
##TITLE=AC1407_PERAH12216_7653017_7f91amZpev
##JCAMPDX= 6.0         $$ Bruker NMR JCAMP-DX V2.0
##DATA TYPE= NMR SPECTRUM
##DATA CLASS= NTUPLES
##ORIGIN= BRUKER
##OWNER= Administrator
$$ 1.72 TOPSPIN		Version 2.1
$$ 2013-03-19 22:16:46.378 -0500  Administrator@X
$$ Compression mode = diff/dup
##.OBSERVE FREQUENCY= 400.02188249412
##.OBSERVE NUCLEUS= ^1H
##.ACQUISITION MODE= SIMULTANEOUS (DQD)
##.ACQUISITION SCHEME= undefined
##.AVERAGES= 64
##.DIGITISER RES= 22
##SPECTROMETER/DATA SYSTEM= spect
##.PULSE SEQUENCE= noesygpps1d.comp
##.SOLVENT NAME= COFFEE_meoh
##.SHIFT REFERENCE= INTERNAL, COFFEE_meoh, 1, 14.9608
##AUDIT TRAIL= $$ (NUMBER, WHEN, WHO, WHERE, PROCESS, VERSION, WHAT)
$$ ##TITLE= Audit trail, TOPSPIN		Version 2.1
$$ ##JCAMPDX= 5.01
$$ ##ORIGIN= Bruker BioSpin GmbH
$$ ##OWNER= Administrator
$$ $$ E:\/data/COFFEE/nmr/AC1407_PERAH12216_7653017_7f91amZpev/12/pdata/1/auditp.txt
$$ ##AUDIT TRAIL=  $$ (NUMBER, WHEN, WHO, WHERE, PROCESS, VERSION, WHAT)
(   1,<2013-03-19 22:16:40.425 -0500>,<Administrator>,<X>,<go>,<TOPSPIN 2.1>,
      <created by zg
	started at 2013-03-19 22:05:10.392 -0500,
	POWCHK enabled, PULCHK disabled,
       configuration hash MD5:
       86 BA 57 50 F2 9D 5C 9B 26 00 A9 28 5F 66 2E 89
       data hash MD5: 64K
       A7 A2 33 20 BA 8B 21 36 8A DC 81 98 9C 85 42 D0>)
(   2,<2013-03-19 22:16:43.597 -0500>,<Administrator>,<X>,<proc1d>,<TOPSPIN 2.1>,
      <Start of raw data processing
       efp LB = 0.3 FT_mod = 6 PKNL = 1 PHC0 = 0 PHC1 = 0 SI = 128K 
       data hash MD5: 128K
       EC 38 42 B5 A2 6C E6 0C 02 23 C2 8D 04 F8 59 94>)
(   3,<2013-03-19 22:16:44.659 -0500>,<Administrator>,<X>,<proc1d>,<TOPSPIN 2.1>,
      <pk PHC0 = -74.82239 PHC1 = 0 
       data hash MD5: 128K
       DC 2E 8D 65 EC FD 50 18 9E 79 BE FA F6 F6 72 43>)
(   4,<2013-03-19 22:16:45.315 -0500>,<Administrator>,<X>,<proc1d>,<TOPSPIN 2.1>,
      <abs ABSG = 1 
       data hash MD5: 128K
       0E BF 1B 63 AE 43 FA CE 0F 4F F1 B3 0A E4 B6 F1>)
(   5,<2013-03-19 22:16:45.503 -0500>,<Administrator>,<X>,<proc1d>,<TOPSPIN 2.1>,
      <abs ABSG = 2 
       data hash MD5: 128K
       3D 4B D7 FA 80 E3 3C 6E D1 87 B9 2D 5E 10 0F BE>)
(   6,<2013-03-19 22:16:45.675 -0500>,<Administrator>,<X>,<proc1d>,<TOPSPIN 2.1>,
      <abs ABSG = 3 
       data hash MD5: 128K
       71 C7 D1 8E 16 BC B3 DD 1E 22 FE 75 29 8C E6 97>)
(   7,<2013-03-19 22:16:45.847 -0500>,<Administrator>,<X>,<proc1d>,<TOPSPIN 2.1>,
      <abs ABSG = 4 
       data hash MD5: 128K
       19 60 F8 51 C4 14 95 60 F8 87 CD D8 45 A5 45 A5>)
(   8,<2013-03-19 22:16:46.034 -0500>,<Administrator>,<X>,<proc1d>,<TOPSPIN 2.1>,
      <abs ABSG = 5 
       data hash MD5: 128K
       F1 88 90 A5 1A 0E 3B 4C 38 AF C9 57 F0 E8 57 60>)
$$ ##END=
$$ 
$$ $$ hash MD5
$$ $$ 82 8D 8C 42 52 A8 92 28 BD 69 AE CE 5E 90 50 BB
##$RELAX= 
##$RELAX= 
##$RELAX= 
##$RELAX= 
##$RELAX= 
##$RELAX= 
##$RELAX= 
##$RELAX= 
$$ Bruker specific parameters
$$ --------------------------
##$DU= <E:\>
##$EXPNO= 12
$$ [...]
150 150 150 150 150 150 150 150
##$TP07= 0
##$TPNAME0= <>
##$TPNAME1= <>
##$TPNAME2= <>
##$TPNAME3= <>
##$TPNAME4= <>
##$TPNAME5= <>
##$TPNAME6= <>
##$TPNAME7= <>
##$TPOAL= (0..7)
0.5 0.5 0.5 0.5 0.5 0.5 0.5 0.5
##$TPOFFS= (0..7)
0 0 0 0 0 0 0 0
##$TUNHIN= 0
##$TUNHOUT= 0
##$TUNXOUT= 0
##$USERA1= <user>
##$USERA2= <user>
##$USERA3= <user>
##$USERA4= <user>
##$USERA5= <user>
##$V9= 5
##$VALIST= <valist>
##$VCLIST= <CCCCCCCCCCCCCCC>
##$VD= 0
##$VDLIST= <DDDDDDDDDDDDDDD>
##$VPLIST= <PPPPPPPPPPPPPPP>
##$VTLIST= <TTTTTTTTTTTTTTT>
##$WBST= 2048
##$WBSW= 25
##$XGAIN= (0..3)
0 0 0 0
##$XL= 0
##$YL= 0
##$YMAX_a= 6137900
##$YMIN_a= -13122827
##$ZGOPTNS= <>
##$ZL1= 120
##$ZL2= 120
##$ZL3= 120
##$ZL4= 120
##$ABSF1= 14.9608
##$ABSF2= -5.597382
##$ABSG= 5
##$ABSL= 3
##$ALPHA= 0
##$AQORDER= 0
##$ASSFAC= 0
##$ASSFACI= 0
##$ASSFACX= 0
##$ASSWID= 0
##$AUNMP= <proc_prof1d_extract.lims>
##$AXLEFT= 0
##$AXNAME= <>
##$AXNUC= <1H>
##$AXRIGHT= 0
##$AXTYPE= 0
##$AXUNIT= <>
##$AZFE= 0.1
##$AZFW= 0.1
##$BCFW= 0
##$BC_mod= 0
##$BYTORDP= 0
##$COROFFS= 0
##$CY= 15
##$DATMOD= 1
##$DC= 0
##$DFILT= <>
##$DTYPP= 0
##$F1P= 0
##$F2P= 0
##$FCOR= 0.5
##$FTSIZE= 131072
##$FT_mod= 6
##$GAMMA= 0
##$GB= 0
##$INTBC= 1
##$INTSCL= 1
##$ISEN= 128
##$LB= 0.3
##$LEV0= 0
##$LPBIN= 0
##$MAXI= 10000
##$MC2= 0
##$MEAN= 0
##$ME_mod= 0
##$MI= 0
##$NCOEF= 0
##$NC_proc= -2
##$NLEV= 6
##$NOISF1= 0
##$NOISF2= 0
##$NSP= 0
##$NTH_PI= 0
##$NZP= 0
##$OFFSET= 14.9608
##$PC= 1
##$PHC0= -74.82239
##$PHC1= 0
##$PH_mod= 1
##$PKNL= yes
##$PPARMOD= 0
##$PPDIAG= 0
##$PPIPTYP= 0
##$PPMPNUM= 2147483647
##$PPRESOL= 1
##$PSCAL= 4
##$PSIGN= 0
##$PYNMP= <proc.py>
##$REVERSE= no
##$SF= 400.020009717122
##$SI= 131072
##$SIGF1= 0
##$SIGF2= 0
##$SINO= 400
##$SIOLD= 131072
##$SPECTYP= <>
##$SREGLST= <1H.CDCl3>
##$SSB= 0
##$STSI= 131072
##$STSR= 0
##$SW_p= 8223.68421052631
##$SYMM= 0
##$S_DEV= 0
##$TDeff= 65536
##$TDoff= 0
##$TI= <>
##$TILT= no
##$TM1= 0
##$TM2= 0
##$TOPLEV= 0
##$USERP1= <user>
##$USERP2= <user>
##$USERP3= <user>
##$USERP4= <user>
##$USERP5= <user>
##$WDW= 1
##$XDIM= 131072
##$YMAX_p= 342314436
##$YMIN_p= -12118
##$CURPLOT= <Network HP LaserJet P1505>
##$CURPRIN= <$Network HP LaserJet P1505>
##$DFORMAT= <normdp>
##$LAYOUT= <+/1D_H.xwp>
##$LFORMAT= <normlp>
##$PFORMAT= <normpl>
##$SURQMSG= 1
$$ End of Bruker specific parameters
$$ ---------------------------------
##NTUPLES= NMR SPECTRUM
##VAR_NAME=  FREQUENCY,     SPECTRUM/REAL,   SPECTRUM/IMAG
##SYMBOL=    X,             R,               I
##VAR_TYPE=  INDEPENDENT,   DEPENDENT,       DEPENDENT
##VAR_FORM=  AFFN,          ASDF,            ASDF
##VAR_DIM=   131072,        131072,          131072
##UNITS=     HZ,            ARBITRARY UNITS, ARBITRARY UNITS
##FACTOR=    0.0627417313425164, 1,          1
##FIRST=     8223.62146879497, 2838,         -62100
##LAST=      0,             5103,            -62010
##MIN=       0,             -12118,          0
##MAX=       8223.62146879497, 342314436,    0
$$ Real data points
##PAGE= N=1
##DATA TABLE= (X++(R..R)), XYDATA
$$ [...]
65260 147998 149075 149458 149192 148437 147203 145741 144832 145089 146155 147069 147351 147259 147081 146672 145787 144442 142808
65243 142808 141007 139170 137479 136107 135167 134618 134109 133158 131795 130807 130921 131877 132760 133105 133148 133073 132692 132026
65225 132026 131533 131450 131418 131156 131010 131336 131655 131098 129571 127978 127228 127373 127812 128008 127831 127408 126836 126131 125437
65206 125437 125150 125625 126667 127580 127901 127909 128181 128794 129274 129289 129093 129216 129835 130534 130636 129911 129034 129129 130591
65187 130591 132500 133540 133491 133428 134423 136367 138247 139255 139429 139443 140042 141507 143379 144721 144877 144034 142969
65170 142969 142338 142308 142774 143646 144813 146018 146971 147592 148075 148645 149301 149872 150383 151251 152925 155315 157757
65153 157757 159699 161221 162747 164404 165976 167423 169141 171577 174834 178761 183232 188157 193400 198945
65139 198945 205076 212163 220179 228534 236381 243101 248650 253604 258777 264543 270505 276013 280938 285646
65125 285646 290149 293664 295308 295047 293643 291761 289436 286463 282917 279087 275102 270921 266637 262438
65111 262438 258179 253210 246924 239431 231491 223766 216356 209109 202090 195476 189165 182806 176220 169544
65097 169544 162991 156824 151620 148115 146471 145894 145304 144328 143381 142894 142783 142762 142873 143507 144903 146748 148346
65080 148346 149222 149508 149628 149686 149412 148751 148161 148085 148383 148620 148705 148930 149454 150053 150372 150132 149205 147809 146570
65061 146570 146016 145991 145964 145912 146411 147689 149062 149644 149363 148939 149032 149653 150343 150666 150531 150156 149743 149281 148768
65042 148768 148466 148611 148923 148810 148103 147162 146165 144831 143093 141498 140451 139491 137883 135712 133802 132701
65026 132701 132256 132140 132197 132201 131829 131114 130569 130564 130801 130623 129760 128572 127638 127267 127496 128401 130144 132501 134592
65007 134592 135573 135689 136134 137686 139965 142327 144910 148196 151978 155502 158441 160960 162974 164112 164474
64992 164474 164606 164601 163967 162681 161573 161254 161327 161198 161143 161898 163601 165783 168213 171034 174086 176621 177955
64975 177955 178167 178049 178370 179084 179206 177706 174670 171301 168649 166690 164833 162849 160871 158833 156477
64960 156477 153791 150979 148122 145272 142793 141147 140386 140244 140585 141341 142132 142474 142377 142271 142307 142241 142018 141941
64942 141941 142115 142237 142126 141993 141880 141336 140046 138495 137624 137970 139372 141272 143016 144139 144734 145427 146619
64925 146619 147878 148355 147807 146842 146175 145892 145536 144683 143378 142134 141547 141758 142315 142653 142684 142775 143221 143993
64907 143993 145024 146432 148297 150412 152506 154653 157241 160542 164438 168582 172640 176363 179661 182797
64893 182797 186373 190911 196403 202402 208450 214183 219079 222574 224724 226485 228912 232135 235435 238264
64879 238264 240750 243147 245291 246941 248269 249496 250179 249407 246844 243176 239304 235485 231592 227931 225177
64864 225177 223456 221988 219954 217406 214991 213036 211286 209389 207196 204549 201263 197444 193479 189550
64850 189550 185497 181341 177529 174372 171572 168711 165860 163297 160939 158595 156571 155341 154699 153929 152837
64835 152837 151931 151425 150811 149844 149220 149712 151053 152322 153088 153513 153555 152853 151538 150493 150547 151751 153640
64818 153640 155852 158262 160791 163348 165888 168383 170878 173646 177104 181344 185907 190200 194105 198021
64804 198021 202369 207207 212313 217452 222426 226957 230640 233099 234209 234185 233389 231955 229616 226041 221383
64789 221383 216380 211739 207541 203464 199506 196135 193583 191448 189287 187354 186328 186465 187464 189031 190981
64774 190981 192784 193717 193827 194217 195929 198893 202405 206248 210709 215683 220483 224695 228723 233229 238311
64759 238311 243452 248107 252202 256135 260355 264879 269272 273204 276847 280511 284091 287227 289936 292587
64745 292587 295179 297130 298039 298286 298541 298827 298352 296192 291985 286125 279506 272992 266888 260917 254808
64730 254808 248842 243653 239588 236449 233827 231451 229117 226505 223378 220054 217418 216215 216343 217102 218156
64715 218156 219902 222662 225924 228870 231473 234502 238351 242442 246010 249011 251834 254418 256082 256162 254499
64700 254499 251412 247490 243360 239386 235503 231461 227088 222207 216548 210120 203638 198211 194502 192346
64686 192346 191135 190302 189475 188563 187833 187658 188017 188474 188836 189555 191238 193886 196934 199989 203243 207141
64670 207141 211874 217271 222975 228520 233424 237523 241231 245237 249739 254054 257100 258204 257388 254968
64656 254968 251157 246138 240390 234716 229909 226307 223616 221171 218504 215756 213513 212248 211994 212529 213630
64641 213630 215097 216770 218767 221560 225623 230970 237188 243841 250692 257636 264678 272018 279936 288491
64627 288491 297380 306091 314102 321008 326611 330898 333726 334567 332767 328095 320853 311527 300674 289193
64613 289193 278242 268538 259915 251851 244208 237186 230816 224976 219804 215599 212311 209533 207098 205152
64599 205152 203493 201421 198644 195945 194388 194154 194651 195568 197097 199168 201240 203120 205382 208564 212396
64584 212396 216366 220633 225763 231720 237764 243401 248926 254920 261671 269276 277823 287124 296521 305287
64570 305287 313144 320233 326713 332509 337256 340305 341045 339484 336394 332603 328179 322533 315220 306447
64556 306447 296865 287187 277958 269339 261028 252659 244460 237308 231950 228257 225433 222866 220561 218754
64542 218754 217356 216050 214889 214516 215538 217661 219680 220443 219804 218572 217665 217361 217250 216685 215286 213121
64526 213121 210495 207585 204401 201107 198242 196419 195814 196003 196277 196098 195381 194479 193850 193629 193669 194000 195005
64509 195005 196845 198928 200350 200862 201051 201541 202411 203553 205263 208150 212563 218304 224784 231324 237393
64494 237393 242833 247897 252974 258265 263673 268904 273571 277306 279919 281426 281912 281403 279920 277600 274732
64479 274732 271738 269122 267307 266454 266435 266909 267298 266822 264932 261939 258893 256528 254439 251622 247794 243874
64463 243874 241097 239972 240248 241563 243751 246564 249571 252526 255568 258742 261472 262927 262993 262491 262218
64448 262218 262099 261672 261147 261413 262918 265046 266863 268197 269766 272481 276899 283147 291002 300029 309863
64433 309863 320447 331997 344852 359525 376763 397367 421889 450557 483460 520802 563067
64422 563067 610998 665296 726205 793493 866785 945789 1030183 1119584 1213599 1311311 1410246
64411 1410246 1506218 1594930 1673931 1742899 1802225 1851693 1890234 1916135 1927209 1921471 1898349
64400 1898349 1859319 1807201 1744888 1674609 1597740 1514812 1425903 1331608 1233803 1135318 1038927
64389 1038927 946812 860748 782167 711770 649360 594394 546566 505676 471075 441680 416666
64378 416666 395795 378801 364638 351862 339847 329192 320597 313609 306937 299892 292975 286902 281605
64365 281605 276569 271746 267492 263689 259573 254652 249372 244488 240157 236103 232481 229933 228661 228018
64351 228018 227415 227199 228089 229961 231856 233250 234648 236680 239210 241767 244382 247222 249647 250452 249207
64336 249207 246772 244183 241517 238236 234297 230405 227306 225211 223937 223284 223105 223154 223046 222527 221811 221513
64320 221513 221992 222754 222813 221830 220602 220214 220843 221735 222238 222509 223125 224289 225600 226521 226826 226548 225568 223487
64302 223487 220066 215708 211251 207194 203341 199295 195083 191130 187860 185576 184520 184626 185253 185550 185272
64287 185272 184976 185315 186357 187708 189103 190639 192499 194680 197016 199363 201732 204304 207337 211018 215294
64272 215294 219877 224469 229043 233829 238884 243799 248050 251657 255194 258973 262479 264833 265643 265158 263789
64257 263789 261870 259760 257805 256125 254742 253835 253483 253153 251923 249410 246020 242155 237630 232251 226474
64242 226474 220981 215879 210942 206455 203118 201027 199370 197448 195524 194304 193896 193772 193571 193466 193708
64227 193708 194207 194816 195784 197604 200314 203108 204818 204921 204015 203204 203019 203116 202992 202700 202639 202852 202880 202231
64209 202231 200690 198234 195086 191997 189971 189322 189277 188939 188457 188708 189892 191101 191487 191337 191576 192618
64193 192618 194216 196254 199135 203318 208846 215371 222335 229133 235466 241655 248280 255379 262362 268833
64179 268833 275117 281569 287623 292011 293885 293396 291145 287429 282214 275603 268039 260064 252037 244224
64165 244224 237059 231071 226320 222019 217079 211196 205193 200113 196223 193117 190551 188704 187685 187244
64151 187244 187139 187475 188465 190075 192090 194417 197181 200611 204856 209672 214210 217459 219252 220707 223261
64136 223261 227202 231372 234346 235657 235809 235378 234364 232392 229342 225685 222238 219634 218001 217100 216660
64121 216660 216551 216709 217082 217710 218810 220702 223653 227731 232744 238314 244129 250130 256421 262963 269455
64106 269455 275599 281398 287132 293029 299019 304706 309550 313143 315518 317232 318965 320879 322394 322771
64092 322771 322019 321197 321665 323943 327225 329970 330971 329993 327582 324417 320817 316697 311833 306052 299257
64077 299257 291457 282969 274524 266950 260605 255290 250810 247374 245221 244024 243050 241912 240832 240155 240036
64062 240036 240722 242627 245683 248915 251217 252462 253414 254670 256211 258031 260571 264185 268567 273118 277664
64047 277664 282534 288053 294209 300691 307052 313008 318824 325180 332323 339473 345445 349809 353072 355753
64033 355753 357701 358425 357733 355816 352961 349405 345321 340778 335861 330935 326678 323616 321674 320332 319164
64018 319164 318201 317824 318374 319751 321283 322024 321348 319358 316716 314071 311550 308750 305269 301320 297702
64003 297702 295051 293221 291626 290069 288877 288229 287747 286973 285952 285120 284764 284825 285163 285863 287304 289970
63987 289970 294016 298949 303977 308714 313325 317889 322072 325709 329351 333757 339054 344810 350845 357426
63973 357426 364698 372457 380633 389575 399571 410319 421136 431566 441676 451940 463030 475574
63961 475574 489880 505880 523437 542717 564288 588880 617043 649007 684936 725423 771688
63950 771688 825168 886950 957656 1037823 1128210 1229796 1343626 1470561 1610934 1764443
63940 1764443 1930416 2107905 2295207 2489559 2687892 2887918 3087935 3285427 3476333
63931 3476333 3655995 3820376 3966067 4089550 4187244 4256358 4295485 4304419 4283745 4234591 4158382
63920 4158382 4056542 3930484 3782111 3614457 3431840 3239197 3040990 2840718 2641464
63911 2641464 2446492 2258741 2079782 1910008 1750155 1602120 1467799 1347572 1240542
63902 1240542 1145921 1063456 992501 931474 878562 832593 792982 759222 730709 706761 686478
63891 686478 668744 652734 638390 626185 616323 608331 601462 595390 590378 586818 584795 584247 585416
63878 585416 588815 594670 602729 612824 625377 641063 660085 682110 706790 733949 763308 794442
63866 794442 827164 861635 897860 935256 972853 1009796 1045544 1079715 1111904 1141679 1168693
63855 1168693 1192803 1213947 1231780 1245555 1254580 1258729 1258220 1252960 1242489 1226682 1206159 1181831
63843 1181831 1154279 1123766 1090567 1055034 1017502 978411 938396 898024 857510 816903 776497
63832 776497 736809 698214 660858 625000 591228 560132 531808 505823 481713 459410 439120
63821 439120 420831 404141 388645 374303 361320 349816 339815 331366 324334 318065 311655 304693
63809 304693 297503 290592 284159 278311 273407 269801 267358 265473 263573 261427 259047 256510 253895 251340
63795 251340 249099 247465 246453 245545 244033 241759 239334 237432 236016 234434 232134 229127 225978 223579
63781 223579 222677 223208 224054 223864 222278 220199 218796 218389 218383 218114 217512 216876 216158 214861 212866 211108 210857
63764 210857 212194 213685 213921 213047 212338 212511 213031 213022 212342 211564 211228 211344 211479 211230 210695 210434 210860 211777 212732
63745 212732 213637 214773 216291 218116 220261 222740 225141 226812 227655 228288 229227 230365 231534 233075 235396
63730 235396 238331 241477 244939 249145 254055 259157 264275 269741 275539 280835 284841 287897 291189 295412
63716 295412 300036 304002 306821 308802 310300 311073 310584 308860 306768 305204 304108 302510 299652 295839 292084
63701 292084 289074 286742 284744 283015 281760 281162 281265 281968 282941 283724 284211 284950 286684 289548 292976 296453
63685 296453 300016 303867 307771 311075 313239 314202 314397 314524 315136 316196 317132 317543 317747 318440 319888 321684
63669 321684 323209 324175 324854 325991 328323 331870 335703 338696 340414 341098 340959 339886 337769 334683 330776
63654 330776 326274 321543 316752 311582 305770 299883 294961 291308 288310 285602 283670 282948 282984 283082 283239 283857
63638 283857 285013 286666 289171 292798 296938 300667 304051 308129 313519 319745 326130 332592 339197 345585
63624 345585 351446 357273 364030 372184 381395 391176 401518 412853 425590 439761 455084 471357 488845
63611 488845 508207 530012 554325 580654 608214 636286 664585 693315 722690 752406 781659
63600 781659 809645 835770 859307 879145 894133 903621 907621 906575 901160 892279 881113 868987
63588 868987 856940 845183 832997 819295 803341 785019 764711 743144 721107 698804 675584
63577 675584 650861 625454 601519 580869 563627 548744 535437 523727 513917 506136 500403 496720
63565 496720 494993 495098 497051 500851 506047 511772 517511 523783 531850 542593 555688 570023 584846
63552 584846 600417 617542 636858 658787 683857 712376 743781 776856 810838 845864 882209
63541 882209 919674 958057 997358 1036442 1071727 1098402 1113488 1117387 1112499 1101186 1085449 1067573
63529 1067573 1049825 1033376 1018106 1003486 989092 974192 957502 937879 915067 889429 861115
63518 861115 829848 795540 758833 720987 683435 647434 613861 583087 555095 529840 507479
63507 507479 488208 471919 458040 445720 434243 423488 413984 406281 400122 394530 388868 383523 379180
63494 379180 375689 372138 368022 363784 360101 357190 355057 353954 354057 354930 355774 356210 356596 357606 359702
63479 359702 362886 366716 370586 374202 377738 381433 385167 388641 391708 394249 395881 396209 395328 393693 391507
63464 391507 388580 384840 380589 376185 371792 367574 363814 360681 358134 356259 355447 356031 357863 360345 362750
63449 362750 364546 365796 367411 370615 375805 382114 388449 394828 402362 412072 424107 438145 454145
63436 454145 472412 493047 515517 538888 562586 586998 613229 642138 673533 706135 737993
63425 737993 766794 790292 807190 817925 824457 829167 833998 840425 849695 862723 879852 900916
63413 900916 925509 953115 983039 1014365 1045989 1076649 1104933 1129352 1148482 1161163 1166744 1165240
63401 1165240 1157386 1144641 1129038 1112603 1096416 1080166 1062758 1043362 1021684 997447 970131
63390 970131 939508 906086 870739 834097 796649 759348 723689 691006 661784 635670 611992
63379 611992 590301 570636 553527 539714 529679 523253 519618 517811 517401 518729 522369 528410 536396
63366 536396 545944 557149 570309 585553 602953 622712 644971 669523 696041 724496 755116 788011
63354 788011 823069 859985 898024 935895 972435 1007509 1041690 1074768 1104919 1129599 1147027
63343 1147027 1156739 1159240 1155614 1147223 1135248 1120481 1103688 1085915 1068032 1050088 1031471 1011522
63331 1011522 989676 965246 937751 907618 876099 844311 812703 781611 751915 724775 700895
63320 700895 680267 662487 647202 634430 624654 618384 615308 613742 610959 604141 591407 572607 549480
63307 549480 524722 500440 477469 456110 436999 420736 406927 394406 382621 372314 364457 358890
63295 358890 354451 350287 346513 343456 340791 337812 334371 331023 328173 325522 322638 319728 317353 315528
63281 315528 313654 311425 309320 307854 306752 305351 303648 302443 302402 303325 304540 305713 306972 308361 309512
63266 309512 310071 310317 311041 312711 314949 317042 318809 320652 322830 325104 327228 329376 331843 334663 337858
63251 337858 341819 347038 353541 360922 368826 377096 385553 394066 402855 412349 422639 433402 444533
63238 444533 456550 470226 485982 503747 523156 543658 564640 585733 607083 629235 652679
63227 652679 677444 703033 728718 754012 778821 803189 827107 850787 874810 899552 924478
63216 924478 948504 971172 992907 1013799 1032629 1047674 1058220 1064679 1067282 1065248 1057533 1043956
63204 1043956 1025307 1002599 976573 947821 917102 885453 854096 824110 796011 769767 745499
63193 745499 724146 707032 694627 686105 680419 677520 678087 682358 689863 700272 713703 729841 747495
63180 747495 765699 784812 805756 828357 851245 873469 895383 917631 939929 961365 981409
63169 981409 999973 1016657 1030572 1041058 1048143 1052143 1053025 1050296 1043327 1031623 1014972 993605 968265
63156 968265 939909 909210 876394 841670 805707 769496 733819 699150 666134 635744 608667
63145 608667 584756 563407 544254 527202 512016 498401 486434 476443 468377 461662 455703 450185
63133 450185 444950 440043 435960 433312 432085 431677 431746 432471 433783 435004 435717 436480 438133 440716 443630 446571
63117 446571 449765 453404 457348 461348 465165 468609 471790 475187 479089 483070 486442 489141 491727 494588
63103 494588 497510 500014 501758 502653 502954 503201 503772 504592 505544 506911 508873 510794 511726 511716 511923 513182 514959
63086 514959 516048 515959 515350 515377 516751 519128 521277 522212 522282 522820 524627 527327 530393 534173 539373 545988
63070 545988 553419 561394 570212 580179 591351 603808 617675 632807 649015 666677 686646 709289
63058 709289 734098 760579 789186 820871 855943 893835 933987 976471 1021685 1069893 1121285
63047 1121285 1176012 1233728 1293300 1353459 1413716 1474295 1535305 1596406 1657275 1717866 1777994
63036 1777994 1837150 1895024 1951792 2007496 2061319 2111885 2158042 2199002 2233822 2261107 2279206
63025 2279206 2286569 2282139 2265722 2237883 2199332 2150676 2093019 2028364 1958908 1886249 1811806 1737650
63013 1737650 1666117 1598703 1536189 1479837 1431583 1392688 1362871 1341105 1326696 1319242 1318192 1323031
63001 1323031 1333596 1349746 1371039 1397031 1427522 1462063 1499518 1538574 1578528 1619137 1659896
62990 1659896 1699909 1738437 1775164 1809891 1842168 1871272 1896411 1916960 1932477 1942330 1945284 1939832
62978 1939832 1925110 1901267 1868850 1828175 1779519 1723620 1661727 1595362 1526226 1455985 1385942
62967 1385942 1317099 1250655 1187950 1129718 1075827 1026040 980485 939026 900828 865238 832618
62956 832618 803567 777602 753435 730374 708679 688552 669574 651280 633663 616893 600987
62945 600987 585907 571626 558014 544975 532680 521236 510292 499459 489020 479573 470998 462514
62933 462514 453904 445985 439521 434363 430005 426444 423897 422063 420240 418025 415515 412959 410553 408478
62919 408478 406844 405591 404597 403816 403209 402738 402421 402215 401838 400991 399797 398642 397530 396043 394128 392379
62903 392379 391208 390251 389071 388071 388016 388809 389430 389165 388358 387738 387494 387351 387277 387628 388541 389554 390073 390075 390047
62884 390047 390183 390047 389289 388369 388148 388803 389625 389925 389721 389448 389390 389563 389802 389774 389219 388382 387816 387633 387304
62865 387304 386438 385292 384186 382927 381311 379821 379131 379112 378936 378128 377041 376262 376061 376381 376922 377164 376789
62848 376789 376207 376239 377136 378284 379028 379386 379744 380226 380697 381154 381745 382461 383052 383246 382937 382259 381610 381534 382376
62829 382376 384032 386071 388118 390119 392285 394692 396952 398473 399244 400130 401995 404581 406762 408027 409233
62814 409233 411618 415484 420248 425400 430841 436454 442013 447617 453677 460320 467230 474305 482047 490997
62800 490997 501069 511796 522921 534405 546193 558511 572211 588089 605828 624298 643226
62789 643226 663944 688125 716258 747898 782997 822271 866393 915543 969870 1029736 1095271
62778 1095271 1166076 1241682 1321982 1406950 1496074 1588160 1681450 1773845 1863294 1948147 2026855
62767 2026855 2097237 2156449 2202033 2232851 2248789 2249911 2236248 2208190 2166544 2112289 2046627
62756 2046627 1971296 1888518 1800580 1709660 1617947 1527500 1439756 1355353 1274513 1197576 1125195
62745 1125195 1058145 996888 941200 890336 843786 801745 764588 731973 702866 676420 652484
62734 652484 631141 612210 595440 580890 568705 558663 550238 543036 536884 531556 526824 522899 520495
62721 520495 520126 521458 523637 526235 529584 534165 539966 546736 554635 564321 576442 591300 608957 629353
62707 629353 652335 677919 706653 739399 776596 818035 863469 913091 967166 1025548 1087949
62696 1087949 1154389 1224906 1298886 1375085 1452292 1529531 1605560 1678542 1746439 1807604 1860884
62685 1860884 1905268 1939518 1962132 1971724 1967499 1949316 1917402 1872399 1815837 1750095 1677535 1599920
62673 1599920 1518957 1436906 1355925 1277054 1200511 1126909 1057500 993222 934226 880404 831609
62662 831609 787210 746273 708604 674976 645807 620277 597256 576532 558404 542519 527978
62651 527978 514366 501908 490655 480181 470193 460826 452180 444043 436290 429194 423175 418414 414811
62638 414811 412127 410186 409089 409086 409945 410649 410179 408601 406998 406250 406280 406459 406296 405602 404443 403154 402139
62621 402139 401443 400823 400316 400362 401177 402411 403656 404949 406465 408159 410127 413011 417508 423593 430746 438864
62605 438864 448455 459898 473005 487459 503294 520733 539917 561097 584825 611624 641493 673978
62593 673978 708662 745448 784426 825637 868822 913186 957363 999821 1039341 1074995 1105759
62582 1105759 1130476 1148347 1159239 1163273 1160234 1149663 1131538 1106613 1076027 1040750 1001605 959652
62570 959652 916282 872841 830207 788830 749079 711471 676559 644644 615671 589390 565607
62559 565607 544242 525214 508319 493284 479930 468290 458553 450772 444505 438833 432944 426752 420837
62546 420837 415738 411495 407973 405357 404046 404109 405084 406332 407489 408640 410186 412498 415503 418675 421595
62531 421595 424386 427277 429981 432128 434406 438551 445719 455314 465969 477345 490300 505516 522878
62518 522878 542375 564767 590813 620321 652517 686977 723651 762205 802042 842989 885322
62507 885322 928890 972576 1014795 1054178 1089599 1119956 1144423 1162721 1174782 1180187 1178362 1169478
62495 1169478 1154857 1136233 1114649 1090294 1063464 1035497 1008480 983995 962432 943779 928792
62484 928792 918865 914674 915516 920336 929010 942076 959384 979612 1001191 1023294 1045762 1068420 1090568
62471 1090568 1110768 1126878 1136712 1139173 1134735 1124605 1109434 1089041 1063137 1031927 996001 956118
62459 956118 913386 869341 825510 782785 741416 701612 663974 629251 597804 569527 544288
62448 544288 522228 503431 487502 473805 462150 452865 446001 440810 436373 432529 429753 428131 427009
62435 427009 425774 424468 423324 422139 420624 419098 418175 417790 417129 415681 413747 411607 408701 404237 398379
62420 398379 392298 387030 382734 378995 375390 371690 367945 364571 361983 359998 358007 355949 354600 354447
62406 354447 354668 353865 351705 349258 347674 347081 346929 346861 346912 347126 347389 347566 347654 347906 348849 350915 353871 356849
62388 356849 359195 361154 363520 366768 370772 375201 379855 384684 389804 395587 402446 410392 418954 427604
62374 427604 436194 444916 453996 463509 473423 483758 494758 506857 520397 535446 552046 570639
62362 570639 592049 616878 645068 676192 710179 747617 789275 835278 884763 936372 989121
62351 989121 1042767 1097323 1152354 1206815 1259373 1308513 1352314 1388553 1415433 1432252 1439309 1437282
62339 1437282 1426886 1408951 1384430 1354143 1318662 1278620 1235037 1189175 1142113 1094579 1047234
62328 1047234 1000982 956872 915708 877835 843232 811614 782345 754562 727781 702431 679401
62317 679401 658838 639725 620951 602513 585083 568500 551552 533675 516240 501385 489747
62306 489747 480040 470791 461764 453469 446069 439356 433394 428532 424886 422295 420718 420186 420360 420609 420668
62291 420668 420883 421636 422810 423979 424944 425928 427386 429690 432801 436249 439634 443207 447617 452970 458486
62276 458486 463291 467273 470898 474504 478235 482482 487887 494795 503021 512265 522551 534209 547625
62263 547625 563167 581282 602563 627670 657037 690622 728068 769247 814406 863571 915994
62252 915994 970589 1026770 1084437 1143088 1201373 1257616 1310302 1357745 1397721 1428008 1447363
62241 1447363 1455734 1453665 1441863 1421283 1393202 1358839 1318929 1273783 1223757 1169673 1112866 1054836
62229 1054836 996877 940060 885557 834754 788724 747607 710726 677348 647149 619932 595335
62218 595335 573163 553706 537259 523341 510888 499306 488859 479806 471673 463909 456943 451759
62206 451759 448388 445499 441832 437558 433825 431371 430119 429837 430496 431921 433704 435687 438189 441478 445348
62191 445348 449530 454299 460330 467959 476861 486436 496370 506762 517829 529480 541194 552353 562760
62178 562760 572735 582640 592451 601889 610813 619309 627569 635998 645395 656710 670574 687326 707506
62165 707506 731921 761034 794501 831519 871399 913623 957649 1002937 1048899 1094363 1137249
62154 1137249 1175322 1207327 1232998 1252027 1263702 1267772 1265043 1256669 1243260 1225129 1202963 1177557
62142 1177557 1149079 1117345 1082864 1047112 1011672 977566 945411 915616 888191 862906 839910
62131 839910 819837 803051 789199 777774 768630 761618 756214 752071 749602 749439 751505 755170 760163
62118 760163 766632 774328 782452 790493 798653 807104 815252 822048 826716 828865 828284 825172 820446 815294
62104 815294 810300 805294 800099 795027 790381 785780 780492 774527 769056 765513 764423 765283 767416 770650
62090 770650 775265 781570 789600 798947 808870 818878 829271 840737 853349 866370 879202 892113
62078 892113 905720 920250 935781 952778 971718 992306 1013654 1035231 1057156 1079698 1103008
62067 1103008 1127199 1152016 1176404 1199260 1220935 1243286 1267787 1294039 1320568 1346571 1372265
62056 1372265 1397844 1422756 1445944 1466252 1482493 1493580 1498800 1497890 1490852 1477900 1459507 1436217
62044 1436217 1408272 1375500 1337665 1295006 1248543 1199916 1150775 1102138 1054284 1007179 960886
62033 960886 915721 872374 832010 795894 764604 737626 713848 692352 672763 655136 639695
62022 639695 626393 614532 603061 591470 580207 569964 560829 552445 544689 537687 531256 524923 518644
62009 518644 513100 508995 506308 504447 503029 502256 502509 503809 505868 508599 512300 517102 522414 527309 531474
61994 531474 535372 539305 542741 544878 545504 544863 542941 539459 534578 529124 523880 518880 513506 507123 499631
61979 499631 491574 483744 476516 469658 462947 456757 451659 447549 443624 439328 434950 431132 428147 425827
61965 425827 423905 422102 420087 417677 415072 412710 410887 409541 408376 407160 405998 405373 405778 407224 409274
61950 409274 411637 414552 418475 423579 429774 437064 445593 455324 465986 477556 490586 505765 523102
61937 523102 541724 560678 579869 600082 621955 644982 667558 688008 705642 720907 734634
61926 734634 747152 758136 767161 774219 779595 783396 785404 785293 782798 777824 770784 762836 755386 749163
61912 749163 744096 740197 738140 738731 742159 748183 756724 767783 780908 795271 810206 825301 839938
61899 839938 853177 864141 872227 876898 877702 874589 867938 858204 845758 831122 814994 797944 780368
61886 780368 762861 746218 730836 716296 701734 686558 670751 654810 639568 625754 613440
61875 613440 601935 590421 578611 566741 555151 544121 534029 525374 518551 513668 510577 509090
61863 509090 509133 510710 513724 518025 523784 531698 542509 556326 572626 590930 611268 633932 659038
61850 659038 686434 715833 746972 779721 813978 849231 884357 918200 950347 980917 1009515
61839 1009515 1034858 1055612 1071236 1081732 1087000 1086877 1081668 1072386 1060538 1047781 1035521 1024626
61827 1024626 1015661 1009402 1006683 1007563 1011102 1016377 1023336 1032195 1042305 1052121 1060163 1065512 1067449 1065116
61813 1065116 1057589 1044054 1024096 998235 968048 935307 900997 865530 829648 794472 760678
61802 760678 728357 697821 669873 644947 622576 602173 583860 568037 554520 542669 532188
61791 532188 523178 515412 508078 500457 492544 484925 478245 472835 468540 464720 460635 456091 451633 447938
61777 447938 445054 442390 439445 436314 433429 430983 428877 427176 426256 426312 426906 427318 427332 427433 428214 429868
61761 429868 432314 435518 439400 443633 447896 452355 457548 463647 470020 475712 480269 483945 487200 490218
61747 490218 492949 495351 497386 498856 499443 498979 497587 495555 493184 490788 488702 487094 485798 484460 482930
61732 482930 481456 480451 480085 480179 480500 481022 481779 482575 483136 483593 484584 486699 489945 493883 498064 502004 505023
61715 505023 506694 507550 508831 511192 513977 516046 517043 517432 517461 516590 514149 510245 505788 501671 498079 494671
61699 494671 491303 488325 486031 484092 481932 479580 477658 476385 475127 473259 471021 468995 467023 464220
61685 464220 460083 455142 450527 447236 445695 445537 445675 445071 443613 442011 440771 439641 438182 436494 435083
61670 435083 434234 433790 433431 432968 432388 431740 430993 430057 429054 428424 428483 428879 428885 428323 427903 428418 429852 431515 432847
61651 432847 433885 435052 436719 438961 441568 444277 446935 449401 451448 453050 454713 457144 460469 464038
61637 464038 467073 469223 470437 470748 470372 469632 468474 466388 463140 459212 455183 451056 446648 442304 438647
61622 438647 435805 433490 431732 430909 431039 431591 432048 432135 431463 429661 427103 424865 423579 422741 421482 419550
61606 419550 417128 414168 410471 406135 401363 396095 390403 385049 380884 377713 374528 371017 368069 366361
61592 366361 365094 362786 358970 354485 350295 346622 343224 339906 336536 333033 329599 326679 324484 322728
61578 322728 321000 319134 317109 314880 312583 310604 309140 307902 306614 305545 305074 304856 303999 302143 299861
61563 299861 297842 296177 294711 293590 292993 292662 292164 291477 290913 290606 290480 290626 291218 292105 292917 293649 294651
61546 294651 295903 296770 296762 296208 295896 296287 297331 298818 300569 302376 304068 305583 306803 307497 307674 307826 308439
61529 308439 309339 309933 310065 310195 310579 310701 309840 307903 305364 302560 299451 296028 292580 289464 286874 284961
61513 284961 283953 283934 284570 285228 285384 284918 284122 283447 283146 283022 282601 281731 280866 280558 280631 280186 278658 276654
61495 276654 275438 275561 276267 276309 275134 273166 271187 269740 268987 268797 268861 268961 269300 270379 272363 274661 276297
61478 276297 276728 276267 275758 275934 276914 278165 279013 279400 280097 281923 284740 287474 289182 289823 289845 289427 288492
61461 288492 287276 286384 286148 286315 286496 286672 287008 287416 287655 287873 288670 290434 292769 294818 296105 296824 297274
61444 297274 297335 296775 295906 295487 295904 296782 297599 298428 299762 301833 304473 307538 311040 314821 318463 321684
61428 321684 324514 326956 328760 329799 330427 331133 331983 332646 332897 332866 332855 333156 333987 335336 336906 338458 340163
61411 340163 342303 344655 346504 347423 347635 347435 346638 344978 342794 340812 339254 337564 335131 331925 328335
61396 328335 324724 321417 318889 317531 317173 317046 316350 314922 313413 312803 313538 315018 316070 316065 315420 314898 314685
61379 314685 314504 314402 314814 315834 316935 317727 318528 319823 321521 323194 324839 326858 329273 331548 333336
61364 333336 335040 337324 340284 343376 346028 348163 350122 352320 355051 358513 362873 368162 374166 380598
61350 380598 387441 394979 403354 412321 421577 431083 440758 450048 458320 465629 472619 479492 485576 490154
61336 490154 493342 495834 498039 499926 501536 503135 504799 506130 506572 505826 503873 500713 496319 490869 484962
61321 484962 479408 474714 470815 467337 464042 460916 458074 455877 454943 455583 457231 458931 460523 462891 466842
61306 466842 472226 478463 485477 493518 502353 511218 519519 527113 533897 539541 543693 546106 546489 544564
61292 544564 540404 534567 527760 520411 512573 504250 495935 488774 483846 481079 479245 477271 475176 473462
61278 473462 472153 471108 470869 472289 475381 479363 483884 489352 495783 502204 507757 512882 518753 525856
61264 525856 533570 541010 547880 554587 561749 569523 577395 584863 592347 600944 611097 621956 632359
61251 632359 641928 650768 658535 664474 668248 670204 670816 670324 668870 666565 663309 658854 653166 646582 639592
61236 639592 632593 625819 619371 613348 607958 603363 599346 595398 591263 587178 583465 580221 577541 575625
61222 575625 574370 573299 572357 572296 573703 575973 577959 579445 581156 583352 585287 586318 586773 587350 588242 589383
61206 589383 591012 593303 595680 597197 597674 598042 599406 602100 605799 610347 616198 624068 634252 646349
61192 646349 659592 673386 687589 702354 717838 733954 750240 765891 780028 792100 802138
61181 802138 810627 818050 824465 829574 833303 836177 838866 841393 843110 843551 842963 841805 840043 837205 832938
61166 832938 827251 820358 812521 803922 794487 783994 772536 760648 748824 737134 725442 713683
61154 713683 701781 689790 678441 668955 661758 655852 650101 644711 640667 638111 636243 634603 633320
61141 633320 632014 629509 624988 618609 610709 601269 590625 579859 569920 560908 552746 546008 541462 539226
61127 539226 538929 540353 543438 547946 553663 560724 569351 579469 590895 603633 617693 632955 649549
61114 649549 667982 688465 710421 733090 756348 780533 805669 831255 856619 881147 904427
61103 904427 926438 947327 966670 983352 996596 1006782 1014822 1020954 1024512 1024541 1020302 1011651 999491
61090 999491 985462 970571 954371 936014 915776 894802 873641 851890 829365 806815 785256
61079 785256 765117 746281 728543 711763 695749 680245 665109 650598 637389 625981 616022 606726
61067 606726 598095 591098 586332 583146 580612 578685 577713 577432 577333 577598 578735 580638 582953 586035 590578
61052 590578 596438 602855 609735 617699 626936 637056 648107 660736 675136 690888 708034 727341
61040 727341 749115 772637 797146 822653 849464 877622 907147 938221 970831 1004721 1039817
61029 1039817 1076195 1113675 1152159 1192262 1234747 1279383 1325277 1372257 1420872 1471175 1522882
61018 1522882 1576930 1635497 1700253 1772120 1853312 1948170 2061326 2196372 2356995 2548180
61008 2548180 2775966 3047996 3375544 3773469 4257058 4840079 5535741 6355293 7301263
60999 7301263 8361590 9511657 10722836 11974338 13268388 14639066 16129812 17731448
60991 17731448 19325272 20700244 21655638 22110256 22125936 21841738 21400577 20928870 20539146
60982 20539146 20293840 20139926 19897015 19346810 18363518 16976683 15327682 13580108 11862001
60973 11862001 10257511 8816770 7561325 6489466 5587173 4837204 4220483 3715488 3301413
60964 3301413 2961503 2682073 2450167 2254150 2085523 1938624 1809277 1694682 1593405
60955 1593405 1504058 1424428 1352593 1288010 1230643 1179800 1134637 1094898 1060225 1029333 1000674
60944 1000674 973305 946527 919513 892129 865386 840210 816348 793210 771082 750583 731474
60933 731474 712888 694348 675822 657322 639211 622405 607440 593719 580421 567716 556279
60922 556279 546107 536669 527879 520033 513030 506498 500455 495135 490366 485850 481885 479077 477532 476900
60908 476900 477008 477815 479052 480527 482520 485222 488105 490494 492427 494238 495712 496474 496830 497291 497586 497144
60892 497144 496274 495694 495025 492990 489256 484889 480666 476055 470334 463752 456946 449978 442674 435399 428847
60877 428847 423327 418633 414397 410296 406230 402515 399653 397791 396778 396730 397978 400266 402618 404378 405946
60862 405946 408179 411498 415897 421354 427749 434657 441644 448611 455546 462176 468189 473593 478545 482968
60848 482968 486698 489943 493271 497089 501277 505310 508657 511053 512453 512804 511977 510033 507379 504443 501183
60833 501183 497189 492206 486406 480222 474143 468545 463426 458350 452984 447594 442693 438350 434329 430774
60819 430774 428051 425798 422911 418873 414531 411070 408684 406830 405400 404804 404979 405094 404610 404110 404643 406402
60803 406402 408492 409991 410940 412144 414296 417562 421853 427039 432754 438395 443630 448773 454348 460393
60789 460393 466466 472315 478304 485164 493486 503411 514595 526430 538434 550479 562670 575171 588153
60776 588153 601729 615827 630366 645581 661788 678687 695403 711547 727746 744650 761882
60765 761882 778619 794790 810918 826968 842199 856094 868610 879495 888192 894600 899150 901850
60753 901850 901959 898954 893176 885222 875270 863400 850012 835474 819791 803006 785478 767462 748897
60740 748897 730014 711622 694183 677007 659025 640175 621512 604045 587951 572877 558605
60729 558605 545298 533265 522449 512237 502128 492645 485067 479905 476098 472125 467521 462844 458591
60716 458591 454820 451623 449201 447432 445868 444197 442270 439736 436221 431997 427968 424742 422041 419191
60702 419191 415915 412378 408698 404735 400349 395692 391102 386736 382390 377803 373087 368700 364931 361646
60688 361646 358662 356154 354467 353603 353106 352389 351139 349544 348211 347670 347823 348073 348121 348349 349179 350348 351201
60671 351201 351513 351580 351577 351340 350939 351077 352585 355531 358960 361543 362503 362055 361047 360270 360060 360286 360494 360199
60653 360199 359458 359199 360603 363989 368600 373530 378413 383109 387388 391434 396020 401438 406555 409801 411029
60638 411029 411579 412418 413047 412595 411211 409793 408825 408138 407576 407129 406447 404833 402035 398674 395655 393327
60622 393327 391431 389574 387452 384839 381830 379111 377468 376832 376115 374347 371660 368896 366548 364641 363444
60607 363444 363513 364769 366126 366470 365771 364855 364271 363745 362674 360877 358860 357445 357101 357531 357978 357964 357616
60590 357616 357253 356947 356629 356355 356246 356353 356767 357678 359085 360580 361692 362314 362669 362969 363377 364163 365638
60573 365638 367993 371410 376264 382883 391081 400140 409357 418511 427733 437045 446173 454840 463082 471097
60559 471097 478744 485347 490077 492420 492266 489862 485879 481220 476430 471544 466860 463470 462410 463484
60545 463484 465675 468648 473082 479452 487371 496359 506483 517809 529910 542299 554724 566591 576738
60532 576738 584358 589658 593146 594774 594283 591792 587464 581182 573268 565033 557865 552096 547423 543910
60518 543910 541741 540398 539057 537582 536295 535027 533433 532134 532450 534819 538353 542172 546426 551838
60504 551838 558956 568168 579797 593903 610476 630010 653321 680608 711201 744381 779924 817612
60492 817612 856743 896374 935610 973376 1008188 1038344 1062117 1077816 1084150 1080695 1067727 1045599
60480 1045599 1014663 975853 930992 882507 833038 785011 739971 698347 660204 626014 596189
60469 596189 570310 547638 528095 511808 497918 485040 472934 462506 453969 446247 438657 431897
60457 431897 426693 422565 418798 415730 414005 413195 412142 410287 407822 404927 401706 398550 395772 393058
60443 393058 389978 386803 384142 381974 379749 377351 375290 373970 373313 373149 373439 374013 374416 374116 372825 370876
60427 370876 369312 369144 370152 370933 370518 369452 368751 368439 367978 367682 368605 370977 373711 375710 376998 378275
60411 378275 379904 381686 383295 384640 385866 387034 387815 387727 386934 386453 387133 388666 390105 391177 392405 394084
60395 394084 395857 397489 399343 401744 404349 406528 408137 409620 411529 414096 417107 420011 422270 423743
60381 423743 424741 425708 426943 428494 430182 431763 433291 435136 437465 439859 441722 442959 443957 445061 446444
60366 446444 448308 450699 453096 454686 455243 455386 455857 456817 457936 458870 459535 460184 461350 463445 466312 469412
60350 469412 472552 476163 480749 486381 492902 500313 508573 517176 525280 532296 538126 542790 546091 547807
60336 547807 548034 547071 544917 541167 535522 528230 519886 511043 502286 494453 488236 483508 479486 475618 471929
60321 471929 468439 464900 461382 458604 457189 456943 457223 457676 458258 458914 459821 461713 465380 470900 477704 485243
60305 485243 493260 501758 511184 522408 535928 551202 567155 583003 598048 611114 621125 628149
60293 628149 632984 635634 635089 630783 623449 614228 603714 592305 580740 569693 559193 548961 538989
60280 538989 529412 520105 510872 501869 493516 486104 479610 473659 467608 461058 454437 448703 444270 440633
60266 440633 437239 434145 431486 428875 425949 423155 421310 420534 420139 419522 418623 417554 416265 414731 413117
60251 413117 411650 410522 409933 409981 410457 410973 411306 411491 411584 411555 411430 411369 411584 412302 413755 416017 418801 421506
60233 421506 423556 424691 425020 424912 424854 425316 426677 429162 432726 437010 441498 445747 449459 452486 454962
60218 454962 457314 459795 462045 463506 464341 465487 467665 470722 474263 478419 483544 489423 495389 501111
60204 501111 506800 512608 518346 523895 529457 535168 540732 545689 549848 553254 555905 557739 558850 559496
60190 559496 559966 560590 561777 563697 565765 566719 565576 562568 558948 555789 553129 550313 546860 542794 538347
60175 538347 533726 529156 524825 520761 516981 513768 511462 509911 508443 506550 504377 502352 500627 499098
60161 499098 497782 496870 496457 496455 496714 497109 497596 498301 499448 501001 502509 503533 504143 504757 505550 506280 506825 507663
60143 507663 509571 512760 516426 519368 521224 522970 525926 530293 535035 539294 543450 548409 554195 559825
60129 559825 564471 568166 571241 573588 574815 574811 573842 572271 570504 569102 568573 568983 569990 571330 573055 575205
60113 575205 577455 579368 580936 582569 584481 586272 587321 587471 587152 586885 586886 587117 587405 587359 586410 584295 581492
60096 581492 578880 576827 574854 572381 569612 567372 566110 565514 565332 566148 568777 573024 577645 581762 585737
60081 585737 590264 595031 598900 601306 602865 604484 606345 607895 608412 607317 604246 599225 592763 585627
60067 585627 578474 571647 565068 558275 550799 542721 534686 527260 520391 513639 506775 500011 493713 488047
60053 488047 482880 477993 473424 469605 467011 465670 465169 465141 465545 466512 468144 470525 473661 477325 481246
60038 481246 485503 490384 495708 500685 504684 507844 510650 513245 515454 517185 518346 518526 517177 514101
60024 514101 509575 504174 498642 493543 488629 482912 475896 468506 462143 456988 451997 446516 440984 435890
60010 435890 430975 426033 421788 419183 418129 417665 417196 416985 417471 418707 420542 422903 425695 428664 431510
59995 431510 433948 435680 436582 437025 437804 439593 442474 446000 449599 452949 456173 459695 463747 468019 471932
59980 471932 475267 478327 481411 484342 486631 488022 488662 488793 488425 487441 486000 484635 483753 483051 481699 479254
59964 479254 476174 473287 471007 469320 468249 467796 467608 467276 467018 467439 468463 469160 468941 468328 468078 468107 467917
59947 467917 467642 467824 468377 468570 468100 467454 467127 467115 467340 467865 468417 468309 467194 465429 463396 461087 458718
59930 458718 457155 457040 457839 458417 458348 458053 457803 457287 456227 454875 453696 452921 452574 452685 453343 454658 456626
59913 456626 458959 461185 463130 465101 467341 469598 471631 473874 476973 480803 484562 487855 491037 494274
59899 494274 496945 498402 498904 499367 500381 501828 503261 504328 504928 505279 505817 506847 508278 509856 511614
59884 511614 514014 517602 522531 528324 534122 539305 543967 548643 553539 558144 561721 564095 565843 567643
59870 567643 569454 570462 569925 567987 565396 562472 558806 554110 548832 543540 538109 532229 526454 522019
59856 522019 519553 518555 518269 518512 519441 521055 523260 526119 529779 534263 539476 545220 551261 557629 564675
59841 564675 572343 579460 584385 586519 586637 585695 584042 582077 580788 580887 581769 582009 580728 578053 574449 570050
59825 570050 564586 557665 549327 540531 532813 527035 522637 518365 513554 508394 503273 498348 493701 489508
59811 489508 485983 483207 480889 478271 474670 470347 466453 463818 462173 460831 459670 458953 458621 458408 458312
59796 458312 458294 457696 455730 452567 449347 446970 445374 443968 442260 440001 437290 434744 433050 432123 431082
59781 431082 429339 427336 425914 425223 424648 423732 422847 422778 423772 425180 426181 426707 427418 428780 430562 432380
59765 432380 434302 436583 439165 441909 445002 448575 452033 454421 455550 456375 458171 461647 466742 472778
59751 472778 478718 483759 487864 491493 494931 498277 501978 506595 511857 516605 520096 522844 525726 528738
59737 528738 531242 533083 534720 536314 537457 537976 538409 539250 540160 540417 539938 539321 538933 538525 537984 537890 538835
59720 538835 540484 541832 542338 542288 542104 541891 541864 542573 544279 546489 548492 550109 551536 552821 554001 555526
59704 555526 557943 561142 564423 567380 570364 573966 578307 582883 586853 589478 590589 590745 590831 591457 592778
59689 592778 594634 596582 597965 598394 598149 597779 597272 595961 593376 589938 586705 584522 583398 582537 580971
59674 580971 578377 575312 572547 570163 567450 563630 558635 553237 548489 544919 542141 539394 536457 533700
59660 533700 531274 528800 526209 524339 524042 524979 525854 525822 525220 525032 526081 528576 531974 535282 537843 539707
59644 539707 540958 541084 539588 536860 533712 530255 526077 521411 517185 513763 510532 507048 503808 501440
59630 501440 499802 498337 496832 495366 493992 492884 492347 492206 491575 489732 486987 484173 481526 478614 475300
59615 475300 472281 470483 470137 470525 470537 469527 467751 466039 465043 464871 465282 466007 466819 467512 467915 467853 467238 466355
59597 466355 465835 466005 466349 466084 465229 464674 465093 466212 467253 467709 467583 467256 467244 467816 468663 469206 469213 468828 468037
59578 468037 466574 464418 461863 459026 455758 452217 448983 446314 443748 440803 437755 435330 433879 433085
59564 433085 432334 431205 429816 428752 428444 428580 428438 427862 427535 428180 429875 432220 434776 437216 439377 441318
59548 441318 443119 444719 446325 448762 452761 457980 463483 469210 476114 484649 494078 503613 513354 523631
59534 523631 534365 545842 559201 574906 590957 603639 610310 611149 608442 604677 601229 598277 595699
59521 595699 593939 593706 594944 596710 598292 599764 601103 601456 599915 596490 591685 585633 578295 570103 561647
59506 561647 552965 543847 534609 525896 517907 510389 503255 496648 490608 485203 480794 477659 475498 473763
59492 473763 472177 470554 468591 466445 465059 465158 466277 467539 468985 471193 473955 476472 478792 481832 485833
59477 485833 489963 493778 497975 503139 508656 513609 518066 522588 526924 530115 531849 532983 534426 535974
59463 535974 536674 536260 535820 536817 539648 543547 547820 552634 558440 565270 573044 582027 592339 603299 613865
59448 613865 623529 632238 639801 646064 651445 656526 661199 664784 666758 666583 663196 655809 645343 634000
59434 634000 623166 612631 602082 592241 583956 577016 570625 564509 559016 554612 551799 551001 552028 554165
59420 554165 557298 562444 570579 581465 594298 608985 625901 644591 663630 681724 698301 713181
59408 713181 726570 739367 752309 764154 771438 770998 762725 749491 734627 720020 706291 693843
59396 693843 683234 675029 669721 667275 666090 662698 653537 637570 616868 594588 572859 552698 534953
59383 534953 520340 508820 499725 492550 487126 483155 480164 477942 476545 475889 475834 476637 478674 481579 484213
59368 484213 485705 486135 486102 486139 486755 488468 491356 494882 498520 502361 506832 512043 517678 523432 529361 535919
59352 535919 543716 553105 563936 575843 588724 602690 617673 633470 650196 668155 687062 705825
59340 705825 723416 739680 755023 769541 782746 794003 802962 809606 813924 815550 813822 808497 800307
59327 800307 790452 779511 767322 753975 740404 727632 715861 704685 693922 683856 674820 666917
59315 666917 660054 653976 648326 642922 637927 633574 629826 626450 623360 620737 618902 618213 619011 621494 625572
59300 625572 630906 637061 643684 650601 657802 665256 672678 679354 684061 685323 682207 675134 665622 655005
59286 655005 643758 632337 622069 614453 609791 607322 606576 607729 610594 614212 617959 622365 628358 636172
59272 636172 645479 656093 667955 680642 693450 705879 717762 729053 739682 749467 757901 764188
59260 764188 767669 768076 765396 759826 752000 742805 732688 721432 708853 695392 681824 668756 656652
59247 656652 645914 636526 627939 619751 612319 606358 602148 599408 597731 596853 596710 597577 599846 603336 607104
59232 607104 610341 613220 616372 619735 622417 623620 623191 621260 617861 613062 607173 600641 593845 586977
59218 586977 579936 572383 564092 555282 546502 538269 530893 524489 518902 513751 508833 504446 501084 498855
59204 498855 497354 496083 494810 493637 492949 493262 494867 497538 500694 503820 506714 509486 512537 516464 521729
59189 521729 528204 535115 541567 547249 552571 558009 563356 567916 571492 574765 578353 581965 585049 587936
59175 587936 591570 596178 601168 606417 612649 620110 627780 634581 640681 646915 653568 660551 668220 676928
59161 676928 685981 694065 700696 706366 711234 714612 716048 715991 714912 712392 707708 700902 692737 683842 674437
59146 674437 664755 655154 645711 636134 626316 616785 608389 601571 596130 591618 587770 584476 581607 579134
59132 579134 577286 576277 575916 575897 576463 578365 581913 586474 591216 596003 601218 607042 613411 620531 628865
59117 628865 638569 649326 660724 672451 684099 695197 705634 715756 725853 735706 744800 752841
59105 752841 759943 766383 772297 777580 782028 785545 788168 789923 790756 790735 790151 789288 788119 786437 784242
59090 784242 781814 779325 776474 772666 767639 761956 756729 752626 749054 744548 738137 730231 722012 714061
59076 714061 705860 696634 686373 675802 665501 655404 645289 635427 626345 618068 610122 602445 595722
59063 595722 590438 586047 581647 577144 573069 569417 565511 561127 557000 553878 551673 549798 547811 545328
59049 545328 541854 537332 532630 528955 526756 525439 524162 522710 521691 521886 523352 525253 526817 528205
59035 528205 530019 532206 534228 536226 539028 542726 546229 548820 551382 555329 560977 567750 575480 584551
59021 584551 595035 606601 619180 632878 647162 660821 672904 683222 691898 698939 704415 708580
59009 708580 711600 713426 714081 713850 713112 712110 710918 709566 708295 707692 708355 710364 713373 717268 722218
58994 722218 727795 732644 735621 736942 737688 738351 738393 737066 734169 730030 725161 719880 713993 706970 698727
58979 698727 690075 682144 675567 670426 666695 664384 663561 664476 667313 671550 676134 680762 686422 694044 703102
58964 703102 712270 720993 729560 737963 745716 752721 759343 765540 770626 773997 775415 774536 770931 764782
58950 764782 756940 748052 738067 726722 714110 700696 687231 674639 663539 653811 644917 636545 628629
58937 628629 621131 614461 609715 607589 607030 605903 603112 599331 595599 592121 588701 585465 582552 579651
58923 579651 576419 573065 570173 568159 567008 566229 565030 562977 560615 558982 558476 558639 559091 560021 561607
58908 561607 563626 565976 569035 573143 578112 583602 589653 596649 605038 615168 626976 639671 652238
58895 652238 664484 677195 691032 705669 720248 734288 747919 761571 775753 790843 806878
58884 806878 823677 841171 859301 877519 894760 909980 922463 931686 937331 939455 938264 933826
58872 933826 926462 917132 906670 894692 880241 863598 846510 830320 814862 799682 785322 772598
58860 772598 761371 750926 741040 731738 722392 712064 700730 689369 678786 668922 659333 649753 640118
58847 640118 630543 621424 613180 605782 598902 592580 587341 583380 579990 576124 571444 566513 561965 557763
58833 557763 553442 548831 544247 540016 536180 532740 529848 527557 525710 524351 523906 524535 525586 526154 526102
58818 526102 526104 526794 528295 530450 533027 535687 538195 540638 543049 544981 545969 546322 546947 548353 550271 552166
58802 552166 553614 554300 554214 553853 553652 553306 552265 550702 549204 547629 545234 542123 539536 538404 538365 538609
58786 538609 538835 539000 538973 539083 540306 543212 547168 551140 554849 558662 562801 567151 571420 574982 576990
58771 576990 577210 576413 575454 574297 572376 569540 566048 561994 557384 552686 548656 545605 543220 541118 539271
58756 539271 537915 537278 537391 538023 538908 540116 541968 544526 547462 550601 554238 558659 563577 568355 572681
58741 572681 576834 581362 586599 592428 598469 604567 610964 617845 624954 631956 638955 646249 653786 661324
58727 661324 668830 676144 682529 687347 691061 694752 698762 702630 706244 709919 713305 715489 716573 718002
58713 718002 720754 724195 727370 730434 733952 737558 740268 741614 741665 740270 737076 732035 725311 716841 706443
58698 706443 694155 680164 664796 648792 633123 618179 603588 589103 575117 562022 549785
58687 549785 538549 529008 521570 515702 510599 505972 501715 497413 492805 488247 484119 480239 476384 472958
58673 472958 470590 469452 469409 470337 471959 473914 476488 480581 486413 492852 498698 504057 509802 516207 522834
58658 522834 529245 535066 539640 542303 542874 541552 538736 535219 531941 529073 525932 522160 518283 514660
58644 514660 510822 506582 502938 500925 500190 499577 498567 497303 495723 493604 491110 488589 486223 484374 483620
58629 483620 483785 483780 483200 483176 484633 486596 487474 487327 487459 488320 489368 490676 493141 497065 501882 507390 514029
58612 514029 521697 529371 536261 542565 548841 555228 561354 566454 569653 570761 570624 570149 569255 567456 565114
58597 565114 563230 562190 561544 560850 559993 558917 557803 557320 557917 559145 560436 562175 565208 569598 574826
58582 574826 580885 588222 596769 605936 615322 624680 633561 641864 650274 659154 667509 674284 680235 687180
58568 687180 695695 704980 714827 726100 739204 753616 769295 787127 807391 828902 850182 870619
58556 870619 890086 908354 925326 941040 954959 965953 973291 977145 977907 975668 970575 963148 954023
58543 954023 943738 932700 920935 908091 894177 879891 865581 850415 833483 815270 796993
58532 796993 778938 760652 742520 725757 710943 697840 686666 678188 672389 668249 665091 663037
58520 663037 661956 661140 660306 659910 660193 660778 661378 662016 662508 662669 663029 664274 665995 667037 667130 666995 666877 666236
58502 666236 665019 663884 662848 660996 657909 654300 650941 648059 645978 645110 644973 644402 643175 642319 642511
58487 642511 643380 644748 647279 651363 656554 662694 670479 680185 690879 701562 712320 723727 735845
58474 735845 748265 760443 771632 781188 789126 795597 799897 801034 799277 795867 791065 783972 774707
58461 774707 765222 757276 750941 745836 742511 741582 742545 744471 747176 750906 755518 760619 765887 770736 774368
58446 774368 776578 777768 777848 776031 772112 766989 761454 755439 748941 742678 737224 732425 728281 725560 724869
58431 724869 725887 728045 731277 735644 741001 747475 755510 765035 775315 785911 796894 807839 817615
58418 817615 825586 832141 837623 841619 843665 843776 842015 838378 833313 827425 820596 812519 804119 797093
58404 797093 791804 787033 782107 777778 774554 771745 768913 766853 766260 766635 767315 768522 770675 773633 777226
58389 777226 781537 786125 790010 792915 795378 797275 797434 795233 791358 786604 781221 775795 771262 767473
58375 767473 763247 758488 754750 753068 752838 753638 756536 762489 770711 779697 788834 798211 807917 818231
58361 818231 829500 841279 852691 863921 875999 888867 901243 912754 924371 936218 946870
58350 946870 955492 962839 969348 974221 977329 980183 983930 988106 992310 997379 1003937 1011488 1019857 1029808
58336 1029808 1041355 1053265 1065034 1077501 1090843 1104032 1116992 1130909 1145525 1158666 1169542
58325 1169542 1179918 1190807 1200734 1208703 1216017 1223352 1228869 1231412 1232957 1235639 1238764 1241133 1243997
58312 1243997 1249068 1255664 1262338 1269595 1278576 1288793 1299467 1311385 1325168 1339447 1352906 1366405
58300 1366405 1381042 1396104 1411042 1427291 1445723 1464309 1480815 1495882 1511141 1526387 1541140
58289 1541140 1556854 1574825 1593782 1612251 1631367 1652746 1675556 1698433 1722261 1748239 1775159
58278 1775159 1801508 1828416 1857694 1888782 1920443 1953491 1989090 2026339 2064314 2104392 2147748
58267 2147748 2192796 2237965 2284680 2334760 2387387 2441482 2498243 2558148 2618537 2677631 2737824
58256 2737824 2801395 2866294 2930139 2994871 3062895 3132068 3199538 3267395 3339330 3414723 3491497
58245 3491497 3571942 3659850 3754368 3852486 3955357 4066415 4185471 4310470 4442919 4585854
58235 4585854 4738633 4899401 5070273 5254384 5450609 5657230 5877785 6116881 6373366
58226 6373366 6644447 6933296 7245571 7581984 7941916 8330699 8755210 9216201 9713756
58217 9713756 10256302 10854831 11512532 12230699 13021083 13901667 14884800 15981956 17216635
58208 17216635 18620306 20220706 22049972 24163104 26636703 29556657 33025273 37176751
58200 37176751 42167492 48156241 55315082 63854545 74010009 85998171 99995880 116124685
58192 116124685 134372611 154476702 175892284 197915156 219896211 241456998 262593841
58185 262593841 283459335 303698570 321710331 334626890 339414225 334442257 320309363
58178 320309363 299344171 274354395 247628591 220668477 194422599 169582072 146709641
58171 146709641 126213956 108282661 92876911 79805921 68815179 59629433 51966977
58164 51966977 45564178 40199792 35691053 31877100 28621305 25822348 23406016 21306992
58156 21306992 19467669 17847291 16416994 15146990 14008437 12983872 12063932 11235412
58148 11235412 10482102 9794836 9170642 8603413 8084274 7609481 7179120 6788857 6430838
58139 6430838 6101590 5801662 5528407 5276046 5041600 4824057 4618984 4420726 4228957
58130 4228957 4046941 3874618 3709581 3553297 3409620 3277895 3153804 3036340 2927882
58121 2927882 2827948 2732950 2641877 2556614 2476763 2399588 2324999 2255378 2190467 2127389 2065696
58110 2065696 2007537 1952857 1899173 1846265 1796499 1750256 1705416 1661624 1620842 1583296 1546867
58099 1546867 1510836 1476522 1443937 1411427 1378870 1347889 1318818 1290674 1263912 1239823 1217471
58088 1217471 1194575 1171213 1149297 1128849 1108366 1088405 1070988 1055608 1039670 1022894 1007413
58077 1007413 993324 978003 960359 942186 924686 907051 889179 872523 857438 842571 827582
58066 827582 813755 801434 789584 778163 768199 759237 749567 739277 730188 722473 714296 705175 696651
58053 696651 689127 681056 671935 663143 655053 646212 636376 627576 621113 615992 611330 607877 606030 604607
58039 604607 602648 600437 597883 593942 588526 583005 578053 572887 567226 561930 556974 550917 543256 535404
58025 535404 528512 522103 515609 509396 503496 497100 490123 483697 478472 473924 469778 466485 463861 461013
58011 461013 458021 455956 454829 453354 451175 449471 448922 448897 449089 450028 451513 452455 452692 452932 452513 449552
57995 449552 444096 438801 435475 432980 429649 425843 422784 420581 418631 416659 414356 411342 408222 406227
57981 406227 405122 403138 399678 396340 394438 393341 392209 391461 391278 390476 388323 386073 385279 385827 386857
57966 386857 388347 390512 392798 394755 396857 399325 401228 401882 402169 403274 405013 406447 407226 407335 406477
57951 406477 404779 403284 402693 402374 401508 400396 399729 399426 399188 399418 400597 402362 404103 405942 408401 411654
57935 411654 415712 420749 426629 432766 438926 445507 452597 459477 465446 470319 473783 475245 474779 473191
57921 473191 470710 466598 460552 453383 445781 437534 428603 419835 411885 404515 397704 392342 388959 386747
57907 386747 384702 382852 381572 380594 379521 378426 377124 374769 371024 366832 363225 360120 357041 354148
57893 354148 351747 349588 347473 345821 344874 344108 343152 342431 342207 341905 341206 340843 341360 341938 341454 339938 337964
57876 337964 335390 331805 327619 323576 319710 315819 312538 310755 310161 309346 307323 304288 301021 298173 296005
57861 296005 294422 293372 293377 295227 298884 303293 307629 312112 317234 322864 328550 334056 339123 343398 347086
57846 347086 351031 355629 360290 364390 368040 371449 374211 375731 375837 374679 372691 370864 370187 370489 370732
57831 370732 370627 370869 371490 371434 370339 369369 369420 369818 369777 369862 370857 372308 373491 374870 377145 379559 380565 379730
57813 379730 377845 375534 372899 370121 367312 363979 359494 353894 347572 340627 333246 326204 320179 314917
57799 314917 309760 304545 299529 295010 291603 290071 290184 290482 289932 289081 288977 289887 291821 295176 299762 304188
57783 304188 307464 310386 314123 318339 322036 325418 329352 333604 337297 340734 345169 350893 356976 362757
57769 362757 368130 372403 374380 373869 371963 369540 366404 362064 356443 349664 341930 333811 326030 318895
57755 318895 312375 306509 301181 295836 290148 284685 280274 277036 274693 273256 272559 271620 269489 266447 263456
57740 263456 260847 258469 256608 255544 254517 252441 249514 247011 245573 244805 244518 245109 246586 248263 249684
57725 249684 251038 252531 254093 255773 257669 259452 260695 261647 263008 264929 266821 267990 267884 266108 263006
57710 263006 259938 258017 256788 254984 252322 249563 247125 244716 242287 240223 238539 236871 235306 234314
57696 234314 233807 233145 232118 231122 230385 229874 229872 230684 231789 232210 231847 231558 231905 232740 234128 236774 241305 247855
57678 247855 256534 267674 281550 298439 318938 343612 372411 404964 441024 479797 519232 557198
57666 557198 593457 629607 666825 703944 737026 759916 766097 752096 719886 675376 624637 572121
57654 572121 521417 475480 435570 401346 372468 349120 330859 316314 304474 295266 288585 283793
57642 283793 280440 278357 276775 274550 271680 269504 268934 269447 270120 270517 270242 268839 266750 265291 265030 265108
57626 265108 264689 264010 263402 262366 260493 258378 256772 255488 253935 252093 250266 248460 246691 245333 244512
57611 244512 243686 242414 241043 240114 239601 239251 239134 239276 239274 238825 238200 237688 237034 235935 234656 233648 232931 232258
57593 232258 231539 230708 229519 227823 225687 223014 219484 215158 210753 207038 204269 202343 201039 199975 198769
57578 198769 197387 195929 194188 192014 189988 188884 188473 187741 186420 185300 184750 183976 182210 179844 177876
57563 177876 176896 176992 177907 178936 179331 179171 179256 179994 181126 182581 184551 186548 187522 187381 187331 188237 189701 191221
57545 191221 193053 195234 196888 197433 197560 198200 199284 200283 201115 201811 202092 202030 202224 202582 201938 199713 196874
57528 196874 194303 191342 187238 182986 180226 178976 177981 176762 175799 175077 174034 172856 172386 172698 173042 173258
57512 173258 174051 175660 177426 178909 180432 182134 183400 183748 183653 184065 185410 187269 188706 188865 187527 185176
57496 185176 182414 179583 177047 175262 174096 172700 170715 169059 168700 169093 168876 167818 167047 167366 168347 169202
57480 169202 169655 169743 169481 169032 168654 168254 167468 166330 165402 165084 165174 165226 165067 164825 164693 164664 164416 163583 162298
57461 162298 161216 160799 160880 161146 161615 162291 162781 162796 162668 162884 163402 163885 164203 164237 163607 162217 160717 159799 159394
57442 159394 159142 159253 160105 161296 161986 162083 162355 163320 164660 165714 166063 165701 165091 164932 165474 166215 166655 166978
57424 166978 167517 168027 168135 168099 168417 169004 169502 170046 170936 171854 172266 172428 173109 174466 175951 177188 178118 178450
57406 178450 177879 176796 175936 175371 174665 173921 173770 174277 174796 175041 175441 176257 177159 177868 178498 179035 179190 179001
57388 179001 178994 179582 180782 182578 184986 187674 190144 192307 194331 195991 196869 197197 197731 198651 199314 199203 198510
57371 198510 197678 197016 196810 197114 197350 196840 195801 195122 195098 195185 195159 195663 197269 199631 201817 203006 202783 201498
57353 201498 200467 201058 203287 205912 207988 209615 211064 212083 212445 212446 212442 212456 212500 212700 212902 212767 212473 212617
57335 212617 213270 213910 214461 215514 217162 218527 218929 218717 218431 217946 217071 216300 216280 217003 218066 219256 220397
57318 220397 221189 221776 222968 225294 228185 230567 231895 232315 232280 232401 233120 234119 234585 234465 234843 236515 238796
57301 238796 240367 240775 240508 240040 239576 239382 239631 240072 240411 240818 241705 243229 245347 247937 250480 252227 253175
57284 253175 254292 256168 258046 258991 259425 260499 262295 263761 264336 264572 265029 265522 265830 266367 267690 269767
57268 269767 272097 274298 276342 278394 280556 282602 284097 285044 286266 288702 292302 296026 298949 301038
57254 301038 302793 304583 306488 308489 310561 312671 314801 316899 318788 320277 321413 322557 324170 326498
57240 326498 329403 332478 335490 338768 342979 348420 354707 361257 367809 374351 380768 386906 392868 399000
57226 399000 405587 412661 420069 427564 434911 442000 448936 456092 464022 473091 482951 492672 501654 510241
57212 510241 519094 528306 537718 547709 558769 570332 581031 590367 599227 608404 617524 626023 634345
57199 634345 643394 653347 663805 674743 686515 699146 712205 725277 738143 750767 763493 776881
57187 776881 790893 804653 817503 829926 842843 856478 870552 885112 900281 915500 929979
57176 929979 943889 958269 973713 989881 1006361 1023232 1040535 1057848 1074680 1090932 1106799
57165 1106799 1122611 1138818 1155767 1173387 1191388 1209741 1228594 1247866 1267376 1287326 1308152
57154 1308152 1329933 1352395 1375364 1398617 1421395 1442922 1463606 1484974 1507991 1532037 1555947
57143 1555947 1579508 1603401 1628035 1653195 1678733 1705065 1732817 1762287 1793435 1826201 1860655
57132 1860655 1896793 1934305 1972673 2011509 2050730 2090378 2130490 2171339 2213646 2258337 2306143
57121 2306143 2357650 2413630 2474970 2542219 2615481 2694852 2780818 2874177 2975763 3086370 3206873
57110 3206873 3338494 3483128 3643575 3823503 4027282 4259904 4527149 4835953 5195015
57101 5195015 5615513 6111704 6701172 7404484 8243845 9240873 10414533 11780076 13348239
57092 13348239 15123548 17102455 19272999 21615963 24106245 26715033 29414501 32183375
57084 32183375 35008830 37883725 40802865 43757888 46723013 49629796 52347830 54695634
57076 54695634 56485140 57573456 57889646 57427852 56223764 54335467 51836420 48816080
57068 48816080 45381498 41656036 37773952 33871084 30073383 26485980 23185474 20217142
57060 20217142 17597154 15318225 13356637 11679224 10249499 9032270 7996241 7114735
57052 7114735 6365097 5727458 5183612 4716748 4312090 3957587 3643838 3363493 3110971
57043 3110971 2882589 2676357 2491073 2325369 2177561 2046135 1930050 1828483 1740468 1664920
57033 1664920 1600975 1548377 1507611 1479464 1463884 1458852 1460502 1464757 1469193 1473869 1480945 1493061
57021 1493061 1510191 1526308 1529655 1508547 1458543 1384313 1294985 1198604 1100685 1005653 917377
57010 917377 838254 768891 708932 657719 614377 577985 547753 522709 501387 482340 464870
56999 464870 448881 434256 420794 408556 397714 388213 379974 373213 368082 364264 361418 359706 359288
56986 359288 359560 359670 359636 360201 361564 362964 363483 362522 359426 353356 343854 331157 315935 299221 282502
56971 282502 267180 253767 242136 232553 225823 222324 221623 223262 227264 233588 241678 250895 260914
56958 260914 271450 282116 292794 303582 313985 322546 327603 328081 323484 313867 300284 284681 268765
56945 268765 253262 238624 225976 216707 211368 209560 210748 214736 221438 230726 242496 256438 271712
56932 271712 287248 302535 317795 333129 347540 358892 364813 363716 355247 340147 319936 296572
56920 296572 272013 247747 224724 203660 185112 169094 154989 142246 131026 121807 114572 108816
56908 108816 104204 100668 97873 95228 92620 90695 90199 91316 93777 97246 101433 106110 111269 117147
56894 117147 124026 132186 141988 153685 167046 181414 196207 211240 226565 242162 257665 272144
56882 272144 284302 293156 298364 299671 296495 288751 277890 266419 256275 248170 242401 239551 240241
56869 240241 244775 253311 266067 283276 305239 332115 363066 395785 427823 458520 488919 519679
56857 519679 549695 576690 598048 610938 613002 603926 585848 561722 533939 504897 477807 455711
56845 455711 440106 431366 430117 437276 453059 476963 508741 548415 594989 645804 697705 748766
56833 748766 798754 848063 896089 940210 975972 998297 1002990 987915 953767 904198 844933 782087
56821 782087 720722 664360 615227 574728 543858 523296 513101 512578 520743 536797 559825 588258
56809 588258 620119 653710 687744 721124 753046 782751 808102 824589 827053 812912 783292 741349
56797 741349 690790 636029 581965 532294 488581 451474 421885 400290 385871 377429 374630 377541
56785 377541 385430 396863 410569 425531 440744 455733 470868 486218 500159 509622 511546 503906
56773 503906 486270 460334 429500 396939 364078 331395 299957 271202 245614 222733 202474
56762 202474 185491 172109 161645 152944 145124 137815 131133 125460 120957 117385 114588 112632 111101
56749 111101 108900 105469 101709 98938 97340 96227 95378 95080 95089 94656 93673 92912 92989 93736 94657 95332 95368 94603
56731 94603 93505 92774 92563 92513 92439 92413 92308 91942 91605 91779 92372 92890 93319 94138 95460 96849 98063 99325
56713 99325 100742 102090 103321 104712 106278 107529 108051 108009 107939 108215 108740 109018 108709 108313 108889 110747 112793
56696 112793 113715 113452 113003 113160 114066 115610 117489 119160 120450 121915 123894 125606 126095 125691 125511 125790
56680 125790 125863 125678 126031 127167 128322 128951 129294 129365 128486 126426 124208 123076 123179 123706 123890 123504 122818 122405
56662 122405 122707 123611 124715 125916 127311 128688 129743 130676 131857 132964 133337 133228 133795 135627 138081 140332
56646 140332 142268 143990 145206 145622 145402 144868 144205 143707 143788 144466 145225 145619 145662 145601 145704 146226 147016 147233 146083
56627 146083 143848 141548 139699 138128 136907 136517 136981 137706 138349 139002 139449 139167 138271 137579 137546 137907 138480
56610 138480 139342 140064 139894 138962 138290 138262 138161 137539 136875 136391 135410 133590 131708 130482 129589 128569 127785 127629
56592 127629 127668 127388 127045 126971 126850 126494 126487 127220 128073 128537 129346 131416 134252 136583 138090 139386 140703 141772
56574 141772 142864 144780 147743 151136 154422 157663 161152 165140 169887 175496 181770 188601 196279 204985
56560 204985 214280 223536 232671 242094 252274 263619 276185 288940 299931 307849 313068 316654 319014
56547 319014 320273 321268 322984 325170 326558 326422 325181 323426 321136 317963 313696 308338 302142 295660 289420
56532 289420 283564 277958 272457 266799 260595 253852 247234 241446 236557 232214 228171 224359 220813 217830
56518 217830 215724 214123 212078 209239 206310 203906 201699 199297 197213 196085 195455 194274 192362 190549
56504 190549 189613 189688 190437 191158 191005 189780 188223 186997 185805 184108 182191 180699 179489 177851 175640 173399
56488 173399 171546 170154 169346 169176 169308 169426 169726 170370 170838 170583 170008 169971 170571 171299 172164 173709 175948 178138
56470 178138 179723 180811 181699 182540 183517 184760 186092 187313 188649 190393 192316 193920 195109 196047 196597
56455 196597 196440 195576 194225 192528 190840 189898 190088 190935 191921 193315 195431 197636 199065 199962 201223 202854
56439 202854 203950 204117 203923 203893 203925 203837 203634 203164 202150 200700 199303 198320 197881 198052 198626 199067 199160 199286 199565
56420 199565 199395 198537 197861 198034 198238 197455 196333 196320 197352 198054 198011 198163 198949 199713 200191 200994 202206 202964
56402 202964 202957 203035 203763 204616 205186 205979 207281 208292 208231 207516 207142 207559 208662 210083 210947 210198 207894 205512
56384 205512 204326 204067 203800 203469 203807 205209 207433 210157 213126 215914 218081 219626 221008 222710 224803
56369 224803 226780 227911 227986 227639 227592 227799 227824 227812 228345 229398 230281 230718 231273 232483 234208 236016 237622 238765
56351 238765 239257 239375 239743 240643 241800 242860 243648 244086 244399 245264 247114 249350 250919 251639 252287 253468 255108
56334 255108 256976 258935 260723 262299 264334 267527 271419 274815 277340 279674 282158 284255 285606 286676
56320 286676 287996 289524 291045 292446 293395 293471 292893 292409 292300 292100 291472 290665 290011 289644 289805 290736 292183
56303 292183 293660 295230 297393 300286 303680 307562 311864 315854 318774 320914 323061 325113 326451 327490
56289 327490 329452 332451 335183 336797 337896 339423 341646 344527 347951 351349 354159 356869 360566 365368
56275 365368 370450 375626 381578 388381 395240 401903 408899 416143 422888 429461 437408 447391 458447 469967
56261 469967 482777 497511 513526 530410 549148 570699 594659 620415 648555 680077 715201
56250 715201 753929 796851 844378 895944 950779 1008776 1069908 1133570 1199047 1265688 1332155
56239 1332155 1396580 1457993 1516479 1571299 1620149 1660981 1693342 1717098 1731126 1734322 1726908 1709842
56227 1709842 1683921 1650252 1610467 1565542 1515443 1460808 1403893 1346855 1290164 1233710 1178424
56216 1178424 1125660 1075805 1028568 983985 942184 902874 865872 831562 800220 771554 745316
56205 745316 721435 699211 677613 656821 638235 622433 608527 596082 586010 578726 572996 567639
56193 567639 562888 559018 555238 551144 547831 546194 545445 544505 543560 542984 542154 540744 539893 540624 542253 543704
56177 543704 545191 547224 549248 550731 552436 555177 558460 561770 565948 571790 578399 584484 590233 596405
56163 596405 602739 608764 615120 622578 630857 639776 650277 662802 675977 688612 701799 717335 735351
56150 735351 755262 777765 803921 833423 865847 902627 945754 995380 1050606 1111725 1179691
56139 1179691 1254209 1334316 1420153 1512276 1609908 1711585 1816640 1924026 2030278 2130410
56129 2130410 2220472 2298105 2361976 2412720 2453718 2488984 2520392 2547553 2568769 2580735 2579270
56118 2579270 2562744 2533850 2496407 2451880 2400529 2343579 2281456 2211586 2130997 2040163 1941922
56107 1941922 1838175 1730751 1624245 1524554 1434866 1355527 1286918 1229596 1182289 1142745 1110281
56096 1110281 1085134 1066002 1050820 1039219 1031677 1026977 1023207 1020515 1020220 1021964 1024396 1027732 1032817
56083 1032817 1038504 1042956 1046802 1052007 1058356 1064038 1068998 1074595 1080674 1086116 1091712 1099325 1108735 1118302
56069 1118302 1128059 1139117 1150976 1162715 1175880 1192588 1211529 1229549 1246460 1264520 1283892
56058 1283892 1302620 1320645 1339672 1359277 1377276 1393861 1411367 1429997 1447746 1464483 1482044
56047 1482044 1500303 1517344 1533616 1551758 1572030 1592011 1611131 1631526 1654145 1677975 1703248
56036 1703248 1731375 1761588 1791775 1822688 1857062 1894591 1932161 1969126 2007755 2048409 2089114
56025 2089114 2130265 2174829 2223234 2272702 2322169 2373279 2426159 2479026 2532483 2589482 2650599
56014 2650599 2713912 2779470 2848996 2921442 2994335 3069345 3150741 3238497 3329006 3422445 3522754
56003 3522754 3630226 3741129 3855267 3976784 4106697 4241872 4382322 4532153 4692178
55994 4692178 4859158 5033556 5220410 5421346 5633616 5858226 6100706 6362467 6640075
55985 6640075 6934573 7252636 7596960 7964939 8358538 8785778 9250736 9752511 10296018
55976 10296018 10892950 11550115 12268639 13057158 13933698 14912502 16002942 17225021 18612413
55967 18612413 20197936 22013095 24108172 26559381 29455042 32894938 37009124 41958102
55959 41958102 47909827 55039204 63555083 73697665 85691956 99715175 115888071
55952 115888071 134214607 154459190 176089410 198387828 220676613 242534479 263905192
55945 263905192 284928357 305334365 323662465 337074470 342314436 337319517 322248849
55938 322248849 299213373 271169715 240933607 210747643 182205297 156275749 133401879
55931 133401879 113670109 96952659 82973069 71361063 61734356 53752882 47116824
55924 47116824 41559891 36868013 32884991 29485834 26558540 24015503 21799093 19862029
55916 19862029 18154766 16637833 15289579 14091903 13020540 12055959 11190568 10417181
55908 10417181 9721028 9089352 8518212 8003453 7534527 7102942 6707672 6346931 6013144
55899 6013144 5700897 5411562 5145379 4896890 4662420 4444308 4243401 4054892 3875708
55890 3875708 3708815 3556100 3413888 3279369 3154816 3041584 2936325 2836756 2744980 2661653
55880 2661653 2582995 2506880 2435686 2369644 2303450 2233118 2160585 2088326 2015261 1941497 1871228
55869 1871228 1806915 1745662 1684989 1627161 1574341 1524547 1476096 1431201 1391424 1354194 1317531
55858 1317531 1283743 1254716 1227772 1199929 1172211 1146136 1119962 1092233 1065359 1041834 1020127
55847 1020127 997710 974994 952988 930378 906299 882875 861797 841321 819825 799239 781707
55836 781707 765731 748961 732153 717157 703466 689874 677205 666470 656538 646382 637363 630621
55824 630621 624520 617226 609509 602449 594812 585390 575623 567146 558846 549018 538408 528579 519311 510096
55810 510096 502171 496553 491997 487272 483496 481870 481211 480227 480248 483087 487965 492968 497904 503431 509067
55795 509067 514254 519636 525167 528825 529396 528663 528649 528602 526967 524238 521396 517479 511331 504095 497386 490618
55779 490618 482573 473945 465789 457126 446803 436247 427633 420632 413679 407226 403008 401125 400487 401247
55765 401247 404147 408120 410924 411662 410648 407618 402129 394991 387306 378821 369027 358876 349524 340357
55751 340357 330164 319251 308561 297852 286734 276324 267758 260129 252047 244222 238264 233952 229959
55738 229959 226394 224236 222965 221096 218569 216456 214759 212570 209976 207815 206000 203887 201774 200232
55724 200232 198574 195847 192708 190435 188703 186273 183339 181189 180065 179215 178597 178664 179004 179083 179817 182465
55708 182465 186430 190076 193172 196486 199442 200459 199553 198482 198193 197884 196652 194386 190986 186373 181453
55693 181453 177540 174681 171800 168501 165499 163382 162115 161597 161632 161631 161394 161757 163463 165930 168206 170370
55677 170370 172863 175314 177363 179690 182697 185128 185634 184849 184182 183534 182135 180704 180556 181219 181190 180575
55661 180575 180670 181334 181192 180322 180405 182048 184159 186166 188729 191854 194331 195526 196089 196474 196396 196052 196270
55644 196270 197071 197475 197003 196005 194450 191849 188514 185388 182474 178831 174177 169030 163329 156561 149353
55629 149353 143259 138760 135008 131642 129156 127372 125441 123705 123654 125430 127088 127085 125954 124805 123568
55614 123568 121603 118832 115470 111605 107671 104451 102104 100111 98447 97783 98195 98794 99009 99224 99760 100233
55598 100233 100304 100108 99610 98512 97068 96053 95634 95174 94361 93574 92986 92245 91288 90542 90209 90186 90640 91717
55580 91717 92818 93258 93538 94712 96616 98106 98962 100058 101548 102474 102539 102800 104075 105965 107867 109698
55564 109698 111215 111873 111852 112100 112966 113825 114284 114548 114409 113277 111598 110755 111014 110924 109310 106582 103579
55547 103579 100545 97961 96995 98111 100265 102275 104038 105701 106762 106888 106742 107161 108230 109787 111954
55532 111954 114521 116631 117784 118442 119090 119474 119327 119036 118976 118940 118675 118242 117427 115663 112970 110088 107269
55515 107269 103985 100295 97384 96005 95369 94339 92832 91308 89733 87948 86299 85129 84126 82856
55501 82856 81373 79798 77960 75936 74213 72873 71426 69927 69351 70197 71606 72588 73228 73921 74245 73574
55485 73574 72237 71173 70833 71120 71935 73067 74025 74551 74903 75177 74946 74107 73459 73748 74645 75234 75060 74204
55467 74204 72926 71813 71661 72512 73260 72868 71578 70408 69901 69946 70342 70940 71513 71939 72188 71940 70760 68942
55449 68942 67534 67100 67085 66823 66441 66189 65612 64166 62251 60919 60823 61851 63416 64709 65064 64535 63798
55432 63798 63261 62786 62446 62783 63933 65219 66125 66999 68270 69610 70502 71067 71691 72319 72751 73226 74084 75122
55414 75122 75801 75840 75300 74396 73540 73170 73272 73432 73493 73691 74013 74020 73521 72794 71971 70871 69638 68790 68446 68286
55394 68286 68442 69438 70982 71850 71485 70676 70144 69472 68199 66958 66640 67110 67653 68099 68720 69455 69941 69926
55376 69926 69235 67823 66228 65322 65277 65522 65977 67308 69495 71275 71762 71574 71571 71527 71027 70706 71385 72709
55358 72709 73768 74466 75181 75597 75008 73491 71868 70775 70482 71157 72521 73708 74197 74466 75073 75730 75997
55341 75997 76188 76622 76641 75391 73182 71159 70009 69717 70052 70499 70301 69421 68922 69535 70500 70701 70276 70099
55323 70099 70368 70816 71692 73263 74811 75365 75078 74798 74677 74360 74063 74190 74259 73498 72266 71601 71577 71448 71145
55304 71145 71264 71694 71725 71578 72399 74458 76594 77715 77751 76987 75629 74365 74151 74960 75668 75594 75300 75485
55286 75485 76024 76551 77216 78263 79397 80004 79705 78526 76985 76043 76411 77776 79155 79988 80429 80697 80870
55269 80870 81163 81644 81727 80776 79272 78504 78956 79821 80297 80512 80869 81247 81321 81117 80788 80283 79585 79006 78873
55250 78873 79153 79521 79710 79719 79832 80303 80958 81296 81137 80805 80483 79949 79285 79115 79521 79404 77840 75513 73826
55231 73826 73031 72378 71793 72105 73567 75335 76655 77570 78226 78386 78013 77576 77445 77502 77554 77602 77610 77510 77484 77726
55211 77726 78042 78200 78536 79525 80844 81614 81546 81217 81245 81789 82684 83415 83241 82147 81381 82121 83824 84895
55193 84895 84790 84386 84402 84725 85282 86262 87183 87011 85676 84444 84338 85094 85984 86677 86891 86240 84989 84117
55175 84117 84088 84283 84081 83668 83360 82998 82605 82848 84178 86089 87806 89103 89973 90102 89347 88262 87552 87334
55157 87334 87345 87529 87982 88630 89277 89787 90095 90337 90864 91629 91750 90484 88572 87638 88065 88517 87884 86649
55139 86649 85815 85558 85691 86488 88071 89577 89944 89200 88240 87666 87536 87877 88657 89402 89514 88928 88026 87055
55121 87055 86050 85192 84779 84831 85021 84961 84470 83705 83143 83181 83716 84404 85267 86611 88308 89727 90548 91099 91645
55102 91645 91907 91602 91051 90845 91201 91879 92465 92616 92366 92244 92708 93440 93710 93446 93334 93755 94317 94596 94684
55083 94684 94785 94941 95388 96446 97744 98195 97206 95373 93714 92746 92559 93084 93893 94341 94265 93996 93500 92254
55065 92254 90290 88549 87743 87600 87740 88438 89886 91368 91996 91759 91261 90932 91041 91921 93419 94626 94835
55048 94835 94405 94062 93826 93255 92339 91376 90347 89153 88232 88178 88879 89660 90210 90808 91692 92668 93331 93403 92921
55029 92921 92244 91698 91190 90558 90262 91023 92611 93812 94001 93910 94285 94674 94347 93659 93515 93962 94326 94392 94509
55010 94509 94768 94940 95122 95599 96161 96227 95615 94585 93317 92002 91256 91708 93156 94751 95990 96965 97763
54993 97763 98225 98348 98400 98583 98915 99354 99742 99869 99937 100574 101918 103057 103050 102171 101526 101658 102251 102958 103740 104511
54973 104511 105255 106445 108547 111070 112845 113339 113023 112383 111347 109902 108556 107808 107655 107880 108403 109126
54957 109126 109924 111036 112964 115565 117679 118093 116733 114533 112344 110423 108903 108173 108407 109004 109083 108650
54941 108650 108774 110165 111949 112534 111597 110466 110353 110999 111420 111269 110872 110470 110188 110427 111526 113181 114828
54924 114828 116560 119042 122482 126243 129638 132834 136723 142011 148415 154758 160012 164282 168500 173121
54910 173121 177566 181019 183147 183736 182315 178809 174076 169117 164067 158537 152643 147038 142125 137885
54896 137885 134316 131443 129014 126731 124677 123048 121672 120283 119082 118446 118269 118188 118225 118671 119511 120640
54880 120640 122447 125437 129378 133510 137550 141756 146083 150077 153712 157534 161786 166084 170183 174322
54866 174322 178427 181575 182775 181939 179745 176719 172746 167343 160305 152237 144457 138099 133278 129325
54852 129325 125692 122295 119152 116220 113638 111618 110043 108618 107512 107259 107774 108004 106984 104961 103081
54837 103081 102117 101867 101785 101805 102288 103273 104085 103983 103100 102437 102806 104047 105342 106077 106198 106036 105986 106196 106446
54818 106446 106497 106510 106771 107038 106771 106134 106040 106930 108164 109009 109493 109785 109555 108724 108105 108354 108886 108806 108466 108923
54798 108923 110176 111157 111408 111563 112056 112443 112316 111943 111654 111334 110868 110451 110188 109890 109494 109185 109062 109202
54780 109202 110049 111977 114392 116043 116439 116381 116882 118220 120215 122763 125740 128951 132417 136317 140482
54765 140482 144509 148458 152889 157996 163286 168271 172966 177504 181851 185987 189748 192347 192785 190994
54751 190994 187981 184552 180558 175646 170030 164154 158232 152581 147813 144175 141172 138300 135773 134052
54737 134052 133094 132414 131564 130222 128232 125944 124140 123307 123356 124286 126499 130016 133947 137336 140208 143245
54721 143245 146744 150456 154169 157890 161592 165283 169193 173437 177605 181049 183473 184851 184910 183225 179848
54706 179848 175473 170824 166149 161386 156619 152215 148525 145531 142856 140199 137729 135903 134861 134213
54692 134213 133406 132184 130668 129198 128086 127375 126775 125963 124898 123715 122489 121332 120514 120109 119658 118572
54676 118572 116818 114842 112974 111388 110517 110825 112079 113426 114358 115079 115803 116241 116046 115332 114422 113483 112648
54659 112648 112200 112327 112873 113495 113902 113946 113658 113225 112699 111904 110910 110353 110767 111765 112467 112684 113016 113833 114862
54640 114862 115817 116729 117554 118155 118775 119789 120846 121016 120035 118655 117546 116661 116004 116123 117236 118589 119343
54623 119343 119597 120008 120841 121866 122759 123134 122613 121309 119856 118650 117493 116306 115613 115831 116599 117272 117659
54606 117659 117837 117746 117418 117171 117127 116992 116680 116677 117311 118177 118746 119039 119295 119472 119614 120103 120965 121433 120851 119552
54586 119552 118328 117504 117124 117473 118653 120127 121415 122822 124701 126487 127319 127289 127182 127206 126863 125946 124812
54569 124812 123725 122655 121725 121167 120889 120672 120692 121255 122161 122930 123463 123825 123644 122551 121145 120652 121497 122880
54551 122880 123884 124371 124686 125080 125626 126240 126673 126793 126847 127099 127409 127607 128023 129098 130689 132408 134373
54534 134373 136884 139496 141365 142482 143689 145347 146865 147781 148435 149205 149801 149816 149398 148906 148321 147455 146461
54517 146461 145758 145599 145845 145974 145332 143791 142078 141015 140394 139276 137439 135770 134900 134205 132784 130878
54501 130878 129576 129380 129693 129697 129204 128563 128180 128297 129053 130442 132149 133586 134346 134660 135147 135881 136060 134997
54483 134997 133213 131976 131853 132328 132858 133553 134581 135552 135992 136063 136339 137135 138391 139959 141641 143121 144235
54466 144235 145214 146397 147836 149376 150906 152204 152747 152113 150616 149175 148479 148444 148578 148629 148735 149050 149400
54449 149400 149351 148614 147386 146222 145557 145358 145308 145260 145389 145876 146527 146827 146383 145315 144103 143111 142359 141802
54431 141802 141650 142186 143284 144317 144708 144488 144175 144161 144438 144943 145806 146989 147919 147970 147341 147007 147683 149178
54413 149178 150921 152571 153834 154248 153750 153082 152985 153257 153252 153002 153015 153170 152783 151816 151049 150891 150959 151114 151882
54394 151882 153396 154828 155529 155931 156671 157566 158207 158897 160098 161460 162269 162484 162494 162195 161220 159882 159031
54377 159031 159007 159402 159741 159818 159516 158876 158175 157411 156030 153839 151806 151094 151545 151956 151738 151411 151586 152390
54359 152390 153880 155997 157959 158582 157573 155818 154240 153058 152279 152101 152428 152666 152389 151734 150912 149928
54343 149928 148984 148550 148674 148779 148503 148197 148305 148766 149455 150678 152693 154966 156463 156626 155867 155150 155187 155916
54325 155916 156740 157437 158627 160986 164127 166802 168194 168470 168134 167488 166855 166582 166477 165861 164523 163094
54309 163094 162075 161037 159314 157106 155301 154403 154097 153815 153345 152853 152544 152370 152046 151410 150674 150165 149927
54292 149927 149845 150015 150522 150893 150348 148859 147506 147447 148698 150118 150484 149519 148106 147527 148281 149695 150890
54275 150890 151856 153174 154920 156518 157639 158523 159260 159448 158822 157692 156447 155134 153805 152826 152474 152613
54259 152613 152989 153504 153961 154027 153739 153718 154497 155915 157372 158396 158744 158341 157433 156603 156349 156716 157398 157956
54241 157956 157980 157371 156503 155783 155138 154376 153907 154372 155517 156226 155980 155517 155645 156064 155956 155239 154580 154412 154521
54222 154521 154480 154112 153555 153090 152843 152636 152310 152086 152197 152274 151713 150669 149966 149858 149710 149211 149052 149780 150728
54203 150728 150816 149989 149076 148527 148055 147400 146873 146988 147873 149030 149646 149344 148707 148729 149678 150980 152203 153454
54185 153454 154599 154893 153944 152387 151104 150328 150019 150407 151458 152380 152523 152351 152727 153565 153940 153314 151909
54168 151909 150122 148332 147143 147019 147606 147999 147655 146625 145118 143455 142248 141945 142236 142496 142677 143167
54152 143167 143893 144328 144397 144656 145432 146354 146941 147182 147349 147629 148076 148605 148936 148801 148243 147474 146609 145855 145732
54133 145732 146559 147787 148436 148258 147962 148187 148708 148876 148488 147970 147876 148320 148883 149124 149273 150181 152352 155221
54115 155221 157669 159047 159404 159040 158373 158111 158955 160942 163303 164964 165146 163736 161408 159234 157900 157415
54099 157415 157575 158243 158909 158685 157300 155655 154757 154585 154632 154988 155938 156985 157417 157637 158704 160557 161888
54082 161888 162033 161836 162257 163123 163777 164071 164141 163955 163671 163828 164638 165678 166769 168456 170972 173357 174459
54065 174459 174394 174230 174510 174876 174994 175043 175192 175199 174700 173577 172044 170688 170306 171246 172921 174380 175399 176644
54047 176644 178755 181656 184883 188176 191560 195126 198974 203219 207841 212629 217437 222428 227925 234055
54033 234055 240627 247344 254006 260506 266736 272524 277675 282039 285613 288606 291325 293918 296270 298170
54019 298170 299487 300115 299944 299122 298277 298147 298936 300247 301672 303114 304506 305647 306587 307779 309507 311482
54003 311482 313385 315533 318458 321908 324671 325395 323254 317995 309965 300205 290038 280244 270799 261537
53989 261537 252809 245302 239400 234865 231065 227423 223766 220302 217232 214505 212044 210054 208836 208302
53975 208302 207934 207222 205939 204038 201604 198968 196630 194904 193810 193310 193464 194229 195328 196467 197604
53960 197604 198868 200225 201366 202002 202243 202534 203171 203981 204660 205241 205982 206894 207844 209111 211251 214243 217291
53943 217291 219888 222569 226176 230791 235944 241498 247595 253880 259563 264374 268896 273790 279106 284414
53929 284414 289206 293071 295895 298075 300275 302873 305903 309497 313960 319249 324734 329719 334071 338253
53915 338253 342854 348159 353972 359820 365437 371062 377131 383711 390277 395931 399854 401832 402499 402781 402896
53900 402896 402130 399853 396310 392151 387655 382913 378341 374295 370408 365933 360569 354421 347450 339770
53886 339770 332230 325746 320031 313909 307064 300584 295434 291180 286754 281902 277336 273740 271010 268378
53872 268378 265132 261344 257812 255002 252331 249028 245425 242569 240602 238565 235992 233675 232342 231478
53858 231478 230103 228094 226098 224654 223992 224221 225086 225953 226625 227876 230635 234956 240293 246399 253379
53843 253379 261154 269442 278046 286637 294664 302131 310088 319433 329150 336501 339108 336409 329248 319022
53829 319022 307566 296991 288665 282402 277091 272121 267905 265086 263642 263001 262806 263207 264322 265660
53815 265660 266354 265941 264765 263580 262892 262616 262203 261139 259520 258137 257776 258484 259769 261451 263839 267029
53799 267029 270576 274136 278033 282757 288093 293162 297236 300248 302541 304380 305761 306571 306825 306770 306701 306744
53783 306744 306858 306944 306776 305931 304111 301471 298395 294938 290813 285953 280746 275626 270734 266051 261589
53768 261589 257387 253569 250385 247859 245439 242392 238619 234686 231051 227781 225008 223040 221777 220634
53754 220634 219359 218416 218212 218409 218419 218148 217821 217378 216535 215252 213747 212246 210976 210210 210022 210229 210778
53737 210778 211937 213834 216053 217957 219209 219801 219919 219927 220202 220776 221504 222655 224794 227835 230869 233264
53721 233264 235334 237424 239043 239613 239560 239826 240633 241538 242454 243699 245137 246204 246941 248200 250502 253275
53705 253275 255580 257194 258630 260368 262374 264356 266316 268777 272306 276796 281440 285541 289039 292090
53691 292090 294619 296720 299023 301973 304955 306783 307075 306571 306142 306033 306084 306036 305437 303824 301359 298929
53675 298929 297315 296502 295956 295267 294348 293247 292104 291171 290643 290408 290058 289200 287821 286355 285348 284970 284929
53658 284929 284847 284582 284147 283594 283086 282859 282916 282943 282689 282198 281570 280828 280277 280583 282093 284261 286126 287183
53640 287183 287492 287222 286560 285962 286005 286978 288815 291336 294291 297353 300338 303272 306025 308192 309646 310886
53624 310886 312472 314385 316350 318424 320775 323268 325860 329103 333537 338820 344119 349146 354043 358500
53610 358500 361977 364809 368088 372192 376340 379895 383266 386985 390610 393194 394483 395124 395930 397334 399239
53595 399239 401064 402147 402324 401968 401379 400540 399601 399044 398997 398802 397689 395658 393399 391550 390322 389518 388601
53578 388601 386976 384580 382033 379881 377884 375437 372527 369871 368101 367204 366819 366740 366964 367430 367993 368675
53562 368675 369773 371527 373725 375858 377755 379806 382387 385378 388589 392369 397187 402705 407892 412224
53548 412224 416209 420424 424508 427476 428746 428584 427810 427433 428248 430420 433460 436807 440295 443990 447961
53533 447961 452495 458233 465615 474310 483546 492954 502830 513635 525605 538788 553095 568210 583695
53520 583695 599338 615325 632088 650051 669405 689983 711412 733540 756629 780944 806271
53509 806271 832167 858628 886116 914754 943797 972182 999483 1026081 1052488 1078784 1104709
53498 1104709 1130066 1154884 1179327 1203595 1227803 1251869 1275567 1298792 1321690 1344375 1366620
53487 1366620 1388027 1408521 1428438 1448077 1467374 1486117 1504245 1521766 1538483 1554051 1568289
53476 1568289 1581286 1593103 1603425 1611549 1616800 1619034 1618638 1615971 1610925 1603254 1593150 1581144 1567430
53463 1567430 1551789 1534276 1515583 1496486 1477225 1457648 1437634 1417127 1396053 1374478 1352519
53452 1352519 1329879 1305917 1280645 1255289 1231289 1208955 1187627 1166943 1147287 1129047 1112193
53441 1112193 1096761 1083207 1071946 1062825 1055281 1048884 1043660 1040087 1038676 1039267 1040786 1042141 1043442
53428 1043442 1045977 1050909 1058309 1067553 1078212 1090343 1104180 1119787 1136871 1154863 1173445 1193089
53416 1193089 1214767 1238888 1264778 1291490 1319027 1348390 1380431 1414968 1451259 1489141 1529245
53405 1529245 1571986 1616816 1662961 1710663 1761049 1814684 1870912 1928805 1988143 2049021 2111107
53394 2111107 2173853 2237005 2300269 2362897 2424325 2485007 2545837 2606777 2666732 2724627 2779933
53383 2779933 2832238 2881119 2926614 2969116 3008545 3044135 3075150 3101240 3122015 3136907 3145712
53372 3145712 3148750 3146266 3138183 3124593 3105845 3081861 3051873 3015229 2972113 2923225 2869233 2810898
53360 2810898 2749373 2686013 2622062 2558614 2496418 2435482 2375304 2315747 2257353 2200593 2145355
53349 2145355 2091538 2039630 1990099 1942453 1895478 1848406 1801529 1755719 1711704 1669815 1630196
53338 1630196 1593098 1558826 1527349 1498083 1470387 1444224 1420085 1398278 1378669 1360998 1344966
53327 1344966 1329904 1314870 1299295 1283257 1267091 1251177 1236170 1222808 1211222 1200880 1191484
53316 1191484 1183469 1177337 1172914 1169658 1167395 1166420 1167080 1169519 1173604 1178969 1185362 1193035 1202438 1213531
53302 1213531 1225839 1239293 1254462 1271779 1291127 1312412 1335902 1361616 1388929 1417230 1446492
53291 1446492 1476750 1507505 1538075 1568133 1597446 1625485 1651798 1676378 1699212 1719869 1738030
53280 1738030 1753989 1768033 1779594 1787605 1791481 1791279 1787183 1779425 1768560 1755269 1739924 1722624
53268 1722624 1703408 1682067 1658134 1631582 1603235 1573969 1543801 1512313 1479682 1446601 1413444
53257 1413444 1380244 1347304 1314998 1282954 1250298 1216959 1184071 1152725 1122834 1093550 1064428
53246 1064428 1035791 1008189 981749 956011 930293 904343 878645 854000 830816 808953 788204
53235 788204 768688 750740 734558 720019 706761 694437 682886 671961 661326 650707 640347
53224 640347 630702 621558 611932 601122 589429 577527 565547 553172 540222 526673 512526 498257
53212 498257 485061 473931 464615 456006 447444 439069 431072 423281 415515 407791 400077 392321 384700 377458
53198 377458 370444 363274 355943 348827 342023 335177 328111 321263 315316 310547 306600 302747 298526 294301
53184 294301 290997 288970 287417 285298 282547 279815 277236 274235 270648 267307 265204 264486 264536 264658 264463
53169 264463 263936 263397 263244 263538 263917 263988 263661 263162 262833 262894 263212 263348 262957 262090 260987 259812 258730 257954
53151 257954 257499 257137 256895 257198 258117 258867 258607 257423 255957 254374 252466 250548 249404 249250 249521 249808 250340
53134 250340 251335 252509 253465 254057 254186 253751 253031 252591 252533 252293 251485 250547 250207 250573 251029 250916 250182 249481 249588
53115 249588 250538 251478 251725 251684 252159 252940 252947 251847 250602 250045 249681 248508 246451 244338 242785 241746 240934
53098 240934 240118 239087 237833 236797 236529 236985 237334 236598 234480 231683 229437 228514 228607 228776 228530 228210 228288
53081 228288 228729 229270 229982 231090 232317 232895 232366 231172 230265 230190 230689 231198 231501 231736 231919 231852 231603 231641 232246
53062 232246 233126 233876 234500 235128 235563 235648 235803 236623 238049 239525 240833 242165 243429 244155 244191 243920 243683 243576
53044 243576 243842 244791 246127 246950 246745 245831 244669 243322 241857 240676 239949 239198 237890 236126 234362 232801
53028 232801 231424 230265 229334 228558 228124 228504 229754 231124 231817 231860 231789 231735 231333 230457 229592 229457 230506 232654
53010 232654 235161 236928 237360 236995 237055 238204 239878 240888 240625 239673 239227 239855 240942 241464 241215 240905 241096
52993 241096 241480 241405 240775 240140 240035 240438 240819 240682 240181 240135 241161 242828 244028 244191 243799 243655 244100 245041
52975 245041 246262 247440 248268 248878 249842 251534 253742 256134 258690 261369 263694 265133 265806 266458 267688
52960 267688 269363 270790 271459 271639 272027 272666 272537 270736 267846 265412 264078 263064 261625 260083 258933
52945 258933 257774 255920 253611 251808 251004 250862 250872 250778 250423 249699 248704 247693 246854 246255 245836 245312 244412 243393
52927 243393 242947 243343 244034 244400 244442 244363 243996 243204 242449 242347 242850 243404 243687 243735 243597 243467 243914 245315 247147
52908 247147 248419 248763 248587 248224 247526 246360 244937 243554 242355 241403 240655 239878 238936 238103 237797 238060 238659
52891 238659 239521 240620 241576 241938 241853 241934 242386 242724 242424 241469 240162 238840 237875 237583 237964 238695 239390 239671
52873 239671 239192 238038 236938 236594 236849 237051 237174 237890 239459 241233 242544 243476 244443 245503 246507 247466
52857 247466 248357 248865 248779 248343 247864 247228 246190 244892 243665 242526 241311 240101 239047 237867 236091 233849
52841 233849 231910 230789 230200 229592 228794 227908 226900 225643 224168 222541 220728 218921 217802 217967 219068
52826 219068 220041 220315 220335 220646 220978 220705 219858 219067 218651 218354 217991 217781 217842 217886 217757 217899 218912 220837 223128
52807 223128 225140 226470 227074 227417 228302 230123 232276 233665 233782 233033 231982 230658 228850 226743 224848
52792 224848 223275 221528 219262 216995 215580 215069 214613 213650 212662 212415 212899 213560 214235 215162 216240 217024 217428
52775 217428 217760 217984 217718 217133 217092 217959 218927 219044 218372 217641 217177 216778 216335 216043 216143 216821 218144 219742
52757 219742 220872 221198 221231 221584 222090 222138 221614 220984 220627 220612 221055 222128 223673 225185 226251 226834 227214 227828
52739 227828 228943 230249 230987 230803 230229 230069 230613 231754 233454 235567 237589 239207 240836 242977 245255
52724 245255 246815 247538 248143 248990 249567 249359 248566 247628 246524 244978 243069 241284 240043 239387 239110 239085 239383
52707 239383 239977 240364 239809 238133 236009 234228 232935 231866 230985 230484 230364 230500 230934 231697 232468 232808 232614
52690 232614 232006 231064 230055 229631 230227 231459 232630 233570 234476 235285 235932 236976 239065 241846 244167 245361
52674 245361 245573 244967 243589 242140 241793 242804 244134 244874 245244 245695 245815 244930 243273 241783 240942 240437 239900
52657 239900 239513 239875 241512 244383 247692 250369 251969 252941 253924 255063 256177 257175 257970 258209 257464 255658
52641 255658 253128 250379 247869 245882 244465 243610 243458 244135 245350 246500 247338 248282 249856 251977 253945
52626 253945 255118 255535 255893 256811 258134 259183 259728 260210 260750 260549 258984 256788 255233 254367 253102 251080
52610 251080 249318 248707 248834 248778 248273 247500 246450 245194 244310 244358 245210 246409 247833 249537 251269 252707 254037
52593 254037 255800 258212 260916 263260 264657 264917 264457 263946 263594 263064 262248 261674 261864 262732 263840 264862
52577 264862 265522 265637 265557 266011 267009 267417 266256 264009 262020 260913 260310 259790 259321 258834 258153 257451 257173 257399
52559 257399 257747 257947 258014 257828 257116 256039 255351 255639 256648 257535 257627 256894 255881 255239 255136 255145 254917 254859 255758
52540 255758 257692 259710 260772 260701 260044 259299 258619 258109 257957 258141 258256 257868 257004 256132 255653 255555 255559 255448 255160
52521 255160 254797 254656 255087 256020 256836 257013 256815 257023 258065 259790 261979 264538 267109 269099 270396 271600
52505 271600 273215 274951 276186 276791 277078 277104 276513 275054 272907 270413 267708 264799 261923 259697 258687
52490 258687 258735 258932 258491 257511 256592 255916 255195 254411 253953 253958 254175 254667 255958 258094 260155 261294 261886 263042
52472 263042 265186 267675 269802 271636 273731 276246 278590 279980 280295 280210 280423 281022 281895 283365 285790 288697
52456 288697 291050 292347 292701 291851 289151 284844 280357 276710 273500 270115 267064 265220 264369 263546 262399
52441 262399 261274 260261 259090 257824 256792 255935 254980 254179 254114 254832 255851 256913 257995 258719 258617 258064
52425 258064 258107 259149 260525 261545 262272 262999 263614 263909 264053 264373 264993 265908 267139 268674 270553 273159 277048
52408 277048 282318 288426 294759 301137 307673 314388 321064 327326 332928 338112 343402 348665 352586 353638
52394 353638 351491 346989 340931 333639 325700 318204 311835 306339 301335 297116 294225 292665 292101 292528 294092
52379 294092 296294 297994 298469 298268 298721 300597 303431 306274 308899 311875 315521 319378 323035 326908 331570
52364 331570 336622 340939 343914 345781 346851 347219 347286 347747 348705 349487 349696 349852 350613 351914 353344 354927
52348 354927 356888 358992 360747 362172 363923 366590 370244 374644 379558 384791 390095 395264 400363 405870
52334 405870 412474 420576 430072 440822 453131 467397 483247 499524 515337 530809 546659 563393
52322 563393 581139 599902 619659 640339 661918 684302 706973 729049 750015 770216 790323
52311 790323 810481 830270 849343 867775 885776 903407 920631 937424 953680 969049 982987
52300 982987 995054 1005239 1013926 1021448 1027665 1032156 1034730 1035612 1035112 1033283 1029925 1024765 1017716 1009208
52286 1009208 1000235 991765 984062 976790 969780 963303 957614 952695 948681 946108 945456 946722 949713 954442
52272 954442 960976 969135 978713 989834 1002706 1017130 1032533 1048468 1064825 1081566 1098478 1115169
52260 1115169 1131194 1146307 1160721 1174935 1189051 1202389 1214076 1224032 1232991 1241518 1249279 1255492
52248 1255492 1259870 1262825 1264675 1264900 1262465 1256979 1249330 1240883 1232121 1222375 1211006 1198514 1186156
52235 1186156 1174624 1163476 1151880 1139647 1127407 1116001 1105852 1096784 1088311 1080148 1072574 1066234
52223 1066234 1061394 1057489 1053630 1049673 1046536 1045224 1045680 1046852 1047850 1048748 1050242 1052809 1056347 1060412 1064628
52208 1064628 1069048 1074224 1080762 1088666 1097271 1105859 1114062 1121581 1127960 1133025 1137277 1141397 1145457 1149034
52194 1149034 1152012 1154874 1158192 1162134 1166460 1170653 1174076 1176361 1177714 1178630 1179279 1179436 1178854 1177354 1174637
52179 1174637 1170479 1165205 1159488 1153555 1146962 1139328 1130869 1122037 1113081 1104322 1096489 1090257 1085582 1081943
52165 1081943 1079195 1077781 1077961 1079192 1080561 1081733 1083196 1085540 1088722 1092207 1095658 1099155 1102707 1105895
52151 1105895 1108179 1109361 1109601 1109243 1108821 1108891 1109507 1110095 1110244 1110465 1111669 1114001 1116632 1118742 1120294 1121776
52135 1121776 1123694 1126405 1130111 1134794 1140392 1147124 1155445 1165684 1178018 1192684 1209816 1229102 1250092
52122 1250092 1272939 1298313 1326350 1356135 1386524 1417062 1447764 1478353 1508174 1536726 1563899
52111 1563899 1589699 1613981 1636383 1656328 1673177 1686630 1697001 1704936 1710832 1714626 1716185 1715833
52099 1715833 1714381 1712491 1710082 1706572 1701747 1696039 1689776 1682574 1673910 1664012 1653589 1642794 1631050
52086 1631050 1617910 1603577 1588503 1573172 1558436 1545468 1534939 1526556 1519766 1514640 1511816 1511837 1514813
52073 1514813 1520530 1528618 1538676 1550370 1563308 1576895 1590671 1604896 1620434 1637763 1656252 1674619
52061 1674619 1691946 1708093 1723289 1737489 1750199 1760943 1769820 1777287 1783231 1786662 1786784 1784063 1779613
52048 1779613 1773704 1765611 1754902 1742103 1727879 1712235 1694817 1675472 1654221 1631218 1607074 1582777
52036 1582777 1558965 1535650 1512888 1491254 1471358 1453218 1436369 1420383 1405174 1391151 1379037
52025 1379037 1369027 1360152 1351193 1342267 1334595 1328471 1322462 1315203 1307033 1299068 1291385 1283109 1273828 1263944
52011 1263944 1253830 1243502 1233033 1222548 1211741 1199914 1186438 1170883 1152932 1132723 1111093
52000 1111093 1088972 1066627 1043894 1020862 997848 974937 952088 929552 907737 886787 866734
51989 866734 847868 830516 814662 800203 787299 775947 765476 755029 744357 733621 722633
51978 722633 710958 698608 686020 673433 660868 648591 636939 625780 614850 604563 595876 589325
51966 589325 584819 582305 581847 582946 584596 586400 589011 593093 598347 603883 609065 613611 617281 619956
51952 619956 621800 622938 623089 621844 619246 615820 612083 608227 604368 600953 598768 598397 599693 601970 604885
51937 604885 609000 615300 624145 634762 645654 655380 663139 668856 672763 674901 675026 672912 668403 661243
51923 661243 651310 639136 625740 611711 596878 581053 564643 548230 532082 516533 502349 490201
51911 490201 480144 471983 465688 460996 457188 453931 451882 451729 453098 455160 457894 461819 466803 472108
51897 472108 477458 483087 488814 494066 498789 503359 507427 509803 509663 507142 502640 496436 489192 481967
51883 481967 475411 469650 465187 463193 464577 469402 477345 487908 499972 512087 523710 535489 548017
51870 548017 561080 574366 587807 600491 610175 614926 614775 611018 604441 595075 583282 570014 556093
51857 556093 542031 528588 516754 507061 499387 493490 489359 486957 485997 486035 486565 487041 486988 486072 484023
51842 484023 480721 476506 472105 467997 464059 460065 456187 452711 449564 446534 443742 441436 439469 437439
51828 437439 435379 433908 433657 434768 436943 439653 442174 443710 443778 442593 440946 439514 438214 436419 433939
51813 433939 431513 430051 429665 429985 431119 433524 436849 439778 441457 442401 443504 444729 445377 445220 444625 443754
51797 443754 442316 440163 437647 435271 433259 431446 429421 426815 423721 420645 417864 414995 411537 407699
51783 407699 404329 402023 400648 399717 398978 398489 398278 398092 397614 396932 396628 397167 398319 399561 400996 403357
51767 403357 406984 411344 415937 421164 427777 435725 444050 451785 458509 464147 468746 472494 475546 477619
51753 477619 477959 475820 470993 463960 455697 447226 439115 431357 423821 416840 411272 407979 407231 408544 411107
51738 411107 414430 418548 423542 429112 434949 441403 449335 459240 470757 482907 494381 503694 509783
51725 509783 512775 513793 513919 513796 514218 516176 519714 523290 524951 523904 520615 515833 510123 504104 498529
51710 498529 494006 490836 488912 487583 485943 483556 480657 477515 474124 470788 468367 467456 467815 469100 471480
51695 471480 474761 477529 478227 476871 474797 472921 471226 469798 469248 469837 471026 472081 472333 470757 466304
51680 466304 459199 451171 443860 437612 432277 428481 427329 429185 433409 439110 445575 452167 458453 464606
51666 464606 471298 479013 487580 496374 504835 512791 520316 527134 532175 533942 531566 525382 516469 505923
51652 505923 494742 484063 475007 468171 463465 460501 459083 459302 461186 464063 466251 465701 461349 453922
51638 453922 445235 436666 428386 419928 411206 402832 395584 389731 384855 380331 375978 372266 369782 368513
51624 368513 367856 367400 367487 368644 370629 372496 373665 374446 375208 375589 375075 374010 373339 373414 373783 374164 374790 375591
51606 375591 375871 375343 374825 375224 376347 377465 378710 381082 385125 390378 396152 402159 408228 414024 419417
51591 419417 424717 430306 436224 442193 447675 451882 454181 454701 454208 453228 451693 449704 448259 448758 451918
51576 451918 457555 465324 475327 487880 503022 520542 540416 562895 587899 614402 640829 666309
51564 666309 691459 717733 746011 775851 805894 834771 861911 887872 913930 941028 968962
51553 968962 996644 1022964 1047098 1068040 1084166 1093384 1093608 1083404 1062742 1033249 997361 956976
51541 956976 913067 866549 819046 772548 728535 687799 650939 618590 591042 567833 548021
51530 548021 530883 516224 503921 493462 484218 476038 469123 463255 457724 452232 447326 443486 440243
51517 440243 436795 433072 429515 426070 422284 418309 414939 412493 410499 408681 407418 406815 406089 404470 402179
51502 402179 399925 397938 396096 394557 393507 392566 391180 389513 388330 388075 388629 389885 391827 393993 395578
51487 395578 396297 396594 396761 396489 395606 394644 394135 393773 392890 391480 390071 388759 387120 385173 383653 383002 382656
51470 382656 381828 380674 380084 380419 380961 380731 379510 377973 376988 376848 377001 376523 374988 372832 370753 368854
51454 368854 366697 364084 361387 359119 357640 357420 359042 362610 367517 373228 380050 388672 399065 410256
51440 410256 421220 431720 442287 453584 465724 477911 488672 496631 501179 502414 500759 496937
51428 496937 492176 487930 485001 482844 479781 474091 465307 454673 444181 435018 427091 420062 414267 410229
51414 410229 407668 405622 403477 401428 400037 399812 401139 404014 407724 411228 413952 415941 417309 418050 418419
51399 418419 418910 419720 420690 421885 423698 426195 428966 431900 435563 440469 446555 453890 463342 475876 491511
51384 491511 509717 530661 555285 584142 616902 653240 693554 738313 786934 837753 889115
51373 889115 940298 991331 1041857 1090030 1132589 1166214 1188886 1199944 1199195 1186607 1162968 1130163
51361 1130163 1090262 1044558 993922 939872 884625 829968 776598 724794 675470 630248 590601
51350 590601 557064 529060 505312 484629 466620 451608 439731 430335 422422 415412 409113 403220
51338 403220 397409 391832 386937 382714 378694 374810 371720 369893 368906 367973 366824 365656 364618 363812 363467
51323 363467 363585 363616 363019 362006 361197 360640 359777 358415 357135 356524 356461 356444 356269 356117 356141 356258 356261 355985 355415 354706
51303 354706 354095 353769 353762 353895 353816 353238 352215 351046 349841 348449 346899 345577 344675 343744 342174 339960 337744
51286 337744 336334 336434 338430 341893 345534 348267 350278 352609 355830 359729 364189 369583 376005 382669
51272 382669 388413 392555 395156 396791 398214 399875 401614 402957 403678 403788 403165 401732 399944 398458 397213
51257 397213 395355 392353 388714 385384 382818 380839 378952 376603 373495 369913 366479 363474 360737 358186
51243 358186 355936 353808 351388 348875 347252 347178 348164 349194 349766 349993 350140 350544 351542 352987 354121 354451
51227 354451 354449 354869 355611 355864 355272 354397 353980 354167 354571 354862 355222 356270 358415 361198 363606 365261 366976
51210 366976 369779 373572 377153 379485 380591 381310 382511 384501 386908 389084 390731 392039 393182 393961 394185
51195 394185 394121 394208 394514 394836 395202 395825 396589 396908 396245 394602 392435 390249 388311 386706 385626 385488 386547
51178 386547 388426 390314 391717 392695 393385 393711 393759 393922 394299 394330 393488 392048 390756 389962 389516 389262 389141 388935
51160 388935 388461 387974 387937 388359 388759 388808 388623 388408 388171 387884 387558 387013 385874 383962 381562 379215 377393 376393
51142 376393 376336 377064 378082 378754 378706 378154 377754 378004 378755 379484 379968 380394 380829 381063 381124 381484 382364 383217 383376
51123 383376 383027 383090 384249 386463 389321 392475 395737 399069 402531 406089 409539 412791 416065 419506 422755
51108 422755 425204 426611 427266 427634 428040 428520 428747 428290 427201 426150 425700 425682 425640 425614 426029 426996 428200 429421
51090 429421 430683 431940 433085 434320 436050 438383 441017 443656 446149 448275 449832 451008 452230 453562
51076 453562 454607 455126 455361 455563 455579 455182 454658 454798 456330 459374 463369 467523 471472 475510 480133 485494
51060 485494 491439 497869 504841 512503 521265 531722 543807 556055 566282 573250 577491 580593 584193
51047 584193 589681 598041 609240 621861 633823 643785 651906 659325 666801 673697 678231 678915 675809 670383
51033 670383 664320 658582 653228 647467 639784 628658 613709 596160 578045 560985 545674 532181
51021 532181 520494 510786 503321 498130 494892 493233 493023 494212 496499 499543 503430 508551 514939 522072
51007 522072 529508 537384 545988 555046 563766 571597 578731 585776 593096 600572 607962 615395 623386 632420
50993 632420 642573 653564 665080 677074 689835 703751 718896 734870 751286 768293 786255
50982 786255 804840 822945 839806 855864 872239 889631 908002 926959 945965 964433 982132
50971 982132 999523 1017425 1036532 1057572 1081681 1110092 1143453 1181785 1224976 1272990 1325731
50960 1325731 1383051 1444690 1509808 1576854 1644445 1712199 1780104 1847121 1911068 1969977 2023062
50949 2023062 2070340 2111849 2147388 2176613 2199335 2216092 2228306 2237305 2243227 2245477 2244330 2241392
50937 2241392 2238176 2234688 2229648 2221676 2210089 2195069 2177324 2157342 2134820 2109113 2080142 2048277
50925 2048277 2013316 1974233 1930286 1881875 1830107 1775959 1720082 1662860 1604352 1544678 1484707
50914 1484707 1425870 1369041 1314206 1261595 1212444 1168031 1128392 1092619 1060114 1030941 1005154
50903 1005154 982353 961872 943096 925775 910296 897291 886606 876985 867212 857287 848030 839941
50891 839941 833045 827552 823757 821326 819442 817861 817229 818074 820044 822477 825256 828657 832642 836862 841331
50876 841331 846617 853155 860644 868466 876613 885895 897114 910202 924372 939033 954384 971198 990231
50863 990231 1011841 1035996 1062610 1091926 1124476 1160600 1200294 1243815 1292202 1346715 1407908
50852 1407908 1475738 1550584 1633555 1725681 1827258 1938121 2058010 2186411 2322496 2465512
50842 2465512 2614784 2769068 2926288 3084243 3241116 3394918 3542838 3681714 3808942
50833 3808942 3922552 4020654 4101376 4163386 4206247 4230501 4237799 4230757 4212210 4184517 4149844
50822 4149844 4110933 4071115 4033458 4000046 3971976 3949554 3932181 3918129 3904700 3888835 3867784
50811 3867784 3839195 3800676 3749693 3684413 3604636 3511424 3405758 3288150 3159735 3023128
50801 3023128 2881732 2738620 2596473 2458079 2326088 2202326 2087887 1983844 1891351 1810937
50791 1810937 1742082 1683634 1634467 1593812 1561216 1536275 1518297 1506239 1499023 1495699 1495200 1496161
50779 1496161 1497203 1497288 1495694 1491969 1486186 1478912 1470526 1460694 1448819 1434863 1419356 1402694 1384776
50766 1384776 1365281 1344047 1321204 1297109 1272106 1246271 1219596 1192580 1166302 1141608 1118538
50755 1118538 1096877 1077037 1059928 1046034 1035019 1026224 1019333 1014595 1012706 1014404 1019985 1029227 1041801
50742 1041801 1057541 1076286 1097913 1122763 1151580 1184725 1221898 1263044 1309014 1360688 1417844
50731 1417844 1479603 1545695 1616556 1692426 1773097 1858321 1947445 2038632 2129361 2217984 2304013
50720 2304013 2386678 2464096 2534274 2596179 2649245 2692472 2724684 2745278 2754054 2750680 2735128 2708653
50708 2708653 2673878 2633920 2591829 2550647 2513194 2481347 2455746 2436338 2422883 2414690 2410141 2406972
50696 2406972 2403159 2397285 2387988 2373352 2351174 2319847 2278810 2228228 2168643 2101201 2028041 1952082
50684 1952082 1876245 1802805 1733354 1669219 1611801 1562460 1522053 1490803 1468780 1456283 1453404
50673 1453404 1459332 1472603 1492150 1517649 1548694 1584176 1622690 1663104 1704335 1745024 1783876
50662 1783876 1820033 1852899 1882041 1907607 1930257 1950121 1966399 1978762 1988665 1998309 2008507 2018532
50650 2018532 2027952 2037546 2048178 2059743 2071763 2084456 2098798 2115931 2136803 2161965 2191409 2224793
50638 2224793 2261882 2302384 2345425 2389875 2435404 2482593 2531546 2580771 2627824 2670775 2708725
50627 2708725 2741182 2767382 2786412 2798068 2803616 2805132 2803177 2794914 2775249 2740545 2691469 2632672
50615 2632672 2570454 2510645 2457408 2412795 2377203 2350432 2332151 2321457 2316648 2315767 2316972 2318148
50603 2318148 2316845 2311068 2299671 2281555 2255122 2219200 2174077 2120926 2060620 1993951 1922703 1849441
50591 1849441 1776055 1703268 1631753 1563013 1498703 1439577 1385525 1336373 1292323 1253686 1220501
50580 1220501 1192404 1168808 1149148 1132927 1119550 1108404 1099327 1092772 1089107 1087884 1088169 1089504 1092115
50567 1092115 1096149 1101229 1106946 1113430 1121201 1130731 1142311 1156165 1172440 1191288 1213104 1238487
50555 1238487 1267762 1300627 1336403 1374508 1414655 1456730 1500624 1545990 1592065 1637906 1682942
50544 1682942 1727019 1769804 1810551 1848855 1885467 1921942 1959669 1999701 2043379 2092337 2147583
50533 2147583 2209028 2276323 2349852 2430517 2518781 2614332 2716583 2825171 2940029 3061235
50523 3061235 3188656 3321346 3457296 3594027 3729311 3860985 3986356 4102471 4207103
50514 4207103 4298814 4375830 4435424 4474874 4492743 4489003 4464363 4420004 4357617 4279086 4186236
50503 4186236 4081442 3968388 3851701 3735723 3623989 3519889 3427130 3349076 3287745 3243681
50493 3243681 3216603 3205852 3210090 3226733 3252024 3281844 3312494 3340489 3361711 3371268 3364573 3338477
50481 3338477 3291329 3222519 3132645 3024172 2901434 2769707 2634057 2498560 2365938 2237750
50471 2237750 2115132 1999379 1891729 1792815 1702663 1621037 1547435 1480949 1420686 1366354 1318055
50460 1318055 1275493 1237848 1204448 1175109 1149737 1128030 1109751 1094896 1083386 1074792 1068478 1063818
50448 1063818 1060324 1057882 1056810 1057342 1059113 1061611 1065048 1070121 1076797 1083968 1090650 1096944 1103484 1110490
50434 1110490 1117893 1125977 1135270 1145948 1157852 1171080 1186106 1203266 1222377 1242966 1264732 1287817
50422 1287817 1312697 1339795 1369171 1400700 1434500 1470933 1510147 1551980 1596461 1644146 1695732
50411 1695732 1751568 1811672 1875980 1944334 2016320 2091243 2168093 2245546 2322265 2397271 2469609
50400 2469609 2537549 2598596 2650617 2692649 2724336 2744986 2753718 2750222 2734835 2707840 2669209 2619159
50388 2619159 2558770 2489964 2415102 2336639 2257026 2178758 2104360 2036188 1976221 1926067 1886877
50377 1886877 1858878 1841054 1831814 1830070 1835192 1845820 1859322 1872805 1884156 1891738 1893563 1887452
50365 1887452 1871830 1845978 1809850 1764249 1711027 1652491 1590570 1526835 1462968 1400616 1340832
50354 1340832 1284244 1231624 1183595 1139777 1099009 1060741 1025580 994200 966290 941044 918205
50343 918205 897973 880187 864341 850426 839076 830585 824201 818767 813808 809628 806548 804569 803787
50330 803787 804481 806391 808393 809501 810024 811122 813220 815521 817287 818909 821313 824833 829206 834306 840263
50315 840263 847030 854393 862310 870741 879256 887529 896225 906715 919583 933973 948738 963670 979079
50302 979079 994607 1009373 1023271 1037282 1052110 1066973 1080186 1090600 1097918 1101905 1102229 1099413
50290 1099413 1095324 1092098 1090723 1091033 1092828 1096383 1101911 1109160 1117771 1127613 1138482 1149762 1160849
50277 1160849 1171956 1184245 1198776 1214801 1228841 1235964 1232775 1219591 1199637 1176370 1151956 1127901
50265 1127901 1105842 1086988 1071277 1057745 1045578 1034508 1024475 1015362 1007023 999345 992497 987138
50253 987138 983986 982960 983162 983971 985639 988410 991668 994614 997390 1000729 1004740 1008808 1012629 1016570 1020859
50238 1020859 1025075 1028691 1031606 1033960 1035824 1037305 1038630 1039896 1040966 1041716 1042154 1042257 1041972 1041513 1041432 1042351
50222 1042351 1044763 1049113 1055767 1064823 1076185 1089875 1106118 1125091 1146843 1171507 1199302 1230246
50210 1230246 1264037 1300296 1338686 1378573 1418608 1456821 1491351 1521363 1547356 1570408 1591078
50199 1591078 1609187 1624562 1637315 1646922 1651424 1648281 1635972 1614408 1584078 1545587 1500100 1449554
50187 1449554 1396045 1341339 1287089 1234992 1186391 1142006 1102281 1067660 1038201 1013191 991502
50176 991502 972187 954424 937000 918277 896952 872928 847445 822347 799128 778552 760937
50165 760937 746373 734472 724298 715040 706763 700128 695444 692452 691069 691772 694866 699699 705000 709980
50151 709980 714882 720558 727660 736139 745314 754311 762476 769352 774417 777102 777236 775367 772546 769794
50137 769794 767678 766251 765273 764550 764119 764203 765129 767323 771182 776706 783370 790508 797771 805080 812355 819621
50121 819621 827213 835512 844440 853561 862717 872195 882223 892687 903539 915195 928299 943256 960195
50108 960195 979210 1000454 1024040 1050059 1078712 1110376 1145607 1185083 1229378 1278661 1332664
50097 1332664 1391122 1454269 1522769 1596902 1675734 1757247 1839576 1922013 2004508 2086254 2165339
50086 2165339 2240091 2310321 2376812 2439863 2498801 2552635 2600413 2640728 2671252 2689027 2691181
50075 2691181 2675650 2641825 2590831 2525039 2447176 2359895 2265970 2168454 2070400 1974397 1882201
50064 1882201 1794586 1711656 1633586 1561060 1494861 1435265 1382091 1335094 1293879 1257616 1225321
50053 1225321 1196429 1170699 1147708 1126931 1108336 1092384 1079424 1069475 1062526 1058422 1056391 1055294
50041 1055294 1054571 1054538 1055634 1057821 1060842 1064486 1068421 1072284 1076169 1080508 1085243 1089616 1093034 1095567 1097317
50026 1097317 1097938 1097219 1095540 1093184 1089709 1084612 1078213 1071198 1063602 1054962 1045259 1034980 1024405 1013554
50012 1013554 1002771 992481 982183 970501 956693 941665 927095 913947 902266 892040 883651
50001 883651 877431 873224 870672 869794 871132 875266 882219 891456 902510 915532 930981 948732 967629
49988 967629 986132 1003404 1019659 1035567 1051593 1068065 1085701 1105561 1128232 1153234 1179503
49977 1179503 1206420 1234244 1263681 1295372 1329708 1366670 1405507 1444791 1483098 1519625 1554070
49966 1554070 1586106 1615250 1641209 1664090 1684149 1701421 1715646 1726375 1732835 1733573 1726402 1709097
49954 1709097 1680431 1640684 1591393 1534901 1474176 1412484 1352681 1296705 1245815 1201025 1162855
49943 1162855 1130782 1103383 1079221 1057346 1037053 1017638 998668 980197 962432 945222 928041
49932 928041 910342 891806 872279 851639 829827 807059 783930 761177 739320 718775 700211
49921 700211 684384 671364 660347 650618 642409 636361 632466 630112 628943 628972 629932 631257 632833 635159
49907 635159 638579 642907 648034 654326 662153 671445 681944 693421 705413 717212 728512 739718 751362
49894 751362 763485 775712 787406 797483 804553 807780 807393 804139 798537 790921 781818 771834 761304
49881 761304 750229 738279 724860 709685 693522 677804 663174 648991 634720 621129 609386
49870 609386 599505 590588 582360 575511 570481 566789 563833 561718 560927 561651 563837 567573 573006 579880 587503
49855 587503 595358 603691 613290 624538 636833 649208 661447 674127 687501 700828 712997 723396
49843 723396 731811 737924 741413 742375 741243 738422 734236 728976 722630 714850 705568 695402 685123 675017
49829 675017 665229 656386 649184 643521 638731 634718 632209 631797 633263 636045 639919 644956 651194 658588
49815 658588 667132 676838 687730 699870 713103 726716 739636 751205 761586 771265 780226 787743
49803 787743 792993 795865 797175 797941 798403 797807 795215 790334 783546 775431 766493 757046 747040 736171
49789 736171 724401 712184 699960 687743 675588 664181 654390 646310 639307 632995 627613 623335 619751
49776 619751 616405 613498 611673 611159 611426 611778 612228 613659 617005 622297 628696 635444 642449 649840 657362
49761 657362 664604 671525 678276 684632 690031 694200 697284 699339 700014 698871 695828 691266 685806 679827
49747 679827 672980 664404 653730 641793 630045 619483 610476 603286 598130 594735 592465 590992 590420
49734 590420 590676 591315 592096 593214 594714 596141 597148 598134 599879 602676 606112 609602 612972 616646 621415
49719 621415 627887 635943 644792 653660 662409 671487 681442 692486 704128 715010 723336 727907 728876 727363
49705 727363 724362 720157 714717 708303 701370 694034 686053 677508 669156 661797 655453 649585 643968 638828
49691 638828 634090 629171 623868 618905 615110 612458 610546 609653 610673 614073 619583 626896 635976 646447
49677 646447 657327 667867 678364 689787 702705 716868 731644 746578 761331 775226 787062
49666 787062 795654 800720 803130 804117 804339 803764 802239 799894 797124 794569 793039 792974 793729 793490 790044 781714
49650 781714 767906 749330 727910 706163 686138 668635 653306 639507 627106 616559 608234 601832
49638 601832 596666 592404 589239 587346 586505 586383 586757 587289 587442 586865 585536 583343 579976 575510 570610 565723
49622 565723 560528 554737 549007 544327 540790 537718 534874 532731 531487 530583 529475 528324 527634 527524 527596
49607 527596 527322 526546 525814 526111 527925 530603 532909 534130 534391 534164 534019 534584 536091 537958 539425 540574
49591 540574 542094 544059 545746 546772 547648 548857 550095 550929 551675 553012 554972 556850 558046 558689 559469
49576 559469 561092 563852 567658 572370 577978 584301 590806 597127 603618 610958 619221 627877 636652 645766
49562 645766 655145 663978 671349 676908 680662 682581 682757 681631 679619 676703 672617 667378 661454 655569
49548 655569 650412 646372 643416 641361 640258 640364 641732 644096 647148 650684 654483 658270 661842 665041
49534 665041 667736 670098 672778 676479 681429 687589 695194 704635 715903 728600 742375 756895 771589
49521 771589 786018 800451 815414 830614 844882 857293 867783 876651 884078 890319 895829 900973
49509 900973 905970 911091 916463 921769 926663 931301 935685 938565 937927 932767 923628 911272 895828 877614
49495 877614 857863 838084 819272 802087 787051 774069 762407 751661 742229 734540 728449 723722
49483 723722 720365 718037 715920 713740 712141 711439 710826 709526 708025 707255 707192 707217 707409 708412 710243 712213
49467 712213 714013 716112 719061 723039 728045 733865 739787 744900 748830 751886 754488 756680 758144 758464
49453 758464 757505 755654 753391 750534 746332 740515 733724 726651 719365 711904 704831 698589 692837 687199
49439 687199 682247 678974 677556 677316 677703 678710 680527 683427 687818 693843 701045 708911 717665 728158
49425 728158 741133 756837 774978 794680 814907 835219 855609 875514 894016 911556 929968
49414 929968 949336 965633 973356 970553 960126 946504 932639 920264 911123 906691 907401 912825 922179
49401 922179 934312 947885 962030 976501 991059 1005261 1018911 1032035 1044244 1054851 1063789 1071666
49389 1071666 1078577 1083588 1085845 1085582 1083538 1079944 1074611 1067608 1059245 1049645 1038897 1027584 1016787
49376 1016787 1007423 999644 992799 986090 979446 973711 969717 967281 965578 964359 964184 965292 966834 967605
49362 967605 967103 965582 963352 960441 956724 952063 946407 939925 933006 926001 919041 912209 905781 900211
49348 900211 895882 892855 890845 889547 888991 889339 890368 891531 892705 894378 896659 898602 899132 898374 897374
49333 897374 896609 895443 893035 889205 884360 879166 874419 870726 868115 866272 865219 865329 866652 868667 870796
49318 870796 872869 875018 877431 880251 883449 886829 890365 894316 898655 902677 905631 907558 908994 910099
49304 910099 910751 911250 912138 913307 914091 914351 914844 916344 918972 922459 926460 930550 934518 938857 944367 951198
49288 951198 958755 966495 974207 981543 988144 994419 1001434 1009714 1018773 1027975 1037132 1046106 1054592 1062684
49274 1062684 1070951 1079568 1088029 1096071 1104219 1112971 1122074 1130993 1139426 1146887 1152484 1155828 1157808 1159902
49260 1159902 1162991 1167130 1171867 1176282 1179277 1180511 1180830 1181469 1183322 1187367 1195021 1207055 1222426 1239026
49246 1239026 1255533 1271781 1287228 1299763 1306490 1305568 1297203 1283030 1264803 1243817 1221495 1199832
49234 1199832 1180539 1163751 1148325 1133559 1120067 1108899 1100582 1095292 1093086 1093362 1094779 1096428 1098717
49221 1098717 1102582 1108277 1115491 1124050 1133739 1143787 1153336 1162271 1171075 1180080 1189436 1199416 1210003
49208 1210003 1220292 1229046 1235878 1241432 1246555 1251858 1257917 1265146 1273416 1282330 1292012 1303116 1315958
49195 1315958 1329981 1344107 1357364 1369258 1379954 1390067 1400000 1409526 1418273 1426439 1434633 1443273
49183 1443273 1452506 1462586 1473791 1486152 1499764 1515348 1534052 1556697 1583574 1614734 1649873
49172 1649873 1687989 1727765 1768415 1809804 1851867 1894487 1937778 1981457 2023442 2059575 2085384
49161 2085384 2098250 2098218 2087564 2070009 2049738 2030234 2013611 2000916 1992716 1989164 1989742 1993375 1998924
49148 1998924 2005601 2013045 2021173 2029912 2038997 2048038 2056817 2065437 2074245 2083659 2094063 2105689 2118588
49135 2118588 2132743 2148101 2164423 2181280 2198426 2216081 2234586 2253867 2273474 2293088 2312642
49124 2312642 2331979 2350742 2368755 2386301 2403907 2422039 2441016 2461010 2482032 2504143 2527897
49113 2527897 2554537 2585628 2622390 2665241 2713847 2767681 2826633 2891158 2962113 3040921 3129801
49102 3129801 3230366 3340083 3449763 3546570 3622269 3679830 3730956 3784976 3838327 3874507 3875497
49091 3875497 3835254 3763823 3679130 3594359 3511709 3426080 3333156 3234110 3134461 3040214 2955282
49080 2955282 2881361 2818945 2767973 2727752 2696682 2672460 2652816 2636219 2621971 2609745 2599158
49069 2599158 2589709 2580909 2572321 2563641 2554822 2546029 2537293 2528365 2519122 2509959 2501434 2493567 2485940 2478546
49055 2478546 2472028 2466803 2462402 2458074 2453713 2449715 2446215 2443132 2440755 2439535 2439167 2438541 2436926 2434864
49041 2434864 2433607 2434072 2436557 2441114 2447732 2456287 2466609 2478592 2492073 2506697 2522063 2537953 2554297
49028 2554297 2570880 2587020 2601497 2612976 2620707 2624789 2625669 2623682 2619353 2613769 2608065 2602686 2597711
49015 2597711 2593760 2591812 2592009 2593375 2595026 2597089 2600154 2604417 2609750 2616112 2623405 2631229 2639148 2646958
49001 2646958 2654447 2661225 2667033 2671860 2675542 2677732 2678494 2678328 2677230 2674365 2669316 2663094 2657098 2651412
48987 2651412 2644968 2637226 2628857 2620690 2612804 2604983 2597528 2591109 2586026 2581899 2578134 2574483 2571131 2568275
48973 2568275 2565795 2563482 2561451 2559948 2558761 2557230 2554994 2552443 2550363 2549437 2550118 2552456 2555928 2559958
48959 2559958 2564777 2571198 2579365 2588490 2598209 2609359 2622721 2637745 2653408 2669832 2688089 2708662
48947 2708662 2731085 2754977 2780548 2808034 2837379 2868504 2901247 2935031 2969294 3004299 3040885
48936 3040885 3079410 3119720 3162172 3207756 3256812 3308304 3360964 3414712 3470475 3528904 3589738
48925 3589738 3652238 3715838 3780416 3846260 3913816 3983247 4054091 4125321 4195821 4264975 4332849
48914 4332849 4399692 4465122 4527967 4587011 4641806 4692752 4740599 4786006 4829229 4870000 4907917
48903 4907917 4943089 4976069 5006968 5035114 5059908 5081619 5100876 5117789 5132101 5143850 5153218
48892 5153218 5159944 5163489 5163706 5160798 5154772 5145500 5133237 5118509 5101511 5082011 5059795 5034754 5006707
48879 5006707 4975588 4941650 4904998 4865175 4821799 4775360 4726709 4675934 4622471 4566127 4507120
48868 4507120 4445238 4380108 4312540 4244654 4178140 4113107 4049060 3986351 3926093 3869151 3815827
48857 3815827 3766161 3719998 3676931 3636679 3599535 3566200 3537116 3512024 3490015 3470095 3451952
48846 3451952 3436214 3423694 3414409 3407669 3403140 3401397 3403292 3409050 3418079 3429396 3442230 3456515 3472866
48833 3472866 3491836 3513199 3536126 3559881 3584013 3608126 3632031 3656057 3680730 3706130 3731958
48822 3731958 3758111 3784693 3811633 3838868 3866723 3895404 3924275 3952442 3980027 4007911 4036136
48811 4036136 4063630 4089850 4115701 4142274 4169500 4196749 4223986 4251583 4279524 4307631 4336215
48800 4336215 4365667 4395624 4425261 4454357 4483501 4513188 4543189 4572795 4601305 4628265 4653499
48789 4653499 4676889 4697902 4715508 4728932 4738448 4745097 4749530 4751291 4749206 4742253 4729933 4711990
48777 4711990 4688102 4658100 4622400 4581906 4537286 4488656 4436256 4381058 4324192 4265947 4205957
48766 4205957 4144359 4082105 4020012 3958060 3895907 3833605 3771586 3710378 3650648 3593204 3538682
48755 3538682 3487405 3439636 3395651 3355455 3318777 3285445 3255459 3228663 3204863 3184298 3167434
48744 3167434 3154035 3143030 3133689 3126451 3122201 3121058 3122287 3125101 3129154 3134432 3140985 3148616 3156658
48731 3156658 3164265 3171083 3177390 3183438 3189018 3193840 3197932 3201353 3203869 3205273 3205784 3205799 3205428 3204600 3203467
48716 3203467 3202411 3201702 3201329 3201050 3200543 3199672 3198695 3198101 3198171 3198880 3200184 3202125 3204663 3207659 3211021 3214600
48700 3214600 3218061 3221201 3224290 3227671 3231142 3234312 3237497 3241552 3246775 3252603 3258542 3264629 3270783 3276441
48686 3276441 3281240 3285421 3289100 3291677 3292378 3291007 3287830 3283206 3277681 3271947 3266252 3260164 3253125 3244812
48672 3244812 3234800 3222475 3207612 3190463 3170992 3148762 3124000 3098011 3071933 3045691 3018722
48661 3018722 2991068 2962951 2933937 2903517 2872273 2841547 2812004 2783096 2753713 2722721 2689151
48650 2689151 2652699 2614158 2574898 2536044 2498536 2463569 2432077 2403779 2377479 2352460 2328956
48639 2328956 2307126 2286124 2264547 2241590 2217598 2193650 2170635 2148617 2127008 2105342 2083709
48628 2083709 2062464 2041863 2022070 2003031 1984112 1964319 1943324 1921931 1901225 1881660 1863395
48617 1863395 1846954 1832877 1820984 1810673 1801745 1794345 1788315 1783333 1779582 1777572 1777241 1777905 1779169
48604 1779169 1781211 1783903 1786279 1787335 1786988 1785853 1784328 1782412 1780318 1778751 1778211 1778200 1777484 1775195 1771343
48589 1771343 1766139 1759193 1749886 1738282 1725165 1711196 1696516 1681228 1665716 1650332 1635259 1620808
48577 1620808 1607447 1595408 1584740 1575843 1569348 1565184 1562321 1559804 1557751 1557093 1558692 1562789 1568791
48564 1568791 1575417 1581567 1587249 1593206 1599635 1605892 1611419 1615982 1618778 1618406 1614279 1607208 1598118 1587153
48550 1587153 1574668 1562002 1550317 1539499 1529126 1519688 1511715 1504358 1496021 1486013 1474496 1461310
48538 1461310 1446143 1429708 1413559 1398693 1385294 1373729 1364742 1358528 1354501 1352156 1351503 1352605 1355407
48525 1355407 1360023 1366489 1374146 1381903 1389286 1396780 1405091 1414298 1423371 1429935 1430976 1424738 1412136 1395919
48511 1395919 1378685 1362215 1348169 1338162 1332894 1331907 1334486 1340341 1349389 1361315 1375437 1390666
48499 1390666 1405723 1419739 1432594 1444438 1455223 1464784 1472602 1476971 1475226 1465876 1450180 1430896
48487 1430896 1409958 1388170 1366360 1345401 1325218 1305061 1284850 1265299 1246765 1229020 1212195
48476 1212195 1196941 1183489 1171457 1160721 1151598 1144049 1137563 1132016 1127877 1125337 1123950 1123297 1123398
48463 1123398 1124357 1126240 1129296 1133713 1139119 1144918 1151124 1158240 1166465 1175640 1185731 1196573 1207220
48450 1207220 1216354 1223299 1228008 1230341 1230278 1228649 1226617 1224491 1221896 1219000 1216530 1214708 1213145 1211668
48436 1211668 1210118 1207455 1202418 1195370 1188255 1182408 1177440 1172570 1167867 1163655 1159723 1155818 1152153 1148884
48422 1148884 1145649 1142044 1138052 1133722 1128957 1123754 1118150 1111886 1104824 1097614 1091238 1085862 1080900 1076086
48408 1076086 1071544 1066897 1061393 1055110 1049019 1043628 1038462 1033103 1027779 1022707 1017705 1012711 1007863 1002864
48394 1002864 997060 990298 982975 975268 967128 958969 951387 944263 937099 930090 923828 918148 912573 907706
48380 907706 904629 902862 900549 897019 893612 891552 890433 889345 888087 886699 885063 883626 883304 884127 885057
48365 885057 885507 885851 886152 885802 884899 884542 885097 885506 884896 883605 882092 880211 878127 876497 875079 872589
48349 872589 868627 864374 860698 857091 853197 849835 847535 845484 842978 840661 839400 839094 839343 840019 840521
48334 840521 839962 838795 838712 840187 841773 842605 843699 845761 847751 848965 850584 853633 857210 860381 864097
48319 864097 869383 875239 880223 884745 889822 894822 898409 900790 903143 905734 908219 910921 914204 917630
48305 917630 921195 926324 934052 943268 952328 961372 971614 983544 997279 1013338 1031305 1048883 1063941
48292 1063941 1076513 1087562 1097326 1106404 1116787 1129998 1145667 1163528 1184963 1210697 1238891 1267709
48280 1267709 1298130 1332110 1369761 1410449 1454844 1503678 1556409 1613243 1676450 1747737 1826895
48269 1826895 1915324 2018062 2140078 2284195 2455701 2665161 2923209 3236913 3615520 4075188
48259 4075188 4632954 5300552 6088842 7010116 8064405 9224332 10440225 11659467 12843783
48250 12843783 13988782 15141527 16369632 17656558 18807200 19495496 19455677 18648968 17256397
48241 17256397 15537528 13709208 11919073 10264516 8800250 7541044 6479016 5600798
48233 5600798 4887808 4312642 3846575 3468217 3160965 2907781 2694099 2511937 2356433
48224 2356433 2221351 2101344 1994913 1901287 1817102 1739237 1667934 1603922 1545040 1488723 1435423
48213 1435423 1386645 1341740 1299323 1259870 1224226 1191319 1159882 1130808 1105416 1082884 1061663
48202 1061663 1042006 1024825 1009333 994077 979232 965785 953424 941251 929770 920152 912053 903794
48190 903794 894103 882256 867381 849352 829883 811204 794003 777831 762928 750199 739787 730916
48178 730916 722945 715643 708839 702691 697831 694395 691448 688159 684880 682199 679646 676429 672863 670056
48164 670056 668585 668337 669030 669968 669910 668287 666205 665286 665831 666926 667871 668584 669018 669113 669149 669368 669522 669425 669509
48145 669509 670171 671039 671615 672126 672989 673991 674933 676542 679677 683980 688222 691766 694767 697316 699442 701771
48129 701771 705078 709157 713018 716247 719418 723164 727601 732654 738220 743992 749728 755632 761899 768113
48115 768113 773876 779832 787162 796029 805388 814423 823362 832702 842446 852447 862857 873903 885691
48102 885691 898460 912544 927882 943976 960477 977386 994604 1011763 1028694 1045560 1062353
48091 1062353 1078801 1094962 1111379 1128303 1145180 1161320 1176768 1192088 1207468 1222426 1236298
48080 1236298 1248737 1259724 1269384 1277991 1286121 1294570 1303745 1313097 1321479 1328388 1334584 1341222 1348623
48067 1348623 1356329 1364020 1371706 1379136 1385810 1391791 1397825 1404363 1411024 1417268 1422974 1427805 1430543 1429778
48053 1429778 1425225 1417851 1408864 1399073 1389059 1379144 1368831 1356794 1341975 1324651 1306073 1287143
48041 1287143 1267753 1247523 1226798 1206500 1186970 1167320 1146233 1123339 1099561 1076143 1053628
48030 1053628 1031930 1011100 991586 973720 957201 941293 925405 909380 893388 877790 863072
48019 863072 849625 837398 825954 814977 804606 795072 786258 777914 770211 763600 758019 752723 747162
48006 747162 741645 736767 732520 728566 725178 723159 722642 722611 722003 720937 720394 720964 722347 723927 725311 726284
47990 726284 726805 727187 727877 728778 729188 728717 727952 727776 728128 728018 726750 724653 722484 720594 718930 717502 716403
47973 716403 715565 714870 714365 713984 713146 711065 707642 703758 700497 698246 696599 695000 693337 692026 691541 691753
47957 691753 691818 691040 689843 689503 690729 692945 695261 697720 701027 705300 709865 714327 719147 724824 731117
47942 731117 737541 744230 751665 759849 768377 777224 786729 796698 806202 814562 821999 828966 835388 841001
47928 841001 845930 850249 853238 853882 852104 848870 845071 840854 836133 831010 825358 818625 810546 801704
47914 801704 792918 784343 775659 767010 759169 752708 747288 741959 736017 729570 723354 718058 713896 710804
47900 710804 708862 708197 708640 709873 711980 715332 719801 724589 729141 733758 738915 744484 750178 756411 764039
47885 764039 773250 783233 792959 801905 810058 817637 824940 832164 839307 846337 853282 859956 865883 870791
47871 870791 874885 878193 879937 879112 875601 870142 863325 855223 846014 836265 826412 816457 806320 796077
47857 796077 785733 775302 765186 755981 747729 739952 732602 726313 721343 716898 712097 707176 703112
47844 703112 700354 698573 697535 697481 698501 700142 701981 704274 707631 712072 716726 720657 723824 726976 730617
47829 730617 734417 737874 741197 745022 749314 753117 755607 756999 758219 759985 762526 765911 770213 775289
47815 775289 780688 786012 791467 797993 806650 817752 830707 844848 860233 877417 896650 917618
47803 917618 939730 962208 984096 1004784 1024491 1043603 1061444 1076391 1087424 1094955 1099799 1101942
47791 1101942 1100795 1096185 1088483 1078076 1065310 1050877 1035807 1020999 1006960 993831 981481 969743
47779 969743 958798 949214 941358 934981 929530 924715 920580 917263 914852 913256 912034 910635 908917 907079
47765 907079 904946 901878 897777 893586 890243 887571 884824 882035 879987 878983 878390 877579 876715 876421 877041
47750 877041 878508 880614 883261 886613 891052 896800 903582 910860 918362 926195 934477 943085 951751 960263
47736 960263 968732 977777 988182 1000057 1012590 1024941 1037104 1049443 1061645 1072800 1082462 1091040
47724 1091040 1099013 1106185 1111843 1115242 1115889 1113709 1109091 1102528 1094211 1084247 1073093 1061248 1048547
47711 1048547 1034339 1018464 1001640 984786 968380 952534 937177 922074 907204 893305 881474
47700 881474 872037 864373 858040 853376 850610 849089 848069 847793 849046 851950 855942 860786 866908 874700
47686 874700 884096 894928 907106 920369 934272 948578 963237 977904 991953 1005224 1018301 1031693
47674 1031693 1045009 1057345 1068289 1078063 1086659 1093293 1096966 1097464 1095564 1092314 1088192 1082912 1075856
47661 1075856 1066660 1055487 1042915 1029513 1015452 1000564 984840 968778 953161 938565 925215
47650 925215 913186 902472 892857 884044 876028 869203 863985 860483 858561 858008 858530 859835 861895 864964
47636 864964 869174 874331 880304 887426 896204 906741 918747 932045 946785 963140 981156 1001028
47624 1001028 1023253 1048211 1075637 1104730 1134823 1165777 1197515 1229214 1259261 1286188 1309503
47613 1309503 1329312 1345234 1356109 1360876 1359359 1351924 1338711 1319599 1294770 1264964 1231157 1194284
47601 1194284 1155189 1114618 1073223 1031806 991471 953197 917258 883321 851143 820862 792636
47590 792636 766442 742459 721277 703271 687948 674305 661873 650988 641914 634053 626463 618978
47578 618978 612347 607123 602835 598676 594691 591646 589759 588216 586211 583860 581645 579463 576926 574296
47564 574296 572390 571515 571200 571011 571000 571155 571074 570520 569832 569427 569354 569681 570801 572782 574866 576300 577473 579500
47546 579500 582682 586056 588630 590490 592394 594740 597360 600032 602684 605158 607153 608583 609786 611186
47532 611186 612791 614185 615011 615302 615293 615094 614739 614402 614216 613929 613082 611587 609785 607818 605402 602419 599375
47515 599375 596931 595214 593861 592418 590433 587638 584519 582266 581464 581099 579611 576805 573920 571902 570487
47500 570487 569222 568408 568438 568842 568655 567477 565754 564227 563460 563565 564053 564194 563847 563684 564367 565766 567259
47483 567259 568407 569026 569042 568802 569186 570836 573396 576028 578456 581010 583813 586547 589033 591448 593864
47468 593864 596039 597819 599416 601150 603188 605591 608239 610641 612102 612218 611072 608957 606195 603223
47454 603223 600537 598514 597450 597772 599887 603744 608812 614506 620486 626669 633282 640886 649991 660623
47440 660623 672547 685900 701209 718789 738457 759878 782788 806838 831650 857099 883096
47429 883096 908990 933633 956242 976752 995156 1011022 1023942 1033997 1041292 1045392 1045660 1041936
47417 1041936 1034499 1023667 1009904 994180 977668 961049 944415 927812 911565 896064 881514
47406 881514 867908 855034 842604 830597 819435 809611 801212 794037 788040 783384 780118 778075 777004
47393 777004 776457 775702 774280 772808 772785 775235 779722 784939 790102 795525 801923 809475 817661 825811 833541
47378 833541 840666 846968 852377 857294 862299 867331 871373 873315 872998 871076 867971 863401 856999 848924
47364 848924 839569 828991 817028 803913 790388 777150 764317 751446 737950 723567 708759 694676
47352 694676 682422 672101 662736 653331 643880 635103 627350 620237 613358 606867 601073 595845 590894 586456
47338 586456 583157 581148 579788 578402 577054 576361 576744 578070 579904 581929 584156 586842 590173 593983 597868
47323 597868 601597 605205 608673 611729 614193 616281 618273 619948 620697 620276 619217 618290 617719 617059 615783
47308 615783 613815 611485 609173 607144 605634 604864 604900 605659 607176 609693 613179 616836 619549 621149 622999
47293 622999 626847 633000 640028 646484 652583 659729 668560 678154 687370 696330 705959 716431 726913 736833
47279 736833 746556 756441 765949 774241 781293 787817 794327 800824 807210 813382 818890 823079 825701 827043
47265 827043 827407 826824 825295 822978 820013 816475 812521 808280 803575 798061 791746 785057 778373 771776 765316
47250 765316 759219 753762 749153 745504 742618 739901 736914 733983 731892 730975 730919 731360 732170 733207 734471
47235 734471 736576 740359 745803 752010 758508 765925 774974 785408 796520 808169 820769 834622 849716
47222 849716 865850 882526 899014 914912 930320 945241 959246 972046 983672 993503 999655 1000163
47210 1000163 994626 984241 970622 955178 939137 923320 907947 893184 879583 867385 855889
47199 855889 844390 833498 824561 817909 812631 808170 805167 804466 806031 809120 812965 817166 822068 828862
47185 828862 838617 850987 864533 878460 893276 909516 926716 944199 962152 981266 1001714 1023076
47173 1023076 1044908 1066786 1088107 1108314 1127192 1144562 1159914 1172701 1182821 1190472 1195742 1198673
47161 1198673 1199507 1198489 1195573 1190590 1183624 1175049 1165402 1155364 1145540 1135908 1125761 1114573 1102753
47148 1102753 1091222 1080530 1070747 1061981 1054444 1048084 1042696 1038447 1035871 1035194 1036051 1037998 1040991 1045122
47134 1045122 1050184 1055800 1061866 1068538 1075682 1082561 1088290 1092559 1095688 1097908 1098737 1097302 1093238 1087031
47120 1087031 1079481 1071045 1061800 1051782 1041093 1029730 1017550 1004487 990747 976777 963062 949965
47108 949965 937716 926489 916363 907117 898211 889128 879729 870173 860579 850984 841546 832576 824346
47095 824346 817095 811177 806907 804141 802289 800884 799963 799774 800367 801648 803672 806562 810150 813935 817513
47080 817513 821011 825014 829973 835685 841422 846589 851083 854952 858020 860150 861650 862943 863872 863854 862836
47065 862836 861601 860881 860535 859989 859162 858505 858302 858443 858973 860431 863352 867565 872251 876741 881138 886079
47049 886079 891942 898446 905090 911844 919198 927544 936664 945844 954437 962338 970096 978547 988116 998396
47035 998396 1008477 1017720 1026187 1034397 1042809 1051502 1060198 1068581 1076636 1084578 1092304 1099106 1104260 1107895
47021 1107895 1110936 1114069 1116988 1118741 1118633 1116690 1113397 1109192 1104208 1098476 1092249 1085926 1079554 1072714
47007 1072714 1065171 1057477 1050605 1045067 1040740 1037427 1035142 1033792 1032991 1032401 1032050 1032258 1033397 1035675 1038919
46992 1038919 1042611 1046418 1050584 1055503 1061124 1067256 1074262 1082745 1092539 1102782 1113209 1124630 1137624
46979 1137624 1151406 1164637 1177052 1189695 1203677 1219162 1235475 1251744 1267382 1282207 1296204
46968 1296204 1309162 1320708 1330721 1339440 1347041 1353419 1358559 1362780 1366357 1369169 1370977 1371805 1371792 1370994
46954 1370994 1369716 1368748 1368839 1370014 1371790 1373983 1376926 1380963 1386065 1391954 1398355 1405086 1412196 1419965 1428595
46939 1428595 1437843 1447139 1456153 1465114 1474554 1484777 1495590 1506481 1517061 1527311 1537329 1546913
46927 1546913 1555543 1562714 1568158 1571765 1573512 1573342 1570886 1565412 1556500 1544822 1531803 1518385 1504432
46914 1504432 1489407 1473220 1456346 1439537 1423609 1409004 1395377 1382130 1369624 1359279 1352097
46903 1352097 1347618 1344921 1344208 1346706 1353236 1363441 1376352 1391157 1407479 1425405 1445303 1467258
46891 1467258 1490694 1514840 1539444 1564687 1590493 1616313 1641591 1666020 1689272 1710758 1729833
46880 1729833 1746171 1759953 1771737 1782031 1790917 1798257 1804312 1809796 1815076 1819669 1822936 1825124 1827439
46867 1827439 1831246 1837374 1845936 1856331 1867550 1878896 1890533 1903214 1917561 1933664 1951093 1969031
46855 1969031 1986632 2003416 2019171 2033418 2045426 2054989 2062703 2069043 2073612 2075755 2075528 2073559 2070274
46842 2070274 2065811 2060379 2054095 2046735 2038285 2029544 2021523 2014427 2007896 2002132 1998007 1996061 1996120 1998041
46828 1998041 2002124 2008555 2016951 2026811 2038084 2051080 2065977 2082462 2099604 2116195 2131457 2145333
46816 2145333 2157835 2168444 2176570 2182312 2186161 2188125 2187813 2185228 2180794 2174650 2166600 2156801 2145794
46803 2145794 2133859 2121047 2107873 2095210 2083331 2071769 2060304 2049326 2038974 2028700 2018166
46792 2018166 2007940 1998827 1990985 1984143 1978261 1973577 1970324 1968618 1968257 1968440 1968209 1967454 1966964 1967287 1968104
46777 1968104 1969060 1970442 1972482 1974602 1976049 1976874 1977658 1978627 1979742 1981434 1984527 1989449 1996051 2004087 2013442
46762 2013442 2023957 2035505 2048189 2062038 2076584 2091191 2105776 2120837 2136769 2153497 2170702
46751 2170702 2187975 2204805 2220860 2236388 2251962 2267662 2282768 2296373 2308068 2317922 2326109 2332776
46739 2332776 2338106 2342226 2345029 2346363 2346567 2346720 2348001 2350632 2353643 2356030 2358049 2360989 2365619 2371257
46725 2371257 2376599 2381149 2385551 2390722 2396900 2403443 2409314 2413799 2416899 2418996 2420186 2420100 2418386 2414970
46711 2414970 2409646 2401747 2390629 2376378 2359753 2341388 2321299 2299209 2275178 2249839 2223922 2197597
46699 2197597 2170385 2141847 2112227 2082216 2052289 2022644 1993675 1965989 1939844 1915055 1891567
46688 1891567 1869573 1848835 1828493 1808062 1788235 1770159 1754175 1739748 1726369 1713907 1702209
46677 1702209 1690998 1680305 1670528 1661946 1654529 1648310 1643490 1640007 1637419 1635564 1635073 1636859 1641139 1647224
46663 1647224 1654310 1662251 1671475 1682272 1694357 1707117 1720145 1733384 1746805 1760069 1772565 1783733
46651 1783733 1793399 1801759 1809000 1814884 1818887 1820924 1821787 1822638 1824158 1826379 1829220 1832819 1837363 1843008
46637 1843008 1850119 1859303 1871080 1885660 1903029 1922923 1944652 1967308 1990316 2013585 2037030 2060215
46625 2060215 2082546 2103452 2122182 2137791 2149552 2157226 2160810 2160289 2155764 2147530 2135838 2120877
46613 2120877 2103061 2082985 2060940 2036946 2011484 1985672 1960297 1935107 1909610 1884180 1859804
46602 1859804 1836906 1815146 1794329 1774911 1757499 1742282 1729052 1717313 1706231 1694889 1682983
46591 1682983 1671105 1660106 1650191 1640757 1631041 1620808 1610370 1600128 1590245 1580760 1571723 1562958 1553960
46578 1553960 1544430 1534892 1526310 1519064 1512756 1507152 1502693 1499744 1497872 1496374 1495165 1494568 1494514 1494577 1494679
46563 1494679 1495198 1496327 1497836 1499584 1501844 1504860 1508331 1511606 1514313 1516772 1519706 1523555 1528117 1532987
46549 1532987 1538265 1544508 1551989 1560427 1569611 1579790 1591075 1602880 1614473 1625861 1637742 1650750
46537 1650750 1665099 1680708 1697239 1714249 1731817 1750887 1772528 1796934 1823536 1851788 1881309
46526 1881309 1911452 1941578 1971839 2003023 2035335 2067802 2099154 2128933 2157461 2185055 2211498
46515 2211498 2236127 2258273 2277727 2294861 2310163 2323668 2334960 2343600 2349420 2352615 2353859 2354024
46503 2354024 2353310 2350864 2345841 2338752 2331145 2323928 2316688 2308753 2300187 2291376 2282202 2272163 2260965 2248615
46489 2248615 2235133 2220481 2204542 2186908 2166938 2144380 2119752 2093818 2066756 2038135 2007658
46478 2007658 1975766 1943495 1911782 1880799 1849937 1818522 1786581 1754852 1724203 1695352 1668994
46467 1668994 1645653 1625281 1607378 1591758 1578942 1569684 1564395 1563082 1565434 1570736 1578110 1587168 1598140
$$ [...]
##END NTUPLES=NMR SPECTRUM
##END=
