
##TITLE=AC1407_PERAH12216_7653017_7f91amZpev
##JCAMPDX= 6.0         $$ Bruker NMR JCAMP-DX V2.0
##DATA TYPE= nD NMR SPECTRUM
##DATA CLASS= NTUPLES
##NUM DIM= 2
##ORIGIN= BRUKER
##OWNER= Administrator
$$ 1.72 TOPSPIN		Version 2.1
$$ 2013-03-19 22:31:27.112 -0500  Administrator@X
$$ Compression mode = diff/dup
##.OBSERVE FREQUENCY= 400.02188249412
##.OBSERVE NUCLEUS= ^1H
##.ACQUISITION MODE= SIMULTANEOUS (DQD)
##.ACQUISITION SCHEME= NOT PHASE SENSITIVE
##.AVERAGES= 4
##.DIGITISER RES= 22
##SPECTROMETER/DATA SYSTEM= spect
##.PULSE SEQUENCE= jresgppsqf.2
##.SOLVENT NAME= COFFEE_meoh
##.SHIFT REFERENCE= INTERNAL, COFFEE_meoh, 1, 14.9608
##AUDIT TRAIL= $$ (NUMBER, WHEN, WHO, WHERE, PROCESS, VERSION, WHAT)
$$ ##TITLE= Audit trail, TOPSPIN		Version 2.1
$$ ##JCAMPDX= 5.01
$$ ##ORIGIN= Bruker BioSpin GmbH
$$ ##OWNER= Administrator
$$ $$ E:\/data/COFFEE/nmr/AC1407_PERAH12216_7653017_7f91amZpev/13/pdata/1/auditp.txt
$$ ##AUDIT TRAIL=  $$ (NUMBER, WHEN, WHO, WHERE, PROCESS, VERSION, WHAT)
(   1,<2013-03-19 22:31:17.425 -0500>,<Administrator>,<X>,<go>,<TOPSPIN 2.1>,
      <created by zg
	started at 2013-03-19 22:16:54.300 -0500,
	POWCHK enabled, PULCHK disabled,
       configuration hash MD5:
       86 BA 57 50 F2 9D 5C 9B 26 00 A9 28 5F 66 2E 89
       data hash MD5: 8K * 40
       EE C8 52 C5 FA 07 D5 68 E6 10 05 10 DF FC 46 31>)
(   2,<2013-03-19 22:31:21.956 -0500>,<Administrator>,<X>,<proc2d>,<TOPSPIN 2.1>,
      <Start of raw data processing
       xfb same F2: SI = 16K WDW = 3 SSB = 0 FT_mod = 6 PKNL = 1 F1: SI = 512 WDW = 3 SSB = 0 FT_mod = 6 PH_mod = 2
       data hash MD5: 16K * 512
       C6 E2 1B 9D 6E 76 06 85 27 E4 B3 CD AC E7 B0 7B>)
(   3,<2013-03-19 22:31:22.956 -0500>,<Administrator>,<X>,<proc2d>,<TOPSPIN 2.1>,
      <abs2 F2: ABSG = 5 ABSF1 = 10.00069 ABSF2 = 0.0001553106
       data hash MD5: 16K * 512
       96 83 BB A7 6A 54 DD CB 9B E2 36 C7 3F C1 F0 DF>)
(   4,<2013-03-19 22:31:23.659 -0500>,<Administrator>,<X>,<proc2d>,<TOPSPIN 2.1>,
      <tilt
       data hash MD5: 16K * 512
       DB 84 CB 4B EE C7 DB 3D 93 A0 2E 4F DB 58 64 6F>)
(   5,<2013-03-19 22:31:25.128 -0500>,<Administrator>,<X>,<proc2d>,<TOPSPIN 2.1>,
      <abs1 F1: ABSG = 5 ABSF1 = 0.06497851 ABSF2 = -0.06497862
       data hash MD5: 16K * 512
       E5 EC 92 77 65 A9 FA FE 5E 44 EB 79 67 F0 50 85>)
(   6,<2013-03-19 22:31:26.706 -0500>,<Administrator>,<X>,<proc2d>,<TOPSPIN 2.1>,
      <symj
       data hash MD5: 16K * 512
       B5 77 01 2E FF 09 3D 7D 41 77 B6 59 94 27 C8 84>)
$$ ##END=
$$ 
$$ $$ hash MD5
$$ $$ F3 EA 12 9B 75 DA 3E 21 C4 E8 0E D3 FF EB 1E B8
##$RELAX= 
##$RELAX= 
##$RELAX= 
##$RELAX= 
##$RELAX= 
##$RELAX= 
##$RELAX= 
$$ Bruker specific parameters
$$ --------------------------
##$DU= <E:\>
##$EXPNO= 13
##$NAME= <AC1407_PERAH12216_7653017_7f91amZpev>
##$PROCNO= 1
##$TYPE= <nmr>
##$USER= <COFFEE>
##$ACQT0= 1000000
##$AMP= (0..31)
100 100 100 100 100 100 100 100 100 100 100 100 100 100 100 100 100 100
$$ [...]
##$TD0= 1
##$TE= 300
##$TE2= 300
##$TE3= 300
##$TEG= 300
##$TL= (0..7)
0 120 120 120 120 120 120 120
##$TP= (0..7)
150 150 150 150 150 150 150 150
##$TP07= 0
##$TPNAME0= <>
##$TPNAME1= <>
##$TPNAME2= <>
##$TPNAME3= <>
##$TPNAME4= <>
##$TPNAME5= <>
##$TPNAME6= <>
##$TPNAME7= <>
##$TPOAL= (0..7)
0.5 0.5 0.5 0.5 0.5 0.5 0.5 0.5
##$TPOFFS= (0..7)
0 0 0 0 0 0 0 0
##$TUNHIN= 0
##$TUNHOUT= 0
##$TUNXOUT= 0
##$USERA1= <user>
##$USERA2= <user>
##$USERA3= <user>
##$USERA4= <user>
##$USERA5= <user>
##$V9= 5
##$VALIST= <valist>
##$VCLIST= <CCCCCCCCCCCCCCC>
##$VD= 0
##$VDLIST= <DDDDDDDDDDDDDDD>
##$VPLIST= <PPPPPPPPPPPPPPP>
##$VTLIST= <TTTTTTTTTTTTTTT>
##$WBST= 2048
##$WBSW= 25
##$XGAIN= (0..3)
0 0 0 0
##$XL= 0
##$YL= 0
##$YMAX_a= 66358
##$YMIN_a= -124356
##$ZGOPTNS= <>
##$ZL1= 120
##$ZL2= 120
##$ZL3= 120
##$ZL4= 120
##$ABSF1= 0.06497851
##$ABSF2= -0.06497862
##$ABSG= 5
##$ABSL= 0
##$ALPHA= 0
##$AQORDER= 0
##$ASSFAC= 0
##$ASSFACI= 0
##$ASSFACX= 0
##$ASSWID= 0
##$AUNMP= <>
##$AXLEFT= 0
##$AXNAME= <F1>
##$AXNUC= <1H>
##$AXRIGHT= 0
##$AXTYPE= 0
##$AXUNIT= <>
##$AZFE= 0.1
##$AZFW= 0.5
##$BCFW= 0
##$BC_mod= 0
##$BYTORDP= 0
##$COROFFS= 0
##$CY= 15
##$DATMOD= 1
##$DC= 0
##$DFILT= <>
##$DTYPP= 0
##$F1P= 0
##$F2P= 0
##$FCOR= 0.5
##$FTSIZE= 512
##$FT_mod= 6
##$GAMMA= 0
##$GB= 0
##$INTBC= 1
##$INTSCL= 1
##$ISEN= 128
##$LB= 0
##$LEV0= 0
##$LPBIN= 0
##$MAXI= 10000
##$MC2= 0
##$MEAN= 0
##$ME_mod= 0
##$MI= 1
##$NCOEF= 0
##$NC_proc= -5
##$NLEV= 6
##$NOISF1= 0
##$NOISF2= 0
##$NSP= 0
##$NTH_PI= 0
##$NZP= 0
##$OFFSET= 0.06497851
##$PC= 4
##$PHC0= 0
##$PHC1= 0
##$PH_mod= 2
##$PKNL= no
##$PPARMOD= 1
##$PPDIAG= 0
##$PPIPTYP= 0
##$PPMPNUM= 2147483647
##$PPRESOL= 1
##$PSCAL= 1
##$PSIGN= 0
##$PYNMP= <proc.py>
##$REVERSE= no
##$SF= 400.021882494141
##$SI= 512
##$SIGF1= 0.06497851
##$SIGF2= -0.06497862
##$SINO= 16
##$SIOLD= 512
##$SPECTYP= <>
##$SREGLST= <1H.MeOD>
##$SSB= 0
##$STSI= 512
##$STSR= 0
##$SW_p= 51.9856959427865
##$SYMM= 3
##$S_DEV= 2651
##$TDeff= 40
##$TDoff= 0
##$TI= <>
##$TILT= yes
##$TM1= 0
##$TM2= 0
##$TOPLEV= 0
##$USERP1= <user>
##$USERP2= <user>
##$USERP3= <user>
##$USERP4= <user>
##$USERP5= <user>
##$WDW= 3
##$XDIM= 16
##$YMAX_p= 277272205
##$YMIN_p= 0
$$ End of Bruker specific parameters
$$ ---------------------------------
##NTUPLES= nD NMR SPECTRUM
##VAR_NAME=  FREQUENCY1,    FREQUENCY2,      SPECTRUM
##SYMBOL=    F1,            F2,              Y
##.NUCLEUS=  1H,            1H
##VAR_TYPE=  INDEPENDENT,   INDEPENDENT,     DEPENDENT
##VAR_FORM=  AFFN,          AFFN,            ASDF
##VAR_DIM=   512,           16384,           16384
##UNITS=     HZ,            HZ,              ARBITRARY UNITS
##FACTOR=    0.101534562388255, 0.501933850740131, 1
##FIRST=     25.9928259484165, 8223.18227667557, 2582
##LAST=      -25.8913354319817, 0,           1817
##MIN=       -25.8913354319817, 0,           0
##MAX=       25.9928259484165, 8223.18227667557, 277272205
##PAGE= F1=25.99282594842
##FIRST=     25.9928259484165, 8223.18227667557, 2582
##DATA TABLE= (F2++(Y..Y)), PROFILE
$$ [...]
##PAGE= F1=0.1015125394115
##FIRST=     25.9928259484165, 8223.18227667557, 1706
##DATA TABLE= (F2++(Y..Y)), PROFILE
15054A925o76o08a18p86n23j83lM99H5J454J205M33k71j009B23a525j309p66j79
$$ 1925 1249 641 -118 -904 -1427 -1610 -1613 -1114 85 1539 2744 3177 2906 1897 223 -1525 -2834 -3600 -3779
15035c779J91Q28O76K90q02j413K11J630A15J742J468L60o92A103g43p44N44A39
$$ -3779 -3588 -2760 -2084 -1794 -2596 -4009 -3798 -2168 115 1857 3325 3685 2993 1103 -743 -1487 -943 139
15016A064Q13P06K05k61q56D67d68o96o06R9N07L34k14r73j163m92K38L48K76
$$ 1064 1877 2583 2788 2527 1671 467 -468 -1164 -1770 -1671 -1164 -830 -1044 -2017 -3180 -3672 -3434 -3086 -2810
14997b810m92L8O27O09K36O9K38M12J81K74K74D08J118J569J875J054P12o27j730
$$ -2810 -3302 -3264 -2637 -2028 -1792 -1723 -1485 -1073 -892 -618 -344 408 1526 3095 4970 6024 6736 6109 4379
14978D379A859a059k238j46n0o05p80O92J562h79A310J466J551Q56M68r34j309
$$ 4379 1859 -1059 -3297 -3443 -3493 -4098 -4878 -4186 -2624 -879 1310 2776 4327 5183 5651 4717 3408
14961C408j464A79a579j631o39K60N01J043R62d04B61M55L27L31J01k83k22k51
$$ 3408 1944 179 -1579 -3210 -3849 -3589 -3088 -2045 -1083 -404 261 716 1043 1374 1475 1192 970 719
14943G19k13B49M52O10Q85R36M33k09r86I20d53j077l48K46e77H5A5b34j196j869
$$ 719 506 249 701 1311 2196 3132 3565 3356 2370 920 -453 -1530 -1878 -1632 -577 85 15 -234 -1430 -3299
14923c299j577J051J490J023J61j67L18K95b41D5i1r0E1K29K33J32J39l36e88
$$ -3299 -4876 -3825 -2335 -1312 -1151 -1318 -1000 -705 -241 45 -91 -181 51 280 513 645 784 448 -588
14903a746k09M93L15l76j209j795O53J554a67A654P86j63A053b42j005p27l96
$$ -1746 -1955 -1462 -1147 -1523 -2732 -4527 -3874 -2320 -167 1654 2440 2277 1053 -242 -1247 -1974 -2370
14886b370K08K82M99J99a91F78L35M49M72j64q28a109k148k316J922a495F51J785
$$ -2370 -2162 -1880 -1381 -1182 -191 678 1013 1462 1934 1770 942 -1109 -3257 -5573 -3651 -1495 651 2436
14868B436R42K6p93A115e49j203n64J67r3L85L20M21b90A00M15j32j19k7C0f64
$$ 2436 3378 3404 2611 1115 -549 -1752 -2316 -2149 -2242 -1857 -1537 -1116 -290 100 515 383 264 237 30 -664
14847a142K35b30B82K34k34b8k31M1E22L97K82J69j47j71D66a76q02o20l64J17
$$ -1142 -907 -230 282 516 282 -28 -259 -218 522 919 1201 1370 1223 1052 466 -176 -978 -1598 -1962 -1845
14827a845M53O94J84k86n66n85m50l66j66m61K94Q99e85A71J57f69j670p47d50
$$ -1845 -1392 -698 -514 -800 -1366 -1951 -2401 -2767 -2933 -3394 -3100 -2201 -585 171 328 -669 -2339 -3086 -450
14807A526J913J240P21j22j028k55O17K044K473K423J727j91j943l509C572a8
$$ 1526 3439 4679 5400 5278 4250 3995 4612 6656 9129 11552 13279 13088 11145 7636 3572 -18
14790a226D56J211p01b97j833j007k05O94O25k58l72o64j37J91N37J007d41H49
$$ -1226 456 1667 966 -297 -2130 -3137 -3342 -2648 -2023 -2281 -2653 -3317 -3454 -3263 -2726 -1719 -441 849
14771A384o28a379r26E13K426J378j77j463A16b777r88J456L62K6O80E17J775
$$ 1384 756 -1379 -2305 513 2939 4317 4140 2677 116 -2777 -3765 -2309 -1947 -1921 -1241 517 2292
14754B292J010p0j040I16e40l81p07o51r65j034j08K075C65K023P92l35j380c43
$$ 2292 3302 3232 2192 916 -540 -921 -1628 -2279 -3244 -4278 -4386 -2311 365 2388 3180 2845 1465 -343
14735b381j804b026d28F04P20K24j37o88cq09n15o04O7O79d46F74Q44j29n43a74
$$ -2381 -4185 -2026 -428 604 1324 1548 1411 723 -3 -812 -1327 -1931 -1864 -1185 -446 674 1518 1389 846 -174
14714a473q94m31J297B27P17A66a192j900j213J425e73A255J331k9q88G48a52
$$ -1473 -2367 -2798 -1501 227 944 166 -1192 -3092 -4305 -2880 -573 1255 2586 2557 1669 748 -152
14696e73j60b51A35M06K28l03b03q92n14M14k58q94m67k88M1Q75a058B62J531
$$ -573 -733 -251 135 541 769 466 -203 -1095 -1609 -1195 -1453 -2347 -2814 -3102 -3061 -2186 -1058 262 1793
14677A793J582J371J208M50r02j997E67b669k945b467f01C44J075R79O85o57A107
$$ 1793 3375 4746 5954 6404 5502 3505 567 -2669 -5614 -2467 -601 344 1419 2398 3083 2426 1107
14659a111k515j849K014i33H47N11n87C60b56n98j54n0r21n96j67q5P45b70A507
$$ -1111 -3626 -5475 -3461 -933 847 1358 771 360 -256 -854 -1008 -1058 -1979 -2575 -2742 -2827 -2082 -270 1507
14639B794L07l86j088n69k65j42A12a156j778o17K07a196A198K395K88k35q57
$$ 2794 3101 2715 1627 1058 793 651 112 -1156 -2934 -3551 -3344 -1196 1198 3593 3881 3646 2789
14622B789A200h52k017j846K03J632O32o05o97O02J222c94D82O25K83F79a100
$$ 2789 1200 -852 -2869 -4715 -4512 -2880 -2248 -2853 -3550 -2948 -1726 -394 482 1107 1390 679 -1100
14604a556N75K08l53r09L92c00B69g6j429o86P66A86J092k22a3j371j01e75G96
$$ -1556 -981 -773 -1126 -2035 -1643 -300 269 -76 -1505 -2191 -1425 186 1278 1056 -13 -1384 -1485 -575 796
14584A723M02K92L53J143J716J470R0j092l013f93k907a013A564O31r02e62j937
$$ 1723 2125 2417 2770 3913 5629 7099 7189 6097 3084 -693 -3600 -1013 1564 2195 1293 -562 -2499
14567b499j337K69L91L32J39o81k50a016B079J914J072k30j331j550C79a396j674
$$ -2499 -3836 -3567 -3176 -2844 -2705 -3386 -3636 -1016 2079 3993 5065 4835 3504 1954 379 -1396 -3070
14550c070j226J473a121G83J406K36q24A17a151l44M78M19a50o9k78j73J1c07
$$ -3070 -4296 -2823 -1121 783 2189 2425 1601 117 -1151 -1495 -1017 -598 -150 -219 -497 -670 -659 -307
14531c9l98o72j025q40k35K27L52J54K32N07g44E44Q72N88k15B89b186j416J607
$$ -39 -437 -1109 -2134 -2974 -3209 -2982 -2630 -2476 -2244 -1737 -744 544 1416 2004 1789 289 -2186 -3602 -1995
14512a995f88c22l56j307j600N54R94n03j139J306B04K793K544J382J34p91j541
$$ -1995 -688 -322 -678 -1985 -3585 -3031 -2037 -2540 -3679 -2373 204 2997 5541 6923 7057 6266 4725
14495D725j346j591A65g96o64k7K25M03c14E48J111J353J178O27m4o46j114j072
$$ 4725 3379 1788 165 -796 -1460 -1487 -1262 -859 -314 548 1659 3012 4190 4817 4773 4127 3013 1941
14477A941r35l13k09j36m2G3a22l11r5D7Q99J053R21L40j06l59r7N84M26k80j017
$$ 1941 1006 693 484 348 306 73 -122 -433 -528 47 946 1999 2920 3260 3154 2795 2698 3282 3708 3428 2411
14456B411G24a801j804j414Q3J235Q96J69mK81P8K67O20k28o73p13l04K95R15
$$ 2411 724 -1801 -3605 -5019 -4936 -3701 -2805 -2636 -2640 -2359 -2281 -2014 -1394 -1622 -2295 -3008 -3312 -3017 -2102
14437b102g92HQ08N24J95m63A1a752m65Q27A19J157M58J63j20F93h51k700l20
$$ -2102 -792 8 816 1340 1535 1072 11 -1752 -2217 -1390 119 1276 1734 1897 1777 693 -851 -3551 -3871
14418c871J931h26K98J62A52K066K217J112Qj245B124b66k329j387Q50R89L73
$$ -3871 -1940 -826 -528 -366 152 2218 4435 5547 5555 4310 2124 -266 -2595 -3982 -3132 -2143 -1770
14401a770L92d25E20M4g51k481r00J517B29J663O19j231F9a423j300n15J158b52
$$ -1770 -1378 -425 520 564 -751 -3232 -4132 -2615 229 1892 2511 1280 69 -1423 -2723 -3238 -2080 -252
14382I14L87o2A56a248p42q58o26l91k69j018K38J811f54G89J145L81r2o46D92
$$ 914 1301 1239 156 -1248 -1990 -2848 -3474 -3865 -4134 -5152 -4914 -3103 -654 789 1934 2315 2223 1577 492
14362f74r50r79j333k96J088a354C4P22O0B91e7E98J376J062L16j054A14b280
$$ -674 -1624 -2603 -3936 -4232 -3144 -1354 34 756 816 291 -57 598 1974 3036 3352 2298 114 -2280
14343c537J216i82a66D25P29J341J880K034J799J083k80j651k831A467f80l30
$$ -3537 -2321 -982 -166 425 1154 2495 4375 6409 8208 9291 9011 7360 4529 1467 -680 -1010
14327a010M61d1E3f77j457j737o87q41M5K121D8L225L100K134Q88n81j936l390
$$ -1010 -549 -41 53 -677 -2134 -3871 -4558 -5399 -5354 -3233 48 3273 6373 8507 9395 8814 6878 3488
14309C488E25a880n97L28a048E97J447J1o97C85j56M20O57K59n66a53j056n92
$$ 3488 525 -1880 -2477 -2149 -1048 597 2044 2055 1358 385 229 649 1306 1565 999 -153 -1209 -1801
14291a801O9g99A25P59O58P4k98l79C61d63p29p56p03l6j9N4K63M60R20G0Q97
$$ -1801 -1732 -799 125 884 1542 1616 1318 939 361 -463 -1192 -1948 -2651 -2687 -2706 -2652 -2389 -1929 -1009 70 967
14270I67K34j88k21a26p07n56m20j81M69O49J5j258j603Q02O72R65f25c7B90K95
$$ 967 1201 1013 792 -126 -833 -1389 -1809 -1990 -1521 -872 -857 -2115 -3718 -2916 -2244 -1279 -625 -37 290 585
14250E85L65K76Q9n1m76Ag61m85k96n45n97o57M76J345P25R8A88J849K522J771
$$ 585 950 1226 1315 1264 788 1 -761 -1246 -1542 -2087 -2684 -3341 -2865 -1520 -795 -697 188 2037 4559 6330
14230F330j3k314B02b862L48e11A061M52L4m51E3d94J18a36l59K46C45R31N20
$$ 6330 6317 4003 202 -2862 -2514 -511 1061 1513 1547 1096 53 -494 -376 -136 -495 -249 345 1276 1796
14211A796j99m59A98d31r43m46N1r3Q20B94J437J301K61q94E78a933j199J199
$$ 1796 1597 1138 198 -431 -1374 -1820 -1769 -1862 -1042 294 1731 3032 3293 2399 578 -1933 -3132 -1933
14193a933h67L86E74J048R37M69j96o68H32a064o54Q53F05J047P16P41J74k96
$$ -1933 -867 -481 574 1622 2559 3028 2832 2164 832 -1064 -1718 -865 605 1652 2368 3109 3283 2987
14175B987l10l09k41n9M61O74M7q51j022A33i78m40K43b47H65J089p5p56D23e86
$$ 2987 2677 2368 2127 2068 2529 3203 3250 2399 1377 133 -978 -1418 -1175 -247 865 1954 1879 1123 423 -586
14154f82G97J311R79K50m18j276B82a214r71M3J050G92J599J197M85l30j203A094
$$ -682 797 2108 3087 3337 2919 1643 282 -1214 -2185 -2142 -1092 792 2391 3588 4073 3743 2540 1094
14135a02m80B41J026J082P25M39N98P43O83J83q10j397A576d3n39D03O63l67h44
$$ -102 -582 241 1267 2349 3074 3513 4111 4854 5537 5720 4910 3513 1576 -43 -582 403 1066 699 -844
14115c353J258b62A343R14j50H02f05k157j129P40J164O66K87lJ55n2N1Ln50n09
$$ -3353 -2095 -262 1343 2257 2107 802 -605 -2762 -3891 -3151 -1987 -1321 -1034 -1037 -882 -934 -883 -880 -1430 -1939
14095a939n62o48J030c02A429R85L3j007a40j946l59O87f18B30B9a84n03n53k17
$$ -1939 -2501 -3149 -2119 -302 1429 2414 2447 1440 -140 -2086 -2445 -1758 -618 230 29 -184 -687 -1240 -1457
14076a457K98b06A133J366R20m2r80E39a769k130o61K71r6o26J574P17N34M64
$$ -1457 -1159 -206 1133 2499 3419 3377 2397 539 -1769 -3899 -4560 -4289 -4385 -5011 -3437 -2720 -2186 -1722
14058a722M70k62O1o80o05m50m30n56j059m43Q24P62O26j73n79K68N25N87O45
$$ -1722 -1252 -1514 -1453 -2133 -2738 -3188 -3618 -4174 -5233 -5676 -4852 -4090 -3464 -3637 -4216 -3948 -3423 -2836 -2191
14039b191a085a63D03M39j10C32m0O43Q81Q88P30N37k20j110F29a817k049j624
$$ -2191 -1085 -163 403 842 732 332 292 935 1816 2704 3434 3971 3751 2641 629 -1817 -3866 -5490
14021e490J612Q15j36p33L62a587c60k50q73j154j80J362b35D40N99n09a72q49
$$ -5490 -3878 -3063 -3199 -3932 -3570 -1587 -360 -610 -1483 -2637 -2817 -1455 -235 440 1039 530 -172 -1021
14003a021q61k84r6J26J95O70d68J72e6K0n78o62o0N49D0R83L68k91n37g7m15
$$ -1021 -1882 -2166 -2262 -2136 -1941 -1271 -468 -296 -56 -36 -614 -1276 -1336 -787 40 1023 1391 1100 563 -77 -492
13982d92a16B08O7J27M66R06R45O44l35j047C66a366j162n92k60J25J70J64j88
$$ -492 -116 208 275 402 868 1774 2719 3363 3028 1981 366 -1366 -2528 -3120 -3380 -3255 -3085 -2921 -3109
13963c109m05j34Q49O10a044B62J388J168K25o29C86b662j222J919P07o50j491
$$ -3109 -3514 -3648 -2799 -2189 -1044 262 1650 2818 3043 2414 386 -2662 -3884 -1965 -1258 -1908 -3399
13946c399L6J665g41C69N03l19cC93R33M72l26E86e16q93k79p3O91d51C8P25p6
$$ -3399 -3363 -1698 -741 369 872 553 -3 393 1326 1798 1472 586 -516 -1409 -1688 -1761 -1070 -451 38 763 687
13925F87c50j658j903j240J129Q57M81l61l81a700c16C68J74g0m95l32L8J56m18
$$ 687 -350 -2008 -3911 -5151 -4022 -3165 -2684 -3045 -3426 -1700 -316 368 542 -70 -565 -897 -859 -703 -1121
13906a121m94l22j07j04J87Q8p3k07m9k54n69k73O72a057D72Q99j31E34e82j232
$$ -1121 -1615 -1937 -2044 -2148 -1961 -1873 -1946 -2153 -2202 -2456 -3025 -3298 -2626 -1057 472 1371 1240 534 -582 -1814
13886a814p52K26Q70N54L4m13r95j323n3K63J068h25G33J250K80n89o53M63Q51
$$ -1814 -2566 -2340 -1470 -916 -882 -1295 -2290 -3613 -3666 -3403 -2335 -825 733 1983 2263 1674 1021 1484 2335
13867B335M38k07o78G80e59j241j667j916p6J881J463J020N08j46n15m76n39R85
$$ 2335 2773 2566 1888 780 -559 -1800 -3467 -5383 -5459 -3578 -2115 -1095 -587 -733 -1248 -1724 -2263 -1278
13849a278hI60L33l51c43k163o39a467b2H44K71j88C0h99j187j547j496J077J782
$$ -1278 -8 960 1293 942 -343 -2506 -3145 -1467 -22 844 1115 927 30 -899 -2086 -3633 -5129 -4052 -2270
13830b270g82B86M48k28b22j691r33n26O21J140e05C2d9a0k52p2e1E86P87N33
$$ -2270 -782 286 734 506 -222 -1913 -2846 -3372 -2751 -1611 -505 32 -49 -10 -262 -334 -51 586 1373 1906
13810A906L49M84Or31E5a563j544Q00i83G6L51e4j048j752j747J178a586b09P9
$$ 1906 2255 2739 2745 1814 55 -1563 -3107 -2307 -983 76 427 -54 -1102 -2854 -4601 -3423 -1586 -209 -130
13791a30q90j964j364J466a402C68J331J441M97m58H72a680J81A77K415J521L84
$$ -130 -1020 -2984 -4348 -2882 -1402 368 1699 3140 3637 3179 872 -1680 -1499 177 2592 4113 4497
13774D497o86j227o95q77a59j475p91a157B62J097P27L52j6o60n68k65o5L36L49
$$ 4497 3811 2584 1889 1012 -159 -1634 -2425 -1157 262 1359 2086 2438 2422 1762 1194 929 864 1200 1549
13755A549L41J52J15Q0Q67P63R89O36mj005j943F8a533e94A116Q86M23J65L62
$$ 1549 1890 2042 2157 2237 3104 3867 4856 5492 5488 4483 2540 68 -1533 -594 1116 2002 2425 2590 2952
13736B952L20n55I91a492j745a464B96P68j43b03j190r17l46k36P0R26f06F40
$$ 2952 3272 2717 991 -1492 -3237 -1464 296 1064 921 -203 -1393 -2310 -2656 -2892 -2822 -1896 -606 640
13717A299L5k16R4j04J059J408P84j15p68j306C73d69N9E67R91J034R98J109M12
$$ 1299 1334 1118 1212 1108 2167 3575 4359 4244 3476 2170 373 -469 -410 567 1558 2592 3590 4699 5111
13698E111m88j500j407q12k36L6o4dj263j135j41R83b10A76b93j227p45K98l08
$$ 5111 4623 3123 1716 904 668 704 640 -4 -1267 -2402 -2543 -1560 -210 176 -293 -1520 -2265 -1967 -2275
13679b275j012j923j773O48K088K073P23j44p51o78j89j49M61K02K85l67O9L73
$$ -2275 -3287 -5210 -6983 -6335 -4247 -2174 -1451 -1595 -2346 -3024 -3213 -3362 -2901 -2699 -2414 -2781 -2712 -2339
13661b339k11l02R1M69M16N79a80A336J529J313M32p35j520D80i48o40L79M91
$$ -2339 -2550 -2852 -2761 -2292 -1876 -1297 -180 1336 2865 4178 4610 3875 2355 480 -948 -1588 -1209 -718
13643g18a65k04k21n97o11n72q49K13a171A023J630K30j184c49j042G6K409K554
$$ -718 -165 -369 -590 -1187 -1798 -2370 -3219 -3006 -1171 1023 2653 2883 1699 -349 -1391 76 2485 5039
13625E039J843O4j673B264h34K66H79P52J18p83C11f19j096j083p33j31O88J464
$$ 5039 6882 6946 5273 2264 -834 -568 879 1631 1749 966 311 -619 -1715 -2798 -3531 -3662 -2974 -1510
13607a510c9E53B53c47p43o46J7N02J06Ln60m73k81p05j030J32J794e34H18O54
$$ -1510 -39 553 253 -347 -1090 -1736 -1719 -1217 -1111 -1108 -1668 -2141 -2422 -3127 -4157 -4025 -2231 -534 818 1472
13587A472m95g68k160n66J722F7J256J130O62l1l08k30n65p30D30h71r04J39O58
$$ 1472 977 -768 -2928 -3494 -1772 67 1323 2453 3115 3084 2776 2546 1981 1251 430 -871 -1775 -1636 -978
13568i78J92j04j030j081P25a107c89ij92q32j041k71O30f69a67B64m3a63pC16
$$ -978 -786 -890 -1920 -3001 -2276 -1107 -389 -9 -201 -1033 -2074 -2345 -1715 -669 -167 264 221 -163 -170 316
13547A153J096N23j77A076f49o44B9J799J397M36j66m57j103E37i32j647j067
$$ 1153 2249 2772 2595 1076 -649 -1293 29 1828 3225 3661 3495 3038 1935 537 -932 -2579 -3646
13530c646J2p24K7L26K97L56N73L60K36j58o15O9N38P55k1j044r34J532P30m36
$$ -3646 -3634 -4358 -4331 -4005 -3708 -3352 -2779 -2419 -2183 -2341 -2956 -2887 -2349 -1594 -1615 -2659 -3593 -2061 -1331 -1767
13510a767q08r37Q1J553O18k68p79M09R17C62P09m83i02j783j728J783J149P14
$$ -1767 -2575 -3512 -3431 -1878 -1260 -1528 -2307 -1898 -981 362 1071 588 -902 -2685 -4413 -2630 -1481 -767
13492g67F6M39l5d39k5E91J056N19j30q21D37e46J45H81J023O66j6H41a581p92
$$ -767 66 505 470 -439 -464 591 1647 2166 2036 1215 437 -546 -401 881 1904 2570 2554 841 -1581 -2373
13472b373J176a08B16A5h27j124q51J034I6J156J90D85e71m53F50K119J001K55
$$ -2373 -1197 -108 216 15 -827 -1951 -2802 -1768 96 1252 1442 485 -571 -1024 650 2769 3770 4025
13454D025m98j147m91l66n21m90a18m5l72k04k3l0J01K22a15H7M93N83J224J340
$$ 4025 3527 2380 1889 1523 1002 512 -118 -163 -535 -739 -762 -792 -691 -469 -115 87 580 1163 2387 3727
13434C727Q17K7q41j526C76a677j855R03P95l1p6P99C59J433J012M27K30p9m42
$$ 3727 4544 4571 3730 2204 376 -1677 -3532 -2629 -1834 -1865 -1941 -1142 359 1792 2804 3231 3461 3382 2940
13415B940o79o85b8j918j622m03R93J224d74H95J865J425O53j249j650B96a043
$$ 2940 2261 1576 -28 -1946 -3568 -3971 -2978 -1754 -474 895 2760 4185 4838 3589 1939 296 -1043
13397a540J75J00P3n08j189j282k75K139b67A482J055J030L79o44A500d61k374
$$ -1540 -1365 -1265 -1192 -1700 -2889 -4171 -4446 -2307 -267 1482 2537 3567 3946 3302 1500 -461 -2835
13380b835l55a021H81J558J521Q94j56j152j728B03h74o66P5O21a31C53P69P69
$$ -2835 -3190 -1021 881 2439 3960 4854 4698 3546 1818 203 -874 -1540 -1465 -844 -131 353 1122 1891
13362A891K16r16a020k342i02B298K841J654J53j244j936j831a40j530j362r53
$$ 1891 2107 1191 -1020 -3362 -902 2298 5139 6793 6946 5702 3766 1935 -140 -1670 -3032 -3985
13346c985P48J209B47N94O16K67L19L95O16M87j22r05j229b88j380j301o91J143
$$ -3985 -3237 -2028 247 841 1457 1724 2043 2438 3054 3541 3419 2514 1285 -288 -1668 -2969 -3660 -2517
13328b517e02B97L33B84b47q22o44L75a79L1A90K92j61G0c75m98j88L32D68J789
$$ -2517 -502 297 630 284 -247 -1069 -1713 -1338 -179 -148 190 482 321 70 -375 -873 -1061 -729 468 2257
13308B257J943J626j1n47j206j741B29a450o32L9p33j522Q16g95A534J715Q82
$$ 2257 4200 5826 5815 5268 4062 2321 229 -1450 -2082 -2043 -2776 -4298 -3482 -795 1534 3249 4131
13291D131k68j003A156f60j960n38i39F0J96a17j048j019o62P19a21A304L03n24
$$ 4131 3863 2860 1156 -660 -2620 -3158 -939 60 256 -117 -1165 -2184 -2846 -2127 -121 1304 1607 1083
13273A083B5a292j275K66R50N56J27k76p59r22j488J099O43i28a08B38N16N33
$$ 1083 25 -1292 -2567 -2301 -1351 -795 -668 -944 -1703 -2625 -4113 -3014 -2371 -928 -108 238 754 1287
13255A287P20Q3l18G95f08r63j087q22N03J064h00G30J139J207Q76j042A000a076
$$ 1287 2007 2090 1772 795 -608 -1571 -2658 -3480 -2977 -1913 -800 730 1869 3076 3952 2910 1000 -1076
13236b281j37M96Q67b77H38M61k0j5M71J083J362J148J56r85j159j363D78e16
$$ -2281 -2418 -1922 -1055 -277 838 1299 1279 1264 1735 2818 4180 5328 5484 4499 3340 1977 478 -516
13217a484O56G52O84O21r3l24m41b43j653k73e65E23K11a3j445l88e54H68J033
$$ -1484 -828 752 1436 2057 1964 1640 1199 -243 -1896 -2169 -565 523 734 -13 -1458 -1846 -554 868 1901
13198A901M48j42l94m11J0J23m9k75m56A25K08R26O55j29G50i45j845j994L09
$$ 1901 2349 2207 1813 1402 1412 1535 1486 1211 755 125 333 1259 1914 1785 750 -945 -2790 -4784 -4475
13179d475b219e4B099J948O98o57o31o09p24R4l32K44j33l66F44d75j339j396
$$ -4475 -2219 -54 2099 4047 4745 4088 3457 2848 2124 2218 1886 2130 1997 1631 644 -475 -1814 -3210
13161c210a384d75M5p60r24j88M22Q96c36K8o47o50p37j78k33o5K75Q90d37D44
$$ -3210 -1384 -475 -430 -1190 -2114 -2302 -1880 -984 -336 -308 -955 -1605 -2342 -2520 -2753 -2818 -2543 -1653 -437 444
13140G21j73c32j439j265n96q8J5r8J91N35M43Q27K38K00p5K08d48D08R47N52
$$ 721 548 -332 -1771 -3036 -3632 -3720 -3705 -3803 -3612 -3077 -2634 -1807 -1569 -1369 -1444 -1236 -448 408 1355 1907
13120A907J78M1k49p97F1f85J98G01J543J842J347R01l77j170j201j575E38e44
$$ 1907 2085 2126 1877 1080 61 -685 -487 701 2244 4086 5433 6334 5957 4787 3586 2011 538 -544
13101a347n18K3J59J47O8l25l77J19N15f46d3D88j4e53j898j370M10J520H38K184
$$ -1347 -1865 -1842 -1683 -1536 -1468 -1793 -2170 -2051 -1536 -646 -43 488 474 -553 -2451 -3821 -3411 -1891 838 3022
13081C022Q08j79o03r13o51l44n1M31O06O14J001J208J075P79Mr95j553j629n95
$$ 3022 3830 3651 3048 2135 1484 1140 1089 1520 2126 2740 3741 4949 6024 6803 6807 5812 4259 2630 2035
13062B035n15G20b77j598j549j0L95j01n83l81J035J503c62D84M97k16B9a175
$$ 2035 1520 720 -277 -1875 -3424 -3434 -3039 -3140 -3723 -4104 -3069 -1566 -362 484 981 765 29 -1175
13043b028m28j65rL40h83e6A141J050M29j102d84j696r71J1M69J178O09L40J14
$$ -2028 -2456 -2621 -2630 -2290 -883 -56 1141 2191 2620 1518 -484 -2180 -3151 -3140 -2671 -1493 -884 -544 -430
13024d30k87r7b7A232J437P66q4j073G81h38j372p36n65J49J507F27K081J553
$$ -430 -717 -814 -27 1232 2669 3435 3351 2278 781 -838 -2210 -2946 -3511 -3362 -1855 627 2708 4261
13006D261P13k59n39p91p04q69n22J57J5n40h69k031R53A270L630K779K312O75
$$ 4261 4974 4715 4176 3385 2681 1812 1290 1447 1462 922 -869 -2900 -1947 1270 4900 7679 9991 10666
12988A0666r13k458l104F09b142n86N76M19l80M9Q41c38F1a53r44j371K38g21
$$ 10666 9753 7295 4191 609 -2142 -2728 -2152 -1733 -2113 -2064 -1223 -338 61 -153 -1097 -2468 -2230 -721
12969g2m16r92j236j67a116G25R94R8o86D10A47N47Q53rp02i73k505q6J600i18
$$ -72 -488 -1480 -2716 -2883 -1116 725 1719 1817 1131 410 147 694 1547 1538 836 -973 -3478 -3564 -1964 -918
12948c29j23j266j539K51M01M71j36p28q80J484d59A218J130P10M49o06j375E0
$$ -329 -452 -1718 -3257 -3006 -2605 -2134 -2270 -2998 -3878 -2394 -459 1218 2348 3058 3507 2901 1526 50
12929a608j586o03M33K55N07a174G49J923K165K051Q90J10p27j276j181r25m28
$$ -1608 -3194 -3797 -3364 -3109 -2602 -1174 749 2672 4837 6888 7778 7888 7161 5885 4704 3779 3351
12912C351q1m4m23r44C99a195j178q62L8j38K69O04N5m7Q49J23m71l96j23M18
$$ 3351 3270 3226 2803 1859 399 -1195 -2373 -3235 -3197 -3335 -3066 -2462 -2407 -2454 -1605 -1482 -1953 -2349 -2472 -2054
12892b054O97e93B61O38R9D38A2J26L15k23Q99O16R4p11D9g07m29N3R9LK72K74
$$ -2054 -1357 -593 261 899 998 438 12 138 453 230 1129 1745 1839 1128 49 -707 -1136 -1083 -984 -981 -709 -435
12870d35A19J428K414K088L4j648j628G68a228j840o78M05l45n78J431a146F74
$$ -435 119 1547 3961 6049 6083 4435 2807 768 -1228 -3068 -3746 -3341 -3686 -4264 -2833 -1146 674
12852B197R57J07j40L18J023O02k49j147A800c15j233p61O15c12A274Q98J77l70
$$ 2197 3154 3261 3121 3439 4462 5064 4815 3668 1800 -315 -1548 -2309 -1694 -312 1274 2172 2349 1979
12834A979q09e02k027j700J701J190j20r97Q93G63J799Q72l42j258g55k051g09
$$ 1979 1170 -502 -2529 -4229 -2528 -1338 -1458 -2455 -1562 763 2562 3434 3092 1834 -755 -2806 -709
12816A068P74k65n6R86J155L46j040A236d33m59h8D93k45i31k202j420L49P4o
$$ 1068 1842 1577 1521 2507 3662 4008 2968 1236 -433 -892 -88 493 248 -931 -3133 -4553 -4204 -4130 -4136
12797d136J71M04a300I73J293N55L2m34j000f85k637j044J695a328k00j621k463
$$ -4136 -3965 -3561 -1300 973 2266 2821 2853 2419 1419 -685 -3322 -4366 -2671 -1328 -1528 -3149 -5612
12780e612K210g5A814J007n26A026d09o99J30Pq19k278P81a224A205J415M72p16
$$ -5612 -3402 -75 1814 2821 2295 1026 -409 -1108 -978 -971 -1790 -4068 -3287 -1224 1205 2620 3092 2376
12762B376j187I7g21m90j57J99j7o23k74k23J90J0M4o4l12j61k91K15R74B71J522
$$ 2376 1189 97 -721 -1211 -1368 -1169 -1186 -1809 -2083 -2306 -2116 -2106 -2062 -2126 -2438 -2599 -2890 -2675 -1701 271 1793
12741A793J96m96D34h61j142r74n30N00O92N39J49pn59N23c96C55K75q0j10a5
$$ 1793 1989 1493 434 -861 -2003 -2977 -3507 -3007 -2315 -1776 -1627 -1634 -2193 -1670 -396 355 630 550 440 -15
12720C29O61J173Q27M13m2K87K87R45J204P98k59j542j597A658e86j974M62h48
$$ 329 990 2163 2990 3403 3361 3648 3935 4880 6084 6882 6623 5081 3484 1658 -586 -2560 -2098 -848
12701a61O8o8b1A10L88N6f4r39j096j194J54J087R00M14K06m3k08J8J4K82J2m40
$$ -161 -93 -161 -21 110 498 554 -64 -1003 -2099 -3293 -3139 -2052 -1152 -738 -532 -575 -783 -765 -751 -469 -457 -897
12679h97m25m34l09n45j73N46O52M51J74q21n80k98L01M94L2m6L64L05C05P46
$$ -897 -1322 -1756 -2065 -2610 -2783 -2237 -1585 -1134 -960 -1781 -2361 -2659 -2358 -1864 -1832 -1878 -1514 -1209 305 1051
12659A051D44a009j836j75g66I52Q29n04H2a364J25a61D52L78O5D12g7o44j306
$$ 1051 444 -1009 -2845 -3020 -766 952 1781 1277 82 -1364 -1239 -161 452 830 895 412 -77 -721 -2027
12640b027j259P2a033A092J253l08B3a993k179J680f06b6n33q79o16j18N24P22
$$ -2027 -3286 -3214 -1033 1092 2345 2037 23 -1993 -4172 -2492 -606 -26 -559 -1438 -2054 -2172 -1648 -926
12622i26D29J367O31m95l20Ia612j613j291n8b074a81A037M06G04g45j724k130
$$ -926 429 1796 2427 1932 1612 9 -1612 -3225 -4516 -4574 -2074 -181 1037 1443 704 -745 -2469 -4599
12604d599J06J799R91N5m59q5R79D12J858J737J226m98j895G67i80m70O86b24
$$ -4599 -4493 -2694 -1703 -1648 -2107 -2192 -1213 412 2270 4007 5233 4735 2840 767 -980 -1450 -764 -224
12585B9g38j493j734J664e11E12N65R4j10q7J4j48A18i02r98j581M18i06A335
$$ 29 -738 -2231 -3965 -2301 -511 512 1077 1171 1061 974 988 840 118 -902 -1900 -3481 -3063 -906 1335
12565C132J052Q26Q40N24L28q64j49k12j86r70j550H20i81r80J56L06L0k89o44
$$ 3132 4184 5010 5850 6374 6702 5838 5689 5477 5291 4321 2771 820 -981 -1961 -1805 -1499 -1469 -1758 -2402
12546b402o17m91k81j76J87K77J010R97K89J88J42j028r88R62c67F99O25L61j47
$$ -2402 -3019 -3510 -3791 -3967 -3780 -3503 -2493 -1496 -1207 -1019 -877 -1905 -2893 -1931 -367 699 1324 1685 1538
12527A538D84a59j76l50k42l23l00K89jl70k05Q4l17J23k72r29r47m82J35L88
$$ 1538 484 -159 -335 -685 -927 -1250 -1550 -1261 -1262 -1632 -1837 -1753 -2070 -1947 -2219 -3148 -4095 -4577 -4442 -4054
12507d054K61J63O9K99P90J205b05B91R53J159M66l23n49o91B51C5R54J652J570
$$ -4054 -3793 -3630 -3561 -3262 -2472 -1267 -205 291 1244 2403 2869 2546 1997 1306 251 35 989 2641 4211
12488D211N19j335H75b364r36F22L022J817O59j00n42n38n32j086j470F01k17
$$ 4211 4730 3395 875 -2364 -3300 622 3644 5461 6120 6020 5478 4940 4408 3322 1852 601 384
12471C84Q65Q36L83k21p13p58c18o67k10L9K53b85A6a59l93n72n79r36p99j59
$$ 384 1249 2085 2468 2247 1534 776 -318 -985 -1195 -1156 -903 -285 16 -159 -552 -1124 -1703 -2639 -3438 -3597
12451c597P56J194a44E60N68O05L15l01K7J26J11p73k83J68R99R47L22O1n5J15
$$ -3597 -2841 -1647 -144 560 1128 1733 2048 1747 1774 1900 2011 1238 955 1123 2122 3069 3391 3452 3397 3512
12431C512a198k19n05j304l96J000O78n71k150p12b323B85J561N10p11m22D67
$$ 3512 -1198 -1417 -1922 -3226 -3622 -2622 -1944 -2515 -4665 -5377 -2323 285 1846 2356 1645 1223 467
12413F64N20Q29J913J843J233N23m09m82R0Q50M27o21k146k018A136a296j749
$$ 664 1184 2013 3926 5769 7002 7525 7116 6634 6724 7574 8001 7380 5234 3216 1136 -1296 -3045
12396c045L21J330d01A09D8d52k97l14l25r86O40G56L753L859K744J052j377l219
$$ -3045 -2724 -1394 -401 109 48 -452 -749 -1063 -1388 -2374 -1734 756 4509 8368 11112 12164 10787 7568
12378G568C154a236k511i14A808J393r7n62r39G37C08a40n5R2k44n53n77r44j038
$$ 7568 3154 -1236 -3747 -914 1808 3201 3104 2542 1603 737 308 -140 -195 -103 -347 -900 -1477 -2421 -3459
12359c459P98Q03g64b4k4I3b55A95P22P86kE57a455j119Q19g75q6n40r89o64q27
$$ -3459 -2661 -1858 -764 -24 -48 93 -255 195 917 1703 1701 557 -1455 -2574 -1755 -775 -861 -1401 -2390 -3054 -3881
12338c881m30m37m9N9L80J076R84N99K68j10p11m99q1O94i47b40D24Q05J269J262
$$ -3881 -4311 -4748 -4797 -4738 -4358 -3282 -2298 -1699 -1431 -1541 -2252 -2751 -2832 -2138 -947 -240 424 1229 2498 3760
12318C760N23q29q03A228f61j997j244N39O22K7n31m02Q83Q80R15b29B75K69j12
$$ 3760 4283 3454 2651 1228 -661 -2658 -3902 -3363 -2741 -2714 -3245 -3647 -2764 -1884 -969 -229 275 544 432
12299D32H2d79n57q1o4k96n06o30J56J210d13a70e9C40P75N51j43F00i56j707
$$ 432 82 -479 -1036 -1117 -1181 -1477 -1983 -2613 -2457 -1247 -413 -170 -59 340 1115 1666 1523 600 -956 -2663
12279b663m09J402b08D69D0a187j514j330P33J295d70C98A82e75q11L58b31E89
$$ -2663 -3072 -1670 -208 469 40 -1187 -2701 -4031 -3298 -2003 -470 398 182 -575 -1386 -1028 -231 589
12260I60m53g14p37O63G08M20O8r6l83B9a302j604L16J116d38a9k91j33o15b70
$$ 960 507 -714 -1451 -788 708 1128 1196 1100 717 29 -1302 -2906 -2590 -1474 -438 -19 -310 -443 -1058 -270
12239H79J408Q30k45n57A043c06j514o88j28M08M70k2p28o91o80O05R71R16N22
$$ 879 2287 3117 2872 2315 1043 -306 -1820 -2508 -2636 -2228 -1758 -1780 -2508 -3199 -3879 -3274 -2303 -1387 -865
12220h65P7q24n78j198j28L78J253P87e44b26A83O31R68O39K08l71H12f58j231
$$ -865 -788 -1612 -2190 -3388 -3516 -3138 -1885 -1098 -544 -226 183 814 1782 2421 2629 2258 812 -658 -1889
12201a889o95m29j60M98J073c91B65a66j477j986j659J124n12K223c51B163J698
$$ -1889 -2584 -3013 -3173 -2675 -1602 -391 265 -166 -1643 -3629 -5288 -4164 -4676 -2453 -351 2163 3861
12184C861K89j262E58a771L34A582K861J598J80j446A825g91b50A857J206J34
$$ 3861 4150 2888 558 -1771 -1437 1582 4443 6041 6221 4775 1825 -791 -250 1857 3063 3197
12168C197j403f12j778o24q36m11J384f73A707J780J179N96j09p40j790A81a662
$$ 3197 1794 -612 -2390 -3014 -3850 -4261 -2877 -673 1707 3487 4666 5262 5153 4413 2623 181 -1662
12150a941c36A791K148J542J275O48K51m32j577B622h47j602B6J496l15I8a571
$$ -1941 -336 1791 3939 5481 6756 7404 7655 7223 5646 2622 -847 -2449 26 1522 1207 98 -1571
12132b866J9m4J73R92e88Hf64k532l477J008K666I08K971K410Q17m01k714G70
$$ -2866 -2847 -2891 -2718 -1726 -588 8 -664 -3196 -6673 -5665 -2999 908 3879 6289 7106 6705 3991 770
12113a181A001L281K505J312m20k724A602N93K874O248M948J729k260m796D799
$$ -1181 1001 4282 6787 8099 7679 4955 1602 2195 5069 11317 16265 17994 15734 10938 4799
12097D05K235L157J504l05j247j531j819B27a631j434j396R47a416B2O38a71r19
$$ 405 2640 5797 7301 6996 5749 4218 2399 227 -1631 -3065 -4461 -3514 -1416 22 660 -171 -1090
12080a090j097j300j063R50R86Q08Q51c02c0p4a0A75e08j831a144B038J690A610
$$ -1090 -2187 -3487 -4550 -3600 -2614 -1806 -955 -302 -30 -104 -10 175 -508 -2339 -1144 2038 3728 1610
12061a368A0397J7848J9433J7188J1432K918o153j4323j8037j7979H811A403a463
$$ -1368 10397 28245 47678 64866 76298 79216 73063 58740 40703 22724 8811 1403 -1463
12047d697N19a17B083L96j059aj401n65J05M72M70K29m53q55l67Q23O62p7o90
$$ -4697 -4178 -117 2083 2479 1420 -1 -1402 -1967 -1862 -1390 -920 -691 -1144 -1999 -2366 -1543 -881 -958 -1648
12028a648j207o73J106K48r3l13p59m50J069J127O97k27q28j175q55j489L04O27
$$ -1648 -2855 -3528 -2422 -2174 -2267 -2580 -3339 -3789 -2720 -1593 -896 -1123 -1951 -3126 -3981 -5470 -5166 -4539
12010d539K49l98m94Q37P41Q10N60O04M4k35o67K98J048d2G72J07m05d06o13j2
$$ -4539 -4290 -4688 -5182 -4345 -3604 -2794 -2234 -1630 -1586 -1821 -2488 -2190 -1142 -42 772 879 474 -406 -1019 -1031
11990a031c02I22P28p9E69a322j236J234n33k451A067P319Q153P475M909J538
$$ -1031 -302 922 1650 1571 569 -1322 -2558 -1324 -1857 -4308 1067 8386 16539 24014 28923 30461
11974C0461k600o141p841F111c63m296J526B6K457J752l07j734B15a516j066k79
$$ 30461 27861 21720 13879 6111 -363 -4659 -3133 26 2483 4235 3928 2194 215 -1516 -2582 -2861
11958b861L23P6l62l92l8j91l89k33N75P42M82O60P28B3b17j366j375k239N76
$$ -2861 -2538 -2462 -2824 -3216 -3254 -3445 -3834 -4067 -3492 -2750 -2268 -1608 -880 23 -217 -1583 -2958 -5197 -4621
11939d621b288d78E36K50d1j860k029j994l50J474J981b83A875Q75k96m15m84
$$ -4621 -2288 -478 536 786 -41 -1901 -3930 -5924 -6274 -4800 -2819 -283 1875 2750 2454 2039 1555
11922A555k03k61Aa183j965o76J413f04F39O84J19D20a043j627j324o9O54Q70
$$ 1555 1352 1091 1 -1183 -3148 -3824 -2411 -604 639 1323 1442 420 -1043 -2670 -3994 -4063 -3409 -2539
11904b539O47O06L83k5n43j451j873j80J458J716B08K466J988J152K83o14m51
$$ -2539 -1892 -1286 -903 -928 -1471 -2922 -4795 -4975 -3517 -1801 208 2674 4662 5814 6097 5483 5032
11887E032N75J728O33m09j555j242j285j111A104A46a108j194l00a082A901K589
$$ 5032 5607 7335 7968 7559 6004 4762 3477 2366 1104 146 -1108 -2302 -2602 -1082 1901 4490
11871D490K153M4j987k277f48k141P22b49E64K81k64I7L0O79J175J093L92k65
$$ 4490 6643 6687 4700 2423 -648 -2789 -2067 -249 564 845 581 97 127 806 1981 3074 3466 3201
11853C201p66A129G1c63o64l44j000r37K84j64P01R23P04K71Rg1D62K3K37j18
$$ 3201 2435 1129 71 -363 -1027 -1371 -2371 -3308 -3024 -3188 -2487 -1564 -860 -589 -580 -71 462 485 722 604
11833F04a53n31k89A48R46k96a00j211j825j787j010R24R36J705f37E86L74A47
$$ 604 -153 -684 -973 148 1094 798 -100 -1311 -3136 -4923 -5933 -5009 -4073 -2368 -637 586 960 147
11814a589k031O99e04B255L066J957J92j966A437c578k771b260A366L518L277
$$ -1589 -3620 -2921 -504 2255 5321 7278 7470 5504 1437 -3578 -6349 -2260 1366 4884 8161
11799H161L389L426N372Q057R699R419M661n89o400j0093j1097q415m549l279
$$ 8161 11550 14976 20348 28405 38104 47523 52184 51595 45195 35102 24005 15590 11041 7762
11785G762C687G28h10j622r71q43J033c99A716L57B81a954k283r75J862a590c65
$$ 7762 3687 728 -810 -2432 -3403 -4246 -3213 -399 1716 2073 281 -1954 -4237 -5212 -3350 -1590 -365
11767G1c40j323j675r53P25J059k09p05J22J610c80H60Q91M85J24m04m19b35k490
$$ 71 -340 -1663 -3338 -4291 -3566 -2507 -2716 -3421 -3299 -1689 -380 860 1751 2236 2360 1956 1537 -235 -2725
11748b725k356a781D49Q79m83D0a155m64J75N9p44j192o55l59o11m53P0O87J794
$$ -2725 -5081 -1781 449 1328 845 40 -1155 -1619 -1444 -1385 -2129 -3321 -3976 -4335 -4946 -5399 -5329 -4642 -2848
11729b848a07B144J943R15J0q67j451A128A99N46K94L10k24l58F4c03F4J105J386
$$ -2848 -107 2144 4087 5002 5012 4145 2694 1128 199 745 1039 1349 1125 767 64 -303 64 1169 2555
11710B555J184O92J48m64q64j444B15a728r93R44B29K023J260J195J687J194N13
$$ 2555 3739 4431 4579 4115 3251 1807 215 -1728 -2721 -1777 229 2252 3512 4707 6394 7588 8101
11693H101j82j228k597H40b143K65c06D0b83j189j200r15j334m84Q05M3p48p91
$$ 8101 7919 6691 4094 840 -2143 -1878 -306 40 -283 -1472 -2672 -3587 -4921 -5405 -4600 -4557 -5305 -6096
11675f096R49R66M21L14L53a150A021K026K455J482O59J17m48j277k087A743e40
$$ -6096 -5147 -4181 -3760 -3446 -3093 -1150 1021 3047 5502 6984 7643 7760 7312 6035 3948 1743 -540
11657b763j389L9R48N77J20K26J29l8Lj66l93j266j299j024K211J537a134A3O46
$$ -2763 -4152 -4113 -3165 -2588 -2468 -2242 -2113 -2151 -2148 -2314 -2707 -3973 -5272 -6296 -4085 -2548 -1134 13 659
11638F59k21d44q33k7M22K59G6@d21n48j78b89A102M81k82A06c93j27E3Q69Q45
$$ 659 438 -444 -1277 -1304 -882 -623 76 0 -421 -969 -1147 -289 1102 1583 1301 106 -393 -520 53 922 1767
11617A767M01m45D22i86j415j053l44j26M33J250e92G42Q60N1l85n25A93A1J30
$$ 1767 2168 1723 422 -986 -2401 -3454 -3798 -3924 -3491 -2241 -592 742 1602 1653 1268 743 193 11 141
11598A41Q0j01b15m77o16o7d47A073J324Q03J61p09j298b94j441q40k08J30J005
$$ 141 221 120 -215 -692 -1308 -1375 -447 1073 2397 3200 3361 2652 1354 -294 -1735 -2575 -2783 -2653 -1648
11579a648P42b1B74K0g9n01j068j082k97O68J109J94r17j912o82K267A439K999
$$ -1648 -906 -21 274 294 -79 -580 -1648 -2730 -3027 -2359 -1250 -1056 -1973 -3885 -4567 -2300 1439 4438
11561D438R38J317j814B173f97j810o00O43J021J39j602n32p7P03a387G46J872
$$ 4438 5376 6693 4879 2173 -697 -2507 -3107 -2464 -1443 -1304 -2906 -3438 -3515 -2812 -1387 746 2618
11544B618N74j086b4k101p76J025b80E34k3j31f18j881r75J470g99D40J335J799
$$ 2618 3192 2106 -24 -2125 -2901 -1876 -280 534 511 380 -618 -2499 -3474 -2004 -799 440 1775 3574
11526C574J319R60k258B98a472A89J675R54P47A75M146K522K765J315j969k619
$$ 3574 4893 5853 3595 298 -1472 189 1864 2818 3565 175 4321 6843 9608 10923 8954 6335
11510F335l138D79a269j334r69k89J617l03k83J89P81L54n63j001j342p55PR89
$$ 6335 3197 479 -1269 -2603 -3572 -3861 -2244 -2547 -2830 -2641 -1860 -1506 -2069 -3070 -4412 -5167 -5160 -4171
11492d171J132R86L04L6J71K21a77A634J345J12n92p87C64i72p74p0k28k80m83
$$ -4171 -3039 -2053 -1749 -1713 -1542 -1321 -177 1634 2979 3091 2499 1712 364 -972 -1746 -1816 -2044 -2324 -2807
11473b807j210J66R3J72K37N10O40N82L45j30K9m7m35p59R91H1J701J350J278
$$ -2807 -4017 -3851 -3758 -3586 -3349 -2839 -2199 -1617 -1272 -1402 -1373 -1420 -1855 -2614 -1623 81 1782 3132 4410
11454D410J040P75L80n45j286j463j248o19m57A65e37m51j09q0K63K4n71j188
$$ 4410 5450 6225 6605 6060 4774 3311 2063 1444 987 165 -537 -988 -1097 -1177 -914 -890 -1461 -2649
11436b649j590L28N24M50k62q26q62N20J167J065h12C97P68L09o54a52r39n46
$$ -2649 -4239 -3911 -3387 -2937 -3199 -4025 -4887 -4367 -3200 -2135 -812 397 1165 1474 820 -152 -1091 -1637
11418a637j86J9M85d01E90J90B07d38j544k130k16K094c00H34L31B40h44p91j6
$$ -1637 -1823 -1804 -1319 -401 590 780 207 -438 -1982 -4112 -4328 -2234 -300 834 1165 240 -844 -1635 -1651
11399a651j51p80j465J313C49K823K313J420N6j406k264I51B15J059J757J391
$$ -1651 -1802 -2582 -4047 -2734 349 3172 5485 6905 6961 5555 3291 951 215 1274 3031 4422
11383D422O26n47j274j283H59G3d87M3j41r8K59J83O2l98n43j465j285q23o11
$$ 4422 5048 4501 3227 1944 859 73 -487 -444 -585 -683 -424 -241 -179 -577 -1120 -2585 -3870 -4693 -5304
11364e304l61M73Q16R51N61L74L59L69M08J54J18M58B19J023J036K24m67p35E37
$$ -5304 -5665 -5192 -4376 -3425 -2864 -2490 -2131 -1762 -1354 -1200 -1082 -624 219 1242 2278 2502 2035 1300 537
11344D94j0A34g37k253J105C612P494Q155P477N154K593j178m665o919q325E565
$$ 494 484 134 -737 -2990 -1885 3612 11106 19261 26738 31892 34485 33307 28642 21723 13398 5565
11327G49D1J740P3c47k542J098E59K171R88m73j086c0j941O21B07J365Q85P44
$$ 749 41 1781 1854 -347 -2889 -1791 559 2730 3718 3245 2159 -30 -1971 -1350 207 1572 2457 3201
11309C201M09k3n55j417a92k137L31b00E29L9i99k856g13B390K455K558O49m16
$$ 3201 3610 3587 3032 1615 -192 -2329 -1998 -200 529 568 -999 -3855 -713 2390 4845 7403 8052 7636
11291G636j309k241j717H45d07a3I65P38k99b24j915K62P76b00k71j239k514K37
$$ 7636 6327 4086 2369 845 -407 -13 965 1703 1404 -224 -2139 -1877 -1101 -200 -471 -1710 -4224 -3987
11273c987a969M54p66j430L76J116P77JL08b99D72K57J85L49J32O5R5j06k00J02
$$ -3987 -1969 -1515 -2281 -3711 -3335 -2219 -1442 -1441 -1133 -299 472 729 914 1263 1395 1460 1555 1449 1249 1351
11253A351n90h28q19f29I7a002j855M50a01I64B59a888k261K065G69K036N27j041
$$ 1351 761 -828 -1647 -629 97 -1002 -2857 -2407 -101 964 259 -1888 -4149 -2084 769 2805 3332 2291
11235B291d85l097j951j66K295A191M640K423m77k573A391a681h14E967O199K291
$$ 2291 -485 -3582 -5533 -5699 -3404 1191 5831 8254 7777 5204 1391 -1681 -814 5967 12166 14457
11219A4457m071C497J302N067n65K67J0668J0051j157n959J4915K3320N322R440
$$ 14457 10386 3497 4799 9866 9301 9568 20236 30287 29130 23171 38086 61406 66728 76168
11205G6168J00932J84343K23993K17406J64427P3565l5376j35628k04660k27996
$$ 76168 177100 361443 585436 802842 967269 1040834 1005458 869830 665170 437174
11195D37174k03909I8253k7664L737j9916k5724m603L239q343E112M793J0570
$$ 437174 233265 98253 70589 74326 54410 28686 24083 27322 18979 5112 9905 20475
11183B0475J297p491C189c098C619K965M35j330B434g02h2A7b346k997i55B025
$$ 20475 21772 14281 3189 -3098 3619 6584 7019 5689 2434 -702 -82 17 -2346 -5343 -955 2025
11166B429G67e71k53j72j118r89L94J00M85D72K209R44o63A221a396l130J209
$$ 2429 767 -571 -824 -996 -2114 -3103 -2709 -2609 -2124 472 2681 3625 2962 1221 -1396 -4526 -3317
11149c317a420a73A23d47j337Q00A926K931K351J845K28j681k892I39b689k058
$$ -3317 -1420 -173 123 -447 -1784 -984 1926 4857 7208 9053 9281 7600 4708 939 -2689 -4747
11133d747j22j95J670a037C04B8a458k696r4a525D11Q95J13j39o04b31j138m35
$$ -4747 -4869 -5064 -3394 -1037 304 28 -1458 -4154 -4248 -1525 411 1306 1419 1280 676 -231 -1369 -1804
11115a804h38B91M05k49e33j475j399J112R59b65E90K19l81d40r93r83j022o44
$$ -1804 -838 291 696 447 -533 -2008 -3407 -2295 -1336 -265 590 809 428 -440 -1433 -2416 -3438 -4082
11097d082J113J206h15k31r34j160o7M03N70L91l21p79r5O34J201D77J477J164
$$ -4082 -2969 -1763 -815 -1046 -1980 -3140 -3207 -2804 -2234 -1843 -2164 -2943 -3038 -2404 -1203 477 1954 3118
11079C118K79n20A286h63j997j108M59J626GJ533J003l10o15k91l11K15M51O89
$$ 3118 3397 2877 1286 -863 -2860 -3968 -3509 -1883 7 1540 2543 2233 1618 1327 1016 1231 1682 2371
11061B371P2o87H30an43c8H44Q67k89d65j550a65B288K064L60j391G27c022r53
$$ 2371 2443 1756 830 -1 -544 -38 844 1711 1422 -465 -2015 -165 2288 4352 4712 3321 727 -3022 -3975
11042c975f96A452J540R83K034J271J21o34j460j757j588D06b76E4M86a44j147
$$ -3975 -696 1452 2992 3975 6009 7280 7401 6767 5307 3550 1962 406 -276 54 540 -144 -1291
11025a291j370OJ211f6F68K54L10M93J85l99A43b298k606K112a45H89k32j91J222
$$ -1291 -2661 -2655 -1444 -66 668 922 1232 1725 1910 1511 143 -2298 -4904 -2792 -145 889 657 466 1688
11006A688J957K363J193J648Q60j67j277k251B878E7a426P2L4j84n23n74j44J49
$$ 1688 3645 6008 7201 8849 9709 9542 8265 6014 2878 57 -1426 -1354 -1320 -1504 -2027 -2601 -2745 -2596
10988b596j90p50j985O25J932g15A431J647J076O71K83p7k91r02m13o41j123F94
$$ -2596 -2786 -3536 -5521 -4896 -2964 -715 1431 3078 4154 4825 5108 5031 4740 3838 3425 2784 1661 694
10969G9c57L1A56Q72J082P28Ql52m35l44k22p45d10j786n78J012f12a18A27P93
$$ 79 -357 -326 156 1028 2110 2838 2846 2494 2059 1715 1493 748 -410 -2196 -2774 -1762 -612 -118 127 920
10949I20L86K65j35l82j57l2B33a609k978n59K382f3A805R44k19p79D25i22j535
$$ 920 1306 1571 1436 1054 897 865 233 -1609 -4587 -5146 -2764 -63 1805 2749 2530 1751 425 -922 -2457
10930b457p37M0O12R55f80a05A6e56j275j451j020J68J260R55Q92b77A22K41a63
$$ -2457 -3194 -3154 -2542 -1587 -680 -105 16 -556 -1831 -3282 -4302 -4134 -2874 -1919 -1027 -277 122 363 -163
10910a494j673j304J818e55A03a003l893J493B520P235O759K968k413m869D311
$$ -1494 -3167 -4471 -2653 -555 103 -1003 -4896 -3403 2520 9755 16514 19482 17069 12200 4311
10894d415a987B382J687r94e31l024j434J284J003J287A427K168K414M92K02J190
$$ -4415 -1987 2382 4069 3075 -531 -3555 -4989 -3705 -2702 -1415 1427 3595 6009 6501 6703 7893
10878G893j41j455j13l44j084j524G90a952j658R82R62L60l95k43j05m42J054
$$ 7893 7752 6297 6184 5840 4756 3232 790 -1952 -3610 -2628 -1666 -1306 -1701 -1944 -2049 -2491 -1437
10861a437I67K162J624R84n43j537j352E16b69f8F55N66J15D93f68q67l58K20
$$ -1437 967 3129 4753 5737 5194 3657 2305 516 -269 -68 655 1221 1336 493 -668 -1535 -1893 -1673
10843a673L15M15c97a96p95k235k248b115B63J155L4l86Q85J423L089M364K831
$$ -1673 -1358 -943 -397 -196 -991 -3226 -5474 -2115 263 1418 1452 1066 1951 3374 6463 10827 13658
10826A3658J403j424k492k635l100B463E91g02j532j049P29a249J98k378j418
$$ 13658 15061 13637 11145 8510 5410 2463 591 -702 -2234 -3283 -2554 -1249 -1051 -3429 -4847
10811d847a236B393K926J319o88k165A081a374M23F9a47j338j637l38O28J356
$$ -4847 -1236 2393 5319 6638 5950 3785 1081 -1374 -951 69 -147 -1485 -3122 -3460 -2832 -1476
10795a476F78J617J40j205a458l131Q14g79F51B20a455r93m89n51j264j159J54
$$ -1476 678 2295 2435 1230 -1458 -4589 -3775 -779 651 220 -1455 -2448 -2937 -3488 -4752 -5911 -5757
10778e757O52J037l66Q3J780B07J577P90q73c89k775l13g85F37P69J761P28j014
$$ -5757 -5105 -4068 -4434 -4351 -2571 207 1784 2574 1701 -389 -3164 -3477 -785 637 1406 3167 3895 2881
10760B881h48m099k156a324B233Q92F04b968l09A029M177K662K59j191j919j870
$$ 2881 -848 -4947 -7103 -1324 2233 3125 604 -2968 -3277 1029 5206 7868 8127 6936 5017 3147
10744C147E48e53C239P351N641O14j130K240M449K840j055K266M232M161P073
$$ 3147 548 -553 3239 10590 16231 16845 15715 17955 22404 25244 24189 26455 30687 34848 41921
10729D1921J3732J8349J9623K3831M5929P9382J06562J16782J10651Q9842O0840
$$ 41921 55653 74002 93625 117456 163385 242767 349329 466111 576762 666604 727444
10718G27444J7352l2706o6735r4119j12188j16441j04493p3394l7703j8985j9783
$$ 727444 744796 712090 645355 551236 439048 322607 218114 144720 107017 88032 68249
10707F8249k1374j0431L320L574n196r450q573n732l183k075m190a507a45I900
$$ 68249 46875 36444 39764 43338 38142 28692 20119 14387 11204 9129 4939 -1507 -145 9900
10692A6394J074n515C886j418N262K689j357l816C48b809E19L747J263j584c0
$$ 16394 17468 11953 3886 2468 7730 10419 9062 5246 348 -2809 519 4266 5529 3945 -30
10676e303D96L635O98k339a777m39b17C8a154l36A265J663Q6J44o81H73a67o98
$$ -5303 496 4131 4829 2490 -1777 -2216 -217 38 -1154 -1490 1265 2928 3014 3158 2477 873 -167 -865
10658h65j147j837j424J846a40B457R52q97F52i16j018j67J033C73J441J192L62
$$ -865 -2012 -3849 -5273 -3427 -140 2457 3409 2512 652 -916 -1934 -2101 -1068 373 1814 3006 3368
10641C368l52j369e24q11C42J681K77j072D65N13N17p5o56K59Q85O2l32G15j28
$$ 3368 3016 1647 -524 -1335 342 2023 2300 1228 465 978 1495 1420 764 1023 1908 1970 1638 715 587
10622E87j8a13j939k225j089J799J144O27q3o65r56o21l65O72R05O12Q65e10A45
$$ 587 569 -113 -2052 -4277 -5366 -3567 -2423 -1796 -1879 -2544 -3500 -4121 -4486 -3814 -2909 -2297 -1432 -510 145
10602A81f20j667o27R01N7j48j019r95J379a024b62a3r70r86l77m10j60l31k14
$$ 181 -620 -2287 -2914 -2013 -1956 -2104 -3123 -4118 -2739 -1024 -262 -13 -983 -1969 -2346 -2756 -2916 -3247 -3461
10583c461M49M43O6j98n73n13k42j567L80J503J459P15j82o15J34r5r2J72J67
$$ -3461 -3012 -2569 -2503 -2701 -3274 -3787 -4029 -5596 -5216 -3713 -2254 -1539 -1721 -2336 -2202 -2297 -2389 -2217 -2050
10564b050P52c11G78P55k79n55k88E1c63o79m95j435j318r87Q41J697a285L06
$$ -2050 -1298 -311 778 1533 1254 699 411 51 -363 -1042 -1537 -2972 -4290 -5277 -4436 -2739 -1285 -979
10546i79c41M3n94M8C81J880J256P71Pl15o91j434a27j818m34L10i84hB57J43
$$ -979 -341 -298 -892 -844 381 2261 3517 4288 4295 3980 3289 1855 -127 -1945 -2379 -2069 -984 -8 257 400
10526D00A32a31k6jj04j67m24j149j435k75M91k07N90J218E15K441K027O83r11
$$ 400 132 -131 -157 -158 -262 -429 -853 -2002 -3437 -3712 -3221 -3428 -2838 -1620 515 2956 4983 5666 4755
10507D755B042a783k947J74J331J530d71K08o20o95o56j155p74m80J25J066J186
$$ 4755 2042 -1783 -4730 -4556 -3225 -1695 -471 -263 -883 -1578 -2234 -3389 -4163 -4643 -4518 -3452 -2266
10490b266a069C24J409P33P26N39M41P8o22n24q77q87D07a71n15n50n30j60K83
$$ -2266 -1069 324 1733 2466 3192 3731 4172 4250 3628 3104 2227 1340 407 -171 -686 -1236 -1766 -1926 -1643
10471a643k04Q93A43R26K20j63m76c5p94p59j097p52p39p41L21K120e23C60P12
$$ -1643 -1847 -954 143 1069 1289 1126 650 -35 -829 -1588 -2685 -3437 -4176 -4917 -4596 -2476 -523 360 1072
10452A072K56J07L66p50h0j732j501q55K66j29n63j43J360a548B76J060J066L71
$$ 1072 1328 1435 1801 1051 -80 -1812 -3313 -4168 -3902 -4031 -4594 -4737 -3377 -1548 276 1336 2402 2773
10434B773o66o64k92k39B23GK77L66K61D07i68j773j715l71J514O55o55j556o02
$$ 2773 2107 1443 1151 912 223 7 284 650 911 407 -968 -2741 -4456 -4827 -3313 -2658 -3313 -4869 -5471
10415e471Q54J407R11P27g54a99o0j539j72c11A035j02i71j366e05A244M57E81
$$ -5471 -4617 -3210 -2299 -1572 -754 -199 -259 -1798 -1970 -311 1035 933 -971 -2337 -505 1244 1701 581
10396a492j112j53L93Q84F810K1351K5139K4509J8253P447o507j4639k4299k6134
$$ -1492 -2604 -2757 -2364 -1480 6810 28161 53300 77809 96062 103509 97002 82363 58064 31930
10382C1930I055c159H83K121N43c431l084b587a18A246M90R54A79b943j097j210
$$ 31930 9055 -3159 883 3004 3547 -3431 -6515 -2587 -118 1246 1736 2690 179 -2943 -4040 -5250
10366e250J312L17M28J366N03j21j202k264J164a076C0f96k404K94G67K831K174
$$ -5250 -3938 -3621 -3193 -1827 -1324 -1445 -2647 -4911 -3747 -1076 30 -696 -3100 -2806 767 3598 5772
10349E772J250K10m31j297j576r91o44K2m19l26F47i4k172j533J145f60L22p53
$$ 5772 7022 7232 6801 5504 3928 2937 2293 2315 1896 1570 647 -94 -2266 -3799 -2654 -660 -338 -1091
10331a091o86j3L71J53A42J812J879M16j663a26k252p31J071q95j19J045P43d39
$$ -1091 -1777 -1790 -1419 -1266 142 1954 3833 4249 2586 -126 -2378 -3109 -2038 -2933 -3052 -2007 -1264 -439
10312e34j670k421J604R76B30K71a778l159J100D21O655J1532J0515K003J5437
$$ -534 -2204 -4625 -3021 -2045 230 501 -1778 -4937 -3837 421 7076 18608 29123 31126 46563
10297D6563P5037J30474J72193J92538J81932J39172O9247m9422j27098j75417
$$ 46563 121600 252074 424267 616805 798737 937909 1007156 957734 830636 655219
10287F55219j91118j75624j37758F4218C0962o513n416m067k847n599a264m118
$$ 655219 464101 288477 150719 64218 30962 24449 19033 14966 12119 6520 -1264 -5382
10275e382J821a312j069n5L41n70j293j529K55R05N97a444b93r55o85r81J094
$$ -5382 -3561 -1312 -2381 -2436 -2095 -2665 -3958 -5487 -5232 -4327 -3730 -1444 -293 -1248 -1933 -2914 -1820
10258a820A437L045J702n00o60k081B7J32J872k33G15i30J70m793m140J795I78
$$ -1820 1437 4482 6184 5684 5024 2943 27 159 2031 1798 715 -930 -760 -5553 -9693 -7898 978
10240A1536R119Q047O147N231k379P773R332J5097J8301J7667J5736J4538J2296
$$ 11536 20655 28702 34849 40080 37701 45474 54806 69903 88204 105871 121607 136145 148441
10227A48441j0012q290r326j4923j9458k7495k7563D335d127D698J281k238a0
$$ 148441 138429 130139 120813 105890 86432 58937 31374 4335 -4127 4698 5979 3741 -10
10213c539k301J363a247A691J580j379g90j690n0i71A833J137N32k15L4M91J92
$$ -3539 -5840 -4477 -1247 1691 3271 1892 -790 -2480 -2530 -971 1833 2970 3502 3287 3321 3812 4004
10196D004M64K7q60G46b748a316G642Q836P303N328K987K35k974m731o468o712
$$ 4004 4468 4495 3635 746 -2748 -1316 7642 16478 23781 29109 32096 32331 29357 24626 18158 11446
10180A1446n676B805k30j64J10r01i7j470j566j381J224J130O88l63j026j762
$$ 11446 5770 2805 2575 2411 2521 1620 -97 -1567 -3133 -4514 -3290 -2160 -1472 -1835 -2861 -4623
10164d623J512N95l40q00J92J336N62l8n54o99j285J057a425b66C5a328j058J14
$$ -4623 -3111 -2516 -2856 -3656 -3464 -2128 -1566 -1604 -2158 -2857 -4142 -3085 -1425 -266 35 -1328 -2386 -2272
10146b272f12A601K811J504j897A606i2j774j384K64l2j305j18J895J126K91k91
$$ -2272 -612 1601 4412 5916 4019 1606 -92 -1866 -3250 -2986 -3018 -4323 -4441 -2546 -1420 -1129 -1420
10129a420j350j265j059J178L81l30k015J763b016f33j27j767l757K064a782J81
$$ -1420 -2770 -4035 -5094 -3916 -3535 -3865 -5880 -4117 -2016 -633 -760 -2527 -6284 -4220 -1782 -1601
10113a601j078p16a672B50J913J350P23R66k90k369b530n715J224K288J12e21
$$ -1601 -2679 -3395 -1672 250 2163 3513 4236 5202 4912 2543 -2530 -8245 -7021 -4733 -4621 -521
10096I730J2606J2007P757J411l198k550J004M775J1006J1089P877j82n171q704
$$ 9730 22336 34343 42100 43511 40313 37763 38767 43542 54548 65637 73514 73332 68161 59457
10082E9457j0182p279j775Q586J2498R389k516k5528H48J1690N5360N6221M9122
$$ 59457 49275 41996 40221 48807 61305 70694 68178 42650 848 12538 67898 124119 173241
10069A73241L3226Q162j9859l5601m1393m1086l2507B1850j0230l683B830f95
$$ 173241 206467 214629 194770 159169 117776 76690 44183 21850 11620 7937 2830 -695
10056b080k20d27C325L672K697Q74o00j590k967B510B29b060r12a201I24K392
$$ -2080 -2300 -427 3325 6997 9694 10568 9968 8378 5411 2510 229 -2060 -2972 -1201 924 3316
10040C316J829N72R0l55J5M13R59J875J519K10k443B940a856j52I60J059n36a796
$$ 3316 5145 5717 5807 5452 5467 5880 6839 8714 10233 10443 8000 2940 -1856 -2008 960 2019 1483 -1796
10021e319j451c144J268j86l69j082p58a153A4O58J03k53K23e17j361k541J099
$$ -5319 -6770 -3144 -1876 -2062 -2431 -3513 -4271 -1153 14 672 775 522 745 -517 -1878 -4419 -3320
10004c320P73j004k85j708b683A144K596J974J368m19r79B001N34e838b425J103
$$ -3320 -2547 -3551 -3836 -5544 -2683 1144 3740 5714 7082 6663 5684 2001 2535 -5838 -2425 -1322
9988a322N45j243k862k644b331A1167J3988J5424J7493J5455J0334K246o299j2685
$$ -1322 -777 -2020 -4882 -7526 -2331 11167 25155 40579 58072 73527 83861 86107 79808 67123
9974F7123j6958j9326A2418b554E42O653L519K92j795l185B581b8j127r01j328
$$ 67123 50165 30839 12418 -2554 542 7195 10714 11006 9211 6026 2581 -28 -1155 -2056 -3384
9959c384j401j075M01J700J030j94L3R8J31a280I32J969J987J574P76q6n34j636
$$ -3384 -4785 -5860 -5459 -3759 -2729 -2923 -2890 -2792 -2661 -1280 932 2901 4888 6462 7238 7152 6618 4982
9941D982k328d67l220q63J708O06Q79J9j185j111o79O7Q57J511h21k31q86j951
$$ 4982 2654 -467 -3687 -4550 -2842 -2236 -1357 -1338 -2523 -3634 -4313 -4246 -3389 -1878 -821 -1052 -1938 -3889
9923c889R7J307c51D07g30j622k4g12C49Q55O7j77m14l13b4n30r68o40J6N52M10
$$ -3889 -3792 -2485 -351 407 -730 -2352 -2376 -712 349 1204 1271 1094 680 367 -24 -554 -1522 -2162 -2146 -1594 -1184
9902a184m46l29j166P20b67I83P30K98m34m45P79k1p32n22g74j032K03P2O53a46
$$ -1184 -1630 -1959 -3125 -2405 -267 983 1713 2011 1577 1132 1911 1890 1158 636 -774 -1806 -1603 -1531 -878 -146
9881F44B52h45j501j623J90a541B88b3o18K04A828L318K365K624Q20j753l098
$$ 644 252 -845 -2346 -3969 -3779 -1541 288 -23 -641 -437 1828 5146 7511 10135 10955 9202 6104
9864F104k452J251K611R39j477l246A32a481j184j719m91J107J589J071Ok039
$$ 6104 3652 4903 7514 8453 6976 3730 132 -1481 -2665 -4384 -4875 -3768 -2179 -1108 -1102 -3141
9848c141k106K381C46J185D49b338O72J65B135L192Q51o99n57J869j970J837J277
$$ -3141 -5247 -2866 346 1531 449 -2338 -1666 -1501 2135 5327 6178 5479 4922 6791 4821 6658 7935
9831G935j322k440A27b983j798J976a204M03r75P8P60K99G90J924J381J514M28
$$ 7935 6613 4173 127 -2983 -4781 -2805 -1204 -801 -1776 -1698 -938 -639 790 2714 4095 5609 6037
9814F037o50K90O67J43r6p18j088j372l64j085B5b764l697J631a10D070J360j59
$$ 6037 5387 5677 6344 6487 6391 5673 4585 3213 2849 1764 25 -2764 -6461 -4830 -110 4070 5430 5271
9796E271j692H06b774l161A36R651J0242Q550N590Q75l116n912p082n796m359
$$ 5271 3579 806 -2774 -5935 136 9787 20029 28579 34169 35044 31928 26016 18934 13138 8779
9781H779l833B260b19k136j452r97J484a365K17k70p10j756j788a947f7A971K364
$$ 8779 4946 2260 -219 -2355 -3807 -4804 -3320 -1365 -1148 -1418 -2128 -3884 -5672 -1947 -67 1971 4335
9764D335n94A634a617j521a124d24D11Q19P97K3J949R36k245g67A158KQ64j88
$$ 4335 3741 1634 -1617 -3138 -1124 -424 411 1230 2027 2050 3999 4935 2690 -767 1158 1160 2024 1836
9746A836C42d31G9O15j77a65m92k91j089j03J72j163l093a250I549J2323J1142
$$ 1836 342 -431 79 694 517 -165 -657 -948 -2037 -2140 -1968 -3131 -6224 -1250 9549 21872 33014
9729C3014P456K332l656p892j1450G391e5B971M917J538j230k350k259j626b30
$$ 33014 40470 42802 39146 31254 19804 7391 -55 2971 7888 9426 8196 5846 3587 1961 -230
9713a692q71l8P24Q26J76o85j854k411J557g94A128J337l43I24a95j82E48L32
$$ -1692 -2563 -2601 -1877 -1051 -875 -1560 -3414 -5825 -4268 -794 1128 2465 2122 924 -195 -377 548 880
9695H80L86J7L85J01n54m62B08J4P24J161Q89M67R1q07A41b653q53g94A823J380
$$ 880 1266 1283 1668 1769 1215 753 208 222 946 2107 2996 3463 3554 2747 141 -2653 -3506 -794 1823 3203
9675C203l9r69G84g53j367o21L41h41H02J599J125L84n84A227a351k37c85B045
$$ 3203 3164 2195 784 -753 -2120 -2741 -2400 -841 802 2401 3526 3910 3326 1227 -1351 -1588 -385 2045
9656B918Q7j389d99k320j563O88R29J213f87L36l71o36m49k42K13P09g9A18h73
$$ 2918 3005 1616 -499 -2819 -4382 -3694 -2765 -1552 -687 -351 -722 -1358 -1807 -2049 -1836 -1127 -79 118 -873
9636b585j554k16J59L1b002A862L395L497J424kk061k915j586j169K28M44o39
$$ -2585 -4139 -4355 -4196 -4165 -2002 1862 5257 8754 10178 10176 8115 5200 3614 2445 2673 3117 2478
9619B478A004B38J66M54Q84o07a342l568J268h34I05N09o29c62A21K406K483J617
$$ 2478 1004 238 404 858 1742 1135 -1342 -4910 -3642 -834 905 1414 785 -362 121 2527 5010 6627
9601F627M79j916A977g65j134a86A026r5a19j245k18g16D47J537R32J122M85L3
$$ 6627 7106 5190 1977 -765 -1899 -186 1026 931 -119 -1364 -1582 -716 447 1984 2916 4038 4523 4556
9583D556m37r37j058E08a072c51A319O82p13c79k036j940j73k61K0J561O53j85
$$ 4556 4119 3182 2124 508 -1072 -351 1319 2001 1288 -379 -2415 -4355 -4528 -4789 -4769 -3208 -2555 -2740
9565b740Q8M95L07J77r27j057k45K24m33n63J973J024L07c41a43b5G49L66N26
$$ -2740 -2652 -2157 -1850 -1673 -2600 -3657 -3902 -3678 -4111 -4674 -2701 -1677 -1370 -341 -143 -25 749 1115 1641
9546A641N54L13G23a764k972k593b668G55j8a032j129j262L81c87B418Q25H96
$$ 1641 2195 2508 723 -1764 -4736 -7329 -2668 755 737 -1032 -2161 -3423 -3042 -387 2418 3243 896
9528b020o69p88m101L056G315J7433J4135P820L52j6490H042K6641N1003M9994
$$ -2020 -2689 -3477 -7578 -4522 7315 24748 38883 46703 47055 30565 8042 34683 85686 135680
9514A35680M8642L9572J8978r314k4921l6176m0056l9553l4667k6261j2354m842
$$ 135680 184322 223894 242872 233558 208637 172461 132405 92852 58185 31924 19570 14728
9502A4728l803C005h177j18L182a634d60j411k273l025l03c415A685M365K383
$$ 14728 10925 3005 -8177 -8295 -5113 -1634 -460 -1871 -4144 -7169 -7472 -3415 1685 6050 8433
9487H433j679A603b067j69d20B968J697Q22j924a52m326a393F588M965K710K025
$$ 8433 6754 1603 -2067 -2236 -420 2968 4665 5487 3563 -152 -4478 -1393 6588 11553 14263 16288
9471A6288q89O30J4329O168K125k63m381k423N93j1686p640D415a893m344L58
$$ 16288 15399 16029 30358 36526 38651 38388 34007 31584 32177 20491 12851 4415 -1893 -6237 -5879
9456e879Q65K45J808A473O579Q028P590P221P815N157O14k208o172r076j0809
$$ -5879 -5014 -4769 -2961 1473 8052 16080 23670 30891 38706 43863 44477 42269 36097 27021 16212
9441A6212F659a295m108b684K04p92o58L22P18%j150j610J912e93B654q54c975
$$ 16212 6659 -1295 -5403 -2684 -2480 -3272 -3930 -3608 -2890 -2890 -4040 -5650 -3738 -593 2654 1800 -3975
9423i358p782g884a996A451a373B829J2968J2182Q261K3904N2592j0691K85359
$$ -9358 -17140 -7884 -1996 1451 -1373 2829 15797 27979 36240 60144 112736 102045 387404
9410C87404J63392J54593J19774N7039m4065j04380j45235j60636j50317j24017
$$ 387404 550796 705389 825163 882202 838137 733757 588522 427886 277569 153552
9400A53552G1674C1067A4784C676d561E91N680k0l091Ib876j639j536o39L078
$$ 153552 71674 31067 14784 3676 -4561 591 6271 6251 3160 9 -2876 -4515 -6051 -6690 -3612
9385c612J598J32P64b2D95K6a63q59R9k97j196j495k197L98J464J306R04M13O
$$ -3612 -2014 -1882 -1118 -22 495 521 -163 -1022 -923 -1220 -2416 -3911 -6108 -5710 -4246 -2940 -2036 -1623 -1617
9366a617J85M29l71r41j562m05J631J270M37m41p72j303m02J454Q88L88j92r15
$$ -1617 -1432 -1003 -1374 -2315 -3877 -4282 -2651 -1381 -944 -1385 -2157 -3460 -3862 -2408 -1520 -1132 -1324 -2239
9348b239j270j350r35J165K074a67F29i0m70o53o78r75o80n22k44M50J182d95
$$ -2239 -3509 -4859 -5794 -4629 -2555 -167 629 -90 -560 -1213 -1891 -2866 -3546 -4068 -4312 -3862 -2680 -495
9329A333R13o9j069g70j819J33g49C40N10l81a038j811j139j87R10N44L46J62
$$ 1333 2246 2177 1108 -770 -2589 -2456 -749 340 850 469 -1038 -2849 -3988 -4175 -3265 -2721 -2375 -2213
9311b213l64r54j124n43M22Q46J142J358b75A80M86R68J523K251L262L084K025
$$ -2213 -2577 -3531 -4655 -5198 -4776 -3930 -2788 -1430 -275 180 666 1634 3157 5408 8670 11754 13779
9294A3779N95j664l623l873A837B34g37j480j652q17J275J543g95K70l60p12j242
$$ 13779 14374 12710 9087 5214 1837 234 -737 -2217 -3869 -4686 -3411 -1868 -795 -525 -885 -1597 -2839
9277b839j267j565J154b124c44A104R92L13p91C89a282j168p63m72P63K16J020
$$ -2839 -4106 -5671 -4517 -2124 -344 1104 2096 2409 1618 389 -1282 -2450 -3213 -3685 -2922 -2706 -1686
9260a686L94r3o34j045q07k24j050J229R07J149h82m93j563j867O13J765Q38m40
$$ -1686 -1292 -1385 -2019 -3064 -3871 -4095 -5145 -3916 -3009 -1860 -882 -1375 -2938 -4805 -4192 -2427 -1589 -2029
9242b029j225k429k78J990J372J07j151N30f37B298J308o84B7d671K023B325L824
$$ -2029 -3254 -5683 -5961 -3971 -2599 -2492 -3643 -3113 -637 2298 3606 2922 27 -4671 -2648 2325 6149
9225F149J692m66k287B135a701j590J244F21J693Q83O7j191a44k333l137K08J453
$$ 6149 7841 7375 5088 2135 -1701 -3291 -2047 621 2314 3197 3264 2073 -144 -2477 -5614 -5406 -3953
9208c953K88a496A424J631J259q70O89a86k502j4261c606A504j28m26a545k805
$$ -3953 -3665 -1496 1424 3055 4314 3444 4133 -186 -2688 -16949 -3606 1504 1376 950 -1545 -4350
9192d350a941R31j27j224p0J49O17O91k742o937j22J962J359m1J919K190a581
$$ -4350 -1941 -1010 -1137 -2361 -2431 -2282 -1665 -974 -3716 -10653 -10775 -8813 -7454 -7495 -5576 -3386 -1581
9174a357q71r30K99R52i30A08Rc56r60o62r2L43L5j48M75a79A046P06j67A70a373
$$ -1357 -2228 -3158 -2859 -1907 -930 108 117 -356 -1316 -1978 -2070 -1727 -1692 -1840 -1365 -179 1046 1752 1585 170 -1373
9152b674j48N21n28r19j59J247Q47N7K98L66L26L8j6q10j205l18N77J241b5A006
$$ -2674 -2822 -2301 -2829 -3748 -3907 -2660 -1813 -1756 -1458 -1092 -766 -728 -744 -1554 -2759 -3077 -2500 -1259 -25 1006
9131A008m40a9j140m01o34o65O38g53F92J307O74j68o84C88b141l016K539C0K332
$$ 1008 568 -19 -1159 -1560 -2194 -2859 -2221 -753 692 1999 2673 2505 1821 388 -2141 -5157 -2618 30 2362
9112B362J861P04q66j356b18l129J547A267J666P78m35j542a185j680a374C70
$$ 2362 4223 4927 4061 2705 -218 -3347 -1800 1267 2933 3711 3276 1734 -1185 -2865 -1374 370
9095F46n6j26k23e37j044j040p72j008m10l25R43J288a128A009J194O4G36a162
$$ 646 590 464 241 -537 -1581 -2621 -3393 -4401 -4811 -5136 -4193 -2905 -1128 1009 2203 2267 736 -1162
9076a393c43F98l1A36b84k44o74m77q82l51M23R04M90l91j143r53m19L49J84j63
$$ -1393 -343 698 667 136 -284 -528 -1202 -1679 -2561 -2912 -2489 -1585 -1095 -1486 -2629 -3582 -4001 -3652 -3468 -3631
9056c631p87j102O50J012J319a040d68k19o09l81j51N50c26D80J30b91j393j470
$$ -3631 -4418 -5520 -4870 -3858 -2539 -1040 -468 -687 -1296 -1677 -1828 -1278 -326 480 610 -291 -1684 -3154
9038c154r21K13N79Q35R70M57k67j109j826j574J085J989a209m2j006j503Q10
$$ -3154 -4075 -3862 -3283 -2448 -1478 -1021 -1288 -2397 -4223 -5797 -4712 -2723 -1209 -1251 -2257 -3760 -2950
9021b950J222e52F15P75N40L84j94p20D67b07k30j78l69r15j632j338q21J76O71
$$ -2950 -1728 -552 615 1390 1930 2314 2120 1400 467 -207 -437 -615 -984 -1899 -3531 -4869 -5690 -5514 -4843
9002d843N17l48L64J534a123b63m31j692k750k621l9L397a688A72Q70J03k50C92
$$ -4843 -4326 -4674 -4310 -2776 -1123 -263 -694 -2386 -5136 -7757 -7796 -4399 -1688 172 1042 1145 895 392
8983a12A92J171J810Q88J99j513a11m095J798A086K230O82o14A189a924j835J455
$$ -112 192 1363 3173 4061 4260 2747 -111 -4206 -2408 1086 3316 3998 3384 1189 -1924 -3759 -2304
8966b304N92k23j015r60a644A7Q56J17L5J00K29O25M04K78k36q60a28j420o5b63
$$ -2304 -1712 -1935 -2950 -3910 -1644 17 873 990 1025 1125 1354 1979 2383 2661 2425 1565 -128 -1548 -1613 -263
8945I17Q00J70n41A06c21A200K446K627J071q36k047A870f54j019j70Q0j34o28
$$ 917 1717 1887 1346 106 -321 1200 3646 6273 7344 6508 4461 1870 -654 -1673 -1843 -1763 -1897 -2525
8927b525j001j200L62J513J123M89q70j520j127O72R68J062g95A00J48i41k083
$$ -2525 -3526 -4726 -4364 -2851 -1728 -1239 -2109 -3629 -4756 -4084 -3116 -2054 -795 100 248 -941 -3024
8910c024j720J246J372Q18N31l3m43j025j115J013M35l91k79P93g90F04R11L88
$$ -3024 -4744 -3498 -2126 -1308 -777 -810 -1253 -2278 -3393 -2380 -1945 -2336 -2615 -1822 -790 604 1515 1903
8892A903J67m5R4O68Q15Q79N16J62n09q76j721c09j954N02C81K046J743J157L47
$$ 1903 2070 2025 2119 2787 3602 4481 4997 5159 4650 3774 2053 -309 -2263 -1761 381 2427 4170 5327 5674
8873E674p29j282j375I65E0e96n44m66m71k18N05j74r32j446q16a617A087J641
$$ 5674 4945 3663 2288 965 50 -596 -1140 -1606 -2077 -2295 -1790 -1964 -2896 -4342 -5158 -1617 1087 2728
8855B728L64r07I89c08j218j407j905r27K063j78m42J029f03A679M32q74g20k833
$$ 2728 3092 2185 989 -308 -1526 -2933 -4838 -5765 -3702 -3880 -4322 -3293 -603 1679 2111 1237 -720 -3553
8837c553k308J21P52M03P27J024N18O39Q20a15F9e22j134r94p45k71J087d58A111
$$ -3553 -5861 -5740 -4988 -4585 -3858 -2834 -2316 -1677 -857 -115 69 -522 -1656 -2650 -3395 -3666 -2579 -458 1111
8817A812rp29B51e47n82jL27K0n12j009r06o49q94o87J957a521M23p26k213K81
$$ 1812 1803 1074 251 -547 -1129 -1130 -803 -783 -1295 -2304 -3210 -3859 -4753 -5440 -3483 -1521 -1098 -1824 -4037 -3756
8797c756i79I83J096j80C18h22m78k40N92C15K023K765J279n38k045A201b807
$$ -3756 -979 983 2079 1899 318 -822 -1300 -1540 -948 315 2338 5103 6382 5844 3799 1201 -2807
8779d219a368B525N439L498J050k057m219d96n469a917a52B999K251K313L383
$$ -4219 -1368 2525 7964 11462 12512 10455 6236 -496 -5965 -1917 -152 2999 5250 7563 10946
8764A0946L067P96k593n896A480E76R7i72m269j823J189P08j015j67J194m77l755
$$ 10946 14013 14809 12216 6320 1480 576 673 -972 -5241 -7064 -5875 -5167 -6182 -6349 -5155 -5632 -9387
8747i387k326m93n42k611k790K557K762K691D275d115k37l020H630K2833J5134
$$ -9387 -11713 -12206 -12748 -15359 -18149 -15592 -12830 -10139 4275 -4115 -4352 -7372 8630 31463 46597
8732D6597k031j0099j6331n60K5996K7506L0248R515L5551n950l9998m7917J846
$$ 46597 44566 34467 18136 17576 43572 71078 101326 110841 146392 140442 100444 52527 54373
8719E4373M4138J1789J2545K1957J7876R455r72l8569o252k6604j1514k7803k5635
$$ 54373 98511 110300 122845 144802 162678 172133 171161 132592 126340 99736 88222 60419 34784
8706C4784C211b0853D178J8729N426J789k031L10k987l655J048K756C687P809
$$ 34784 3211 -20853 4178 22907 28333 30122 28091 28401 25414 21759 22807 25563 3687 11496
8692A1496d106n262m401j05M874a518l263K153C97J507N17k2L25P21N42N35L39
$$ 11496 -4106 -9368 -13769 -13874 -9000 -1518 -4781 -2628 397 1904 2421 2399 2724 3445 3987 4522 4861
8675D861l79j112A177E84K110J200A643b212A696Q478O202O854K0865L8805M6113
$$ 4861 4482 3370 1177 584 2694 3894 1643 -2212 1696 10174 16376 23230 44095 82900 129013
8660A29013L8632K7696L175p882j1005n6983m6593l6416A7574P69K88n134m737
$$ 129013 167645 195341 198516 190634 179629 122646 76053 39637 17574 18343 18631 13497 8760
8647H760j73J94l121a67l116e6A644b91m832l297M176h15B246K096J26j252H29
$$ 8760 8587 8781 5660 -167 -3283 -56 1644 -291 -5123 -8420 -4244 -815 2246 4342 4468 3216 829
8629a054j129k97N29g45C92M74B13a003j841j678J32L05j186R3J868J377j37j556
$$ -1054 -2183 -2480 -1951 -745 392 866 213 -1003 -2844 -4522 -4390 -4085 -5271 -5178 -3310 -1933 -2070 -3626
8611c626j74d69A944L18o88j94J659K010J022r99A400b117j747o1N23R10d03G71
$$ -3626 -3800 -469 1944 2262 1574 1380 3039 5049 6071 5072 1400 -2117 -3864 -3925 -3402 -2492 -403 771
8592a59k305k969b701F63K375Q74l93j249b9n23i7J4j159k421k682O59K111a592
$$ -159 -2464 -5433 -2701 663 3038 3912 3519 2270 -29 -552 -97 -83 -1242 -3663 -6345 -5686 -3575 -1592
8573c89A11Kl3N85M45L55P73R91m29j369C51a098j882j825J599g26I65k4d28j700
$$ -389 111 113 80 665 1110 1465 2238 3229 2800 1431 351 -1098 -2980 -4805 -3206 -726 965 941 -428 -2128
8553b128j033l28m0O80Q58M97J32O10F9K16m4R7Q29J93o60a331k004M11a270N61
$$ -2128 -3161 -3489 -3529 -2849 -1991 -1494 -1362 -752 69 285 241 338 1167 1360 700 -1331 -3335 -2924 -1270 -709
8533g09j077k161j40J307J268m84j712l19J364g19B50b44o35m94j218j721J795
$$ -709 -1786 -3947 -4087 -2780 -1512 -1996 -3708 -4027 -2663 -719 250 -244 -879 -1373 -2591 -4312 -2517
8516b517D1P17h7j131j086k428J602j263J375a077F4P04k86b73n37Q4b82B25M89
$$ -2517 41 758 -87 -1218 -2304 -4732 -3130 -4393 -3018 -1077 64 768 482 -273 -810 -726 -282 225 714
8497G14L40A11b406k457R97a177A761J789N77n73j438q29P60J056m90H98J41L689
$$ 714 1054 111 -2406 -4863 -3866 -1177 1761 3550 4127 3554 2116 1287 2047 3103 2613 898 1039 4728
8479D728N231L713J872q77l288l935l089n6R94K72j308j959i6k041j47L19J58
$$ 4728 9959 13672 15544 14667 11379 7444 4355 4299 5293 5565 4257 2298 -96 -2137 -2284 -1965 -1807
8462a807Q83J50r88k381k468K820h56A76g68k476k355K780a254L80d28A304J096
$$ -1807 -924 -774 -1762 -4143 -6611 -3791 -856 176 -768 -3244 -5599 -2819 -1254 -874 -428 1304 2400
8445B400m03E90a7G75R26j49A91b450l268j351J823J504l99j110j944j325K687
$$ 2400 1997 590 -17 775 1701 1552 191 -2450 -5718 -7069 -5246 -3742 -4141 -5251 -7195 -8520 -5833
8428e833J883Q68j16m75N13J415d40A043J185N80n10I11d82r72e79A62g46j123
$$ -5833 -3950 -3082 -3198 -3673 -3160 -1745 -440 1043 2228 2808 2298 911 -482 -1454 -579 162 -746 -1869
8410a869j808k036j032L087a127l96j031j15e73H10O51E31A54i00l039K13D58
$$ -1869 -3677 -5713 -6745 -3658 -1127 -1523 -2554 -2669 -573 810 1461 531 154 -900 -3939 -3726 458
8392F441M101O80l469A318c380P88A014K111K122K387K975J328n46N88K700Q646
$$ 6441 10542 11222 7753 1318 -3380 -2592 1014 3125 5247 7634 10609 11937 11391 11979 14679 23325
8376B3325M414J822l08L471P441J0329Q976Q603J3752K1316K9783L5325L7691
$$ 23325 27739 29561 29253 32724 40165 50494 59470 68073 81825 103141 132924 168249 205940
8363B05940L9797L9832L6980K8899J5494k060k1596l7451m6652m5619l6832k7996
$$ 205940 245737 285569 322549 351448 366942 364882 343286 305835 259183 213564 176732 148736
8351A48736k0288j7877j8995j9724j6101j2332j7995A1825n62k52O227N906K041
$$ 148736 128448 110571 91576 71852 55751 43419 25424 11825 11263 11011 17238 23144 25185
8338B5185l525r551A931b393a88D908K815r19k512A999m96R9G35a296k035a149
$$ 25185 21660 12109 1931 -2393 -188 4908 7723 6804 4292 1999 1503 1602 735 -1296 -3331 -1149
8321B494K823q46A442a032B08J044g05m262L1i61A972K251J413M86l051i17k331
$$ 2494 5317 4471 1442 -1032 208 1252 -705 -4967 -4936 -961 1972 4223 5636 6122 3071 -917 -3248
8304c248f47A110e91n276K874E16J838q97d41l928j029e97A832n45a152k202j076
$$ -3248 -647 1110 -591 -5867 -2993 516 2354 1457 -441 -4369 -5398 -597 1832 1287 -1152 -3354 -4430
8287d430j172J690a249B430K148oj936b00k650q71J411E59K076M48j097f30k455
$$ -4430 -5602 -3912 -1249 2430 4578 4572 2636 -200 -2850 -3721 -2310 559 2635 3083 1986 -630 -3085
8270c085j246l93R48a672F35J623l9D77b157n19g72I43J13k37N80m41c7j569j310
$$ -3085 -4331 -4724 -3776 -1672 635 2258 2219 477 -2157 -2676 -772 943 1056 819 1399 958 -37 -1606 -2916
8251b916J178F22J763n41d28l955k089a747B073K642p63A522b124k635r28J70
$$ -2916 -1738 622 2385 1844 -428 -4383 -6472 -1747 2073 4715 3952 1522 -2124 -4759 -5687 -5517
8235e517p44Q24K700a32A477O66m49a103n893e56A1958J4561J3746J1101N854
$$ -5517 -6261 -5437 -2737 -132 1477 2143 1694 -1103 -6996 -556 11958 26519 40265 51366 57220
8220E7220N7n157q133r453q757o218l461m79K497L946K113q85l158k104K415l817
$$ 57220 57277 52120 43987 34534 25777 19559 16098 15619 18116 22062 24175 23290 20132 18028 20443 16626
8204A6626L591M782L340k314q128E925d365c98I866Q057L943o72m049n276m940
$$ 16626 20217 24999 28339 26025 17897 5925 -4365 -398 9866 17923 21866 21194 17145 11869 6929
8189F929B674D27i59M20A793J444j133a972l704a928b6q89l757J045i7F230Q502
$$ 6929 2674 427 -959 -539 1793 3237 2104 -1972 -5676 -1928 -26 -915 -4672 -3627 -97 6230 14732
8172A4732P911O690M355K945Q08j210k573l850m395o340p247C527d755J327A701
$$ 14732 22643 29333 33688 36633 37441 36231 33658 29808 25413 19073 11826 3527 -4755 -3428 1701
8156C292A389b016l709m20p72k254d024B472O041N476M752L392L805M058M388
$$ 3292 1389 -2016 -5725 -6145 -6917 -9171 -4024 2472 8513 13989 18741 22133 25938 29996 34384
8141C4384M858L849J145k856o805j0190j1713B148a152B246J168j380c57o79K85
$$ 34384 39242 43091 44236 41380 34575 24385 12672 2148 -1152 2246 3414 2034 -357 -1036 -751
8126g51m9J07j77k48c43B809K734J066j718k176A239j96C22a726Q62D206M837
$$ -751 -800 -693 -870 -1118 -343 2809 5543 6609 4891 2715 1239 1043 322 -1726 -864 4206 9043
8109I043L058J023j252j540k029k718k260l49J694K779L997M400M247M814L477
$$ 9043 12101 13124 11872 10332 8303 5585 3325 2976 4670 7449 11446 15846 20093 24907 28384
8094B8384L093L358Q71j030n492n202m346n237D432A425O569Q965P268M209J097
$$ 28384 31477 34835 35706 34676 29184 23982 19636 14399 4432 1425 7994 16959 24227 28436 29533
8079B9533l638o493l934k419p07k254l552B758F86J151L980L327J028L39M873
$$ 29533 25895 19402 15468 13049 12342 10088 6536 2758 686 1837 5817 9144 10172 10511 15384
8064A5384O826J324p445F819J3379L2278K8615K7213L8417O8520R5683J04945
$$ 15384 22210 23534 16089 6819 20198 52476 81091 108304 146721 215241 310924 415869
8052D15869R1039N7096P669m5845q3275j01965j01948q2707n6487l2999k4500
$$ 415869 506908 564004 571673 525828 442553 340588 238640 155933 99446 66447 41947
8041D1947j9591r459N023O666K433j474m549n513n184l555O05L179K103N352J0910
$$ 41947 22356 12897 17920 24586 27019 25545 20996 15483 10299 6744 7349 10528 12631 17983 28893
8026B8893J1627P344L738j200j795j350J120m026r325j0011k902K876M76m782
$$ 28893 40520 47864 51602 50402 48607 47257 48377 44351 35026 25015 22113 24989 25465 20683
8012B0683n600k225K058P492J2981R346p43n924O16J3983J4585J7312K7557L5210
$$ 20683 15083 12858 14916 22408 35389 44735 43992 38068 38684 52667 67252 84564 112121 147331
7998A47331L9159O0860J19215J96979K45914K49617K03975J08724j6516j26930
$$ 147331 186490 247350 366565 563544 809458 1059075 1263050 1371774 1355258 1228328
7988A228328k11343k49344k40896j98226j43146q8683j0369M9207M5718K0198
$$ 1228328 1016985 767641 526745 328519 185373 96690 86321 135528 181246 201444
7978B01444q337k8817l6262l2134k2719j7104j3718q013l788j871k230j734m611
$$ 201444 193107 164290 128028 95894 73175 56071 42353 34340 30552 28681 26451 24717 20106
7965B0106o279o131k302j24Q93M56k112A264b178m08D00L50b07m733J557A406
$$ 20106 13827 7696 5394 5270 6163 6619 4507 1264 -2178 -2586 400 750 -207 -4940 -3383 1406
7948A583a973k837I53O239L59G90A00c867Q37B931f40B123K79m27O163K1125L2549
$$ 1583 -1973 -4810 953 7192 7551 790 100 -3867 -3030 2931 -640 2123 2402 1975 8138 29263 61812
7931F1812L7047L0651K1406p889k3722j5852k1643l4844A5199c723C691L318k609
$$ 61812 98859 129510 150916 143027 119305 103453 81810 46966 15199 -3723 3691 7009 4400
7918D400c39n156l965M293H62L851j20j852j35J477m41b72q741d348C540L856
$$ 4400 -339 -5495 -9460 -5167 862 4713 4593 2741 2606 4083 3642 -272 -9013 -4348 3540 7396
7902G396r48E64f858l885M952a195j220l347o00C45K635J174N564j412B728I17
$$ 7396 6448 564 -6858 -10743 -5791 -1195 -2415 -5762 -6362 345 2980 4154 9718 8306 2728 917
7885A664Q307K196J0603O606P824P075K571l855r837A0149h026K758G526J1561
$$ 1664 9971 12167 22770 29376 37200 44275 46846 42991 33154 10149 -8026 -5268 7526 19087
7871A9087R058L126m136q351H769C340P45K914L11k099B076I59e373M19l200o78
$$ 19087 28145 31271 27135 18784 8769 3340 4085 6999 7310 5211 2076 959 -5373 -4954 -8154 -8832
7855h832A244c202l043J690A046M991P513O344R370O145J191l845o108j0530R010
$$ -8832 1244 -3202 -6245 -4555 1046 6037 13550 19894 29264 35409 36600 32755 26647 16117 25127
7840B5127J607j810j535n14j61M96l055k230m159Q2r08E571P615l207j623c990
$$ 25127 26734 24924 23389 22875 22714 23210 20155 17925 13766 13848 12940 5571 13186 9979 8356 -3990
7823g997j139n22b562D787O008O047P535J1660R025J0627K7739L9392M4418L8601
$$ -7997 -9136 -9658 -2562 4787 10795 16842 24377 36037 45062 55689 83428 122820 167238 205839
7809B05839K4051K785j8721l0224l9800m1999l7630k8596j6669p418k187k88K202
$$ 205839 229890 232675 213954 183730 143930 101931 64301 35705 19036 11618 9431 9143 11345
7796A1345M971N121L934Q1j788p56J911R6l07j951q333a007j0768j0993M432O642
$$ 11345 16316 21437 25371 25452 23664 22908 24819 24915 24608 22657 14324 -1007 -11775 -22768 -18336 -11694
7780a1694C532J5924k316D056a002j5645c729j157G315J4722R931O56k01R80R489
$$ -11694 3532 19456 17140 4056 -1002 -16647 -3729 -4886 7315 22037 31968 32624 32423 33403 42892
7765D2892M910p560p786q306j1267K3566K7884K4400J4554k543j8445C9989A3082
$$ 42892 47802 40242 32456 24150 12883 36449 64333 88733 103287 100744 82299 39989 13082
7751f01q555n163J995N170K082o8k400l839m81d695G59L171J779j203r43J265
$$ -601 -9156 -14319 -12324 -7154 -5072 -5140 -7540 -11379 -11860 -4695 759 3930 5709 4506 3563 4828
7735D828n98h46k307A025P196O936J721l645F383b577n951l85K791Q37j286b047
$$ 4828 4230 -846 -3153 1025 8221 15157 16878 13233 6383 -2577 -8528 -8913 -6122 -5285 -6571 -2047
7718E862M653K624k522l698p19p67G37f159c28F752K638R55Q81J224o36k382k333
$$ 5862 10515 13139 10617 6919 6200 5433 737 -6159 -328 6752 9390 10345 11226 12450 11814 9432 7099
7701G099j422p76M01k66O94Q81K231R60j777l750m94O217L254j309k478J165K934
$$ 7099 5677 4901 5302 5036 5730 6611 8842 9802 8025 4275 3781 9998 13252 11943 9465 10630 13564
7684A3564K25P96K259K287L692K203K556j520n516k490L96J354k318k721K068
$$ 13564 13789 14585 16844 19131 22823 25026 27582 26062 20546 18056 18452 19806 17488 14767 16835
7669A6835L903O221M539P308L537K126O575R560O823J629m149j0215j9929D034
$$ 16835 20738 26959 31498 38806 42343 44469 51044 60604 67427 69056 64907 54692 34763 4034
7654a1419B2378K5995J9578K4440K0055l108k1277q170J4724L6715J3070Q167
$$ -11419 22378 48373 67951 92391 112446 109338 88061 79891 94615 131330 144400 152567
7642A52567K8200L5377j818l0812J2237O0339J9580M3483J52646K02495J34394
$$ 152567 180767 216144 214326 183514 195751 256090 275670 319153 471799 674294 808688
7631H08688J10949M00356J008013J414000J638425J640762J421312R97713L36340
$$ 808688 919637 1319993 2328006 3742006 5380431 7021193 8442505 9440218 9776558
7622I776558n76628j124029j498193j665399j609377j334377q73714k33849n2991
$$ 9776558 9199930 8075901 6577708 4912309 3302932 1968555 1094841 860992 808001
7613H08001j35049k05498j03944k4956k9620p1217m6402l055q69k9770j7865k623
$$ 808001 672952 467454 363510 338554 308934 237717 191315 188260 187391 157621 139756 137133
7601A37133K441q523j0202n724r187k4357l7484A8434J3541K8742K2424J1436
$$ 137133 139574 131051 120849 115125 105938 81581 44097 18434 31975 60717 83141 94577
7589I4577n46p702o131o790j2496j9183j2043Q874J6130R652K236p3k296k730
$$ 94577 94031 86329 80198 73408 60912 41729 29686 38560 54690 64342 66578 66505 64209 61479
7575F1479K543J5222J7494N326j0506j8449p777J839j5677D292P8096J25748J36528
$$ 61479 64022 79244 96738 102064 91558 73109 65332 67171 51494 4292 82388 208136 344664
7562C44664J21844Q4103K8042l3925q6253j19701j24584r4763l6488j892o324
$$ 344664 466508 550611 578653 544728 458475 338774 214190 119427 82939 81047 74723
7551G4723j0676l457l406o104P58J2511J0721l098j8217k0802R528L2541L1704
$$ 74723 64047 60590 57184 51080 51838 64349 75070 71972 53755 32953 42481 75022 106726
7538A06726K5852K0206J2255j73j3393k8800l5125l0189j7330j2124A2837l800
$$ 106726 132578 152784 165039 164866 151473 122673 87548 57359 40029 27905 12837 9037
7526I037J1533N825l925n058R37j126m816l348J989E313b57F713J8071J3623K672
$$ 9037 20570 26395 22470 17412 18349 17223 12407 9059 11048 5313 -257 6713 24784 38407 41079
7511D1079m678o047o40L319N601M629j711o508p876l632p570E969L425J1604K268
$$ 41079 36401 30354 29714 33033 38634 43263 41552 35044 27168 23536 15966 5969 9394 20998 23266
7496B3266q327F70J631J0856K207k516P885P182l339j2237m199J3009Q872j642
$$ 23266 14939 670 2301 13157 15364 12848 20733 27915 24576 12339 8140 21149 30021 28379
7482B8379n800m579j830N466J2057R715n83r476o387O06j530q901l832O311K63
$$ 28379 22579 18000 16170 21636 33693 43408 42825 33349 26962 27568 26038 17137 13305 19616 19879
7467A9879r448l369J0603L466q376D745N932L534l232R240J8892P772q845j7838
$$ 19879 10431 7062 17665 21131 12755 4745 10677 14211 10979 20219 39111 46883 38038 20200
7453B0200r953M00l178O313J7438P996o275J433K3788J9245k055k2407j8920J3023
$$ 20200 10247 10647 7469 13782 31220 39216 32941 34374 58162 77407 75352 52945 34025 47048
7439D7048J8369P377K3m222j1753j7371q793L257n18p752K088R839K823j757P011
$$ 47048 65417 72794 72817 68595 56842 39471 30678 33935 33417 25665 27753 37592 40415 38658 45669
7424D5669o78j2687o545K4109K0618k796k2545A6436E170J7227R841j620L618
$$ 45669 44991 32304 25759 49868 70486 67690 45145 16436 5170 22397 32238 30618 34236
7411C4236K4503L3736L0877R449k1636m9993B3636K8811J7593j4227k5529J1712
$$ 34236 58739 92475 123352 132801 111165 61172 23636 52447 70040 55813 30284 41996
7399D1996J2928j2212j0178K8848J9894j0879j7673J8165J9276j5839B7220r61
$$ 41996 54924 42712 32534 61382 81276 70397 52724 70889 90165 74326 27220 26259
7387B6259L8483J0329m017J3771J4159j5768l6587J5538L4988m352l8587K792
$$ 26259 64742 75071 71054 84825 98984 83216 46629 62167 97155 92803 54216 57008
7375E7008L9245L102l7774r968M0812N808m3441k2734N4178K0599k0357p24L3601
$$ 57008 96253 99355 61581 51613 92425 98233 54792 32058 86236 106835 86478 85754 119355
7362A19355k106E6203k3425P5459K4357m1255k4598O4806K8459m0743l6636O4404
$$ 119355 117249 56203 32778 108237 132594 91339 66741 131547 160006 119263 82627 147031
7350A47031L9403m0693n8707O7904N7693k6126o0247L9715N3029m2852D5874K4270
$$ 147031 186434 145741 87034 154938 212631 186505 126258 165973 219002 176150 45874 70144
7338G0144R0018j2026k2306J08223P5918n2151A23337P8559J27554j3402j17752
$$ 70144 160162 148136 125830 234053 309971 257820 123337 201896 329450 316048 198296
7327A98296M2351J27956j4974j56997M0184J81150R233j67882J5753K19452K8155
$$ 198296 240647 368603 353629 196632 236816 417966 427199 259317 275070 494522 522677
7316E22677k03441m3571K66552M4794k09404j4036L30650J00737k47155q8038
$$ 522677 319236 275665 542217 587011 377607 363571 694221 794958 547803 459765
7306D59765M26173J65355l05928k23421N41646K89883l28773l07573P08197M26567
$$ 459765 885938 1051293 745365 521944 1063590 1353473 1024700 717127 1425324 1851891
7296A851891l99358m58447J033340P67827m37882q25292J395767J332714m86876
$$ 1851891 1452533 994086 2027426 2795253 2357371 1532079 2927846 4260560 3773684
7287C773684j356314K481003K799018k50851k327810M969447P331286J487927
$$ 3773684 2417370 4898373 7697391 7446540 5118730 10088177 17419463 18907390
7279A8907390l776061K1338640M6935745N9169725N9696140M7518496K4580906
$$ 18907390 15131329 36469969 83405714 142575439 202271579 249790075 274370981
7272B74370981m158534l1932801n2289587o0960482n7030105B6233944j1179683
$$ 274370981 270212447 238279646 185990059 125029577 67999472 26233944 15054261
7265A5054261M401632l624458p910623k778002K531788o35602l107664j269196
$$ 15054261 19455893 15831435 7920812 5142810 7674598 7038996 3931332 2662136
7257B662136J491248j00826j669585q96121R92059R6621r56811o08588O89135
$$ 2662136 4153384 4052558 2382973 1486852 2478911 2575532 1618721 1010133 1699268
7248A699268J40413o38403n24019N03556J78990m18306m41863L36347J65097k89027
$$ 1699268 1839681 1201278 677259 1180815 1359805 941499 499636 835983 1001080 712053
7238G12053C49642K72315J71550j91125k95103J67813J42856j43158B34796J47041
$$ 712053 349642 621957 793507 602382 307279 475092 617948 474790 234796 381837
7228C81837J50432r4118A97963O3613J42718n3852j57616P8352J28844m2407j72814
$$ 381837 532269 438151 197963 261576 404294 350442 192826 271178 400022 357615 184801
7217A84801M370J33564j0510j41543M9826K26680J57373N8355j6840n0715n6171
$$ 184801 189171 322735 312225 170682 220508 447188 604561 662916 646076 595361 539190
7206E39190l4568j6458m7069j15752A53098p1731R8350K1604q1935m6615J01264
$$ 539190 504622 488164 441095 325343 153098 81367 179717 201321 119386 72771 174035
7195A74035M3558n4867p4675M9961L8840n6015A2348J12506O8032m1485m5390
$$ 174035 217593 162726 88051 138012 176852 120837 12348 124854 192886 151401 106011
7184A06011Q3766Q1796m4543H1025O7810J27428k5881A12491O3357J62100J7652
$$ 106011 189777 271573 227030 81025 148835 276263 250382 112491 175848 337948 355600
7173C55600j49448J4930J39836K5354A81471M1970K57553L0860B45853J9389L75424
$$ 355600 206152 221082 360918 386272 181471 223441 480994 511854 245853 265242 640666
7162F40666J22002k66477j20287M40604J47698l77716j72826P45193K89919m76432
$$ 640666 762668 496191 375904 816508 964206 586490 413664 1158857 1448776 972344
7152I72344l02840J032045N40157p43596m52230K035580J204177j078859l93853
$$ 972344 669504 1701549 2241706 1498110 1045880 3081460 4285637 3206778 2812925
7143B812925M778998M121861j304717l291545J7352802L0892432L6718786L5344322
$$ 2812925 7591923 11713784 10409067 7117522 24470324 55362756 92081542 127425864
7135A27425864K6389005J1434144o130442k2195716l3054959l6537857l2597884
$$ 127425864 153814869 165249013 159118571 136922855 103867896 67330039 34732155
7128C4732155A3650008k290583J233468k897489l481253l68211J43917j479447
$$ 34732155 13650008 11359425 12592893 9695404 6214151 5845940 5989857 4510410
7120D510410k023169N9854N23500o20327A105883Q3851P63057k6666m73562k4600
$$ 4510410 2487241 2547095 3070595 2450268 1105883 1189734 1952791 1926125 1452563 1427963
7110A427963K43859j39557m93316j98895K34743J3172l39317B49942a9309G0310
$$ 1427963 1671822 1532265 1038949 840054 1074797 1087969 748652 249942 -19309 70310
7099B1116J86157J31198p6045k3018K76893J92674m3723k08705p6242J04307j121
$$ 21116 207273 338471 262426 239408 516301 708975 665252 456547 380305 484612 483491
7088D83491j79518p0528J22581J0597j34353j6055J17920L80j33917k4085J29439
$$ 483491 303973 233445 356026 366623 232270 216215 334135 334515 200598 176513 305952
7077C05952J0774j27987k1666J45319M4794p2538m1416M8408l0506A07042q634
$$ 305952 316726 188739 167073 312392 357186 284648 243232 291640 261134 107042 98408
7066I8408J53996K6582q0151K3447J07529n594j41169l5802J36125J5651j24520
$$ 98408 252404 278986 198835 222282 329811 324217 183048 147246 283371 299022 174502
7055A74502J0754J54543J3628j34630J638J65560J9229j55406j8983J86805L1259
$$ 174502 185256 339799 353427 218797 220435 385995 405224 249818 230835 417640 448899
7044D48899j59518j4140K15659L7719j96061l8443K83469R5579j78620j3733M00356
$$ 448899 289381 275241 490900 528619 332558 294115 577584 673163 494543 480810 881166
7033H81166K67262o5044k89353l01072j65828J21974M90688M77221R0703l61898
$$ 881166 1148428 1083384 794031 492959 327131 449105 939793 1417014 1507717 1145819
7023A145819k15100N43761M05194r9227j85694L43624K71910m17896n04626Q22691
$$ 1145819 930719 1474480 1879674 1780447 1594753 1938377 2210287 1792391 1287765 2110456
7013B110456P55638k44062k88934J286665J066029p22775j398801K635869K763505
$$ 2110456 2866094 2622032 2333098 3619763 4685792 3963017 2564216 5200085 7963590
7004G963590m71447k502947N385145P407145J100685m192132K2783664M8096072
$$ 7963590 7492143 4989196 10374341 17781486 18882171 14690039 37473703 85569775
6996H5569775N9863510N9783720M6937557K3389880n674563l3401521n3378341
$$ 85569775 145433285 205217005 252154562 275544442 269869879 236468358 183090017
6989A83090017o1437427n6881423B3772070q869187M538245m099138G213806k039032
$$ 183090017 121652590 64771167 23772070 14902883 19441128 15341990 7213806 5174774
6981E174774K691047q31950l290486j054823J598244j76873j757120r37328J033532
$$ 5174774 7865821 7033871 3743385 2688562 4286806 4109933 2352813 1415485 2449017
6972B449017M6321j014992m83894P91740J17319o96499n16614N27234J65651m61132
$$ 2449017 2495338 1480346 996452 1788192 1905511 1209012 692398 1219632 1385283 924151
6962I24151m52692M07963J81510l15100C56786K88379J71351k16489B97452K31522
$$ 924151 471459 879422 1060932 745832 356786 645165 816516 600027 297452 528974
6952E28974J69022j49708k73565J35155J52594j04052B05183Q9252J58932o0961
$$ 528974 697996 548288 274723 409878 562472 458420 205183 294435 453367 392406
6942C92406j80637O4955J34768m4324j78049J1001J28385k0200j45192M348J22264
$$ 392406 211769 276724 411492 367168 189119 200120 328505 308305 163113 167461 289725
6931B89725n084j14781j6452J00697j71j05524l7317R7819J5267q5724m3017Q7685
$$ 289725 284641 169860 153408 254105 253934 148410 111093 208912 224179 138455 95438 183123
6919A83123K2694o8388m2096P3578K3959o3695F2999O5365L2428m6460n0311N8894
$$ 183123 205817 137429 95333 168911 192870 129175 62999 128364 160792 114332 64021 122915
6907A22915L3380l8662n3984M2803L1975l4535D5264L9467L8671k2251m9857K7223
$$ 122915 156295 117633 63649 106452 138427 103892 45264 84731 123402 101151 51294 78517
6895G8517L4776j7942D4495J9364L9635r490m2614R917L3809p828D3354P704L8035
$$ 78517 113293 95351 44495 63859 103494 94004 51390 61307 95116 87288 43354 51058 89093
6882H9093j572l6990p065L0008j050l5113PL4718M411k7355j0492K7501K866l1584
$$ 89093 87521 50531 43466 73474 72424 37311 37318 72036 76447 49092 38600 66101 68967 37383
6868C7383j4644L5305R350k5881j7909L3547J4806j8963k6265J4542R808k0604
$$ 37383 22739 58044 67394 41513 23604 57151 71957 52994 26729 41271 51079 30475
6856C0475H414L0334J7958j4895A5101K2169K2571m339k3976q526Q838o822j0059
$$ 30475 8414 38748 56706 41811 15101 37270 59841 55502 31526 23000 31838 25016 14957
6843A4957J7595J4799o554j9462P098J4070o437A5478J0339J9711J16j7555o656
$$ 14957 32552 47351 40797 21335 28433 42503 36066 15478 25817 45528 45644 28089 21433
6830B1433J0983k302A0136o95J8790J252j3304L461J5985P82j6682p677J6797
$$ 21433 32416 30114 10136 9441 28231 29483 16179 19640 35625 36407 19725 12048 28845
6817B8845N451j4138I000J6113Q084p437p583P676K466A3993F24J8459R097p270
$$ 28845 34296 20158 9000 25113 33197 25760 18177 25853 28319 13993 624 19083 28180 20910
6803B0910A0448Q610R623m671j0660J389K718p058j410J7615R974o498I084e296
$$ 20910 10448 19058 28681 24010 13350 14739 17457 10399 8989 26604 36578 30080 9084 -5296
6788A1806L122k928P024P352m901F284o58J2808K189o148J424P338k049G446c969
$$ 11806 14928 12000 19024 26376 21475 6284 5626 18434 20623 14475 15899 23237 21188 7446 -3969
6772G745L864l846J288P569j53o669J632Q293J70I585D698J0965N376m473l701
$$ 7745 11609 7763 9051 16620 16467 9798 11430 19723 19893 9585 4698 15663 21039 16566 12865
6757A2865L220J525M641J8912K4726J5494Q00j0045j0780n236k882l961k662j831
$$ 12865 16085 17610 22251 41163 65889 81383 82183 72138 61358 56122 53240 49279 46617 44786
6743D4786n168r762j1636E246a975o394K247K241C20J7954K6093K2981J4923L623
$$ 44786 39618 29856 18220 5246 -1975 -8369 -6122 -3881 320 18274 44367 67348 82271 85894
6729H5894l335o752r264r469q727q044r197r444l327r10o214C262K763O024m13
$$ 85894 82559 75807 66543 57074 48347 40303 31106 21662 18335 17425 11211 3262 6025 12049 11636
6714A1636E184J966R652K718p602B732N842O455k173E825J514N232J77m748C364
$$ 11636 5184 7150 16802 19520 11918 2732 8574 15029 12856 5825 7339 12571 12748 8000 3364
6698B090L809P884P076Q41m628j866O644N499n645r205L098J2631P895N099K545
$$ 2090 5899 13783 20859 21700 17072 15206 21850 27349 21704 12499 15597 28228 36123 41222 43767
6683D3767K114o760l789L854Q458Q468K1653J1502K8038L0473L1685J6638K495
$$ 43767 45881 39121 35332 39186 47644 56112 77765 89267 117305 147778 179463 196101 198596
6670A98596k1423k6982k7289m9196k0772r74M992k02j0347j942p751j320l747
$$ 198596 177173 150191 122902 73706 52934 51960 56952 56750 46403 44461 36710 35390 31643
6657C1643q655j0046D595c579j303G682Q406j691C870e586C400O596j746C008
$$ 31643 22988 12942 4595 -3579 -4882 7682 16088 14397 3870 -5586 3400 9996 8250 3008
6642E484O296R62n055e18o652c243E929P346K282k596o424B038q60a997o95C581
$$ 5484 11780 12742 7687 -518 -7170 -3243 5929 13275 15557 12961 6537 2038 1178 -1997 -2692 3581
6625G619j950A231N21L964j929b944k284B675L060j08N8J222j093j401K399M260
$$ 7619 5669 1231 1752 5716 3787 -2944 -5228 2675 5735 5627 5685 6907 5814 4413 6812 11072
6609A1072R83m127I51e53B250O75H85c239n831b788F996O026j232C509f554B277
$$ 11072 12055 7928 951 -553 2250 2925 885 -3239 -9070 -2788 6996 13022 11790 3509 -6554 2277
6592I969Q34E391B050M289O499N158L238K27l664o829C084b508k666O08J096L30
$$ 9969 10803 5391 2050 6339 12838 17996 21234 21461 17797 10968 3084 -2508 -5174 -4566 -3470 -3140
6576c140h36F381P645L725k947p162a00l107M75Q17c8B552J336k3M03p4e94q358
$$ -3140 -836 6381 14026 17751 14804 7642 -100 -3207 -2732 -1915 -38 2552 3888 3865 4268 4194 -594 -8952
6558h952a440C866m79J220J3191J8506J6147J0394L793j845n228p759r754j2478
$$ -8952 -1440 3866 3387 4607 17798 36304 52451 62845 66638 64793 59565 51806 42052 29574
6544B9574j2914D259b020F468Q410Q488M337J514k427p177H831a646l662K515
$$ 29574 16660 4259 -2020 6468 14878 23366 27703 29217 26790 19613 8831 -1646 -5308 -2793
6530b793L49k010o854n096o426l02R39P89j549L894N209J683k069g053A965O678
$$ -2793 -2444 -4454 -11308 -16404 -22830 -23132 -22193 -21404 -22953 -19059 -13850 -12167 -14236 -7053 1965 8643
6514H643N273P90k260E773b149r243d300D056P405L402N858N226N971M467O197
$$ 8643 13916 14706 12446 5773 -2149 -11392 -4300 4056 11461 14863 20721 25947 31918 36385 42582
6499D2582p34N046R376P801l519q433j0963j0689j1215o048m28N132P561Q641
$$ 42582 41848 46894 56270 64071 60552 52119 41156 30467 19252 13204 12776 17908 25469 34110
6485C4110K415J581j120l683l602k946m448p802C933d854j374a905D623O157J786
$$ 34110 36525 38106 36986 33303 29701 26755 22307 14505 3933 -4854 -6228 -1905 4623 10780 12566
6470A2566k803m595l0L724K65D230E75R615J8781K4711K4059J9408J1621L732
$$ 12566 9763 5168 5138 8862 9127 4230 575 10190 28971 53682 77741 97149 108770 112502
6456A12502l927r797j1774j1431q243m373Q1J74k512n900q110q292r276r211F203
$$ 112502 108575 98778 87004 75573 67330 62957 63038 63212 60700 54800 46690 38398 29122 19911 6203
6440A0860J0182J6712N215l89p451j1130A0582b945o662c295J370k558A361J5201
$$ 10860 21042 37754 42969 42580 35129 23999 10582 -2945 -9607 -3295 -1925 -4483 1361 16562
6426A6562J5821J2258R383L395j036n54j990m369q332j2539A3865E428L766O963
$$ 16562 32383 44641 54024 57419 56383 55829 53839 49470 41138 28599 13865 5428 9194 16157
6412A6157M069J318j110n523G372j983P063Q894O946L427j734q646G540d945D487
$$ 16157 20226 21544 20434 14911 7372 5389 12452 21346 28292 31719 29985 21339 7540 -4945 4487
6396A5135L542m669n971Q85O744N222K66k82N928O297K670q49O69O759N184j296
$$ 15135 18677 14008 8037 8922 15666 20888 21154 20872 26800 33097 35767 34918 35587 42346 47530 46234
6380D6234j0303r056J1650K1882K5020J6334m298k4211l1134j782K2285L216k2509
$$ 46234 35931 26875 38525 60407 85427 101761 97463 73252 42118 40336 62621 65837 43328
6367D3328d019B9819O9340N8914L6854K4484M6389P4559J67923K53429L00931
$$ 43328 -4019 29819 99159 158073 194927 219411 265800 340359 508282 761711 1062642
6356A062642K94889K40797J47807M5310n4405j34535j92692k36381k60381k65659
$$ 1062642 1357531 1598328 1746135 1791445 1737040 1602505 1409813 1173432 913051 647392
6346F47392k20611j41891n8263j2977L45k0945n804l368K4350O3450Q5340R3076
$$ 647392 426781 284890 226627 213650 213995 193050 187246 183878 208228 271678 357018 450094
6334D50094N8504L175n9050j03380j30504H4387A8888J01664Q7623O2315M3753
$$ 450094 508598 511773 452723 349343 218839 84387 18888 120552 208175 270490 314243
6323C14243L9349K8446K1916O4544J80822K91345L25637K68981J33695l2536j55676
$$ 314243 353592 382038 403954 468498 649320 940665 1266302 1535283 1668978 1636442 1480766
6312A480766j74299p9997J5379j41r7421k22032k79524k76961A54265B3628A1777
$$ 1480766 1306467 1226470 1241849 1241708 1144287 922255 642731 365770 154265 23628 11777
6300H3346P5288L4414J477l8107n2784l5530l025Q765N400l511j462J4643K6695
$$ 83346 158634 193048 194525 156418 103634 68104 65079 73844 79244 75733 74271 88914 115609
6287A15609K0705M761m265r94J145k719k0586m2646B5272A0338J8975J4222J594
$$ 115609 136314 141075 136810 135816 136961 134242 113656 71010 25272 10338 29313 43535 45129
6274D5129j55J945M767K750P189J6398J0435J4252N9133J31910J86218K14350
$$ 45129 44974 46919 51686 54436 61625 78023 88458 102710 161843 293753 479971 694321
6262F94321K01252J45161O3355l4011j23500j86770k09238j95057j54652H3049
$$ 694321 895573 1040734 1104089 1070078 946578 759808 550570 355513 200861 83049
6251H384e779B6655K3404J414j2497j5318n112L56q585e996a437A6048J1081M151
$$ 8384 -5779 26655 50059 51473 38976 23658 18546 18902 10317 -5996 -1437 16048 27129 31280
6237C1280j582o420A1057f620q863O289K798q96c507F731P582K720j138p474a30
$$ 31280 29698 23278 11057 -6620 -15483 -9194 -6396 -7292 -3507 6731 14313 17033 15895 8421 -130
6221e360a388B809n49J142K411j716b187p772b21H159N059O958J0493Q913L047
$$ -5360 -1388 2809 2260 3402 5813 4097 -2187 -9959 -221 8159 13218 20176 30669 39582 42629
6206D2629k361q464n15M962J615o757j2649q896K914Q156Q938J1493J3201J5866
$$ 42629 40268 31804 31289 36251 37866 31109 18460 9564 12478 20634 29572 41065 54266 70132
6192G0132J6715J7110J4342Q730K308o170j2855k0861k8142B6588a2645B4002
$$ 70132 86847 103957 118299 127029 129337 123167 110312 89451 61309 26588 -12645 24002
6179F4336L6208K6480J2167k309j6154k8789l5975A9168d473H924K323e62q566
$$ 64336 100544 127024 139191 136882 120728 91939 55964 19168 -4473 8924 11247 -562 -9128
6166i128I657N962K394K682O630K8214M2062N1608N2420M1804K3929j849k2746
$$ -9128 9657 15619 18013 20695 27325 55539 97601 149209 201629 243433 267362 265513 242767
6153B42767m0350n1389m7773k533M3396M8385K9269K159j3744o741J7573M0990
$$ 242767 202417 151028 103255 100722 144118 192503 221772 223931 210187 203446 221019 262009
6141B62009P5188J06878J17212J01643N8278n152o7131j17741j45431j41931j21405
$$ 262009 337197 444075 561287 662930 721208 716056 648925 531184 385753 243822 122417
6130A22417D7540E354b4052a22B3095J2011m798j4273A226a3043o587g682C703
$$ 122417 47540 5354 -24052 -122 23095 35106 30308 16035 1226 -13043 -19630 -7682 3703
6116A7697J2525J1560N944n248k0194C042O051R642J1166N647j749m632m901m619
$$ 17697 30222 41782 47726 42478 22284 3042 9093 18735 29901 35548 33799 29167 24266 19647
6102A9647J193J209j261r334n583f582R2e76c9q147q946M395b44F656L758n96
$$ 19647 20840 22049 20788 11454 5871 -6582 -6490 -576 -39 -8186 -17132 -12737 -244 6656 10414 9818
6086I818M937J3309J4293J6336J6651J6147N548o620q095l860o727j6307k7042
$$ 9818 14755 28064 42357 58693 75344 91491 97039 90419 82324 78464 71737 55430 28388
6073B8388G870k50P358l918k615M684K0741O0368P9665O7888K4019l5694p8528
$$ 28388 7870 7620 14978 11060 8445 13129 33870 94238 173903 241791 265810 230116 151588
6060A51588F3184c271F412L0793M0443J8421k6499k1784O3718M2487l0488E6335
$$ 151588 63184 -3271 6412 37205 77648 96069 69570 47786 111504 153991 123503 56335
6047A34432P6232l4435q4022J70683J68219j8650j71048K61740M08022L6388l90296
$$ 134432 210664 176229 92207 262890 431109 412459 241411 503151 911173 947561 557265
6036E57265J314129K703841L350234L360113K660700J358722k62829j824083k963243
$$ 557265 1871394 4575235 7925469 11285582 13946282 15305004 15042175 13218092 10254849
6027A0254849l446957l228860A160054n49872L91265j86855C74015r9006J55797
$$ 10254849 6807892 3579032 1160054 610182 1001447 814592 374015 275009 430806
6018D30806m6713j91545p5089R9712l314j01264m4514P4188J2866n5483B6846
$$ 430806 384093 192548 117459 217171 213857 112593 68079 142267 155133 99650 26846
6006D1640R253A6723R560M3364N664k9916k1385K6884J0571j8393A7844J1107
$$ 41640 50893 16723 26283 69647 75311 45395 24010 50894 61465 43072 17844 28951
5994B8951J0217j3403F175J3905J1936p655H101P458P909q169E611N234j367h147
$$ 28951 39168 25765 6175 20080 32016 24361 8101 15559 23468 15299 5611 10845 9478 -8147
5979b0775d150C218i37q226m10d256k792j1915l184g088C766B77f43A1021Q577
$$ -20775 -4150 3218 -937 -9163 -9573 -4256 -7048 -18963 -22147 -7088 3766 277 -643 11021 19598
5964A9598j332n111j376K82K373Q820J4500J6067K4965M1639N3293N2027L6192
$$ 19598 18266 13155 11779 12061 14434 23254 37754 53821 78786 120425 173718 225745 261937
5951B61937J1135j6201l9042n0759n1831m2988k9740j8302p886l850n016B502
$$ 261937 273072 256871 217829 167070 115239 72251 42511 24209 16323 12473 7457 2502
5938G035R089L387n336A156i407a886D240J143q28G89b990j395a133B149O70N07
$$ 7035 16124 19511 14175 1156 -9407 -1886 4240 5383 4555 789 -2990 -4385 -1133 2149 2819 3326
5922C326J915J131B446g674j0268K847K960J567N38j134m676K037j50L639k135
$$ 3326 5241 6372 2446 -7674 -17942 -15095 -12135 -10568 -10030 -11164 -15840 -13803 -13953 -10314 -12449
5907a2449j364O288A6513K2479J5534O756k556q507j2306j5692D796a0408b218
$$ -12449 -13813 -7525 16513 38992 54526 61282 58726 50219 37913 22221 4796 -10408 -2218
5893D454L630l38k453E47d481m432L229a2B594q89a667j168A272L069j177B48
$$ 4454 8084 7746 5293 547 -4481 -8913 -5684 -12 2594 1705 -1667 -2835 1272 4341 3164 248
5876i03A382J222n53a997p080j0996Q634C013K1463K1673J8814J0869K740o199
$$ -903 1382 2604 2051 -1997 -9077 -20073 -11439 3013 24476 46149 64963 75832 78572 72373
5862G2373j3094j7924j7104j1832n886k528G38c406m533j848M83o47R99L536K594
$$ 72373 59279 41355 24251 12419 6533 4005 738 -3406 -7939 -9787 -9304 -9951 -8952 -5416 -2822
5847b822n83j1038n032n518O86M363N202M656L21J596q57n444m749j898l850l133
$$ -2822 -3405 -14443 -19475 -24993 -24307 -19944 -14742 -10086 -9765 -8169 -9026 -14470 -19219 -21117 -24967 -28100
5831b8100K175J1852N918i70I4b722m545n295K072j749k84K270d821J450j770
$$ -28100 -25925 -14073 -8155 -970 94 -2722 -7267 -12562 -10490 -12239 -12523 -10253 -4821 -3371 -5141
5816e141m162l39L526L015a220B89L85O10jj33a36a3l707k120l87A283a7863n261
$$ -5141 -9303 -9642 -6116 -3101 -1220 289 674 1284 1283 1150 -136 -13 -3720 -5840 -6227 1283 -17863 -23124
5798b3124k897M321P460B265J2364M760m406b94k0849j6054m876P872J5024A0747
$$ -23124 -26021 -21700 -14240 2265 14629 19389 14983 -294 -21143 -37197 -42073 -34201 -19177 10747
5783D420i97r973a633E108M134k059F24h057i06A6234J4350J1932J1050Q279N212
$$ 4420 -997 -10970 -1633 5108 9242 7183 624 -8057 -906 16234 30584 42516 53566 61845 67057
5768F7057J211l415p029j0702j2440j4568G775c360k007C96O529O422K742j2m719
$$ 67057 68268 64853 57824 47122 34682 20114 7775 -3360 -5367 396 6925 13347 16089 16077 11358
5753A1358n308j151K911N476L165l495B839a1798N495E148Q614N07l989C433c297
$$ 11358 6050 4899 7810 13286 16451 12956 2839 -11798 -6303 5148 13762 14269 10280 3433 -3297
5737f331qk603k966J745d226D078O993O574M887K622J688k245n048o205m815k051
$$ -6331 -6339 -8942 -11908 -10163 -4226 4078 11071 17645 22532 25154 26842 24597 19549 13344 8529 6478
5721F478K28j687A229c725k638J514f19C141K896J327l46B859d956n552b985B381
$$ 6478 6706 5019 1229 -3725 -6363 -4849 -619 3141 6037 7364 7018 2859 -4956 -10508 -2985 2381
5704B532a785p330l740e159K199k786k908l908k433M283M628i82A229f6F18J667
$$ 2532 -1785 -9115 -12855 -5159 -2960 -5746 -8654 -12562 -14995 -10712 -6084 -982 1229 -66 618 2285
5688B285J83B28b134j454a249f01E40J28J07O716J6187J5165R134M621k96o893
$$ 2285 2468 228 -2134 -3588 -1249 -601 540 668 775 7491 23678 38843 47977 52598 52302 45409
5672D5409j2480j2430q007A723o94N85K615J710J094K411L408K184p89l586n020
$$ 45409 32929 20499 12492 1723 1029 1614 4229 5939 7033 9444 12852 15036 14247 10661 5641
5657E641A946F3b446j658A441L745M00A676c141j113a423A059J786Q36J576K740
$$ 5641 1946 63 -2446 -4104 1441 5186 5586 1676 -3141 -4254 -1423 1059 2845 3681 5257 7997
5641G997M457K495k882D201c082E42P603L583L26p83j675m688a833k765d43A867
$$ 7997 12454 14949 12067 4201 -3082 542 8145 11728 12054 11271 9596 4908 -1833 -4598 -443 1867
5624g95k581B482J0128N223J58n961C495e250l83D68O389L790K915l47k259q9
$$ -795 -3376 2482 12610 17833 17991 12030 3495 -5250 -5633 468 6857 10647 13562 13215 10956 10867
5608A0867L245K230k809D827g256L047G007P854N464J703j886m355k904k44J464
$$ 10867 14112 16342 13533 4827 -7256 -4209 7007 14861 20325 22028 20142 15787 12883 12639 14103
5593A4103l49l253k432k261J657M793N220J749o24O51K637L710J526P80L312L010
$$ 14103 13754 10501 8069 5808 7465 12258 17478 19227 18603 19254 21891 25601 27127 27907 31219 34229
5577C4229l296q494n308N429P297j050q176m420N661N087o205B971j041K4334
$$ 34229 30933 22439 17131 22560 29857 28807 20631 16211 21872 26959 20754 2971 1930 26264
5563B6264K0075J2883K710k354p898j3151j7796j0083Q287Q710k561j1167k895
$$ 26264 46339 59222 61932 59578 51680 38529 20733 10650 18937 27647 25086 13919 11024
5550A1024J4877J2031N227j1334j3872J1601K7119K6525Q353J208l608Q086J8246
$$ 11024 25901 37932 43159 31825 17953 29554 56673 83198 91551 92759 89151 97237 115483
5537A15483J4468L096O731K0158K1933J8221K752o703M424J9243J4230j2063m3583
$$ 115483 129951 133047 139778 159936 181869 200090 202842 196139 200563 219806 234036 221973 178390
5524A78390m9807E7007k6112M8088N7736M7119M8967L9305L5477J8646N186m1560
$$ 178390 128583 57007 30895 78983 136719 183838 232805 272110 307587 326233 331419 289859
5512B89859m0227k7189M6111Q5064N4146K9037M759L2932Q1854P6017J9263J142
$$ 289859 249632 222443 268554 353618 407764 436801 441560 474492 556346 632363 651626 652768
5500F52768M6950J10278J97074K15967K36779K67054L44166N00127Q11721J272194
$$ 652768 699718 809996 1007070 1223037 1459816 1726870 2071036 2571163 3382884 4655078
5490D655078J755473K061092K052534J657245Q96322j59603j313699k372259l167097
$$ 4655078 6410551 8471643 10524177 12181422 13077744 12918141 11604442 9232183 6065086
5481F065086B531643G32122K726517J861580Q78678j9430o51913r43812r51589
$$ 6065086 2531643 732122 3458639 5320219 6198897 6179467 5527554 4583742 3632153
5472C632153p91665n98237m47470l33659k39287j74063j36292j17791r2032q8095
$$ 3632153 2840488 2242251 1794781 1461122 1221835 1047772 911480 793689 701657 613562
5462F13562n8949n6745n6080m4978k0985k6905k5002l0413l3079k8688j2657m960
$$ 613562 554613 497868 441788 396810 375825 348920 323918 293505 260426 231738 219081 214121
5450B14121r316j4152j6083j1550q776p360q636m206o12j744p269j1975j1654
$$ 214121 204805 190653 174570 163020 154244 146884 138248 134042 133430 131686 124417 112442 100788
5437A00788r136j786M768J1734P500J203l928j232O28m496j5134j0037P188K1550
$$ 100788 91652 89866 94634 106368 113868 115071 111143 109911 110539 106043 90909 80872 88060 109610
5423A09610J6735j205j8774k5240k3354j1370O35M332K820Q83R19K317N27l783
$$ 109610 126345 125140 106366 81126 57772 46402 47037 51369 54189 55072 55991 58308 58835 55052
5409E5052n834p509q364q530J709J8080J6044N337o326j7767k0107H684A126l64
$$ 55052 49218 41709 33345 24815 26524 44604 60648 65985 59659 41892 21785 8684 1126 762
5395G62J9237K1367J4541K756m134l490K540k091j0548j8149G216K983L90C041
$$ 762 19999 41366 55907 58663 54529 51039 53579 51488 40940 22791 7216 10199 10589 3041
5380g804A3424K0709J5611M163q246j5632H001f471B497J7829R007K77o174r212
$$ -7804 13424 34133 49744 53907 45661 30029 8001 -6471 2497 20326 29333 29610 23436 14224
5366A4224F701k245k81o69A241a421D598P118L714q76l035J719R221P014j029
$$ 14224 6701 4456 4175 3506 1241 -1421 4598 11716 15430 14554 11519 13238 22459 29473 28444
5351B8444q984G999l050O570O110M374J939k484j0355P55L3992M3528L9349L1364
$$ 28444 19460 7999 4949 11519 17629 22003 23942 21458 11103 11858 45850 89378 128727 160091
5337A60091K0497Q397n350k0450l4962m2987C9711A3286L285J457p071k526O950
$$ 160091 180588 188985 183635 163185 128223 85236 39711 13286 16571 18028 10957 8431 15381
5324A5381P258J117m495n793j954K818K904L13l074j485P05L6J835Q181R966L665
$$ 15381 22639 23756 19261 13468 11514 14332 17236 17549 14475 12990 13695 13731 15566 23747 33713 37378
5308C7378p227A3806n499J2522Q312l801A2392c470k342A709N13a505E101J2260
$$ 37378 30151 13806 8307 20829 29141 25340 12392 -3470 -5812 1709 2222 -1505 5101 17361
5294A7361Q411J948k089K484P270P528M847O022Q065O690J809L02J029q04o222
$$ 17361 25772 27720 25631 28115 35385 42913 47760 53782 61847 68537 70346 70648 71677 70873 64651
5279F4651j0547n387O854J0003P327L560P767J3803J8368J3875N06j6520k5097
$$ 64651 54104 48717 55571 65574 72901 76461 84228 98031 116399 130274 130780 114260 89163
5266H9163j4269m287j2900l069O6812J03550R2629N7488J6505p270l396Q376N561
$$ 89163 74894 70607 57707 54638 121450 225000 317629 375117 391622 384352 380956 389332 394893
5253C94893k0266n5269n2798M6440J32663J10225O7839K33207O25305R29748J030077
$$ 394893 374627 319358 266560 313000 445663 555888 623727 856934 1482239 2411987 3442064
5242C442064R02929N67878R5427l98566q05114j021713j011600p56671l17638
$$ 3442064 4344993 4912871 5008298 4609732 3804618 2782905 1771305 1014634 696996
5233F96996o0042r2325j45119r9891k0920k1021n8212m5162n305N573k5358k9235
$$ 696996 636954 544629 399510 299619 278699 257678 199466 154304 148999 154572 129214 99979
5221I9979J377K172k0001l9247k0583J2921J3343K4039L1349J7155j5086l8440
$$ 99979 101356 103528 83527 44280 23697 36618 49961 74000 105349 122504 107418 68978
5209F8978l1894K032J2642J7699K9579K0244r459k5551P149L0724Q483k3306n474
$$ 68978 37084 39116 51758 69457 99036 119280 109821 84270 91419 122143 130626 107320 101846
5196A01846M1016K5056L78P4014J12656P1140Q330R2657M14478O17183O17984
$$ 101846 142862 167918 168296 242310 354966 426106 434436 527093 941571 1558754 2176738
5185B176738M87640K38444m2052k85085l86737j77003L33442O80657O54228L75227
$$ 2176738 2664378 2902822 2860770 2575685 2188948 2011945 2345387 3026044 3680272 4055499
5175D055499m649l23009m44549l37711j72446j70425l40915n37288o15526m76614
$$ 4055499 4050850 3727841 3283292 2945581 2773135 2602710 2261795 1724507 1108981 632367
5165F32367j22268o736n7105j45945q1187K2997N020n7942l9547L4834L9082p749
$$ 632367 510099 503363 446258 300313 219126 242123 247143 189201 149654 184488 223570 215821
5153B15821n4688n6682l8923m564O148M483n394K5918N1921M2477K0332p932j2615
$$ 215821 161133 104451 65528 60964 67112 71595 66201 92119 144040 186517 206849 198917 186302
5140A86302J1320L1476L4156M5432R9843J67192K14476K30947K20309J84506J25300
$$ 186302 197622 229098 263254 308686 408529 575721 790197 1021144 1241453 1425959 1551259
5129A551259M5500p3673j47521k02662k29444k26096j92455j39036q1194n8885
$$ 1551259 1596759 1523086 1375565 1172903 943459 717363 524908 385872 304678 245793
5119B45793p1079H2410d96D6377N8795J3877j4350j9714j3141o28k75j0534k0922
$$ 245793 174714 82410 -496 46377 105172 119049 104699 84985 71844 71216 70941 60407 39485
5106C9485A5741c287A0851K2636J2164K450n858n166j516j021k718m027n035j0243
$$ 39485 15741 -3287 10851 33487 45651 48101 42243 37077 35561 34540 31822 27795 22760 12517
5092A2517a439k106A2177J0078L058j773l440k667j516p31l528n604k221M029
$$ 12517 -1439 -3545 12177 22255 25313 23540 20100 17433 15917 15186 11658 6054 3833 7862
5078G862O200K836r35j076j16k994n242B697K822N172L70q15r71j607L54M688
$$ 7862 14062 16898 15963 14887 14771 11777 6535 2697 5519 10691 11061 10246 9275 7668 8022 12710
5062A2710N247K393m264F763e405D109J3421J2151R029O913N758Q877J4873J8756
$$ 12710 17957 20350 16086 6763 -5405 4109 17530 29681 38710 45623 51381 60258 75131 93887
5048I3887J9409J3189M362m982j4682k1209k3511j7380k810Q536J1494J2548J9018
$$ 93887 113296 126485 130847 125865 111183 89974 66463 49083 46273 54809 66303 78851 97869
5035I7869K8736L4557L3529K4642R055r559k7727m0042m5146m0225k6664j1379
$$ 97869 126605 161162 194691 219333 228388 218829 191102 151060 105914 65689 39025 27646
5023B7646l209k412k464l340m239j625L009K876j171n070C686H33J114M028M455
$$ 27646 24437 22025 19561 16221 11982 10357 13366 16242 15071 10001 3686 833 1947 5975 10430
5008A0430K459k036m250I22d65A453M88r55D06a045j182j963l908L891B782O895
$$ 10430 12889 10853 6603 922 -465 1453 1941 986 406 -1045 -2227 -4190 -8098 -4207 2782 9677
4992I677M557O40k907E954h83m539K671a321j93j845l786c447A958L412L5B330
$$ 9677 14234 14874 11967 5954 -883 -5422 -2751 -1321 -1514 -3359 -7145 -3447 1958 5370 5405 2330
4975a629m681O15a553A236K4h09k753p09O10j075k590c189D12J765k44j42R73
$$ -1629 -6310 -5695 -1553 1236 1260 -809 -3562 -4271 -3661 -4736 -7326 -3189 412 2177 1933 1791 2764
4958B764k69F10b880k059b340d7C54M09b59j996j365a367E84Q35l44b07j011f1
$$ 2764 2495 610 -2880 -4939 -2340 -47 354 763 -259 -2255 -3620 -1367 584 1419 1075 -207 -1218 -61
4939C236K952Q4B994b055k603a120C28e90o75J89m51j749j690j919N59J99j84
$$ 3236 6188 6272 2994 -2055 -4658 -1120 328 -590 -1265 -1076 -1527 -3276 -4966 -6885 -6326 -6127 -6311
4922f311K208L11P94J073n02j989q87b422A896L381K246J537J263O78j66p33k243
$$ -6311 -4103 -3792 -2998 -1925 -2427 -4416 -5303 -2422 1896 5277 7523 9060 10323 11001 10835 10102 7859
4905G859k730k01K830J394j991E39f437b312A882P05E83c255l786P97J918M15
$$ 7859 5129 4928 7758 9152 7161 539 -6437 -2312 1882 2587 583 -3255 -7041 -6244 -4326 -3911
4889c911m90j140J391a511B36i5k129k454n79Q68R60a634B85O16A18b207p7H48
$$ -3911 -4401 -5541 -4150 -1511 236 -95 -2224 -4678 -5257 -4389 -3429 -1634 285 901 118 -2207 -2284 848
4870C331M57j732a285o36A636K414q09g63m974J485J371j131k598p89J330P02
$$ 3331 3788 2056 -1285 -1921 1636 4050 3241 -763 -5737 -4252 -2881 -4012 -6610 -7399 -6069 -5367
4854e367Q77R06l55j065J704h28E96c36k307k418m07j167r12K685K375d23G29
$$ -5367 -4490 -3584 -3939 -5004 -3300 -828 596 -336 -2643 -5061 -5468 -6635 -7547 -4862 -2487 -423 729
4836I17f81j499K54b64a03k367k764K109N16j121l31a512b08o57k835j403J014
$$ 917 -681 -2180 -1926 -264 -103 -2470 -5234 -3125 -2609 -3730 -4061 -1512 -208 -865 -3700 -5103 -4089
4819d089N88o18R7a844d53E4IK5c80H1J714J870N67J32R93J947O61j221C059a263
$$ -4089 -3501 -4119 -4022 -1844 -453 54 9 34 -380 81 1795 3665 4232 4364 5357 7304 7965 6744 3059 -1263
4798d185N73P36o45j826P42g73B134l25b018m634c223J508j816k456b747a274
$$ -4185 -3612 -2876 -3521 -5347 -4605 -773 2134 1809 -2018 -6652 -3223 -1715 -3531 -5987 -2747 -1274
4781b237q45g57A752k13a435l869a992C11J73a548l298J201H26L788J406j419
$$ -2237 -3082 -757 1752 1539 -1435 -5304 -1992 311 484 -1548 -4846 -3645 826 4614 6020 4601
4765D601A405b384j538m41J743E37K635P08A909b232l441J935f74F55Ab896k559
$$ 4601 1405 -2384 -3922 -4363 -2620 537 3172 3880 1909 -2232 -5673 -3738 -674 655 1 -2896 -5455
4748e455E08N204J288j360B675i5k130o45Q38f74r82k454a027B281l11b312l705
$$ -5455 508 5712 7000 5640 2675 -95 -2225 -2870 -2032 -674 -1656 -4110 -1027 2281 1970 -2312 -6017
4731f017b7C053j052a454k420a805J48p44C37K934K24A300a351j08J14k476J842
$$ -6017 -27 3053 2001 -1454 -3874 -1805 -1657 -2401 337 3271 3495 1300 -1351 -1459 -1345 -3821 -1979
4714a979D58J02b069k536h88B355K099J146l66A911c128P44B263J648j326A017
$$ -1979 458 560 -2069 -4605 -888 2355 4454 5600 5234 1911 -3128 -2384 2263 3911 2585 1017
4697I49a327m488J493D39O44b761a252E986K691k266C08f482i93B031J995J742
$$ 949 -1327 -5815 -4322 439 1083 -2761 -1252 5986 8677 6411 308 -6482 -993 2031 4026 5768
4681E768j465i9l657d82B751j39J334M239L096j576D299a425k410j260O97B323
$$ 5768 4303 -99 -3756 -482 2751 2612 3946 8185 11281 9705 4299 -1425 -3835 -5095 -4398 2323
4664F373n97B343p1K499j093a304p79B763j59a565l308Q48q15k213a971B669m67
$$ 6373 5776 2343 2272 4771 3678 -1304 -2083 2763 2604 -1565 -4873 -4025 -4840 -7053 -1971 2669 2202
4647B202b843d88F202J790C625d087J861a78q11A649M079l13C63p5P436K597D973
$$ 2202 -2843 -488 6202 7992 3625 -4087 -2226 -178 -989 1649 5728 5415 363 288 7724 10321 4973
4629c819D299M830l056a167E094P410Q46l353l083k955b944o4G450L746n408e488
$$ -3819 4299 9129 6073 -1167 5094 12504 13350 9997 6914 3959 -2944 -3008 7450 11196 5788 -5488
4612H014J0073m89H112b428I76J425J430P047M952l251B198H84R924K100F047
$$ 8014 18087 17598 8112 -2428 976 2401 3831 10878 15830 12579 2198 884 10808 12908 6047
4596D803Q652J207o025j26R181L987m987k026O854K103r889C550K0091K7565L1386
$$ 4803 13455 14662 8637 8511 17692 21679 16692 14666 21520 23623 13734 3550 23641 51206 82592
4581H2592L8462M3754L8779K5454N472j7563l7310m9439m7190l1102j3026j3232
$$ 82592 121054 164808 203587 229041 234513 216950 179640 130201 83011 51909 38883 25651
4569B5651r640J0028P648q708A1474J2689J3350k929j5491n156O387o393E953
$$ 25651 16011 26039 33687 24979 11474 24163 37513 34584 19093 13937 20324 13931 5953
4555B7208J4813m729A5795O9J7020k505A3524J1969J9574k379A7192K651K9006
$$ 27208 42021 37292 15795 15864 32884 30379 13524 25493 45067 42688 17192 19843 48849
4542D8849M348k2071A5076K5252N167k1655j080L1456N600k6789j2284L6721J1399
$$ 48849 53197 31126 15076 40328 45495 23840 22760 54216 59816 33027 20743 57464 68863
4529F8863k6768B0167M0431J6168k5119k1553M3001K0565k8993B0505N0540L1734
$$ 68863 42095 20167 60598 76766 51647 30094 73095 93660 64667 20505 71045 102779
4517A02779k2167D0231M3236L3705k9065B5537P0328N1576k3552E2098N1875O5243
$$ 102779 80612 40231 83467 117172 88107 25537 95865 147441 123889 52098 103973 169216
4505A69216j8138F7270M7134Q1737j8809G0926O4690J14423o344j15009L6236
$$ 169216 151078 67270 114404 196141 177332 70926 135616 250039 243695 128686 164922
4494A64922J41686K052j51060K8890K00831K5475j87117J2374K83844O6122k32141
$$ 164922 306608 308660 157600 186490 387321 412796 225679 238053 521897 588019 355878
4483C55878k8249M11804J40534k99266j23795O42408L03977l91789k55790J151227
$$ 355878 327629 739433 879967 580701 456906 1099314 1403291 1011502 755712 1906939
4473A906939P87387k88972l39542J846036J585568j379250j372420J2123887J7393166
$$ 1906939 2694326 2405354 2065812 3911848 5497416 4118166 2745746 14869633 32262799
4464C2262799J9901775J8601338J3309750M980409m530204j2971412j8439320
$$ 32262799 52164574 70765912 84075662 89056071 84525867 71554455 53115135
4457E3115135j9928211A5604935C111552P77459J578947j519664j944974L18924
$$ 53115135 33186924 15604935 3111552 3889011 5467958 3948294 2003320 2322244
4449B322244L69152p35351G93968J98021M22418k78141D75999O3022L20086j23244
$$ 2322244 2691396 1956045 793968 991989 1414407 1136266 475999 539021 859107 735863
4439G35863C27842K9073K42667n4957B59731l3971J96971j1894j95447o3029J51904
$$ 735863 327842 356915 599582 544625 259731 225760 422731 410837 215390 152361 304265
4428C04265n66j43641n6846J36158J9393j05191p4152R8287K3981p8424o0992
$$ 304265 303699 160058 103212 239370 258763 153572 79420 177707 201688 123264 62272
4417F2272Q3797K5145o1777D8137P1646K8918m7191C9273M9770K9760l5273B6269
$$ 62272 146069 171214 109437 48137 119783 148701 101510 39273 89043 118803 83530 26269
4404G6285L2793k4467C0266K5747K7785j9161B4635L2041K9393j3658C1687J0024
$$ 76285 109078 84611 30266 56013 83798 64637 24635 56676 86069 72411 31687 41711
4392D1711K7748r399B0682J0790K9426l466B8247j468K4090k747A9449P66K5796
$$ 41711 69459 60060 20682 31472 60898 57432 28247 26779 50869 48122 19449 20215 46011
4379D6011N90k2007n393K1215J464j9384o166K0702K627j8183q222J8364L646
$$ 46011 46601 24594 19201 40416 41880 22496 16330 37032 39659 21476 13254 31618 35264
4366C5264j7534F403K1334Q368j0697j1178J3943P795j1544E380J2634J0184n191
$$ 35264 17730 6403 27737 36105 25408 14230 28173 35968 24424 5380 18014 28198 23007
4353B3007n849J4626J2431m792j8800J0476M0945M0784L6790L0830K3536J4326
$$ 23007 17158 31784 44215 39423 20623 31099 72044 112828 149618 180448 203984 218310
4341B18310j551j9297l9500n3118m9859k3443K192m657j3548k928Q828l98q030
$$ 218310 216759 197462 157962 104844 54985 31542 33734 29077 15529 12601 21429 21031 13001
4328A3001L026P709j611A0599k391J0176J155H864A232J3441N199m994E485D95
$$ 13001 16027 23736 22125 10599 8208 18384 19539 8864 1232 14673 19872 14878 5485 495
4313h41K45H948Q962J435p827A133L922M012m520b713H685N913p90l395n41j349
$$ -841 -596 8948 17910 19345 11518 1133 5055 9067 4547 -2713 8685 14598 13808 10413 9872 8523
4297H523B395a699G343M187k676B254r84M371O04j104P24J012B973F27P536M330
$$ 8523 2395 -1699 7343 11530 8854 2254 1270 5641 6245 5141 5865 6877 2973 627 8163 12493
4281A2493k823B317H76M782L99B054B53L852R02B257J601L354m8B651c190B0b06
$$ 12493 9670 2317 876 5658 6057 2054 253 4105 5007 2257 3858 7212 7164 2651 -3190 20 -206
4263d061I05N857J638l589f39K65E19a317A40L739J253B192a156A114K049A369
$$ -4061 905 6762 8400 4811 -639 -374 519 -1317 140 3879 5132 2192 -1156 1114 3163 1369
4246i46C427K225r60j705k12o19a220j706B209J682A384b72C671M453K32l136
$$ -946 3427 5652 4692 2987 2775 2156 -1220 -2926 2209 3891 1384 -272 3671 8124 8356 5220
4230E220I93b551k081n94b113E0f25k420bB728r31c23B693L528L34B777a339n60
$$ 5220 993 -2551 -4632 -5226 -2113 50 -625 -3045 -2 2728 1797 -323 2693 6221 6555 2777 -1339 -1899
4212a899K72j02A872N056L162j070m167g7l339M56F5K707N77E64c775a746C87
$$ -1899 -1627 -1729 1872 6928 10090 9020 4853 -77 -3416 -2960 65 2772 3349 564 -3775 -1746 387
4194I53M65O81n40a537c08C571J304j900g05l07B546K720J587P87r58l045c98
$$ 953 1418 2099 1559 -1537 -308 3571 4875 2975 -705 -1012 2546 5266 6853 7640 6682 3637 -398
4176c2B340K33d02l419F71K495M00r33j237J1J723K287O56j850F67b338F87K633
$$ -32 2340 2573 -402 -3821 671 3166 3566 2633 1396 1407 3130 5417 6073 4223 667 -2338 687 3320
4158C320j24I23a868G89L106J558j081A558b257J9e36q01j728B9L014N40A403
$$ 3320 3196 923 -1868 789 3895 5453 4372 1558 -2257 -2238 -536 -1337 -3065 29 3043 3583 1403
4140d58G46Q99d59l944b179A85K87e85q97r2q67J76i01A75q3i73o40c49A179L77
$$ -458 746 1645 -459 -4403 -2179 185 472 -585 -1482 -1574 -2441 -2265 -901 175 92 -973 -1613 -349 1179 1556
4120A556J87O58J151J220m4j273A110a678m76C04J499J671K326J048p94k638E93
$$ 1556 1743 2401 3552 4772 4728 3455 1110 -1678 -2154 304 1803 3474 5800 6848 6054 3416 593
4102h07j340j968o1a945f45c13a36G11M96j02n15A07h4m41fE20A72a393p04O64
$$ -807 -2147 -4115 -4176 -1945 -645 -313 -136 711 1207 1105 590 107 -84 -525 -6 520 172 -1393 -2097 -1433
4082a433E92N52C17a556r75C72K070J026m04j363F07J46j95a311l534e84B983
$$ -1433 592 1144 317 -1556 -2531 372 2442 3468 3064 1701 607 753 558 -1311 -4845 -584 2983
4064D047n02j260G60c06j254p60L63i76B94N84l95a008j458q1K56j162J45H47
$$ 4047 3545 2285 760 -306 -1560 -2320 -1957 -976 294 878 483 -1008 -2466 -2547 -2291 -3453 -3308 847
4045C335N88j730b28n42A014Q17m45H0h46K97E31L47D27b64A19Q77Q86N25Pq15
$$ 3335 3923 2193 -228 -770 1014 1831 1386 80 -846 -549 531 878 427 -264 119 996 1882 2407 2414 1599
4025A599A01f19A188L019K590J080k77j094j523k340a41j861o75N55d73A197R42
$$ 1599 101 -619 1188 4207 6797 7877 7600 6506 4983 2643 -141 -2002 -2677 -2122 -473 1197 2139
4008B139k66G63h16m01M85a34A027J530J003K50R8K89j70j67j77o67A496c12j06
$$ 2139 1873 763 -816 -1217 -732 -134 1027 2557 3560 3810 3908 4197 4027 3860 3683 3016 1496 -312 -418
3989d18B78J339M30n08F13J38Q30M32m15E38a328j886O74Q28j23n57j39P0P29
$$ -418 278 1617 2047 1539 613 751 1581 2013 1598 538 -1328 -3214 -2540 -1712 -1835 -2392 -2531 -2461 -1732
3970a732a03A405K45n47k41L49K87n42b65j578j117i78D07L96L95l83f9r74d51
$$ -1732 -103 1405 1650 1103 862 1211 1498 956 -265 -1843 -2960 -978 407 803 1198 815 -69 -1043 -451
3950H28Q94j5m34m42K20P37L75n40H03l48J319J864J460P01k25j610A343a802
$$ 828 1722 1707 1273 831 1051 1788 2163 1623 803 455 1774 3638 5098 5799 5574 3964 1343 -1802
3931d349j61K18J292J212O02k69N56H55J667O77o33H77a143q85e92E98Q9f03j488
$$ -4349 -4510 -4292 -3000 -1788 -1186 -1455 -899 855 2522 3199 2566 877 -1143 -2028 -592 598 687 -603 -2091
3912b091A91K662J535K16p58j037o65j17q45d8n59a89H00M84k67A24a262j698
$$ -2091 191 2853 4388 4604 3846 2809 2144 2027 1182 -48 -607 -189 800 1284 1017 124 -1262 -2960
3894b960k058K398C81K118Q45J73L73J093K079K241J620j67k406C347b927d3E332
$$ -2960 -5018 -2620 381 2499 3344 3517 3890 4983 7062 9303 10923 10756 8350 3347 -2927 -43 5332
3876H867J486l78j487k235k921j584G3f09D0Q65K28J22j78E19c4o4F85R11J47
$$ 8867 10353 9975 8488 6253 3332 1748 73 -609 40 905 1133 1255 1077 519 -34 -98 685 1596 1743
3857A743q40b12m32l00o86q04l78N64N30d99A039J532J496J334M19q83k187h9
$$ 1743 903 -212 -644 -944 -1630 -2434 -2812 -2248 -1718 -499 1039 2571 4067 5401 5820 4937 2750 -89
3838b384N40R12n47j083n92N63M10L42L34J23J20j32K78j90o28p65n37K7L67N62
$$ -2384 -1844 -932 -1479 -2562 -3154 -2591 -2181 -1839 -1505 -1382 -1262 -1394 -1116 -1306 -1934 -2699 -3236 -3209 -2842 -2280
3818b280N67k96j131L56R86K85k90k22k92J69O62d78D82L47C82c13k28j46e5A186
$$ -2280 -1713 -2009 -3140 -2784 -1798 -1513 -1803 -2025 -2317 -2148 -1486 -478 482 829 382 -313 -541 -687 -55 1186
3797B926J624J274J037K62r44j634B041i52r89i23B19J87g09k470P63H52L155
$$ 2926 4550 5824 6861 7123 6179 4545 2041 -952 -1941 -923 219 406 -709 -3179 -2416 852 4007
3780D007K260P77j371j702j795m89j56n58b18j998k53a49H85A78h79o1K76n9l11
$$ 4007 6267 7044 5673 3971 2176 1687 1531 973 -218 -2216 -2469 -149 885 178 -879 -940 -664 -723 -1034
3761a034p81r81o7N56R36c45D82O10M64A84a640q86J245K40r64j241L01J111P33
$$ -1034 -1815 -2796 -2863 -2307 -1371 -345 482 1092 1556 184 -1640 -2526 -1281 -1041 -2005 -3246 -2945 -1834 -1101
3742a101L14B29J169J002N16L23N60L28J21n16j363F59a112j410r43K96J335e90
$$ -1101 -787 229 1398 2400 2916 3239 3799 4127 4248 3732 2369 659 -1112 -2522 -3465 -3169 -1834 -590
3723a74k89j157q76N55R26L86m3n39l63L02K6o09r08m9R81h07J66n14j94f23b19
$$ -174 -463 -1620 -2496 -1941 -1015 -629 -672 -1211 -1574 -1272 -1246 -1855 -2763 -2812 -1831 -807 -641 -1155 -1349 -623 -219
3701c54j102j351p45J498d08B66O57N51N30j24l73C6a700j756q12J086J261O98
$$ -354 -1456 -2807 -3552 -2054 -408 266 923 1474 2004 1880 1507 36 -1700 -3456 -4268 -3182 -1921 -1223
3683a223L97K51C67Q54O33M23j14q96o30j43M48C69g78n30J97I5Q63C40a123k662
$$ -1223 -826 -575 367 1221 1854 2277 2163 1267 637 494 942 369 -778 -1308 -1111 95 958 340 -1123 -3785
3663c785k99J953A36J831P60L25k10q9k9l65l88o76l31j54Q8P62J434O95m21j555
$$ -3785 -4084 -2131 136 1967 2727 3052 2842 2753 2724 2359 1971 1295 964 810 898 1660 3094 3789 3368 1813
3643A813c29k114n41a478A016J482p7j047g49k465J18i18D90R63P74Q65J441J126
$$ 1813 -329 -2443 -2984 -1478 1016 2498 2421 1374 -749 -3214 -3096 -918 490 1453 2227 3092 4533 5659
3625E659M32m57k204E59b159H55K050P77J6j062j030p60b74j281j558j35L66J068
$$ 5659 6091 5634 3430 559 -2159 855 2905 3682 3698 2636 1606 846 -274 -1555 -3113 -3248 -2882 -1814
3607a814e3B728J635R7m90j040j049o79o2M93N71P43j45A162i38j248F19K448
$$ -1814 -53 2728 4363 4460 3970 2930 1881 1202 1140 1633 2204 2947 2802 1162 -938 -2186 619 3067
3589C067J912M27j097j825A121c45j189j055o23m82K69J337f69I07J133N12J0
$$ 3067 4979 5406 4309 2484 1121 -345 -1534 -2589 -3212 -3694 -3425 -2088 -669 907 2040 2552 2562
3572B562o63G96b72p48j481j787R82R69N89j62n62p88l29M66M03M72R67d77B41
$$ 2562 1899 796 -272 -1020 -2501 -4288 -3306 -2337 -1748 -1910 -2472 -3260 -3589 -3123 -2720 -2248 -1281 -477 241
3552I03P00N37J153J542J510P35j78r83j126j021j050p44KQ12P82L00m89j469
$$ 903 1603 2140 3293 4835 6345 7080 6902 5919 4793 3772 2722 1978 1980 2792 3574 3874 3385 1916
3534A916c1j437M68a47@d12m76n36m95m24J42K75j19r2j4p62j893p46J121J582
$$ 1916 -31 -1468 -1000 -147 0 -412 -888 -1424 -1919 -2343 -2201 -1926 -2045 -2137 -2151 -2913 -4806 -5552 -4431 -2849
3514b849h21a35o38j670j029Q24K82L24R82A84Q26k69c11j668j064R72g71A0J000
$$ -2849 -821 -135 -773 -2443 -3472 -2648 -2366 -2042 -1060 184 1010 741 -311 -1979 -3043 -2071 -771 10 1010
3495A010J021Q68P78j43r40G70A73K77J140M30k96o20j27L32J153K09o47H34m13
$$ 1010 2031 2899 3677 3534 2594 770 173 450 1590 2020 1724 1104 977 1309 2462 2671 2024 834 421
3476D21O05L67F63a343k499j210J928J353L16k37j82O41L69l56m26r32o47Q06
$$ 421 1026 1393 663 -1343 -3842 -5052 -3124 -1771 -1455 -1692 -1874 -1233 -864 -1220 -1646 -2578 -3225 -2419
3458b419M79L64d75H77J059J025Q51l03j638h49j622E04J420l75e2k562o01a051
$$ -2419 -1940 -1576 -475 877 1936 2961 3812 3509 1871 -849 -2471 504 1924 1549 -52 -2614 -3215 -1051
3439A316J652R22K08k03q78j324B0a628j590j482j478j48J825a434H14J144N07
$$ 1316 2968 3890 4098 3895 3017 1693 20 -1628 -3218 -4700 -6178 -6326 -4501 -1434 814 1958 2465
3422B465M4n73D37a609r59a203E18P58J11D99c86l18J21l76M4C60J792R62Rj148
$$ 2465 2509 1936 437 -1609 -2568 -1203 518 1276 1387 499 -386 -704 -583 -959 -915 360 2152 3114 3123 1975
3402A975a30k286j17c51A606J049m0q85B68a497o29O4j364a531A089K530J764
$$ 1975 -130 -2416 -2533 -351 1606 2655 2615 1730 268 -1497 -2126 -2062 -3426 -1531 1089 3619 5383
3385E383J051m50j175j220p34L92O78O00O68P30L71l31j186j986b56k766d57B540
$$ 5383 6434 5984 4809 3589 2855 3247 3925 4525 5193 5923 6294 5963 4777 2791 -256 -3022 -457 2540
3366D410P61pp46j298A453c0p70j16C97J802R12L52r36j135g69k566j802b317
$$ 4410 5171 5164 4418 3120 1453 -30 -800 -916 397 2199 3111 3463 2527 1392 -769 -3335 -5137 -2317
3347B27J329M32L90J26K10m4l35p42n08K65M84M45n9l40J50R26P00N11P09N66
$$ 227 1556 1988 2378 2504 2714 2670 2335 1593 1085 1350 1834 2279 2220 1880 2030 2956 3656 4167 4876 5442
3327E442K15k70j360j856D69b96A09R28J703K485J529k38k188A257D84J976K451
$$ 5442 5657 5387 4027 2171 469 -296 109 1037 2740 5225 6754 6516 4328 1257 484 2460 4911
3310D911J267Pp23j726j340n81k27n20A7a039j307p44J024Q09c57C42O63J23r6
$$ 4911 6178 6185 5462 3736 2396 1815 1588 1068 17 -1039 -2346 -3090 -2066 -1257 -357 342 1005 1128 1032
3291A032l83B31h1q6o17m97n71n63k5J4Po83o12j80J369J226j13j106j873K51
$$ 1032 649 231 -81 -167 -784 -1281 -1852 -2415 -2440 -2426 -2419 -3102 -3714 -3894 -2525 -1299 -1412 -2518 -4391 -4140
3271d140a405A116J958J440J358J183J112R60J41k39j563j746k438A254a54M5
$$ -4140 -1405 1116 3074 4514 5872 7055 8167 9127 9268 9029 7466 5720 3282 1254 -154 -109
3255a09p35L48C54P96O0k58c7j574j552J54R35M63J31j68k24n06n74k87j37m63
$$ -109 -844 -496 354 1150 1210 952 -37 -1611 -3163 -3009 -2074 -1611 -1480 -1648 -1872 -2378 -2952 -3239 -3376 -3839
3235c839J75l2l03j4k04J159Q54Q74L25k78j340j382r66J118J538J43l33P9a137
$$ -3839 -3664 -3696 -3999 -4013 -4217 -3058 -2204 -1330 -1005 -1283 -2623 -4005 -4971 -3853 -2315 -2172 -2505 -2426 -1137
3215C47O70m98b21j243r6L86p8p18n09j84J109M83l81q01m56m50J52L63L48N48
$$ 347 1017 519 -221 -1464 -1560 -1174 -1252 -1970 -2479 -2663 -1554 -1071 -1452 -2253 -2709 -3159 -3007 -2644 -2296 -1748
3195a748O58B0J115J176L31n79r07d4j325j383r85n29K4J7J17rj7J04J396f71
$$ -1748 -1090 20 1135 2311 2642 2063 1156 -44 -1369 -2752 -3737 -4266 -4242 -4225 -4108 -4117 -4134 -4030 -2634 -671
3174A173P23m19D18c27F03J534R41q1p20j041A26d78L7A74J007J243N10L27q16
$$ 1173 1896 1477 418 -327 603 2137 3078 2997 2277 1236 126 -478 -441 174 1181 2424 2934 3261 2445
3155B445F61a000l18K79L76l04r45j088K6R50h76HJ107J058P73L9n23q09A9b409
$$ 2445 661 -1000 -1318 -1039 -663 -967 -1912 -3000 -2974 -2024 -876 8 1115 2173 2946 2985 2462 1653 19 -2409
3134d452r33J125R00L14O36J044d10G85M63B02a505j171e16A951J778Q28n57j294
$$ -4452 -5385 -4260 -3360 -3046 -2410 -1366 -410 785 1248 202 -1505 -2676 -516 1951 3729 4557 4000 2706
3116B706H41g30k41a83F80O67k08c4j733j612L52J74J028O11K81e0E14K24c64
$$ 2706 841 -730 -971 -183 680 1347 1139 -34 -1767 -3379 -3027 -2853 -1825 -1214 -933 -50 514 738 -364
3096b137j829j575J222K058e07D66K20a21r10n9k23L77d24J83O3k25j325j569
$$ -2137 -3966 -5541 -4319 -2261 -507 466 686 -121 -1031 -1090 -1313 -936 -424 -241 -178 -403 -1728 -3297
3078c297m98a620D0J593R59J4q18C00a039j286j197L95j13L08R24M69J90r4n02
$$ -3297 -3795 -1620 40 1633 2592 2606 1788 300 -1039 -2325 -3522 -3127 -3240 -2932 -2008 -1539 -1349 -1443 -1945
3059a945q31l31J455P96r8j17q36j231J168d82D98P14R83R85L07q76I09f70j032
$$ -1945 -2776 -3107 -1652 -856 -954 -1071 -1907 -3138 -1970 -482 498 1212 2195 3180 3487 2611 909 -670 -1702
3040a702m12M55f25a6A065J89k05B73g61o18n42rO47k2n86k10K99h63C84J119
$$ -1702 -2114 -1659 -625 -16 1065 1254 1049 273 -761 -1379 -1921 -1930 -1283 -1305 -1891 -2101 -1802 -863 384 1503
3020A503K11j10N4K27O34P44J78n65j179I2a657j120q77r84J261a376F12J651
$$ 1503 1714 1604 1658 1885 2519 3263 3441 2876 1697 92 -1657 -2777 -3654 -4638 -3377 -1376 612 2263
3002B263Q84L40m7m03r28I38A47a285j17O88G1J079N31J92l01m79m57A22J12b86
$$ 2263 3147 3487 3440 3037 2109 938 147 -1285 -1402 -714 71 1150 1681 1873 1572 1093 636 122 234 -286
2981g67m29n11o67p15p40k54L5L94n89m40Qp04R07Q6M12P19K25M37M77O35J7K76
$$ -767 -1196 -1707 -2374 -3089 -3829 -4083 -4048 -3654 -4243 -4683 -4675 -5379 -4472 -4386 -3974 -3255 -3030 -2593 -2116 -1481 -1464 -1188
2959a188e17a13A1c49q68r17m78n6J46R05f61A93M36k72G7f6k42j36b2A036R43
$$ -1188 -517 -113 11 -349 -1217 -2134 -2612 -2668 -2522 -1617 -661 193 629 357 77 -66 -308 -444 -22 1036 1979
2938A979O04J78p1l18n47o36k54e0j746k760J597a410B74R50L19m49D0a006k57
$$ 1979 2583 2761 2690 2372 1825 1189 935 -50 -1796 -4556 -2959 -1410 274 1224 1543 1094 40 -1006 -1263
2919a263Q4L03M36D70Q12l3I4b100k028j46J327a075D48P98J89Q18O28n8k99m10
$$ -1263 -1179 -876 -440 470 1282 1249 94 -2100 -4128 -4274 -2947 -1075 448 1246 1435 2253 2881 2823 2524 2114
2899B114k99K55L92M04L88n0q13I81b11q79n50p84m9K82j13R4l03k61j32J96a114
$$ 2114 1815 2070 2462 2866 3254 3204 2391 981 -211 -1090 -1640 -2424 -2473 -2191 -2304 -2210 -2513 -2774 -2906 -2710 -1114
2877I05J774J049J68n6l87r2q88r84C35g39l89j65m38q58j329L7O19k91N9P15
$$ 905 2679 3728 3896 3840 3453 3361 2473 1489 335 -739 -1128 -1293 -1731 -2589 -3918 -3881 -3262 -3553 -3494 -2779
2857b779L58L50P01L13J38n76r90p53o34n20L68O53N35Q9q67O00i47A187K861
$$ -2779 -2421 -2071 -1370 -1057 -919 -1495 -2485 -3238 -3872 -4392 -4024 -3371 -2836 -2747 -3614 -3014 -947 1187 4048
2838D048K647P48j260k528A651p44L32J43F16h26k235j168J033J496H1J368k52
$$ 4048 6695 7443 6183 3655 1651 907 1239 1382 616 -826 -3061 -4229 -3196 -1700 81 1449 1197
2821A197f62j439k043J80J767g11D07J46c80k40c2A491j50C23f96j410j317j065
$$ 1197 -662 -2101 -4144 -3964 -2197 -711 407 553 -380 -620 -32 1491 1341 323 -696 -2106 -3423 -4488
2803d488n11J83J118J188J051J53l03n49q53j347K75g63B992L693K969K029J36
$$ -4488 -4999 -4816 -3698 -2510 -1459 -1306 -1609 -2158 -3011 -4358 -4083 -763 2992 6685 9654 11683 11819
2786A1819j469l286B812a066q11E92J034j91o87c34j030q82l63J04L27k49o07
$$ 11819 10350 7064 2812 -1066 -1877 592 1626 1435 748 -334 -1364 -2246 -2609 -2505 -2178 -2427 -3034
2769c034Q80g47D79M94M9k18J70J59M76J057J098J627J680O95o84j333B707a596
$$ -3034 -2154 -747 479 973 1022 804 974 1133 1609 2666 3764 5391 7071 7766 7082 5749 2707 -1596
2750b188A248K902J845J5k181G51b802j620J702f67G50J362O54O22N68J46k46
$$ -2188 1248 4150 5995 6010 3829 751 -2802 -4422 -2720 -667 750 2112 2766 3388 3956 4102 3856
2733C856o64j228B98a529j054R83a96G67q9A56b31B3J53C6c49o58J5b45H27N37
$$ 3856 3192 1964 298 -1529 -2583 -1600 -196 767 678 156 -231 23 176 36 -349 -1007 -992 -245 827 1364
2713A364k14m93G6i96j684j029l74O84P32J54j09J94O7p79j283K25J714a075h0
$$ 1364 1150 657 76 -996 -2680 -3709 -4083 -3399 -2667 -2513 -2622 -2428 -2361 -3140 -4423 -4198 -2484 -1075 -80
2693B86C1f00n15ld39A237J452J247N47p5l96n35o33m66k16j11L9p41B42i89q99
$$ 286 31 -600 -1115 -1118 -439 1237 2689 3936 4483 4408 4012 3477 2844 2378 2162 2051 2090 1349 242 -989 -1888
2672a888q80j66L94J040d94F16Q82Q24N13O7k05r70C73a272j097m44l8O78N49
$$ -1888 -2768 -2934 -2540 -1500 -494 616 1498 2322 2835 2902 2697 1727 373 -1272 -2369 -2813 -2851 -2173 -1624
2653a624f17I1N80M29j40A97a124k066o59Q01Q00N80M06N2M50c68o77r42k24N12
$$ -1624 -617 91 671 1100 960 197 -1124 -3190 -3849 -3048 -2248 -1668 -1262 -1210 -760 -368 -1045 -1987 -2211 -1699
2633a699f02FM48A10K96Q21J198R86K96m18p84l38J14M40Q61J014J102O53M39
$$ -1699 -602 6 454 110 406 1227 2425 3411 3707 3289 2505 2167 2281 2721 3582 4596 5698 6351 6790
2614F790l02o25p61n79o65k4n5r2m48p83A117c91p61l54K05e33E2J51M09L45j00
$$ 6790 6488 5863 5102 4523 3858 3834 3779 3687 3239 2456 1117 -391 -1152 -1506 -1301 -533 52 203 612 957 857
2593H57A6a022j401r53a328I65J916J328Q60m02q97r11r38l18j95F33d47j246
$$ 857 16 -1022 -2423 -3376 -1328 965 2881 4209 5069 4667 3770 2859 1921 1603 1408 633 -447 -1693
2575a693p14N9N20l82j100q35J497g80E49M44B48a265j764K30J172c86D40O28
$$ -1693 -2407 -2348 -1828 -2210 -3310 -4145 -2648 -780 549 993 248 -1265 -3029 -2799 -1627 -386 440 1068
2557A068J49O53N00K06J60l64j043E85B21c89p23j140q96P69B64K523J747R61
$$ 1068 1217 1870 2370 2576 2736 2372 1329 585 221 -389 -1112 -2252 -3148 -2379 264 2787 4534 5495
2539E495k61q82j430j421B07h30j126m61Q68D30J771J031l81A038a123k136J046
$$ 5495 5234 4352 2922 1501 207 -830 -1956 -2417 -1549 430 2201 3232 2851 1038 -1123 -3259 -2213
2522b213a65A005K05E93I8K17J035N33j8l0l25l01K24K00k24k94n3L13N74L44
$$ -2213 -165 1005 1210 593 98 315 1350 1883 1865 1835 1510 1209 1433 1633 1409 1115 1062 1375 1949 2293
2502B293k27m00l79j02A12a054o01i9A428P04k71o54A29e03K05B91M55K98k73
$$ 2293 2066 1666 1287 1185 112 -1054 -1655 -99 1428 2132 1861 1207 129 -503 -298 291 746 1044 771
2483G71d4j222j281m37a487G6L63g23k635q64b041E95J613J41j129b31D20J983
$$ 771 -44 -1266 -2547 -2984 -1487 76 439 -723 -3358 -4222 -2041 595 2208 2349 1220 -231 420 2403
2465B403J540Q18o55j471E22f90M0A94N30j20B72L0O7k0h1p10j090j712J28a042
$$ 2403 3943 4761 4106 2635 522 -690 -650 194 724 604 272 302 369 349 -81 -791 -1881 -3593 -3465 -1042
2444A451J595K30j008A04b425q60J263b56A229J050K55o39F63a015j259k27Q55
$$ 1451 3046 3276 2268 104 -2425 -3285 -2022 -256 1229 2279 2534 1895 663 -1015 -2274 -2501 -1646
2427a646P50c30l9A25O68K96l10f85j145j055N63i83c98n10j076n2K17h48c89
$$ -1646 -896 -330 -369 125 793 1089 779 -685 -1830 -2885 -2322 -983 -398 -908 -1984 -2036 -1819 -848 -389
2407a43C08L49I3f41r19k24h79a60I9Q4P2P12J240J021L46m12j431A50g97k48
$$ -143 308 657 93 -641 -1560 -1784 -879 -160 99 183 255 967 2207 3228 3574 3162 1731 150 -797 -1045
2387a045j70K16K83a78D31M28K59k0J71J23k22C71a503k101l23J597c16A418P98
$$ -1045 -1215 -999 -716 -178 431 859 1118 1098 1269 1392 1170 371 -1503 -3604 -3927 -2330 -316 1418 2216
2368B216K01J51j37q22F34aC14R67N55l81E36h15j183n86R58d30D75Q00Q66J075
$$ 2216 2417 2568 2431 1609 634 -1 314 1281 1836 1455 536 -815 -1998 -2584 -1626 -430 475 1275 2141 3216
2348C216J023L49j71n65q26r18p25n37B36d87n65n8b02G43J189J083Q54K60q28
$$ 3216 4239 4588 4417 3852 3026 2108 1383 846 236 -487 -1052 -1110 -202 743 1932 3015 3869 4129 3301
2329C301j352C78a577p35M66Q70b42J01p26j498j098M37Q85P06N91a6A296J539
$$ 3301 1949 378 -1577 -2312 -1846 -976 -242 -141 -867 -2365 -3463 -3026 -2141 -1435 -844 -16 1296 2835
2311B835J440J611m0k22j167n56q24j058H03a95q76j021j4K81j66o41J11R09c17
$$ 2835 4275 5886 5846 5624 4457 3901 3077 2019 803 -195 -1071 -2092 -2106 -1825 -1991 -2632 -2521 -1612 -317
2291G13L93l89d5q7j85j34m45l20n40o03m36J16Q93f08H80R26N71O1j03o20G92
$$ 713 1106 717 -45 -132 -317 -451 -896 -1216 -1756 -2359 -2795 -2679 -1786 -608 880 1806 2377 2438 2335 1715 792
2269d59j448j538m00a747A575K898J834R64k13o20j450k048A209a82k09F07J693
$$ -459 -1907 -3445 -3845 -1747 1575 4473 6307 7271 7058 6438 4988 2940 1209 -182 -391 607 2300
2252B300J626J73j185j040q51k76l53c64r18p43n90l35Q46P95d8A165P62M69q
$$ 2300 3926 4099 2914 1874 1023 747 394 -364 -1282 -2025 -2615 -2950 -2104 -1309 -48 1165 1927 2396 2388
2233B388k73n60o31l97j54r8A11a10r9m4a3D64M25Q7C75f75m96c75E21L56k67
$$ 2388 2115 1555 924 527 373 275 111 -110 -209 -253 -13 464 889 976 375 -675 -1171 -375 521 877 610
2212F10b02q13r25o86j316j034l68R44Q40J43N86O17J071b06A012R71K87l39p12
$$ 610 -202 -1015 -1940 -2626 -3942 -4976 -5344 -4400 -3560 -3417 -2831 -2214 -1143 -206 1012 1983 2270 1931 1219
2193A219A31a387j446n31J60K92j49n99l29O80P92P39O99c48A71M60B78d99k27
$$ 1219 131 -1387 -2833 -3364 -3204 -2912 -3061 -3660 -3989 -3309 -2517 -1778 -1079 -348 171 631 278 -499 -726
2174g26a83H14J411J520O93n76j812a98k685k072j495q08m6K131K196R22L58j97
$$ -726 -183 814 2225 3745 4438 3862 2050 -198 -2883 -4955 -6450 -7258 -7304 -5173 -2977 -2055 -1697 -1894
2156a894M72D47L345K602Q12j633k431c47k734J5b77A729N27A074e08j333J4Q38
$$ -1894 -1422 447 3792 6394 7206 5573 3142 -347 -3081 -3066 -277 1729 2256 1074 -508 -1841 -1827 -989
2138i89L54L13j73o6Q9b11M2l5j51m75j343j840m88b193a12A932J162L51L5q65
$$ -989 -635 -322 -495 -561 -472 -211 -169 -204 -355 -830 -2173 -4013 -4501 -2193 -112 1932 3094 3445 3480 2615
2118B615o39o28j39M48L08l44o17c48j560n42M79R80d93J11A18O66O17O62L22
$$ 2615 1976 1348 1209 1657 1965 1621 1004 -348 -1908 -2450 -1971 -991 -493 -382 118 784 1401 2063 2385
2099B385J4N1j3O40N03k63p62k94J14K41n98C65b346l225K633A84K491R37kq83
$$ 2385 2399 2450 2437 3077 3580 3317 2555 2261 2375 2616 2018 365 -2346 -5571 -2938 184 2675 3612 3610 2727
2079B727A030i59j470j066p91P19J141J021O87b93k79q10j259j266l84Q65L77
$$ 2727 1030 -959 -2429 -3495 -4286 -3567 -2426 -1405 -718 -293 -572 -1382 -2641 -3907 -4291 -3426 -3049
2062c049j75k03j03l41P08J087i91P9m02q68p16P3n44m34Q03a131H20J354L06
$$ -3049 -3224 -3427 -3530 -3871 -3163 -2076 -991 -912 -1314 -2182 -2898 -2825 -3369 -3803 -3000 -1131 820 2174 2480
2043B480p71B31a420j592j571J320a186B72N20J98K31K86L1l97D06c84k21D2M35
$$ 2480 1709 231 -1420 -3012 -4583 -3263 -1186 272 792 990 1221 1507 1538 1141 406 -384 -605 42 477
2024D77B05f01n66p47m33l19p76p48Q43i74A176J345P97k35j342a06j420p88M17
$$ 477 205 -601 -1167 -1914 -2347 -2666 -3442 -4190 -3347 -974 1176 2521 3318 3083 1741 -106 -1526 -2314 -1897
2005a897K40O18A89J538Q20k29p28E11f21q42n35k70K7m3r2N84g91a7C54a52j967
$$ -1897 -1657 -1039 189 1727 2547 2318 1590 511 -621 -1463 -1998 -2268 -2241 -2284 -2376 -1792 -791 -17 354 -152 -2119
1984b119k951Q24K107C96J868M77m98A078e23j344o14N3M64f23I86J559J158N64
$$ -2119 -5070 -4246 -2139 396 2264 2741 2243 1078 -523 -1867 -2481 -2428 -1964 -623 986 2545 3703 4267
1966D267n64j554G92g19j440P8A70J008j36c72j659K99B19R93m45A98h78l72r8
$$ 4267 3703 2149 792 -719 -2159 -2081 170 1178 1042 -372 -2031 -1732 219 1212 767 198 -878 -1250 -1348
1947a348L37L64c15J37E38J038Q09k03r10D17a39j16m38j185j538R0a460A17J990
$$ -1348 -1011 -647 -315 -178 538 1576 2385 2182 1272 417 -139 -255 -693 -1878 -3416 -3326 -1460 117 2107
1928B107J933J917J400Q51L16r38j758j623m18M44j75m90j625e13k449l93P67
$$ 2107 4040 5957 7357 8208 8524 7586 5828 4205 3787 4231 4056 3566 1941 -513 -2962 -3355 -2588
1911b588L32P59C10K474L059L070K168J139J99o61j852k878C370A90h86C93J670
$$ -2588 -2256 -1497 310 2784 5843 8913 11081 12220 12419 11758 9906 7028 3370 190 -886 393 2063
1894B063Q28j94k33J387L545L293J403m09j515j963j776n88Q0N33j34p84o21j211
$$ 2063 2891 2697 2464 3851 7396 10689 12092 11683 10168 8205 6429 5841 5921 6454 6320 5536 4915 3704
1876C704j782b96q08D60J870P99o39H60a365k102O27L75m72n83N11J248b60A377
$$ 3704 1922 -296 -1104 460 2330 3129 2490 860 -1365 -3467 -2840 -2465 -2937 -3520 -3009 -1761 -260 1377
1857A716m29C72a21G93J442M04o65E18a447j101J86M05j4m17Q38O81L43J21l32
$$ 1716 1287 372 -121 793 2235 2639 1974 518 -1447 -2548 -2362 -1957 -1971 -2388 -1550 -869 -526 -405 -737
1838g37m81o48m62L50L61N9J67M76AQ36J87l58j74A74c04R6@d8r1k37l70k76n61
$$ -737 -1218 -1866 -2328 -1978 -1617 -1558 -1391 -915 1 837 1024 666 492 174 -304 -208 0 -48 -139 -376 -746 -1022 -1583
1815a583r36o08a514G65J592L12j306a744k853a838A120J866m5q64E75h09j240
$$ -1583 -2519 -3127 -1514 765 2357 2669 1363 -1744 -4597 -1838 1120 2986 2941 2077 575 -809 -2049
1798b049q75oO35Q49B58J773J301N82n81j160I66N15J315P66q74A004a597q88
$$ -2049 -2924 -2930 -2295 -1446 258 2031 3332 3914 3333 2173 966 1481 2796 3562 2688 1004 -1597 -2485
1780b485I40K346J266k47j579a146m133J321G59L597K592N58j089j677j361q33
$$ -2485 940 3286 4552 4305 2726 -1146 -5279 -3958 759 4356 6948 7506 6417 4740 3379 2546
1764B546n66I89f6j364m48K14N95c51B77K91B33d47p93J42c36A93K17J42K45O15
$$ 2546 1980 989 -66 -1430 -1878 -1664 -1069 -351 277 568 233 -447 -1240 -1098 -336 193 410 552 797 1412
1744A412Q5n17e84k308N13c8A924R88k2j275d35k389j268J417J095K89n79j586
$$ 1412 1497 980 -584 -2892 -2379 -38 1924 2912 2890 1615 -435 -2824 -4092 -2675 -1580 -1291 -1870 -3456
1726c456L93a184a19A44M67J442K316K337J721J638k62j856k868A851a086E1J535
$$ -3456 -3063 -1184 -119 144 611 2053 4369 6706 8427 10065 9803 7947 5079 1851 -1086 51 1586
1709A586L5A7c135l154J092J828Q60l3k5J018B04J174N66k37q35f29q06o50K68
$$ 1586 1621 17 -3135 -6289 -5197 -3369 -2509 -2542 -2567 -1549 204 1378 1944 1707 872 -629 -1435 -2085 -1817
1690a817N72d5A715K477J680O25j832A067d390O75D10K766O72j570f16j935J229
$$ -1817 -1245 -45 1715 4192 5872 6497 4665 1067 -4390 -3715 410 3176 3848 2278 -616 -2551 -1322
1673a322H90J090R6q97D95R60J344J216K50K12O83k62q58p62j226C79a830j706
$$ -1322 890 1980 2076 1179 495 1455 2799 4015 4265 4477 5160 4898 4040 3278 2052 379 -1830 -3536
1655c536J658G00J926J327J60n20o78n92n73D70a124q48h69E84N48k3m59b75j121
$$ -3536 -1878 700 2626 3953 4113 3593 2915 2323 1750 470 -1124 -1972 -869 584 1132 1109 650 -275 -1396
1636a396q14j139q70l37j62O56b014B70J807Q36K96o36E90a352o98n45K05Q40
$$ -1396 -2210 -3349 -4219 -4556 -4718 -4062 -2014 270 2077 2913 3209 2573 590 -1352 -2050 -2595 -2390 -1550
1618a550P68L85pl17k03J2J36L60J83P5k96k18J84l48o76j144p54K22Q31J144
$$ -1550 -782 -397 -404 -721 -924 -912 -776 -416 -233 -158 -454 -672 -488 -836 -1512 -2656 -3410 -3188 -2357 -1213
1598a213b05G5L52N07K65l57B27b93m91n53q20r29j057o62r33J126J407P91j45
$$ -1213 -205 75 427 934 1199 842 227 -293 -784 -1337 -2157 -3086 -4143 -4805 -5738 -4612 -3205 -2414 -2559
1579b559p80m57M29j56qJ29J001N95f35A442K803K647J517K26j391k648A030b430
$$ -2559 -3339 -3796 -3367 -3523 -3531 -3402 -2401 -1806 -635 1442 4245 6892 8409 8635 7244 4596 1030 -2430
1560c341J636c53G69N7B89h41j801j805j657j80J63J64J550J554Q49K06j106j372
$$ -3341 -1705 -353 769 826 289 -841 -2642 -4447 -6104 -6284 -6121 -5957 -4407 -2853 -2004 -1798 -2904 -4276
1542d276a118A936K572J837J26j428B460D38a238j919j369J614h74E56J281n21
$$ -4276 -1118 1936 4508 6345 6471 5043 2460 438 -1238 -3157 -4526 -2912 -874 556 1837 1316
1526A316h62k270q12J361J084M55J1j95j53o95r91j446k01J093J380g26E45Q21
$$ 1316 -862 -3132 -3944 -2583 -1499 -1044 -1033 -1228 -1381 -2076 -3067 -4513 -4714 -3621 -2241 -726 545 1366
1508A366M64R0l13m10l71k86B49a81k32l98j09J21L72C94M32c20j872k96a244
$$ 1366 1830 1920 1607 1197 826 540 249 -181 -413 -811 -920 -799 -427 394 826 -320 -2192 -2488 -1244
1488F87J730J027K71j003A206c05k173r53k1K57L12O04K3j93r0k88J58l6K32N12
$$ 687 2417 3444 3715 2712 1206 -305 -2478 -3431 -3452 -3195 -2883 -2279 -2256 -2449 -2539 -2827 -2669 -2705 -2473 -1961
1468a961c84A028Q43J76E82b375j964K006g02I7j0i31k071k325j177J528J244
$$ -1961 -384 1028 1871 2047 582 -2375 -4339 -2333 -702 97 87 -931 -3002 -5327 -6504 -4976 -3732
1451c732M28J130g19A067J101J57n93F04b22l97l17L31A9J086R04Q86n20q54E54
$$ -3732 -3304 -2174 -719 1067 2168 2325 1732 604 -222 -619 -936 -605 19 1105 2009 2895 2375 1521 554
1431f57j921j249i57A699J693J78r17A041e08j208q17j57j78J28M92O58J30P17
$$ -657 -2578 -3827 -957 1699 3392 3570 2653 1041 -508 -1716 -2533 -2690 -2868 -2740 -2248 -1590 -1460 -743
1413g43b53j11j009k117j516l24J071O99K25J29M68Q91e78F85R95O20j079h91
$$ -743 -253 -364 -1373 -3490 -5006 -5330 -4259 -3560 -3335 -3206 -2738 -1847 -578 685 1680 2300 1221 -891
1394c355J64e41A912J933P92o39j520I79B69M41M89K3E84k19O60L38D41i67k494
$$ -3355 -3191 -541 1912 3845 4637 3998 2478 979 269 710 1199 1222 584 365 1025 1363 441 -967 -3461
1375c461j138J460a450c76k46n85d86A329J035p0j106b22m90j7b81C04a97p99
$$ -3461 -4599 -3139 -1450 -376 -622 -1207 -486 1329 2364 2294 1188 -222 -712 -729 -281 304 -197 -996
1357i96j352n10a261H2i2j907p42a300D43R02k0E21e24j136k04M09P20K68r28
$$ -996 -2348 -2858 -1261 82 -92 -1999 -2741 -1300 443 1345 1325 521 -524 -1660 -1864 -1455 -735 -467 -1395
1338a395j605n4r53J504c73A368P50k21H32g52j564j689J676a02A347O76J16m68
$$ -1395 -3000 -3054 -4007 -2503 -373 1368 2118 1897 832 -752 -2316 -4005 -2329 -102 1347 2023 2139 1671
1320A671G57c98j529j444o67J550h28H08J293O91L1n53j122d48j458o26o91r70
$$ 1671 757 -398 -1927 -3371 -4038 -2488 -828 808 2101 2792 2823 2270 1148 -448 -1906 -2532 -3223 -4193
1302d193N8l22J156J471d13A487J961J678J243O01p20j519j689A272c41j781j271
$$ -4193 -4135 -4457 -3301 -1830 -413 1487 3448 5126 6369 6970 6250 4731 3042 1272 -341 -2122 -3393
1285c393J532d99C40J360Q46Q75p54j035m78j33j7j90a17j439p10O8R15c09G8
$$ -3393 -1861 -499 340 1700 2546 3421 2667 1632 1154 1021 1004 814 -117 -1556 -2266 -2198 -1283 -309 78
1265A18f8j140j668k18N14P06O83d73e1C43K95M87K45J82j37K17L66m3N5k39m93
$$ 118 -68 -1208 -2876 -3094 -2580 -1874 -1191 -473 -51 343 638 1125 1370 1552 1415 1632 1998 1955 2010 1771 1278
1244A278A59h76q41k7k8K4k97p93l91J216d56I48O27n70b77r84M50D66J406N62
$$ 1278 159 -876 -1717 -1744 -1772 -1748 -2045 -2838 -3229 -2013 -456 948 1575 1005 -277 -1261 -811 466 1872 2434
1224B434q46b84k250j054a195A75M74j97M69P57M28A020e93k150O78b54B43i9
$$ 2434 1588 -284 -2534 -3588 -1195 175 649 452 921 1678 2106 1020 -593 -2743 -2065 -254 243 -99
1205a521j519r7Q20J071L28L0j10J68a92I12J097P44N78L19J51l06k70j236b36
$$ -1521 -3040 -3137 -2317 -1246 -918 -888 -998 -830 -192 912 2009 2753 3331 3650 3801 3495 3225 1989 -236
1185c382j659K053a250E50J171M92k02o89D97f13j276q67j25J07J33r23r40n10
$$ -3382 -5041 -2988 -1250 550 1721 2213 2011 1322 497 -613 -1889 -2756 -2881 -2774 -2641 -3564 -4504 -5014
1167e014P78J194a087B31N30k51d48j741j886L23K79Q61R08e48B48O00K20C79
$$ -5014 -4236 -3042 -1087 231 761 510 -448 -2189 -4075 -3752 -3473 -2612 -1704 -548 248 848 1068 379
1148a91m77k28o30q88o45K49a185c12G3f0k69m62k34n40l26m85m76l21O22J181
$$ -191 -668 -896 -1526 -2414 -3059 -2810 -1185 -312 73 -60 -329 -791 -1025 -1565 -1891 -2376 -2852 -3173 -2551 -1370
1128a370b36C83p1b7m64m17l95o09n29j075m33M06O89N84K41m62p08k90J079a063
$$ -1370 -236 383 312 -27 -491 -908 -1303 -1912 -2441 -3516 -3949 -3543 -2854 -2270 -2029 -2491 -3199 -3489 -2410 -1063
1107C02M52D6a307j339l35K8o18Q17c69B152K878K778K243R30n74k129l527A747
$$ 302 754 46 -1307 -2646 -2981 -2953 -3571 -2754 -369 2152 5030 7808 10051 10981 10407 8278 4751 1747
1088b14m03K60a32d0D45Q64N23l29m69J44N62O06J30m15r43a64j412j762q90N27
$$ -214 -617 -357 -132 -40 445 1309 1832 1503 1034 1178 1740 2346 2476 2061 1118 -164 -1576 -3338 -4228 -3701
1068c701O83J148f13G21R60K96k69G90c46j009o12m70j23J104d19F6a6q94j118
$$ -3701 -3018 -1870 -613 721 1681 1977 1708 790 -346 -1355 -1967 -2437 -2560 -1456 -419 66 -16 -910 -2028
1049b028j115M95M35j1j34m01jL05M85K19Q47E13J658K034K196J241p9o04r63
$$ -2028 -3143 -2648 -2213 -2224 -2358 -2759 -2760 -2455 -1970 -1751 -904 513 2171 4205 6401 7642 7563 6959 5996
1030E996j486k237f85k962q46K023f35B71O83k96c60j934k122b174B35J935J239
$$ 5996 4510 2273 -685 -3647 -4493 -2470 -635 271 954 658 -360 -2294 -4416 -2174 235 2170 3409
1013C409R87M58l99j458I54a246j709j046k53R65J393R07M28b35a8j70l61r44
$$ 3409 4396 4854 4455 2997 954 -1246 -2955 -4001 -4254 -3289 -1896 -989 -561 -235 -18 -188 -549 -1493
995a493j124r55M60P99O73l2m28p0h53A013K103K541J777J064M40R3k45j151j319
$$ -1493 -2617 -3572 -3112 -2313 -1640 -1672 -2100 -2170 -853 1013 3116 5657 7434 8498 8938 9031 8786 7635 6316
976F316j551j662A066d58j614j138n79K7O32P51K66m67j375j137P29J839a043
$$ 6316 4765 3103 1066 -458 -2072 -3210 -3789 -3762 -3130 -2379 -2113 -2580 -3955 -5092 -4363 -2524 -1043
958h6k89o88j63r7Q0l3J38j098p99J497F67J890J510J006O33k51L02L47J92p20
$$ -86 -375 -1063 -1226 -1323 -1243 -1276 -1138 -2236 -3035 -1538 667 2557 4067 5073 5706 5455 5757 6104 6296 5576
938E576j833G22b588J056B021K468R53o38j751H94h64L57A106J501J049J58n52
$$ 5576 3743 722 -2588 -1532 2021 4489 5442 4804 3053 894 -864 -507 1106 2607 3656 3814 3262
921C262j515h09k427n8R89O01l29m98f71A985J682O25p51q37j224b54j367c36
$$ 3262 1747 -809 -3236 -3294 -2305 -1704 -2033 -2531 -671 1985 3667 4292 3541 2704 1480 -254 -1621 -336
902A013M57k80C27h90j247q70J56N91Q09M94L0m84m33o35r14q96k42N53J172a184
$$ 1013 1470 1190 327 -890 -2137 -3007 -2851 -2260 -1451 -957 -927 -1411 -1844 -2479 -3393 -4289 -4531 -3978 -2806 -1184
881C40J616L84n99q62C71J89K82b4j500o72h71A315J845L82j339G50A30J135K302
$$ 340 1956 2340 1741 879 371 560 842 -24 -1524 -2196 -871 1315 3160 3542 2203 750 130 1265 3567
862C567J176J89j558G35b192k086a807E47J683O69q0o17j050c84j015Q5e71H95
$$ 3567 4743 4932 3374 735 -2192 -4278 -1807 547 2230 2899 2819 2202 1152 -384 -1399 -1314 -571 895
843B128J079J56o16r77C31a230j529j148J25J628b99E57N36n8k81l17I2K92J182
$$ 2128 3207 3363 2747 1770 331 -1230 -2759 -3907 -3782 -2154 -299 557 1093 1035 754 437 92 384 1566
824A566J360K056O81o63j568j276k54N78N31R3n85j011D72d62k78k45L23j94l02
$$ 1566 2926 4982 5663 5000 3432 2156 1902 2480 3011 3104 2519 1508 472 -462 -740 -985 -662 -856 -1158
805a158k74j88M9L62N34a66B0J25A0J3L9KJ68a02j023q03n36p24k13k18M32J291
$$ -1158 -1432 -1620 -1571 -1209 -675 -166 20 145 10 23 62 64 232 -102 -1125 -1928 -2464 -3188 -3401 -3619 -3187 -1896
783a896c54G43J048R15j73n86l71k6l15o10f23j140j672j650Q76K072E72K469
$$ -1896 -354 743 1791 2706 2533 1947 1576 1550 1235 625 -623 -1763 -3435 -5085 -4209 -2137 572 3041
765C041J601J134M5n52q61n06j614E38a225j211n88O0K95J50R4O68g93b29m45
$$ 3041 4642 5776 5821 5269 4408 3902 2288 538 -1225 -2436 -3024 -2964 -2669 -2519 -2425 -1757 -793 -229 -674
746f74o91p06p75j21O1L75M24J00MQ13E70J642J699R85K30L7m76j017r49r47F15
$$ -674 -1365 -2071 -2846 -2967 -2906 -2531 -2107 -2007 -2003 -1190 570 2212 3911 4896 5126 5163 4687 3670 2721 1774 615
724a177j901j365J682a090e16k80j039j623m36B1K449P74p74o58n73C95g71q65
$$ -1177 -3078 -4443 -2761 -1090 -516 -796 -1835 -3458 -3894 21 2470 3244 2470 1812 1239 395 -771 -1636
706a636m91k25l00K8a215C73J411J525M22k73j443a65k409k252L32J320R87N16
$$ -1636 -2127 -2352 -2652 -2624 -1215 373 1784 3309 3731 3458 2015 -165 -2574 -4826 -4494 -3174 -2187 -1671
688a671N85L72Lj16J44J16K35P4l19o32j002q27q43M5J162a089B31J020K24K05
$$ -1671 -1086 -714 -711 -827 -683 -567 -332 -258 -577 -1209 -2211 -3038 -3881 -3836 -2674 -1089 231 1251 1475 1680
668A680H04f75r51o01K15j10j357q19M06J406R75O93O4l94j45j48n62m39j05K04
$$ 1680 804 -675 -1626 -2227 -2012 -2122 -3479 -4298 -3892 -2486 -1511 -818 -754 -1148 -1293 -1441 -2003 -2442 -2547 -2343
648b343O32P05D5N45K42J04K26l2m22c99m11k90j406q01JJ39O3K98a354G23J673
$$ -2343 -1711 -1006 45 590 832 936 1162 1130 708 -399 -810 -1100 -2506 -3307 -3306 -3167 -3104 -2806 -1354 723 2396
627B396J160J755J385P89j06q51j597j956A353A31g56q30q09J16O74N11l6K16
$$ 2396 3556 5311 6696 7485 7379 6528 4931 2975 1353 131 -756 -1586 -2395 -2279 -1605 -1094 -1130 -914
609i14K30b19A28C4i89j405j674J92O84O62L63L04k25p12p15l49k68J2P59K25
$$ -914 -684 -219 128 34 -989 -2394 -4068 -3876 -3192 -2530 -2167 -1863 -2088 -2800 -3515 -3864 -4132 -4120 -3361 -3136
589c136M36J105F7J266J087L87K77o25j93j93j14p34b95k114k244L12J979a171
$$ -3136 -2700 -1595 67 1333 2420 2807 3084 2459 2266 2073 1959 1225 -295 -2409 -4653 -4341 -2362 -1171
570g66N4j441k15c09A954J873J346L7p28j034j378G34c23n02L2K19G8J234R71
$$ -766 -712 -2153 -2368 -309 1954 3827 5173 5210 4482 3448 2070 734 -323 -825 -793 -574 78 1312 2283
551B283P35N80r4q33j198C65H8O06N35K7m64a85r55l20O4L53K58l63j04K15n77
$$ 2283 3018 3598 3504 2671 1473 365 88 694 1229 1256 792 -185 -1140 -1460 -1396 -1043 -785 -1148 -1252 -1037 -1614
530a614o54o33r20l9L00J83N5l07p00K94a728I14J416m62a52l482a590B366M456
$$ -1614 -2268 -2901 -3821 -3860 -3560 -3377 -3322 -3629 -4329 -4035 -1728 914 2330 1868 -152 -3634 -1590 2366 6822
511F822L283J364r54k647l751B46b636o12Q4J69Q85J024C61Q08R3m44l58j4K89
$$ 6822 10105 11469 10515 7868 4117 246 -2636 -3248 -3164 -2995 -2110 -1086 361 1169 1262 818 460 446 735
492G35N16R42P39L23q13H78g01j387k03Q6j47o64L20P50P75a6A591J853J313M16
$$ 735 1251 2193 2932 3255 2442 878 -701 -2088 -2291 -2205 -2352 -3016 -2696 -1946 -1171 -16 1591 3444 4757 5173
472E173n80j149A707B2a246p56M25b08A546J825J633P29L20k03l52q99j021j291
$$ 5173 4593 3444 1707 22 -1246 -2002 -1577 -208 1546 3371 5004 5733 6053 5850 5498 4599 3578 2287
454B287G95i89j441j665m64M09J672c14A835J123j85r81A3b405j763a901e26C92
$$ 2287 795 -989 -2430 -4095 -4559 -4150 -2478 -314 1835 2958 2773 1792 13 -2405 -4168 -1901 -526 392
435D46A30e09p5b73C51R54O5P75P34j151E00a146r98m90J98M38J25N04e36D17
$$ 446 130 -509 -584 -273 351 1305 1370 2145 2879 1728 500 -1146 -2144 -2634 -2436 -1998 -1873 -1369 -536 417
414C78l6j52b14j085j364q75n29P46Q89N31j29K82O95a59G03R68L80k39F50a185
$$ 378 342 190 -214 -1299 -2663 -3538 -4067 -3321 -2432 -1901 -2030 -1748 -1053 -159 703 1671 2051 1812 650 -1185
393c253P1f6B913J641K2j358A070a155j246J99N66n15j152j296J012M64J18k80
$$ -3253 -3182 -66 2913 4554 4576 3218 1070 -1155 -2401 -2202 -1636 -2151 -3303 -4599 -3587 -3123 -3005 -3285
375c285m00l1K95N54N12p5l19J32K94p2o59q71r63J651H64L589K561J335nj167
$$ -3285 -3685 -3716 -3421 -2867 -2355 -2430 -2749 -2617 -2323 -2395 -3054 -3925 -4888 -3237 864 4453 7014 8349 8344 7177
355G177j557k205A020a958j140c25A660N41q93e5j269K8e37B41O75M57J45%F81
$$ 7177 5620 3415 1020 -1958 -3098 -325 1660 2201 1308 -55 -1324 -1296 -537 241 916 1373 1518 1518 681
335e80j495j139O15g01A96J07K7j58c75m05k82L8j269j613J18J383R05p0p33j092
$$ -580 -2075 -3214 -2599 -701 196 303 330 172 -375 -780 -1062 -1024 -2293 -3906 -3788 -2405 -1500 -1570 -2303 -3395
315c395Q90R86O81L7j19J01r0p79j90c55A339R45Q9q19B18a681j540r94j77J068
$$ -3395 -2505 -1519 -838 -801 -920 -819 -909 -1688 -1878 -355 1339 2284 2373 1554 218 -1681 -3221 -4215 -4392 -3324
295c324J072N12M0n28j047L52J296c20B78N39j54A72f41j247j159r59J44J140
$$ -3324 -2252 -1740 -1700 -2228 -3275 -2923 -1627 -320 278 817 663 172 -641 -1888 -3047 -4006 -3862 -2722
277b722O57j78J57L47M47O23K91m06r07j020o37M2J4K81Q91h77B43L69M65Q77
$$ -2722 -2065 -2243 -2086 -1739 -1292 -669 -378 -784 -1691 -2711 -3348 -3306 -3292 -3011 -2120 -877 243 612 1077 1954
257A954J540J673J456J084N56l61j081j956k173D47a263r27P8O78d55H06J131
$$ 1954 3494 5167 6623 7707 8263 7902 6821 4865 2692 447 -1263 -2190 -2112 -1434 -455 806 1937
240A937L71o29D18a571k572O90a386A36P45D07a198k331j975K145a438B1J136
$$ 1937 2308 1679 418 -1571 -4143 -3453 -1386 136 881 407 -1198 -3529 -5504 -3359 -1438 21 1157
223A157P00P95K39k31p12n21N23Q5q46A58d40K8J21K3n49o47j077j249R74a141
$$ 1157 1857 2652 2891 2660 1948 1427 1950 2035 1189 158 -440 -412 -291 -268 -817 -1464 -2541 -3790 -2816 -1141
202d9D87rI4d04m24m94n98j208n95N97J303e02G48R03J184J571J048l32j288j881
$$ -49 487 478 94 -404 -828 -1322 -1920 -3128 -3723 -3126 -1823 -502 748 1651 2835 4406 5454 5122 3834 1953
182A953f01k583m5p18M90M72J19L07M38e46A434J358L51q67H44g76j177C12J585
$$ 1953 -601 -3184 -3229 -3947 -3457 -2985 -2866 -2559 -2121 -546 1434 2792 3143 2276 844 -776 -1953 312 1897
163A897P78N24O0l25j253B37j0R66P08J03m84l58j93O7nm17j05P71J327J602R20
$$ 1897 2675 3199 3259 2934 1681 237 227 1193 1901 2004 1520 1162 969 1036 1031 614 509 1280 2607 4209 5129
142E129n06j803C04a731e96I74O51l49b59j866j307R05Q23j77j215j059J158P42
$$ 5129 4623 2820 304 -1731 -596 974 1625 1276 -259 -2125 -3432 -2527 -1704 -1881 -3096 -4155 -2997 -2255
124b255J102G73J888Q81n45A308a316k071J216O09n51P4L63J93q1k79K94L90l0
$$ -2255 -1153 773 2661 3542 2997 1308 -1316 -3387 -2171 -1562 -2113 -2039 -1676 -1483 -1564 -1843 -1549 -1159 -1189
105a189m02n17k46N78d09C65J074J139O14p49A042e3m2A84a90m40b05H70L78j66
$$ -1189 -1591 -2108 -2354 -1776 -409 365 1439 2578 3192 2443 1042 -53 -95 184 -190 -630 -205 870 1248 1082
85A082D42a25m1B02L03C9b56aI15M90k69m67M58J461J431R04n31j416l84J277
$$ 1082 442 -125 -166 202 505 39 -256 -1 915 1405 1136 669 1127 2588 4019 4923 4392 2976 2592 3869
65C869Q70r7j761A130b84n83K80A060K261J796O04j407A197b849c29B189R26r31
$$ 3869 4739 4642 2881 1130 -284 -867 -587 1060 3321 5117 5721 4314 1197 -2849 -329 2189 3115 2184
47B184Cb274r98J38j59J140h37b23B66e25j168M89d62E60J535O99m35j005O13
$$ 2184 3 -2274 -3272 -3134 -3293 -2153 -837 -223 266 -525 -1693 -1204 -462 560 2095 2794 2359 1354 1967
28A967K104J194m93B120a083m2I09Q83p18c30j260n33K55o09o45J232a66E74B01
$$ 1967 4071 5265 4772 2120 -1083 -1125 909 1792 1074 -330 -1590 -2123 -1868 -2477 -3122 -1890 -166 574 201
8a343j723h16C31a37j879n47C15J808
$$ -1343 -3066 -816 331 -137 -2016 -2563 315 2123
0B123
$$ 2123
##PAGE= F1=-2.202297678447e-005
$$ [...]