
##TITLE=AC1408_AMCAH12217_7653457_wT77oWUpKg
##JCAMPDX= 6.0         $$ Bruker NMR JCAMP-DX V2.0
##DATA TYPE= NMR SPECTRUM
##DATA CLASS= NTUPLES
##ORIGIN= BRUKER
##OWNER= Administrator
$$ 1.72 TOPSPIN		Version 2.1
$$ 2013-03-19 21:27:46.357 -0500  Administrator@X
$$ Compression mode = diff/dup
##.OBSERVE FREQUENCY= 400.02188249412
##.OBSERVE NUCLEUS= ^1H
##.ACQUISITION MODE= SIMULTANEOUS (DQD)
##.ACQUISITION SCHEME= undefined
##.AVERAGES= 8
##.DIGITISER RES= 22
##SPECTROMETER/DATA SYSTEM= spect
##.PULSE SEQUENCE= zg30
##.SOLVENT NAME= COFFEE_meoh
##.SHIFT REFERENCE= INTERNAL, COFFEE_meoh, 1, 14.98509
##AUDIT TRAIL= $$ (NUMBER, WHEN, WHO, WHERE, PROCESS, VERSION, WHAT)
$$ ##TITLE= Audit trail, TOPSPIN		Version 2.1
$$ ##JCAMPDX= 5.01
$$ ##ORIGIN= Bruker BioSpin GmbH
$$ ##OWNER= Administrator
$$ $$ E:\/data/COFFEE/nmr/AC1408_AMCAH12217_7653457_wT77oWUpKg/10/pdata/1/auditp.txt
$$ ##AUDIT TRAIL=  $$ (NUMBER, WHEN, WHO, WHERE, PROCESS, VERSION, WHAT)
(   1,<2013-03-19 21:27:38.123 -0500>,<Administrator>,<X>,<go>,<TOPSPIN 2.1>,
      <created by zg
	started at 2013-03-19 21:26:32.076 -0500,
	POWCHK enabled, PULCHK disabled,
       configuration hash MD5:
       86 BA 57 50 F2 9D 5C 9B 26 00 A9 28 5F 66 2E 89
       data hash MD5: 64K
       02 BD 5B 11 B1 F2 FB 2C D0 8B 07 94 D9 A9 E0 44>)
(   2,<2013-03-19 21:27:41.232 -0500>,<Administrator>,<X>,<proc1d>,<TOPSPIN 2.1>,
      <Start of raw data processing
       efp LB = 0 FT_mod = 6 PKNL = 1 PHC0 = 0 PHC1 = 0 SI = 32K 
       data hash MD5: 32K
       D5 BE 9D 7A A0 07 07 E7 98 67 17 B4 C0 C3 AE 88>)
(   3,<2013-03-19 21:27:41.685 -0500>,<Administrator>,<X>,<proc1d>,<TOPSPIN 2.1>,
      <pk PHC0 = 102.1124 PHC1 = 0 
       data hash MD5: 32K
       2C 0E 5D 1D BC BB CA 83 51 BD 6A 07 20 E5 70 B0>)
(   4,<2013-03-19 21:27:41.920 -0500>,<Administrator>,<X>,<proc1d>,<TOPSPIN 2.1>,
      <abs ABSG = 1 
       data hash MD5: 32K
       C3 F5 D3 FB 13 71 FD 03 49 C1 4A 14 7C 8A EC 84>)
(   5,<2013-03-19 21:27:42.091 -0500>,<Administrator>,<X>,<proc1d>,<TOPSPIN 2.1>,
      <abs ABSG = 2 
       data hash MD5: 32K
       0C 5F E9 64 69 70 18 FB 4F A3 DB 1B 2F 9D B7 A5>)
(   6,<2013-03-19 21:27:42.232 -0500>,<Administrator>,<X>,<proc1d>,<TOPSPIN 2.1>,
      <abs ABSG = 3 
       data hash MD5: 32K
       57 F0 AE B4 36 8A 5B D0 54 CB 19 C7 DD B5 A1 E6>)
(   7,<2013-03-19 21:27:42.373 -0500>,<Administrator>,<X>,<proc1d>,<TOPSPIN 2.1>,
      <abs ABSG = 4 
       data hash MD5: 32K
       0F 0F EC A7 26 D5 D0 6F 4E 60 F9 13 EB 09 9D 37>)
(   8,<2013-03-19 21:27:42.529 -0500>,<Administrator>,<X>,<proc1d>,<TOPSPIN 2.1>,
      <abs ABSG = 5 
       data hash MD5: 32K
       CF 28 0A 96 F1 1A 1D 55 DA 3D 70 05 79 5D 8C 82>)
$$ ##END=
$$ 
$$ $$ hash MD5
$$ $$ 1F 6A B9 C1 E5 A1 C7 E8 47 F8 BF B5 B6 5E FC 1F
##$RELAX= 
##$RELAX= 
##$RELAX= 
##$RELAX= 
##$RELAX= 
##$RELAX= 
##$RELAX= 
$$ Bruker specific parameters
$$ --------------------------
##$DU= <E:\>
##$EXPNO= 10
##$NAME= <AC1408_AMCAH12217_7653457_wT77oWUpKg>
$$ [...]
150 150 150 150 150 150 150 150
##$TP07= 0
##$TPNAME0= <>
##$TPNAME1= <>
##$TPNAME2= <>
##$TPNAME3= <>
##$TPNAME4= <>
##$TPNAME5= <>
##$TPNAME6= <>
##$TPNAME7= <>
##$TPOAL= (0..7)
0.5 0.5 0.5 0.5 0.5 0.5 0.5 0.5
##$TPOFFS= (0..7)
0 0 0 0 0 0 0 0
##$TUNHIN= 0
##$TUNHOUT= 0
##$TUNXOUT= 0
##$USERA1= <user>
##$USERA2= <user>
##$USERA3= <user>
##$USERA4= <user>
##$USERA5= <user>
##$V9= 5
##$VALIST= <valist>
##$VCLIST= <CCCCCCCCCCCCCCC>
##$VD= 0
##$VDLIST= <DDDDDDDDDDDDDDD>
##$VPLIST= <PPPPPPPPPPPPPPP>
##$VTLIST= <TTTTTTTTTTTTTTT>
##$WBST= 2048
##$WBSW= 25
##$XGAIN= (0..3)
0 0 0 0
##$XL= 0
##$YL= 0
##$YMAX_a= 650189
##$YMIN_a= -555659
##$ZGOPTNS= <>
##$ZL1= 120
##$ZL2= 120
##$ZL3= 120
##$ZL4= 120
##$ABSF1= 14.98509
##$ABSF2= -5.573092
##$ABSG= 5
##$ABSL= 3
##$ALPHA= 0
##$AQORDER= 0
##$ASSFAC= 0
##$ASSFACI= 0
##$ASSFACX= 0
##$ASSWID= 0
##$AUNMP= <proc_prof1d_extract_pilot.lims>
##$AXLEFT= 0
##$AXNAME= <>
##$AXNUC= <1H>
##$AXRIGHT= 0
##$AXTYPE= 0
##$AXUNIT= <>
##$AZFE= 0.1
##$AZFW= 0.1
##$BCFW= 0
##$BC_mod= 0
##$BYTORDP= 0
##$COROFFS= 0
##$CY= 15
##$DATMOD= 1
##$DC= 0
##$DFILT= <>
##$DTYPP= 0
##$F1P= 0
##$F2P= 0
##$FCOR= 0.5
##$FTSIZE= 32768
##$FT_mod= 6
##$GAMMA= 0
##$GB= 0
##$INTBC= 1
##$INTSCL= 1
##$ISEN= 128
##$LB= 0
##$LEV0= 0
##$LPBIN= 0
##$MAXI= 10000
##$MC2= 0
##$MEAN= 0
##$ME_mod= 0
##$MI= 0
##$NCOEF= 0
##$NC_proc= -8
##$NLEV= 6
##$NOISF1= 0
##$NOISF2= 0
##$NSP= 0
##$NTH_PI= 0
##$NZP= 0
##$OFFSET= 14.98509
##$PC= 1
##$PHC0= 102.1124
##$PHC1= 0
##$PH_mod= 1
##$PKNL= yes
##$PPARMOD= 0
##$PPDIAG= 0
##$PPIPTYP= 0
##$PPMPNUM= 2147483647
##$PPRESOL= 1
##$PSCAL= 4
##$PSIGN= 0
##$PYNMP= <proc.py>
##$REVERSE= no
##$SF= 400.02
##$SI= 32768
##$SIGF1= 0
##$SIGF2= 0
##$SINO= 400
##$SIOLD= 32768
##$SPECTYP= <>
##$SREGLST= <1H.CDCl3>
##$SSB= 0
##$STSI= 32768
##$STSR= 0
##$SW_p= 8223.68421052631
##$SYMM= 0
##$S_DEV= 0
##$TDeff= 65536
##$TDoff= 0
##$TI= <>
##$TILT= no
##$TM1= 0
##$TM2= 0
##$TOPLEV= 0
##$USERP1= <user>
##$USERP2= <user>
##$USERP3= <user>
##$USERP4= <user>
##$USERP5= <user>
##$WDW= 1
##$XDIM= 32768
##$YMAX_p= 460314131
##$YMIN_p= -658422
##$CURPLOT= <Network HP LaserJet P1505>
##$CURPRIN= <$Network HP LaserJet P1505>
##$DFORMAT= <normdp>
##$LAYOUT= <+/1D_H.xwp>
##$LFORMAT= <normlp>
##$PFORMAT= <normpl>
##$SURQMSG= 1
$$ End of Bruker specific parameters
$$ ---------------------------------
##NTUPLES= NMR SPECTRUM
##VAR_NAME=  FREQUENCY,     SPECTRUM/REAL,   SPECTRUM/IMAG
##SYMBOL=    X,             R,               I
##VAR_TYPE=  INDEPENDENT,   DEPENDENT,       DEPENDENT
##VAR_FORM=  AFFN,          ASDF,            ASDF
##VAR_DIM=   32768,         32768,           32768
##UNITS=     HZ,            ARBITRARY UNITS, ARBITRARY UNITS
##FACTOR=    0.250966925370066, 1,           1
##FIRST=     8223.43324360094, 16828,        -168467
##LAST=      0,             -46596,          161960
##MIN=       0,             -658422,         0
##MAX=       8223.43324360094, 460314131,    0
$$ Real data points
##PAGE= N=1
##DATA TABLE= (X++(R..R)), XYDATA
$$ [...]
23847 -181666 307520 185615 189743 -48462 -40317 -195269 -44912 -171364 260096 124187 -238077
23835 71374 -59825 -95418 112105 224499 -133616 413252 69113 -57262 268730 -132348
23824 51511 302270 -262917 -155919 45497 54572 -91678 79925 -115208 -64868 78705 -269283
23812 -202247 94225 -183654 51959 58935 128343 -59526 -207243 -103050 -266226 -151713 59794
23800 107744 1535 37473 -66959 -147704 -153774 -45375 -100882 -325795 13513 416616 128064
23788 -18537 -84212 30285 275767 75173 15643 189152 -116536 158355 -159816 -15125 -47525
23777 -47525 115566 -164547 -151800 -58382 -191034 56695 -14017 -122649 10118 -29217 -283740
23766 -283740 -191812 175335 -520507 91644 -37956 -311250 -92817 128115 -181539 -28871
23755 -139730 51786 -214124 139791 -121836 -31216 49038 17236 -206498 89416 32458 -66726
23743 -46906 -136159 21459 -145505 70997 -101104 -24406 -163823 -15116 -135813 -249394 222793
23731 -293138 18816 -112536 -105208 311161 -126981 -330550 -411927 195013 83155 182059 -172551
23719 -29126 174793 313360 67056 -58423 -158552 -215423 -39423 66280 25603 -86186 -152974
23708 -152974 -348558 -161530 111841 63559 72533 -61100 -231864 20278 17421 -83596 -216743
23697 -216743 -122736 20309 300084 -146415 46429 97280 230511 133778 -108569 44056 -99771
23685 59556 170457 -22552 45225 -299647 -7348 -132156 -56304 -283474 18169 -126117 -11615
23673 183612 87715 -262840 -29523 -55824 -48612 -192421 314935 196943 -197254 -142242 29774
23661 240567 8541 18793 172242 -154243 67919 162910 -17848 57776 -27519 -90620 -231377
23650 -231377 -198639 -101023 -115875 217210 211027 -92788 -35683 -349955 240205 -1250 170909
23638 15690 186238 9309 57745 228607 15996 298357 150465 -267166 147297 -46454 -102337
23627 -102337 -93253 -115196 60369 116668 29425 -257701 -34985 197943 -223468 85672 61767
23616 61767 140658 77052 49146 191920 -159972 140340 -87102 47464 242536 28657 -120982
23604 -67597 -28806 41843 51442 45122 -113657 -95714 93135 108321 -90161 -284887 -276844 -181347
23592 -181347 -48935 -47318 -311865 59701 -127248 64789 39345 254466 235507 -24581 -103004
23581 -103004 -108759 352523 -149464 148546 -9995 433151 376733 -238185 -42975 21739 -37016
23569 197935 32319 151844 -36375 -64639 -6564 -114396 -285763 -156923 27906 105599 31003
23557 -102283 -173952 16964 -194140 179486 7369 -188065 -227566 -80090 74167 250121 -69058
23545 -42350 -4365 -44656 280104 -391601 184494 28654 -175702 -152437 29208 -53656 120438
23533 -61244 -51520 -201327 -64153 174400 -7919 -393422 -290636 -19048 -84124 -16867 -46984
23522 -46984 46844 -24097 -338526 69639 -38437 -113394 -7555 126202 42915 149209 3841
23510 60170 -257230 50603 67817 -75291 65785 -240119 -115780 -69211 -135178 143021 153999
23499 153999 -17962 -100170 64286 22808 -506224 -153017 36042 -201945 -162927 135673 -57695
23487 -170878 -34056 130202 62027 -209863 -167301 300503 -84165 -15541 52744 18678 -250626
23475 167905 163611 -114186 157381 -229747 -178421 -298162 3676 105439 20898 136049 207896
23464 207896 -25730 -219600 -8949 -233944 -9690 277346 109658 76911 106424 -90217 -285657
23453 -285657 -56349 75993 -127283 -186410 -341174 -116207 -136815 -114435 125407 130675 -104722
23441 -50781 229925 150142 -348265 -175694 89900 -39185 -234571 -126506 176170 27975
23430 -412495 -9782 -29983 -85747 -216112 -484751 -200963 89137 -204118 -117305 -14504 26684
23418 90347 -118578 74760 -88318 -252222 61885 123895 -173857 45171 -270707 56269 -190112
23406 -199654 -334951 -183724 48693 -197862 170224 -85773 -6416 -32298 79895 -46134 -265553
23395 -265553 36430 133440 -341704 261419 279570 51041 61468 276857 -440328 -68812 -338187
23384 -338187 -20702 -73355 75403 -31411 -278010 34024 -340982 -102842 -302196 -17758 -281846
23373 -281846 -48872 29377 -188669 -111409 -143666 261751 -162396 -36886 74644 172635 171430
23362 171430 -220805 -416839 -105628 -165054 -282411 94842 17110 339753 5986 -5566 -117059
23351 -117059 -32335 -219676 -382065 -79452 -103340 66618 -120711 -98776 317113 9358 -27687
23339 -87365 -82112 136517 225435 108182 249848 -93039 3758 72949 252928 91777 253801
23328 253801 -40288 5429 27787 225527 -277914 -137007 277529 1196 -388161 -102609 -28417
23316 -257269 -431303 -98808 -191193 89737 135914 -12303 45111 -415216 163943 -119948 42121
23304 75144 -253881 -327022 -128940 31684 -47228 -17614 -82383 -27463 616648 69014 -40332
23292 49762 -122386 85989 -17419 -92785 159377 -35023 -43582 -29786 -163592 -93707 -7766
23280 316397 -26148 -151524 -116019 -175197 -160169 30923 -11259 -149129 -208240 169657 -166461
23268 -377366 -62585 210642 45115 -206855 -126572 188497 85430 223091 -278267 -8059 -94689
23257 -94689 -71658 201983 -237232 -50458 -115486 77615 -240790 -98368 -19444 101651 145916
23246 145916 31843 -878 -64365 65712 73144 -63721 162815 88874 63333 137789 174414 103302
23234 103302 283008 26884 42196 -139708 -94169 -333961 -180465 89937 -160558 -139915
23224 -139915 -160555 -236520 -113528 -139844 -247925 184151 109541 151346 -338569 -203935
23214 -203935 164932 86517 -114640 -284377 -65259 91340 -57645 397363 22771 -249741
23203 70554 22671 -62176 -40518 81633 -42283 183044 -220544 -77471 86014 33458 -5989
23191 21818 -100388 -124858 26555 78258 165734 -16089 -251161 164586 -13569 -466580 33078
23179 -267717 -75994 140911 -275588 74553 -3719 224425 307495 112652 -364817 -83777 -75006
23168 -75006 -99026 80682 -92680 -272211 29870 -80420 -256731 -42180 69535 -35404 3113
23156 -278000 38368 179909 25794 -155182 84718 80850 -131017 27198 -216640 -15885 -17063
23145 -17063 -321845 107115 79891 -41696 -24067 -7499 -81714 140904 216920 -211404 135178
23133 310163 -161272 22835 265180 -34076 -108114 -75079 -24574 -172644 142106 -222362
23122 -197567 -111877 -109031 -19838 332027 -84640 25641 -23153 -403758 314919 -4823 -162913
23111 -162913 -115065 237157 -21106 261078 83578 205954 60910 80720 -187496 51861 255709
23100 255709 -285549 141685 36624 110142 10132 -25852 188043 236155 52404 -438244 90453
23088 -118185 107030 122578 -366538 -140196 -21142 -217275 -165707 116707 -64790 -29741
23077 -50798 42947 95575 132256 149396 -59808 -31675 -194541 -79649 -51558 241214 226989
23066 226989 27758 -160192 -31102 -108750 54219 104129 138618 -380053 15456 90181 -157698
23054 -175843 -52563 -56004 37227 146329 -184019 39315 -218447 215896 -5243 -97687 -151954
23043 -151954 196000 -34696 -316341 25411 27167 -23686 -182462 -96216 7543 197661 315049
23032 315049 -26187 -118305 -175997 -336132 -38370 666083 111620 43876 -118090 233126
23021 59885 154094 -149184 5535 -400739 -135712 49258 91135 280971 366328 73927 -71742
23009 -60910 94924 191420 -243438 -137683 19491 -274601 -87463 793 -223837 134633 -133472
22997 133429 10884 69946 -291019 -159711 -82428 -125389 -1680 -140558 -197440 -138477 -40101
22985 -58218 -145261 53927 -132161 86124 -108213 -11292 105992 -3736 -140724 -58763 296674
22973 -184683 -99594 -221430 37940 -276349 -173317 -264411 -192632 105252 150055 -13692 -117315
22962 -117315 104924 -110882 -23229 303060 -23945 94249 -93634 -146683 22500 461027 58993
22950 116191 154984 22131 19390 -5545 7624 -105559 59156 270941 5752 -7436 -183183 -58891
22937 333373 140664 -138652 -72026 -33827 -271015 -316341 -158394 -376 77891 -260165 -10036
22925 27845 -88263 127887 100694 11129 -183337 20009 -6503 21622 -138262 -163391 38494
22913 40568 -113223 -121326 -63341 -144738 -74436 -108652 106085 -336637 -251679 -46085 -348555
22902 -348555 154457 179213 -98101 119820 -151581 247147 51135 119057 -116450 72953
22891 -30556 110202 36975 -362743 -64388 -9501 59534 254545 -74395 162832 145259 -112862
22879 208833 -168579 36298 83665 113084 -137289 -344793 -107283 -14319 169214 10953
22868 15281 -191835 -302549 179676 -69045 3197 -71474 26855 -170218 -148668 133414 230504
22857 230504 191046 -169489 -155542 318327 -202702 141178 54147 -166017 -213528 145730
22846 -19215 -89050 70629 14657 229798 -28846 -254588 -287888 -10044 110159 -35851 178571
22834 48290 -206113 20956 -126155 266764 -15809 -116246 -247532 -209401 -223207 -233366 78132
22822 27770 -143729 -183936 -169834 2408 -30057 -372875 262500 -179321 78543 176157 -106436
22810 -54490 37419 179612 106533 75200 -15467 -636 16646 49121 124766 -185216 42563 -42172
22797 -14528 -42918 -106399 279720 38612 -134207 -193383 6265 -273981 106670 -5252 -74900
22786 -74900 -30115 -22786 -124480 -293140 -104208 -15140 7034 -88641 186718 -33631 -64691
22775 -64691 -83612 -268427 109807 149585 -229913 113844 -198464 -89881 -137791 -119197 -290080
22764 -290080 -208570 -151653 64061 260857 -403874 144996 15848 -22088 81952 93476 -105100
22752 169167 88323 -267839 62239 -220722 161188 60971 88143 149082 -223954 -287582 -316297
22741 -316297 -123349 -5007 -208828 12313 221652 186646 -237052 -27334 88517 -289786 -133112
22729 140672 56971 39096 496579 -55831 36248 163355 -350627 -190543 -111240 -170013 -13974
22717 -22457 342657 1307 91796 -170740 283350 -225015 -26572 84968 -150558 -284455 -166321
22706 -166321 -34558 -69417 338311 -206040 -62651 -12262 349899 -49353 -38533 45832 -162702
22694 -19449 30466 -101948 -163454 -197597 -31316 39930 18026 172788 -129910 15590 175437
22683 175437 -27517 -179074 318214 -159268 -70639 201929 85036 102331 -108277 189730
22672 -252917 -108763 -180685 72945 -35345 113651 126518 -111134 -205939 70034 -43797 -45949
22661 -45949 -233382 -41573 -109160 -231278 -20588 45396 -107186 91437 -48111 -312152 -6974
22649 -118996 -306863 166705 -124657 -239520 -58387 11586 -78131 -39020 -82637 -107535 -193387
22638 -193387 -67316 -83224 -35108 -131879 389586 195447 314330 72075 -69279 125770 -429862
22626 37889 -99889 -153873 -9129 -121963 -199464 -175293 -12010 209096 108735 -108554 100900
22614 58408 -38291 149282 1567 -22749 294655 -147623 -244077 -19105 -195796 -34482 -41795
22603 -41795 -71704 -93918 194455 200689 -10544 104533 8953 -35094 -102110 -131891 -146681 481455
22590 58504 -145901 93405 137328 -143757 181277 57371 -2005 26554 -240556 104975 191499
22579 191499 -124643 -64540 6339 74869 -176945 113188 149304 16962 -57455 -521564 -255836
22567 360990 -73304 197846 405230 -6889 -231007 -215327 -257119 25946 -15599 -12143 -263166
22556 -263166 -162553 -18316 -146490 39364 80973 -51230 83137 146836 -254135 232957 -86297
22544 84433 281257 -174636 189606 196062 17232 337781 -204229 -128469 -160731 -31705 -111515
22533 -111515 -145746 216324 39385 127586 71010 -96685 -46544 -23152 22211 249778 -71812
22521 28745 -1861 3632 -157213 282347 16956 -91204 -309861 -57794 -6053 -216691 -58650
22509 -92315 100872 -98790 -223023 -130496 123689 140362 -224716 94563 212776 29507 38193
22498 38193 2368 237394 -252723 -170144 102399 427738 15557 219284 37855 59445 42282
22487 42282 -167947 -276701 -311656 -192850 -163263 -148693 -10363 -316248 -65662 -226067 186209
22475 263515 -2821 -309511 -93726 -385614 12959 100915 -36869 -177213 94438 203247 -96417
22463 21263 114438 71692 15774 84480 46654 147017 -5744 152663 117481 -66087 44043
22451 -61056 91983 34830 92291 -307354 227215 124046 -57330 35760 11897 -74810 -47067
22440 -47067 -205636 110403 203580 -112112 67087 -140740 -44910 -173574 -276976 -247989
22430 -247989 92798 169057 118970 -153846 -450851 -291089 135864 -258499 -97829 -268835
22420 -268835 303309 -201312 6797 -592390 -164557 114034 140242 203328 50295 -18325 106263
22408 30547 -57922 -10 112799 190532 -234093 33810 -271759 113213 116490 -197020 100050
22396 -242831 171110 68430 -103833 -367747 -313515 59747 -35002 62087 -255443 -106972
22385 150191 39675 -112095 79619 133121 97234 140584 215890 173977 71230 293655 -177967
22373 -51360 -165368 -173045 -9896 250753 194339 -40552 -36066 -133516 -178418 81522 -313399 -37077
22360 -383903 4707 -102392 -131594 70365 -61522 -172505 207831 -169006 20617 -45324 -67208
22349 -67208 322232 -192548 93786 -295310 -314534 -92259 -21040 -33853 -5271 -207211 -546804
22338 -546804 -9067 -109920 263090 899 -89547 -160000 -235390 22528 -78761 -323657 -248993
22327 -248993 -73857 -170569 -7548 320471 -132102 -188184 -32811 2709 74689 199079 16550
22315 244716 265980 -61862 11596 -256347 -181949 40212 -302822 -482227 -84734 -8349 -36079
22304 -36079 -54319 89423 -379075 -130288 41917 -302972 -59117 197568 -404364 290365
22293 5036 320088 27781 -83546 -337390 104784 120610 -340291 -15912 97412 -17817 -198443
22282 -198443 -106856 -117696 -120746 5047 299892 -125785 30178 -66671 100157 -131950 -32305
22270 -56584 -44812 -28128 -96179 -3018 -184497 -131214 -210536 -19388 -6729 -134717 -225828 154005
22257 34839 24049 -73931 -380600 -157567 84593 411417 36254 16649 82070 -118024 -146236
22246 -146236 -279858 -71412 213122 -142500 101281 -480697 -302233 113575 -170846 -33674
22235 185556 -188083 -89374 -239046 217997 -43594 -100244 16042 182610 145832 -175957
22224 161897 155807 -59020 173354 -188235 -271033 -3185 -115493 -223494 233099 789 -170391
22212 -83481 -91043 -49054 341832 204552 -151229 23982 62217 8295 283370 -57548 9856
22200 -24290 -193800 -273001 -8022 -322933 6365 222636 102188 -286297 123084 -6213 183632
22188 -35867 -41869 -161127 141291 74149 349759 18578 43367 -68235 101554 61914 104064
22177 104064 -192702 -7930 -166218 -224723 -61673 -363587 -206349 -61895 -172806 -56538 -71978
22166 -71978 265956 2265 5826 156736 88471 -57911 -268742 187248 201030 264992 -104159
22154 341 -260931 -91524 -63415 291327 -108064 104604 -655 -15344 105788 -12959 94984
22142 154613 -366140 -148880 -41626 -273101 12612 22660 -303713 158116 -39809 33184
22131 -174141 -77769 81162 108690 -174801 -99153 -205856 -54249 -49647 -84240 -160174 23912
22119 -218441 6694 -160935 191569 -300752 -216421 200327 -137519 30012 -235286 -87337
22108 111581 -122384 -183501 -50584 42019 177003 293994 42533 -130707 -233465 -100443
22097 -335586 41110 -82161 -254291 396198 -44763 -70509 86322 -217643 15967 -57738 -8998
22085 -125566 81904 -304822 137711 354176 -193392 -216810 -24904 -65244 -293726 -166211
22075 -166211 195237 -156894 -15193 -100361 200973 -49227 3022 76111 328703 98127 -215632
22063 -267409 40334 35894 -139206 50824 -193581 -228224 77812 28609 -390958 194092 -194441
22051 -182886 -175081 -62563 436876 -82558 5676 169606 -186829 215869 -146359 -95890 67163
22039 -8125 -76961 -57105 -180451 -83210 -304861 -25506 76476 -125348 -129069 -83755 -181860
22028 -181860 19104 -155594 -155309 -184396 328947 -335793 172936 278171 -267833 -31147 56591
22016 251052 89446 325747 57108 40411 -74756 193046 136143 143336 1494 126431 -201564
22004 -47430 -123941 173120 -233680 -29221 -224903 2352 -145494 124161 -153171 -81612 -83840
21993 -83840 214589 43950 -245245 -72495 -317073 -7909 53326 -14949 -202321 -76468 89049
21981 20770 11217 -104619 -156752 -428394 108985 66596 20027 -88984 -246642 35459 1150
21969 147039 -245534 -85316 -229290 123283 -270104 -367734 -211754 13498 -119273 133073
21958 17344 -91010 136959 130382 -9965 127142 56539 74930 855 -128825 -117773 19600 -167353
21945 -10836 112186 -263962 166098 348406 -148889 -164354 -10192 142944 -152729 -55149
21934 109142 -88345 -145902 -12236 -167176 187945 -501831 -348244 10037 75283 62524 -105186
21922 369429 107512 -60619 66058 37938 -47004 -99491 -296212 -181804 -211050 60833 -164646
21910 -92307 -62998 -89672 153133 283347 -2559 6442 85213 65385 40148 26884 -29740 -56162
21898 -56162 268466 120695 317536 -111033 7718 -104266 -93717 -241423 97773 -159905
21887 -139238 51065 75911 106009 -299848 -133918 160734 -25323 -130818 -79477 -106968 47717
21875 198623 -36789 -185944 59064 21126 -83504 82609 -236511 -141734 -715 -37669 248231
21863 -276634 21197 -18011 -251696 -39555 367099 -93877 149366 -68563 -144101 -282281 196337
21851 -52614 42333 -478265 -163468 137641 -151500 293393 165735 -101041 150261 -89 -64425
21840 -64425 -206962 101307 -125513 -48069 -45803 -143957 10576 125664 -119633 -64650 -32984
21829 -32984 -137826 155539 85835 30744 20023 -357345 99986 115052 -39203 185220 -101038
21817 -145332 -66655 -102401 -124193 101146 77992 -326884 67472 257064 113058 -108076
21806 -19157 -20719 490610 69785 -95688 259243 120848 -34681 -177761 -224482 -66366 53682
21794 -147630 148766 -50583 -259080 -355064 31233 -57801 91364 -309877 66106 -340410 53943
21782 -46724 29343 -3933 227794 -29264 17059 -263223 -89960 155309 125618 -36692 -155731
21771 -155731 -84867 -59154 -133278 -117517 67569 233697 -37540 -83039 -105670 153361 32921
21759 -35654 -17744 59750 -204981 -36049 258723 -19082 229012 -3491 -335514 -84798 -12695
21747 -367270 101352 191924 59830 -196062 -163963 -241308 288461 -184754 -148626 -210025 185356
21735 72316 130085 -123559 -79266 260622 -264527 -73901 -97522 -127679 -343877 -396477 -180771
21723 -201023 82844 58013 168905 -158220 47703 28851 -142207 189104 -266142 -60690
21712 32609 -32943 55669 61334 -158254 -206785 -252500 -245467 -63614 62883 237452 -5731 -123697
21700 -123697 51884 -225703 48426 203353 28232 -146557 30503 62244 -274998 60193 -238621
21688 18266 -77055 205306 154660 171262 -174460 -110140 219654 -35965 -47516 -3646 13792
21676 -211177 25615 -110271 100610 -10210 -26019 176581 177260 71771 3028 -55199 -221010
21665 -221010 -282387 165329 -58847 148424 212042 -249887 13233 17378 -97589 39291 141779
21654 141779 161549 109605 -97911 -139301 217521 -197544 -100489 107892 -81871 -117756 -12142
21642 -202151 -169582 95344 -181681 -285018 -138369 202379 -158908 -91524 255256 -192509
21631 -152029 -116037 68798 64262 -264516 -56624 210145 -63403 -84034 -37177 -63018 161675
21619 -62916 64171 209449 -95710 131851 -191692 -76050 -40220 -186269 -56098 330159 -172930
21607 122344 -49956 -36446 -244811 140454 141044 -45403 -336738 217464 -138758 -134900 -35455
21595 11747 -194063 153007 -216159 -2153 -506715 27535 -69692 -31051 -157611 -147006 -42897
21583 5246 -306687 -236383 -127719 -293689 -183947 108185 -262799 -126528 -171243 -281506
21573 -281506 48166 -23745 -101465 -221923 -226906 -33965 -42119 94507 135793 -142805 -251574
21562 -251574 256018 -30247 271549 164606 -261719 -52219 -289957 -108371 -133180 -14104
21551 16643 -76892 25962 -164621 -312890 144087 38728 -73607 -75865 237725 111971 -87182
21539 194295 -202595 -207638 111772 4878 -109513 142738 -506860 -3328 -411778 78462 -83237
21527 -69623 26925 -169422 79764 130696 -135022 -84929 54285 128948 -131184 5369 -217854
21515 -251789 43766 113561 -3871 285753 -107517 125994 3993 96031 7298 -105381 -48459
21503 68186 55028 35697 69312 103223 -29253 -49547 -483422 51516 -134786 -61605 -27821
21491 -277629 -44799 125315 -52686 -310255 -202122 -175319 42523 -174990 -345707 -200161
21481 -200161 56798 -259819 -162942 33332 -27303 -179245 -194862 325420 -103662 218338
21470 -52251 130898 45660 -264307 35237 -79995 -138371 197381 202898 67902 -402233 -221895
21459 -221895 144534 -196732 142568 -107260 115868 44091 -92195 -163710 -79968 -44226
21449 -44226 -218324 -110806 -82776 30925 103479 -101462 297931 30769 3631 245455 185838
21438 185838 502727 359674 412723 262813 49117 168822 191256 -575008 9425 107296 80299
21427 80299 197480 -76750 -123783 169228 238414 -161187 -363665 -153398 -61530 -224225
21417 -224225 9743 -55090 -182504 -173815 -104113 54040 -114449 68222 -11360 283701 106726
21405 -334564 -52923 -1211 -28309 168398 14755 155876 23110 9297 -165050 24005 -221783
21393 -550 -219008 -326068 78433 -173442 -77227 -257333 -1457 -191440 211757 -247821 -57764
21381 -4897 -60418 -26109 -61718 9695 69387 -36695 -156491 -5142 271257 227678 395012 25886
21368 -321807 -38406 183341 -65643 259382 292681 -38367 -388526 250021 126851 -50643
21357 -36398 -82511 -174020 -214688 -9700 -140195 -9109 49679 150954 -231572 -217703 -76198
21345 -144838 31245 -278336 27846 -245336 95699 -267881 -206809 189886 -283917 -315976
21335 -315976 -98188 -381974 76478 -165213 107888 -370635 -64077 -6073 -7430 14593 -6346
21323 182770 -409457 -2773 83830 -302689 154815 -11397 -64677 -33172 332074 121051 -34123
21311 235920 -73382 -177108 -24280 -54324 129548 -2504 191772 -8277 43647 -74640 -483369
21300 -483369 -208963 -32316 108003 -203240 -61307 -92486 -130133 40102 103695 -67702 -198088
21289 -198088 -85549 -222079 31234 266799 -166591 177227 -163020 89088 -35041 -245962
21279 -245962 -328153 -7990 -178389 -207300 -77382 -17260 36154 -117017 282431 -57094 -151401
21268 -151401 -221342 -77963 156239 95332 -59840 -296498 161403 270107 155609 -83514
21257 28591 -207553 99235 39173 -23559 47995 -51003 170594 -182645 -48624 -135922 164800
21245 -111444 105354 -175045 -245746 -106510 -185172 -140882 -244866 -250243 -45592 -200518 349376
21233 -213897 -39116 83158 -235229 -417677 496123 67585 -110554 -134353 -150213 113873
21222 117633 269316 -110195 -75457 65126 -29642 -225621 128126 -80553 213424 97542
21211 10487 -92339 -77315 -158363 2576 23707 -19174 9830 -122971 273455 326 8799 -147062
21198 -178746 222858 184566 501661 -139609 -32942 79899 -183875 130911 -109410 -9424
21187 -135723 121812 117513 -117955 -4652 -274613 -58035 150615 179585 -154722 -48590 90684
21175 -238441 113387 -132630 -187852 -103471 106679 -454204 241542 8591 -134289 -179256
21165 -179256 206206 108876 248594 184476 224708 -364497 -112047 333392 -165594 -79685
21154 1353 182418 -94994 -77174 -132123 48517 -75198 -40510 -413266 401028 -328060 260860
21142 7780 -378977 193259 -59811 -5786 -269802 -210160 -88121 -109242 -360012 -50225 -53485
21131 -53485 -142311 139954 -19694 14446 -131351 20465 -275237 171509 81074 -260814 -249476
21120 -249476 -120191 196751 336374 24461 -168381 31147 -33199 -214664 59724 161770
21110 161770 7231 29197 -84890 -223863 166376 -100101 298175 -260339 83716 100525 17107
21098 -91218 37483 36940 -64547 260395 -222994 -72360 -19760 130691 -130407 -19194 -238094
21087 -238094 114622 -45640 15827 -150918 190247 43740 -184101 -30172 163725 -161111
21076 -218268 -173789 277778 -131975 -92088 -393845 -253218 -129626 -276719 -383711 -202049
21066 -202049 240882 156108 111779 -88515 174107 -217480 -178212 41031 123012 -93855 7789
21054 -66912 136347 52444 -24607 -305436 -111114 -58299 361861 127948 -527067 50956
21043 -261094 -145398 404268 86005 -143905 -329014 -23771 177192 55475 86997 -133884
21032 -59344 235979 -27996 -216410 -213360 -153839 -57293 -429517 -179669 236555 72849 -59793
21020 -213779 148316 139691 165758 -22257 171579 -2093 -35598 -122133 -92262 186893 283199
21009 283199 -28919 192562 139261 -45045 227420 372586 -192558 -114107 -261265 45593
20998 23336 -87433 -21167 -137215 -91870 -357514 -119323 -342800 -19208 297484 -317821
20987 -13330 -318946 -77275 92588 -59123 -77257 168006 -42943 -36071 -202470 -63527 266461
20975 -314826 -102207 -377508 -434344 338427 285102 -187309 -412980 -253444 -297864 -23647
20964 296492 -330813 87571 139155 -174116 -390881 -200078 90764 176500 6565 155533 -128263
20952 29432 5921 -64335 -349773 -269409 -9956 -276310 245163 281454 115352 27285 333800
20941 333800 -156851 -166386 -343770 -87866 -168734 -62949 -171422 -247282 -63736 -113263 -58385
20930 -58385 -26251 -110767 -137938 -184858 -105956 160219 -375698 -177778 -139612 229014 48710
20918 261126 200408 30136 -8499 -25090 -12089 -277508 64562 83224 7945 -113000 88661
20906 -398542 426755 47616 94698 359978 -82217 -247144 117421 -46404 -93798 -58954 44334
20894 -32209 -122631 -263310 111757 -226836 11708 -117819 -377911 35352 35887 -32013 109704
20882 78331 -325198 -103984 -85395 69263 42187 -233947 -187608 295712 95630 -490523 -130160
20870 263100 -173061 -104547 -205555 157501 -133657 -281290 135545 93969 60933 -311451
20859 -171030 -150403 -115885 11395 -61859 299327 -263370 -69828 -102108 130257 -243165 -145133
20848 -145133 -65359 358305 -41364 -84207 176672 -250679 -463917 -231787 -10178 80483
20837 -168196 191220 166414 -252083 -81052 -17629 -49948 -90730 -1241 59080 -33634 -244911
20826 -244911 -66646 104521 -68045 51937 -56192 34272 -235778 51720 -179669 -71661 92051
20814 475053 2618 -473701 -7127 87291 38197 369173 -240720 2291 -26909 -227213 -135527
20803 -135527 17600 -125724 -179895 -241977 64666 -294364 124693 82164 77875 -113614 208587
20791 238827 16761 213282 -44875 -239329 53225 36694 -261184 -194180 -91153 -89569 -80928
20780 -80928 -329914 -3955 -39947 -43078 -88661 -137952 -195709 -92752 -73961 242171 131872
20769 131872 -91740 5143 -277536 -121092 -122633 -157137 -333620 -14814 -175545 243770 1035
20757 237421 -65173 17078 -10097 202028 -250348 -209414 -43499 -245330 16766 -100882 -136131
20746 -136131 -249247 -276236 -172669 13757 -11877 -189627 -319378 198227 -117171 -57583
20735 -573 -116288 20027 1254 -85268 30968 -49273 73446 -385175 -92220 152494 -17852 -221083
20723 -221083 -178728 -8467 238159 14795 -33816 -7650 -39396 -122896 -369844 -65725 56481
20711 -220588 -16461 -322566 102550 38973 221217 381613 67049 -195196 84615 -172348
20700 -18480 43606 -182328 -59870 -158301 -289796 -127712 -257995 63796 12059 -107833 -45981
20688 -33503 -138315 53998 111519 -139379 -151354 -105755 132349 119710 -9143 -107552 33324
20676 -58314 -30471 -74240 99318 264233 34340 -45009 46613 -87511 -245124 -261760 -79658
20664 -344316 -18266 -122088 -76713 54528 -81467 -446583 77034 79208 116781 -275892 169818
20652 -74632 -25604 172589 -111858 101760 -80326 158520 -109791 -136732 177469 138588
20642 138588 -149811 -211653 -394898 -219812 -23924 -277090 -254790 39390 -135937 244062
20631 -113997 28140 -67980 316251 -198934 22248 -19006 -123447 -296624 236431 395367
20621 395367 73798 205817 -246104 210219 -138655 34648 -103148 296944 -128804 171145
20610 -103611 -83648 -275644 -278310 -44211 -22451 41517 213044 270526 91689 94478 -130727
20598 -368513 166966 -18343 -151581 -67155 172580 -116385 -60516 -111591 85850 169040 -843
20586 -30733 20229 -29822 -130372 296494 -163391 -235760 275961 96868 102172 -9940 -22496
20575 -22496 255881 -221167 -257321 234586 -2760 -56135 -100919 -44866 -205382 -104149 77643
20563 -219853 -261209 -61282 191372 -82015 80441 -179840 -135276 -191166 -357009 -112094 -72591
20552 -72591 -362105 -88905 -115849 -54212 -189443 -145966 80027 -149079 -34912 -183415 -211269
20541 -211269 32689 -151666 -100033 296882 -128339 -251299 7173 79094 144507 -116303 1562
20529 -82369 -112122 -115876 49174 -21984 -280267 91923 -61545 53703 -196892 268196 -88123
20517 139140 -84899 -110735 -85975 131882 375408 -9373 -206208 -57841 16244 -236297 -347444
20506 -347444 -217615 5449 292431 -35407 -458147 -38215 185894 -224433 -163302 207237
20495 69890 -192541 -192550 -45738 -117230 -48370 109312 98144 -4776 22271 364036 -260063 -263235
20483 -263235 80357 -153480 -143112 -127254 141786 -149781 -383808 -162033 -470362 -59567
20472 139143 -48952 -92742 -73726 -129456 -33250 -181613 63342 -272406 175587 172035 -52038
20460 78772 -71360 78885 -242805 223992 -206535 3114 -192106 211980 2690 -57026 -4816
20448 73588 -310769 -226849 6755 -27754 -226386 -198778 -320918 59696 34913 28506 -265857
20436 -313817 -28309 -148100 110283 -24092 56149 282610 -113145 111708 -151130 67801
20425 -78578 -97737 11433 -3985 -130869 -170242 -91734 40739 -236898 -15886 -32733 -24678 -208714
20413 -208714 -99590 167924 196469 22575 -84465 14286 35294 122633 -15039 -152052 6908
20401 26665 208204 -183925 -167487 44623 108706 -228355 -226589 -133966 -82274 57925 -374704
20389 2619 126366 219868 35102 -200728 90612 328750 -207235 -173397 182505 -7587 -106819
20378 -106819 54593 -88984 -105241 -89763 -357405 -185690 137648 -269580 106436 -81259
20367 -105922 -411581 -149801 -151883 -98186 187916 -326831 -324627 -268003 -101644 -50271 -312103
20356 -312103 -155595 111524 -100508 68814 6385 4155 -284194 82231 70874 179035 97544
20345 97544 -210823 19669 -52225 -116577 -58454 171069 -86887 148890 -469605 -120443 70534
20333 48021 126432 127317 -176697 -79184 -367446 192898 74434 -363351 48500 -94815 -16167
20321 236511 -32040 194256 -147049 -108419 66324 86250 13259 108028 15164 -178693 196909
20309 -190657 -136196 13180 80824 103003 -354117 252865 -97487 64292 179221 -174830 -168470
20298 -168470 -179354 82510 -191438 33184 112760 -16442 38145 -153223 -48975 -347504 -266211
20287 -266211 220226 -111639 16790 59090 -167572 167793 -1194 52757 211651 70731 38441
20276 38441 8528 289372 145820 237709 -212310 -131034 -238920 38246 -314741 -60331 -412770
20265 -412770 297479 -291839 201258 6749 -153846 -190918 -58592 -68616 -142229 -73794 -44993
20254 -44993 107215 -286983 -463177 -34758 180507 -47037 -119949 -167491 -116460 -136238 -96201
20243 -96201 -81103 202951 -60103 -64676 -121960 -141628 47184 -308962 82740 6284 -101728
20231 170821 -178618 -100797 -126444 5865 -353273 -134989 -113257 -237444 131963 -323820
20220 -107949 96897 65259 -220464 -228721 50360 108577 -182423 -284752 15297 -342365 52360
20208 50932 -140509 -125859 -17592 77571 163716 27607 -3762 -121419 94649 214017 -80796
20196 355860 -279085 24529 150088 -33380 -119973 184812 69474 -283070 -212492 -75476 244202
20184 -107136 171677 149081 -86455 -240643 -124980 -354241 108571 87974 323250 -8566
20173 177159 -316703 73155 32168 207590 116295 -211246 146476 56916 -54299 -232623
20163 -232623 -122611 -99009 -381560 -162696 -91452 -198253 292562 136120 -161623 79575
20152 12728 152845 100764 -26688 -25680 -50546 -21725 83254 -59445 45059 -430954 -191206
20140 223580 -230932 368243 -138389 56580 -99490 -203347 133279 -134129 55273 10690
20129 -135825 -84980 -306180 -163879 -300747 83194 364329 -106877 58159 291431 -71686
20118 -215370 -27664 16756 -267148 -268999 -64524 -385098 -30062 198696 -121230 -203198 34371
20106 380413 -306140 -200206 -179894 -7286 -107899 107850 25442 -2425 -84289 -266717 132844
20094 -43739 87229 67418 -115038 31012 226009 -114610 -137139 -245762 -137581 212139
20083 -362226 325838 147473 36224 -253511 37295 59339 43624 193877 247939 -384667
20072 113007 -120713 144558 -38639 -75424 -68959 -48858 -335125 -146456 -35763 14674 19734
20061 19734 -301936 -162652 -25984 -74183 88173 -151855 14175 -255398 344417 -139073
20050 -185135 6992 206484 2988 -124903 -177278 137313 112719 -263830 16072 54486 -179297
20038 -69790 191648 -180781 -325236 109767 -172933 29634 262449 -347028 -62781 182531
20027 -21945 -235713 74585 -315965 -75999 -90186 -27913 -157463 -244189 -171185 -60248 -62069
20016 -62069 92515 91361 19023 -163573 -177475 -424909 255926 7606 149373 138878 -320653
20004 -72464 -181889 -135419 245358 15269 -96913 -277722 -217036 418 -138204 -260351 239899
19992 -271712 -435553 -221652 -303468 -420349 7222 -54158 -109688 27782 -28687 -19307 278978
19980 -4166 -41562 28005 -74343 -510758 -62338 128248 -320272 -96526 120670 -100135 90788
19968 499896 -77125 79397 -257744 -49841 -172599 155398 3935 -11866 20372 -199127 289019
19956 -123604 176072 -186686 -155705 17397 45767 27154 84498 25520 194748 -123858 -326034
19945 -326034 -219224 -182953 -45251 -121921 110121 -175646 -231088 96053 -340164 -196889
19935 -196889 -18973 83914 236565 -94848 -90556 -265114 -135071 77057 -177850 116179 534359
19924 534359 -172007 -73341 95190 -1260 66387 -194878 -137398 -210971 205273 -192447 86784
19912 -180560 108448 -32571 -98547 -269143 40619 -93811 68882 -176320 98575 -5030 157150
19900 238585 344834 93282 -54499 -182042 -152581 213512 60992 -24452 53798 -18348 -176343
19889 -176343 166082 367298 -261211 -17209 42022 -102298 261372 -432354 -132619 85126
19878 -114054 158270 195577 -67735 -202977 67420 -474281 63424 -248401 -319093 9791 228526
19867 228526 88457 -123468 -153945 33611 -305841 -409317 -224112 279546 20337 -256168
19856 56075 55250 139413 -249459 157127 174703 -235352 209201 -41942 -21767 209923 -204484
19844 -187987 -259402 78678 -106937 -74146 32378 -252070 -218295 -74742 -257453 -140663 -24510
19832 -185324 121849 94075 284366 111740 -381105 -465745 -268554 -35479 25008 66455
19822 66455 -31068 78059 181980 -125879 59727 -62351 -10189 368826 225867 -226578 80615
19810 -122865 -75452 -31339 96014 -183516 73044 -132109 -260058 139097 -63134 -191800
19800 -191800 -3454 -348596 -25542 285373 -41848 93426 236487 147822 -303206 -96962 223367
19788 -149892 -51076 -345 -184402 102703 -15873 -195887 -219551 -255928 -148660 -38392 113165
19776 -6556 321824 157228 -293672 -302431 111350 -21197 -122164 -140371 -294575 18975 88435
19765 88435 -23898 -62286 97559 217922 96990 270966 88730 -18923 -193960 -157188 182620
19753 -165736 157103 -151981 20520 335534 -121565 -287340 -49093 -135107 -355050 -42231
19742 127535 156067 -93673 5713 152480 -49143 41292 -147929 98264 -21720 -123114 -114074
19731 -114074 -252218 -250259 -126927 -208634 218745 -271432 -93066 -88821 -40540 -398770 24625
19719 175980 251371 104949 420980 -89390 351730 102294 16696 -303388 -125163 -76745
19709 -76745 -77200 -204212 -47970 -191475 -513224 280769 -173512 -174076 -442804 32739 -430791
19697 -322408 -135923 -88797 -205896 -13024 -47211 -123357 -185670 38900 -112467 32084 251901
19686 251901 -113121 -32179 -47103 90035 -324538 -281878 -405714 -90687 -20929 126288 -253379
19674 398240 128913 -22506 -84841 13078 15579 -132020 -166961 23805 -112972 -176783 -246265
19663 -246265 204447 94063 101706 -17342 175714 -3139 -147417 -164163 167323 -45625 -96932
19652 -96932 -189301 -286219 -79701 145225 -193401 -255639 44742 237024 -1066 -136065 -132083
19641 -132083 -261966 -75322 -462436 89161 -84092 -84476 -236123 -58379 -11968 -361548 -160542
19629 -18549 -331892 16112 -278412 24594 140442 -58575 2144 -2644 -237391 -154610 -88576
19618 -88576 45126 -34124 -2073 -15783 -100195 148780 -325238 127393 -119176 -207682 -28981
19606 -271217 5708 -135990 182511 -139090 6724 -54328 -218272 1551 -21742 -85011 -169933
19595 -169933 -65232 244738 -80137 153673 -125143 -366273 93487 -221173 -41044 102500
19584 68763 -40392 39995 -123356 105075 -109294 166205 138710 140614 169130 -114864 312209
19572 -160743 -331182 101576 -63636 573742 -134633 -116306 38670 -52655 -64540 152220
19561 -143433 -249920 -49861 -22867 -143554 -32950 83022 13521 -137247 -184153 142222 149809
19550 149809 97191 234146 57425 244049 -52299 -144867 -291871 -112223 -38829 71200 -86207
19538 -18891 156405 78058 151066 42496 -159422 -29166 -52743 -246549 -232355 7219 51018
19527 51018 -103334 -137570 -275999 233973 -23876 109328 -145180 -300964 132514 -59588
19516 141798 -192693 -64701 41840 -151712 137890 -262023 -113928 3963 -295188 -73101
19505 111600 -20618 -307617 -8070 235402 21139 107645 -45662 -276078 -189693 -128801 -184963
19494 -184963 121688 -220735 181731 64282 -21530 154057 -326623 -125432 -115302 -13869
19483 -47135 -46416 -144772 -125812 12636 -307822 50918 -69049 -204402 -251323 -106613 -41921
19471 -204834 -355865 -99459 16595 -93242 52316 -96572 37934 136666 -44475 -49743 -203785
19460 -203785 48970 -350679 -29384 -15088 76288 -147515 -63057 68798 84490 -109309 142343
19448 -49618 -11342 -62592 -181663 -151511 -300103 -265585 -173082 -28571 -21447 -215064 177486
19436 -184602 37044 -348248 170773 -26413 -218450 -234262 -81541 72364 188350 89754 111334
19425 111334 -335452 388809 -101303 109467 -65334 -349566 220895 -36099 173807 104920
19415 104920 -129207 -124266 139083 -188004 -256801 -30112 -156604 107066 -195696 228384
19404 -67401 -121028 -290493 -97047 51270 27357 19048 133770 16607 152009 -163568 -260783
19393 -260783 153585 -227250 111684 -386194 -432393 -250439 -15464 48071 -72568 -124280
19383 -124280 -277975 253979 -144309 -77432 50358 -7843 -29150 -98546 -170009 143102 29258
19371 -51697 -32512 -208627 280998 -2425 -195289 -25755 64158 -211589 -69139 94172 13926
19359 -48876 -145540 14653 -143595 94595 -121943 -262894 37048 15061 -23586 -372334 185510
19347 13059 155957 194372 -177586 -201100 -2674 -33152 -75369 154559 -100103 22565 -98103
19335 -64583 -148179 -42488 -39783 281087 -90803 -157119 -335342 -137984 -46181 13917 -208419
19323 -229101 56232 -421287 185988 58035 -134289 -144124 -173839 60482 -211601 24660 -68720
19311 -389468 102248 -352114 -103291 -123914 9582 -19927 -415111 104268 107624 -139724 46215
19299 -194027 -563588 -165339 -160822 -41424 -133590 -319634 -199771 3519 -25323 110167 -184757
19287 -416756 -77663 -400382 106430 -135473 22249 52169 -144160 -255306 -198150 -273501
19277 -273501 -207194 105094 -87226 -99384 231201 129961 -188641 -186249 -217183 -6313 -167604
19266 -167604 -176687 -103307 -68422 280963 -141639 -6444 52554 59440 -217176 108725 84107
19255 84107 -58253 -79693 -74344 -119447 86522 -46466 168033 40496 -13218 165752 148947
19244 148947 196989 -227478 104471 -38343 351583 93847 -340747 -145133 376810 196127
19234 196127 27012 253877 -315043 156475 141896 -19184 103060 -112515 107988 -90881
19223 -108671 -130048 4525 -308735 -347782 48630 28315 208241 103898 -63381 -31043 303648
19211 250245 -367644 -42037 131016 -205417 -136270 -421988 -87402 298004 -147316 -209330
19201 -209330 -41053 144317 145127 -204051 165681 -4773 29011 -141855 36768 191440 -249292
19189 -333289 -278636 -356459 52421 31952 195717 -153513 -330863 -280775 -135189 29051 -79465
19177 -153046 -37843 -191292 45567 -243358 -65839 126090 -168081 -330145 88953 -124163
19166 -350415 -6613 111266 -47900 -211525 42528 -7682 215203 -843 -70015 -239874 -185741
19155 -185741 -8743 194903 144382 -38090 129686 33666 5115 427 -256482 -126907 52455
19143 -78284 189263 -129873 -191462 87269 -331555 -92099 -73369 -149287 -66092 57724 -66754
19131 -190170 84662 -34677 -168409 -57187 31601 -76242 437573 -106321 246730 92194 21686
19119 212132 -32133 -249701 -110424 -132395 163432 49984 9592 154413 -43699 49687 -324801
19107 -106649 -144510 -81973 -209042 -294410 76055 -88493 -113847 117486 -156947 -168514 -80933
19095 -43336 184368 140793 -297226 66435 -191535 -125760 142927 133002 42799 -81459 -222580
19084 -222580 173436 -143232 -84788 58551 -23966 -31587 -30928 -6170 20837 -71862 54264 229482
19072 229482 106148 -87910 -124536 -16914 -54928 -290535 216212 -176170 -139677 -201062 -262061
19061 -262061 19426 5307 -127000 -57718 -222626 45979 -106567 264255 135175 -122841
19050 -377961 88079 -112831 -376178 -87671 -219972 72290 -111143 -51787 -253991 -129252
19040 -129252 -194785 53728 107029 317844 -281956 83143 152902 -132652 178915 202212 -79508
19028 -197544 -179116 47960 1253 -55594 -125328 57413 172704 132898 -98347 39444 -180014
19016 -410889 147123 36060 49612 -129910 -226647 -233491 -315421 -173112 -322892 434972 14611
19004 -319273 81710 340635 181393 16889 -153955 36753 -154401 170167 -169103 -6684
18993 211611 -58036 -48790 123430 388080 -107237 -155508 -131937 -220214 1202 -51998 24296
18981 -381170 -31234 -114503 59384 -5867 -158845 -351450 -132576 -189450 -217585 -111001 95161
18969 -426321 -155758 1318 295763 -460988 -67904 181893 -111314 -173894 -186804 256421
18958 109345 -202901 150463 -189791 -136441 157198 -319389 296353 -260143 -237626 160323
18947 97820 143408 -155761 -218101 -43719 -105567 61494 -157229 -230017 -289594 -227692 -7865
18935 -52562 -26960 -87434 30298 -58739 -557879 -134081 151485 138341 -315427 125820 -181973
18923 293792 150207 123024 69294 -192335 -131005 -91865 -278409 -138504 2223 -31523 -13540
18911 43547 -214635 -88183 -80406 -18236 208999 -182717 -147865 -83798 -313357 -167595 -205103
18900 -205103 32696 -25572 365172 -111198 -326356 19267 124560 72457 -437646 92098
18889 132779 -188729 -9435 -125926 -143883 239735 -80127 -401867 -23606 54906 -101935 46881
18877 30792 101463 214911 27814 -100753 91264 -2104 -63248 243730 171626 -316199 -152512
18865 -88049 -191493 34829 -57019 -155820 -24084 171062 96099 -99850 26224 94001 265681
18854 265681 1574 110230 117613 250445 111744 503827 93896 -272616 323479 178203
18844 178203 -302621 18867 125824 55644 -21696 25386 145888 166398 -89864 -219916 35739
18832 -70414 145633 74244 -14725 -308270 -103049 -395674 -261428 -241349 -176515 -369445
18822 -369445 -36382 125802 -92556 76546 296427 200841 125163 4456 189969 67915 282455
18811 282455 -106628 -3848 91231 79738 175829 -211818 116764 175631 -380477 -85087 -186149
18800 -186149 -370371 -16134 -25041 -315205 -128384 -268431 -73430 -87710 -161074 -235828 -245713
18789 -245713 -128136 172538 -229303 210247 -67671 -378808 27453 312166 -125688 -109113
18779 -109113 -21849 192712 -423056 15825 -139532 -82805 93748 -119612 227753 -126383
18768 -304393 -153113 -318225 192350 -303512 -83926 -1532 -47126 255708 -328485 -298306
18758 -298306 217485 -124317 207229 -62607 -170393 -203097 79965 42869 -64158 11514 1031
18746 -8583 -182310 -272411 7698 -207948 -16696 -22218 -36667 -4026 -433529 275901 -52699 162793
18733 90230 197591 -89955 -240070 -152670 -3505 359277 -111992 271410 223368 12317 116319
18722 116319 -253247 218276 235180 236894 -69787 9079 -36647 -202662 -209634 -323538 38988
18710 73003 189665 -156464 70238 -373419 -75387 -117411 166747 -27268 -13866 8509 -1190
18698 145794 -22902 -201421 -185331 28478 -77744 52854 -190910 -221565 -4478 51110 47389
18687 47389 -77556 -219712 -62440 83296 -33682 -71040 -133767 -235542 107453 -7814 -402583
18676 -402583 -101802 95585 -9740 -270944 159336 -266450 -3163 -241832 32665 -1531 80524
18664 46723 29014 117017 -170598 2204 -349947 -114591 23276 -77959 -35181 209007 116620
18653 116620 -55336 -81126 -110830 -69408 -150586 -307376 -6012 -1360 -238068 -33387 -355540
18642 -355540 -292743 204746 28878 -224546 -50634 126775 156882 111690 -405375 -92413 -182785
18631 -182785 69650 -269750 -376905 -121838 -319459 -35865 -63926 30233 -2603 188209 -137575
18619 -184884 -327718 -219500 -24759 -57153 -114843 -166024 -181944 -59957 199464 -55098 68846
18607 -171640 -185520 -82998 5464 4418 300907 -115900 -226222 -247041 -213344 -245002 -3217
18595 21749 -72975 -421952 -325868 -65193 -132280 -136233 81257 -144251 -320053 -237612 -176399
18584 -176399 -76771 -75503 194485 84866 14045 46328 -80164 -25303 -24289 76048 173428 -94232
18571 47319 -96223 -113984 58915 -205410 -249107 -121688 54468 -83425 -199555 149389 -355010
18559 183359 -3231 44963 -57797 15549 77091 67577 -93971 126147 46658 12111 -84227 -117558
18547 -117558 14010 -26305 -17276 -50882 -127585 42643 72582 -140129 -169394 45763 -3406 -53944
18535 -53944 64820 -102587 -25523 40707 -199306 -106752 170903 -145990 -393274 150573
18524 -283681 -81139 -223263 99705 -249791 225302 -47241 -86644 -340096 -99274 19886 85571
18513 85571 126118 -3583 -329423 -199476 -91712 -201551 -76686 -37215 58925 -41555 39377
18501 -55266 -28864 -97479 -343346 -8911 -13459 -344802 -52996 -110193 -16188 -80104 196266
18489 -282070 190623 -156931 275932 92031 43521 -13236 -160923 -315384 -19161 -103150
18479 -103150 -163158 9747 168242 200730 66751 217224 95174 -280064 -239112 -150684 -162753
18468 -162753 32976 71187 330501 14850 -253540 -275069 231347 -181085 -102343 -31015 238689
18456 -164520 -18403 93538 -248550 -120557 -2663 -114063 43792 27895 -209012 -15543 44600
18444 41140 100835 121715 -18332 66924 -67953 -273742 31715 229841 55992 -222064 -94400
18432 -84946 94002 -31298 -151953 -321238 -25965 -192769 203993 89781 155498 93679 -99239
18420 -2854 29258 -42392 25972 -167655 -27039 1707 -138102 -158741 59768 299279 36312
18408 101847 -22795 57439 279292 297814 165834 -78784 143395 -81070 -159981 -125880 197083
18396 -125950 -137182 -28250 181707 165519 136119 -70718 -233618 -361138 -211680 56237 29664
18385 29664 -15538 -237335 -75464 -20441 202290 244047 -462693 197932 -278145 -132390
18374 22553 173945 -125199 -41774 -183786 62720 66934 -396396 253318 44665 -242976 -151923
18363 -151923 149396 16911 -122402 -253006 -48223 -132215 144 -287532 385865 -305499 -16715
18351 62114 -59546 117757 25301 -29009 -201916 206319 -72448 -76001 -30326 -157597 -370801
18340 -370801 -85929 308793 156396 -235033 19903 -330940 153374 -3479 -7182 195956 -373820
18328 -67496 -171795 -46446 131170 16841 -153081 -230100 -365286 -52598 175648 -180464
18317 -64305 -74430 17160 -34478 -93051 -307301 -146828 -87775 68679 81576 -83254 -140320
18306 -140320 -259051 -251669 -28772 -11091 340833 -288203 49705 5681 212641 -587737 -147855
18294 -398983 -196327 -142410 112437 193112 199790 -113699 69827 154251 -111653 -514686 4700
18282 97067 -211588 -17916 -53318 348408 -156200 203809 -50580 -269322 -119149 -43771
18271 -9491 -98381 -349729 -425221 283593 -354666 -120398 23235 -62800 -217059 -158907 -224981
18260 -224981 199571 -35724 -172015 10464 200645 362493 122858 51296 -260962 -46624
18249 119193 51050 -103920 382417 -317252 -357084 19728 113147 -119383 -125520 -79100 105236
18237 130304 -582154 302406 -151236 139305 55198 76353 -259583 -170381 270249 25226
18226 113637 17767 313963 -2276 -3069 59494 103371 -115769 -331923 51445 109454 19924
18214 253379 -131784 218681 104898 -334485 -112192 -152241 -291108 -159497 -13147 81940
18203 173355 -111316 -48107 -70045 298039 -230056 93947 -18312 222493 -79658 -175941 -30046
18191 -141358 -179918 -138973 88101 16404 190416 -54277 -248353 215704 81228 258689 -57157
18179 335705 103869 -61912 -162821 183032 46964 -158270 -297062 35803 150443 323081
18169 323081 -202159 60823 117101 -324719 153282 25276 -77202 264140 -123658 -177077
18159 -177077 47417 -106980 46928 -120 -4365 -181775 171701 -3727 -70237 -27799 158518
18147 -165299 -189117 151590 -162432 -181 200348 -10389 -121536 59952 -129257 -49391 -151558
18136 -151558 6916 -131549 189442 -138427 -182409 17966 -142827 59970 -371773 -154257
18125 -205271 130819 62400 -130674 60629 -124889 64018 199641 130438 -256779 -118754
18114 241674 -9635 5450 -191924 -702 256283 107859 -138420 -187209 -116806 -155844 -200875
18103 -200875 147023 -183231 76893 -132004 317998 -469707 -17193 -108767 -68035 -127524
18093 -127524 -27655 -113730 -21519 -129116 196151 127825 -166601 249609 180794 240297 85808
18081 -159876 -14629 219408 98026 25954 -65790 -82808 -154690 -35078 164047 -4494 -121095
18070 -121095 -233186 213840 279208 163073 230390 189483 77745 -394034 -4417 -66071 -4207
18058 198374 -200790 -39003 -150797 -101314 -223184 -106349 -245674 134329 -72775 50079
18047 76059 179153 72979 26113 284697 -309452 110381 -88936 132267 -45856 15620 301776
18036 301776 -29836 20435 17163 -341421 138820 115506 -128661 -122828 -168767 -29786 -99531
18025 -99531 -363423 -21307 -235680 -2396 -234200 -13653 130130 -320108 263790 -147755
18014 47027 26714 -430741 -2917 -135019 289347 -55071 -40621 189755 -164999 -39844 311753
18002 62625 209025 264621 163993 401386 57216 -240135 -123181 -130270 -48312 2422 111488
17991 111488 -99762 -95764 -135938 56983 91381 -106484 -186963 67691 178714 49088 391621
17980 391621 379197 4691 3012 138188 168209 -139773 -7977 -211366 -314594 -21112 139978
17968 -146713 -22691 -151575 160146 20953 -126264 -172814 177159 377673 7290 -25605 -23049
17957 -23049 38482 -108000 -7554 138926 -296961 145500 156040 -23845 -167113 67952 -114748
17945 4051 -84440 -38927 -13170 131933 34419 93609 -130087 111782 -51481 -266420 -284234
17934 -284234 -149103 -49576 116752 57765 -64533 -219469 149473 -17284 -231705 108847
17923 86503 -100213 57921 -12757 -109218 -24599 51995 -70904 -6945 -120457 -13457 253939
17911 -385241 -50229 54562 107036 161583 42242 -19998 102414 -218473 50176 -251906 68114
17899 -14062 -244844 -4234 152729 -103015 -9085 116837 -49035 -15880 47952 135714 -56135
17887 129324 6094 209382 -105576 -78447 -186768 -69236 49600 -19307 -57199 305365 -205095
17875 291129 63034 332163 -55670 185985 -50145 -210609 -227718 72831 90580 284973 -176962
17863 -44754 189551 -16892 330662 115499 -378935 215834 54923 -53022 -104621 199307
17852 47699 275412 -13370 -165815 -32100 159220 -132491 49994 -390280 -9303 -66946 -126874
17841 -126874 293153 -119429 114199 182361 -80210 -324756 -23334 -142533 114535 -57925
17830 235615 279426 -136758 228683 96475 -2453 -104782 -113459 -90843 -13605 99756 -80046
17818 -126146 61972 66342 129724 -17916 72347 -113310 -42467 -181537 38932 -9486 -43487
17807 -43487 -351374 -261672 168755 138159 65145 415670 -20443 148318 -104299 -54483 28338
17795 290734 63304 -73554 -1239 199991 23948 153675 -169962 -75087 -21798 -201293 -254762
17784 -254762 -175365 153451 -251578 312905 -360848 -21707 -12028 -116879 245120 51381
17773 -84606 144185 -251715 13292 -27563 174018 -262673 -138065 -42398 3661 -49131 -70120
17762 -70120 185339 130304 -68289 -54722 139694 -116836 -387786 -48545 68112 59052 -142002
17750 152535 -362756 154724 -3316 -219795 156156 232456 54064 210427 -104596 73975
17739 110532 322188 -268309 220251 -109428 92326 -170669 230046 -153480 7234 -1269
17728 346569 -142082 166427 -122446 -28568 443084 231947 -6503 -167589 -180712 44460
17717 -14615 -175104 -51492 170350 -290250 -56606 -50143 -175127 -64125 -49225 -136072 -208568
17706 -208568 -47958 -196841 9236 193857 -343655 176165 6220 -57234 -17067 80114 164842
17695 164842 -153171 299015 -185275 -82327 -239590 106500 -78493 49528 180996 -78220
17684 76226 43464 -250519 27434 184176 174672 124636 309166 -146485 -191805 73664 -71185
17672 -277940 261769 -66108 114099 -255166 250642 103514 -14037 -297940 247803 -188067
17661 -127513 169979 133752 -164064 49228 68495 150041 1644 325418 127625 113539 -66955
17649 456067 -233145 -11177 26666 140154 -224 15116 208217 -86829 -60876 -123 33057 -23017
17636 100572 -31434 63141 131160 -2897 31106 -193701 265576 -25661 40731 -234152 108706
17624 -162070 176268 241814 -48049 -50880 -239134 68082 109305 230904 165073 70689 222633
17613 222633 81263 40983 -48271 139656 -57216 100753 3630 -141146 224285 228885 73584
17601 22838 -282171 -11176 -95437 12331 -243168 298140 -142403 187412 45677 145971
17591 145971 125110 -84539 -61029 83021 67492 -83278 283612 241285 369800 136795 166752
17580 166752 -14979 227384 -223335 61903 40399 -147265 36995 64809 -149140 -125239 113398
17568 -46948 142471 -112838 -33585 276061 361989 -32216 -54648 -85087 321850 95945 46046
17556 -61744 63588 61353 120838 300378 254434 26986 23378 143885 69277 147568 44578 105581
17544 105581 -59788 321292 148197 323557 -85251 320637 171792 -67755 144775 -11880
17533 287053 70197 -225669 -5359 128116 169986 53863 -97281 -28461 -252353 268213 25505
17521 -373244 44287 211223 366456 546 113592 200291 191994 22544 160505 -277415 -143204
17510 -143204 -81554 155510 358088 69896 -197993 -70372 -58771 -261730 75555 113646 262975
17499 262975 356601 -197277 76490 25173 116577 129793 95815 280514 130616 168338 196051
17488 196051 -123677 34391 161308 56041 360988 145218 501541 7461 94047 -102571
17477 26627 311199 44423 171577 -69721 43151 -176034 275192 66215 -10529 197418 33452
17465 126459 151700 2122 43466 132567 264587 519389 -119662 -14734 -24089 90433 -13902
17453 347915 182219 279993 57612 118974 340813 367167 392004 308882 460421 106973 306538
17442 306538 105522 90861 146029 248660 320465 23028 241525 511977 299036 71933
17431 212070 318113 310042 57786 254038 384627 148736 200182 103233 424895 505728 117333
17419 619699 405515 328628 287323 117058 132307 310486 114862 108012 132395 116452 259312
17408 259312 325509 254355 206975 167111 -54858 -137025 76474 103899 235345 270486 174212
17397 174212 79685 328725 172145 116036 236442 222595 177025 -85676 113536 -9220 92802
17385 144146 114112 219682 394811 412197 205329 201772 346034 420373 222787 109098
17374 161007 -39112 409 73980 278033 209320 230366 -23056 -72030 183704 127750 -3898 56654
17361 -91755 103818 302275 55646 496990 -232384 -27492 34992 367411 -18305 329064
17350 63722 308987 32268 332238 251174 -37614 278207 -10370 -150733 -70532 175967 561681
17339 561681 946 350255 186150 -66340 148225 295891 151582 171584 -28518 164799 -9626
17327 124416 269232 252996 356085 -123478 -127156 70285 247408 279295 222777 -34300 162506
17315 -186823 296055 120497 272766 76374 323304 232307 306573 423765 231767 516654
17305 516654 260086 150603 222562 218029 199495 211576 166492 -16754 85026 -36635 102155
17293 -143213 -111698 120746 15195 100836 43799 56146 233271 397239 -159326 281946
17282 -21782 -74926 -104267 -45683 123167 167100 129854 157626 -245817 447353 277026 248257
17271 248257 386668 146592 505064 -84714 -152107 501735 -71445 289982 3654 428990
17261 428990 281386 277897 291273 224901 100677 9806 8948 236755 167340 186328 351231
17250 351231 191436 330560 310663 127876 -75854 43073 530239 -69010 215785 51616
17239 240392 308575 111881 232727 -179603 376031 333689 294213 150478 258135 79910
17228 163550 71373 404737 322440 59356 -34867 36782 336927 -87674 203661 194558 145864
17217 145864 -67367 -50755 356965 -134231 -38181 106733 -39186 61229 287351 -114855
17206 480941 258657 71663 241795 293288 237302 299388 232211 264182 87110 340888 91460
17194 285899 364352 307586 -126198 287305 203789 443551 434289 795114 237466 492486
17184 492486 161175 -105473 55208 277196 38612 207061 310543 246043 234091 275837
17174 275837 108174 335051 179080 312485 184765 150696 95904 151753 313988 451007
17164 451007 458606 90190 79115 314637 123225 327021 503527 163345 164305 190124 578485
17153 578485 115315 310806 384507 421422 358007 166302 -12268 183587 350872 269265
17143 269265 403641 340802 651314 454518 583151 159076 282713 344528 334046 402764
17133 402764 427353 435125 384898 580758 92913 461915 446284 385472 586525 437321 380867
17122 380867 350518 306647 259459 664075 477019 117243 302355 237398 57817 420962
17112 420962 270427 335566 501560 287607 344809 78268 418625 120789 316914 558095
17102 558095 193011 510706 370911 513238 350675 373117 153709 133879 518683 422516
17092 422516 533706 269662 292981 227937 250324 300810 471955 613062 463076 311004
17082 311004 74783 273627 499718 416063 498707 334979 247099 383706 447928 326223
17072 326223 150952 333294 592759 415654 604073 315671 766571 880698 174641 695067
17062 695067 512250 520350 516139 506897 485193 403595 607699 458298 294340 525332 521519
17051 521519 454858 226471 572048 610462 705490 365254 398684 687386 479535 398995
17041 398995 662549 696733 560559 322545 815225 542641 322775 561733 436546 478006
17031 478006 423794 535973 514289 923897 480700 372280 690706 633032 359772 771052
17021 771052 623143 1039784 832495 803398 679472 552940 357449 662125 634442 628695
17011 628695 699918 470083 562296 850784 821036 456558 624028 645611 659807 779608
17001 779608 1128710 499182 316141 502598 321913 491799 1044991 724114 703070 852690
16991 852690 801153 777173 601708 753056 669277 1066136 986406 848343 990368 555043
16981 555043 752949 653473 509156 920793 932078 877954 805331 578830 823485 750686
16971 750686 659132 1101776 656006 1039783 729939 853369 866172 806601 922584 845630
16961 845630 772262 1049762 1025576 929846 600929 848156 940366 919669 925022 924288 664398
16950 664398 813081 1095482 1085940 1185967 1039678 1101153 978900 905596 911644 1216470 1035332
16939 1035332 1152120 1311067 1063329 1415974 1299092 990579 1061737 1360646 1163195 954947
16929 954947 984473 1397082 1219302 1119335 1304154 1084193 1118471 1125597 1583500 1334685
16919 1334685 1295265 1101565 1361155 1292615 1437542 1462622 1733272 1034604 1129059 1784667
16909 1784667 1302245 1257417 1338083 1550084 1444032 1772255 1576313 1612421 1661929 1611509
16899 1611509 1630993 1941877 1788817 1899648 1643066 1582787 1536411 1787224 1907303 2056420
16889 2056420 1733325 1944681 2259584 1648700 1920360 1593374 2072154 2020752 2034929 2013817
16879 2013817 2073265 1962130 1854830 2053939 1865903 2158829 2017355 2336204 2311409 2135837
16869 2135837 2380322 2320915 2487372 2342911 2477387 2600811 2445333 2490897 2421169 2721128
16859 2721128 2691674 3098383 2688389 2664062 2616519 2837048 2702186 3133366 2811567 3199831
16849 3199831 2887691 3183034 3009163 3023315 3175586 3153229 3465294 3549099 3604796 3558535
16839 3558535 3959524 3701488 4191234 3557485 3732785 3877234 3864095 3818352 4008056 3943505
16829 3943505 4567736 4537154 4457042 4479460 4678605 4640864 4791566 4823133 4602468 4940394
16819 4940394 5200140 4650805 5189056 5424168 5404257 5807877 5888325 5967850 5884727 6081148
16809 6081148 6222005 6057806 6122435 6775138 6888164 6871118 7233235 6996293 7206902 7327318
16799 7327318 7467653 7896831 7916177 7800287 8427494 8634296 8884999 8945120 9177755 9514297
16789 9514297 9898672 10169667 10303599 10401337 10820220 11184361 11253547 11854711 11980917 12098642
16779 12098642 12758866 13102610 13799712 13657279 14678136 15113578 15321265 15975868 16524843
16770 16524843 17244797 18059120 18122589 18916891 19272282 20500678 21310695 22093948 22584784
16761 22584784 23662418 24765847 25868897 26645223 27945357 29098155 30597010 31461321
16753 31461321 33115826 35275786 36750106 38030770 40132888 42095007 44667804 46475186
16745 46475186 49288667 51713041 54948497 57992156 61500576 65113867 68899818 72992062
16737 72992062 77367852 82257102 87650030 92922472 98887495 105331194 112011474 119263739
16729 119263739 126400092 134179851 142374229 150490055 157981365 166436462 174157633 180845925
16721 180845925 187445349 192613799 196877677 199862643 201502340 201575967 199964043 197112141
16713 197112141 192645744 187604355 180757209 173909991 166342125 158372744 150227166 142033311
16705 142033311 133875723 125990968 118660497 111494628 104941578 98373820 92047645 86489793
16697 86489793 81643957 76817367 71872924 67936637 63848825 60263336 56589210 53960990
16689 53960990 50700891 48121010 45496138 43231013 40712964 38898839 36806434 35430635
16681 35430635 33522783 32250504 30630747 28886579 28051863 26537401 25675462 24447297
16673 24447297 23632137 22665235 21628626 20953450 19989520 19484656 18231430 17728133 17364450
16664 17364450 16479877 16199650 15326559 15076910 14804740 13808078 13394588 12996776 12721565
16655 12721565 12150239 11715657 11663915 11048987 10699098 10655451 10182697 10015525 9676923 9620751
16645 9620751 9351013 8821711 8532548 8348675 8139580 7714224 7736895 7617175 7337410 7089653
16635 7089653 6928746 6705473 6576058 6493390 6099156 6034648 5958969 6119421 5512569 5373527
16625 5373527 5478775 5204961 5224173 5264997 5095424 4843090 4860282 4767206 4746863 4174917
16615 4174917 4291287 4317365 4065008 4253813 4239390 3702884 3960735 4075334 4028345 3486627
16605 3486627 3414588 3583714 3663350 3479219 3506511 3406360 3282033 3233139 3407251 3119415
16595 3119415 3250934 2727662 2943702 2686364 2513929 2590570 2603418 2375703 2677838 2702523
16585 2702523 2504292 2470338 2457549 2269479 2566327 2473510 2087042 2417376 2219769 2201328
16575 2201328 2296632 2029279 2274090 1916937 2113912 2052101 1863047 1741863 1902015 1863796
16565 1863796 1843089 1890799 2046388 1838811 1942528 1733418 1852966 1372592 1694736 1721907
16555 1721907 1739821 1401773 1712186 1645120 1204601 1681681 1617416 1775885 1418801 1542047
16545 1542047 1188280 1520117 1149356 1604630 1502004 1436832 1372005 1117941 1260124 1446555
16535 1446555 1298981 1091741 1224150 1096507 1125807 1378781 1271323 1377595 1396310 1064904
16525 1064904 1114633 1021612 1140668 857408 1308193 552778 858878 1305350 1022000 1149225
16515 1149225 1066232 1134610 942855 1297349 1130713 667124 1100012 1040262 907578 598678
16505 598678 845577 822203 1183304 917814 955119 689797 1104066 1049951 873975 959917
16495 959917 757984 575358 771585 824355 986709 632746 833023 536707 592252 602248
16485 602248 490925 870345 1107284 938474 836961 763703 770181 517874 853568 757516
16475 757516 425182 813298 762566 651119 678276 610161 604289 458518 832203 634035
16465 634035 535842 592641 914013 555106 459536 446459 855706 688701 864832 885374
16455 885374 739601 715811 523567 415097 684080 398289 637426 276947 443088 542759
16445 542759 365143 647689 629170 250179 408048 370613 570684 417990 442923 661502
16435 661502 389841 670545 544874 575084 254423 527382 373825 98138 249923 601406
16425 601406 471726 582664 250884 750278 123506 452946 168835 392281 73773 394340
16415 394340 62606 387134 515573 158621 459792 167686 345500 368552 358954 74152
16404 440836 324236 216834 488014 314271 224802 137015 452191 159504 371216 306406
16394 306406 310332 337285 451499 296044 234463 196055 156553 362496 96936 -177096 5540
16382 292668 155616 432673 206002 342834 210909 280528 453325 350503 348426 553070
16372 553070 274843 1370 571207 180334 293606 361806 332020 165686 432897 326727
16362 326727 441662 194056 88637 46449 173193 263397 -1394 223037 463427 219472
16351 27361 423389 63840 156886 269643 141846 329688 245654 608693 149714 -129271
16340 165750 235157 -128987 140398 267325 158547 292417 488331 708174 233571 163986
16330 163986 270017 222151 148245 60776 -50647 241652 135761 72864 336099 349899 713992
16319 713992 153410 226849 -87988 268096 139838 194603 294452 261452 -61013 517685 252966
16307 285926 121434 -113652 310188 49562 141115 65332 -314553 137991 -222062 132071
16296 47463 311426 355247 90365 172818 345113 166324 64084 17138 188518 -2306 190010
16284 184083 439409 400938 345990 157208 29917 155613 177675 -121294 39392 -18089 350534
16272 168363 3199 485325 42334 27385 -17913 173269 254225 -31070 -38605 205235 2026
16260 -117845 98861 207635 107548 171157 351854 76059 90314 -140530 229282 255477
16250 255477 160789 -44821 212118 98885 -29920 121346 513205 552473 108247 50714 -113012
16238 381646 498391 9888 119644 148985 172274 242576 225141 185060 -60818 287273 134096
16226 174319 125182 64279 -250128 -251401 240673 435947 -168591 207854 -209788 220980
16215 169633 293942 35932 -34040 314310 345583 179539 134346 -13076 -74263 43892 39552
16204 39552 -15636 262822 228796 -9411 -101385 -129337 120520 -45048 309151 356934 86547
16192 119128 167461 235121 -156175 127739 -82991 -67257 -143237 -63635 230945 269146 93816
16180 333687 -126733 79860 111172 253174 -195317 117706 135235 246626 -121809 49698
16169 111134 -52373 -177859 -121945 177066 -138758 343167 52857 -663 -454093 12879 146463
16158 146463 -200824 149208 67932 267667 -16996 143973 -112182 -73084 51068 183450
16148 183450 -238209 286833 82537 -118828 -74881 343989 -173608 -243417 120479 102790
16138 102790 -74843 95786 -147953 -158077 -20046 -7926 109268 131594 -178765 161052 256981
16127 256981 411960 -277482 -181272 -129869 -8606 -363866 -150513 408064 -4627 157484 -23931
16115 70883 348823 37023 -96335 85102 119281 282566 -80274 231706 -197927 122315 280144
16104 280144 310503 322412 365100 198224 202146 258270 206483 -270427 146469 -179834 -312670
16093 -312670 -44780 7286 -347761 -22906 -363092 -318115 -290520 -178201 -300031 -80110 9793
16081 156690 31226 105095 62843 68321 101528 41177 259863 -116016 32770 -52854 -204776
16070 -204776 -170319 -251228 369545 -109574 77454 -75666 111011 -152633 -36137 -147356
16060 -147356 -56710 48339 -66163 -35009 75089 117881 -91526 -67150 -433385 -24072 189964
16048 136894 -297377 -119274 -213426 -240151 80937 -22758 -65841 -66445 -142660 -111550 -218684
16037 -218684 122303 -133338 132933 -28214 -77209 -408623 -1749 54520 19576 -91765 -222211
16026 -222211 -201434 -150823 -165098 -59829 -132504 51969 -16031 -35677 201899 95497 112057
16015 112057 16653 132454 241809 360561 -350332 -181466 -77652 257315 75337 -34261
16004 -229311 -11955 103377 -34497 -163922 124600 80512 53717 136227 -83503 -32827 -230345
15993 -230345 -184317 57690 -180625 -103107 -55527 -19230 38676 -198294 160720 77375 83107
15982 83107 248906 73995 361149 99860 287627 104345 3215 -184142 33717 -277468 76950
15970 -226297 -24825 -181505 -254172 111663 58673 136779 86672 32458 99126 -39934 -296350
15959 -296350 57254 189752 428489 -209627 88698 -13781 -61241 -35948 -237832 108756
15948 -136905 -272818 -81065 -113040 -212410 -173762 -283054 -43780 -91844 -63718 152398 -46903
15936 -2823 100706 78447 97826 98459 37572 40620 4105 -121890 -241207 -306384 85343 47717
15924 47717 -16372 -37411 -212828 -257097 -205800 -10236 -298080 -230376 -66030 19779 -27882
15912 142508 -139594 -183794 156513 12936 -197754 36223 -96203 -463452 116007 -144957
15901 -123348 6199 -91410 106052 -252228 266844 -283699 72142 -218970 61216 36057 -301287
15889 -203481 336152 -52901 -20855 231727 -235306 12869 -249717 -373092 208486 105466
15879 105466 109706 126057 -295828 20216 -12284 220694 -86940 -107673 88189 -338813 -358556
15868 -358556 -376787 -36821 -319859 -234568 -4477 -1224 235215 -216594 -235758 -214622 103536
15856 -97647 255249 237836 -177001 -95782 -265309 103216 142062 340989 20030 -45342 118024
15844 109144 -67989 12548 14954 -145115 -107721 216927 168276 -190566 -252391 -61499 -2226
15832 -58620 -141138 166714 159331 -146209 22840 -97889 -300554 -123100 -133271 -47798 -169726
15821 -169726 -18997 -114919 -111351 -243566 58388 -173438 -78904 86531 -434637 83239 -70052
15809 -310704 -210274 123563 -155884 -26666 -3109 20554 336449 81916 21355 95302 -86389
15797 -146237 -203751 -26911 95563 39935 75541 20623 272740 36695 145999 -74283 -13927
15785 52490 -205366 17433 67630 -199169 38758 78560 -284674 -278048 -154343 91920 -192874
15773 -131260 21970 376288 142538 -134584 -106598 -29661 -201321 -273695 -59078 165553
15762 -143800 -603376 -28689 -173216 291564 223249 150866 -92980 279804 76279 -57333 102020
15750 50356 103846 24495 108 112564 139002 278187 81354 -101107 -59552 317369 200562
15739 200562 24531 262428 18335 72038 130516 47454 369806 95356 -169250 18559 -29126
15727 -468447 -658422 -86111 -297379 -141027 -101407 98290 147325 -67710 -210180 -392946
15717 -392946 95074 76725 -438182 68629 74883 -218656 -276070 26155 159772 -319603 39346
15705 68207 304258 7221 -5458 -200528 108960 -236527 93340 -66650 -75938 -208231 -289118
15694 -289118 -107174 62723 257388 45593 -45182 -56664 80088 -121691 252354 33446 -127069
15682 -120234 104007 -20743 158258 177035 1700 -301612 -63892 46566 -67779 -49907 -124388
15671 -124388 -58888 -54178 12673 -207813 249038 -93719 -246742 76109 -6723 -194280 138489
15659 2266 -15098 -56087 -79785 -6715 -113305 -123642 -72857 200566 106329 12345 -278461
15647 -94943 -319106 -22651 -38295 51395 -75664 -53892 -108190 30025 -135079 127684 61764
15635 -91924 1997 -210213 163629 41323 43249 -109021 -88308 -83223 31630 74079 46601 111209
15623 111209 -152117 197173 -83015 102868 -85259 -100155 222830 -190443 6109 54844 -96292
15611 -182448 -50782 -22165 -228292 23440 232182 -149156 -168123 99505 -223948 -85102 -245532
15600 -245532 -93494 -46696 45392 -143124 -341840 -345730 -323041 140897 150076 -122570 306657
15588 -125348 -11247 121095 -46760 651 -111119 -268038 288903 -521195 148641 -66828 30991
15576 217083 56398 123265 -126364 73917 70921 -187803 -81855 -185804 -97990 -125912 -364134
15565 -364134 -174546 -16726 57242 146709 -29371 -259978 -11757 -37746 100821 -115516 46446
15553 -24364 -24017 -77247 -491656 100832 -474708 417804 33489 -298379 162424 -39031 -239545
15542 -239545 -3038 -38147 58724 203029 -60067 388086 114496 12208 -283358 -415210 -82656
15530 -387232 248775 -138764 46956 65603 126598 62525 78691 219164 -168385 29209 -86908
15518 164472 48536 121989 -5091 -248192 222800 68524 -32916 -87839 130037 47697 79301
15507 79301 114758 -44089 -661 -193762 117845 5550 89865 135020 -122481 -15220 -70241 51384
15494 86388 100246 -129279 228469 -2294 -182543 -176426 297012 307847 314111 -56511 -198834
15483 -198834 -208841 218232 101774 21640 -83631 -175613 -357160 -78332 54616 147611 -73142
15471 -8309 49206 -147616 118925 -22120 -108030 122024 -128880 85732 -100769 -142355 95677
15459 74269 -38014 -104969 -122487 -175244 241370 143855 225007 -29548 105686 42886 25320
15448 25320 114140 -70494 68103 49999 333410 -268863 106478 -199455 -464527 -239845
15438 -239845 81288 26032 12603 -369277 18492 104093 142883 167858 209515 274520 -112626
15426 -43688 2303 28593 -287276 -189576 225271 -110585 247934 -144468 -84158 115320 -225926
15414 -23108 275335 41650 -56576 -94546 368826 284982 58916 -83454 -69522 24751 253706
15403 253706 279521 -49237 -69122 -48453 -158437 -98134 228826 62345 -334464 -131899 46848
15391 -104252 -61903 34192 75592 -174085 -54399 -154990 -34680 -281763 29089 -77507 285164
15379 116380 -247243 -15078 20132 182091 -199341 -65215 -319150 79674 -36107 -108696 438612
15367 -165197 89829 139819 -74209 -147019 269842 240000 27890 84918 -91239 38050 286552
15356 286552 -109303 87543 -210825 -65650 -116133 -74563 -188107 381445 176261 -324881
15345 -321914 124769 85203 -116092 -33280 -227812 283479 -92242 -136406 148670 -22740
15334 -298419 -87634 -219830 320525 -31826 5561 390613 213228 -16672 136018 269944
15324 269944 237305 -179454 54055 319739 -110144 69068 205507 -247480 -163219 -11678
15313 45766 264293 39253 31291 273143 29407 97888 -277260 12748 214978 -28136 56005
15301 -103916 -15739 178425 106642 8490 633662 337807 47624 -212442 234600 148149 -334242
15289 -138367 -175294 359298 29762 -4567 56200 324913 102048 220006 94991 197711 -126672
15277 -339109 216876 -92844 7016 90894 21280 244865 -13922 6994 -276160 46105 141174
15266 141174 5788 44111 -63899 83616 -30321 296678 54039 -122851 164802 355569 191298
15255 191298 -173731 145799 38659 247510 131031 209308 672239 1582828 1173086 1309967
15245 1309967 1682887 518472 185179 -22804 -84633 265188 -53828 416657 84836 457665
15235 457665 -101901 105148 -212117 8945 43559 -29165 -15512 179409 152654 151737 -103249
15223 -83981 161339 114528 -6143 165277 -133621 189418 159860 222395 89268 -89876 86805
15211 188932 -62886 -186326 96616 62928 -128232 -290529 65446 164865 179603 -386506 230686
15199 246407 67183 135030 88227 -1077 131622 164748 376458 232612 129102 -244078 255132
15187 -63622 328644 327753 -210411 224965 12368 182801 -37550 481957 86543 -61031 130046
15175 -133303 78718 108455 -4553 1912 96272 130204 382698 -9367 130383 92370 -9287 -43840
15163 -43840 -231555 457885 30185 83232 281913 232844 42594 -32202 117817 338494 -58866
15151 103320 -293685 -26998 -21018 -68432 302082 201369 309618 163174 -445508 -82706
15140 125298 -77277 -198239 196152 -239996 24877 197406 38538 579824 360487 187572
15130 187572 -118427 480611 -33974 11685 261122 227678 127552 -84402 -209757 264169
15119 -62776 280154 299071 258429 -51787 43969 288896 -145209 -58871 142006 269773 158142
15108 158142 267661 118563 -41353 339952 245846 211306 -42407 213262 594005 403337
15098 403337 261237 204144 94127 364737 25344 -129421 -104790 325157 309306 383778 221322
15087 221322 307549 -217453 320464 154790 199388 266833 6782 11259 259008 297211 -6924
15075 -103718 -28767 181076 277015 449216 134067 396631 233979 -21944 343982 109723
15064 32925 128397 618724 210961 172965 176239 253875 168285 216074 51419 232770 177916
15053 177916 44947 137904 85941 84235 59011 196838 13672 369104 123041 241730 -28371
15041 157325 -60964 181408 199323 35004 -219713 258277 -171088 180399 27505 380544
15031 380544 43873 947 290460 180680 586089 171610 105680 116119 -64914 -20747 159418
15019 218200 229699 324312 -82505 9593 -14110 194184 390144 234888 63617 220216 228436
15008 228436 148701 229390 369232 96233 551242 -112039 69794 -68065 428800 244420
14998 244420 529458 68612 396953 84309 579010 -120491 340746 173589 150413 217089
14988 217089 -59444 96195 87587 138902 -106625 457631 431415 146085 170834 131992 237626
14977 237626 294388 -100540 -34712 306259 263503 654961 29935 5158 40597 418705 159784
14965 107722 227254 191141 321925 600045 -232901 127655 198549 334927 117028 161800
14955 161800 515576 37688 506709 249665 99815 593158 188247 374230 508924 452867
14945 452867 128245 170877 391827 171449 447104 154310 229980 300930 147364 556865
14935 556865 330146 297757 274680 357243 183771 284545 371554 205831 357813 493361
14925 493361 299589 446094 210810 305822 328985 133745 425621 124503 363089 117827
14914 295418 450141 279330 591291 148449 302011 164687 151773 324041 227865 168495
14904 168495 818881 218488 487175 260882 787675 325694 312967 -97128 197133 902334
14894 902334 611040 259498 418842 374002 221940 420930 224054 635452 221172 278079
14884 278079 591788 -95458 332578 670284 554404 290828 91258 448479 305022 607631
14874 607631 302600 128709 409271 284273 381748 791156 272274 222111 169375 425118
14864 425118 453157 221476 378743 497158 453085 411001 315599 359668 469379 330703
14854 330703 328038 285727 544416 842219 593388 469042 274302 617288 235105 318983
14844 318983 386702 597099 564327 508813 518920 393153 161237 478972 383542 140357
14833 469376 674555 416627 479730 375069 305673 394718 182336 509185 179165 374161
14823 374161 563523 412656 236982 299106 240058 440392 537299 1113563 289279 628621
14813 628621 412780 761610 593439 281908 447133 303740 427789 607702 683899 253723
14802 309005 501524 467506 494862 438139 739332 710746 538901 560201 363141 514333
14792 514333 418137 690823 550671 553617 423202 331071 730454 428864 419786 543508 562259
14781 562259 664908 429821 389829 665389 399302 632153 546284 711353 554116 654561
14771 654561 377979 557225 565576 261311 214629 687414 521354 628264 274021 526316
14761 526316 578259 760979 796951 781541 466347 779503 489203 835587 599039 687616
14751 687616 670986 589168 816528 883895 581068 793303 989350 636021 634533 556046 765235
14740 765235 777151 719560 741074 763695 789403 904538 739818 883062 640279 848433
14730 848433 476019 826734 953365 653560 902752 1021351 848701 650005 680242 594837
14720 594837 745943 819534 628956 835340 875473 899225 802783 921332 514260 870733
14710 870733 684553 756006 768872 429886 576974 1002925 761646 864531 836966 820844
14700 820844 699171 892501 711354 480400 975796 970091 700599 946622 1109515 846221
14690 846221 680380 827507 641457 930070 795551 1130049 998243 743166 889651 854456
14680 854456 991946 1264184 1169728 1308810 827895 993583 735194 1285951 729152 1064987
14670 1064987 950243 1025393 1030172 1122169 756358 1183925 1121740 1400889 1214961 1200330
14660 1200330 1235357 1116568 1154844 1006887 1177953 1363401 1269696 978973 1252761 1097184
14650 1097184 1059172 1132730 1110080 1255095 1137078 913029 1099373 1449726 1479735 1071839
14640 1071839 1539264 1267975 1386025 1788617 1269088 1310914 1248446 1377192 1314778 1102574
14630 1102574 1136738 1371970 1330794 1355209 1243633 1420179 1236900 1463487 1300732 1564712
14620 1564712 1257722 1184168 1282525 1535225 1479523 1266810 1736756 1412939 1709488 1109964
14610 1109964 1643190 1872921 1634879 1457792 1610997 1785469 1913637 1373945 1732529
14601 1732529 1600687 1458656 1859368 1502398 1772832 1813026 1931494 1931875 1769635 1399512
14591 1399512 1923861 1561690 1659209 2034032 1820608 2256540 1849200 1754515 1904915 1762840
14581 1762840 2209892 2104266 2004120 1596851 1940003 2005310 2287349 1895011 2174677 2217172
14571 2217172 2171194 2369122 2469736 2359890 2330098 2298466 2631210 2352680 2366312 2253879
14561 2253879 2679752 2561377 2488653 2729024 2686838 2677348 3034880 3406426 3508190 4148604
14551 4148604 4826625 5692288 7716832 11322804 19788205 40178188 45488756 22890227
14543 22890227 8846303 4714189 2949725 2505471 2344998 2424854 2190195 2283780 2091028
14534 2091028 2251035 2243104 2232191 2226307 2359001 2320270 2403945 2342004 2295333 2300263 2626254
14523 2626254 2174359 2592487 2363312 2712529 2628175 2702889 2837181 2563267 2898610 2414744
14513 2414744 2802414 2574740 2687674 2980248 2757539 2974445 3084622 2869141 3037473
14504 3037473 3224996 3107438 3171380 3278326 3060239 3330626 3322727 3287054 3442728 3471622
14494 3471622 3115668 3356066 3389880 3292407 3576588 3599349 3633442 3743509 3646072 3683298
14484 3683298 3736551 3913530 3486558 3729324 4047861 3859932 3932446 4161901 4059362 4275412
14474 4275412 4194347 3926807 3954825 4498762 4233869 4470601 4383468 4581933 4636105 4750714
14464 4750714 4680101 5012937 4797979 4964014 5229209 4413109 5047109 4766474 4962305 5080782
14454 5080782 5433743 5231539 5131045 5685734 5555417 5590414 5458091 5712618 5613536 5811447
14444 5811447 5611314 6032553 6044482 6148596 6203712 6142338 6011361 6358480 6137034 6455719
14434 6455719 6584625 6745334 6860345 6803809 6602039 7029220 6993967 7245372 7241844 7332559
14424 7332559 7520267 7557167 7470308 7879134 7720213 7795941 7938039 8336152 8551959 8633767
14414 8633767 8486213 8610098 8757802 8747296 9097604 9034373 9449930 9673583 9783131 9897205
14404 9897205 10028800 9849537 10181441 10099743 10567213 10974897 10913174 11205346 11197451 11516473
14394 11516473 11779868 12044325 12109140 12532841 12426954 12448350 12794105 12713765 13212627 13261552
14384 13261552 13858260 13773880 14401466 14566948 14957776 15060127 15272732 15825642 15678076
14375 15678076 16417204 16558533 16798422 16880798 17197119 17602583 18113440 18058170 18743214 19070674
14365 19070674 19480640 19920444 20207184 20570448 21109014 21494294 22363137 22664589 22862660
14356 22862660 23614821 24319205 24624868 25201928 25935049 26533210 27168331 28142495 28433666
14347 28433666 29412771 29513659 30700390 31289204 32384888 33019087 33808826 34857068 35645705
14338 35645705 36826325 37738950 39018866 39854397 41038264 42463576 43370432 44937407
14330 44937407 45910503 47814196 48864606 50804580 52164578 54342353 55932373 57515028
14322 57515028 59498165 61704709 63705068 66136817 68521146 70815789 73675191 76043409
14314 76043409 79299133 82530950 85605481 89028425 92194062 96294781 100088041 104726206
14306 104726206 109094912 114063716 119108933 124164038 130203506 136055719 142562346 149262402
14298 149262402 156512048 163847572 172094728 181031176 190223626 199493553 209812355 220349385
14290 220349385 231911146 243711765 256341425 269383823 282937438 296961045 311565308
14283 311565308 326328498 341699213 356962923 371941822 386865388 401268835 414827563
14276 414827563 427424878 438570687 447502562 454255196 457776823 460024586 460314131 460265141
14268 460265141 458824316 455415137 449660512 441583418 432018148 420508267 407777810 394052245
14260 394052245 379563871 364456022 349044052 333373206 318154769 303609852 289498846
14253 289498846 275655689 262453181 249324446 237239587 225414066 214080508 203815817
14246 203815817 193626553 184462337 176006201 167736428 159677261 152061452 145021178 138431548
14238 138431548 132617344 126710381 121001521 115807564 110762991 106223788 102194939 98138111
14230 98138111 94068577 90592838 86724584 83076107 80116132 77224957 74547788 71749849
14222 71749849 69186748 66599915 64405262 62221214 59946371 58126543 56067593 54184178
14214 54184178 52653372 51514356 49821839 48205892 46545536 45136376 43857033 43329037
14206 43329037 41960488 40436070 39344708 38172755 37050134 36168738 35517579 34343926
14198 34343926 33439092 32593434 31842985 30637502 30008158 29543406 29174446 28005046 27419906
14189 27419906 26622903 26174684 25490037 24632109 24302222 23817371 22923158 22960526 22180163
14180 22180163 21574742 21217611 20914613 20176523 19922459 19588410 19068219 18498095 18115290
14171 18115290 18195340 17450703 17311097 16719242 16612419 16181079 15998965 15740657 15438455
14162 15438455 15394027 14626531 14517143 14351154 13869749 13922354 13675409 13027825 13309642 12671367
14152 12671367 12322880 11998469 11993536 11809813 11967209 11255006 11347070 11186528 10985708 10876246
14142 10876246 10519826 10378677 10198269 10011811 10423732 9639672 9350498 9394400 9463413 9341491
14132 9341491 9299212 9196702 9061770 8855364 8559470 8666097 8325913 8312142 8170443 8189878
14122 8189878 7902000 7755580 7594192 7613604 7936595 7437861 7067461 7164442 7165196 7105455
14112 7105455 7015255 6790599 6978931 6752039 6555123 6678065 6576860 6625268 6213911 6466898
14102 6466898 6164626 6247710 5855338 5984338 5736335 5692292 5552670 5657898 5659966 5482034
14092 5482034 5235264 5317195 5311792 5320139 5535479 5183769 5170963 4849471 4997772 4942108 5001740
14081 5001740 5196228 4633035 4779562 4871935 4434697 4923448 4134629 4971612 4350511 4285160
14071 4285160 4584786 3903457 4211561 4392070 4211842 4710557 4264751 4026221 4092731 4110587
14061 4110587 3768121 3947957 4166700 3894310 3926676 3748029 3487105 3744549 3559117 3788694
14051 3788694 3681022 3300380 3647010 3574191 3488710 3396781 3601595 3192475 3498448 3268993
14041 3268993 3203818 2912395 2966341 3177826 2954932 3131606 3307432 3185924 2748138 3233669
14031 3233669 3029319 2710972 2746260 3010340 3075920 2697739 2802908 3025673 2575613 2978932
14021 2978932 2692342 2567759 2634436 2448714 2634652 2688853 2639708 2248390 2427310 2412686
14011 2412686 2358561 2048624 2521637 2347597 2295714 2490716 2301019 2183809 1946409 1997535
14001 1997535 1812921 2268331 1758619 1938576 1890736 2065327 2110790 2074406 2102144 2014355
13991 2014355 2354361 2534689 3430240 6232892 13028251 33138079 46852675 26073471
13983 26073471 13107635 8351045 5658997 4816687 4065463 3536077 3394255 3109599 3256674
13974 3256674 3028404 2610105 2640270 2184889 2600773 2378590 2583135 2485627 2151551 2521932
13964 2521932 2136037 2147243 2300788 2063612 2569786 2168728 2055550 2078667 2417991 2037552
13954 2037552 1793169 2187047 1896372 1994513 1710169 1761082 1887518 1991495 1931996 1884410
13944 1884410 2060957 1580928 1801821 1501773 1905890 1538725 1677997 1850034 1512977
13935 1512977 1728337 1817038 1620103 1823644 1656235 1562446 1847915 1598281 1626439 1436039
13925 1436039 1325709 1801030 1584130 1852361 1583388 1405279 1343148 1632149 1623040 1398015
13915 1398015 1600605 1500320 1780855 1051395 1247112 1560814 1647256 1544497 1150173 1668139
13905 1668139 1298899 1221892 1327251 1348284 1597657 936420 1428538 1168566 1129971 1391081
13895 1391081 1020265 1404162 1085367 979664 1249426 1169459 1057136 1263295 1153499 1179018
13885 1179018 1406650 1111620 1084411 1283095 1206852 1048168 1032593 1262454 1350961 1343422
13875 1343422 947053 1192583 1104553 1048901 1088611 790554 1243201 1433611 1192426 950837
13865 950837 1100760 1015792 1075240 1229625 926873 1199884 1349360 1341495 608484 1116492
13855 1116492 1192660 1185316 898062 941302 1125511 918322 1041752 906583 1065892 1445460
13845 1445460 1132554 991541 845455 729863 606291 1034078 1001955 577785 1045629 1173921
13835 1173921 1033795 1205412 811957 884916 661309 984588 1113435 1001699 864698 938065
13825 938065 633850 730917 1020160 602502 658039 892896 834093 818462 737226 991223
13815 991223 828420 1094283 702805 811801 1105651 774642 952985 699612 691510 859864
13805 859864 1178215 933868 767114 249425 955190 467829 793994 697127 980822 962877
13795 962877 844235 1013858 965789 801166 768257 761745 376460 662616 512082 768212
13785 768212 868447 621572 502454 891837 859308 589586 905801 295080 786203 668202
13775 668202 888851 793664 568560 942940 748341 572086 1010947 690391 771103 606840
13765 606840 1006681 828918 805873 629675 725814 475702 683571 869465 564328 686790
13755 686790 1009424 782257 688743 761230 662713 624818 339600 568273 532247 331908
13745 331908 402706 692758 388604 686728 641670 638834 826163 596752 503793 369577
13735 369577 379150 455637 721272 256409 402023 518557 295802 873231 513907 810012
13725 810012 441436 668051 392766 539729 626941 325659 415612 363971 308053 394875
13715 394875 625326 639122 597387 375414 729618 502611 940762 478261 570273 497520
13705 497520 404266 535879 589526 622314 521989 980274 316100 467247 901243 198853
13694 438800 181443 534732 574974 651117 603321 370517 633045 582755 155570 341258
13684 341258 709425 522495 270659 720587 317378 567746 484492 488946 313432 331868
13674 331868 280411 367439 551476 619168 318803 587104 208838 125403 166656 342434
13664 342434 101694 535812 507339 334101 283697 491620 470776 907446 350369 313036
13654 313036 356470 287662 473011 173424 -212321 29178 387596 403500 105502 414022
13644 414022 473317 206986 580708 234859 326823 423941 98015 611864 316057 397372
13634 397372 608638 528418 455311 563086 546476 346994 151464 537725 232361 163985
13624 163985 75576 356708 312305 385835 378419 113968 282548 332459 507369 165614 473987
13613 473987 341032 222245 547175 487680 422842 -70219 307339 169487 213544 403247
13603 403247 287278 627535 307624 656776 496422 367563 359303 240798 434652 261797
13593 261797 231771 334377 183422 297132 448813 486475 312138 336278 363088 457291
13583 457291 7865 177940 95487 441805 602280 527773 96318 303875 427270 220519
13573 220519 10060 363870 168378 182234 561454 293479 444569 443491 287543 237751
13563 237751 406340 487378 45852 177606 466595 426654 431344 170889 312310 67173 57879
13552 57879 283604 252391 -120047 95668 354362 99748 171703 260724 416744 128825 181243
13541 181243 42447 46753 476066 504350 106313 -65300 353812 86186 162455 371205 169014
13529 414992 224446 354944 76383 316790 223538 166321 159575 78230 385752 210611 260765
13518 260765 -23178 445132 147281 -36951 304223 298456 248480 212694 438490 120338 331930
13507 331930 163004 450927 220415 256586 167674 -195476 216937 198322 252794 292467
13497 292467 353232 329355 381044 -46422 279693 330709 -159841 170174 278236 -41269 234693
13485 109092 25259 436238 205734 242363 252491 365999 285851 460451 250746 324045
13475 324045 -6860 112849 127481 91948 399260 44399 -176439 222674 430951 248677
13465 248677 133886 12480 436465 1870 -1763 73767 77277 337352 301798 199082 385477
13454 385477 209871 123661 150301 88528 91530 318212 105854 6119 126833 241165 352900
13443 352900 200005 301154 216536 188464 261177 -19795 215690 243506 13893 143428 359490
13432 359490 187780 172357 131599 256964 237374 75306 295025 429500 400307 -20079 148621
13420 173302 268642 580526 276340 31417 125123 -154668 212028 377777 81571 -79684
13409 -58018 51482 127608 -84770 422678 404012 330395 138016 297908 481337 247962 61221
13397 118408 309283 -6198 121125 278875 103696 97008 79672 111333 252027 101947 296210
13386 296210 -150606 97434 103169 187597 -130023 -16973 68917 261705 115728 256565 -94652
13374 332242 188210 336339 182903 349513 218324 508826 123077 188791 306546 176908
13364 176908 172269 227559 267034 101753 203485 97789 107045 -38142 367779 91224 52684
13353 52684 -89817 -46095 188585 408767 222651 242374 40770 315829 299783 363439 506854
13342 506854 212008 460996 393127 627706 229413 51932 291219 73455 266895 234156
13332 234156 152695 300510 143560 -6064 368274 163096 -87715 160968 230422 296186 -45407
13320 55018 93580 415441 248840 285326 20863 302947 337537 210788 411750 -24639 142427
13308 282618 276994 490067 -15787 85555 15717 -29391 15753 403110 278011 34332 217359
13297 217359 112564 241304 163844 353085 383971 255200 358819 88454 105914 62566
13287 62566 -236309 -22423 -2728 -68711 247284 20126 11355 202463 434460 115485 218319
13276 218319 91204 559920 184705 169510 -54198 273826 112140 338055 -4287 227476
13265 -66858 -100073 -150854 340918 325203 433402 300953 -158952 13479 -101747 -69532 -294045
13254 -294045 -125435 73440 -6144 132046 23790 -60084 63377 -29755 162507 -103804 56841
13242 140010 -48642 182784 286277 223320 197080 28856 -6184 271406 52123 331036 332664
13231 332664 -144420 143110 83560 -10553 35900 81759 130650 -166143 60553 134002 450315
13220 450315 33102 -143582 72252 76617 310228 -38137 187866 -87333 162 -210234 7081
13208 98125 91928 90019 40239 328561 60354 103608 -118115 253167 298759 -183741 345740
13196 -75993 113009 -115542 154959 -24423 -47745 134597 124662 137411 203770 -79486 -73661
13185 -73661 -158813 177006 5941 214965 135183 320 348 -315871 -103187 262531 85520 -94575
13172 169351 -238608 122508 -153581 -101395 35 -41211 -154800 42615 166483 174432 445850
13161 445850 85308 368477 -3914 -6393 216798 207133 135814 214158 206645 195870 287070 45423
13148 245713 46192 288126 273709 1255 7273 -6368 138034 186675 148023 484777 14128
13136 235779 428271 23394 -8327 72694 -86758 3723 153489 297496 98971 260782 -248482
13124 235082 -108769 146245 94357 237839 -69112 158063 291808 -200740 -252900 62219
13113 192420 263196 104807 97327 -96091 284445 129492 114010 305709 334273 439 65821
13102 65821 34381 -59517 -243848 235587 26889 46962 24714 138871 195277 199512 176394
13091 176394 -199129 -238889 8446 222506 -268981 -73137 -30179 326436 386800 72359 -21989
13079 344157 137384 176859 310487 115178 130579 200282 229650 11821 172792 49641 -7466
13067 -25645 149076 311959 89451 136333 70875 235789 63055 521227 41994 -58624 365375
13055 -3148 18783 144691 -37321 188434 147606 218033 271701 -169685 122258 44732 77164
13044 77164 196017 -33007 355749 -39865 38529 97046 51514 232127 2619 208786 -351093
13032 285920 -66042 192063 -48646 44704 -89026 -44327 104062 147362 73765 -7825 -115241
13021 -115241 25552 106812 36336 145922 -63012 -218108 -145613 142058 175754 127621 -116512
13009 154492 401757 237146 188537 82443 -4843 111980 66878 102413 -430291 150695 246664
12998 246664 95130 63213 322941 -161887 -203152 195316 101111 -218773 181285 147700
12988 147700 -127779 9172 265859 318941 164641 -60316 1915 -139704 142241 -152366 -172708
12977 -172708 -228519 -109324 -66015 -73773 341019 47179 -26017 -9854 -106481 -162244 -82907
12966 -82907 267878 -77852 146020 -19026 254474 -55530 108638 273580 83158 316770
12956 316770 193143 113589 -156044 3492 104178 -227678 -183863 392658 128958 154900
12946 154900 334248 319158 -187052 -135888 -57030 116915 59511 114441 359646 74746 82154
12935 82154 -67681 205200 -141127 -58202 -61450 116482 -46929 40175 337058 294919 -100570
12923 -109329 378668 -248573 -192916 189017 253281 -310474 125909 74535 1682 -205999
12912 -75639 -350200 -44407 60315 82379 -76573 249184 281991 -142417 -105449 -51729 -327365
12901 -327365 148778 -238209 58286 -151049 -12879 -443254 -233738 102674 30332 -43281
12890 113213 -75729 14731 -214720 69577 116024 377432 -84388 -180529 -49228 169169 180349
12879 180349 244833 15402 -217412 -70441 63083 326132 -72131 312333 -18345 84564 181135
12868 181135 51402 93191 14840 101242 -160957 -108875 132113 -63095 -22820 79359 -5944
12856 177302 258142 87602 436995 -202872 -135285 -71299 -176473 -190920 181297 68845 141542
12845 141542 25698 62541 -26468 298198 659723 31734 -144142 -167874 -155835 -152843 -101797
12834 -101797 -56627 -138799 -118084 272732 -160686 -238823 322091 209703 -82934 -103407 255662
12822 48062 -24652 -139278 -107048 -339573 116310 126943 266998 85821 -190099 -56557 -126660
12811 -126660 41707 223328 248559 -318421 70933 -98460 -162281 142486 108324 -63218 -53263
12800 -53263 23095 4528 30334 115817 -256351 104286 -43792 -37702 152236 -271148 -134593
12788 241852 -170471 -353939 144456 -2770 -222586 -110171 127064 226820 47564 -110745
12777 -304266 -100015 58800 116365 -96989 -31201 103475 26476 6734 -98863 30499 -141882
12765 -76961 -59029 17998 151882 223016 -111034 50118 -84171 -221530 -27512 48381 -139117
12753 390697 106140 -103272 -42139 349822 15105 -310087 238406 -386150 -14276 182155
12742 56911 130725 99672 41142 -143163 -21264 279853 18312 152912 378115 504394 119677
12730 27366 -54506 128993 189125 289696 151991 -92368 -157836 -140377 81291 -41091 -97589
12719 -97589 -203694 -74568 272629 225509 63023 -106181 -199621 134202 -130181 207012
12708 -158862 142842 117614 239668 266093 45899 517324 512877 156706 73602 122853 125963
12697 125963 -25324 109405 233609 294512 -205298 -159503 12697 118780 -151325 -227672
12687 -227672 190150 102993 98578 -140709 -65781 63484 -46891 -272109 123685 263926 -102641
12675 216300 -25472 371736 270277 -61418 -109603 378433 391268 211021 785 -145730 -74405
12664 -74405 204014 41970 291838 121762 -13144 -159921 -103638 -121122 1412 191236 -166234
12652 118754 323041 87983 -52243 -53122 58735 81061 210752 -39766 14586 -139167 23157
12640 205836 26914 -90403 -208299 70228 185245 -117635 62880 -40691 167527 73096 153314
12629 153314 118724 12367 200042 100032 352808 299925 222149 236701 157735 281742 8554
12617 -47914 67650 -194779 408715 -161499 -154097 -47408 33889 147227 -39216 328805 -214831
12605 -345 52317 33499 -103856 252154 439643 -5629 342746 163131 -8279 -176216 -44759
12593 249627 35572 -52154 80851 286632 -24734 168959 -94429 320066 33482 -80075 -446465
12582 -446465 79939 227855 138081 232906 127133 -12699 -74591 317560 -141990 -179868 -200779
12571 -200779 -152651 135540 -213418 -27031 -38593 231204 -327481 89363 152874 26965 192080
12560 192080 -378003 -95400 158848 -87375 -68337 -60879 -121511 231012 -104287 134033 450371
12549 450371 107396 192458 -173382 45713 83156 158562 277394 111974 22046 -222938
12538 -25357 195089 -68867 18622 -134338 -60150 178840 127511 -231118 -202675 -25322 254516
12526 89013 11427 95290 125381 112985 -6563 -423199 176361 207797 -21626 108064 228586
12515 228586 -102849 397147 -91751 132059 257537 285537 -111264 -22313 -110442 82869
12504 93046 -184010 273063 -153981 -167214 -167481 -19610 -98762 -426099 293460 -194290 144097
12492 237686 -44167 -124103 125174 22943 252601 -40473 -132592 -77205 -133125 215066 148018
12481 148018 -92414 -103762 -87316 -67235 284806 69370 -161357 -6104 109028 125817 75821
12470 75821 -321661 100630 114226 -206101 -190057 160966 158476 85139 -219734 157751 -331602
12458 202324 -98648 3556 -360203 -351558 -20538 -334575 -77427 -67225 -31934 232708 -213588
12446 118443 137654 -68386 196754 -37471 173580 6877 -56015 -25740 441786 -270536 -65655
12434 -94645 -28671 218908 128996 -17321 -12722 65905 -173523 128053 -62539 11016 154969
12423 154969 108395 -321389 -250668 127869 15333 36104 -31184 -77537 -16225 -397915 84984
12411 -160019 13429 -156748 -302719 289814 -147739 -145274 -244023 -308714 -302493 367592 195077
12400 195077 148772 271569 -73803 -286971 -173314 -90417 -234332 -205367 -45506 -122319 57805
12388 -187177 10434 -91494 -220271 -13955 -260778 -234496 -3972 8894 12843 353850 29804
12376 -12057 22482 -300109 -20802 160298 34883 -57964 36012 -107007 -91134 3340 -145112
12364 28246 -112688 -54152 -124827 -210639 -26555 -90156 -62011 99876 155932 -120700 -46087
12352 -203762 -337152 157551 -97958 140500 -212956 71215 -283559 195303 228250 192893
12342 192893 289898 -4500 273411 98264 -90222 253712 226087 45966 16509 55775 23555
12330 282907 -190646 -48646 155341 286636 -227658 237893 -149635 179493 -106756 -24758
12319 -292299 67542 108627 188765 -232428 -51579 -60828 -209377 -24847 -38583 -144102 -164511
12308 -164511 -286824 -3165 -143123 -26417 -96516 -244190 14400 34097 -245868 105711 -362393
12296 79671 215409 8768 35902 435027 44849 -127839 135753 -45178 -134307 -22010 372480
12284 95303 172472 126672 72879 94917 266022 -32616 285409 365180 -33696 366095 36138
12272 288181 266693 246121 -121194 129260 -17014 133960 -29518 87494 334527 37212 91807
12261 91807 -15938 -53118 25327 387360 221357 391 -194629 125109 81793 437138 -260604
12249 31856 54315 175852 363972 40704 305658 214517 134576 216077 -94454 144650 262405
12238 262405 380227 144031 205941 4420 135759 42101 234050 -101076 151866 114102
12228 114102 22447 -28539 154397 195898 299082 352680 116312 328998 377856 111718
12217 439986 219220 122919 44937 293203 22614 -81318 7004 64766 -154418 -155629 260310
12205 -63788 70050 -53580 -16445 -242368 168815 508548 522304 238700 373139 146568
12194 71045 -81558 53696 130471 156477 191281 245153 69959 -70195 139080 -15214 -25225
12183 -25225 25082 9147 458918 418926 -359796 101124 197907 67487 125010 298030 253526
12172 253526 15126 248490 -41581 211367 306621 231941 -4068 38904 73911 75686 -69817
12160 -145748 -129074 146066 186815 135514 428140 124477 -73925 51189 -121700 -203 -184108
12149 -184108 -40025 209642 1546 -240421 -81773 28047 -3601 141507 25918 -89816 -172466
12138 -172466 117629 -103369 -80189 208265 -75170 -34679 -132322 -24367 105551 234698
12128 234698 268137 -28520 167540 -297303 172085 239870 128165 -199809 183486 20561
12117 502018 -57376 -181592 8272 -237071 -168908 -67787 -65404 135901 67271 -328704 103238
12105 24847 93574 305687 241112 57920 -151077 57134 26477 133293 44329 171870 53989
12093 -99885 37479 95425 -33657 -71232 93904 144395 2783 -139298 51388 -143412 -305539
12082 -305539 320277 9577 20785 6280 -56831 -362247 22649 -437608 257131 -231477 38840
12070 -98796 -53338 -223378 44720 -76480 510168 1054299 1856632 540828 291746 53196
12059 361289 -300213 242003 3018 -33627 76535 105984 73509 226159 2469 -205078 -77896
12047 -279968 -169161 -48240 -183735 -140527 -107609 155918 54033 54674 81041 73097 102016
12036 102016 76995 -24415 -230908 -136447 218883 51949 -54952 288780 -32906 243640 198737
12025 198737 28504 288291 7447 134511 -155058 -222769 -109675 -27550 -135049 -207050 154810
12013 3631 -153205 265133 76176 344275 44511 107282 -77732 -104895 -127324 -50450 133249
12001 -280841 19662 -451698 175225 93168 38418 130088 43064 -229195 93797 47412 385387
11990 385387 -275347 -160725 -79175 53883 -288917 -154288 167245 -200379 -199890 87149 36192
11978 -150505 -196845 -149024 -289578 -193848 172936 244174 8078 -191871 90738 -87022 45019
11966 -1528 -117440 -337978 210208 -88296 21337 144574 -108451 -210916 -62558 -293721
11956 -293721 -319885 -23103 -22714 18100 84793 15901 -47802 256589 -52908 -169979 -48509
11944 131874 -69332 -212719 -40508 -39128 88754 60313 133257 40084 -84045 16924 290156
11933 290156 -255188 257259 84703 -202246 41156 155797 -92675 190391 103787 50177
11922 -40630 -241115 -170836 31358 -287256 124510 -259756 24807 53763 135964 -104520 -151553
11911 -151553 140383 203042 -131710 13499 32222 -139357 218775 -28368 155297 -143095
11900 -140163 -360961 -110597 16122 8363 28146 -96607 -9357 299844 61264 -281400 -134860
11888 -24838 -52246 -150174 254641 -316719 -26180 -190633 204760 -73059 -26265 90776 -125780
11876 -131237 54458 -114702 -24993 -50594 -159861 -472063 -224861 71272 153398 31451 95362
11865 95362 -221877 -121482 -108491 -299448 -165770 -236492 120452 84658 -290821 339136
11854 -9395 -103080 -74355 67691 360910 -133056 -153395 -200709 -4143 -265133 6829 42685 99212
11842 99212 99119 -63703 60958 458210 74968 -20497 118507 -174983 -43357 36334 -14859 165499
11829 -17242 -250397 7619 298865 -10917 -60653 -398904 -97522 116567 13503 -297711 8546
11817 206114 -51914 -100604 -73473 -86861 6991 48470 -68985 261273 22545 -150885 -122662
11806 -122662 251887 22220 -136214 -68840 -37202 23885 -35718 53948 -151113 -42268 -286869
11795 -286869 -38230 -337290 -23 133919 -160491 -226495 224764 284479 217133 40313 30459
11784 30459 -30134 34715 -187292 -107410 -60533 -225690 -71306 -370152 -222601 270147 154128
11773 154128 200564 125145 110447 72428 -186607 -225538 -251840 -119996 104003 -100049 43462
11761 -17082 289093 -104870 -151325 72261 44402 -54664 -23034 102995 -11165 200423 90954
11749 474 65915 -95092 236252 -39243 219025 -153694 146959 95703 -123812 -273718 149405
11737 -280524 90466 13560 -288539 16103 69878 110009 -25407 263517 -235551 2715 65168
11726 65168 -107945 89827 -194366 -207322 236896 -26430 -147673 -46694 66818 403132 109681
11714 -202381 95289 201456 210807 295524 -138343 5735 -201581 -11660 169999 2098 -3994
11702 16468 147061 -117858 73452 -29389 77610 -193959 298467 136256 69434 313369
11692 313369 230112 328101 -168182 3506 -196348 34562 178888 408052 339154 28442 108075
11681 108075 15657 -13177 -215776 239677 152998 -114909 41497 -34319 214197 54908 -69415
11669 -32808 -199877 -78065 197173 -111623 -28198 -84314 -66836 -55727 -13633 -82050 290314
11657 135493 -204385 29337 7050 304295 19206 94635 231994 173017 103509 92059 25138
11645 186823 -96474 -56175 171170 150210 -34240 215246 -161334 144457 -101072 167562
11634 -147894 382025 -92263 -171928 69221 311982 -34256 236833 286702 146169 24504 -139239
11622 242756 274280 -19213 96427 -62388 -3365 7401 -203056 169993 402354 213860 68116
11610 324740 134784 -96981 -116866 40301 397956 -217424 -128110 28080 87917 -39515 -134545
11599 -134545 -76301 -166688 -185423 2981 173241 -96628 -117300 -147071 140051 89478 -172150
11587 -252117 394547 209376 -221263 -104249 11879 133489 340293 73438 46098 158072
11577 158072 23890 17219 -112937 -42358 140695 215091 89501 130333 352474 -440535 -78957
11565 132120 -19338 429426 647747 187772 157291 18909 14174 -88763 115471 43487 -126584
11553 -16931 -278171 245694 96065 59375 165666 -101038 12059 106050 -115266 481028
11542 420774 72124 -110034 158076 148272 -109590 -216677 58387 442303 -10900 221388
11531 31759 255759 547090 111419 116880 253214 -375226 -337505 164548 -117116 -190869
11521 -190869 234133 -154063 5125 144562 183844 204255 9778 161759 270702 -236768 108134
11509 39361 156129 284938 109868 177101 409021 -269450 325887 220131 355941 316785
11499 316785 -53592 70592 197221 -94859 -90741 110618 107803 73069 41745 283427 -186461
11487 242482 50651 226251 158438 519118 274268 330462 508387 -16058 -209624 345212
11476 219889 307487 212792 478067 165997 175684 132315 -237520 164403 178283 -241694 -135837
11465 -135837 127005 1266 425561 292863 -38600 -50417 248391 -262556 240908 437871
11455 437871 288534 485640 331016 348931 182486 -40049 89264 -51074 328100 -12246
11444 502710 -154597 -18106 189109 55258 -62829 -169565 -139820 -32111 405206 67850 -95679
11432 226605 -187010 179294 -48393 -99276 78677 162545 190645 -32360 -126862 -80599 -11689
11420 9074 139968 121909 147104 86015 217848 -195317 13965 -84037 413449 119008 31167
11408 18792 164081 -39164 153164 -104782 -117983 197299 -56502 -177871 205035 155916
11398 155916 131193 169492 -312010 66339 234746 17892 -52876 169959 198378 -140223 30579
11386 136711 -224789 128282 319653 343236 -173284 12491 123337 100605 -131222 206442
11375 140525 -249008 -295506 48462 73836 -41254 -38312 50832 -194980 -230840 351363 -58691
11363 28563 -132955 261709 -108360 -54251 67385 6382 -2010 -72576 -488110 -58383 253783
11351 109472 -148284 91210 217098 90495 -358120 -56712 -272904 -285951 -123006 -200000
11341 -200000 212839 -218384 -126782 -1055 160266 -54911 -194093 51241 -81968 120251 98286
11330 98286 -283137 -413060 -122581 -251685 84680 -1789 -72905 33114 42595 17568 99299
11319 99299 262821 -1850 28223 51571 -264822 71096 -84739 50011 -206125 35280 15137
11307 31571 177696 13351 -10037 -118122 86146 -185299 265543 103088 -396695 64593
11296 54657 -153145 151987 169787 -141412 -291045 12883 -116925 114644 -41365 -243175
11286 -243175 -275624 -145880 -60568 -120937 100521 -139752 -185640 162802 -43389 -309984
11276 -309984 2104 -214806 21437 6751 79865 172027 -79179 -240718 30152 -137286 191977
11264 -36725 -94586 37277 -167605 147461 -134155 -507392 -10391 78399 124591 -62640 -134682
11253 -134682 119743 291739 -55129 145735 -207938 35336 -230769 -496261 -768 -387733
11243 -387733 149333 -82863 -76271 18123 99437 -7800 232716 -5837 -32041 171105 -63784
11231 11290 -157620 279880 31730 -163331 -233045 -185597 180411 -445041 -239443 31421
11220 -16098 37676 20905 59626 143314 -3466 197778 -170292 -17946 -56861 -54502 132983
11208 -227549 54244 -21829 -71672 -204033 -13842 -24820 -254468 -71137 11092 -14558 85179
11196 -66748 751 6715 -65826 -102967 -67915 12990 192383 463043 267367 -288096 -85296
11184 -160722 -40680 96385 -55559 3898 -100463 -96337 350207 61420 -61826 -203518 119923
11172 68104 13869 -51175 -60393 -48824 234695 -532092 243102 -164792 -33733 -148431 -113457
11161 -113457 233357 22704 -21885 -386554 -41223 -174364 -150592 -171549 29451 136185 29300
11149 -294034 221845 -213339 73182 -5374 148353 -130774 85157 150742 -36385 25047 55602
11138 55602 89111 102658 -15062 205358 47814 204657 -315861 -45558 113131 -45467 94409
11126 142111 324746 12074 -152763 -46224 -49096 79085 -47331 187301 -84963 306687 96322
11114 52836 132102 137406 24885 6409 -54967 445102 124631 -117509 116005 481948 365871
11103 365871 250797 291554 10856 203612 278073 519514 141366 -30828 132783 430378
11093 430378 -51161 178059 -72329 172877 -11878 227731 135214 452211 307408 106272
11082 117157 265466 278547 183087 175839 553446 172098 245982 177243 480068 -177168 345032
11070 367917 328171 224359 319903 443114 220561 600780 507183 367541 726267 519529
11060 519529 725087 441361 615097 601397 585036 722260 847405 658460 753808 847338
11050 847338 725701 695744 736079 688765 525457 695035 694043 1012860 1051998 516300 700615
11039 700615 722892 788618 887728 1043891 828081 1050766 878074 859416 681367 833969
11029 833969 826442 966671 953054 631789 647116 748806 575739 720725 716772 718395 657759
11018 657759 469791 654970 617338 733737 715431 480567 557495 728092 990384 929127
11008 929127 763269 782636 796227 499977 766372 589506 772791 536285 644158 828493
10998 828493 707430 762547 657899 845025 627178 548047 925023 953693 884930 951600
10988 951600 832896 1065188 875261 1106780 1051928 1143180 1150929 1223724 1517269 1687742
10978 1687742 1895212 1778331 2060780 2499985 2523440 2925152 3277909 3457245 3293851 3111924
10968 3111924 3026138 2889196 2332025 2000086 1758479 1880817 2042160 1795481 1919898 1894924
10958 1894924 1999948 1644764 1894952 1756756 1771693 1427537 1239248 1095609 875512 642402
10948 642402 656399 577589 587003 204882 103629 310757 189598 514933 222599 142812
10938 142812 122722 282025 27606 100037 -45920 128179 -93450 90884 133519 238229 -143561
10926 56331 -442855 -153625 12405 -63317 46121 186742 -311040 33943 -142076 -136164 -46438
10914 -223250 -281795 60865 34240 342065 -186450 7188 -16684 24775 -58175 -148280 -147086
10903 -147086 -108594 399488 2002 -256336 -350085 150196 62994 347085 67295 -149728 253511
10891 180423 -4350 171376 214189 66843 17034 -23853 -330920 -184444 -106242 -420931 -103366
10879 -82367 -125686 -118955 -189807 91582 56513 99204 21114 -169584 -6462 -271251 -65151 187373
10866 58729 -286060 66145 -238180 118608 55971 -88736 311986 -79192 205314 -48834 -93918
10855 -93918 -301372 272504 122912 -44730 80727 217908 57591 -459686 196753 -99728
10844 33806 29765 -93761 -21387 -78009 93264 -233149 -272580 6130 -49523 295417 360882 178088
10831 99766 108528 -187641 100368 -11643 74136 32966 -354471 10594 -16748 -78199 392829
10819 -154789 47990 197598 309553 222250 243206 -162003 -224528 -103727 200346 -272796
10808 -34871 13883 -318500 9733 -131687 -42448 -282694 28605 -154659 72267 -38382 -50376
10797 -50376 -9290 -127163 -156993 -532264 216599 164603 192748 294864 39206 112499 -80947
10785 -14014 -142596 34448 148719 -153554 -157082 -105085 -166485 -193332 22442 -48361 -365775
10774 -365775 -250796 287912 -197784 253518 31056 -59928 -192005 165891 189729 -78433
10763 -467725 -180785 -21741 323246 60479 -175544 135415 -284278 -98115 119084 61657
10753 61657 85879 27640 -278075 22348 150546 -251029 85762 96210 44279 -91045 -130614
10742 -130614 -40337 -48024 -96842 -19637 -249927 22063 -386042 -341520 -253910 -17487 408139
10730 -69275 6498 89342 145420 223782 62812 -145127 -226073 -283500 -43453 62198 163034
10719 163034 -108450 -169880 -144355 -165668 -146641 185163 -345082 -430855 281739 -123908
10708 198530 -257695 -61316 24855 105166 -48265 -325544 -164451 -99676 -119165 -125581 171038
10696 65390 112775 -203298 -153807 116839 -280294 89913 -334184 125119 291764 -10487
10685 -125751 -197639 -118895 -215271 -128658 99307 11183 23318 -32523 -270413 -29499 -109533
10674 -109533 -112423 -65354 -226008 -105147 -198889 121051 -32242 46194 -32552 -183556 -224799
10663 -224799 -306275 32523 -307537 35123 -67770 172028 -363302 -599469 -290916 -234653
10653 -234653 -100053 -120892 70239 119360 -345816 89730 8163 16159 -112815 -3202 25635
10641 42589 -426188 -89182 254839 173736 95760 79488 10146 -90693 249659 199903 -203158
10629 -23983 20429 317103 76441 -229054 -236693 -241213 -42498 12616 119652 -135010 43234
10617 -71090 -154697 473434 96723 -237953 -161952 -141767 65261 -256111 150824 -26343 -51301
10606 -51301 -279856 -155874 4342 155784 46594 125307 -50205 -164785 3432 -18495 -93848
10595 -93848 -53150 71992 -209506 72036 -314580 -89932 349137 20852 -17720 -139233 -324215
10584 -324215 -123903 -99052 -173710 -172865 -26754 92203 -95593 -2937 -55513 -308824 40425 -14988
10571 -92953 -153059 28493 -33213 3585 -63113 -140155 -181459 183029 -4049 -94283 157413 153820
10559 153820 161350 -419103 -315296 -75573 -66485 -6479 510749 12754 52596 356430 -38029
10547 -12630 173248 -248642 -147545 -37201 118722 -70858 91194 -139376 135813 208794
10537 208794 -72204 152910 -368621 -210066 -51349 352545 -184100 62941 -367521 63778
10526 -65329 270776 75804 -102080 112489 -198370 -124644 120988 -144749 14284 228872
10516 228872 46463 -141849 63896 -10256 55026 -140377 -38192 -296621 87753 86961 -114458
10504 -272087 250600 58330 187214 -60658 156954 -7526 72834 82698 111622 59649 -61768
10492 -319597 -339225 -7964 43565 -25369 324543 101788 -247414 -41850 189787 -42354 314926
10480 440486 402489 449580 385339 114097 65796 453559 98520 408935 -100525 -116512 -132093
10469 -132093 94748 -74405 215585 -118511 -119338 -220636 -16379 -9041 236057 -72551 30032
10457 51723 129190 -197413 -74912 56110 264748 31493 -245218 -101885 -244278 32509 -144285
10445 -55483 171098 269 -149933 63903 -96681 243439 -66912 -69623 -2335 -80914 162568 170319
10433 170319 232256 -17505 108981 -381217 -24004 -185053 -7701 -168569 179830 40257 -191381
10421 -188185 -6442 -138335 -77399 -166118 26321 -211487 86764 -98686 -447281 42895 20882
10409 -87633 -248092 289522 244664 280217 -50196 -120203 102400 -72527 79552 -38499 24182
10397 -132826 -13864 -80361 -41181 115621 323320 113857 73796 53487 228247 224807 195670
10386 195670 125361 130864 -11349 506692 185596 267005 159655 27296 160909 196279 165275
10375 165275 144530 57998 423861 163310 31937 322760 127460 423009 631761 477656
10365 477656 630754 240394 455109 499721 287148 255313 108549 142505 46253 410366
10355 410366 106633 159014 133130 255114 527810 282888 677967 520597 -33174 457418
10344 426441 311425 467688 471236 447589 2881 -13062 232912 228861 39616 172150 373421
10333 373421 267547 142296 185210 -318474 -240105 -71950 118905 28034 -93246 186475
10322 62907 329778 105342 209524 202668 -96239 188058 97140 177618 7282 328990 -36035
10310 -201912 183694 -51080 252867 -59162 174319 40188 -210385 -46657 -29973 -71515 -197488
10299 -197488 55803 301767 40387 18956 343074 -34577 -18960 332396 -113764 329355
10288 -60456 172709 106090 -89438 9989 -76018 78495 -59644 222269 82491 149746 -61543
10276 23223 -231925 -182202 -243669 -22245 -160538 132232 -120260 281139 418806 -127567
10265 92212 325000 23151 82872 92518 291070 557178 165103 343500 495599 366489
10255 366489 10870 8901 -136503 92846 -31358 72059 15767 67098 82076 -44840 -5976 42836
10242 -121894 -175722 -235800 77173 -163105 -77108 -76898 131186 -71937 2515 -181245 -75350
10230 21623 -241703 7889 150776 230960 91350 -47326 35848 42873 -131475 -224860 283163
10218 137860 -67932 -16770 45914 37430 118895 -164965 49059 -111108 -241809 -80863 -404821
10207 -404821 -139015 64625 -355310 -176246 20703 -49383 126657 190323 -16922 -275919
10197 -275919 -46180 49718 70807 -292819 -181189 -29711 346687 -133426 -26713 -138254
10187 -138254 -77971 226494 -76129 6206 -167631 28076 1502 58353 40532 -190625 -183920
10176 -183920 -246795 136467 -119424 126623 68853 -194612 -49596 67203 -144584 -238828
10166 -238828 45764 13501 302975 -190864 -56436 -206128 222715 -49614 -227691 -83100
10155 43965 -48330 -292374 -36674 -31083 -45773 -197914 -129167 -45698 127417 38699 -224242
10143 90544 -492513 34576 38497 -96656 -87603 -238409 111870 -176912 57278 -134173 -107767
10132 -107767 -64317 -386764 -300164 -151184 -335743 8518 -47343 -397427 87423 -61147 -375746
10121 -375746 -187755 -33725 -246191 -399172 79615 -133245 21397 44000 -57206 -105604 17899
10109 -295160 50623 44864 -340119 -258027 -158250 -190500 -136483 -334106 -80248 -372544 263374
10097 -221436 -156141 -156907 40351 -349681 -53694 101035 -41900 145224 -45812 25876 57927
10086 57927 -74887 72734 -50733 -116282 -131666 -83595 -397926 -126889 -434517 -75923 198327
10074 -93876 -56059 -13622 143806 108098 142395 -231704 139612 -187785 91635 -68010 168921
10062 -63974 -322904 -313218 20968 -84079 -1895 66431 -167282 9418 -78639 -44921 -197633 -280315
10050 -280315 -148185 -39365 -279301 -36537 168179 -36689 -261986 -102626 -14894 248916
10039 124754 -135138 -248061 -108706 71615 -153011 -167513 -222317 -391535 122588 278986
10029 278986 18003 103803 100323 57172 -40945 -451032 63936 -77384 -205621 -192362 -31564
10017 237782 -268045 -345234 108656 61850 78236 -68099 221822 85625 231457 -47846 -72192
10006 -72192 -84189 168491 105856 -102619 111588 -125185 114098 39126 -150218 250275
9995 -21157 -407323 251709 -157408 190192 13465 62695 -128973 -458064 -207343 52123
9984 38521 8759 -129256 -24523 245367 -364187 -132470 -346963 -101691 -38333 -54 80548
9972 398744 154625 15522 -167531 23974 367472 -144252 6981 -160595 -270911 227134
9961 269777 -159552 -153067 108509 -40549 5542 159946 86848 -85250 -82454 -53285 -95894 -57614
9949 -57614 -202238 104711 -153674 -156717 -60836 -192664 -227320 -55570 -31472 -100020 -31861
9937 -63414 -10412 -175530 -77932 149813 -117669 -397080 -208272 -174483 -305845 -99139 -158302
9926 -158302 -206423 164731 -33667 -93686 227386 -193673 4534 62612 80884 -185116 32846
9914 173497 263697 -90991 74027 162272 145250 -254341 264073 -93071 -149915 -119072 -346277
9903 -346277 141027 -17320 66071 48257 180145 -154904 103158 -57926 14698 -173169 -134512
9892 -134512 6359 72512 -97741 -53593 -35960 -163260 204586 -57301 207812 -123873 259706
9880 -192294 -66123 -260871 -251083 -113880 -471258 19273 -9978 -175590 257997 -260352 -148573
9869 -148573 -296874 14072 72217 -172675 36089 -268734 -114467 -150952 -289318 -147290
9859 -147290 22563 183505 -163007 81234 -227487 -187742 150501 228298 226513 -68606 -221643
9848 -221643 396328 -181311 22118 -364658 -26365 -3229 -167985 -63191 -23518 -50455 125345
9836 -336761 -197324 -127994 121805 -155499 -117295 116414 -169152 162466 -84010 -194228
9826 -194228 -121189 -24712 -340892 173948 -218518 62546 -28965 311619 -86260 -99849 -120853
9815 -120853 -46511 -19654 119059 47210 -441824 29570 -127660 -15818 88245 66407 -45930
9803 -153544 56995 96514 -75160 -321101 -279226 26855 -13181 -351439 -79158 -49766 -40295
9792 -40295 -32149 -174698 -491268 -172192 -31169 118772 -197249 -116534 -152555 80836 11471
9780 -12779 81244 -468307 -223211 -387235 -149789 47389 -29058 -74344 -108337 69936 -70388
9768 46394 -83918 -211091 -128163 -24408 22781 21736 -91269 -363410 -68156 -217397 -76423
9756 -62553 -256201 -229676 -117930 380358 -20021 188537 -102500 -103303 63289 -120619 -302257
9745 -302257 -235820 51283 -10889 -154955 -50300 -202392 -4993 -212155 197415 -21581 -10562
9733 -317075 62615 2991 -68792 -131911 -272904 -123802 -115474 -359311 -69840 116671 63042
9722 63042 30715 71776 -31422 -78081 -81339 -48844 -30240 -148227 21619 -332767 83011 54932
9710 54932 145213 -60217 -210995 -96073 230146 107710 -159865 -206398 125259 30781 -99236
9698 -230445 -187814 -280517 -29645 71801 -123570 243320 -416537 245274 -171092 -297261
9688 -297261 -164592 -46345 -288315 -147543 -149143 -220973 330559 -353737 -59176 -4038 194562
9676 -367658 -326789 -671 75405 14430 -233739 -244991 33065 -214568 32923 -39802 81465 -26750
9663 -179493 -145648 214549 -466848 64081 207740 -51830 364807 -477314 62700 -215952
9652 -74677 -97662 14919 71723 32917 63613 32385 -85223 16740 -384113 130366 -160078
9640 -77923 122980 -72246 133188 -79538 -204646 -190666 -395146 73983 122407 -313291 -116557
9628 182256 -396088 85021 83179 98955 317343 229254 -47471 -305104 64562 -416424 -281098
9617 -281098 77284 -11729 -198509 205592 -187724 -91994 2648 -103782 -219066 177431 -258131
9605 -107561 155702 -107343 -253775 -150652 -45895 209162 -204498 -186275 209610 -35321
9594 62258 -302506 56764 -151744 -195842 -94689 -95730 162220 119844 -49639 -125102 -38328
9582 -65264 -297984 -121451 -123125 109136 57306 -110576 -116696 41642 -446503 -124536 -127242
9571 -127242 102237 -234129 50546 32031 311203 31075 -149479 -12452 -138834 30423 -517430
9559 -177873 -266147 122509 -173491 -102781 -11203 -177869 44420 -286997 163980 -168881
9548 -168659 -145938 116132 -90785 82336 -389117 -303422 -348124 137118 -246317 -16874 3457
9536 -109879 -13956 155277 -75091 -131155 -45495 -39522 -495966 -293108 92025 51336 31734
9525 31734 -317630 -29619 -105237 -75370 -135941 178372 50776 33352 91536 -393073 254279
9513 2691 223731 165105 14148 -141610 104255 -9119 89138 -123780 -207824 109561 -199431
9501 279542 -3798 78858 -147839 -11503 66844 -335717 -129061 -25941 -490044 -75241 472169
9489 -290560 -268428 24349 -56412 -220264 118980 -138079 -21020 125614 -141955 -178766 -215451
9478 -215451 142525 -338450 -122285 -205800 -17940 -156658 -68252 -185341 -333574 -21766
9467 -260673 -75315 165275 -39126 391231 -419498 -337414 -259119 91530 132147 315743 18095
9455 39516 49252 -327078 -193900 62253 -42692 -77890 128350 -169235 -12711 -233133 240202
9443 -81184 -220025 -178301 -72548 36034 -74822 -295434 10082 -16297 -248095 -324486 -30094
9431 51012 -130328 43391 188791 -121692 87218 -220584 -134763 314802 244061 170444 42522
9419 48150 -47300 50622 -421746 -222334 199856 -119041 -64995 89122 184731 247523 140145
9408 140145 18620 -295190 -389312 82065 -99359 22669 -139792 1295 158655 -89019 -446032
9397 -446032 -4975 -169515 32061 -274533 268732 -339268 -12131 -50658 -146158 106008 -151698
9385 -473998 -14837 19951 76357 -54961 16787 196603 56301 -68545 -245613 -44221 40045
9373 -341693 146898 -80105 16348 -128246 454071 212408 -283059 -233780 268722 146330
9363 146330 33768 -237529 -179277 30376 -161293 -80198 35353 -198097 -94357 -192341 -1621
9351 -3826 -47096 73922 -304702 16932 38074 -120085 67137 150179 -25258 -81748 -237763
9340 -237763 184407 65473 -1252 100174 95124 -78390 -323532 -275059 6343 -38925 27746 -110269
9327 13167 -136929 157892 -209247 -49136 -256966 161404 71572 78003 -32387 13572 -213122
9315 -326979 -298618 -99590 -26525 3407 -282901 -122653 70500 -151033 95327 15347 -342166
9303 -48761 2597 -150851 -235390 -296708 124550 44454 -20287 418981 22820 1033 -413743
9291 -155484 45658 -30443 28281 -254113 -352597 16573 -62812 18177 46111 141530 -45339
9279 -160495 -487338 -206957 -26619 190808 -190022 -33579 -116926 -361725 -112891 -164101
9269 -164101 -14044 -234283 -75226 -11595 -77861 222248 -479 -165982 9040 -43482 -36154 -152929
9257 -152929 161298 -213317 -25079 126740 -61317 -28393 72422 -338861 -385557 -71420 -115986
9246 -115986 253064 -83968 -236488 -32536 -241197 12156 -129778 -47213 -51194 -577179 136670
9234 -211251 -55423 -57389 -74877 -254992 -220744 91031 -42253 -79824 369580 -131827 -199335
9223 -199335 -105141 117316 -49683 -1700 123390 -24763 148786 -34949 -205406 162680 -114549
9211 -20382 -128471 -196168 -367303 -266365 5451 -6240 -234037 -142493 172032 -128602 61761
9199 -200128 -85942 -52613 111625 -91976 92596 -71463 -163749 -216986 5352 -156213 22269
9187 -338032 -154034 160295 300823 -313945 62457 -49806 119264 16603 -102399 -105140 69930
9175 -73653 -148771 -157297 36171 -37790 100396 156837 40160 172968 -88967 128354 10867
9163 -25259 -485814 128838 47597 41304 -33537 182170 93482 -108688 110963 -18095 89676
9151 -78883 -218788 -99780 -240144 -308161 277256 178599 -64123 400162 12037 179879 -96890
9139 -19155 49731 -419086 -48429 -57580 -147734 -120404 68433 -381657 -261447 -38904 41127
9127 -49437 -101573 67405 182626 -128443 -178777 -198795 -85815 -251973 -102517 -125077 -54154
9115 -188191 277583 -4232 -62564 -81965 -72613 -84803 97408 -218744 -275670 305235 108149
9103 -178627 63158 -334951 -19644 -243166 -109834 -266833 91328 -137442 221804 94071
9092 109401 -275623 53237 -131187 -24693 -363880 -266125 -240369 -110730 108536 235066
9082 235066 30234 -91895 94746 -99641 -295342 128744 59777 129913 306870 31870 -86384
9070 260229 29007 -111562 33229 -8319 -100610 -133398 128328 38093 93638 9845 155221
9059 155221 -109130 -338610 48002 382 -3045 -65100 62285 -282339 -4803 -15629 -186716 35358
9046 -20039 140737 5274 -28983 -105353 -79968 -141006 -94631 11049 229690 547378 24100
9034 -11524 204363 249286 -28214 -70735 -183398 -8885 -545547 26174 153009 163241 -86013
9022 40105 -43062 -70176 233816 65176 -457028 -317254 -167821 -58014 -5779 125553 -234990
9010 20241 9307 -238587 -105168 -4490 142816 223160 39515 70905 -287172 18805 4242 -145367
8997 41556 -342907 49499 -132744 -302273 -162002 -230100 257146 72756 -119792 -49755 -206626
8986 -206626 201366 -77491 -123387 39350 150778 138451 -110323 50805 -57681 59506 -175719
8974 -136465 106924 -59602 -255157 -421957 -1376 -223374 -217395 -299873 51766 27118 -287175
8962 -326842 -73506 -120458 183316 -32467 -138904 -98173 -163830 -29835 6450 -50760 57104
8950 78473 114972 -279083 118443 -2103 28914 107995 -484270 127845 -389829 270323 -305196
8938 -222188 -238777 -175565 -32321 480452 43159 157472 -180423 16155 -312124 219847 32844
8926 111700 33470 647042 810799 2982375 12138085 7623995 1706785 661849 320495
8916 376035 112957 50612 124185 -246497 -68664 226519 282415 114219 185765 -132927 85608
8904 -105020 -75471 -16571 -55922 -194401 -84366 269589 -122717 -85949 -104162 -149915 -268588
8893 -268588 74242 -272850 110785 -219172 -278382 -23746 -197432 49946 418580 -84462 269311
8881 -354240 -110342 73303 -345966 -161222 -148875 -254896 -114439 -36892 25725 189772
8871 189772 55476 18405 270876 -36302 10775 -11478 152139 195074 85894 13404 215867
8860 215867 -79468 -258462 -25645 -56329 -21768 -83760 108100 122945 116741 -302444 195651
8848 -50739 -326856 -576485 -169301 -134730 -134671 -202223 253830 -374252 -20383 -143269 -120875
8837 -120875 -134111 -350798 220452 -9418 -57951 65283 -111603 -311483 -23590 -227138 -99728
8825 -304172 81741 36291 -128387 -113413 -102417 -432776 -74085 -192443 55616 -55017 -399950
8814 -399950 53326 -230331 -362315 -50753 -76360 4373 -187823 92650 -3746 -205861 -135782
8803 -135782 -157644 -118218 -83596 -135746 -57722 222475 109386 140735 83502 -81104 -205328
8792 -205328 48579 -211523 123481 153105 20725 -5463 -80135 -147450 303912 104899 49443
8780 -111967 10150 566 -95930 122911 -194237 -147729 67680 156706 -158304 111920 132175
8769 132175 41099 -214484 202389 -22293 -241416 -282263 -133794 -246494 -538838 -2943 -18787
8758 -18787 92963 179722 115218 -69450 -136478 196925 -266425 -86707 184924 152135 118074
8747 118074 -106469 125431 -5817 -67691 -92293 194747 -106724 -209711 -67594 48417 -227057
8735 46125 -7385 -232671 307768 -85700 -149137 19495 72625 128742 407995 -165853 146355
8723 -102463 -83416 -228909 -97756 16799 201298 49582 208800 22409 -210536 127046 317894
8712 317894 27996 -191990 182296 60119 37384 -19248 -271463 58064 -173073 -182635 1700
8700 21786 -227320 14836 -275749 -195372 113279 -179360 -183963 -226088 -249473 -390390 -90807
8688 235254 117721 -105958 1378 -188066 -8413 240462 -248828 205813 39733 68727 141803
8677 141803 1962 -49346 -173203 -203818 59650 -5689 -124421 -37833 84886 198455 -979 -102547
8665 -102547 50007 11399 -279825 -84950 101531 -217711 75099 -26764 42988 -125545 -72616
8654 -72616 267609 -89266 -215463 -174919 -70059 9305 460088 -38086 -139397 -153400 312246
8642 -330726 71527 -164694 -359436 112935 -57601 -214351 -59983 -204255 -266669 -483601
8632 -483601 -19510 183551 72708 -204902 214895 -209327 137707 -52161 -49259 -442328 -91630
8620 -274271 17062 -75552 260865 -177020 32222 -26955 -56039 174650 -168970 96199 20916
8608 -301347 -224915 87616 24718 33270 -108707 -130360 -348873 262972 12795 -135220 10007
8596 -116407 -104475 53023 68766 16425 -144396 -123115 31911 102313 -107072 71506 460634
8585 460634 -21256 184984 -263711 -172028 -75600 -180383 -106428 -92348 144086 111109 -111813
8573 87028 85771 -40399 -112444 -50242 -243054 94480 -15924 -232590 72406 240660 66617
8561 -4957 150513 159203 -182617 -145912 80009 173029 -239288 170185 -62654 -306321 18380
8549 85997 -36871 -29475 -415151 -163345 100454 -108665 -111080 -36183 -325096 -57389 -97725
8538 -97725 -29205 63593 93340 -221683 41697 42581 -116571 -225677 -212466 -57490 -89038 -18268
8525 80107 -86160 35851 -235326 -308976 -231295 42528 41039 -284066 24177 -100782 -111362
8514 -111362 -359638 -157619 -161467 -91849 -226530 201325 65543 12998 -120992 195130 -230054
8502 -382273 -329728 56196 119753 10080 -103232 -14140 15733 204120 -29047 308412 -107307
8490 -423901 78231 -177424 -49731 6821 40556 -52906 -12966 24778 209211 39562 224789
8479 224789 -167837 61485 37089 -250653 -33315 -127271 -347573 -305844 -159199 161973 -370957
8467 -36215 -89096 74967 173806 96389 -275227 -17179 148064 -210322 -193268 -337181 51037
8455 -127642 24649 -83317 60014 -129684 -64435 -190987 -211506 -251459 127403 6276 -302743
8443 11063 131792 -106175 -142997 -6154 -34625 213600 213950 5344 -297604 46923 -94748 76368
8430 -174259 -158819 16357 767 -64228 -224716 -189532 -59032 261084 -54526 -11489 249223
8418 -49011 134151 -251450 -98909 149027 -157020 153197 -255193 -137642 299728 -218978
8407 -230178 -151279 220317 -163611 -92941 -86272 65049 -171968 293997 -121063 -184189 284455
8395 17664 103949 -71743 8232 -35435 -191399 35152 -100382 -247096 20184 70559 -186357
8383 -9103 205622 -111090 1765 -72986 -133305 -34580 220589 67717 -146444 -329628 41908
8371 9054 48822 155992 -38154 -163552 -101985 156956 -108345 71611 35444 -100953 -40530
8359 162377 -216242 125971 47503 -50108 -56822 -69988 -123474 10153 -271709 -17110 -275861
8348 -275861 23929 -14101 23948 59471 599659 80784 34232 258085 24282 142046 -57238
8336 -287798 -34832 36944 -63508 87532 133412 180323 -15120 274167 -90690 -18612 380278
8324 -118632 108924 -222082 -160017 -81548 159381 -86390 85314 -80213 -245854 100857 -78056
8312 252634 -453758 -309700 109687 53432 -136440 -310296 191769 -23000 41525 163518
8302 163518 56204 -131884 -243260 -300814 -280366 233592 35418 -11672 72862 9398 -196592
8290 -240141 67026 31744 -367704 -69748 -192306 367928 58082 -157794 67655 -154268 -115861
8279 -115861 -16485 -428341 24337 323756 -106166 -210655 -72254 -15912 11296 57536 -24221
8267 -161881 47845 37735 -156025 154581 -119865 14042 11772 -248804 -2835 -169615 30670
8255 -156046 137833 -319793 11771 172549 -65132 98285 -66409 -226593 92084 15562 -155705
8243 -110532 -87169 -211488 -201381 -92334 -193105 -93389 -46155 -65043 -73636 115179 -27244
8231 36345 -283986 -334965 -241436 -83304 316138 -150164 77930 -243822 -107602 -296952 115187
8219 2046 -9320 237558 115815 -6393 -136995 -127141 147830 70962 -92408 192548 136816 -250734
8206 -69635 -99405 -107764 11092 -80400 -92126 -127110 187977 -164382 -25348 195106 -25125
8194 20501 -85541 -317813 183271 -95640 -63583 -70066 -81444 46205 -145495 78894 -14853
8182 -145711 74540 -14862 -360961 -121826 -147953 -7979 -111942 7776 -332058 -58687 61542
8170 -320897 348127 -214860 117652 -110605 116023 -150733 -208634 -49322 -224707 -2057
8159 -241549 -34006 -438033 71367 -4800 47430 12704 78406 61330 -138993 -97363 327936
8147 -53147 -136139 8830 -230980 -25392 -177545 86819 103246 -105265 102522 85926 -209441
8135 -139519 -122580 -21919 -248148 -91894 -117968 -21474 96380 75683 -58134 -316801 279738
8123 152950 -34886 -132829 -228328 -209403 -48144 46498 153821 2761 -97979 51249 -234062
8111 -145900 348757 70288 -16454 -138785 -174284 -263456 -327146 81543 -195436 -194019 179765
8099 174722 -53579 89201 179017 -70956 166115 8904 30187 -71218 -120965 -94391 -139813 42115
8086 -162233 -321285 -183305 -125778 23423 41426 54722 -221440 -99760 -92656 91908 -196562
8074 33925 113284 313524 -118328 -87408 -355161 110095 126926 -49717 -207431 64062 108281
8063 108281 -224341 107176 -134653 19921 19159 59925 -261776 -146590 15046 -87698 171313
8051 -149511 11196 -214971 -192536 -138490 142146 -1464 20959 -208906 -387799 -120750 181583
8039 3546 -288610 -116062 -225418 50577 67752 97020 -55372 -319819 -82757 40782 192244
8028 192244 -219620 -208373 -155632 63404 -47877 -122034 51448 203 -108327 -221584 53510
8016 146673 -97763 122326 -40694 -91073 60128 -418077 172487 -247032 58686 -168022 -122763
8005 -122763 -100969 -78543 54473 30518 -6211 -137825 -135665 -257826 180451 -243833 -35320
7993 80102 -223998 -163062 -12843 174458 267196 -102654 -6067 -22633 -13074 -288890 -346059
7982 -346059 -236405 -184476 -262889 -66395 -324949 -315826 -1073 -253531 62380 -249190 10797
7970 -32016 215826 -393584 -358566 195388 205593 -46142 91054 96426 -104342 195437 98052
7959 98052 56344 -75378 30259 -68982 83116 -173003 -99098 -107161 -37786 135192 45173 -25791
7946 -32033 5692 93470 221153 -32615 27016 -8332 -91023 75108 242565 -189050 -146562 78056
7933 76819 2534 -244413 133531 -98958 131313 -165207 -122769 -82872 -166846 -197501 -179523
7922 -179523 141456 -212474 -44994 -201405 -94381 291956 319401 -85770 -78838 -259885 -124776
7910 -105742 -322210 330399 93257 -168070 -230762 -146265 -144507 -127816 -493477 -128911 -68283
7899 -68283 178764 53083 201847 199445 -218062 58826 -256159 -79731 16216 32898 135938
7888 135938 175401 15552 -156894 222868 -68241 108413 -29869 -159327 -356586 -156627
7877 -38782 272221 -218608 20730 -137537 38038 66587 -86413 -113333 26220 175216 49539
7865 -99687 -215369 -36553 60000 -36608 -44946 43269 -288770 -83615 210327 84728 -118492
7853 130446 -297808 -119082 -382763 86394 -25587 246685 33005 14490 159524 70000 36063
7842 36063 -157035 168248 -52384 -302957 183516 -172255 -79948 -139951 196409 142346 177325
7831 177325 8181 -131078 -255260 -223538 -98430 21308 223843 10340 47918 -168727 -283562
7820 -283562 157136 43708 4202 -254912 -362434 -132395 -129493 511565 -301274 3705 -184754
7808 188741 97053 100293 -210864 -191679 146375 -69148 72594 -139307 227339 117310 -4194
7796 15331 -82301 -281054 -32509 -39749 -271046 53999 -135367 -318731 162886 19878 -165326
7784 -97805 7895 -7936 159244 2567 -152672 281964 54590 -105325 -43337 -407277 217229
7772 -47166 -94321 -11171 -228085 188287 -148057 -186474 -15648 30924 -261297 114199 156345
7761 156345 -295276 -33488 -112318 -461253 -120375 -184508 -169221 16958 -99371 250664 182183
7750 182183 -150105 -85816 -253203 -73900 -73072 121580 78376 43940 -214371 -127644 23560
7738 -5107 -239773 -200029 -87670 -53088 125053 -2759 48692 -376579 268807 18901 -15027
7726 136621 152806 -33945 -155755 -52724 99940 -338379 269085 -84797 92379 155924 -173654
7714 89629 -120382 -58434 293303 130763 21381 13917 -80225 -65340 407190 -74490 -241703
7703 -241703 19758 -95995 -375988 -118815 77271 177233 -270576 10248 -92897 94417 58325
7692 58325 -184917 21096 -73999 101374 -180671 83196 55026 -20568 -200447 345613 79638
7680 144028 229256 6084 18340 62932 -21552 196338 -93806 -163956 -204311 201885 -45055
7668 -143540 6875 177682 22897 -50871 -5274 -67287 54525 -216687 -262129 -178647 -102766 -67527
7656 -67527 101466 -8182 -68553 -198479 -188826 -154606 7615 154250 268754 -96219 58211 -8617
7643 -194434 -140006 -10479 5802 -244361 -50227 -212930 -69016 3332 107847 -134660 -107172
7632 -107172 -227241 -149897 -122941 386553 -134134 -199751 124267 -244532 -179738 310209
7621 -129177 10032 -169381 -149001 19236 257695 53723 132294 -168253 -350889 -92375 181844
7609 -214991 19983 -218576 20383 -143432 -174384 102276 145108 -282878 16821 -188251 -231510
7598 -231510 239950 -161694 74219 -107219 22523 -62486 92265 -266883 89211 -187862 56566
7586 -78266 118543 -362787 41603 -56820 -59755 -235778 -68932 13981 42275 -93220 8529 90358
7574 90358 -157485 -51262 -121223 -54798 84307 325379 -207664 -137524 130067 -161773 -25779
7562 -180935 307980 115603 -123702 -143358 251202 -100371 131388 -72912 -176853 187065
7551 24587 -124107 -349136 182825 246470 -131218 -161926 -13534 98615 -250165 117278 17033
7539 -773 -147049 160888 39717 -238398 92485 -102284 30269 -111587 -25422 -115440 41778
7527 -2745 -24022 127088 -7990 -137113 47767 254482 44480 -1813 20529 -55829 -84416 240004
7514 -148681 -175903 -34490 -282800 95878 289255 161571 -225317 -99904 43301 415270 -133364
7502 -30544 34144 -165892 97615 -62370 -31226 -121878 170173 13539 -124752 154501 -110051
7490 122453 121352 -192221 28898 -93955 -162816 -34700 -147842 334170 93128 -103439 219303
7478 46152 -374864 -59869 -170241 233858 113340 -160996 -273996 -41893 -94382 218259
7467 87013 -171334 -197331 47841 27581 -271480 -162771 -20064 -353486 -69659 -245202 42635
7455 -28746 -78953 -158195 -174609 -143328 -168866 64628 -264143 -81903 -124785 138182 -99098
7443 -71743 166928 132583 -46477 -279098 -98806 197413 -167819 -30980 -298820 116255 13285
7431 -29376 -90580 -110722 -27309 -66937 -76761 43102 -49157 160328 -140094 -280779 -61113
7419 468535 53385 -71341 24923 187256 15530 51551 -166012 46078 16885 -98995 61556
7407 -151601 -13511 276455 28580 119424 -314472 150188 -270665 -145364 -578893 -154830
7396 -124641 -83599 -143417 -176104 -134675 -286052 284287 21732 14945 51055 -79741 -135825
7385 -135825 -203811 -42435 37659 -14823 -66399 -252311 -85656 -25322 -294190 -35222 231777
7373 187884 -144306 163411 78276 -256782 -232652 -22345 -31947 143408 7758 186682 81320
7361 118477 -34598 -256460 -228421 -129964 -145361 -192222 -28356 -133973 -219713 381349 -143352
7349 271360 -314166 21488 -2011 -72356 -133844 250186 -112748 -140671 -27238 -169771 -119547
7338 -119547 -102850 -108751 -70072 45742 -80241 -240881 104658 -35597 -5145 -96678 375256
7326 28394 -118392 -82639 205287 -173247 -182210 -50716 61842 -34587 202789 351661 -16276
7314 38299 -56525 -217101 173566 -253376 -99455 130542 -186269 245524 301043 -199816
7303 -31149 299988 40401 219838 40879 222430 179925 14110 555844 95461 60594 71530
7292 71530 -196333 -5593 170902 200673 233131 -304326 -139914 -202647 -179381 165331 -128555
7280 49927 290301 -268089 204628 194492 -320461 208364 466989 281034 23014 134331
7270 134331 -24430 24728 -102236 131467 91720 -254921 -305579 48194 -81093 -194871 131687
7258 50075 -128601 54523 66303 -124511 -134284 -94854 -160318 -101049 220189 -104809 -111713
7247 -111713 289885 -74273 -138206 105902 127956 5109 -21375 43357 -154107 -271990 67844
7235 141197 38844 44095 -211451 -274200 -146358 262146 108848 -373908 148015 -340013
7224 99379 -99099 125085 -127781 -110805 240874 -165690 -244557 -74385 159894 -129718 -357186
7213 -357186 -44761 -268056 171581 36613 37513 22436 -260123 -114042 -69810 221471 -127524
7201 -155693 252856 15508 32453 -172870 -231601 -35690 -59331 702 -259074 97147 -55893
7189 -355902 -135701 -35461 -437378 -144541 39865 -212274 -249215 -173973 18974 -32223 -338404
7178 -338404 210420 99575 -312193 68049 -138979 244009 -110500 92293 -46510 -170421
7168 -170421 -325997 350369 15209 -152633 147630 -147245 80602 184210 31397 144572
7158 144572 -37505 217764 -67821 432160 170944 -138137 106948 -217674 8274 -87574 156195
7146 12959 188273 24842 127384 -166460 -146197 -254548 326618 -129164 214859 4194 205034
7135 205034 -165423 -10321 -25908 111109 374548 379772 -214500 -149876 -1453 320520 43416
7123 23627 -126767 -237668 -170916 -287905 -88240 -289174 134852 -204414 264115 72691
7112 51300 39314 -365042 90628 -47273 -179430 112346 -227526 -145601 110075 -3317 22268
7100 -75791 453743 -362 -208762 -20639 -117593 410520 164395 -151356 93892 -75379 104529
7088 267624 28140 197994 -105835 161708 -93722 -239604 130557 92836 131878 -2221 31222
7076 -155650 -173361 -70660 234949 363809 5789 165854 -340416 -107690 65769 32753 -148740
7064 -141053 -72207 351113 -115679 -122591 -16033 -90731 -88636 -59548 -79034 -191610 41400
7052 282447 -290321 134911 45451 187217 66049 119395 -164816 -40251 -175597 -338522
7042 -338522 -26311 -250420 -239942 87141 -2345 -99691 193922 127916 5628 -130337 76193
7030 167046 359423 -84478 201251 88192 -69772 -247755 133491 -297535 -132619 -4957 143884
7018 -92851 -136091 97747 -157217 -265728 -299644 -210755 100552 86473 -105452 -182164 31812
7006 99751 -19525 -99449 -209923 -46720 -186250 239191 114898 186437 242013 135132 221964
6995 221964 -121135 -229876 49511 169902 29032 262293 -115102 -182774 290892 -105884
6984 -152725 -112088 -191545 238811 -361030 123645 -253325 5867 -114612 -40900 -128385 84599
6972 138315 -232731 -152374 383280 52624 127454 -27614 -65124 -79293 21469 -18163 -48257
6961 -48257 -2064 -236350 196333 -27546 25588 65225 -80643 48600 273975 120723 -288971
6949 166221 -114386 -1172 -138320 78525 142423 -102777 44500 -66447 43185 1933 -258347
6937 184499 178601 -115929 71190 24087 232935 -211262 -305100 -287463 -352039 -200031 -59387
6925 -119077 -83146 -33569 258884 36171 -44710 -126531 -107444 241850 -6678 112045 -94054
6913 -279513 -151680 71389 277263 206432 -65121 -13441 -61600 61268 115550 -105146 -140080
6902 -140080 -312542 -140063 2269 -81435 -1945 -145877 52154 -236508 -176275 -118686 28079
6890 -172735 -33731 -164904 -496867 -207414 199335 -84517 -177430 -216753 -231086 -136291 -98828
6879 -98828 72594 -120022 94811 36545 55474 55324 -108297 38155 -68081 -188954 -27795 -161988
6867 -161988 23090 40648 -96797 -56651 -163274 262413 249664 131034 -21574 -269262 -114756
6855 -206638 -88917 54185 -155182 40164 334790 -25230 -306238 -92001 110108 354859 68343
6843 -28127 362027 -187791 -84652 -38201 53225 -141249 -63829 -108063 -103479 20277 -18394
6831 110126 138545 233345 -128404 11788 209613 166859 -43181 -38198 101901 -85187 17880
6819 120292 101572 66442 -322990 -144768 -185615 -63726 -339419 -171602 -188137 159338 207407
6808 207407 73090 150438 226718 -169022 -119171 100049 -354722 189297 162750 -30281 114231
6796 166858 -326720 -42097 -183605 59841 28358 -102340 68663 77385 10640 -306747 -63751
6784 -46634 101127 -73539 213651 -110303 201006 -96613 -110758 -110318 32593 66733 22453
6772 187826 -107833 341147 -54873 -23215 337489 18804 -229550 -60978 101934 90402 -178313
6760 88650 129267 -231646 87902 -179825 248590 41185 -9060 -452844 68633 -6705 -97565
6749 -97565 268915 -38270 94270 35417 -8794 44388 -286507 254183 -39877 -319863 35495
6737 -193824 53540 -23126 60425 -17963 55589 -12739 113668 -67080 107008 -318170 64252
6725 8776 341780 -126940 -269745 -79718 190232 8384 -222524 48403 -298107 -193301 -163200
6714 -163200 -79398 23883 157400 -54114 26888 44518 -12199 83837 127305 15510 13764 -134884
6701 352364 -363601 434942 -7197 222164 104474 317881 155446 41742 -342915 59553
6690 -66020 -203630 154581 -140658 -206463 -189784 35215 151962 332783 66114 -605074 70299
6678 -308863 -121039 -266987 -170192 -2883 70574 -44216 46668 334322 158378 166533 -35663
6666 453199 -255466 -67687 -126703 71505 41888 225602 -78755 -240528 -241439 -129150 259634
6654 131862 193815 -96644 278048 112062 -154828 92941 -76522 268976 -32509 178873 335720
6643 335720 -55254 385469 -54549 -77035 122356 -65333 -303844 202977 -61683 2062 37874
6632 37874 -248545 -136456 -353628 -128041 194307 86616 191308 227280 -32005 193653
6621 60706 -145304 -253644 -36162 40772 166982 201749 93398 -164937 -249576 -31576 175966
6609 -70417 -11332 -74346 -186752 -32404 87287 -100453 -207086 111321 263896 -151178 -77202
6598 -77202 -221273 -49521 153569 -198751 115424 -39134 32368 -254552 104423 149447 -91339
6586 -108712 -272135 7385 -84382 25012 -77078 16561 99679 138081 -227602 -192290 94652
6574 145649 -147754 -48534 -164277 45734 -38808 103705 96178 59801 -32209 -204952 -49042
6562 40404 -128267 -317256 -91133 -250519 131982 -335376 -412082 -165860 -177641 -16715 145463
6550 193226 376045 -92136 -18022 10974 -67540 -33007 -260051 63252 -94124 16179 -143555
6538 -163211 -125194 -48542 -160596 -155370 -145836 310331 210149 -126688 350709 353541 -98237
6526 -144480 218010 -144236 -4158 108435 167136 25413 -371326 -158130 -118699 -97120 54949
6514 -47084 181071 -16214 66309 149884 59740 -93241 -86719 -191783 99636 -92360 -112766 -9436
6501 -68419 -147752 -229491 -120767 73051 -63303 211437 -356634 -266427 25128 141342 218051
6490 218051 -14018 274455 -64238 1508 264458 -410099 181260 112156 10714 13687 -111316
6478 119026 -304110 -90124 -87936 217374 -75915 -46388 82548 114694 -44551 5344 162728
6467 162728 434661 155999 -231459 -277530 73220 -150488 296136 63882 -38867 137212
6456 -49928 36400 -105317 -86543 126754 173948 288159 -222619 -224917 269496 -68719 131700
6444 107150 249203 -312508 2989 40781 156388 -126875 -298524 229963 178932 -106024
6433 -58396 180598 -498299 57051 -35051 -168362 24437 -84497 -8887 130847 -35445 -254642
6422 -254642 -53918 58487 111409 -248525 120391 -92858 -168845 -289587 90056 271701 -112774
6410 -314575 -287524 68422 327194 210394 -267194 -210875 120527 65565 108959 -8057 479118
6398 21776 -124447 294510 -78522 176354 231104 -281675 -203062 -219412 237156 69178 -118944
6386 -75489 -178040 -56298 -210150 48067 53643 42822 -134800 167181 89749 -20085 -15693
6375 -15693 302834 627808 64465 62378 298129 -176387 133154 40845 174687 -99831 -3010
6363 -102463 -317934 135781 125326 -134580 15887 -111417 -4395 163542 -5774 -87446 -50350
6352 -50350 60906 -28551 73963 46672 -254544 -80431 3488 200922 7586 45563 115152 156008
6340 156008 -25233 9812 214425 -181817 -76516 -153487 -28824 -94051 -155753 -83686 -250269
6329 -250269 -98842 -56046 -197824 -30661 -122041 -114697 -234617 335483 36918 -122053 254797
6317 218911 -203422 -240382 -24350 -156213 -152091 50256 114533 -299574 -135188 155240 142191
6306 142191 -123458 -52697 442978 174509 -183353 244878 262573 -281495 210019 -217682
6295 -170682 -345516 1709 -116045 185399 -16793 252433 -330698 -228247 40671 -239737
6284 146464 -205248 -147067 28380 -175087 102037 38791 101956 -22187 -240260 44910 -318198
6272 -154528 -80771 211871 -632556 -23732 -169841 51731 -298837 -53647 -267573 96392 146617
6261 146617 89959 42933 222999 105039 -220101 -141693 -83898 136386 -34497 -7723 -29892
6250 -29892 -162699 -259458 103731 71181 240019 -82031 363549 -157220 -300220 -36959 -116584
6239 -116584 322320 54303 -110340 -95929 405210 147231 4697 256606 55507 -94672 2810
6227 -129761 -588955 81877 -35533 -209238 -331348 -347708 137982 -186595 -25288 212872
6216 -75270 -103556 -82371 8452 -20363 -290205 78775 -35233 -225674 -312969 -275554 -44588 185603
6203 -13573 -142271 -18637 133171 22020 -138021 138328 33678 289447 223213 219619 296
6191 -165654 7461 30730 412050 -248932 130807 6549 -313610 -121307 -22211 -39886 -72762
6180 -72762 -146162 -229824 51221 -161503 -191401 49778 288612 -94445 -183465 12032 -139504
6168 28908 21147 62435 322400 -133900 -68865 216661 85625 20947 252002 243454 -86940
6156 -225140 25480 248519 79136 -37532 -19024 222569 -6621 -58638 -3752 115698 -51981
6144 -126459 30238 -107308 -103233 -289910 -81179 -60172 -332875 116542 28373 -87607 -297540
6133 -297540 104198 -188612 23175 24840 314833 23053 -185700 -136735 285652 -44939 359483
6121 391648 -50232 -70279 8213 -171025 54991 -174946 -137328 -379030 -41059 6484 -196491
6109 -137813 -94369 46581 -178045 32982 404760 54113 -35715 -35805 49980 -50207 140140 65865
6096 -85458 -41305 139134 1790 206374 -129614 -162909 152599 -365960 -220969 -99702 -394468
6085 -394468 240872 -17984 -17119 16515 160411 332014 55906 -213325 25303 -44289 -213777
6074 -213777 -202957 -152797 168322 -237647 -178513 -13639 289118 -177198 -227950 80015 110298
6063 110298 42471 53587 35022 68510 -130910 -189673 -168746 -34041 70466 109730 77590
6052 77590 -169167 -2269 -31340 34413 97244 204273 417401 208643 87363 184036 28239
6040 -11092 -224726 -14922 -236550 132366 67891 -340057 -90422 -110025 -306694 207776 342967
6029 342967 267690 121385 -58456 -43808 -15584 192097 172208 311764 142155 -270523 -148389
6018 -148389 -67580 -37465 -339725 357141 -3521 36778 292989 326810 -277604 18729 -241453
6006 -51094 -150659 -50688 22900 -36433 -268995 129033 146867 -96913 -23741 -150818 -46015
5994 -190952 -39594 102685 -108715 -138085 -22833 222582 200480 -140866 116321 144955 -333132
5982 -129874 156094 141029 -70901 163797 -253249 -30141 470581 329942 92426 -56903 -58945
5971 -58945 -221291 145886 164572 84697 175897 88509 179972 -262548 -7278 74837 -222595
5959 -424128 132118 75630 43292 -153951 257022 132316 -120549 20929 -104685 -134405
5949 -134405 153717 164439 -4510 -27648 58499 202429 204273 -288664 -260222 -33377 192576
5937 -221295 -145280 131479 -149377 -205222 -84966 -126047 138045 -71835 72007 4560 245213
5926 245213 -33127 -323174 181844 -7657 259819 -121970 -182593 -280271 22130 -33623 -291383
5915 -291383 -210823 109826 115446 -130827 -98274 -155680 -99774 301502 237335 153980 -37410
5903 -330562 12087 -7583 -81330 39135 110976 177371 -290452 -31343 217031 -139603 -374204
5892 -374204 -181559 -197077 278548 51515 40002 116245 -318084 -132578 -17655 4047 -147838
5880 122028 16848 -21802 -87537 27933 9443 -24017 199490 41044 -77335 86080 -177888
5868 -65633 137388 -216970 105277 -209302 19937 -84647 -33922 -232176 12741 45710 -92491
5856 57786 14413 192086 -161042 317144 -52386 -11984 -73927 -242343 -66620 -357028 171827
5844 -176 156626 -259369 159891 -108476 -8117 50411 -88076 -38676 -93860 188800 113949
5833 113949 109376 128935 -159610 71843 -299883 157572 249306 165954 -39162 227725 37263
5821 157378 -49343 -71431 212250 154819 -24117 -140520 247893 -243883 77663 91014 -328174
5809 78635 31403 30364 26880 -321916 -125846 121549 56496 72577 170529 -20075 -193877
5798 -193877 -105732 -176073 -183219 -124070 -99369 -167803 180197 302322 22532 16071 39151 -127200
5785 3887 19245 -140932 17273 107244 45954 -74647 345374 -149383 195795 385876 72955
5773 216778 122694 304108 -303960 257120 -37506 166160 -189068 -198399 19575 -81866 -180837
5762 -180837 286012 -203321 134051 186358 -85167 159261 158796 59458 -168452 138554 130652
5751 130652 113076 -194425 -121372 48386 189338 133686 -51374 112011 -166623 34476 30366
5740 30366 229392 -81308 107305 85276 -53725 12496 26836 -40344 -505098 164247 137349
5729 137349 63724 211507 -213104 -289687 -10827 260702 -233663 -290835 -10096 116449 24804
5717 40396 100110 134494 -18461 -142775 -4595 199845 33223 156908 -240775 -63375 18285
5705 99011 258720 134659 -78991 -345671 -3202 -96373 -104543 174617 -113915 107773 16331
5693 91092 356386 380659 -137929 -76117 127755 -36218 277063 8884 105289 -107868 52154
5681 186754 -11469 -102961 -157285 209364 79587 -121702 -124629 1360 99485 172123 -70552 150758
5668 -361897 -135120 517949 -14523 -237015 146015 -74751 -383191 174418 -73648 59007
5657 181623 303223 -123382 -154373 158232 218262 82285 60050 -14258 32479 -50399 16103
5645 -419028 -303792 -182834 305793 114302 -224489 72782 -312606 8290 -16661 179468
5634 -214908 -174159 3827 38831 5911 -12672 -86517 27505 -138373 564155 -385478 123176
5622 263041 253392 31379 171301 73320 131075 -209473 56254 -126983 -122384 138832 258841
5611 258841 -8638 -179736 -184761 139962 1542 12402 -41749 11606 -42779 129721 79859 121057
5599 121057 -234269 -97579 -220407 62018 -24731 -3856 124692 72991 45820 -107964 -111089
5588 -111089 71397 -63656 20860 -43171 119274 -159533 -65053 -51967 212174 -12192 -116016
5577 -116016 134790 -13805 -244845 -59440 133102 375218 -40323 139869 -196073 -148269
5567 -148269 20391 -59798 -51761 -319803 -234528 -288827 -1392 108470 -114832 289894 -70765
5555 -1 210723 -67817 -245872 -52797 -230455 -231488 52352 126535 -23373 -173482 -261163 -22282
5542 3492 -150263 137945 -248393 116906 -172592 28788 -201402 -18406 -36210 -343322 196428
5530 51217 53170 226694 -153434 328918 -83262 82080 79541 -147171 88197 136141 -232435
5518 -170235 -219595 187607 268660 100954 -177863 4646 112458 84638 -15108 45181 131365
5507 131365 161925 -17440 -48976 231547 -238021 244550 95703 48120 406912 -3606 -24845
5496 -24845 -142867 -48514 371562 -11480 -58206 -15040 -32623 -356593 -203530 -46543 116080
5484 -119226 75192 -112212 -189631 -152286 -281975 84546 445706 332058 409014 60130 -18671
5472 48398 -113706 -189620 -82116 175574 448 -166121 305132 150401 52275 -210131 -91071
5460 186502 82733 -57629 -340059 -134080 175614 150633 -102319 201816 -2562 -22242 -134727
5449 -134727 219950 -157507 -188113 -222687 42700 -260394 -28020 -304001 -116967 -180784 278854
5437 -220184 -186257 381823 -155206 63391 174769 357708 -5759 104012 313763 11448 -290223
5425 -23366 120878 340105 -31614 56273 -2636 236967 220608 -325871 6172 -270205 24283
5413 -186397 -136055 -229766 -46947 -23675 -145200 -33311 -84715 41347 -302956 -188589 96191
5401 -50810 -212997 25924 -8311 177533 55112 137156 -107914 -95030 56064 6218 -160342
5389 55599 -226852 161627 29690 407127 -107620 -18281 -317279 -26993 255452 147192
5379 147192 176248 7578 -128658 -72500 128341 -94116 -91172 -254804 -37453 310942 129639
5367 3458 335487 225135 -125736 -128599 33094 108777 -70839 284132 -88043 -56667 100820
5355 169067 83964 -135630 88756 87848 -26037 294809 195207 -33695 123646 64928 -45623
5343 -90609 254033 208490 184859 237217 -229397 -56040 -49811 136650 -192554 -163449 77379
5331 146367 -294784 -705 -108065 133988 -233986 238898 111485 86229 -256595 -78961 53792
5319 -21654 57914 -218644 -13441 -27045 81777 211446 -83236 73217 58479 332533 -252644
5307 -25095 250510 -108583 47800 177627 -23891 -254173 82128 301964 79452 81339 47508
5296 47508 -60924 215372 -450341 -75893 10989 249061 -80856 -101705 -86254 212755 55821
5284 135794 106021 -86147 20086 411757 -133639 -217567 135977 -203826 -57111 -33784 -32578
5273 -32578 -198191 -22739 -143078 30208 91037 176367 256985 -286122 146668 -309119 -115267
5261 35275 -126575 121277 131515 236983 -206565 -124179 196578 64690 46785 18301 -155776
5249 1410 -142156 -3300 -103329 51222 -6075 298302 -74006 45332 -100094 -94468 312035 -346347
5236 -201691 77893 161694 275758 -227217 16682 -135068 -250336 -128949 -8818 -56625 -114770
5225 -114770 302325 45287 193612 88710 157394 54638 -50423 -10182 -90752 142597 199002
5214 199002 77392 78914 -180876 -39258 101325 128174 -90956 -270122 148761 242119 147976
5203 147976 168958 -25990 -292543 448730 52438 -64939 153956 83829 116877 106279 -132662
5191 374525 69169 238871 7549 -12714 -122318 10564 -94261 -78985 150601 276506 -60390
5179 51114 268443 100282 -336178 62267 29902 221908 -4466 -12236 232894 -14165 190449
5167 245060 -41994 -12663 -65348 -1701 -122076 33114 375551 -104181 -11160 -201470 -16438
5155 -192514 -138026 -189914 127610 -366155 57316 144656 -15540 329656 -252139 75643 180068
5144 180068 198286 115282 -177309 -31687 -268377 26621 300988 -187522 -48826 -321883 -20234
5132 82868 -409620 -319448 -35120 -83510 40630 87290 209778 354328 191560 -272361 216193
5120 -42916 52636 -74274 -247093 61384 -55579 -166578 -256417 86069 10604 -190902 43296
5108 -151790 -49299 -176943 -159020 116886 -357787 48336 -149164 174123 46571 15945 -148775
5096 57172 16468 164115 12957 43943 240073 74356 -78395 -273824 -30306 154877 221486
5085 221486 100670 -12698 189729 -107690 1479 132212 153070 31575 117157 -191102 -182925
5074 -182925 -64890 -77083 -55756 44353 71745 178353 68792 70419 9687 -14676 7181 75686
5062 75686 -66269 66303 -229248 -69211 -95090 -2673 -145764 40545 42506 63366 78337 300539
5050 300539 126001 226695 171550 -269344 -65904 225125 66389 168715 184776 184463 -162492
5038 -31709 -61463 68087 79949 -10490 5770 45494 62907 -315372 179529 -260293 52260
5026 -18032 -82813 -228616 -82717 -35466 -43295 -261031 171313 -47211 30204 72029 -272573
5014 348161 69201 25160 144690 58051 133342 27507 66124 -21032 -52462 -246535 -202834
5003 -202834 132025 293032 -134551 -42483 41492 24505 -179411 -70285 -394765 192039
4992 102659 -6435 114970 -208030 114417 378048 200453 70105 -3409 -10988 118813 -350876
4980 134053 63189 76724 188693 66584 -106534 -68613 -8124 168460 142582 -139080 -177469
4969 -177469 91987 -143929 41236 127623 -305552 19295 -207955 -143145 -30330 -42854 -45188
4958 -45188 -443713 -76147 86732 151739 -304665 58983 79591 -67609 220992 -201761 404035
4946 -9681 -214101 14502 22599 -327128 -25846 98028 -212398 -255848 228341 -169094 81690
4934 260879 247680 -216468 -76973 185348 -75863 -145883 289913 270077 -66461 307517 87070
4922 -181323 120485 199326 -108972 198344 -173729 -250764 -205078 -20749 82352 54985 -335508
4910 27278 219592 242418 90642 -240969 2200 -359726 -120712 -302484 -70563 -133573 254250
4898 86502 316795 -84078 179195 -52817 -287549 169615 112367 -189712 1006 81943 -79826
4886 26551 -5633 -91821 96660 -54112 90060 -60357 -106605 335141 -174568 412814 118327
4874 3245 99884 -150637 -66399 123422 -138368 -193101 -31390 -134808 -247376 -16928 -45665
4863 -45665 -176487 -194640 -72822 77018 192900 93706 7167 196240 74379 -19 -358106 -140345
4850 70730 -72344 218472 165924 329812 -186500 236646 -192992 43470 -166678 49029 163562
4839 163562 -116672 -159905 -14738 -39486 -172100 -99773 -3119 114357 -182391 356398 373555
4828 373555 -199223 -196278 -60541 438919 -106893 168722 129269 -71853 -93635 308467 -41127
4816 22462 226543 -77252 109681 83946 26543 216635 111478 83243 128723 153603 14870
4804 150166 -170013 29315 -87964 -215890 -150154 -7823 99043 136713 110399 1114 -284227
4792 -73307 -51539 43084 13456 2444 -72715 358797 182637 -150313 -188431 -406022 216753
4780 36136 -24278 -20224 -92019 196248 57127 240695 309121 76268 178385 243175 220654
4769 220654 416782 48521 273940 235059 -265424 351761 248204 -264240 -147363 92251
4758 -9886 136358 -153148 100781 -240597 176707 -86131 -64312 164446 212000 -103826 -90836
4747 -90836 300596 200063 60006 -276028 169769 -1738 -76853 58757 -165470 -40542 -16256
4735 -208055 -302658 28833 133709 93802 -109241 86789 -43147 96754 -203593 -137080 -150605
4724 -150605 43969 98082 72938 -225033 9904 -106678 -68299 260105 128363 -23642 372252
4712 -248679 100187 111918 -14544 -28269 -226796 -12647 156010 14726 -177626 221608 6917
4700 129515 181799 92994 -73581 386635 110280 -101688 159379 82871 -79109 -110105 19283
4688 -162440 195843 45692 -25956 51250 66203 309724 24083 -43947 -238497 176056 -34471
4676 76743 -215873 -60584 271081 267488 -245833 -169073 41042 -82503 4615 -218131 52078
4664 2416 -131660 -105732 -102958 89166 -2475 -112331 69990 48187 33357 -139603 154033 257148
4652 257148 -233741 -94299 -106635 302676 88605 165702 263041 -10207 -34453 13412 77360
4641 77360 144215 -8384 157427 44262 -59577 239103 -86384 -59720 -101547 15361 146730
4630 146730 -44959 40592 372367 41026 382029 409696 -226660 -146291 160343 -136652 -108287
4619 -108287 -151321 -180706 100987 369323 33173 10655 290292 3697 205635 -253291 34580
4607 -43051 334001 -86685 -135090 336458 220043 -49150 45417 237430 -369214 303302 25383
4595 -126320 122613 169250 113229 -29150 -59726 91910 -250838 60816 30977 67430 517223
4584 517223 -86515 272337 -15023 -116704 -131436 -132668 -10116 -111306 -54909 -296838 369544
4572 2310 30492 -97923 -109344 -146121 -95750 37899 4872 -290508 -93672 253234 -130991 227090
4559 37401 38028 16825 134864 -295412 -265846 -48256 45674 111924 -89888 -168083 405830 -248761
4546 -8736 75157 190417 -264874 64151 135514 265279 -203730 -134245 -84772 -261401 -53049
4534 57813 199218 302558 78780 -125797 141220 142696 188881 37784 115641 26035 135232
4523 135232 143265 -314392 -185063 179706 -114497 -52456 -189261 -348210 157902 97809
4513 97809 131331 38338 -130805 356359 -10574 43973 -310932 81054 -161155 -177031 69999
4501 -168492 225755 -26236 170759 136189 117314 -262084 26825 -111946 176924 127814 57745
4489 -132907 -146043 -56199 224688 104585 -349470 -86500 -233813 -125040 -148690 -357912
$$ [...]
##END NTUPLES=NMR SPECTRUM
##END=
