
##TITLE=AC1408_AMCAH12217_7653457_wT77oWUpKg
##JCAMPDX= 6.0         $$ Bruker NMR JCAMP-DX V2.0
##DATA TYPE= nD NMR SPECTRUM
##DATA CLASS= NTUPLES
##NUM DIM= 2
##ORIGIN= BRUKER
##OWNER= Administrator
$$ 1.72 TOPSPIN		Version 2.1
$$ 2013-03-19 21:55:29.828 -0500  Administrator@X
$$ Compression mode = diff/dup
##.OBSERVE FREQUENCY= 400.02188249412
##.OBSERVE NUCLEUS= ^1H
##.ACQUISITION MODE= SIMULTANEOUS (DQD)
##.ACQUISITION SCHEME= NOT PHASE SENSITIVE
##.AVERAGES= 4
##.DIGITISER RES= 22
##SPECTROMETER/DATA SYSTEM= spect
##.PULSE SEQUENCE= jresgppsqf.2
##.SOLVENT NAME= COFFEE_meoh
##.SHIFT REFERENCE= INTERNAL, COFFEE_meoh, 1, 14.96075
##AUDIT TRAIL= $$ (NUMBER, WHEN, WHO, WHERE, PROCESS, VERSION, WHAT)
$$ ##TITLE= Audit trail, TOPSPIN		Version 2.1
$$ ##JCAMPDX= 5.01
$$ ##ORIGIN= Bruker BioSpin GmbH
$$ ##OWNER= Administrator
$$ $$ E:\/data/COFFEE/nmr/AC1408_AMCAH12217_7653457_wT77oWUpKg/13/pdata/1/auditp.txt
$$ ##AUDIT TRAIL=  $$ (NUMBER, WHEN, WHO, WHERE, PROCESS, VERSION, WHAT)
(   1,<2013-03-19 21:55:20.187 -0500>,<Administrator>,<X>,<go>,<TOPSPIN 2.1>,
      <created by zg
	started at 2013-03-19 21:40:56.984 -0500,
	POWCHK enabled, PULCHK disabled,
       configuration hash MD5:
       86 BA 57 50 F2 9D 5C 9B 26 00 A9 28 5F 66 2E 89
       data hash MD5: 8K * 40
       95 F8 3B BB F4 D5 68 34 58 AC A0 2B 70 D8 E1 FA>)
(   2,<2013-03-19 21:55:24.546 -0500>,<Administrator>,<X>,<proc2d>,<TOPSPIN 2.1>,
      <Start of raw data processing
       xfb same F2: SI = 16K WDW = 3 SSB = 0 FT_mod = 6 PKNL = 1 F1: SI = 512 WDW = 3 SSB = 0 FT_mod = 6 PH_mod = 2
       data hash MD5: 16K * 512
       2B 55 30 AD C6 D1 67 72 22 EA 6C 10 3C 5A 51 72>)
(   3,<2013-03-19 21:55:25.624 -0500>,<Administrator>,<X>,<proc2d>,<TOPSPIN 2.1>,
      <abs2 F2: ABSG = 5 ABSF1 = 10.00064 ABSF2 = 0.0001047667
       data hash MD5: 16K * 512
       6C 93 86 AC 43 70 98 14 9E 6C 42 C4 3E A6 B6 AA>)
(   4,<2013-03-19 21:55:26.624 -0500>,<Administrator>,<X>,<proc2d>,<TOPSPIN 2.1>,
      <tilt
       data hash MD5: 16K * 512
       55 30 5B 7A 48 27 91 69 CE BC 7F F3 D6 AC 24 A5>)
(   5,<2013-03-19 21:55:28.093 -0500>,<Administrator>,<X>,<proc2d>,<TOPSPIN 2.1>,
      <abs1 F1: ABSG = 5 ABSF1 = 0.06497851 ABSF2 = -0.06497862
       data hash MD5: 16K * 512
       F1 C2 EC A3 5A 84 FB D2 B1 73 19 B5 53 B6 42 5E>)
(   6,<2013-03-19 21:55:29.343 -0500>,<Administrator>,<X>,<proc2d>,<TOPSPIN 2.1>,
      <symj
       data hash MD5: 16K * 512
       12 FC 48 CD 49 1E D1 3F EA 14 BF 80 D8 17 92 D0>)
$$ ##END=
$$ 
$$ $$ hash MD5
$$ $$ 17 C9 38 A1 CE 52 CE 3E D1 DC E7 D4 D6 33 96 79
##$RELAX= 
##$RELAX= 
##$RELAX= 
##$RELAX= 
##$RELAX= 
##$RELAX= 
##$RELAX= 
$$ Bruker specific parameters
$$ --------------------------
##$DU= <E:\>
##$EXPNO= 13
##$NAME= <AC1408_AMCAH12217_7653457_wT77oWUpKg>
##$PROCNO= 1
##$TYPE= <nmr>
##$USER= <COFFEE>
##$ACQT0= 1000000
##$AMP= (0..31)
100 100 100 100 100 100 100 100 100 100 100 100 100 100 100 100 100 100
$$ [...]
##$TD0= 1
##$TE= 300
##$TE2= 300
##$TE3= 300
##$TEG= 300
##$TL= (0..7)
0 120 120 120 120 120 120 120
##$TP= (0..7)
150 150 150 150 150 150 150 150
##$TP07= 0
##$TPNAME0= <>
##$TPNAME1= <>
##$TPNAME2= <>
##$TPNAME3= <>
##$TPNAME4= <>
##$TPNAME5= <>
##$TPNAME6= <>
##$TPNAME7= <>
##$TPOAL= (0..7)
0.5 0.5 0.5 0.5 0.5 0.5 0.5 0.5
##$TPOFFS= (0..7)
0 0 0 0 0 0 0 0
##$TUNHIN= 0
##$TUNHOUT= 0
##$TUNXOUT= 0
##$USERA1= <user>
##$USERA2= <user>
##$USERA3= <user>
##$USERA4= <user>
##$USERA5= <user>
##$V9= 5
##$VALIST= <valist>
##$VCLIST= <CCCCCCCCCCCCCCC>
##$VD= 0
##$VDLIST= <DDDDDDDDDDDDDDD>
##$VPLIST= <PPPPPPPPPPPPPPP>
##$VTLIST= <TTTTTTTTTTTTTTT>
##$WBST= 2048
##$WBSW= 25
##$XGAIN= (0..3)
0 0 0 0
##$XL= 0
##$YL= 0
##$YMAX_a= 68755
##$YMIN_a= -132156
##$ZGOPTNS= <>
##$ZL1= 120
##$ZL2= 120
##$ZL3= 120
##$ZL4= 120
##$ABSF1= 0.06497851
##$ABSF2= -0.06497862
##$ABSG= 5
##$ABSL= 0
##$ALPHA= 0
##$AQORDER= 0
##$ASSFAC= 0
##$ASSFACI= 0
##$ASSFACX= 0
##$ASSWID= 0
##$AUNMP= <>
##$AXLEFT= 0
##$AXNAME= <F1>
##$AXNUC= <1H>
##$AXRIGHT= 0
##$AXTYPE= 0
##$AXUNIT= <>
##$AZFE= 0.1
##$AZFW= 0.5
##$BCFW= 0
##$BC_mod= 0
##$BYTORDP= 0
##$COROFFS= 0
##$CY= 15
##$DATMOD= 1
##$DC= 0
##$DFILT= <>
##$DTYPP= 0
##$F1P= 0
##$F2P= 0
##$FCOR= 0.5
##$FTSIZE= 512
##$FT_mod= 6
##$GAMMA= 0
##$GB= 0
##$INTBC= 1
##$INTSCL= 1
##$ISEN= 128
##$LB= 0
##$LEV0= 0
##$LPBIN= 0
##$MAXI= 10000
##$MC2= 0
##$MEAN= 0
##$ME_mod= 0
##$MI= 1
##$NCOEF= 0
##$NC_proc= -4
##$NLEV= 6
##$NOISF1= 0
##$NOISF2= 0
##$NSP= 0
##$NTH_PI= 0
##$NZP= 0
##$OFFSET= 0.06497851
##$PC= 4
##$PHC0= 0
##$PHC1= 0
##$PH_mod= 2
##$PKNL= no
##$PPARMOD= 1
##$PPDIAG= 0
##$PPIPTYP= 0
##$PPMPNUM= 2147483647
##$PPRESOL= 1
##$PSCAL= 1
##$PSIGN= 0
##$PYNMP= <proc.py>
##$REVERSE= no
##$SF= 400.021882494141
##$SI= 512
##$SIGF1= 0.06497851
##$SIGF2= -0.06497862
##$SINO= 16
##$SIOLD= 512
##$SPECTYP= <>
##$SREGLST= <1H.MeOD>
##$SSB= 0
##$STSI= 512
##$STSR= 0
##$SW_p= 51.9856959427865
##$SYMM= 3
##$S_DEV= 1402
##$TDeff= 40
##$TDoff= 0
##$TI= <>
##$TILT= yes
##$TM1= 0
##$TM2= 0
##$TOPLEV= 0
##$USERP1= <user>
##$USERP2= <user>
##$USERP3= <user>
##$USERP4= <user>
##$USERP5= <user>
##$WDW= 3
##$XDIM= 16
##$YMAX_p= 158697899
##$YMIN_p= 0
$$ End of Bruker specific parameters
$$ ---------------------------------
##NTUPLES= nD NMR SPECTRUM
##VAR_NAME=  FREQUENCY1,    FREQUENCY2,      SPECTRUM
##SYMBOL=    F1,            F2,              Y
##.NUCLEUS=  1H,            1H
##VAR_TYPE=  INDEPENDENT,   INDEPENDENT,     DEPENDENT
##VAR_FORM=  AFFN,          AFFN,            ASDF
##VAR_DIM=   512,           16384,           16384
##UNITS=     HZ,            HZ,              ARBITRARY UNITS
##FACTOR=    0.101534562388255, 0.501933850740131, 1
##FIRST=     25.9928259484165, 8223.18227667557, 427
##LAST=      -25.8913354319817, 0,           -288
##MIN=       -25.8913354319817, 0,           0
##MAX=       25.9928259484165, 8223.18227667557, 158697899
##PAGE= F1=25.99282594842
##FIRST=     25.9928259484165, 8223.18227667557, 427
##DATA TABLE= (F2++(Y..Y)), PROFILE
$$ [...]
##PAGE= F1=0.2030471017997
##FIRST=     25.9928259484165, 8223.18227667557, 145
##DATA TABLE= (F2++(Y..Y)), PROFILE
15192F46B88b07l69k30L4K59b12A95N62N81L77qn46B41c98a02C95N19L51K37J40
15171A642Jk39m03D29c73r46M9a08H55P24L41K84j18p38B32b60J05G4J33L87L52
15150I46K57R9j08m51j2k61j80m7J53P8r4I4d42o49p00n26j39N06N65N05d38G9
15127E82J21k02A15f48q80o99L2Q96b12H21R56Q37N54J50l07o72p42n51m67l5
15107E44J64K36J26k24I1a115j554a333a93C54bn71m44J15R8j18k08q2j4p9J51
15086a154j20J98p6n5m03m91J98J98l23e28H62O65N48J67k80o29n86A32e04k75
15066g79L36F21R16P69N8o79F38c00n59L30gF11O45J93m23C46e04m19o88l40j50
15045b101J19N91O68a31e2o08r11q79k42L09K53N30O46a80B27C4c87l14nc09I8
$$ y = [646, 288, -207, -576, -806, -772, -513, -212, 195, 757, 1338, 1715, 1707, 1161, 241, -398, -102, 395, 914, 1265, 1502, 1642, 1643, 1404, 1001, 429, -373, -1319, -1270, -108, 855, 1579, 1920, 2204, 2086, 1348, 232, -260, -155, 74, 207, 594, 946, 1203, 1302, 1194, 743, 731, 470, 290, 243, 396, 474, 380, 94, -442, -1091, -1791, -2317, -2456, -1950, -1385, -880, -438, 79, 582, 703, 501, 115, -648, -1528, -2227, -2195, -1299, -212, 821, 1777, 2614, 3168, 3318, 3011, 2339, 1597, 1046, 579, 544, 708, 944, 1070, 846, 91, -1115, -2669, -1333, -193, 354, -2, -573, -1017, -902, -804, -922, -1130, -1212, -1226, -1305, -1154, -1274, -1076, -1152, -1207, -1610, -2101, -1903, -1705, -2028, -528, 862, 1527, 2075, 2242, 1962, 1333, 747, 132, -504, -779, -443, 621, 1537, 2306, 2364, 1685, 638, -300, -859, -529, -7, 611, 1256, 1449, 1026, 346, -504, -923, -1611, -1951, -2101, -1982, -1391, -723, -131, -52, -660, -1571, -2450, -2692, -2383, -2130, -1600, -954, -180, 227, 34, -387, -701, -706, -309, 98]
15023C08i8q31j013j095J254g55A6M31B06a102l10M5f35a98rj59l60j021K08k99
15003a838m1J21K80K86L65J53l1n2M9K23b12Q0M6I8N62K99k65b2q55m41oK93c32
14979G65J248J173P70K03m31q87j167C56g50m32K89e1G83Q37M29j77n81o12A24
14959a24j26l99j148n43J097N40K67K07J02j16j46N7G5M56K12l56b77n29q1J62
14939g25R8J62i3C30J79j01a57k71a87j00J07B33M39M58Rm00a80j171o3O20K74
14918e20q17m32N24d65B12M33J53QL1p1k92k10L6p0K10L78O46O90M70k6q53E78
14895e49p66j42L31M5m18K9f32G9Q58P72N00j91l12p9j93j79k52C80h7m40j68
14874f95l66r06m68R55e33D1J5b98o59n54d71A33O92Q64M74J74l51q14C65e07
$$ y = [308, -98, -929, -1942, -3037, -1783, -755, 16, 447, 206, -1102, -1412, -1367, -635, -198, -207, -366, -726, -1747, -1539, -1838, -1879, -1758, -1478, -1192, -827, -674, -705, -757, -708, -485, -212, -132, -86, 98, 660, 959, 694, -22, -877, -1318, -1324, -1031, -332, 765, 2013, 3186, 3956, 4159, 3728, 2841, 1674, 356, -750, -1182, -893, -51, 783, 1620, 2049, 1872, 1291, 679, 124, -124, -250, -649, -1797, -2340, -1243, -703, -436, -229, -127, -243, -389, -332, 75, 531, 743, 387, -277, -806, -887, -725, -627, -465, -93, 330, 509, 408, -157, -428, -187, -287, -180, 233, 672, 1130, 1139, 739, -180, -1351, -1414, -794, -520, -1337, -1769, -1245, -465, 212, 645, 798, 806, 837, 766, 474, 264, 300, 230, 440, 818, 1464, 2154, 2624, 2598, 1745, 578, -549, -1315, -1457, -1126, -1081, -1499, -1470, -632, 79, 937, 1709, 2209, 2018, 1706, 1627, 1434, 1255, 1003, 380, -87, -527, -695, -1061, -1967, -2435, -1480, -533, 41, 56, -298, -957, -1511, -471, 133, 825, 1689, 2163, 2337, 1986, 1172, 365, -507]
14853a461k46N08L79J48l73l69k97Mm35J90j44J81M36N16b67B55J63k00b17m06
14833f23n11k09j34K80L51J52j4p55m16N93M02K51n2l16j069m6i75B35R26M73
14813A634J14q5j15l06n31A89c36k8J25g3a3m01n36j13J55K23J49k93j26J46b57
14791B93J27j29i0o89o32j95M64e71A6N19K99L53P8m29H6f67o43j75r1j40N6L58
14769a302N78b36j04Ki7B22L09K81K87m0j68k73B51d6p0M0E8b18n29p36j110L18
14747b275a072e4G54L51J22j32k77k02j3k9Q2K48K29K0l26A45h04j393k68O53
14727a812O14L05J18k52r53O73b51F93R67Q21K74k92p56p34l71j67J6K10L79M68
14707A508L11j56m90k56j39R9K9j15k74G5d97l09k16a16I79N24m52j9J40k93C08
$$ y = [-1461, -1707, -1199, -820, -672, -1045, -1414, -1711, -1707, -2142, -1952, -2096, -1915, -1479, -963, -267, 255, 418, 218, -217, -623, -1134, -1343, -1477, -1197, -846, -694, -708, -1463, -1879, -1286, -884, -633, -685, -1001, -2070, -2116, -975, 235, 1161, 1634, 1748, 1663, 1548, 1242, 711, 189, -336, -364, -239, -73, -13, -414, -950, -1063, -908, -685, -536, -829, -955, -809, -257, 293, 420, 291, -90, -779, -1411, -1606, -1142, -571, 16, 535, 834, 1187, 1265, 836, 86, -667, -1310, -1485, -1576, -1716, -1660, -1302, -724, -236, -340, -338, -97, 222, 531, 812, 1099, 1059, 891, 618, 251, -46, -116, -76, 58, -218, -747, -1483, -2593, -2275, -1072, -54, 754, 1105, 1227, 1095, 818, 616, 603, 574, 656, 904, 1133, 1153, 827, 145, -804, -2197, -2465, -1812, -1198, -893, -775, -1027, -1980, -1307, -251, 693, 1660, 2481, 2755, 2463, 1707, 973, 602, 435, 451, 661, 1040, 1508, 1819, 1663, 1173, 917, 778, 877, 906, 791, 517, 75, -497, -806, -1022, -116, 979, 1503, 1051, 1032, 1172, 879, 308]
14685c94j83J65B26K37m3b0p41q97L87e96C36Q53O64Pq5j46j23j28j54k23o8j58
14663G75j54j17M6M02O69O80N47L71j17n32j016E83b54k48K00A84P28M78K34J19
14643A743k24o35k82j73C2d27m85l80l8k9l7j25j57j86l0K75M20N26K87j21l97
14622i04k74J3K36O8M5k63l27M06M38L6k00P5D10J604J657R71O2p26j334A034
14601d77p70d39J44l82o2a2A089P60K07m75F83a8o06k34j41k40l54R6M63K01L36
14580d97c0n6k06k56j97k78J26L32o8o23j071a066A03R35K21m53a97o54k04E2
14559I04J83n40c46p06n15j14J7j52K45L32K74J73J72b90B03O34L93M60L77mn10
14538A553o30k01P07J88K47K03o9n75p10k42mJ70K84K49L16J38j88m91m10j78
$$ y = [-394, -577, -412, 226, 463, 420, -20, -761, -1658, -1271, -596, 336, 1189, 1853, 1860, 1775, 1629, 1506, 1378, 1224, 1001, 933, 775, 621, 504, 550, 952, 1621, 2301, 2848, 3219, 3102, 2570, 1554, 583, -254, -502, -302, 184, 912, 1390, 1624, 1743, 1519, 884, 602, 429, 32, -427, -912, -1292, -1330, -1359, -1396, -1521, -1678, -1864, -1894, -1619, -1199, -673, -386, -507, -904, -1178, -1165, -929, -861, -816, -1079, -1406, -1000, -562, -526, -726, -651, 410, 2014, 3671, 4642, 4704, 3978, 2644, 1034, -477, -1247, -439, -295, -677, -739, -12, 1089, 1849, 2056, 1581, 683, -18, -624, -858, -999, -1239, -1593, -1497, -1034, -833, -497, -30, -86, -292, -548, -745, -1023, -897, -565, -633, -1256, -2327, -1066, 103, 1038, 1259, 806, -197, -851, -1055, 52, 904, 1087, 547, -346, -1052, -1567, -1681, -1664, -1816, -1571, -1239, -965, -792, -620, -290, 203, 837, 1230, 1690, 2067, 2063, 1553, 923, 722, 1429, 1617, 1864, 2067, 1998, 1423, 713, 471, 467, 637, 921, 1170, 1486, 1624, 1436, 945, 535, 357]
14518C57r6j06b38m79n85q6R3K15M54DM92K63N2k19k23r6K46K52L10L48K77M7
14496A753m21E12e15l16A50P51K36k35m39d52p91J07c93D88P03O58J38j81m56
14477A350l53m30j59M69J41p9k75A73RQ70J071K35q30D22e85l79d33C17O84J91
14457A192m26b46j046N91A32L56j52b45j045n24N7P02K14KR0J95K3j02n1j5k07
14436i06j73k55l57k86rM27K64N91a42C29M5a21n64m39q1K99M04K04j90m18m11
14415a317n6L58J99L4q6l08l33k96k45j96%j88J81Q62e63a3B51C7f48q44n94R92
14393a094A07Q41O47N00j11p42D64a90p34n00m21p7K94M26L94R5J49b16A08N04
14373F12L91M49J49k03m06D18a68o23n35l83k30f63A99P14J61o7j87k46A05g81
$$ y = [357, 261, 155, -238, -717, -1302, -1388, -1295, -1080, -626, 4, 496, 759, 811, 592, 369, 273, 519, 771, 1081, 1429, 1706, 1753, 1332, 512, -515, -831, 150, 901, 1137, 902, 463, -452, -1243, -1136, -393, 488, 1191, 1849, 1987, 1806, 1350, 997, 567, 408, 877, 1018, 939, 664, 173, 182, 1052, 2123, 2358, 1528, 422, -585, -964, -433, 317, 1001, 1192, 766, -246, -1292, -701, 132, 488, 336, -245, -1290, -1814, -1757, -1055, -841, -839, -749, -554, -531, -633, -684, -699, -906, -1079, -1334, -1691, -1977, -1986, -1559, -1295, -704, -142, 329, 374, -121, -685, -1124, -1205, -906, -502, -298, -488, -906, -1317, -1373, -1015, -816, -782, -868, -1176, -1509, -1805, -2050, -2246, -2246, -2434, -2253, -1391, -563, -13, 251, 37, -648, -1492, -2086, -1094, 107, 948, 1595, 2095, 1984, 1242, 464, -190, -924, -1424, -1845, -1922, -1628, -1202, -808, -713, -564, -216, 108, 612, 1003, 1452, 1601, 1398, 992, 418, -168, -791, -1326, -1709, -1939, -663, 199, 913, 1074, 1007, 820, 574, 105, -781]
14352a196L98i8B67K55J93Jk3J67M80N48L48k3k91p39C81a19n85n54m54q1J27
14331a666L9l96m13R02g21b06B23K70K19J48L9m44a97o34m48m6M31b8I61R64N78
14310B503L44Q9j39j30P9J72P9j99l59p38H17a42j43F1J81K24j67b25j027n16
14290a768O53M89L07P1o6j69j12PJ2k89l59j40K94d54H4K82p1b64p22p1b71A47
14267C55Q1A85h5k42j34J93GJ09J19J29n2q0j8a44p98q13k76R02M50k24j41J21
14245i23q7jO4j23K09L73a28O0B67P1K00J45k73j49N0K52K71j53B83b50p49m2
14223a041o08K56M29K44c05E79J100M35r2n46G02k90p6l9a36p52q27P42A56J64
14203C20a62o29j85M27a80l5k72n11o96m97l21K01M40N54K19J15rK60J96k00l25
$$ y = [-1196, -798, -98, 267, 522, 715, 716, 693, 860, 1340, 1888, 2236, 2213, 1922, 1183, 381, -119, -704, -1258, -1712, -1793, -1666, -1627, -2023, -2436, -1534, -721, -206, 223, 493, 712, 860, 899, 455, -197, -831, -1279, -1325, -894, -28, 961, 1925, 2503, 2847, 2936, 2797, 2667, 2746, 2918, 2997, 2798, 2439, 1701, 817, -142, -285, 61, 242, 466, 299, -225, -1252, -1768, -1115, -626, -319, -248, -314, -483, -595, -588, -576, -865, -1224, -1364, -1070, -454, 84, 366, 295, -264, -986, -1057, -271, 147, 355, 436, 185, -85, -327, -461, -268, 7, 116, 235, 364, 312, 232, 214, -144, -942, -1755, -2031, -1129, -679, -903, -1044, -923, -1010, -1011, -947, -1070, -861, -488, -128, -68, 267, 338, 538, 683, 410, 261, 311, 563, 834, 681, 283, -250, -999, -1041, -1649, -1393, -964, -720, -305, 579, 1679, 2114, 2022, 1476, 702, 412, 336, 297, -136, -888, -1715, -973, 156, 320, -162, -791, -976, -549, -180, -215, -487, -998, -1694, -2191, -2512, -2311, -1871, -1317, -1098, -983, -992, -732, -536, -736, -1061]
14182a061k07L44d37J91k58m24k26M69Q9K0mn0Qj92m57n79J64O01L64J92L0a97
14159F1N0d49p20j63M76a67G9a2n27q32N7J40e37C41O23J74k67B04g73k08h2E68
14136E57a15r37R1b5E00K84j85a70j227j247L20i37G62J224O81K11p81H02C4J1
14116D5L03q1c81q66K16K89K89Jm58p87n07h44H88J624J532J182O80j68q24j727
14096C187A102e50q45O87h7E0f00m63c18I33P04K9p02c80j101m81L71L40f07D84
14075A527L22k04n44n43H7a88m14J1K24J16p0k95p32r18l18k36O1N09O36N91e04
14053d48p7k35k80o6P3r9n05l83m21n55K47K07J001e98C48O97L07k30m73A63d43
14031a137q14n13N95c16I61P53L87k07p06B91d91j98l69n06k31l8Q78a46C08J5
$$ y = [-1061, -1268, -924, -437, -246, -504, -928, -1154, -685, -596, -576, -580, -630, -622, -814, -1271, -1850, -1686, -1085, -721, -529, -499, -197, 61, 111, -449, -1169, -1332, -856, -167, 79, -12, -539, -1371, -1314, -1174, -537, 341, 964, 1138, 871, 204, -773, -981, -82, 568, 557, -115, -1052, -961, -25, 500, 784, 599, -170, -1397, -2644, -2324, -937, 762, 1986, 2667, 2878, 2097, 802, 34, 45, 348, 267, -381, -1247, -1031, -742, -453, -452, -910, -1697, -2204, -844, 888, 2512, 4044, 5226, 5906, 5738, 4914, 3187, 1102, -550, -1395, -708, -87, 50, -600, -1063, -318, 933, 1637, 1666, 964, -380, -1481, -1962, -1591, -1251, -607, 484, 1527, 1849, 1645, 1101, 558, 87, -188, -602, -591, -367, -251, -321, -616, -1348, -2266, -2584, -2820, -2759, -2250, -1614, -1023, -504, -448, -525, -760, -1040, -1106, -1033, -1132, -1637, -2020, -2441, -2996, -2749, -2542, -1541, -598, 348, 1045, 1352, 1122, 649, 163, -443, -1137, -1951, -2464, -1869, -316, 961, 1714, 2101, 1894, 1188, 291, -491, -689, -1058, -1564, -1795, -1833, -955, -146, 308, 323]
14011C23a47o92o11n11l59K83J94N08K39k30o81O0P93e55b07B2L24O06N72M49
13991A973K41n9l42n91B60h66k91a90E40Rj70a33m28l97l58O6Q4J73K35c25A51
13969H58K48j3J07J20N3j15E62c88q84p55o14M30O09O44J53O1L4j42m39j56L85
13948a062L00J51J26j81m76l49Q1L06e46e5B09F2f2A31P69P08M63J54o07E23f82
13926a646k42L51O82q4p56l36J44J47l29j36R4R06d24B99Q7j74B9b54k0A75O05
13905G80N47P6n78e9o66N1A26J115J084N19r2o46G67i5B27K34N29K77O8m2qj1
13883A274j24l21C05d15p92l75L98n45l86P77e17B30K73j9qB38D7a42k12j05J0
13862d49b22E4L37O54M71M23M35kl20k92p2M69O16M14J20l37p68r63A65h10o04
$$ y = [323, -147, -839, -1450, -1961, -2320, -2037, -1843, -1335, -1096, -1326, -2007, -1947, -1154, -555, -207, 22, 346, 952, 1524, 1973, 2214, 2155, 1813, 1222, 260, -866, -1157, -190, 540, 549, 379, -133, -561, -958, -1316, -1250, -1166, -993, -758, -325, 151, 858, 1106, 1093, 1200, 1320, 1373, 1258, 562, -388, -1272, -2027, -2641, -2211, -1602, -958, -805, -744, -710, -852, -1291, -1447, -1062, -762, -611, -485, -666, -1142, -1491, -1410, -1104, -546, -55, 209, 62, -62, 131, 900, 1608, 2071, 2225, 1618, 523, -682, -1646, -1888, -1537, -855, -939, -1695, -2031, -1887, -1740, -2069, -2205, -2111, -1205, -424, 299, 386, 212, 29, -254, -274, 175, 780, 1327, 1403, 825, -59, -725, -674, 126, 1241, 2325, 2844, 2752, 2106, 767, -95, 227, 461, 990, 1267, 1335, 1293, 1285, 1274, 1150, 829, 305, -415, -1207, -1582, -1184, -1729, -2115, -1338, -517, 230, 503, 484, 476, 238, 47, -142, -354, -459, -449, -222, 54, 391, 1045, 1516, 1939, 2374, 2372, 2052, 1760, 1688, 2157, 2773, 3187, 3307, 2970, 2202, 1239, 165, -810, -1414]
13841a414l6P2j20j71k77m25J32O62N62M40L2r4j93N1L03a19C69L96N33N20P70
13820B588N05L06m47p26p90G07L1L12K85k92D94a13m53p3J44r8pl84n55j15p7
13799a731g23A05P80M46R0k95E56b16p60m82e64C81P00N32K85k24p44b25j192
13780a417r09j8P15O93d68C79R18O77M55l0K2K11R1J30q0j52m36o44G50G9c34
13758b84J34G3J63L8e9p37r55m52J100A3J127R90N75l20j100c07j324j111R38
13739a804h72b37A38L42K38N8A14g10p37M75K98L15J40l45p02p74j48m39p71K62
13719c136L79O68R12a17F11J86l04G1a62A59J47l0F2b3A48K54O08K2l60A95c30
13697g06k81r4K83j44l72k08K9Q9J59J68j49j70J78L96j22L98J3r3l33n11J08
$$ y = [-1414, -1450, -1378, -1498, -1669, -1946, -2371, -2239, -1577, -1015, -575, -543, -637, -830, -779, -476, -119, 369, 765, 1298, 1818, 2588, 3093, 3399, 2952, 2226, 1436, 707, 738, 1050, 1335, 1043, 494, -113, -566, -639, -495, -593, -600, -984, -1539, -1654, -1731, -723, 105, 885, 1331, 1421, 1126, 556, -216, -976, -1458, -564, 381, 1081, 1613, 1898, 1674, 930, -225, -1417, -2326, -2344, -1629, -936, -468, 379, 1297, 1974, 2429, 2399, 2421, 2632, 2723, 2853, 2773, 2621, 2185, 1541, 750, 79, -334, -284, -150, 73, 236, 274, -59, -796, -1751, -2203, -1103, 13, 1140, 2130, 2705, 2385, 1285, -307, -1631, -2742, -1804, -872, -237, 138, 480, 718, 776, 114, -710, -1447, -972, -674, -359, -219, -564, -1266, -2040, -2188, -2627, -3398, -3136, -2757, -2089, -1177, -117, 611, 797, 493, 71, -162, 159, 306, 276, 62, -23, 148, 402, 1010, 1032, 672, 195, -330, -706, -987, -1081, -798, -942, -1314, -1522, -1493, -1404, -1245, -1077, -1226, -1396, -1218, -822, -944, -546, -533, -626, -959, -1470, -1362]
13676a362L61d76g9C3L8J82N65P03Q67L31m45q93C37e45r55o97N41M75N58G0P22
13655G92M85K14k68F01b25r96l12f63D1K46J77M6j15A91b12k25J35Dc1r0j93k17
13633e31J99a37j33a20A64j0o4J39K84N1k40A17b21n32p86J9P24J82J69Lp7j80
13611f99L39h9j73k08n61o56p10P38L50K43J89K15N3aH81P39K20l38o94c20j523
13590a843N66D42J563J019L05k80n16k09m60l12n61A35h21m76m1k4q8K41c53C67
13569I78J70Nl24l04e1o45l22J77J46j17m73q29l66O64e95E35J023M34J10k35
13549A867m27k17j33j91C70c47p26l57r8M82b00E93L71l5D02c54r60M7O27a90
13528FR3M09K90J46o3D31a14k71k21k65j95J6J82j76k83j03j0r1j71Q2N62d29
$$ y = [-1362, -1001, -476, -79, 33, 71, 253, 818, 1521, 2388, 2719, 2274, 1381, 337, -545, -1500, -2197, -1656, -1181, -623, 70, 792, 1277, 1491, 1223, 601, -225, -1221, -1533, -663, 41, 287, 464, 510, 395, 191, -212, -437, -302, 4, -31, -121, -314, -531, -332, -137, -270, -120, 164, 154, 90, 229, 513, 564, 324, 117, -221, -753, -1539, -1520, -796, -614, -445, -442, -519, -699, -360, -89, -262, -470, -1031, -1687, -2397, -1659, -1309, -1066, -877, -662, -609, -1, 881, 1620, 1840, 1502, 808, -320, -1843, -1277, 442, 2005, 3024, 3329, 3049, 2533, 2324, 1864, 1552, 991, 135, -821, -1297, -1338, -1362, -1450, -1209, -353, 367, 978, 1148, 1153, 829, 525, -51, -696, -1018, -841, -695, -812, -1285, -2114, -2480, -1816, -595, 535, 1558, 1992, 2102, 1867, 1440, 1223, 1090, 899, 370, -347, -1073, -1430, -1528, -1046, -200, 593, 964, 929, 402, -354, -1314, -1267, -640, -190, 6, 99, 508, 798, 944, 881, 431, -114, -385, -606, -871, -1066, -1050, -868, -1044, -1327, -1430, -1440, -1531, -1702, -1620, -1058, -429]
13505E1e5l48m31o65o36o55P36m33Q46P08b19D39N66J61k8j66j71l62b0p1k17
13484c08j39J30a44Jk84k47m8p8p1o3J02L4K32J30j3l0J7nj37K2r4k15j58k02
13460a251k78k66J69L38J52n40q2N64c04C50K73j28A11c34k28j12k46J5j3k50
13440a168k63k52L16N35c94D7K98Q7A77e07j075M0b99A021J181Q27J53n76r86
13421A620E86a97m80N4K74A04L08O49K69k35C39f31M8B3N71J16J77J83M8l40A13
13399a296j346m95p72J30J091R82f83b77O5m45l72j48j14k67k21jL89J97k14m6
13379a454L33N24a94M3k22l62k69l43J05N62K50j0J15R5N5j13n80p26l97J66M92
13358a333O59b06N9k25m50l43m24o68Q5J8R4K46L16N4j44k91mN48M52b08B33J53
$$ y = [51, -55, -403, -834, -1499, -2135, -2790, -2054, -2487, -1641, -933, -219, 439, 1005, 1166, 1138, 972, 801, 439, -20, -91, -308, -447, -317, -144, -143, -427, -674, -722, -800, -871, -934, -832, -798, -566, -436, -449, -479, -462, -467, -604, -582, -676, -891, -1049, -1251, -1529, -1795, -1626, -1288, -1136, -1676, -1758, -1194, -304, 350, 623, 495, 111, -334, -562, -674, -920, -905, -918, -1168, -1431, -1683, -1367, -832, -394, 47, 345, 432, 177, -507, -1582, -1542, -299, 1021, 2202, 3029, 3182, 2606, 1620, 586, -197, -677, -623, -349, 104, 412, 1061, 1330, 1095, 339, -631, -583, 23, 594, 710, 887, 1070, 1118, 778, 113, -1296, -2642, -3137, -3909, -3779, -2688, -1706, -683, -277, -212, -657, -1029, -1177, -1291, -1558, -1779, -1780, -1391, -1194, -1408, -1454, -1121, -597, -194, -151, -373, -735, -1004, -1347, -1242, -680, -430, -440, -325, -230, -175, -288, -868, -1594, -1991, -1825, -1333, -674, -206, -147, -372, -822, -1165, -1589, -2257, -2172, -2154, -2060, -1814, -1498, -1444, -1588, -1879, -1883, -1335, -883, -208, 233, 386]
13336C86D9i97r28j29K24N73e22E51L81k70A93c65j114n67N25M59K40m7J51N6
13316f62m80m84n6K69J53r8o7K60d78C54P36L4k93l08A95o4a4j56k95k79l21k89
13294a354k43j37L96e23B03O74M72L59L87P80J034Q97M96o68j304j636B07a279
13275b356P26f55b93J0n35q45K67N20c58J29qk85n62p36Q77B49N48J99l05b0p97
13254h17k84M85c05J27j60k10n50q76m39K63K40P10J28m47k60h71d12l3k13m32
13234a090L74g9F53L09l11A7f35q8n0c61B9O11L87J26o9j41m4J50N14N34O8m30
13212A735n32l90l30Q4j8G7e90m80j84Q6J54j58m23R6N33nk67k99m5K25J02Q1
13190a174N7l45P4L38J87k8m66n01L69L37K29o0l55n43p03M72L83k5k69K78M73
$$ y = [386, 49, -997, -1925, -2054, -1830, -1257, -522, 551, 932, 662, 193, -365, -1479, -2046, -1521, -1062, -822, -869, -718, -662, -1142, -1626, -1682, -1413, -1260, -1358, -1425, -1165, -478, 354, 1090, 1124, 831, 523, 195, 131, -14, -170, -465, -744, -1065, -1354, -1597, -1734, -1338, -523, 203, 877, 1349, 1708, 2095, 2875, 3909, 4806, 5302, 4634, 3330, 1694, 207, -1279, -2356, -1630, -655, -293, -283, -818, -1663, -1396, -876, -358, -229, -237, -522, -1084, -1820, -943, 249, 797, 996, 691, -20, -817, -1101, -616, -305, -178, -338, -548, -1098, -1974, -2413, -2150, -1910, -1200, -1072, -1519, -1779, -871, -412, -445, -658, -1090, -716, -79, 653, 962, 651, 17, -635, -723, -773, -361, 29, 640, 1027, 1153, 1084, 943, 899, 1049, 1563, 2097, 2165, 1735, 1203, 813, 483, 567, 549, 77, -590, -1070, -1254, -1168, -1014, -1172, -1595, -1499, -966, -971, -1238, -1537, -1582, -1357, -1255, -1174, -1117, -1462, -1388, -1050, -863, -891, -1357, -1858, -1489, -1152, -923, -983, -1338, -1881, -2584, -2112, -1729, -1754, -2023, -1745, -1272]
13169a272B74R67j15B11i01k57M1k27m74m80o7P3N21O14K53MJ07m11K08d34K7
13148d07l36k65k42m49j24m4K04J97L32M96K44m45l97JK07K59L80a12c8j30Q0
13127h8A66K47K40L16L74M92r3O5m42C17i78q31K90N2p6K67j08f50b6B91b89q28
13105a117j126h77A288J922J206M20m40r36r44n89J39J77q6l73m77E59A53F4b58
13085h85n01q9L93e03k15J14C39Q16N30m9j66n38B17e77J1a5D25N94O60N34M14
13064B627K63p1m20q69C51h90j008l68N20M19O02a73am30j24i4F27M52J5k62j46
13043F86j94B06b17r78p31P88M48g6D35P28N33k28o47l98a94j03J08o4m88p45
13023a486r15K55e43A092R35M73j65p82D95e78j035m9O84L71J38J26a11C3P9J32
$$ y = [-1272, 274, 1241, 1126, 211, -901, -1158, -1117, -1344, -1818, -2298, -2365, -2292, -1771, -1157, -904, -900, -793, -1204, -996, -434, -407, -743, -1008, -1250, -1699, -1823, -1867, -1663, -1466, -1134, -638, -394, -839, -1236, -1235, -1028, -769, -389, -112, -38, -168, -88, 166, 413, 653, 969, 1343, 1835, 1742, 1807, 1365, 317, -978, -1809, -1519, -1467, -1543, -1276, -1384, -650, -26, 291, -289, -1117, -2243, -877, 1288, 3210, 4416, 4836, 4396, 3460, 2516, 1927, 2066, 2243, 2157, 1784, 1307, 559, 153, 64, -258, -885, -1386, -1475, -1082, -503, -718, -604, 339, 1155, 1685, 1636, 1470, 932, 217, -577, -566, -15, 425, 1019, 1679, 2213, 2627, 2890, 2819, 2399, 1530, 351, -890, -1898, -2266, -1746, -1327, -725, -173, -1, -431, -555, -94, 627, 1079, 1094, 832, 686, 492, 206, -217, -1195, -1926, -1138, -690, -76, 435, 1163, 1696, 1468, 821, 423, -194, -297, -189, -253, -741, -1486, -2401, -2146, -543, 1092, 2027, 2500, 2335, 1553, 495, -578, -1613, -1662, -978, -607, -469, -343, -111, 33, 112, 244]
13003B44J62k5k5A58a56k62J11H3L49K51j0j01k85C4b40j64o3e0E71N31L70J37
12981A609k66l40k17l00i8l99m90J88b03A96dm11o22p62o1P39J82k38n00o21K22
12960b076l59K86O82P19c72m4m12o98k30K25q0j37QQ6K44M72d24A28O81N10K64
12939A583k6n02A98a071j254J050d30J71l87o95o52N09K36l9k47k65R1N16l6k04
12919a432n0Q8J58j7j86J20M5e31R5l36l02k05j109r64O46R71f71D01L78R4m31
12898D42d28q01n22e15B10J55C8d10k94b89D38N9L11L42k1K23K51r9k68m76C09
12876b8k52j04R8Q5l5j40m14q89J59b5A220O65J29l23o47B12e00n22l6K64L69
12855d25J73o7j19j60p9a24D13N85K63k03k26m07a69o13l61j70p5L47c67C59N47
$$ y = [244, 406, 381, 356, 158, -156, -418, -307, 83, 432, 683, 673, 572, 287, 34, -240, -404, -467, -50, 571, 1102, 1472, 1609, 1343, 1003, 786, 486, -98, -497, -987, -799, -203, 196, -4, -415, -1037, -1799, -1860, -1121, -939, -1177, -1677, -2298, -2076, -2435, -2149, -1467, -748, -372, -416, -828, -1526, -1756, -1531, -1611, -1748, -1740, -1654, -1410, -938, -424, 128, 809, 1319, 1583, 1557, 1055, 198, -1071, -2325, -1275, -430, -259, -646, -1341, -1993, -1484, -1248, -1287, -1534, -1799, -1708, -1192, -1228, -1432, -1482, -1394, -1236, -1253, -1439, -1319, -1274, -531, -436, -772, -1074, -1279, -2388, -3352, -2706, -1735, -671, 401, 779, 873, 442, -428, -1229, -1751, -515, 210, 365, 38, -410, -704, -289, 438, 497, 808, 1150, 1129, 1352, 1603, 1504, 1236, 760, 309, -28, -280, -384, -286, -201, -236, -376, -790, -1679, -1520, -25, 1220, 1885, 2014, 1691, 1044, 212, -500, -1022, -1058, -794, -425, -252, -319, -438, -598, -677, -124, 413, 998, 1261, 1058, 832, 425, -169, -782, -1143, -1313, -1388, -1041, -367, 359, 906]
12834I06M14J14m07m92I8g6C8J63P5J20K55K95J83K21k5J1j3K83K30J063M80j09
12812C270p02q22q06a97q17o42J76N12M48b48e6B0b08l14k89l79l34l49Q8M40
12792a345e25f6F45M92L65n0k91l41B76c24l29j71K01a62D71O08N72J03n23B0
12771a733m35i54f7D97j01c58o82p17O13K17q6l8m7a47D08J62j94a3p76j085O34
12750a240L87L45b37B47K55b46j188o36P55d92e2%l71l64J18J58K43g9A5d70q82
12729a352p41k60L9L70m6K86g51A82N65K26j17m00d0p23q03k49j14m35N58f54
12708I9f7k84m38o31k92N27N39A23N64M26N30K76m21p25e97j466k6f52D53N38
12688I91m2m45a76n67m62j74o3Q7L1l09k01o3n4J97M32N61c50a11C7J0c43p46
$$ y = [906, 1320, 1434, 1027, 535, 98, -76, 38, 201, 276, 396, 651, 946, 1129, 1350, 1325, 1336, 1323, 1606, 1836, 2899, 3379, 3270, 2568, 1746, 940, -197, -1014, -1656, -1480, -968, -520, -248, -56, 20, -208, -522, -811, -1190, -1524, -1873, -1785, -1345, -525, -66, 645, 1137, 1502, 1452, 1161, 820, 276, -324, -653, -824, -623, -162, 471, 1079, 1651, 1754, 1231, 20, -1733, -2168, -954, -67, 497, 396, -358, -1040, -1757, -1144, -927, -1013, -1051, -1098, -147, 408, 570, 376, -13, -789, -1874, -1240, -853, -508, -237, 247, 502, -246, -1434, -2070, -1315, -492, -52, -52, -423, -787, -669, -511, -268, -79, 15, -470, -1352, -2093, -2353, -2314, -1944, -1990, -1704, -751, 182, 747, 973, 856, 456, -40, -763, -1566, -1815, -1929, -2364, -1806, -654, 99, -67, -351, -789, -1420, -1712, -1185, -646, 123, 687, 1113, 1643, 1919, 1498, 773, -597, -2063, -2089, -652, 453, 991, 949, 504, -176, -743, -1205, -1379, -1442, -1355, -1324, -1633, -1834, -1897, -1951, -1754, -1322, -761, -350, -111, 37, 47, -343, -1089]
12666a089n15n88M31O23L55K75A7N66L70K93k3L9k2j47l71A93c33m16k59k90m07
12645a705O61B68J285R74L59o42j117c21p96g8I29L21n37A3d88j22n2P8kl41p71
12624a698J36b52I93R54M93r1m39p09C44g66j059Q46M83A39Q94R76P80O34j13
12605C310m65p56j013B22e62l97Q2d01B74O20L61j37l18C40a23k84j90m08n58
12586a563m21j02K29kn3k01k52K92J25M04e30G12J022J25l99D05i09J17a86E44
12565I79J79O7j25k30m03j81O7J90J01L8J62P7K77n0m7m48a97j043q91k50a013
12543C49R12N64K5j54K28L38N35N06K6q18A137b07m12lJ91P9j99k98Qc07E11Q41
12521A352L59k44F26d48j076l95J21Q38c34L0K7A19M40L40Rk92b36o27d25G9O0
$$ y = [-1089, -1604, -2192, -1761, -1138, -783, -508, 17, 583, 953, 1246, 1223, 1262, 1240, 1093, 722, 193, -333, -749, -1008, -1298, -1705, -1044, 268, 1553, 2527, 2886, 2244, 1127, -321, -1117, -78, 929, 1250, 713, 13, -488, -610, -662, -584, -586, -927, -1698, -1562, -252, 993, 1947, 2440, 2349, 1910, 1201, 344, -766, -1825, -979, -496, 139, 1033, 2009, 2789, 3423, 3310, 2845, 2089, 1076, 222, -562, -959, -877, -401, 274, 894, 1255, 1118, 800, 340, -123, -407, -597, -1005, -1563, -1984, -2086, -1857, -1859, -1912, -2113, -2365, -2073, -1948, -1544, -530, 712, 1734, 1859, 1460, 405, -909, -792, -186, 544, 979, 1158, 1225, 1100, 870, 467, 286, 353, 543, 644, 682, 844, 921, 1198, 1148, 1101, 653, -197, -1240, -2131, -2381, -1013, 349, 1261, 1825, 1850, 1696, 1924, 2262, 2797, 3303, 3329, 2511, 1137, -207, -619, -622, -431, -352, -551, -849, -841, -307, 511, 1352, 1711, 1467, 626, -448, -1524, -1919, -1798, -960, -334, -304, -277, 119, 559, 899, 908, 616, -236, -863, -425, 79, 139]
12500A39b75n31j228K28d18H23Q74J60m35B68a079p89L54P24b16E5a03o83q26
12481a612P6L35G7J202O68K56k97k27n5k82n15B15b36l48p4k62O1L21r4n46o10
12460a788n53L38M34M51L43L43A1N12N25M53K47J14k14o90B57g29J34K00n8l50
12440h03o69o11Q09a01l04l04Q1C38J783E20P13M00k27G02F9b84a25C8M43J9k1
12419D79r7A79M1J34G1b43j71J7a93C52M54K11m7m54c48q39j017P51O29p2J43
12398g53J31N6j30k70j89p0j02j84k79%L10O97c11a55J8j37K7j04m5L5J15D7L39
12375C86G9c48m01l37l68r4M40L29b78D30J64A44f05r00M14j80N13K05j86o60
12355a399n65P72L65Q8j06l06l25j58j27n8J39J12q8l31J18K34J47O90a10B24
$$ y = [139, -275, -806, -2034, -1806, -418, 823, 1697, 1857, 1422, 268, -1079, -1868, -1514, -790, -216, 55, -103, -786, -1612, -1536, -1201, 77, 1279, 1947, 2203, 1906, 1679, 1624, 1342, 827, 215, -236, -584, -658, -920, -859, -538, -632, -1178, -1788, -2341, -2003, -1569, -1118, -775, -432, 11, 523, 1048, 1501, 1748, 1862, 1648, 958, 257, -729, -595, -395, -453, -803, -1472, -2083, -1274, -101, -405, -709, -628, 338, 2121, 520, 1233, 1633, 1406, 702, 69, -284, -125, 38, 481, 500, 479, 382, 179, 220, 354, 71, -243, -414, -397, -193, 352, 806, 1017, 970, 516, -348, -1187, -2204, -1453, -824, -896, -753, -622, -566, -696, -966, -1155, -1225, -1327, -1511, -1790, -1790, -1480, -783, -311, -155, -137, -274, -247, -351, -396, -361, -246, 47, 386, 79, -348, -749, -1086, -1454, -1548, -1108, -779, -278, 430, 594, 144, -605, -1505, -1091, -1271, -758, -553, -739, -1399, -1964, -1192, -827, -739, -845, -1151, -1476, -1634, -1761, -1819, -1680, -1568, -1656, -1987, -1869, -1635, -1488, -798, -110, 224]
12334E08K66K13R7k94B86c34q20q49n55K21m1L30k86Q4M82N33d94C53M97J77p6
12313I51k45a06o39j100p56r06K50P53a001C62J241Q11M97K33p4n27n10q29D68
12293F24J344J697J346J64n80j365A502c9r16m55K33M39J93j31j58j89J36L77
12275e10b1A47nl2dj16n89p14l37M39O03b66A08J29k5a0o92r71r52J80N82P37
12253a126b09A152J377J208J120O22M20k39n20j030j277A203a5o66m01K55c76
12235gA63Nl7a0CK9a69m97q96j113L58J137a13F90J36j55A12g00r49n93R75d74
12212B63L81J20j34B37b35n55l01J34M8J16J51b46F2J32J06kI5l3j8J90M01L6
12190F71j20k5K13O24M95M70k04q01C88h64N9A97J220J120O35l05o64q11C94c43
$$ y = [508, 774, 987, 1084, 790, 286, -334, -1154, -2003, -2558, -2337, -2378, -2048, -2334, -2250, -1768, -1235, -494, 353, 850, 1027, 951, 706, -106, -745, -1845, -2601, -3507, -3257, -2504, -1001, 362, 1603, 2414, 2911, 3144, 3070, 2543, 2033, 1204, 468, 624, 1968, 3665, 5011, 5175, 4595, 3230, 1502, -39, -955, -1410, -1177, -738, -545, -676, -834, -1023, -887, -510, -21, 147, 142, 110, -4, -120, -709, -1423, -1760, -1321, -718, -266, 108, 237, 212, -10, -702, -1673, -2625, -2445, -1863, -1126, -209, 1152, 2529, 3737, 4857, 5479, 5899, 5660, 5140, 4110, 2833, 1203, -15, -681, -1082, -827, -376, -7, 163, 168, 131, -10, 3, 32, -169, -666, -1562, -2675, -2317, -1180, -113, 690, 826, 671, 112, -700, -1649, -2242, -1267, -474, 263, 644, 764, 630, 237, -235, -790, -1091, -957, -909, -793, -642, -246, 62, 194, 300, 298, 95, 62, 44, 234, 635, 671, 551, 526, 739, 1363, 1858, 2328, 2124, 1323, 388, -864, -805, 197, 1417, 2537, 3172, 2867, 2203, 1392, 394, -343]
12169g66l50l71n15k79o0J04n3n1J74L11N39f55a90A44J07J45A96a89k48K07B78
12147I36M53K97J1k65j85k32K9K64L44J04j35n17B96e48o20n69k89j32K1J06J72
12126a859J79q5m0K13M53K63n0L27B54Q88Q28L27m19F04d08A245K406J197k92
12107D556j500C15f50A330j43O6m78f41k026g6B176J450N80n93r44j333i6j731
12089a827j081R98f39C44M91M16k31B64i43r78k94j01j37L06M16J58d55A128J270
12070B398M98k75j163C21a11H51J428j23e9C735J0320J2576J1907Q443K606k668
12054D6919q340j1730j1784E655E37Q7b15k048r71J293R35J13J80a52N0p50j070
12037a922M37c86A55i8m34k80o20O7O55k0m6L21J28k42q8k33K13a49E97M22L5
$$ y = [-766, -1116, -1487, -2002, -2281, -2341, -2237, -2290, -2341, -2167, -1856, -1317, -655, -190, 144, 251, 396, 196, -189, -437, -230, 278, 936, 1389, 1686, 1697, 1432, 1247, 1015, 1044, 1308, 1652, 1756, 1621, 1104, 296, -548, -1168, -1737, -2026, -2158, -2137, -2031, -1859, -1680, -1765, -1805, -1592, -1139, -876, -926, -599, 254, 1142, 1970, 2297, 1878, 604, -408, 1245, 3651, 4848, 4556, 3056, 315, -650, 1330, 1187, 1253, 775, -641, -2667, -76, 2176, 3626, 4206, 3613, 2669, 1336, -96, -1827, -2908, -1910, -639, 344, 835, 1251, 1020, 264, -943, -1921, -2215, -2316, -2453, -2147, -1731, -1573, -455, 1128, 2398, 2896, 2621, 1458, 321, -111, 851, 2279, 2156, -59, 3735, 14055, 26631, 38538, 46981, 49587, 46919, 38579, 26849, 15065, 5655, 537, 624, -215, -2263, -3234, -1941, -1006, -893, -713, -152, -102, -852, -1922, -1485, -386, 155, -98, -532, -812, -1432, -1365, -710, -730, -776, -455, -327, -569, -657, -890, -677, -149, 597, 1019, 1054]
12016A054j80k74k76h4n97p05l72M76N29K51ma91E43J056Q78M78l33j012E70b48
11995g83k95K8J68J09p7m82l57k10L27d10A127J253M20r35e36J66D938N296M582
11976A4816L133O75j669l514m450m292A270h95j29D61J316L44o57C01a111j201
11960b312k69J13O22f53F69J208R74Q49k9m32k09j34J0J92k07j27k98k78l11M9
11940A926j85l53j12P2n59f0o28P0a33B86Q1A10f06k32l27j29p3q6L7m4m23j45
11918b028J51L41M23N32A45O96M70J18k18B83e71l18j42K43l39p23p44J079N74
11899i41J53j93k37M73A76O87JC39f13n90j54n3J22N06b28A53N2i6l75m65k74
11878a210KK53M17A83P72O51K64j94p29e0j107o92J59e92E32N93P3m69D0d20k12
$$ y = [1054, 874, 600, 324, -84, -681, -1386, -1758, -1282, -753, -502, -506, -191, 543, 1599, 2477, 2955, 2622, 1610, 570, -248, -783, -1078, -1050, -882, -773, -850, -1332, -1689, -1899, -1572, -410, 1127, 2380, 2800, 1865, -536, -370, 4938, 10234, 14816, 17949, 18624, 16955, 13441, 8991, 4699, 1270, -895, -1024, 461, 1777, 2121, 1464, 301, -1111, -2312, -2581, -2468, -1846, -653, 669, 1877, 2851, 3700, 3671, 3239, 3030, 2896, 2906, 3098, 2891, 2764, 2466, 2188, 1877, 1926, 1741, 1388, 1276, 1348, 789, -60, -688, -618, -133, 286, 367, 110, -606, -838, -1165, -1294, -1367, -1453, -1416, -1460, -1883, -2028, -1877, -1536, -1113, -581, 145, 841, 1311, 1429, 1211, 283, -571, -889, -1031, -788, -1127, -1850, -2594, -1515, -941, -788, -981, -1218, -745, 176, 863, 864, 339, -613, -1203, -1357, -1410, -1288, -782, -228, 153, 205, -96, -471, -936, -1210, -1208, -955, -538, 183, 955, 1606, 1870, 1676, 947, -50, -1157, -1849, -1690, -592, 532, 1125, 1198, 729, 40, -420, -632]
11857f32K00a37b1m04o74j73K79kk23n29l4L98e59A26M01m9j59F6a66l21l03j12
11835i02J41N8j33k28m66k99j81N75f13A04N16J07A23i13l94l5e98C67P76K18
11815A361k01n04b65j617q3f23H47Q55n41d67j810d73B845K413K43n04j464L42
11797C875N777O452M454L554J762j31l541m699n880E494B090J290K243l35j648
11782C640A218a234j628J267g69J24k16n76p13N04P08L81m41r65M35K9O39Q9n41
11763a312q01k18K34k5k92r0L66M24K66r9K79M77L18p3j82K43A96N71L52J3E00
11741d83q64K37c77A02Q9qa37l98o12m53l03l8L20K99e78D11Q75O29K50J74K59
11720B598p4r5R0j70n08p34B94b32j38k5n3m9K0J31Rj80O7m12l56n06l82m8L85
$$ y = [-632, -432, -137, -21, -425, -1099, -1272, -993, -995, -1218, -1747, -1781, -1383, -559, 126, 527, 478, 319, 66, -166, -487, -790, -902, -761, -703, -836, -1064, -1530, -1829, -2010, -1435, -613, 104, 620, 727, 123, -913, -1307, -1342, -598, 367, 1143, 1361, 1160, 656, -265, -1882, -1965, -623, 847, 1702, 1161, -467, -2277, -473, 2845, 5258, 5501, 4997, 3533, 3875, 9652, 16104, 20558, 24112, 25874, 25743, 22202, 17503, 11623, 5494, 2090, 3380, 5623, 5288, 3640, 1218, -1234, -2862, -1595, -769, -645, -861, -1437, -2150, -1646, -938, -557, -998, -1963, -1528, -1499, -860, -771, -1312, -2113, -2331, -2097, -2122, -2414, -2504, -2138, -1714, -1448, -1547, -1268, -791, -473, -546, -728, -485, 196, 767, 1119, 1132, 500, -483, -1347, -1110, -377, 102, 191, 183, -137, -535, -1147, -1600, -1903, -1941, -1621, -1322, -578, 411, 1286, 1915, 2165, 2339, 2598, 2524, 2429, 2519, 2349, 1841, 1107, 294, -232, -370, -395, -448, -497, -477, -346, -337, -517, -450, -862, -1218, -1724, -2106, -2154, -1769]
11697a769L05J71qk59l46l56nK84P1k7j4J26M11K03J04l00j93k21e73F58R00O51
11675B209K51j47k34n66n34B59e32p16n23l45j8M04K56L14J56p4l41l73K0m1K71
11654a542M62K72j18j01j01k0K9j26l41j25j26L75M69K83K15d5C18Q6A78b38R4
11633a44D00M46K18j48B77d20n26J4M47B64O89N15L52K0N8p8o67B70e01l86n9
11612i46L1j27K03j36n65j69j67n0J27O65d08J15m21m10l60m49o39l62O52P62
11592a520N65M04b60A09L68K90l0o5j19k02A4b17j26k4q7n5M8k3J14K6l87r20
11570a651q34M46j210K06j13e23B743K715m33j076j940e17j342j094Q9q08J030
11553b642h11E80J000M50p51b93k166K9l31i65A21b8p75k41M81I16P39o70e74
$$ y = [-1769, -1464, -1293, -1301, -1560, -1906, -2262, -2267, -1983, -1912, -1939, -1953, -1827, -1416, -1213, -1109, -1409, -1602, -1823, -573, 658, 1558, 2209, 2460, 2313, 2079, 1513, 979, 259, -532, -1248, -1771, -2116, -2134, -1730, -1474, -1160, -1004, -1078, -1419, -1792, -1772, -1813, -1542, -1080, -808, -926, -1027, -1128, -1148, -1119, -1245, -1586, -1711, -1837, -1462, -993, -710, -495, -45, 318, 404, 178, -238, -144, 400, 846, 1064, 916, 277, -420, -946, -932, -485, 264, 953, 1468, 1820, 1840, 1898, 1820, 1153, 270, -501, -887, -946, -915, -1042, -839, -975, -1540, -1709, -1876, -1926, -1799, -1134, -408, -293, -714, -1124, -1484, -1933, -2572, -2934, -2282, -1520, -955, -551, -260, 109, 477, 767, 737, 672, 553, 351, 14, -217, -343, -367, -454, -509, -461, -484, -370, -344, -731, -1651, -2485, -2039, -3249, -3043, -3156, -523, 2743, 5458, 5025, 3949, 2009, -517, -1859, -2953, -2864, -3672, -2642, -811, 580, 1580, 2030, 1279, -293, -2459, -2430, -2761, -965, 121, -28, -803, -1044, -563, 916, 1655, 985, -574]
11533a822l82N59L80q23M46H82J828L71j079c36q31I12K255L4j228e27q54B1Q08
11514H29Q01K310M92j413j238f06q42p33i22C03O74k38B50c54r2H3P05N69J21
11495A478n40a34q93r1b65D91J6a4q10q37m46K16j27l60l91j63J66M20N17O27
11475a202L02j82r02j193Q05h02D17O39j24C09d53m71j92o18k86Q7K30M54N70
11456f79c33C3N21O48N18J80jk79n07C75d26p68o47k0M60e97E4J57b16o47p44
11435a607l64P50b32A16c07o67o93n66n89K53J019g52G4O40N4C56b72q01q48o20
11415b541L30O83K84R3M2l48n71k35O23N35p1p69l28R11d98A52K85K15L06L82
11395A340k6o8o2k21p8J0J81K30K60M3j8k68m84m11H8c62q4K6a41A19J95d2m22
$$ y = [-1822, -2204, -1645, -1265, -2088, -1642, 882, 2710, 3081, 2002, -336, -1167, 912, 3167, 3201, 1973, -527, -1381, 21, 829, 1630, 3940, 4432, 3019, 1781, -606, -1448, -2181, -922, 303, 977, 739, 250, -354, -446, 83, 788, 1357, 1478, 938, -134, -1027, -1118, -265, 491, 507, -14, -824, -1661, -2107, -1891, -2018, -2378, -2769, -2932, -2766, -2346, -1829, -1202, -900, -1082, -1984, -3177, -2372, -802, 417, 1056, 932, 309, -453, -924, -1116, -1734, -2020, -1933, -1703, -1249, -679, -333, 33, 554, 1202, 1720, 1900, 1899, 1620, 1113, 375, -426, -1194, -1841, -1861, -1401, -597, 54, 211, -216, -863, -1607, -1971, -1221, -232, 116, -307, -974, -1667, -2233, -2822, -2569, -1550, -752, 74, 714, 768, 356, -272, -1073, -1921, -2541, -2211, -1528, -1244, -1151, -1109, -1457, -2028, -2263, -1640, -1105, -1176, -1945, -2273, -1362, -498, 152, 437, 652, 958, 1340, 1314, 1246, 1184, 963, 885, 895, 1076, 1306, 1566, 1609, 1591, 1323, 839, 428, 88, -362, -446, -420, -141, 119, 314, -42, -464]
11372d64q4B0J075P34K99l37H68g28o79f46J96k96p16j6g23I8M34J61j7J57M3
11351H76B34f03j47A9P68O04J95n27c2q40k82K3K36eA659J461Q00m01j526a89
11330b010nO92M08r0j050q55k70N45L39K93O1K15J80K53J71j43l87o8N94L81j96
11309i42p42j259R11i35d18j15o86j108J048e31J50J76G41J630P27L24m89j083
11291A850b5j808R15b24A33l7i9k40k40k34m47m50P44b47D02M80K03m1k44H9d19
11269g57k87j71k10K0L58K93L56a59N1l73m56m59m36n93Q59b36H73N44j10m90
11249H17A91b31J13A00K33I7c44n92l66l3J9L02L06j81j163Q20C52J878J076o8
11229C238j615f9j377l76N4n83L18c28A110M45n11f30k227O88d15A731K183J519
$$ y = [-464, -548, 20, 1095, 1829, 2128, 1791, 868, -728, -1407, -646, -450, -746, -1462, -1478, -723, 98, 532, 693, 676, 833, 876, 234, -603, -750, 19, 787, 1391, 1586, 1059, -32, -872, -1154, -1131, -895, -5, 1659, 3120, 3920, 3519, 1993, -189, -2010, -2015, -1323, -915, -1005, -2055, -2910, -3180, -2635, -2296, -2003, -1942, -1727, -1547, -1294, -1123, -1266, -1653, -1721, -1127, -746, -942, -1684, -2943, -2032, -935, -418, -533, -1219, -2327, -1279, -531, -381, -205, 741, 2371, 3098, 3422, 2933, 1850, -25, -1833, -918, -224, 133, 96, -99, -339, -579, -813, -1260, -1710, -966, -247, 402, 882, 1085, 1044, 800, 89, -419, -757, -1044, -1215, -1425, -1405, -1047, -754, -398, -159, -108, -481, -937, -1396, -1832, -2425, -1566, -236, 873, 1417, 1307, 817, 191, -231, -118, 100, 333, 97, -344, -936, -1302, -1335, -1316, -1014, -708, -889, -2052, -1232, 352, 2230, 3306, 3238, 1623, -69, -1446, -1822, -1768, -2351, -2033, -328, 1110, 1555, 1044, -630, -2857, -2169, -415, 1731, 3914, 5433]
11211E433n21B257c10A963J467I92J843Q501O055r65l631R106J2760J966J413
11196C8040N1389R3899J13263J08724Q0569L2501k2713p2948j05657j14643r9139
11185A03285D3807n353q35j3726H419M523M470k962F755C075K451j52B666c3A64
11169F29O4l45c22j107f60A485J562K73l73r08G56f54D27K570J977N99q68j661
11151C044A251n66J60k82h48j924d70B610K312J675R13j56o91j381j768I50a267
11133a131d82R8l55p27r19M49j33l72m33q2n7P0Q01R65c06C37M36J07k9L7J16
11112A004J91L74K94K26o3k77o42B95f88j316o76K80R05f49g9A71i1l29k74K6
11092f68K23J91a02A4c51o45q89n08j12R19f19E7P44P53N33L7n05D13i37j247
$$ y = [5433, 4912, 2257, -310, 1963, 3430, 992, 2835, 11336, 17391, 16426, 12795, 21901, 34661, 36627, 38040, 89429, 183328, 296591, 405315, 485884, 518385, 495672, 422724, 317067, 202424, 103285, 43807, 38454, 37619, 23893, 8419, 12942, 17412, 14450, 6755, 3075, 5526, 5374, 2666, -33, 164, 629, 693, 348, -322, -1429, -660, 1485, 3047, 3320, 2947, 2039, 756, -654, 427, 2997, 4974, 5573, 4705, 3044, 1251, 685, 845, 563, -848, -2772, -470, 2610, 4922, 6597, 7510, 7354, 6663, 5282, 3514, 950, -1267, -1131, -482, -384, -739, -1466, -2385, -1936, -2069, -2441, -2874, -2956, -3013, -2943, -2142, -1177, -306, 337, 773, 880, 851, 888, 1004, 1195, 1569, 1863, 2089, 2026, 1749, 1107, 295, -688, -2004, -2680, -2400, -1495, -649, -79, 171, -91, -420, -694, -668, -445, -254, -102, 14, -351, -996, -1885, -2393, -2505, -1586, -619, 57, 801, 1554, 2087, 2124, 1619, 413, -937, -2184]
11072b184K45l08R75M33L68A38L08q6al49k88o54p92Q66f00K73l20m98J84B41
11051A661O98n14H36i5k97a20on94p85L81M62j58l49k64K04G9J250N56R7m56G50
11029d96j100j68K31J19L58c75B25J17a6o83m48K35b33C2d16r94p1b21E65L94
11009I59L11K42K30M3k82D97c94j08C58J268J072L90J07l17o97p71E87d53k76
10990g29p23@A025O61K01k45m75N9K40N86N83K70N2k81o13p69D81d66j273K18
10970a521f82r1m96o63m39J160a7H36P5k14C23j41A9M30J040J418P28P03J3p34
10950C617j266I68E7c65q90p93N11l75K70M8M9L39d48E89Q1H8g80j259l6p35O43
10929b167Q45d06A63J70A41a82m27K51D01Q36M22j12n60A13f81j039k04J67q0
$$ y = [-2184, -1939, -2247, -1272, -839, -471, 138, 446, 360, -1, -350, -638, -1292, -2084, -1218, -600, -327, -647, -1145, -961, 241, 1661, 2359, 1845, 836, -95, -392, -120, -126, -720, -1505, -1124, -662, -820, -1169, -1433, -1229, 79, 1329, 1885, 1982, 1526, 750, -496, -1596, -1764, -1533, -1414, -1056, -375, 225, 342, -16, -699, -1147, -912, -233, 32, -416, -1410, -1481, -221, 565, 959, 1270, 1512, 1742, 1785, 1503, 497, -394, -502, 358, 1626, 2698, 3088, 3195, 2878, 2181, 1410, 587, -453, -729, -1452, 0, 1025, 1686, 1887, 1642, 1167, 1226, 1466, 2052, 2635, 2905, 2957, 2676, 2063, 1294, 481, -466, -1739, -1521, -682, -773, -1269, -1932, -2371, -1211, -17, 836, 911, 697, 323, 182, 19, 449, 1489, 2907, 3635, 4338, 4351, 3617, 2351, 968, 57, -365, -1255, -2048, -1537, -1912, -1642, -1594, -1545, -1206, -448, 589, 670, 88, -780, -2039, -2075, -2810, -2167, -1322, -406, 163, 333, 141, -182, -609, -358, 401, 1237, 1659, 1547, 987, 113, -681, -1720, -1924, -1757, -1837]
10910a837p56R83c53E89N92K7B93a070C23L069L220K190j79k214B303b637N03
10893b134A599K250L76q38j167B85b149p75R60N35N31H97J651J604L826l545j303
10876C130I80b93o80o43O08c58D36M35J36K06J54j69C63c74l94b82b7q34j156
10857b017J41O45Q5o27j103N02R76O95b59C54Q54O99O48N42M00O2p14j186D56
10837e15m2@G13H8f12j389N13o96e4B279J764J149k34k02j454j455m23L40j42
10818A622F18B08K76k5G6a96j00j4m01o41l58L54K71l07o5f64C0J56c11o40p85
10797a736P16M06k30o53p29N34l99nL47K17O8l16l24J94P17i1A001Q46L32j44
10777B035o85A00i07m60r0L40H0J278J77M0j87mm97b64j341L3O20e4A560J965
$$ y = [-1837, -2593, -1610, -353, 589, 1181, 1208, 293, -1070, 323, 3392, 6612, 8802, 8623, 6409, 2303, -2637, -2134, 1599, 3849, 4225, 3387, 2220, 285, -2149, -2924, -1964, -1429, -898, 897, 2548, 4152, 7978, 4433, 3130, 980, -293, -973, -1616, -1008, -358, 436, 871, 1007, 1213, 1367, 1198, 363, -374, -768, -282, -27, -861, -2017, -1876, -1231, -1146, -1773, -2876, -2374, -1398, -703, -259, 354, 1208, 1907, 2555, 3097, 3497, 3559, 2845, 1659, 456, -515, -557, 0, 713, 88, -612, -2001, -1488, -2184, -54, 2279, 4043, 5192, 4958, 4756, 3302, 1847, 1424, 1764, 1622, 618, 208, 484, 459, 76, -196, -296, -310, -711, -1352, -1710, -1356, -1085, -1392, -1457, -664, 30, 186, -311, -951, -1736, -1020, -614, -844, -1497, -2226, -1692, -2091, -2096, -1749, -1532, -1464, -1780, -2104, -1910, -1193, -91, 1001, 1847, 2179, 2035, 1350, 100, -907, -1367, -1457, -1117, 80, 1358, 1535, 1575, 1388, 1384, 887, -264, -1605, -1572, -952, -54, 1560, 3525]
10757C525J153q33A721c23o87A384J847J000l17A858D45K616K595N80j848A429
10740H16K713L096J484J892J886J498K433K041L39j842O91Q195J1482J1483J4478
10725F2685K5237L9964N1100N7529N8512N3777M2298J2770j8256l8854n4952o4020
10713B27790o4434n4310l5760j6202q344j0219j1280o508k945k576k403o98J86
10700A2297j131k386k187q41l69k72p86r35j352E05J49J666N31j106G28L30Q33
10683A891p58e07j279q29N67J48l36a068E10Q47K38k08o22C59n7L7fA48P85P28
10663A661P4n43D41A33M58N15E27d43r24m05J14j98k87N27J75l47m34M21Q87a94
10642A80J57o2c09n00n51p76N03Q13P4p36o43M88g25a57k5k24K8k2l85r02N52
$$ y = [3525, 4678, 3845, 1721, -323, -1010, 1384, 3231, 4231, 3914, 1858, 445, 3061, 5656, 6236, 4388, 1429, 816, 3529, 6625, 8109, 10001, 11887, 13385, 15818, 17859, 18198, 16356, 17047, 25242, 36724, 48207, 62685, 87922, 127886, 178986, 236515, 295027, 348804, 391102, 403872, 385616, 346762, 291810, 227790, 163356, 109046, 73286, 57084, 48740, 38521, 27241, 20733, 17788, 15212, 12809, 12111, 12297, 11166, 8780, 6593, 5752, 5383, 5111, 4325, 3390, 2038, 505, 654, 2320, 2851, 1745, 728, 1058, 1891, 1133, -507, -1786, -2615, -2048, -1900, -2236, -1068, 510, 1357, 1595, 1387, 765, 359, 302, 339, -6, 148, 933, 1661, 1735, 1192, 441, 133, 591, 1106, 527, -443, -1367, -1772, -1658, -1856, -2143, -1616, -1441, -1788, -2222, -1801, -914, -194, 180, 337, 275, -309, -809, -1360, -2136, -1633, -820, -746, -1482, -2125, -1637, -725, -157, -182, -406, -378, -400, -785, -1687, -1135]
10621a135c12J18j6k79l83j40Q1J67J90k68J1L7l19l49j98P4k00j41k25m83N15
10600b120R09A85P46K33k91l35J78M23J48J65P3J6l25o04e86j150l51M90J03j33
10580a627j32p83j45N41R36b39G11P30K56n99I1c10B09N91L32l55I4g39p04m29
10560a872j79Q8q3l69J021d53C16K52j31A16f18l75J85k72o85k5n9K55l57K44
10540a707K04l99n91q3l3N85P48N66K71r4j36n43J45c12g4A41f9@F3O7a95m79
10518f74p08l99j20K21P34E0J206J198N53p5p66j047a87j364r98K34a149C75R86
10499A361m5D26i29q50Q0l27o85n72J201Q82e12j31m56o3M15b96l8j45k91k52
10479a022n44l5o14L8R44C89J549N94L12K39L69M3r5L3p75l09n65m67m24D25c7
$$ y = [-1135, -312, -194, -210, -489, -872, -1012, -931, -764, -574, -842, -831, -794, -1113, -1462, -1660, -1586, -1786, -1927, -2152, -2635, -2120, -1211, 185, 931, 1164, 873, 538, 716, 1139, 1287, 1452, 1525, 1541, 1216, 612, -586, -1736, -2087, -1597, -1494, -1627, -1759, -2542, -2687, -2146, -1210, -239, 711, 1441, 1697, 1098, 91, -310, 209, 800, 1132, 777, 94, -739, -1443, -1872, -2051, -1963, -2046, -2415, -1394, -453, 316, 568, 437, 116, -618, -993, -808, -1080, -1765, -1790, -1849, -1594, -1951, -1707, -1503, -1902, -2493, -2576, -2609, -2024, -1276, -710, -439, -533, -669, -1212, -1067, -312, -74, 141, -69, 0, 63, 130, -195, -674, -1382, -1781, -1901, -1680, -946, 50, 1256, 2454, 3007, 2932, 2166, 1119, -187, -1551, -2549, -2315, -1149, 375, 1361, 1316, 426, -929, -1779, -1699, -2026, -2711, -3283, -2082, -1200, -512, -643, -1099, -1162, -747, -296, -334, -479, -770, -1022, -1566, -1601, -2215, -2177, -1233, 389, 1938, 2532, 2844, 3083, 3452, 3495, 3400, 3433, 2658, 2349, 1784, 1317, 893, 425, -37]
10457b39e3D05O36M45k3k96l08K25J49n15A79f00q65n11m80k5Q39f39B81L96p9
10436E98a32j136q51K86Nl80l71L18Q08P06p1rl87n54p6Q51C12R36L27p28f72
10414a410c5F91Q7B35a167r48R14b44C61j80e81m57k50m57k95L58A33K721K160
10395E014J391O1p84k700K320J2199J3477J1617N461k639p887j1714j2723A701
10380B20K189H98A82g76m60e87j75j13A27M04b80q44l69k01o00K28R45c40C72
10360B59d44j085j028O9O36l08j85N31N50J92j11q62n24i58B48N34C48d60%J39
10340c21R0l38p40q42N87l30l2f96C8a64p27j77d59e1r0o27q98m68L29L22M50
10319a033m7q13k15P69N07K5j44q0j279K00f53B085J550I12a739A455o90J508
$$ y = [-239, -53, 405, 1041, 1486, 1463, 1167, 859, 1084, 1233, 718, 179, -600, -1465, -1976, -2456, -2481, -1642, -639, 281, 677, 598, -132, -1268, -2119, -1833, -1828, -2208, -2579, -2261, -1453, -747, -818, -827, -1214, -1768, -1844, -993, 312, 1248, 1575, 847, -672, -1410, -35, 691, 778, 235, -1167, -2115, -1201, -244, 361, 181, -581, -1038, -1288, -1745, -2040, -1682, 133, 2854, 5014, 6405, 6466, 5682, 2982, 5302, 17501, 30978, 42595, 48056, 45417, 37530, 25816, 13093, 1701, 220, 2409, 898, 182, -776, -1236, -587, -762, -875, 127, 531, -280, -1124, -1493, -1694, -2294, -2066, -1121, -340, 372, 259, -444, -1529, -2557, -2488, -1852, -2160, -2345, -1814, -1264, -1072, -1183, -2045, -2569, -958, 248, 782, 348, -460, -460, -321, -231, -569, -1309, -2151, -1564, -1894, -1926, -696, 38, -164, -891, -1068, -459, -51, -141, -768, -1666, -2134, -1805, -1483, -1033, -1080, -1893, -2108, -1339, -832, -807, -951, -1031, -2310, -2110, -653, 2085, 3635, 912, -1739, 1455, 765, 2273]
10301B273L380L841Q60J563K6212N3314P6182R0959R2324P7400M7556k1060o4166
10288C90638q7424r3868q4787E9679B0792H288l088b75A710K704j784a345p98
10275b143A6li22L95D51K14A3d69r8m17j536J99N38k20k69O72O90j146j090M74
10255b672q1Q78Q72o16R0p28j320J584j002r19J12P10K96A576N442L956J833J748
10237A4555L501k161Q532K583M086N954Q512J1550J5514J5643j3722r505o704
10224E8338o601q977j3191j3069D030a067C065O20A676a177j104P74j135Q55m66
10209b253j35J3K0K07l06j062O99f45A541J132j86K63J4k20r63A41a541L15A210
10189C654K520J995J868J630R61m88j355k085k563k363j450m84o19k02R4m00g13
$$ y = [2273, 5653, 9494, 10354, 11917, 38129, 91443, 167625, 258584, 350908, 428308, 475864, 454804, 390638, 303214, 209346, 124559, 59679, 20792, 8288, 5200, -275, 1710, 4414, 2630, -1345, -2143, 16, 13, -922, -527, 451, 665, 13, -469, -567, -984, -2520, -2321, -1783, -2003, -2272, -1600, -910, -2056, -3146, -2672, -2753, -1875, -1003, -1619, -1529, -2257, -3577, -1993, -2995, -3914, -3802, -3092, -2796, 1576, 7018, 10974, 12807, 14555, 18056, 15895, 24427, 27010, 31096, 37050, 45562, 57112, 72626, 88269, 74547, 65042, 58338, 51737, 42760, 29569, 16500, 4030, -1067, 3065, 3685, 1676, -1177, -2281, -1507, -2642, -1787, -2253, -2388, -2375, -2355, -2148, -2454, -3516, -2817, -645, 1541, 2673, 2487, 2750, 2764, 2544, 1581, 141, -1541, -1226, 1210, 3654, 6174, 8169, 10037, 11667, 12628, 12140, 10785, 8700, 6137, 3774, 2324, 1840, 1221, 1019, 1113, 713, -713]
10171a534o71L30Q26R3o44k34P5n03j1R92b27B38Q88k23j36c05o77J24d16j18
10151e34j97k68r65l23j010J22R12P56O07K98k61j226O5K74M24L65M11a75B70
10131D67L5k10g3l64n17l99n0L48d10B86O20N75P7k40l10j22J08G6d59l9B26B4
10108b58m50o49k24k23N59D90J486N40n10I3f03C908N659N982L994N30j179J8
10090A8912n71L126P243Q084M811r54l077m760n803m704l267L893P994P034l317
10075C4644j7139G001k720L1724L4502L1300K2698N064j6426k3967k6775k4842
10063C7559j8557r491j530M17j346k204j771A419B6P03J440O79J126J030m1j114
10047C849A618g81n66M82B629L098K179k43j738k472G51d09n38p40r11e82A442
$$ y = [-1534, -2205, -1875, -1049, -956, -1600, -1834, -1759, -2262, -2273, -1281, -227, 238, 1126, 903, 767, -305, -982, -858, -416, -534, -731, -999, -1964, -2287, -3297, -3175, -2263, -1507, -900, -602, -863, -2089, -2024, -1750, -1326, -961, -550, -175, 270, 467, 502, 292, -73, -437, -954, -1353, -1403, -1055, -410, 286, 906, 1481, 1558, 1318, 1008, 886, 994, 76, -459, -498, 226, 24, -258, -708, -1357, -1581, -1804, -1245, 490, 1976, 2516, 2006, 93, -603, 3908, 9567, 15549, 19543, 20073, 18894, 18912, 18341, 21467, 28710, 36794, 41605, 40651, 37574, 32814, 27011, 22307, 19040, 22933, 30927, 37961, 34644, 17505, 7001, 4281, 36005, 70507, 101807, 124505, 129569, 113143, 89176, 62401, 37559, 19002, 9511, 7981, 8398, 7052, 4848, 3077, 1419, 26, 729, 2169, 2848, 3974, 5004, 4963, 3849, 1618, -781, -1347, -865, 2629, 5727, 7906, 7663, 5925, 3453, 751, -409, -947, -1687, -2598, -582, 1442]
10029B376M87M67j30p49j042d6n96j318k36P58e75J83A49N43J54a12j217j281
10011b610j474L79P75N56k78J25O72g58L60r02j82q74f33H14J040P03K9o98L27
9992B215I45c25r034J189N31P20c271A259O621J102K790N247P384P586O268J175
9976C9432l167o204q327r146C953c055A89K124J00r56F16f13j019e39A96K34A87
9958a1A61M30P88L64K90k73m44D46e73j078p98M84Q9k1k35O26f19C14P48N68K32
9937A862j99R1K8M4J37m6m06E01d11l37k90M91c6A25a11n14m65j52q3L4J27J2
9915a152r9l38l75m03o72O1J66J122e10B61p0f53j075o11Q89M13j96m99j24k17
9895b073n46K70P51d68B10N45N86K86j64n97h0q22k04a77G32M46k78A45h71j171
$$ y = [2376, 2863, 3330, 3200, 2451, 1409, -46, -642, -1960, -2196, -1438, -575, -392, 149, 692, 846, -112, -1329, -2610, -4084, -3705, -2930, -2374, -2652, -2527, -1855, -758, -398, -1300, -1482, -2356, -633, 814, 1854, 2557, 2586, 1888, 2215, 945, -325, -9359, -8170, -7639, -6919, -3271, 1259, 7880, 8982, 11772, 17019, 24403, 31989, 38257, 39432, 36265, 30061, 21734, 12588, 3953, -3055, 189, 2313, 2413, 1457, 616, -613, -1632, -539, 196, 430, 187, -11, 161, 591, 1379, 1743, 2033, 1760, 1316, 446, -573, -1651, -2449, -1965, -1876, -1897, -2132, -1506, -619, 314, 1062, 1630, 1862, 1663, 1754, 1782, 1826, 1963, 1917, 1511, 501, -411, -748, -1038, -547, -36, 125, -111, -625, -1090, -1242, -1325, -1291, -1164, -1152, -1251, -1589, -1964, -2367, -3039, -2978, -2812, -1690, -510, 261, 191, -653, -1728, -2339, -1450, -1037, -1233, -1732, -1856, -2073, -2619, -2349, -1598, -468, 210, 755, 1341, 1627, 1463, 866, -80, -902, -1106, -177, 732, 1178, 900, 145, -871, -2042]
9875b042r04J151n63a02B940K641J746R13p18k362A994b95D55R44j75j19a93o49
9857h42d14A95J45d68k129k020J107L21j08K64m78o65J308O23j3P17m30f56H22
9837I38J41O14J724n92j005m57D55a118j177jN83O81k57r87o84L12R02h04a74
9817d09r01q58P64E77J532O20j86o54q84C56A35K51L38L50M43Q4nG15a43r94j071
9796b208O46N14q17k09B756N443N222L702J547o75k932m153m847A545a406o86
9780b092p11Q1P68R17b15E22a9A14J233Q40k14G69l28K22Q28K491Q37l13j380
9761C126G95a859N49k04L13F3Q79k32K78p2Q09p2N20R58J79r04G12h46l31e83
9740a89A32K15P8j75c22r05j053A004M112M327L874K431N12j614l518m319B105
$$ y = [-2042, -2946, -1795, -2358, -102, 2940, 5581, 7327, 8240, 7522, 5160, 1994, -295, 455, 1399, 1224, 1105, -193, -842, -414, 195, 340, -468, -2597, -4617, -3510, -3189, -3297, -3033, -3511, -4176, -2868, -2245, -2258, -1541, -1971, -656, 822, 938, 1079, 1693, 3417, 2825, 1820, 1363, 455, -1118, -2295, -2296, -1713, -1032, -1289, -2276, -2960, -2648, -1746, -804, -174, -409, -1310, -2168, -1404, 577, 2109, 2729, 2543, 1889, 1005, 356, 135, 386, 724, 1074, 1517, 1601, 1596, 715, -143, -1137, -2208, -1562, -1048, -1865, -2074, 2756, 8199, 13421, 17123, 18670, 17995, 15063, 10910, 6063, 1545, -1406, -2092, -2803, -2722, -1954, -1037, -215, 522, -19, 114, 1347, 2187, 1973, 769, 441, 663, 1491, 3982, 4819, 4506, 3126, 795, -1859, -1310, -1514, -1201, 63, 942, 710, 988, 916, 1725, 1653, 2173, 3131, 3310, 2406, 712, -846, -1177, -583, -189, 132, 347, 425, 250, -322, -1227, -2280, 1004, 5116, 9443, 13317, 15748, 16260, 14646, 11128, 6809, 2105]
9722d2B040K254L88j294A419B67b46d5E30Q12P38j21p07B76g81j394P61N51l68
9703a231r37p44J354f6I36L79k44C35h17j104L00e36D63J200O21K98P9k36k06
9684B219j86n36o04bj289j032M83N43J9m27j39N40b66D50l1a52j372N47C86J308
9664A694J079N98m9o16r39p65A73e17m36O6L82h9c2r5k04k59m51j049j81R63M19
9643h89l09j267k14J117b57A69C7a96j63a49E15O46J178J058J159L25j27o62j146
9624B946j247j93M38N59K91m36p60G44C2a53c5A11f15q61k41M8L50e80G35K299
9604C034J472J30j337A371B0a315p91k28K90N82M24j32l56M06A06Q85P30R8H56
9584h87j154R44n40MO27a22F11L2a75j200L09A60J121N44k32F29i84j389l80O35
$$ y = [-42, 2040, 4294, 4682, 3388, 1419, 267, -246, -45, 530, 1342, 2080, 1959, 1252, 276, -781, -2175, -1414, -863, -1231, -2168, -2912, -1558, -66, 936, 1315, 1071, 335, -817, -1921, -1621, -536, 463, 1663, 2284, 2582, 2661, 2425, 2219, 2033, 1497, 893, -2, -1291, -2323, -1840, -1297, -1278, -1705, -1844, -1304, -266, 450, 419, -152, -1524, -977, 386, 1694, 2773, 3371, 3322, 2706, 1767, 1002, 173, -517, -953, -887, -505, -89, -32, -127, -331, -590, -1041, -2090, -2271, -1308, -889, -1198, -2465, -2679, -1562, -257, 169, 37, -196, -359, -149, 515, 1161, 2339, 3397, 4556, 4881, 4754, 4092, 2946, 1699, 1506, 1944, 2503, 2794, 2358, 1598, 744, 32, -153, -35, 111, -615, -1476, -1717, -1669, -1319, -580, 735, 3034, 4506, 4636, 3299, 1371, 20, -1315, -2106, -2334, -2044, -1462, -1038, -1170, -1526, -1120, 106, 991, 1721, 1819, 856, -887, -2041, -1097, -1637, -1633, -1006, -122, 611, 643, -175, -1375, -1066, 160, 1281, 1825, 1593, 629, -984, -2373, -2753, -2118]
9564b118N56M74L92N9q6l46l46o2k13p1j65k24p4L68L74L70b80D55M7e10j166
9543a676m06m63m97N14J230A548J275M85j63A497b94A29j9a222j788l7j24l91
9525c562J736A926M987M587M113M082L699j0720L806K4058J7204K1622K0530Q368
9511A08262n812j2360j7355j7284j7398j4339j1678C410a959J19j276k628K765
9498b979g38E32M87g38j643Q86K21O5j210r94a202L40G64Q44J19J925J843J291
9480F786N83k084A951a472k583g71F59J133N61Q07K162L792K752K745j776j881
9464A0954k206k316j602k320q99k86C16h45j410K46m85O50b79B284M887L994L949
9447A5114K771J136q60k818m113n015A220a102J61B01O59O42p36d70n41J06l33
$$ y = [-2118, -1562, -1088, -696, -637, -723, -1069, -1415, -1477, -1690, -1761, -1926, -2150, -2224, -1856, -1482, -1112, -280, 455, 502, -510, -1676, -2082, -2545, -3042, -2528, -1298, 1548, 2823, 3308, 3145, 1497, -294, 129, 110, -1222, -3010, -3047, -3171, -3562, -1826, 1926, 6913, 11500, 15613, 19695, 23394, 12674, 16480, 40538, 57742, 79364, 99894, 108262, 102450, 90090, 72735, 55451, 38053, 23714, 12036, 3410, -1959, -1840, -3116, -5744, -2979, -738, 532, 1019, -738, -2381, -1495, -1274, -1209, -2419, -3413, -1202, -862, 764, 1608, 1727, 3652, 5495, 6786, 7369, 5285, 1951, -1472, -4055, -771, 659, 1792, 2353, 3160, 5322, 9114, 11866, 14611, 12835, 10954, 8748, 6432, 4830, 2510, 1611, 1325, 316, -845, -2255, -2009, -2494, -1844, -279, 2284, 7171, 11165, 15114, 17885, 19021, 18161, 15343, 11230, 6215, 1220, -1102, -941, 201, 860, 1502, 766, -470, -1011, -905, -1238]
9430a238@B518L255J417p94A299b093m077A43e52A705R78B62a070E585O188J2698
9413B4471K9024N408J40890R7476R7846Q2054M7774l5844p0998r2473r7766q8307
9401A39555o8611B5704E636r58j246F74a190j460M38f17b13p38j324r91P95r46
9385c417j27J735P43m88k91m70M39O6r34N71d65A71J33L32K38a99l32l60b86H72
9364A834J98m52l51N2l15G4e27p22m33o89r18L0N45M13N38M00d80A67J95b48r54
9343a202q37J74O57N90F8R6E4e17p00n50o18m25j94J184f06B81L01f7q02j29M48
9322e50a80k49p26q19p1P20N83m1j62j66l3J76L27b51C21P26R93J000P14M01L8
9301D193o10j001A233H7e58m9o90l24M78j50L47j4p7j77o29o55K91K96K08M99
$$ y = [-1238, 0, 2518, 5773, 7190, 6396, 1299, -2093, -6170, 143, -552, 1705, 2683, 262, -1070, 5585, 11773, 24471, 53495, 58903, 199793, 297269, 395115, 477169, 524943, 489099, 418101, 325628, 227862, 139555, 70944, 25704, 5636, 4678, 3432, 674, -1190, -2650, -2212, -617, -213, -951, -2275, -3266, -2471, -3417, -3544, -1809, -1066, -1554, -1845, -2315, -1876, -1810, -2744, -2173, -465, 171, 304, 636, 874, -199, -531, -891, -286, 872, 1834, 2032, 1580, 1229, 1281, 966, 74, -527, -1249, -1682, -2371, -3289, -3259, -2714, -2301, -1763, -1363, -480, 167, 362, -248, -1202, -2039, -1865, -1208, -618, 68, 164, 54, -517, -1217, -1767, -2385, -2810, -3004, -1820, -606, 281, 582, -67, -869, -998, -550, -180, -429, -1155, -1974, -2045, -1325, -742, -783, -945, -1111, -1144, -968, -641, -251, 321, 1047, 2040, 3040, 3754, 4155, 4193, 3583, 2582, 1233, 87, -558, -607, -1297, -1621, -1143, -1293, -946, -960, -1037, -1214, -1843, -2498, -2207, -1911, -1703, -1204]
9281a204l7j34l22M9K73J90j70k33o12qP27f15B98N58K3k22p3J91M42L95q1o21
9259I10b21j417n14N39K97O0m44k19O89a18G19N56L27K43L12n12o38D41b07l60
9239e67l80n7j6L30C21Q66J93l04A04c48J26E7b8k68o40n76M38a80E54P99m6n59
9217G48b83q53J9c12G03J185J398J085o65j300A132D27m4a00p5A164E43k70c437
9197c107J005R07K21k18o15n66J5J54l76L40P92M02j3q9q58r27Mj3L06R12g57
9175f47l37k25k69m18n49l74p9M27K86j8j02j16J31L26M19N25N01EM66J56j99
9154D28H1d58l91j30J42K4k38n21k10o32j99J76N53L20M89e08b52a3C55NEc60
9131a49B88L00j56i9n70m68l7M2L20K95b45j7n71q08J53P34B68Q01K26l46A78
$$ y = [-1204, -1241, -1375, -1697, -1648, -1375, -1185, -1355, -1588, -2200, -2208, -1481, -615, 298, 856, 879, 657, 584, 775, 1217, 1612, 1531, 910, -221, -1638, -2152, -1613, -1316, -1256, -1700, -1919, -1230, -118, 719, 1275, 1602, 1845, 2157, 1645, 1007, 441, -207, -567, -947, -1004, -1020, -690, 321, 1187, 1380, 1076, 104, -348, -222, 57, -28, -296, -936, -1512, -1074, -180, 554, 1353, 1307, 748, -283, -1136, -1117, -312, 703, 1888, 3286, 4371, 3706, 2406, 1132, 427, 383, -100, -175, 1164, 543, 273, -3437, -3107, -2102, -1195, -974, -1192, -1807, -2373, -2358, -2204, -2580, -2240, -1448, -1046, -1059, -1148, -2006, -2933, -2929, -2942, -2636, -1724, -757, -647, -984, -1209, -1478, -1896, -2445, -2819, -2898, -2471, -2185, -2203, -2305, -2421, -2290, -1964, -1545, -1020, -519, 5, 471, 627, 428, 81, -458, -849, -979, -837, -813, -1051, -1572, -1782, -2414, -2613, -2437, -1884, -1564, -1075, -508, -252, -13, 355, 360, 5, -360, -149, 288, 588, 432, -99, -669, -1137, -1174, -1132, -812, -517, -245, -262, -833, -1641, -1488, -754, 268, 1069, 1295, 949, 178]
9109i11j267k19O40O68J59J59m6l75j48k35nM75d52E7O0i0k70l38j79J51K06l75
9087h95l32l31m6N29c99B80j4c0n47r76o10j66P31N15c87J43N8c9B89K10a44j57
9065c01o2j5k50l27m95m85n3m9L09N50e46A84P02P22L86J03k39m67l78A57e86
9043a200j06K05k4l09l05J68J68o92N14N27L69J97j91l91o12j92N03N27J08J20
9023f16g0D71R2F3a125n03b80C03J28j81G9d7j1k0k33k52n32k81K9L75c48B34
9000F55J66J54J84L48Q9m75E9a059j215J045a78b4m75m06m72l50j84l27o88m53
8980c379N15R05Q51B5J106Q65P39J17n36q58A49a050j041n28J54N84Q08a63D44
8960E31k06b67p81o23m04K75K34N17J49n74j031r50o1M44J096R48c60B1a11k02
$$ y = [-911, -2178, -2397, -1757, -1089, -930, -771, -817, -1192, -1340, -1575, -1580, -1105, -452, 57, 117, -90, -360, -698, -877, -726, -520, -895, -1227, -1558, -1604, -1075, -399, 280, 266, -30, -577, -1553, -2163, -2329, -1598, -1083, -387, -244, -186, -39, 289, 499, -144, -301, -363, -378, -628, -955, -1450, -1935, -1988, -2037, -1728, -1178, -546, 184, 886, 1608, 1994, 2097, 1858, 1391, 1013, 157, -586, -1200, -1306, -1101, -1125, -1434, -1739, -1571, -1403, -2095, -1581, -1054, -685, -488, -679, -1070, -1682, -1874, -1371, -844, -736, -616, -70, 471, 563, 63, -1125, -1628, -280, 303, 431, 250, 79, -47, -58, -78, -311, -563, -1095, -1376, -1347, -972, -348, 234, 655, 821, 975, 1159, 1507, 1596, 1121, 59, -1059, -2274, -1229, -178, -24, -499, -905, -1377, -1727, -1911, -2238, -2926, -3379, -2864, -1959, -1108, 25, 1131, 1996, 2735, 2852, 2316, 1458, 149, -1050, -2091, -2619, -2465, -1881, -1073, -163, 444, 531, 325, -267, -1048, -1671, -2075, -1800, -1566, -1049, -900, -1474, -2505, -3455, -3516, -3072, -1976, -1028, -360, 21, -111, -313]
8940c13j74j48m02l65l23K9r2q13P9J14J15O2p8L26R35f2F49L90R9q8k36l60e0
8916g32n22n30Q7L63K08L3j97k21K73d70a24j39l24n34n00m78K64K82L23k13k31
8895a674q64J80P67d05B98J79B03b88j37a02b4o51j024j07e09J43n27o43j8N55
8875i99K51K44k50l1m75l99K76L53c81A31L42M8B36d10m73O0a57D98k03f12j165
8854a777n49r20L24J283f85b60j84n04l97o72q16J03M05N67N1n1K00g77C05Q41
8834A146M63J9m11n63A02c48l90j37j56l73j70O03A38J182O17J39l21o34B20f17
8813a365l83M36M61b92e2j00l37m06j55j77m0K8O1K68L39a41B01P46L56k04D61
8791d33o40o7J61M46B61P97P48K36m74o86A46g29p43K12K80d62fj01d3C77J158
$$ y = [-313, -487, -635, -1037, -1402, -1725, -1696, -1788, -2601, -2522, -2408, -2293, -2231, -2309, -1983, -1048, -62, 649, 1039, 1138, 1050, 814, 454, -50, -732, -1254, -1784, -1697, -1334, -1126, -1093, -1290, -1511, -1238, -470, -124, -263, -587, -1121, -1621, -2099, -1835, -1553, -1230, -1443, -1674, -2538, -2358, -1591, -405, 298, 477, 203, -288, -425, -102, -24, -675, -1699, -1806, -509, -366, -893, -1536, -1554, -999, -748, -504, -754, -785, -1260, -1659, -1383, -1030, -381, 131, 473, 521, 236, -410, -883, -823, -157, 498, 295, -612, -1777, -2326, -3246, -2922, -1639, -685, -260, -444, -948, -1345, -2017, -2833, -2730, -2325, -1758, -1707, -1758, -1558, -777, 305, 1146, 1609, 1628, 1217, 654, 102, -348, -738, -875, -1031, -1404, -1574, -971, 138, 1320, 1937, 2076, 1755, 1121, 220, -617, -1365, -1748, -1312, -851, -292, -52, -152, -489, -895, -1050, -1227, -1267, -1239, -1178, -910, -571, -141, 201, 947, 1303, 1099, 461, -433, -1073, -1140, -979, -533, 261, 1058, 1806, 2042, 1568, 882, 146, -729, -1472, -1260, -980, -462, -6, -107, -43, 377, 1535]
8770A535J066N34j65p66p34D53e42j24k960N06c24A538J58E10i93j510j141K45
8752c399L26j053J1M10N04R61J109m31k713m173j576Q34c688a372m471l648c633
8734F053N728R527K777r386B100E62J2476J5520J4413M177J4296p81j5804A7293
8719A9875K6553N896R174R109M582N992K21j5181m842P66k2705r875r112D74h560
8703B685R097L22k052j700j699j982r44K589M584n443k15c427j897k404c665f74
8686a364n85R65o8k74bC4O53N38O05k42p81g41j231K67I64K689J149j047E05J765
8666B270N219K628J981N586J9011K6347K4689J8941O33k492p556k5238k4453k2547
8652B5019A1962l766L17k211B205D70N61D96c43a42p08k54K41b82j87j633k571
$$ y = [1535, 2601, 3135, 2970, 2204, 1470, 453, -542, -666, -3626, -3120, -324, 1538, 1696, 510, -993, -2503, -3644, -3399, -3073, -4126, -4115, -3705, -3201, -2240, -1131, -1562, -4275, -8448, -10024, -9190, -3688, -1372, -5843, -9491, -3633, 6053, 11781, 21308, 24085, 14699, 2100, 562, 13038, 28558, 42971, 47148, 61444, 60663, 44859, 17293, 19875, 46428, 52324, 61498, 70607, 75189, 81181, 81402, 66221, 61379, 62145, 39440, 29565, 20453, 474, -8560, 2685, 11782, 12104, 10052, 8352, 6653, 4671, 3727, 6316, 10900, 5457, 5242, -3427, -5324, -7728, -3665, -674, -1364, -1949, -984, -1052, -1326, -2, 34, 687, 1225, 1830, 1588, 807, -741, -1972, -1705, 964, 3653, 4802, 3755, 505, 2270, 7489, 10117, 12098, 17684, 36695, 63042, 87731, 106672, 107305, 104813, 97257, 72019, 47566, 25019, 11962, 8196, 8513, 6302, 2205, 470, 1031, 496, -343, -142, -850, -1104, -863, -282, -469, -2102, -4673]
8635d673O12J653M65m8N62c85G73J155Q87N26l53j240D54h43o66J20f89H0O29
8616G09J88b2j550j273P81O70J07l7j15M03c47D60O04K38E92a033j385j319J624
8597b113b94D42c46j460l29L80Q29b46A30K20J79N43P85J015P53m1j623a42k053
8578b195m56a151b01m40n98m70j25m84n31P81R15M85O6r9K13A38O01K32l07A13
8557c0A12P96Q53L33n15E80c86n02Q7J69n6l05j41k22r02p04K22P40Q33f9I38
8535A912O20J71l73o59n91l21L4O7j55A98g47j034O70B02J036K54m80b71j344
8516a615O2c87E02K78i9j119j287n60p4M06N32n50r51a234E58N97C15c87j109
8497a496q09M17i12D4N87l09c57r27p35q5J51L78L73M11j82k78l39h7B122J755
$$ y = [-4673, -4061, -2408, -1943, -1991, -1429, -385, 773, 1928, 2815, 3341, 2988, 1748, 454, -843, -1509, -1389, -689, 80, 709, 897, -22, -1572, -2845, -2064, -1394, -1287, -1324, -1439, -1036, -347, 460, 1064, 1302, 592, -1033, -2418, -3737, -2113, -294, 442, -346, -1806, -2135, -1755, -926, -246, 130, 350, 529, 1072, 1857, 2872, 3625, 3584, 1961, -142, -2195, -2651, -1151, -201, -641, -1239, -1709, -1834, -2318, -2849, -2068, -1153, -668, -602, -701, -488, 138, 739, 971, 664, 113, -30, 112, 908, 1761, 2094, 1579, 580, -386, -888, -801, -632, -688, -993, -1134, -1356, -2258, -2962, -2740, -2000, -1167, -69, 938, 1912, 2532, 2703, 2330, 1671, 1080, 759, 793, 860, 705, 198, -747, -1781, -1111, 202, 1238, 1492, 1012, -271, -1615, -1553, -387, 502, 780, -99, -1218, -2505, -3065, -3139, -2733, -2201, -2751, -3702, -1234, 558, 1155, 315, -387, -1496, -2305, -1888, -912, 44, 631, 322, -357, -1284, -2019, -2104, -1953, -1575, -1202, -791, -973, -1251, -1590, -87, 2122, 3877]
8477C877J381K83q86j898C40a899j102J340O95J87l04l30M06c80a20l29r64p31
8459b144f77E87O37m7m57A85m4L97M31J27j94D04a67l58r3b75i0j43o47p61L76
8438a265e16j97q80m34Q18B76P73N51R0k92m39m59dn76o35n96m57M5N69M11l10
8417a553o62q25J31N58P18f28E61J159J152L95n66j182C14d84q30p76n5K45J23
8398a777L13Q9j98m06j31P88a63B39q4b60l7D02M86P08R98K05o85r78c26k373
8378b699r45a438b19A493J523J213J969M51J40J343K969L169L415M130R056J2464
8362D3335J2946J0054M863Q51l463m748m956n934o088q159q682q370o173k188
8348A3288k255n421A421g31j651K26Q04M84J79K95m23j86M59A07a95o89n64J33
$$ y = [3877, 5258, 5541, 4655, 2757, 340, -1899, -3001, -1661, -966, -779, -1083, -1413, -1007, -380, -120, -449, -1413, -2144, -677, 587, 1224, 1177, 720, 185, 141, 538, 969, 1096, 902, 404, -167, -525, -618, -275, -90, -233, -880, -1641, -1265, -516, -713, -1593, -2027, -1209, 276, 1049, 1600, 1690, 1398, 959, 500, -4, -580, -1215, -1811, -2268, -2223, -1654, -1243, -1553, -2215, -3040, -2909, -2351, -1633, -628, 561, 1720, 2872, 3267, 2701, 1519, 314, -484, -1314, -2090, -2145, -1900, -1777, -1464, -1375, -1573, -1979, -2110, -1322, -163, 239, 155, -260, -297, 402, 888, 1596, 2594, 2799, 2114, 1136, -326, -2699, -3644, -1438, -219, 1493, 3016, 4229, 6198, 6649, 6789, 8132, 11101, 14270, 17685, 21815, 30871, 43335, 56281, 66335, 71198, 72049, 68586, 63838, 58882, 52948, 46860, 38701, 30019, 21649, 15476, 13288, 11033, 5612, 1421, -731, -2382, -2156, -1352, -868, -689, -394, -817, -1003, -544, 107, -195, -884, -1448, -1315]
8330a315j86o76m77K02jL90i21c69C73j08d30r22j17L12j31k63k0Q5j105k34J231
8309a594b82C3b26j88k7G6J61f34p95O00j5n01p02l85m33k48J2O14N69M10L9m8
8287a517j00L12O46A08O02j14c81k9C41P60M34j97F55c57r82q18l23J19a098B3
8266F79J0k12b67p20l51M30d19n12j307L26B82J218R5F72h04j497N64O65M32K63
8246c77m58r29q2P78a1E72B2a147j124M5M21f33A071J124J556J199O05l41j852
8227C362b86c4G492R087Q525O291K808j012m157o489p650G163A099a885F79M741
8211E420L162O52j115j753R26L766m21k775K24K613Q90j685m868g3m50B128K950
8194E078J918J004q8j205j647j570j212I77i64L75F70M8f89k31E16Q67o62h09
$$ y = [-1315, -1501, -2177, -2654, -2452, -2453, -2063, -921, -369, 373, 265, -430, -1352, -1469, -1157, -1288, -1551, -1571, -1486, -2591, -2825, -1594, -282, 33, -226, -414, -441, 76, 237, -634, -1429, -829, -844, -1345, -2047, -2432, -2865, -3113, -3101, -2487, -1918, -1508, -1469, -1517, -1617, -1305, -659, 108, 710, 596, -381, -410, 341, 1101, 1535, 1338, 655, -357, -1339, -2157, -2480, -2361, -1098, 23, 679, 689, 477, -267, -987, -1338, -908, -419, -931, -2238, -1912, 282, 1500, 1595, 672, -804, -2301, -1737, -1072, -640, -377, -835, -1764, -1846, -1068, -11, 572, 22, -1147, -2271, -2226, -1805, -633, 1071, 2195, 3751, 4950, 5555, 5214, 3362, -286, -34, 7492, 16579, 25104, 31395, 34203, 33191, 29034, 22545, 14895, 7163, 1099, -1885, 679, 5420, 8582, 9234, 8119, 6366, 7292, 11058, 10637, 7862, 8086, 10699, 11589, 9904, 5036, -73, -523, 2128, 5078, 6996, 8000, 7912, 6707, 5060, 3490, 2278, 977, -964, -589, 670, 718, -689, -920, 516, 1383, 721, -809]
8175a154d01C51J784K176M218L673K087N47r98k742l632l709A2b693M5J189e94
8157a37E92N23J97D01a800q72h04A217J929J151J104K993L695L386K746J541l0
8140A9732j511j212n74j003j708k540l115l312k337H14a441k079N28a220B34J22
8124C56E5d66o99r22l39J065A10P63L91N09Q29J39l35m08Q31J062L29j27j69L09
8104D233O58Q0o92j498A245J917M264L797K443J322J219R02Q83J1k029l250l260
8087I464l530j952j159K816L459L746M077L094j433k957l560l571k813B107f4
8071h6G1P86K521K516K55j657J31L078K877r89l340M632J1729J1428J1476J6280
8055F1794L2731M6871N2143M6824L0767N529k3944m2897n1997n0323l8098k1670
$$ y = [-1154, -401, 351, 2135, 4311, 8529, 12202, 14289, 14836, 13838, 11096, 7464, 3755, 12, -2693, -2648, -1459, -594, -137, 592, 1115, 1312, 401, -1800, -2672, -804, 1217, 3146, 4297, 5401, 8394, 12089, 15475, 18221, 19762, 19732, 18221, 17009, 16435, 15432, 13724, 11184, 8069, 4757, 2420, 814, -1441, -3520, -2992, -1220, 234, 356, 55, -466, -1165, -2087, -2426, -1361, 110, 873, 1264, 1773, 2602, 2741, 2406, 1998, 2829, 3891, 4220, 4093, 3924, 4233, 4891, 4971, 4279, 2781, 1245, 3162, 7426, 11223, 13666, 14988, 16207, 17109, 17992, 18003, 15974, 12724, 9464, 5934, 3982, 2823, 5639, 9098, 12844, 16921, 20015, 18582, 15625, 12065, 8494, 5681, 2107, -64, -86, 71, 857, 3378, 5894, 6149, 4492, 4623, 7701, 10578, 9589, 6249, 10881, 22610, 34038, 45514, 61794, 94525, 141396, 193539, 240363, 271130, 276659, 252715, 209818, 157821, 107498, 69400, 47730]
8043D7730j1350j0124j2595D566L307M531P33j955j963j034q75j291q95J444J797
8028H365P37J844M111M774L920K221k96R22J073l16l051o276m603q02ok508k280
8011G829J458K188K664L214J881q73k332L437Q462R416J1848J4137J9466K0712
7997A03507K8173O0499J07169J40291J45652J19776O3861j1861p5816j22106j41567
7986D17578j34273j09776q1473C6039m893K9833K4028P591q075j6745j6271j1789
7974C9718r239q466n351P87K621o89k447m482n134C052l49J413M63j928j277K754
7958D128K356j051A651c141O00c57C28f36k965o25a936@B150K166J103j190j631
7941B598A40e843a481m46D076L380j554A731Q460J5744J6773J4002R157L135j9219
$$ y = [47730, 36380, 26256, 13661, 4566, 7873, 12404, 13137, 11182, 9219, 8185, 7310, 6019, 5124, 6568, 8365, 9102, 10946, 15057, 19831, 23751, 25972, 25676, 26598, 27671, 27355, 24304, 18028, 13425, 12623, 12617, 10109, 7829, 9287, 11475, 14139, 17353, 19234, 18361, 16029, 19466, 27928, 37344, 49192, 63329, 82795, 103507, 131680, 192179, 299348, 439639, 585291, 705067, 768928, 757067, 681251, 559145, 417578, 283305, 173529, 92056, 36039, 31146, 60979, 85007, 92598, 84523, 67778, 51507, 39718, 30479, 22013, 16662, 17449, 20070, 19381, 16934, 12452, 7318, 3052, 2703, 4116, 4579, 2651, 1374, 4128, 6484, 5433, 1651, -3141, -2541, -357, 328, -636, -3601, -4226, -1936, 0, 2150, 4316, 5419, 4229, 2598, 140, -5843, -1481, -1927, 4076, 7456, 5902, 1731, 10191, 25935, 42708, 56710, 65867, 69002, 49783]
7926D9783n619o914j5244F663a676A24e39k00D82c45i7j215k339l60a118A156
7909B990L68j295B25a626M68g7E90o6D6a327j290J088f32j16m91l416J629g64
7890B296L381K590N75l025B831R85N202M107M712L406K561k97l863n489D239b280
7873D93L172L119R03m37j699j284l13J207J379k52j681A732F45k79b542j027j045
7856d614g48R9q28N14j66o58I82N728N906O105L979L65l214o532F083K148K56
7839H487k23J040J099J810J398N42l237L08K50m244j556j558j112n54C10K860
7823C170A301a965j398c21F193N084M005M016L678O416J2761K1261K5852K3477
7809A12743J5280L507j0132j9794k5737k5877k0343j0476k778k170l648l358j933
$$ y = [49783, 44164, 37250, 22006, 6663, -1676, 124, -539, -739, 482, -345, -97, -1312, -3651, -4011, -1118, 1156, 2990, 3358, 2063, 225, -1626, -1158, -77, 590, 524, 46, -1327, -2617, -1529, -632, -748, -1239, -4655, -3026, -764, 2296, 5677, 8267, 8842, 5817, 2831, 3816, 9018, 13125, 17837, 21243, 23804, 23507, 19644, 14155, 4239, -2280, 493, 3665, 6784, 7687, 7250, 5551, 4267, 3954, 5161, 6540, 6288, 4607, 1732, 645, 366, -2542, -3569, -4614, -748, -649, -1477, -963, -1129, -1787, 982, 6710, 12616, 18721, 22700, 23065, 19851, 13319, 6083, 8231, 8487, 8264, 9304, 10403, 12213, 13611, 14153, 10916, 11224, 11474, 7230, 5674, 4116, 3004, 2450, 310, 3170, 1301, -1965, -3363, -321, 6193, 11277, 15282, 19298, 22976, 29392, 42153, 63414, 89266, 112743, 128023, 131530, 121398, 101604, 75867, 49990, 29647, 19171, 16393, 14223, 10575, 7217, 5284]
7796E284K460K632J763o9n23p44k49O02p40j400C317b683k912k892k650M355I15
7778G912r15B475b082p417C401m18a31l423e45o70m598K295H37L554j377G7a545
7760d459A0051J5742J3672R976n90j4104A6103G297F97e207j669O91J685b109
7745a447l65j419j639b250E1J910J363p8j160p46e68m156R28q92a27C913J963
7728E876N25j79j990A112b907Q65E90J034j84K30P62R59j67m33j183d76l625d77
7709C376J884p25k108j59L156J922j464B685o34N66j98b34j250G55K741L11j592
7692B215a19l8E137N014J876m56l784k994N59J548L149J394q26j897j39j62L197
7675A1616K945J819j94r43j693p32j341Q89M35M261J305L205M259M670J605k97
$$ y = [5284, 7744, 10376, 12139, 12070, 11547, 10803, 10554, 11156, 10416, 9016, 3317, -2683, -5595, -8487, -11137, -6782, 915, 7912, 6997, 2475, -2082, -9499, 3401, 2983, -131, -3554, -545, -1215, -5813, -3518, 837, 4391, 3014, 77, -1545, -4459, 10051, 25793, 39465, 49441, 48851, 34747, 16103, 7297, 697, -5207, -6876, -6185, -4500, -2109, -1447, -1812, -3231, -4870, -2250, 51, 1961, 3324, 3246, 2086, 1340, -568, -4724, -3796, -4688, -127, 3913, 5876, 6401, 6222, 4232, 1112, -2907, -2042, 590, 1624, 1440, 1670, 2432, 3391, 3224, 2791, 1608, -476, -4101, -477, 3376, 5260, 4535, 2427, 2268, 5424, 7346, 5882, 2685, 2051, 2617, 2419, -234, -1484, 755, 3496, 3807, 2215, -119, -157, 5137, 10151, 12027, 11571, 7787, 4793, 5352, 6900, 10049, 11443, 10617, 8720, 8581, 8419, 11616, 14561, 16380, 16186, 15243, 13550, 12818, 11477, 12366, 12801, 17062, 18367, 21572, 25831, 30501, 32106, 31809]
7659C1809j497l169q351D293f737D016J5469J4304J5513J1454m236j3273o179
7646C7068J3716J3355O090Q808J3287J2737q33j3742K1520L5318j333K5550Q5859
7633B57400J01054N7996O7449K11554N43756P18130Q50105Q90345Q17633O17091
7623E132513J60188m38105p09639q61881q93586q17098o43392m19121o7578l0609
7613D11692p4593j19199l7487q714j1771l6919j4436p51r14k4270j3423j9083
7601E0132j6562j6023J320K4245Q297l916o358o590m566k160P874N363J804o011
7587C6849n261j111m479q313k970N490O523K725J304K573L64l038j377J0126J1510
7572E0915L492p630r340K594O538o589A0803K4312P1539P8639P1108M9708J7245
$$ y = [31809, 30312, 27143, 18792, 4293, -6737, 4016, 19485, 33789, 49302, 60756, 56520, 43247, 37068, 50784, 64139, 70229, 79037, 92324, 105061, 104228, 90486, 112006, 147324, 145991, 171541, 257400, 358454, 416450, 483899, 695453, 1239209, 1957339, 2807444, 3697789, 4515422, 5132513, 5292701, 4854596, 4144957, 3283076, 2389490, 1572392, 929000, 509879, 442301, 411692, 337099, 217900, 180413, 171699, 159928, 123009, 108573, 107822, 106908, 82638, 69215, 50132, 33570, 17547, 18867, 43112, 51409, 47493, 41135, 34545, 29979, 27819, 35693, 41056, 42860, 36849, 31588, 30477, 25998, 17685, 14715, 20205, 26728, 29453, 30757, 33330, 33694, 30656, 29279, 39405, 50915, 54407, 46777, 37437, 40031, 46569, 39980, 10803, 35115, 106654, 185293, 256401, 306109, 323354]
7559C23354j7309m8024o7338p0865n5366j9642Q12n678j1506o429n19Q94M770
7546B7154R085O688j126r708j0771N193J6105J6542J3857J0669N983J651p110
7533H4212j5943k1072j8365r282m905F460B231J0766O422j230o935m939p33L6
7519E618K874J986r92m729j275N783N701J191k798k007J471L487L843J747k296
7504A9604p986D666K875L654k11j080J634K533l706g39a80I210M838m93m84m25
7488A2646n581c092H343J0841N478j975m977o700l493L8N489N812L81l536p60
7473A4941L791N59o285o142L221K613l048k055M309J548o160c208A520P735K475
7458A1730L370O034L318m083r444D945K88l33M027Q791L443n241K68J4706J2962
$$ y = [323354, 306045, 258021, 190683, 119818, 64452, 44810, 45622, 39944, 28438, 22009, 21490, 22384, 27154, 36239, 42927, 41801, 32093, 21322, 26515, 42620, 59162, 73019, 83688, 89671, 91322, 84212, 68269, 47197, 28832, 19550, 14645, 6460, 2231, 12997, 19419, 18189, 11254, 6315, 5582, 5618, 8492, 10478, 9486, 4757, 3482, 9265, 14966, 16157, 13359, 11352, 12823, 16310, 20153, 21900, 19604, 11618, 4666, 7541, 11195, 10984, 9904, 11538, 14071, 10365, -739, -180, 9210, 14048, 13555, 13071, 12646, 7065, -3092, 8343, 19184, 24662, 22687, 17710, 11010, 7517, 7555, 13044, 18856, 19237, 15701, 14941, 18732, 19291, 13006, 6864, 10085, 12698, 9650, 7595, 11904, 13452, 7292, -3208, 1520, 9255, 11730, 15100, 21134, 24452, 20369, 10925, 4945, 5233, 4900, 8927, 17718, 21161, 15920, 16188, 30894, 43856]
7443D3856Q91r192q556K567O637K189r39j879o264j1324o501N562J451q271h77
7427B974M797P425J2413M32q945B002J3091J5212L192j1161B671c094A4918P611
7413B2529k16J23J0944J4970J2204N084q695k2316A3171J1509R409q154I269P527
7399A6796J0188m558k629J8266J2462p262j9129L158J2480o428E628M408K2770
7386C2806O19r050J0940J7129k381k0742k80K1672O33k3146n090K6956O236k0472
7372C5830j0744K3951P171k3491A3545K8606J1736j4110q40K3596K300C1687A0833
7358E9814J8465k4851k0429M2480K1112k4404l3642L8693K8054k3200C8740M0890
7346G9630L6905j5889m1560K9260L8546k0314C2604P768N4612j0540k8402O6635
$$ y = [43856, 44747, 35555, 26999, 29566, 36203, 38392, 37453, 35574, 29310, 17986, 11485, 17047, 18498, 10227, -877, 2974, 7771, 15196, 27609, 28041, 19096, 2002, 15093, 30305, 33497, 22336, 2671, -3094, 14918, 22529, 22313, 22436, 33380, 48350, 60554, 65638, 56943, 34627, 13171, 24680, 34089, 25935, 9269, 16796, 26984, 22426, 19797, 38063, 50525, 43263, 24134, 27292, 39772, 33344, 5628, 10036, 32806, 33425, 24375, 35315, 52444, 50063, 29321, 29041, 50713, 51346, 28200, 23110, 50066, 56302, 35830, 25086, 49037, 56208, 32717, 13545, 42151, 53887, 39777, 38937, 62533, 64833, 31687, 10833, 59814, 78279, 53428, 32999, 75479, 96591, 72187, 38545, 77238, 105292, 82092, 38740, 79630, 116535, 100646, 59086, 88346, 126892, 106578, 32604, 40372, 94984, 84444, 56042, 122677]
7334A22677N2232k6478E8514M1351Q4401m657q2915J1976R3441L959r0645J4218
7322A29643J12396R699j12550j3175J43808K6917j20867l1801J72695L8338j33585
7311B21518n0659K23911P2058j55917j07494K72420J19704j74137j68971L42996
7301E95429J84020k03284k49124M60334K91867k30979m09736O44112N06490k40176
7291A348953o30693Q45647Q59040k57689j040312J469611J765134j13011j884616
7282B362064K792535M616622J115624l759985J0278942K6516712L3736438L4333235
7274A11992187K7628208J4625362j830843j7847489k9671989l4823102l2708719
7267C7363615A3209091n343455L252225k142817D167312j509884J761014l67571
$$ y = [122677, 174909, 148431, 58514, 99865, 184266, 179609, 96694, 108670, 202111, 206070, 115425, 129643, 242039, 251738, 139188, 126013, 269821, 296738, 175871, 144070, 316765, 355103, 221518, 170859, 394770, 466828, 310911, 203417, 475837, 595541, 421404, 252433, 595429, 779449, 576165, 327041, 787375, 1079242, 848263, 438527, 1082639, 1589129, 1348953, 718260, 1563907, 2422947, 2165258, 1124946, 2594557, 4359691, 4246680, 2362064, 5154599, 9771221, 10886845, 7126860, 17405802, 43922514, 77658952, 111992187, 139620395, 154245757, 152414914, 134567425, 104895436, 70072334, 37363615, 13209091, 7865636, 11117861, 8975044, 4167312, 2657428, 4418442, 4050871]
7259D050871j936730q01596J045131j7710j018619o10104O89884R4185n81977
7250I13335m47768M60041J16397l75983C02548L34572J27092k45110B12404K32807
7240D45211J27560j58636A77116J64637J17112j03996A55760Q3757R8221p6610
7230B61128A01474Q5933J01991m9152I9572M7934J01335j9262j10351l377Q3508
7219A99359l810r2711j6029Q2325R020p3718j5741J22491R2602L5132j0179l2666
7207B96075m2204l4173r176n274k9906o9078D2017L5793K7482k2846l6631K8827
7195G4642K9692o986j5382K3718K5387j3161m5047m315L0632m210k8681N030J6052
7182H7371j6839l428O8758M4394j9352k5085M4989M5067j8016m0045M4334N1778
$$ y = [4050871, 2114141, 1312545, 2357676, 2339966, 1321347, 711243, 1401127, 1495312, 913335, 465567, 925608, 1042005, 666022, 302548, 637120, 764212, 519102, 212404, 445211, 572771, 414135, 177116, 341753, 458865, 354869, 155760, 239517, 337738, 261128, 101474, 187407, 289398, 240246, 99572, 147506, 248841, 229579, 119228, 115851, 199359, 195549, 102838, 86809, 169134, 178154, 104436, 88695, 211186, 303788, 338920, 328741, 296075, 253871, 219698, 210522, 205248, 175342, 106264, 42017, 77810, 105292, 82446, 45815, 74642, 104334, 97348, 81966, 105684, 131071, 117910, 72863, 68548, 99180, 94970, 66289, 71319, 87371, 70532, 67104, 135862, 180256, 160904, 135819, 180808, 225875, 207859, 167814, 212148, 263926]
7170B63926k3227p4072N9068R3417m228p7249Q9525J38756p158r6981J03612J76356
7158F41745m768k08325J00066L11050L0273k34787J69728M65968R4170l37473
7148A027647L83266R79727L27838l56091R75668K482684J509296k47934L874611
7139A0956712J2931169J8714680K0656266J8281123J1888212K765767o967612
7132H9226317j5056154j9703980k0086892j6476910H885185j206655n58811j878697
7124E241022j446213j41495k93471r36147p70926Q2531K8960m82252n44110J72664
7114I10563K35194r2819j59390L9138J3024j80758k35936q634Q1390p4716k47194
7103B79862C6794N6171k977h129A05879O3471n2343J8982J55938R0856l0652q6855
$$ y = [263926, 240699, 166627, 225695, 319112, 314884, 237635, 327160, 465916, 458758, 361777, 465389, 641745, 636977, 428652, 528718, 839768, 870041, 635254, 804982, 1270950, 1365120, 1027647, 1410913, 2390640, 2718478, 2362387, 3338055, 5820739, 7330035, 7082101, 10956712, 23887881, 42602561, 63258827, 81539950, 93428162, 96193929, 89226317, 74170163, 54466183, 34379291, 17902381, 8885185, 7678530, 7119719, 5241022, 3794809, 3653314, 3359843, 2423696, 1652770, 1735301, 1764261, 1282009, 737899, 910563, 1145757, 1052938, 893548, 932686, 945710, 764952, 529016, 520382, 601772, 527056, 279862, 36794, 92965, 89988, -8129, 105879, 169350, 117007, 135989, 291927, 382783, 352131, 265276]
7091B65276j9064L4728l3741q3707n770M8225j8118o8305K4702O7847j0496o9821
7079A31756j2493M7243r980p0136R223P0932Q176m3049r88L6311k3635D8501j172
7066D7329Q5843M921m2514M1920O9215m534q1111k9555P0812M826p6001K942Q5627
7053A79720M728q3464R697J01345J2912r2095k6297J10649K0982r0588n443J28474
7041B70620K5571j12192l6581J65090N3860j10333l1244K21132J40500m7859j79561
7030C59003j46232o2672N1K65054K84043P7648j93817j45457L25164K51828o6280
7019I48333j43017J99186K02395j84146k64023M28234M06817j85854l09117P44510
7009A843318O85913l58856j008570J451679J671564j83775j850048K846451M428638
$$ y = [265276, 246212, 280940, 247199, 163492, 157722, 205947, 187829, 119524, 144226, 212073, 201577, 131756, 119263, 166506, 156526, 86390, 95613, 166545, 174721, 131672, 130684, 166995, 143360, 48501, 47329, 133172, 138093, 95579, 137499, 206714, 202180, 121069, 91514, 162326, 167152, 91151, 94093, 179720, 184448, 100984, 110681, 212026, 224938, 132843, 106546, 217195, 238177, 147589, 142146, 270620, 296191, 183999, 147418, 312508, 366368, 256035, 224791, 445923, 586423, 538564, 359003, 212771, 150099, 150150, 415204, 699247, 776895, 583078, 437621, 762785, 1014613, 948333, 805316, 1004502, 1206897, 1022751, 758728, 1186962, 1593779, 1407925, 1098808, 1843318, 2529231, 2170375, 1161805, 2613484, 4285048, 4101273, 2251225, 5097676, 9526314]
7000I526314R27278l769170J0426625K5781869L2521828L2880017K6222521J3589438
6992A48106720k257376j7553103k8741772l3457042l1230696A2011557m408701
6985G602856L031034k219042C761792j139611J700093m37128j915969o67102J028427
6976B330502m8552j011395o02369O65238O9373n84628l58215M78226R5834l84634
6966F49380C22802L30102J07467k59437B03932K61971J21149j67051A84318J68217
6956C52535J05380j21655A37189J34140J06400q2801A26550R1132J01743n3880
6946B65545A14907L8384R1294l2292I9379M1487Q4423k2416I7760q45P8341r072
6934A66184q1425N807P2853j255p1317j9009O1688L895o2837k4715O4835J0763
$$ y = [9526314, 10453592, 6684422, 17111047, 42892916, 75414744, 108294761, 134517282, 148106720, 145849344, 128296241, 99554469, 66097427, 34866731, 12011557, 7602856, 10633890, 8414848, 3761792, 2622181, 4322274, 3885146, 1969177, 1302075, 2330502, 2281950, 1270555, 668186, 1333424, 1402797, 818169, 459954, 938180, 1034014, 649380, 322802, 652904, 760371, 500934, 203932, 465903, 587052, 420001, 184318, 352535, 457915, 336260, 137189, 271329, 377729, 294928, 126550, 217682, 319425, 265545, 114907, 153291, 244585, 212293, 99379, 140866, 225289, 202873, 97760, 96915, 175256, 166184, 84759, 90566, 163419, 162164, 90847, 71838, 133526, 137421, 74584, 49869, 114704, 125467]
6922A25467m9758k7750N2751J3662m1564l2805M5785J6253l4301C3737M2310J9829
6910I5876k7524B6660L0941K1495j9950B9311K8781K0028j8618B2848K2940K2761
6898F8549j2485B3892J6998K2816q729B6130J1707K1726p003B5605Q695K1198
6886E5498m750B2428j456K3946J050k1746m248K0854J233j9213k302J9974K943
6873D3463j6974j1857J5661L637j5096m342K0394M783j5149A0883J8442P308j1980
6860B4653I869J3815Q692q605A0494Q113P462p656q956J4468P131p129H509Q340
6846A6849R415n205G427P185J1809k310A1593J861R352k415F449J290J2119L91
6832B0249r149j90Q495j38q412K36R299K57r228j294R024P4I244D200J1300K834
$$ y = [125467, 75709, 47959, 100710, 114372, 72808, 40003, 85788, 102041, 67740, 33737, 76047, 95876, 68352, 26660, 57601, 79096, 59146, 29311, 58092, 78120, 59502, 22848, 45788, 68549, 56064, 23892, 40890, 63706, 54977, 26130, 37837, 59563, 52560, 25605, 34300, 55498, 50748, 22428, 20972, 44918, 45968, 24222, 19974, 40828, 42061, 22848, 20546, 40520, 43463, 26489, 14632, 30293, 33930, 18834, 14492, 34886, 39669, 24520, 10883, 29325, 36633, 24653, 9869, 23684, 32376, 23771, 10494, 18607, 26069, 18413, 9457, 23925, 31056, 23927, 8509, 16849, 26264, 21059, 7427, 14612, 26421, 24111, 11593, 13454, 22806, 20391, 6449, 7739, 19858, 20249, 11100, 10910, 19405, 19267, 10855, 11091, 20390, 20647, 11419, 10125, 19149, 19223, 9244, 4200, 15500, 18334]
6816A8334q505C675J1421M807n722E694N116M489l957n607L116K569E681k441
6802C240J0281N564l422p529O93K508l481k006Q192L964n721a101D885Q871k04
6787A3552E681B566N928P77D159L6N307j118m021L635N332l80o443B271M975M31
6771G677C065J670N440n8B425j50R630L305l944n093K146K231l570j63R696Q886
6755B5399L062k718n423m053J198O412M609p98p252n061M926N600j388r097C602
6739a018k035P28A1450J5005J2149P678M663J435j693n292r063j1295j1656E821
6724G143R36l611a845A083P184J047m403F98L163K191M7P54J360j079l503P87
6708D418L457m06A505c204D462L478j565B529J379K709j061G80c370g98A321L753
$$ y = [18334, 9829, 3675, 15096, 19903, 14181, 5694, 10810, 15299, 11342, 5735, 8851, 11420, 5681, 3240, 13521, 19085, 15663, 8134, 8827, 11335, 7854, 5848, 14040, 18004, 12283, -1101, 4885, 13756, 13552, 5681, 2566, 8494, 9271, 4159, 4195, 9502, 8384, 4363, 7998, 13330, 12950, 6507, 2271, 7246, 7677, 3065, 4735, 10175, 10117, 2425, 2275, 11905, 15210, 11266, 6173, 8319, 10550, 6980, 6817, 16513, 25399, 28461, 25743, 20320, 16267, 17465, 23877, 28486, 27688, 20436, 15375, 20301, 25901, 24513, 15416, 3602, -1018, -3053, -2325, 11450, 26455, 38604, 46282, 50945, 52380, 50687, 45395, 36332, 25037, 13381, 5821, 7143, 8079, 4468, -1845, 1083, 8267, 9314, 4911, 698, 3861, 6052, 6099, 6853, 8213, 7134, 3631, 4418, 7875, 7469, 1505, -3204, 4462, 7940, 6375, 2529, 3908, 6617, 5556, 780, -3370, -798, 1321, 5074]
6692E074K462r07A560K161Q878P296J597j226r42p82n71l994O404M785O435L035
6676C4636J8128J2263J7138J7008J0465J842o266k2425j7485k5134j4517j680
6664B3973N064O90r83o616k927K481o49n192p302l530j273C39c185A031J038H8
6647b909b89A534P63K192K602P85j903B261a546j970N89A498M511K115j367C362
6630A269k31f06j673D90J619F09f49C472L357J86C095a663f02A726J351J469J056
6613E602r2n0J537K525L93k824A933i89B149K363J090q45j205J86K740K767J08
6596I353k541B957o25J220p35e26j661A83J898J053J262J508K76j334k171D30
6579b138k279K033J002r86R26A080J177m16r07N99M98H27e45I46J941K25k04Q70
$$ y = [5074, 7536, 6629, 1560, 3721, 12599, 19895, 21492, 20266, 19324, 18542, 17971, 13977, 20381, 25166, 31601, 34636, 52764, 65027, 82165, 99173, 109638, 111480, 105214, 82789, 65304, 40170, 25653, 23973, 29037, 29727, 28744, 22128, 19201, 21682, 21033, 15841, 8539, 5009, 3736, 339, -3185, 1031, 2069, 88, -2909, -289, 1534, 2297, 4489, 7091, 7876, 5973, 2261, -1546, -3516, -2927, 1498, 6009, 8124, 6757, 3362, 1269, 1038, -606, -2279, 490, 2109, 609, -649, 3472, 6829, 7015, 3095, -1663, -602, 1726, 3077, 4546, 5602, 5510, 5460, 6997, 9522, 9915, 7091, 1933, -989, 2149, 4512, 5602, 4757, 3552, 3738, 6478, 9245, 9353, 6812, 2957, 2332, 3552, 2817, -526, -2187, 183, 2081, 3134, 4396, 5904, 6180, 4846, 2675, 430, -2138, -4417, -2384, -1382, -2368, -1442, 1080, 2257, 1841, 934, 1533, 2031, 827, -545, 946, 2887, 3112, 2908, 3778]
6561C778K77A896a606j374N45r69H62R396R242O859L248M02k122l443m139m536
6545A5769m095m264B859a637e71F284P119O466L462j56m156p010D518d07j767
6530b174j256j642l802l562J610J159K803K063a032L93j78F85e29j511b67B076
6513D645K459K65k072D78c442J098f01J54A274L608L156K235L256R03j571J340
6497A4201O613N164J770m88k910m110o337n983B636L831O743M948J169m58r87
6482A7882j787k533k865l290l530c67k278J211A531K537J516L22J20L01O41M1
6466G009j650k594m25L290Q599J2206J2930J0931O551J239k620n474o978p198
6452C5816n516l164j994k048k641l671m328m490C653f12n749b78G038N781N388
$$ y = [3778, 4055, 1896, -1606, -2980, -2435, -3404, 862, 10258, 19500, 26359, 29607, 30009, 27887, 24444, 20305, 15769, 11674, 7410, 2859, -1637, -571, 6284, 13403, 19869, 23331, 23175, 19019, 12009, 4518, -407, -2174, -3430, -5072, -8874, -12436, -10826, -9667, -6864, -4801, -1032, -639, -817, 685, -529, -2040, -267, 2076, 4645, 7104, 7369, 5297, 478, -3442, -2344, -601, -447, 1274, 4882, 8038, 10273, 13529, 14432, 12861, 14201, 20814, 25978, 27748, 27260, 24350, 20240, 13903, 7920, 2636, 6467, 13210, 18158, 19327, 18869, 17882, 16095, 13562, 10697, 7407, 3877, -367, -2645, -1434, 1531, 4068, 5584, 5906, 6026, 6327, 6968, 7009, 5359, 2765, 2340, 5630, 14229, 26435, 39365, 50296, 56847, 58086, 55466, 49992, 43014, 35816, 30300, 27136, 25142, 23094, 20453, 16782, 12454, 7964, 3653, -612, -6361, -278, 7038, 12819, 18207]
6437A8207mn543D416c529A337M686N21C197a118K59E580O358O146M292K684Q36
6421B5896j97J16q54k922m998n840m719j455Q53M95j387A606c207j928a46C243
6404E438K502J788m74l516A36R7N976L146o03k225j570J881K366j40j795J149
6388H418M198K495o32j02K784P041N251q23o170l630N339J1649J1092M152l046
6373D8016j4436A6497J404J4479M428j1967f01I300L5117L0146K0551N873J5788
6360A16775L5744P7813J19540J41765J42205J22932Q9431M8553M850l9657q4063
6349G75888j20049j43918j48785j31375q3975k8419K750j0668j7188j1978O41
6338H2924J4459L2633N0089N2747L8453M716k6140m8994o4196F7487C61L6182
$$ y = [18207, 18203, 12660, 4416, -3529, 1337, 6023, 6544, 3197, -1118, -859, 5580, 11938, 18084, 22376, 25060, 25896, 25699, 25815, 24961, 22039, 17041, 11201, 6482, 5027, 5880, 6375, 4988, 1606, -3207, -5135, -146, 3243, 5438, 7940, 9728, 9254, 5738, 136, 233, 6209, 9355, 8752, 6527, 4957, 6838, 9204, 9064, 7269, 8418, 12616, 15111, 14479, 14377, 17161, 24202, 29453, 28630, 22460, 18830, 24169, 35818, 46910, 51062, 48016, 33580, 16497, 17901, 32380, 36808, 24841, -601, 9300, 44417, 74563, 95114, 100987, 116775, 152519, 230332, 349872, 491637, 633842, 756774, 846205, 894758, 899608, 859951, 775888, 655839, 511921, 363136, 231761, 147786, 119367, 122117, 111449, 94261, 82283, 82924, 97383, 130016, 180105, 232852, 271305, 276021, 249881, 200887, 136691, 67487, 361, 36543]
6326C6543M8056L6169K7112K5876K0709J3113K6364R0780J61824J86081J55895
6315H28522Q1261k3905r9481j12359m9239K0357J7246l9888j16806j49415j55785
6304B00508H1700A5281D476K9844L9622K6627L149j6554k7910k4184n588L493
6292C2975N795K095O19O214J4211J3518P437K729M68K456j846j0751k4441B3731
6277A6684N752K630J533J149Q89q77K823J4641J0700J3158M1891Q3323J19596
6264C13892J33636J19362Q1544K4794l7692r4644j28390j33025j10684p3506m5086
6253E0201j8563A3047h39B0118J0516n909q519H025J473L666k541A833e663C939
6238A3837O311K114l400q725h28o816J395J040P88a82D987N184r40r48l101B52
$$ y = [36543, 84599, 120768, 147880, 173756, 194465, 207578, 233942, 324722, 486546, 672627, 828522, 909783, 885878, 786397, 674038, 624799, 645156, 662402, 622514, 505708, 356293, 200508, 81700, 15281, 4476, 34320, 73942, 100569, 103718, 87164, 59254, 35070, 29482, 32975, 38770, 40865, 41484, 47698, 61909, 75427, 82864, 85593, 86061, 88517, 86671, 75920, 51479, 23731, 16684, 22436, 25066, 26599, 27748, 28637, 27760, 30583, 45224, 55924, 69082, 110973, 194296, 313892, 447528, 566890, 648434, 673228, 635536, 540892, 412502, 279477, 168793, 95287, 50201, 31638, 13047, -839, 20118, 30634, 24725, 16206, 8025, 9498, 13164, 10623, 1833, -5663, 3939, 13837, 20148, 22262, 18862, 10137, -828, -7644, -6249, -5209, -4421, -182, 4987, 10171, 9231, 8283, 5182, 252]
6221b299D45J316b873a022F430L401j410B508c915g78j538C368J0021R887M653
6206B7929j856k931q65J297q06m008o307m266P90K808L480M390P671J0105J0931
6191D8362R811P275K746j577n157q008j0949j3500A2971e78A2344J6941J2708
6178D1993Q010K244k659p114j0442j2845F139D03J924H50c952k904A077L899P067
6163A2043R159O997K582j964J38J0931J5816J1367M864l065j0133j1956m660J3730
6149E5849K3971K0636J0078o783q998k728R015K2544M1533O0387O9281O2425L8654
6136C95864j630l9746o8435q2490p6301F1148B4253b605p288C663J2306n57n752
6123I660B319c381n204m899J336c895C490O302N056K621n213A036a2898f350g21
$$ y = [-2299, 445, 1761, -2873, -1022, 6430, 9831, 8421, 2508, -3915, -778, -2316, 3368, 13389, 23276, 27929, 26073, 23142, 22277, 23574, 22768, 18760, 12453, 8187, 8977, 11785, 15265, 19655, 27326, 37431, 48362, 58173, 65448, 68194, 66617, 61460, 53452, 42503, 29003, 12971, -578, 12344, 29285, 41993, 50003, 52247, 49588, 42474, 32032, 19187, 6139, 403, 2327, 850, -3952, -6856, 1077, 4976, 12043, 21202, 28199, 30781, 28817, 28955, 39886, 55702, 67069, 71933, 68868, 58735, 46779, 42119, 55849, 79820, 100456, 110534, 103751, 94753, 92025, 101040, 123584, 165117, 225504, 294785, 357210, 395864, 394234, 354488, 286053, 203563, 127262, 61148, 24253, -2605, -9893, 3663, 15969, 15412, 9660, 2319, -3381, -8585, -13484, -12148, -3895, 3490, 9792, 14848, 17469, 12256, 1036, -12898, -6350, -721]
6107D659O506J747P30n723j450J825j069C146c783p902o739O332e359a252l582
6092d834l457A76P547K53C72a008A2547J0596O875N910L436L084K781L003L230
6077E1462l324j2401j6129n005J771l097B509d909C451e85A3591L3965L1480J9453
6063I8489N022r585j7010k7319A3873J3284K6164k615A7608J3460M1897O860l5517
6050D4308P26O0670J6324n5393o117J18528N0576p0387j7178K43466J56534j46560
6038C95497m3860J153600J635996J821293J643460J103873L08350n61012j296598
6029F160599j734324j798733A107619A92380K68810M0503k04885A03403R2101
6020A95504L1089q2134D3052N3506K8386l7172B2151L1707K9586j4870C0732l461
$$ y = [4659, 11165, 12912, 13642, 7919, 6469, 8294, 7225, 3146, -3783, -11685, -18424, -12092, -5359, -1252, -4834, -8291, 176, 7723, 7976, 372, -1008, 12547, 23143, 30018, 35928, 39364, 42448, 45229, 48232, 51462, 48138, 35737, 19608, 14603, 16374, 13277, 2509, -4909, 3451, -585, 13591, 47556, 79036, 98489, 103511, 93926, 76916, 49597, 13873, 27157, 53321, 50706, 17608, 31068, 72965, 79825, 44308, 45034, 105704, 122028, 66635, 60518, 179046, 229622, 159235, 142057, 385523, 542057, 395497, 351637, 1505237, 3141233, 4962526, 6605986, 7709859, 8018209, 7457197, 6160599, 4426275, 2627542, 1107619, 192380, 461190, 501693, 296808, 103403, 195504, 226593, 144459, 43052, 96558, 124944, 87772, 22151, 53858, 83444, 68574, 30732, 27271]
6008B7271J5465j0083E554J2659J6178m042j1963P914R596n856A2158m009J2941
5995B1090l81G230B031J1080J813F440F87O424K80C367N281P859p11D439a0059
5979f232a515k575J107B166P27b670j0686K913a115A741o49C19A29a669j787A848
5962D765n71o21N030N412J508L790J0633K1619K4932K2100J5587O567m800j3517
5948A02434k0381k4387k4616A5221p153o71l320e43C773M934O80k851C101F60
5933b234J091C736J911j755h95l172F12J217d45k114A217L421K09A688c649m775
5917h424J076J241J9j491l385m255O05J534J161M287H41J2415J0027O017K016
5902C1316k490n341o776p707A903c726l96a583A31J343L20m8F99a564j643a292
$$ y = [27271, 42736, 32653, 5554, 18213, 34391, 30349, 18386, 26300, 35896, 30040, 12158, 8149, 21090, 20709, 7230, 2031, 13111, 14924, 6440, 687, 7111, 7391, 3367, 8648, 16507, 15796, 4439, -10059, -6232, -1515, -4090, -2983, 2166, 2893, -2670, -13356, -10443, -1115, 1741, 1092, 319, 129, -1669, -3456, 1848, 4765, 4194, 3573, 8603, 14015, 15523, 19313, 29946, 51565, 76497, 98597, 114184, 120751, 115951, 102434, 82053, 57666, 33050, 15221, 8068, 7397, 4077, -543, 3773, 8707, 9387, 6536, 3101, 660, -2234, -1143, 3736, 5647, 3892, -895, -4067, 612, 1829, -445, -2559, 1217, 4638, 4847, 1688, -3649, -8424, -7348, -6107, -6088, -7579, -10964, -15219, -14614, -13080, -11919, -7632, 841, 13256, 23283, 29300, 31316, 28826, 23485, 16709, 9002, 1903, -3726, -4122, -1583, 131, 1474, 1794, 1746, 699, -1564, -3207, -1292]
5885a21q54j866P73A005K043p20E65f48p20j03j078j391o16j695Q29g42F075R012
5867A5087R149P460M006J320l311o858r555G646A360A57a30j001q38K35M93p0
5851a311j264o70m92q27m091j067j886o95Q30J431N92P48p88Q31K291R28k067
5834g507j952k973k755K775K744L785K030J103m912j43p01c405k011l597K863
5819f150M81j166P49J735J070M03L16O66M18K80M21m08J73a08j042j788K0k514
5801e432J255j291o021l560k330L174c777C715M749o64e86q215j1155J12Q726
5786a1118N243B490a614n545b054H08J124m11g32k478J087A333N545M102N933
5771A6913O418N006K944L68j149l618m894o358p699A157h83B482M123L129J111
$$ y = [-121, -975, -2841, -2068, 1005, 3048, 2328, 565, -648, -1368, -1471, -2549, -3940, -4556, -6251, -5422, -742, 6075, 15087, 24236, 31696, 35702, 37022, 33711, 26853, 17298, 7646, 1360, 157, -130, -1131, -1969, -1734, -1241, -1311, -2575, -3245, -3737, -4564, -8655, -9722, -11608, -12303, -11473, -10042, -9450, -8702, -9490, -8659, -6368, -5440, -7507, -9459, -12432, -15187, -12412, -9668, -5883, -3853, -2750, -7662, -7805, -8506, -3405, -5416, -9013, -6150, -5669, -6835, -6086, -4351, -3281, -2878, -2562, -1896, -1478, -1198, -777, -1185, -1012, -108, -1150, -2938, -2918, -5432, -4177, -5468, -11489, -15049, -17379, -14205, -3777, 3715, 8464, 7800, -586, -8801, -19956, -19844, -11118, -5875, 2490, -1614, -7159, -2054, 808, 1932, 1521, -732, -3210, -2123, 1333, 6878, 10980, 16913, 23331, 28337, 31281, 31649, 30500, 26882, 21988, 15630, 7931, 1157, -883, 2482, 6605, 9734, 10845]
5756A0845P38J70o24m34r27l49m31j089l141B32d243m24E4L248J403N1k016A103
5737g0k358j796l15k65K340C590M428L046J825J514L52K28j231k119k743k386
5721F504k159j579A047a225j326c55A825Q01l89G00f58j147j127j631J105i62
5704E31k50a558j755a582A45N25f72k201q41L00N12J79q4B39J108m3d59k199j93
5685b851a073F84J127m92B92M5N179J1852P717O151J536m48l901p649q142D057
5668a39n60A432R5J145J857p82K09K256J875j31k995e88k525A708L826R02m29
5651F007r70j849A230a075j838J372d9C96L4P16J728K315n49A754b675k362K069
5634b968A330L798K116K42j961B137G3J424J097n53e3n19B318K971J899k65k501
$$ y = [10845, 11583, 11753, 11129, 10695, 9768, 9419, 8988, 7899, 4758, 232, -4243, -4667, 54, 3302, 4705, 4756, 2740, 1103, -70, -2428, -4224, -4539, -4804, -2464, 3590, 8018, 11064, 12889, 14403, 14755, 14983, 13752, 11633, 8890, 6504, 4345, 2766, 1047, -1225, -2551, -355, 1825, 2626, 2237, 700, -658, -1805, -2932, -4563, -3458, -962, 531, 281, -1558, -3313, -1582, 145, 670, -672, -2873, -3714, -3414, -2902, -2723, -2807, 239, 1347, 1304, -459, -2658, -2851, -1073, 684, 1811, 1319, 292, 337, 5516, 17368, 25085, 31236, 32772, 32324, 28423, 20774, 12632, 4057, -139, -699, 1432, 1527, 2672, 4529, 3747, 3956, 6212, 8087, 7956, 4961, -588, -3113, 1708, 5534, 6436, 6007, 5037, 3188, 1230, -1075, -2913, -1541, -49, 396, 430, 1146, 2874, 5189, 4640, 1754, -2675, -5037, -2968, 1330, 5128, 7244, 7486, 5525, 2137, 73, 1497, 2594, 2041, -53, -572, 2318, 5289, 7188, 6923, 4422]
5617D422d30j114C529N622L365J015k144m093j843R01P04j873F35a309D124N488
5601I612L259M84j193j222q11k1o54j736k186j904p39R1N06Q63K046K370L246
5584A2011L199J907j769m152o43K103L742L97m447j731M528K806j937m876J105
5569A2243O011Q16o554f38a56A3248R580K947k265k127j534j765m934o481m86
5554F183R86l46j02L343Q398O299m930H484l181J4301J5312R636M167k432l380
5539D2907K559Q787J0009M813Q029O396P103Q730M803k250l700L772M444l742
5525A02660j1947j7139k3395j2710K2457J5549J8206K7712K1947J7269P081P3
5513A67763k0604k1215p302J6145M5235K2695L904J2L1725M1133L3799J8270P747
$$ y = [4422, -430, -1544, 3529, 9151, 12516, 13531, 11387, 7294, 5451, 6352, 7056, 5183, 635, -1309, 4124, 9612, 12871, 13355, 12162, 10940, 10129, 10108, 9454, 7718, 5532, 3628, 2889, 2980, 3486, 4349, 6395, 8765, 12011, 15210, 17117, 15348, 11196, 10553, 12656, 16398, 16795, 12348, 10617, 15145, 17951, 16014, 11138, 12243, 18254, 19070, 12516, -638, -156, 13248, 22828, 25775, 23510, 21383, 19849, 18084, 13150, 6669, 6183, 7169, 6823, 6721, 10064, 18462, 24761, 19831, 8484, 5303, 19604, 34916, 44552, 48719, 46287, 42907, 45466, 54253, 64262, 69075, 77104, 83500, 90603, 99333, 104136, 101886, 98186, 101958, 106402, 102660, 90713, 73574, 50179, 37469, 59926, 75475, 93681, 121393, 143340, 160609, 167690, 167763, 147159, 125944, 118642, 134787, 180022, 202717, 206621, 206633, 238358, 279491, 313290, 331560, 339307]
5500C39307K8592N5050R0473J11179J17652J36729J71174K42058M01000O47558
5490B340772R21151J110959J130110R39417N41628j8782o42902j224876j671794
5481C425683A526648B60129J380722R96318M78018j126l41600m83857m76815l87838
5471A423951k90098k20036j68870j24503q9833o8862n6499m5077m5824l8283l6506
5460B39560k6333k1414j8720j1982q565j0256j2743q143o568p849p392o015j970
5447I1610l253p112q604o567p14K254j254m671m924m387j577j566j667K591L297
5432E3456K548N46K970K675l055o106k647M389P911N651l130j2539j2287n806
5418C4576nj316n013m490m63M665N176J789l393n633n325m818m507J854J0502
$$ y = [339307, 367899, 422949, 513422, 624601, 742253, 878982, 1050156, 1292214, 1693214, 2340772, 3261923, 4372882, 5502992, 6442409, 6984037, 6965255, 6322353, 5097477, 3425683, 1526648, 260129, 1640851, 2637169, 3115187, 3114061, 2772461, 2288604, 1811789, 1423951, 1133853, 913817, 744947, 620444, 530611, 461749, 405250, 360173, 314349, 276066, 239560, 213227, 191813, 173093, 161111, 152546, 142290, 129547, 121404, 114836, 106987, 99595, 93580, 91610, 88357, 81245, 72641, 66074, 65360, 67614, 66360, 61689, 56765, 52378, 50801, 49235, 47568, 50159, 53456, 56004, 56550, 59520, 62195, 59140, 53034, 50387, 54776, 62687, 68338, 65208, 52669, 40382, 34576, 34571, 33255, 28242, 23752, 23289, 27954, 33130, 34919, 31526, 25893, 20568, 15750, 11243, 13097, 23599]
5403B3599J1129M429l277r677j0480F912A967K001J1389J3355P340K32n545p790
5389B2949l7K421m835r254B062L293o38A193e561C931J0231Q736M534l193q634
5374A5605C933A045J41P329N959J513j905m447D068a336A000N511J803j318l120
5359C876j482J010j332L99K484M655L664P0m955m000J203M686K989J870R40j947
5343A4130o825b189A6504K3601K0389J6415J1198N188k330r557j7089k2970A9416
5329H196K937J844l710l397R36J915J091n7j657q49L63M79j771k590m90K373L311
5312H924L638L936K429j378p359A87P35J1162N715k521G570i92k787e86N0I41
5295F956N553O67m017m283J911L929N284L757N844O292K591j867k857q83K510
$$ y = [23599, 34728, 39157, 35880, 26203, 15723, 6912, 1967, 3968, 15357, 28712, 36052, 36284, 30739, 22949, 22912, 25333, 20498, 11244, 2062, 5355, 4717, 1193, -5561, 3931, 14162, 22898, 27432, 24239, 15605, 3933, 1045, 1186, 8515, 14474, 15987, 14082, 9635, 4068, -1336, 1000, 6511, 8314, 6996, 3876, 2394, 3404, 2072, 2471, 4955, 9610, 13274, 13344, 8389, 4389, 5592, 10278, 13267, 15137, 16077, 14130, 7305, -2189, 16504, 40105, 60494, 76909, 88107, 93295, 90965, 81408, 64319, 41349, 19416, 8196, 11133, 12977, 9267, 5870, 6806, 8721, 9812, 9755, 8098, 7249, 7612, 8091, 6320, 3730, 3240, 5613, 8924, 12562, 16498, 18927, 17549, 10190, 187, 922, 12084, 17799, 15278, 7570, -992, -3779, -586, -536, 941, 6956, 12509, 13176, 9159, 4876, 6787, 10716, 16000, 19757, 25601, 31893, 34484, 32617, 29760, 28877, 31387]
5280C1387J226k550k415J973M178K979K434M199O272N945L715k434r988j1139
5266C5782j230K168r186A2681J9374M2477L6993K0071M729k196N905J3976J1748
5253A65758j997k2999k8312J9433O8409N3600K1750R3567K93013M44250M91361
5242A597833M27388K62579L6153j99903l89047m87740m73782l40711j22440j3524
5232B96806m5331o9241m5748p089j0807k6886j9824L476J830j3401j7316m490
5220D1979K877o940j7217m879O582K441P081J5733Q429o246j8080j2694N924N815
5206C0805O477J3286J0279m876j3840L394J8326L283j5279o46K8895J6128o257
5193H9975K3686P0791M7867q446K1229K13754L34815L50181K82385J56459O965
$$ y = [31387, 32613, 30063, 27648, 29621, 33799, 36778, 39212, 43411, 49683, 55628, 59343, 56909, 46921, 35782, 34552, 36720, 27534, 12681, 32055, 74532, 111525, 131596, 136325, 134129, 140034, 154010, 165758, 163761, 140762, 112450, 131883, 200292, 253892, 275642, 369209, 662222, 1106472, 1597833, 2025221, 2287800, 2323953, 2124050, 1735003, 1247263, 773481, 432770, 310330, 296806, 251475, 182234, 136486, 129397, 118590, 91704, 71880, 75356, 77186, 63785, 46469, 41979, 44856, 37916, 20699, 15820, 22402, 24843, 31924, 47657, 56086, 49840, 31760, 19066, 24990, 30805, 37282, 50568, 60847, 55971, 42131, 45525, 63851, 67134, 51855, 51209, 80104, 96232, 89975, 113661, 184452, 232319, 223873, 245102, 458856, 793671, 1143852, 1426237, 1582696, 1589661]
5182A589661j27491j96309j10823J43151L47970L55557K11556n16j86920k70237
5172A755599k14034j03215p7441j63716k76788l31001k67419p4751K3656l0431
5162B40459p3216m9638R119J898l7925k2690K4555K5667n531l2809l6842k0306
5150B2741N267L095k121l353J9145L3337J9068Q739l659l062J3764K2073J9230
5137A54264K3425N2356R2511J22483J36542J36955J21276R0061L4431n3808r9066
5126H11430j29180j40135j34192j12262p7136m2063k8017m0641E2154c566B3685
5114E3845J3061m051j2623j1002j073n84m583j0164I513a556C373J2258P562K189
5100B5382l06j853j457j359o22p8j703n204D429a974F935N282J448r93k866k278
$$ y = [1589661, 1462170, 1265861, 1155038, 1298189, 1646159, 2001716, 2213272, 2212756, 2025836, 1755599, 1541565, 1438350, 1360909, 1197193, 920405, 589404, 321985, 247234, 270890, 240459, 167243, 117605, 126724, 128622, 90697, 68007, 92562, 118229, 112698, 79889, 43047, 22741, 28008, 31103, 28982, 25629, 44774, 78111, 97179, 105918, 102259, 99197, 112961, 135034, 154264, 177689, 230045, 322556, 445039, 581581, 718536, 839812, 929873, 964304, 910496, 811430, 682250, 542115, 407923, 295661, 218525, 176462, 148445, 107804, 52154, -3566, 23685, 53845, 66906, 62855, 50232, 39230, 38157, 37573, 32990, 22826, 9513, -1556, 3373, 15631, 23193, 25382, 25076, 23223, 21766, 20407, 19785, 19707, 18004, 12800, 4429, -1974, 6935, 12217, 13665, 12672, 9806, 7528]
5084G528q32R44J312O09r50k429j760Ml97J32r89N29J932L104J634q74l508B082
5065F85J396J439K823M145K788p19k876l782B652J329M714O621P424O780O803
5050C6323P565Q347P973O033K311k274p515j0474j1352q874l348P38L289O241
5036C4983J1619J8629K1647K0096J4570M079o294j5585k2007k3805k0803j4662
5024B2467q453m428j340R46L72j923k658p4K259J339j232l356H4J461L789J961
5008G295k37k197A868G7P84R18J55k37j19o06A97J62Q06m51c92j151O69A101O30
4989A731n87a385p95R63d88k97j632R92A430K247j62A296a411O27A534J852K51
4972C637j405B84b079k157J489f39b66q82j573M23i76p3k73pp89j901J373e46
$$ y = [7528, 6696, 7640, 8952, 9561, 8611, 6182, 4422, 4426, 4029, 4161, 3172, 3701, 5633, 8737, 10371, 9497, 5989, 2082, 685, 2081, 3520, 6343, 10488, 13276, 12557, 9681, 5899, 2652, 3981, 8695, 15316, 22740, 29520, 36323, 43888, 52235, 60208, 66241, 68552, 66278, 58763, 48289, 36937, 28063, 24715, 25453, 28742, 34983, 46602, 65231, 86878, 106974, 121544, 125623, 119329, 103744, 81737, 57932, 37129, 22467, 14014, 9586, 8246, 9192, 9564, 7641, 4983, 4909, 7168, 8507, 7275, 3919, 84, 1545, 5334, 7295, 7058, 4861, 1868, 77, 861, 1779, 1934, 1697, 1578, 972, 197, 359, 1165, 714, -392, -1543, -874, 1101, 1731, 1144, -1385, -2180, -1217, -488, -785, -2417, -1425, 1430, 3677, 3515, 1296, -1411, -784, 1534, 3386, 3637, 2232, 284, -2079, -4236, -2747, -639, -266, -1148, -2721, -2298, -976, -1049, -1322, -1329, -2118, -4019, -2646, -546]
4953B77i02k665p7a318d7l47j237j839L49a478f0B97h08j542n42R92e34d0l15
4934c55j510r59a057D21M88B92i04o33K60p1l64P2K49L34k51J20K98l70j64f97
4913A211K042J370R02M57O17R18R76J37j133j919k642B42b117k029J358i61C23
4895A969J223N19n21A426h37j270N96M45l63j152m78P44h09D8M70b40j765k6f61
4875g75r45P36E48K65g27k464r4a448c98J77r5n92q40o18j089o9Q32O98O93j97
4855a498j167j192Q66O59l35o76j21L67Q94f97E71L16a85j652j186n64k27J327
4837b487f76D40B6a746N99A784J755k5A736g83k605J474c04f8r67j075j22J072
4819a160d62J08j69j92L8a98D57K66n5K84P28Q19n25B41a523o97M93d53C03L18
$$ y = [277, -902, -3567, -3644, -1318, -47, -394, -1631, -3470, -3121, -1478, -60, 297, -808, -2350, -2892, -1900, -534, -40, -355, -1865, -2824, -1057, 421, 909, 292, -904, -1537, -1277, -1348, -1712, -1640, -1391, -1057, -1308, -1188, -890, -1260, -1424, -697, 1211, 3253, 4623, 5525, 5982, 6599, 7517, 8493, 8630, 7497, 5578, 2936, 242, -2117, -4146, -2788, -961, 323, 1969, 3192, 3711, 3190, 1426, -837, -2107, -1511, -1066, -1429, -2581, -3059, -2315, -809, 48, 518, -240, -2005, -2031, -661, -775, -1720, -984, 548, 813, -727, -3191, -3285, -1448, -398, -221, -316, -908, -1748, -2366, -3455, -3524, -2692, -1994, -1301, -1498, -2665, -3857, -2991, -2332, -2667, -3343, -3464, -3097, -2203, -697, 571, 887, -185, -1837, -3023, -3587, -3814, -2487, -676, 440, 26, -1746, -1147, 1784, 3539, 3514, 1736, -783, -3388, -1914, -304, -68, -1035, -2110, -2232, -1160, -462, -354, -523, -715, -677, -198, 457, 723, 668, 952, 1680, 2499, 1974, 241, -1523, -2220, -1727, -453, 303, 621]
4799F21a61j095N17A397J469j35j177C42c21j179k296M65J395K64M31D2J014k23
4781H33g19k070e82D8g08r78P24C43J008O74j65H05i93j688p55j42P40a293I9
4761E8a511j466e74F34m7c43r74p26l23N17P59j44m3B24J541M80q92b46r04p97
4741a947M97c76A075M91F92b103j942K18R0J727A42Q96A05a898j941N55m2O70
4723b656d81I72K14n34Q92R96j034a303k439a599M40r38h99A138N27F63a534j483
4705c017o68P25a457e41m88m63H1J693n79a426n34I86J007C88b675a070F68A51
4686b167l08g27J05q94O07n0k226g74B146J141A547b712P40A174J150k49k31Q46
4668B690n66f90j0A695M11D70a12I20a44k716i52A420l93a875e14C515M30F10
$$ y = [621, -161, -1256, -739, 1397, 2866, 2731, 1554, 342, -321, -1500, -3796, -3331, -1936, -1672, -1241, 42, 1056, 833, -719, -2789, -582, 48, -708, -1686, -962, 343, 1351, 2025, 1860, 805, -993, -2681, -3436, -3578, -2838, -1293, 99, 58, -1511, -2977, -574, 634, 587, -343, -1317, -2043, -2366, -1849, -1090, -1234, -1277, 224, 1765, 2245, 1353, -246, -1150, -1947, -1450, -376, 1075, 1566, 692, -2103, -4045, -3827, -3737, -2010, 142, 1038, 105, -1898, -3839, -3284, -3326, -2656, -481, 972, 1186, 652, 1544, 2540, 1506, -1303, -3742, -1599, -1159, -2097, -899, 1138, 1665, 663, -1534, -3017, -3685, -2960, -1457, -541, -1029, -1492, 81, 1774, 1195, -1426, -1960, 986, 1993, 388, -2675, -1070, 668, 151, -2167, -2475, -727, -622, -1516, -909, -959, -3185, -774, 2146, 3287, 1547, -2712, -1972, 1174, 2324, 2075, 1844, 2690, 2124, -690, -700, 1695, 2106, 470, -112, 920, -144, -2860, -952, 1420, 1027, -1875, -514, 3515, 3945, 610]
4649b346E94J074A11a305I73O50b55q55A547R09a48k246B337K587o99j612j08
4632B505J68H3f95C602J190A526b299C949K980j594A396M64L520o31D71K66L468
4615D205m64g92p9C492K77A723K104L367o81A955F52M292K54G65a063D147J325
4598E472B677k61M484M36B928M47O455J559m060k928N996L625k010k745N332R975
4582B4574J3267J9302K3672K1985J4275L653q572j9103k6040k7182j7917n034
4570A6880l777k431O256L827m272F712K539O885j742E622K297P478k484B232N988
4555H220J0435k98G639k626J0765Q77H103L342J1168L05A0899j52J6469O160o873
4540B6503p454M278J081o154P232J5087K324j5254A1829J5470P407j3824F506
$$ y = [-2346, 594, 1668, 111, -1305, 973, 1623, -255, -1110, 1547, 2456, -148, -2394, 2337, 4924, 4225, 2613, 2505, 2673, 83, -695, 3602, 4792, 1526, -2299, 3949, 6929, 5335, 1396, 1860, 5380, 4749, 471, 737, 4205, 3741, -792, -871, 3492, 3769, 1723, 3827, 7194, 6513, 1955, 652, 4944, 5198, 765, -1063, 4147, 5472, 2677, 2416, 6900, 7336, 2928, 3375, 9830, 11389, 7329, 4401, 10397, 14022, 12012, 9267, 14599, 24574, 37841, 57143, 80815, 102800, 117075, 120728, 112156, 93053, 67013, 39831, 21914, 16880, 13103, 10672, 16928, 20755, 16483, 6712, 9251, 16136, 14394, 5622, 7919, 15397, 12913, 2232, 8220, 18655, 18357, 7639, 5013, 15778, 16655, 8103, 11445, 22613, 22918, 10899, 10747, 27216, 33376, 26503, 19049, 23327, 24408, 18254, 25486, 40573, 42897, 27643, 11829, 27299, 34706, 20882, 6506]
4526C3418J2283j2357A2218K0537J4184j2949H660L0656K0895j1121A4451J9742
4514C4193K5934r668A7580K8254L0882r543B2783K3240M0928n939C2480K2599
4502E5079N0430l380D3032J5368O9038M526F3976n44Q9237J4768p6690q237J17510
4489B00020K6818r7114l3665J66251N4583j18535p1954K41596J05214j44216j55236
4478A73762L60724K05052j80617k68811O22833M75721j32547l88133R77536J060981
4468B906501l83666D16438O046338Q858677J0381817R959782P406948L159327
4460D6229327j837979o392702r462560j0456484H687436A838191Q1429R78968
4452B898588p82330I69972J74707K80699l57549C98328P6753K79878j20556B60590
$$ y = [33418, 45701, 33344, 12218, 32755, 46939, 33990, 8660, 39316, 60211, 49090, 14451, 34193, 60127, 50459, 17580, 45834, 76716, 67173, 22783, 46023, 86951, 81012, 32480, 55079, 105509, 102129, 43032, 58400, 127438, 131964, 63976, 63432, 152669, 167437, 90747, 82510, 200020, 226838, 129724, 96059, 262310, 316893, 198358, 126404, 368000, 473214, 328998, 173762, 534486, 739538, 558921, 290110, 912943, 1388664, 1256117, 867984, 1845520, 2906501, 2522835, 416438, 6462776, 15321453, 25703270, 35663052, 43070000, 46229327, 44391348, 37998646, 28536086, 18079602, 8687436, 1838191, 1919620, 2898588, 2116258, 969972, 1144679, 1425378, 1067829, 398328, 475081, 754959, 634403, 260590]
4441B45283K09676m0186A89145l9885J48910j1211A35853l9301J21706L456j05659
4430A16055n2561R4069J2596p6211D0395Q0685J8037n4329B6377O0234J9378l9191
4418F6798B5877N0289J8777l0603A7918L9122J9506k3170A2455L5368K1178j6065
4406E2936A5541J9240J9976j1039A4610J5703J8209q768A2631J1741J8270n132
4394C7510A3266N95J7744k683A0501Q476J6808j604A5528o430J5972P49A1576
4380I145J5558J987j2646o201J3634L028j0021C167J0991K750G963l878J2736
4367A6821L243q024D979J1463N680o078C779M605N674l611n079O979M264n650
4353A0961A621J3428J0339o90r943j77J9650K1554K0080J8365J5060R752J170
$$ y = [245283, 454959, 414773, 189145, 149260, 298170, 286959, 135853, 96552, 218258, 221714, 116055, 63494, 157563, 170159, 93948, 40395, 121080, 139117, 84788, 26377, 86611, 105989, 66798, 25877, 76166, 94943, 64340, 17918, 57040, 76546, 53376, 12455, 47823, 69001, 52936, 15541, 34781, 54757, 43718, 14610, 30313, 48522, 39754, 12631, 24372, 42642, 37510, 13266, 13861, 31605, 28922, 10501, 18977, 35785, 34181, 15528, 9098, 25070, 25819, 11576, 9145, 24703, 26690, 14044, 7843, 21477, 24505, 14484, 3167, 14158, 16908, 7963, 4085, 16821, 20064, 12040, 4979, 16442, 22122, 16044, 3779, 8384, 14058, 10447, 5368, 12347, 16611, 10961, 1621, 15049, 25388, 24698, 14755, 14578, 34228, 55782, 75862, 94227, 109287, 119039, 120209]
4340A20209r358k0117k7850k9424A3937l00M10m178r54K519j944C464K53O381
4326A0098M39D365GO858J504m103A524M326J079C236p75M845J303m055a053E115
4309H103j722A758J91J425F86c70D696K380j969d18B220M021O3k362k80N89j437
4292B814d26B562K472j248E39O75K906O5A928A30J659j18a058l40A854N73k30
4275B197J964K077m73B258f87A735O28D34a433a2A113a6j204B69O04a273B190
4257E933J660j031l017G9h16D50K156J731l35A114a948G69L036J89A803i03j308
4240b211a099c2A307M95B03a479A355K137j74A015a804b93E01c99n44A42K05J030
4222A377K458J822m9j822G58a731l36i71C63O49B51a798b7A805n1i3j285e71A86
$$ y = [120209, 110851, 90734, 62884, 33460, 13937, 13637, 14047, 9869, 8915, 11434, 9490, 3464, 3717, 10098, 10537, 4365, 7, 6865, 8369, 4266, 1524, 5850, 6929, 3236, 2461, 7306, 8609, 4554, -1053, 5115, 8103, 6381, 1758, 1949, 3374, 686, -370, 4696, 7076, 5107, -418, 2220, 6241, 6304, 3942, 3662, 4251, 2814, -426, 2562, 5034, 3786, 539, 1214, 4120, 4185, 1928, 130, 1789, 1671, -1058, -1398, 1854, 2427, 2197, 4161, 6238, 5765, 2258, -687, 1735, 2363, 434, -1433, -12, 1113, -16, -1220, 269, 873, -1273, 2190, 5933, 7593, 6562, 3545, 79, -816, 450, 2606, 4337, 4002, 1114, -1948, 769, 3805, 3994, 1803, -903, -2211, -1099, -32, 1307, 1802, 203, -1479, 1355, 3492, 3318, 1015, -1804, -293, 501, -399, -943, 142, 347, 1377, 3835, 5657, 5608, 3786, 758, -1731, -2067, -971, 363, 1012, 251, -1798, -27, 1805, 1754, -93, -1378, -571, 186]
4202A83b25m47J26p33b80A212N18D69b023g92A30a90l69D05N83B74a302N76C88
4182A247J13n81a68j082j341l22N61d90C016L237J727o48k548A701D75O09oJ03
4164A181J73l34c72j671L44d08B12L44N00K71j86m65H1g34pA830K843J993O05
4145G271o32j418k058A514C07a96n65m40d63F96J05e3j305K64d75P4F75J835J135
4126C645l71A636c4o49n53n88K36P58c02H78J767P03j36j025I82A9f17j87a14
4106F45K77m0j39k37b94j215e27A030P71l99A40a209j76j14j62J39J94M40a83
4086A13b48p05L75D6L79d9j438o30a004j46p71i41G31J156p02B91m8Q8A39D8A6
4064c71R3g8G06O42K21j48l2k48E34c9E24P34L60j04k26k46j69l38g8p03A26R81
$$ y = [183, -225, -672, -546, -1279, -280, 1212, 1730, 469, -2023, -792, 130, -190, -559, 405, 988, 274, -1302, -726, 388, 1247, 1360, 779, -168, -1250, -2591, -2913, -2352, -490, 3016, 6253, 7980, 7332, 4784, 1701, 475, 1084, 1078, 1181, 1354, 1020, -372, -2043, -1699, -408, 212, 556, 1056, 1327, 1141, 676, 81, -734, -741, 1830, 4673, 6666, 7271, 6639, 5221, 3163, 1514, 307, -196, -761, -1201, -463, 696, 801, -53, -1358, -1094, -475, -401, 675, 2510, 3645, 3274, 1636, -34, -683, -1236, -1824, -1588, -830, -302, 878, 2645, 3348, 3212, 2187, 982, 19, -617, -804, -114, 645, 922, 882, 743, 506, -294, -1509, -527, 1030, 1801, 1402, 140, -1209, -1385, -1499, -1661, -1522, -1328, -888, -183, 113, -248, -953, -578, 46, 425, -49, -1487, -2117, -1004, -1150, -1921, -941, 731, 1887, 1185, 291, 243, 331, 139, 48, 16, -371, -278, -78, 706, 1348, 1569, 1421, 1389, 1141, 534, -39, 524, 1258, 1618, 1514, 1288, 1042, 873, 535, -78, -781, 126, 1107]
4042A107Q44k57C84e60a80C05r8r8K61K24B65d83q81m78J38g72b94J39m62K53
4022c64E23Q93j5o50E5a99l52p30j44K65L9k79m53L62K58L19b19E85N16K64J96
4001A561O4q7l18n30h8j215j161k01J131O73a08D67O56M57j56o61B24m3J96L8
3981D15B01K2J294J385P95k49j038H56e71o94r6N42D04J104M45m91A36a368K8
3962a340c95B53N72M99L59J75k29m73m25j56L63K76Jj05k03k84l9L48K59j02D50
3940b22j019n62g31H63J252O7p23F55r0M47L34J05m95B70f79q90K71d40C57N57
3920I14M15L04J83KJ69J46o1p75C03g56p22j79j21n01O31L88K58K68J98h2C61
3898F33M3J23J6j01B82c29l63GN98M63L06J16k65m95A87b53e0G1a09o39q07n83
$$ y = [1107, 1951, 1694, 384, -560, -180, 305, 207, 109, 370, 594, 265, -483, -1364, -1842, -1704, -772, -294, -155, -617, -364, 523, 1416, 1401, 751, 55, -199, -551, -1281, -1425, -1160, -1121, -1400, -1853, -1491, -1233, -914, -219, 585, 1101, 1365, 1561, 1625, 1538, 1220, 690, -88, -1303, -2464, -2665, -1534, -861, -108, 467, 1123, 1580, 1424, 763, 224, 181, 377, 415, 201, 223, 1517, 2902, 3697, 3448, 2410, 856, -571, -1265, -1361, -819, 404, 1508, 1953, 1462, 136, -1368, -1340, -395, 253, 825, 1324, 1683, 1858, 1629, 1156, 731, 575, 938, 1214, 1215, 1110, 907, 623, 584, 932, 1191, 1089, 450, -222, -1241, -1803, -731, 863, 2115, 2182, 1459, 655, 565, 1012, 1346, 1451, 956, 270, -679, -1569, -1298, -440, 357, 914, 1329, 1633, 1816, 1818, 1987, 2133, 2072, 1297, 303, -756, -1478, -1657, -1778, -2279, -1648, -1260, -1002, -734, -536, -82, 361, 633, 676, 799, 815, 714, 282, -329, -692, 7, 605, 1068, 1374, 1490, 1225, 730, 187, -253, -50, 71, -109, -748, -1555, -2138]
3876b138M18k01M42l4k49L51d58D61N16K42k94G4i50r01g31A72P42M64K1K77R42
3855B618Q60N54l35j225A028C61a4m9l04p60q96K92J95n15p26Q05f54D15L97l67
3835D45c34d3H59P20J09l93E09c21q6p1k37l27l20m6L47N02A37O94J45m40g6l37
3813d13J10C73R03M16k10m74m44K90O39L16m82o07A82b94n35l13j84l4k77n2L04
3792a385l17k20P47d19C9J24qd08m60k83l0o6r4n29j67O80M50c29G9k0A4a82m59
3769f41k39m96k67M12d78H14J393J023K00j006H93g26o61f56c27l58n92n69Q15
3750a031d09J58k07j28J61M6o4j54J18a51G0P7h1k04k80j50J13J80f0A33g8k48
3728c26m47l05L0K54K71j56p13J77L18L00K34G1M73N80M22M7k27o68G5i43p61
$$ y = [-2138, -1720, -1921, -1479, -1513, -1762, -1411, -458, 461, 977, 1219, 925, 74, -950, -1851, -731, 172, 914, 1378, 1399, 1676, 2618, 3478, 4032, 3697, 2472, 1028, 361, -14, -63, -367, -1127, -2023, -1731, -1536, -2051, -2777, -1972, -654, 415, 812, 445, -334, -43, 859, 1579, 1688, 1295, 509, -321, -407, -478, -715, -1042, -1362, -1408, -1061, -559, 137, 831, 976, 536, -76, -413, -303, 373, 1276, 1692, 1482, 1008, 564, 854, 1493, 1809, 1327, 720, 182, -294, -829, -1142, -1326, -1360, -1637, -1689, -1385, -1702, -1922, -1175, -419, 39, 163, 155, -408, -868, -1151, -1181, -1247, -1341, -1870, -2037, -1357, -907, -329, 79, 59, 14, -182, -641, -880, -1376, -1643, -1231, -478, 814, 2207, 3230, 3430, 2424, 893, -726, -1387, -656, -327, -685, -1277, -1846, -1031, -409, -251, -458, -586, -425, -379, -443, -597, -479, -151, 70, 147, -81, -285, -565, -715, -602, -422, -60, 133, -78, -326, -773, -1078, -1048, -794, -523, -679, -1392, -1215, -897, -597, -363, 71, 544, 1124, 1546, 1593, 1366, 698, 75, -943, -1704]
3707a704j67g58a05A15a94o43k57b41F76N24k7k79D21h4n88l05J15c61B27N20
3687G47O31M01J96m69o72a95j140m75e79E04O04M83J89k37n57A93b49n42j88R7
3667h82c21B09P92R31P22J85l04j255c88j012l72KM1J3g48G73R76M9p58H3h88
3645a396l12r0j44L27O6l9j90m9P43M33K71C85M87L81J6l72E0g89o56P8K66o3
3623a164J68J81R9J56b21B75M93N09m0m25B5a164L64A40Q10N51L07M1j67r3n7
3602A532K41N50L97k0m03j054e1j154j04J78e20b11P5r6j96k25k48k74j82K23
3582a134K71l66m59k58R3j7J11L30l59L62f31g3H4h2j50l5O9B4a95k21m82k15
3560a113L02L40C64P66N02o5p48a013j004p3P76f41c16L1l53m89m18j07g25GK90
$$ y = [-1704, -1871, -758, -105, 115, -194, -837, -1094, -241, 676, 1200, 1173, 894, 421, -84, -672, -977, -862, -361, 227, 747, 1378, 1779, 1975, 1506, 834, -195, -1335, -1810, -579, 504, 1108, 1591, 1780, 1543, 986, 193, -249, -791, -979, -882, -321, 209, 1001, 1932, 2654, 2839, 2535, 1280, -388, -1400, -1772, -1770, -1729, -1716, -748, 773, 1749, 1798, 1040, 83, -888, -1396, -1708, -1798, -1942, -1615, -1549, -1588, -1778, -1827, -1084, -651, -380, 385, 872, 1253, 1269, 897, 50, -789, -1445, -1367, -1101, -1164, -996, -815, -716, -560, -221, 275, 768, 1277, 1237, 812, 25, -1164, -800, 140, 950, 1501, 1808, 1849, 1682, 1589, 1532, 1773, 2323, 2720, 2700, 2297, 1243, -51, -1205, -1309, -1131, -520, -211, -136, -232, -428, -653, -901, -1175, -1357, -1134, -863, -1229, -1688, -1946, -1853, -1870, -1759, -1429, -1788, -1426, -631, -73, 84, -82, -232, -267, -198, 24, -195, -416, -898, -1113, -811, -471, 364, 1130, 1632, 1567, 819, -1013, -2017, -2090, -1314, -641, -316, -285, -638, -1127, -1545, -1652, -725, 7, 297]
3539B97K32K7j91h5m99j40n19L30d31b14k2l2P0A97N77P1k00B40e16o31K85b83
3516C40P40K20l08A98i89r3M53j90l99k91L3M75J29n96l73O03e15@D58L29K12
3495I99k0j73k37A67c47m46K4E4R94Q71L18j50m13n29n28A68b25l57O1K28a07
3473b1A38gr1j13n2k7j54k80l70q4K26K26kl58o50l16M17M36J26j30j76j23K08
3450a294K56N12B79J003J091P15L55j55o08q63H73d33j189o67j22J78M46O48c92
3430a40p6l57m83l05j91J59K25K7n0j08k30j55k9n54L38K56J72J73K25d32F78
3408A611j18F94c75r58n99J09O29b28D43K89l03b38r39j04b19E74L64L8J73K12
3388A361K67M64J76j40n14n69Ea039m94O22J73j64m5c81B77K56K84M65N30O06
$$ y = [297, 529, 556, 365, -85, -584, -724, -1243, -913, -431, -214, -236, -268, -198, 197, 774, 845, 645, 240, -516, -1147, -862, -283, 340, 1080, 1300, 992, 198, -989, -1082, -629, -819, -1218, -1509, -1476, -1001, -872, -1468, -1841, -1238, -515, 0, 458, 787, 999, 979, 806, 569, 167, -347, -793, -769, 54, 1048, 1919, 2237, 2087, 1674, 1145, 617, 168, -225, -582, -521, -293, -107, -21, 138, -7, -98, -211, -263, -290, -444, -724, -1094, -1178, -952, -726, -728, -1086, -1736, -2052, -1635, -1199, -1073, -1203, -1379, -1502, -1294, -1038, -526, 279, 1282, 2373, 3088, 3443, 3288, 2680, 1817, 873, -433, -1622, -2289, -2411, -2233, -1787, -1139, -392, -140, -216, -573, -1056, -1361, -1552, -1393, -1168, -1141, -1191, -1299, -1529, -1684, -1713, -2267, -1929, -1673, -1501, -1328, -1103, -432, 678, 1611, 1493, 694, -375, -1333, -1932, -1823, -1194, -228, 443, 732, 429, -238, -1177, -1281, -219, 574, 938, 976, 1149, 1361, 1628, 2092, 2268, 2128, 1614, 1045, 5, -1039, -1533, -911, -738, -902, -947, -381, 277, 533, 817, 1282, 1812, 2418]
3368B418J46n89l47j33j62K19K80j45m43E35e27n44K93N3m74p72N45a4I62N94
3348A556K17k87n30A92b27j11K2J16L2B17P9A22a90l78m72l76j76K15N55a13D73
3326I37j0m03d2p37j62J53N1j88p01l95O03f33c8D74K49K70j7k84l31e7p25q26
3304a608m03l03N13P37K62j5r1n4K71K93h1A59L57J62j86H7d25m31k74O5M45i
3281G56P56L48q5k22j71k12j16K8L8j64m59A43h9k30m8k59l62K32N9J05p8lJ14
3258e59l79n45J85d53m28P7a52D69J59B0i90o08J94O57R1k3K0J26J10J38N2e4
3235A32J92K09J08q7B44A10D5a31k93n31o78m39O14b85E35N22L12Q5k48l80j16
3214G10A2f76m49a58F94L25k72l33C7c63n48r14k59l29L51K85L12J26q4k02J75
$$ y = [2418, 2564, 1975, 1628, 1495, 1333, 1552, 1832, 1687, 1244, 535, -527, -1071, -778, -725, -1199, -1971, -1426, -14, 962, 1556, 1773, 1486, 956, 192, -227, -338, -316, -200, -168, 217, 296, 122, -190, -568, -1040, -1416, -1592, -1377, -822, -113, 473, 937, 927, 524, -42, -779, -941, -788, -737, -925, -1626, -2021, -1418, -633, -38, 474, 723, 993, 976, 692, 361, -57, -782, -1608, -2011, -2314, -1801, -1064, -802, -817, -908, -962, -691, -398, -81, 159, 516, 678, 492, 87, -425, -856, -1130, -1065, -620, -9, 756, 1512, 1860, 1775, 1553, 1382, 1170, 1054, 1082, 1120, 956, 497, 143, -89, -319, -367, -626, -988, -756, -697, -592, -670, -673, -559, -938, -1483, -1298, -453, -881, -804, -152, 469, 628, 20, -990, -1598, -1404, -747, -656, -679, -659, -533, -423, -285, -233, -54, 132, 324, 533, 641, 554, 244, 110, 45, -131, -424, -955, -1633, -2072, -1458, -285, 535, 1057, 1369, 1454, 1206, 826, 710, 12, -676, -1125, -158, 694, 1019, 747, 414, 37, -363, -911, -1825, -2084, -2413, -2062, -1777, -1465, -1339, -1423, -1625, -1450]
3193a450M35d34a92P8p78m76O32a93C88R6I0g15o29N50a15A5e8l35k99k68n76
3172a536j15L00N27b51B20J62r2Ed00o39m85L42e53K26Q7j90n89j034o67P81j79
3151b118m61N04R44N38k3o21q72R52c9E62n0g2o43l52p7J97c48F65J205P43N64
3130C177K9m24p34I53b71p17j46j20k21o7K86J47K95L91h2A63Ge52q18o23k53
3109b246L59O18N71a68M2l72k82K21G3K61A40d48j027J79e5A141Q39N20R7k59
3089B338m52q71C5a126r52L3ON13O56L67K14J44Ce9l38n12n22o45QO87M26n1m91
3066a497l68M88M06k16k80M8k46P8K18L39M79A56M53L83J98M5K3p1k21l19j20
3045E27K2Kj83b29j126M64C99N99J25l41A57a61E56R63J22n31C44b14l32j45O
$$ y = [-1450, -1015, -434, -192, -114, -892, -1368, -736, -193, 388, 484, 90, -715, -1344, -794, -115, 15, -58, -393, -692, -960, -1536, -1651, -1351, -824, -251, 220, 382, 290, 5, -400, -1039, -1524, -1182, -553, -327, -240, -430, -1019, -2053, -2720, -1939, -2118, -2579, -2075, -1131, -593, -616, -1237, -2109, -1157, -39, 562, 512, -72, -715, -1067, -1144, -947, -348, 665, 1870, 2613, 3177, 3206, 2782, 2048, 953, -271, -988, -1134, -1254, -1475, -1542, -1256, -1109, -814, -423, -82, 163, 7, -552, -1370, -1993, -2246, -1887, -1269, -698, -168, -126, -498, -780, -559, 73, 334, 140, -448, -1475, -1296, -55, 1141, 1980, 2500, 2597, 2338, 1886, 1015, 35, -1126, -2078, -2045, -2039, -1526, -870, -503, -289, -145, 3, -59, -397, -909, -1431, -2076, -2068, -1381, -955, -1006, -1497, -1865, -1377, -971, -1187, -1467, -1419, -1665, -1587, -1369, -1030, -551, 156, 609, 992, 1190, 1235, 1258, 1187, 966, 647, 527, 549, 551, 368, -229, -1355, -891, 399, 998, 1123, 782, 157, -161, 556, 1519, 1641, 1110, 344, -214, -546, -691, -685]
3024f85P4j28j22R9K91H58J775J774J507N42l87j135j705A575B01g12o94l21J6
3005a711O18e39a34A3c11q78p35N77L06r1M06a79A52J75J44R1J90M98K16j31l31
2984A004n01C9c88m72n06j10O0N24b13C50K05A64f68o14L66b9G35N80J42Q7R5
2963A639K12L00J61j87l16m06j36J03n3jl20m34C9f21k84L14a52D2K25M83R1l97
2941D44c52o93J71M35C9J61K11p4K45l3J54NJ28L8k17B76e41n24L45A87P97R20
2919A904O90M22l92l21l75j7l65m59B23f37n42K26M04N8k44P1K96m3Q4N8R4C96
2896I41N85M17K14j41k21k90l88C91b87n70o71q03n81O35M16L51l3J88K89K35
2876h31J01K7J86J41J01J04C7J17m1a20j27l45m11n75L51M49K75J40q5r3j09k47
$$ y = [-685, -611, -739, -861, -762, -471, 858, 2633, 4407, 5914, 6456, 6069, 4934, 3229, 1575, 201, -712, -1406, -1727, -1711, -1093, -539, -134, 13, -311, -1189, -1924, -1347, -1041, -1132, -726, -179, 152, 327, 471, 562, 752, 1250, 1466, 1335, 1004, 503, 39, -388, -860, -1366, -1476, -1416, -892, -213, 350, 555, 164, -668, -1282, -916, -29, 735, 1315, 1457, 1544, 1639, 1851, 2151, 2312, 2125, 1809, 1403, 1267, 1370, 1317, 1316, 996, 562, 39, -621, -905, -591, -152, 42, 267, 750, 841, 444, -352, -1045, -874, -439, 39, 200, 411, 337, 582, 549, 703, 708, 836, 874, 657, 276, -541, -1065, -720, 187, 984, 1904, 2594, 3016, 2624, 2303, 1928, 1911, 1546, 1087, 223, -637, -1179, -953, -549, -491, -735, -664, -368, -411, -327, -269, -175, 396, 941, 1526, 1943, 2157, 2016, 1795, 1505, 1117, 391, -287, -857, -1528, -2331, -2912, -2277, -1861, -1510, -1543, -1355, -1066, -831, -730, -703, -517, -376, -275, -171, 37, 154, 113, -120, -247, -592, -1003, -1578, -1227, -778, -503, -363, -448, -541, -650, -897]
2854h97l89l78Q6J39k71k75j42L84P51b18E29L25J41k15C65Fe32n07m67j67Q5
2833a588L11O22C03J102Q10N57j27n72I88a32j075m02K15p1m97m33j11K80K67
2814a959Q4qJ15K44J43M88M22K33l7e4D24O23M70K27p3k03j65k27k38D19b30q31
2792a061p16n4P50c46C55R9a62r65q57n29p8M37K75L27L98J62j11k60o1K62K29
2771i33k1l80n13l3J81J50J73M73M41a02B65M23L09Q6q9j56l61B35dk76j96j91
2749f67j21K32a42C57L36K38l22h3p05p04l07j94O70J70m1m38j52M21f62a93A38
2727I0c47n71l29J81k03K04J98m8k48k47k65j66J88g56g6C40J90K10l49a64r83
2706a147k12M37c20A11l0d93p43l93O26L3j82l41q8J30M85c87m23J94a46B86J28
$$ y = [-897, -1286, -1664, -1578, -1439, -1710, -1985, -2127, -1743, -992, -218, 529, 854, 995, 780, 365, 6, -532, -1039, -1506, -1673, -1588, -1277, -655, 303, 1405, 2215, 2772, 2645, 2073, 988, -132, -1207, -1609, -1394, -1465, -1962, -2395, -2506, -2226, -1959, -1875, -1883, -1768, -1524, -1381, -893, -471, -238, -275, -54, 424, 1047, 1517, 1744, 1671, 1468, 1303, 1076, 838, 419, -230, -1061, -1777, -1831, -1081, -346, 355, 454, -162, -1127, -1984, -2513, -2591, -2154, -1879, -1552, -1154, -992, -1103, -1363, -1424, -1162, -933, -954, -1334, -1847, -1880, -1699, -1549, -1376, -903, -462, -102, 265, 688, 997, 1083, 994, 838, 477, 235, -4, -280, -476, -667, -788, -556, -142, 357, 693, 931, 609, -83, -788, -1492, -1799, -1993, -1323, -1153, -1194, -1632, -1784, -1363, -662, -193, 138, 90, -347, -918, -1247, -1066, -1269, -1065, -867, -915, -1163, -1410, -1675, -1841, -1653, -756, -76, 340, 530, 740, 391, -164, -1147, -1359, -922, -320, 111, 81, -493, -1236, -1629, -1003, -970, -1152, -1493, -1581, -1451, -966, -387, -810, -616, -146, 286, 414]
2685D14A50f23o90l1P0M03e1F51l24b62o00l14k00l25k41k90n19M92P27K99K8
2664a205j60l19k79N56l17p2k82m64m86J68M51O39g82a10C05M42J87C31c40n50
2644h90j37J52b84D65O76M15r0F99a02o27l95c86H61J359J154N03J2m16o29q22
2624B022r94e5r80j97L52M23J99k00l52J02l2l02j48k00k15L4j6j07k35J57J70
2603a602j40j33L1j31K8N17J92L53c60C21P40N94M63R8j76o22E67c15n81k95J64
2582a027M44K55A8L44J04j7j55h4j27J8DJ49J11r0h8l28n03m94l53L72M55K05
2560g34l43m49K48a06A215Q91J70k31l55m43n00a34j002q47l93K64N11M44b85
2540H31J025Q77L83p3o93r20E77b75o89n20q4J42e85D12Q26J13l66j94k31B50
$$ y = [414, 150, -623, -1313, -1344, -1274, -871, -51, 651, 327, -262, -862, -1176, -1376, -1701, -1942, -2232, -2751, -2259, -1532, -1233, -1205, -1365, -1684, -1963, -1407, -1724, -1796, -2078, -2542, -3028, -2860, -2409, -1770, -782, -110, 305, 747, 934, 331, -340, -890, -1027, -875, -284, 465, 1141, 1556, 1466, 699, -102, -729, -1124, -386, 861, 2220, 3374, 3877, 3889, 3473, 2844, 2022, 1028, -55, -1035, -1232, -880, -457, -258, -458, -810, -708, -740, -1042, -1190, -1390, -1605, -1571, -1587, -1694, -1929, -1772, -1602, -1742, -1875, -1844, -1975, -1947, -1430, -1238, -885, -360, 321, 1061, 1655, 2118, 2216, 2040, 1418, 567, -315, -896, -1191, -1027, -583, -328, 18, 362, 466, 449, 294, -84, -211, -193, 4, 153, 264, 174, -88, -416, -919, -1413, -1766, -1394, -939, -734, -1077, -1526, -1278, -106, 1215, 2106, 2276, 2045, 1690, 1247, 747, -134, -1136, -1983, -2376, -2112, -1601, -1157, -285, 831, 1856, 2733, 3116, 3043, 2350, 1430, 577, -275, -964, -1484, -1568, -1426, -585, 412, 1238, 1351, 985, 791, 560, 250]
2519b9A13K95K32k6j84B01n3e0k00l06l99n69l15O7o5M14kP06nn39o43h90B28
2495A058L07p9E09a033L84I47Q46J68l37p52a1q43m87o61j94M50K29m91J91P78
2475a039i9G77N30L94K87J64j64I32e64j140L71e52a31Di6o6P3A5M6J48M39M79
2453A127L78L77J15k42l73n90B31c85k94m71p95p14M80P70f01a09A40j2R2L1l6
2432B15I7e9n83l40d70B54L65J35N4M7K7k97g1p94p42n26r1K18P40d00A01L74
2410D75j0A03d65r54n89K27N9o5M75e33D37Q10N4n02e0n87k52R1N6L8j29j67L59
2387f41F32J010L53m95E39f26q84O85A17M65k57b89r11o15N13L28Q1j51m29m8
2367a521N62C52J037Q87M58J63l20l61m35m83lQ5K1k39l74A07c61k74l35n18m37
$$ y = [-29, 113, 408, 640, 614, 430, 201, 148, -50, -250, -556, -955, -1524, -1839, -1772, -1837, -1423, -1425, -719, -724, -1263, -1906, -890, 228, 1058, 1365, 1286, 509, -1033, -649, 947, 1793, 1961, 1624, 872, -11, -854, -1341, -2002, -2196, -1746, -1517, -2008, -1817, -1039, -99, 777, 1307, 1701, 1988, 2152, 1988, 932, -564, -1704, -1333, -552, -131, 4, -96, -162, -89, 15, 61, 209, 648, 1127, 1505, 1882, 1997, 1755, 1382, 792, 231, -385, -679, -1150, -1945, -2659, -2179, -1409, -601, -109, 140, 128, 220, 251, 215, 97, -59, -642, -982, -470, 254, 619, 754, 808, 855, 882, 585, -71, -865, -1607, -2133, -2224, -2006, -1266, -400, 101, 475, 465, 103, -465, -1419, -2008, -1781, -1722, -1787, -1312, -533, 437, 1247, 1301, 799, -50, -637, -889, -798, -742, -704, -833, -1000, -641, 632, 1642, 1995, 1500, 539, -626, -1510, -825, 117, 582, 325, -289, -1200, -1815, -1302, -974, -893, -1044, -1473, -1521, -959, 352, 1389, 2276, 2734, 2897, 2577, 2216, 1781, 1298, 1295, 1380, 1401, 1162, 788, 107, -361, -635, -970, -1488, -1925]
2346a925O12c28h8m11p79m84L20O70K98N6J96A85L91K44M70M92j67p84a60j116
2326a276j61a3A314R80O05O38M89M18K41j09n92p46p07l57nK26L81O39M10M03
2306D228o55r43j116G14C02A50a1k12l07m16k79j41j08K96d18B20M61R8l87a09
2285e88l68n34M17b94B38L11N9k91d92m97l62J08J32J43K5m9L63J57k72n78j70
2264a492K16f20D95Q87P69M10J7o45p22b66p68aD21K91Ql20A0d36o45m09mN5J64
2241a275J34J03R9J82c68D0K86R9j25c6k33K2B77N84K95K1M0J28L10R8p9l23n56
2218G95c58j221p26j26J93K93L14N80c44A95P7P7K41M91M63R4j45C04a046r76
2198b022N74M94c89B00N92l8j96B71a52c2H44P83Q49N49L37K56m87n15q92p12
$$ y = [-1925, -1313, -328, -88, -499, -1278, -1762, -1442, -772, -474, -418, -222, 185, 576, 820, 1290, 1782, 1615, 831, -160, -1276, -1437, -13, 1314, 2294, 2899, 3537, 4026, 4444, 4685, 4576, 3984, 3238, 2531, 2174, 2169, 2395, 2776, 3415, 3825, 4228, 3573, 2630, 1514, 714, 302, 150, -11, -223, -530, -946, -1225, -1366, -1474, -1178, -418, 220, 681, 779, 392, -109, -588, -956, -1490, -1073, -294, 238, 549, 608, 317, -492, -989, -1351, -1243, -1111, -968, -943, -992, -629, -472, -744, -1322, -1492, -1276, -620, 495, 1382, 2151, 2561, 2578, 1933, 1211, -266, -1034, -1, 421, 712, 720, 400, 10, -436, -1081, -1490, -1494, -1439, -1275, -1141, -1038, -939, -757, -368, 40, 326, 425, 300, -36, -269, -247, 277, 861, 1156, 1177, 1217, 1345, 1655, 1753, 1674, 1351, 795, -358, -1579, -2305, -2431, -2238, -1945, -1631, -1051, -344, 195, 272, 349, 590, 1081, 1544, 1638, 1493, 304, -1046, -2022, -1448, -954, -389, 200, 792, 754, 558, 271, -152, -32, 844, 1627, 2476, 3025, 3362, 3618, 3131, 2616, 1724, 1012]
2178A012D2e41p18m34k3N71L66J86R5l3k22l39N0l4e09A95Q02O07J95l15n64D22
2155D21M11L30m8m62eo26l15J68J43n0m01l35l37J38M85M67J10j79k56o36l47
2134a976K39L20M06L56N2q6m43p65p87r7L95Q14g75DO11J29C55b67p86j44K44
2113i53K81c12A90N71K90O5k01D46d80r68n62M23L62J17M9k17m14L70K44J10K41
2092g25L04i0j28n27q52M03b08C79P7b69r67r06M24J62J59O31L70C26M86n8b3
2070a030n06q4N29J5l35k67r4L10M03d57D96P24L33l24E65a56q05o31o14M8r1
2049b249M91P88c18i2n76j060f23B73P87L84J82l3k83m60k21j30o0J67K21J18
2029I45m10a89r23q27J71Q52J69j83n67n22lN36N26L59j65n62l64k05M73e47c2
$$ y = [1012, 42, -541, -1259, -1693, -1716, -1145, -779, -593, -498, -531, -753, -1092, -1042, -1076, -509, 195, 997, 1604, 1799, 1484, 920, 422, 421, 832, 1162, 1114, 652, -5, -631, -946, -778, -635, -685, -1086, -1421, -1758, -1620, -1135, -668, -558, -737, -993, -1629, -1976, -1737, -1417, -1011, -655, -603, -689, -1132, -1897, -2684, -2781, -2386, -1572, -775, 4, 615, 744, 355, -267, -1053, -1197, -953, -672, -312, 190, 761, 1051, 1116, 915, 446, -480, -1448, -2010, -1587, -1225, -1108, -1059, -1276, -1690, -1320, -1076, -966, -725, -421, -90, -218, -745, -1597, -1194, -208, 379, 456, -269, -1236, -2142, -1718, -1556, -1397, -766, -396, 326, 812, 754, -23, -1030, -1536, -1620, -1091, -1076, -1411, -1678, -1772, -1462, -1059, -457, 496, 1220, 1553, 1229, 565, -156, -961, -1592, -2206, -2158, -2249, -1758, -970, -318, -92, -668, -1728, -623, 273, 1060, 1444, 1626, 1593, 1310, 850, 629, 499, 439, 606, 827, 945, 535, -189, -1112, -1939, -1768, -916, -747, -930, -1497, -2019, -2022, -1486, -960, -601, -766, -1328, -1692, -1897, -1424, -547, -32]
2007C15r3a09p60r20Q1h33FO79L20j12C48b54p58m73l67N0Q2O83c78C25L89O0
1985G74L56L15M4k95E10c85p90k86P25b51A43m5c66k20k80K09B13R92P46K01j53
1964A999n39n50j92L29P41O51M18n99A105D17A18L81M50L86J75Q4k41m18C4a030
1943b089r69l2K84%L05P1j6L69P45L29K39q3k35j62j72R6M14J80l43q06J43d39
1920C54J27B08c12o51o34n99l1J20R63d81J88j97j03n6KO4J85a34l2n5k39m06
1898h66l30l34K07c82D45N62K15j71m22G0c82l34k70l63m81L70O08c12hA04a37
1876f76m87j57Nj78K29N2j11j36L63b3H84O64l72h8j562P88H12J573J447M68l23
1855C977p89r64q94E78A86R1J98j2A89K2J88N51m0j9m02b31p19j48e42K57Q6j64
$$ y = [315, 222, -109, -869, -1789, -1708, -833, 6, 685, 1005, 893, 348, -254, -1012, -1485, -1852, -1802, -1720, -1037, -378, 325, 714, 774, 1130, 1445, 1489, 1194, 510, -385, -1175, -1461, -736, -251, 143, 98, -366, -586, -866, -657, 213, 1205, 1951, 2152, 1999, 1460, 910, 718, 1047, 1788, 2439, 2857, 2258, 1105, 417, 118, 499, 949, 1335, 1510, 1594, 1353, 935, 34, -1030, -2089, -3058, -3090, -2806, -2806, -2501, -2430, -2446, -2077, -1332, -1003, -764, -847, -1082, -1244, -1416, -1320, -906, -726, -1069, -1875, -1732, -439, 354, 481, 208, -312, -963, -1597, -2196, -2227, -2107, -1144, -481, -293, -490, -593, -649, -647, -583, -398, -134, -166, -221, -460, -866, -1196, -1530, -1323, -382, 445, 1007, 1222, 1051, 629, 70, -382, -716, -986, -1349, -1830, -1460, -852, -312, -8, 104, -137, -676, -1163, -1320, -1315, -1493, -1264, -1212, -1323, -1459, -1096, -23, 884, 1548, 1176, -88, -1650, -862, 812, 2385, 3832, 4300, 3977, 3188, 2224, 1330, 578, 186, 277, 475, 463, 189, 211, 399, 950, 910, 891, 489, -231, -950, -1098, -542, -285, -199, -363]
1833c63k09jO4a42C24M82K80n6l53C05Ea33A45M65M87L96O4k76C56h89j412m54
1811b755J236O32L63J67N4OK6a05A73J87J19O3A80g12m23i2H39O16J09m0J91O31
1789B346M81K15k72j183c36j788K32g18D97P37j13D01f41q40N92J86m77k13N15
1770h78f6E56N33K59O8m3k53k18j01N94N31K40l26r04c24j548k97J52m31Q94N72
1749i82d24C77Q81Q58J17k54m90j92j97m74A23b42k34K2k51o24q42O28N30k84
1729a297n54n4O10a96F20O50N44L31J10j49p60C62g68o00e37c0I7Q7K22L24Q0
1708H10J68j30k34k96r1K90K20N4l53g1rH8K18J16A68b85p13o38l86J19M09O02
1686h92a52C62J27A02g44j075q10R41P42b54K6o39r85N05d53D33N59l98a3o58
$$ y = [-363, -572, -573, -509, -142, 324, 806, 1086, 1030, 677, 305, 5, -133, 145, 610, 1097, 1493, 1557, 1281, 356, -889, -2301, -2755, -1519, -887, -524, -357, -303, -297, -271, -105, 173, 360, 479, 542, 180, -712, -1135, -92, 839, 1455, 1564, 1524, 1715, 2346, 2827, 3042, 2770, 1587, -336, -2124, -1892, -718, 497, 1234, 1121, 401, -641, -1481, -889, -703, -1180, -1393, -878, -66, 556, 1089, 1348, 1416, 1373, 1120, 902, 801, 1395, 1926, 2166, 1840, 936, -324, -1872, -2169, -2017, -2448, -1554, -982, -424, 377, 1258, 2116, 2233, 1979, 1489, 1297, 1100, 626, 123, -242, -476, -454, -705, -1329, -2171, -1543, -1013, -1297, -1851, -1905, -1295, -196, 620, 1270, 1814, 2145, 2255, 2106, 1346, 362, -768, -1368, -537, -30, 97, 184, 406, 730, 810, 978, 848, 614, 318, 227, 517, 737, 791, 438, -71, -80, 88, 306, 422, 168, -285, -998, -1636, -2022, -1903, -1494, -892, -152, 362, 489, 102, -744, -1819, -2629, -1688, -946, -254, -228, -867, -1852, -1347, -453, 433, 992, 594, -13, -671]
1666f71o43j68N38J13J2k37j15J61K97K49J89a04H7K91L75O39P93O19K7l86p22
1645A723D61h98j026L26a68D56K99L1M14K23K4q5k79k6R3k24F3f92m94k21r0K77
1623a220e71j008b82H86R72L81k30q49B66n2Q28J040O55K01o41A110c66r02r69
1604b237o3N29L80J53lM8o5j39m03r9L29J62k91o35K38L67K08jp7J03L13L95L69
1581d19j45l53l10l3J56N36B01P75M64J91j0k62l69m61A71a57l54l79J77c01B03
1559E45J02C13d26j506j06J015d69J28J1j27Q0g8C55K00L91L82J30l27E42b01
1538i54k42J62N0P5Q1K68K18P7j33j32L8k72q09p12J63L91h13A75N41O7a06r21
1516a027n18K76L87J97l79p46j55M53O39L77J60M5Pj15k27k25k20l04n83l92M29
$$ y = [-671, -1314, -1482, -944, -831, -819, -1056, -1171, -1010, -713, -464, -275, -104, 87, 378, 753, 1392, 2185, 2804, 2831, 2445, 1723, 461, -898, -1924, -1598, -168, 456, 755, 786, 1200, 1423, 1447, 1362, 1083, 1057, 1150, 926, 63, -692, -1186, -1407, -1497, -1220, -571, -1579, -282, 886, 1858, 2239, 2009, 1160, 266, 214, 1042, 2082, 2737, 2938, 2297, 1110, -366, -1268, -2237, -2300, -1771, -1391, -1238, -1241, -1193, -1258, -1397, -1800, -1899, -1570, -1408, -1699, -2334, -2096, -1729, -1521, -1522, -1599, -1496, -1183, -788, -419, -564, -917, -1227, -1260, -1104, -568, 201, 976, 1440, 1631, 1621, 1359, 990, 529, 171, -157, -511, -890, -713, -301, 203, 545, 647, 313, -426, -1932, -2038, -1023, -469, -341, -330, -457, -377, -78, 355, 555, 946, 1328, 1458, 1131, 542, -201, -954, -1196, -1034, -984, -909, -828, -560, -342, -265, -398, -530, -492, -764, -1573, -2285, -2122, -1731, -813, 175, 716, 783, -106, -1027, -1545, -1269, -882, -685, -1064, -1810, -1965, -1512, -873, -496, -336, -291, -284, -399, -626, -851, -1071, -1375, -1958, -2350, -1921]
1495a921J51K06L77k29J94d66A24K51j58a97n15k81k71j08P9K00K52a63H89J116
1475B005R73O44K94j92p84j254A94a114q04K64M72j6r7J89e08A2M44L18J43N7
1455I74j70k29B58a02l13l70k99j20k06j04j99k67N78N07K09J03m5l42J66AQ35
1434H36O71L65k32o65a11q41k00M20K60A24M44j68f6p63p97J36e89E02O96J58
1414A356l1k82k92k76A69b21m22n58n50P7N54K27M36B53Q94Q16J58l80E39e59
1393a178J21k19J48k26k81j37j34L9h97A00N27J22j25j74j76NL29K04l2k49A44
1371c2D04O09M25J32l01n49C04K6M06N30L80r7n71A76e16Q8F45J500J073J49n25
1350B842q66H99b35r68j90N16j92k63L62c20H9L08A83b82r39j101K41P80e20a01
$$ y = [-1921, -1770, -1564, -1187, -1416, -1222, -466, 124, 375, 217, -197, -712, -993, -1264, -1372, -1293, -1093, -841, -163, 889, 2005, 2978, 3622, 3916, 3724, 2940, 1686, 194, -1114, -1918, -1654, -1182, -1198, -1295, -1106, -508, 12, 456, 774, 917, 974, 804, 575, 258, -102, -415, -785, -1084, -1204, -1410, -1514, -1713, -1980, -1402, -895, -686, -583, -628, -970, -804, 1, 836, 1507, 1872, 1640, 975, -111, -952, -1152, -732, -472, 124, 568, 400, -66, -829, -1626, -1490, -589, 502, 1198, 1356, 1325, 1043, 751, 475, 169, -221, -643, -1201, -1751, -1674, -1120, -893, -457, 253, 1147, 1963, 2121, 1741, 539, -559, -1178, -1057, -1276, -1128, -1354, -1635, -1772, -1906, -1867, -897, 100, 627, 749, 624, 450, 274, 279, 608, 812, 780, 531, 144, -32, 404, 1013, 1438, 1570, 1269, 720, 304, 330, 736, 1266, 1646, 1549, 978, 176, -516, -428, 645, 2145, 3218, 3367, 2842, 1976, 899, -235, -1203, -1393, -877, -1069, -1332, -970, -320, 89, 397, 183, -282, -1221, -2322, -2081, -1301, -520, -101]
1329F6K11G7b61m45n52j75k95n93j27P4k00m37K50O21R31M76J12k83l85l43k36
1308a868QJ48j16ok0P65A80J416J213N33ql89q62p83E46g8n00m29l14K2l70o59
1286b328L77Q11e01J78m09o56p30l81P8J02j28r0L01L95Q1ML13jk91k48M25L07
1264a251K69K60J70qJ33B6M72Q2O3J29l03a60l92J78a09fk05k14k49A66M49R0
1242G05j89A36h74r60M78M81d29On28o57j77L84K67l77l82k05J45K32N69e51A04
1220F99K26L3j86k39L7A23d25p09n33l20J58Q54b12B8b22n59j56Q2P1k34n01o06
1198b125Q42c55@d1k75m24K2J75a90c0n5k53n94q66o1k14e95E49J011L43m4n75
1176A284F13A56a82l20k52J1b69C14L39pl13a5A99P59N65k4p06b09m47L18D8K49
$$ y = [66, 277, 77, -261, -706, -1258, -1433, -1728, -2321, -2448, -2374, -2574, -3011, -2761, -2140, -1209, -733, -621, -904, -1289, -1632, -1868, -1860, -1712, -1828, -1834, -1854, -1089, 180, 1596, 2809, 3342, 3334, 2945, 2083, 1300, 546, -78, -578, -1007, -1321, -1299, -1669, -2328, -1951, -1140, -501, -323, -732, -1388, -2118, -2499, -2421, -2319, -2447, -2537, -2236, -1841, -1760, -1756, -1443, -1444, -1735, -1983, -1558, -1251, -982, -722, -552, -560, -427, 26, 498, 580, 643, 772, 469, -160, -552, -374, -109, -6, -211, -425, -674, 166, 615, 705, 516, 136, -874, -1834, -1356, -875, -429, -423, -951, -1608, -1785, -1401, -1134, -1511, -1893, -2098, -1953, -1721, -1152, -551, 104, 699, 925, 958, 772, 533, 570, 123, -425, -1134, -1667, -1987, -1829, -975, -212, 28, -222, -781, -937, -855, -784, -1018, -1519, -2125, -1283, -355, 0, -41, -316, -740, -718, -543, -190, -30, -85, -338, -932, -1798, -1859, -2073, -595, 549, 1560, 1903, 1859, 1284, 613, 156, -182, -502, -754, -743, -269, 314, 653, 646, 333, -15, 199, 958, 1523, 1499, 793, -209, -656, -338, 48, 297]
1154B97p3A02%d6k0p3m2k88l61n71j91g44E7J11b51m16l9g3B87Af45M8C44Q28
1130A172L98k22N3F85A12b64p49j023l52P00M69K11K1j70j59J2K34J31d64C3L39
1109C72J63o1B14H9M1K52K99K00j77q8A95h3q0B78K9E6b24n51p35o57k49J93l7
1086b260P3J26L98g18C80R53M83l30E15i38j308Q7J68N9K2i11A99P22P69N68P69
1065C027j79j111m68n04B57b66p47q62j04M38M41J72K25R7j25n05j27K00J50K74
1045g39o6n01k92O02M47a73e0C19K83J01K78O65K10n5n86Da448j295J205g22a94
1023I3J58J13L15R72J261J141N58j40o24q34p73l08m84F48c10n19l09m69N4O53
1003i00c79B12P25O91N12K65r8o67G71d23j280l11N31L99N00J95J78h3j42n22
$$ y = [297, 224, 102, 102, -46, -66, -139, -181, -469, -830, -1401, -1592, -744, 57, 168, -251, -667, -706, -73, 287, 1, -645, -597, 344, 1172, 1570, 1348, 1401, 685, 112, -264, -1013, -2036, -2388, -1688, -1219, -1008, -987, -1157, -1316, -1304, -1070, -939, -464, 33, 372, 535, 474, 214, 89, 130, 382, 681, 881, 704, 616, 195, -83, -163, 278, 307, 56, -224, -775, -1510, -2167, -2416, -2223, -2260, -2187, -2061, -1663, -718, 380, 1333, 1816, 1486, 515, -938, -2246, -2159, -1991, -1932, -1910, -911, 199, 921, 1690, 2258, 3027, 2848, 1737, 1269, 765, 257, -266, -1013, -1875, -1979, -1541, -1100, -928, -703, -606, -731, -1236, -1363, -1163, -1013, -739, -805, -1306, -1598, -996, -549, -173, -50, 319, 602, 703, 981, 1646, 1856, 1801, 1215, 4, -1448, -2743, -1538, -722, -194, 93, 251, 364, 679, 1651, 2912, 4053, 4611, 4471, 3847, 3013, 2240, 1932, 1448, 648, -310, -829, -1138, -1607, -1553, -900, -379, 212, 937, 1628, 2140, 2405, 2307, 1640, 771, -423, -1703, -2014, -1483, -1084, -584, -389, -211, -83, -225, -747]
983g47n71p64O78b16H41N21J81n20Dh48J70J96p2j78r1j78K4K94i1C68M00K34
961A002O9k64C73a30l34b21A38L2b66j282k77e53C13Q47M92K44j50k29l45D76
940b79q16n19L86e43G1O7K97K33L34M58O57N11L25l18q35o15n66B41q6a52n34
919f86o60n25N13O52K43j47J9a04E95M26O8k55A89d14l75J74K37J46j23A15N27
898F42K74M1k7l23J02J47l55A39d66q97j007M65g57C54R19M69K28N4q0l05p07
877I32A08i21j84M95a6B94K38k36A05l1L76L04k30b82p20M94C94P42k00B97d35
855d08A06K69a75o23k35a93A183J418J268O27J08n65n76r89j082C66c84o8a69
835H5f5l26m01l04k59k70o22K71K05e39E60Q53K59J36K26%k13l22k42j34j83D63
$$ y = [-747, -1318, -2082, -1404, -216, 841, 1362, 1543, 1023, 4, -848, -678, -482, -554, -732, -823, -1001, -977, -683, -91, 368, 768, 1002, 1071, 807, 373, -130, -464, -221, 138, 170, -266, -1548, -1825, -553, 313, 1160, 1652, 1896, 1746, 1517, 1172, 476, -279, -1095, -1614, -1228, -543, 71, 138, 435, 668, 1002, 1460, 2117, 2628, 2953, 2635, 1800, 1185, 619, 241, 155, -152, -686, -1346, -1871, -1358, -706, -463, -610, -591, -104, 595, 1021, 1089, 834, 189, -414, -789, -615, -378, -232, -355, 115, 642, 916, 957, 930, 607, 709, 856, 501, 139, -466, -1363, -2370, -1905, -757, 354, 1273, 1742, 1970, 2024, 1944, 1639, 932, 108, -921, -1105, -610, -16, 294, 532, 296, 105, 74, 450, 754, 524, -282, -1002, -508, 394, 1136, 936, 297, -435, -408, 106, 375, -175, -798, -1033, -193, 1183, 2601, 3869, 4496, 4604, 4039, 3463, 2474, 1392, 366, -384, -452, -169, 85, -65, -391, -792, -1096, -1355, -1625, -2247, -1976, -1771, -539, 560, 1413, 1672, 1808, 2034, 2034, 1821, 1499, 1257, 1123, 940, 463]
812b18p46n33L73A62J531J605J225M38j55m99o67l60n59r67q01m22b33n91o9L08
792e85a2B41a74n69L6A93Q85M15P6n01A69e87m17L27D19J056O76J8m70o74k29
771G96L18M17n2o50c69q45R9c69C57L72J5j89B69a15j55r3Q8a1D89Q06R10Q70
749C075N39L06k22o70r57I80C96k1J83J25j82dj035n84K74e82A17O97m5A59g11
727a343j37j37m24k34N36O71N11K38k06l26m78k78j52j87lP48b61F97O69P1o7
706A370m83B29c74p32o78p19N04L85M58e64A88P47M39J08k03m51F0a058J2C09
685A318K68k50F44c39j131p39K86N38M66J07r0j01j64j43K66L5N9q5l75j8O82
664g46a26Rk86n42m54J18O02f8C09J43q8OJ26R5n8j02B6g33r52k24l6M04K68J64
$$ y = [-218, -964, -1497, -1124, 162, 1693, 3298, 4523, 4961, 4806, 4307, 3640, 3280, 2721, 1754, 953, 531, -233, -824, -893, -585, -12, 241, -174, -743, -707, 193, 1078, 1493, 1569, 1068, 169, -587, -1004, -677, 419, 1475, 2151, 2169, 1699, 1025, 796, 1114, 1531, 1479, 829, -369, -1214, -1115, -369, 357, 729, 744, 555, 269, -115, -270, -363, -275, -11, 489, 1295, 2205, 3075, 3614, 3920, 3698, 3028, 2071, 980, 396, 375, 558, 683, 501, -4, -1039, -1623, -1349, -582, 117, 814, 769, 159, -711, -1343, -1480, -1617, -2041, -2275, -1739, -1068, -557, -319, -525, -851, -1329, -1607, -1759, -1946, -1949, -1201, -261, 697, 1366, 1437, 1370, 887, 229, -374, -1106, -1784, -2503, -1999, -1614, -1156, -564, 188, 935, 1374, 1482, 1279, 828, 60, -1058, -1046, 309, 1318, 1586, 1336, 644, -339, -1470, -2209, -1923, -1385, -919, -812, -902, -1003, -1167, -1310, -1044, -1009, -950, -1035, -1410, -1428, -746, -126, -117, -403, -945, -1399, -1281, -679, -68, 309, 452, 364, 370, 496, 591, 533, 431, 26, -733, -1685, -1909, -1945, -1541, -1273, -1109]
640a109k7j8j15J89P1M4l9Jd0A102P79P7o06B99g08K92a63k59o88o94k98r1rN49
616a653e83D22O54jD99c16o60p56N21e23J55Q6r7m3Q3O4q8l4J65A85K65o0a64
592h05l0H1O62K76k12A16a161o84N98N19K01P8a20C01K16O1O8k38a70o80k33l52
570a435k24J70L25J71n4j14j02j09R7M46M04i6D4e8JE9O05O45L31q4m85D32c31
546g71J96K14A69O37L49L4k41l19k93j0J34P8k56e42j143l23O02M37L62K62p7
525d22n4r2K53g4r5m89r74f96B96J246O99L36o70B24a438o55O79e72b4C46K09
504E55o8j88N2K25K31J11j90A25a162l45c12F50P71L35j09k50m57l95D2g80m55
483a235N79K93a5j05n22q61n03L71N32K24j39m11R8L14b19C4b08n43m77OM18K11
$$ y = [-1109, -1136, -1154, -1269, -1080, -1009, -965, -1004, -1003, -40, 1102, 1881, 1958, 1352, 299, -708, -416, -163, -422, -1110, -1804, -2102, -2193, -2202, -1653, -583, 422, 1076, 1075, 499, -316, -976, -1732, -1211, -523, -368, -282, -379, -422, -339, -275, -363, -397, -232, 185, 450, 390, -164, -805, -835, 81, 743, 1019, 807, 116, -1161, -1845, -1247, -728, -527, -449, -120, 301, 517, 578, 646, 408, -170, -850, -1083, -1435, -1659, -1489, -1164, -993, -1047, -1161, -1263, -1372, -1275, -829, -425, -96, 44, -58, -57, 59, 664, 1309, 1640, 1556, 1071, 432, -331, -771, -575, -361, 169, 806, 1155, 1189, 948, 629, 336, 326, 460, 538, 282, -542, -1685, -2008, -1406, -969, -607, -345, -422, -476, -568, -315, -74, -169, -658, -1632, -696, 296, 1542, 2241, 2577, 1907, 224, -1438, -2093, -1414, -572, -24, 346, 555, 487, 299, 351, 576, 807, 918, 728, 125, -1162, -1507, -312, 650, 1421, 1756, 1647, 1397, 940, 545, 42, -780, -1235, -656, -363, -15, -120, -642, -1503, -2006, -1635, -1103, -879, -1018, -1429, -1331, -1017, -219, 34, -208, -751, -1228, -1222, -804, -593]
461e93K01a23E76P45K48k17F74B70J39R99J031M99j20n68p57o24m28A67i2k96
441c88n06q25K69N55b49E4N15j86a38m36l63L66b80j86m65k09k26J80J75QK1O0
419i22J43J17m62M67B64Q93Q93O78j47r17B85a095o01P53M05a98A81M30L77n7
399I31MJ62O16N97K60j06p91F97i0j49k49k10Q5b56C57L61K45L87L75k33l52o8
377A072Q7K5l6l46C06a89QA33K4a19m50n84L26b30g1k24m44o11m94K98k63l34
355b143O63f75a36L6r6j31k63j06m6L4j7l0j05n3J18km7M8P9k1k16j96l45l07
331a802k41lM34f71F2L52K83O6L7P4K85K39k76C07e72o40jk4K11K66j6J72L4j71
307g41n45n37l22Q2L71L31Q3l97K07K73L51K66K16A32N00N4qr4p6A76d3K0o6A0
$$ y = [-593, -392, -123, 576, 1321, 1569, 1352, 674, 270, 409, 1408, 2439, 2938, 2818, 2250, 1493, 869, 441, 167, -92, -388, -894, -1719, -1450, -895, -249, 54, 569, 383, -138, -574, -937, -571, -280, -466, -931, -1140, -1366, -1186, -1011, -1003, -982, -922, -779, -662, -1124, -657, 264, 1157, 2050, 2728, 2581, 1664, 285, -1095, -1696, -943, -538, -198, 181, 611, 988, 931, 935, 1097, 1713, 2310, 2570, 2464, 1673, 697, -90, -239, -488, -698, -613, -256, 357, 718, 963, 1350, 1725, 1492, 1140, 1072, 1159, 1184, 1148, 802, 306, -189, -181, 133, 157, -119, -569, -1153, -827, -230, -71, -295, -739, -1350, -1844, -1546, -1809, -2143, -1480, -675, -136, -100, -196, -327, -590, -696, -742, -708, -725, -755, -860, -913, -795, -797, -844, -796, -717, -738, -954, -1150, -1495, -1802, -2043, -2046, -1612, -671, 62, 414, 697, 763, 800, 874, 1159, 1398, 1122, 307, -572, -1212, -1213, -1237, -1026, -760, -776, -604, -570, -741, -1286, -1823, -2145, -2063, -1692, -1361, -1278, -1675, -1468, -1195, -844, -578, -362, 132, 632, 686, 678, 584, 508, 176, -43, -23, -89, 10]
282I3l7J09L1h2o86q19M27N06a57A54m6b62n65m59J09L25K48a47e9o4l7k88j17
259e65J27A21J81c6n22l64J80K41m07m36l12k78J8L73P20f2E38J95k76a43o08
238g51j77m13n16j82K70J18L15J53q7m05o87L65K09M63N24b60A3J0b88o79q16
217a783q22R48P39L90K14J50I3L41L43O3j97A83g03o13L86a10D10J76j8K55L57
196A180L91K87L23J88j40o66F88e43j139K88O82b16j40n2A99P88M76L2m86m90
176E19g6n76k20J83J65n8k63n30n08K77O19G2P45K29l39A30a35A15M51L13J7k06
154F90n6j04M8q5m7j39c55j061j271O74Q84N28I0Q66P17N0m98E24B06J74Q7O9
132E36p8J55K75P6j95C23a10k31QJ19j7K7d1B26p2a23l45n27q2L09K89d7B17K00
$$ y = [93, 56, 165, 196, -82, -768, -1587, -1160, -654, -157, 154, 108, -262, -827, -1286, -1177, -852, -604, -147, -59, -123, -160, -448, -565, -438, 121, 302, -36, -558, -922, -742, -501, -908, -1344, -1656, -1934, -1916, -1543, -823, -62, 538, 733, 457, -143, -751, -928, -1341, -1857, -2039, -1769, -1651, -1336, -1183, -1270, -1675, -2362, -1997, -1788, -1325, -801, -260, 13, 23, -288, -967, -1783, -2605, -1657, -918, -528, -314, -164, 93, 434, 777, 840, 643, 183, -703, -1316, -930, -110, 410, 586, 568, 823, 1180, 1571, 1858, 2181, 2369, 2229, 1563, 688, -543, -1682, -1394, -712, -216, -356, -408, 199, 987, 1463, 1495, 1009, 519, -76, -652, -872, -689, -524, -582, -845, -1375, -1883, -1606, -987, 72, 817, 1046, 707, 130, -135, 115, 566, 879, 896, 690, 634, 530, 578, 493, 446, 307, -355, -1416, -2687, -2013, -1129, -601, 90, 956, 1673, 1723, 1225, 524, 206, 380, 467, 536, 458, 613, 888, 964, 769, 323, -110, -341, -333, -214, -231, -204, -41, 226, 154, -123, -468, -995, -1077, -768, -479, -47, 217, 417]
108D17L46L44Q5m47A69c3D08O85Nn12b87n24J63a35F20N90J79m74a54j367c56
86C81K42B16f68m36N02b44l0l55k54J56K67A24Q64O18K64n03Ca333E21J553P54
65B828r1n47q37n78C10R9N31P50Q36L06p8p64r39D31K96L55m20a06p50c13A26
43B53h7n11m14J59k70J79e4E58J06A91c81K3a2I32P90L87l13G00g43P2E08O02
21A110K4k44l43B66a78M6E66L56k53a81j090p0c71d3n52k12L31N3n29r55h44
$$ y = [417, 763, 1107, 1192, 745, 169, -33, 408, 1093, 1098, 586, -287, -811, -648, -135, 620, 1210, 1389, 915, -154, -1521, -356, 381, 623, 216, -668, -1104, -602, -244, -274, -629, -883, -727, -460, 124, 988, 1606, 1870, 1367, 3, -1333, 521, 2074, 2828, 2737, 2190, 1353, 775, 310, 409, 940, 1690, 2526, 2832, 2754, 1990, 1051, 431, 727, 1082, 662, -106, -856, -313, 126, 253, -87, -598, -1012, -853, -1123, -944, -54, 558, 664, 191, -381, -358, -12, 932, 1722, 2109, 1796, 700, -743, -671, 508, 1110, 1134, 890, 547, 266, -178, -132, 566, 922, 669, -181, -1271, -1341, -371, -43, -595, -807, -476, -423, -952, -1907, -844]
##PAGE= F1=0.1015125394115
##FIRST=     25.9928259484165, 8223.18227667557, 154
##DATA TABLE= (F2++(Y..Y)), PROFILE
16383A54N62p7I6h12l09c01G20P91K98j20q6N1J57p8k87m80A73h74L80I08J086
16362A994J75n44H04b25p04Q9K20FP93M40J90k05m99A46g89j49c92B18M95j23
16342E90b08j7A034R37J26q39a26j035e63A78J82K64L44J78j79m23E2a29K4A38
16321C42I9f17n72A06J617J048K88o31A152G0Q3O75k8b14j664c51A240P53l55
16302A638o55m01j3K7B94c87o60a81C52lb29r50r15K67L40J08e19E27M42n4B74
16280e27n4A06M32J09J72L0m14c07k93A78M85Qk01j92n4r4b16n21j84L12a66O4
16258a02k85l78m58n50N0f69B46M33J20j23j89A59B8c3j11m0r4R2d6k70o51l30
16236a297N16I6R96P97J76k91n40m09k11n8Q1M73Q27J166N38j36j014A239C98
$$ y = [154, 716, 639, 96, -812, -1121, -301, 720, 1511, 1809, 1689, 1603, 1654, 1811, 1733, 1446, 966, 173, -874, -494, 908, 1994, 2169, 1625, 804, -225, -929, -840, -620, 6, 799, 1239, 1429, 1224, 725, 146, -789, -938, -392, 218, 713, 590, -208, -225, 1034, 1971, 2097, 1258, -126, -1161, -563, 178, 360, 624, 968, 1146, 967, 544, 52, -129, -105, 138, 342, 99, -617, -1189, 106, 1723, 2771, 3059, 2428, 1152, 70, 153, 828, 800, -214, -1878, -351, 1240, 1993, 1638, 983, 582, 569, 596, 294, -387, -1047, -181, 352, 349, -229, -1179, -2094, -1827, -1487, -1379, -519, 527, 969, 915, 274, -527, -581, 106, 538, 647, 819, 849, 435, -307, -600, 178, 663, 671, 470, 278, 224, 130, -216, -737, -921, -609, -166, -102, -387, -765, -1223, -1773, -1723, -669, 246, 679, 799, 676, 487, 159, 28, -33, -144, -184, -278, -186, -46, -316, -967, -1297, -781, 96, 1092, 1889, 2065, 1774, 1234, 825, 614, 556, 637, 1110, 1937, 3103, 3641, 3505, 2491, 1239, 398]
16216C33L6K33J41j24I2e58k40L3L57a00j29o72m98dA356Q30L75k41k36k36l35
16195A513n14B64d39o38m77J64M12d01a5I6m5M5g4l37k8J67c3j17l85k86J77a60
16172F2A4c97o40k2J17m14l23K8K33Q4J64N07F18J142N12j0n38p93If38a06H93
16149A665P96P93N11N11j12m04n37m20l98n06m99j75J82O71Q19L52j69o88j021
16130A371B09c83r3a34E57O03L22Kj0m2l9j35k76m02a27p10o04j64O03L09m0l2
16108g65K66K40K2k81l97k66N01D2N59L32J51j30j18r8o9j20c2q11n36n08P17
16087a170b90D69K54K25k56B16d26k52k16q3J04a79G84Q86Q97N32L46r7k0j9l11
16066B998n95k16l96n33l50q3j15j51A23d43n46n29l90l27k24Q7M47N56L45K5
$$ y = [333, 369, 602, 743, 619, 92, -558, -798, -765, -408, -100, -229, -901, -1399, -4, 1356, 2186, 2561, 2320, 2084, 1848, 1513, 999, 264, -439, -1077, -1554, -1390, -978, -401, -15, 96, 51, 96, -74, -411, -439, -272, -33, -150, -535, -821, -644, -160, 62, 14, -397, -1037, -1059, -942, -1356, -1679, -1651, -1418, -1334, -1170, -663, 618, 1760, 2272, 2262, 1724, 931, 9, -638, -106, 893, 1665, 2461, 3254, 3765, 4276, 4164, 3760, 3223, 2803, 2405, 1899, 1400, 1225, 1407, 2078, 2897, 3249, 3080, 2392, 1371, 209, -383, -476, -134, 557, 1160, 1482, 1484, 1474, 1432, 1393, 1258, 982, 580, -127, -837, -1441, -1605, -1002, -693, -733, -765, -499, -259, -237, -518, -915, -1181, -680, 42, 601, 933, 1084, 954, 836, 738, 669, 549, -32, -843, -1379, -1887, -1170, -290, 469, 723, 948, 692, 216, -426, -678, -894, -977, -873, -179, 784, 1670, 2567, 3099, 3445, 3348, 3328, 3309, 2998, 2403, 2187, 1791, 1258, 908, 825, 710, 559, 123, -443, -989, -1518, -1908, -2235, -2459, -2372, -1925, -1369, -1024, -999]
16046i99m57q33n5d97I42P86L95q8p75H9i08o88J12L82J49K51c02a06m28r12p1
16025a517c28D91r3b00l84b79D75P48L99R9k23n32D12c19p15j30e17A27M15K35
16005G77K88J8k62l32A52N6N15N59J88l48B94g76r67KO45d60C8K55G3d61p19l38
15983a518L36d04D60Q00J060M72o9m36l59m10o46D8h62j46b82E90L33m18e00j079
15963a579k30h09f7D61N0k18c70r03q40Q07d35B22M08M97m9k89k41j0P5r4A42
15941b98l84b61D71M52J90E34a06p12l60M31A02N20j01I2a46A95L00M79L63J93
15921A530j27l17k73C44D3b65k90@H04J86B40a068q00e18H69O29j08o07e6p16
15901g72j78J92K34M8m72p66m10K30M05j93n79N04h61i9C84J99k23b25p01o83
$$ y = [-999, -1456, -2289, -2344, -497, 942, 1728, 2123, 2035, 1260, 89, -908, -1596, -1484, -1102, -953, -702, -302, -106, -534, -1446, -1517, -328, 491, 398, -200, -584, -279, 475, 1223, 1622, 1721, 1498, 966, 412, -319, -1034, -1164, -517, 127, 542, 777, 1065, 1083, 821, 489, 152, 208, 723, 1282, 1470, 1122, 294, -776, -1743, -1741, -1096, -460, 38, 293, 73, -461, -1180, -1518, -1182, -404, 460, 1260, 2320, 2792, 2723, 2287, 1928, 1518, 872, 48, -862, -1008, -282, 590, 923, 505, -500, -1579, -1809, -809, -67, 461, 511, 293, -370, -1273, -2113, -1306, -435, 222, 630, 1127, 1078, 789, 548, 538, 613, 519, 142, -298, -682, -261, 471, 923, 1113, 534, -106, -818, -1178, -747, 102, 622, 521, 92, -146, 195, 495, 974, 1337, 1530, 1403, 1086, 813, 344, 43, -265, -555, 0, 804, 990, 240, -1068, -1868, -518, 869, 1498, 1390, 783, -56, -772, -950, -758, -524, -476, -948, -1714, -2124, -1894, -1489, -1682, -2261, -1757, -861, -99, 384, 583, 360, -225, -926, -1609]
15881a609N23K96j43o22l85Jl9L82L29Lm02m15j82J39R0p1m36J022d76D12N92
15860A004K5D77a00n12j12k06M5p1k2k6p8p1J66M76J94l96m63m01m03M09N88O8
15838i15n93n39M84O85b30A46J00H1c04k39K46A79N73L96J75m1j30j69k36H9a048
15816a553e60H6N60J88K93K4n1j83J9m9O4M14O91Q8l06H40f22j493J009b7D99
15794E52B40a44l28k00j30j80N4d25A5L33hr12r20j60L12K4m19M64b86E08P7A50
15771b78k79P3a91C13L96J15l37I2c65Q4B47O83M78l5n64e8q64b83H86P80M23
15750B089k3o27D59d45m81l54K14M63A98Q86N32p3F71f20q07N32L92J59k25l7
15730f06b87i8q6m74o37n53M58L92J05k46m71j85J48N83d16eF9a23m17l18n8M
$$ y = [-1609, -1086, -790, -933, -1555, -1940, -1939, -1978, -1596, -1267, -1264, -1666, -2081, -2263, -2124, -2034, -2105, -2541, -1519, -476, 412, 1004, 1029, 477, -100, -612, -724, -930, -885, -956, -978, -1004, -1082, -1153, -987, -511, -317, -713, -1176, -1577, -1980, -1571, -983, -915, -1508, -2047, -1563, -878, -230, 146, 246, 81, -304, -543, -297, 179, 752, 1148, 1323, 1282, 1152, 983, 747, 89, -1048, -1553, -560, 86, 646, 834, 1127, 1151, 1100, 917, 936, 887, 951, 1365, 2056, 2144, 1838, 840, -622, -2115, -1106, -27, 499, 552, 240, -144, -472, -672, -802, -982, -928, -425, 15, 348, -8, -920, -1840, -2000, -1688, -1664, -2083, -1619, -286, 508, 585, 150, -278, -557, -484, -191, 313, 709, 824, 487, 92, -365, -281, 247, 930, 1408, 1373, 809, -58, -922, -283, 886, 1666, 2089, 2066, 1439, 459, -445, -926, -1280, -1066, -603, 198, 1084, 1616, 1543, 671, -620, -1427, -895, -503, -344, -569, -606, -287, -98, -184, -658, -1295, -1848, -1390, -998, -893, -1139, -1610, -1795, -1647, -1064, -416, -5, 69, -123, -540, -858, -916, -912]
15708i12n1K69a15A134J235R41L73j72m30o47n26j85j36j06k56m21l71A20b0j7
15688c7m8A27P9r7g6l66m47l21M57L67H7c7j10l02m24n35j77K97L74L22j41m13
15666a146l8K86d13E1M14L64M16M98L73k36o07B38i47j062p21J001Q08e6F81K78
15646I59j03l68k16K35K96q7A96d04m93j35L74K10Q8J71C28O40N18K89J29m0j93
15625A671k08k63k36k12j75a96q16q8e13C11J95jk23E2lK6J31J49Ma6q68q36j71
15602a891j37j99L76K69K54M87a95b1l53m80m14rJ34K4J29K46L18a45I6j0a83
15580e89m09J23c82A78N46L46J95l81a27j383f85F42J146R89M60k41m42o90n46
15561A318o19c46p66R7d14Ga19n77q56m36h01A56M94K69J13r6L4J63K78L11L47
$$ y = [-912, -963, -694, -115, 1134, 2369, 3310, 3683, 3511, 3081, 2434, 1908, 1723, 1587, 1481, 1225, 804, 433, 120, -20, -37, -85, 127, 206, 109, -76, -442, -889, -1210, -753, -386, 87, -37, -147, -449, -873, -1408, -1585, -1288, -914, -592, -733, -1146, -1184, -898, -413, 51, 465, 829, 1245, 1743, 2116, 1880, 1273, 238, -947, -2009, -2730, -1729, -921, -56, 681, 959, 856, 488, 272, 507, 803, 716, 196, -404, -897, -1032, -658, -448, -360, -189, 328, 968, 1486, 1775, 1904, 1864, 1671, 1463, 1200, 964, 752, 577, -196, -1012, -1100, -513, 311, 506, 505, 282, 52, 49, 75, 206, 355, 359, -16, -884, -1720, -1891, -2028, -2227, -1851, -1582, -1328, -841, -195, -21, -374, -854, -1268, -1277, -1143, -1119, -990, -744, -426, -145, 96, 86, -183, -589, -998, -875, -382, 178, 724, 1070, 1265, 884, -127, -1510, -685, 642, 1788, 2777, 3237, 2996, 2554, 1864, 1318, 699, -346, -1112, -1015, -414, 7, -119, -696, -1552, -1988, -801, 156, 650, 919, 1032, 936, 970, 1133, 1411, 1722, 2069]
15540B069k6l75q27a56n19b56D81O28L76K81R3l47n61B46c33o01n15o13n15N39
15520b038J63L68L66K4j61l07k10K47J90P9J99L24c29a22e0j34m46m06j53K1K33
15499i35L45b92o6n36o49l37N41f51a23A08a58k45J05b2I6fl17l62r0J29M4o84
15477a286k48k26j86Q5M16L72L3P5j13P5a74I44R14N82r4l69m12o17m20o7L71
15456H32N73M63J58k24n26E85a51q26n03L48c19B47M00K02m1j68Mj5o2m8j42G4
15433DL79O12N70J72r7G20f22j442j76i64a5C42A59e60r28o88k1N81L94N72c12
15411D3J97J68J57N7j31B22h6k98j15b37B9Kh8j08B98P72O80L45l16q20b25o94
15389i19L87GJ16c39p83K68b7E58L26J17J4j30k87k21N24R95J067P04L42j03l27
$$ y = [2069, 2043, 1668, 841, -156, -675, -256, 481, 1109, 1485, 1766, 1859, 1512, 951, 246, -333, -934, -1449, -2062, -2577, -2038, -1875, -1507, -1141, -1117, -1278, -1585, -1795, -1548, -1358, -1279, -1080, -756, -329, -122, -50, -184, -630, -1036, -1189, -1168, -935, -590, -292, -358, -894, -1543, -1880, -1339, -651, -123, 108, -158, -403, -298, -22, 96, -6, -323, -685, -775, -646, -602, -1286, -1534, -1760, -1946, -1861, -1445, -1073, -1040, -965, -1078, -1003, -174, 944, 1858, 2440, 2346, 1977, 1565, 948, 528, 461, 832, 1405, 1868, 2026, 1802, 1276, 585, -151, -977, -1480, -1132, -319, 247, 647, 849, 808, 640, 644, 629, 567, 519, 377, 74, 4, 383, 995, 1565, 1737, 1640, 720, -622, -2064, -2240, -964, -15, 342, 159, -560, -1488, -2176, -2197, -1616, -1222, -650, -312, 43, 240, 408, 565, 622, 491, 222, -86, -384, -499, -237, 29, 31, -88, -196, 298, 1070, 1750, 2095, 1779, 959, -225, -919, -532, 7, 123, -339, -1122, -854, -27, 558, 884, 1001, 1015, 885, 598, 377, 901, 1896, 2963, 3667, 4009, 3906, 3579]
15368C579m68l75l96o42E60g74j336o69J069g35B7M55K28J20J13k27k17j3R3L62
15348I41R7j56l52G0c56l41l0K88E8N71M80J35l89c8p85I1J286Q25j8o30C90h69
15325a910m88Q63N03F75K083J251K57n75j046A248A15c36C13R33M31J4m21A11
$$ y = [3579, 3111, 2736, 2340, 1698, 560, -774, -2110, -2779, -1710, -735, 27, 482, 710, 830, 943, 716, 499, 486, 579, 941, 1038, 882, 530, 70, -356, -697, -727, -439, 58, 629, 1109, 1244, 855, -38, -823, 91, 1377, 2202, 2184, 1554, 390, -869, -1910, -2398, -1535, -1032, 675, 2758, 4009, 4266, 3691, 2645, 1248, 115, -336, 313, 1246, 1677, 1691, 1270, 111]
$$ [...]