
##TITLE=AC1409_CRIAH12218_7652841_IGf1nGLMjE
##JCAMPDX= 6.0         $$ Bruker NMR JCAMP-DX V2.0
##DATA TYPE= NMR SPECTRUM
##DATA CLASS= NTUPLES
##ORIGIN= BRUKER
##OWNER= Administrator
$$ 1.72 TOPSPIN		Version 2.1
$$ 2013-03-19 23:16:03.243 -0500  Administrator@X
$$ Compression mode = diff/dup
##.OBSERVE FREQUENCY= 400.02188249412
##.OBSERVE NUCLEUS= ^1H
##.ACQUISITION MODE= SIMULTANEOUS (DQD)
##.ACQUISITION SCHEME= undefined
##.AVERAGES= 8
##.DIGITISER RES= 22
##SPECTROMETER/DATA SYSTEM= spect
##.PULSE SEQUENCE= zg30
##.SOLVENT NAME= COFFEE_meoh
##.SHIFT REFERENCE= INTERNAL, COFFEE_meoh, 1, 14.98509
##AUDIT TRAIL= $$ (NUMBER, WHEN, WHO, WHERE, PROCESS, VERSION, WHAT)
$$ ##TITLE= Audit trail, TOPSPIN		Version 2.1
$$ ##JCAMPDX= 5.01
$$ ##ORIGIN= Bruker BioSpin GmbH
$$ ##OWNER= Administrator
$$ $$ E:\/data/COFFEE/nmr/AC1409_CRIAH12218_7652841_IGf1nGLMjE/10/pdata/1/auditp.txt
$$ ##AUDIT TRAIL=  $$ (NUMBER, WHEN, WHO, WHERE, PROCESS, VERSION, WHAT)
(   1,<2013-03-19 23:15:54.743 -0500>,<Administrator>,<X>,<go>,<TOPSPIN 2.1>,
      <created by zg
	started at 2013-03-19 23:14:48.403 -0500,
	POWCHK enabled, PULCHK disabled,
       configuration hash MD5:
       86 BA 57 50 F2 9D 5C 9B 26 00 A9 28 5F 66 2E 89
       data hash MD5: 64K
       FB EF 46 31 75 60 24 85 21 87 43 A6 F2 7C 0E 65>)
(   2,<2013-03-19 23:15:57.946 -0500>,<Administrator>,<X>,<proc1d>,<TOPSPIN 2.1>,
      <Start of raw data processing
       efp LB = 0 FT_mod = 6 PKNL = 1 PHC0 = 0 PHC1 = 0 SI = 32K 
       data hash MD5: 32K
       A6 A5 2A 54 72 B9 70 93 E7 99 5C F4 1B F5 56 5A>)
(   3,<2013-03-19 23:15:58.430 -0500>,<Administrator>,<X>,<proc1d>,<TOPSPIN 2.1>,
      <pk PHC0 = 98.24524 PHC1 = 0 
       data hash MD5: 32K
       12 F1 6E 9C 16 D7 10 DA E2 43 83 6F 3A BB D8 66>)
(   4,<2013-03-19 23:15:58.664 -0500>,<Administrator>,<X>,<proc1d>,<TOPSPIN 2.1>,
      <abs ABSG = 1 
       data hash MD5: 32K
       59 22 93 2B EF 0A 48 3F 16 6B A1 E8 2D F1 DC 61>)
(   5,<2013-03-19 23:15:58.821 -0500>,<Administrator>,<X>,<proc1d>,<TOPSPIN 2.1>,
      <abs ABSG = 2 
       data hash MD5: 32K
       95 0E E8 3F 34 6C 24 47 DC 29 B1 18 97 92 1C E7>)
(   6,<2013-03-19 23:15:58.961 -0500>,<Administrator>,<X>,<proc1d>,<TOPSPIN 2.1>,
      <abs ABSG = 3 
       data hash MD5: 32K
       41 4B 44 51 64 A3 8A B8 6E BC EC EE C5 F9 54 E5>)
(   7,<2013-03-19 23:15:59.133 -0500>,<Administrator>,<X>,<proc1d>,<TOPSPIN 2.1>,
      <abs ABSG = 4 
       data hash MD5: 32K
       68 F5 59 25 A7 2D 96 7E 51 44 71 53 CE D1 D9 26>)
(   8,<2013-03-19 23:15:59.274 -0500>,<Administrator>,<X>,<proc1d>,<TOPSPIN 2.1>,
      <abs ABSG = 5 
       data hash MD5: 32K
       F4 AE 84 57 B6 27 24 04 67 B3 CB 7D CC 28 77 97>)
$$ ##END=
$$ 
$$ $$ hash MD5
$$ $$ FD 88 FE 2E EA 98 2F 23 1E 44 69 4D 82 6D 36 63
##$RELAX= 
##$RELAX= 
##$RELAX= 
##$RELAX= 
##$RELAX= 
##$RELAX= 
##$RELAX= 
$$ Bruker specific parameters
$$ --------------------------
##$DU= <E:\>
##$EXPNO= 10
##$NAME= <AC1409_CRIAH12218_7652841_IGf1nGLMjE>
$$ [...]
150 150 150 150 150 150 150 150
##$TP07= 0
##$TPNAME0= <>
##$TPNAME1= <>
##$TPNAME2= <>
##$TPNAME3= <>
##$TPNAME4= <>
##$TPNAME5= <>
##$TPNAME6= <>
##$TPNAME7= <>
##$TPOAL= (0..7)
0.5 0.5 0.5 0.5 0.5 0.5 0.5 0.5
##$TPOFFS= (0..7)
0 0 0 0 0 0 0 0
##$TUNHIN= 0
##$TUNHOUT= 0
##$TUNXOUT= 0
##$USERA1= <user>
##$USERA2= <user>
##$USERA3= <user>
##$USERA4= <user>
##$USERA5= <user>
##$V9= 5
##$VALIST= <valist>
##$VCLIST= <CCCCCCCCCCCCCCC>
##$VD= 0
##$VDLIST= <DDDDDDDDDDDDDDD>
##$VPLIST= <PPPPPPPPPPPPPPP>
##$VTLIST= <TTTTTTTTTTTTTTT>
##$WBST= 2048
##$WBSW= 25
##$XGAIN= (0..3)
0 0 0 0
##$XL= 0
##$YL= 0
##$YMAX_a= 651379
##$YMIN_a= -556289
##$ZGOPTNS= <>
##$ZL1= 120
##$ZL2= 120
##$ZL3= 120
##$ZL4= 120
##$ABSF1= 14.98509
##$ABSF2= -5.573092
##$ABSG= 5
##$ABSL= 3
##$ALPHA= 0
##$AQORDER= 0
##$ASSFAC= 0
##$ASSFACI= 0
##$ASSFACX= 0
##$ASSWID= 0
##$AUNMP= <proc_prof1d_extract_pilot.lims>
##$AXLEFT= 0
##$AXNAME= <>
##$AXNUC= <1H>
##$AXRIGHT= 0
##$AXTYPE= 0
##$AXUNIT= <>
##$AZFE= 0.1
##$AZFW= 0.1
##$BCFW= 0
##$BC_mod= 0
##$BYTORDP= 0
##$COROFFS= 0
##$CY= 15
##$DATMOD= 1
##$DC= 0
##$DFILT= <>
##$DTYPP= 0
##$F1P= 0
##$F2P= 0
##$FCOR= 0.5
##$FTSIZE= 32768
##$FT_mod= 6
##$GAMMA= 0
##$GB= 0
##$INTBC= 1
##$INTSCL= 1
##$ISEN= 128
##$LB= 0
##$LEV0= 0
##$LPBIN= 0
##$MAXI= 10000
##$MC2= 0
##$MEAN= 0
##$ME_mod= 0
##$MI= 0
##$NCOEF= 0
##$NC_proc= -8
##$NLEV= 6
##$NOISF1= 0
##$NOISF2= 0
##$NSP= 0
##$NTH_PI= 0
##$NZP= 0
##$OFFSET= 14.98509
##$PC= 1
##$PHC0= 98.24524
##$PHC1= 0
##$PH_mod= 1
##$PKNL= yes
##$PPARMOD= 0
##$PPDIAG= 0
##$PPIPTYP= 0
##$PPMPNUM= 2147483647
##$PPRESOL= 1
##$PSCAL= 4
##$PSIGN= 0
##$PYNMP= <proc.py>
##$REVERSE= no
##$SF= 400.02
##$SI= 32768
##$SIGF1= 0
##$SIGF2= 0
##$SINO= 400
##$SIOLD= 32768
##$SPECTYP= <>
##$SREGLST= <1H.CDCl3>
##$SSB= 0
##$STSI= 32768
##$STSR= 0
##$SW_p= 8223.68421052631
##$SYMM= 0
##$S_DEV= 0
##$TDeff= 65536
##$TDoff= 0
##$TI= <>
##$TILT= no
##$TM1= 0
##$TM2= 0
##$TOPLEV= 0
##$USERP1= <user>
##$USERP2= <user>
##$USERP3= <user>
##$USERP4= <user>
##$USERP5= <user>
##$WDW= 1
##$XDIM= 32768
##$YMAX_p= 461789126
##$YMIN_p= -683295
##$CURPLOT= <Network HP LaserJet P1505>
##$CURPRIN= <$Network HP LaserJet P1505>
##$DFORMAT= <normdp>
##$LAYOUT= <+/1D_H.xwp>
##$LFORMAT= <normlp>
##$PFORMAT= <normpl>
##$SURQMSG= 1
$$ End of Bruker specific parameters
$$ ---------------------------------
##NTUPLES= NMR SPECTRUM
##VAR_NAME=  FREQUENCY,     SPECTRUM/REAL,   SPECTRUM/IMAG
##SYMBOL=    X,             R,               I
##VAR_TYPE=  INDEPENDENT,   DEPENDENT,       DEPENDENT
##VAR_FORM=  AFFN,          ASDF,            ASDF
##VAR_DIM=   32768,         32768,           32768
##UNITS=     HZ,            ARBITRARY UNITS, ARBITRARY UNITS
##FACTOR=    0.250966925370066, 1,           1
##FIRST=     8223.43324360094, -52181,       127845
##LAST=      0,             122060,          -90682
##MIN=       0,             -683295,         0
##MAX=       8223.43324360094, 461789126,    0
$$ Real data points
##PAGE= N=1
##DATA TABLE= (X++(R..R)), XYDATA
$$ [...]
23873 -151761 266928 -182886 -98225 -325075 -185389 55156 24754 -62467 -181087 -130354
23863 -130354 327900 -28366 56503 28226 13350 -80467 -143355 -73527 -300715 186574 105514
23852 105514 -142136 201148 -150955 215228 195396 55225 -5964 162354 -23633 175286
23841 -147548 -77517 217334 -17127 187354 -151964 229580 -114217 -204309 207968 -173849
23830 -104495 66988 16599 -111257 -116725 230258 1247 385131 -169847 -110480 89262 227971
23819 227971 126604 -4058 94291 -8726 -516849 52344 -163003 -79044 314729 -33696 194864
23807 177163 -45484 -4609 47275 -169301 -339854 -210282 -53471 6371 220928 -84280 36627
23795 74946 160782 120740 -125548 -142131 125729 -56866 265286 -120542 -78392 -86808 -166686
23784 -166686 -6216 -66885 142868 -241670 102777 -9125 11314 -129455 -37243 475130 -116589
23772 20264 123232 -236866 -144908 13474 -28058 -117818 114629 -45937 108607 15431 210412
23761 210412 -234257 -31836 -157 -286032 164615 267891 -166989 -255459 -160115 -8189 -158318
23750 -158318 -18363 226773 -297184 -120336 -24651 -195171 -54269 -345372 -63887 -182359
23740 -182359 61185 139262 32207 15960 -235399 -117067 -112579 167892 -146381 -131508 26171
23728 93975 145407 -124879 304405 -153740 -213733 -137609 -75151 -215223 -105372 -83096 47439
23716 148039 52604 218052 75269 -41677 -252728 12316 32192 -112166 -276350 -116513
23705 25447 361832 -96107 -119486 7609 -77263 -94275 -274845 157844 161974 -211519 -131447
23694 -131447 -117608 54080 102298 -79317 -163673 91959 -88279 -360043 46432 -245763 -71658
23682 -156828 107835 108412 -326383 2954 -94596 -215163 29754 1036 -144088 -95235 273688
23670 197721 -69492 136999 50978 76173 6279 -181368 -178904 -75399 -118361 -133890 -18987
23658 -443765 -20133 -46416 -136785 -12359 -305119 9137 -77616 18068 342462 66318 -51932
23646 117448 -36432 5555 -279153 13768 -122293 43302 16422 -62082 84928 -13447 129158
23634 99991 -19520 -70508 12851 82246 85733 88421 -40875 123629 375550 46276 210309
23623 210309 -118205 95826 -74189 -303756 -164093 -106661 28790 -121888 11288 -94082 -69095
23612 -69095 97892 63286 228372 -246229 -69200 339790 -39852 -82496 -154752 14755 -107364
23600 109515 -21570 110545 92617 -303406 203698 -35977 -64714 -121785 290776 120426
23589 -211710 -49885 244219 -25352 143810 103035 -64216 -115578 24728 48784 -509613 89561
23577 72354 -88103 80091 -60634 314568 232860 17920 161734 56757 -92930 -106593 64593
23565 250022 -8245 235026 166327 22971 160877 -265909 -106192 -149253 153487 -16860 -265655
23554 -265655 -15596 -262986 -99075 328034 -475679 324117 -98363 -56004 -172357 229712
23543 -191287 -193592 -138027 -178857 133196 -382012 281848 -108896 -97542 -109259 155587 -24853
23531 -17414 154625 24910 392759 -107810 -247620 194797 6404 -305323 33441 47930 -339181
23519 109584 88794 -398172 44781 -71197 231690 -75884 -150838 -29663 -78300 -117374 -6320
23507 14918 108904 -72981 267020 -92152 -51301 -89818 -83245 39943 175924 -79049 -136053
23496 -136053 141252 84270 286192 118419 -179703 82627 -89145 -143784 -60013 -30794 -27731
23485 -27731 41739 110137 15109 36042 139591 -102408 -67922 130361 41686 80829 -267950
23473 -73747 -153401 58562 69459 -13131 -66049 -306875 -140382 -27611 -313553 -309224 221852
23461 -7618 -326023 -60672 -193544 -63594 1041 242398 -90164 183651 -132901 -428101 128936
23449 359797 122160 21465 176252 108646 8025 113223 -17014 256951 -7987 -89788 7201
23437 -23048 25595 162972 42482 -391852 -11025 75292 -55484 -183209 -411862 32612 -314275
23425 -278205 78239 -252886 -49189 -125236 54332 -57687 80465 83765 63427 47254 -175573
23413 19617 219800 -32042 60118 60734 9496 -90205 105459 -138209 -124185 40208 46639 167125
23401 167125 -7805 22427 373719 -9978 32740 127685 348397 -68454 -170268 50563 17929
23389 97555 -59026 -200591 -25265 -137574 124609 144870 49749 63578 189934 -52525 259170
23377 -218446 -93729 74757 -99208 -452214 -198551 -52795 -215193 -118842 47533 -67470 -212881
23366 -212881 -42799 -287985 -90947 -84799 27846 111700 104138 140419 -11130 -79183 -6441 106366
23353 -126863 -59691 88627 58304 218341 -57882 225214 41199 160743 167632 120716 55893
23341 203855 -21988 199269 33697 95372 -66154 -30175 224991 -174385 -34410 -281794 -7943
23329 210643 251689 181166 -7386 -409581 96397 -66101 -144533 -108955 -389410 -27740 138262
23317 171710 -92037 -156545 -227064 -113899 125146 85911 -110977 280338 94736 60482 325168
23306 325168 -30332 -17693 -146664 173046 -157690 16039 -43275 -160448 -111042 246144
23295 -85474 192553 -56734 228997 198747 -99937 127414 84218 207811 -14270 -236739 -98888
23283 68969 -20184 -25966 -34414 -104445 83608 68962 113733 -306285 -14184 52962 -301291 325943
23270 -249788 166241 -171065 -25919 146457 -15962 140799 236389 82261 29511 405877
23260 405877 84220 -123253 56113 87122 -83836 17706 180585 -240640 96841 -48826 -194423
23249 -194423 -98370 -101634 -88317 113670 -159578 14989 169311 -277246 69588 -56321 207219
23237 -16654 140469 40032 202154 -310397 -221629 -311128 160632 -180629 -280447 1934 -203082
23225 196079 -221384 45142 37131 -113165 164287 16131 225302 447045 -60329 -328747
23215 -328747 -135889 4911 169651 -182469 186208 305342 -451139 -111524 -56209 185320
23204 -258667 -124980 -89122 91745 782 -111210 -101495 199525 -33012 -113764 107043 -6295
23192 30734 -112586 -154998 33033 -18653 -212796 320943 -85584 113762 89066 -128882 -66868
23181 -66868 114167 -112969 126091 -139209 -133239 274513 -124775 157348 -155081 -109190
23171 -109190 -262210 788 -258535 76112 175837 230161 -22408 54285 -50242 -95530 -4985 26077
23158 121355 82378 -192112 -291582 -327909 144942 -18633 -332288 -75431 69380 235195 90557
23146 203437 -23778 122350 150843 137014 46620 46601 -230599 -89033 118993 219934 -233628
23134 197155 -45916 141932 -61166 200507 272430 435402 -62736 88161 -307698 -102626
23123 26247 49857 149376 -299034 -258040 224248 121645 276743 210498 -29742 10 36930
23112 36930 -93632 60830 -87673 -333417 -73287 -197687 91771 -218519 -294057 -135211 -76932
23101 -76932 178552 16726 5537 -52171 317811 -328150 -257459 -232283 43604 -68043 -260441
23090 -260441 459389 -140567 -108739 -2215 -17578 -16723 6582 15692 87959 157755 -20348 -126084
23078 -126084 139611 299303 233284 178732 1342 170771 151521 -548220 -93054 -176672 62791
23066 -202624 -21526 38816 -55254 -567311 -258203 -119390 -114641 -154033 -83265 -3301 -232895
23055 -232895 35621 130004 -17643 -180906 14902 141942 -57440 70936 -39092 39643 -230417
23043 98453 56106 38517 -188110 220869 -113630 -88381 -189067 -102037 -272821 351907
23032 44705 -274683 -71764 124654 108064 95426 -135490 -101709 -322970 138185 -156703
23021 238841 -98298 -165770 122111 -111348 -169768 -11945 238093 261262 3532 45019 -73921
23009 -38745 236457 -69170 -296211 -67275 45061 -124731 -31530 -110744 -360614 -237898 106828
22997 -216943 -17985 -148213 -348686 169533 15084 84534 38635 252865 -132569 91791
22986 -112539 288330 232326 -68189 -77421 -63406 179270 -44129 -25080 29250 -55995 -211363
22975 -211363 85588 -136267 -19275 220485 109109 46496 138935 153460 -54220 145455 213811
22964 213811 133075 -145933 -39500 -290030 -46306 -34158 -69357 -16585 367686 -191338 -210560
22953 -210560 177042 -44573 -6745 -201283 -9958 224105 105711 -51455 -68057 -20481 30913
22941 -298275 111858 103951 -82705 -338975 -131392 -36991 -52846 122196 -32187 -402462 -279988
22930 -279988 -188240 362814 164242 82194 154373 73806 200248 -290652 86566 -474795
22919 23057 -76108 92219 -8205 239892 -140078 -52629 -174950 68035 -202996 78268 73906
22908 73906 220505 15925 -139138 82759 -1065 -122381 44992 257475 -376795 109040 312232
22897 312232 56385 -53373 -225154 -396 -84312 -167790 11357 -321271 33988 531239 253231
22885 31262 -18686 -40096 12583 -259033 88930 143461 -365796 197886 -206627 23250 -117088
22873 115645 55777 -135048 108340 15465 123182 169920 -43414 187255 110173 -52361 -109129
22862 -109129 -68397 -74149 -97985 -25441 313447 40562 -181954 -61855 176831 -139958 -1985
22850 -190347 -171285 71032 133412 -232855 -223961 -267608 40615 9228 -247167 -34291 167659
22838 -153522 -25758 -160085 -67278 -101013 -12984 -64579 -52025 -222527 -120335 -196430 -109550
22827 -109550 -204219 -16632 91041 -52231 121078 -34931 5150 -177563 -11481 305745 -76787
22815 103447 29727 113754 -44708 78299 243758 256222 -140430 172584 -103843 -98211 11723
22803 -197885 76632 -194587 -122359 -62382 78819 107007 109493 -14157 107783 145172 84927
22792 84927 -33927 -192216 21779 -108782 -96894 212486 -14922 -99878 58160 -6049 -74054
22781 -74054 102297 -169833 -170611 116103 49319 -202636 15213 -79733 -227595 -210051 -78467
22769 97268 74668 -48714 -233344 -14433 -95705 160671 -153476 -4408 -65971 138089 -292860
22757 -198890 -128981 -221168 85050 248528 211070 13346 154095 -58620 -14287 -53381 -199506
22746 -199506 134241 -13819 -180995 -53306 -82806 -78050 -196094 354343 363226 -254118 36641
22734 100935 82782 91999 -39531 -40935 -75389 -13810 -117538 -156101 -100027 69756 85497 -83993
22721 -182119 317869 92828 125307 254661 119610 143873 -121986 -172186 35164 166672
22711 166672 -169145 -35397 298221 86771 -206920 127551 421425 -11600 -88506 61414
22700 -145762 -67176 -206184 -54806 140159 52548 -46966 103020 -243766 -105810 12203
22689 -61679 1965 -160667 -20845 91447 46672 -114970 207860 31427 -34643 -168481 -123085
22678 -123085 -192032 -68678 -179946 -175136 -85424 -60744 -96717 -179764 -7930 -156711 -212870
22667 -212870 119621 -446856 -73881 32830 -198624 -190107 193801 54921 -9593 -371181 -123330
22655 -46846 139782 -167435 -185085 68996 -118946 15745 -9531 -5554 -121862 18953 -120323
22643 -162657 87569 -158989 -112571 20894 146456 270698 -267888 -27320 31892 -309136
22632 66321 37399 -396735 -205063 225479 376964 487 -169199 24245 -177834 -200470 -49300
22620 278647 441732 -200899 169678 -126644 -83454 -36069 167410 -123388 -31149 -145783
22610 -145783 -253455 -107293 -38630 3879 -237293 206740 149649 -461156 -120062 3454 -176392
22598 112982 29306 216468 196841 -93784 76765 -46736 -156487 -35258 -313285 -239566 39600
22586 -91354 -137616 -101702 46125 100923 341285 302059 -18116 39402 -130090 28741 -129355
22574 -51134 -43597 28847 102681 267313 266677 55675 -119895 31905 369842 -7815 -236209 -344445
22562 -344445 155712 -41781 -9491 -76461 -3447 8677 -238991 184368 102947 -167316 79885
22550 -292251 182295 -411523 88763 -263746 106259 -186473 -241841 -166032 -158627 -139940 20863
22538 -170166 248775 -397574 77791 40673 209139 -98654 -342066 -33113 -112633 8486 -176397
22526 166605 43265 242010 36646 27127 -196867 -178581 197902 -72840 189016 -99007 -143146
22515 -143146 -95691 30439 -242375 -160664 142457 -127710 -197273 47723 153367 204630 -113347
22503 -67824 -45799 359 -189105 -52582 -286965 147990 264925 205621 104715 44879 188787
22492 188787 242716 115479 -11335 66230 -77597 -194895 196786 -142464 -188517 -246073 -208647
22481 -208647 124813 -19313 -94405 -8495 70204 -152107 -88159 189939 -4926 243122 -166299
22469 184334 -451 -115727 -228444 -33272 -125033 121064 -194498 -6074 -63065 64173 42797
22458 42797 -63677 -329445 66271 88554 -162883 -228603 -196045 39469 -43843 -136580 -25119
22446 -246720 203598 -23665 62004 61228 74700 -85267 58667 -4176 86241 -185158 425252
22434 14452 -46318 -324266 146677 -99410 -166308 321654 -80559 -199657 52260 -71467 16869
22422 -130073 -153099 -30045 -118801 191174 -240904 -202226 -136291 11493 -16129 -259482 49984
22410 110418 26078 28738 -302550 -325373 90067 302390 -185601 -88355 -142637 221998 -131509
22398 -61014 -400773 -29526 -156313 -159564 -243101 249304 31404 388654 -223174 51448 -158571
22386 26065 177464 -110378 -180753 -175666 -89774 -133419 -189942 -218580 308443 132537 53667
22374 -13776 -11864 -30695 198851 43257 -197437 -219473 -101517 -174033 -35474 -137433 203724
22362 -289627 -11585 -258372 972 32466 63027 -141048 -73966 111561 -162627 -489623 -156511
22350 102503 202237 -332725 -89880 161516 10545 3479 85783 -334317 -40767 223286 -254062
22338 -66381 372394 -168732 -93841 -289480 -84354 214082 -106065 329434 -154405 41641
22327 -29672 165136 278172 -36695 -308219 -239490 -13469 -76883 173329 -26354 179730 -279809
22315 120853 184752 -31560 206478 -69396 -40526 43248 -25967 79435 -66312 252093 183129
22304 183129 -122373 138774 72846 26435 -22292 261496 -117498 -200878 -38080 56398 411294
22293 411294 77512 -85973 76164 -293309 -75742 105188 -1174 -190476 187380 -18666 76657
22281 -117416 -7279 439605 78847 41889 147858 -20968 146789 144789 -134289 195848 86654
22269 -184435 -39206 -67660 -151041 -135635 -91314 -380341 -117222 274855 -193306 -98473 -184959
22258 -184959 310062 -188059 -39316 -129110 -343361 -207194 127121 -200692 111829 -237178
22247 36587 -106482 42758 -109274 -214120 9536 167604 -137383 -114716 -186792 50136 48704
22236 48704 -54367 -17231 -28073 -234843 -117770 -90015 -297017 -124641 88350 -76602 -71175
22225 -71175 -33955 -89128 228 164387 2535 -156344 -57673 -36109 -195748 129626 -244950
22213 -316434 327362 -243058 -182910 -145863 -53429 -51507 -63085 -317418 -137711 -176748 -222901
22202 -222901 237632 115931 -202570 -265107 -291353 -96803 308703 -208142 138722 124859
22192 124859 245617 109171 -174751 -250598 -216141 -140211 108586 128173 93497 238001
22182 238001 -102347 364414 233657 -4362 15155 144105 -351 40257 -134308 -160419 -115600
22171 -115600 -199948 254154 -161777 -363111 159201 -189867 -345 -237504 -481458 -259006
22161 -259006 -221054 -190368 72603 134392 -119559 -143678 -70531 -314800 -184348 61622 -104248
22149 205894 -183241 275135 -66724 -59592 81047 253377 -341509 262516 -49426 282006
22138 -23487 -321692 133567 396135 -5801 -97278 254476 -85540 -93431 -294414 -171790 69590
22126 223608 73437 -103653 -186930 -118104 -306075 -154005 -183262 36817 81269 -229451 10889
22114 20426 113609 -86912 -53037 13315 370246 -14178 -307585 121716 20017 -11314 45831
22102 155674 33453 -326180 72420 -37857 57987 116063 -125453 -101081 120227 231917 163577
22091 163577 66966 -1453 -42603 97737 177641 14495 -119800 187071 11740 -156832 -91696
22080 -91696 -141427 -109273 169688 -109766 -254784 -245782 263595 -100158 -144552 180306 11122
22068 26643 -8142 -220560 -349291 -194942 226459 -493366 -140003 -128130 126422 -120308
22057 -23106 80668 178427 -8288 -94110 -69836 184759 -174242 -123705 -14225 -89277 -25703
22045 27827 -139542 -18453 -26738 -421018 203188 -60594 -438871 -128503 -1620 105665 26359
22033 61137 -107658 80848 -151490 103959 168594 104471 15531 -112891 -325980 -32829 -8026
22021 -205501 148029 -271670 46043 14550 138738 45152 65084 181049 -262675 -200752
22011 -200752 85865 53802 18337 -33413 -63443 -237917 191557 -113821 -11267 86837 53698
22000 53698 138025 -41331 53619 -747 -25891 5049 -146947 233659 207588 -298866 -30176 59023
21987 -20210 75039 -61078 -254992 214661 -110453 7010 -488827 73220 -147777 -168917 -128458
21976 -128458 91990 -332682 -60022 226376 187522 58143 12551 -14191 379381 -145978 160892
21964 152188 100580 96387 87685 -318419 -167076 -360009 316692 44832 46834 -75712 70770
21952 -157928 -63247 -15095 -133694 -86863 105981 234413 44082 -89386 -30781 92818 -335304
21940 157259 -174907 -112559 -30983 -233177 -42881 -122489 71270 -203172 30296 96584 17716
21928 167775 223535 -58384 47884 46979 -16412 126748 -65184 53822 -195521 -107211 -36567
21916 -269852 173834 -174148 -61988 -20090 95870 -70025 28667 -49861 231096 70790 -122950
21904 -341380 105507 -92369 -329877 76187 61142 61682 -90376 107030 -44495 15962 -17827
21892 -278600 60352 118817 -154028 -235924 93818 66741 191275 -80391 -405473 -100043 -145458
21881 -145458 35400 7394 304542 173418 -190720 2164 76497 164006 425518 134780 -119066
21869 376682 -190639 43038 -182774 -71432 156058 -136295 27454 -171715 -52213 -266871
21859 -266871 -49172 61068 -98662 -139409 -23147 -266729 -270432 -92287 -232631 -301326 97078
21847 82390 -295867 169443 -176847 -203274 -28795 -64386 -77896 1713 347594 -211752 -171994
21836 -171994 -23786 52840 -5201 76829 417747 127186 283834 -112423 -266625 -223357 -39100
21824 -218212 -213558 -70158 -34344 -220669 148158 -8756 -56345 -64189 136519 60783 -358167
21812 10898 57928 -273055 133810 -17949 -136678 -161220 62609 225946 -96056 -194113 382643
21800 -264549 -79728 108117 -171052 -37672 -377702 -108092 54312 -74198 110151 -264262
21789 305513 272122 67995 52173 35705 73724 231731 110509 -68508 -139226 101659 -9870
21777 -260116 -393079 -220841 412085 -50423 -460808 -157517 330854 -90499 -380225 -92343
21766 -64275 -246235 -99200 36909 -76291 -293737 -73400 -50428 -186632 -67212 -181421 27833
21754 232051 -264939 -39088 -65603 243703 -239042 78775 -144716 -55434 -211858 -172592
21744 -172592 -282474 85218 83030 -155340 -54114 -149105 -204122 -302462 -70283 442053 -174252
21732 139708 -66254 -127050 256021 6615 -298874 101565 -75804 -278259 -185441 250213 26154
21720 -125283 24860 -212134 -152800 48300 -103957 29716 152823 372624 -83150 -37854 -11565
21708 -100021 239936 124795 150294 346021 -300407 -43613 169316 -186086 -29901 -357648
21698 -357648 86331 -274779 -16642 -129175 3594 -16366 196885 255291 -99267 18985 -11143
21686 6309 -47650 -126339 -52434 -347151 230707 -17135 165486 193443 128768 271158 -163172
21674 -300893 83592 -249558 -393475 142177 215048 -82356 84104 -24739 -255132 -123681
21663 54073 118951 131846 -209370 -14396 19957 -150080 -94245 -44080 -245560 70042 -195436
21651 -87002 207603 293907 280837 65456 28401 23205 88203 293468 -59778 113437 50152
21639 71217 -21811 24156 71520 -548291 164929 19031 -200121 -64648 -96087 -414909 55200
21627 246140 -245830 -333734 -366308 -88611 126306 193073 73730 -337650 -9526 -119755 163800
21615 28252 -145451 -81474 14009 -12933 -223955 27485 -403666 -37137 -93384 -113393 2739
21603 43089 16211 -11131 458559 18707 198050 168694 -113317 -33775 65739 -139930 -99145
21592 -99145 -15516 -146523 -218799 -111650 -53362 -328215 -409290 -186455 27657 92428 -198931
21580 -78872 -163129 243112 20662 299626 -278817 118938 -82142 -259825 107374 107711 135280
21569 135280 47276 -54509 -21786 202858 -314951 155781 -212241 140697 -133018 96714
21558 -33674 -181947 31683 -247374 279021 -207411 -119867 -28217 -242319 -14414 -246228
21548 -246228 43253 11790 99122 -107597 267536 304799 173316 19401 50699 -242100 80796
21536 -62389 21540 -77963 -82206 -124956 -80199 -153161 346141 -33457 -126382 -151938 -64636 80590
21523 -274905 -19726 -399327 50460 -271359 49637 -207802 3440 101838 91663 -370449 -172816
21511 78458 -39990 137075 -125805 -449400 -80073 156472 132202 74496 166658 151524 28414
21499 -267509 74690 10972 110887 -269269 -337256 -167929 221598 60615 -253876 -60879 37098
21487 -32318 -49349 -61891 -94243 110069 -165989 92790 -90194 61532 -35442 -141093 -62801
21475 -45193 -148962 95693 -135961 -283449 345711 -25778 -87814 -206977 155403 242574
21465 242574 8442 185797 -5828 -35440 -106650 -174534 48716 29392 181147 -244232 -68483
21453 -10262 142123 179832 -205756 -198263 95880 -98984 -140090 -265794 -325783 -125772 101902
21441 -313779 54569 -117498 -131540 -30245 305159 302543 421802 183471 262767 210855 -131074
21429 137204 106768 -177161 201576 187043 -145744 -100480 -134787 9692 -202665 1818 104126
21418 104126 215656 -141892 -30942 53229 251504 62786 -85909 -444198 -46843 64993 -177209
21406 -73258 -158021 31460 170601 -116937 -96675 222297 83892 205533 -65399 -113690 278799
21394 -277222 -107943 175700 -220451 -157854 85484 -311931 12282 -336719 -982 381673 72436
21382 -297594 -76039 76953 -150465 -328349 -110205 -191719 -199573 176309 -242945 -251923 106358
21370 99388 -54197 -92191 -161044 296680 -241225 -108746 -32203 -10967 190743 -235300 -322820
21359 -322820 -140405 -364638 -146251 -168968 -129402 -196797 -8825 225143 -161781 54162 -226330
21347 -156911 -15084 5258 -99895 -252035 105180 -323228 128075 48439 -337722 -52591 -56994
21336 -56994 -239798 -247073 16326 -128923 79886 82973 -118125 -76076 82494 -144049 -152624
21325 -152624 157045 49117 -31518 188383 -308282 68964 -65714 336858 82787 31165 -194360
21313 96472 317526 -47696 -261678 -109113 -90921 -221608 -90199 275 -85021 -332760 -56220
21301 85016 -37346 -307095 46501 -161917 -528395 -327378 -30408 -412157 -154379 171079
21290 -373601 57827 -259360 -164903 -69576 -46926 222729 -245461 -235046 -181699 219486 7570
21278 -63794 -105345 135182 136004 -6557 166598 129179 -124141 129888 218908 202628 142170
21267 142170 -215648 54034 -199395 -149499 -20877 36059 129194 -6106 186950 -104158 84570
21255 236550 25767 247344 -149858 -158558 -100563 -100724 121467 -129909 -375740 -60373 162430
21243 106277 63097 93017 -101660 188911 -41022 -504968 160915 -227437 65920 -66244
21232 49658 160469 -34628 -55932 -176037 -80704 -152616 13504 295623 -80641 58508 -106791
21220 -352285 -102473 383623 261050 99147 -124367 69173 107366 -210510 12984 -35221
21209 -245090 20881 -159473 -24336 -385719 -168661 -301098 82193 23457 -87814 35298 4204
21197 174360 -333512 -221040 -112113 225134 44422 -316788 -266359 28277 18682 109038 13584
21185 -181809 -126612 -102614 110967 -46214 -6506 -66880 158409 212211 9319 166107 -233992
21173 127703 -68936 -120771 11695 1091 112929 -165980 258109 -23788 -224695 -235304 4706
21161 11729 268573 -162161 -164160 -303929 -330823 136602 -101037 -238461 -321128 -307255 -40925
21149 -213933 -144131 130647 123278 -290534 -44527 -163545 85476 -433845 185500 -304953
21138 -59685 -144876 74273 -88037 91851 -60180 44600 -222334 -124004 144561 -206573 881
21126 -33173 -231535 51173 59966 196383 -192395 -13794 -153741 -157841 236626 36485 -72224
21114 -70531 75626 37379 -119977 -185307 -17531 591 -97601 -45560 -48053 -694 -18273 42661
21101 40249 -251772 -447819 -119971 -38349 -43611 -73308 -308452 6657 8895 -161013 187351
21089 245881 7608 -246329 282853 -61577 -157378 142012 -28602 159961 -388544 411772
21078 -303094 113683 -179426 -62390 -180973 79417 31502 211370 -29806 95783 -218790
21067 -156926 -46733 -25127 86901 -200899 98536 -32290 -106055 50091 59802 -190069 -320591
21056 -320591 -60450 -173477 -192443 -117419 -136920 -176363 284164 -37014 -329989 220284 -273946
21044 8181 100054 -77559 -194055 -145948 -36049 -107141 168090 157170 -188047 -89559 -170734
21033 -170734 203431 138231 -100062 -178673 -453125 136002 70214 -110129 138464 -76730
21022 -156755 147845 34304 -40480 53157 24093 91966 343516 50622 219896 -173170 -62912
21010 -99780 36540 -34718 23207 -177000 -224897 -245362 -330487 -171200 163978 521580 141769
20998 -87241 35821 70060 -234361 -178915 105851 -62062 236445 -103163 -164401 34481 -110550
20986 -69998 -62258 155971 -68308 -193659 -92251 -44135 131500 -267714 326176 -127708 -141838
20975 -141838 -103671 -95195 129446 -159236 386578 -40762 -137712 -8970 -112432 -296283 190537
20963 6760 -23864 -66032 189054 191225 83619 -24916 -183756 148419 -43989 -160568 -206253
20952 -206253 190619 -94730 -255359 -164705 -20585 -199584 -79294 23067 -76503 290 10115
20941 10115 -247199 217520 54040 -20905 103327 18939 -147585 -92056 312997 -98096 -244218
20930 -244218 -38525 49029 -42400 3527 349218 -65320 159502 -61133 -64835 -16032 -91690
20919 -91690 -95913 104462 -64859 -265049 112991 -297723 -284965 -6583 -284900 -186054 93678
20907 -119620 -246822 -207734 -167273 100510 119915 -106617 -37327 -168470 -165082 -59700 -151197
20896 -151197 104384 -238654 43098 154460 91859 -291483 -374662 106768 -246961 -181736
20886 -181736 19080 -93859 -1724 -16679 -277362 -311617 -154603 -370023 -86077 -122096 -37392
20874 73436 -46549 215123 -108009 49753 32134 41716 -132219 -57497 57783 -139116 13126
20862 54931 118073 -223267 -36406 -216071 95940 124726 50463 233875 145868 -165231 130099
20850 -107268 -312829 -5397 -120932 -103757 -172712 -324734 -108220 -117030 139940 46433 30802
20839 30802 -244311 134454 -59863 -255545 -121060 -89184 -45154 -59960 -42126 -205900 29238
20827 282624 -121211 -110394 20243 -135531 -215729 -261585 326933 247369 315114 -120466 -37023
20815 -115681 -189795 12439 -372669 -110646 -25323 -88315 14217 82731 -176996 -139203 -150613
20804 -150613 37912 -50143 -82484 -971 32049 29291 156184 -347093 -368635 98525 -106423
20792 -134277 17448 -23533 -194705 119709 129360 -21830 -226488 -214622 -413713 -69856 31543
20780 -22497 -8774 -30927 -211832 -205587 -16789 75969 264134 -216875 -321023 50612 -205775
20768 -145173 313409 88132 53261 -90418 183909 -190255 177650 -138889 -146008 223473
20757 133218 -332528 -6650 -202155 121403 -370721 -194829 -107895 -238004 -22100 328117
20746 -302336 -310536 -67886 139734 -143802 -18554 -123354 150486 -255096 69287 -68615 -153831
20735 -153831 -365939 821 142430 -42884 238447 -296014 -32121 -324926 -218307 -61762 -54866
20724 -54866 346168 -166194 2160 62651 -8023 -183807 -80558 -158504 -53372 -145185 19150
20712 -202607 235191 -315943 -102180 -47351 -84074 18390 51894 353567 -6071 69055 -94586
20700 -48936 136198 -266986 -348057 312429 -229604 117751 -182287 -376760 112814 210127
20690 210127 142857 -210328 71785 -216424 211419 15778 -60007 -26374 -7005 -253280 100867
20678 -100716 -28190 111514 -214494 -263565 66698 -69 -200404 -40778 460806 -213625 -230003
20667 -230003 249605 -56621 34209 -28548 79039 73731 18123 331175 -13522 38601 152860
20656 152860 -205271 -221049 -179049 -158165 -101394 -166127 -143652 111760 247191 -5644 -2538
20644 -6261 -234979 -215893 -129835 -298521 -123420 330980 -46296 -87549 146046 -158072 130998
20632 193368 25728 -193691 51940 -17054 -83768 -7715 131557 170804 -172199 150712 -83676
20620 -239954 -172713 -205536 4794 -22831 -274292 -89644 -173311 63002 47922 -74970 86365
20608 4954 -159389 -72959 -56670 22069 -32992 -68850 68330 -399756 -206357 -30015 -186401
20597 -186401 161091 -77057 -234493 -196063 50087 81648 32595 37062 258072 76713 -39100
20585 156578 4336 -27327 458248 187591 -44868 149463 -116626 102233 -152548 -154449 220882
20573 77541 120486 7836 -75159 -229634 -116996 -94804 123928 -365313 -102969 62686 16208
20561 32055 60959 147928 -58559 -46112 -244678 -139820 -152832 310792 -260292 96587 179071
20550 179071 -11264 -205093 -217749 127288 -219357 89798 238722 68899 146815 -234197
20539 -39382 -285742 -203150 204136 -325595 46604 -114134 -299471 -325476 -507440 -7316 -106645
20528 -106645 -88820 26868 94734 -178505 51848 -10544 49877 32184 -374843 186225 318964
20517 318964 69944 140320 -34944 86632 121595 -226550 107216 -96976 171878 185901 128989
20506 128989 -88050 100251 156855 328513 237844 -105797 61363 -283653 -124870 -218481
20496 -218481 -428419 70034 267640 -179981 -458802 -76033 -126359 127910 -138360 -66822
20485 -376550 2434 62271 354859 5890 85071 -269405 -327529 -289855 -159491 16316 -158355
20473 -266717 -154645 -79815 21114 217453 -192583 -104791 73857 -165556 -281756 265562
20462 -338204 -114444 8016 105246 34396 -80615 -121808 -190881 -261119 293852 10493 80298
20451 80298 73185 -59685 138242 -232876 -93574 163226 53016 131883 -205989 -99956 -7697
20439 147327 3091 338024 71054 -219011 -90114 198442 -225047 -213583 -96467 -71400 -157627
20428 -157627 166808 -121175 -22097 145348 -269863 -201318 -203423 70274 -210771 -343520
20418 -343520 143969 80967 67744 48927 34264 142429 -204781 161250 97824 -160511
20407 78900 -66526 -44429 25257 -13032 27654 -44811 -559712 -179299 -32496 142661 -54595
20395 64467 13220 -183597 -182193 -118554 -182133 -71527 87634 -132078 76446 -3099 -472 100817
20382 222711 266077 -3984 210594 61330 -262472 -226710 109232 28190 17756 4222 -117101
20370 1834 -248642 -373987 91893 -52907 139650 -73133 131660 -225267 168391 -204860
20359 77033 -90673 -146798 -297740 28243 -201538 -168310 104152 -237456 -111324 -307198
20349 -307198 68752 6660 -85384 -159056 163744 141519 -38852 -79838 23541 -397308 -192868
20337 -215588 -56502 104253 -329727 -113083 16488 -186726 951 -8163 225638 -399 -830 -183860
20325 -183860 -123466 19393 -444653 -287780 -305640 177206 -91356 -136785 70163 177100 115014
20314 115014 245936 -114680 -194330 39811 274814 98827 -346896 6976 265579 -103293
20303 -9155 -95880 -326164 -293897 50554 98947 84937 -28751 87786 -311986 46199 21475
20291 -328628 -182489 -91124 -85616 116410 111179 63571 149798 -362194 -155293 156502 -20735
20279 -38080 -151612 222501 -182941 -148094 -86751 -318416 -44357 231338 -1711 -180848 -207294
20268 -207294 -67134 -595662 -476841 106886 -328941 -26261 -46256 -238167 -10868 -194626
20258 -194626 -48936 66714 201941 -100492 -99942 36614 -213395 522865 -62824 -11677 63102
20246 -168548 -238570 76323 246378 254620 1065 -13289 -77024 7379 -286735 -75051 -311576
20235 -311576 -116082 -314809 21364 -80323 43328 214876 43908 -97638 -36479 179163 -17277
20223 152476 10759 7564 239246 254614 -36170 -160622 -37006 -50118 -49653 -222525 -197318
20212 -197318 -118228 -229004 -128322 111527 -433335 71297 142241 45949 -195015 -28431
20201 118999 -32687 -154876 81957 -326506 -159151 -242249 -142521 -262167 -202907 -283640 -207658
20190 -207658 -14944 159521 -169832 18290 38643 129788 -58897 -237062 56883 286860 -191996
20178 -116474 -170834 459317 167727 143688 -6503 107557 224984 79080 -31553 -19871 241021
20166 13848 157089 14868 -153303 -447910 -20456 -103820 -111628 -235853 319092 -237782 -312149
20155 -312149 216717 -9080 -123268 -5890 -87959 41938 -369690 -43659 -144750 -99698 145690
20143 139601 126337 34909 -125912 -152619 123672 -41663 -32307 -285676 -244239 -394756 -245134
20132 -245134 -52452 58293 -189095 -3146 -94301 336645 -76853 -281018 -212865 67517 -257061
20120 -291537 56233 -9172 -346304 -102278 -75007 35547 -61707 -83406 -57390 328475 -67374
20108 36900 -334280 -203165 33082 96079 -176897 -118236 223833 -113478 -243115 30141
20097 63195 -366348 -170192 -180181 162210 24615 102859 -90717 35150 -184537 149312 173210
20086 173210 213204 -170586 -39823 203051 -45102 82306 115330 -170149 -326065 -314496 -22623
20074 37770 128681 -95071 -384128 -151777 -229072 -185896 -240610 105440 -38818 223050 -86732
20062 213649 -416408 -232425 164718 6621 48305 54817 172578 134367 -356139 65057 193527
20051 193527 -277628 51801 -193299 342001 134643 -95529 44647 235975 73203 -55996
20040 -155517 -232881 -438951 -198205 -124536 -226776 56635 -192602 -213202 -54511 -217816
20030 -217816 -91201 -62091 -13223 -233084 -63925 10948 29461 130703 34169 34420 -138780
20018 -408132 77958 -98901 97412 55104 45847 41089 -20772 42011 -117616 -216207 -147913 -104123
20006 -104123 -246653 -151286 113261 369514 -96700 -268270 -43483 -53495 -429950 56647
19995 -422082 465771 -263242 -284271 -118244 243136 118985 -12749 -31983 152648 69405
19984 -135766 -198096 8467 -55172 100542 71950 7088 -281655 -307151 92783 -238214 -26620
19972 -28807 -13293 99035 -127198 94422 104300 -71108 41899 -153076 87458 -241515 -278598
19961 -278598 -76854 -208863 103023 238822 -16297 83025 -35442 -29314 -209240 -413961 14720
19949 241743 -394600 -70554 -332604 403861 -243030 -17006 -34127 -33028 -148770 -126156 274902
19937 390227 -408192 290065 -151948 61520 -113537 -173270 -67620 186134 -85331 -66659
19927 -66659 91138 -212721 230247 -204119 -213069 -33063 34607 15119 80675 -272712 -204924
19916 -204924 1568 426644 -157315 15814 238224 -96804 129203 -81119 -591635 -164250
19905 -39255 456642 146861 57091 158808 -162032 -227309 -200679 93840 87106 -94777 116680
19893 -119473 -333759 -238336 -152894 -83036 62092 497721 276514 124292 -3930 -21777 238834
19881 -105267 -234673 -335756 -165695 80558 -31021 11305 304831 -170943 -375884 222346
19870 153807 -77228 89019 -140598 -297938 -151853 207925 45495 -175685 -324779 159482
19859 -146546 17886 42720 -248474 -94057 135345 -218976 -161425 -200679 215988 -899 -196146
19848 -196146 114878 289530 43551 -280556 298076 147960 75694 -215840 253099 -154524
19837 -23178 200138 211308 109510 176532 -186339 -279994 -85427 -263051 235428 -327502
19826 -77933 27663 -260431 -206596 -93193 53691 -172473 -120622 123087 150442 9720 100352
19815 100352 149474 24570 -345626 -45288 9318 -248254 22022 -169667 -140780 246064 -14532
19803 -9901 -354524 -123507 -328487 119902 -68619 194450 -89303 168883 81557 -125953
19792 42011 68062 366297 -191715 57785 -178232 174071 101092 -121640 -22802 279573
19781 -63877 -81640 -244854 420122 -242628 166792 194183 -85129 -250049 -98464 751 20030
19770 20030 -100921 -212375 -205066 -24644 -63377 254311 -25352 -65243 -87908 43396 -133871
19758 -3589 -74640 -245789 -203144 17408 20837 -206890 -143190 93690 42432 70960 25928 5188
19745 -195420 221372 -200550 169451 -356432 25535 -117057 72166 -15874 55351 13462
19734 -372266 65552 239047 -113442 379070 -132527 66469 -78800 -449957 -106800 -7586
19723 96246 -274874 29213 214011 -30303 2263 -262463 -100877 117973 -38525 16849 -145383
19711 -125714 -437025 194922 -1457 -308274 16016 -150510 -256218 48655 -25531 -141667
19701 -141667 -114425 102193 -82594 -103823 273514 -53929 75285 -124616 1911 -48194 -344158
19690 -344158 -60784 -228016 -24014 -187767 13756 -35180 -286300 -87749 193322 -191596
19679 -258806 -384141 -273598 -269674 113749 19575 275839 -33154 -257681 59859 164437
19669 164437 -38280 -144829 136692 -43061 -55482 -223553 20621 44572 -41369 -167769 19700
19657 -438520 -216121 100223 15742 -200001 268547 -229074 -22224 -187139 -285234 39480
19646 33082 254407 -4701 -23387 -36148 90206 -213811 -161484 2893 -3143 200734 2646 -16139
19633 203763 -420870 -7579 -180335 -7000 71249 161403 36565 -74252 -179126 206231 -66994
19621 7725 63258 -163588 -30649 60703 -269096 -205585 -96405 -39083 235314 169328 -66460
19609 83016 -132313 -90195 119716 -96036 -179519 50440 -130374 179927 150439 -430595 34987
19597 -99933 -73001 -61452 -163747 -161502 15308 32034 -165254 -178714 -43634 9105 179263
19586 179263 -72997 38302 20436 -224094 -16725 -170862 -153739 6459 127687 -291384 -19411
19574 -6510 -85853 46798 -52260 30006 -15485 -40116 149075 -235356 101589 103561 36180
19562 48079 107934 -126330 266394 -403223 -58891 43229 -230570 -47474 294546 66151 86465
19551 86465 27972 -77625 -39196 16263 39078 -36238 -100072 -119142 273965 -292889 292005
19539 97457 -21530 -226722 371192 -60688 -4457 151977 32167 -160105 -148456 -303645 -7877
19527 -116157 -16157 42213 86923 -30828 -101172 62079 -202024 161157 64922 -155233 236165
19515 -78617 -227449 -214073 -286543 -61662 -125209 -193685 -486431 7826 -195735 -2287 -210500
19504 -210500 -190599 -170825 -303209 253467 126114 117077 231335 5653 -76290 -226551 -137830
19493 -137830 -331974 -229475 -317228 29951 -317540 206429 75822 -280054 -2936 11594 202296
19482 202296 43357 240484 -242345 -202779 -260070 -3210 82380 -148779 -86953 93514 119290
19471 119290 -305024 1296 74557 143775 -75711 11767 35005 -51691 -87890 -185377 216635
19459 16150 -212929 132317 97012 -14215 -195661 -45830 108343 -320983 -170989 -297078
19449 -297078 -113054 -56391 -351889 233189 -95636 40035 -24619 161078 314745 -166472
19438 -16923 34912 152573 10826 -370728 -187095 -255678 177137 -69357 223904 -427682
19427 191547 22173 -194053 106500 -176552 -13045 67671 -33840 9390 -269125 -43383 -102818
19416 -102818 32395 -188366 71160 -16051 139728 -194737 -53111 116181 -84900 255211
19405 153727 275559 -116618 209732 159835 -294810 -246437 -96625 -205660 -97968 -19707
19394 70080 -49807 -97383 -13553 23337 -279158 -341750 -208082 204213 731 33984 -28660
19382 6255 95077 -284277 -71006 -3368 4860 -336432 -126407 -106279 -186804 -53249 -125937 155942
19369 -121008 -48126 -238295 -4410 -163343 441867 47628 -82840 -123514 -68569 2156 -146983
19357 137403 -11477 133366 -111454 -176935 -142143 -152175 -154469 -258889 -139348 -23534 -116319
19346 -116319 278086 -186281 180008 29573 25968 6004 -220347 7538 -10181 -9254 -64911 -93977
19334 -93977 -150646 -266993 -230045 -51816 -100304 -233423 28489 -16835 -131728 17936 -140126
19322 25426 59641 -392747 113990 -113533 -284607 -45535 37802 -76725 -53994 -195331 -19799
19310 57676 -269419 77785 -316973 -104092 -223574 -351711 -542 94164 244184 43398 -62363
19298 -4987 -196038 -122632 -175076 99635 -110026 -381330 -228122 -3953 -62082 89965 -205961
19286 281324 78748 48401 -174322 -99420 -204211 -68193 -83709 -234923 133420 -146702
19275 17853 66919 -51800 -20962 -126184 -93347 108682 -3733 54865 44751 -91430 -39487
19263 -61652 166884 -245390 -195764 152214 226193 -34959 -345777 -77178 -35290 352963 -2358
19251 35324 -177866 -185095 -126061 35266 -116260 78799 106891 -155673 -61652 -53438 -10578
19239 54493 62538 -211206 -276530 -126595 -259840 -168376 -137677 -153183 -167799 -52276 -80782
19228 -80782 -34113 -32802 112825 105934 -153597 33675 124133 -143711 -112062 -56304 79022
19216 -84730 -137420 256052 -240630 40135 -354983 -338185 89535 56396 -248101 48658 193985
19205 193985 122503 -354851 124201 92093 165545 -127080 -98864 -116761 81559 62954 -95418
19193 -114582 116944 -252265 71115 -96912 -223253 -13134 136570 -108395 100039 210548
19183 210548 275498 -43647 -102008 215770 186661 -127413 -59114 -142570 -129856 60618 -165940
19171 -194159 -14500 48169 45467 -19289 -149366 149219 -219193 -60068 -14597 -83641 -89764
19160 -89764 -18529 -238841 184047 18759 75562 -110890 -139676 7008 116587 164698 102091
19149 102091 181885 265004 -426102 -269687 104653 -109521 192025 -706 -9054 84840 114566
19138 114566 -31733 -163873 29023 -133574 -161842 -277849 55160 -112137 -472769 19214
19127 170775 61659 60235 167751 -15194 -6150 -222942 -219427 -272143 -378183 147570 -59495
19115 -21166 187906 -56530 104605 -92217 -8861 169669 223284 9800 254006 -97085 -147762
19104 -147762 -135576 -12217 16258 59631 -24987 -151399 149220 -243332 -70262 23905 -62091
19092 29970 -54830 -501836 90292 -310956 98422 9298 -73619 -87164 -80802 58814 -144970
19080 229303 -184532 -102023 -45705 184291 -115537 -165314 47026 51074 104831 -37320 -72413
19069 -72413 -383634 -54133 -337431 -120571 -124357 -258191 -188820 -44079 -200845 -61560 116920
19057 38762 37734 21980 36291 -23164 -567 182283 213474 -102830 -5845 13300 -185558 -299434
19045 -299434 149464 -66892 -14326 177410 -113233 -225447 73697 -41831 105835 -196359
19034 172756 -18298 118299 -257001 136803 -129649 93332 285701 70096 167122 -196585
19023 -155269 61245 -75468 -314999 -21695 239027 42622 479445 -156261 -7575 -203056 -118096
19012 -118096 -378106 -209204 -131850 108785 -43201 -196421 129173 -244425 -104779 92578
19001 40487 -199353 86047 -228672 139441 66790 -90170 191186 -119656 101446 -209134
18990 -85743 -128318 -209955 -287199 -64033 -124785 291989 -231046 74998 -72036 13452 22078
18979 22078 -18286 -336785 -84482 -96638 -18359 35647 -181078 -29630 -133737 -248089 -145649
18968 -145649 -343104 92255 -73023 -282665 -237802 -100163 127141 118057 -41986 185251 -62980
18956 -82929 85627 -83726 -59831 109408 -79013 -543342 11787 151873 -133113 -94439 -40276
18944 -188432 32086 -54829 -233781 73354 135795 197111 38890 55142 -211821 127827 90285
18933 90285 65775 -96278 -113226 150627 -100298 80833 89512 -166938 -45291 -227525 219054
18921 59558 -119961 -407752 69762 -54689 -331088 82918 64268 25590 -115892 -334028 -248630
18910 -248630 3779 -130891 -67296 -34324 -19829 -184125 31441 15889 -88066 -355806 66451
18898 192995 -218931 223946 25999 84893 27526 15327 184697 331912 -83144 -89140 41729
18886 -75604 -197784 245647 39868 -115208 -56394 26446 -139635 29141 -97008 -176659 -41325
18874 -243254 73166 -58163 -116131 -311552 209084 95949 167008 36773 -4780 -199301 -346788
18863 -346788 -299073 -209037 -246714 -98764 173863 79914 -159807 143030 -78864 -41486 -202650
18852 -202650 -26653 83213 -93928 173083 -60149 148020 -513368 129145 162600 64341 -151780
18840 71934 44559 -10377 -117879 -102056 -78808 -91324 -92322 -32632 -36412 -343009 27492 -10752
18827 -91557 -137025 -35016 89793 -184385 197888 -20542 17482 38350 140505 -146159 38303
18815 150749 -147080 -102258 -124839 162285 177875 217404 331107 279070 -64222 404256 -165559
18803 -302432 -106506 -8843 -97770 -177894 151831 -161689 -108799 57242 79255 -272512 -129043
18791 164340 17244 -21847 -170637 -64356 -86668 -95999 39656 18777 116365 291892 -101820
18779 103676 290931 -116891 225908 -7289 -57607 -189513 -247795 15473 -237285 -13715 -163315
18768 -163315 67454 78108 -282007 -349631 166593 276966 158116 -191870 -165561 -139471
18758 -139471 44948 -113851 -111223 26559 -165579 51046 -274963 159241 -255614 -414850
18748 -414850 -32807 -81282 -300624 -69178 222037 -225146 -55239 285396 199620 -196287
18737 -114836 84720 -150925 -146650 190648 -238455 144424 177659 212837 -247333 -11778 -154231
18726 -154231 101061 135130 -346137 -260748 -109902 -89165 -132980 76007 -49065 -159758 154930
18714 -78725 75413 206733 -352318 -107136 -28585 149484 -200412 -10351 -207883 -145169
18704 -145169 -171691 -83566 -39981 -18921 83075 -90645 -171021 49439 80345 -132785 -183086
18693 -183086 202182 -113442 115721 -9787 265918 -286976 75414 212500 -215061 143899
18682 -226250 97190 -239498 -7620 31388 125008 -63337 -173463 85599 -29721 205689 -62021
18670 -136917 -7534 61675 103962 65879 -115233 -193620 159627 -208986 41442 -132257 37693
18658 -96531 -402615 -207113 35082 133915 -28135 -239035 -11522 -35961 -172265 -485064 -106151
18646 -106290 78297 79957 -53240 -312689 -124206 -83897 -142605 88945 50338 135376 23131
18634 85761 -199965 76639 143158 -14102 158225 -61253 -148959 -78085 -9906 -67569 114905
18622 -51803 20869 -41991 201176 -253214 -181919 99537 14368 -132199 -30349 62748 73925
18611 73925 97773 232243 -158055 -15134 28729 53126 50221 -83346 -115202 85981 152609
18600 152609 -42501 -171043 -191886 87198 48381 -43813 -347955 229343 179360 -199483 108983
18588 51971 -194530 -83676 196279 -1260 110161 152359 -63152 -150451 -68273 -335559 203250
18576 -91177 52236 171156 18046 -107257 -132585 -275270 -118787 134418 -18231 252059
18565 67322 -77562 140558 4886 -30081 -42462 243798 61395 -264694 118446 -164418 -127883
18554 -127883 20196 -125328 -216622 110606 -126543 -279852 -117326 -420893 -70804 -132936
18544 -132936 -333554 -112616 -249003 -96257 168189 -38740 -55850 99538 -269633 -113007
18533 114329 -217297 -64923 -91967 31540 -275881 -165166 52452 170157 197145 -117361
18522 57428 11945 155589 447 34681 93249 80632 -350898 -184250 -91602 -131173 -229376
18511 -229376 20352 -6450 166223 -55216 -317796 -162503 -10353 41180 -3971 -1275 -89083
18500 -89083 181217 8063 -107146 -218771 176513 580150 -298253 87580 -157424 157989
18489 -103649 -283064 6822 -184394 -51992 144 -76287 219287 102921 164413 -293055 133863
18477 77666 -7056 5022 176218 -32262 -19928 14908 214481 -188868 63655 86159 159771
18466 159771 -155315 -42052 -268564 -87817 25327 168224 267214 -162176 300813 -48825
18455 -6088 -69303 -81460 129886 -255083 140011 -151866 88706 -211109 -131847 -94496 -15274
18443 -12857 152766 -249162 65304 -63710 129969 72015 -128501 -61848 56230 63795 27366
18431 -151511 -67427 -128281 254541 239442 -116606 -30151 -230283 -109281 -252501 66507
18420 -43451 49608 -122900 -80493 19793 -288665 -30492 159022 -36767 -162116 41140 -302306
18408 89927 23877 -9468 -205494 -4870 178297 -91047 81751 185583 140108 -200091 230001
18396 81712 62308 254865 -73180 -445455 15684 234648 -154879 42968 -86857 35047 -132001
18384 -333507 -143312 115938 -238249 -96684 80023 -4880 -167667 -161759 -75435 -208386 -191287
18373 -191287 -93341 -130715 199512 -497449 -27695 57739 -3811 24895 155257 -205497 216601
18361 266560 -6904 -78336 -26017 300202 -191610 -217544 -159187 -332425 32925 16296 -175940
18349 191056 -204103 -82662 -60663 -143857 -220147 -15662 303770 45419 -151864 177863 75082
18337 144077 -79057 -10827 -283532 -53819 -480364 -293161 -153437 131904 10326 -50993
18326 19113 138431 -57191 -189593 -85285 -207069 -358328 -100262 -93517 145203 136107 -357715
18314 -96919 69531 -137239 -58832 176737 -216261 -185552 -146740 75407 75927 -118084 43468
18302 -185830 -246361 84958 -80461 287201 -75672 122218 -233322 297709 -366253 -161549
18291 -3734 63058 56649 -14415 -108533 -289219 -86390 -317835 -160031 -264134 32221 -137674
18279 23160 -91488 -13935 -172944 293382 -145260 -36117 293538 81974 -119446 229150
18268 -85862 -30284 167379 -132045 -100843 221541 120742 -20738 167814 -81087 49705 6432
18256 250944 2501 328812 2787 -321093 -123816 -220808 -97851 270465 -25896 -329528 -25027
18244 -124587 -73388 -316 67293 340293 -262544 217251 44088 -52647 -73524 14422 -158178
18232 -92323 -430109 339763 2759 -285320 -122037 -219685 -240935 -384054 -39584 -255387 -222637
18221 -222637 127424 167850 190289 -355086 -245126 12542 44009 164225 -448883 183058
18210 -151701 22985 10073 39589 169880 -43719 -120397 135760 -213692 20392 203253 -22186
18198 -89367 187155 423523 -34180 -102867 -120198 -205105 146599 -80514 -171857 82013 -133162
18186 -261340 -154443 32170 -105047 110433 -121692 -176240 260724 96893 12962 -16859
18175 92413 -233026 -316594 -318785 59507 161433 -105964 -223976 129053 123123 -70790 -382148
18164 -382148 -345691 161425 202721 -193441 138661 104902 -122031 -120203 -81180 -169358 123871
18152 -72931 310263 146381 65541 395864 2634 4217 -308109 136176 151230 42043 33976
18141 33976 -15933 64333 -68010 -76299 120222 166708 -159764 -66054 48069 205106 -135391
18129 -20716 230427 -217483 -59624 238341 -53054 -195669 -93058 -198200 314803 -53580
18118 -364129 -45535 210953 -17136 127239 -75736 25721 1254 -131018 234063 39583 -184531
18106 284208 36656 -146062 -4399 -90910 -528912 156457 85407 141983 167902 -197402 23645
18094 -64905 -96059 -117166 -137646 -282713 -306128 869 28278 -145517 -23722 40550 303356
18083 303356 140479 -84212 -225965 48390 112948 -76566 119922 -117421 -26657 -113249 -120182
18072 -120182 137308 150974 125537 -3464 106162 26089 14943 202294 92377 -61283 96600
18060 -17807 -71669 -334067 -122138 -253355 -133916 34441 150817 -36050 -54881 -369626
18050 -369626 -106668 -127703 157349 318142 295902 -114219 -94156 -160479 34255 -222370
18039 -464762 81468 -177996 -109231 -108968 81651 -174858 47285 30232 -72529 262440 148351
18028 148351 -266199 68693 -89273 -129073 -162041 -38080 253433 -181571 -151988 16465 -165215
18016 17451 -43580 138133 -43671 231463 13887 115514 291579 100787 5188 284646 5440
18004 5690 -76453 4075 35308 79306 -40274 190544 -247091 10071 -94977 21741 -17486 54704
17991 140932 172162 -130403 -40602 104171 -76333 -72840 268120 89531 -32282 -24098 -115059
17980 -115059 -184556 63180 -143860 40377 99278 7778 695 92349 226869 -22423 184827
17968 157384 193342 -17199 -341584 -161033 -299592 24299 -289398 -18415 97675 -119590
17957 78868 -287803 24393 15291 9957 -170239 146827 10549 -58631 -189997 75776 -185525
17945 223808 -116181 -195846 -107124 178032 193602 -94996 -65386 300928 123684 116797 -123531
17933 -52536 180589 -33635 247174 -140733 -71074 85094 -21686 -111726 55141 55287 61012 -17856
17920 -33958 204909 -122821 -81116 -169204 -335120 17075 158709 138044 -190552 192397
17909 -411339 179002 188416 -286961 -297822 35225 -78578 -173261 -379808 -124316 343878 -280559
17897 -146060 277021 152559 -43127 10176 107088 -65200 51138 260008 -122850 -457210
17887 -457210 12645 -289062 -244273 -33046 -130982 -139231 23218 167168 171769 -60840 -182275
17876 -182275 -262878 118262 -360669 246670 208337 116533 140453 365147 -7122 328644 191870
17865 191870 -99471 -282570 -93149 181102 30438 -118302 -183542 -126035 255465 136280
17855 136280 -13726 164692 -165015 23202 -42313 423698 -11127 -40364 -408125 -285282
17845 -285282 -257619 -37 -32340 23617 -298065 -95883 54374 -160788 12218 -104720 -23403
17833 114251 150972 -52815 55156 185486 -147579 -218568 -29111 -211764 -103195 -354174
17823 -354174 66028 -135683 69672 -427877 163355 227545 -75636 -205248 207036 -123199
17812 -147196 11645 123216 423693 27623 154086 12619 -73275 -72369 -1562 283108 -273323
17800 -62563 272601 -118384 -10943 -4423 284176 -222582 96541 -300729 342507 -154990
17789 -341598 -240011 -92304 117793 -19535 44883 208353 -373967 -117445 -179493 -152247
17779 -152247 120437 389147 71244 -244637 329674 103264 68271 112580 25595 -56269
17768 150908 45240 50946 29302 -55721 -146126 -102922 -15630 121086 -6116 49924 43859 -233697
17755 -14057 134417 479984 61856 -48294 9024 57441 182063 261639 -181359 -9548 -252922
17744 -252922 201785 -120569 84618 -404978 112631 54891 89395 -37608 -61218 -299935
17734 -299935 188969 98125 -167291 -196895 112075 -174891 -160852 23923 -172252 263041
17723 314335 -55045 -42186 -137408 45856 -166406 -341303 157395 193192 85895 -42324 229576
17711 244213 -51025 139356 151934 56496 -294793 -12680 -311728 54825 32147 -185113 181338
17699 -42123 67264 -159592 238153 213843 -26904 112488 -55602 213706 -254086 -111720
17688 315218 -200169 -122477 -266203 245966 512019 -473754 485166 123139 -141094 8209
17677 244042 76712 304817 -32340 158978 141644 -198225 207974 144198 259672 248057
17667 248057 136068 -191793 256486 23964 -179558 -97339 -47123 131644 -108022 78099
17656 -221030 156069 -66772 126500 -9130 116771 68238 -6919 79255 -66005 185880 -235254
17644 144334 220872 260056 109132 -73465 207959 -157516 126482 -39513 185686 -124457
17633 -33570 -92731 -139507 69565 116485 -29665 40659 95733 -139850 -59498 -117359 4787 -150687
17620 103378 473600 -2513 -54823 -280319 125686 -135485 247090 91128 169467 -89275 92488
17608 -139386 180202 366641 67236 -59970 62161 -214588 -169235 -229844 278979 -43219 -67564
17597 -67564 9679 66212 24942 286097 295763 224799 -68391 -49647 -49122 -110609 -302261 -58940
17584 56628 251182 65462 25175 -62872 131864 219948 261201 106070 199837 153975 -204967
17572 -125581 -276417 110243 -230467 -152619 -259043 55000 -509400 173786 496197 -2559
17561 -162670 -180840 177619 -132096 330693 -76591 38743 8177 -72033 -32705 144654 -113285
17549 342902 91211 -116458 23088 21404 214805 75602 -456659 -22848 273524 -70662 151869
17537 -88582 8803 -33193 173220 -43867 15166 95126 244132 -121386 -42907 -196014 -233225
17526 -233225 202122 118362 -5371 97697 -359899 15466 13908 -174548 239828 -125025 340741
17514 -40309 375908 423353 -308640 -63044 -146566 -58907 142506 224782 84132 115005 -182105
17502 242025 134137 -13621 46145 -149364 -16826 44999 17088 -79758 305335 160179 -127520
17490 -9154 69751 217286 358666 -127996 294348 154022 292440 47838 -6731 48755 244194
17479 244194 135696 284948 305311 28443 244435 -257931 381357 -96148 50855 23905
17468 38868 360057 261329 139570 68851 87951 190642 364810 -28498 227128 -69974 -263495
17457 -263495 333179 232875 101289 175834 -47284 244845 250444 262827 234422 214285 320712
17446 320712 191919 297359 477868 214066 128397 209340 452298 478998 146708 339472
17436 339472 235704 -29829 226654 188427 -195053 134611 -70275 12200 -13708 252037
17425 384957 282851 354233 152879 66494 173030 355210 87545 108497 187909 372979
17415 372979 -58745 278953 3959 268768 324003 47660 28974 149546 84381 206010 -31193
17403 81479 61198 58653 308575 218876 91824 -61050 254901 230306 89465 229017 125301
17392 125301 35487 68131 151439 12224 -35491 102917 68685 -98741 475516 -118780 338084
17380 153002 186296 406414 -115669 -190732 147311 319989 179340 -4830 582327 -35510
17369 156904 110194 276862 640555 284856 409426 40637 233769 -50860 177982 15174
17358 177784 104803 -350281 312383 -24905 127963 88252 78336 251758 18101 121932 374296
17347 374296 249584 -35376 208565 250522 1068 336044 97710 116002 -79154 -17229 190761
17335 -29433 -39054 184633 196661 30741 267889 730150 109407 71894 469712 -310552 -280724
17324 -280724 312587 353976 158250 89011 328727 332687 43944 127340 250824 262175 524793
17313 524793 477463 370221 -38768 39898 159214 -28361 60371 -149479 93906 64210 -162335
17301 -32547 222081 56237 65613 275615 562389 328712 -174589 254113 13674 527011
17291 527011 569592 296928 141774 325505 -113913 220025 278725 421202 205528 39581
17280 78508 377243 31151 -37333 7469 165348 105067 214283 291513 333121 -117068 4469
17268 307376 179618 260982 578955 -126344 111404 49527 235543 -183912 137264 67296
17257 277588 115959 279376 -35189 450301 378367 -246886 174605 20782 443902 -57577
17246 -13915 255689 86384 55588 336687 228799 357613 277880 430434 -65213 325595
17235 9849 101637 310387 326300 93254 270024 419774 1871 -45414 230546 82338 54039
17224 54039 -75014 310622 185090 59510 12721 168389 373153 -28486 -130922 171915
17213 452557 454980 61045 90131 229132 -60913 128067 508901 -30872 349911 257978 152931
17202 152931 215755 -141592 394622 162586 190970 190247 271903 314013 276940 117208 250688
17191 250688 301610 340420 281759 249873 257655 203616 215172 378364 177228 353153 267401
17180 267401 297666 127953 65546 349885 618556 220663 168017 -65895 185124 373284
17170 373284 17354 235078 134726 90254 423194 348830 218492 54852 350565 498031
17160 498031 537476 91621 14292 75495 152835 95032 170385 309804 516143 448053 385645
17149 385645 176510 416742 354602 10488 288719 393808 333062 401354 343523 282635 226365
17138 226365 366842 318471 219876 332948 192572 431083 311660 487394 405721 16444
17127 155892 312681 141845 454870 543797 53158 142471 387372 76807 540864 271259
17117 271259 80634 434702 355304 468222 -150712 450006 426393 227773 348117 343610
17107 343610 119807 435680 542927 290343 552737 506039 373340 348933 373222 619298
17097 619298 81202 262120 316688 133577 34140 510559 177493 326177 439261 619371
17087 619371 760083 570093 114463 431442 112059 197669 91584 356599 471084 541184
17077 541184 424251 323582 86254 542642 390878 582546 534532 479182 501722 393973
17067 393973 573817 314834 560584 598508 424098 490369 361216 382011 547000 453559
17057 453559 530245 657817 265254 531645 224412 512843 280367 595481 622357 339763
17047 339763 629368 362151 514904 406549 389479 463662 332292 732287 971220 661885
17037 661885 511089 619631 522628 545273 522591 251339 456447 998484 506645 869711
17027 869711 442751 462729 196153 390444 539120 867661 611523 917379 472027 433486
17017 433486 616833 721935 461463 629780 303884 730264 561981 610157 587584 713628
17007 713628 734319 509886 802120 784915 749676 729952 1118717 623579 559130 870964
16997 870964 629701 807684 527973 584196 563793 671498 885372 594774 686876 1079216
16987 1079216 802246 746130 588694 800472 748486 567360 564716 560977 282611 553577
16977 553577 672477 916569 987121 774493 972808 723577 670113 769534 816750 828910
16967 828910 995772 693097 1121831 715364 1063071 824872 699338 1066090 655715 823721
16957 823721 955064 911877 867503 1117842 1138884 1247499 982435 1275419 1000581 1333993
16947 1333993 897183 1459066 1086707 1169123 1015940 1095584 1102322 1097742 1420731 1352981 1002012
16936 1002012 1265438 1071542 1001289 919966 1265867 898492 1420169 1235673 1477498 1165686
16926 1165686 1070290 1650234 1411426 1486441 1109623 1167517 1345021 1278753 1587932 1336893
16916 1336893 1301711 1523488 1232009 1311815 1329338 1374836 1419948 1534513 1317054 1356375
16906 1356375 1628600 1592430 1725833 1638640 1381026 1784337 1789039 1841159 1586399 1802452
16896 1802452 1633107 1664160 1694983 1657314 1875722 2045109 2070235 1735177 2219761 1969610
16886 1969610 2148085 1835025 2091247 2098775 1723918 2069815 1877767 2086638 1940502 1989722
16876 1989722 2136943 2077049 2022424 2189198 2256176 2481488 2154001 2169925 2432918 2397611
16866 2397611 2262376 2506212 2620781 2435340 2900198 2509297 2356891 2492332 2757881
16857 2757881 2557609 2687978 2709981 2789000 2985699 2917560 2719130 2966292 3056072 2730222
16847 2730222 3031331 3374660 3122269 3203755 3320052 3765814 3531206 3420044 3538627 3619512
16837 3619512 3385920 3732972 3723542 3995100 3736980 4086377 4189749 3991733 4134982 4317925
16827 4317925 4410838 4695401 4489626 4353505 4432386 5021363 4610934 5172790 5220859 5370122
16817 5370122 5310995 5178619 5616731 5366634 5582661 5677901 6002402 6102940 6101561 6011211
16807 6011211 6603884 6755863 6484896 7054059 7083871 7114959 7315835 7081268 7638838 7695193
16797 7695193 8100385 8386687 8377267 8810010 8667130 9220315 9518348 9529166 9943992 10275763
16787 10275763 10395048 10819004 10852893 11154512 11369352 11705150 12506488 12503190 13009874 13338131
16777 13338131 14031877 14046468 14476200 15178212 15502810 16095489 17025563 17423953 17767318
16768 17767318 18646299 19284632 20295113 20896778 21501321 22450083 23370233 24306662 25395761
16759 25395761 26256900 27371104 28909345 29936193 31160785 32942874 34196259 35725144
16751 35725144 37735427 39766397 41554398 43635508 46094419 48497755 51273862 54215217
16743 54215217 56949734 60691427 63910624 67974243 71809914 76600164 81266317 86399765
16735 86399765 91844234 98089793 104133879 111164265 118519089 126066724 133761650 141948617
16727 141948617 150520741 159254121 167304188 175528161 183729676 190506977 196897295 201708275
16719 201708275 205362333 207681448 208631647 207636240 205216938 201255061 196451362 190111873
16711 190111873 182818388 174761365 166372961 157624770 149135376 140438455 131860895 124056743
16703 124056743 116239098 108965092 102125288 95188438 89476578 83267520 78788163 73604652
16695 73604652 69283426 64979531 61445455 57881117 54357365 51348955 48562230 45771774
16687 45771774 43472069 41171360 38625031 36908271 35074162 33460826 31901115 30139325
16679 30139325 28861300 27577837 26201200 25349184 24361772 23093426 22219404 21262678 20637558
16670 20637558 19564278 18990149 18293680 17444830 16719418 16588912 15889854 14867696 14735397
16661 14735397 14265705 13965907 13481569 13025489 12580737 12072303 11942800 11223397 11134712
16652 11134712 10930773 10410370 9545452 9569938 9407394 8719648 9070143 8748504 8317104
16643 8317104 8347296 8112210 7764934 7291889 7483844 7291762 6831270 7109749 6428547 6516408
16633 6516408 6424299 6139473 6075604 5741755 5944838 5760411 5227149 5291979 5332991 5116580
16623 5116580 5209234 4718888 4585663 4669281 4491953 4594451 4701548 4503331 4389747 4151600
16613 4151600 3986925 3993716 4077887 3849129 4063992 3752046 3394223 3803333 3708917 3402458
16603 3402458 3315422 3226149 2813052 3476486 3135523 3610030 2949088 3043767 2857332 2983488
16593 2983488 3115278 2766160 2331945 2711468 2602575 2687480 2403768 2835334 2605566 2865881
16583 2865881 2351815 2553687 2370571 2302366 2426308 2545488 2168676 2183017 1743639 1888541
16573 1888541 2122415 1948967 1784737 2069396 1907173 2001108 1785119 1978416 1910498 1706213
16563 1706213 1787311 1585889 1754337 1945349 1655490 1697056 1590311 1612417 1222344 1559538
16553 1559538 1385401 1590632 1410500 1536403 1356085 1418811 1778827 1350568 1643300 1203072
16543 1203072 1343863 1226089 1396701 1294111 1018260 1109765 1278233 1238991 1127792 925775
16533 925775 1055703 1142247 1198204 1354836 1191322 1021750 1234155 569551 1228503 915886
16523 915886 1155945 947292 674898 960036 1021331 1106885 927603 966592 670574 867124
16513 867124 663109 1026508 1036797 871161 840471 756920 946930 719306 1079182 749644
16503 749644 773166 958118 659091 630588 685055 793235 892451 483402 692465 673317
16493 673317 328577 624424 780326 654101 676182 659664 518790 1072348 501700 906885
16483 906885 600134 779994 572960 463320 621252 382070 604574 510666 743805 886011
16473 886011 552211 361133 500836 757323 357509 574853 614836 410344 653586 563404
16463 563404 433952 493755 387279 582676 514480 931796 274888 749199 412122 521154
16453 521154 564872 217391 354736 747256 577157 -56692 625587 523671 605379 108861
16442 419178 229559 451571 210426 142534 549412 488699 661365 360015 139692 435844
16432 435844 553076 304559 547267 411494 263643 423372 346078 472864 489928 323832
16422 323832 205898 342583 37709 564694 189543 211223 492069 130749 474630 372233
16412 372233 292081 6984 612517 557400 442223 174620 564764 333903 508115 161291
16401 302589 511589 458582 280489 249749 416779 326181 288224 304884 479454 601796
16391 601796 320170 392738 555864 421152 466994 244455 87802 182221 522433 261001
16380 251505 472992 324973 214468 225307 363982 292925 145650 -149357 55236 203687
16370 203687 347731 429350 104080 501087 -33820 445462 239877 108575 -244032 453767
16359 272112 106144 107240 352024 -37250 119239 337840 146862 -91040 206323 131733
16349 131733 207851 6263 416554 124358 168999 127028 184951 466793 38337 261041 -42679
16337 131408 643301 225591 190262 209788 -108589 193741 -27398 186944 40467 106361
16327 106361 172812 102082 172131 269569 52869 2600 164206 76710 389594 323942 -187323
16315 111982 31683 42716 258572 -106333 -115943 307919 146887 -73484 -165674 163093 192308
16304 192308 68450 188352 15200 271254 223588 135816 -27386 69798 219185 -122604 35249
16292 -87768 73646 153768 244472 373174 185520 160969 -175445 113985 -22537 108965 24863
16280 84926 249059 375227 102780 70456 35580 -22525 -111870 -280472 -129914 102097
16269 36130 -248431 -83603 152498 97459 106730 30314 -22263 46784 79443 -172577 241196
16257 208023 90077 -151092 -219241 586535 -134685 96547 -8935 305103 -14157 32964 -84727
16245 -117475 -195276 135166 81380 291659 -22846 115136 182021 -52563 2789 -62468 -224620
16234 -224620 37826 -78129 193039 -149857 -143185 257977 66134 290336 3147 295529 87364
16222 131973 -50704 84081 -114052 179306 76928 116410 -128964 16293 -190272 58205 372922
16211 372922 6586 -110895 -8159 487384 -126184 211523 207821 -298647 118754 -100084 164810
16199 -91298 218068 -4648 -136826 -361411 -406158 216648 22180 -232581 -118327 -263213
16189 -263213 -90860 -66716 62949 -163516 133245 101314 -249365 353308 259805 -107865
16178 148482 89912 133391 37805 1986 189119 32184 206757 -59041 73562 1535 -124892
16166 -23781 147114 -62328 -51687 -121926 142720 174956 70824 -86102 -44013 66933 10706
16154 107611 1067 -117852 -106784 153544 88781 132235 87572 -8372 -16291 -201845 -40990
16142 134788 -25887 -71847 224135 68923 120053 22941 -112059 -281684 -45823 5227 90394
16131 90394 -269707 178589 122140 -67736 -69820 67374 81479 -113734 123293 79125 -11925
16119 18813 -311 64123 384 102427 -171251 133858 254351 -69169 31917 -7676 80101 42591
16107 42591 66535 -122145 29807 7090 188512 129772 -72323 158286 284152 -83142 -243851
16096 -243851 46812 182858 154897 495303 -117542 -12434 -86765 -138443 -123692 -53835 -44685
16085 -44685 159853 8651 -177284 -17881 -58539 288519 9077 -380252 -113722 -142807 10493
16073 -102455 -70099 -16296 -46549 -105268 115367 -212562 -320842 212883 27689 126613 9068
16061 145897 -9384 -59833 -210870 906 127686 14325 28861 115670 -157752 42147 156621
16050 156621 10606 -154186 62946 -81700 -174681 -272762 259071 -15761 -191163 -225218 85145
16038 -182878 -21919 -15733 -169272 159380 -131530 -338070 -194632 -49217 70333 3834 73052
16027 73052 23219 27459 308867 33375 -49376 -186266 -67667 -32584 -138083 -40948 -190629
16016 -190629 -270760 -53375 86134 -483377 -24374 -105322 -268503 71468 21799 84976 107928
16005 107928 -280686 -173548 -415303 -96780 214243 -141678 -318545 356160 -108114 -169251
15995 -169251 -23821 -193068 -102514 -28627 -51072 -33136 -157715 -123953 36238 428824 -5865
15983 -47743 393321 12771 111942 -13756 372303 -23345 -160331 195536 82944 40867 -28724
15971 53156 28550 85434 -16954 -374562 19622 160820 295445 -7606 -2668 -44601 -250890
15960 -250890 135063 -237187 -82821 36242 -40199 -97118 -76323 -342068 -170284 -389440
15950 -389440 -83662 -354851 -190267 83023 158877 -72905 271382 -423724 48988 -123986
15939 -266927 -160993 117037 9584 -71752 140719 -120356 -317995 -77186 176663 -107057
15928 18018 -95835 -131952 -184494 -20000 30650 -73469 51061 -52969 -108271 143338 30110
15916 -89970 -54741 -490436 -328271 -290827 147939 -258702 8644 -202232 216910 -111755
15905 -192445 49946 -170134 -261455 -52133 -151471 -125344 250666 147421 -145358 -27293 -155745
15894 -155745 -181524 -118962 -15407 -207983 -179767 -346183 -193810 -297076 15359 132500
15884 132500 -188533 464238 143840 8728 -144002 81790 14026 -71613 126008 -14652 79535
15872 -240208 -17020 48086 -69857 -108811 12825 -73000 239452 -55205 -270378 -267626 535 120246
15860 120246 -125373 135210 -260173 -200618 27069 94837 -31685 -340323 119704 115501 -162772
15848 -122950 -26733 -138099 91365 65264 81680 -59707 -133121 -27582 9442 3187 -109519
15836 6050 86868 167890 -62184 50032 -22801 -201527 -301936 173906 228091 -284176 -128229
15824 -120372 -203322 -52937 27049 -17617 -258066 -190098 -219198 70531 215608 -195688 41652
15812 162148 -119812 -184387 113634 77076 180103 75301 -185361 379812 2255 -263600
15801 317371 74517 208647 -163336 -67036 -126095 -20418 -40052 137655 -226483 -156349 -281643
15790 -281643 95404 165421 -114711 236232 129315 251621 -34157 -57129 -117232 -94502 145489
15778 -148868 -48643 120584 -48125 23855 -121923 -65565 100569 21135 -34822 41666 -29344
15766 -112674 -64070 187078 -156696 66034 -116223 -38492 -61097 -82037 -298171 88627 2328
15754 -303698 77581 223297 -154403 68678 9833 212153 55391 -94906 80750 89520 -213218
15742 64762 247142 -8717 81335 -121709 25733 84459 227766 17379 131915 -82439 6948
15730 -19562 314264 15947 -95591 219558 176882 -199426 -182505 -171910 -67255 241483 231730
15719 231730 -377772 -587558 -70566 -238661 153871 -73977 -90908 80052 170450 134263 -126756
15707 -216483 -209678 -540 -26542 -370528 -64466 -23642 16479 -67424 -131251 -198634 60810 -25184
15694 -168264 -181919 22120 105056 118115 90599 198105 87475 -92737 -200871 -29627 -229644
15683 -229644 -163223 93874 -200546 -9914 308240 -121901 237592 -353401 343912 14153
15672 100370 146480 275402 80737 147433 308761 44213 72034 248042 236617 255036 164835
15661 164835 71422 -126474 -311570 171811 -64877 -9973 -72230 99239 -80539 -150806 -23278
15649 69018 122652 61310 -72547 -146582 -83704 -219834 -66530 -197418 31575 45187 -45738
15637 -271538 -22575 6462 -71424 -91141 229262 223643 7875 -56170 141930 -186656 -165637
15626 -165637 277578 -100043 146210 -179968 -36244 253114 156590 89743 164343 290477
15616 290477 -19557 285235 101048 191086 -341809 -74827 -36027 229129 -22611 117449
15605 64713 -360202 77937 119889 -110915 -272174 -156542 -190817 108667 -171030 -48652
15594 327626 14903 -437756 -147420 -349825 -446257 -62680 13124 -3939 -134692 -190586 -20676
15582 -214566 194389 194684 31411 -12403 -158133 -139635 -350728 165471 170405 276995 -69140
15570 -150258 158205 36193 378882 -76774 134190 192636 -91110 84211 148995 45396 150431
15559 150431 98633 -123657 46805 -50776 -149635 -44554 129049 -170669 -139765 29281 264931
15548 264931 -205616 251412 48165 68346 -105083 1387 121593 -257801 -158114 -108567 -145071
15537 -145071 76432 -49245 -120004 -202868 -165580 -456579 -240143 -36919 127360 3893 40185
15526 40185 -110881 -179575 -143654 26761 -52628 -71083 124976 -71559 114934 138792 -19994
15514 171522 -142595 82970 30337 283854 182844 169340 -77343 309244 317995 84623 -108831
15502 178848 -215113 14866 135084 -136974 150575 71220 201665 13654 -228689 -190155
15492 -190155 -150923 -444846 259232 -128077 7061 45758 -340009 -75290 19867 153185 138132
15481 138132 18644 294197 -108770 42172 -172024 250304 3947 -329875 23721 310796
15471 310796 -403034 -100 90475 292226 -144070 130822 -233382 -89586 216495 42347 194260
15460 194260 -95710 -41027 -7841 -89535 -45501 204276 -72849 102402 -71022 -151685 30045
15448 -92810 -294429 -41375 83928 -304623 252588 -380154 -100900 61763 -165707 162616
15437 66108 87611 -154254 192448 -70603 9912 -26075 408606 1091 115428 197308 135528
15426 135528 214504 -187142 24449 339270 53613 -70200 -89124 -124626 84544 -140490 154115
15414 -161965 -84949 131669 -161610 260459 81321 59506 -39510 -99325 -261838 137132
15403 -78578 -29892 -213714 140043 -214050 -263571 52965 -104062 103341 -238217 115096
15392 53965 104501 33681 84781 -84576 -245327 -132602 15307 -164620 -266787 182809 146731
15381 146731 -32160 -44936 61464 -117417 272375 191445 -155248 -372872 143186 131090
15371 131090 41933 -159313 -88974 -97100 -234 218255 -205879 -201234 8546 -1804 -83833 98415
15358 28371 -360990 171331 -148863 -116996 95335 71790 26385 -44277 -198222 188050 244835
15347 244835 -27740 -157414 46079 -47298 -268135 129141 -18727 -98213 65796 91878 32592
15335 395369 241633 -6412 6134 89025 16695 -51689 -97821 -306754 94091 437565 -116881
15323 -343473 161012 183271 219155 45499 -51931 36517 142049 -77109 369050 344002 300699
15312 300699 -240883 24647 -134957 -194074 146712 -122018 -112987 51489 32059 392150 -92076
15300 -173778 -257507 13710 -88908 20638 -105563 -289272 155384 128381 220122 212896 309081
15289 309081 -137980 -89 142436 -47551 415462 384626 -307688 -200928 226478 186660 -21746
15277 -251791 167005 -43483 123279 205917 220264 270371 293677 260790 -25916 106495 317694
15266 317694 169173 264143 227516 259086 71050 44529 180549 -148305 -34956 184454 349973
15255 349973 329940 75429 457161 207939 210175 302941 922598 1206389 1390054 1366765 1396562
15244 1396562 440721 45467 48938 264809 132674 51489 178389 -103882 -146237 -263176
15234 -263176 30397 127689 -24484 -82533 81771 -231418 59239 -21683 32832 424670 -65530
15222 97995 68843 103184 -72115 87437 49128 371849 147149 -296770 339710 -31805 -235400
15211 -235400 25952 -148806 212208 -234408 161456 12772 15113 73260 -30409 180902 -218407
15199 64355 -181828 -170195 25270 184150 -73720 102421 93426 -271088 -213612 276266 -97692
15187 218172 130452 89221 126758 53110 200483 150276 -13579 -91125 -10639 52503 135096
15176 135096 -9514 20139 147417 262433 -81105 -140213 133080 101339 -32299 -7492 337640
15164 294126 -175175 370605 314322 458937 -3092 -53802 -286990 -90495 169615 303451
15154 303451 -61283 -116467 -172289 266559 54806 -263673 -93101 -149560 -267161 -72990 -74434
15143 -74434 -7639 312540 382536 89143 -78456 336691 278327 250888 130557 346071 248341
15132 248341 207660 11421 -287011 -5658 458200 26646 -145530 48761 68287 532482 224806
15120 10603 208291 266563 -27900 233439 49722 -54162 -174435 396454 -56579 586743 106827
15108 108018 322794 269318 93442 -21861 171374 120609 87867 57182 246542 -68639 69886
15096 160879 18638 102383 235723 42075 50668 86326 149774 219960 163292 210879 317658
15085 317658 -79101 23629 307229 314268 61731 268877 -78180 231559 345435 219815 130679
15074 130679 -249060 441186 323816 143862 265427 262580 97970 257709 304332 219818
15064 219818 208786 599289 576685 -48593 -28073 112350 354652 -60892 429308 247664
15054 247664 190402 246432 165712 166005 189751 258799 144001 121358 21603 58723 462004
15043 462004 261208 -82180 -59004 205474 220654 466679 162992 215679 106891 32223
15032 359431 -197723 149179 74136 135757 181310 399886 76026 449314 309582 208787
15022 208787 484672 93640 18702 330452 404666 85869 328508 -62341 201202 94784 -4084
15010 399024 274318 545609 1563 253721 119514 -58847 204807 460696 -322543 393209
14999 167450 2268 -15154 94512 270582 100643 32018 295058 348876 205248 308839 439156
14988 439156 356682 228679 83177 314166 156515 370969 549177 224171 80434 96325
14978 96325 312450 447091 130463 211361 236764 332329 159057 1418 313967 118280 89672
14967 89672 137367 473320 472123 151268 390987 359260 96921 564994 263511 312285 307232
14956 307232 528095 194482 330531 113017 408556 409875 481535 659626 362309 214217
14946 214217 399464 62522 51465 396114 221788 431709 101819 297670 311836 505738
14936 505738 512172 405400 221080 88662 332394 70611 398743 360152 317585 515582 300710
14925 300710 433252 268718 184544 514512 340988 488031 373847 513964 289169 381968
14915 381968 594257 169872 70937 256746 472462 476961 131368 340798 99347 337548
14905 337548 100120 530849 497833 206409 452313 297132 274649 383136 319046 192103
14895 192103 370741 519449 811408 336464 500053 213158 161901 383073 202590 107223
14885 107223 356850 194320 431215 15486 275345 69875 186900 434136 341748 448174
14875 448174 265934 179469 282855 106464 503828 609488 402003 284807 183523 476096
14865 476096 130578 282634 424668 546277 235806 187397 491532 181871 337493 197671
14855 197671 187411 193231 311983 505974 619439 638241 230572 564879 781197 367971
14844 494377 584018 293836 383842 327402 316364 90175 712834 488353 528508 627521 277041
14832 537625 678264 363497 566044 374403 607468 748765 462046 488053 500085 422927
14822 422927 457479 374529 820384 630929 519045 365958 619700 491708 511448 471630
14812 471630 716277 148040 598892 575551 473135 516189 462168 527346 388458 509838
14802 509838 349373 643794 715476 217480 385700 558039 762329 536376 632034 624698
14792 624698 604870 529163 349736 472556 676674 726223 637433 701314 670716 219504 461609
14781 461609 623983 457384 203498 671496 811254 631928 592313 710734 744304 690387
14771 690387 491563 610733 580261 915425 587585 585240 353878 636190 621533 628142 627377
14760 627377 754763 432842 797701 537354 915986 864487 679511 578509 741064 531775
14750 531775 560022 613363 706367 748948 400966 790190 653753 555931 637053 720364 410013
14739 410013 832959 438793 788704 815779 601408 823568 821255 676102 1016131 767535
14729 767535 1034099 563880 981657 479264 661556 1007702 750022 1047344 834479 1049170
14719 1049170 1003333 910976 715572 927964 805002 907726 806659 738907 941026 992445
14709 992445 683278 1118740 936739 716727 676605 951826 911902 634721 951319 711328
14699 711328 743100 914134 1084998 1130860 596552 914925 913562 815426 759546 759742 1042606
14688 1042606 1113093 857779 865715 819983 758233 864047 463619 919403 664910 945436
14678 945436 892966 949228 908891 1337377 993911 849126 975171 1265405 885980 1025766
14668 1025766 1219776 1393441 1174357 1058299 860698 1095187 991503 984264 1156461 1324678
14658 1324678 1282520 1296157 1036181 1148968 1193441 1130302 1124060 1168210 1270267 1140945 1181404
14647 1181404 986812 1349450 1246321 926331 1090738 1157718 1142155 1164563 1457881 1306591
14637 1306591 1460542 1247318 1396243 1382483 1251571 1294853 1449146 1796304 1262512 1253557
14627 1253557 1254966 1383627 1315193 1067912 1376057 1374959 1201772 1417762 1710326 1282338
14617 1282338 1856074 1583353 1437340 1574835 1507651 1809508 1242951 1691989 1453108 1413161
14607 1413161 1273537 1514683 1422518 1637812 1781805 1194502 1666377 1713944 1731674 1450021
14597 1450021 1619550 1826831 1443393 1518999 1754598 1796175 1732078 1493388 1825778 1905771
14587 1905771 1742417 1821450 1867751 2110235 1978518 1878561 1918782 2192656 1851055 2001471
14577 2001471 1842687 1869560 2208682 1946734 2207874 2296552 2160161 1883729 2356490 2322126
14567 2322126 2153857 2258788 2388988 2447573 2474690 2595550 2489511 3046196 2855314 2759935
14557 2759935 2936213 3172424 3417568 3257299 3877388 4415234 4817339 6059995 8368320
14548 8368320 13206699 23948520 38571871 40726302 22930625 9595348 4737737 3333136
14540 3333136 2355901 2035065 2317911 1977107 1986414 1623699 2296224 2319232 1999730 2020284
14530 2020284 2048027 2221965 2262102 2276441 2231843 2320995 2372400 2494143 2122906 2312597
14520 2312597 3021047 2466274 2515730 2610007 2640987 2444208 2678546 2970377 2736455 2764125
14510 2764125 2679080 2673561 2938651 3033413 2784184 3123781 3066450 3270653 3121533 3183087
14500 3183087 3249265 3077360 3567254 3087260 3391707 3495248 3273522 3380975 3832017 3564440
14490 3564440 3980219 3458924 3539168 3626858 3739174 3451161 3874192 3665571 3824667 3730041
14480 3730041 4065302 4060686 3682817 4021036 4425303 4458696 4198403 4231613 4246240 4321420
14470 4321420 4378255 4636614 4174748 4323061 4477133 4561184 4582773 4536336 4736820 4777645
14460 4777645 4737622 4727877 4784614 4843588 4852834 5135502 5449992 5562432 5298629 5375336 5591337
14449 5591337 5617570 5457140 5589532 5625516 5433940 5852193 5914240 5983266 6213821 5883288
14439 5883288 6269787 5939428 6511940 6341921 6633543 6483928 6801496 6357492 6669720
14430 6669720 6596936 6799981 7289868 7035509 7418489 7187681 7337113 7616239 7645032 7613150
14420 7613150 7623159 8234970 8215908 8072406 8449313 8496695 8508792 8748161 9010704 8986977
14410 8986977 9271809 9150829 9442868 9323226 9790765 9925582 9769569 10134919 9823915
14401 9823915 10413020 10585736 11002723 10844242 11107112 11422358 11519067 11790405 11889517 12142170
14391 12142170 12108733 12556467 12787479 12777364 13534787 13607691 13524447 13961428 14043187 14572305
14381 14572305 14589572 15061019 15103728 15864771 15780970 16076373 16631195 16870313 16870098 17347640
14371 17347640 17639985 17817188 18519571 18589441 19136438 19362864 20224682 20323870 20790249 21378865
14361 21378865 21838807 22679277 22718103 23092675 23793742 24363680 24899878 25801842 25829454 26496482
14351 26496482 27134377 27825273 28581830 29165100 30183711 30722297 31784085 32396106 33379444
14342 33379444 34126960 35000946 36062838 37098944 37969574 39171551 40334340 41518084
14334 41518084 42569731 43478202 45234553 46462428 48086226 49697698 51084355 52552520
14326 52552520 54500754 56532721 58294449 60324953 62350605 64466199 66958815 69402513
14318 69402513 71566765 74324257 77380674 80525591 83316677 86653760 90179295 93836716
14310 93836716 97777024 101894983 106214970 110661696 115854652 120818107 126180618 131992436
14302 131992436 138445535 144545329 151518282 158647047 166482245 174921178 183608260 192335683
14294 192335683 202484049 212595550 223642772 234928356 246861098 259578856 272894322
14287 272894322 286219068 300456443 314870486 329702634 344785911 360068759 374976338
14280 374976338 389975820 404158211 417588349 430073497 441237978 450511614 457333791
14273 457333791 460839439 461789126 459995681 458263508 457165829 453384725 450674778 443959375
14265 443959375 434351528 423219936 411075169 397544773 383211029 367812709 352022146
14258 352022146 336477138 321023452 306053474 291778871 278166189 264598428 251501953
14251 251501953 239015814 227251964 216136533 205471837 195106947 185675282 176997776
14244 176997776 168714054 160990792 153130292 146058704 139298881 133404549 127667868 122388552
14236 122388552 116943505 111887735 107188018 102821456 98753170 95076472 91280548 87757503
14228 87757503 84108447 80951027 77916039 75157942 72292323 69613775 67494773 64699693
14220 64699693 62696721 61153664 58964357 56861767 54922148 53355918 52068400 50670707
14212 50670707 48865412 47305103 45889174 44375839 43375367 42206263 41339514 39937811
14204 39937811 38954127 37790730 36647240 35963298 35298052 33950530 33126149 32295802 31252785
14195 31252785 30617101 30228063 29242675 28500964 27842487 27088170 26471887 25913269 25058812
14186 25058812 24557043 24054393 23519145 23226939 22428348 22091646 21853778 21348659 20745747
14177 20745747 20604813 19917406 19467000 18764784 18626075 18519589 18139846 17745620 17249023
14168 17249023 16965120 16369814 16109385 15904600 15540256 15461025 15118311 15051837 14639896 14634622
14158 14634622 14242455 13776013 13968370 13593119 13330824 13327829 12867572 12491211 12594577 12065877
14148 12065877 11926198 11730604 11588283 11616191 11261377 11099026 10857956 10955451 10724185 10425091
14138 10425091 10638982 10404755 9813250 9911332 9799090 9769014 9557447 9540966 9208386 9316479
14128 9316479 8924920 8670256 8650761 8403551 8719561 8402170 8316821 8159061 7838084 7905370
14118 7905370 7653212 7716031 7101770 7696995 7311506 7421122 7114844 7179462 7121437 7056126
14108 7056126 6650868 6688529 6635504 6627336 6344210 6555431 6562437 6509788 6326297 6326613 6115645
14097 6115645 5772032 6148954 5864218 5579871 5697228 5878877 5502423 5734179 5464536
14088 5464536 5406800 5559556 5255503 5276562 5021470 4953963 5077360 5134563 4904190 4702190
14078 4702190 4688671 4561834 4995193 4628739 4640715 4165550 4643380 4598068 4564844 4348444
14068 4348444 4241990 4302892 4288932 4425138 4136315 4138469 4255115 4181375 4161024 3963357
14058 3963357 3991750 4033983 3890572 4051936 3848851 4074061 3729404 3962706 3450600 3550961
14048 3550961 3718653 3536710 3432410 3436160 3005359 3346037 3676405 3480925 3266468 3149433
14038 3149433 3161908 3014599 2826982 3288364 3287848 2853379 3115216 3311634 3266074 3068784
14028 3068784 3026973 2923777 3177330 2781571 2836472 2828497 2644282 3129980 2906196 2532236
14018 2532236 3050323 2834756 2842770 2695861 2589997 2388603 2608642 1922282 2490242 2394855
14008 2394855 2277808 2429705 2203641 2417697 2446948 2229724 2275778 2419290 2480001 2441325
13998 2441325 2169653 2178035 2096624 1942030 2293885 2111724 2116106 2355980 2745391 4089302
13988 4089302 7387305 17168194 33411083 40800138 26865494 13765150 8329418 6379637
13980 6379637 4903279 3980433 3449567 3116067 3475053 2927097 2955723 2894212 2998698 2633466
13970 2633466 2823541 2782947 2320988 2500965 2347226 2262567 2229133 2048625 2091524 1941830
13960 1941830 1893524 2163941 2046202 2104318 2075284 2136820 1908146 2104133 2138376 2378829
13950 2378829 2254185 1863230 2047268 1795413 1636912 2146436 1732049 2002437 1804968
13941 1804968 1852357 1930053 1848445 1915276 1606745 1929032 1418590 2174502 1819595 1728519
13931 1728519 1445853 1541276 1748164 1613021 1507122 1573374 1696840 1542765 1805293 1739392
13921 1739392 1471811 1318068 1346976 1553800 1406274 1612402 1494366 1712710 1471104 1557971
13911 1557971 1476888 1617585 1381318 1655675 1305733 1190150 1445039 1172784 1663006 1475891
13901 1475891 1577700 1399139 1353007 1325487 1676507 1509188 1431499 1567060 1111131 1258558
13891 1258558 1336960 1397765 1574780 1484771 1389224 1168191 1071312 1440285 1460326 1340876
13881 1340876 1524654 1311083 1538890 1240893 1897473 926513 1222219 1170496 1306219 999875
13871 999875 922057 1368057 1341358 1300862 974663 1195342 950459 1206149 1445556 1170308
13861 1170308 1191048 1285425 1135839 1085936 1088400 1073642 1177467 1214158 968050 1222322 905248
13850 905248 1108586 1063626 1144863 927200 873647 837790 922797 790276 978401 1050606 924067
13839 924067 1158432 1005943 875095 1057230 1055138 987161 658147 721038 993123 627523
13829 627523 794476 962708 1007368 904301 1103041 748136 914371 783888 962318 964739
13819 964739 628625 924536 632789 976175 859213 724676 954190 479018 667384 1041153
13809 1041153 920192 943337 723574 847561 831124 661810 700360 855071 751376 888944
13799 888944 625116 780707 689942 596736 702745 784156 617449 488552 862061 798550
13789 798550 547522 796666 729404 903386 748680 722370 833885 912554 627041 790730
13779 790730 440107 847746 764224 569541 613589 1057909 899971 628518 674504 578979
13769 578979 654313 777779 634791 571063 366864 648932 594615 776870 865082 549417
13759 549417 469691 903293 771130 395912 423949 608080 561718 504634 509881 668800 681388
13748 681388 909616 731811 640902 367255 611416 677184 685595 629847 662102 174509 818686
13737 818686 836507 750853 528511 874300 566507 570170 636027 836386 497451 858739
13727 858739 785702 766736 651150 486038 741974 995438 726791 569950 622105 779528
13717 779528 482863 517085 604035 240385 541565 598336 463673 376945 294578 225011 663147
13706 663147 725683 629823 747993 438290 458453 724288 680035 740807 491483 503731 522895
13695 522895 570728 661056 497866 581094 379486 749416 469081 522025 549382 343724
13685 343724 629372 424039 460910 394557 599630 582673 408525 498745 132467 654373
13675 654373 164313 568027 396746 602004 337979 185416 455107 660512 369912 287099
13665 287099 382752 362166 300128 261496 571005 425853 299528 591289 355051 272493
13655 272493 761373 429933 417245 449776 413842 598678 538344 335685 468974 485737
13645 485737 498750 347993 483473 450608 441951 382521 390687 594552 660410 579391 365606
13634 365606 381445 482976 375781 437914 384181 634378 502527 668274 254824 624668
13624 624668 206851 212129 380950 578859 297046 396846 553034 464515 566446 339002
13614 339002 296349 615516 498175 224449 397647 377289 697672 203783 367703 634568
13604 634568 406979 384912 579288 628057 272657 375190 452402 578835 312294 269183
13594 269183 202794 545655 279235 115409 129311 285708 273919 647515 634416 126513
13583 302117 564492 562964 367349 432823 142225 283915 576642 91085 535302 101107
13572 197751 328044 514540 324442 463245 494912 423992 250687 150841 462638 351116
13562 351116 367374 437652 244801 200479 378142 226750 236276 315836 228597 160118 457502
13551 457502 94576 206516 160390 764162 49102 402831 393752 179012 356741 468398
13541 468398 362014 764889 334766 188617 217374 263823 178539 371143 274586 518343
13531 518343 319703 421256 310814 107453 211267 473202 349615 254636 170296 479459
13521 479459 445590 150092 270838 119356 41085 498855 416889 443222 266590 204004
13511 204004 393227 -98815 13336 124170 122510 240358 -72598 205387 79571 354718 143441
13499 415175 77068 416552 308250 337055 514367 562359 178346 259744 407276 336789
13489 336789 187677 404307 184681 61537 -157156 -6888 390966 462016 219696 595328
13479 595328 198652 -109637 313989 65763 282752 -62198 345712 345716 96403 402829 508703
13468 508703 224821 275757 106588 483223 75078 225627 205507 399434 164354 121108
13458 121108 124741 493784 288589 130086 491694 362800 271529 -43417 275471 -89276
13447 162504 159104 226938 80293 251384 162429 596960 236270 20374 108500 81093 232010
13436 232010 208618 331792 582065 63865 -89168 243345 154365 -198235 355246 -39153
13425 343631 -99841 323850 153733 -200355 97315 135208 34959 -88601 145281 -150820
13414 196336 340040 273756 31247 482015 333152 319578 56990 213179 380106 -61160
13403 250712 58069 250541 199273 214624 37112 205444 163586 166125 283795 -78797 547265
13391 486017 453332 41299 277968 123887 59049 586973 57227 297977 256878 331980 260235
13380 260235 455317 32910 304829 40901 250393 390819 311294 418545 219635 43415
13369 308943 259366 316444 145319 332209 13195 115923 435044 386115 283779 260585
13359 260585 170688 288747 261428 297618 219142 78871 358491 283891 370744 188810 163142
13348 163142 379902 397846 470394 355990 440612 431808 167816 -80611 373772 503400 255293
13337 255293 533880 460691 108669 530072 264090 240492 155307 306971 342604 -49203
13326 178354 144401 69453 248477 92834 309639 111639 -2471 9762 414816 73216 488406
13315 488406 267389 247389 44550 149073 229571 699396 33403 -17037 57503 -3905 -147227
13304 -147227 -81760 -195614 132100 237386 34207 90430 170 45621 340441 327120 190064
13293 190064 315886 113603 376417 191303 375071 173234 141936 35303 97386 415840
13283 415840 145971 187245 21124 258398 58421 125415 -258728 -52310 274252 259515 -69505
13271 324874 132848 -102604 144095 153379 279581 130524 154367 149140 -96652 301908 113665
13259 219279 -170848 148745 142161 -86409 19383 168146 -179504 207749 -10115 -2591 -27643
13248 -27643 326415 94731 50596 127208 44781 119146 312236 -511328 248739 -47651 135467
13236 221788 333678 88223 -107462 159156 -7275 -33882 61763 -143668 -85481 -143651 -233707
13225 -233707 -1348 -66878 234657 36821 25851 -174551 363193 199550 -101841 -91224 347218
13213 48026 24368 -103094 -34983 -56718 94455 95974 -117598 171688 9589 -61502 254696
13201 446248 -49786 -35916 110224 216182 166506 87837 468204 -111674 132049 -74540
13190 178411 206262 137761 37540 -181277 75247 -5246 200780 158284 286971 -150318 131206
13178 124184 34074 -57294 67179 -132315 -49396 218705 259316 -244580 87054 45593 -79181
13166 509582 44555 -93620 -5614 214710 28048 160147 87427 62906 144483 -34834 448946
13154 203666 210871 105900 32745 74641 13457 -21256 93273 195797 139386 -133792 114779
13142 185628 83576 226697 -196216 87789 -312914 113579 334597 48977 125356 179352
13132 179352 175415 69709 -77009 -285442 -82975 -94182 341576 363934 146676 206787 211558
13121 211558 192618 -20092 327670 -164949 243099 133488 290947 72984 13299 60949
13111 60949 -276401 -186280 136504 119201 108577 -146281 251516 51958 109404 58426 59885
13100 59885 28531 106838 -18496 -83463 112453 -72189 52687 115391 -106177 36381 127964
13089 127964 98166 -73032 -35756 73705 229400 -203044 317074 20947 -20665 294325 523433
13078 523433 268887 238808 309710 26727 -46328 -233841 128873 -187709 84732 -127413
13067 231795 297762 200553 194643 -31978 92395 23387 151064 215621 -146529 -37989 349149
13055 -87818 225484 145914 -166696 162862 67905 141590 97842 159774 -53351 247707 113724
13043 68250 267640 123237 162783 287022 184119 311596 108445 -30247 117107 -70376
13032 84461 201924 165788 91927 276697 108039 -31631 -100633 -108049 204054 193939 19038
13020 122449 -269910 3819 106928 56941 -72607 207266 -37136 157312 201744 91788 324865
13009 324865 103096 259214 44716 -338027 297056 259893 172326 53858 101154 -44637 -243154
12998 -243154 -17468 -3905 -116387 84697 138453 181102 60786 97602 43273 312553 279339
12987 279339 106864 76499 88170 -103886 -92421 202295 181897 -98237 -130278 -81010 -48067
12976 -48067 201940 18727 -44263 -127104 75851 -185221 11319 210934 26563 295958 -50260
12964 -244502 176308 -107370 185064 -159584 317596 -23228 -107526 -28680 51952 183459
12954 183459 -196543 15032 -64368 -119347 102306 -59478 -114978 -288448 -74836 -80550 -71995
12943 -71995 -4181 261975 -290847 96486 -94888 -46530 254328 11103 -31716 -27664 54722
12931 160434 -176742 -131224 101715 11042 15918 -188956 25897 93140 23693 444127 206507
12919 -177293 -35156 181376 -118614 174786 -9515 61981 -198593 367896 -73284 55413 -30214
12907 -123695 155800 38208 -149568 8633 -67823 7261 450293 88504 -330308 111741 17598
12895 -11956 263807 246532 220968 -86648 5698 -323923 292721 131848 106190 199866 59139
12883 -69508 7527 256233 41929 180176 25311 32307 -204824 -38372 165545 278796 -42490
12871 -98815 32046 -348029 -82252 -225859 57863 26855 -102672 124288 75568 -141142 -13365
12859 -2642 138275 -203911 37628 143339 -76459 67293 210899 -371514 141940 28816 140117
12848 140117 -110348 -213871 159465 250176 196159 15086 -165478 -112779 -104245 325206 -68948
12836 258701 31155 12122 61048 -71025 45706 -130042 179645 -27443 -99410 94151 -214378
12824 -70705 -65857 206062 438013 -21781 283242 -248136 -143183 24634 78412 125796 65752
12813 65752 355352 104714 65692 -75415 -51522 445910 156037 73415 -40283 247901 398610
12802 398610 33520 -47100 50527 -181318 88306 -1820 -78540 258036 -23968 137836 50558
12790 -71558 283165 -74362 -154442 -29697 -386 64881 -101564 -55537 464818 17887 -112089
12778 -113003 54662 153030 -108837 -181437 3134 42567 97086 78159 273288 170052 -59367
12766 -129990 -350872 -182083 63528 109373 -129846 -46465 183007 -65205 -216536 -156234
12756 -156234 -82451 123737 -105809 333630 -126669 -174498 -141406 -202511 -45336 356092
12745 63678 187949 -65408 237722 187803 218391 446372 -147943 122731 280314 299210
12735 299210 200234 106749 297770 31419 191771 -122451 88766 59860 20267 11353 324966
12724 324966 -2528 72266 -29219 177412 69206 17101 -31286 307243 1708 -224217 -176067
12713 -176067 -150062 -164087 229208 87021 64728 85044 -155331 76824 289074 120397 428247
12702 428247 107322 90860 4488 63140 -19252 129037 327105 156972 184983 -43538 34901
12690 310956 -314847 136404 -144033 106184 -174325 54719 -148136 207163 -223525 207299
12679 36923 31008 45589 211369 145411 257665 454619 110758 188700 -112360 68962 186410
12668 186410 149048 -72995 94285 116027 141651 34887 -8040 213595 -96700 -158942 -153166 -71355
12655 81683 -34976 -141094 61534 254042 140136 359564 318302 239033 72394 -9944 -8914
12644 -8914 -97478 265303 218588 -84880 -79471 249307 30458 -11329 194093 -359778 190161
12632 213280 -98148 -53775 210582 142350 311884 381443 211332 385146 315385 -47458 85453
12620 180039 371414 480106 1369 -68941 -44440 -97982 -85578 15479 81308 -112785 -22633
12608 81664 130259 112677 -101227 -308250 -56814 189543 -7771 -251320 442004 222041 118208
12597 118208 278857 103034 -32950 653954 46800 242341 79842 -4119 140211 -150843
12586 -165770 -88774 -14664 94268 -33049 44026 -39024 -170470 -163165 228747 -111617 -90522
12575 -90522 -188196 -238341 -66919 56023 -755 -59742 304040 245143 -101127 9021 162682 39821
12562 96211 260383 88296 190459 -75332 259954 195154 -131255 -125662 -180640 285680 -220054
12550 51755 -141952 8033 100553 -63729 -259704 -146194 75744 99294 -74788 91722 39644
12538 147323 129805 -355202 -5741 219172 36549 376139 -34466 186088 -87472 131986 68087
12527 68087 30947 361137 159422 -41816 255067 -60194 107325 260064 235730 -33537 228530
12515 38454 -317902 -26622 -207951 -24279 -81302 -290618 -178207 -245532 -169122 -31343 -247309
12504 -247309 -69568 152569 -31485 -116941 -152740 195542 -11226 -69854 -254099 -68820 92596
12492 50872 -109882 -72668 140722 -5344 260951 195716 189594 -69581 -68888 -19529 -34822 267689
12479 4105 -166323 -104812 113372 -59665 -88599 129192 106189 184469 148685 -63064 -68874
12468 -68874 72577 173814 -270343 51142 69796 -134380 189985 84711 60736 88841 98919
12457 98919 -178300 70348 137674 57875 -14649 -3858 -61996 -123505 -117462 -6191 70918 262873
12445 262873 4262 36466 135305 -59074 184003 213258 96755 -47716 -90769 202817 42233
12433 -71571 -350465 33585 -136965 -3780 163757 -206339 -36034 -28638 -132300 -17239 -211546
12422 -211546 -43545 -48443 340595 145723 -73164 -24296 221812 -40631 145879 121518 150623
12411 150623 33660 75656 2771 -34579 194038 199715 -195180 118706 144905 159383 -13923
12399 33618 55494 -5258 142331 -85002 52806 -115007 -29229 -72306 -43098 -24888 95287
12387 -49286 -136639 118109 36224 -19649 -24808 112730 -123222 -129640 -426615 -326313 -337359
12376 -337359 -434247 -87396 -76847 -60639 93371 49353 32956 -44347 173969 -97740 -158774
12365 -158774 -149785 -16979 -71261 52028 -353759 152209 -512241 6034 239028 68133 -204511
12353 -59682 54830 -76052 -7275 294477 123249 55008 -62210 180646 87857 -18541 -166710
12342 -166710 -264428 69599 -81487 -121756 171570 -67646 187962 43750 19550 -187478 114815
12330 40462 151776 -9720 130175 -4485 27252 -155416 -64611 -70674 -220187 109535 356796
12319 356796 256626 -38861 166059 49587 -320659 -236939 105790 -7602 102899 -64380 70676
12307 -220809 -108778 77346 227801 -273403 -3579 -65404 20326 -146265 -1848 345948 -199692
12295 -18524 -133704 55884 136082 311784 -8120 -100095 82767 18265 334615 89378 184638
12284 184638 63001 119603 -53881 92306 122994 -95152 36955 78010 -105765 457670 72179
12272 323375 329559 460324 319836 397157 169495 275931 74075 -40368 72232 -16285 232418
12260 110861 -260369 -162217 14597 120069 -41946 170550 -174005 37412 318422 10528
12249 -155460 12026 118574 -58947 -153090 -18229 -70658 221572 -281553 -23280 293639 11905
12237 -237630 92303 11805 50610 166057 -20551 161551 -20246 422839 25158 65293 506373
12226 506373 244852 109440 420059 196314 258782 238401 245476 231705 419731 59182 322620
12215 322620 209038 87058 -45710 154555 70299 191768 11579 210860 206833 24705 64810
12204 64810 295194 168110 133812 56786 445018 187125 248508 298126 234097 310478 264923
12193 264923 285243 -68022 99718 -15882 215595 157808 48133 -110708 -46592 -120582 -107320
12182 -107320 37074 121824 239429 143798 104966 243181 146551 -2803 171445 309592 -79658
12170 -220909 344892 105628 -20148 187840 98428 -170758 28698 -26852 74839 226823
12160 226823 110574 36535 48451 -313499 403075 176170 134976 -250586 37908 -254831
12149 -9035 265335 -119503 -78397 56993 33263 176744 329847 -120481 170015 108138 96790
12138 96790 13414 -132344 564374 -35889 -101600 114569 -26106 195220 132626 -2043 -21717
12127 -21717 106522 204555 142945 -49848 90278 -189466 148667 51831 67621 -60515 169618
12115 406135 -25820 17184 30456 223887 -168587 158683 -90773 215902 -131072 -163260
12105 -163260 91210 -279650 15102 7492 -159724 101972 -97487 85014 -202626 -87152 -343290
12094 -343290 -161751 12477 188351 -169264 -60195 -188979 134260 -43480 -23723 96336
12083 -34915 -26811 -150390 130512 -47255 22358 30031 425066 922684 1234214 1397345 469754
12071 229727 335372 -51986 306988 7668 300677 81920 362292 -37381 191141 319762
12061 319762 537105 -7352 -228700 -46712 193302 -245943 -59505 17083 84591 -11403 189771
12049 -35183 5616 -158912 -449950 -85714 200656 124578 -226917 132036 -5266 9439 -31074
12037 169665 49313 62427 135060 221387 -185556 -73060 -159070 147874 -84366 111442 161147
12026 161147 22 47184 -31346 -149895 98855 -53940 351637 -339539 -198601 287272 -217700
12014 -256929 200952 -103156 -256929 210909 -112495 -220519 -80828 -110070 401816 87090
12003 -92390 -6552 -58298 -38181 129851 -251264 54539 125546 34507 -66042 100948 -120873
11991 184568 304415 -18247 89047 19373 -35938 148383 -25800 -108085 -117912 -288323 -254762
11980 -254762 14699 -169905 41477 -282678 -37727 5330 -10806 -161742 -19055 -30724 4171
11968 -212582 -126192 -64311 -287985 -124907 59238 47395 -168380 230620 -15264 -104239 -76649
11957 -76649 255751 48246 -123814 -58209 72881 -132610 12190 -165481 -28786 -27678 269676
11945 -12652 134815 -119305 51567 70629 -47428 -73342 -194748 -53937 -249047 56105 33536
11934 33536 -42342 -144668 -181379 269741 76182 -17913 111502 -66965 -212835 -50059 41196
11922 -266611 -171812 -50761 25653 -315172 -81422 123401 167619 231126 -69238 -23629 -128202
11911 -128202 376434 95900 281641 -365484 88699 305688 206931 7693 -28187 265376 -40170
11899 -179520 -259418 133438 13962 6022 -256638 -158460 -180778 3428 -305743 291779 171467
11888 171467 -18690 27592 -24291 -56882 389590 108191 483904 -45224 106220 -187411
11877 -145583 -12633 -180332 37946 -2086 81563 302034 146852 -9859 259280 1209 -133752
11865 -386763 -221301 290464 38320 254077 -237393 102920 78597 33687 -76470 -225373
11855 -225373 42622 114265 -89656 -5836 -354372 -198536 -367571 -87483 -265271 38304 -136382
11843 -125167 -303369 359 103069 -13769 120549 55646 -205396 37334 -84151 4423 35002
11832 35002 -66096 20132 -237668 -330766 -11786 -130309 -38461 -269881 50045 -511541 -142228
11820 -125470 -96146 -169324 154617 -92409 203567 373396 -252466 146322 22896 70796
11810 70796 -98231 101771 129700 -15339 226260 -305283 -14668 150721 -154808 -246856 285296
11798 40327 -90783 102018 -104084 -21831 -289765 -130096 123791 43153 -208346 -111763
11788 -111763 -195826 -83585 57938 -156438 98254 -69503 99637 -75042 -85908 108734 34818
11776 332929 29945 28408 96629 -46830 -119664 -205073 132387 -203355 -211282 -186473 399165
11764 -340660 -261667 -40804 41785 9747 -276227 -216887 -142002 3990 -124691 214216 69417
11752 143231 -67451 -100628 171952 -52153 212606 -58533 -21458 7551 -160858 -362787 131565
11740 105756 117200 -271365 78798 316040 13402 70039 7063 361532 -367595 121689 4640
11728 70768 -370153 -134869 -136432 29272 -33759 -101244 122167 214224 -278927 121352 109160
11717 109160 -60959 60361 -112274 36529 -119402 85140 -448772 -148744 132056 38316
11706 22267 123915 62518 -96504 133299 103618 55432 233512 -90552 36734 -133671 123985
11694 195656 54417 -140698 238013 284188 101686 -5789 185866 -475046 -9775 44639 369464
11683 369464 469587 280631 284789 27577 -164156 -43759 38291 43546 -102365 2120 77233
11672 77233 -10564 -163752 81459 120543 18723 -43803 215917 -290340 -353209 -290000 -254187
11661 -254187 -12281 -152717 -345745 50673 362031 -18525 -101335 -143141 92674 -64359 208569
11649 246574 305526 89798 -395182 24634 145238 121802 -86295 131505 287727 -90872 411725
11637 279956 137076 100784 70461 -29901 209658 59190 211630 393581 -110243 166918
11626 377469 174971 -48678 248224 224885 282421 48084 -87972 -23152 -54870 -392580 -114897
11614 -199422 -93305 -78859 -166296 -4810 234836 -17374 218621 -284665 277902 -163104 -268612
11603 -268612 -165576 226548 -59043 133597 178065 -212260 -178462 78595 -93325 -94417 129909
11591 87770 -334070 348112 -130980 72083 92487 150924 52369 -92046 -135797 -206165 -417300
11580 -417300 -137700 12701 358408 109971 74510 86153 -203767 42344 18670 180278
11570 180278 -13585 148354 197540 3340 400965 8732 126980 26796 23919 -50123 365700
11558 93691 -330549 127811 -168683 -185360 34902 81155 195562 -450097 -267421 -26247
11547 178754 79905 15229 -113662 191700 -142720 5768 8476 -73252 179298 44359 -115166
11535 -76266 188335 84273 110818 33952 16274 199 -37151 105399 -80473 116992 -37608
11523 -55951 -22936 259152 -143765 138592 218799 17144 176635 143119 24928 288593 148477
11512 148477 392733 8915 88208 -129650 -190044 241396 110028 14088 23149 139112 260061
11501 260061 173218 178301 207019 249328 332717 73282 54792 216392 104358 -67814 28044
11489 402515 282671 111277 127146 491316 340107 335858 -338513 228355 211153 115866
11479 115866 132460 2552 -35747 170495 -144526 -26638 306939 -137268 307583 -129646
11468 146177 457331 137341 249017 -11917 24148 335293 248990 92187 77382 -47507 -310967
11457 -310967 198909 266606 -167942 -107655 -29017 -34776 438393 -65578 147706 -220472 170099
11445 71124 -4481 216627 230834 73601 266036 162303 -79371 395696 44814 400259 71046
11433 -254016 287162 297722 147765 -77008 187213 -29519 64503 121441 157089 170068 248172
11422 248172 -3663 147409 352637 23394 102794 -14453 -203720 -70083 77859 -143705 -259652
11411 -259652 222114 68970 -28345 184755 -104114 290338 271111 42909 -38409 60202 23532
11399 -299276 41087 49776 -101757 226035 243043 -15707 -240718 -175714 295241 285867 236766
11388 236766 109136 -105474 144773 -193202 79518 125512 101826 96068 -208599 -175935 -144660
11377 -144660 -146216 61712 92896 -84409 89999 215325 -137513 -312869 202448 -47597 -195125
11366 -195125 167563 44685 -48403 -41661 53283 189625 35528 -349900 120972 245318 119694
11354 -91175 -271257 -170159 -6090 120573 -9689 35439 -92817 -392727 168448 36846 211611
11343 211611 82661 31721 218175 -210681 -242127 -217234 118957 153890 313175 135594
11332 -132288 58807 -177857 3894 302075 222342 -162474 -390961 -217464 -44692 258743
11321 -25195 303834 -393267 19336 175945 131383 -32301 -111209 -209279 -96464 168980 -175782
11309 -104889 -108625 -22916 174306 192157 186757 -61960 -34873 111564 -227505 230439 -91950
11297 43039 -277384 -128643 -110705 -517186 -248126 -344630 73394 34797 -188661 -23951 -91357
11286 -91357 9944 72510 117755 -145637 -126025 174303 213507 9074 96916 232328 -227377
11274 -181064 280516 -45239 150253 -130959 133823 -21568 -312923 -391932 -76311 -148369
11264 -148369 -19396 300773 149639 -311346 -121110 43196 313521 -154723 69731 -97474
11253 421684 -185534 143815 13912 -189203 -54729 -167928 -360011 416083 102101 52592
11243 52592 -168152 57673 61982 182850 -186836 50477 121516 181489 -66622 -228112 -76096
11231 228101 125824 -287120 -545873 -4103 -80110 -118310 365124 206296 161665 230957 -98864
11219 -303892 42037 -169058 242202 78847 23120 -67405 -95316 186753 -177490 41709 -86032
11207 13449 -453190 187671 183167 -70187 -99639 -44745 -12177 -135718 -20096 55203 78932
11196 78932 -115520 63228 -98746 75122 93920 101655 74064 -131195 -376022 -327024 -73218
11184 -255436 329310 218977 98953 -29251 4331 90198 -123121 -90398 -78278 -174774 -5882
11172 -9003 21861 -236424 96991 182488 -28571 -133731 -191815 -86134 -193445 141624 442043
11161 442043 -250485 128826 -33555 203797 -16642 -160394 -73258 -340979 -328985 -89918
11150 127163 48091 141827 -183074 112711 164964 150913 28447 -94191 -12525 50539 163585
11139 163585 250225 54951 -239060 280241 35108 94434 194017 -191903 290073 108925
11128 -109734 -82274 -8340 208021 -6133 -146054 -59752 -165658 -97126 124663 8661 -84682
11116 33565 161278 58675 96096 84615 -157261 -105877 105165 149501 99592 213420 -122328
11104 363371 92100 239746 146873 242114 184816 118227 199404 80003 213845 -68910 263573
11092 50109 -206056 321650 -29230 179925 -19504 57924 273828 379993 120640 390114
11082 390114 216060 127860 408007 163900 205982 115925 242004 676958 143089 238400
11072 238400 295891 299835 3309 189024 40923 500518 445729 415607 421608 588205 332749
11061 332749 698941 371028 566893 447461 577610 635941 506132 504659 540407 742893
11051 742893 952876 802624 787039 690334 865050 599478 749613 432261 863381 873368
11041 873368 547528 577608 1121115 584769 476015 706348 917279 811047 1080810 512653
11030 665581 816524 900607 524677 524841 971957 324515 734992 670981 529369 648617
11020 648617 608693 778333 631035 572537 761809 517625 642459 610524 547531 426500
11010 426500 562000 839205 718047 607472 543432 984631 451219 786750 667717 499808
11000 499808 708602 545034 571285 705462 378239 803574 392259 553003 880512 541340
10990 541340 699210 1139758 507816 1038584 995366 1079171 740761 861218 1060598 1217024
10980 1217024 1545184 1326889 1556800 1846091 1751382 2223705 2826359 2636002 2782849 2658160
10970 2658160 2484465 2366499 2477831 2189227 1873460 1778077 1561423 1758013 1448578 1534660
10960 1534660 1860263 1469745 1770521 1473575 1822624 1495943 1613878 1187753 1112944 696042
10950 696042 1086110 880346 523895 526911 360097 373603 318272 390026 112861 28067 321809
10939 321809 98683 195310 -150414 -218904 234383 105577 9578 153074 -313556 -105362
10928 104565 332201 17631 58836 157607 180614 178158 -123378 248541 143465 16253 -103943
10916 -346262 121817 -234833 242717 -197442 15286 -216070 67992 -90124 -110134 -291553
10906 -291553 -258663 -136155 280154 -45709 123253 73329 -276126 -36003 392334 -140052
10895 317043 -99286 225009 58239 149614 104002 69454 205782 15744 -209032 224807 266080
10884 266080 -75766 5578 -9105 -323971 234971 -2282 -22426 161123 178490 207592 -477676
10872 -135369 -190304 365335 82607 -95394 203912 -110711 168386 -57875 -7705 -19618 169646
10860 -308250 -74784 -30181 -73896 -69484 -193102 -126588 106095 -147912 -221182 -190609 -161519
10849 -161519 168699 -269661 -90906 28344 87059 79092 -24917 129943 165230 166445 -79740
10837 173517 -327867 -52537 71309 196577 36873 243815 -312391 -155611 35821 -20494
10826 -50288 -8726 -6711 354392 22621 42454 -299490 198345 52910 -26974 -146979 -138370
10815 -138370 -64996 -92646 85525 58833 -151252 -306630 -25236 114431 -60369 -142114 -139787
10804 -139787 144449 42365 81829 259501 120469 37264 -113865 -214976 101681 -28018
10793 -169120 147848 27993 -9292 -141886 -150252 -348480 -107708 -199144 -5018 12701 132441
10782 132441 63133 -169495 -202965 83987 -478217 -125704 -114866 -31910 -14516 -199577 -265399
10771 -265399 49105 129379 238553 -26946 49681 -57693 243418 -254386 -182938 -185552 99273
10759 185835 -386427 191813 174950 -214607 -24734 -160302 -207389 -27010 80007 -113469
10748 -96199 393326 -192013 -233385 163733 2824 87010 190182 103491 483409 100657 -123351
10736 200882 -38983 -143922 -136581 -134149 -121128 -71793 193234 -150614 110021 -235982 -360542
10725 -360542 112094 -158582 -177879 -178558 -327026 -210017 288699 23926 194291 94139 -167188
10713 306188 -118104 59214 45279 -163634 -33897 34123 78411 76900 -310544 -40990 159136
10701 -130062 -43785 100793 -209069 -363014 -48420 -84233 113992 -281972 -152176 -99822
10691 -99822 106093 58824 -23381 -258523 127425 -211048 -196823 -177016 100177 -130140
10680 -264557 -75057 -54970 68435 197840 -161453 -471660 -60343 151396 80692 -57084 19037
10668 -354674 -25054 128105 -220938 -126317 -159477 -12415 -155623 -173670 101957 -191267
10657 -144917 -102649 83321 -336180 -160668 -191532 297725 242108 97325 -196294 -30994 68806
10645 7183 -113882 193858 -190669 -156180 -187483 45813 150462 15346 -208258 -69385 -13884
10633 48053 -180335 73055 -246588 -64775 -410194 -327901 -306344 21440 -122178 4547 -151073
10621 -192581 -239405 -28382 -50635 -44027 -9789 500055 26354 -155577 182085 -205927 -4362
10609 16304 3046 -253907 -78360 275490 -17368 108508 175546 -178158 189052 -265881 -85368
10597 -98988 -13145 -46144 208527 -44791 -15850 -440320 -98788 -106598 55525 169003 -15133
10585 -186307 -120784 136084 76239 -229191 -113476 6362 93574 -224342 -123298 -177310 -194852
10574 -194852 242932 114437 -176258 -113258 -239213 77683 8401 -101672 228311 -337205
10563 -25909 41769 -22494 -344616 73313 -60892 -296374 120473 -59367 -432477 -310599 207909
10551 -256963 -95658 24312 -445399 176316 -4194 -49089 36932 -377219 146434 176225 95095
10540 95095 -238487 -55953 94016 -134055 -213640 -39363 819 5527 196774 15119 10617 -48984
10527 -46406 -9734 158250 -164734 -216871 83110 -78265 -160164 248397 -3877 149691 -210204
10515 -79678 -356194 78886 -47796 24981 -169657 202860 -244493 -51529 87708 -5092 329306
10503 305084 -136810 -172423 20964 37696 -3934 -7334 -186894 -250418 -58379 8083 -117210
10491 -73967 -30360 -116842 137684 -43899 -185360 303090 222005 195021 292299 114487 609870
10480 609870 131418 649252 131681 -22730 -200469 47501 50358 -121670 -211705 -84250 133231
10468 110700 131118 116823 307654 -21760 13903 -256697 -84989 -120145 -140765 -90543 -79699
10457 -79699 -75558 -103051 77064 -150053 38696 -104122 157934 161287 3600 164984 -44372
10445 88258 -170898 237867 339411 106860 -126717 293278 79821 -174741 -84560 -186244
10435 -186244 217707 -75763 -299235 89653 -94456 -219667 184872 39295 67198 -319466
10424 -159243 47031 62514 66444 -210131 -120937 225415 357683 117372 -70372 447322 -18228
10412 152881 -231244 20022 -389293 173803 92827 165557 -371047 252469 58253 67345 192426
10401 192426 -101865 183666 246955 -114754 71476 -29610 -63263 -3641 113218 384959 -1760
10389 47529 352457 78196 -56056 47354 229366 -8849 214653 67030 174408 109694 120136
10378 120136 -36040 167417 -61047 556929 213808 493238 9298 261321 -6261 164193 413341
10367 413341 245225 816231 373770 227097 179408 195085 379812 318954 105920 20471
10356 113494 10696 -3152 262146 378935 226619 499893 481668 255694 349231 479341
10346 479341 421606 256908 239927 322239 291624 103349 397909 502489 53747 14720 319140
10335 319140 12065 125267 327290 -21973 24999 97071 14758 56685 355564 237964 179687
10324 179687 387397 92864 87352 177713 100899 28543 99265 253149 63941 331122 -20423
10312 -188937 132152 223067 -118471 -36259 -57799 -48557 -683295 -226307 -315 23418 23974 -359627
10299 79290 -135692 -62592 -92560 173354 43915 26079 -10694 -461778 -27273 -12455 -72492
10288 -72492 -183744 60295 234391 243657 -185270 -170678 297742 -155123 -124403 -1121 -270020
10277 -270020 221171 -409551 115436 -320116 -414435 -127044 -92418 11283 -81306 -124157
10267 -124157 114102 -186421 170666 35996 -30003 91679 310353 638095 359902 314227
10257 314227 -54776 149931 129744 326993 -153370 -193696 104622 333606 95875 -65200
10246 -178458 -10789 -145157 -37289 219420 142911 13009 148637 81357 -25484 -243292 181902
10234 102271 56016 -69037 -132291 -56277 -79183 459124 -108940 -24263 -45855 -145670 -209570
10223 -209570 -96640 108982 -182219 -266713 -282798 -289366 -275317 40351 -147959 -43839 -220367
10212 -220367 -75176 -35868 -247569 -245305 -174893 59976 52979 -109477 472740 175351 82799
10200 -115637 -143834 120918 185947 -263027 -161348 -191552 19562 16117 248171 -9728 -357707
10189 -357707 151452 106026 -72177 -282154 -344323 -237701 -29921 187821 284545 124530
10178 -169769 -214201 -35978 -228593 -153457 -517513 66392 -261948 376271 5357 -114684 267165
10166 94878 5474 -19953 -298001 -22714 113184 -135871 -75602 -383054 76802 194414 68676
10154 -267289 175436 125201 -247908 16155 -170793 125966 -183186 181178 -140517 -106924
10144 -106924 -445030 173101 -358713 -165462 -134996 -233754 -16336 32660 170013 75762
10133 -287227 -139392 -526842 104254 -2546 100950 -137020 -81278 37104 -214519 -155046
10123 -155046 -186037 -203559 -230457 71610 -23712 -15883 -148145 -170847 198346 -66063 -155835
10112 -155835 -204031 -58079 68268 94160 -252091 -209791 66416 -182774 -39289 36170 -80186
10100 -16216 110359 -144862 -283360 -56470 161360 -138849 166417 31005 -67027 40162
10089 72337 -315687 384358 -187641 12154 -104147 -142063 -120343 15031 16535 -108407 83530
10077 2196 68267 167136 -122470 -154400 9222 -138614 -149735 -324246 104576 118351 -61100
10065 -61920 34748 -51170 265072 104658 62491 -280431 -289134 -215862 288981 243 -53725
10053 17849 -217724 238294 49538 -240265 58799 -262629 -436171 9691 -8595 64483 51679
10042 51679 -100065 -189304 138974 -62314 3615 91609 -85143 -129572 246669 -337074 -3373
10030 -244579 -112422 88124 230208 -207414 37555 -259081 350845 -157924 210802 -60605
10019 -138374 173260 -196344 -188243 -41312 134680 -228719 -2806 -131185 -287830 10432 132287
10008 132287 -11845 -62597 -37476 -274733 -88851 -202476 -198339 -81357 149552 -81918 -84274
9997 -84274 -139908 216310 -129928 -189729 -90102 -86957 -50116 129802 -130240 284099 82668
9985 180953 10411 -43227 164864 59566 -48480 128213 -66736 -116431 -192738 -121206 50121
9973 45530 -137390 -178766 -200249 35410 -50431 72027 23358 -202713 -143609 -68993 -295200
9962 -295200 -97892 -226882 -249 196273 -83582 -46399 -216707 -47050 -55810 88416 209713
9951 209713 329409 -15732 -104995 72862 -38615 -237010 240010 102234 -235685 152731
9940 107007 -150317 -30362 103188 -124190 -271373 355165 101827 -179698 -195089 -105068
9930 -105068 -36716 -213231 -171996 56371 -69422 -134130 -186144 -35045 -79178 41305 88337
9919 88337 -165289 240223 -154898 85117 -179896 -280871 -147029 -189685 -237610 -83056 -90493
9908 -90493 -164206 69381 -201817 -184667 -410330 331393 -369117 -144104 178705 -46054 -10898
9896 -133355 -279242 220452 -480016 -67120 -83200 -171486 -7916 90238 69458 -167202 31377
9884 -103441 -246774 -178715 53711 -266248 -308348 -191204 -308459 141032 -1315 -144338 -114065
9873 -114065 -45470 62893 50312 161366 223136 185986 34703 -171311 41096 179566 102424
9862 102424 -251796 130933 -246300 -396899 46158 25658 -220396 31986 -29597 221822
9851 -25917 128072 -134033 -254276 -359374 -20716 101036 -23275 73824 9904 -22008 7683
9839 -165053 -1796 -29926 -177980 -210745 2398 -213661 239058 -138037 -308624 -133022 -153973
9828 -153973 -102055 -35993 -373604 -266319 -104003 -97524 227452 -74263 -35077 -194375 -29164
9816 -210144 244361 145521 113944 45851 -201084 -141122 -102925 -102703 -173516 -108813 49083 109664
9804 109664 -183149 69956 -141061 -58811 143603 242954 -71999 81040 -260775 13080 -250061
9792 17203 54464 13888 148853 -30622 161862 122826 -219270 9488 -169108 -476106 8813
9780 -175952 -78185 -21634 106056 18068 -406200 72440 120884 -130737 -80246 -85626 -89528
9769 -89528 184530 -51421 240343 -49749 -118657 92515 -83709 214519 -115835 -141001 36492
9757 114627 44922 -191863 -132851 -23653 50038 86612 -80641 112490 75776 55262 -137595
9745 -112271 -126013 -46761 42629 -161584 -367806 -80819 -139166 236777 268756 -98138 30875
9733 132763 24489 -167834 -50933 -226375 26959 -192047 -337556 -218193 213604 205805 355013
9722 355013 -176383 178293 286197 -69636 56135 -104371 -31369 -52490 -242254 64946 -259879
9710 -25484 29745 240924 -61590 -54286 68413 -47628 -53475 -131715 -95969 -405541 -255974 -203900
9698 -203900 60379 -222747 -147873 -100571 -169604 41218 -127691 -313823 55276 -93852 -212835
9687 -212835 81240 21428 -318599 -246896 -277339 -332610 20601 208683 25363 -278629 -91770
9675 -12862 -72508 337323 67017 198281 -34559 68477 -170355 -240847 -45391 -66598 264519
9663 -115146 107277 -285943 170661 219772 -86428 -171772 -231193 -139955 -3046 242216 -47720
9651 -156957 -244748 -164208 -138272 -91070 -125770 -34996 251754 -164404 -199402 14445 -209613
9639 104715 -40067 -172502 -203848 138217 -293612 -258693 -185504 -40275 -291796 6665 -51316
9627 -142115 -57392 -284546 -289477 -412742 3165 172202 -146192 -416872 -251622 6165 227757
9616 227757 -120181 -129932 -71157 -147478 -141881 156762 55897 -92417 66209 -258474 -25037
9604 65522 272559 -191317 -81062 126117 -22444 33294 -358501 77490 -478096 50584 75027
9593 75027 -142647 -124577 -20268 -70760 -81980 -121736 -273010 -43803 96398 40278 258357
9582 258357 -57856 169540 22992 -255986 -115324 -266353 153772 -158519 -118510 -168394
9572 -168394 7650 250469 -62499 -226196 -279465 -26374 -9436 -318176 -136486 -114082 68141
9560 109405 210733 -71586 -56421 138469 225573 -438056 -111330 -126098 -262181 -87920 -148913
9549 -148913 -289321 -3529 243312 12640 -236242 -82495 -130683 -171170 -402987 176904 -261944
9537 -121566 54897 276542 111327 -75243 1438 109494 -109938 -92505 -45561 -35456 -104815
9526 -104815 28228 362924 -246348 -61556 -150567 -6973 -134418 -169400 232186 105369 -462443
9514 248714 -6858 315895 -418075 -213983 -233023 77527 -42973 -109113 -301762 -56405 691
9502 -116069 -184324 -47551 -112983 -3963 51336 -199620 -250039 -61698 59523 -127876 191879
9490 -68319 29054 -500161 160547 82680 -86376 110738 -154997 91655 86298 -101814 -6048
9478 34798 -47874 -214499 156845 14339 -234659 21287 -314937 -100899 -443376 -55971 151556
9466 -92113 -250357 -79862 -15241 -35255 -231261 -252602 -161246 128774 -71651 120857 -148906
9454 -323900 -277981 108678 -191554 6028 219619 51466 -168820 -43550 161082 -173518 186704
9442 97408 -119126 -135028 -54199 412798 -172482 -287768 215634 -36068 4095 -49700 39373
9430 -154297 -127892 -189443 -432674 -121415 77475 -324089 90592 -166614 -111889 64404 145683
9419 145683 23876 -66241 -78722 194331 -63281 -189106 -293211 -435964 -304524 316195
9408 -57351 -29533 20382 -74043 -477945 110383 -173684 53327 103399 -90545 73465 -89112
9396 133813 37189 105972 -549203 113035 125799 -99456 -271571 -169413 41871 236751 -15270
9384 -244452 -81998 -264932 -91770 52150 -17682 125436 43160 -137143 61892 49209 50721
9373 50721 -538667 14606 -220662 -350 109004 -42232 -161582 -35700 5555 -150915 186526
9361 -54394 -111411 -27501 156146 -72987 -130342 163867 -33962 171227 58048 -205425 -134219
9350 -134219 -30052 -2468 96372 233991 83379 -189818 -179206 181882 -169832 34349 -72828
9338 -204891 -201258 332333 108467 -4812 -46996 -187552 -429854 230950 -422335 101945 -331608
9326 135301 213710 -197128 -65044 156572 166488 157085 -508688 -238515 -82380 -289964 -233490
9315 -233490 20907 82435 -80369 134239 123912 -376601 -97540 -372403 -188880 -9290 -98318
9304 -98318 -193824 -2190 -243581 88698 74332 146594 15442 -3913 -47974 -123625 -24452 -205
9291 13770 185003 -131376 -97847 -245634 -185980 -25215 41882 69470 -65243 -287429 289486
9279 188397 -341069 -38721 -104950 -112166 -209540 46179 -200236 -107572 -47670 -100852 5563 -100192
9266 95752 -151376 -200752 -228285 -252817 232526 -156210 -57349 -387774 78781 -141770 -123512
9255 -123512 102511 -328003 67245 -419425 123283 363040 -174260 -96068 -61554 136410
9244 66646 148987 -360323 -35298 147399 -16474 -33442 -66875 -171071 -160780 41742 158248
9233 158248 -161073 -463879 -278330 -89761 278732 -76877 50617 -263046 -255262 136534 131369
9222 131369 51392 150783 182747 69279 36611 -128873 -51840 83973 -226742 -145782 140838
9210 223156 -423525 -292812 -54846 214110 62733 -137292 -31767 -159114 -280025 16723
9199 132894 -354857 231634 -126357 138297 273187 -29003 -141634 -4290 125428 89240
9189 89240 -188068 -99627 -102751 9798 -33145 31583 -47533 -154594 -13574 -108650 -56960 144377
9176 -446737 27167 -81064 38532 -24354 -149364 146013 -284332 -200366 -273950 85108 -44677
9164 -299449 -63509 -95439 -68493 257382 -56146 26114 -92064 59094 -36770 251121 -227476
9152 73659 135054 -373418 -20257 206038 -366733 -117349 21085 98914 -89063 -124435 237922
9140 217778 126906 82432 -307326 -37679 119408 -105091 -178482 -214580 -294048 175023 22012
9128 385931 -92798 -248046 -18123 -191636 151121 -270129 35550 58976 -215827 -241414 -217948
9117 -217948 178863 -10968 245811 -3855 -280826 -116284 -289255 218193 -115034 266644
9106 220589 148366 41062 150700 -105224 113358 68265 29893 -205584 -327168 -185669
9096 -185669 308503 -239283 -199515 137429 100136 -8525 168163 -288003 -228836 -58944 -199930
9085 -199930 50827 184284 199015 -118510 -14248 -45265 -74561 80233 -126678 86608 231343
9074 231343 22170 -137742 -98154 -433736 -194533 -178985 177041 -252331 106469 -273578
9063 200933 -34442 -22305 -190975 -67308 -203882 18942 -236842 -72330 -298020 -309303 82827
9051 -116196 -157047 17087 -137822 -135130 -88704 -22916 -190428 -52607 -166702 -333337 -146285
9039 -309559 61592 -61986 -137084 131474 74485 236477 70785 139034 -94315 77208 -7447
9027 1573 -216354 65923 -304999 61600 -208590 -341028 -235372 -92593 140193 -129330 -208040
9016 -208040 114618 -101117 -7157 -86287 36207 -97936 -387536 116871 20272 127279 -289224
9004 -58046 -49589 -176162 122766 -30297 -509579 65795 59789 5495 -143400 -60374 -199247
8993 -199247 -158876 -317514 -54949 20428 -64748 113754 209782 -182164 -85918 -107334 182957
8981 172725 -241968 -45510 41595 -13646 136349 44072 -118626 -74716 -104073 7075 284932
8970 284932 -78415 -303127 8581 -190041 59932 -107349 17782 -126236 -316009 -214447 140351
8958 -289571 71675 -67669 -56153 -21353 102378 -90614 -278681 -156151 -183324 -134190 54201
8946 82564 -143362 -100251 -133250 390027 -24333 273904 80038 -188398 -199928 -229746 72586
8934 170502 40691 -135788 55327 26443 -161682 -12575 26967 61907 316141 890343 1302044
8923 1302044 4003081 8682730 8001983 2432460 711537 259755 410863 257671 -452014
8913 -27332 174066 91196 73270 130236 71139 7742 294626 -42437 20701 168563 -152524
8901 135528 -242831 100459 -107223 -125705 -384269 -299179 -98435 192854 29936 -121441
8890 -67826 -152197 -23732 -216539 -16235 121572 270710 -480023 5592 -49187 -361289 -291357
8879 -291357 136103 234175 1866 375352 78209 86334 -92966 -9851 -94020 14403 -98762 -168447
8867 -168447 135879 172802 -56242 -24018 8385 152353 -204009 69921 -190782 83927 -352298
8855 -279044 134842 171974 -207737 34022 230001 -14174 -115918 37336 25593 -464532 -132494
8843 11295 -210976 8720 -181515 -80810 167177 -26226 83834 -46143 55404 252817 72351
8831 -123719 53911 -379254 -248011 101030 155700 -464206 -62546 -272075 -56809 -135255 -13993
8819 16380 -163644 -162991 843 -64661 -344233 37620 -178860 -59943 126061 -130670 32466 -365836
8806 -132811 74813 -58264 122844 -45236 330467 55474 8719 -20917 -48069 -27971 26448
8794 -10959 -132572 -120352 36894 89056 -397699 33323 2493 -64368 -82744 -82226 -115110 -8919
8781 -99516 90979 36950 64442 -164511 -139344 -209823 83150 -253068 -80578 -130800 -336860
8770 -336860 -140463 -276333 89379 117358 -134685 -348060 -33911 -32241 44534 -146971 -226247
8759 -226247 -62684 -177570 -326881 -33587 -11277 -115426 160939 11668 -108606 34018 101287
8748 101287 -102834 -118211 421741 -37306 -149383 -92485 104342 45406 -53525 30670 132291
8737 132291 211221 -234522 -83841 -259708 -281396 -3408 8499 -339655 -41948 282178 -34146
8725 -141048 129603 -287380 78143 133797 -170778 168384 -69169 -193556 39227 -379197
8714 -152411 -105087 -187745 158336 -98366 -41651 -114773 -62995 -146401 -48936 120091 91800
8703 91800 -179739 -137501 238788 -153088 -167986 -216163 129852 -80263 486956 -79920 186966
8691 -152090 -61625 -57246 41385 12829 -219344 62048 -73593 -4808 83777 -99415 246226 -201486
8678 214951 26398 -395271 -452136 -80635 -120516 -172570 327075 25401 99612 -195038 -146882
8667 -146882 -361379 -107568 -497001 104810 -22275 36802 -208555 143123 -96295 -33604
8656 -19425 10164 -187461 152779 99732 227860 -102283 126401 -202130 -79935 -405145
8646 -405145 -29361 341215 -63915 127507 116987 54239 -82819 -447445 103869 -348877 -64891
8634 4042 150470 -171605 -267505 2067 212260 -466423 43303 -92382 -69037 55896 128205
8623 128205 -50329 -27491 -144223 -143913 178194 72346 -141994 -192131 4870 -69868 -116455 -17497
8610 247990 23408 -367350 259246 -293876 -77471 -185220 135300 -98891 239513 -242719
8599 -6510 -133306 -106570 -481620 -135651 96051 -29829 -49009 -233318 -339294 -176104 -184078
8588 -184078 -339295 80039 249475 -332498 -29643 -31019 170098 -299603 -220324 -226222 -45832
8576 -87751 -119207 62695 306693 126028 -186416 29623 -179258 -42845 -43683 -148059 -227756
8565 -227756 -226878 -28191 -163876 -281197 -131829 -89457 -265431 -24786 164675 -76235 -243502
8554 -243502 -48356 253814 -35120 94157 -35038 82926 -237881 -15835 -34205 218816 -145125
8542 -16813 83159 148301 -213135 -141577 238914 -5820 -256746 -65620 -231833 -59521 27643
8530 101232 -36299 -363869 119509 -88376 227482 -241149 -65884 172 15914 260486 -178728
8518 -203572 178671 -290654 100791 -288303 10934 -111983 -95459 -283175 -285500 -55518 -73109
8507 -73109 131722 -86099 -191686 -79563 -272827 -278699 -227075 -71995 -97880 75918 166180
8496 166180 -269921 39976 -111225 -94065 -49730 -254679 124114 -3312 146960 21430 -235228
8484 8419 -65217 -73817 176231 -143819 241671 78139 119065 -135394 -488824 -28371 68115
8472 -58385 74501 -207477 10232 -44099 -174111 99825 -192232 -288243 -200369 -113683 -139728
8461 -139728 -117678 144605 60062 -256518 19693 73569 -112395 132585 -25445 -254747 -185307
8450 -185307 -120399 9120 37654 -123580 -352528 -270290 -67339 238058 -41203 277049 75269
8438 69898 -30828 -53186 155886 39486 6141 173863 67890 85236 -57828 -55341 -78452 -389888
8426 -389888 -217906 -31205 -60189 -271778 6757 7423 -107699 33976 184744 -37919 -19329
8415 -19329 -83110 161188 46441 -65472 107597 -89106 -38223 -172504 169281 42052 151770
8404 151770 30178 106330 176797 -195640 -288031 113821 195622 106835 51192 102517 -93184
8392 -114641 297205 118116 -480401 -1167 84075 -101371 74860 -276992 77904 85444 16490
8380 -170297 -9285 71410 163594 -150155 -147611 19525 -219405 22479 158387 92229 153070
8369 153070 11 -340715 71697 53212 -80099 -224449 -61598 -107529 7007 143369 -182624 -194278
8357 -194278 134984 198375 141583 69965 225828 89132 196086 -81300 -243330 99474 -54777
8345 195214 -8511 371269 -305756 -19437 -30441 -125497 19456 -18477 41538 33183 124573 -20556
8332 -170057 57056 -481025 16835 -160200 -155562 79393 -147247 326711 214332 -353351 -125030
8320 -208721 -94336 -40056 425422 -245512 -119910 -120761 -138035 -473238 -137568 49118 -253400
8308 121299 52973 -108308 -212291 -250211 -14716 -132226 -187156 -114157 -117022 -26270 348442
8296 -52734 -146316 64627 -25997 -269825 241159 -25379 -73846 -126161 425955 -203099 -109171
8285 -109171 -141643 -183585 -50058 196231 -237575 -28525 -140970 -215901 -234527 -364917 -174408
8273 2200 83832 -470142 60105 -136631 175957 -525091 -317409 -69686 -108269 271093 -132466
8261 256693 -101321 -221577 130816 -138087 -143313 -2131 -152983 184240 25705 82194 -145647
8249 -119690 -76800 -144722 -12977 344097 -28546 11898 186191 32418 5823 12789 -166839
8237 200939 92217 -309836 -163960 74887 159286 -120956 -24133 67514 -166629 239397 -182644
8225 -174641 -49739 -75429 -78958 -41957 213905 115787 -221002 -128848 -72641 -233854 -185618
8214 -185618 -16452 -222938 -76736 -198647 102644 -93281 21147 161180 -193013 -198069 -23237
8202 -151468 109256 -241150 263766 -104986 -209615 -164249 -136419 65940 -17530 -341177
8192 -341177 -109187 100298 -59217 28113 -316080 -98616 -302779 -153441 29702 -48788 -190103
8181 -190103 16917 -153231 -170221 -66615 115151 166663 46130 92234 -104700 5144 -159284
8169 -321994 -123525 -200217 -387301 -75714 -176045 -128278 -181282 -226269 -161575 -181413 229981
8157 -35133 -228505 308723 -224791 85500 -256423 -123754 102149 45662 16106 -108615
8146 36518 -196442 -267510 192930 -218768 26179 -276482 -267393 216622 -95633 -157593 -60195
8134 -19942 -201407 -322180 -243689 -200423 297516 140194 -242111 -211141 -258141 416266 89328
8122 -27332 146683 67251 159237 -45103 111338 -63275 165626 -331949 140785 184131 216968
8111 216968 108706 -140261 -170853 -18885 -25911 -24740 157084 83523 -341954 91471 -123167
8099 -98430 -14571 -73301 143286 146780 305806 -281693 17434 -20892 26857 -151921 103313
8087 -39802 -147807 -80411 -117486 151297 -410379 108562 -223768 170834 -103206 23806
8076 32552 -208807 75659 109283 -148907 -98330 229416 -37956 125817 -230856 -376958 -191212
8065 -191212 -43117 100375 -56044 99966 34018 314369 -183375 -297619 82461 -276246 133247
8053 -66931 40713 -63731 11832 201558 -108314 -84830 85787 -13476 -105544 -191789 -28048
8041 -8537 -358456 33199 -48873 -72822 54204 -76546 -258763 267960 28519 -7985 36982 32400
8029 32400 424180 -17528 -164188 448014 -71997 -193926 116002 -415873 366 216509 83738
8017 93435 205070 -4057 -68799 -277651 517 117415 -160717 -39282 -279839 -108920 304273
8005 -148909 -238731 -111471 21557 266365 -86267 25146 270350 -47149 -24973 115530 192310
7994 192310 -344834 -51866 -251069 -277132 22764 -120276 29623 -84901 -41025 228753 -87157
7982 -59668 -316223 -142123 -164580 101844 -102623 90596 -44750 -139791 96622 22813 -35845
7970 -193194 99598 -38290 -308403 -54633 -128845 -112127 -111348 -225394 -115181 -492171 -204019
7958 -72216 -109317 70617 -10973 102047 17821 -188284 -106252 239437 83117 -226935 -175323
7947 -175323 -206261 -12175 -137338 -8184 207135 -30238 59289 -92642 -112475 114351 -57431
7935 299788 11072 18193 -28448 70149 -63176 -12132 -357418 -157948 -56891 -109030 77134
7923 -39282 66422 141759 -63653 -497408 -60116 117273 -155066 258305 127529 -73656 728
7911 15474 -71740 14412 163846 -148631 194210 -75440 -146189 241959 23137 -267092 -188441
7900 -188441 -80408 -238136 -233913 -103818 -26398 -219559 198097 156658 34589 -94191 -119974
7889 -119974 -63190 -108646 9850 142548 183361 106481 -38267 -107486 18723 21245 -249043 204886
7876 192649 51198 -144051 -128284 -114474 -224890 -55288 -357493 -218019 -288280 -10814 -305197
7865 -305197 -31915 -207714 175938 81409 -366520 320521 87589 73477 178158 -7405 -220306
7854 -220306 -473994 35329 -29237 17700 -89379 -246855 -71851 16179 19080 -275893 -125451
7842 107940 225585 118852 125342 74034 -84624 77383 256982 -7609 235 -80133 -77248 40467
7829 -232701 243380 -40848 1523 -57480 136990 -232603 35861 -343866 116669 257589 -156637
7817 6146 -110130 94709 28579 240037 -276407 -78216 125089 -86128 -242547 -83254 -433564
7806 -433564 -64694 -71426 -208482 -131010 -113623 123897 -282696 177309 -430448 184940 -89962
7794 148273 -174955 -19659 71939 212742 -139835 -86350 -157076 -250711 -126766 4430 114567
7783 114567 -117578 -450999 15187 89536 -129550 -102138 265011 21154 196762 -24686 79895
7771 -17582 74341 -79291 -99166 96625 -91458 -211913 -205475 331676 165181 -203396 27863
7759 51220 -182471 -154416 -199677 -241819 46937 -322963 -36639 -134961 199596 -174405 94188
7747 -235921 122092 -10486 157442 22051 116458 160126 216494 -116165 171325 -335162 34496
7735 -54890 -133318 -59679 42104 -183849 -361249 -424422 89285 114070 -403583 -289670 -79580
7723 -88827 -315635 284376 -284097 -149338 223109 -9694 -17310 141115 55826 225465 117982
7712 117982 -156630 -19196 -196352 124232 -175197 -268535 31290 69557 -201475 269289
7701 -52786 -103114 163798 -114758 51536 157009 251580 322692 -152783 -58163 -52660 -303576
7690 -303576 -244174 -155966 -39943 134218 -249124 -217627 -278027 -153758 -108539 -170435 -133450
7679 -133450 88894 241505 -15407 -110751 -136712 -320053 238638 20009 292984 136668 -207669
7667 -83744 -74260 -94262 -124957 -45 -80430 -105086 -34788 -65566 -96477 -212946 -217135 286923
7654 -7703 -141284 -62335 -45591 131817 10977 172410 58917 25800 15887 13481 317907 26249
7641 286258 -105240 -30632 -356415 67042 -230379 45293 -45651 52128 -155507 -18857 -112199
7630 -112199 236527 -203000 124754 262932 -55940 -175391 11701 -70211 -56982 -52114 -16493
7618 -16582 -18270 265105 -160094 225171 -65281 45510 147040 -142875 221503 180795 -60224
7606 117936 -62367 145367 229628 -147525 -435295 -113588 -220522 16987 135377 23358
7595 -188924 -171962 202465 -344611 223052 -112833 -89986 74147 -4040 -159918 42464 276403
7584 276403 -60544 298088 2364 394264 -111923 -32001 -405468 156485 274950 -195782
7573 58038 -43249 -100529 -299914 -83052 -267267 -65586 -19018 -30143 120207 -24423 20971
7561 -49 28578 53660 -588779 44493 -27272 -125305 -55615 -140515 -191821 59956 275581 103480
7548 -349094 -118752 -76743 -415299 -170356 -145741 -2850 -166207 195240 -168041 87690 180168
7537 180168 111113 -208708 -71942 -53008 -49794 267058 -190774 -89786 87244 -258591 179492
7525 414164 -113000 42393 126109 142002 466559 10114 20445 260371 -37766 26951 72263
7514 72263 -267475 -97126 235477 -94660 -165974 67588 96955 33973 -98704 -63060 240475
7502 69785 100319 69072 234437 65265 -93025 46518 -54275 195924 20833 93962 -209311
7490 -190941 -122665 -19978 -13768 -115826 -215940 -46176 -145521 -272334 59604 109744 -77579
7478 175207 49835 -151139 -133975 244839 86843 152967 -51019 -86870 60542 -65140 -195332
7467 -195332 -129227 -336931 -25314 154348 -194989 -100384 -252948 -6269 53199 -204965 50163
7455 -127961 -213612 32648 30593 -171675 -134221 21739 149073 -88786 35837 91174 51807
7444 51807 27482 161986 -109287 349579 -178118 -362984 -147969 175558 -116074 182146
7433 2383 -311306 -131083 29941 23174 259406 43225 -324018 -116243 -207760 11495 -245789
7421 124807 -444148 -78298 -151995 12010 -34969 278853 -206455 111484 -245689 -295306 -309490
7410 -309490 213989 -112480 -184009 -281116 75309 -93034 57173 25413 -182838 -241710 -63915
7398 -110243 -179498 210425 136297 -90235 -28810 -189528 -167637 -57396 -38599 112584 -321047
7386 1932 93702 -203654 213424 193417 134703 -151986 325228 12828 -113383 -132081 -208823
7375 -208823 -162229 -217914 355842 216018 -148936 -318242 -186084 56326 -107901 159266
7364 -137300 -76387 29650 -49062 -283863 27926 -178979 15658 -81687 204112 67720 27486
7352 -124192 6373 51364 -202924 -64805 -190138 108515 -27915 -344675 -76919 -64892 150211
7340 -140827 -250449 -171182 -163020 -234996 -55687 302680 107973 -141336 -45680 49198 -14107
7328 -83398 253763 588036 132155 4301 134947 -246786 87834 207411 -154848 -343436
7318 -343436 124582 457150 110814 205190 142456 -22494 380861 -27833 -217380 -104259
7307 50677 -648404 -226435 -202689 104095 39636 -120436 -23773 113027 136260 57265 -326210
7295 -114053 298384 -177575 210932 80148 -124945 -128938 -356439 -161799 419612 -168542
7284 -175073 -289896 83954 -138259 31125 194833 253516 91339 -79410 -132019 -238345 91800
7272 22076 20807 29030 110656 -189972 150907 -125396 -119209 30513 -136904 -170123 -155963 -90053
7260 -90053 31145 82495 -103454 -297295 -342686 96463 -244152 -142320 -142867 -4649 209231
7248 87430 -266433 -254030 -193653 -344103 -50691 3381 22702 -137638 -217740 -206762 -210445 -25609
7235 -121206 -135534 42453 29073 -244983 -54005 208179 -86399 67279 125317 -92522 239994
7223 114703 -80597 289939 79452 -196714 129017 -269575 90677 29817 -301952 746 -116843
7211 -479 -26148 279214 180695 202666 -304252 -43409 -229049 29910 80728 9813 166597 232324
7199 232324 -22858 101298 53476 -36014 -348473 192899 -70003 161445 -444757 -74682 -130482
7188 -130482 -138010 132266 15609 -39636 365450 -99649 177203 92693 44732 -208740 104576
7176 219641 -88112 -75953 -120555 68699 -105053 -308331 15958 -45816 90010 16119 -185118
7164 -70833 86330 -39674 82402 152452 -13125 46840 122030 -98267 85747 -191746 404965
7152 -320402 -104416 84930 66197 43130 -242164 -235176 1026 103751 3279 13948 -467437
7140 156403 289017 243234 210532 -47930 175869 -286400 -27102 -107079 -287075 -284837 -61549
7128 -61964 -37048 -9897 -99495 101778 82088 -148604 -110856 -230022 63634 8328 294800
7117 294800 137560 -198206 180215 -94045 -60229 144486 -301599 21295 -9002 -63822 -60780
7106 -60780 10986 27931 -18651 130774 -88880 40095 -21872 108757 348510 65037 -251004
7094 182427 218641 -359952 -292224 12765 -93601 53990 -216214 -182207 259143 -379267 -57155
7082 -89265 -143664 -71626 -283804 -258457 135620 96239 -135144 300038 -234338 -178558 48270
7070 -136898 183061 116590 19876 -257991 -159596 -254606 -151921 -87665 -77875 -338028 -167398
7058 -5505 -204183 12219 240475 18922 -151222 -1053 -81065 -132727 121775 108716 134078
7047 134078 30977 -104536 83064 153188 9655 -113175 153882 -33608 -116619 -165967 244922
7035 -11927 -123219 336376 108648 -100992 -45163 -11010 -10522 138012 -205446 145846 158606
7024 158606 90251 212234 -216644 48662 378515 -173501 113691 -148206 75060 -237053
7013 -14906 105068 10822 -57103 -233430 -160738 -144454 75255 -257085 -211435 -83442 -120033
7002 -120033 125131 -80884 -39456 -312624 67443 -413336 25172 10885 -61841 -348861 31106
6990 30395 39817 -286461 27265 -211120 273026 83913 123243 -117831 91251 -64653 -215066
6979 -215066 -206997 217843 362536 93857 351358 -46350 280243 -101077 20988 -74614 -15434
6967 -107064 -307839 204289 80948 247589 -6510 -104757 -219687 -60607 -333046 39997 -127885
6955 -156911 -150884 -90725 -62898 -58548 -109461 -283570 -293376 -399175 99457 98815 -112793 -14506
6942 227260 -251469 -39340 41313 81552 -225690 115727 -37313 -299058 -251951 -118500 120463
6930 -65942 -225796 -38202 -418395 -414359 -23345 308138 15424 -119463 -120329 -118133 355931 -118123
6917 -258101 -361948 -100170 -169899 -177458 154113 117149 -195540 235563 -78460 319856 -170691
6905 -311900 213226 -10798 -75169 -214539 -3323 -154812 111200 -76677 -35977 -141633 25875
6893 116798 126788 -155539 -117730 58873 303968 -186465 -464903 240797 -74091 -53432 47904
6881 112543 -118798 -227421 402 -30037 86883 -50854 -31238 302958 214781 -270452 -55539
6869 107079 -155633 192225 249188 321508 134763 204177 -221569 -27457 -68610 73859 -33655
6857 60101 -242952 -90253 106035 -205189 310369 38545 -159515 27918 66461 -183279 79890
6845 -34949 217384 -23450 144643 7923 -7590 -56061 36013 125967 237118 -143230 64904
6833 237400 48624 83704 -173899 75258 301358 -86241 208453 115103 189756 177148 -189185
6821 -333380 -160550 137364 -53299 45770 -202818 -465799 189976 -289645 -123095 -177672
6811 -177672 -507225 -138551 -37882 201844 -54215 -16859 -345166 237115 15497 119724
6801 119724 -174379 -9406 -58862 -199284 -10263 -111145 -134617 29389 78253 -172214 -188163
6790 -188163 -160589 6242 -82860 -45209 -325005 -63316 4637 -195879 -90665 -7108 2576 4155
6778 4155 -89437 65579 -280935 99368 9407 -27242 82612 38577 267087 249201 271354 -145997
6765 -102817 -115114 -247586 117836 123860 -28075 162676 48728 -39098 -41751 312052 -256176
6753 -76386 19657 112904 -45834 -87727 -137904 -94706 295772 -132745 46192 -97034 12328
6741 -337340 -37642 130469 -108271 -74988 66389 -239667 -68275 142770 68637 -147524 -59652
6729 112336 121525 155825 126331 120366 100357 211621 -63166 94768 -258719 -82386 27129 -111460
6716 -129191 -201332 -74971 322802 -94444 43691 73233 -162614 58775 145841 39385 138533
6705 138533 433167 167483 -3396 139479 64696 355005 -55213 -71900 -241264 359812 -74428
6693 101524 -81092 -339115 17381 -166964 76508 -142033 -269569 -204859 -74094 6430 98795
6682 98795 -136097 56584 196989 -351567 101231 -86119 16409 -77566 75732 171988 252720
6671 252720 17265 -379813 -236322 82898 -64781 129705 -86964 245248 98322 -296810 -254799
6660 -254799 -2900 96856 -353586 -186856 85256 37012 -108953 35178 -45874 -250357 325984
6648 11729 -28795 -60255 72507 83316 -308757 -82919 -104845 222807 93084 205816 -193675
6636 -98876 -353282 -157756 171218 7847 165866 216371 -17541 52205 145130 -7273 39754
6624 -35763 242514 29776 -304556 42381 -58701 -14220 -55203 106965 -332946 -31807 22081
6612 175308 65448 146320 92565 -224474 67898 89611 -406208 -243880 -37757 28448 40622
6601 40622 147221 220031 -57721 -3237 -239255 -20433 -325590 -170396 -88197 148362 -78986
6589 -167386 -180558 1100 64143 -45352 -77023 972 117837 76864 -24024 -139459 44675 13165
6576 94356 222657 -89516 313926 50356 -51387 -141139 -170748 -221640 -64293 67046 -153287
6564 47261 -217287 -8586 235851 178891 -209665 -130443 76350 44916 -14483 -359367 -234236
6553 -234236 2272 85831 614 77955 -268472 -148313 37277 -130050 -90228 -283531 78465
6541 256255 306087 -39226 -103882 251317 -2951 -237850 127652 -127467 39758 -8004 -214346
6530 -214346 158481 22690 97360 93801 -188438 85010 -197528 323385 -92471 -194811 -146619
6519 -146619 22618 -300509 136581 109149 -131190 -374382 -225211 80823 154058 -207776
6508 -230022 -109060 92867 52721 -152083 41849 44833 71990 -113152 -276296 -360113 100527
6496 -51725 -110613 -156524 76391 -247684 -131367 99115 -20817 127478 133769 -24170 13197
6484 186535 1557 184908 316529 114866 392443 334344 107033 364643 150029 -281248
6473 299029 -37806 93060 -72614 85729 63226 257915 40382 -97893 -253195 155090 -214501
6461 -213848 -74956 -189770 11372 164939 -369828 37394 118803 -96706 -27347 -172992 -103836
6450 -103836 114007 10092 -57851 -166193 -163177 -29208 -95407 -216674 17459 -51518 -115936
6439 -115936 -36899 -105493 -1493 145212 135520 -173562 82347 78782 -240154 -251643 -102798
6427 28553 218088 -64188 339297 -65400 74239 -89904 39488 99900 -108014 -127544 273180
6415 134938 -113176 58178 143012 -243642 260415 -364494 -131755 137960 -60396 -238382
6405 -238382 168357 41823 -12577 -43480 -266504 147939 -42556 -173287 57329 96478 -99661
6393 36088 -346550 -249115 -16647 104662 85713 -86064 33343 -114795 -243183 57825 -122708
6381 120258 -55753 -57637 -102725 104176 -62442 18995 -30626 3399 -55961 -312411 159183
6369 -187837 -216374 42745 218743 -145430 -264300 21327 -231647 98984 122466 43754 39925
6358 39925 67803 242423 -133426 -109178 -84730 -157076 -213233 45061 26581 63679 5428 76180
6346 76180 -143061 201603 -49751 272900 220735 -171 -133600 50174 -112718 -137890 47235
6334 -45051 220655 290853 -366479 -181063 -147628 208320 -274143 721 -48959 -80058 -5808
6322 13399 -392679 153953 128308 149808 -174802 -214808 -354130 -175286 -361279 27501 95912
6311 95912 24786 -182741 -63734 -187802 126070 -15398 -143761 139878 136756 -260274 351017
6299 46182 26131 10526 -184056 -239039 -187667 -120128 -240861 -27802 -53664 -301549 53373
6287 -331041 87106 75233 118184 -66064 243020 -198284 -503526 -145940 -53195 -138168 204131
6275 -125660 -220487 257723 109179 -391673 161487 61816 73790 -151215 171282 205848
6265 205848 79060 247158 -89963 -111080 144540 188298 67957 57696 146495 158245 55092
6253 205955 48043 52164 -45268 208044 94283 -179815 -198881 227591 17454 -104610 -31048
6241 -85126 50251 -38503 -1297 65679 256954 -118896 233057 -56976 126755 -23849 32366
6229 -24811 226275 -33672 73509 -69426 82476 -136068 89296 43568 -112028 -242411 -130479
6218 -130479 -86187 -83810 -233486 -39250 -115333 46449 -102023 243185 -173796 -66290 125537
6206 161016 183305 -315409 -67992 154549 -57804 138446 -186402 -113346 12189 -77303 -125800
6195 -125800 -150136 -290946 238381 -94805 334799 -159006 -317797 69095 -128984 -64646
6185 -64646 -118910 -23778 -6266 107160 -43297 91245 -95012 -62499 -183750 -405753 60531
6173 263620 -221224 29721 207433 44898 -239669 -183308 203596 -112150 -66831 4089 -93663
6161 -209841 -32733 -375119 -8577 -70523 125800 48553 28066 -355888 -180550 -433182 78987
6149 -836 97864 47633 45288 -187282 10825 -258065 -139978 -327391 -148589 -270134 -63498
6137 506383 -217371 -175464 182695 -7667 96421 -50054 -407138 19685 -29714 66016 391733
6126 391733 262162 148975 188424 -23706 -199759 -54660 26975 -61724 -185645 19244 134664
6115 134664 -195051 170913 71883 21669 -142375 -65607 36298 -8738 238241 -86218 -258104
6104 -258104 62900 60688 -278502 -16549 68098 40197 161245 -14803 58943 38835 70968
6093 70968 168915 77132 -203096 172144 67775 81130 9576 -74293 -20478 -127160 -151506
6082 -151506 143421 58731 -84306 -26309 -150105 -10688 -250048 291092 -39902 -35702 121899
6070 46982 -186028 46819 352650 -85186 -399545 -204507 -92074 -86556 -8002 -33509 -522809
6059 -522809 126573 -91256 1241 -5081 39787 -91332 -276359 -39280 -84576 221992 119477
6048 119477 -1266 -166735 52195 -229826 41679 320997 49685 43716 190814 -91547 24886
6036 -229708 -75368 6255 -176578 66107 -41571 -96913 -106655 37388 -59170 -137754 -199026 158661
6023 31392 -157134 252493 -190043 -64768 405042 227227 18657 127000 -87032 -227199
6013 -227199 -36615 -23449 -140077 90763 105655 207168 6238 -184369 80954 34898 122278
6002 122278 -112086 -241096 -88056 49016 68585 -224077 9621 -20168 191027 -75564 -38610
5991 -38610 -96952 205601 -104293 -438879 -71277 -45873 -247703 -181886 -11472 -85800 148050
5979 -87068 89860 -211851 -105592 -129825 157142 88981 92676 -117791 133178 85885 249160
5968 249160 3545 -387726 241046 27738 -294149 14352 -89607 63587 132725 -53587 58015
5956 -80756 97222 -267679 196250 -30957 -175602 -181740 -96013 -377764 -170934 -60440 111134
5944 -100932 140862 -21882 -7799 189092 341129 -351442 -635 184202 71643 -162856 29867
5932 -86353 -261881 31956 -227249 97820 -160931 -208525 -54833 213750 -126137 -295270 -110665
5920 -30657 -110144 -157414 252401 18293 156441 -67640 -33308 326049 156065 173663 264639
5909 264639 53907 301059 191153 -169668 8674 -49738 -261228 -140354 146383 -20499 649
5897 -75276 159365 208050 117540 -60373 302395 170190 -209854 19608 235234 33910 130211
5886 130211 -68998 -99816 -100927 29728 144751 -75887 45876 -266057 -80168 41737 114449
5875 114449 -222080 80847 97136 48600 175407 50345 221207 49023 -65858 -363606 -53532
5863 -125951 -15835 -119477 88209 -74017 -30981 78819 176706 -151919 -129130 195867 79390
5851 -245417 219666 -242361 115226 -71776 167866 62840 -224253 -283254 214721 167993
5841 167993 72527 -299820 106870 318519 162644 -23188 246530 216929 -110339 158438
5830 -131566 -24173 152371 28864 156158 -520880 -223668 12625 -10489 75647 66526 142605
5819 142605 -246291 -74952 -25472 -264151 -334577 197773 -204246 -5456 -119768 275915 -274111
5807 -144287 241754 -86670 -210566 312341 213073 -99320 -318143 -670306 18994 -102885
5796 22040 313097 -375314 147738 139870 62121 295228 66180 -216466 274991 -36241 -144557
5785 -144557 -16325 -49336 -134459 120328 -73077 239902 64624 98368 -222931 185055 122172
5774 122172 -128613 -24307 -170492 -406211 -140053 91715 133629 -310502 -76467 -152682 266662
5762 108743 248362 -216870 -32663 72100 30663 -87850 186420 -9418 216574 -73605 12060
5750 -40407 104610 -224283 180578 21496 -282394 152487 -136844 -145965 -1115 -101902 24691
5738 21166 -73474 111189 -200678 -300367 196100 41188 192176 -4811 -30369 -215335 12643
5726 329369 293041 -287858 211286 -92127 230102 -208460 -403726 -92812 389520 -34837
5715 128567 -284872 217392 36818 -181011 -80960 89692 -60038 7810 -495553 -329682 60114
5703 315610 -80175 151930 245489 105163 46599 239697 -87340 112507 183173 -114348 348800
5691 253925 -3636 -2792 134937 189213 302367 87244 -163906 76510 -216865 4698 -320406
5679 -24420 -82020 -164183 -76110 -94181 -49528 -69348 -218473 -65104 -83371 173250 -136261
5667 -153593 110626 140944 -33307 136361 304141 -95614 47908 98978 99290 284602 -60352
5655 117724 -4469 44600 194481 -157816 -2607 -90917 223279 -16259 -25844 140256 127385
5644 127385 117064 428901 -351373 18974 204027 -220800 -45610 25322 383502 204496
5634 204496 58261 -154867 -200521 329610 54380 220927 -287595 8492 -23568 -67047 -4285
5622 -166417 -227106 -463765 16422 -84757 -113423 -13125 -218243 -133646 -81131 -155641 -234664
5611 -234664 -231336 53234 2218 -33885 216305 354368 93118 30768 55396 -145214 103251
5599 153483 -30964 117606 368328 -245480 -22333 169471 208081 -173629 134207 -111539
5588 -66255 164980 -227035 125836 -15327 154870 -91942 -231234 17136 -240004 -41600 259655
5576 -141830 -74589 -137436 -19768 -117207 -46570 -63981 23418 -9621 -214347 265608 -45929
5564 -10836 318537 209323 -301736 -176587 71137 44681 266067 56603 64761 81036 -32916
5552 -129923 -122844 -110616 440820 245824 -230821 99247 -114207 77222 90923 134034 -10942
5540 35378 -300354 -173758 -87443 -26344 395946 -131372 -421095 -151895 110668 -166946
5529 -158879 -399098 136562 264965 -34587 -217041 -224923 64192 137732 101736 -75949 313497
5517 116645 84839 -5033 294411 111043 184052 -55503 364824 -35110 288621 77883 24195
5505 39858 18764 70595 72205 117157 -90525 -95800 142969 14910 272990 156867 193367 -145987
5492 187276 104762 -37175 -118277 -14840 -99609 180686 -5094 -182425 255339 -7037 175818
5480 159897 171997 -309892 -173697 -104735 252779 7032 -195962 82829 -128843 -58043 -240603
5469 -240603 -87717 -19616 205484 141406 -56685 53655 41405 213698 -138375 213093 212210
5458 212210 -31143 222894 167483 -17294 -165256 183499 64897 87009 17723 175959 -22319
5446 144736 230184 18954 53947 192959 -5665 417933 -386609 125450 -281531 -229670 -7117
5434 -323048 -398884 -20561 -46485 190742 -280754 -140487 202210 -202770 105717 -25972
5423 231740 -307402 -85501 55639 -216023 87914 -77018 13964 3696 -248246 -262985 158743
5411 -85560 24853 64637 134513 250635 -99758 -54557 -306646 129832 85054 73352 -356451
5399 74888 -211997 247206 -54576 -165129 26611 -149674 150365 24258 117118 113437 -163161
5387 -155270 57842 -43792 148824 -19771 -82414 77306 -228569 -167450 12266 294329 23857
5375 80616 19455 228870 219268 42390 -230076 29936 -151639 -85111 -116272 -19975 -137119
5364 -137119 -98860 220917 225463 21329 203532 131831 43261 -364168 89432 224105 14439
5352 -268388 5740 -93405 135569 -93362 46663 -241781 -38305 -135947 119539 239136 -302325
5340 29840 -260979 -60657 209642 -190021 259129 140121 -7320 -103518 -31097 154222 279874
5329 279874 25567 13081 -20364 162591 30766 158801 -94291 -225889 255038 322916 -110552
5317 451730 190435 339620 -18362 -253537 -12008 -363088 293089 -91079 -6306 -24025 141673
5305 -132595 -41964 62664 18368 -140650 -171794 -352620 161551 -217306 145555 -101639
5294 -227416 -67160 5146 252118 -214387 122699 -90150 -283692 27936 93056 280939 387264
5283 387264 -97647 15637 60420 137013 126635 -219170 64719 -190109 -253324 -22378 -50178
5272 -50178 5105 80300 15913 64161 15664 123699 -157455 -198927 -69716 -114417 1322 157503
5260 157503 184293 1062 104711 260096 181643 -25160 -14297 264625 -187514 26545 144742
5249 144742 -100962 -246044 303219 172092 43824 -60319 12637 171355 -68386 -10336 -54234
5238 -54234 35617 -20125 317781 -363886 -316840 -152037 23248 -301059 19756 54913 -345872
5226 86043 -89267 78950 -143545 48359 9761 -57513 -246592 -51367 21649 161980 72681
5214 155023 -247287 53793 -11971 13967 -229481 130593 -138870 -105170 -5704 -37872 177829
5202 97001 -9457 280094 -188372 266359 -174771 -247996 -475188 -198351 138312 243273
5192 243273 -135142 82231 53019 -145887 -196895 -208543 231811 82053 -42985 197233 -383858
5180 276013 -232612 -241133 329133 -14874 -97168 -60312 -387097 341011 174334 -6063 -186585
5169 -186585 170563 15315 141130 288333 -8864 -14499 225720 -109173 143660 70671 134467
5158 134467 -208157 -27946 432082 8569 -251652 130183 113780 -27368 -182987 92436 372255
5147 372255 -70108 169925 -163585 334016 -1555 -349828 -203937 -60246 -105206 158391 156841
5136 156841 -6308 20270 -215006 -156500 -332497 -67959 55894 -223365 27904 320864 10294
5124 -260206 14731 -51936 -50455 35508 -82003 -106980 -132269 -387074 122016 -92769 156277
5112 -75732 113343 34016 68172 191323 97500 20312 312874 8905 153722 50740 516 28658
5100 28658 50633 96409 -15303 275511 41821 89710 -106456 176321 253215 -95776 165939
5088 -5802 32510 -170044 -173351 213536 -118599 -18232 -281301 -34921 199763 165172 -193902
5076 89891 175398 -6524 25720 16142 298712 -192781 111212 46495 38263 9341 -127749 -16111
5063 -233723 -132283 -97534 34461 -142445 16851 -231216 49256 -90152 -16654 136454 -97743
5051 -141896 295425 387292 -70078 -51855 -22728 115512 -10297 131870 -19727 -59014 133588
5039 223936 -55662 -286335 169951 -157787 197468 167027 -186312 2832 85801 175797 215282
5028 215282 -12632 74988 -167289 -13183 57323 264863 194312 -15753 119468 60332 -105639
5016 188498 77938 -280958 -38073 286857 -330513 -41289 -41437 -327802 74052 -8577 154001
5004 -71781 35370 -264024 -53937 -122503 43692 53647 222769 112222 15072 121648 -12631
4992 -32368 -267970 -311479 342085 -63382 -211673 -125658 12823 -94973 -116431 106686 107709
4981 107709 -44644 16560 316966 368741 187467 -229344 -82431 173262 -141565 142942
4970 171172 -216660 266382 159124 -263214 85871 -389453 -2663 -106316 8633 156339 240474
4959 240474 -337261 360497 108048 106537 -232289 70543 -20812 -262514 178233 159117 -221984
4947 -126464 -34915 173704 19956 -170492 -70140 -304411 43825 137451 220585 123773 -155618
4935 -4287 105100 93784 -15127 -62950 39865 266700 337832 188135 212911 74046 73156 -211584
4922 -34208 117150 51505 -277473 -28398 -208139 -32606 51015 141637 17341 103888 340835
4911 340835 349373 -361929 78072 -266661 -136624 376889 -44446 36583 -120167 -61531 105847
4899 256975 56215 -158366 -183810 378557 109644 -78476 46889 62759 30249 -91471 -101436
4888 -101436 204445 119799 218743 92790 -9404 66520 146290 53323 -208495 51906 -46599
4876 132698 3867 -103620 -283200 -191547 39618 -34243 360929 -43634 -92654 -207695 -20173
4864 39057 130760 123789 173694 208660 -126362 4966 41878 67206 87034 -320233 212349 10845
4851 19843 -113030 -185997 -28958 112922 -124732 -142019 -110868 72266 864 15631 -269028
4839 227506 175994 -158827 60095 211854 139281 -137008 247578 23115 -291655 -105286
4828 -493 341038 296538 80584 228352 -54786 -11381 -8306 48316 177471 108709 -287575 -162028
4816 -162028 -229196 -105409 -143967 -98799 -150443 334110 109187 -128474 -42771 161485 118383
4805 118383 -123316 -174602 -52495 -103355 36204 -16340 -119456 15578 33000 69528 121591
4794 121591 18821 -45693 -146639 287521 300938 -268194 -121214 -186481 220347 -1557 -308867
4783 -308867 -97234 -63999 -140509 -47239 -81698 161098 -56757 315527 389102 -163867 278785
4771 -220490 139382 118556 -231765 -98025 -118713 -51278 231855 -21314 -305874 264072 -66995
4759 168806 -207163 -140100 60762 171839 -114162 176996 -125502 71105 60980 -5828 160957
4747 -3975 118962 -122905 -376670 240637 68136 23408 -314358 60516 22515 65627 -141250
4735 -189422 -2078 -260369 -31357 389778 -19577 189110 -10979 99755 -9325 185146 338103
4724 338103 -51348 39064 -99362 -40748 215036 326863 3265 -79112 -89778 11271 103412
4713 103412 -118737 -63265 83875 19238 51531 116170 161452 -66400 135905 -414731 -189874
4701 -3867 36149 -66971 167916 174825 -258455 45185 301914 39293 -113049 -249320 -90732
4689 -54546 38936 155863 -108890 -34659 43583 -54029 50555 37759 285034 81578 -91418
4677 9297 232683 141679 44921 -45350 -8431 -4154 43619 151592 29018 -162033 -105578 16230
4664 -169339 387286 -67244 42928 -47276 124219 89759 138167 68384 212376 -214205 173254
4652 -130618 205648 -9594 -76431 -215975 -229128 137162 137438 252729 -173659 -228294 60808
4640 42733 -114332 28097 38343 60861 235263 214860 -43878 -242680 -199386 -147530 -195457
4629 -195457 -10458 88251 -163854 241729 -22223 -306374 61316 186754 -68372 143614 33405
4617 -256393 131981 276623 49501 -261588 484456 357570 -149002 -20468 107271 -3241
4606 76690 -51612 155702 -12855 42131 17381 -101541 -103750 -20553 93903 141549 -101127
4594 -98506 251440 -28733 -131233 72035 111463 128845 -142563 -116555 446519 3917 -240598
4582 -248602 356506 -178648 10894 -262649 -51088 103011 20353 -154839 190904 -117928
4571 137347 -166570 69946 144973 -114732 65126 75097 33502 98472 179479 263763 -99828
4559 70234 286349 -101213 -350170 -39259 59524 78368 -57969 81182 354734 237091 364496
4548 364496 111993 -93751 -291073 -259209 -78676 193331 179676 -54648 -114737 198747 -69250
4536 -151354 -102696 -85479 22050 -111478 74603 -259834 -40038 -141344 -60650 -109712 123871
4524 -177172 274608 137469 57129 9637 162595 -226135 -21503 -248133 77199 284608 271739
4513 271739 122870 287303 26218 -85068 -8186 216768 -40454 151393 179772 -258080 124721
4501 39422 272581 -160185 179264 -36968 252159 -259687 -153441 190010 -5105 -81099 -33282
$$ [...]
##END NTUPLES=NMR SPECTRUM
##END=
