
##TITLE=AC1409_CRIAH12218_7652841_IGf1nGLMjE
##JCAMPDX= 6.0         $$ Bruker NMR JCAMP-DX V2.0
##DATA TYPE= NMR SPECTRUM
##DATA CLASS= NTUPLES
##ORIGIN= BRUKER
##OWNER= Administrator
$$ 1.72 TOPSPIN		Version 2.1
$$ 2013-03-19 23:29:05.196 -0500  Administrator@X
$$ Compression mode = diff/dup
##.OBSERVE FREQUENCY= 400.02188249412
##.OBSERVE NUCLEUS= ^1H
##.ACQUISITION MODE= SIMULTANEOUS (DQD)
##.ACQUISITION SCHEME= undefined
##.AVERAGES= 64
##.DIGITISER RES= 22
##SPECTROMETER/DATA SYSTEM= spect
##.PULSE SEQUENCE= noesygpps1d.comp
##.SOLVENT NAME= COFFEE_meoh
##.SHIFT REFERENCE= INTERNAL, COFFEE_meoh, 1, 14.96076
##AUDIT TRAIL= $$ (NUMBER, WHEN, WHO, WHERE, PROCESS, VERSION, WHAT)
$$ ##TITLE= Audit trail, TOPSPIN		Version 2.1
$$ ##JCAMPDX= 5.01
$$ ##ORIGIN= Bruker BioSpin GmbH
$$ ##OWNER= Administrator
$$ $$ E:\/data/COFFEE/nmr/AC1409_CRIAH12218_7652841_IGf1nGLMjE/12/pdata/1/auditp.txt
$$ ##AUDIT TRAIL=  $$ (NUMBER, WHEN, WHO, WHERE, PROCESS, VERSION, WHAT)
(   1,<2013-03-19 23:28:59.352 -0500>,<Administrator>,<X>,<go>,<TOPSPIN 2.1>,
      <created by zg
	started at 2013-03-19 23:17:29.602 -0500,
	POWCHK enabled, PULCHK disabled,
       configuration hash MD5:
       86 BA 57 50 F2 9D 5C 9B 26 00 A9 28 5F 66 2E 89
       data hash MD5: 64K
       9F 17 E2 13 05 61 B9 D5 42 0C 7E F7 8C 45 26 FB>)
(   2,<2013-03-19 23:29:02.446 -0500>,<Administrator>,<X>,<proc1d>,<TOPSPIN 2.1>,
      <Start of raw data processing
       efp LB = 0.3 FT_mod = 6 PKNL = 1 PHC0 = 0 PHC1 = 0 SI = 128K 
       data hash MD5: 128K
       97 E0 47 A5 FB D0 90 71 4B 77 37 54 0F 1B 07 97>)
(   3,<2013-03-19 23:29:03.508 -0500>,<Administrator>,<X>,<proc1d>,<TOPSPIN 2.1>,
      <pk PHC0 = -79.7937 PHC1 = 0 
       data hash MD5: 128K
       52 BE CC 2B 91 B5 59 89 77 A4 E2 05 A9 74 AE 3B>)
(   4,<2013-03-19 23:29:04.149 -0500>,<Administrator>,<X>,<proc1d>,<TOPSPIN 2.1>,
      <abs ABSG = 1 
       data hash MD5: 128K
       C0 B2 02 79 67 AA 4B F6 A6 22 1B DB 7B 68 76 9D>)
(   5,<2013-03-19 23:29:04.336 -0500>,<Administrator>,<X>,<proc1d>,<TOPSPIN 2.1>,
      <abs ABSG = 2 
       data hash MD5: 128K
       66 53 45 6D 52 F4 11 FD 8C A9 B8 C5 0F 8B E7 5A>)
(   6,<2013-03-19 23:29:04.508 -0500>,<Administrator>,<X>,<proc1d>,<TOPSPIN 2.1>,
      <abs ABSG = 3 
       data hash MD5: 128K
       7D 2E EB B2 9B 84 66 64 6B 6E 4C 41 B9 B6 38 DD>)
(   7,<2013-03-19 23:29:04.680 -0500>,<Administrator>,<X>,<proc1d>,<TOPSPIN 2.1>,
      <abs ABSG = 4 
       data hash MD5: 128K
       F1 99 A8 A8 21 D2 CE A7 5B 0E 3E DE AD A7 EB 7D>)
(   8,<2013-03-19 23:29:04.868 -0500>,<Administrator>,<X>,<proc1d>,<TOPSPIN 2.1>,
      <abs ABSG = 5 
       data hash MD5: 128K
       BE F2 9F E0 D0 00 E9 15 E4 75 82 06 A6 5C 68 2F>)
$$ ##END=
$$ 
$$ $$ hash MD5
$$ $$ E5 38 AF 73 72 D9 5C 00 2F F6 89 CE C5 96 C4 CE
##$RELAX= 
##$RELAX= 
##$RELAX= 
##$RELAX= 
##$RELAX= 
##$RELAX= 
##$RELAX= 
##$RELAX= 
$$ Bruker specific parameters
$$ --------------------------
##$DU= <E:\>
##$EXPNO= 12
$$ [...]
##$TP07= 0
##$TPNAME0= <>
##$TPNAME1= <>
##$TPNAME2= <>
##$TPNAME3= <>
##$TPNAME4= <>
##$TPNAME5= <>
##$TPNAME6= <>
##$TPNAME7= <>
##$TPOAL= (0..7)
0.5 0.5 0.5 0.5 0.5 0.5 0.5 0.5
##$TPOFFS= (0..7)
0 0 0 0 0 0 0 0
##$TUNHIN= 0
##$TUNHOUT= 0
##$TUNXOUT= 0
##$USERA1= <user>
##$USERA2= <user>
##$USERA3= <user>
##$USERA4= <user>
##$USERA5= <user>
##$V9= 5
##$VALIST= <valist>
##$VCLIST= <CCCCCCCCCCCCCCC>
##$VD= 0
##$VDLIST= <DDDDDDDDDDDDDDD>
##$VPLIST= <PPPPPPPPPPPPPPP>
##$VTLIST= <TTTTTTTTTTTTTTT>
##$WBST= 2048
##$WBSW= 25
##$XGAIN= (0..3)
0 0 0 0
##$XL= 0
##$YL= 0
##$YMAX_a= 6027845
##$YMIN_a= -12689706
##$ZGOPTNS= <>
##$ZL1= 120
##$ZL2= 120
##$ZL3= 120
##$ZL4= 120
##$ABSF1= 14.96076
##$ABSF2= -5.597422
##$ABSG= 5
##$ABSL= 3
##$ALPHA= 0
##$AQORDER= 0
##$ASSFAC= 0
##$ASSFACI= 0
##$ASSFACX= 0
##$ASSWID= 0
##$AUNMP= <proc_prof1d_extract.lims>
##$AXLEFT= 0
##$AXNAME= <>
##$AXNUC= <1H>
##$AXRIGHT= 0
##$AXTYPE= 0
##$AXUNIT= <>
##$AZFE= 0.1
##$AZFW= 0.1
##$BCFW= 0
##$BC_mod= 0
##$BYTORDP= 0
##$COROFFS= 0
##$CY= 15
##$DATMOD= 1
##$DC= 0
##$DFILT= <>
##$DTYPP= 0
##$F1P= 0
##$F2P= 0
##$FCOR= 0.5
##$FTSIZE= 131072
##$FT_mod= 6
##$GAMMA= 0
##$GB= 0
##$INTBC= 1
##$INTSCL= 1
##$ISEN= 128
##$LB= 0.3
##$LEV0= 0
##$LPBIN= 0
##$MAXI= 10000
##$MC2= 0
##$MEAN= 0
##$ME_mod= 0
##$MI= 0
##$NCOEF= 0
##$NC_proc= -2
##$NLEV= 6
##$NOISF1= 0
##$NOISF2= 0
##$NSP= 0
##$NTH_PI= 0
##$NZP= 0
##$OFFSET= 14.96076
##$PC= 1
##$PHC0= -79.7937
##$PHC1= 0
##$PH_mod= 1
##$PKNL= yes
##$PPARMOD= 0
##$PPDIAG= 0
##$PPIPTYP= 0
##$PPMPNUM= 2147483647
##$PPRESOL= 1
##$PSCAL= 4
##$PSIGN= 0
##$PYNMP= <proc.py>
##$REVERSE= no
##$SF= 400.020009733788
##$SI= 131072
##$SIGF1= 0
##$SIGF2= 0
##$SINO= 400
##$SIOLD= 131072
##$SPECTYP= <>
##$SREGLST= <1H.CDCl3>
##$SSB= 0
##$STSI= 131072
##$STSR= 0
##$SW_p= 8223.68421052631
##$SYMM= 0
##$S_DEV= 0
##$TDeff= 65536
##$TDoff= 0
##$TI= <>
##$TILT= no
##$TM1= 0
##$TM2= 0
##$TOPLEV= 0
##$USERP1= <user>
##$USERP2= <user>
##$USERP3= <user>
##$USERP4= <user>
##$USERP5= <user>
##$WDW= 1
##$XDIM= 131072
##$YMAX_p= 394751813
##$YMIN_p= -12048
##$CURPLOT= <Network HP LaserJet P1505>
##$CURPRIN= <$Network HP LaserJet P1505>
##$DFORMAT= <normdp>
##$LAYOUT= <+/1D_H.xwp>
##$LFORMAT= <normlp>
##$PFORMAT= <normpl>
##$SURQMSG= 1
$$ End of Bruker specific parameters
$$ ---------------------------------
##NTUPLES= NMR SPECTRUM
##VAR_NAME=  FREQUENCY,     SPECTRUM/REAL,   SPECTRUM/IMAG
##SYMBOL=    X,             R,               I
##VAR_TYPE=  INDEPENDENT,   DEPENDENT,       DEPENDENT
##VAR_FORM=  AFFN,          ASDF,            ASDF
##VAR_DIM=   131072,        131072,          131072
##UNITS=     HZ,            ARBITRARY UNITS, ARBITRARY UNITS
##FACTOR=    0.0627417313425164, 1,          1
##FIRST=     8223.62146879497, 795,          -63061
##LAST=      0,             3801,            -63331
##MIN=       0,             -12048,          0
##MAX=       8223.62146879497, 394751813,    0
$$ Real data points
##PAGE= N=1
##DATA TABLE= (X++(R..R)), XYDATA
$$ [...]
61752D62167L459L115K847K920L016K303N63j369k647l378m081m660m562l793
$$ 462167 465626 468741 471588 474508 477524 479827 480390 479021 476374 472996 468915 464255 459693 455900
61738D55900l000k661k662k744k760k478j702p82l97n85n46K47J207J466J142
$$ 455900 452900 450239 447577 444833 442073 439595 437893 437111 436714 436129 435583 435830 437037 438503 439645
61723D39645J098J638K075J766R72M90P97J772K960L799L825L019J942J260J047
$$ 439645 440743 442381 444456 446222 447194 447684 448481 450253 453213 457012 460837 463856 465798 467058 468105
61708D68105P46o4j117j795j968k141k722l415l662l421l133l001k797k486k475
$$ 468105 468851 468787 467670 465875 463907 461766 459044 455629 451967 448546 445413 442412 439615 437129 434654
61693D34654k951l408l303k875k796l127l265k914k572k832l610m304m401l761
$$ 434654 431703 428295 424992 422117 419321 416194 412929 410015 407443 404611 401001 396697 392296 388535
61679C88535k551j258m94n38j099j660j946j916j610j167q43p19n44j37J91l6
$$ 388535 385984 384726 384232 383694 382595 380935 378989 377073 375463 374296 373453 372734 372190 372053 372244 372208
61663C72208p61j389j480j088m13N01J500K168K244K011J978K332K899L495L970
$$ 372208 371447 370058 368578 367490 367077 367578 369078 371246 373490 375501 377479 379811 382710 386205 390175
61648C90175M042L435K284J076K20k01k89j92m3K54J090K586L980M114K710P60
$$ 390175 394217 397652 399936 401012 401232 401031 400742 400550 400507 400761 401851 404437 408417 412531 415241 416001
61632D16001n37q07l81K85P09M56l51j000j123j236j837k506k658k664l244m032
$$ 416001 415464 414657 414276 414561 415270 415726 415375 414375 413252 412016 410179 407673 405015 402351 399107 395075
61616C95075l931k811j749j412j354j254j638k719l600l502l003l139l815m154
$$ 395075 391144 388333 386584 385172 383818 382564 380926 378207 374607 371105 368102 364963 361148 356994
61602C56994l974l942m389m864m893m519m060l825m003m371m243l246k008j550
$$ 356994 353020 349078 344689 339825 334932 330413 326353 322528 318525 314154 309911 306665 304657 303107
61588C03107k025k639k667k087j284o78o21j115j657j786j650j631j593j162m81
$$ 303107 301082 298443 295776 293689 292405 291727 291106 289991 288334 286548 284898 283267 281674 280512 280031
61573B80031p3JJ44M17M63K45J34J56n7m67n56k56j50m16l84L63J165J166M92
$$ 280031 279958 279959 280103 280520 280983 281228 281362 281518 281461 280994 280438 280182 280032 279616 279232 279595 280760 281926 282418
61554B82418PK30J039K071K861K926K277J615J559J843J792J359J097J209J256
$$ 282418 282425 282655 283694 285765 288626 291552 293829 295444 297003 298846 300638 301997 303094 304303 305559
61539C05559R46O55Q69J406J601J128L87o1j80l44o32o58j82M34O71N06K44jk64
$$ 305559 306505 307160 308029 309435 311036 312164 312551 312490 312310 311966 311334 310676 310494 310928 311599 312105 312349 312348 312084
61520C12084m12m02o22j345k033j889j109o73q68q75j77N75O35L18L61P41Q63
$$ 312084 311672 311270 310648 309303 307270 305381 304272 303599 302731 301856 301679 302254 302889 303207 303568 304309 305172
61503C05172N15j7n20q66p32M0R61J345J135Q41Q13J008J300J480J193L42n75
$$ 305172 305687 305670 305150 304284 303552 303592 304553 305898 307033 307874 308687 309695 310995 312475 313668 314010 313435
61486C13435j016j078j154j119n91K21O54O73J024K101L307L918M055M330M793
$$ 313435 312419 311341 310187 309068 308477 308698 309352 310025 311049 313150 316457 320375 324430 328760 333553
61471C33553M769L675J764Kp33m00J65Q7o85j387j410r88q07j094j354j131o85
$$ 333553 338322 341997 343761 343763 343030 342630 342795 342882 342197 340810 339400 338412 337605 336511 335157 334026 333341
61454C33341o66j106j197l37R32J482R00k20j154j573j252m9J528K425K137J222
$$ 333341 332675 331569 330372 330035 330967 332449 333349 333129 331975 330402 329150 329101 330629 333054 335191 336413
61438C36413M22j04l42O7J142K100K262K052K193K417J919Q40J74K62M43L41M30
$$ 336413 336835 336731 336389 336456 337598 339698 341960 344012 346205 348622 350541 351381 351555 351817 352260 352601 353031
61421C53031R82J400J120M77Q4k6p1J58R21J813K092J625R85N63J12o78j554j925
$$ 353031 354013 355413 356533 357010 357094 357068 356997 357155 358076 359889 361981 363606 364591 365154 365266 364588 363034 361109
61403C61109j628j168j068j159q50l9O31O15J48k45n62j031j377j045j48N65P49
$$ 361109 359481 358313 357245 356086 355236 355197 355828 356443 356591 356346 355784 354753 353376 352331 352183 352748 353497
61386C53497Q16J024R54L49j84Q2Q50J094M42k80m0J212K563L190L128K953K930
$$ 353497 354313 355337 356291 356640 356456 356538 357388 358482 358924 358644 358604 359816 362379 365569 368697 371650 374580
61369C74580K825K482K182K155K207K149K228K616K783K121J007M86Q69J451J732
$$ 374580 377405 379887 382069 384224 386431 388580 390808 393424 396207 398328 399335 399821 400690 402141 403873
61354D03873K113L047M239N182N825O266O306N858N381N287N283M840M021L284
$$ 403873 405986 409033 413272 418454 424279 430545 436851 442709 448090 453377 458660 463500 467521 470805
61340D70805K721K027J177N74N75J198K179L031L183K409J079k43j279j976k339
$$ 470805 473526 475553 476730 477304 477879 479077 481256 484287 487470 489879 490958 490715 489436 487460 485121
61325D85121k616l195l958m158l449k569k324k263j338L90J709J990J960K472
$$ 485121 482505 479310 475352 471194 467745 465176 462852 460589 459251 459641 461350 463340 465300 467772
61311D67772L472M622O062P873R378R828R509R457J0173J1145J1559J1053R787
$$ 467772 471244 475866 481928 489801 499179 509007 518516 527973 538146 549291 560850 571903 581690
61298E81690Q177O568M913K848K91k164l777m463m777n202n809o494p146p527
$$ 581690 589867 596435 601348 604196 604487 602323 598546 594083 589306 584104 578295 571801 564655 557128
61284E57128p426o977o533o188n708n053m459l949l132j781k77P72J181J202J123
$$ 557128 549702 542725 536192 530004 524296 519243 514784 510835 507703 505922 505645 506417 507598 508800 509923
61269E09923J102J230J491J728J887K140K635L315M095M969N717N866N328M721
$$ 509923 511025 512255 513746 515474 517361 519501 522136 525451 529546 534515 540232 546098 551426 556147
61255E56147M550M357L353J765P57R73J815K395K487K243J627P46J78L28O85K67
$$ 556147 560697 565054 568407 570172 570929 571902 573717 576112 578599 580842 582469 583215 583393 583721 584406 584673
61239E84673j161k797l621l315k422j879k248l179l728l345k313j136N7J158J646
$$ 584673 583512 580715 577094 573779 571357 569478 567230 564051 560323 556978 554665 553529 553586 554744 556390
61224E56390J204N25P81K263M101N379N967O201O297O355O504O696O597N993N098
$$ 556390 557594 558119 558900 561163 565264 570643 576610 582811 589108 595463 601967 608663 615260 621253 626351
61209F26351M285L634K905J982J118P76J178K066K975L728M551N601O644P374
$$ 626351 630636 634270 637175 639157 640275 641051 642229 644295 647270 650998 655549 661150 667794 675168
61195F75168P873Q498R480J0797J2269J3459J3686J2473J0001O980M189K216J236
$$ 675168 683041 691539 701019 711816 724085 737544 751230 763703 773704 780684 784873 787089 788325
61182G88325P98J04j099k238k859l399m463n750o435o396o271o386o472o423o498
$$ 788325 789123 789227 788128 785890 783031 779632 775169 769419 762984 756588 750317 743931 737459 731036 724538
61167G24538o678o589o268o282o868p561p988q327q759r057r101r185r463r557
$$ 724538 717860 711271 705003 698721 691853 684292 676304 667977 659218 650161 641060 631875 622412 612855
61153F12855r028p821o002l661j368r5k56j176j941k387k898l728m865o071o807
$$ 612855 603827 596006 590004 586343 584975 584880 584624 583448 581507 579120 576222 572494 567629 561558 554751
61138E54751o542n553m849m907n050m492l424k446j544l32J074K226L095L977
$$ 554751 548209 542656 537807 532900 527850 523358 519934 517488 515944 515612 516686 518912 522007 525984
61124E25984M902N735O712Q149R762J1002J1942J3185J4871J6448J7500J8253
$$ 525984 530886 536621 543333 551482 561244 572246 584188 597373 612244 628692 646192 664445
61112F64445J9070J9948K0669K1144K1415K1522K1447K1045K0097J8618J6948
$$ 664445 683515 703463 724132 745276 766691 788213 809660 830705 850802 869420 886368
61101H86368J5329J3556J1312Q655N880L079K82k221m164n835p821j0188j2360
$$ 886368 901697 915253 926565 935220 941100 944179 944461 942240 938076 932241 924420 914232 901872
61088I01872j3875j4880j5739j6424j6537j5858j4750j3935j3743j3697j3064
$$ 901872 887997 873117 857378 840954 824417 808559 793809 779874 766131 752434 739370
61077G39370j1822j0689j0096r568q394o599m877l800l394l237k713j379O49K745
$$ 739370 727548 716859 706763 697195 688801 682202 677325 673525 670131 666894 664181 662802 663451 666196
61063F66196M414N622O485P014P363P890Q720R618J0524J1755J3438J5243J6906
$$ 666196 670610 676232 682717 689731 697094 704984 713704 723322 733846 745601 759039 774282 791188
61050G91188J8492J9857K0601K0906K1750K3709K6212K8434L0262L1820L2936
$$ 791188 809680 829537 850138 871044 892794 916503 942715 971149 1001411 1033231 1066167
61039A066167L3797L5269L7724M0220M1862M3177M5176M7740N0160N2529N5297
$$ 1066167 1099964 1135233 1172957 1213177 1255039 1298216 1343392 1391132 1441292 1493821 1549118
61028A549118N7938N9559O0432O1550O2946O3931O4676O6088O8320P0931P4317
$$ 1549118 1607056 1666615 1727047 1788597 1851543 1915474 1980150 2046238 2114558 2185489 2259806
61017B259806P9356Q5761R2506R9866J09217J21035J35286J53878J80239K16062
$$ 2259806 2339162 2424923 2517429 2617295 2726512 2847547 2982833 3136711 3316950 3533012
61007C533012K61027L16498L86840M76379N88361P27907R00712J104226J323067
$$ 3533012 3794039 4110537 4497377 4973756 5562117 6290024 7190736 8294962 9618029
60998I618029J537193J729284J874165J922829J815179J527269J109008O66671
$$ 9618029 11155222 12884506 14758671 16681500 18496679 20023948 21132956 21799627
60990B1799627L02108O7218l2639j4442Q3604J85233J86800J1548l37978p82575
$$ 21799627 22101735 22168953 22136314 22121872 22205476 22390709 22577509 22589057 22251079 21468504
60980B1468504j219030j569625j794392j881387j841847j709518j528998j336301
$$ 21468504 20249474 18679849 16885457 15004070 13162223 11452705 9923707 8587406
60972H587406j149880r77100q22670o89378n76169m80163l99731l34136k81639
$$ 8587406 7437526 6460426 5637756 4948378 4372209 3892046 3492315 3158179 2876540
60963B876540k39670k06081j79187j57371j39444j24718j12217j00668q9600p9465
$$ 2876540 2636870 2430789 2251602 2094231 1954787 1830069 1717852 1617184 1527584 1448119
60953A448119p0381o1810n3883m7711m3758m1021l8518l6455l5170l4010l2216
$$ 1448119 1377738 1315928 1262045 1214334 1170576 1129555 1091037 1054582 1019412 985402 953186
60942I53186l0045k8063k6087k3825k1744k0337j9129j7516j6081j5846j6572
$$ 953186 923141 895078 868991 845166 823422 803085 783956 766440 750359 734513 717941
60931G17941j6912j6165j4874j3686j2681j1906j1639j1747j1468j0290q642p324
$$ 717941 701029 684864 669990 656304 643623 631717 620078 608331 596863 586573 577931 570607
60919E70607o583o061n396m628l999l606l284k837k308j885j616j340r79o10k67
$$ 570607 564024 557963 552567 547939 543940 540334 537050 534213 531905 530020 528404 527064 526085 525475 525208
60904E25208Q7K95J22k83l98m9L13K94R4Pj78p31j319j447j397k013l472m905
$$ 525208 525295 525590 525712 525429 525031 524982 525295 525589 525683 525690 525512 524781 523462 522015 520618 518605 515133 510228
60886E10228n466n344n444o310p637q635q740q029p114o566o379o073n318m315
$$ 510228 504762 499418 493974 487664 480027 471392 462652 454623 447509 440943 434564 428491 423173 418858
60872D18858l606l556m062m620m661l925k584j044L65J485K304K903L401L815
$$ 418858 415252 411696 407634 403014 398353 394428 391844 390800 391165 392650 394954 397857 401258 405073
60858D05073L997L815L312K702K217K012K106K334K465K412K310K313K420K511
$$ 405073 409070 412885 416197 418899 421116 423128 425234 427568 430033 432445 434755 437068 439488 441999
60844D41999K445K066J325M79rk9p2o76j685k370k344k062k242k945l520l433
$$ 441999 444444 446510 447835 448314 448305 448276 448204 447528 445843 443473 441129 439067 436825 433880 430360 426927
60828D26927k895k535k587k715k587k325k214k276k395k630l052l428l461l363
$$ 426927 424032 421497 418910 416195 413608 411283 409069 406793 404398 401768 398716 395288 391827 388464
60814C88464l659m359m770m385l558k994k879k868k786k907l512m402m935m543
$$ 388464 384805 380446 375676 371291 367733 364739 361860 358992 356206 353299 349787 345385 340450 335907
60800C35907l279j833q93n21l42k75o73j584k344k294j527o30P6O13R51J008R80
$$ 335907 332628 330795 329902 329381 329039 328764 328091 326507 324163 321869 320342 319712 319788 320401 321352 322360 323340
60783C23340J181J514J577J273R89J082J517K066K513K576K070J310J018J550
$$ 323340 324521 326035 327612 328885 329874 330956 332473 334539 337052 339628 341698 343008 344026 345576
60769C45576K442K973K961K736K527K256J858J429R66L21m50r16p79l72l88j013
$$ 345576 348018 350991 353952 356688 359215 361471 363329 364758 365724 366045 365595 364679 363900 363528 363140 362127
60753C62127j699j874j627j378j171o90L0M09P0n86q49n69k56m06r75j575k001
$$ 362127 360428 358554 356927 355549 354378 353688 353718 354127 354197 353611 352762 352193 351937 351531 350556 348981 346980
60736C46980k507l474m767n557n088l642k392k195k801l394l488l043k131r74
$$ 346980 344473 340999 336232 330675 325587 321945 319553 317358 314557 311163 307675 304632 302501 301527
60722C01527n6K53J11p0p8J65P75J540J747J026J16N4P65J258J134R55J066J043
$$ 301527 301471 301724 301835 301765 301687 301852 302627 304167 305914 306940 307056 307110 307875 309133 310267 311222 312288 313331
60704C13331P20P93J783L093L769L644L133K464J799J602K066K476K043J100P11
$$ 313331 314051 314844 316627 319720 323489 327133 330266 332730 334529 336131 338197 340673 342716 343816 344527
60689C44527J143J574J339O86J33k49o28r66j083q92m10K01O39P64P67P34L35
$$ 344527 345670 347244 348583 349269 349402 349153 348525 347559 346476 345584 345174 345375 346014 346778 347545 348279 348614
60672C48614n05r47j07J514K384J852P30k20j294k756l802l513k258j240r88j093
$$ 348614 348109 347162 347055 348569 350953 352805 353535 353315 352021 349265 345463 341950 339692 338452 337464 336371
60656C36371j111r22m24L36Q40O03lr5N78J487K166K647K966K967K683K306J667
$$ 336371 335260 334338 333914 334250 335090 335693 335690 335595 336173 337660 339826 342473 345439 348406 351089 353395 355062
60639C55062L44j561l268m154m227l742k890k054j685j649j239k51N29L29n41
$$ 355062 355406 353845 350577 346423 342196 338454 335564 333510 331825 330176 328937 328686 329215 329544 329003
60624C29003j135r84l48L24O79N03Mj52M29J239J410P96N6k43j09K39P24J206
$$ 329003 327868 326884 326536 326860 327539 328042 328046 327894 328323 329562 330972 331768 331824 331581 331472 331711 332435 333641
60606C33641J375J072N75L08M00N19K16n33j093p29N16J695J984J575J236J228
$$ 333641 335016 336088 336663 336971 337371 337890 338106 337573 336480 335751 336267 337962 339946 341521 342757 343985
60590C43985J173Q27M88M55N69N03K07j59m95p50p75m28J99P70J018J025J194
$$ 343985 345158 345985 346473 346928 347497 348000 348207 348048 347553 346803 346028 345600 345799 346569 347587 348612 349806
60573C49806J861K932L978M736N339O011O800P727Q902J0157J0898J0674R731
$$ 349806 351667 354599 358577 363313 368652 374663 381463 389190 398092 408249 419147 429821 439552
60560D39552Q567P156N099K451k12k512m482n983o552o133n345m648l716k031
$$ 439552 448119 455275 460374 462825 462613 460101 455619 449636 443084 436951 431606 426958 423242 421211
60546D21211K09K297L818M839N538O137P061Q614J0603J2555J4281J5815J6932
$$ 421211 421420 423717 427535 432374 437912 444049 451110 459724 470327 482882 497163 512978 529910
60533E29910J7168J6405J4919J2803R834O105K360p04l111n265p125q218q428
$$ 529910 547078 563483 578402 591205 601039 607144 609504 608800 605689 600424 593299 585081 576653
60520E76653q290q354q545q400p700o624n422m206l081k195j553r29k5J319L110
$$ 576653 568363 560009 551464 543064 535364 528740 523318 519112 516031 513836 512283 511354 511329 512648 515758
60505E15758N136O932Q136R071J0679J3520J7127K0700K4225K8237L2623L6400
$$ 515758 520894 527826 535962 545033 555712 569232 586359 607059 631284 659521 692144 728544
60493G28544L8869M0288M1044M0815L9139L6284L2770K8296K2050J4054N440k846
$$ 728544 767413 807701 848745 889560 928699 964983 997753 1026049 1048099 1062153 1067593 1064747
60481A064747j0915j9195k7340l4388l9658m3067m4763m4864m3542m1102l7968
$$ 1064747 1053832 1034637 1007297 972909 933251 890184 845421 800557 757015 715913 677945
60470F77945l4683l1677k8902k5882k2434j9096j6566j4890j3571j2274j1024
$$ 677945 643262 611585 582683 556801 534367 515271 498705 483815 470244 457970 446946
60459D46946r776q386p022o109n646n076m064l017k465k297k064j738j701k018
$$ 446946 437170 428784 421762 415653 410007 404931 400867 397850 395385 393088 391024 389286 387585 385567
60445C85567k284k239k101k105k046j531n40M89J011P56j61j254j921j812j103
$$ 385567 383283 381044 378943 376838 374792 373261 372721 373210 374221 374977 374816 373562 371641 369829 368726
60430C68726l78j63n49j194j675j831j710j341p51j78J6j86l57j82J13K02K66
$$ 368726 368348 368185 367636 366442 364767 362936 361226 359885 359134 358956 358972 358786 358429 358247 358360 358562 358828
60413C58828P38J577K243K417K265J979J485Q06L10L46Q59J503J924J877J413
$$ 358828 359566 361143 363386 365803 368068 370047 371532 372338 372648 372994 373853 375356 377280 379157 380570
60398C80570R94J110J666K159K446K820L251L223K646K256K564K998K752K047
$$ 380570 381564 382674 384340 386499 388945 391765 395016 398239 400885 403141 405705 408703 411455 413502
60384D13502J741K022K230J962J565J477J751K249K844L244L197K895K797K971
$$ 413502 415243 417265 419495 421457 423022 424499 426250 428499 431343 434587 437784 440679 443476 446447
60370D46447L054K872K573K145J366L69k54j62L28P22Q22O91O22J190K807M950
$$ 446447 449501 452373 454946 457091 458457 458826 458572 458410 458738 459460 460282 460973 461595 462785 465592 470542
60354D70542O413O676O541P031Q130R023R188Q731P862O600M908K811M14j923
$$ 470542 476955 483631 490172 497203 505333 514356 523544 532275 540137 546737 551645 554456 554870 552947
60340E52947l669m667n392o331p286p658p289o652o181n811n261m517l905l768
$$ 552947 549278 544611 539219 532888 525602 517944 510655 504003 497822 492011 486750 482233 478328 474560
60326D74560m126m614m767m375l593k765k230k140k229j920r42K96J285K208L634
$$ 474560 470434 465820 461053 456678 453085 450320 448090 445950 443721 441801 440859 441155 442440 444648 448282
60311D48282N462O918P790Q883J0815J2986J4341J4730J4773J4693J3978J2191
$$ 448282 453744 460662 468452 477335 488150 501136 515477 530207 544980 559673 573651 585842
60299E85842R546O580L649P92k152n310q515j1341j3515j4983j5542j4831j3013
$$ 585842 595388 601968 605617 606409 604257 598947 590432 579091 565576 550593 535051 520220 507207
60286E07207j1000r531q347o790m854l122j938j241r84j069j092q14p22j393k421
$$ 507207 496207 486676 478329 471539 466685 463563 461625 460384 459400 458331 457239 456425 455703 454310 451889
60271D51889k833k498k264k562k841k764k972m016n209n334m190k690j702j323
$$ 451889 449056 446558 444294 441732 438891 436127 433155 429139 423930 418596 414406 411716 410014 408691
60257D08691j233j145q64l45J41J96k40p15o55J05J174J912J962J513J070R13
$$ 408691 407458 406313 405449 405104 405245 405441 405201 404486 403831 403936 405110 407022 408984 410497 411567 412480
60241D12480R31R05Q49R19J112J161Q25K39n8L37J092J394R32L94O08J455K048
$$ 412480 413411 414316 415165 416084 417196 418357 419182 419421 419363 419700 420792 422186 423118 423512 424120 425575 427623
60224D27623J850J226Q61J060J662K295K599K523K433K734L411M191M948N666
$$ 427623 429473 430699 431560 432620 434282 436577 439176 441699 444132 446866 450277 454468 459416 465082
60210D65082O173O423O779P449P867P457O848P288Q683R382Q397O833O295O761
$$ 465082 471255 477678 484457 491906 499773 507230 514078 521366 530049 539431 547828 554661 560956 567717
60196E67717O949O256N216M369L680L059K572K077J348N81J80k0o49j855l054
$$ 567717 574666 580922 586138 590507 594187 597246 599818 601895 603243 603824 604004 603984 603335 601480 598426
60181E98426l787m217m603m845m822m770m991n428n740n630m998m018l163k821
$$ 598426 594639 590422 585819 580974 576152 571382 566391 560963 555223 549593 544595 540577 537414 534593
60167E34593k909l017k956k855k763k609k529k732k953k594j612p68o02p24m96
$$ 534593 531684 528667 525711 522856 520093 517484 514955 512223 509270 506676 505064 504296 503694 502970 502474
60152E02474K9L84N68R64J516J657J160N37L39M62M28J34K7N25J525K535L267
$$ 502474 502503 502887 503455 504419 505935 507592 508752 509289 509628 510090 510518 510652 510679 511204 512729 515264 518531
60135E18531L889M670N448N754N478N122N137N307N100M462L856L525L189K604
$$ 518531 522420 527090 532538 538292 543770 548892 554029 559336 564436 568898 572754 576279 579468 582072
60121E82072K073K074K591L110L163K757K255K100K573L603M681N102M456K920
$$ 582072 584145 586219 588810 591920 595083 597840 600095 602195 604768 608371 613052 618154 622610 625530
60107F25530J144k11q33q49n69k41l8k31j103k569m004m749m774m602m541m307
$$ 625530 626674 626463 625630 624781 624212 623971 623933 623702 622599 620030 616026 611277 606503 601901 597360 593053
60091E93053l562k524j740j398j251j184j368j777j952j638j280j486k158k610
$$ 593053 589491 586967 585227 583829 582578 581394 580026 578249 576297 574659 573379 571893 569735 567125
60077E67125k532k356k515k809k792k512k492l084m114n084n521n280m731m549
$$ 567125 564593 562237 559722 556913 554121 551609 549117 546033 541919 536835 531314 526034 521303 516754
60063E16754n006n579n510m736l911l553l532l464l208k810k381k164k344k538
$$ 516754 511748 506169 500659 495923 492012 488459 484927 481463 478255 475445 473064 470900 468556 466018
60049D66018j896j50J795K808K872K917L491M204M534M524M471M430M359M374
$$ 466018 464122 463972 465767 468575 471447 474364 477855 482059 486593 491117 495588 500018 504377 508751
60035E08751M534M626M463M135L715K999J879P45J72K53M83J93j076l335n951
$$ 508751 513285 517911 522374 526509 530224 533223 535102 535847 536019 536272 536755 536948 535872 532537 526586
60020E26586p869q503q329q302q710q996q642p731o628n541m595m000l874m034
$$ 526586 518717 510214 501885 493583 484873 475877 467235 459504 452876 447335 442740 438740 434866 430832
60006D30832m123l887l294k556k028j881j831j472q68n34p06r75q25k63L48Q62
$$ 430832 426709 422822 419528 416972 414944 413063 411232 409760 408892 408358 407652 406677 405852 405589 405937 406799
59990D06799J396J973K436K727K974L262L507L662L861M224M490M065K573M73
$$ 406799 408195 410168 412604 415331 418305 421567 425074 428736 432597 436821 441311 445376 447949 448422
59976D48422j055j123q6O76J05j532l057l652l474l084k651j943r70k47j84m55
$$ 448422 447367 446244 446158 446834 446939 445407 442350 438698 435224 432140 429489 427546 426576 426329 426145 425690
59960D25690l39L11R06J051J112J475J718J186J74l30p5J24k61o35l66J20O7k70
$$ 425690 425351 425662 426568 427619 428731 430206 431924 433110 433284 432954 432879 433003 432742 432107 431741 431861 431928 431658
59942D31658k4Q23J346J052M54O2l33r55j394j211p16m64l37K44J416K714L750
$$ 431658 431634 432457 433803 434855 435309 435371 435038 434083 432689 431478 430762 430298 429961 430205 431621 434335 438085
59925D38085M480M836M704M311M174M349M260L436K140R22p1r64j602j638j089
$$ 438085 442565 447401 452105 456416 460590 464939 469199 472635 474775 475697 475626 474662 473060 471422 470333
59910D70333m24K2L62Q51J494K099K456K452K112J649J253Q19J75m15l45M75J243
$$ 470333 469909 469931 470293 471144 472638 474737 477193 479645 481757 483406 484659 485478 485653 485238 484893 485368 486611
59893D86611J121L75J44J111K760M099M737N078N621O410P114P424P292O872O398
$$ 486611 487732 488107 488251 489362 492122 496221 500958 506036 511657 518067 525181 532605 539897 546769 553167
59878E53167O103O144O451O639O267N289M155L378K988K498J374m64k488l943
$$ 553167 559270 565414 571865 578504 584771 590060 594215 597593 600581 603079 604453 603989 601501 597558
59864E97558m554m781n197n609n236l930k644k267k415k020q77J89P00J224K419
$$ 597558 593004 588223 583026 577417 572181 568251 565607 563340 560925 558905 558028 558217 558917 560141 562560
59849E62560M030N383O346P193P702P110N073K269o5j089q75j81J83o1n94r47
$$ 562560 566590 571973 578319 585512 593214 600324 605397 607666 607601 606512 605637 605456 605639 605578 604984 604037
59833F04037r94j039j504k613m168n531n980n264l857k562j872j723j792j984
$$ 604037 603043 602004 600500 597887 593719 588188 582208 576944 573087 570525 568653 566930 565138 563154
59819E63154k502l381m082l949l206l024m084n428n452l939k340j884k232k389
$$ 563154 560652 557271 553189 549240 546034 543010 538926 533498 528046 524107 521767 519883 517651 515262
59805E15262k206k266k765l236l270k906k375j898j695j778j850j632j229q81
$$ 515262 513056 510790 508025 504789 501519 498613 496238 494340 492645 490867 489017 487385 486156 485275
59791D85275o61p02j323k380k919k199q35j04j83o0P23J311Q98j4l83k0N18R13
$$ 485275 484614 483912 482589 480209 477290 475091 474256 474152 473969 473909 474632 475943 476841 476827 476444 476424 476942 477855
59773D77855J263J583J796K093K649L111K972K440K302K876L574L703L152K267
$$ 477855 479118 480701 482497 484590 487239 490350 493322 495762 498064 500940 504514 508217 511369 513636
59759E13636J468J185J719K837L852M353M565M813N026N132N504O489P686Q275
$$ 513636 515104 516289 518008 520845 524697 529050 533615 538428 543454 548586 554090 560579 568265 576540
59745E76540P998P309O612N861N063M505M277L992L353K591J973J299M04j96J28
$$ 576540 584538 591847 598459 604320 609383 613888 618165 622157 625510 628101 630074 631373 631777 631581 631709
59730F31709J017J292M14q53j493j425j227j130q69l90q2j44k44q0%o58k001l027
$$ 631709 632726 634018 634432 633579 632086 630661 629434 628304 627435 627045 626963 626819 626575 626495 626495 625837 623836 620809
59712F20809k827j724r52j216j950k185j771j261r40n38Q0O13Q42R85J290J667
$$ 620809 617982 616258 615306 614090 612140 609955 608184 606923 605983 605445 605525 606138 606980 607965 609255 610922
59696F10922J986K351K820L159L182L009K720K106J115J92k36l39m89n95m41m27
$$ 610922 612908 615259 618079 621238 624420 627429 630149 632255 633370 633562 633326 632987 632498 631903 631462 631035
59680F31035j206k609l688l992m145m769n472n455m706m054m110m690n251n497
$$ 631035 629829 627220 623532 619540 615395 610626 605154 599699 594993 590939 586829 582139 576888 571391
59666E71391n437n128m621l951l103k015p75K65P97R37J161J740K446K950L319
$$ 571391 565954 560826 556205 552254 549151 547136 546361 546626 547423 548360 549521 551261 553707 556657 559976
59651E59976L812M329M474M177L789L405K651J392J99m71j059k290l992n314n972
$$ 559976 563788 568117 572591 576768 580557 583962 586613 588005 588204 587733 586674 584384 580392 575078 569106
59636E69106o434o841o620n530m332l785l648l259k734k738l308l663l312k687
$$ 569106 562672 555831 549211 543681 539349 535564 531916 528657 525923 523185 519877 516214 512902 510215
59622E10215k475k850l531m223m714m838m675m560m617m435l541k061o88J9N8
$$ 510215 507740 504890 501359 497136 492422 487584 482909 478349 473732 469297 465756 463695 463007 463026 463084
59607D63084j99l67k36K09P82J238J412J249P76K34N2L95P85N80j72o73l38N96
$$ 463084 462885 462518 462282 462491 463273 464511 465923 467172 467948 468182 468234 468629 469414 469994 469822 469149 468811 469407
59589D69407J526K134K336K005J251O16M97N83L00l52r37j349j825k309k451k243
$$ 469407 470933 473067 475403 477408 478659 479275 479772 480355 480655 480303 479366 478017 476192 473883 471432 469189
59573D69189k019j811j435j276k050l519m256l370j726q62j108j534j355o76m2
$$ 469189 467170 465359 463924 462648 460598 457079 452823 449453 447727 446865 445757 444223 442868 442192 442150
59558D42150J81j3k94l06j73l51p87o88L50J569K006J787J762K212K730L137L662
$$ 442150 442331 442318 442024 441718 441545 441194 440407 439719 440069 441638 443644 445431 447193 449405 452135 455272 458934
59541D58934M402N334O755Q938J1450J3624J5489J7291J8246J6969J3295Q526
$$ 458934 463336 468670 475425 484363 495813 509437 524926 542217 560463 577432 590727 599253
59529E99253L684j258n881q560q269o230m531l648k529p70O97J087Q14N77K81
$$ 599253 602937 601679 595798 587238 578969 572739 568208 564560 562031 561261 561958 563045 563859 564436 564717
59514E64717n39j796k990l951m846n571n769n579n778o724p577p249o025n380
$$ 564717 564178 562382 559392 555441 550595 545024 539255 533676 527898 521174 513597 506348 500323 494943
59500D94943n987o696o063m253k619j859j583j447j605j939j871j297p99n77L1
$$ 494943 488956 482260 476197 471944 469325 467466 465883 464436 462831 460892 459021 457724 456925 456348 456379
59485D56379J431K928L576L351K873K507K319K462K980L570M090M917O178P064
$$ 456379 457810 460738 464314 467665 470538 473045 475364 477826 480806 484376 488466 493383 499561 506625
59471E06625O622N067L544K704K162J355K44q10j383j143k02O66P14K15K17J166
$$ 506625 513247 518314 521858 524562 526724 528079 528323 527513 526130 524987 524785 525451 526165 526380 526597 527763
59455E27763K300K777K883L607N200O786P476P420P378P513P203O039M485L079
$$ 527763 530063 532840 535723 539330 544530 551316 558792 566212 573590 581103 588306 594345 598830 601909
59441F01909J533o77l124m678n026n048n434n789n553n034m820m747m237l305
$$ 601909 603442 602765 599641 594963 589937 584889 579455 573666 568113 563079 558259 553512 549275 545970
59427E45970k459j900j421r29m05M53J941L861N849P915J0190J2412J4389J6508
$$ 545970 543511 541611 540190 539261 538856 539309 541250 545111 550960 558875 569065 581477 595866 612374
59413F12374J9024K1200K2202K2516K3180K3620K1686J6319Q948J744m367r166
$$ 612374 631398 652598 674800 697316 720496 744116 765802 782121 791069 792813 788446 779280
59401G79280j1868j1714r231n711j774K467O039P175M958J23n918j2000j7019
$$ 779280 767412 755698 746467 740756 738982 741449 747488 754663 759621 759744 753826 741826 724807
59388G24807j9833k0035j8396j6043j3485j0794q212n984l893j613N37J819K132
$$ 724807 704974 684939 666543 650500 637015 626221 618009 612025 608132 606519 607056 608875 611007
59375F11007K272K869L584L707L232K793K732K791K714K626K609K359J674R18
$$ 611007 613279 616148 619732 623439 626671 629464 632196 634987 637701 640327 642936 645295 646969 647887
59361F47887O61R56J359J529J492J425J528K106L309M769N821O243O438O801P275
$$ 647887 648548 649504 650863 652392 653884 655309 656837 658943 662252 667021 672842 679085 685523 692324 699599
59346F99599P743Q472R718J1118J1943J1935J1494J1012J0423R554Q535P572O576
$$ 699599 707342 715814 725532 736650 748593 760528 772022 783034 793457 803011 811546 819118 825694
59333H25694N300L681J786m14k908n302p021p913q355q702q910q888q797q818
$$ 825694 830994 834675 836461 836047 833139 827837 820816 812903 804548 795846 786936 778048 769251 760433
59319G60433q822q627q346q179q021p610o979o396o014n822n857o073o142n729
$$ 760433 751611 742984 734638 726459 718438 710828 703849 697453 691439 685617 679760 673687 667545 661816
59305F61816m845l614j829O65L378N575P227Q820J0046R554O438J404l977q680
$$ 661816 656971 653357 651528 652193 655571 661146 668373 677193 687239 696793 703231 704635 700658 691978
59291F91978j2449j5168j6668j6927j6050j4180j1749r446p648o144m766l757
$$ 691978 679529 664361 647693 630766 614716 600536 588787 579341 571693 565549 560783 557026
59279E57026l159k385r97N54J670K689M401O662Q451R242R583J0128J0842J1370
$$ 557026 553867 551482 550485 551039 552709 555398 559799 566461 574912 584154 593737 603865 614707 626077
59265F26077J1564J1414J0837R809Q340O311L729J130q17k162l567n220o437o607
$$ 626077 637641 649055 659892 669701 678041 684352 688081 689211 688394 686232 682665 677445 671008 664401
59251F64401o027n451n128m765m185l665l593l897l857k685m37J811L049L372
$$ 664401 658374 652923 647795 643030 638845 635180 631587 627690 623833 621148 620711 622522 625571 628943
59237F28943L551L862M009L994M214M609M590M086L773L870L508J991m0j456k125
$$ 628943 632494 636356 640365 644359 648573 653182 657772 661858 665631 669501 673009 675000 674960 673504 671379
59222F71379k722l439l829l798l836m159m362m205m115m605n573o431o657o054
$$ 671379 668657 665218 661389 657591 653755 649596 645234 641029 636914 632309 626736 620305 613648 607594
59208F07594m826l561k828k656k577k327k165k375k790l047l003k718k178j453
$$ 607594 602768 599207 596379 593723 591146 588819 586654 584279 581489 578442 575439 572721 570543 569090
59194E69090q49n75l54K52J154J778J911K093K908M126M888M720M016L537L597
$$ 569090 568241 567666 567312 567564 568718 570496 572407 574500 577408 581534 586422 591142 595158 598695 602292
59179F02292L913M188M552N299O216O535N844M787M470N123N876N897N286M539
$$ 602292 606205 610393 614945 620244 626460 632995 638839 643626 648096 653219 659095 664992 670278 674817
59165F74817L737K781J980J693J643J257N91J31k30j184k858m566n856p021q194
$$ 674817 678554 681335 683315 685008 686651 687908 688499 688630 688400 687216 684358 679792 673936 666915 658721
59150F58721q878q872q830r185r307q530p378o785o662o290n718n614n885n737
$$ 658721 649843 640971 632141 622956 613649 605119 597741 590956 584294 578004 572286 566672 560787 555050
59136E55050n155n039n625n910n163l996l252k747j898r00l65k11J96J021J872
$$ 555050 549895 544856 539231 533321 528158 524162 520910 518163 516265 515365 515000 514789 514985 516006 517878
59121E17878K656L693N006O131O803P232P512P354O789O629P585R144R890R151
$$ 517878 520534 524227 529233 535364 542167 549399 556911 564265 571054 577683 585268 594412 604302 613453
59107F13453P779P054P137P130O469N644N325N344M977M011K924K078J205k2j288
$$ 613453 621232 628286 635423 642553 649022 654666 659991 665335 670312 674323 677247 679325 680530 680508 679220
59092F79220j846j418o36l72p76j186j034n86n11r49j492j948k566l417m139m663
$$ 679220 677374 675956 675320 674948 674172 672986 671952 671366 670855 669906 668414 666466 663900 660483 656344 651681
59076F51681n573p221q863r289q210o554n490n493o161o557n897m324k937k722
$$ 651681 646108 638887 630024 620735 612525 605971 600481 594988 588827 582270 576373 572049 569112 566390
59062E66390l580m603n044m675l579k181j251j290j971k560k721k557k217j929
$$ 566390 562810 558207 553163 548488 544909 542728 541477 540187 538216 535656 532935 530378 528161 526232
59048E26232k077k607k750k025j132r55j111n60N63R66K23n66m77mO1n4L31J169
$$ 526232 524155 521548 518798 516773 515641 514686 513575 513015 513578 514544 514767 514201 513724 513720 513781 513727 514058 515227
59030E15227J896K375K921L683M561N480O389P255Q352J0040J1984J3141J3000
$$ 515227 517123 519498 522419 526102 530663 536143 542532 549787 558139 568179 580163 593304 606304
59017F06304J2306J1991J1841J0954R151P139N331L392J135q35j822k038k330
$$ 606304 618610 630601 642442 653396 662547 669686 675017 678409 679544 678709 676887 674849 672519
59004F72519k971l259k542j255l67j4N80J776K880L268L299L449L236K001K04
$$ 672519 669548 666289 663747 662492 662125 662111 662691 664467 667347 670615 673914 677363 680599 682600 682804
58989F82804j169k088l094l818l362k268k303l866n119m583l228k773l062k466
$$ 682804 681635 679547 676453 672635 669273 667005 664702 660836 655717 651134 647906 645133 642071 639605
58975F39605l09K474M826O532P742Q506R001R590J0430J1322J1918J1931J1257
$$ 639605 639296 641770 646596 653128 660870 669376 678377 687967 698397 709719 721637 733568 744825
58962G44825J0160R109Q284P470O540N594M499K853O25j686l790n920q181j0231
$$ 744825 754985 764094 772378 779848 786388 791982 796481 799334 799959 798273 794483 788563 780382 770151
58948G70151j1859j3182j3943j3469j1826j0158r307q872q302p995q381q665p659
$$ 770151 758292 745110 731167 717698 705872 695714 686407 677535 669233 661238 652857 644192 636533
58935F36533n416l138j712j218j484k123k362j745q60o02r09j031p19k77K52R81
$$ 636533 631117 627979 626267 625049 623565 621442 619080 617335 616475 615873 614964 613933 613214 612937 613189 614170
58919F14170J384P38o84j759j981j884j953j951j482n54O67J999L042L436L394
$$ 614170 615554 616292 615608 613849 611868 609984 608031 606080 604598 604044 604711 606710 609752 613188 616582
58904F16582L510L994M692N727P397R453J1172J2216J2781J2885J2300J1331J0821
$$ 616582 620092 624086 628778 634505 641902 651355 662527 674743 687524 700409 712709 724040 734861
58891G34861J1096J1539J1568J1403J1574J2190J3021J3850J4407J4287J3295
$$ 734861 745957 757496 769064 780467 792041 804231 817252 831102 845509 859796 873091
58880H73091J1631R660P723O130M871L361J002j877m242n642o641p723q474q402
$$ 873091 884722 894382 902105 908235 913106 916467 917469 915592 911350 905708 899067 891344 882870 874468
58866H74468p971q042q573q659p850o816o443o775p208p386p495p799q271q769
$$ 874468 866497 858455 849882 841223 833373 826557 820114 813339 806131 798745 791250 783451 775180 766411
58852G66411r238r588r689r593r537r490r049q080p088o520o081n388m897n301
$$ 766411 757173 747585 737896 728303 718766 709276 700227 692147 685059 678539 672458 667070 662173 656872
58838F56872o217o552o217o347p450q443q134o760n372m409l723l294l129k819
$$ 656872 650655 644103 637886 631539 624089 615646 607512 600752 595380 590971 587248 583954 580825 578006
58824E78006j981q38J54R22J521J878K165K891L961M470M016L474L647L950L463
$$ 578006 576025 575187 575341 576263 577784 579662 581827 584718 588679 593149 597165 600639 604286 608236 611699
58809F11699K605K487L093L387K907K069J010o12k607m049m321l667k718k126
$$ 611699 614304 616791 619884 623271 626178 628247 629257 628645 626038 621989 617668 614001 611283 609157
58795F09157k430l601m826n437n717o101o169n377m271l755l564k745j343k52
$$ 609157 606727 603126 598300 592863 587146 581045 574876 569499 565228 561473 557909 555164 553821 553569
58781E53569M69J596L053L749L392L069L573M401M806M631L675J454j724m539
$$ 553569 554038 555634 558687 562436 565828 568897 572470 576871 581677 586308 589983 591437 589713 585174
58767E85174o188p241q359r136q955q153p452o818n719m120k492j069K88J638
$$ 585174 578986 571745 563386 554250 545295 537142 529690 522872 517153 513033 510541 509472 509760 511398
58753E11398K738L245L037K463K198K514K872K639K043J774J878J825J600J853
$$ 511398 514136 517381 520418 522881 525079 527593 530465 533104 535147 536921 538799 540624 542224 544077
58739E44077K896M287N517O355O498N786M751M205M147L926L446L204L175K786
$$ 544077 546973 551260 556777 563132 569630 575416 580167 584372 588519 592445 595891 599095 602270 605056
58725F05056K211K457L725M864M951M363L768L056K059J397J731K789L822M586
$$ 605056 607267 609724 613449 618313 623264 627627 631395 634451 636510 637907 639638 642427 646249 650835
58711F50835N309O137P001P643P502O095L798J553l48k457m988p340r135j0758
$$ 650835 656144 662281 669282 676925 684427 690522 694320 695873 695525 693068 688080 680740 671605 660847
58697F60847j2377j3373j3404j3168j3380j3693j3372j2429j1395j0412r255p899
$$ 660847 648470 635097 621693 608525 595145 581452 568080 555651 544256 533844 524589 516690
58685E16690o468m995l682k955k940l193l328l446l633l627l271k775k243j447
$$ 516690 510222 505227 501545 498590 495650 492457 489129 485683 482050 478423 475152 472377 470134 468687
58671D68687l69O33J452K421L649M791N732O759P778Q154P645O735N737M333K439
$$ 468687 468318 468951 470403 472824 476473 481264 486996 493755 501533 509687 517332 524067 529804 534137 536576
58656E36576O89m20j143j744k000j810j632j800k128k588l553m891n646n246m286
$$ 536576 537265 536845 535702 533958 531958 530148 528516 526716 524588 522000 518447 513556 507910 502664 498378
58641D98378l565l102k545j821q30O57K278L074K781K348K558L028L146L116L284
$$ 498378 494813 491711 489166 487345 486515 487172 489450 492524 495305 497653 500211 503239 506385 509501 512785
58626E12785L300K735J859J024J1j222j983j799j220q76m81L76J232J547J773
$$ 512785 516085 518820 520679 521703 521714 520492 518509 516710 515490 514614 514133 514509 515741 517288 519061
58611E19061K514L312L355K918K901L241L004J952R43O99J001J308J435J448J348
$$ 519061 521575 524887 528242 531160 534061 537302 540306 542258 543201 543900 544901 546209 547644 549092 550440
58596E50440J014L42n40j214j337j070p63l03N58J411J600J482K203L936N553
$$ 550440 551454 551796 551256 550042 548705 547635 546872 546569 547127 548538 550138 551620 553823 557759 563312
58581E63312O365P035Q098Q854Q588P829P421P258O914O711P100P708P968Q175
$$ 563312 569677 576712 584810 593664 602252 610081 617502 624760 631674 638385 645485 653193 661161 669336
58567F69336Q988J0413J2059J3871J5848J7644J9143K0818K2776K4189K4422K4012
$$ 669336 678324 688737 700796 714667 730515 748159 767302 788120 810896 835085 859507 883519
58555H83519K3675K3002K1041J7577J3127Q273L711K50k027l936n831o892o563
$$ 883519 907194 930196 951237 968814 981941 990214 993925 994175 992148 988212 982381 975489 968926
58542I68926n801n925p027q475j0282j2796j5615j7882j9309k0079k0184j9604
$$ 968926 963125 957200 950173 941698 931416 918620 903005 885123 865814 845735 825551 805947
58530H05947j8599j7297j5534j3607j2356j1848j0996r189p285o197n546m652
$$ 805947 787348 770051 754517 740910 728554 716706 705710 696521 689236 683039 677493 672841
58518F72841l836l682l912l993m002m030l670k938k592k665j942NJ598J373nj075
$$ 672841 669005 665323 661411 657418 653416 649386 645716 642778 640186 637521 635579 635584 637182 638555 638550 637475
58502F37475j604j871j354J36J233P95j13J55J225J591J246J338J948K245K347
$$ 637475 635871 634000 632646 632782 634015 634810 634697 634852 636077 637668 638914 640252 642200 644445 646792
58487F46792L073M182M686M679N194O515Q069R604J1147J2289J2893J3787J5393
$$ 646792 649865 654047 658733 663412 668606 675121 683190 692794 703941 716230 729123 742910 758303
58474G58303J6525J6065J4836J3969J2525Q918L912j40k554m561o705q236q935
$$ 758303 774828 790893 805729 819698 832223 841141 845053 844913 842359 837798 831093 822857 813922
58461H13922r278q892o919l921j463L07K699O019Q980J0732J1757J2471J2521
$$ 813922 804644 795752 788833 784912 783449 783756 786455 792474 801454 812186 823943 836414 848935
58448H48935J1627R936P451M360J507p03l281p027j0637j2172j1774j1004j0171
$$ 848935 860562 870498 877949 882309 883816 883113 879832 872805 862168 849996 838222 827218 817047
58435H17047q491o408n350n252m531k609n19J054K408L584M290N072O748Q739
$$ 817047 808556 802148 796798 791546 787015 784406 783887 784941 787349 790933 795223 800295 807043 815782
58421H15782R710R654R607R554Q475O231L624Q88k134m755o283p494r261j0518
$$ 815782 825492 835146 844753 854307 862782 869013 872637 873525 871391 866636 860353 852859 843598 833080
58407H33080r790q061p469p841p237n476m229l746k586o52M80N24J041K570L913
$$ 833080 823290 815229 807760 799919 792682 787206 782977 779231 776645 775993 776473 776997 778038 780608 784521
58392G84521M596N445O357O178N205N190O307O752N887N252N805O606O916P226
$$ 784521 789117 794562 800919 807097 812302 817492 823799 830551 836438 841690 847495 854101 861017 868243
58378H68243P610P287O388O017O113N373L686K439K190K186K320L258M597N295
$$ 868243 875853 883140 889528 895545 901658 907031 910717 913156 915346 917532 919852 923110 927707 933002
58364I33002N820P389R243R502Q589Q808J0524J1837J2155J2796J3814J3548J1793
$$ 933002 938822 946211 955454 964956 973545 982353 992877 1004714 1016869 1029665 1043479 1057027 1068820
58351A068820J0228R222P437M988L631L393K431P96P54K717M457N102O295Q509
$$ 1068820 1079048 1088270 1095707 1100695 1104326 1107719 1110150 1110946 1111700 1114417 1118874 1123976 1130271 1138780
58337A138780R899R931J0460J2150J3312J3396J4039J5562J6047J5076J4725J5682
$$ 1138780 1148679 1158610 1169070 1181220 1194532 1207928 1221967 1237529 1253576 1268652 1283377 1299059
58325A299059J5990J4786J3533J2530J0169O813N214N729N454L517K781M565O226
$$ 1299059 1315049 1329835 1343368 1355898 1366067 1372880 1378094 1383823 1389277 1392794 1395575 1400140 1406366
58312A406366O083O220Q071R571R305R383J1469J3788J4700J5501J7134J7917
$$ 1406366 1412449 1418669 1426740 1436311 1445616 1454999 1466468 1480256 1494956 1510457 1527591 1545508
58300A545508J7093J6985J8979K0925K0905K0153K0000J9614J8857J9534K1650
$$ 1545508 1562601 1579586 1598565 1619490 1640395 1660548 1680548 1700162 1719019 1738553 1760203
58289A760203K2405K1048K0562K2459K4303K4598K5379K7627K8945K8440K8979
$$ 1760203 1782608 1803656 1824218 1846677 1870980 1895578 1920957 1948584 1977529 2005969 2034948
58278B034948L1794L3829L3398L3378L5651L7552L7221L7330L9941M2725M3851
$$ 2034948 2066742 2100571 2133969 2167347 2202998 2240550 2277771 2315101 2355042 2397767 2441618
58267B441618M5578M9346N2420N3181N4518N8333O1946O3578O5849P0049P2881
$$ 2441618 2487196 2536542 2588962 2642143 2696661 2754994 2816940 2880518 2946367 3016416 3089297
58256C089297P2826P3612P7217P9738P8736P8102Q0845Q3706Q4079Q5572R1150
$$ 3089297 3162123 3235735 3312952 3392690 3471426 3549528 3630373 3714079 3798158 3883730 3974880
58245C974880R7431J01432J06289J14590J22899J28767J36018J47115J57719J64997
$$ 3974880 4072311 4173743 4280032 4394622 4517521 4646288 4782306 4929421 5087140 5252137
58235E252137J73519J86445J99077K08173K19002K35658K53224K67493K83408
$$ 5252137 5425656 5612101 5811178 6019351 6238353 6474011 6727235 6994728 7278136
58226G278136L05356L28477L48684L71719M02691M36444M68190N03568N47817
$$ 7278136 7583492 7911969 8260653 8632372 9035063 9471507 9939697 10443265 10991082
58217A0991082N95856O44112P00714P72222Q52294R35983J032497J150485J284766
$$ 10991082 11586938 12231050 12931764 13703986 14556280 15492263 16524760 17675245 18960011
58208A8960011J432366J607017J822024K074832K366142K717421L151072L672579
$$ 18960011 20392377 21999394 23821418 25896250 28262392 30979813 34130885 37803464
58200C7803464M293579N052188N989032P129542Q518580J0245610J2403266J5045589
$$ 37803464 42097043 47149231 53138263 60267805 68786385 79031995 91435261 106480850
58192A06480850J8201818K1854822K5824908K9712877L3023527L5264596L5794081
$$ 106480850 124682668 146537490 172362398 202075275 235098802 270363398 306157479
58185C06157479L3682838K8091840J9044649P775007l836761j4193844k2413268
$$ 306157479 339840317 367932157 386976806 394751813 390915052 376721208 354307940
58178C54307940k8144920l1335998l2237039l1395356k9433928k6824333k3880454
$$ 354307940 326163020 294827022 262589983 231194627 201760699 174936366 151055912
58171A51055912k0861797j7983236j5361262j3029359j1001011r280326p836952
$$ 151055912 130194115 112210879 96849617 83820258 72819247 63538921 55701969
58164E5701969o621717n603979m766393m077367l499187l013833k615467k286924
$$ 55701969 49080252 43476273 38709880 34632513 31133326 28119493 25504026 23217102
58156B3217102k006372j767711j572736j411039j267004j138598j030906r38295
$$ 23217102 21210730 19443019 17870283 16459244 15192240 14053642 13022736 12084441
58148A2084441q50085p67041o95906o33863n73441n16689m69837m29635l88984
$$ 12084441 11234356 10467315 9771409 9137546 8564105 8047416 7577579 7147944 6758960
58139F758960l50773l22578l02389k82442k62691k48086k36594k22132k05867
$$ 6758960 6408187 6085609 5783220 5500778 5238087 4990001 4753407 4531275 4325408
58130D325408j93347j83520j71247j57588j47385j39670j30186j20488j15028
$$ 4325408 4132061 3948541 3777294 3619706 3472321 3332651 3202465 3081977 2966949
58121B966949j11979j06145r8376r3264r0067q4600p7767p3701p1558o7300o1660
$$ 2966949 2854970 2748825 2650449 2557185 2467118 2382518 2304751 2231050 2159492 2092192 2030532
58110B030532n8569n7485n4764n0797m8654m7567m4666m1350m1027m2447m1844
$$ 2030532 1971963 1914478 1859714 1808917 1760263 1712696 1668030 1626680 1585653 1543206 1501362
58099A501362l9835l9654m0452l8916l5709l3973l3184l0714k7619k6679k6537
$$ 1501362 1461527 1421873 1381421 1342505 1306796 1272823 1239639 1208925 1181306 1154627 1128090
58088A128090k4077k0751k0283k1731k1199j8937j8436j9736j9896j8945j9345
$$ 1128090 1104013 1083262 1062979 1041248 1020049 1001112 982676 962940 943044 924099 904754
58077I04754k0453j9482j7108j6400j7059j6331j4712j4967j6354j5552j2764
$$ 904754 884301 864819 847711 831311 814252 797921 783209 768242 751888 736336 723572
58066G23572j1329j1641j0953q911p937q302p917o911p429r068r321q420q946
$$ 723572 712243 700602 689649 680738 672801 664499 656582 649671 642242 633174 623853 615433 606487
58053F06487j0845j1434j0266r479r463q657p379p436q162p234n121m375m847
$$ 606487 595642 584208 573942 564463 555000 546343 538964 531528 523366 516132 511011 506636 501789
58040E01789m132k419k282l816m562m206m823o351o477n223n197o924q164q258
$$ 501789 497657 495238 492956 489140 484578 480372 475549 469198 462721 457498 452301 445377 437213 428955
58026D28955q868j0063r907q434p903q604q455p204o890p672p262n274m040m317
$$ 428955 420087 410024 400117 391683 383780 375176 366721 359517 352627 344955 337693 332419 328379 324062
58012C24062m122k714j895k376k558j947k149l470m000l175k875l872m436l672
$$ 324062 319940 317226 315331 312955 310397 308450 306301 302831 298831 295656 292781 288909 284473 280801
57998B80801l008l250l124j867n49K77J469L041L694L332L333L718K992J331Q97
$$ 280801 277793 274543 271419 269552 269003 269280 270749 273790 277484 280816 284149 287867 290859 292190 293087
57983B93087K105K661J310l53q42q21j069j106q70j350k498k862k110j572j682
$$ 293087 295192 297853 299163 298810 297968 297147 296078 294972 294102 292752 290254 287392 285282 283710 282028
57968B82028j264q0N09J50K40J248J806J234O12N83M81K17N88J144L29j599k460
$$ 282028 280764 280684 281193 281343 281583 282831 284637 285871 286483 287066 287547 287764 288352 289496 289825 288226 285766
57951B85766j665j139j918k610k296k126k781k894j491K50J078J550K571L825
$$ 285766 284101 282962 281044 278434 276138 274012 271231 268337 266846 267096 268174 269724 272295 276120
57937B76120M726N326N594N386N504O893Q586Q571O861N293M245K294n44k340
$$ 276120 280846 286172 291766 297152 302656 309549 318135 326706 333567 338860 343105 345399 344855 342515
57923C42515k701l586n722p242p072o693p160p235o066n038n257n574m870l970
$$ 342515 339814 336228 330506 323264 316192 309499 302339 295104 289038 284000 278743 273169 268299 264329
57909B64329l669l074j555k78j10r3N08P14p8o57k46p5r77j533m78R82J230Q67
$$ 264329 260660 257586 256031 255753 255643 255550 256058 256772 256694 256037 255791 255716 254739 253206 252728 253710 254940 255807
57891B55807J309K313K904L272L905M095L205K239K386L039K906K149J810K003
$$ 255807 257116 259429 262333 265605 269510 273605 276810 279049 281435 284474 287380 289529 291339 293342
57877B93342K046J647Q37m45j766k173j610j300j929k740l058l321l770l670k808
$$ 293342 295388 297035 297872 297427 295661 293488 291878 290578 288649 285909 282851 279530 275760 272090 269282
57862B69282k237k498k582j633k21R43K068L092L216K553K506L455L897L103K601
$$ 269282 267045 264547 261965 260332 260111 261054 263122 266214 269430 271983 274489 277944 281841 284944 287545
57847B87545L523M422L518J541L87L02J73l44p36q18o89k68J26k98j413j961j502
$$ 287545 291068 295490 299008 300549 300936 301238 301411 301067 300331 299513 298824 298556 298682 298384 296971 295010 293508
57830B93508j133j371j082L41J526J255L62J04K09P0K21R90J251J92j033j133
$$ 293508 292375 291004 289922 290263 291789 293044 293406 293510 293719 293789 294010 295000 296251 296443 295410 294277
57814B94277p36r97j578j818k504m599p277r044r752r887r146p458o163o218o415
$$ 294277 293541 292544 290966 289148 286644 282045 274768 265724 255972 246085 236939 229481 223318 217100 210685
57799B10685n300l657l112l294k667j255l79l02k26p6l03m14L89J528J882J761
$$ 210685 205385 201728 198616 195322 192655 191400 191021 190719 190493 190417 190114 189700 190089 191617 193499 195260
57783A95260K252L032K838J838J616K798M359N332N713N731N528N518N868N818
$$ 195260 197512 200544 203382 205220 206836 209634 213993 219325 225038 230769 236297 241815 247683 253501
57769B53501M667L047K079J677R56j37q84j240j894l056m243n024n168m445l116
$$ 253501 258168 261215 263294 264971 265927 265790 264906 263666 261772 258716 254473 249449 244281 239836 236720
57754B36720k024j461p08N19J225P96L18R27J931K013J345Q77N29k68j042j010
$$ 236720 234696 233235 232527 233046 234271 235067 235385 236312 238243 240256 241601 242478 243007 242739 241697 240687
57738B40687o37p50q75j63P40O52K3K41J244J747J503J356J339P53o4k3O87P73
$$ 240687 240050 239300 238425 238262 239002 239654 239677 239918 241162 242909 244412 245768 247107 247860 247796 247773 248460 249233
57720B49233J51J18R66J309L11j026j416q30N5P66Q77J3j441k427k336j492n38
$$ 249233 249384 249502 250468 251777 252088 251062 249646 248816 248871 249637 250514 250527 249086 246659 244323 242831 242293
57703B42293M5p0p54j256j050o62r00j638k152k254k249k188k040k169k736l193
$$ 242293 242338 242268 241514 240258 239208 238546 237646 236008 233856 231602 229353 227165 225125 222956 220220 217027
57687B17027l177l212l596l524k488j519j579j673k49K262M200N371O978R258
$$ 217027 213850 210638 207042 203518 201030 199511 197932 196259 196010 198272 202472 207843 214821 224079
57673B24079J1319J3328J6680K1697K7000L1615L6020M0427M3428M3023L8142
$$ 224079 235398 248726 265406 287103 314103 345718 381738 422165 465593 508616 546758
57662E46758K8775J5758Q51j3675k5979l4891l9674m0429l8472l5342l1554k7052
$$ 546758 575533 591291 592142 578467 552488 517597 477923 437494 399022 363680 332126 305074
57650C05074k2364j8247j4702j1409q714p037n836m387l016k289j677n00M90J38
$$ 305074 282710 264463 249761 238352 229638 222601 216765 212378 209362 207073 205396 204896 205386 205524
57636B05524r51j165l36L10L89O00Q99M68n36j075j121j602k365k253j335j071
$$ 205524 204573 203408 203072 203382 203771 204371 205270 205738 205202 204127 203006 201404 199039 196786 195451 194380
57620A94380j815k133j178J41R12J422J938J955J449J281J643J516M51n33o09
$$ 194380 192565 190432 189254 189395 190307 191729 193667 195622 197071 198352 199995 201511 201962 201429 200820
57605B00820l89o82j192j342j265j299j374j588k357l475l974l432k611k311k496
$$ 200820 200431 199749 198557 197215 195950 194651 193277 191689 189332 185857 181883 178451 175840 173529 171033
57590A71033k855l245l326k777k105k180k743k600j504n68n16q34j007j299j754
$$ 171033 168178 164933 161607 158830 156725 154545 151802 149202 147698 147130 146614 145780 144773 143474 141720
57575A41720j798j301r65j100j188j038j165j628j692j166p94q88q85o78j007
$$ 141720 139922 138621 137656 136556 135368 134330 133165 131537 129845 128679 127885 126997 126112 125434 124427
57560A24427j906k237j511p25o33n03M10J450J682J344J131R48M51j6J9K57J69
$$ 124427 122521 120284 118773 118048 117415 116912 117322 118772 120454 121798 122929 123877 124328 124312 124331 124588 124757
57543A24757j59l73m80n78n47l95k24L36J710L138L119J564K20K47P30L96l80
$$ 124757 124598 124225 123745 123167 122620 122225 122001 122337 124047 127185 130304 131868 132088 132335 133065 133461 133081
57526A33081m87Q5N56Q32J392K173K578K405K042J847J901K078K121J911J719
$$ 133081 132594 132679 133235 134067 135459 137632 140210 142615 144657 146504 148405 150483 152604 154515 156234
57511A56234J744J460L12j058j334m78R1m68j409j851j966k153k237k160k380
$$ 156234 157978 159438 159750 158692 157358 156880 156971 156503 155094 153243 151277 149124 146887 144727 142347
57496A42347k879k856k070j482j783k378k515k410k418k137j264l65K5K42O81
$$ 142347 139468 136612 134542 133060 131277 128899 126384 123974 121556 119419 118155 117790 117815 118057 118738
57481A18738R47O80L19K77J79l13p76q34q56j120j234j079j275j974k258j642
$$ 118738 119685 120365 120684 120961 121140 120827 120051 119217 118361 117241 116007 114928 113653 111679 109421 107779
57465A07779j058j300j559q07M04Q12M31K61N84Q05O43L46J5l28l50P5L06k54
$$ 107779 106721 105421 103862 103055 103459 104271 104702 104963 105547 106352 106995 107341 107356 107028 106678 106753 107059 106805
57447A06805j218j791j832j600r88J22J208J662J647J684J759J494Q52J32l94
$$ 106805 105587 103796 101964 100364 99376 99498 100706 102368 104015 105699 107458 108952 109804 109936 109542
57432A09542m10K84J203J437Q80M24N08N15M6k14K62Q85J007R46J037P75j82j010
$$ 109542 109132 109416 110619 112056 112936 113360 113868 114383 114429 114215 114477 115362 116369 117315 118352 119127 118945 117935
57414A17935r56n88p05r09m61K37L70K64P78J662J877J196L23k82o69q03p42j035
$$ 117935 116979 116391 115686 114777 114316 114553 114923 115187 115965 117627 119504 120700 121023 120741 120072 119269 118527 117492
57396A17492j910k521j974o73K73N98Q48J242J642K201L059L691L500K768K259
$$ 117492 115582 113061 111087 110414 110687 111285 112133 113375 115017 117218 120277 123968 127468 130236 132495
57381A32495K181K323K660L055K927K062J116N63r7j249k119k012j627j914k413
$$ 132495 134676 136999 139659 142714 145641 147703 148819 149382 149285 148036 145917 143905 142278 140364 137951
57366A37951k205j712j991k725k639j560n17NL35M29m5m67K67J866K718K087Q95
$$ 137951 135746 134034 132043 129318 126679 125119 124602 124607 124942 125371 125326 124859 125126 126992 129710 131797 132692
57349A32692J19l22o82o02K16J365K233K539K280J693J280J294J285P52nl59l35
$$ 132692 132811 132489 131807 131205 131421 132786 135019 137558 139838 141531 142811 144105 145390 146142 146137 145778 145443
57332A45443l72m49l22k55o09j005q86n39n97q88q12n11m91m60K32J209J458R31
$$ 145443 145071 144622 144300 144045 143436 142431 141545 141006 140409 139521 138709 138198 137707 137247 137479 138688 140146 141077
57314A41077M76K51l93j450j987j594q90m14p4R7k71j062j587j555j328j059m79
$$ 141077 141553 141804 141411 139961 137974 136380 135490 135076 135002 135099 134828 133766 132179 130624 129296 128237 127758
57297A27758L41R12J067J089J043Q34P50J111J522J375R23Q41R62O34J17L46J266
$$ 127758 128099 129011 130078 131167 132210 133044 133794 134905 136427 137802 138725 139566 140528 141162 141279 141625 142891
57280A42891J773J479J233J582J988J998K020K440K894L015L068L335L595L544
$$ 142891 144664 146143 147376 148958 150946 152944 154964 157404 160298 163313 166381 169716 173311 176855
57266A76855L206K725K267K160K548K968K922K683K756K814K193J210Q12J004
$$ 176855 180061 182786 185053 187213 189761 192729 195651 198334 201090 203904 206097 207307 208119 209123
57252B09123R06L60K00P23J163J017P29P42Q69R48J128J262R85O38J032K022K487
$$ 209123 210029 210389 210589 211312 212475 213492 214221 214963 215832 216780 217908 219170 220155 220793 221825 223847 226334
57235B26334K042J622J931K436K473K295K381K583K576K392K100J636J318J642
$$ 226334 228376 229998 231929 234365 236838 239133 241514 244097 246673 249065 251165 252801 254119 255761
57221B55761K347K583K350K738M201N664N993N481N057M846M344L516K903K829
$$ 255761 258108 260691 263041 265779 269980 275644 281637 287118 292175 297021 301365 304881 307784 310613
57207C10613L072L193L029K946L521M609N162M633M131N110P127Q306Q076P928
$$ 310613 313685 316878 319907 322853 326374 330983 336145 340778 344909 350019 357146 365452 373528 381456
57193C81456R092J0817J1766J1875J1971J2437J3226J4500J6352J8240J9299J9112
$$ 381456 390548 401365 413131 425006 436977 449414 462640 477140 493492 511732 531031 550143
57181E50143J7914J6473J5791J6280J7059J6880J5840J5310J5953J6862J7080
$$ 550143 568057 584530 600321 616601 633660 650540 666380 681690 697643 714505 731585
57170G31585J6939J7310J8317J9462K0404K1101K1689K2585K4112K5797K6703
$$ 731585 748524 765834 784151 803613 824017 845118 866807 889392 913504 939301 966004
57159I66004K6630K6253K5999K5760K5805K6807K8506K9492K8970K7712K6838
$$ 966004 992634 1018887 1044886 1070646 1096451 1123258 1151764 1181256 1210226 1237938 1264776
57148A264776K6591K6898K8025K9821L1333L2006L2547L3753L5251L6229L6710
$$ 1264776 1291367 1318265 1346290 1376111 1407444 1439450 1471997 1505750 1541001 1577230 1613940
57137A613940L7254L8033L9064M0761M3390M6405M9112N1611N4320N7077N9498
$$ 1613940 1651194 1689227 1728291 1769052 1812442 1858847 1907959 1959570 2013890 2070967 2130465
57126B130465O1925O5110O9054P2950P6299P9664Q4078Q9988R6807J03611J10264
$$ 2130465 2192390 2257500 2326554 2399504 2475803 2555467 2639545 2729533 2826340 2929951 3040215
57115C040215J17600J26258J35830J45842J57140J71245J88425K07661K28723
$$ 3040215 3157815 3284073 3419903 3565745 3722885 3894130 4082555 4290216 4518939
57106D518939K53238K83374L20565L66053M21694M89745N72607O73435P96307
$$ 4518939 4772177 5055551 5376116 5742169 6163863 6653608 7226215 7899650 8695957
57097H695957R45312J123939J335363J582237J865462K183152K530298K897972
$$ 8695957 9641269 10765208 12100571 13682808 15548270 17731422 20261720 23159692
57089B3159692L272446L636120L970289M257916M485814M645811M731153M725990
$$ 23159692 26432138 30068258 34038547 38296463 42782277 47428088 52159241 56885231
57081E6885231M596730M299857L806813L125588K298350J378513M10417n71697
$$ 56885231 61481961 65781818 69588631 72714219 75012569 76391082 76801499 76229802
57073G6229802j531153k421053l191652l806651m253549m539877m681188m692868
$$ 76229802 74698649 72277596 69085944 65279293 61025744 56485867 51804679 47111811
57065D7111811m590442m392656m121412l799257l447807l086989k733571k399828
$$ 47111811 42521369 38128713 34007301 30208044 26760237 23673248 20939677 18539849
57057A8539849k093753j819813j579142j370274j190900j038698r10407q01468
$$ 18539849 16446096 14626283 13047141 11676867 10485967 9447269 8536862 7735394
57049G735394p07668o26515n56360m95211m41337l93987l52491l15373k81378
$$ 7735394 7027726 6401211 5844851 5349640 4908303 4514316 4161825 3846452 3565074
57040C565074k50626k23736k00386j79609j60781j43460j26889j10504r4353p8355
$$ 3565074 3314448 3090712 2890326 2710717 2549936 2406476 2279587 2169083 2074730 1996375
57030A996375o1964m5223k9063j3792J362J5832K5905K6941J7069k070k7021n3415
$$ 1996375 1934411 1889188 1860125 1846333 1847695 1863527 1889432 1916373 1933442 1931372 1904351 1850936
57018A850936p6317r1970r9641j00901r7409r0403q1554p2699o4644n7289n0718
$$ 1850936 1774619 1682649 1583008 1482107 1384698 1294295 1212741 1140042 1075398 1018109 967391
57007I67391m5218m0481l5924l1576k7862k4783k2128k0044j8582j7180j5456
$$ 967391 922173 881692 845768 814192 786330 761547 739419 719375 700793 683613 668157
56996F68157j3975j3340j3117j2609j1979j1526j0603q461n614l120j048J130
$$ 668157 654182 640842 627725 615116 603137 591611 581008 572547 566933 563813 562765 563895
56984E63895L159M239M227L377J372k118o392j0396j3975j7280j9559j9917j8791
$$ 563895 567054 571293 575520 578897 580269 578151 571759 561363 547388 530108 510549 490632 471841
56971D71841j7184j5034j1823q384o268n464m392k106R46M288P941J1569J4555
$$ 471841 454657 439623 427800 419416 413148 407684 403292 401186 402132 406420 414361 425930 440485
56958D40485J7027J9348K0529J8683J3377O296o62o738j1735j5449j8039j9850
$$ 440485 457512 476860 497389 516072 529449 535745 535083 528345 516610 501161 483122 463272
56946D63272k0569j9572j7123j4297j1579q641n447k439M27L680P345J1025J4853
$$ 463272 442703 423131 406008 391711 380132 371491 366044 363605 364032 367712 375057 386082 400935
56933D00935J9158K3183K5463K5530K3909K0385J3865M383o064j5258k2265k6962
$$ 400935 420093 443276 468739 494269 518178 538563 552428 556811 550747 535489 513224 486262
56921D86262k9277k9449k8123k5715k2452j9111j6757j5507j4449j3004j1409
$$ 486262 456985 427536 399413 373698 351246 332135 315378 299871 285422 272418 261009
56910B61009r830q091o419n387m894m217l279k722k596k117j008P2P18J418K587
$$ 261009 251179 243088 236669 231282 226388 222171 218892 216170 213574 211457 210449 210521 211239 212657 215244
56895B15244L982N349O780Q225R545J1162J3661J6623J8903K0096K0589K0080
$$ 215244 219226 224575 231355 239580 249125 260287 273948 290571 309474 329570 350159 370239
56883C70239J7435J2402O235K52n150r718j2799j4137j4147j3011j0471o878l294
$$ 370239 387674 400076 406311 406563 401413 391695 378896 364759 350612 337601 327130 320252 316958
56870C16958j11L353P480J1654J5452J9479K4412L0043L5719M0892M4803M6447
$$ 316958 316847 320200 327680 339334 354786 374265 398677 428720 464439 505331 550134 596581
56858E96581M5153M0566L2108J9680N023q892k0181k8688l4261l6050l4028k9702
$$ 596581 641734 682300 714408 734088 739111 730219 710038 681350 647089 611039 577011 547309
56846E47309k4480j8519j1835n189J058P833J6102K5604L5592M5854N6141O5479
$$ 547309 522829 504310 492475 487286 488344 496177 512279 537883 573475 619329 675470 740949
56834G40949P2762P7130P7013O9960N4663L2750P870j6464l7643n3744o3826o8187
$$ 740949 813711 890841 967854 1037814 1092477 1125227 1133097 1116633 1078990 1025246 961420 893233
56822H93233o7712o3297n6181m7980l9656l1060k1945j2812m148M442J3595K3212
$$ 893233 825521 762224 706043 658063 618407 587347 565402 552590 548442 552884 566479 589691
56810E89691L2556M0942M7767N2227N3211M9286L9149K3075L859j4694l0364m2808
$$ 589691 622247 663189 710956 763183 816394 865680 904829 927904 931763 917069 886705 843897
56798H43897n1633n5884n5665n2632m8176m2488l5907k9597k4075j8447j2070
$$ 843897 792264 736380 680715 628083 579907 537419 501512 471915 447840 429393 417323
56787D17323n646J96O050J2386J8305K2727K5651K7038K5621K0241J1602J576
$$ 417323 411677 411873 417923 430309 448614 471341 496992 524030 549651 569892 581494 583070
56775E83070q498j7797k5303l0359l3321l4626l3987l1423k8126k5166k2284j9027
$$ 583070 574572 556775 531472 501113 467792 433166 399179 367756 339630 314464 292180 273153
56763B73153j6131j4347j2914j0734q410p438p809q025p228n900m610l440k635
$$ 273153 257022 242675 229761 219027 210617 203179 195370 187345 180117 174217 169607 166167 163532
56750A63532k543k881k927k521k000j406o42j56m65j166j368r71o24n52l54J04
$$ 163532 160989 158108 155181 152660 150660 149254 148612 148456 147991 146825 145457 144486 143862 143310 142956 143060
56734A43060M15L23K1k74n21p30j025j528j868j317J17J322J421Q92P16J069J531
$$ 143060 143475 143798 143819 143545 143024 142294 141269 139741 137873 136556 136673 137995 139416 140308 141024 142093 143624
56717A43624J923K104J628M99k96MP58R05M86K08O2l95r04q54l95j1N96J905L168
$$ 143624 145547 147651 149279 149778 149482 149486 150244 151149 151635 151843 151905 151510 150606 149752 149357 149346 149942 151847 155015
56698A55015L031J570L46K82P39Q60O50L72m3m38k23P59J741J930J410P82L65
$$ 155015 158046 159616 159962 160244 160983 161843 162493 162865 162822 162384 162161 162920 164661 166591 168001 168783 169148
56681A69148J59L11J094K371L396L400K469J520J168R30P1j072j475j087r74j627
$$ 169148 169307 169618 170712 173083 176479 179879 182348 183868 185036 185966 186037 184965 183490 182403 181429 179802
56665A79802k221k001j334p53o7Q37J276Q06J39P7L12K12M6L21O35L11m27r41
$$ 179802 177581 175580 174246 173493 173426 174263 175539 176345 176484 176561 176873 177085 177131 177452 178087 178398 177971 177030
56647A77030j335j991k515k219j295m77j8R3m94j736k448j566K60J532J888J968
$$ 177030 175695 173704 171189 168970 167675 167198 167180 167273 166779 165043 162595 161029 161289 162821 164709 166677
56631A66677J823J060K71O17J874K445J604M26Q1L23K62l14r26j153r72p13p94
$$ 166677 168500 169560 169831 170448 172322 174767 176371 176797 176878 177201 177463 177149 176223 175070 174098 173385 172591
56614A72591j224j493j308j081j241j470j262q10o24o60o48q20j427j900j460
$$ 172591 171367 169874 168566 167485 166244 164774 163512 162702 162078 161418 160770 159950 158523 156623 155163
56599A55163l07O92J228J594J806J670J446J584J863J697J105N71K14j21k51N2
$$ 155163 154856 155548 156776 158370 160176 161846 163292 164876 166739 168436 169541 170112 170326 170205 169954 170006
56583A70006M44M67K99L14L37J95M05J349K252K125J231N41K71J00L60J572L185
$$ 170006 170450 170917 171216 171530 171867 172062 172467 173816 176068 178193 179424 179965 180236 180336 180696 182268 185453
56566A85453M132M487N213O447P365P709Q168R189J0514J1794J2612J2108R757
$$ 185453 189585 194072 199285 205732 213097 220806 228974 238163 248677 260471 273083 285191 294948
56553B94948O380L288P47j656l577m294m145m047l907l074k127k384l664m387
$$ 294948 301328 304616 305363 303707 300130 295836 291691 287644 283737 280663 278536 276152 272488 268101
56539B68101m046l784m173m267l524k938l419m410m939m957m835m533l960l393
$$ 268101 264055 260271 256098 251831 248307 245369 241950 237540 232601 227644 222809 218276 214316 210923
56525B10923l010k647k334k291k251j654n78L46R87J636J994J471M85J90O83Q91
$$ 210923 207913 205266 202932 200641 198390 196736 196158 196504 197491 199127 201121 202592 203077 203267 203950 204841
56509B04841M29J97O91J148R16L94M2l61q56p98N2R48J214J035P35K09m06m14
$$ 204841 205270 205467 206158 207306 208222 208616 208658 208297 207441 206643 206695 207643 208857 209892 210627 210836 210430 210016
56491B10016L94J195J142L52n34j041r29k87K09p7p10o02L63J126J042O59O07
$$ 210016 210410 211605 212747 213099 212565 211524 210595 210308 210517 210440 209730 209128 209491 210617 211659 212318 212925
56474B12925P16O35M48L05J52J11L49N23J34n27p10m34l72n73m57j57m78j337
$$ 212925 213641 214276 214724 215029 215181 215292 215641 216164 216298 215771 215061 214627 214255 213682 213225 213068 212590 211253
56456B11253j514l81J225K255K552K398J989J618J448R98j24j058n43J067K016
$$ 211253 209739 209358 210583 212838 215390 217788 219777 221395 222843 223841 223717 222659 222116 223183 225199
56441B25199J603R02P59O34J2n84o72o64r05r93p26o71j130j504j271p50l75m7
$$ 225199 226802 227704 228463 229097 229109 228525 227853 227189 226284 225291 224565 223894 222764 221260 219989 219239 218864 218817
56423B18817L68O80P96P29K41o14q15N70K722L769L185K093J345Q16O03J099J749
$$ 218817 219185 219865 220661 221390 221631 221017 220202 220772 223494 227263 230448 232541 233886 234702 235305 236404 238153
56406B38153J400K22m79m87q27j555j402j95O17M73O69J938L107L173K844K909
$$ 238153 239553 239775 239296 238809 237982 236427 235025 234830 235447 235920 236589 238527 241634 244807 247651 250560
56390B50560K897K460K315K738K801K129J714J915J542J11q98l73N78O64M15O29
$$ 250560 253457 255917 258232 260970 263771 265900 267614 269529 271071 271182 270284 269911 270489 271153 271568 272197
56374B72197N20p39k055j915p12J35L40M65M51R7N0Q42J730J773J294J049R41
$$ 272197 272717 271978 269923 268008 267296 267431 267771 268236 268687 268784 268834 269676 271406 273179 274473 275522 276463
56357B76463O81O81J146J350R17O66J022J003K6p36k85L50j54j116j123m61l40
$$ 276463 277144 277825 278971 280321 281238 281904 282926 283929 283955 283219 282934 283284 283130 282014 280891 280430 280090
56340B80090n96q4J224K318K828L140L270L037K899L302L770L691L424L565L836
$$ 280090 279494 279410 280634 282952 285780 288920 292190 295227 298126 301428 305198 308889 312313 315878 319714
56325C19714L799L838M314M568L971L068K640K471K089J774J687J092l80j692
$$ 319714 323513 327351 331665 336233 340204 343272 345912 348383 350472 352246 353933 355025 354645 352953
56311C52953j793j161p98p13m77j51L54J603L269L791K640J534K065L540M496
$$ 352953 351160 349999 349201 348488 348011 347860 348214 349817 353086 356877 359517 361051 363116 366656 371152
56296C71152M866N180N158M680M715N605N973M963L933M108M309L167J999K957
$$ 371152 376018 381198 386356 391036 395751 401356 407329 412292 416225 420333 424642 427809 429808 432765
56282D32765N604P735Q609R021R157Q752Q600R607J0940J1217J0771J0863J1466
$$ 432765 438369 446104 454713 463734 472891 481643 490243 499850 510790 522007 532778 543641 555107
56269E55107J1853J2471J4038J5765J6583J7234J8968K1144K2469K3704K6609
$$ 555107 566960 579431 593469 609234 625817 643051 662019 683163 705632 729336 755945
56258G55945L0917L4916L8405M2666M7988N3608N9730O7256P5911Q4700R3739
$$ 755945 786862 821778 860183 902849 950837 1004445 1064175 1131431 1207342 1292042 1385781
56247A385781J03526J13130J21308J28670J36327J43081J46554J46526J44518
$$ 1385781 1489307 1602437 1723745 1852415 1988742 2131823 2278377 2424903 2569421
56238B569421J40549J32993J21386J06722Q9186O8182M4607K0654k648k5472m7068
$$ 2569421 2709970 2842963 2964349 3071071 3160257 3228439 3273046 3293700 3291052 3265580 3218512
56227C218512o5961q2060r6226j07939j15853j20371j23219j24638j23539j20246
$$ 3218512 3152551 3070491 2974265 2866326 2750473 2630102 2506883 2382245 2258706 2138460
56217B138460j16476j12543j07252j00683r4476q9108q3339p6717p0339o4822
$$ 2138460 2021984 1909441 1802189 1701506 1607030 1517922 1434583 1357866 1287527 1222705
56207A222705n9652n4798n0816m7260m3029l8408l4715l1977k9085k6043k3878
$$ 1222705 1163053 1108255 1057439 1010179 967150 928742 894027 862050 832965 806922 783044
56196G83044k2417k0447j8031j6374j5467j4078j2014j0181q592o605m839m532
$$ 783044 760627 740180 722149 705775 690308 676230 664216 654035 645443 638838 633999 629467
56184F29467n156n005l873k837j883l51Q08Q5j638k019q88p3jN39J482J570J233
$$ 629467 624311 619306 615433 612596 610713 610362 611170 611255 609617 607598 606710 606637 606636 607175 608657 610227 611460
56167F11460K115L772M136L283L467N164O522O933P724Q908Q845P747Q079J0593
$$ 611460 613575 617347 621483 624766 628233 633397 639919 646852 654576 663484 672329 680076 688155 698748
56153F98748J3230J4742J6264J8560K0902K3453K7619L3278L8744M4156N1648
$$ 698748 711978 726720 742984 761544 782446 805899 833518 866796 905540 949696 1001344
56142A001344O1482P1394Q0422Q9819R9157J05239J06206J03398R7909Q8785P6236
$$ 1001344 1062826 1134220 1214642 1304461 1403618 1508857 1615063 1718461 1816370 1905155 1981391
56131A981391O3355N2867M4831L8687L4591L1354K6209J8297R817K508m318j1206
$$ 1981391 2044746 2097613 2142444 2181131 2215722 2247076 2273285 2291582 2301399 2303907 2299589 2288383
56119B288383j7054k1523k6291l2668m0478m9978o1878p4570q4386q9655r1650
$$ 2288383 2271329 2249806 2223515 2190847 2150369 2100391 2038513 1963943 1879557 1789902 1698252
56108A698252r1031q6732p9199p1010o3205n4422m4723l6618l1063k6125k0829
$$ 1698252 1607221 1520489 1441290 1370280 1307075 1252653 1207930 1171312 1140249 1114124 1093295
56097A093295j6715j4277j1629q148n712m856l465p95J040J116J429K996M113
$$ 1093295 1076580 1062303 1050674 1042526 1036814 1031958 1028493 1027698 1028738 1029854 1031283 1034279 1038392
56084A038392M108M922P219Q806Q599Q296Q566P757N987O168Q966J1129J0883
$$ 1038392 1042500 1047422 1054641 1063447 1072046 1080342 1088908 1096665 1102652 1108820 1117786 1128915 1139798
56071A139798J0574J1868J2809J2067J1689J3116J4672J5379J6931J9575K0503
$$ 1139798 1150372 1162240 1175049 1187116 1198805 1211921 1226593 1241972 1258903 1278478 1298981
56060A298981J8854J7777J9019K0120J9474J9358K1148K2331K1315K0393K1040
$$ 1298981 1317835 1335612 1354631 1374751 1394225 1413583 1434731 1457062 1478377 1498770 1519810
56049A519810K1076J9448J8856K0486K1361K0030J9642K1947K3743K2975K2822
$$ 1519810 1540886 1560334 1579190 1599676 1621037 1641067 1660709 1682656 1706399 1729374 1752196
56038A752196K5714K8791K9462L0119L2902L5183L4840L4692L7164L9666L9936
$$ 1752196 1777910 1806701 1836163 1866282 1899184 1934367 1969207 2003899 2041063 2080729 2120665
56027B120665M0667M4115M7402M7998M8530N1335N3668N3331N3460N6651N9902
$$ 2120665 2161332 2205447 2252849 2300847 2349377 2400712 2454380 2507711 2561171 2617822 2677724
56016B677724O0641O1935O6415P0918P2722P5018Q0511Q5723Q7654Q9781R5416
$$ 2677724 2738365 2800300 2866715 2937633 3010355 3085373 3165884 3251607 3339261 3429042 3524458
56005C524458J01380J04518J07992J14781J21733J26390J32647J42945J52479
$$ 3524458 3625838 3730356 3838348 3953129 4074862 4201252 4333899 4476844 4629323
55996D629323J58104J65107J77656J90836K00060K09930K25146K41468K54666
$$ 4629323 4787427 4952534 5130190 5321026 5521086 5731016 5956162 6197630 6452296
55987F452296K69565K90675L12981L31948L53156L81754M12337M40254M72416
$$ 6452296 6721861 7012536 7325517 7657465 8010621 8392375 8804712 9244966 9717382
55978I717382N15159N62374O08124O59595P24285P96632Q71731R59424J069302
$$ 9717382 10232541 10794915 11403039 12062634 12786919 13583551 14455282 15414706 16484008
55969A6484008J195378J332468J493557J693103J928971K200985K530992K943071
$$ 16484008 17679386 19011854 20505411 22198514 24127485 26328470 28859462 31802533
55961C1802533L442267M037009M762969N659433O747388Q064277R695829J1737033
$$ 31802533 35244800 39281809 44044778 49704211 56451599 64515876 74211705 85948738
55953H5948738J4245524J7257313K0777215K4661423K8534753L1897662L4251044
$$ 85948738 100194262 117451575 138228790 162890213 191424966 223322628 257573672
55946B57573672L4975142L3158504K7889331J9008208P578825m504538j5409347
$$ 257573672 292548814 325707318 353596649 372604857 380183682 375679144 360269797
55939C60269797k3945412k9582467l2290605l2476048l0865928k8229026k5135084
$$ 360269797 336324385 306741918 274451313 241975265 211109337 182880311 157745227
55932A57745227k1939476j8880560j6108490j3670087j1550790r737421q217892
$$ 157745227 135805751 116925191 100816701 87146614 75595824 65858403 57640511
55925E7640511o952266n889522n001990m274707l676932l172960k748267k399495
$$ 57640511 50688245 44798723 39796733 35522026 31845094 28672134 25923867 23524372
55917B3524372k110121j858896j641261j460552j307529j168199j042671r37522
$$ 23524372 21414251 19555355 17914094 16453542 15146013 13977814 12935143 11997621
55909A1997621q47726p63297o85805o21821n67424n14761m66733m30012m00166
$$ 11997621 11149895 10386598 9700793 9078972 8511548 7996787 7530054 7100042 6699876
55900F699876l68265l36109l10900k90598k68184k45184k27729k13930j97792
$$ 6699876 6331611 5995502 5684602 5394004 5125820 4880636 4652907 4438977 4241185
55891D241185j81218j69984j61761j49980j35911j25632j18393j09011r8678r2682
$$ 4241185 4059967 3889983 3728222 3578242 3442331 3316699 3198306 3089295 2990617 2897935
55881B897935r0166q6332q2211q2313q4909q4346q0931p9349p9234p6339p1286
$$ 2897935 2807769 2721437 2639226 2556913 2472004 2387658 2306727 2227378 2148144 2071805 2000519
55870B000519o8408o7354o4183n9369n6678n5428n1705m6144m2925m2096m0123
$$ 2000519 1932111 1864757 1800574 1741205 1684527 1629099 1577394 1531250 1488325 1446229 1406106
55859A406106l7004l5727l5737l3824l0598k9464k9986k8744k5947k4820k5293
$$ 1406106 1369102 1333375 1297638 1263814 1233216 1203752 1173766 1145022 1119075 1094255 1068962
55848A068962k4544k3068k3991k6844k7979k6753k5743k5287k3372k0493j9260
$$ 1068962 1044418 1021350 997359 970515 942536 915783 890040 864753 841381 820888 801628
55837H01628j9489j8691j6943j6403j6662j5436j3176j2156j1845j0005p510p127
$$ 801628 782139 763448 746505 730102 713440 698004 684828 672672 660827 650822 643312 636185
55825F36185q332q253p021p257q864r350q765r420j1058j1173r801r371j0009
$$ 636185 627853 619600 612579 605322 596458 587108 578343 568923 557865 546692 536891 527520 517511
55812E17511r630q400q462r458q821o440m675l877k319l05J35m18P47L490M732
$$ 517511 507881 499481 491019 481561 472740 466300 461625 457748 455429 455124 455259 454841 455588 459078 463810
55797D63810L594K398K229J650L01k50J65j05j154j254m02n97k146l061k619k319
$$ 463810 467404 469802 472031 473681 473982 473732 473897 473792 472638 471384 470982 470385 468239 465178 462559 460240
55781D60240k956l825m948p085r461j0380r998r561q455n216r63J755L095N184
$$ 460240 457284 453459 448511 441426 431965 421585 411587 402026 393571 388355 387392 389147 392242 397426
55767C97426P603P452L977n90m901r493j3822j6032j6124j5895j5513j3534j0402
$$ 397426 405029 412481 416458 415868 410967 401474 387652 371620 355496 339601 324088 310554 300152
55754C00152q348p543n995l530k242k600k801k416k895l947l300r24L20p34j882
$$ 300152 291804 284261 278266 274736 272494 269894 267093 264677 261782 257835 254535 253611 253931 253197 251315
55739B51315j538r26j047q66R7M10o41j776k217k762l536l404k549k744m239n220
$$ 251315 249777 248851 247804 246938 247035 247445 246804 245028 242811 240049 236513 233109 230560 227816 223577 218357
55723B18357n156n596o764o568m203j688n16K63J416J949J568J822L283M306M091
$$ 218357 213201 207605 200841 194273 190070 188382 187866 188129 189545 191494 193062 194884 198167 202473 206564
55708B06564M223N578O409N252L211J602k51l015n373o091o080o611p144o654
$$ 206564 210787 216365 222774 228026 231237 232839 232588 229573 224200 218109 212029 205418 198274 191620
55694A91620n530m676m079l576l518l661k967j450n56p88q10K37J387J786J990
$$ 191620 186090 181414 177335 173759 170241 166580 163613 162163 161607 160819 160009 160246 161633 163419 165409
55679A65409K431K562K423L019M159M101K367P08K02k87j472j994r69O1m22j453
$$ 165409 167840 170402 172825 175844 180003 184104 186471 187179 187381 187094 185622 183628 182659 182720 182298 180845
55663A80845j416n64k1K02M93M79J15L75J496K063J293N51J054J761J233M2m71
$$ 180845 179429 178865 178844 179046 179539 180018 180133 180508 182004 184067 185360 185911 186965 188726 189959 190001 189530
55646A89530n08r95j650j607j045o09j65M82N58n51k074l057l876n211o472o591
$$ 189530 189022 188027 186377 184770 183725 183116 182951 183433 183991 183440 181366 178309 174433 169222 162750 156159
55630A56159n647m482l388k294j545j454j675j807j971k171j977j418j217j615
$$ 156159 150512 146030 142642 140348 138803 137349 135674 133867 131896 129725 127748 126330 125113 123498
55616A23498j999k150k555l039k581j136j49m05r52r90j205k154k920k578j737
$$ 123498 121499 119349 116794 113755 111174 110038 109889 109484 108532 107542 106337 104183 101263 98685 96948
55601I6948j396j398j153p46l93J53P55O38j93o62m07m39j246j766j287p10q45
$$ 96948 95552 94154 93001 92255 91862 92015 92770 93408 93215 92553 92146 91707 90461 88695 87408 86698 85853
55584H5853r94m22K58L85M96J091J496J155O81N77L75M6O57K375L537L076K179
$$ 85853 84859 84437 84695 85080 85576 86667 88163 89318 89999 90576 90951 90997 91654 94029 97566 100642 102821
55567A02821K149K324J793J381J979K431J229q49j886j652j335j342j283j418
$$ 102821 104970 107294 109087 110468 112447 114878 116107 115258 113372 111720 110385 109043 107760 106342
55553A06342k257l171l066k065j206r23r30j064j185r59n97q81j633j460P4J478
$$ 106342 104085 100914 97848 95783 94577 93654 92724 91660 90475 89516 88919 88038 86405 84945 85019 86497
55537H6497J650J470J812J764N71l70M27J956K318J637J217R40j14j422j784j600
$$ 86497 88147 89617 91429 93193 93764 93394 93821 95777 98095 99732 100949 101889 101775 100353 98569 96969
55521I6969k122l086l285k918l072l428k805j635j507k360k426j169j65o71k064
$$ 96969 94847 91761 88476 85558 82486 79058 76253 74618 73111 70751 68325 67156 66991 66320 64256
55506F4256l072l119k223q18K02L34K28O35J141J098J093J980L116L194K340J647
$$ 64256 61184 58065 55842 55024 55226 55560 55788 56423 57564 58662 59755 61735 64851 68045 70385 72032
55490G2032J194L21n86n37J00Kr00j415j182q78n07N49J802J870O93k34j10M07
$$ 72032 73226 73547 72961 72424 72524 72526 71626 70211 69029 68151 67644 68193 69995 71865 72558 72324 72214 72621
55472G2621Q00J343J807J283j72j219j126o00l88l33k72n34j046j054l25L73L41
$$ 72621 73421 74764 76571 77854 77682 76463 75337 74737 74349 74016 73744 73210 72164 71110 70785 71158 71499
55455G1499k59q83j147q06l0M36J57k36n4J61m30j237r00N05J474J266O08K09
$$ 71499 71240 70357 69210 68404 68374 68810 68967 68731 68677 68838 68408 67171 66271 66776 68250 69516 70124 70333
55437G0333n1k68j96j4k22p01r03q67r54q03J56J327J489O05k27n36p19p13j7
$$ 70333 70282 70014 69818 69804 69582 68881 67978 67111 66157 65354 65510 66837 68326 68931 68704 68168 67449 66736 66719
55418F6719R81J209N86R9J67L18M07O48N76l46j238p38O16Q87j89p80M5R91Q58
$$ 66719 67700 68909 69495 69594 69761 70079 70486 71134 71710 71364 70126 69388 70004 70891 70702 69922 69967 70958 71816
55399G1816J69l22q38j353r54M36J278N28q00j305j132j105j167q30k64K31R51
$$ 71816 71985 71663 70825 69472 68518 68954 70232 70760 69960 68655 67523 66418 65251 64421 64157 64388 65339
55382F5339J992K547J947P44q4l02j20N32J637K660L109L098K923K624K285K004
$$ 65339 67331 69878 71825 72569 72485 72183 72063 72595 74232 76892 80001 83099 86022 88646 90931 92935
55366I2935J419J27j301j739j189q29j166j454j315j424j980j987r21J15j4q68
$$ 92935 94354 94481 93180 91441 90252 89423 88257 86803 85488 84064 82084 80097 79176 79291 79277 78409
55350G8409j375j409j384j187n79M5K69L70O57P32K69j84L0P07J245J430J212
$$ 78409 77034 75625 74241 73054 72475 72520 72789 73159 73816 74548 74817 74633 74663 75370 76615 78045 79257
55333G9257L77q20j489j232p25n73m07J57N40O1q80j402j329j018n84j20p0o03
$$ 79257 79634 78814 77325 76093 75368 74795 74388 74545 75085 75146 74266 72864 71535 70517 69933 69813 69743 69140
55315F9140j041o80J91P60P01K39l38p01n41n9J25q8j13K11J91m45p99o1J238
$$ 69140 68099 67419 67610 68370 69071 69310 68972 68271 67730 67671 67796 67708 67595 67806 67997 67552 66753 66692 67930
55296F7930J962J727Q33l93j504j818j200l69J26N72J120J079O0r49o69P32J935
$$ 67930 69892 71619 72452 72059 70555 68737 67537 67168 67294 67866 68986 70065 70125 69176 68507 69239 71174
55279G1174K053J231O9p60p62j21L98M85N50O44R3j117j659o37R18J463J117J063
$$ 71174 73227 74458 74527 73767 73005 72884 73282 73767 74317 74961 75054 73937 72278 71641 72559 74022 75139 76202
55261G6202J410J149L5q95q22j01M48M08j51p79q58k38M21M38j8l49m09l68j79
$$ 76202 77612 78761 78796 77901 77079 76978 77426 77834 77683 76904 76046 75808 76229 76667 76649 76300 75891 75523 75344
55242G5344J09k8q60j664j568q30l59l28j82J48J34k90m98j51L81P08Q12O79J69
$$ 75344 75453 75425 74565 72901 71333 70503 70144 69816 69634 69782 69916 69626 69128 68977 69358 70066 70878 71557 71726
55223G1726m90p26l19L30P52Q22O14J83l14o06n41k03J62K75P2j08J44P08J003
$$ 71726 71236 70510 70191 70521 71273 72095 72709 72892 72578 71972 71431 71228 71390 71665 71737 71629 71773 72481 73484
55204G3484P99M96M12K93j24o10q37q70q32n48J00Q44J390J673J564Q75m2l75
$$ 73484 74283 74779 75191 75484 75360 74750 73913 73043 72211 71663 71763 72607 73997 75670 77234 78109 78067 77692
55186G7692J01O80Q27Q17Q51M02q33k064k338j742j027n46l30m78p59m52O38J557
$$ 77692 77793 78473 79300 80117 80968 81370 80537 78473 76135 74393 73366 72820 72490 72012 71253 70801 71439 72996
55168G2996J496R97R58J120O58k63o48j80N51J061J243R22J18m54j38N97P31J44
$$ 72996 74492 75489 76447 77567 78225 77962 77314 77134 77685 78746 79989 80911 81029 80575 80437 81034 81765 81909
55150H1909l93m35j56L10Q83J087N42k44n09l73m38n50j18N76N80j77q01q98r37
$$ 81909 81516 81081 80925 81235 82118 83205 83747 83503 82994 82621 82183 81633 81515 82091 82671 82494 81693 80795 79858
55131G9858j063p87j24J16l45o90k45N88J132J407J725J925J582O38n29j373j451
$$ 79858 78795 78008 77884 78000 77655 76965 76720 77308 78440 79847 81572 83497 85079 85717 85188 83815 82364
55114H2364q38k74m27r42q44J45J290J872J880J546R44K24k59l18l0M82R77R79
$$ 82364 81526 81252 80825 79883 79039 79184 80474 82346 84226 85772 86716 86940 86681 86363 86333 86815 87792 88771
55096H8771L32k24J90J344K116J944J321Q28N23L57L58K91j14n01k53M05N64K5
$$ 88771 89103 88879 89069 90413 92529 94473 95794 96622 97145 97502 97860 98151 98037 97536 97283 97688 98252 98277
55078I8277m43m45n23r69j126n18K13K80m9l1L22L89Pl69m15k16P6M02O56P43
$$ 98277 97834 97389 96866 95897 94771 94253 94466 94746 94697 94666 94988 95377 95384 95015 94600 94384 94460 94862 95518 96261
55058I6261P30O98N71K78q0m05o97q35n84o2J19m84j480j956j454m51J53j9m11
$$ 96261 96991 97689 98260 98538 98458 98053 97356 96521 95937 95875 95994 95510 94030 92074 90620 90169 90322 90303 89892
55039H9892j73P55J444J032k36j326j547r82p0P47J040O24j31n92m84RO13J024
$$ 89892 89719 90474 91918 92950 92714 91388 89841 88859 88789 89536 90576 91200 91069 90477 89993 90002 90615 91639
55021I1639Q87K04m05l71J8M1l46n34k65J06L25N04N72K50k78m30j88k78j097
$$ 91639 92526 92730 92325 91954 91972 92013 91667 91133 90868 90974 91299 91803 92375 92625 92347 91917 91729 91451 90354
55002I0354k077k448k059j138J78J570K358K102J196M59L27O71J121J338J170
$$ 90354 88277 85829 83770 82632 82810 84380 86738 88840 90036 90495 90822 91493 92614 93952 95122
54987I5122P30K41k57p75j082q90l63M9K66N95J003J003M32j25m1O24J323J623
$$ 95122 95852 96093 95836 95061 93979 93089 92726 92775 93041 93636 94639 95642 96074 95949 95908 96532 97855 99478
54969I9478J410P94Q7l72n27n75o19n81m50l06j52M8J86K29M10P92Q87K88m88
$$ 99478 100888 101682 101769 101397 100870 100295 99676 99095 98645 98339 98187 98235 98421 98650 99060 99852 100739 101027 100539
54950A00539n20K45R35J018Q04O35L51j16l98l33l39o84r66p21j77J21N0q5n8
$$ 100539 100019 100264 101199 102217 103021 103656 104007 103891 103493 103160 102821 102137 101171 100450 100273 100394 100444 100359 100301
54931A00301J06L02M35M61M22L24R1j37J38J127K180K449K047J874K349L026L533
$$ 100301 100407 100709 101144 101605 102027 102351 102442 102305 102443 103570 105750 108199 110246 112120 114469 117495 121028
54914A21028M061M692N027M791M128L095J571l0p93o29p21k034l893m853m540
$$ 121028 125089 129781 134808 139599 143727 146822 148393 148363 147570 146941 146220 144186 140293 135440 130900
54899A30900l835l457l193k559j637r57q69j247j711j955j848j336m99K83N67
$$ 130900 127065 123608 120415 117856 116219 115262 114393 113146 111435 109480 107632 106296 105797 106080 106647
54884A06647L96L20N99Q56Q20Q59J230J366Q04K77Q69K345L537M113M766N615
$$ 106647 107043 107363 107962 108818 109638 110497 111727 113093 113897 114174 115043 117388 120925 125038 129804 135419
54868A35419N817N008L890K907J644K0j146j505j978l292m673n006m517m218m292
$$ 135419 141236 146244 150134 153041 154685 154705 153559 152054 150076 146784 142111 137105 132588 128370 124078
54853A24078m066l295k548k300k370k290j847j289j117j428j536q08J93K78o08
$$ 124078 120012 116717 114169 111869 109499 107209 105362 104073 102956 101528 99992 99184 99377 99655 99047
54838I9047j184q06l97q04j373j085j91L61M68O76R87R42N74L20J72j88o43p57
$$ 99047 97863 97057 96660 95856 94483 93398 93207 93568 94036 94712 95699 96641 97215 97535 97707 97519 96876 96119
54820I6119m87r7L52P81P48O5n41k31P43J322R64J1r70j529j277k51Q00J174J072
$$ 96119 95632 95535 95887 96668 97416 97481 96940 96709 97452 98774 99738 99749 98779 97250 95973 95722 96522 97696 98768
54801I8768J088J181R37N17M59O47M53j25l47R9O01N65K43J95M56N18M3o58q74
$$ 98768 99856 101037 101974 102491 102950 103597 104050 103925 103578 103677 104278 104843 105086 105281 105737 106255 106298 105640 104766
54782A04766k96M74N77O1j23N20J289J370R85Q52J036J088R55R50J131J375J839
$$ 104766 104470 104944 105521 105582 105459 105979 107268 108638 109623 110475 111511 112599 113554 114504 115635 117010 118849
54765A18849K685L547L972M145M516M991N119M913M706M425L691K505J193j61
$$ 118849 121534 125081 129053 133198 137714 142705 147824 152737 157443 161868 165559 168064 169257 169096
54751A69096j593k814l571m167m907n333m851l883l436l625l597k906k009j353
$$ 169096 167503 164689 161118 156951 152044 146711 141860 137977 134541 130916 127319 124413 122404 121051
54737A21051q62n15n78r70j083n83J62O41P34N73L41K63M11N68P14J314K511L406
$$ 121051 120189 119674 119096 118126 117043 116460 116622 117263 117997 118570 118911 119174 119585 120153 120867 122181 124692 128098
54719A28098L135K361K623M082N148M638L200K078J463Q13L5n37r59j654k683
$$ 128098 131233 133594 136217 140299 145447 150085 153285 155363 156826 157639 157674 157137 156178 154524 151841
54704A51841l576l941l903l896m099m125l414k027p96l22j88L35J050J065R8j165
$$ 151841 148265 144324 140421 136525 132426 128301 124887 122860 122064 121742 121554 121889 122939 124004 124102 122937
54688A22937k045k437k331j602n80q5m96j233j528j248p28l07k20n00p61n35j5
$$ 122937 120892 118455 116124 114522 113942 113857 113361 112128 110600 109352 108624 108317 108097 107597 106836 106301 106286
54671A06286J14k37k67N39J502J551N31p30j411j276n58K70O86M24k53p58o42
$$ 106286 106400 106163 105896 106435 107937 109488 110019 109289 107878 106602 106044 106314 107000 107424 107171 106413 105771
54654A05771Q7R05J097L85o78j215r07k07L14M91M41L07K22L11N38O93N71R4o16
$$ 105771 105858 106763 107860 108245 107567 106352 105445 105238 105552 106043 106484 106791 107013 107324 107862 108555 109126 109220 108604
54635A08604j174j162n93MK46L14M64N00J93j52j12J91L74M96P91J016Q09M33
$$ 108604 107430 106268 105675 105679 105925 106239 106703 107203 107396 107244 107132 107323 107697 108193 108984 110000 110809 111242
54617A11242M15O24N07J23K3J56r8p75j170j023q72r24n52O36J964K477J949P63
$$ 111242 111657 112281 112788 112911 112934 113090 112992 112217 111047 110024 109152 108228 107676 108312 110276 112753 114702 115465
54599A15465n67j456j429p23j50j03k11k14m20r14j054l65O73J245J170P49K04
$$ 115465 114898 113442 112013 111290 111140 111037 110826 110612 110192 109278 108224 107859 108532 109777 110947 111696 111900
54582A11900k76l37N3K95j28q67j123o27J58O74P40N29L04J41j23m91n20J22R04
$$ 111900 111624 111287 111340 111635 111507 110640 109517 108890 109048 109722 110462 110991 111295 111436 111313 110822 110302 110424 111328
54563A11328R05J09m04J42J284K074K160J757J094L46k12m56n23m98l15j16j88
$$ 111328 112233 112342 111938 112080 113364 115438 117598 119355 120449 120795 120583 120127 119604 119106 118791 118675 118487
54546A18487l69p2Q60J777K043J705J120L98l58p75n31K47J113J539J124j0j053
$$ 118487 118118 118046 118906 120683 122726 124431 125551 125949 125591 124816 124285 124532 125645 127184 128308 128298 127245
54529A27245j304j057r95r53k94N70M44o30j089k39N33r6j291j415m79J59m8m30
$$ 127245 125941 124884 123889 122936 122642 123212 123656 123026 121937 121698 122231 122135 120844 119429 118950 119109 119061 118631
54511A18631m90l49KP41J467J464P60R2j82l08k74L27J393K038J544J40j338k151
$$ 118631 118141 117792 117794 118535 120002 121466 122226 122318 122136 121828 121554 121881 123274 125312 126856 126996 125658 123507
54493A23507j976r71K80J102J192P03O6k25P4O46Q96O60K97K2l00n71l66K07L48
$$ 123507 121531 120560 120840 121942 123134 123837 123903 123678 123752 124398 125294 125954 126251 126273 125973 125402 125036 125243 125591
54474A25591k64q22n29L30J101J779K534K857K241J241Q76J253J617J488R73K55
$$ 125591 125327 124505 123976 124306 125407 127186 129720 132577 134818 136059 136935 138188 139805 141293 142266 142521
54458A42521m34o77m35l69q06r34M8J475K013J465O03l39j593k570k218p72L03
$$ 142521 142087 141410 140975 140606 139800 138866 138914 140389 142402 143867 144470 144131 142538 139968 137750 136978 137281
54441A37281L37J10K01R9n05r08n66l6L3j19p0r9n15r01q04n98q08j030m61P71
$$ 137281 137618 137728 137929 138028 137523 136615 136049 136013 136046 135927 135857 135758 135243 134342 133538 132940 132132 131102 130641 131412
54421A31412J566J183M8p75o12L27J228J462J081M94j49q22j142p13P4L50P8K14
$$ 131412 132978 134161 134209 133434 132822 133149 134377 135839 136920 137414 137265 136443 135301 134588 134662 135012 135090 135304
54403A35304J229K207J992O31q54j726j924j573q13N6P33J246J800K363K675K587
$$ 135304 136533 138740 140732 141363 140509 138783 136859 135286 134473 134529 135262 136508 138308 140671 143346 145933
54387A45933K156J489O88j51r50j607j936j823j361o58L19J370J791J098m5l74
$$ 145933 148089 149578 150266 150115 149165 147558 145622 143799 142438 141780 142099 143469 145260 146358 146313 145939
54371A45939L95J250J333J009J030J406J700J898K303K885L282L322L019K284
$$ 145939 146334 147584 148917 149926 150956 152362 154062 155960 158263 161148 164430 167752 170771 173055
54357A73055J137J04j65L08P94O24k28j304k117k453k459k448k603k833k990l007
$$ 173055 174192 174296 174131 174439 175233 175857 175629 174325 172208 169755 167296 164848 162245 159412 156422 153415
54341A53415k789k209j364o82n31q54j265j441j338j186j283j674j955j567l72
$$ 153415 150626 148417 147053 146371 145840 144986 143721 142280 140942 139756 138473 136799 134844 133277 132905
54326A32905J177K410K812K209R36k68q06p24m16p0K25J24n07j031o77J05j3j326
$$ 132905 134082 136492 139304 141513 142449 142181 141375 140651 140235 140165 140390 140514 140007 138976 138299 138404 138391 137065
54308A37065k477k244j129m11l19j35L89P19O19N42Q03J025P38Q2l77l34J2K94
$$ 137065 134588 132344 131215 130804 130485 130350 130739 131458 132077 132619 133422 134447 135185 135267 134890 134556 134568 134862
54290A34862L48K83K14Q6o9R7Q08J572J580Q28K56M88J017J100Q24O46L86m39
$$ 134862 135210 135493 135707 135793 135724 135821 136629 138201 139781 140609 140865 141353 142370 143470 144294 144940 145326 144887
54272A44887j489j791j135m56n74j175j373p86K47J204J725J753J584J661K061
$$ 144887 143398 141607 140472 140016 139442 138267 136894 136108 136355 137559 139284 141037 142621 144282 146343
54257A46343K333K015J221M87J55J19J04O1J40L89O15N42J32l80p15p56n38k32
$$ 146343 148676 150691 151912 152399 152554 152673 152777 152838 152978 153367 153982 154524 154656 154276 153561 152805 152267 152035
54239A52035j21m08r52j321j284j031q22o39l62j07n8j46j55p5p2j45j08P4J85
$$ 152035 151914 151506 150554 149233 147949 146918 146096 145457 145095 144988 144930 144784 144629 144554 144482 144337 144229 144303 144488
54220A44488M6k94o59q46o78j43N00Q79Q37M57r6n50n18J20Q56J018O19L56N85
$$ 144488 144534 144240 143581 142735 142057 141914 142414 143293 144130 144587 144491 143941 143423 143543 144399 145417 146036 146392 146977
54201A46977P91L78m16q61p52m90l54k06K5J10k2r9M0J17o4k10J8L71L76Ml71
$$ 146977 147768 148146 147730 146869 146117 145627 145273 145067 145092 145202 145180 145081 145121 145238 145174 144964 144982 145353 145729 145733 145362
54180A45362n96p20m52O29K177L033K456R92j76m54j25K31K41n9k65l8K87p8j252
$$ 145362 144766 144046 143594 144223 146400 149433 151889 152881 152705 152251 152126 152357 152598 152539 152274 152236 152523 152445 151193
54161A51193k281k272j546j067j070r82n12l1J60K19K92K50J09J90O25J102J295
$$ 151193 148912 146640 145094 144027 142957 141975 141463 141432 141592 141811 142103 142353 142462 142652 143277 144379 145674
54144A45674J244J114R52P79O51M90J78j57k71k40l20l89o1N24O25j37j168j648
$$ 145674 146918 148032 148984 149763 150414 150904 151082 150925 150654 150414 150094 149705 149644 150168 150793 150656 149488 147840
54126A47840j443r77n20l5N12R89J241J177Q76O27O72Q61Q30N29K09n4l87o32
$$ 147840 146397 145420 144900 144865 145377 146366 147607 148784 149660 150287 150959 151820 152650 153179 153388 153334 152947 152315
54108A52315l82L18Q85J049J213J642J857J380O62O51J626K885L516L168K260
$$ 152315 151933 152251 153136 154185 155398 157040 158897 160277 160939 161590 163216 166101 169617 172785 175045
54093A75045J641J837K414K375J348K2q34j242j605j961k110k109k080j859j350
$$ 175045 176686 178523 180937 183312 184660 184682 183848 182606 181001 179040 176930 174821 172741 170882 169532
54078A69532r12q85j017q65m34O1P09J575K187K092J682J722K209K508K476K575
$$ 169532 168620 167735 166718 165853 165419 165480 166189 167764 169951 172043 173725 175447 177656 180164 182640 185215
54062A85215K836K668J888J126Q08M96l29j398k075k219k120j895j433o74L24
$$ 185215 188051 190719 192607 193733 194541 195037 194708 193310 191235 189016 186896 185001 183568 182894 183218
54047A83218J482K497K868K471J937K020K702L272L274L042L219L969M871N421
$$ 183218 184700 187197 190065 192536 194473 196493 199195 202467 205741 208783 212002 215971 220842 226263
54033B26263N519N454N513N671N722N600N452N347N078M308L012J660Q89Q60J031
$$ 226263 231782 237236 242749 248420 254142 259742 265194 270541 275619 279927 282939 284599 285488 286348 287379
54018B87379O74k87j201j518j452j654k420l462m298m610m365l877l648l917m373
$$ 287379 288053 287766 286565 285047 283595 281941 279521 276059 271761 267151 262786 258909 255261 251344 246971
54003B46971m581m527m409m113l347k329j773j960k259j958j234r10j334j976
$$ 246971 242390 237863 233454 229341 225994 223665 221892 219932 217673 215715 214481 213571 212237 210261
53989B10261k167j905j679j721j779j588j262j002p25k81N8k24j112j845j699
$$ 210261 208094 206189 204510 202789 201010 199422 198160 197158 196433 196152 196210 195986 194874 193029 191330
53974A91330p89J64O13N12J45j25K2O32J404J992K344K606K875L244L857M679
$$ 191330 190541 190705 191318 191830 191975 191850 191872 192504 193908 195900 198244 200850 203725 206969 210826 215505
53958B15505N424N983O718P861Q787Q419O434L608Q76j462l403m654m841m167
$$ 215505 220929 226912 233630 241491 250278 258697 265131 268739 269615 268153 264750 260096 255255 251088
53944B51088l296k571j705l74J149K199K501K440K481K621K590K440K531K953
$$ 251088 247792 245221 243516 243142 244291 246490 248991 251431 253912 256533 259123 261563 264094 267047
53930B67047L289L094K461J919J929K529L314L756L727L682M133M936N448N380
$$ 267047 270336 273430 275891 277810 279739 282268 285582 289338 293065 296747 300880 305816 311264 316644
53916C16644N116N082N318N763O475P274P679P520P150O718N846M426L091K241
$$ 316644 321760 326842 332160 337923 344398 351672 359351 366871 374021 380739 386585 391011 394102 396343
53902C96343J274m19k142k734k310k053k336k356j884k052l724o072p603p991
$$ 396343 397617 397198 395056 392322 390012 387959 385623 383267 381383 379331 375607 369535 361932 353941
53888C53941q015q181q233p920p412o923o452n997n641n315m790m000l174k531
$$ 353941 345926 337745 329512 321592 314180 307257 300805 294808 289167 283852 279062 275062 271888 269357
53874B69357k101j890k040k658l522m142m162l709l207k871k578k262k177k539
$$ 269357 267256 265366 263326 260668 257146 253004 248842 245133 241926 239055 236477 234215 232038 229499
53860B29499l100l352l131k698k301j945j591j306j149j082j110j278j559j858
$$ 229499 226399 223047 219916 217218 214917 212972 211381 210075 208926 207844 206734 205456 203897 202039
53846B02039k050j915j207o6P93O92k15j068j175n32M34J232J412Q38k1m04m2
$$ 202039 199989 198074 196867 196801 197594 198286 198071 197003 195828 195296 195730 196962 198374 199212 199191 198787 198745
53829A98745N98R23Q09N28L49L61M50M31K68J97M00P28R32J063J297J531J507
$$ 198745 199343 200266 201075 201603 201952 202313 202763 203194 203462 203659 204059 204787 205719 206782 208079 209610 211117
53812B11117J269J057R38Q92J150J885K675K906K705K789L357L912M251M798N664
$$ 211117 212386 213443 214381 215273 216423 218308 220983 223889 226594 229383 232740 236652 240903 245701 251365
53797B51365O173N828N104M744M737M594M135L539K870K199J837K001K403K565
$$ 251365 257538 263366 268470 273214 277951 282545 286680 290219 293089 295288 297125 299126 301529 304094
53783C04094K308J645N62p25j685k087k397l125m098m859n369n790n908n456m776
$$ 304094 306402 308047 308609 307884 306199 304112 301715 298590 294492 289633 284264 278474 272566 267110 262334
53768B62334m478m543m409l865l263k846k515k258k210k189j786j083p30j119
$$ 262334 257856 253313 248904 245039 241776 238930 236415 234157 231947 229758 227972 226889 226159 225040
53754B25040j853k298k278k010j730j547j436j188o51p3R9j81n19p48j097j529
$$ 225040 223187 220889 218611 216601 214871 213324 211888 210700 210049 209976 210075 209894 209375 208627 207530 206001
53738B06001j476o18M61R65R63J152J737K081J648P38O4o2J25K97M09O61J206
$$ 206001 204525 203907 204368 205333 206296 207448 209185 211266 212914 213652 213716 213654 213779 214076 214485 215146 216352
53721B16352J823J963J391P42J006K218L214L061K300K089K522K676K346K473
$$ 216352 218175 220138 221529 222271 223277 225495 228709 231770 234070 236159 238681 241357 243703 246176
53707B46176L488M247L601K220J715K305K682K151J640K089K951L119K623K469
$$ 246176 249664 253911 257512 259732 261447 263752 266434 268585 270225 272314 275265 278384 281007 283476
53693B83476L105L867L941L274K425J911J800J734J328N81j53o77j199j840k266
$$ 283476 286581 290448 294389 297663 300088 301999 303799 305533 306861 307442 307289 306612 305413 303573 301307
53678C01307k091j514j127j209j481j520j124l64L86N53j50j289k006j846j160
$$ 301307 299216 297702 296575 295366 293885 292365 291241 290877 291263 291816 291666 290377 288371 286525 285365
53663B85365o03m82o15o60m57j05J15m6n99j157j086o6J350K036J497N47L92J111
$$ 285365 284762 284280 283665 283005 282548 282443 282558 282512 281913 280756 279670 279604 280954 282990 284487 285034 285426 286537
53645B86537J700J555J219J344J680J672J517J874K721L250K939K119J401J015
$$ 286537 288237 289792 291011 292355 294035 295707 297224 299098 301819 305069 308008 310127 311528 312543
53631C12543R30J197J927L023M088M636M430L735L133L012L326L857M452M821
$$ 312543 313473 314670 316597 319620 323708 328344 332774 336509 339642 342654 345980 349837 354289 359110
53617C59110M513L449K357K173L032M146M655M385L811L551L880M501M860M732
$$ 359110 363623 367072 369429 371602 374634 378780 383435 387820 391631 395182 399062 403563 408423 413155
53603D13155M369L965L317K308J402J184J559J813J431M86o65j613j961j657j214
$$ 413155 417524 421489 424806 427114 428516 429700 431259 433072 434503 434989 434324 432711 430750 429093 427879
53588D27879j240j696k026j965j796j759j810k003k568l390l880l621k888k236
$$ 427879 426639 424943 422917 420952 419156 417397 415587 413584 411016 407626 403746 400125 397237 395001
53574C95001j940j977k256k519k357j667q86n47o75r17j043j020p75k19M45Q11
$$ 395001 393061 391084 388828 386309 383952 382285 381399 380852 380177 379260 378217 377197 376422 376203 376648 377459
53558C77459P04M41M79R34J468J648J374R41O73O16O22O73R59J590K361K895L063
$$ 377459 378163 378604 379083 380017 381485 383133 384507 385448 386121 386737 387359 388032 388991 390581 392942 395837 398900
53541C98900L176L686M640N530N887N948O383P357Q225Q411Q224Q420R250J0346
$$ 398900 402076 405762 410402 415932 421819 427767 434150 441507 449732 458143 466367 474787 484037 494383
53527D94383J1369J2252J2936J3379J3845J4667J5657J6225J6212J6126J6456
$$ 494383 505752 518004 530940 544319 558164 572831 588488 604713 620925 637051 653507
53516F53507J7253J8508K0376K2672K4656K5787K6421K7251K8271K8874K8827
$$ 653507 670760 689268 709644 732316 756972 782759 809180 836431 864702 893576 922403
53505I22403K8647K8888K9384K9413K8444K6677K4981K4253K4587K5079K4648
$$ 922403 951050 979938 1009322 1038735 1067179 1093856 1118837 1143090 1167677 1192756 1217404
53494A217404K3157K1504K0597K0456K0453K0219J9975K0048K0357K0554K0480
$$ 1217404 1240561 1262065 1282662 1303118 1323571 1343790 1363765 1383813 1404170 1424724 1445204
53483A445204K0262K0012J9644J8995J7985J6622J4977J3267J1695J0151Q133
$$ 1445204 1465466 1485478 1505122 1524117 1542102 1558724 1573701 1586968 1598663 1608814 1616947
53472A616947N225J594k076n133p437r327j1240j3311j5296j6921j8152j9050
$$ 1616947 1622172 1623766 1621690 1616557 1609120 1599793 1588553 1575242 1559946 1543025 1524873 1505823
53460A505823j9498j9413j9217j9592k0663k1800k2551k3223k4173k4926k4766
$$ 1505823 1486325 1466912 1447695 1428103 1407440 1385640 1363089 1339866 1315693 1290767 1266001
53449A266001k3885k3236k3184k3024k2079k0627j9361j8313j6832j4484j1579
$$ 1266001 1242116 1218880 1195696 1172672 1150593 1129966 1110605 1092292 1075460 1060976 1049397
53438A049397q791o526m779l456k555j898r02R02L132M761N428N972P304R132
$$ 1049397 1040606 1034080 1029301 1025845 1023290 1021392 1020490 1021392 1024524 1029285 1034713 1040685 1047989 1057121
53424A057121J0475J1130J1859J3260J5164J7212J9277K1208K2890K4695K7170
$$ 1057121 1067596 1078726 1090585 1103845 1119009 1136221 1155498 1176706 1199596 1224291 1251461
53413A251461L0046L2263L3367L4130L5457L7375L9548M2003M4666M6869M8197
$$ 1251461 1281507 1313770 1347137 1381267 1416724 1454099 1493647 1535650 1580316 1627185 1675382
53402A675382M9378N1391N3998N6036N7118N8077N9663O1669O3495O4844O5572
$$ 1675382 1724760 1776151 1830149 1886185 1943303 2001380 2061043 2122712 2186207 2251051 2316623
53391B316623O5502O4757O3869O3174O2367O0976N8984N6718N4307N1520M8057
$$ 2316623 2382125 2446882 2510751 2573925 2636292 2697268 2756252 2812970 2867277 2918797 2966854
53380B966854M3895L9391L5031L0896K6468K1279J5610J0166N055l74o579j3294
$$ 2966854 3010749 3050140 3085171 3116067 3142535 3163814 3179424 3189590 3194645 3194271 3187692 3174398
53368C174398k0211k7549l5406m2975m9064n3322n6461n9304o2047o4361o5747
$$ 3174398 3154187 3126638 3091232 3048257 2999193 2945871 2889410 2830106 2768059 2703698 2637951
53357B637951o5814o4680o3142o1997o1075n9477n6913n4250n2420n1233m9854
$$ 2637951 2572137 2507457 2444315 2382318 2321243 2261766 2204853 2150603 2098183 2046950 1997096
53346A997096m8092m6656m6140m6304m6381m5696m3940m1256l8204l5309l2507
$$ 1997096 1949004 1902348 1856208 1809904 1763523 1717827 1673887 1632631 1594427 1559118 1526611
53335A526611k9341k5822k2714k0706j9598j8681j7657j6794j6300j6018j5785
$$ 1526611 1497270 1471448 1448734 1428028 1408430 1389749 1372092 1355298 1338998 1322980 1307195
53324A307195j5684j5776j5735j5078j3670j1896j0279q988p772o326m652k981
$$ 1307195 1291511 1275735 1260000 1244922 1231252 1219356 1209077 1200089 1192317 1185991 1181339 1178358
53312A178358j451%J503L115M793O362P579Q477R503J1061J2920J4485J5655J7017
$$ 1178358 1176907 1176907 1178410 1181525 1186318 1192680 1200259 1208736 1218239 1229300 1242220 1256705 1272360 1289377
53298A289377J9093K1805K4792K7752L0225L1627L1908L1750L1774L1827L1443
$$ 1289377 1308470 1330275 1355067 1382819 1413044 1444671 1476579 1508329 1540103 1571930 1603373
53287A603373L0515K9058K6896K4192K1799K0218J8601J5709J1624P531L948L25
$$ 1603373 1633888 1662946 1689842 1714034 1735833 1756051 1774652 1790361 1801985 1809516 1813464 1813789
53275A813789l568p086r889j2585j5614j8421k0484k2335k4762k7561k9891l1393
$$ 1813789 1810221 1803135 1793246 1780661 1765047 1746626 1726142 1703807 1679045 1651484 1621593 1590200
53263A590200l2203l2311l1744l1172l1441l2552l3764l4624l5247l5605l5321
$$ 1590200 1557997 1525686 1493942 1462770 1431329 1398777 1365013 1330389 1295142 1259537 1224216
53252A224216l4294l2978l1845l0996l0373k9894k9272k8167k6732k5602k5104
$$ 1224216 1189922 1156944 1125099 1094103 1063730 1033836 1004564 976397 949665 924063 898959
53241H98959k4828k4241k3381k2647k2102k1399k0321j9019j7706j6311j4596
$$ 898959 874131 849890 826509 803862 781760 760361 740040 721021 703315 687004 672408
53230F72408j2518j0363q566p486p286p881q915r942j0745j1426j2147j2827j3274
$$ 672408 659890 649527 640961 633475 626189 618308 609393 599451 588706 577280 565133 552306 539032
53217E39032j3503j3638j3580j3074j2148j1201j0535j0053r564r070q621q098
$$ 539032 525529 511891 498311 485237 473089 461888 451353 441300 431736 422666 414045 405947
53205D05947p471o999o969p248p351o937o165n598n770o646p527p598o695n325
$$ 405947 398476 391477 384508 377260 369909 362972 356807 351209 345439 338793 331266 323668 316973 311648
53191C11648m049l161k894l377m224m708m636m590m900m938l945k258j038r36
$$ 311648 307599 304438 301544 298167 293943 289235 284599 280009 275109 270171 266226 263968 262930 261994
53177B61994j544k131k345k209j866j518j335j308j350j434j438j073k78N20Q64
$$ 261994 260450 258319 255974 253765 251899 250381 249046 247738 246388 244954 243516 242443 242165 242685 243549
53162B43549Q24O66K27q14k121k785k393j474p81n56n63n31l25l8M9j62l01k6
$$ 243549 244373 245039 245266 244452 242331 239546 237153 235679 234898 234342 233779 233248 232923 232885 232934 232772 232471 232445
53144B32445K89k1p66r34j30P88R92Q58J213J846J795R05K11M60J060R76J97l00
$$ 232445 232734 232713 231947 231013 230883 231671 232663 233521 234734 236580 238375 239280 239491 239951 241011 241987 242184 241884
53126B41884M1O02M41m53j129q77j9O08O83N74O83J001J385J785K095K100J809
$$ 241884 241925 242527 242968 242515 241386 240509 240490 241098 241781 242355 243038 244039 245424 247209 249304 251404 253213
53109B53213J489J173N53l97j117j240j282j847k498k234j145n28j108k023k168
$$ 253213 254702 255875 256428 256031 254914 253674 252392 250545 248047 245813 244668 244140 243032 241009 238841
53094B38841j739j560j571j073j99J08k79l24M85J162P19l10p16l90j86l54k85
$$ 238841 237102 235542 233971 232898 232699 232807 232528 232204 232689 233851 234570 234260 233544 233154 232968 232614 232329
53077B32329K45O62N85L50J83k27r53j389j118o05m66n63m51k88n39j052j205
$$ 232329 232574 233236 233821 234171 234354 234127 233174 231785 230667 230062 229596 229033 228582 228294 227755 226703 225498
53060B25498r01p21j046j602j937j891j384k88J208K460K898K616K203K037J950
$$ 225498 224597 223876 222830 221228 219291 217400 216016 215728 216936 219396 222294 224910 227113 229150 231100
53045B31100J531O86k11p06p24n75n23n51n27m25l19l74q25j677k387k230j186
$$ 231100 232631 233317 233106 232400 231676 231101 230578 230027 229500 229075 228756 228382 227557 225880 223493 221263 220077
53028B20077q8L38K06Lj59l42k82K52Q46Q37L01L4M70J164J499J407J204J071
$$ 220077 219989 220327 220533 220536 220377 220035 219753 220005 220851 221688 221989 222023 222493 223657 225156 226563 227767 228838
53010B28838R51P38L99J0k86m52o43q97r23n10N7L54M65P70J180J194P44L82M05
$$ 228838 229789 230527 230926 230936 230650 230198 229555 228658 227735 227225 227282 227636 228101 228871 230051 231245 231989 232371 232776
52991B32776M55J81k45n54q59j225j222m44Q08J821K235K169J771J234R74J300
$$ 232776 233231 233412 233167 232613 231754 230529 229307 228863 229671 231492 233727 235896 237667 238901 239875 241175
52975B41175J913K223K136K030J967J529O40m7M4O21R65Q92P78P79N88op08j042
$$ 241175 243088 245311 247447 249477 251444 252973 253613 253566 253610 254231 255196 256088 256866 257645 258233 258227 257519 256477
52957B56477q20k15L62M30k26j216j834j822j546j338j080p21o60j142j681j680
$$ 256477 255657 255442 255804 256234 256008 254792 252958 251136 249590 248252 247172 246451 245791 244649 242968 241288
52941B41288j342j272j445j335r32p19o41r4P97R83M5r97j103o11m11m57j14M71
$$ 241288 239946 238674 237229 235894 234962 234243 233602 233508 234305 235288 235333 234336 233233 232622 232211 231754 231640 232111
52923B32111M66k95j027j099o69k11Lk04p94j298j185n37qn6n61j085j132m41
$$ 232111 232577 232282 231255 230156 229487 229276 229279 229075 228281 226983 225798 225261 225253 225197 224636 223551 222419 221978
52905B21978N67R52M15j55L4L32l83j703j965n90J115J786J502R89M14k84p25
$$ 221978 222545 223497 223912 223757 223791 224123 223740 222037 220072 219482 220597 222383 223885 224874 225288 225004 224279
52888B24279n17Q8O23R68J072P07M3j42N27J327J423J067J082J519J649J133M41
$$ 224279 223762 223850 224473 225441 226513 227220 227263 227121 227648 228975 230398 231465 232547 234066 235715 236848 237289
52871B37289J17K34N76Q92R16O11L38M72Q56R87O89K55J1N6L62P89J041Q76L94
$$ 237289 237406 237640 238216 239108 240024 240635 240973 241445 242301 243288 243977 244232 244243 244299 244661 245450 246491 247367 247761
52852B47761r0m49q29j386k113k873l486l839l991m085m117l964l609l118k414
$$ 247761 247671 247222 246393 245007 242894 240021 236535 232696 228705 224620 220503 216539 212930 209812 207398
52837B07398j459o32m79r27j197p81K5P05J196J584J702J468J222J246J274R61
$$ 207398 205939 205307 204828 203901 202704 201923 201948 202653 203849 205433 207135 208603 209825 211071 212345 213306
52821B13306M54N9l08p81j051q14m77o58j153j086j38J062J777J875J608J209
$$ 213306 213760 213819 213511 212730 211679 210865 210388 209730 208577 207491 207353 208415 210192 212067 213675 214884
52805B14884Q98Q23Q53P41N58O15Q85Q50J11j071j943j875q88K58O29K0q17j105
$$ 214884 215782 216605 217458 218199 218757 219372 220257 221107 221218 220147 218204 216329 215441 215699 216328 216348 215531 214426
52787B14426r17p61n90O1J050J437O92n04j084q41m87n91q99p52j6O60N45l02
$$ 214426 213509 212748 212158 212219 213269 214706 215398 214894 213810 212969 212482 211891 210992 210240 210224 210884 211429 211127
52769B11127j103j328j224j208j109m95M76J115J091P94P12Q49R42Q05L27n38
$$ 211127 210024 208696 207472 206264 205155 204660 205136 206251 207342 208136 208848 209697 210639 211444 211771 211233
52753B11233j497j875j217J34J291J719J759K142L032L709L401K356J683J999
$$ 211233 209736 207861 206644 206778 208069 209788 211547 213689 216721 220430 223831 226187 227870 229869
52739B29869K621K445J345K41o9L60J009J500J669J443R39N31N80J078J610J663
$$ 229869 232490 234935 236280 236521 236452 236812 237821 239321 240990 242433 243372 243903 244483 245561 247171 248834
52723B48834J046P1p54j258j667k149k523k609k514k399k178j765j313r57n80
$$ 248834 249880 249951 249197 247939 246272 244123 241600 238991 236477 234078 231900 230135 228822 227865 227285
52708B27285j69j1j24L6P41J235N73r25j897j591n43L73Q31Q29M32K1Q2M42L32
$$ 227285 227116 227105 226981 227017 227758 228993 229566 228641 226744 225153 224610 224983 225814 226643 227075 227096 227178 227620 227952
52689B27952m60j108q86j59K68L00M34Q33J094Q45R5q19j311q85K21R73N99m94
$$ 227952 227492 226384 225498 225339 225607 225907 226341 227174 228268 229113 229208 228389 227078 226193 226414 227387 227986 227492
52671B27492j260j273r45p26o37o01n95m55M9P72J251J236R24N81L48M28J058
$$ 227492 226232 224959 224014 223288 222651 222050 221455 221000 221049 221821 223072 224308 225232 225813 226161 226589 227647
52654B27647K087K991L441L564L483L004K085J145N40J7p97j652j996j914k043
$$ 227647 229734 232725 236166 239730 243213 246217 248302 249447 249987 250004 249207 247555 245559 243645 241602
52639B41602k444k340j291k4N04L50K11K11j88j035j567j227l45N39J382K199
$$ 241602 239158 236818 235527 235503 236007 236357 236568 236779 236591 235556 233989 232762 232417 232956 234338 236537
52623B36537K472J720L86n00n27k56l35p34j019j001q37p22o40m22L9O10J001
$$ 236537 239009 240729 241115 240615 240088 239832 239497 238763 237744 236743 235906 235184 234544 234122 234161 234771 235772
52606B35772J062Q86O10K65p1j81mK05J93Q5J57M24P01R38J169J212Q35J80k27
$$ 235772 236834 237720 238330 238595 238524 238343 238339 238544 238737 238822 238979 239403 240104 241042 242211 243423 244258 244438 244211
52587B44211p3M31P77O53J90j49J8N63R39Q48N71M54L82J13j39PL69L59j25n26
$$ 244211 244138 244569 245346 245999 246189 246040 246058 246621 247560 248408 248979 249433 249815 249928 249789 249796 250165 250524 250399 249873
52567B49873m50k10k50m38l22J11L41k5p17j101r33o75r01j529j934j782j339
$$ 249873 249423 249213 248963 248525 248203 248314 248655 248630 247913 246812 245879 245204 244303 242774 240840 239058 237719
52550B37719q36o8R93J683J344K90n00n49k08O1J50R5m4l7L30Q15Q99M91J02K45
$$ 237719 236883 236815 237808 239491 240835 241125 240625 240076 239868 239929 240079 240174 240130 240093 240423 241238 242137 242628 242730 242975
52530B42975R19J686K010J610Q26M07N93O84K1r20j163o91l70m97l85L49J097
$$ 242975 243894 245580 247590 249200 250026 250433 251026 251710 251731 250811 249648 248957 248587 248090 247705 248054 249151
52513B49151J251J167J555K427L137L216K774K320K365K898L224K657J376J49
$$ 249151 250402 251569 253124 255551 258688 261904 264678 266998 269363 272261 275485 278142 279518 279667
52499B79667p30j602k582l332l754m093m173l454k163j407j661k072j812j310
$$ 279667 278937 277335 274753 271421 267667 263574 259401 255947 253784 252377 250716 248644 246832 245522
52485B45522j281j404q79K05J027J248J250J325J396J370J183P22K18L35J235
$$ 245522 244241 242837 241958 242163 243190 244438 245688 247013 248409 249779 250962 251684 251902 252237 253472
52470B53472J980J607N40J11P92J748K109J973J978K464L183L521L027J991J310
$$ 253472 255452 257059 257599 257710 258502 260250 262359 264332 266310 268774 271957 275478 278505 280496 281806
52455B81806J406J579Q90o26k179l325m127m444l884k591j353q00r41j470k039
$$ 281806 283212 284791 285681 285055 282876 279551 275424 270980 267096 264505 263152 262352 261411 259941 257902
52440B57902k203j706q73k97q2J21L67K81k48p41o92r4P13J364J566J234O13M6
$$ 257902 255699 253993 253120 252823 252741 252862 253229 253510 253262 252521 251829 251735 252448 253812 255378 256612 257225 257271
52422B57271l50n65m43M4M85M94L78P92J720K382K238J617J249J582K649M198
$$ 257271 256921 256356 255913 255957 256442 256936 257314 258106 259826 262208 264446 266063 267312 268894 271543 275741
52406B75741N811P191Q361R343R786R284P909O001L568N05k689n041o070o153
$$ 275741 281552 288743 297104 306447 316233 325517 333426 339427 342995 343500 340811 335770 329700 323547
52392C23547n841n319m614l850l115k454k063k091k215j850q22M82J588K189K087
$$ 323547 317706 312387 307773 303923 300808 298354 296291 294200 291985 290135 289313 289795 291383 293572 295659
52377B95659J402P94Q86J535K217K945M123N516O253N983N286M774M446M092L661
$$ 295659 297061 297855 298741 300276 302493 305438 309561 315077 321330 327313 332599 337373 341819 345911 349572
52362C49572L032K094J187P60N59n0q93j154q39r19j549j525k18J148J151J40
$$ 349572 352604 354698 355885 356645 357204 357154 356261 355107 354268 353349 351800 350275 350057 351205 352356 352496
52346C52496n53n00o5Q74K624M468N217M880M601M913N263N361N811P028Q508
$$ 352496 351943 351443 351378 352252 354876 359344 364561 369441 374042 378955 384218 389579 395390 402418 410926
52331D10926R600J0304J0871J1372J2018J3261J5106J6838J7833J8253J8602J9024
$$ 410926 420526 430830 441701 453073 465091 478352 493458 510296 528129 546382 564984 584008
52319E84008J9418J9799K0112K0004J9229J8135J7358J7125J7108J6887J6335
$$ 584008 603426 623225 643337 663341 682570 700705 718063 735188 752296 769183 785518
52308G85518J5592J4885J4331J3873J3389J2830J2173J1300J0158Q941P869O862
$$ 785518 801110 815995 830326 844199 857588 870418 882591 893891 904049 912990 920859 927721
52296I27721N753M768M263L903K677R5l033n414o637p319q006q491q316p563o819
$$ 927721 933474 938242 942505 946408 949085 949180 946147 940733 934096 926777 918771 910280 901964 894401 887582
52281H87582o481o239n391l572j167J083K833M410O314Q565J0624J1888J2221
$$ 887582 881101 874862 869471 865899 864732 865815 868648 873058 879372 887937 898561 910449 922670
52268I22670J2046J1989J2403J3161J3891J4327J4382J4011J3209J2185J1322
$$ 922670 934716 946705 959108 972269 986160 1000487 1014869 1028880 1042089 1054274 1065596
52257A065596J0821J0535J0258J0037R992R907R309Q063O655N675N067M158K417
$$ 1065596 1076417 1086952 1097210 1107247 1117239 1127146 1136455 1144518 1151173 1156848 1161915 1166073 1168490
52244A168490jk603n122p493r442j0611j1092j1428j1885j2068j1547j0532r555
$$ 1168490 1168489 1165886 1160764 1153271 1143829 1133218 1122126 1110698 1098813 1086745 1075198 1064666 1055111
52231A055111q734p813o834o179n914n588m856l954l217k503j491l07N53Q79R70
$$ 1055111 1046377 1038564 1031730 1025551 1019637 1014049 1009193 1005239 1002022 999519 998028 997721 998274 999153 1000123
52216A000123J155J422J636J894K432L303M347N376O270O918P304P598P956Q129
$$ 1000123 1001278 1002700 1004336 1006230 1008662 1011965 1016312 1021688 1027958 1034876 1042180 1049778 1057734 1065863
52202A065863P553O049M306L266L116L216L125L217L886M633M530L586K915L312
$$ 1065863 1073416 1079465 1083771 1087037 1090153 1093369 1096494 1099711 1103597 1108230 1112760 1116346 1119261 1122573
52188A122573M223M496L816K840K148J668J197Q48N58l05k333n120p423q412q432
$$ 1122573 1126796 1131292 1135108 1137948 1140096 1141764 1142961 1143809 1144367 1144062 1141729 1136609 1129186 1120774 1112342
52173A112342q355q501q482p968p191o597o277n968n452m691l609k058j43J631
$$ 1112342 1103987 1095486 1087004 1079036 1071845 1065248 1058971 1053003 1047551 1042860 1039251 1037193 1037050 1038681
52159A038681K755L190L286L254K981K399J757J315R45L36n01j170j393j313j188
$$ 1038681 1041436 1044626 1047912 1051166 1054147 1056546 1058303 1059618 1060563 1060899 1060398 1059228 1057835 1056522 1055334
52144A055334r83m80L28J100J456J299Q47M33K45K95N49J080J980L216M672O328
$$ 1055334 1054351 1053871 1054199 1055299 1056755 1058054 1058901 1059334 1059579 1059874 1060423 1061503 1063483 1066699 1071371 1077699
52128A077699Q241J0377J2613J4954J7461J9945K2013K3586K5065K6756K8324
$$ 1077699 1085940 1096317 1108930 1123884 1141345 1161290 1183303 1206889 1231954 1258710 1287034
52117A287034K9217K9356K9053K8324K6805K4433K1753J9379J7450J5765J4089
$$ 1287034 1316251 1345607 1374660 1402984 1429789 1454222 1475975 1495354 1512804 1528569 1542658
52106A542658J2111R458O146K857M30r26j655k232k787l344m028m879n667o142
$$ 1542658 1554769 1564227 1570373 1573230 1573660 1572734 1571079 1568847 1566060 1562716 1558688 1553809 1548142 1542000
52092A542000o428o944p954r275j0556j1691j2833j3995j4839j4994j4463j3497
$$ 1542000 1535572 1528628 1520674 1511399 1500843 1489152 1476319 1462324 1447485 1432491 1418028 1404531
52080A404531j2067r797o595l169n32R88K005L267M926O765Q778J1034J3141J4402
$$ 1404531 1392464 1382667 1376072 1372903 1372371 1373359 1375364 1378631 1383557 1390322 1399100 1410134 1423275 1437677
52066A437677J4690J4694J4985J5302J5082J4339J3395J2111J0086P601N570M380
$$ 1437677 1452367 1467061 1482046 1497348 1512430 1526769 1540164 1552275 1562361 1569962 1575532 1579912
52054A579912L445K198Q53j97j168k516m249o172q372j0885j3282j5216j7084
$$ 1579912 1583357 1585555 1586408 1586211 1585043 1582527 1578278 1572106 1563734 1552849 1539567 1524351 1507267
52041A507267j9396k1724k3081k3266k3032k2866k2432k1344j9789j8079j6241
$$ 1507267 1487871 1466147 1443066 1419800 1396768 1373902 1351470 1330126 1310337 1292258 1276017
52030A276017j4297j2507j1003r638q349p197n988m574l590m036n730p095p073
$$ 1276017 1261720 1249213 1238210 1228572 1220223 1213026 1207038 1202464 1198874 1194838 1189108 1182013 1174940
52017A174940o522o859q004q690q446q180q756r959j1116j2008j2860j3911j5261
$$ 1174940 1168418 1161559 1153555 1144865 1136419 1128239 1119483 1109524 1098408 1086400 1073540 1059629 1044368
52004A044368j6821j8249j9239j9939k0719k1484k1656k1015k0145j9772j9895
$$ 1044368 1027547 1009298 990059 970120 949401 927917 906261 885246 865101 845329 825434
51993H25434j9825j8968j7299j5248j3345j1913j0936j0137r276q417p901q078
$$ 825434 805609 786641 769342 754094 740749 728836 717900 707763 698487 690070 682169 674091
51981F74091q968j0107j0809j0748j0299j0216j0941j2223j3384j3844j3447j2337
$$ 674091 665123 655016 644207 633459 623160 612944 602003 589780 576396 562552 549105 536768
51969E36768j0700q625o313m153k477j171J80J785L450M904O044O800P058O875
$$ 536768 526068 517443 511130 506977 504500 503329 503509 505294 508744 513648 519692 526492 533550 540425
51955E40425O491N939M931L249J075j215l261m592m762l975l185l043l016k048
$$ 540425 546916 552855 557786 561035 562110 560895 557634 553042 548280 544305 541120 538077 535061 533013
51941E33013J19K810N482Q224J1155J3931J6157J7918J9667K1736K4005K5767
$$ 533013 533132 535942 541424 549648 560803 574734 590891 608809 628476 650212 674217 699984
51929F99984K5864K3462J8821J3020O808Q8p312j4776k1169k5706k8276k9161
$$ 699984 725848 749310 768131 781151 787959 788047 780735 765959 744790 719084 690808 661647
51917F61647k8840k7882k6643k4957k2521j9621j7140j5569j4287j2200r087n962
$$ 661647 632807 604925 578282 553325 530804 511183 494043 478474 464187 451987 442900 436938
51905D36938m008l315k908j807J63K477M458N689O185O272O101N341L619J284
$$ 436938 432930 429615 426707 424900 425063 427540 431998 437687 443872 450144 456245 461586 465205 466489
51891D66489p87k239l635n522p504q674q627p622o035m212k685j877j556r98J41
$$ 466489 465702 463463 459828 454306 446802 438128 429501 421879 415844 411632 408947 407070 405514 404516 404657
51876D04657J554K856M003N046N813O112N981N590N039M363L597K715J662M67
$$ 404657 406211 409067 413070 418116 423929 430041 436022 441612 446651 451014 454611 457326 458988 459455
51862D59455p34j864k972m115n170n716n221l589j512Q4J057K047L321M210M129
$$ 459455 458721 456857 453885 449770 444600 438884 433663 430074 428562 428646 429703 431750 435071 439281 443410
51847D43410L508L081K641J439n00k364l722m908o086o889p115o965o411n139
$$ 443410 446918 449999 452640 454079 453579 451215 447493 442585 436499 429610 422495 415530 409119 403980
51833D03980l427k212j897j779j173l43J83N16R41J143P15q5p38j360k347l444
$$ 403980 400553 398341 396444 394665 393492 393149 393332 393848 394789 395932 396647 396562 395824 394464 392117 388673
51817C88673l866l338k356j460q28m59k30J73Q76J506J710J799K238K723K489
$$ 388673 384807 381469 379113 377653 376825 376366 376136 376309 377185 378691 380401 382200 384438 387161 389650
51802C89650J539P30N22M06j39q19j104j056j078j234j314j361j618k110k628
$$ 389650 391189 391919 392441 392847 392708 391889 390785 389729 388651 387417 386103 384742 383124 381014 378386
51787C78386l068l408l476l064k308j626j189p08J53J278K163K437K203J833J544
$$ 378386 375318 371910 368434 365370 363062 361436 360247 359539 359692 360970 363133 365570 367773 369606 371150
51772C71150J299J117J245J867K824L795M667N463O046O246O303O759P658Q177
$$ 371150 372449 373566 374811 376678 379502 383297 387964 393427 399473 405719 412022 418781 426439 434616
51758D34616P393N313K845P50j061l035n105o576p040p029p496q560r228q564
$$ 434616 442009 447322 450167 450917 449856 446821 441716 435140 428100 421071 413575 405015 395787 387223
51744C87223o875n308m405l577k102j31J662L021M260N588O786P656Q331Q965
$$ 387223 380348 375040 370635 367058 364956 364825 366487 369508 373768 379356 386142 393798 402129 411094
51730D11094R308Q893P573N700L866K601K254K840L797M135L157J097j138k870
$$ 411094 420402 429295 436868 442568 446434 449035 451289 454129 457926 462061 465218 466315 465177 462307
51716D62307m091m964n329m993m275l815l828l970m015m226m841n512n623m985
$$ 462307 458216 453252 447923 442930 438655 434840 431012 427042 423027 418801 413960 408448 402825 397840
51702C97840l872k551j106L05J412K096K387K193J366J72o71p10k62N1Q7J58L59
$$ 397840 393968 391417 390311 390616 392028 394124 396511 398704 400070 400242 399571 398861 398599 398650 398737 398895 399254
51685C99254L23k62j196k034k581k943l228l346l115k394j203K14J483K410L287
$$ 399254 399577 399315 398119 396085 393504 390561 387333 383987 380872 378478 377275 377489 378972 381382 384669
51670C84669M670O707Q783J0100J0668J1368J2800J4265J4349J2481R410O001
$$ 384669 389339 396046 404829 414929 425597 436965 449765 464030 478379 490860 500270 506271
51658E06271K230k199o738j0229j2051j2407j1564r593o928m388k308l49J451
$$ 506271 508501 506302 499564 489335 477284 464877 453313 443720 436792 432404 430096 429747 431198
51645D31198K165J115j008k918m206n347o462p008o714o037n473m970m247l258
$$ 431198 433363 434478 433470 430552 426346 420999 414537 407529 400815 394778 389305 384335 380088 376830
51631C76830k085p60N94J667K159J917R64l37j280j462j329j630k369k910l074
$$ 376830 374745 373985 374579 376246 378405 380322 381286 380949 379669 378207 376878 375248 372879 369969 366895
51616C66895l322l761l797l181k580k521k468j698n50k8m45j163j504j237l72
$$ 366895 363573 359812 356015 352834 350254 347733 345265 343567 343017 342989 342544 341381 339877 338640 338268
51601C38268Q27J727J954K013K687L919N020N899P154Q766R688R130P488N488
$$ 338268 339095 340822 342776 344789 347476 351395 356415 362314 369468 378234 387922 397052 404540 410028
51587D10028L111N3l202n598o583o380n359l778k077p54K16J363L024M977O937
$$ 410028 413139 413192 409990 404392 397809 391429 386070 382292 380215 379461 379677 381040 384064 389041 395978
51572C95978Q927J0969J2720J3734J3966J3802J3632J3644J3861J4194J4412J4343
$$ 395978 404905 415874 428594 442328 456294 470096 483728 497372 511233 525427 539839 554182
51560E54182J4191J4573J6004J8393K1148K3741K5997K7650K7851K5635K0984
$$ 554182 568373 582946 598950 617343 638491 662232 688229 715879 743730 769365 790349
51549G90349J5038Q986L041l120r210j4339j8138k1183k3963k6046k6752k6194
$$ 790349 805387 814373 817414 814294 805084 790745 772607 751424 727461 701415 674663 648469
51537F48469k5027k3464k1202j8233j5039j1998r189o866n479m990m841m801n267
$$ 648469 623442 599978 578776 560543 545504 533506 524317 517451 511972 506982 502141 497340 492073
51524D92073o247o897o617o135o528p620q194p736p031o899p201p313o936o110
$$ 492073 485826 478929 472312 466177 459649 452029 443835 436099 429068 422169 414968 407655 400719 394609
51510C94609m972l894l357l359l328k889k308j926j684j472j466j669j611j048
$$ 394609 389637 385743 382386 379027 375699 372810 370502 368576 366892 365420 363954 362285 360674 359626
51496C59626m66l75m81k00L18M47K10L39J157K136K723K963L056K823J983O76
$$ 359626 359160 358785 358304 358104 358422 358869 359079 359418 360575 362711 365434 368397 371453 374276 376259 376935
51480C76935o14j452j719j656j782k410l150l298k833k600l206m113m328l681
$$ 376935 376321 374869 373150 371494 369712 367302 364152 360854 358021 355421 352215 348102 343774 340093
51466C40093k936k673k634k343j912j840k178k348j905j138o69o03n27k72j66
$$ 340093 337157 334484 331850 329507 327595 325755 323577 321229 319324 318186 317517 316914 316387 316115 315949
51451C15949l53l04N38J959L273M250N208O236P038P632Q616J0347J2208J3079
$$ 315949 315596 315292 315830 317789 321062 325312 330520 336756 343794 351426 360042 370389 382597 395676
51437C95676J2373J0337P615M858K576J055L32K94O87J016P38k85j754l428n302
$$ 395676 408049 418386 426001 430859 433435 434490 434822 435116 435803 436819 437557 437272 435518 432090 426788
51422D26788p049p864p357o251n609n488n061l978k894k449k413k163j522o88
$$ 426788 419739 411875 404518 398267 392658 387170 382109 378131 375237 372788 370375 368212 366690 366002
51408C66002K45J188J792J790J493J450J643J510P69j74p71r10p55l65K47R08
$$ 366002 366247 367435 369227 371017 372510 373960 375603 377113 377882 377708 376937 376027 375272 374907 375154 376062
51392C76062J505K250L434M935O201O885P291Q115R830J2364J5293J8262K1188
$$ 376062 377567 379817 383251 388186 394387 401272 408563 416678 426508 438872 454165 472427 493615
51379D93615K4202K7408L0740L4029L7180M0152M2720M4199M3531L9849L3170
$$ 493615 517817 545225 575965 609994 647174 687326 730046 774245 817776 857625 890795
51368H90795K4527J5330O525j659r266j6174k2179k7305l1738l5472l8205l9625
$$ 890795 915322 930652 937177 935518 926252 910078 887899 860594 828856 793384 755179 715554
51356G15554l9759l8928l7422l5262l2299k8576k4552k0904j8018j5750j3672
$$ 715554 675795 636867 599445 564183 531884 503308 478756 457852 439834 424084 410412
51345D10412j1513r341p440o121n559n585n697n399m594l541k537j721j154q09
$$ 410412 398899 389558 382118 375997 370438 364853 359156 353757 349163 345622 343085 341364 340210 339401
51331C39401m54K25J246K161K398J786O87l27q95j033j007j075j286j521j640
$$ 339401 338947 339172 340418 342579 344977 346763 347450 347123 346228 345195 344188 343113 341827 340306 338666
51316C38666j625j605j683j750j526r25k53J53M21R15J461J318K51q42q76rN66
$$ 338666 337041 335436 333753 332003 330477 329552 329299 329452 329873 330788 332249 333567 333818 332976 332100 332091 332657
51299C32657K04m37m55N6K52k88j151j717j838j760j689j537j120m42L17J084
$$ 332657 332861 332424 331969 332025 332277 331989 330838 329121 327283 325523 323834 322297 321177 320735 321052 322136
51283C22136J973K982L767L983L782L723M121M695M914M497L599K672K098J836
$$ 322136 324109 327091 330858 334841 338623 342346 346467 351162 356076 360573 364172 366844 368942 370778
51269C70778J454O77j80n37j61P59J948L051L522L011J901R39K86n47j774k928
$$ 370778 372232 372909 372729 372192 372031 372790 374738 377789 381311 384322 386223 387162 387448 386901 385127 382199
51253C82199l525l641l556l384l261l444l866m017l574k877k432k318k292k139
$$ 382199 378674 375033 371477 368093 364832 361388 357522 353505 349931 347054 344622 342304 340012 337873
51239C37873j714j015m71o71j533k190k017j261m16M20J191J545J435J473J985
$$ 337873 336159 335144 334673 334002 332469 330279 328262 327001 326585 327005 328196 329741 331176 332649 334634
51224C34634K268J538J71p86j009r33p97n08k82m40o34k40M90O71K47K43J235
$$ 334634 336902 338440 338611 337825 336816 335883 335086 334578 334296 333856 333222 332982 333472 334143 334390 334633 335868
51207C35868K431K751K164J479J328J784K520L016K888K277J726J523J532J652
$$ 335868 338299 341050 343214 344693 346021 347805 350325 353341 356229 358506 360232 361755 363287 364939
51193C64939J943K194J974J312P95P21N90j69j311k038j908j250p75r20j473j788
$$ 364939 366882 369076 371050 372362 373157 373878 374468 374299 372988 370950 369042 367792 367017 366097 364624 362836
51177C62836j513r88p22p07o73p20j032j177n38N86J196J025Q42J080J207R00
$$ 362836 361323 360335 359613 358906 358233 357513 356481 355304 354766 355352 356548 357573 358415 359495 360702 361602
51161C61602Q02J374J839J314L30J73R97J667J383N42j10m21o61r78j297j466
$$ 361602 362404 363778 365617 366931 367261 367434 368431 370098 371481 372023 371913 371492 370831 369853 368556 367090
51145C67090j344j001q45j225j970k515k501k048j515j202j193j224q34J31J247
$$ 367090 365746 364745 363900 362675 360705 358190 355689 353641 352126 350924 349731 348507 347673 347804 349051
51130C49051J924J999J720J358J090J035J076Q65L64J24O40J611K267K309K039
$$ 349051 350975 352974 354694 356052 357142 358177 359253 360118 360482 360606 361246 362857 365124 367433 369472
51115C69472J659J054L61J73Q44J886K410J991R89J42NO11J534K243K534K543
$$ 369472 371131 372185 372546 372719 373563 375449 377859 379850 380839 380981 380986 381597 383131 385374 387908 390451
51099C90451K419K112J576R94O56N71M12j6l42K4J007J667J237J45m52j19M65
$$ 390451 392870 394982 396558 397552 398208 398779 399191 399175 398833 398857 399864 401531 402768 402913 402461 402342 402807
51082D02807O11N20P09J103J219R99Q42R36J072J122J321J878K567K883K578K008
$$ 402807 403418 403938 404647 405750 406969 407968 408810 409746 410818 411940 413261 415139 417706 420589 423167 425175
51066D25175J962L001M945P105Q966J0526J1958J3432J5171J7248J9044J9459
$$ 425175 427137 430138 435083 442188 451154 461680 473638 487070 502241 519489 538533 557992
51054E57992J8021J5457J2884J0880R707R802J1217J2838J3050J1332Q587N865
$$ 557992 576013 591470 604354 615234 624941 634743 645960 658798 671848 683180 691767 697632
51042F97632L266K49l388p122j0005j1326j1179j0376r572q687p522o672p171
$$ 697632 700898 701147 697759 690637 680632 669306 658127 647751 638179 629492 621970 615298 608127
51029F08127r171j1615j3367j4122j4114j3524j2535j1431j0183q303n574k693
$$ 608127 598956 587341 573974 559852 545738 532214 519679 508248 498065 489762 484188 481495
51017D81495n94O86J944L622N256O270O872P724Q998J0154J0695J0695J0509J0215
$$ 481495 480901 481587 483531 487153 492409 498679 505551 513275 522273 532427 543122 553817 564326 574541
51003E74541R663Q908Q242P767P191O183M767L328K274J737J447R09j25j351k186
$$ 574541 584204 593112 601354 609121 616312 622495 627262 630590 632864 634601 636048 636957 636832 635481 633295
50988F33295k288j647l30J474L195M222M672N447P267R951J2810J5247J6764J6916
$$ 633295 631007 629360 629030 630504 633699 637921 642593 648040 655307 665258 678068 693315 710079 726995
50974G26995J5828J4519J4159J5099J6903J9100K1532K4228K7373L1233L5748
$$ 726995 742823 757342 771501 786600 803503 822603 844135 868363 895736 926969 962717
50963I62717M0321M4434M8214N2025N5708N8717O0815O2145O2750O2478O1259
$$ 962717 1003038 1047472 1095686 1147711 1203419 1262136 1322951 1385096 1447846 1510324 1571583
50952A571583N8980N5339N0416M5122M0371L5965L1135K6093K2067J9582J7741
$$ 1571583 1630563 1685902 1736318 1781440 1821811 1857776 1888911 1915004 1937071 1956653 1974394
50941A974394J5682J3840J3022J2882J2222J0522Q316O148L868J088k223n865
$$ 1974394 1990076 2003916 2016938 2029820 2042042 2052564 2060880 2067028 2070896 2071984 2069761 2063896
50929B063896r801j4144j8841k3578k8064l2420l7129m2518m8237n3431n7427
$$ 2063896 2054095 2039951 2021110 1997532 1969468 1937048 1899919 1857401 1809164 1755733 1698306
50918A698306o0143o1771o2372o1874o0312n7912n4999n1861m8587m4969m0793
$$ 1698306 1638163 1576392 1514020 1452146 1391834 1333922 1278923 1227062 1178475 1133506 1092713
50907A092713l6296l2177k8982k6600k4469k2243k0112j8435j7198j5866j3991
$$ 1092713 1056417 1024240 995258 968658 944189 921946 901834 883399 866201 850335 836344
50896H36344j1844j0218r462r032q232p137o284n669m686l158j790j265j282r15
$$ 836344 824500 814282 804820 795788 787556 780419 774135 768466 763780 760622 758832 757567 756285 755370
50882G55370K65J792K967L518L630L623L758M312N489P179Q800R685R734R531
$$ 755370 755635 757427 760394 763912 767542 771165 774923 779235 784724 791903 800703 810388 820122 829653
50868H29653R732J0525J1830J3712J6179J8786K0900K2439K3937K5829K8024L0355
$$ 829653 839385 849910 861740 875452 891631 910417 931317 953756 977693 1003522 1031546 1061901
50856A061901L3066L6619M1146M6326N1796N7577O4088P1639P9879Q7977R5513
$$ 1061901 1094967 1131586 1172732 1219058 1270854 1328431 1392519 1464158 1544037 1632014 1727527
50845A727527J02976J10961J19014J25893J30946J34739J37960J40156J39941
$$ 1727527 1830503 1941464 2060478 2186371 2317317 2452056 2590016 2730172 2870113
50836B870113J36296J29327J19810J08311R4917P9739O3540M7661L3309K0943
$$ 2870113 3006409 3135736 3255546 3363857 3458774 3538513 3602053 3649714 3683023 3703966
50826C703966J0469J877m452p987q413n871j016N204J1891J8192K2911K4527K1990
$$ 3703966 3714435 3716312 3711860 3703873 3695460 3689589 3688573 3693777 3705668 3723860 3746771 3771298 3793288
50813C793288J5370N464p082k1922l8584n6313p4298r1764j07982j22465j34909
$$ 3793288 3808658 3814122 3807040 3785118 3746534 3690221 3615923 3524159 3416177 3293712 3158803
50802C158803j44691j50757j52567j50793j46550j40213j31688j21504j10785
$$ 3158803 3014112 2863355 2710788 2559995 2413445 2273232 2141544 2020040 1909255
50793A909255j00126q9321p8270o7328n6726m6458l6949k9051k3033j8256j4108
$$ 1909255 1809129 1719808 1641538 1574210 1517484 1471026 1434077 1405026 1381993 1363737 1349629
50782A349629j0661q188o664o020o234o917p449p857q787j0301j1511j1838j1866
$$ 1349629 1338968 1330780 1324116 1318096 1311862 1304945 1297496 1289639 1280852 1270551 1259040 1247202 1235336
50769A235336j2349j3106j3587j3962j4802j6090j7264j7980j8255j8148j7800
$$ 1235336 1222987 1209881 1196294 1182332 1167530 1151440 1134176 1116196 1097941 1079793 1061993
50758A061993j7482j7161j6317j4696j2790j1140r548p521n110k641p5K767N697
$$ 1061993 1044511 1027350 1011033 996337 983547 972407 962859 955338 950228 947587 947512 950279 955976
50745I55976Q540J1592J5017J8198K0520K2490K5235K9019L3159L7210M1335M5552
$$ 955976 964516 976108 991125 1009323 1029843 1052333 1077568 1106587 1139746 1176956 1218291 1263843
50733A263843M9485N3088N6722O0346O3301O5214O6437O7425O8147O8449O8356
$$ 1263843 1313328 1366416 1423138 1483484 1546785 1611999 1678436 1745861 1814008 1882457 1950813
50722A950813O7785O6401O4068O1008N7218N2146M5230L6487K6394J5513M486
$$ 1950813 2018598 2084999 2149067 2210075 2267293 2319439 2364669 2401156 2427550 2443063 2447549
50711B447549n869j4752k1543k5709k6906k5260k1390j5932r299j992N123J1068
$$ 2447549 2441680 2426928 2405385 2379676 2352770 2327510 2306120 2290188 2280889 2278897 2284020 2295088
50699B295088J5188J7258J7277J5220J0842L754o097j7947l0470m2603n3969o4435
$$ 2295088 2310276 2327534 2344811 2360031 2370873 2374627 2368530 2350583 2320113 2277510 2223541 2159106
50687B159106p3444p9927q2949q2476p9459p5032o9626o3071n5538m7855m0628
$$ 2159106 2085662 2005735 1922786 1840310 1760851 1685819 1616193 1553122 1497584 1449729 1409101
50676A409101l3529k5896j7723r557j729N688J2343J7708K1693K4661K6748K7725
$$ 1409101 1375572 1349676 1331953 1322396 1320667 1326355 1338698 1356406 1378099 1402760 1429508 1457233
50664A457233K7529K6434K4658K2325J9873J7901J6515J5359J4438J4271J4983
$$ 1457233 1484762 1511196 1535854 1558179 1578052 1595953 1612468 1627827 1642265 1656536 1671519
50653A671519J5923J6651J7721J9896K2920K5757K7933L0061L2957L6693M0736
$$ 1671519 1687442 1704093 1721814 1741710 1764630 1790387 1818320 1848381 1881338 1918031 1958767
50642A958767M4707M8671N2694N6351N8952O0279O0912O1521O1984O1407N9161
$$ 1958767 2003474 2052145 2104839 2161190 2220142 2280421 2341333 2402854 2464838 2526245 2585406
50631B585406N5598N1700M8196M5056M1783L7954L3475K8167K1218J1412j723
$$ 2585406 2641004 2692704 2740900 2785956 2827739 2865693 2899168 2927335 2948553 2959965 2958242
50620B958242j6984l1894m3986n1696n4549n3049m8298m1256l2335k2076j1857
$$ 2958242 2941258 2909364 2865378 2813682 2759133 2706084 2657786 2616530 2584195 2562119 2550262
50609B550262l367K658O599Q759Q676N782J29p777j7405k8097l9069m9870o0448
$$ 2550262 2546895 2549553 2556152 2564911 2573587 2579369 2579498 2571721 2554316 2526219 2487150 2437280 2376832
50596B376832p0397p8539q3741q5856q5590q3678q0682p7160p3503o9629o5313
$$ 2376832 2306435 2227896 2144155 2058299 1972709 1889031 1808349 1731189 1657686 1588057 1522744
50585A522744o0677n6018n1258m6154m0960l6327l2432k8744k4832k0952j7494
$$ 1522744 1462067 1406049 1354791 1308637 1267677 1231350 1198918 1170174 1145342 1124390 1106896
50574A106896j4335j1115p927n101k523K89L309N842P487Q811J0608J2831J4838
$$ 1106896 1092561 1081446 1073519 1068418 1065895 1066184 1069493 1075335 1082822 1091633 1102241 1115072 1129910
50561A129910J6460J8231K0459K2806K4955K7066K9185L0774L1406L1558L2058
$$ 1129910 1146370 1164601 1185060 1207866 1232821 1259887 1289072 1319846 1351252 1382810 1414868
50550A414868L2968L3558L3391L2745L2047L1454L1162L1463L2329L3432L4857
$$ 1414868 1447836 1481394 1514785 1547530 1579577 1611031 1642193 1673656 1705985 1739417 1774274
50539A774274L7402M1715M7431N3609N9757O6081P2870Q0129Q7828R6053J04683
$$ 1774274 1811676 1853391 1900822 1954431 2014188 2080269 2153139 2233268 2321096 2417149 2521832
50528B521832J13220J21262J29007J36833J44423J50738J55138J58041J59920
$$ 2521832 2635052 2756314 2885321 3022154 3166577 3317315 3472453 3630494 3790414
50519C790414J59984J56607J49117J38339J25120J09186Q9965O7900M4146J9457
$$ 3790414 3950398 4107005 4256122 4394461 4519581 4628767 4718732 4786632 4830778 4850235
50509D850235n822l1003n5166p7781r8316j15395j27397j34017j36230j34415
$$ 4850235 4844413 4813410 4758244 4680463 4582147 4466752 4339355 4205338 4069108 3934693
50499C934693j27558j14898r7541p7648n6543l4476j1924R708K8729M3862N4112
$$ 3934693 3807135 3692237 3594696 3517048 3460505 3426029 3414105 3423813 3452542 3496404 3550516
50488C550516N8403N5756M5818K9094O671k0125m9547p8988j05313j26276j41493
$$ 3550516 3608919 3664675 3710493 3739587 3746258 3726133 3676586 3597598 3492285 3366009 3224516
50477C224516j51715j57353j58252j54717j47923j39096j28967j18200j07640
$$ 3224516 3072801 2915448 2757196 2602479 2454556 2315460 2186493 2068293 1960653
50468A960653r7771q8460p9661p1888o5498o0031n4727m9376m4157l9057l3940
$$ 1960653 1862882 1774422 1694761 1622873 1557375 1497344 1442617 1393241 1349084 1310027 1276087
50457A276087k8969k4361j9915j5289j0672o631l374n98J967M307O452Q628J0967
$$ 1276087 1247118 1222757 1202842 1187553 1176881 1170250 1166876 1166278 1168245 1172552 1179004 1187632 1198599
50444A198599J3362J5734J8144K0539K2502K3419K2888K0949J8000J4475J0601
$$ 1198599 1211961 1227695 1245839 1266378 1288880 1312299 1335187 1356136 1374136 1388611 1399212
50433A399212O579K976O56J20R97K365L505M274M951N917P459R658J2368J5313
$$ 1399212 1405791 1408767 1409423 1409543 1410540 1412905 1416410 1420684 1425635 1431552 1439011 1448669 1461037 1476350
50419A476350J8275K1270K4603K8660L3553L9080M5063N1543N8349O4836P0413
$$ 1476350 1494625 1515895 1540498 1569158 1602711 1641791 1686854 1738397 1796746 1861582 1931995
50408A931995P5150P9331Q2621Q4255Q4054Q2647Q0516P7427P2890O6714N8905
$$ 1931995 2007145 2086476 2169097 2253352 2337406 2420053 2500569 2577996 2650886 2717600 2776505
50397B776505M9530L8823K6885J3316k236j8936l5039m9545o2732p4644q4069
$$ 2776505 2826035 2864858 2891743 2905059 2902823 2883887 2848848 2799303 2736571 2661927 2577858
50386B577858q9721r1706r0841q7181q0262p0472n9092m7037l4468k1575q956
$$ 2577858 2488137 2396431 2305590 2218409 2138147 2067675 2008583 1961546 1927078 1905503 1896547
50375A896547K787J3052K0784K4887K5287K2959J8600J1879K251r937k3456l6893
$$ 1896547 1899334 1912386 1933170 1958057 1983344 2006303 2024903 2036782 2039033 2029096 2005640 1968747
50363A968747m9082n9129o6366p0391p1270o9790o7179o4154o0408n5436m9567
$$ 1968747 1919665 1860536 1794170 1723779 1652509 1582719 1515540 1451386 1390978 1335542 1285975
50352A285975m3709l8279l3114k8357k4553k1834j9735j8221j7979j9270k1080
$$ 1285975 1242266 1203987 1170873 1142516 1117963 1096129 1076394 1058173 1040194 1020924 999844
50341I99844k2052k1851k0923j9318j6590j2854r138o361m415k615p35Q27J853
$$ 999844 977792 955941 935018 915700 899110 886256 877118 870757 866342 863727 862992 863819 865672
50328H65672K805M281O129P472P691P160O809P082P511P358O475N387M610M063
$$ 865672 868477 872758 878887 886359 894050 901210 908019 915101 922612 929970 936445 941832 946442 950505
50314I50505L264K063R64N65Q31J167J210J166J344J744K295L167M496N969P013
$$ 950505 953769 955832 956796 957361 958192 959359 960569 961735 963079 964823 967118 970285 974781 980750 987763
50299I87763P482P863Q809J0459J2329J3856J5087J6711J9326K2771K6434K9999
$$ 987763 995245 1003108 1011917 1022376 1034705 1048561 1063648 1080359 1099685 1122456 1148890 1178889
50287A178889L3605L7386M1241M4783M6724M4565L5995K1275L693j2796k5903
$$ 1178889 1212494 1249880 1291121 1335904 1382628 1427193 1463188 1484463 1488156 1475360 1449457
50276A449457l4965l9802m0628l8518l4908l0708k6407k2622j9611j6668j2919
$$ 1449457 1414492 1374690 1334062 1295544 1260636 1229928 1203521 1180899 1161288 1144620 1131701
50265A131701q662n101k813j223M96K796N903R687J3324J5859J7300J8448J9659
$$ 1131701 1123039 1117938 1115125 1113902 1114398 1117194 1123097 1132784 1146108 1161967 1179267 1197715 1217374
50252A217374K0575K1103K1650K2110K1637J9998J8250J7447J7314J6810J5452
$$ 1217374 1237949 1259052 1280702 1302812 1324449 1344447 1362697 1380144 1397458 1414268 1429720
50241A429720J3322J0302O099Q75m784j0449j5848k0414k3348k4324k3873k2947
$$ 1429720 1443042 1453344 1459443 1460318 1455534 1445085 1429237 1408823 1385475 1361151 1337278 1314331
50229A314331k2234k1725k0948j9810j9228k0479k3696k7478l0322l2039l3288
$$ 1314331 1292097 1270372 1249424 1229614 1210386 1189907 1166211 1138733 1108411 1076372 1043084
50218A043084l4203l4147l2745l0398k7642k4596k1258j7943j5065j2721j0779
$$ 1043084 1008881 974734 941989 911591 883949 859353 838095 820152 805087 792366 781587
50207G81587r175p906o842n826m905m259l844l369k697k092j896k096k406k630
$$ 781587 772412 764506 757664 751838 746933 742674 738830 735461 732764 730672 728776 726680 724274 721644
50193G21644k738k720k564k423k463k629k774l032l633m401m869m964n106n470
$$ 721644 718906 716186 713622 711199 708736 706107 703333 700301 696668 692267 687398 682434 677328 671858
50179F71858n699n564n365n308n029m222l273k681k276j645r16m87k45K42R05
$$ 671858 666159 660595 655230 649922 644893 640671 637398 634717 632441 630796 629880 629393 629148 629390 630295
50164F30295J340J575K013K708L416M254N584P291Q846J0052J1067J1842J2343
$$ 630295 631635 633210 635223 637931 641347 645601 651185 658476 667322 677374 688441 700283 712626
50151G12626J3206J5090J7432J8882J9216J9748K1464K3822K6008K8341L1602
$$ 712626 725832 740922 758354 777236 796452 816200 837664 861486 887494 915835 947437
50140I47437L5611L9324M2013M3648M4424M4526M4223M3808M3513M3579M4049
$$ 947437 983048 1022372 1064385 1108033 1152457 1196983 1241206 1285014 1328527 1372106 1416155
50129A416155M4361M3703M1881L9232L5516K9712K1375J1454J257q711j8346k7210
$$ 1416155 1460516 1504219 1546100 1585332 1620848 1650560 1671935 1683389 1684646 1675935 1657589 1630379
50117A630379l4928m1663m7303n0841n1520n0185m8403m6506m3618l9507l5240
$$ 1630379 1595451 1553788 1506485 1455644 1404124 1353939 1305536 1259030 1215412 1175905 1140665
50106A140665l1707k8627k5449k2553k0782k0191j9849j8805j6908j4667j2645
$$ 1140665 1108958 1080331 1054882 1032329 1011547 991356 971507 952702 935794 921127 908482
50095I08482j1046r848q992q271p176n246k702l36J369K623L745M655N278N970
$$ 908482 897436 887588 878596 870325 863149 857903 855201 854865 856234 858857 862602 867257 872535 878505
50081H78505P016Q032Q367P914P106O256N303M114K652J030l68j058j098j267
$$ 878505 885521 893553 901920 909834 916940 923196 928499 932613 935265 936295 935927 934869 933771 932504
50067I32504k160l322l828l563l412m168n592o758p007o550o170o279o405n834
$$ 932504 930344 927022 923194 919631 916219 912051 906459 899701 892694 886144 879974 873695 867290 861456
50053H61456m651l560k635j052J522M073N384N510N471N939O948Q382R957J1030
$$ 861456 856805 853245 850610 849558 851080 855153 860537 866047 871518 877457 884405 892787 902744 913774
50039I13774J1321J1499J2319J3352J3495J2527J1281J0364R718R405R799J0737
$$ 913774 925095 936594 948913 962265 975760 988287 999568 1009932 1019650 1029055 1038854 1049591
50027A049591J1380J1287J1000J1270J2396J4374J6959J9365K0670K0923K1086
$$ 1049591 1060971 1072258 1083258 1094528 1106924 1121298 1138257 1157622 1178292 1199215 1220301
50016A220301K1555K1480K0020J7553J4995J2592J0194Q191P212O953O129L818
$$ 1220301 1241856 1263336 1283356 1300909 1315904 1328496 1338690 1346881 1354093 1361046 1367175 1370993
50004A370993K08m168r359j5728k2993k9999l5531l9083m0710m0468l8380l4920
$$ 1370993 1371201 1367033 1357674 1341946 1318953 1288954 1253423 1214340 1173630 1133162 1094782 1059862
49992A059862l1044k7545k4669k2414k0770j9380j7544j5076j2811j1693j1682
$$ 1059862 1028818 1001273 976604 954190 933420 914040 896496 881420 868609 856916 845234
49981H45234j2100j2687j3594j4590j5164j5315j5431j5379j4614j3247j2122
$$ 845234 833134 820447 806853 792263 777099 761784 746353 730974 716360 703113 690991
49970F90991j1520j0733r277p736o841o407n855n241n129n632o222o310n714m693
$$ 690991 679471 668738 659461 651725 644884 638477 632622 627381 622252 616620 610398 604088 598374 593681
49956E93681l738l117k466j203N52K008K816L624N085O853Q132Q746R096R332
$$ 593681 589943 586826 584360 583157 583709 585717 588533 592157 597242 604095 612227 620973 630069 639401
49942F39401R193Q577P729O874O050N260M541L807K900J651j49k617n458q042
$$ 639401 648594 657171 664900 671774 677824 683084 687625 691432 694332 695983 695834 693217 687759 679717
49928F79717j0017j1543j2787j3494j3348j2429j1022r295p438n744m218k518
$$ 679717 669700 658157 645370 631876 618528 606099 595077 585782 578344 572600 568382 565864
49916E65864o49O69Q77M35K79O72J209J659K194K810L238L458L795M412N144N828
$$ 565864 565215 565884 566761 567196 567475 568147 569356 571015 573209 576019 579257 582715 586510 590922 596066 601894
49900F01894O390O684O738P098Q349J0156J1358J1191R954Q285O352M076J743
$$ 601894 608284 614968 621706 628804 637153 647309 658667 669858 679812 688097 694449 698525 700268
49887G00268j37j435k446l427m354n194o103p289q720j0100j1073j1507j1534
$$ 700268 700131 698696 696250 692823 688469 683275 677172 669883 661163 651063 639990 628483 616949
49874F16949j1359j1099j0770j0252r237p476n246l345k319j811j078O2J158J932
$$ 616949 605590 594491 583721 573469 564232 556756 551510 548165 545846 544035 542957 543019 544177 546109
$$ [...]
##END NTUPLES=NMR SPECTRUM
##END=
