
##TITLE=AC1409_CRIAH12218_7652841_IGf1nGLMjE
##JCAMPDX= 6.0         $$ Bruker NMR JCAMP-DX V2.0
##DATA TYPE= nD NMR SPECTRUM
##DATA CLASS= NTUPLES
##NUM DIM= 2
##ORIGIN= BRUKER
##OWNER= Administrator
$$ 1.72 TOPSPIN		Version 2.1
$$ 2013-03-19 23:43:45.586 -0500  Administrator@X
$$ Compression mode = diff/dup
##.OBSERVE FREQUENCY= 400.02188249412
##.OBSERVE NUCLEUS= ^1H
##.ACQUISITION MODE= SIMULTANEOUS (DQD)
##.ACQUISITION SCHEME= NOT PHASE SENSITIVE
##.AVERAGES= 4
##.DIGITISER RES= 22
##SPECTROMETER/DATA SYSTEM= spect
##.PULSE SEQUENCE= jresgppsqf.2
##.SOLVENT NAME= COFFEE_meoh
##.SHIFT REFERENCE= INTERNAL, COFFEE_meoh, 1, 14.96076
##AUDIT TRAIL= $$ (NUMBER, WHEN, WHO, WHERE, PROCESS, VERSION, WHAT)
$$ ##TITLE= Audit trail, TOPSPIN		Version 2.1
$$ ##JCAMPDX= 5.01
$$ ##ORIGIN= Bruker BioSpin GmbH
$$ ##OWNER= Administrator
$$ $$ E:\/data/COFFEE/nmr/AC1409_CRIAH12218_7652841_IGf1nGLMjE/13/pdata/1/auditp.txt
$$ ##AUDIT TRAIL=  $$ (NUMBER, WHEN, WHO, WHERE, PROCESS, VERSION, WHAT)
(   1,<2013-03-19 23:43:36.399 -0500>,<Administrator>,<X>,<go>,<TOPSPIN 2.1>,
      <created by zg
	started at 2013-03-19 23:29:12.914 -0500,
	POWCHK enabled, PULCHK disabled,
       configuration hash MD5:
       86 BA 57 50 F2 9D 5C 9B 26 00 A9 28 5F 66 2E 89
       data hash MD5: 8K * 40
       75 A9 43 AD 24 B7 96 59 E8 0D 28 7E C1 29 75 66>)
(   2,<2013-03-19 23:43:40.774 -0500>,<Administrator>,<X>,<proc2d>,<TOPSPIN 2.1>,
      <Start of raw data processing
       xfb same F2: SI = 16K WDW = 3 SSB = 0 FT_mod = 6 PKNL = 1 F1: SI = 512 WDW = 3 SSB = 0 FT_mod = 6 PH_mod = 2
       data hash MD5: 16K * 512
       74 D9 C4 96 AA 7E 96 56 DD A5 60 72 C9 CE 71 ED>)
(   3,<2013-03-19 23:43:41.789 -0500>,<Administrator>,<X>,<proc2d>,<TOPSPIN 2.1>,
      <abs2 F2: ABSG = 5 ABSF1 = 10.00065 ABSF2 = 0.0001152569
       data hash MD5: 16K * 512
       59 DE 8F 6B FB 26 A6 01 A9 AD 17 E4 F4 B7 7B EB>)
(   4,<2013-03-19 23:43:42.524 -0500>,<Administrator>,<X>,<proc2d>,<TOPSPIN 2.1>,
      <tilt
       data hash MD5: 16K * 512
       16 1D 56 55 2E 00 5D F9 6F 13 F5 3C A9 3A 67 73>)
(   5,<2013-03-19 23:43:43.883 -0500>,<Administrator>,<X>,<proc2d>,<TOPSPIN 2.1>,
      <abs1 F1: ABSG = 5 ABSF1 = 0.06497851 ABSF2 = -0.06497862
       data hash MD5: 16K * 512
       9A 04 63 0D 35 41 69 FC BD 08 22 5D 00 23 3B 61>)
(   6,<2013-03-19 23:43:45.180 -0500>,<Administrator>,<X>,<proc2d>,<TOPSPIN 2.1>,
      <symj
       data hash MD5: 16K * 512
       DC 69 03 96 A8 32 33 94 5A 80 FA 17 F1 EC A7 EB>)
$$ ##END=
$$ 
$$ $$ hash MD5
$$ $$ 25 99 BD C5 29 83 72 49 11 FD BE B6 C7 79 70 6B
##$RELAX= 
##$RELAX= 
##$RELAX= 
##$RELAX= 
##$RELAX= 
##$RELAX= 
##$RELAX= 
$$ Bruker specific parameters
$$ --------------------------
##$DU= <E:\>
##$EXPNO= 13
##$NAME= <AC1409_CRIAH12218_7652841_IGf1nGLMjE>
##$PROCNO= 1
##$TYPE= <nmr>
##$USER= <COFFEE>
##$ACQT0= 1000000
##$AMP= (0..31)
100 100 100 100 100 100 100 100 100 100 100 100 100 100 100 100 100 100
$$ [...]
##$TD0= 1
##$TE= 300
##$TE2= 300
##$TE3= 300
##$TEG= 300
##$TL= (0..7)
0 120 120 120 120 120 120 120
##$TP= (0..7)
150 150 150 150 150 150 150 150
##$TP07= 0
##$TPNAME0= <>
##$TPNAME1= <>
##$TPNAME2= <>
##$TPNAME3= <>
##$TPNAME4= <>
##$TPNAME5= <>
##$TPNAME6= <>
##$TPNAME7= <>
##$TPOAL= (0..7)
0.5 0.5 0.5 0.5 0.5 0.5 0.5 0.5
##$TPOFFS= (0..7)
0 0 0 0 0 0 0 0
##$TUNHIN= 0
##$TUNHOUT= 0
##$TUNXOUT= 0
##$USERA1= <user>
##$USERA2= <user>
##$USERA3= <user>
##$USERA4= <user>
##$USERA5= <user>
##$V9= 5
##$VALIST= <valist>
##$VCLIST= <CCCCCCCCCCCCCCC>
##$VD= 0
##$VDLIST= <DDDDDDDDDDDDDDD>
##$VPLIST= <PPPPPPPPPPPPPPP>
##$VTLIST= <TTTTTTTTTTTTTTT>
##$WBST= 2048
##$WBSW= 25
##$XGAIN= (0..3)
0 0 0 0
##$XL= 0
##$YL= 0
##$YMAX_a= 65387
##$YMIN_a= -124824
##$ZGOPTNS= <>
##$ZL1= 120
##$ZL2= 120
##$ZL3= 120
##$ZL4= 120
##$ABSF1= 0.06497851
##$ABSF2= -0.06497862
##$ABSG= 5
##$ABSL= 0
##$ALPHA= 0
##$AQORDER= 0
##$ASSFAC= 0
##$ASSFACI= 0
##$ASSFACX= 0
##$ASSWID= 0
##$AUNMP= <>
##$AXLEFT= 0
##$AXNAME= <F1>
##$AXNUC= <1H>
##$AXRIGHT= 0
##$AXTYPE= 0
##$AXUNIT= <>
##$AZFE= 0.1
##$AZFW= 0.5
##$BCFW= 0
##$BC_mod= 0
##$BYTORDP= 0
##$COROFFS= 0
##$CY= 15
##$DATMOD= 1
##$DC= 0
##$DFILT= <>
##$DTYPP= 0
##$F1P= 0
##$F2P= 0
##$FCOR= 0.5
##$FTSIZE= 512
##$FT_mod= 6
##$GAMMA= 0
##$GB= 0
##$INTBC= 1
##$INTSCL= 1
##$ISEN= 128
##$LB= 0
##$LEV0= 0
##$LPBIN= 0
##$MAXI= 10000
##$MC2= 0
##$MEAN= 0
##$ME_mod= 0
##$MI= 1
##$NCOEF= 0
##$NC_proc= -5
##$NLEV= 6
##$NOISF1= 0
##$NOISF2= 0
##$NSP= 0
##$NTH_PI= 0
##$NZP= 0
##$OFFSET= 0.06497851
##$PC= 4
##$PHC0= 0
##$PHC1= 0
##$PH_mod= 2
##$PKNL= no
##$PPARMOD= 1
##$PPDIAG= 0
##$PPIPTYP= 0
##$PPMPNUM= 2147483647
##$PPRESOL= 1
##$PSCAL= 1
##$PSIGN= 0
##$PYNMP= <proc.py>
##$REVERSE= no
##$SF= 400.021882494141
##$SI= 512
##$SIGF1= 0.06497851
##$SIGF2= -0.06497862
##$SINO= 16
##$SIOLD= 512
##$SPECTYP= <>
##$SREGLST= <1H.MeOD>
##$SSB= 0
##$STSI= 512
##$STSR= 0
##$SW_p= 51.9856959427865
##$SYMM= 3
##$S_DEV= 2656
##$TDeff= 40
##$TDoff= 0
##$TI= <>
##$TILT= yes
##$TM1= 0
##$TM2= 0
##$TOPLEV= 0
##$USERP1= <user>
##$USERP2= <user>
##$USERP3= <user>
##$USERP4= <user>
##$USERP5= <user>
##$WDW= 3
##$XDIM= 16
##$YMAX_p= 315137965
##$YMIN_p= 0
$$ End of Bruker specific parameters
$$ ---------------------------------
##NTUPLES= nD NMR SPECTRUM
##VAR_NAME=  FREQUENCY1,    FREQUENCY2,      SPECTRUM
##SYMBOL=    F1,            F2,              Y
##.NUCLEUS=  1H,            1H
##VAR_TYPE=  INDEPENDENT,   INDEPENDENT,     DEPENDENT
##VAR_FORM=  AFFN,          AFFN,            ASDF
##VAR_DIM=   512,           16384,           16384
##UNITS=     HZ,            HZ,              ARBITRARY UNITS
##FACTOR=    0.101534562388255, 0.501933850740131, 1
##FIRST=     25.9928259484165, 8223.18227667557, -1636
##LAST=      -25.8913354319817, 0,           -1846
##MIN=       -25.8913354319817, 0,           0
##MAX=       25.9928259484165, 8223.18227667557, 315137965
##PAGE= F1=25.99282594842
##FIRST=     25.9928259484165, 8223.18227667557, -1636
##DATA TABLE= (F2++(Y..Y)), PROFILE
$$ [...]
$$ plain form
15328 6730 5042 3474 1723 523 -215 -16 403 1016 1566 1708 1596 2759 4739 5962 4481 3346 2205
15311 2205 1657 1333 974 -104 -2289 -4568 -3155 -1925 -1369 -1042 -1331 -3164 37 2224 3202 2899 1668
15294 1668 110 634 2483 4269 5637 5493 7272 5830 4046 3352 2107 911 -33 -700 -802 -613 -149
15276 -25 -713 -2397 -4451 -3638 -1542 -12 651 -81 -1648 -2983 -3809 -4258 -4607 -5811 -4295 -2665 -2007 -1276
15258 -1276 -162 414 410 -344 -961 -422 -48 600 1821 2816 3372 3439 3142 2807 1290 -1153 -3155 -4785 -6300
15239 -6300 -3018 -1566 -1992 -471 735 63 -2024 -1954 -1706 -1362 -1623 -1292 -1365 -2071 -7305 -10868 -11998 -10233
15221 -10233 -7075 247 2786 3523 1843 -309 -3264 -4212 -4163 -2731 -824 978 2119 1449 133 -2163 -3161
15204 -3161 -46 2292 4258 8764 9258 6391 4642 -3597 -5993 -6284 -4931 -3639 -1522 13 -655 -1940
$$ packed form
15328F730j688j568A723E23b15a6D03O13N50J42j12J163J980J223j481j135j141
15311B205n48l24l59a04k185k279J413J230N56L27k89j833C7K187R78l03j231
15294A668A10N24J849J786J368j44J779j442j784o94j245I11c3o67j02J89a49
15276b5o88j684k054Q13a542a2F51h1j567j335q26m49l49j204J516J630O58P31
15258a276a62D14mc44o17d22d8F00J221R95N56O7k97l35A290a153k002j630j515
15239f300c018J452m26d71G35F3b024P0K48L44k61L31p3p06n234l563j130J765
15221a0233L158B47K539P37j680c09k955r48M9J432h24I78J141o70A33b163r98
15204c161d6B292J966M506M94k867j749c597k396k91J353J292a522A3f55j285
$$ plain form
15188 -1940 -2355 -1557 -511 29 339 994 1647 1743 461 -399 -2661 -5278 -7146 -6738 -5141 -4838 -4744 -4021 -3124
15169 -3124 81 1244 1094 -128 -1763 1277 3496 3080 367 -412 -266 682 685 698 -348 -2306 -3903 -2060
15151 -2060 -1828 -2198 -2340 319 2826 4826 8307 14530 15326 14328 11182 -987 281 547 621 -289 -1999 -2839
15133 -2839 -1025 1860 3084 2806 954 -1699 -3885 -5800 -7665 -5097 -3647 -1778 -1324 -1076 -780 -578
15117 -578 -272 329 756 1442 2049 2774 3363 3827 4084 3404 2174 812 -746 -2065 -3123 -3766 -3178 -1343
15098 -161 -263 -1082 -2261 -3199 -2673 -1838 -2411 -3060 -2238 -722 153 17 -282 -1278 -1882 -1726 -1001 -776 -623 -772
15078 -772 80 -305 -1281 -2837 -2271 -584 393 684 651 481 496 -437 -2024 -3905 -5736 -8025 -5998 -3144
15060 -3144 -1824 -1505 -1624 -1622 -943 626 2286 3158 2982 1282 -653 -2045 -839 924 1762 1606 760 -544 -1947
$$ packed form
15188a940m15P98e11B9L10O55O53R6D61c99k262k617j868M08J597L03R4P23Q97
15169c124H1J163j50a28j635A277K219m16C67d12J46F82LJ3c48j958j597J843
15151b060K32l70j42C19K507K000L481O223P96r98l146i87B81K66P4b89j710q40
15133b839a025A860J224k78I54a699k186j915j865K568J450a778M54K48K96K02
15117e78b72C29M27O86O07P25N89M64K57o80j230H12g46j319j058o43N88a343
15098a61j02q19j179r38N26Q35n73o49Q22g22A53A7b82r96o04J56P25K25J53j49
15078g72H0c05r76j556N66e84C93K91l3j70J5d37j587j881j831k289K027K854
15060c144J320L19j19KO79F26J660Q72j76A282f53j392h39I24Q38j56G60e44j403
$$ plain form
15041 -1947 -2977 -3500 -3050 -2557 -2026 -1574 -1213 -838 -613 -144 127 875 1150 1118 562 -178 -964 -1152 -487
15021 857 2197 2872 2458 1040 -295 -1105 -1131 -1242 -1823 -2917 -3726 -2806 -1760 -626 187 1002 1088 838 1057
15002 1057 2083 3381 3387 1598 -42 -641 -1463 -1780 -1459 253 2785 3291 2371 1178 968 358 1505 3331
14984 3331 3002 1092 -2197 -6290 -982 3855 6553 6935 3902 2301 763 -752 -937 -201 1043 2280
14968 2280 2612 1978 468 -1192 -1679 -596 235 161 -1443 -3779 -6674 -3161 -1355 -1289 -280 518 517 -733 -2366
14949 -2366 -3633 -4864 -5466 -4650 -2835 -2511 -2727 -2907 -3257 -2695 -1713 -955 239 1841 2625 2211 1210 -297
14930 -9 1743 2732 2469 1225 -461 -2115 -3483 -1246 3314 6741 8665 8022 3872 3096 2746 2665 3120 3687
14912 3687 3053 1683 -455 -2437 -3353 -1438 337 527 324 -16 -347 -247 -108 578 2264 3704 5925 6596
$$ packed form
15041a947j030n23M50M93N31M52L61L75K25a44A27P48K75l2n56a78p86j88d87
15021H57J340O75m14A040b95q10k6j11n81j094q09R20J046f26A87Q15Q6k50K19
15002A057J026J298OA598d2n99q22l17L21B53K532N06r20A178k10C58J147J826
14984C331l29A092b197m093i82C855K698L82l033j601G63g52j85b01A043J237
14968B280L32o34D68a192m87e96B35p4a443k336k895c161a355O6b80E18jg33j633
14949b366j267j231o02Q16J815L24k16j80l50N62R82P58B39J602P84m14j001b97
14930iA743R89k63A225d61j654j368a246C314L427J924o43C872p76l50q1M55N67
14912C687o34j370d55j982r16a438C37J90k03a6l31J00a08E78J686J440K221O71
$$ plain form
14894 6596 5365 4233 2173 -573 -3450 -5453 -6296 -2894 -2630 -3896 -3879 -4382 -2482 -1229 -831 767 1319
14877 1319 1307 446 -485 -1234 -2072 -2017 -2513 -3847 -5044 -5091 -3488 -1568 314 1781 3126 3836 3552 2831
14859 2831 2225 971 -345 -1665 -2569 -2698 -2281 -1459 -337 340 456 -533 -1498 -3056 -1641 -192 851 1404
14841 1404 1649 2145 2284 581 -1539 -2479 -3742 -3556 -2077 3 1600 1518 295 -326 505 2251 4316 6399
14823 6399 7431 5817 2273 -870 -3697 -6365 -5916 -2339 -726 -341 -1124 -2702 -4329 -4020 -3036 -1960
14807 -1960 -1143 -602 944 3104 5224 7231 7734 6678 4400 2631 265 -959 -2399 -2558 -2316 -1648 -1036
14790 -1036 -552 -270 -889 -83 1925 3050 2390 747 -1009 -2768 -3212 -2512 -1004 383 1130 1794 2210 2368
14772 2368 1915 1332 596 511 1323 2448 3924 4471 4961 4717 4640 3536 2719 2456 1878 389 -1364 -2912
$$ packed form
14894F596j231j132k060e73k877k003q43b894K64j266J7n03J900a229L98G67N52
14877A319j2D46d85p49q38N5m96j334j197m7J603a568C14J467J345P10k84p21
14859B831o06I71c45j320r04j29M17Q22c37C40J16e33r65j558J415a92H51N53
14841A404K45M96J39E81a539r40j263J86J479CJ597q2B95c26E05J746K065K083
14823F399J032j614B273h70k827k668M49b339g26c41p83j578j627L09R84J076
14807a960Q17N41I44K160K120K007N03j056k278j769B65i59j440j59K42O68O12
14790a036M84b70o19h3A925J125o60G47a009j759m44P00a004C83P47O64M16J58
14772B368m53n83E96q5Q12J125J476N47M90k44p7j104q17k63n78C89a364j548
$$ plain form
14754 -2912 -4731 -1608 -766 -771 -187 890 802 780 -62 -1264 -2146 -2228 -1056 -79 877 1993 3609 6542 3972
14735 3972 2813 1702 930 861 862 666 -116 -887 -1610 -1831 -246 897 1345 2157 1453 493 356 568 778 690
14715 690 221 87 319 816 1447 1278 -488 -2510 -3093 -2584 -1518 -536 -524 7887 9779 8049 5055 -959
14696 -4578 -3525 -1820 -107 1547 2867 2395 111 -2344 -2096 176 1958 2764 2706 1987 889 421 492 1071
14678 1071 1599 1698 995 388 -115 -332 -387 320 1183 2112 3099 3603 3883 3678 3083 2503 1703 720 -151 -1061
14658 -1061 -1489 -1513 -1059 -428 314 1092 1850 2454 2737 2274 756 -1418 -3678 -4248 -2867 -1197 424 1729
14640 1729 2338 2412 2332 2439 1957 1766 1144 1247 1631 2149 2531 3311 8236 10414 10129 7486 -562 -985 -483
14620 1619 1471 -193 -627 -947 -149 -122 153 -74 -224 -552 -1046 -733 -712 -1481 -2030 -3074 -4215 -4418 -2906
$$ packed form
14754b912j819a608g66na87H90q8k2f2j202q82q2a056g9H77J116J616K933k570
14735C972j159j111p72o9Jj96a16p71p23k21b46H97M48Q12p04D93j37K12K10q8
14715F90B21H7K32M97O31j69d88k022n83N09J066e36J2G887J892j730k994i59
14696d578J053J705a07A547J320m72A11b344K48A76J782Q06n8p19H89D21P1N79
14678A071N28R9p03C88a15k17n5C20Q63R29R87N04K80k05n95n80q00G20a51r10
14658a061m28k4M54d28C14P78P58O04K83m63G56a418k260n70J381a197D24J305
14640A729O09P4q0J07m82j91o22J03L84N18L82P80M925K178k85k643e62m23d83
14620A619j48a93m34l20a49K7A53g4j50l28m94L13K1p69n49j044j141k03J512
$$ plain form
14601 -2906 -2161 -998 17 1447 343 -1485 -2500 -2629 -2713 -2495 -908 707 2013 3075 4252 4920 5489 6149
14583 6149 6322 4127 2952 1587 584 -485 -1460 -2499 -3529 -3914 -3311 -1767 325 2616 4243 4592 3989
14566 3989 2823 2091 1912 1866 2286 3031 2489 2111 1425 9 -1286 -2066 -844 1934 3871 3986 3325 2922 2791
14547 2791 2122 743 -1418 -3388 -3400 -2787 -2755 -2128 -485 -183 247 551 -72 -1265 -2524 -2576 -2340 -2745 -3730
14528 -3730 -4367 -3866 -3490 -2641 -979 240 1906 3252 3830 3880 7301 7974 9315 8065 7688 4748 -2282
14510 -2638 -1967 -656 791 1395 1561 1925 2527 3004 3291 3811 2683 2350 992 83 -766 -1284 -1757 -1994 -2175
14491 -2175 -2685 -3798 -3368 -1097 885 1467 1107 644 34 -251 280 444 -380 -450 -1338 -1784 -1401 -221 713
14471 969 940 841 1643 2322 3010 2155 1687 108 -1360 -2123 -2093 -662 -89 107 667 2057 3981 7198 8288
$$ packed form
14601b906P45i98A7J430C43a485j015j29q4K18i08G07J306J062J177O68N69O60
14583F149J73k195j175j365E84d85r75j039j030l85O03J544C25K291J627L49o03
14566C989j166p32j79m6M20P45n42l78o86Ia286p80h44A934J937J15o61m03j31
14547B791o69G43a418j970j2O13L2O27d85a83B47L04g2j193j259n2K36m05r85
14528c730o37N01L76Q49i79B40J666J346N78N0L421O73J341j250l77k940b282
14510b638O71f56G91O04J66L64O02M77K87N20j128l33I92H3g66n18m73k37j81
14491b175n10j113M30a097H85N82l60m63C4b51B80J64c80p0q88m46L83b21G13
14471I69k9r9Q02O79O88q55m68A08a360p63L0f62h9A07N60J390J924L217J090
$$ plain form
14452 8288 6164 1700 -214 937 2329 3126 3263 2016 10827 -2761 353 -6010 -10296 -1950 -555 -174
14435 1930 2273 2898 2983 3224 3872 5764 6907 6625 5022 2955 771 -1301 -2876 -1687 642 1766 1476
14418 1476 -145 -2627 -4551 -4672 -4311 -4188 -4141 -4024 -3688 -3867 -2774 -2096 -2128 -3399 -2288 -2914 -4583 -8571
14400 -8571 -6273 -1439 -1029 -699 -774 -964 -2363 -3107 -3729 -3606 -3249 -1447 523 1796 2398 2125 1422 730
14382 730 17 -372 -51 1963 3805 3837 2469 662 -1117 -1530 -943 -337 272 347 -833 -2009 -3204 -4296 -6246
14363 -6246 -5584 -3399 -2181 417 -601 48 -700 -1424 -1749 -1712 -6162 -5851 -2696 202 2963 4296 8975 8254
14345 8254 -174 -2335 -2395 -1522 -114 32 210 735 1532 1787 1811 1919 2265 1567 642 -257 -1198 -722 1479 1911
14325 1911 2834 3807 4869 6585 8708 8835 7039 2309 257 -1646 -467 780 1393 1617 1420 1529 2310
$$ packed form
14452H288k124A700b14I37J392P97J37j247Q811b761C53f010m286a950e55a74
14435A930L43O25Q5K41O48J892J143k82j603k067G71a301j575J189F42J124k90
14418A476a45k482j924j21L61J23M7J17L36j79J093O78l2j271J111o26j669l988
14400h571K298a439M10L30p5j90j399p44o22J23L57a447E23J273O02k73p03o92
14382G30A7c72e1A963J842L2j368F62a117m13N87c37B72P5h33j176j195j092j950
14363f246O62K185J218D17f01D8g00p24l25L7m450L11b696B02K761J333M679p21
14345H254a74k161o0Q73a14C2J78N25P97K55K4J08L46o98F42b57r41M76A479M32
14325A911R23R73J062J716K123J27j796B309B57a646d67G80O13K24j97J09P81
$$ plain form
14308 2310 3532 4675 6287 6555 5942 4484 3070 1200 -555 -81 69 -91 -558 -1277 -2494 -4160 -4781 -4217
14290 -4217 -2357 -282 1014 1506 1443 980 910 -167 -1504 -1832 -1095 -154 -488 402 377 244 471 1056 883
14271 883 -217 -1626 -3376 -4392 -4098 -3394 -2668 -1727 -1192 -207 33 391 512 609 -486 -649 -310 -323 -271 39
14250 -146 -935 -1411 -1508 -891 1007 3377 6337 8899 11813 12617 11785 9039 5171 2083 1526 1859 1796 1410
14232 1410 302 -1128 -2200 -2957 -2475 -987 -255 -29 200 455 -196 -1529 -2637 -2328 -563 1283 2273 2447
14214 2447 1715 1214 1063 1454 1930 1941 2050 2122 1257 -303 -521 -538 -535 -786 -1521 -1673 -1875 -1585 -1101 -281 1072
14192 1884 2201 2116 2266 3421 5902 7091 6791 4085 2617 557 -1627 -2905 -4048 -4561 -5758 -6258 -6666
14175 -6666 -6054 -3666 -2459 -2380 -2439 -2045 -1487 -864 83 364 137 -1040 -1771 -2799 -2056 -1474 -1767 -2036 -2413
$$ packed form
14308B310J222J143J612K68o13j458j414A200e55h1F9i1m67p19j217j666o21N64
14290d217J860b82A014M92o3m63p0a67j337l28P37a54l34D02k5j33K27N85j73
14271H83b17j409j750j016K94P04P26R41N35b07C3L58J21R7d86j63c10j3N2C9
14250a46p89m76r7O17A007K370K960K562K914Q04q32k746l868B083n57L33o3l86
14232A410C02a128j072p57M82i87b55b9B00K55a96j333j108L09e63A283R90J74
14214B447p32n01j51L91M76J1J09P2q65c03k18j7Lk51p35j52k02K90M84b81A072
14192A884L17q5J50J155K481J189l00k706j468E57a627j278j143n13j197n00m08
14175f666O12K388J207P9n9L94N58O23H3K81A37a040p31j028P43N82k93k69l77
$$ plain form
14156 -2413 -1252 -546 -470 -441 -481 -385 -662 -840 -884 -889 -1482 -2050 -2594 -3490 -4365 -3014 -1007 853 2049 2283
14136 2283 2099 1346 1481 1038 693 -802 -1565 -1171 -85 927 1548 2249 2412 2247 1374 253 -620 -1790 -2575
14117 -2575 -3131 -3612 -3772 -3945 -3887 -3769 -2472 -994 128 512 -4 -1103 -1934 -881 1862 3265 3046 1121 -776
14097 -2110 -909 -383 -173 -89 -565 -1351 -1942 -1049 883 2501 3037 2654 1022 -625 -1759 -392 1417 2325
14079 2325 2257 1293 -43 -1310 -2149 -1790 -1851 -1042 -485 -346 -28 -644 -1078 -1333 -1615 -1174 -192 1094 1937 2086
14059 2086 1618 919 587 137 398 1115 2293 3883 4851 3797 1602 -793 -2348 -3002 -2941 -2458 -2171 -3263
14041 -3263 -6378 -8349 -7752 -2714 -791 -689 -1161 -937 -2296 -3058 -3882 -3786 -1762 -206 950 1582 1768 1824
14023 1824 1778 1250 651 225 -678 -1230 -1380 -1166 -1088 -674 -14 1224 1731 2502 3751 3687 3930 2635 1840 1476
$$ packed form
14156b413J161e46P6K9m0R6k77j78m4nn93n68n44q96q75J351a007H53J196K34
14136B283j84p53J35m43l45h02p63L94h5I27O21P01J63j65q73B53f20j170p85
14117b575n56m81j60j73N8J18J297i94A28L84dj099q31h81A862J403k19A121g76
14097b110i09c83a73Q4m76p86n91Q93H83J618N36l83A022f25j134c92A417R08
14079B325o8r64d3j267q39L59o1Q09d85J39b8o16m34k55k82M41a92A094Q43J49
14059B086m68o99l32A37K61P17J178J590R68j054A602g93j555o54O1M83K87j092
14041c263l115j971N97b714g91J02m72K24j359p62q24R6a762b06I50O32J86N6
14023A824m6n28n99B25f78n52j50K14P8M14a4A224N07P71J249o4K43j295p95l64
$$ plain form
14003 1476 1406 1686 1725 1466 705 64 -548 -1447 -2398 -3332 -1345 1752 3635 5025 6533 7511 5740 6271
13985 6271 5173 3656 2716 2601 2624 2108 667 -1309 -2751 -863 2719 5799 7343 8249 7369 4905 1917
13967 273 -763 -1434 -1097 -181 -282 -380 -141 544 858 762 -840 -4137 -7786 -2433 -209 727 -334 -845 -2312
13948 -2312 -5297 -3591 -2611 -2833 -3804 -6494 -7527 -2801 1480 2087 1042 -440 -1349 -803 -1224 -2018 -73
13930 1715 2780 3008 2307 2995 -1689 -3655 -3419 -160 3046 5020 4041 1416 -1322 -3475 -1564 -740
13913 -1384 -2196 -2911 -2566 -1620 -686 114 1287 2894 3558 3038 1907 873 442 997 975 -136 -1647 -2832
13895 -2832 -3477 -3258 -4192 -3397 -3313 -2312 -1827 -873 -199 -232 -664 -1213 -1795 -1881 -1334 -970 -184 1036 1356 212
13874 -1626 -3207 -4028 -3667 -1237 2245 4804 5777 5233 2946 2007 1208 468 403 1373 2279 2111 1821 1025
$$ packed form
14003A476p0K80L9k59G05F4e48q99r51r34a345A752J883J390J508R78j771N31
13985F271j098j517r40j15K3n16F67a309j442h63B719L080J544R06q80k464A917
13967B73g63o71L37a81j01r8a41E44L14r6h40l297l649b433b09G27c34n11j467
13948b312k985J706R80k22r71k690j033b801A480O07A042d40r09N46m21p94g3
13930A715J065K28p01O88a689j966K36a60C046J974r79A416a322k153a564g40
13913a384q12p15L45R46f86A14J173J607O64n20j131H73m31N55k2a36j511j185
13895b832o45K19r34P95Q4J001M85h73a99l3m32n49n82q6N47L64a84A036L20B12
13874a626j581q21L61a237B245K559R73n44k287r39p99D68o5R70R06j68k90p96
$$ plain form
13856 1025 -66 -1080 -673 1451 2777 3547 3763 2722 1900 1656 2255 3746 5061 5047 4230 3050 1651
13839 1651 628 175 446 1467 3161 4908 6251 4036 1199 -1426 -735 1532 3374 3451 2940 6748
13823 6748 1071 -1518 -3025 -3858 -2758 -1992 -1582 -65 1695 3045 4591 5201 4932 3280 2071 -332 -1822
13806 -1822 -3964 -4208 -3580 -3190 -1835 -276 -334 -352 -563 -1665 -2648 -3195 -1273 -574 -1417 -3080 -4148 -3696
13788 -3696 -2697 -1547 -917 868 1459 925 201 -390 -388 79 1196 1776 1799 1291 636 204 529 883 1353 1245
13768 1245 823 135 -1623 -2920 -2559 -1376 -779 -83 424 824 114 -428 -1556 -2925 -2876 -2466 -1814 -1866 -1277
13749 -1277 -77 1692 1695 1024 -178 -852 -230 1007 931 607 -469 -917 1276 2739 3274 3354 2923 1412 111
13729 -1238 -2334 -1830 -2855 -3328 -2997 -1292 1551 2956 2986 1885 506 -753 -1924 -2506 -2277 -1713 -1966
$$ packed form
13856A025f6j014M07A451J326P70K16j041q22k44N99J491J315j4q17j180j399
13839A651F28A75K71J021J694J747J343k215A199a426O91A532J842P7n11L808
13823F748A071a518j507q33J100P66M10f5A695J350J546O10k69j652j209c32j490
13806a822k142k44O28L90J355b76n8j8k11j102r83n47a273e74q43j663j068M52
13788c696R99J150O30H68N91n34B01c90KG9J117N80K3n08F36B04L25L54M70j08
13768A245m22A35a623j297L61J183N97h3D24M00A14d28j128j369M9M10O52n2N89
13749a277g7A692Lo71a78o74b30A007p6l24d69m48A276J463N35Q0m31A412A11
13729a238j096N04j025m73L31a292A551J405L0j101E06g53j171n82K29N64k53
$$ plain form
13712 -1966 -1869 -2282 -2258 -1560 -1134 -646 -294 -112 42 300 -211 -496 19 1463 2799 3547 3570 3045 1483 78
13691 -1063 -870 -391 -325 -455 -1802 -2369 -2968 -3135 -3540 -3185 -2022 -1250 -904 -797 138 1111 1878 2301 2567
13672 2567 2517 2020 1978 1907 1946 2010 1512 224 -1458 -3204 -4473 -4099 -2186 942 3567 4219 3445 1983 565
13652 -651 -2153 -3327 -4323 -3235 -2095 -792 573 1946 3653 4047 5310 5299 4888 3964 2745 1398 859
13635 859 1547 2210 1303 -643 -2592 -3928 -4257 -3906 -2835 -2905 -2867 662 3824 6476 7336 5796 3810 1151
13616 -1015 -2293 -2407 -1144 -225 372 644 205 -192 -659 -1233 -1677 -2879 -2830 -835 1973 3110 3256 1890
13598 1890 206 -1459 -3172 -4200 -5342 -3236 -925 -22 201 576 706 596 556 -414 -144 1754 2429 2907
13580 2907 3475 4259 5237 5580 4029 1883 -1091 -4153 -6498 -3766 -540 1243 3489 5803 6121 6814
$$ packed form
13712a966R7m13K4O98M26M88b94a12D2K58b11k85A9J444J336P48K3n25A483G8
13691a063J93c91O6j30j347n67n99j67m05L55J163P72L46J07A38R73P67M23K66
13672B567n0m97m2p1L9O4m98B24a458j746j269L74J913I42K625O52p74j462E65
13652f51j502j174r96J088J140g92E73J373J707L94J263j1m11r24j219j347n39
13635H59O88O63r07f43j949j336l29L51J071p0L8F62L162K652Q60j540j986A151
13616a015j278j14a144b25C72K72B05a92m67n74m44j202M9h35A973J137J46j366
13598A890B06a459j713j028j142K106i25b2B01L75J30j10m0d14a44A754O75M78
13580B907N68P84R78L43j551A883a091l062k345K732e40A243K246K314L18O93
$$ plain form
13564 6814 3537 2144 746 -347 -997 -452 640 1621 1534 861 -304 -1576 -1558 -448 371 527 -991 -1226 -1884
13545 -1884 -1522 -38 2409 4148 3913 2635 2015 1702 2550 4432 6501 6984 5411 3393 1625 671 1050
13528 1050 1922 2206 1264 -340 -331 603 529 -462 -2307 -5122 -3884 -1932 -2551 -2868 -3468 -3847 -3081 -1756 -264
13508 1286 2501 1050 54 -1566 -2970 -3210 -3258 -3179 -2875 -301 684 -254 -2190 -3870 -4537 -2973 -1583 -837
13490 -837 -1374 -2741 -3603 -3996 -4139 -3737 -2811 -2455 -2397 -3197 -3175 -2203 -1028 -450 -34 746 2415 3068 3194 2413
13470 2413 1170 -48 -783 -835 -511 105 300 54 -584 -1756 -2525 -2773 -2935 -2479 -4123 -5452 -6259 -7891 -8544
13451 -8544 -4236 -3065 -1908 -1152 -1401 -1784 -862 -36 -276 -1707 -2885 -2457 -1293 -429 39 -484 -595 -23
13432 842 1376 2173 2646 3145 3296 2668 1762 269 -32 111 568 445 -475 -1757 -3116 -3275 -3068 -2633 -3257
$$ packed form
13564F814l277j393G46c47o50d52F40R81q7o73c04j272J8d48C71J56i91k35o58
13545a884L62c8B409J739k35j278o20l13Q48J882K069M83j573k018A625F71L79
13528A050Q72K84r42c40RF03p4d62j845k815J238a932o19l17o00l79P66J325b64
13508A286J215A050E4a566j404k40m8P9L04c01F84b54j936j680o67J564J390P46
13490h37n37j367q62l93j43M02R26L56N8q00K2R72a028d50c4G46J669O53J26p81
13470B413A170d8p35n2L24A05J95E4e84j172p69k48j62M56j644j329q07j632o53
13451h544d236J171J157P56k49l83h62c6k40j431j178M28J164d29C9d84j11b3
13432H42N34P97M73M99J51o28r06B69c2A11M57j23d75j282j359j59K07M35o24
$$ plain form
13413 -3257 -3338 -2487 -1443 83 1907 4023 5884 6807 7655 5966 1864 -158 -1714 -1042 1569 3919 6296
13396 6296 6898 4015 2378 1066 510 660 936 1766 2246 2399 1779 1172 1865 -1446 -1986 -2710 -2937 -2665
13378 -2665 -324 -10 -467 -273 240 638 1350 1553 2091 2875 4575 7451 8899 7557 4056 -1547 -2826
13361 -2826 -3533 -3457 -2434 -926 -301 548 1605 3196 4422 5959 5237 3618 1878 39 -1307 -2836 -4490
13344 -4490 -6388 -8928 -9423 -8624 -6068 -2659 -2729 -2449 -1222 -81 721 981 1230 1834 3182 3807 2846 1509
13326 1509 -21 -1617 -3061 -3803 -2699 -1012 26 534 805 1649 2092 1703 1010 544 268 262 491 659 705 934
13306 934 1361 1750 2139 2772 3040 2467 1672 668 -211 -941 -1371 -2020 -2767 -2687 -1638 -435 1184 2778 3968
13287 3968 4936 5807 5251 3568 2448 976 -386 -1846 -1142 1089 2039 2259 2021 1817 2201 2822 2342 2866
$$ packed form
13413c257q1Q51J044H3J824K116J861R23Q48j689A864a58j556O72A569K350K377
13396F296O02k883j637A066E10J50K76Q30M80J53o20o07O93a446n40p24k27K72
13378b665c24a0m57J94B40L98P12K03N38P84J700K876J448j342l501a547j279
13361b826p07P6J023i26c01E48J057J591J226J537p22j619j740C9a307j529j654
13344d490j898k540m95P99K556b659p0K80a222h1G21K60K49O04J348O25r61j337
13326A509b1j596j444p42J104a012B6N08K71Q44M43l89o93m66B68oK29J68M6K29
13306I34M27L89L89O33K68n73p95F68b11p30m30o49p47Q0J049d35A184J594J190
13287C968R68Q71n56j683j120I76c86j460P04A089R50K20k38k04L84O21m80N24
$$ plain form
13269 2866 2989 2317 972 -64 -1526 -2371 -3696 -4722 -3763 -2296 -425 1260 2073 851 -1185 -3152 -3614
13252 -3614 -2092 -943 -1276 -1017 -1425 -2006 -2382 -2615 -2140 -1232 232 1711 2559 1435 378 848 1945 3323
13234 3323 4562 4863 3999 2301 10 -2451 -4114 -4087 -3842 -2555 -1840 -1502 -1393 -642 -80 121 926 2005
13216 2005 2467 1633 377 -1466 -2646 -3006 -2960 -2968 -2674 -1978 -1270 -315 467 -84 507 1562 2266 1973 466 -766
13195 -665 -539 -273 100 -1068 -1949 -3008 -3361 -2432 88 665 -120 -1371 -2092 -1508 -84 656 -489 -2683 -2464
13176 -2464 376 1840 2138 1687 632 -759 -2441 -3231 -3393 -1611 -1165 -346 -557 -214 -93 678 1350 1359 790
13157 790 465 353 365 -9 -363 -27 690 1160 1975 2837 2955 2289 819 -900 -1910 -1621 -504 105 224 -23 -296
13136 -296 -926 -1378 -2391 -3409 -3889 -3637 -2712 -856 -480 -786 -71 634 964 557 -81 -1053 -1256 -1441 -1391 -1815
$$ packed form
13269B866J23o72I72f4j462q45j325j026R59J467d25A260Q13H51a185j967m62
13252c614J522i43l33K59m08n81l76k33M75R08B32J479Q48j124C78M70J097J378
13234C323J239L01q64j698A0b451j663K7K45J287P15L38J09f42h0A21Q05J079
13216B005M62q34C77a466j180l60M6qK94O96P08c15D67h4E07J055P04k93D66g66
13195f65J26K66A00a068q81j059l53R29H8N77a20j251p21N84h4F56d89k194K19
13176b464C76J464K98m51F32g59j682p90j62a611M46c46k11b14i3F78O72Rn69
13157G90l25j12J2il54b7F90M70Q15Q62J18o66H19i00j010K89e04A05J19b3k73
13136b96o30m52j013j018m80K52R25h56L76l06g1F34L30m07h1r72k03j85N0m24
$$ plain form
13116 -1815 -1833 -1541 -1482 -869 416 2060 3422 3908 3722 3218 2186 730 -149 642 1779 1725 844 -245 -1817
13097 -1817 -3253 -3912 -3149 -1804 -386 -176 -1965 -3157 -4486 -5521 -3473 -3611 -4789 -2930 -1164 169
13080 1049 659 -142 -587 -773 -860 -9 74 -937 -2560 -3559 -3276 -1696 -567 629 1814 3230 3826 2899 978
13060 -1073 -2755 -3449 -2822 -2284 -1287 -79 954 1166 955 449 53 143 767 1797 2459 2815 2836 2827 2689 2352 2004
13039 2004 1079 -61 -593 486 1250 1516 1526 1480 1574 1747 2646 3299 4077 3905 3533 3407 2315 681 -573 -1268
13019 -1268 -1503 -479 528 1608 2506 2914 2233 479 -2348 -4338 -2524 -2365 -2673 -3095 -3449 -4272 -5202 -6544
13001 -6544 -4912 -4521 -2900 -1830 -1086 -731 -3 598 1329 1545 1210 -162 -2078 -3781 -4226 -2932 -1232 -769
12983 -769 107 2536 3791 4330 5079 4262 2620 470 -1295 -786 770 1947 2270 1651 927 924 1434 2192 3085
$$ packed form
13116a815j8K92N9O13D16J644J362M86j86n04j032G30a49F42J137n4H44b45j572
13097a817j436o59P63J345c86a76j789j192j329j035K048j38j178J859a164A69
13080A049l90a42m45j86q7iG4i37j623r99K83J580e67F29J185J416N96r27I78
13060a073j682o94O27N38R97g9I54K12k11D49E3R0O24J030O62L56K1rj38l37l48
13039B004r25f1n32D86P64K66J0m6R4J73Q99O53P78j72l72j26j092F81e73o95
13019a268k35d79E28J080Q98M08o81D79b348j990J814J59l08m22l54q23r30j342
13001f544J632L91J621J070P44L55cE98P31K16l35a62j916j703m45J294a232M63
12983g69A07K429J255N39P49q17j642D70a295N09G70J177L23o19p24lN10P58Q93
$$ plain form
12964 3085 3809 4758 5740 6936 7569 7756 7714 6569 4790 5108 4791 3040 955 -1638 -3186 -4267 -3257
12947 -3257 -2876 -4065 -22040 -15845 -9280 -3534 -1027 -404 -957 -496 -380 -6 310 774 921 537 -927 -2874
12929 -2874 -4827 -7057 -4470 -675 781 1595 940 -149 -983 -1225 -345 849 1336 1104 652 -406 -1864 -2652
12911 -2652 -1997 -26 1605 2068 2389 2262 2613 3444 3302 2747 2169 1957 2446 2864 2484 846 -640 -991 -708
12892 -708 140 1269 1585 1028 312 -390 -881 -1667 -2142 -2534 -2295 -1319 315 2438 3509 2846 1178 -253
12873 -1767 -2953 -2530 -954 820 2173 2708 2481 1931 1894 1591 706 -126 -941 -1209 -1699 -1418 -908 -227 -678
12854 -678 -1704 -2945 -3727 -632 3416 6839 8834 9319 6541 1747 -1510 -2538 -46 169 -550 -1314 -2108
12837 -2108 -1915 -577 1559 2891 3019 2477 1351 -384 -2147 -2995 -4144 -4878 -4919 -3373 -1773 -852 -701
$$ packed form
12964C085P24R49R82J196O33J87m2j145j779L18l17j751I55a638j548j081J010
12947c257L81j189j7975O195O565c534a027d04n53M61J16fC10M64J47l84i27j947
12929b874j953k230K587f75G81Q14o55a49q34k42c45H49M87k32m52d06j458p88
12911b652O55b6A605M63L21j27L51Q31j42n55n78k12M89M18l80H46f40l51K83
12892g08A40J129L16n57C12c90m91p86m75l92K39R76C15K123J071o63A178b53
12873a767j186M23i54H20J353N35k27n50l7l03G06a26q15k68m90K81N10b27m51
12854f78j026j241p82f32C416L423J995M85k778A747a510j028d6A69e50p64p94
12837b108J93e77A559J332J28n42j126c84j763q48j149p34m1J546J600h52J51
$$ plain form
12820 -701 -2317 -2007 -2273 -3022 -3603 -3226 -1206 -172 -148 -1342 -3175 -3937 -2630 -1329 -530 -401 -435 -574
12802 -574 -425 54 437 136 -597 -1795 -3302 -2639 -3263 -4383 -4100 -2736 -2083 -2748 -4367 -7158 -7410 -7077
12784 -7077 -5909 -4366 -2593 -267 975 1917 3125 4140 4183 3730 2359 1478 392 -404 -844 -540 199 877
12766 877 1561 2050 2710 3701 3768 3223 2160 917 -350 -200 -1373 -2919 -3867 -4282 -4111 -1570 153 898 756
12747 756 1369 1540 2113 2244 2364 1784 1039 1390 2162 2659 2580 3998 501 -6 -2834 -3952 -2605 -232 1110
12727 963 383 248 -131 -38 624 1220 1839 2050 2177 2358 2174 1588 1348 1420 2372 3352 3434 3487 3584 4267 7054
12706 7054 9099 8784 6242 1888 -3778 -3891 -2608 -1079 606 1154 1537 2336 2673 2618 1850 663 -437 -621
12688 -621 -85 268 1039 1767 2404 3266 3782 3747 2713 718 -886 -2755 -1157 750 1530 1508 1201 494 -296 -980
$$ packed form
12820g01j616L10k66p49n81L77a206a72K4j194j833p62J307J301e30J29l4j39
12802e74J49E4L83A36e97j198j507O63o24j120K83J364O53o65j619k791k52L33
12784g077J168J543J773b67I75R42J208J015M3m53j371q81C92d04m40L04A99O78
12766H77O84M89O60R91O7n45j063I17c50J50j173j546r48m15J71a570A53P45j42
12747G56O13J71N73J31J20n80p45L51P72M97p9J418E01fk828j118J347b32A110
12727I63C83j35a31c8F24N96O19K11J27J81j84n86k40P2R52R80Q2N3R7O83K787
12706G054K045l15k542A888c778j13J283a079F06N48L83P99L37n5p68F63d37j84
12688f21h5B68P71P28O37Q62N16l5j034G18h86j869a157G50P80k2l07D94b96o84
$$ plain form
12668 -980 -1752 -710 2617 3129 642 -2275 -3337 -3356 -3450 -3219 -3236 -2609 -1301 -73 863 1435 1601 1173 -440 -1610
12648 -1610 -2634 -2772 -2656 -2118 -1621 -962 -184 480 740 822 605 246 100 963 1722 2694 3451 3629 3121
12629 3121 2385 1409 136 -1350 -2244 -2896 -3331 -2853 -2121 -2158 -1413 -1343 -1781 -2518 -3134 -2920 -2986 -2534 -2330 -2132
12609 -2132 -1877 -1709 -1747 -1243 -65 91 -192 -779 -1270 -1333 -839 -213 -380 -1108 -2335 -3177 -3471 -3928 -4865 -3613
12589 -3613 -692 1481 2511 2735 2877 1877 530 255 1440 1719 2617 1718 2581 3129 2858 1882 299 -1010
12570 -813 143 806 613 66 -374 -762 -1111 -860 223 843 415 121 -146 271 975 1299 1027 -189 -1342 -1776
12550 -1776 -1344 -639 -1226 -1628 -1698 -1077 -204 315 606 133 -371 -291 512 464 962 1907 1598 1604 1578 494 -765
12528 -1528 -1545 -1262 -1340 -1943 -1539 -562 -239 -402 -1121 -2140 -3185 -3516 -2872 -603 2133 3160 2873 2240 1577
$$ packed form
12668i80p72g10B617N12F42b275j062j9r4K31j7O27a301g3H63N72J66m28d40j170
12648a610j024j38J16N38M97O59a84D80K60Q2k17B46A00Q63P59R72P57J78n08
12629C121p36r76A36a350q94o52m35M78P32l7P45P0m38p37o16K14o6M52K04J98
12609b132K55J68l8N04f5I1a92n87m91o3M94b13j67p28j227q42k94m57r37J252
12589c613f92A481J030K24J42j000E30B55J185K79Q98q99Q63N48k71r76B99a010
12570h13A43O63j93F6c74l88l49K51B23O20D15A21a46B71P04L24k72a89j153m34
12550a776M32f39n87m02p0O21b04C15K91A33c71Q0E12m8M98R45l09Ok6D94g65
12528a528j7K83p8o03M04e62b39j63p19j019j045l31O44f03B133J027k87o33o63
$$ plain form
12509 1577 897 329 -146 -117 138 528 490 99 -472 -1348 -2371 -2653 -3776 -4319 -2632 -311 1383 2604 2581
12490 2581 1144 575 -1194 -2439 -2762 -2924 -2255 -7327 -6197 -1004 404 233 352 -361 -383 -637 -223 62
12471 614 1421 2487 3664 3793 2979 2242 1345 539 -256 -826 -1463 -2192 -2286 -1519 -775 -473 146 174 -222 -945
12451 -945 -1432 -2258 -2273 -2532 -2986 -4294 -4803 -6196 -6570 -3868 -1720 756 1494 1749 1194 46 -593 -908 -1396
12432 -1396 -1825 -2560 -3562 -3651 -2948 -1853 -979 -5 420 -1 403 731 1227 1906 2351 2885 3335 3519 3382 2561
12412 2561 2644 2499 2236 1559 364 -1054 -1417 -261 2103 4123 5315 4674 2751 831 -537 -610 -235 246
12393 79 -581 -1828 -2924 -3362 -1988 -228 904 1200 1235 1148 387 -194 -892 -1534 -2392 -3233 -1687 216 1652
12374 1652 2304 2075 296 -1447 -2700 915 2708 3405 3674 3546 2974 2308 1396 469 -826 -2339 -3052 -3650
$$ packed form
12509A577o80C29a46K9A38L90l8I9d72q76j023k82j123n43J687c11A383J221k3
12490B581A144n69a194j245l23j62O69n072J130a004D04j71J19c61k2k54b23F2
12471F14Q07J066J177J29q14p37q97E39b56n70o37p29r4P67P44L02A46K8b22p23
12451i45m87q26j5k59m54j308n09j393l74K702a720G56P38K55n55D6e93l15m88
12432a396m29p35j002q9P03J095Q74eD20aD03L28M96O79M45N34M50J84j37q21
12412B561Q3j45k63o77C64a054l63b61B103K020J192o41j923H31e37p3b35B46
12393G9e81j247j096m38J374b28I04K96L5q7C87a94o98o42q58q41J546B16J436
12374A652O52k29B96a447j253I15J793O97K69j28n72o66r12D69h26j513p13n98
$$ plain form
12356 -3650 -4501 -5417 -5952 -4378 -2870 -1305 -171 -72 -72 -339 -729 -1426 -2194 -2728 -2619 -1833 -456 580 2099
12337 2099 3848 6251 7412 7154 6850 5187 3601 1534 -647 -2662 -2986 -1867 -527 673 1837 2256
12321 2256 2237 1310 -271 -1591 -1312 -378 860 1651 2497 3640 4331 3955 2474 1049 -498 -1750 -3028 -3606
12303 -3606 -3735 -3606 -3336 -3231 -2148 -1456 -446 21 -1629 -3869 -6219 -7124 -2681 -2110 -2131 -1525 -1300 -861
12285 -861 -865 -1387 -1912 -3033 -4321 -6294 -7345 -4010 -881 1825 3446 3813 3036 1126 -1225 -570 -958
12268 -958 -1500 -2034 -2493 -2926 -3009 -2383 -1086 123 630 626 300 102 833 1168 2125 2277 1074 -93 -1488 -2431
12248 -2431 -2683 -1430 -737 -818 -1466 -1751 -678 223 786 914 171 -78 -25 712 946 1069 410 -47 -172 227
12227 1432 2178 2532 2187 1075 -667 -1743 -199 1994 3294 3165 2108 447 -1433 -1937 -2227 -2391 -3021
$$ packed form
12356c650q51r16n35J574J508a305a71g2%k67l90o97p68n34J09P86d56E80J519
12337B099J749K403J161k58l04j663j586A534f47k015l24J119e27F73J164M19
12321B256j9r27b71j320K79c78H60P91Q46J143O91l76j481A049d98j252j278n78
12303c606j29J29K70J05J083O92d46B1a629k240k350r05b681N71k1O06K25M39
12285h61mn22n25j121j288j973j051L335h81A825J621L67p77A126a225e70l88
12268i58n42n34m59m33q3O26a086A23N07mC00A02P31L35R57J52A074i3j395r43
12248b431k52J253O93q1o48k85f78B23N63J28A71g8b5G12K34J23D10d7j25B27
12227A432P46L54l45A075f67j076a99A994J300j29j057D47a433n04k90j64o30
$$ plain form
12210 -3021 -2875 -3272 -3435 -4428 -2100 -4735 -1809 -1514 -1680 -2206 -2853 -3870 -4521 -3333 -2400 -1279 -479
12192 -106 -37 -635 -935 -1694 -1458 -603 -661 -1133 -1998 -1979 -721 371 978 1004 593 -320 -911 -1909 -2768 -3229 -3298
12171 -3298 -2633 -1562 -763 -108 -373 -675 -186 1679 4217 5965 4953 3648 1952 366 -141 72 -364
12153 -1659 -3405 -1887 -154 1432 2329 2826 1962 332 -1106 -2144 -1332 1553 2898 2317 970 -637 -1786
12136 -1786 -2092 -1093 488 2175 3180 3589 3064 2736 2009 1777 2284 2449 2092 1683 891 -500 -2083 -1765
12118 -1765 -789 -156 850 914 1620 1894 1834 1989 2622 3258 3649 3719 6532 6998 4007 102 -2390 -3236 -2588
12099 -2588 -657 1236 516 -1009 -2547 -1640 -554 -189 -280 -1117 -1121 -1138 435 2003 3020 2973 2301 1166 1089
12080 1089 726 692 900 1044 1225 857 540 356 -110 9 331 443 455 523 208 -11 -380 -402 355 1216 2214 2618
$$ packed form
12210c021J46l97j63r93b100k635a809K95j66n26o47j017o51J188R33J121d79
12192a06c7n98l00p59K36f03n8m72q65J9g21C71O07K6m11c20n91r98q59m61o9
12171c298O65J071g63a08k65l02a86A679K538J748j012j305j696C66a41G2c64
12153a659j746J518a54A432Q97M97q64C32a106j038Q12A553J345n81I70f37j149
12136a786l06R99D88J687J005M09n25l28p27k32N07J65l57m09p92e00j583L18
12118a765g89a56H50O4P06K74o0J55O33O36L91P0K813M66k991A02b390q46O48
12099b588f57A236E16a009j538R07e54a89r1q37mj7D35J568J017m7o72j135p7
12080A089l63l4K08J44J81l68l17j84a10IL22J12J2O8B08a1l69k2C55Q61R98M04
$$ plain form
12058 2618 2115 1178 330 -325 -307 44 913 1842 1632 98 -1837 -2680 -2250 -1405 -1354 -1935 -1871 -619 722 1529 859
12037 859 930 101 -980 -1743 -1277 -1060 -1431 -1081 -1070 -1845 -2370 -2579 -1595 -522 277 1699 3430 5062 6298
12018 6298 6650 3861 2491 790 -320 -903 -486 169 697 1440 2084 2278 1284 260 373 -117 -951 -1302 -991
11999 -991 -417 -359 -908 -1813 -2436 -2092 -829 610 1923 2452 1856 761 -202 -1370 -861 -374 145 502 -696
11979 -2392 -2489 -562 695 2737 3819 4818 4357 3919 2633 1691 905 1046 1845 2891 3927 4457 3663 2195
11961 2195 430 -1059 -580 -8 -92 -906 -1905 -2955 -2329 -950 -541 -1432 -2603 -3333 -2046 732 2144 3043 3346
11942 3346 3252 2574 1938 1042 263 996 1191 422 -389 -1234 -1995 -2617 -1847 -742 536 1754 2928 5111 5164
11923 5164 3533 1921 1582 463 -491 -1433 -2377 -2525 -2514 -1888 -1451 -1582 -2720 -4186 -6007 -3954 -2216
$$ packed form
12058B618n03r37C30c25J8D4Q69R29k10I8a837q43M30Q45N1n81O4f19G22Q07o70
12037H59P1A01i80p63M66K17l71L50J1p75n25k09R84e22B77J422J731J632J236
12018F298L52k789j370G90c20n83M17A69N28P43O44J94r94B60J13a17q34l51L11
11999i91d17N8n49r05o23L44h29F10J313N29n96G61b02j168N09c74A45L57f96
11979b392r7e62F95K042J082R99m61m38j286r42p86J41P99J046J036N30p94j468
11961B195D30a059M79hq4q14r99j050O26i50M09q91j171p30J287G32J412Q99L03
11942C346r4o78o36q96B63P33J95D22c89q45p61o22P70g42E36J218J174K183N3
11923E164j631j612l39D63d91r42r44j48J1O26M37j31j138j466j821K053J738
$$ plain form
11906 -2216 -1141 -952 -183 1516 3356 5563 6213 7180 2925 1481 751 1181 1705 2116 2523 3353 4027
11889 4027 3846 1843 1839 3343 -296 -1016 -1549 -1705 -1878 470 2002 2711 2661 2274 1851 1095 415 -104 -128 -1412
11869 -1412 -3413 -3406 -1987 -704 567 650 109 -568 -1830 -3363 -5725 -2471 -2056 110 1884 2648 3155 4167
11851 4167 5733 9208 10632 11197 9155 4564 -3216 -6350 -2818 1447 2678 1511 -1001 -3194 -3692
11836 -3692 -2060 -15 1257 1378 1370 2263 3696 5070 5088 4237 3350 2446 1542 1149 951 1112 2004 3324 3831
11817 3831 4140 4338 4359 4361 3632 2455 165 -1654 -2740 -2646 -2088 -2120 -2536 -3415 -3925 -2309 -1386 -840 -2254
11798 -2254 -2442 -2363 -2247 -3163 -4516 -5241 -6724 -5798 -3102 -2041 -1724 -1118 -1208 -1214 -463 -178 -61 -959 -469 -1120
11778 -1120 -1322 -1393 -1125 -221 697 914 883 92 -676 -932 135 1347 1930 1785 1568 888 350 -25 -337 -491
$$ packed form
11906b216J075J89a83A516J840K207O50R67B925j444p30M30N24M11M07Q30O74
11889D027j81A843mJ504b96p20n33j56j73D70J532P09n0l87m23p56D15a04k4j284
11869a412k001PJ419g04E67Q3A09e68j262j533k362b471M15A10J774P64N07J012
11851D167J566L475J424N65k042D564c216l134b818A447J231j167a001k193m98
11836c692J632a5A257J21qQ93J433J374J8q51q87r04r04l93j98J61Q92J320N07
11817C831L09J98K1Kp29j177A65a654j086R4N58l2m16q79n10J616R23N46j414
11798b254j88P9J16r16j353p25j483R26K696J061L17O06r0od63a78f1q98d69o51
11778a120k02p1K68b21F97K17l1I2f76k56A35J212N83j45k17o80C50b5l12j54
$$ plain form
11758 -491 -1409 -2061 -3567 -2710 185 1612 4713 6062 8023 4055 2582 1613 2563 5563 8661 3874
11741 1525 -782 -1545 649 4375 9075 11052 13234 13887 14355 11912 8967 5889 -3077 -9265 -10854 -7698
11725 -7698 -2214 471 1396 923 -392 -1632 -2408 -2549 -2982 -3596 -2886 -2727 -2451 -2571 -2537 -2095 -1076 -364 -107
11705 469 1501 2658 3811 4434 4369 4316 3070 1089 -879 2418 4950 6923 7657 9104 8358 9011 6957
11688 6957 4752 3860 3493 1886 197 -453 785 1761 1512 75 -1560 -2345 -1874 -1003 -168 624 118 -433 -1141
11669 -1141 -1086 -674 -34 344 793 1184 1538 907 426 -60 -1665 -2291 -3097 -3713 -2633 -1744 -1020 -681 -788 -817
11649 -817 -689 -129 334 57 -157 256 973 2004 2805 3340 3398 3000 2228 1457 727 -101 -1180 -2199 -1322
11630 -1322 -691 -516 -585 -1670 -2670 -3499 -3824 -4536 -6762 -7916 -4710 -2909 -294 1383 2072 2641 2732 2829
$$ packed form
11758d91r18o52j506Q57A85J427L101J349J961l968j473r69R50L000L098C874
11741A525g82p63F49L726M700J977K182O53M68k443k945l078c077o188j589L156
11725g698b214D71R25m73c92j240p76j41m33o14P10J59K76j20L4M42J019c64a07
11705D69J032J157J153O23o5n3j246A089h79B418K532J973P34J447p46O53k054
11688F957k205q92l67j607A97d53G85R76k49G5a560p85M71Q71a68F24A18d33p08
11669a141N5M12c4C44M49L91L54o31D26f0j605o26q06o16J080Q89P24L39j07k9
11649h17J28a29C34E7a57B56P17J031Q01N35N8l98p72p71G27a01j079j019Q77
11630a322O31J75o9j085j000q29l25p12k226j154L206J801b94A383O89N69R1R7
$$ plain form
11612 2829 2345 1576 733 -704 -1644 -1714 -2204 -1758 -2065 -1980 -2140 -2148 -1730 -1225 -1192 -1668 -2728 -4655 -4583 -4681 -3418
11591 -3418 -1112 226 1377 2273 1427 250 -88 -466 -807 -830 -391 345 1459 2563 3299 3248 2198 546 -402
11571 -1211 -1788 -887 1662 3230 3844 3548 2734 283 -1770 -3154 -5067 -2794 -2621 -1414 -3920 -2837
11555 -2837 -2752 -1874 -1071 -1242 -3290 -3559 -2129 -1144 -237 -31 -510 -1100 -2002 -2855 -3452 -3123 -4099 -5553 -8126
11536 -8126 -6609 -4609 -2604 -945 193 -233 -1068 -2185 -2042 632 3247 4143 3652 2627 2851 3201 3353
11519 3353 4260 4185 3320 1707 356 -143 372 1232 1670 2039 2120 1744 865 -193 -1329 -2537 -3400 -3192 -1238
11499 448 1738 1529 -294 -1879 60 2494 2492 1711 252 -618 -1480 -2497 -3501 -877 2212 3892 4463 3964
11481 3964 2206 -479 -3057 -2494 -988 155 1188 1640 2000 1640 1495 1594 1316 461 -303 -1890 -3062 -2656
$$ packed form
11612B829m84p69G33g04r40p0m90M46l07Q5j60qM18N05L3m76j060j927P2r8J263
11591c418a112B26J151Q96q46B50h8l78l41k3c91C45J114J104P36n1j050E46d02
11571a211n77h87A662J568O14k96q14B83a770j384j913K273J73J207k506J083
11555b837Q5Q78Q03j71k048k69J430R85b37c1m79n90r02q53n97L29r76j454k573
11536h126J517K000K005i45A93b33q35j117J43F32K615Q96m91j025K24L50J52
11519C353R07p5q65j613C56a43C72Q60M38L69Q1l76H65a93j136j208q63K08a238
11499D48J290k09b94j585F0K434kp81B52f18q62j017j004h77B212J680N71m99
11481C964j758d79k578N63i88A55J033M52L60l60j45R9k78D61c03j587j172M06
$$ plain form
11463 -2656 -2107 334 2518 6282 6098 6506 3391 -1355 -1771 -1391 -822 -804 -308 513 1369 860 -286 -2349
11445 -2349 -3542 -1126 -148 -354 -643 -176 1530 2809 2079 882 311 335 -152 -625 -278 476 1171 2038
11427 2038 3084 3921 4335 4695 4065 4130 4019 3998 3729 3610 4317 5410 5564 4935 2487 -666 -3897 -5011
11409 -5011 -963 1563 2597 2159 465 -1967 -3993 -4959 -4056 -3231 -2508 -1120 -282 153 -4 -1092 -1811 -2121
11391 -2121 -1137 -220 -1370 -4256 -3813 -2763 -2161 -1507 -1567 -2209 -2982 -2462 701 2723 2713 645 -226 -1811
11373 -1811 -1405 -1660 -1148 -1225 -1754 -2105 -2397 -831 1450 2538 2212 1409 869 645 540 908 1866 2599 2701
11354 2701 2234 1590 1090 1223 1726 2180 2853 3433 4144 5109 6475 7277 8431 8667 4720 1965 -270 -1712
11336 -1712 -2340 -1557 676 1750 2184 1695 578 458 1711 956 -397 -1465 -1970 -2612 -2483 -2066 -1338 -487
$$ packed form
11463b656N49C34K184L764j84M08l115a355m16L80N69J8c08E13Q56n09b86k063
11445b349j193a126a48k06k89a76A530J279p30H82C11K4a52m73b78D76O95Q67
11427B038J046Q37M14L60o30O5j11k1k69j19P07J093J54o29k448f66l231j114
11409e011i63A563J034m38D65a967k026r66R03Q25P23a120b82A53dj088p19l10
11391b121R84b20j150k886M43J050O02O54o0o42p73N20G01K022j0F45b26j585
11373a811M06k55N12p7n29l51k92h31A450J088l26q03n40k24j05L68R58P33J02
11354B701m67o44n00J33N03M54O73N80P11R65J366Q02J154K36l947A965b70j442
11336a712o28P83F76J074M34m89E78j20J253p55c97j068n05o42J29M17P28d87
$$ plain form
11317 -1 388 1549 2259 1727 645 -973 -2777 -2440 -2020 -1229 -922 -649 -141 -334 184 21 -665 -1194 -1548 -1904
11297 -1904 -1973 -1728 2 -54 550 -143 -2239 -4522 -4908 -2464 75 2148 2941 2253 579 -1111 -2093 -1641 -183
11277 1900 3427 3172 1894 477 325 -1572 -4514 -6320 -1946 1181 1943 878 153 -1230 -2289 -1065
11260 2422 4039 3492 2516 1580 1289 1607 2050 2005 1648 1040 1276 1789 2127 1804 1489 982 441 154 343
11241 343 1154 2209 2601 1895 203 -1823 -2379 -145 2037 2787 1751 -197 -2909 -128 2611 4091 4394
11224 4394 2882 1399 -180 -1265 -1660 299 1219 780 920 718 685 741 639 186 -790 -2092 -3763 -5336
11206 -5336 -4604 -2564 -766 351 607 1151 672 -34 -666 -1171 -1434 -1803 -2086 -3390 -6463 -6417 -3438 -695 1384
11186 2216 364 -1527 -1975 -1378 -337 527 822 865 416 -300 -344 -379 -316 -93 -389 -1088 -1415 -2025 -3240 -4356
$$ packed form
11317aC88J161P10n32F45i73j804L37M20P91L07K73a41j93A84B1f65n29l54l56
11297a904o9K45Be4E50a43k096k283l86K444G5K073P93o88E79a111r82M52a83
11277A900J527k55j278D77j52a572k942j806a946A181P62H78A53a230j059a065
11260B422J617n47r76r36k91L18M43m5l57o08K36N13L38l23l15n07D41A54J89
11241C43Q11J055L92p06B03a823n56a45B037P50j036a97k712a28B611J480L03
11224D394j512A399a80j085l95B99R20m39J40k02l3N6j02A86g90j302j671j573
11206e336P32K040g66C51K56N44m79c4o32n05k63l69k83j304l073M6K979f95A384
11186B216C64a527m48N97c37E27K95M3D16c00m4l5O3i3k96o99l27o10j215j116
$$ plain form
11166 -4356 -5179 -4119 -1992 368 1868 2464 1055 -1230 -3260 -4553 -5038 -4423 -3597 -3275 -2965 -2729 -1863
11149 -1863 -370 1099 982 -423 -1854 -3392 -4814 -6489 -3870 -1558 -644 -772 -502 -1341 -2022 -2971 -2370
11132 -2370 -1760 -1520 -1505 -1422 -700 604 1938 2645 1559 -342 -1997 -3782 -1049 -1082 -1577 -2518 -2936 -3760 -2326
11113 -2326 -653 988 2021 1879 1335 382 -348 -423 -351 -242 -6 417 1418 2801 3542 3114 1732 -67 -1807
11094 -1807 -3597 -3162 -2133 -1158 -1206 -1429 -2010 -2630 -3961 -4160 -4359 -4486 -3557 -1872 287 2668 4054 4562
11076 4562 3967 2562 985 -716 -319 685 728 -185 -992 -1179 -90 955 1311 790 -455 -618 1067 3286 5016
11057 5016 5434 5214 4617 3451 1710 1470 2121 3527 5051 5523 5181 5035 4463 3616 2751 2048 1982 2446
11039 2446 2779 2547 1042 -892 -2421 -1382 1642 3609 2806 1070 -873 -2059 -1634 -1099 -868 -1034 -1222
$$ packed form
11166d356q23J060a992C68J500N96A055a230k030j293m85O15Q26L22L10K36Q66
11149a863c70A099j17d23j431j538j422j675K619a558f44j28K70q39o81r49O01
11132b370O10K40J5Q3g00F04J334P07j086c42j655j785a049l3m95r41m18q24J434
11113b326f53I88J033j42n44C82c48p5P2J09fD17J001J383P41m28j382f7j740
11094a807j790M35J029R75m8k23n81o20j331j99j99j27R29J685B87K381J386N08
11076D562n95j405I85g16c19F85M3a85q07j87i0I55L56n21d55j63A067K219J730
11057E016M18k20n97j166A710k40O51J406J524M72l42j46n72q47q65p03o6M64
11039B446L33k32A042h92j529J039A642J967q03A070h73j186M25N35K31j66j88
$$ plain form
11022 -1222 -2021 -2384 -1176 -653 -1188 -2376 -4291 -4789 -3655 -2135 -1143 -1044 -726 -1020 -182 1879 3700
11005 3700 4715 5071 3617 2813 2319 2445 2056 1219 415 1410 1815 1515 772 -546 -645 -1046 -556 -180 -156
10986 -156 306 1362 -851 -4183 -3559 -2598 -1575 -565 -213 -913 -1573 -1486 -1708 -1954 -2365 -2813 -316 1292 2470
10967 2470 2601 1333 -525 -1852 -2542 -2386 -1617 -220 489 16 -1484 -1983 -1607 -1092 415 1674 3192 4301
10949 4301 4879 5008 3854 2017 -416 -2709 -4771 -5769 -2832 -1059 -853 -1802 -2651 -2738 -2841 -2792 -2712 -2659 -3173
10930 -3173 -3456 -3253 -2408 -883 1146 2903 2655 8 -2831 -2660 -1496 -1032 -677 -323 -142 -137 -337 -844 -796 -411
10910 -411 350 854 1483 1925 2873 3703 4307 4373 3596 2160 483 -611 -384 802 1301 1523 585 263 -1289
10890 -1955 -383 1290 1838 1428 -10 -2443 -2004 -1217 -1366 -645 -574 -935 -339 -961 -83 463 170 -294 537 1768
$$ packed form
11022a222p99l63a176N23n35j188j915m98J134J520R92R9L18k94a82A879J821
11005C700J015L56j454q04m94J26l89q37D15R95M05l00p43e46r9m01M90a80K4
10986a56C06J056h51l332O24R61J023e65b13p00o60Q7k22k46m11m48c16A292J178
10967B470J31j268e25j327o90J56P69b20D89A6a484m99L76N15D15J259J518J109
10949D301N78J29j154j837d16k293k062r98b832a059K06r49q49q7j03M9Q0N3n14
10930c173k83K03Q45h83A146J757k48Hb831J71J164M64L55c23a42Nk00n07M8L85
10910d11C50N04O29M42R48Q30O04O6p77j436D83f11K27H02M99K22E85B63a289
10890a955c83A290N48m10a0k433M39P87j49f45P1l61c39o22h3D63A70b94E37J231
$$ plain form
10870 1768 2000 1976 1269 -514 -2174 -3474 -3984 -3624 -3358 -2880 -2557 -2341 -2035 -1830 -807 34 1183 1871 1785
10851 1785 1023 414 64 -9 -383 -1669 -2552 -3233 -2624 -1280 -77 -552 237 -33 -1540 -2646 -3228 -3316 -2409 -1385
10831 -1385 -469 -601 944 204 363 56 -409 1525 1505 2472 2571 1782 254 -1059 -2069 -2404 -1030 736 2679
10812 2679 5199 6993 8058 6971 4717 400 -2255 -4604 -3564 -1486 -395 1 -513 -1055 -759 288 573
10795 573 752 1647 2972 3692 4668 4830 5605 2390 1000 -469 -1482 -1764 -1366 271 826 473 331 713
10777 713 1023 1299 1074 -21 -1290 -53 1384 2014 1633 505 -873 -1328 -1086 -927 -465 1112 2129 3162 4478
10758 4478 5465 9170 10196 10306 8349 6282 3330 148 -910 -165 1375 2437 2726 1930 1222 1075 456
10740 -300 -532 -1010 -1260 -1078 -1093 -868 -986 -972 -601 566 1250 1265 533 -508 -1642 -2103 -1404 211 1985 3106
$$ packed form
10870A768K32k4p07e14j660j300n10L60K66M78L23K16L06K05h07C4J149O88q6
10851A785p62D14F4il74j286q83o81O09a280g7m75B37c3j507j106n82q8R07J024
10831a385d69j32I44B04J59E6d09A525k0R67R9p89B54a059j010l35a030G36J943
10812B679K520J794J065j087k254D00b255k349J040a486c95Ae13n42K96B88K85
10795E73J79Q95J325P20R76J62P75B390A000d69j013k82L98B71N55l53j42L82
10777G13L10K76k25b1j269e3A384O30l81E05h73m55K42J59M62A112J017J033J316
10758D478R87L705J026J10j957k067k952A48i10a65A375J062K89p96p08j47D56
10740c00k32m78k50J82j5K25j18J4L71E66O84J5E33e08j134m61O99B11J774J121
$$ plain form
10720 3106 3056 1142 -883 -2111 -1903 -924 -240 1172 2069 1651 1044 716 379 -164 -806 -1333 -1755 -2504 -2013
10701 -2013 -3760 -4310 -4767 -4306 -3435 -1701 -95 3 -449 -1446 -2050 -3491 -4292 -3185 -2023 18 1689 3212
10683 3212 3534 3176 1808 -272 -627 -318 -209 -173 530 873 187 -1051 -2436 -3124 -3285 -1753 153 2483
10665 2483 2952 2479 369 -1000 -1491 278 899 826 -1266 -1553 -2235 -2401 -2246 -2913 -3105 -2998 -3473 -4375 -4387
10646 -4387 -2599 -1540 -876 -614 -740 -1627 -2842 -3932 -4760 -4787 -4309 -3950 -3967 -2585 -475 2018 3199 2658
10628 2658 947 -967 -2470 -3123 -2859 -1867 -445 807 1685 2087 2369 3017 3386 2225 250 -1054 -1360 -443
10609 691 1582 2075 2564 2495 2535 2687 2987 3407 3457 4832 4887 3902 1661 -977 -3195 -5858 -6226 -3558 -2237
10590 -2237 -1564 -1178 -1342 -916 353 1866 2320 1040 381 -7 -56 199 698 742 222 -194 -727 -1258 -1826 -2651
$$ packed form
10720C106n0A142h83j228K08i24b40A172Q97m18o07l28l37a64o42n27m22p49M91
10701b013j747n50m57M61Q71a701i5Cd49r97o04j441q01J107J162A8J671J523
10683C212L22l58j368b72l55L09J09L6E30L43A87a051j385o88j61J532A53K330
10665B483M69m73C69a000m91B78O21p3a266k87o82j66J55o67j92J07m75r02j2
10646d387J788J059O64K62j26q87j215j090q28k7M78L59j7J382d75B018J181n41
10628B658I47i67j503o53K64R92d45H07Q78M02K82O48L69j161B50a054l06d43
10609F91Q91M93M89o9M0J52L00M20N0J375N5r85A661i77k218k663l68K668J321
10590b237O73L86j64M26C53J513M54A040C81gm9A99M99M4B22a94n33n31n68q25
$$ plain form
10570 -2651 -3792 -5099 -5296 -2884 -1697 -1352 -2046 -2799 -3806 -4204 -4067 -1714 354 1401 1024 -22 -1602
10553 -1602 -2632 -2215 -588 349 87 -721 -1798 -2509 -2779 -1670 -95 927 1566 3226 4210 5505 6026 5727
10535 5727 5333 4893 4319 3237 2696 3444 3560 2614 830 -873 -2387 -457 1003 1855 2203 1689 1558 838
10517 838 310 88 -146 -674 -504 -471 -558 58 2109 4413 6128 6683 5994 5368 3579 1879 -1284 -3963 -513
10497 1723 2203 2336 2063 1429 271 -897 -1808 -2332 -202 676 1306 1483 1289 1299 1487 2114 3365 4196 4340
10478 4340 2932 1331 228 -426 -1129 -1299 -1711 -2810 -4054 -5027 -5225 -4367 -2800 -1381 -650 -507 133
10460 882 2007 3151 4021 3772 2821 1755 1531 1361 544 -789 -1114 -1600 -1633 -1398 -1354 -1979 -1041 83 1998
10441 1998 3147 4725 9301 8601 4456 2306 17 -2650 -4355 -917 2426 4998 6769 8291 9084 5643
$$ packed form
10570b651j141j307j97K412J187L45o94p53j007l98J37a714C54J047l77b2j580
10553a602j030M17e88C49H7g21j077p11k70J109i5I27O39J660R84J295N21k99
10535E727l94m40n74j082n41P48J16r46H30h73j514d57A003Q52L48n14j31p20
10517H38C10H8a46n28J70L3q7E8K051K304J715N55o89o26j789j700a284k679e13
10497A723M80J33k73o34B71h97r11n24b02F76O30J77j94J0J88O27J251Q31J44
10478D340j408A331B28d26p03j70m12j099j244r73j98Q58J567a381f50J43A33
10460H82J125J144Q70k49r51j066k24j70E44g89l25m86l3K35M4o25R38H3J915
10441A998J149J578M576p00m145k150A7b650j705i17B426K572J771J522P93l441
$$ plain form
10425 5643 4435 3438 2180 826 -613 -2532 -4272 -4312 -2649 -770 563 1762 1876 1757 1076 1286 1488 1518
10407 1518 1526 1289 1142 1189 1008 137 -1422 -3083 -4456 -5948 -9683 -3735 -2292 -532 1611 2579 2263 750
10388 -1432 -4108 -2907 -2056 -1533 -1387 -1390 -1378 -1310 -1572 -2696 -3717 -4160 -4284 -3579 -3003 -1282 -1212 -532 -1358
10369 -1358 -506 1893 4121 5729 6250 3534 1957 1423 2207 1998 772 -716 -2344 -3421 -2672 -1322 282
10351 1548 1906 905 -1192 -3141 -837 2474 4310 4599 3101 969 66 -163 -244 110 230 -41 -395 -791 -1266
10332 -1266 -1335 -2405 -3020 -2428 -1759 259 1244 1567 1277 1151 529 -277 -878 -1452 -1776 -1915 -1343 -783 -428
10313 -428 -850 -1073 -1168 -1288 -716 953 2326 2371 3457 3991 3273 832 -1937 -2664 -4533 -4290 -2588 -1259
10294 -311 491 543 392 460 1476 1815 863 -1015 -3165 -5159 -5717 -4947 -4692 -2682 -1197 -591 -784 -282
$$ packed form
10425E643j208r97j258H26f13j919j740m0J663g70E63J199J14j19o81K10K02L0
10407A518Qk37j47M7j81A37a422j661j373j492l735c735J443e32A611R68l16G50
10388a432k676J201Q51N23J46lJ2O8k62j124j021m43j24P05N76a282P0e32q26
10369a358e06A893K228J608N21k716j577n34P84k09G72g16j628j077P49a322B82
10351A548L58I05a192j949h37B474J836K89j498I69F6a63q1A10J20d1l54l96m75
10332a266o9j070o15N92O69B59R85L23k90j26E29b77o01n74l24j39N72N60L55
10313d28m22k23r5j20N72I53J373M5J086N34p18H32a937p27j869K43J702a259
10294c11D91N2j51O8J016L39H63a015k150j994n58P70K55K010a197e91j93b82
$$ plain form
10275 193 445 523 -775 -2712 -3939 -4488 -3598 -1990 -111 641 1186 1357 742 682 300 342 192 -376 -2031
10256 -2031 -3257 -2465 -1961 -2043 -2417 -2901 -4525 -4250 -1861 0 1262 1262 683 62 -1807 -4594 -7175 -4457 -2799
10237 -2799 561 1666 2125 1046 -1094 -1525 1307 2586 1581 -764 -3278 -4093 -1094 1582 2932 2540
10221 2540 1453 -215 -496 139 166 756 1231 1170 874 767 514 -232 -848 -1407 -2210 -2197 -1052 -198 140 -599
10200 -1660 -1908 -1841 -1534 -862 1071 1833 751 -729 -2115 -2266 -1010 284 1266 764 -1212 -3395 -4688 -3136
10182 -3136 -749 1372 1988 2839 3343 3247 2375 1013 -132 77 929 1658 1810 1967 1433 1693 -213 -1831 -2767
10163 -2767 -2328 -1914 -2739 -7820 -4270 -5754 -4111 -3017 -1398 -1210 -1116 -1291 -1567 -1562 -1644 -2258 -2652 -2629 -2000
10144 -2000 -976 518 1732 2509 2581 2176 743 -991 -2545 -3261 -1966 210 1655 2256 1907 1220 67 -39 -389
$$ packed form
10275A93K52P8g75j937j227n49Q90J608a11F41N45J71o15o0C00M2j50c76j655
10256b031j226P92N04q2l74m84j624K75a861@A262%n79F2a807k787k581K718J658
10237b799E61J105M59A046a094m31A307J279j005g64k514q15a094A582J350l92
10221B540j087b15k81A39K7N90M75o1k96j07k53b32o16n59q03J3a052a98A40e99
10200a660k48O7L07O72A071P62G51g29j386j51a010B84R82n02a212k183j293J552
10182c136g49A372O16Q51N04r6q72A013a32G7Q52P29J52J57n34K60b13j618r36
10163b767M39M14q25n081L550j484J643J094a398J88R4j75k76Nq2o14l94K3O29
10144b000i76E18J214P77P2m05G43i91j554p16J295B10J445O01l49o87F7c9l50
$$ plain form
10125 -389 -367 -694 -533 -832 -1295 -1753 -2367 -2836 -2295 101 2334 2590 1275 -320 -1164 -1083 -1635 -2419 -2338 -305
10104 885 1181 1121 523 701 1986 3235 3495 3189 2352 1783 2288 3904 5562 6378 6732 6611 5597 4663
10086 4663 3302 1944 1427 766 -169 -482 63 419 172 -1034 -2010 -2050 -1668 -864 -147 380 481 263 -1155
10066 -2228 -2223 -1354 -615 -912 -2267 -2941 -2356 -486 808 1422 1684 2181 1835 835 -59 -84 920 2352 3918 4389
10046 4389 3825 3506 2237 1100 -189 -1155 -2203 -3111 -3005 -1887 -199 -263 -623 -1143 -1931 -777 784 520
10028 520 -2473 -4196 -4889 -6814 -6563 -8811 -7630 -6008 -4855 -4417 -3609 -2771 -853 -256 -217 -450 -682 -965
10010 -965 -2005 -1909 -2272 -3666 -4889 -6000 -7133 -6711 -4073 -6029 -5261 -328 2069 4119 4302 2444 1237
9993 1237 520 1649 -4189 -5838 -7641 -9824 -10171 -2342 -1906 -1991 -1053 -1140 -1641 -371 1096 2504 3152 3265
$$ packed form
10125c89K2l27J61k99m63m58o14m69N41A01K233K56A275c20q44Q1n52p84Q1c05
10104H85K96o0E23J78J285J249K60l06q37n69N05J616J658Q16L54j21j014r34
10086D663j361j358n17o61a69l13F3L56A72a034r76m0L82Q04a47C80J01k18a155
10066b228NQ69f15k97j355o74N85d86H08O14K62M97l46H35e9k5I20J432J566M71
10046D389n64l19j269A100a89r66j048r08J06J118a99o4l60n20p88g77G84k64
10028E20b473j723o93j925K51k248J181J622J153M38Q08Q38h53b56L9k33k32k83
10010i65j040R6l63j394j223j111j133M22K638j956P68c28B069K050J83j858j207
9993A237E20J129d189j649j803k183l47b342M36q5R38q7n01c71A096J408O48J13
$$ plain form
9975 3265 3096 2505 1027 -822 -3478 -5306 -4787 -3714 -3021 -2549 -1723 -972 -81 815 1130 554 -406 -1680
9957 -1680 -2545 -2058 -871 -486 -846 -413 54 -247 -1369 -2254 -235 2455 5789 9364 10607 9810 7756 1613
9938 1756 1503 1039 697 584 353 992 1599 2441 3574 3912 8334 4069 2753 816 -1377 -3371 -5154
9921 -5154 -6037 -6484 -4574 -2621 -375 1463 7027 8573 6762 2859 519 789 2143 3711 4650 4805 3898
9904 3898 2840 1181 -133 -193 76 866 1578 2421 2879 2909 3198 3587 3842 3334 2738 1467 140 -784 78 2036
9884 2036 3489 3225 1859 148 -1512 -2935 -3521 -2920 -1584 569 2693 4419 4630 4103 2937 1895 1408
9867 1408 893 542 -1104 -579 -991 -1109 -956 265 1548 1844 1491 1721 2658 2992 1709 138 -767 -307 96
9847 -23 -1540 -1730 -803 509 2103 3613 4357 3773 1791 95 -939 -786 -316 -508 -293 -716 -1007 -872 -729
$$ packed form
9975C265j69n91A027h22k656j828N19J073O93M72Q26P51h1H15L15E54d06j274
9957a680q65M87h71L85l60d13E4b47j122q85b35B455L334L575J243p97k054A613
9938A756k53m64l42j13k31O39O07Q42J133L38M422D069j316H16a377j994j783
9921e154q83m47J910J953c75A463N564J546j811B859E19K70J354J568R39J55r07
9904C898j058A181a33o0G6P90P12Q43M58L0K89L89K55n08n96j271A40g84G8J958
9884B036J453k64j366A48a512j423n86O01J336E69K124J726K11n27j166j042m87
9867A408n15l51a104N25m12j18J53B65J283K96l53K30R37L34j283A38g67c07I6
9847b3j517j90h03E09J594J510P44n84A791I5i39J53c16j92K15m23k91J35J43
$$ plain form
9828 -729 -660 -878 -2000 -2907 -4107 -5615 -4084 -1386 877 2508 2990 2490 1127 641 1305 2666 4326
9811 4326 6801 9413 11072 10580 8755 4876 2337 -443 -3461 -5911 -7091 -6136 -4471 -4571 -3755 -2192
9795 -2192 14 1452 172 -2002 -3183 -4133 -4643 -4732 -3250 -79 2656 3195 2796 2235 1320 332 -966 -2670 -2023
9776 -2023 532 813 -109 -1435 -4269 -3717 -1752 -1728 437 565 185 -1483 -2877 -3748 -3394 -2271 -569 169
9757 400 742 210 -845 -3010 -4467 -1118 1500 2962 3166 1964 -368 -3313 -5639 -2882 -575 1033 2174
9740 2174 2617 2495 1853 1277 1273 1368 1267 1494 1751 1211 1049 -83 137 1479 2994 3211 2542 883 -1206 -1831
9720 -1831 -407 1668 2031 335 -2081 -4057 -2871 -2398 -3250 -4709 -5717 -5402 -3239 -1207 -334 173 -634
9702 -941 -301 133 413 242 545 1543 2297 1806 918 -3 -356 -1144 -1204 -1758 -2962 -3434 -4056 -4190 -3861 -2994 -2235
$$ packed form
9828g29O9k18j122r07j200j508J531a386H77J631M82n00A127m86O64J361J660
9811D326K475K612J659m92j825l879B337d43l018k450j180R55J665j00Q16J563
9795b192A4J438A72b002j181r50n10q9J482g9B656N39l99n61r15C32i66j704O47
9776b023E32K81a09j326k834N52a752K4D37J28A85a483j394q71L54J123e69A69
9757D00L42B10h45k165j457a118A500J462K04j202c68k945k326K757e75A033J141
9740B174M43j22o42n76mR5j01K27K57n40j62h3A37J342J515K17o69H83a206o25
9720a831d07A668L63C35b081j976J186M73q52j459j008L15K163a207c34A73f34
9702i41c01A33K80j71L03R98P54m91q88cl53p88o0n54j204m72o22j34L29Q67P59
$$ plain form
9681 -2235 -2306 -2957 -4563 -5257 -2914 -780 305 999 2304 4999 6021 4693 3581 3051 3091 3719 3804 3372
9663 3372 2480 1946 1639 922 -699 -1689 -2393 -3019 -3395 -4105 -3510 -3091 -1968 -1770 -1389 -767 353 2084 3443
9644 3443 4808 6079 5584 3885 2095 323 -388 518 1926 2276 1438 14 -1250 -2156 -2546 -2323 -2112 -1289
9626 -1289 -1233 -1833 -2838 -3696 -4620 -4277 -3392 -1812 -49 1572 2600 2242 1082 1397 2764 3858 4354 3839
9608 3839 2250 51 -1752 -3755 -1354 600 1570 1806 1114 110 -679 -934 -1123 -1933 -2938 -3702 -4147 -3820
9590 -3820 -3038 -2089 -1044 -1078 -1802 -2978 -3351 -1976 -636 678 416 583 1099 1672 1353 918 486 693 1494
9571 1494 2265 2671 2162 1398 4677 6340 7495 8107 9008 9404 8681 6800 4178 994 1552 2027 4782 5977
9553 5977 4107 2853 2127 2120 3455 5822 6908 4470 1680 -1704 -4338 -4543 -2892 -969 -32 494 546 134
$$ packed form
9681b235p1o51j606o94K343g80C05O94J305K695J022j328j112n30M0O28Q5m32
9663C372q92n34l07p17f99r90p04o26l76p10N95M19J123J98L81O22C53J731J359
9644C443J365J271m95j699j790C23c88E18J408L50q38A4a250r06l90K23K11Q23
9626a289N6o00j005q58r24L43Q85J580d9A572J028l58A082L15J367J094M96n15
9608C839j589E1a752k003a354F00R70K36o92A10f79k55j89q10j005p64m45L27
9590c820P82R49a044l4p24j176l73J375f36F78k62J67N16N73l19m35m32K07Q01
9571A494P71M06n09p64L279J663J155O12R01L96p23j881k622I94N58M75K755J195
9553E977j870j254p26pJ335K367J086k438A680a704k634k05J651i69c2D94N2A34
$$ plain form
9534 869 1542 819 236 -167 -1314 -1744 -1359 -944 -972 -1642 -882 -1380 -2424 -2479 -1942 -546 765 1576 2188 1654
9514 1654 -93 -2397 -4244 -2179 338 2654 4154 4805 4382 3887 2310 827 -218 2339 3391 3962 4290
9497 4290 4853 5060 5118 4279 2127 119 -1469 -1697 -1688 -574 1567 2318 1916 1172 319 769 1130 1319 1672 1942
9477 1942 1295 708 633 -270 -1358 -2100 -3859 -6630 -7721 -5583 -4094 -3858 -500 1842 2168 2372 2033 1230
9459 1230 152 576 2088 4110 6610 9045 6411 3709 1386 -234 -988 -826 -1059 -1408 -2024 -1595 -1811
9442 -1811 -2229 -2236 -2119 -2125 -1947 -1531 -1837 -2368 -2903 -3230 -3298 -2549 -1463 -302 903 1553 249 -3316 -6022 -3456
9422 -3456 1026 2299 3512 3094 1909 386 -1482 -2577 326 117 -31654 2607 1635 263 -1028 -1449
9406 -1449 -1191 -452 229 731 454 1140 939 1137 729 -335 -1298 -1891 -2184 -3512 -4915 -6647 -7548 -7655 -7277
$$ packed form
9534H69O73p23B36a67j147m30L85M15k8o70P60m98j044n5N37e46G65Q11O12n34
9514A654i3k304j847K065C38K316J500O51m23m95j577H27b18B339J052N71L28
9497D290N63K07N8q39B127A19a469k28Re74A567P51m02p44C19M50L61J89L53K70
9477A942o47n87p5b70j088p42j759k771j091K138J489K36e00A842L26K04l39q03
9459A230A52M24J512K022K500K435k634k702A386b34p54J62k33l49o16M29k16
9442a811m18pJ17oJ78M16l06n31n35l27o8P49J086c02I03O50B49c316k706K566
9422c456A026J273J213m18j185C86a482j095C26A17c1654B607r72B63a028m21
9406a449K58d52B29N02k77O86k01J98m08c35r63n93k93j328j403j732r01j07L78
$$ plain form
9387 -7277 -5583 -3933 -2592 -1834 -1260 -809 -691 -484 1037 3275 3394 2498 1467 1653 736 338 -671 -358
9369 -358 1269 2703 2715 1445 409 -404 -397 -333 391 954 792 -638 -3069 -4386 -5058 -3742 -2113 -1772 -1936
9350 -1936 -1958 -1474 -1085 -1133 -875 52 1574 3236 8597 10451 10833 7751 -2755 -4915 -7482 -8736 -5767
9333 -5767 -4064 -4470 -5995 -6443 -4749 -2904 -1533 -1496 -1310 -1535 -529 -140 11 63 -360 -1301 -2543 -3757
9315 -3757 -4201 -3057 -1587 -732 -467 -122 890 1963 2831 3055 2650 2241 2224 2525 3277 3965 5957 6177 3457
9296 3457 2247 945 525 1847 2340 2164 1702 237 -1089 -2879 -3620 -3707 -3914 -4625 -2766 -990 -81 213 -442
9276 -1079 -1119 -359 1655 1971 124 -1765 -1237 1255 2976 3378 3016 2402 1954 2337 2041 1735 2276 3393
9258 3393 4505 5421 5839 687 -3360 -5177 -3230 24 1173 894 718 -325 -2199 -4147 -4351 -2459 488
$$ packed form
9387g277J694J650J341P58N74M51J18K07A037K238J19q96j031J86G36C38f71L13
9369c58A269J434J2j270D09d04PO4C91N63j62f38k431j317o72J316J629L41j64
9350a936k2M84L89m8K58E2J522J662N361J854L82l082b755k160k567j254K969
9333e767J703m06j525m48J694J845J371L7J86k25e29a40A1N2c60r41j242j214
9315c757m44J144J470g32K65a22H90J073Q68K24m05m09j7L01P52O88J992K20k720
9296C457j210I45m20J322M93j76m62B37a089j790p41q7k07p11J859i90h1B13d42
9276a079m0c59A655L16A24a765N28A255J721M02l62o14m48L83k96l06N41J117
9258C393J112R16M18F87c360j817J947B4J149k79j76c25j874j948k04J892D88
$$ plain form
9240 1927 3108 3544 3699 2183 551 -1655 -1032 -1187 390 -422 -1192 -2676 -1491 73 1099 593 593 142 761
9221 761 2471 3972 4279 3136 1812 889 991 1519 1835 1565 1629 1051 -512 -2291 -4419 -5235 -4026 -6127
9203 -6127 -7321 -6652 -4704 -1726 -4007 -5632 -5487 -7142 -7956 -5586 -2722 -736 294 1277 2008 3002 4499
9186 4499 5951 5872 3434 1351 -228 -1149 -908 178 1327 897 951 1613 2564 2985 2532 1263 -357 -1638
9168 -1638 -2471 -2141 -1328 -24 1041 696 -899 -2491 -3214 -3004 -2305 -1240 -997 -247 -1107 -1592 -1201 -681 625
9148 2305 2595 1760 928 294 -46 -59 -216 -772 -1023 -1174 -1280 -1503 -1754 -1375 -1591 -1110 248 1602 2191 2580
9128 2580 2347 2073 2350 3348 4207 3987 2305 358 -1368 -2225 -2038 -1015 -372 -643 -1429 -1730 -1567 -1184 -1166
9109 -1166 -1192 -2021 -1367 -1396 -1991 -2194 -2617 -2921 -3082 -2761 -1727 832 2069 2497 2075 1416 380 -1235 -2537
$$ packed form
9240A927J181M36J55j516E51a655O23j55C90d22p70j484J185G3J026n06%A42O19
9221G61J710J501L07j143j324H89J02N28L16k70O4n78e12j779k128q16J209k101
9203f127j194O69J948a726k281j625J45j655q14K370b722g36B94R83P31R94J497
9186D499J452p9k438A351b28r21K41A78J149m30N4O62R51M21m53A263c57j281
9168a638q33L30Q13b4A041l45h99j592p23K10O99J065K43b47q60m85L91N20F25
9148B305K90q35q32B94d6j3j57n56k51j51j06k23k51L79k16M81B48J354N89L89
9128B580k33k74K77R98Q59k20j682C58a368q57J87a015c72k71p86l01J63L83J8
9109a166k6q29O54k9n95k03m23l04j61L21J034H32J237M28m22o59C80a235j302
$$ plain form
9090 -2537 1013 4173 5014 4647 2646 202 -2147 -2716 -1523 -1097 -1465 -1956 2017 6248 8485 7871 5442
9073 5442 3098 926 -516 -964 -967 -877 -1081 -690 2351 3649 4459 4876 3207 1500 -2686 -2832 586 2190
9055 2190 2192 1840 1433 783 -537 -1753 -2505 -1966 -1379 -698 201 516 343 -340 -1200 -1175 -170 229 -345 -1564
9035 -1564 -2898 -2363 -561 1465 2921 3365 2772 1916 1097 581 576 -193 -1319 -2400 -2894 -2709 -1715 -245 1318
9015 2806 2265 2194 2186 1403 -2130 -5623 -6306 -3150 463 2507 2605 2267 2504 2526 1812 785 279 240 537 717
8995 717 250 -561 -1352 -792 684 1832 2902 2673 951 -1273 -2527 -2295 -1246 -749 -1463 -2433 -1866 -81 1717
8975 2705 2454 1959 1090 119 -580 -1638 -2221 -3453 -3175 -2699 -2213 -1599 -985 -379 -55 233 -184 -930 -1831
8956 -1831 -2746 -3434 -3987 -4471 -4644 -3707 -1668 -412 440 1878 2676 3559 3274 2251 1071 -336 -1534 -2023
$$ packed form
9090b537A013L160Q41l67k001B02b147n69J193M26l68m91B017M231K237o14k429
9073E442k344I26e16m48lR0k04L91B351J298Q10M17j669A500b686j46E86J604
9055B190Kl52m07o50e37j216p52N39N87O81B01L15j73c40q60K5a70B29c45j219
9035a564j334N35e61A465J456M44n93q56q19n16na93j126j081m94J85R94b45A318
9015B806n41p1qp83b130l493o83c150D63K044R8l38K37K2p14G85B79l9K97J80
8995G17B50e61p91N60F84J148J070k29I51a273j254K32J049M97p14r70N67h1A717
8975B705k51m95q69A19e80j058n83j232K78M76M86O14O14c79e5B33a84p46r01
8956a831r15o88n53m84j73R37a668d12D40J438P98Q83k85j023A071c36j198m89
$$ plain form
8938 -2023 -2547 -3301 -4062 -3944 -1828 -100 559 717 910 282 -209 -582 -662 479 1366 913 435 132 -1073
8918 -1337 -776 63 87 -391 -1251 -2038 -2093 -1233 -302 354 589 1261 1998 2219 2428 3013 3533 3906 4340 3094
8898 3094 2243 -99 -2023 -3418 -3484 -2473 -1468 -624 -1022 -2328 -2922 -2676 -2426 -1683 -1183 -962 -917 -927 -68 396
8877 513 696 899 513 312 190 894 1987 3458 3969 4439 3695 2093 386 -339 -594 -675 -997 -2154 -3172
8858 -3172 -3037 -209 2443 3930 3649 2096 417 -903 -1305 -250 2153 4394 6397 5670 4280 3870 3968 4453
8840 4453 5689 6543 7694 7064 4970 3095 1920 117 -1222 -2556 -3434 -4111 -3019 -1649 -363 1285
8823 2291 2600 6288 4316 82 -55 1286 2418 2315 1132 80 -1083 -2302 -3679 -5278 -6051 -3694 -2609
8806 -2609 -2217 -1403 -881 -380 -126 552 1578 2582 3093 2480 1773 2109 2658 3149 2195 534 -1442 -3371
$$ packed form
8938b023n24p54p61J18a828a00E59J58J93B82b09l73q0D79Q87m53D35A32a073
8918a337N61F3K4c91q60p87n5Q60c02C54K35O72P37K21K09N85N20L73M34j246
8898C094q51i9j924j395o6J011J005f24l98j306n94K46K50P43N00K21M5j0f8C96
8877E13J83K03l86k01j22P04J093J471N11M70p44j602C86c39k55q1l22j157j018
8858c172J35b09B443J487k81j553D17i03m02b50B153K241K003p27j390m10R8M85
8840D453J236Q54J151o30k094j875j175A17a222j334q78o77J092J370c63A285
8823B291L09L688j972H2e5A286J132j03A132H0a083j219j377j599p73K357J085
8806b609L92Q14N22c80a26E52J026J004N11o13p07L36N49M91r54E34a442j929
$$ plain form
8788 -3371 -1200 226 1773 2498 3506 2919 2628 2004 1503 635 254 -238 -106 -354 -1068 -2038 -2793 -1252
8769 -74 -347 -1997 -4048 -4972 -4377 -3601 -3030 -2652 -2727 -3633 -4270 -4956 -6078 -5540 -5209 -5216 -5104 -3783 -1219 1551
8748 3250 3471 2605 2011 3074 4527 5205 5539 4308 2136 -927 -3745 -6177 -4935 -1268 -931 -1551 -2270
8731 -2270 -3140 -2954 447 913 -8171 -7898 -12450 -6478 2005 -8536 -19288 -2199 8966 7372 8600 3761
8714 1710 -22 602 -20183 -23385 -21742 -18960 -8192 -1479 2145 5147 4897 4717 1904 -883 -4368 -4712
8698 -4712 -2760 -941 -1799 1184 -1625 -1132 -2483 260 2038 1550 2759 2706 1530 -373 -1182 -508 987 1885
8680 1885 556 -1671 -3626 -5186 -4037 -3110 -4764 -4567 -5715 -4172 -4863 -2815 -715 355 512 -470 -2568
8663 -2568 -4152 -8979 -9593 -11848 -14777 -20284 -19005 -9896 -9725 -6688 -3842 -4641 -3823 -3292 -2431 -1205
$$ packed form
8788c371a200B26J547P25J008n87k91o24n01F35B54b38a06k48p14r70p55a252
8769g4k73j650k051r24N95P76N71L78p5r06o37o86j122N38L31pJ12J321a219A551
8748C250K21q66n94J063J453O78L34j231B136i27k818k432J242a268L37o20p19
8731b270q70J86D47M66h171K73m552N972B005h536j0752b199H966j594J228C761
8714A710b2F02b0183l202J643K782h192a479B145L002k50j80A904h83l485l44
8698d712J952i41q58A184a625M93j351B60J778m88J209n3j176c73q09e08I87Q98
8680A885E56a671j955j560J149R27j654J97j148J543o91K048g15C55J57d70k098
8663b568j584m827o14k255k929n507J279R109J71L037K846p99Q18N31Q61a205
$$ plain form
8646 -339 -56 518 644 92 -1527 -2858 -3707 -2978 -2009 -732 275 1561 2367 2865 3325 2928 2209 1103 436
8626 455 888 1047 560 -132 -628 -961 -793 -388 816 2471 4033 5009 5738 5732 4193 2733 1393 693 495
8607 495 292 161 212 147 356 802 138 931 2524 4283 4713 4946 4641 3898 3139 2776 2340 1387 256 -1040
8586 -598 -34 -529 -1398 -2196 -2163 -1319 -276 357 436 -58 -673 -1897 -3852 -5076 -5260 -2550 -773 -762 -1337 -1019
8566 -1019 -918 -715 -623 657 1722 2313 730 -964 -1780 -923 -1769 -3533 -4627 -6782 -9098 -10410 -4824 -6918
8548 -6918 -4470 -2646 -142 1623 2562 2914 2193 1006 -798 -1844 -1805 -2297 -3351 -4559 -2571 133 1873
8531 1873 2110 1029 -359 -837 -1117 -533 -155 -799 -816 -402 -41 -798 -1638 -2020 -1934 -919 906 2303 2331 832
8510 -1181 -3055 -4518 -5619 -5362 -3565 -2183 -1820 -1912 -1819 -1906 -2112 -156 -752 -1750 -2250 -1657 589 3298 5478
$$ packed form
8646c39e6E18J26I2a527j331q49P29R69g32B75J286Q06M98M60l97p19A103D36
8626D55M33J59m87a32m96l33J68c88H16J655J562R76P29oj539j460j340F93j98
8607D95k03j31N1o5K09M46A38P93J593J759M30K33l05p43p59l63m36r53B56a040
8586e98c4m95q69p98L3Q44b76C57P9e8o15j224j955j224j84b550g73J1n75L18
8566a019J01K03R2F57J065N91G30i64q16Q57q46j764j094k155k316j312d824k094
8548f918K448J824a42A623R39L52p21A006g98j046L9m92j054j208J988A33J740
8531A873K37A029c59m78k80e33a55o44j7d02d1p57q40l82Q6i19I06J397K8H32
8510a181j874j463j101K57J797J382L63r2R3q7k06a56n96r98n00N93E89K709K180
$$ plain form
8491 5478 7221 7356 6094 3912 2422 1075 168 152 937 2646 4203 4020 2747 388 -2223 -5493 -7049
8474 -7049 -2439 2394 6063 8935 9615 8810 -2160 -2628 -2609 -2668 -3077 -4117 -3956 -1695 583 280 -788 -2105
8456 -2105 -2650 -2415 -846 781 662 -1004 -2368 -2668 -2648 -1426 546 2748 4286 7842 7728 7671 8915 10155
8438 10155 8326 1778 -2788 -3482 -2885 -1827 -2267 -4488 -6936 -6086 -790 2057 2492 3022 2714 1527 319
8420 -1478 -3538 -5028 6959 13829 19711 30955 38353 47520 52565 55076 54385 51568 46698 40828 33024
8405 33024 23747 14936 8223 7083 8736 11107 11327 5462 -14535 -8724 -2557 2164 1841 8165 11942
8390 11942 11479 1192 -2859 -5432 -7543 -10731 -3532 -2830 -3059 -3873 -2241 1191 4140 4883 3391 530
8373 -2719 -5903 -4759 -1859 -1426 -1818 -1954 -3713 -2250 -881 -348 -594 -979 2187 3382 3835 4337 3940
$$ packed form
8491E478J743J35j262k182j490A075A68j6P85J709J557j83j273C88b223l270j556
8474g049b439B394L669K872O80q05b160m68J9n9m09j040J61a695E83B80g88j317
8456b105n45K35h46G81j19a004j364l00K0J222E46K202J538L556j14n7J244J240
8438A0155j829A778b788o94N97J058m40k221k448Q50g90B057M35N30l08j187C19
8420a478k060j490F959O870N882J1244P398R167N045K511o91k817m870n870p804
8405C3024r277q811o713j140J653K371K20E462a4535N811b557B164l23O324L777
8390A1942m63A192b859k573k111l188c532P02k29q14J632A191K949P43j492E30
8373b719l184J144a859M33l92j36j759J463h81c48k46l85B187J195M53N02l97
$$ plain form
8356 3940 2665 1576 1904 2208 2115 883 -374 -2473 -4908 -7460 -8269 -4754 -2144 -1021 -1496 -1570 -40 1914
8337 2692 2771 2590 2614 2353 2393 3057 3555 3796 4445 5211 4957 4751 3367 2369 1904 1598 1259 1367 1720 1903
8317 1903 2139 2880 3177 4028 4437 4413 3486 3174 2438 2484 3251 4090 6380 6939 7952 6679 1001 -62 -641
8298 -641 -1086 -1926 -2414 -2235 -1682 -726 393 1807 2699 3712 4349 4256 3542 2486 1611 198 -1425 420 1670
8279 1670 2399 2961 3124 2586 1846 727 -637 -1853 -2347 -2150 -1544 -673 375 1483 1974 970 2045 1314 185
8259 -160 730 1738 2045 1963 2003 2126 2029 435 -1167 -613 1630 2898 3078 5956 5210 1386 -2160 -2980 -3024
8240 -3024 -2329 -1722 -910 81 925 1275 666 200 -956 -1487 -2458 -3311 -3965 -3930 -2840 -1591 -60 2047 4291
8221 4291 7984 9593 7629 4585 2156 -562 -2842 -3163 -725 1126 2632 3962 5238 5371 5181 4959
$$ packed form
8356C940j275j089L28L04r3H83c74k099k435k552q09L515b144a021m75p4d0A914
8337B692P9j81K4k61M0O64M98K41O49P66k54k06j384r98m65l06l39J08L53J83
8317A903K36P41K97Q51M09k4r27l12p36M6P67Q39K290N59J013j273A001f2n79
8298f41m45q40m88J79N53g26C93J414Q92J013O37r3p14j056q75A98a425D20J250
8279A670P29N62J63n38p40G27f37j216m94J97O06f73C75J108M91I70J075p31A85
8259a60G30J008L07q2M0J23r7D35a167N54A630J268J80K878p46A386b160q20m4
8240c024O95O07Q12H1Q44L50o09B00i56n31r71q53o54L5J090J249f0B047K244
8221D291L693J609j964l044B156e62k280l21g25A126J506J330J276J33j90k22
$$ plain form
8205 4959 4816 4886 4925 4756 3620 1698 -902 -2840 -2773 1505 4374 6370 6201 3802 2018 313 -1285 -1217
8187 -1217 105 106 -194 -907 -1049 -404 559 1361 1929 1709 909 298 -657 -1661 -2252 -2414 -2028 -2166 -2790 -3507
8167 -3507 -3508 -2406 -3110 -2462 -676 1513 3091 3789 3179 1868 -202 -1634 -2154 -2125 -2218 -2811 -3683 -3803 -1930
8148 -1930 -150 1069 1295 30 -1971 -3989 -6777 -4513 -2769 -823 649 2156 2621 2546 1695 119 -1317 -1796
8130 -1796 -1709 -1215 -841 -1634 -3058 -2219 -1778 -1414 -1146 -68 287 -115 -535 -356 -291 430 -547 -1587 -1607 -1211
8110 -1211 -1054 -1002 -888 -699 -182 -201 -1180 -2860 -3865 -4054 -2664 -687 1022 2102 3895 5344 6808 7965
8092 7965 7300 7494 3373 1146 -292 -1906 -1752 -125 2958 4157 3676 2303 656 -702 -317 1810 4635
8075 4635 7603 7977 5329 2127 -766 -2231 -2085 -2215 -2784 -3538 -3062 -1803 -521 -241 -1327 -3496 -4602
$$ packed form
8205D959j43P0L9j69j136A698i02j938O7A505K869J996j69k399j784C13a285O8
8187a217A05Ja94p13j42d04E59Q02N68k20q00B98f57j004n91j62L86j38o24p17
8167c507jJ102p04O48f76A513J578O98o10j311b02j432n20K9r3n93q72j20J873
8148a930a50A069K26C0a971k018k788K264J744h23F49J507M65p5q51A19a317m79
8130a796Q7M94L74p93j424Q39M41L64K68f8B87a15m20J79O5D30e47j040k0L96
8110a211J57N2J14J89a82j9r79j680j005j89J390f87A022J080J793J449J464J157
8092G965o65J94C373A146b92j614J54a25B958J199m81j373F56g02c17A810K825
8075D635K968L74k648B127g66j465J46j30n69p54M76J259e21b41j086k169j106
$$ plain form
8058 -4602 -3817 -3278 -3300 -2277 -1165 -81 994 2057 3160 4390 4946 5321 6595 5062 3197 419 -2042
8040 -2250 -4278 -7016 -5925 -3659 -1711 -356 521 818 493 379 164 930 626 441 527 842 1176 904
8022 904 759 356 1823 1852 1843 1417 238 -462 -1094 -1422 -1341 -1335 -1832 -3276 -3618 -4178 -5145 -5558 -4166 -28 4192
8000 6308 9333 11902 10253 6984 754 -1226 -2320 -2894 -2066 -396 1330 2040 2324 1926 1127 561 -884
7982 -2206 -2394 -1731 -1734 -2062 -2522 -3738 -3514 -2118 165 599 733 210 -394 -921 -1151 -1953 -3141 -3452 -2015
7963 -2015 -718 746 2124 3043 3837 4169 4288 3221 1945 1138 703 1104 1547 1456 2059 1611 778 1106 -2266
7943 -4204 -5267 -6353 -6909 -5909 -337 745 1925 3263 4165 3822 2033 -584 -3945 -7095 -7451 -7567 -4399
7926 -4399 -11016 -7576 -5921 -3442 17 2549 3424 4653 5623 4714 3007 1580 426 -147 8 627 1625 2475
$$ packed form
8058d602P85N39k2J023J112h1I94J063J103J230N56L75J274j533j865D19b042
8040b250k028k738J091K266a711c56E21K97l25j14A64P66l04j85Q6L15L34k72
8022I04j45C56J467K9rm26B38d62o32l28Q1Om97j444l42n60r67m13J392b8D192
8000F308L025K569j649l269G54a226j094n74Q28c96A330P10K84l98p99E61h84
7982b206j88O63ll28m60j216K24J396A65M34J34B10c94n27k30q02j188l11J437
7963b015g18G46J378R19P94L32J19j067j276q07m35M01M43r1O03m48G78L28b266
7943d204j063j086n56J000c37G45J180J338R02l43j789e84l361l150l56j16L168
7926d399o617L440J655K479A7K532Q75J229R70r09j707j427D26a47HO19R98Q50
$$ plain form
7908 2475 3564 3926 3558 2703 1628 631 84 -536 -1375 -1461 -1613 -977 57 421 -85 -1737 -2484 -888 1067 2405
7888 2405 1776 -143 -3590 -5010 -7441 -8431 -6169 -5184 -4905 -5049 -4119 -2503 -661 689 1363 1590 1162 1046
7870 1046 406 -250 -2824 -5331 -3396 263 881 -23 -2544 -5286 -5311 -11444 -13151 -7569 -2716 -240 -88 -297
7852 -297 -813 -1650 -1654 -120 1363 4515 5951 5651 5812 5227 5062 5241 5565 5667 5049 4582 3219 1796 1478
7833 1478 860 1500 1604 941 -342 -1235 -661 776 1704 552 -1917 -2510 -1996 -1493 -1868 -3334 -5044 -6608
7815 -6608 -5471 -3001 -1359 -508 254 213 -560 -2663 -5437 -5966 -4040 -2808 -2127 -1189 202 2096 2977
7798 2977 2097 2341 1869 1415 1284 -394 -1822 -2849 -2302 -15 3192 3402 1649 1186 501 -213 -3720 -4966
7780 -4966 -2863 17 -1231 -2240 -3665 -9797 -6538 -7091 -6004 -4916 -2966 -4885 -6289 -8520 -6383 -4367
$$ packed form
7908B475J089L62l68q55j075F31H4e36q39q6j52O36E7L64h5j652p47h88A067J338
7888B405o29a43l447j420k431r90K262R85K79j44R30J616f61F89O74K27m28j16
7870A046D06b50k574k507J935B63O18b3k521k742k5o133j707N582b716b40h8k09
7852b97n16q37ma20A363L152J436l00J61n85j65J79L24J02o18m67j363j423l18
7833A478o18O40J04o63c42q93N74G76R28E52a917n93N14N03l75j466j710j564
7815f608J137K470a359e08B54m1e60k103k774n29J926J232O81R38B02J894Q81
7798B977q80K44m72m54j31c94j428j027N47a5C192K10A649m63E01b13l507j246
7780d966K103A7a231j009j425o132L259n53J087J088J950j919j404k231K137K016
$$ plain form
7764 -4367 -4101 -3543 -103 2849 3937 4171 2927 4192 2409 -940 -3577 -6216 -8024 -10371 -8939 -5371
7748 -5371 -3545 -1935 -3338 -2774 -373 1774 2739 2193 1039 301 -917 -3079 -5255 -6609 -8476 -10237
7732 -10237 -5019 488 4238 6086 9107 9792 8045 -1930 -3119 -3685 -2434 251 954 -201 -2108 -3625
7716 -3625 -4168 -1410 450 141 -267 -1032 -1308 -1534 -1368 -981 -538 -784 -1383 -1087 -138 138 981 1061 893 699
7696 699 128 -169 404 1210 2771 4837 6791 6163 4434 5355 4536 2708 1978 1931 2413 10651 4101 3432
7678 3432 6527 9262 40661 53971 60767 60433 42007 39850 27331 14392 -2065 -3561 -5425 -9038
7664 -9038 -3666 -1671 -110 -1219 -3058 -1206 -2119 -1993 -2520 -5962 -2663 2732 3412 3311 2774 767 -2024
7646 -2558 -950 1195 3278 2949 467 -1263 -1461 -1795 -1914 -2001 -919 690 2134 2709 2779 1944 1578 985 1030
$$ packed form
7764d367K66N58a03B849J088K34j244J265j783i40k637k639j808k347J432L568
7748e371J826J610j403N64c73A774R65n46A039C01i17k162k176j354j867j761
7732a0237e019D88L750J848L021O85j747a930j189n66J251B51P03b01j907j517
7716c625n43a410D50A41b67p65k76k26J66L87M43k46n99K96a38A38Q43Q0j68j94
7696F99A28a69D04Q06J561K066J954o28j729R21q19j828p30m7M82Q238D101o69
7678C432L095K735L1399J3310O796l34j8426k157j2519j2939b065j496j864l613
7664i038c666a671a10j109j839a206r13J26n27l442b663B732O80j01n37G67b024
7646b558i50A195K083l29D67a263j98l34j19q7i19F90J444N75P0q35l66n93M5
$$ plain form
7627 1030 1220 819 586 486 800 434 -308 -1149 139 1382 1410 1104 923 415 -295 -1153 -1912 -1182 -334 815
7606 1045 68 -845 -1342 -2022 -2678 -3023 -3721 -4255 -2599 -818 435 439 -129 -702 -841 -833 16 1236 2010 2057 852
7584 -979 -3060 -4299 -2483 -1202 -493 412 952 1346 1133 -270 -2880 -4568 -4183 -710 1446 2850 2264
7567 2264 1105 -736 -1440 -449 1327 1838 976 -516 -2382 -3105 -3134 -4754 -4635 -2594 -693 360 1320 1912
7549 1912 1948 1883 1400 448 326 988 2077 3061 4388 4330 3016 1116 -179 -426 258 1109 2811 3637 3024
7530 3024 2059 1174 1128 2727 4467 6796 7757 7367 5194 3458 740 -914 -1794 -2831 -4094 -3618 -542 1310
7511 2779 1996 134 -1876 -1921 35 1652 2195 1047 -1578 -3691 -6871 -8620 -6247 -2795 -891 68 -142 -391
7493 -391 -39 595 1459 2076 2097 1864 1778 2469 3443 4096 4015 2491 1443 -744 -2953 -4263 -3388 -635 888 783
$$ packed form
7627A030J90m01k33j00L14l66c08q41A39J243K8l06j81D15b95q58p59P30c34H15
7606A045F8h45m97o80o56l45o98n34J656h18D35Ma29n73j39QA6J220P74M7H52
7584i79k081j239J816a202d93D12N40L94k13b70k610j688L85g10A446J404n86
7567B264A105g36p04d49A327N11q62e16j866p23k9j620J19K041f93C60R60N92
7549A912L6o5m83D48j22O62J089R84J327n8j314A116a79k47B58Q51J702Q26o13
7530C024r65q85m6J599J740K329R61l90k173j736G40i14q80j037j263M76e42A310
7511B779p83A34a876m5C5J617N43A047a578k113l180j749K373b795h91F8a42k49
7493c91c9E95Q64O17K1k33q6O91R74O53q1j524j048g44k209j310Q75f35H88j05
$$ plain form
7473 783 243 -865 39 1629 1838 1060 -380 -1326 -2080 -1544 268 2087 3019 3195 970 -701 -1676 -1838 -622 843
7452 211 -2022 -3983 -10614 -11102 -5138 -8415 -5109 -3601 -1037 800 2585 3571 3830 10097 524 -3404
7435 -4753 -4893 -4579 -4452 -1032 4972 10188 10266 9321 7320 1811 -1941 -4577 -4454 -4830 -7365 -9461 -9171
7418 -9171 -7583 -6325 -4871 -1897 1749 4155 4093 1675 -1641 -5292 -4194 -1426 1357 2177 2098 2075 2679
7401 2679 4899 7488 12759 13652 12315 10294 6066 3018 370 -421 -1196 -3573 -8141 -10536 -14853 -9364
7385 -9364 -5407 -3338 -1891 -218 628 1311 2135 4003 4560 4078 3118 1518 -837 -4091 -7386 -9273 -7752
7368 -7752 -5501 -5718 -1643 2936 4319 1859 -1696 -7376 -13182 -8792 5471 6357 5295 911 -997 -3099
7352 -3099 -5808 -8383 -1938 6115 14766 5943 8480 5097 24204 21338 33908 8481 2538 -21986
$$ packed form
7473G83B43h65C9J590K09p78c80r46p54N36B68J819R32J76I70g01r75j62f22H43
7452B11b022j961o631m88e138l277L306J508a037H00J785R86K59O267E24c404
7435d753j40L14J27a032D972N216P8r45k001A811a941k636J23l76k535k096K90
7418i171J588J258J454a897A749K406o2A675a641l651J098a426A357Q20p9k3O04
7401B679K220K589N271Q93j337k021m228C018C70d21p75k377m568k395m317N489
7385i364L957K069J447b18F28O83Q24J868N57m82r60A518h37l254l295j887J521
7368g752K251k17a643B936J383A859a696n680n806M390E471Q86j062I11i97k102
7352c099k709k575a938F115Q651E943K537l383J9107k866J2570H481B538b1986
$$ plain form
7337 -11532 46950 73959 20077 -8374 128558 236947 216824 100644 255061 749125 1351957
7326 1351957 1851541 2195756 2282129 2098301 1693338 1168000 643229 247928 149206 203166
7316 203166 166460 80981 41236 51098 24855 -57068 4304 20455 21595 -9743 -12500 -14860 5183
7302 15380 5618 5092 8529 4095 2930 2783 15420 16035 15060 12981 6793 4671 5609 3733 -503 7219
7285 6414 4681 5927 -2854 -5193 -11185 -10968 -21347 -15410 -11055 -6462 -3104 -462 1306 3488 -1916
7269 -10882 -7229 -157 2538 899 1215 -910 -3066 -924 5452 10520 10317 8763 4792 3602 8890 9602
7253 9602 8661 9508 10894 15017 26918 30752 18247 14541 8827 4068 -256 397 3819 5382 5713 8391
7237 8391 17889 23068 22404 -5160 -25621 -34543 -27587 -29434 -48697 -32214 -7938 -9918 -13087 -506 6546
$$ packed form
7337a1532D6950K7009B0077h374A28558J08389k0123A00644J54417M94064O02832
7326A351957M99584L44215Q6373j83828m04963n25338n24771B47928r8722N3960
7316B03166l6706H0981l9745R862B4855e7068D304J6151J140i743k757k360E183
7302A5380E618n26L437D095j165j47J2637O15r75k079o188k122R38j876e03G219
7285F414j733J246b854k339n992K17j0379N937M355M593c104d62A306K182a916
7269a0882L653a57B538H99L16i10k156i24E452N068k03j554l971j190N288P12
7253I602r41Q47J386M123J1901L834j2505l706n714D068b56C97L422J563L31K678
7237H391R498N179o64e160k0461q922O956j847j9263J6483g938j980l169e06F546
$$ plain form
7221 -1933 -2354 28033 39232 54268 40414 36585 32519 20128 1025 44217 81205 93827 52562
7208 52562 -13677 9141 -31831 -31864 96885 209450 235260 151908 67470 162277 180035 31460
7195 372046 811475 882200 454416 1018961 3384464 6438129 9688799 12571627 14391896
7186 14391896 14763947 13590494 11170450 8009198 4790862 2150624 905425 1177139 1172499
7177 1172499 785569 396023 407453 462254 252062 192098 40514 7489 -51160 -100625 -117220
7166 -117220 14393 -37316 -20183 42853 43532 11279 -12530 5112 15169 -3966 -44065 -25195
7154 -25195 14722 24341 8357 -7181 2461 4763 7614 34064 51630 30226 6749 4664 18848
7141 18848 20620 10858 4283 10693 13660 84 12849 22697 19706 17176 6714 237 -2416 -10575 -1355
$$ packed form
7221a933m21B8033J1199J5036j3854l829m066j2391A025M3192L6988J2622m1265
7208E2562a3677I141c1831l3I6885J12565K5810q3352F7470R4807J7758C1460
7195C72046M39429P0725m27784N64545K365503L053665L250670K882828J820269
7186A4391896L72051j173453k420044l161252l218336B150624I05425K71714m640
7177A172499l86930l89546J1430N4801k10192n9964D0514G489e1160m9465j6595
7166a17220A4393c7316J7133D2853O79A1279a2530E112J0057c966m0099J8870
7154b5195A4722R619H357g181B461K302K851K6450J7566k1404F749k085J4184
7141A8848J772r762D283O410K967H4J2765R848k991k530F714B37b416q159a355
$$ plain form
7125 -5519 -8916 -15487 -9598 -1032 -1171 -6784 -2479 4837 5398 188 -2286 375 5036 9542 9897 9507
7109 9507 8705 3805 13345 18014 30516 20580 28011 15144 1291 7176 -3598 -7514 -625 11876 8274
7094 8274 -2081 -9273 -6560 -9194 -7028 -6610 -7946 -3644 3074 2357 3769 3375 2782 1196 1526 9492
7078 9492 16356 21906 18868 15964 16036 22557 13399 6475 1874 4145 11266 11093 10448 6222 746 4843
7062 4843 30030 57458 48757 9419 -33940 3618 52878 4157 3166 89900 174273 194345 195582
7049 195582 340879 719287 1115268 1459918 1673142 1701458 1532497 1210088 809897 425669
7039 425669 156028 120324 153480 113767 37822 43257 45739 -12126 -196 -4035 17425 16390 1888
7025 -11066 -2157 7297 10188 7833 23811 15477 814 -903 -2550 140 8787 17943 26794 29636 15079
$$ packed form
7125e519l397o571N889a032j39n613b479D837N61A88b286C75M661M506L55l90
7109I507q02C805R540M669J2502r936P431j2867A291N885c598l916f25A1876l602
7094H274b081p192K713k634K166M18j336c644C074p17J412l94n93A196L30P966
7078I492O864N550l038k904P2O521r158F475A874K271P121j73o45m226G46M097
7062D843K5187K7428q701I419c3940C618M9260D157r91Q6734Q4373K0072J237
7049A95582J45297L78408L95981L44650K13224K8316j68961l22409m00191l84228
7039D25669A56028l5704L3156l9713C7822N435K482a2126a96l839A7425j035A888
7025a1066b157G297K891k355J5978q334H14i03j647A40Q647R156Q851K842j4557
$$ plain form
7010 15079 16491 11116 7433 4764 4005 42 -6745 -11959 -15298 -19323 -13871 -10449 -8258 -4221 823 1912
6994 1912 1514 -2218 -3814 -8702 -15223 -16122 -13554 -10066 -8742 -6340 -8304 -10189 -13276 -11974 -11360 -5760
6978 -5760 -4918 -4882 -6957 -5071 -2620 -273 2514 2547 -1459 -3752 -6894 -10402 -5105 -1122 831 106 239
6961 239 3438 3486 9008 8591 3130 3882 4203 4036 2476 1987 -1711 -4611 -5457 -2650 -2487 -4643 -5923
6944 -5923 -5793 -5808 -4070 -2772 -1935 -1022 -661 -588 198 -465 -2489 -2321 -3546 -3823 -3988 -3887 -3545 -2202 -1560
6925 -1560 -2538 -2972 -1016 -952 1292 2907 3299 3567 1848 -508 -2943 -4962 -5517 -3970 -1884 13 1634
6908 1634 2382 2021 1031 837 1160 2221 2895 2473 825 -61 -666 948 2984 3724 3728 2181 1428 337 47 951
6888 951 1942 2178 1216 -33 -533 -361 1711 3127 3742 3161 1690 -390 -1473 -2498 -1097 1707 4068 5804
$$ packed form
7010A5079J412n375l683k669p59D2f745n214l339m025N452L422K191M037H23J089
6994A912l98b218j596m888o521q99K568L488J324K402j964j885l087J302O14N600
6978e760Q42L6k075J886K451b73B514L3a459k293l142l508e105a122H31A06J33
6961B39L199M8N522m17C130P52L21j67j560m89a711k900q46b650J63k156j280
6944e923J30j5J738J298Q37R13L61P3A98d65k024J68j225k77j65J01L42J343O42
6925a560r78m34a016O4A292J615L92K68j719e08k435k019n55J547a884A3J621
6908A634P48l61r90j94L23J061O74m22H25f1o05I48K036P40Mj547p53C37D7R04
6888I51R91K36r62c3n00J72A711J416O15n81j471c90j083j025a097A707K361J736
$$ plain form
6870 5804 5917 5254 3596 442 -1769 -1446 -2762 -2660 -2524 -2946 -3960 -4739 -5635 -7686 -9393 -9455 -9202 -6241
6852 -6241 -5593 -4066 -3736 -3140 -2477 -1203 -145 833 1494 258 -2151 -4439 -5596 -3111 -1738 251 739
6835 739 415 -457 -1357 -3211 -64 1009 1104 897 1310 2445 3245 3666 3305 2033 281 -1184 -1496 516 1259
6816 1259 1310 941 650 483 925 1703 2313 1869 1045 3 -596 -1092 -974 -837 -235 716 1714 2091 1372 400 -104
6794 -531 -1638 -1816 -1688 -1888 -1311 -552 -503 -729 -1189 -1809 -2815 -2678 -1714 490 1529 2594 1129 695 -9
6774 324 620 468 -605 -1845 -3535 -5877 -7868 -7588 -2812 -1707 -520 -8 -812 -1958 -3153 -3269 -550 654
6755 980 754 648 781 428 -686 -2078 -2469 -2276 -2075 -1666 -1012 -536 -669 -1635 -1260 -293 613 1949 2646
6736 2646 2060 186 -2569 -4774 -5135 -3307 -1890 -1022 -731 -787 -566 1024 3158 4396 4021 3168 2208 2348
$$ packed form
6870E804J13o63j658D42a769L23j316J02J36m22j014p79q96k051j707o2K53K961
6852f241O48J527L30N96O63a203a45H33O61B58b151k288j157K485J373B51M88
6835G39l24d57r00j854f4A009R5k07M13J135Q00M21l61j272B81a184l12E16P43
6816A259N1l69k91j67M42P78O10m44q24Ce96m96J18J37b35G16R98L77p19D00a04
6794e31j107j78J28k00N77e52M9k26m60o20j006J37R64D90J039J065A129m34i
6774C24K96j52f05j240j690k342j991K80b812J105e20hq04j146j195j16e50F54
6755I80k26j06J33l53f86j392l91J93K01M09O54M76j33r66L75b93F13J336O97
6736B646n86A86b569k205l61J828J417Q68K91n6K21A024K134J238l75q53r60J40
$$ plain form
6718 2348 4041 6601 7092 5103 2529 -498 -1796 -85 1013 1450 1784 2035 2451 2951 3097 2746 2617 2289
6700 2289 1883 1159 222 -1137 -2078 -2576 -2513 -1376 -413 -102 218 324 -544 -1842 -3609 -4559 -4886 -4032 -4828
6681 -4828 -5103 -6955 -8167 -6959 -4150 -4146 -417 374 1550 2921 4005 4440 -1129 -1534 -2635 -3895 -533
6663 1238 2313 4141 4724 3669 2617 2151 2186 2353 3027 2827 2188 594 -616 -461 895 1189 1120 -309 -2185
6644 -2185 -3682 -2267 589 1078 301 -1177 -2086 -1204 131 -150 757 3630 4526 3795 1368 -1629 -2579 -1912
6626 -1912 -120 708 437 1673 2915 3461 3392 2564 871 -663 -1955 -2382 -1789 -1319 -1158 -657 -1147 -2201 -3288
6607 -3288 -3983 -3252 -1579 84 114 616 456 -24 -296 -78 122 -547 -1490 -1831 -3082 -3903 -3968 -3517 -2501 -1127
6586 -394 492 376 -498 -1557 -2504 -2922 -2841 -2247 -1556 -876 9 1382 2535 3718 5748 5522 3995 2897 1720
$$ packed form
6718B348J693K560M91j989B529d98j298h5A013M37L34K51M16N00J46l51j29l28
6700B289m06p24B22a137r41m98O3J137d13a02B18J06e44j298j767r50l27Q54p96
6681d828k75j852j212J208K809Md17C74J176J371J084M35a129m05j101j260e33
6663A238J075J828N83j055j052m66L5J67O74k00o39E94f16J55H95K94o9c09j876
6644b185j497J415E89M89C01a177r09Q82A31a50G57K873Q96p31A368a629r50O67
6626a912a20G08k71J236J242N46o9q28H71f63j292m27N93M70J61N01m90j054j087
6607c288o95P31a579H4L0N02j60b4k72g8A22e47r43l41j251q21o5M51J016a127
6586c94D92j16d98j059r47m18Q1N94O91O80IJ373J153J183K030k26j527j098j177
$$ plain form
6567 1720 803 -83 2025 1040 -1714 -2568 -3074 -3127 -1673 -632 463 1856 1857 1510 462 -16 878 2640 3583 3578
6547 3578 2459 1947 1240 175 -154 -670 -1719 -2589 -2190 30 3087 5328 5711 4741 3336 2324 2295 1870
6529 1870 670 -973 -2014 -1346 -361 127 -341 -531 199 626 2702 4939 5075 4528 3054 1183 -1367 -1288
6511 -1288 -1881 -1420 -239 1508 2087 1650 473 -1486 -369 315 1233 1274 -369 550 937 639 271 272 -947 -3795
6491 -3795 -6557 -8007 -9089 -4811 -3152 -2143 -2222 -2441 -2965 -3063 -2867 -2613 -2428 -3057 -4069 -5508 -4588 -2821
6473 -2821 -953 -108 1090 1629 1928 653 -485 -1056 -773 697 2385 2803 3185 3471 3692 3498 2820 794 8 983
6453 983 1332 1110 -187 -1590 -2632 -2488 -1004 420 1886 3223 3529 4768 4619 3687 3836 3496 2848 1342
6434 -170 -1844 -517 1913 2086 900 -1307 -3270 -4277 -2970 -1371 759 3038 5051 5596 4645 3115 579
$$ packed form
6567A720H03h3B025r85a714q54n06n3J454f32D63J393Jl47D62a6H78J762R43n
6547C578j119n12p07A75a54n16j049q70L99C0L057K241L83r70j405j012k9m25
6529A870F70i73j041O68c61A27c41j90A99M27K076K237J36n47j474A183a367P9
6511a288n93M61b39A508N79m37D73a486c69C15R18M1c69E50L87k98B71Ji47k848
6491c795k762j450j082M278J659J009p9k19n24r8J96K54J85o29j012j439R20J767
6473b821i53a08A090N39K99F53d85n71K83F97J688M18L82K86K21j94o78G94HR75
6453I83L49k22a87j403j042J44a004D20J466J337L06J239j49r32J49l40o48A342
6434a70j674e17A913J73I00a307j963j007J307a371G59K279K013N45r51j530E79
$$ plain form
6416 -1965 -3779 -4599 -4370 -3202 -2599 -3052 -4469 -4654 -2155 -981 -410 311 588 2024 4079 5735 5905
6399 5905 4670 3736 2676 2176 1688 1208 167 -609 -548 715 2229 2879 2857 1904 726 -389 -504 -524 -770 -953
6379 -953 -767 -83 1514 3115 3613 2983 2064 1273 -43 -1028 -2867 -947 1208 1092 2171 -556 -2087 -3093
6361 -3093 -6293 -2955 -4528 -4772 -3825 -2931 -2410 -176 3097 5974 7719 8686 8441 7204 4993 771 -1671
6343 -3644 4503 7018 6197 3863 2443 1100 192 3 5 -482 -1314 -3085 -3434 -4017 -3281 -3366 -3528 -3185 -1846
6324 -1846 -4347 -5206 -5218 -2114 -195 14 -566 -1797 -2714 -2249 -3790 -2832 -1772 -889 544 531 -1520 -2364 -1750
6305 -1750 -841 -3457 -7794 -7009 397 806 201 -95 301 -1431 -1657 -1592 -332 349 1067 751 -938 -3133 -4238
6286 -4238 -6063 -6901 -5096 -1110 1435 571 -598 -2192 -3516 -3797 -3289 -1284 -2935 -4866 -6139 -5771
$$ packed form
6416a965j814q20K29J168O03m53j417j85b155i81d10C11K77J436K055J656J70
6399E905j235r34j060n00m88m80A67f09O1G15J514O50k2r53G26c89j15k0k46j83
6379i53J86h3A514J601M98o30r19p91d3r85j839i47A208j16J079e56j531j006
6361c093l200b955j573k44R47Q94N21a76C097K877J745R67k45j237k211G71a671
6343c644D503K515q21k334j420A100A92CKd82q32j771l49n83P36q5j62L43J339
6324a846k501q59j2b114a95A4e66j231r17M65j541R58J060Q83E44j3a520q44O14
6305a750h41k616m337P85C97M09B01i5C01a431k26O5c32C49P18l16i38k195j105
6286d238j825q38J805a110A435E71e98j594j324k81N08a284j651j931j273L68
$$ plain form
6270 -5771 -5031 -6478 -1285 -88 -114 -1495 -4296 -6543 -9126 -4292 -4158 -4497 -6588 -4143 -3869 -4334 -4551
6253 -4551 -2806 -607 1890 4016 4749 4666 5279 5785 7601 4991 2474 237 1152 3132 3045 2363 889 -627
6234 -2394 -1940 -837 -1031 -3277 -7011 -11314 -14054 -15065 -12892 -7755 -3662 -108 2238 3502 2141 911
6217 -999 -2627 -3407 -1836 42 1006 1053 496 343 1021 2148 3100 3027 1935 -205 -2147 -2848 -2155 -1455 -1377 -1450
6197 -1450 -1199 -782 -904 -1399 -2122 -3534 -4128 -3352 -3743 -3577 -4141 -5231 -4387 -3180 -2550 -1465 -246 980
6178 981 -179 -1616 -3029 -3005 -1964 -708 1184 1408 2028 1950 2135 1731 -714 -1872 -4280 -3594 -3404 341 2101
6159 2101 3435 4325 4938 5290 4626 1556 -2368 -4852 -5386 -2761 108 587 -427 -475 -5005 -1865 305 844
6141 844 1275 2198 2400 1081 -1335 -1672 -313 548 1352 1314 -1973 -1291 -2122 -2583 -3156 -5614 -6127 -5558 -4307
$$ packed form
6270e771P40j447a285h8k6j381k801k247k583d292J34l39k091K445K74m65k17
6253d551J745f07A890K126P33q3O13N06J816k610B474B37R15J980q7o82H89f27
6234b394M54h37j94k246l734m303k740j011K173N137c662a08B238J264j361I11
6217i99j628p80J571D2R64M7D96j53O78J127R52p3j092b05j942p01O93P00P8p3
6197a450K51M17j22m95p23j412n94P76l91J66n64j090Q44J207O30J085b46I80
6178I81a79j437j413K4J041g08A184K24O20p8J85m04g14j158k408O86J90C41J760
6159B101J334Q90O13L52o64A556b368k484n34K625A08M79d27m8m530a865C05N39
6141H44M31R23K02A081a335l37c13E48Q04l8a973O82q31m61n73k458n13N69J251
$$ plain form
6122 -4307 -1134 2200 3693 2507 746 -1576 -3322 -5284 -5580 -5427 -4142 -2069 -934 -244 353 1619
6106 1619 -1065 -1958 -2749 -3197 -2311 -2283 -2548 -2334 1820 2098 -699 -3885 -354 16762 29847 34517 43799
6089 43799 70706 60114 35442 15662 9565 -1956 3279 1175 -1567 -1445 -2815 -514 2679 6159
6075 6159 7573 8592 7054 5298 3575 2646 1346 -176 -35 1639 2403 3681 3191 1739 537 -545 -1814
6058 -1814 -1982 -3434 -5124 -2460 24 1774 2682 2625 2037 1995 3461 4448 5266 5985 6765 7419 7472 6332 4852
6039 4852 4574 4534 3182 1985 679 -860 -2026 -2767 -2259 -1280 652 703 -98 -1598 -2433 -2704 -2699 -3335 -5118 -7509
6019 -7509 -7680 -4886 -1577 2236 4224 4773 4730 4127 3227 2603 2087 1483 780 -103 -1677 -819 1185 2752
6001 2752 2145 2873 2516 2961 3001 3086 2765 2346 1291 1175 826 208 -501 -778 -582 -774 -1044 -136 819 826 1192
$$ packed form
6122d307a134B200J493j186G46a576j746j962k96J53J285b069i34b44C53J266
6106A619a065q93p91m48Q86K8k65K14A820K78f99l186c54A6762J3085M670R282
6089D3799K6907j0592k4672A5662o097a956C279A175a567J22j370e14B679L480
6075F159J414J019j538j756j723r29j300a76c5A639P64J278m90j452E37e45j269
6058a814j68j452j690b460B4J750R08n7n88m2J466R87Q18P19P80O54N3j140j480
6039D852k78m0j352j197F79h60j166p41N08R79F52N1i8j500q35k71No36j783k391
6019g509j71K794a577B236J988N49m3o03r00o24n16o04p03a03j574h19A185J567
6001B752o07P28l57M45M0Q5l21m19j055j16l49B08e01k77J96j92k70a36H19PL66
$$ plain form
5980 1192 -382 -2566 -5101 -7550 -9082 -9011 -8195 -14277 -11350 -11652 -7387 -6042 -6438 -7224 -3202 -1805 -1912
5963 -1912 -1323 -1234 -1601 -1822 -1943 -1027 -146 488 -456 -2192 -3512 -3078 -1995 -1693 -2074 -3887 -6051 -6749
5945 -6749 -5890 -1468 2033 4692 6891 10411 12622 15072 14721 12314 6942 -2777 -3695 -8306 -2426 -2690
5929 -2690 -3081 -2291 -553 864 561 441 568 761 2069 2470 2463 1820 51 -2323 -3482 -5611 -6673 -7621 -8420
5910 -8420 -9122 -9283 -9953 -9150 -3985 1239 4364 4848 3171 816 -1873 -4815 -3784 98 2742 2529 0 -3546
5891 -3946 667 3337 4365 3196 47 -2468 -2906 197 1884 1601 566 -801 -1533 -1886 -1911 -1919 -1028 590 1275
5872 1275 921 -1631 -2562 -443 2420 2547 1506 -1764 -3916 -2707 800 749 717 -216 102 1110 2369 2191
5854 2191 1577 1349 416 -120 -197 -948 -2016 -3075 -2882 -3438 -3624 -2969 -1609 1289 3891 6841 9570 10402
$$ packed form
5980A192c82k184k535k449j532P1Q16o082K927l02M265J345l96p86c202J397j07
5963a912N89Q9l67k21j21R16a46D88d56j736j320M34J083L02l81j813k164o98
5945f749Q59a468B033K659K199L520K211K450l51k407n372b777r18m611b426k64
5929b690l91P90e53H64l03j20J27J93J308M01po43E1b323j159k129j062r48p99
5910h420p02j61o70Q03c985A239L125M84j677H16a873k942J031I8K644k13@c546
5891c946F67K670J028j169D7b468m38A97J687k83E66h01p32l53k5qQ91E90O85
5872A275l54a631r31d43B420J27j041a764k152J209H00n1l2b16A02J008J259j78
5854B191o14k28D16a20p7p51j068j059J93n56j86O55J360A289K602K950K729Q32
$$ plain form
5836 10402 9565 9595 9287 7380 5417 1529 -3810 -5308 -3866 2279 2113 831 822 1036 1616 681 -54 -889
5818 -889 -941 -1481 -1256 -481 -866 -940 -1068 -1082 -814 279 1539 3130 4947 4914 3359 -496 -930 -2802 -14226
5799 -14226 -17713 -22929 -23656 -24391 -22383 -19488 -17584 -17160 -15071 -13148 -11107 -9896 -8520 -6264 1344
5783 2526 2080 1422 1307 -122 -388 -866 -526 23 -641 -964 -2475 -3648 -4430 -1423 807 1788 1993 1333 467
5763 -474 -1609 -1584 -1115 -291 792 1499 1362 1040 348 -41 36 522 1281 1368 1183 699 1148 2875 4079 4554
5743 4554 3656 1897 -11 -3797 459 2747 2114 1634 821 544 128 -610 -1600 -2879 -2804 -1765 -126 1635
5724 3215 3956 4623 4221 3166 3048 2108 986 -797 -2512 -3288 -4074 -4480 -4643 -4526 -3147 -2940 -3063 -3344 -3334
5705 -3334 -3273 -3793 -4206 -4187 -4274 -3754 -2027 -11 1119 1999 2119 1461 619 -1047 -2389 -2583 -2302 -2084 -1971 -2177
$$ packed form
5836A0402q37L0l08j907j963A529c810j498J442B279j66H31rK14N80F81e4q35
5818h89n2n40K25d81l85p4j28j4K68B79J260J591J817l3j555d96m34j872j1424
5799a4226l487n216p27p35K008K895J904M24K089J923K041J211J376K256A344
5783B526m46o58j15a22k66m78L40B3f41l23j511j173p82a423H07R81K05o60D67
5763d74j135K5M69b91G92P07j37l22C48d1C6M86P59Q7j85m84M49J727J204M75
5743D554q98j759a1l786D59K288o33m80q13k77A28f10r90j279P5J039a26A635
5724C215P41O67m02j055j18r40I86g97j715p76p86m06j63J17J379K07j23k81J0
5705c334O1n20m13J9q7N20J727a1A119Q80J20o58F19a047j342j94K81K18J13k06
$$ plain form
5685 -2177 -2168 -1872 -1575 -2064 -2826 -5023 -5239 -4062 -707 2820 4656 6505 5683 4688 3272 1846 1466 -905
5666 -3167 -2638 -1000 238 448 859 1318 1302 -631 -2839 -1844 387 1496 2672 3384 3665 3399 3002 2637 1934
5647 1934 831 -352 -651 -1465 -1752 -2116 -1814 -1143 -1423 -1835 -2981 -4443 -3474 -2168 -1181 -678 -591 -512 -562 -1182
5627 -1182 -1778 -553 515 1778 2278 2869 2667 1853 1117 1191 500 598 230 -470 -221 149 907 1100 -211 -1158
5607 -1158 -1774 -1880 -756 884 1558 1741 1832 2636 3978 4800 5027 4379 4438 5081 5019 4033 1321 -1401 -1669 -3586
5587 -3586 -4178 -5614 -2767 -389 702 584 -253 -362 -1747 -1368 -853 1232 1029 564 -930 -2252 -3547 -5025
5569 -5025 -5801 -4940 -2454 -1260 -642 -1075 -2743 -3314 -3969 -3519 -1988 -1411 -1793 -1178 -112 987 2238 3274
5551 3274 4271 3267 765 899 3006 6736 8762 11120 11327 9294 5888 196 3551 743 -3967 -7008
$$ packed form
5685b177RK96K97m89p62k197k16J177g07B820J836J849q22r95j416j426l80i05
5666c167N29a000B38K10M11M59j6f31k208R95C87J109J176P12K81k66l97l65p03
5647A934H31c52k99q14k87l64L02O71k80m12j146j462R69J306R87N03Q7P9n0o20
5627a182n96e53E15J263N00N91k02q14p36P4E00R8B30d70b21A49P58J93b11r47
5607a158o16j06g56H84O74J83R1Q04J342Q22K27o48N9O43o2r86A321a401k68j917
5587c586n92j436b767c89G02j18b53j09j385L79N15A232k03m65i30j322j295j478
5569e025p76Q61b454J194O18m33j668n71o55M50J531N77l82O15a12I87J251J036
5551C274R97j004G65J34K107L730K026K358K07k033l406A96L355G43c967l041
$$ plain form
5535 -7008 -15348 -15428 -16272 -13933 -11673 -4356 3388 5318 -1486 -13427 -12314 -10277 -11761 -13231 -10286
5520 -10286 -3439 -3874 -1875 -3279 925 3694 5403 -288 2148 1813 1224 2094 -2279 -4215 -629 1771
5503 7028 654 756 -2949 -240 214 1590 2608 1889 1038 -587 -2106 -2218 -2834 -3198 -1148 707 1614 3307
5485 3307 3827 3777 4486 4808 5087 4050 2331 -291 -1354 -994 -1380 -499 -596 -681 -1013 -1185 -958 -489 -402 -498
5465 -498 -666 -841 -2583 -6921 1696 930 -1088 -608 336 159 797 2748 3732 3745 2664 1037 1148 1855
5447 1855 1927 2271 2862 3213 2871 2812 3348 2806 3070 1722 79 72 -79 -1176 -1305 -1423 -1554 -1959 -2033 -2008 -3292
5426 -3292 -2795 -1986 -1966 -2700 -4054 -4728 -5598 -6021 -5909 -4790 -3185 -2284 -2112 -2261 -2611 -2332 -1092 454 1921
5407 1921 2945 3090 2871 2285 949 99 863 2451 3017 1790 -649 -2750 -4363 -5255 -5499 -3833 -2835 -2815
$$ packed form
5535g008q340q0q44K339K260d356C388J930a486j1941J113K037j484j470K945
5520a0286c439m35a875j404I25K769J709b88B148l35n89Q70b279j936f29A771
5503G028F54J02b949b40B14J376J018p19q51e87j519j12o16l64a148G07R07J693
5485C307N20n0P09L22K79j037j719b91j063L60l86d99r7q5l32j72K27M69Q7r6
5465d98j68j75j742m338A696p66a088M80C36A59O38J951R84J3j081A037J11P07
5447A855P2L44N91L51l42n9N36n42K64j348G9pg9j097j29j18j31m05p4K5j284
5426c292M97Q09K0p34j354o74q70m23J12J119J605R01J72j49l50K79a092D54J467
5407A921J024J45k19n86I49I9P64J588N66j227f49k101j613q92k44J666R98K0
$$ plain form
5389 -2815 -3789 -5284 -7149 -6126 -5699 -5301 -4435 -4483 -3463 -997 692 1718 2542 2114 2194 1867 2032 1440 302
5369 124 1060 1588 1086 -52 -1764 -3013 -3386 -3500 -480 534 61 141 -518 -1792 -3662 -4146 -2154 528 909
5350 909 879 -884 -1844 -582 1066 1434 499 -1192 -3763 -1945 338 1398 1781 1916 2052 1784 2078 2970 4226
5331 4226 5107 4604 4023 3693 3807 3462 3296 2980 604 -1320 -1727 -1562 -820 6 1447 2769 4321 3227 1690
5312 1690 1099 868 920 1586 2105 2448 2274 1879 465 -806 -1819 -1267 -659 -929 -2178 -3302 -2097 -731 471
5292 -1948 -5251 -251 1271 441 -422 -2303 -1930 -3566 -4004 -3605 -2967 -1791 -599 -139 -439 -241 703 1802
5274 1802 3128 3482 2827 2062 1135 -106 -681 868 897 620 346 -47 429 1189 1665 2325 2778 1639 -296 -1838
5254 -1838 955 3249 5703 6973 7133 12088 10905 7933 -2124 -3269 -3201 -3445 -3227 -2109 645 4432 7843
$$ packed form
5389b815r74j495j865J023M27L98Q66m8J020i97F92J026Q24m28Q0l27J65n92C02
5369A24R36N28n02e2j712j249l73j14d80E34F1Q0e18j274j870m84J992E28L81
5350I09l0h84r60e82A066L68D99a192k571J818C38J060L83J35J36k68K94Q92J256
5331D226Q81n03n81l30J14l45j66l16F04a320m07J65P42FJ441J322J552j094j537
5312A690n91k31N2O66N19L43j74l95D65h06j013N52O08k70j249j124J205g31D71
5292a948l303b51A271D41d22j881L73j636m38L99O38J176e99a39l00J98G03J099
5274A802J326L54o55p65r27a06n75H68K9k77k74d7D29P60M76O60M53j139b96j542
5254a838I55K294K454J270J60M955j183k972b124j145O8k44K18J118F45L787L411
$$ plain form
5237 7843 8534 6947 5479 -1384 6044 3329 -2500 1985 -3361 9376 11049 12902 15153 6960 10705
5222 10705 14190 -14019 -6810 -7335 -13317 -13239 -11492 -9052 -5658 -568 2777 4173 5658 4349 1287
5206 -760 -3218 -5220 -2914 166 1015 -149 -2052 -3242 -4206 -5312 -4310 -7530 -7216 -4573 -5017 -6661 -2048
5188 -355 1121 471 572 2076 2773 2912 9960 9246 7702 5562 741 -7614 -8056 -5549 -3363 -1865 -1232
5171 -1232 -990 88 1496 1708 939 -341 -1603 -1166 -2329 2045 4009 -270 -1767 -4451 -4749 -3663 -1869
5154 -1869 -506 -887 1025 1642 615 -310 -1637 -1045 -1475 -2444 -3019 -1562 465 1116 1066 712 856 945 707
5135 707 -720 -1418 -1465 -1324 -1873 -1908 -1958 -2566 -2257 456 3407 6066 8575 8261 6868 4628 685 -1541 -4612
5116 -4612 -5542 -6201 -6643 -6579 -3755 -2640 -225 1095 1109 71 -1542 -3363 -4978 -4103 -1943 -410 516 1306
$$ packed form
5237G843O91j587j468a384F044k715b500A985c361I376J673J853K251F960L745
5222A0705L485a4019f810n25n982P8J747K440L394e68B777J396J485j309A287
5206g60k458k002K306A66Q49a49j903j190r64j106J002l220L14K643m44j644b048
5188c55A121D71J01J504O97J39P048p14j544k140G41g614m42K507K186J498O33
5171a232K42H8J408K12p69c41j262M37j163B045J964b70j497k684k98J086J794
5154a869e06l81A025O17F15c10j327N92m30r69n75J457D65O51n0l54J44Q9k38
5135G07g20o98m7J41n49l5n0o08L09D56K951K659K509l14j393k240F85a541l071
5116d612r30o59m42O4K824J115b25A095J4G1a542j821j615Q75a943d10E16P90
$$ plain form
5098 1306 2007 2407 2104 979 -169 -587 -227 1246 1951 1602 71 -977 -2204 -2964 -2650 -1488 -111 -469 -274
5079 -274 -436 -1050 -1063 -957 -1336 -1963 -2273 -1833 -630 -131 46 648 1066 798 -355 -1807 -3447 -4339 -2493 -793
5058 151 416 673 238 457 1218 2287 2701 2761 2241 1133 -368 -1886 -1659 554 2180 2406 538 -2193 -4525
5039 -4525 -4732 -4317 -4029 -3761 -2332 -490 1238 2866 3428 3337 2899 2264 1378 299 2726 2364 2033 1063 256
5019 1545 1948 2668 3449 6276 6437 4167 4111 3812 3351 2693 1356 -47 -781 -618 841 2259 3085 3380 3329
5000 3329 3422 3487 2090 723 323 1572 3270 4928 5248 5869 7274 6371 4930 5009 -799 -1551 -2303 -2970 -2100
4981 -2100 -2209 -3673 -1996 -1483 -1116 -1598 -1806 -1990 -1277 -570 -3 848 1858 1539 1138 98 -1504 -2992 -4808
4962 -4808 -4308 -1569 484 1626 2553 2305 1470 531 -357 -921 -813 -1 273 1267 2011 2148 1903 951 685 -1291
$$ packed form
5098A306P01M00l03I79a69m18b27A246P05l49G1i77j227p60L14J162a11l58J95
5079b74j62o14j3J06l79o27l10M40f30a31D6O02M18k68c55j452j640q92J846g93
5058A51K65K57B38K19P61J069M14O0n20j108c68j518K27E54J626K26E38b193k332
5039d525k07M15K88K68J429d90A238J628N62r1m38o35q86B99K427l62l31r70B56
5019A545M03P20P81K827J61k270n6k99m61o58j337d7p34J63H41J418Q26K95n1
5000C329R3O5j397G23C23J249J698J658L20O21J405r03j441P9g99p52p52o67Q70
4981b100j09j464J677N13L67m82k08j84P13e70cH48J010l19m01I8a504j488j816
4962d808N00a569D84J142R27k48q35E31c57n64J08aB73R94P44J37k45I51k66a291
$$ plain form
4941 -3611 -6058 -6742 -6818 -3062 -447 1550 3111 3219 2591 1733 1385 1280 1587 1567 1468 591 -515 -578 127 1
4920 347 580 779 514 94 -89 43 354 313 1261 1862 2069 1971 1448 694 -341 -1500 -3019 -4047 -1638 694
4899 1758 1928 1735 574 -495 -1985 -835 370 1047 571 607 1008 -513 65 4930 4610 -64 -874 -2391 -1849 962
4878 2699 2967 2792 2344 1327 1240 477 -696 -1981 -2301 -1773 1896 1057 307 -111 -1857 -2290 -2986 -3231 -2856
4859 -2856 -2515 -1857 -1111 -243 781 1917 2619 2913 2648 1648 625 383 535 855 165 -1005 -119 1589
4840 2482 1940 1436 1494 1736 1709 454 181 506 1504 2205 2374 2140 1670 461 -319 -400 19 1083 1768 1949 1939
4819 1939 1815 1231 914 663 906 1602 2752 3001 2266 1126 794 3114 7288 1960 -401 -1131 -1470 -1438
4801 -1438 -1060 -564 -249 1001 1779 2098 2027 1817 1420 1126 945 1007 790 797 879 1436 1540 1532 1110 257 -883 -1934
$$ packed form
4941c611k447o84p6c062d47A550J561J08o28q58l48j05L07k0r9E91e15o3A27A
4920C47K33J99k65I4h9D3L11m1R48O01K07r8n23F94c41j159j519j028a638F94
4899A758J70j93E74d95j490h35C70O77m76L6M01e13F5M865l20f4q10j517N42I62
4878B699K68j75m48j017q7D77f96j285l20N28A896q39C07a11j746m33o96k45L75
4859b856L41O58P46b43G81J136P02K94k65j000F25k42J52L20A65a005a19A589
4840B482n42n04N8K42k7D54A81L25R98P01J69k34m70D61c19q1A9J064O85J81j0
4819A939j24n84l17k51K43O96J150K49p35A126l32K320M174A960d01p30l39L2
4801a438L78M96b49A001P78L19p1k10l97k94j81O2k17PQ2N57J04qm22B57h83j051
$$ plain form
4779 -1934 -1491 -1593 -2342 -3375 -3863 -3987 -3943 -3372 -2715 -2157 -2013 -1651 -2100 -2197 -2943 -4262 -4572 -4102 -1520
4759 738 2201 2134 1127 468 1724 3290 3810 2567 1140 -180 -1744 -2981 -2728 -1146 -1019 -997 -986 -462
4740 252 1150 1403 1235 639 -338 -321 398 867 1137 1151 1432 1872 2171 2543 2850 3335 4088 5067 6159 5191
4720 5191 4263 3606 2778 2560 840 -1167 -2515 -2704 -3172 -2442 -1051 -768 -215 -184 -915 -1527 -935 260 1295
4701 1295 1833 1679 1103 372 -367 -1034 -1254 -1296 -1178 -1380 -1374 -901 13 614 1493 2377 3129 3019 1807 -509 -2756
4680 -2756 -2834 -1835 -1409 -2423 -2783 -1240 679 1035 326 -708 -165 584 114 -1476 -3108 -3387 -4215 -2779
4662 -2779 -4189 -1019 -586 -249 -656 -574 -551 -1036 -2168 -3247 -2964 -2385 -926 -305 -1088 -2737 -4005 -2478
4644 -2478 -1072 -1302 -2614 -4195 -3969 -2302 -606 570 515 -1074 -2589 -1429 117 166 -523 -2440 -3755
$$ packed form
4779a934M43j02p49j033m88j24M4N71O57N58J44L62m49r7p46j319l10M70a520
4759G38J463o7j007D68J256J566N20j243A140a80j564j237K53a146J27K2J1d62
4740B52Q98K53j68n96c38J7C98M69K70J4K81M40K99L72L07M85P53R79J092r68
4720E191r28o57q28k18H40a167j348j89m68P30a051K83b15L1p31o12N92B60J035
4701A295N38j54n76C72c67o67k20m2J18k02OM73A3O01Q79Q84P52j10j212e09k247
4680b756p8R99M26j014l60a240F79L56C26g08a65E84A14a476j632k79q28J436
4662b779j410a019M33b49m07Q2K3m85j132j079K83N79i26c05p83j649j268J527
4644b478a072k30j312j581K26J667f06E70n5a074j515J160A17M9e23j917j315
$$ plain form
4627 -3755 -1726 1551 2875 2890 2295 1539 555 -632 -2628 -3395 -2558 -213 2022 1514 1018 229 -687 -797
4609 -797 461 1296 1668 1068 149 -499 -302 449 1578 2745 2937 2954 2702 2051 1350 -360 -1043 -2206 -1626
4590 -1626 385 997 -1056 0 -2 -714 -1625 -2841 -4341 -3662 -2019 12 2633 5520 6558 5351 3546 1498
4571 -638 -2208 -2482 -1851 -69 2807 4735 6303 6417 5079 4324 3210 2243 772 -328 -897 -1084 -464 -343
4553 -343 -1080 -1768 -847 1776 2213 -958 -708 3016 5133 6033 1254 -916 -134 131 -1495 -1347 -788 555
4534 247 -357 -2263 -5511 -153 11041 18291 12612 -6270 -2889 13515 20387 1922 19400 51516 67849
4519 67849 46105 26239 139564 307375 472299 605820 682595 673929 587767 445709 280872
4508 280872 128112 18047 50473 64435 41871 7265 16483 26425 25615 -19110 2488 -1169 -4048
$$ packed form
4627c755a726A551J324J5n95p56E55f32j996p67Q37b13B022n08m96B29f87j10
4609g97D61Q35L72o00A49d99J97D49J129J167J92J7k52o51p01c60o83j163N80
4590a626C85O12a056@bp12r11j216j500O79J643A2K621K887J038j207j805A498
4571f38j570k74O31f9B807J928J568J14j338p55j114r67G72c28n69j87d64J21
4553c43p37o88h47A776M37i58K50C016K117R00A254i16a34A31a495J48N59E55
4534B47c57j906l248a53A1041P250n679f270b889A3515O872A922J7478L2116J6333
4519F7849k1744j9866J13325J67811J64924J33521P6775q666q6162j42058j64837
4508B80872A28112A8047L2426J3962k2564G265R218R942q10a9110B488a169k879
$$ plain form
4495 -4048 -5137 10906 779 -171 188 -60 4141 59 -3502 -9235 -2907 -1097 354 4578 9827 12051 15262
4478 15262 2895 3948 4823 1342 -976 -3104 -6305 -6805 -6081 -3198 -1163 -516 -958 -609 -387 -160 -1303
4461 -1303 -3093 -4530 -4970 -2877 -439 3022 5300 6408 6389 4808 2877 966 -447 390 1047 149 -316
4443 -734 135 1450 1536 751 -1585 -3613 -5175 -5333 -3835 -2249 -2095 -1566 78 1793 2621 1464 2640 2528
4425 2528 2713 1577 446 -2323 -1333 433 2182 3251 3732 3744 3703 3375 3232 2962 2340 1483 307 -909 -951
4406 -951 39 1895 4762 6573 5319 4169 1353 -1079 -3593 -5939 -7711 -6633 -3567 -2484 -1997 244
4389 2681 3497 3785 2835 1570 1179 2008 2662 2241 920 -483 -1552 -1175 -366 707 1722 2218 1975 1530 867
4370 867 1127 686 -506 -2223 -3263 -3450 -1879 -190 1113 1680 1508 752 -850 -2530 -1793 -1026 -1860 -4283
$$ packed form
4495d048j089A0906G79a71A88f0D141E9c502n733b907a097C54M224N249K224L211
4478A5262B895J053Q75A342i76k128l201n00P24K883a163e16m42L49K22a60j143
4461a303j790j437m40K093d39C022K278J108j9j581j931I66d47C90O57A49c16
4443g34A35J315Q6G51a585k028j562j58J498J586J54N29G8J715Q28j157J176j12
4425B528J85j136D46b323R90D33J749J069M81J2m1l28j43k70o22q57C07i09m2
4406i51C9J856K867J811j254j150A353a079k514k346j772J078L066J083M87B44
4389B681Q16K88r50j265l91Q29O54m21I20d83j069L77c66G07J015M96k43m45o63
4370H67K60m41e06j717j040j87J571a90A113N67j72G52h50j680P37P67q34k423
$$ plain form
4352 -4283 -4252 -3440 -1421 595 1713 2076 2082 1313 234 -1120 -1489 -1600 -2466 -2745 -4105 -5937 -9808 -6251
4334 -6251 -12201 -8559 -1436 133 1210 1875 2686 3014 4651 7205 8945 10746 11101 9790 6212 3737
4318 3737 1311 -40 -983 -2135 -2706 -3171 -3504 -1369 813 858 730 1355 2058 2129 639 -1994 -3851 -2246 887
4298 2707 2730 1665 -609 -2925 -5075 -10033 -10828 -4394 -2549 -9854 -6558 96 430 887 91 -1380 -2320 -2820
4280 -2820 -201 673 734 -259 -1483 -1584 -1594 -1885 -1777 -1355 -1284 -424 493 1407 2197 2554 2664 3010 2994 2034 481
4258 -1376 -1747 -1150 -785 6 1029 2147 3079 3740 3635 2868 2755 1706 -66 -2012 -3453 -2151 -1060 -543
4240 -543 88 642 -5 -1760 -3469 -2672 -2118 -1873 -1764 -1072 -985 -730 -1646 -2221 -1772 -171 348 -126 -1515 -2410
4220 -2410 -2501 -2965 -1913 -811 1118 2756 4310 5781 5691 3404 -402 -2475 -572 3270 5197 8484 9221
$$ packed form
4352d283L1Q12a421E95J118L63Op69B34a120l69j11q66k79j360j832l871L557
4334f251n950L642a436A33J077O65Q11L28J637K554J740J801L55j311l578k475
4318C737A311d0r43j152n71m65l33a369H13M5j28O25P03P1F39a994j857J605H87
4298B707K3j065f09k316k150m958p95d394J845p305L296I6L34M57I1a380r40n00
4280b820b01F73O1b59j224j01j0k91J08M22P1d24D93R14P90L57J10L46j6r60D81
4258a376l71N97L65FJ023J118R32O61j05p67j13j049f6j946j441J302a060N17
4240e43H8N54ej755j709P97N54K45J09O92Q7K55r16n75M49a71C48a26j389q95
4220b410r1m64J052h11A118J638J554J471r0k287d02k073e72C270J927L287P37
$$ plain form
4203 9221 9443 7323 -241 -2191 -3183 -2767 -1550 -1132 -796 -289 -296 -1735 -3267 -5311 -4611 -4420 -3950 -3021
4185 -3021 -970 683 1147 2195 3274 3643 3074 1380 -737 -2937 -5415 -5505 -640 185 -490 -1033 -1061 -394 -94
4165 -157 -89 36 195 69 165 320 -706 -1886 -2229 -1607 429 2977 3954 2520 728 -1313 -2488 -2418 -2205 -2579
4145 -2579 -3051 -2515 -1318 -517 -84 486 1020 1866 2713 2837 3008 3005 2947 1966 -257 -3015 -4703 -944 1453 1801
4125 1801 635 -2206 -4685 -3962 -4199 -3762 -3875 -4464 -4095 -3449 -1342 -1536 -1603 1746 3393 3133 2468 1225
4106 -102 -868 -1334 -2193 -2905 -3673 -4985 -4339 -1376 656 2339 3299 3594 3355 2565 1349 1433 984 666 691
4087 691 710 753 696 357 104 -62 -596 -1294 -1886 -2045 -1055 116 1078 1021 499 -542 -458 919 1548 916 -247 -1316
4065 -1316 -1037 18 413 480 -21 -190 -616 -844 -1091 -1377 -677 1005 2407 3266 3407 3070 2006 319 -2317
$$ packed form
4203I221K22k120b41j950r92M16J217M18L36b89pj439j532k044P00J91M70R29
4185c021i70F83M64J048J079L69n69A380g37k200k478r0f40A85d90n43k8c94i4
4165a57O8C6J59F9R6J55g06j180l43O22D29K548R77j434G28a313j175P0K13l74
4145b579m72N36J197e17h4D86N34Q46Q47J24J71ln8r81b57k758j688i44A453L48
4125A801F35b206k479P23k37M37j13n89L69O46a342j94o7A746J647k60o65A225
4106a02p66m66q59p12p68j312O46a376F56J683R60K95k39p90j216Q4m49l18K5
4087F91J9M3n7l39A04f2n34o98n92j59R90A16R62n7D99e42Q4I19O29o32b47j069
4065a316K79A8L95O7b1j69m26k28k47k86f77A005J402Q59J41l37j064C19b317
$$ plain form
4045 -8151 -10077 -9952 -7914 -288 3353 7106 9587 9844 7403 1760 -884 -2619 -2842 -1468 533 2088
4029 2088 2815 2556 1971 1152 336 -901 -2325 -3996 -4836 -6295 -3698 -3426 -3381 -2359 -2639 -3562 -3741 -4082
4011 -4082 -2900 -1897 -1266 -1153 -921 -623 -150 -198 -1080 -1557 -1934 -2151 -1587 -1244 -1162 -478 874 1861 2499 3218
3991 3218 3750 3751 4323 4332 3843 3273 2679 1765 667 231 938 1057 783 365 -77 267 451 552 327 265 -397 -1626
3969 -1626 -3062 -2753 -2546 -1160 -425 300 855 1374 2264 2862 2918 2026 504 -386 -572 626 2236 3519 3389
3950 3389 2345 1307 -64 -1222 -648 172 1354 2194 2637 2901 3049 3195 3239 2243 -3 -2589 -3459 -3353 -2500
3931 -2500 -1446 -856 -291 319 1229 2013 2616 2783 2405 1532 436 -845 -1691 -2325 -2054 -1383 -1347 -2028 -2915 -3783
3911 -3783 -4212 -2761 -822 1425 2470 3201 3099 2603 1865 2467 2773 829 75 -310 998 1449 2123 2833 3741
$$ packed form
4045h151j926J25K038b88C353L753K481K57k441A760h84j735k23J374E33J555
4029B088P27k59n85q19C36i01j424j671q40j459K597K72M5J022k80r23j79l41
4011d082J182J003O31J13K32K98a50m8q82m77l77k17N64L43Q2d78H74R87O38P19
3991C218N32JN72Rm89n70n94r14F67B31P07J19k74C65g7B67J84J01k25o2c97j229
3969a626j436L09K07a160d25C00N55N19Q90N98N6q92E04c86j86F26J610J283j30
3950C389j044j038f4j158N74A72J182Q40M43K64J48J46M4r96ck586q70J06Q53
3931b500J054N90b91C19R10P84O03J67l78q73D36h45q46o34K71O71L6o81q87q68
3911c783m29J451h22A425J045P31j02m96p38O02L06H29G5c10I98M51O74P10R08
$$ plain form
3892 3741 3700 3284 2434 2173 2147 2229 2093 2363 2345 2217 2506 2087 959 -654 -1853 -2666 -2440 -1881 -1087 -235 811
3870 1832 1745 624 -470 -1058 -1914 -2152 -1126 929 2777 4940 4142 3425 1649 -423 -991 1141 3695 6261
3852 6261 6962 5703 4746 3433 2131 921 253 -566 -1487 -1611 -1635 -2462 -3256 -3186 -2636 -1493 -1171 -1663 -2248
3833 -2248 -2980 -1604 32 520 452 745 349 908 2018 1871 2622 2202 1115 -836 -2353 -2701 -2023 -2452 -2064
3814 -2064 -1415 -840 138 5 -714 -1981 -3388 -5527 -3328 -904 -1498 -1922 -1598 -1420 -2294 -3593 -1627 -594
3795 -1222 -3234 -3501 -3184 -1763 595 342 937 1234 866 194 -679 637 1761 1682 1252 761 810 1345 1175
3776 1175 -53 -1948 -3452 -3228 -1206 583 1703 2115 1795 1077 1151 1875 2423 2231 1475 414 -709 -1190 425
3756 1122 585 -573 -1692 -2691 -2983 -2759 -2744 -2453 -2321 -1964 -1413 -429 834 1096 -97 -1967 -3962 -4356 -1651
$$ packed form
3892C741m1m16q50k61k6Q2j36K70j8j28K89m19I59f54j199q13K26N59P94b35H11
3870A832q7F24d70n88q56k38J026I29J848K163p98p17A649d23n68A141K554K566
3852F261P01j259r57j313j302I21B53e66r21j24k4q27p94P0N50J143L22m92n85
3833b248p32J376C2M88o8K93C49N59J110j47P51m20j087h36j517l48O78m29L88
3814b064O49N75A38Eg14j267j407k139K199i04n94m24L24J78q74j299a627e94
3795a222k012k67L17J421E95k53N95K97l68A94f79F37J124p9m30m91M9N35j70
3776A175e3j895j504K24a206E83J120M12l20p18P4P24N48j92p56D14g09m81D25
3756A122n37e73j119r99k92K24J5K91J32L57N51d29H34K62i7j870j995l94a651
$$ plain form
3736 671 1973 1829 409 -1648 -2232 -1509 -234 713 1127 1012 957 1491 1822 1697 896 -233 -126 2123 2850
3717 2850 4104 6113 7639 7871 3475 3219 3466 3396 3153 2676 2593 1699 525 -1012 -2145 -3636 -6069 -7891
3699 -7891 -6898 -2892 623 3354 6000 5684 3580 1931 286 -1341 -2538 -3094 -3151 -2739 -2001 -672 216 886
3681 886 482 186 -492 -1622 -2906 -3508 -3113 -2874 -2790 -2117 -805 -310 -928 -2232 -3539 -4502 -4757 -3758 -2306
3662 -2306 -496 1540 2977 3129 2227 342 -251 -906 -1376 -1489 -780 -784 -368 -423 -444 199 1340 2902 3658 3096
3642 3096 1947 720 332 46 726 1264 1703 1562 1372 608 -57 201 1127 2143 2188 1404 -97 -2614 -4189 -3855
3622 -3855 -3088 -177 -69 201 621 405 -339 -1817 -4718 -2803 1508 3167 3021 1334 -1328 -4090 -6968
3605 -6968 -6636 -3512 -1636 351 2372 3777 4389 4235 3845 3368 2354 1446 1079 1268 1575 2453 3087 3119
$$ packed form
3736F71J302j44D09a648n84P23b34G13M14j15n5N34L31j25q01b33J07B123P27
3717B850J254K009J526K32C475k56K47p0k43m77q3q94E25a012j133j491k433j822
3699g891R93b892F23K731K646l16k104j649B86a341j197n56n7M12P38f72B16O70
3681H86m04A86d92j130j284o02L95K39Q4O73h05c10o18j304j307r63k55R99J452
3662b306d96A540J437J52r02C42b51o55m70j13P09mc68n5k1A99J141J562P56n62
3642C096j149G20C32D6O80N38M39j41j90F08e7B01R26J016M5p84i7k517j575L34
3622c855P67a77f9B01M20k16c39j478k901J915A508J659j46A334a328k762k878
3605f968L32L124a636C51K021J405O12j54l90m77j014r08l67J89L07Q78O34L2
$$ plain form
3587 3119 2200 825 -991 -2351 -3990 -2827 -2654 -3262 -3223 -4467 -1629 -1071 -433 110 619 1151 1173 1199 1964
3568 1964 3210 4843 4073 2679 833 -763 -1380 -1100 -632 -82 96 -308 105 197 346 810 1368 1283 1378 2118
3548 2118 2806 3562 3125 1151 -541 -2732 -4834 -5674 -3698 -2728 -3762 -2288 -1674 -1442 -74 726 1964 2860
3530 2860 2682 1625 317 -918 -1878 -2449 -2303 -1568 -862 -276 -702 -679 1072 3539 6349 9128 9440 4395
3511 922 -2386 -3314 -1459 -306 237 41 -469 398 1557 2402 3538 3931 3845 3639 3219 1781 -716 -1602 846
3491 2132 2862 2626 1623 -165 -1674 817 3663 5336 9836 8602 953 -407 -1711 -1116 -1150 -2360 -3698
3474 -3698 -2792 1034 3857 4778 4055 1974 -86 -811 -658 174 1179 1698 1750 1179 679 -321 -845 -300 347
3454 -1157 -1816 -1172 440 2045 3374 5203 5835 8178 7841 6381 2874 1453 409 131 89 -182 -1173 -2361
$$ packed form
3587C119r19H25i91j360j639J163J73o08L9j244a629N58d33A10N09N32K2K6P65
3568A964J246J633p70j394H33g63o17K80M68h2I6c08A05R2J49M64N58q5R5P40
3548B118O88P56m37A151e41k191k102q40J976R70j034J474O14K32g4G26J238Q96
3530B860j78j057C17i18r60n71J46P35P06b76m26K3A072K467K810K779L12D395
3511I22b386r28a459c06B37D1d69C98J159Q45J136L93q6k06m20j438g16q86H46
3491B132P30k36j003a65j509H17K846J673M500j234I53d07j304N95l4j210j338
3474c698R06A034K823R21p23A974h6p25J53A74J005N19N2n71n00c21n24c00C47
3454a157o59O44D40J605J329J829O32K343l37j460B874j421D09A31m2a82r91j188
$$ plain form
3436 -2361 -3329 -3532 -3181 -1925 -1403 -1421 -1840 -1186 -1157 -1666 -1473 -1355 -1420 -2020 -2659 -3986 -5159 -2899 -2150
3417 -2150 -2138 -2027 -1343 -1125 -1081 -518 249 657 624 -247 -1020 -1796 -1796 -1643 -276 1761 2078 1686 1827 1966 2684
3396 2684 4324 6351 6476 5508 4398 3546 2449 1091 176 -271 3 10 -801 -2160 -2449 -1891 -351 686 1843
3377 1843 3517 4120 3031 1438 -423 -2101 -2038 992 2052 2029 1585 925 -338 -840 -820 595 3077 5351
3359 5351 5449 3782 2281 121 -2036 -3941 -5715 -3863 -2361 -973 -295 -765 -1999 -3862 -4336 -1923 23
3341 1706 2376 3231 3371 1425 1572 2032 1038 -257 -1941 -2938 -4307 -6130 -5741 -1574 1314 2429 3308
3324 3308 3522 3446 5278 6514 6722 6932 6178 5347 2489 349 -1219 -959 508 1034 438 -1002 512 885
3306 885 2615 2045 2499 2253 3086 3305 3641 3251 2311 1630 3069 3693 3834 3713 5357 6499 2105 1910
$$ packed form
3436b361r68k03L51J256N22j8m19O54K9n09J93J18o5o00o39j327j173K260P49
3417b150J2J11O84K18M4e18B49M08l3b47p73p76%J53b76A761L17l92J41J39P18
3396B684J640K027J25r68j110q52j097A091A76b71CPh01j359k89N58c51F86J157
3377A843J674O03j089A438d23j678O3I92J060k3m44o60c38n02K0E95K482K274
3359E351R8j667j501A21b036j905j774J852J502i73b95m70j234j863m74a923B3
3341A706O70Q55J40A425J47M60r94b57j684r97j369j823L89a574A314J115Q79
3324C308K14p6J832J236K08K10p54q31B489C49a219K60E08N26D38a002E12L73
3306H85J730n70M54k46Q33K19L36l90r40o81J439O24J41j21J644J142B105j95
$$ plain form
3288 1910 3981 4932 3852 3217 2248 1331 774 891 1503 2103 2557 2785 2110 1646 668 360 528 1397 2186
3269 2186 2592 2744 2498 2037 1376 455 -91 -355 -624 -1142 -1483 -1594 -1183 -337 458 703 1124 1510 2318 2520
3249 2520 2673 2254 1993 2014 2504 2637 1986 2187 1262 545 -290 -750 -1366 -2496 -3756 -3107 -1115 -390 906
3229 1171 1658 1494 760 -19 -1045 -2462 -4031 -6024 -9165 -8655 -4307 -3271 -1962 -1104 -553 -501 -1750
3212 -1750 -2797 -3831 -3336 -2505 -3106 -5429 -5873 -6119 -6017 -5619 -4890 -3693 -1399 1407 2673 1595 490
3194 -714 -1604 -2203 -1892 -478 294 1034 2405 3548 3137 -86 -2830 -4215 -10931 -7879 -5138 -4924 -5041 -1553
3175 -203 167 79 130 -509 -212 -216 259 -193 -1241 -2026 -2245 -1825 -1204 -855 -998 -1296 -572 600 2097 2880 2923
3154 2923 2537 2549 3015 3010 2454 1533 -191 -1775 -2101 -2085 -904 -70 787 952 1628 1993 1613 1020 247 -506 -1062
$$ packed form
3288A910K071R51j080o35r69r17n57J17O12O00M54K28o75m64F68l08J68Q69P89
3269B186M06J52k46m61o61D55i1k64k69n18l41j11M11c37D58K45M21L86Q08K02
3249B520J53m19k61K1M90J33o51K01r25E45b90m60o16j130j260O49a115c90I06
3229A171M87j64p34a9j026j417j569j993l141N10d307J036J309Q58N51N2j249
3212a750j047j034M95Q31o01k323m44k46J02L98P29J197a399A407J266j078D90
3194g14q90n99L11d78B94P40J371J143m11h6k744j385o716L052K741K14j17a553
3175b03A67G9N1e09b12mB59a93j048p85k19M20O21L49j43k98e72F00J497P83M3
3154B923l86J2M66nn56r21a91j584l26J6i04g0G87J65O76L65l80n93B47e06n56
$$ plain form
3133 -1062 -1211 -1780 -2078 -1692 -1499 -1496 -1641 -2142 -2812 -3159 -2818 -2262 -970 -223 14 367 441 686 432 -247 -1289
3112 -1289 -2057 -2026 -915 309 -56 -853 -1600 -2313 -2075 -1350 -544 -102 365 362 98 -694 -1524 -2912 -4030 -4594 -3791
3091 -3791 -2043 -469 537 604 764 1836 3275 4446 3626 9692 4626 2269 -160 -2260 -1398 -117 277
3073 71 234 -233 -1059 -1423 -2297 -1514 -604 432 990 1193 1260 1202 1056 1285 1987 2526 1590 -158 -1875 -3713
3053 -3713 -5519 -6589 -5826 -2887 -1622 -1068 -1221 -2383 -1092 167 742 1486 1923 2282 2044 1967 1459 569
3034 282 484 718 1145 808 -334 -1707 -2727 -1791 -544 859 2295 2989 3045 2540 897 -1146 -3096 -4942
3016 -4942 -7796 -1570 -1878 -2701 -2442 -824 536 -101 -1760 -3235 -3920 -3465 -2325 -1247 -399 231 684 926
2998 926 1209 1437 1860 1881 2052 2607 2876 2595 2155 1463 267 -712 -1009 -829 -550 -277 947 1350 490 -729
$$ packed form
3133a062j49n69k98L86J93Lj45n01o70l47L41N56i70b23A4L53P4K45k54b47j042
3112a289p68L1i15C09e6p97p47p13K38P25e44a02C65lI8f94q30j388j118n64Q03
3091c791J748d69E37O7J60J072J439J171q20O066D626B269a60k100Q62a17B77
3073G1J63b33q26l64q74P83f04D32N58K03O7n8j46K29P02N39r36a58j717j838
3053c713j806j070P63b887J265N54j53j162a092A67N75P44M37L59k38p7n08E69
3034B82K02K34M27l37c34j373j020R36e44H59J436O94N6n05H97a146j950j846
3016d942k854a570l08q23K59h24E36a01j659j475o85M55J140J078c99B31M53K42
2998I26K83K28M23K1J71N55K69k81m40o92B67g12k97J80K79K73I47M03D90g29
$$ plain form
2977 -1464 -925 -290 530 1030 1679 3184 5298 7630 9739 11925 12349 12631 11731 12065 3603 2511 3320
2960 3320 4154 4455 3811 3146 2728 1835 783 -167 -131 -96 -139 -693 -1739 -2917 -3697 -4638 -3378 -1970 -1259
2941 -1259 -834 -1004 -1544 -1701 -1125 -807 -990 -998 -816 -52 875 996 72 -905 -3641 -4413 -3999 -1500 1722 4489
2921 4489 5233 3834 2144 1001 1030 2396 3970 3013 2058 1357 1043 107 -790 -1369 123 1971 1924 632
2902 -384 -253 1037 2505 2567 1613 -520 -2241 -1885 866 3405 4066 3251 1639 13 256 1645 1901 1672 1641
2883 1641 2699 3869 4345 4073 3465 2878 1943 1406 1197 827 1076 1162 1360 1593 1872 1911 2006 2207 2948 3869
2863 3869 4631 4311 3097 1725 157 -1848 -2858 -3973 -3285 -1469 -815 -734 -757 511 2307 3289 3009 1505
2845 1505 -967 -3385 -1362 -406 -1033 -2286 -1973 -275 1183 1661 1181 -377 -1372 -2852 -2797 -3867 -3204 -1417
$$ packed form
2977a464N39b90E30N00O49J505K114K332K109K186M24K82r00L34C603j092Q09
2960C320Q34L01o44o65m18q93G83a67L6L5m3n54j046j178p80r41J260J408P11
2941a259M25j70n40j57N76L18j83qJ82e2H75J21G2i05k736p72M14a500A722K767
2921D489P44j399j690A001K9J366J574r57r55p01l14A07g90n79A23J848m7F32
2902c84J31A037J468O2r54e20j721L56H66K539O61q15j612A3K43J389K56k29l1
2883A641J058J170M76k72o08n87r35n37k09l70K49Q6J98K33K79L9R5K01P41R21
2863C869P62l20j214j372A57a848j010j115O88a469O54Q1k3E11J796R82k80j504
2845A505i67k418a362d06o27j253L13b75A183M78m80c77r95j480N5j070O63a417
$$ plain form
2826 -812 -1246 -1742 -2002 -2283 -2718 -3644 -4053 -4679 -5556 -4173 240 3541 6816 10152 10520 9988 9223 3033
2807 165 -1650 -2655 -2289 -2056 -1794 -1254 -1099 -721 152 -900 -2041 -2831 -3099 -4036 -4603 -4347 -3954 -3797 -3654
2788 -3654 -2540 428 2535 2471 1348 -689 -2265 -1691 -13 1811 2991 3376 2882 1675 359 -858 -1747 -487
2769 1593 2778 3068 2965 1857 301 -670 -787 -184 671 459 1381 1843 2492 3555 4557 8119 8799 7489
2751 7489 2465 399 -1224 -2228 -1707 -1310 -1157 -1094 -992 -1358 -1504 -1751 -2045 -2338 -2331 -2106 -1960 -1685 -467 449
2730 1064 1534 2294 2449 1935 544 -1214 -2476 -2666 -4534 -807 384 3688 4899 2164 1235 -666 -445 601
2711 1431 666 -1439 -2964 -2112 -699 1376 3576 4292 4294 3776 2724 1178 23 -876 -1601 -2054 -1883 -1240 -630
2692 -630 -687 -1503 -2630 -2680 -3191 -4295 -3434 -2407 -1479 16 1756 2279 2432 2449 2174 1999 1320 168 -638 -1120
$$ packed form
2826h12m34m96k60k81m35r26m09o26q77J383B40L301L275L336L68n32p65C033
2807A65a650j005L66K33K62N40J55L78A52i00j141p90k68r37n67K56L93J57J43
2788c654J114D28K107o4j123f89j576N74a3A811J180L85m94j207C59h58q89d87
2769A593J185K90j03j108C01f70j17a84F71k12R22M62O49J063J002L562O80j310
2751G489B465C99a224j004N21L97J53O3J02l66j46k47k94k93PK25J46K75d67D49
2730A064M70P60J55n14E44a214j262j90j868h07C84L304J211B164r29f66K21F01
2711A431F66a439j525Q52f99A376K200P16Kn18j052A178B3h76p25m53J71O43O10
2692f30n7q16j127n0n11j104Q61J027R28A6J740N23J53J7k75j75o79A68f38m82
$$ plain form
2672 -1120 -1895 -2600 -2758 -2121 -653 1936 3427 4091 3772 3297 3600 3682 3061 1901 89 -1652 -3025 -2270 -1106
2652 -972 -1225 -1301 -1181 -265 1271 1672 586 -1304 -773 600 1651 2474 2313 1277 -454 -1677 -2820 -3076
2634 -3076 -2373 -1069 -27 123 -955 -1867 -753 2231 4964 8251 10567 9853 7077 3382 1030 331 1855
2617 1855 3223 3423 3483 3734 3302 6025 5958 2339 1468 -202 -328 909 2904 4786 5536 4938 3671 2688
2599 2688 1972 1468 1062 1569 3038 3441 2760 1679 740 937 1604 1036 395 -648 -634 -800 571 460 411 957
2579 957 473 -1223 -3032 -942 1076 2280 3119 3159 2286 663 -545 -1237 -507 174 -207 -907 -993 -581 -59 162
2558 1439 3304 4336 4124 2941 1542 154 -1369 -3375 -4971 -5448 -5293 -3297 -3065 -3841 -3949 -4622 -4543
2541 -4543 -4129 -2825 -2889 -1978 -1515 -819 164 846 874 860 236 48 387 308 -202 -675 -934 -946 -620 -555 -787 131
$$ packed form
2672a120p75p05j58O37f53A936J491O64l19m75L03Q2o21j160H9a652j373P55a106
2652i72k53p6J20b65A271M01E86a304N31F00J051Q23j61j036d54j223j143k56
2634c076P03a069b7A23i55r12g53B231K733L287K316p14k776C382A030C31J524
2617A855J368K00O0K51m32K723o7B339q71b02j26I09J995J882P50n98j267r83
2599B688p16n04m06N07J469M03o81j081G40J97O67n68C95f48J4j66E71j11m9N46
2579I57D73a223j809i42A076J204Q39M0q73F63e45o92e07A74b07p00q6M12e9A62
2558A439J865J032k12j183j399A54a369k006j596m77J55J996K32p76j08o73P9
2541d543M14J304o4R11M63O96A64O82K8j4B36D8L39p9b02m73k59j2L26O5k32A31
$$ plain form
2518 1507 2865 2844 1913 -162 -2225 -1512 1973 5405 7634 8414 4704 2385 340 -1129 2117 5040 6840
2501 6840 7577 8194 1168 56 1366 1370 2023 2322 1469 695 -60 -109 1 -284 -332 -85 841 1443 482 -487 -106 -110 587
2477 1393 1479 1039 -111 -843 -917 -413 174 -836 -2089 -3410 -3901 -3028 -2731 -1200 120 -446 -935 -1793 -2632
2458 -2632 -2983 -2878 -1875 -966 -548 -668 -1588 -2754 -3993 -3663 -2943 -2233 -4195 -2497 -3170 -2607 -992 588
2439 428 840 914 393 563 682 828 1259 2185 3146 3829 3436 2017 -242 -411 923 2400 4225 6348 8430
2420 8430 7696 9761 8806 9977 6504 187 -666 -1673 -1522 -1436 383 1567 2123 1862 1304 401 -1002 -3195
2402 -3195 -5390 -7259 -6629 -4235 -545 519 268 -1109 -891 198 1412 2058 1871 -335 -3322 -6437 -6041
2385 -6041 -2441 474 1808 1531 1763 2324 2468 2475 2060 1255 483 -970 -2172 -2371 -1123 819 1791 2767 2534
$$ packed form
2518A507J358k1r31a62k063P13A973L432K229P80l710k319C40a129B117K923J800
2501F840P37O17A168E6J310MO53K99q53F95f0m9Ab84m8h5H41O02D82d87a06mE87
2477A393Q6m40a11p32p4d13A74h36j253j321m91Q73K97a200A20d46m89q58q39
2458b632l51J05J003R09M18j20r20j166j239L30P20P10j962J698o73N63i92E88
2439D28M12P4C93J70J19J46M31R26R61O83l93j419b42j69I23J477J825K123K082
2420H430p34K065r55J171l473A87f66j007J51Q6C83J184N56k61n58D01a002k193
2402c195k195j869O30K394e45E19k51a109K18A98J214O46j87c35k987l115L96
2385f041b441D74J334k77K32N61J44Pm15q05D83i70j202j99a123H19R72R76k33
$$ plain form
2366 2534 1137 -751 -2770 -3944 -3323 -1186 1219 2669 3332 3398 2446 623 -2103 -2934 -3207 -3808 -4826
2349 -4826 -6481 -1115 3241 6967 10460 11827 10167 6584 -578 -40 2148 4158 5107 4640 3954 2508
2333 2508 400 -1955 -1818 955 3514 5002 6310 5400 3957 1716 -19 -1133 -1400 -561 353 702 770 1171
2315 1171 358 -538 412 700 854 1062 1249 1508 1517 1026 389 -604 -1199 72 1334 2501 4375 7441 9153
2296 9153 9976 9614 8562 4262 2554 742 -163 -1099 -2401 -4113 -6049 -6068 -4399 -3166 -1668 -896 -523
2279 -523 -1349 -380 428 571 405 -555 -2546 -12221 -4438 -3575 -3024 -2580 -2479 -2980 -4111 -6163 -6231 -4980
2261 -4980 -1401 497 2064 2924 3226 3066 1908 1550 1904 1787 660 -865 -2444 -4055 -6647 -7704 -7667 -6005
2243 -6005 -3842 -876 1631 1548 -106 -1635 -1240 -585 -1086 -2366 -3637 -3152 -1616 -1240 -1240 -2185 -3792 -4599
$$ packed form
2366B534A137g51k019j174O21a186A219J450O63O6r52F23b103q31k73o01j018
2349d826j655a115C241L726L493J367j660l583e78d0B148K010R49m67o86j446
2333B508D00a955J37I55K559J488J308r10j443A716a9j114k67e61C53L49O8M01
2315A171C58e38D12K88J54K08J87K59Rm91C89f04n95G2J262J167J874L066J712
2296I153Q23l62j052D262j708G42a63r36j302j712j936j9J669J233J498P72L73
2279e23q26c80D28J43j66e55j991r675d438Q63N51M44J01n01j131k052o8J251
2261d980a401D97J567Q60L02j60j158l58L54j17F60h65j579j611k592j057L7J662
2243f005K163h76A631q3a06j529L95e85n01j280j271M85J536L76%r45j607q07
$$ plain form
2225 -4599 -5107 -5332 -3050 -1523 -69 873 943 785 782 913 607 -473 -1525 -2541 -4175 -6349 -9675 -12778
2207 -12778 -6106 -3048 -594 753 1307 1878 3190 3934 4462 3723 1729 -285 -2261 -2543 -425 1392 2566
2190 2566 3234 2633 2458 1835 447 -1394 -3258 -4193 -3648 -2660 -592 1196 2818 4347 4571 3255 1726
2173 1726 -185 -1769 -2180 -2052 -1648 -1818 -2545 -3842 -4947 -4201 -3558 -3008 -2747 -2324 -1074 -105 783 1470
2155 1470 1632 1104 3115 6083 6218 -1430 813 6492 9036 10267 9445 8311 6786 7205 4096 3833 3663
2138 3663 3359 2662 1365 49 -1372 -1262 -86 1474 2406 2304 1508 1364 486 -486 -1816 -2129 -656 1295 2304
2119 2304 2481 1751 268 -1550 -3896 -7305 -6622 -3901 -1685 -625 -1020 -1831 -2446 -3115 -1011 -3388 -4608
2102 -4608 -8733 -8997 -7607 -6755 -2359 -1172 -776 -757 -1591 -2633 -3595 -4049 -4533 -4021 -4870 -3578 -5179 -2655
$$ packed form
2225d599n08k25K282a523f9H73P0j58lJ31l06d73j052j016j634k174l326l103
2207a2778f106c048e94G53N54N71J312P44N28p39A729b85j976k82d25A392J174
2190B566O68o01j75o23D47a394j864r35N45R88e92A196J622J529K24j316j529
2173A726a85j584m11J28M04j70p27j297j105P46O43N50K61M23a074a05G83O87
2155A470J62n28K011K968J35a430H13N679K544J231q22j134j525M19l109k63j70
2138C663l04o97j297D9a372J10h6A474R32j02p96j44D86d86j330l13f56A295J009
2119B304J77p30B68a550k346l409O83K721a685f25l95q11o15o69a011k377j220
2102d608m125k64J390Q52b359a172L96J9q34j042r62m54m84N12q49J292j601K524
$$ plain form
2084 -2655 -1045 -1870 -2540 -2718 -2493 -2754 -2746 -2595 -2859 -3802 -5173 -5734 -4012 -3286 -2332 -1807 -1031 -93 381 566
2064 566 618 517 409 -303 -1117 -1888 -2038 -1713 -1556 -1051 30 1019 1256 1397 1317 1898 2624 3009 2378 1167 -122
2042 -2411 -3879 -3125 -1206 -1874 -3304 -5839 -6187 -3784 -553 1587 1658 1009 -12 55 391 1422 1938 1767
2024 1767 1088 181 -187 -103 376 116 -241 -930 -1178 -471 681 1100 1189 801 466 -343 149 1838 3606 4935
2004 4935 5051 4667 3709 2140 1018 -19 -828 -1100 -226 895 924 985 1517 1959 1907 1280 134 -1073 -355 2173
1983 3417 3600 2935 1565 -488 -2561 -5307 -6029 -747 2785 3752 3394 1796 -521 -2600 -863 833 1600 1244
1965 1244 267 -246 -613 -337 -680 -508 -193 743 1073 5608 7511 1767 4288 1601 -393 -2647 -1905 1774
1946 4628 6855 7946 7875 6936 3025 -618 -2085 -1216 -577 -1587 -3430 -2572 -1611 -918 -584 -552 228 1388
$$ packed form
2084b655a045q25o70j78K25k61QJ51k64r43j371n61J722P26R54N25P76i3C81J85
2064E66N2j01j08c03q14p71j50L25J57N05C0R89K37J41q0N81P26L85o31A167a22
2042b411j468P54a206o68j430k535l48K403e53A587P1o49a2E5L36J031N16j71
2024A767o79A81a87Q4C76A16b41o89k48d71F81M19Q9l88l35c43A49J689J768J329
2004D935J16l84r58j569A018a9q09k72b26H95K9O1N32M42n2o27A34a073c55B173
1983C417J83o65j370d88k073k746p22g47B785R67l58j598e21k079h63H33P67l56
1965A244B67b46l67K76l43J72a93G43L30M535J903A767K521A601c93k254P42A774
1946D628K227J091p1r39C025f18j467Q69e77j010j843Q58R61O93L34L2B28J160
$$ plain form
1928 1388 1973 1843 1301 340 -469 -887 -5 1417 2312 2387 1769 631 -354 -758 -1795 -2882 -3096 -2682 -1095
1908 1422 2827 3718 2798 1235 -602 -914 -790 -480 -723 -1303 -1041 -592 -1169 -2361 -3628 -5031 -7751 -10252
1890 -10252 -12042 -8780 -3501 -1998 -1239 -1118 -1098 971 4169 4486 3548 1831 -67 -1924 -3051 -2646 -1549
1873 -1549 -284 -162 -903 -718 -487 -832 -1308 -2761 -4186 -3612 -1836 -95 919 1346 879 -190 -830 -1319 -1127
1854 -1127 -971 -702 -66 687 1847 3174 3573 2910 1444 282 730 2064 3036 3797 3814 3351 2815 2963 3313
1835 3313 4061 4044 3372 2608 1921 1519 906 485 188 -869 -876 -363 -82 -632 -925 -1979 -2489 -2788 -2095 -1228 -1173
1814 -1173 -1832 -2644 -3572 -5401 -4681 -3223 -682 22 -47 -1030 -1799 -2256 -2273 -1917 -1036 -297 114 275 -54 -1156
1794 -1156 -2238 -1184 -189 666 953 1048 646 796 987 1808 1579 737 1083 2769 3477 4793 5887 5995
$$ packed form
1928A388N85j30n42C40d69m18eA417Q95P5o18F31c54m04j037j087k14M14a095
1908A422J405Q91r20A235f02l12J24L10k43n80K62M49n77j192j267j403k720k501
1890a0252j790L262c501J503P59J21K0I71L198L17r38j717f7j857j127M05J097
1873a549b84J22p41J85K31l45m76j453j425N74J776i5I19M27m67a90o40m89J92
1854a127J56K69f6F87J160J327L99o63A444B82M48J334R72P61J7m63n36J48L50
1835C313P48j7o72p64o87m02o13m21A88h69pc63h2n50k93j054n10k99O93Q67N5
1814a173o59q12r28j829P20J458f82B2d7r83p69m57j7L56Q81b97A14J61e4j102
1794a156j082J054a89F66K87R5m02J50J91Q21k29G37L46J686P08J316J094J08
$$ plain form
1776 5995 4764 1024 -576 -2148 -2438 409 3278 4307 4427 3431 2096 503 -1192 -1365 37 3351 4947
1759 4947 3410 1103 581 1645 3111 4861 8567 9926 12567 11300 3213 3034 2930 3445 1674 2058
1743 2058 1318 753 907 1660 2616 2923 2375 1247 -265 -1078 -2230 -2014 -1998 -75 1079 3169 4980 5120 4964
1724 4964 3976 2634 1229 -229 -1924 -2632 -1464 -1286 -1139 -1223 -1677 -1815 -1112 27 903 1809 2426 3210 3561
1705 3561 3290 1999 494 -963 -2070 -1549 -1997 -4120 -10634 -11332 -9334 -3034 -846 686 1387 1939 2090 2285
1687 2285 1927 1192 128 -1723 -4059 -7028 -7285 -3393 954 3541 4482 3644 1623 -818 -1956 358 1620
1670 1620 1010 -580 -108 1664 3003 3512 2302 673 -871 -1505 -2115 -2047 -854 208 299 -593 -81 1487 2324
1651 2324 2511 1638 1667 1988 834 -979 -2507 -1040 44 1319 2519 3373 3968 4253 4210 3203 1361 -633 -2625
$$ packed form
1776E995j231A024e76j572k90D09K869J029J20r96j335E03a192j73C7L314J596
1759D947j537A103n22J064J466J750L706J359K641j267C213j79j04N15A674L84
1743B058p40n65J54P53R56L07n48j128b65q13j152K16J6g5A079K090J811J40j56
1724D964r88j342A229b29j695p08J168J78J47q4m54j38P03B7Q76R06O17P84L51
1705C561k71j291D94i63j107N21m48k123o514o98J998c034h46F86P01N52J51J95
1687B285l58p35A28a723k336k969k57c393I54K587R41q38A623h18j138C58J262
1670A620o10e80a08A664J339N09j210F73h71o34o10O8h54B08R1e93h1A487Q37
1651B324J87q73K9L21H34i79j528a040D4J275J200Q54N95K85m3j007A361f33j992
$$ plain form
1632 -2625 -2737 -726 41 -185 -1322 -2768 -1949 215 1283 2124 2600 2752 2659 3468 3505 4516 5752 6308 6284
1613 6284 5434 2110 996 6960 8733 6791 -438 198 1110 2661 3508 3301 2158 799 -400 370 2799
1596 2799 5240 4994 4130 2630 1375 -132 -1778 -3171 -5177 -6664 -5926 -10098 -1643 543 1638 1225
1580 1225 -397 -1461 -1067 -257 171 -39 -664 -1418 -1626 -828 149 492 572 -982 -1854 -2466 -2023 -1264 -259 91
1559 1111 2029 2256 2083 1122 -360 -916 -171 298 374 505 -115 -1392 -1797 -1187 228 -102 -794 -1312 -2049 -1450
1539 -1450 -651 1030 1569 1456 885 -616 -1964 -2161 -1038 636 1411 1945 2284 2763 3566 4130 4553 3851 1665
1519 -1579 -4783 -4667 -1004 794 1509 1185 615 -801 -45 -30 -615 -1242 -1308 -1205 -1659 -2589 -3989 -5524 -6071
1500 -6071 -5765 -2962 -1508 -1455 -1937 -2874 -3982 -4887 -4799 -3543 -1882 -538 -64 -180 425 923 1197 1048 1565
$$ packed form
1632b625j12g26D1a85j137j446Q19B15J068Q41M76J52r3Q09L7J011J236N56k4
1613F284q50B110I96N964J773j942d38A98R12J551Q47k07j143G99d00C70K429
1596B799K441k46q64j500j255a32j646j393k006j487P38m172a643E43J095m13
1580A225c97j064L94b57A71c9o25p54k08P98A49L43Q0i82q72o12M43P59b59I1
1559A111R18K27j73r61c60n56a71B98P6J31a15j277m05O10B28a02o92n18p37N99
1539a450f51A030N39j13n71f16j348j97a038F36P75N34L39M79Q03N64M23p02A665
1519a579l204J16a004G94P15l24n70h01d5J5n85o27o6J03m54r30j400j535n47
1500f071L06K803J454N3m82r37j108r05Q8J256J661e38f4j16D25M98K74j49N17
$$ plain form
1481 1565 1838 2057 1398 247 -1158 -2308 -1803 548 2127 3253 2472 507 -1473 -2841 -1511 445 1694
1464 1694 2271 1927 723 -695 -1427 -3749 -4669 -5124 -4865 -2761 111 2084 1589 -457 -2820 -3991 -3752 -1287
1445 -482 53 267 916 1275 1272 714 474 54 -27 718 1023 893 954 977 1209 1547 752 -161 -171 -272 -659 -1600 -1673
1422 -1673 -2148 -2122 -1163 -863 -624 944 2630 3434 2723 1363 710 343 362 1511 2188 2385 2782 2787 2681 1683
1402 1683 -142 -1001 -1783 -2186 -3114 -3428 -3510 -3407 -3429 -3530 -2393 -354 524 -154 -625 -1180 -1622 -1577 -716 852
1381 2205 1874 1760 838 794 -96 -534 -439 -147 -90 -608 -1559 -2765 -3807 -3808 -2940 -521 979 1185 527 -203 -159
1360 -159 698 1626 2065 1564 1782 1796 332 3084 -2682 -4608 -5286 -5017 -4116 -2511 -583 1059 2004 2354 2936
1341 2936 2590 2501 2020 1399 1132 293 -545 -1408 -2354 -2955 -3418 -2335 -485 1331 2378 1991 433 -547 -857
$$ packed form
1481A565K73K19o59B47a158j150N05E48J579J126p81E07a473j368J330D45J249
1464A694N77l44G23f95p32k322r20m55K59K104A11J973m95d57k363j171K39a287
1445d82E3K14O49L59ln58k40E4b7G18L05j30O1K3K32L38G52a61j0j01l87r41p3
1422a673m75K6R59L00K39I44J686Q04p11j360o53C43J9J149O77J97L97Nj06r98
1402A683a42q59p82m03r28l14q2J03k2j01J137c54E24a54m71n55m42M5g16H52
1381B205l31j14H38m4i6m38R5a47N7n18r51j206j042jQ68e21I79K06E27b03M4
1360a59F98R28M39n01K18J4C32K752b682j926o78K69R01J605e83A059R45L50N82
1341B936l46q9m81o21k67B93e45q63r46o01m63J083d85A331J047l87D33e47l10
$$ plain form
1322 -857 -986 -681 -125 343 499 320 -27 -293 -599 -852 -1117 -1409 -1317 -539 499 1730 2977 2873 1567 -170
1301 -1383 -2065 -2769 -3863 -4498 -2802 -554 1614 2679 3066 2927 2268 1969 1489 836 975 1384 2645 3348
1283 3348 4202 4396 4116 3341 2248 1177 1238 1772 1725 347 -737 -667 -179 307 1509 3116 3969 4120 3777
1264 3777 2696 1572 1236 1370 922 23 -446 -301 338 472 647 298 -1103 -2920 -3773 -2797 -853 1519
1245 2447 2530 1713 186 -1893 -4399 -8375 -7663 -3884 -1128 -513 -393 -309 -1089 -2151 -2822 -3669 -2817 -1621
1227 -1621 -1047 -856 -955 -834 -625 -706 -1663 -2474 -2532 -2867 -3375 -3324 -2587 -1719 -925 25 1247 2652 3805 3949
1207 3949 3199 2276 1640 2061 2176 1956 1713 2907 4753 5889 6026 4209 2050 -361 -2442 -3489 -1469
1189 1427 3670 4794 7607 8248 6891 4448 2509 279 -1663 395 1544 2629 3002 2551 2016 1460 1388
$$ packed form
1322h57j29L05a25C43J56j79b7k66l06k53k65k92R2e39D99J231J247j04j306a70
1301a383o82p04j094o35J696e54A614J065L87j39o59k99m80o53J39M09J261P03
1283C348Q54J94k80p75j093j071O1N34m7C47g37P0a79C07J202J607Q53J51l43
1264C777j081j124l36J34m48B3d46J45C38J34J75B98a103j817q53R76h53A519
1245B447Q3q17A86a893k506l976P12L779a128e13J20Q4p80j062o71q47Q52J196
1227a621N74J91r9J21K09q1r57q11n8l35n08N1P37Q68P94B5J222J405J153J44
1207C949p50r23o36M21J15k20k43J194J846J136J37j817B050c61k081j047a469
1189A427K243J124K813O41j357k443j939B79a663C95J149J085L73m51n35n56p2
$$ plain form
1172 1388 1877 2752 3513 3305 1906 276 -739 -732 413 1033 594 -442 -1068 -958 -147 769 1390 1558 908 105
1151 -446 -1329 -2760 -4073 -6308 -8930 -11678 -4806 -2877 -759 1504 2471 1062 -6469 -8395 -3371 -2560
1135 -2560 -1584 -1018 -201 1460 2248 1869 765 227 842 2352 4335 6456 6385 3510 491 -2557 -3540 -2477
1117 -2477 -1821 -1383 -1477 -2172 -1526 -273 431 300 -577 -2051 -3567 -1736 -6 1317 1276 1048 -286 -1176 -1867 -2941
1097 -2941 -4062 -4545 -3634 -2069 -955 -227 -327 -253 -67 293 842 819 285 -828 -1212 174 2161 3664 4051
1078 4051 6653 4453 -773 -2787 -4430 -3036 -1498 -758 -773 -1287 -1763 -1754 -1573 -547 150 846 1696 2189 2637
1059 2637 2101 888 -570 -1339 -1176 -1099 -1320 -1652 -2453 -2612 -374 2010 3894 4770 3722 1822 -1192 -2208
1041 -2208 -2318 -1291 236 1133 709 168 -304 -732 -931 -1219 -1525 -870 510 2285 3279 3742 3305 2174 424
$$ packed form
1172A388M89Q75P61k08j399B76g39PD13O20m39d42o26J10a47G69O21J68o50A05
1151d46q83j431j313k235k622k748d806J929g59A504R67A062f469j926c371Q11
1135b560R76N66b01A460P88l79G65B27O15J510J983K121p1k875D91b557r83J063
1117b477O56M38r4o95O46b73D31j31e77j474j516a736fA317m1k28b86q90o91j074
1097b941j121m83R11J565i55b27j00P4f7B93N49k3B85h28l84A74J987J503L87
1078D051K602k200g73k014j643J394a498P40j5n14m76RJ81e47A50O96Q50M93M48
1059B637n36H88e70p69J63P7k21l32q01j59c74B010J884Q76j048A822a192j016
1041b208j10J027B36Q97m24A68c04m28j99k88l06O55E10J775R94M63m37j131D24
$$ plain form
1021 -2288 -2670 -2030 -1857 -1602 -647 1036 2853 3167 2661 2029 1537 564 -122 -1132 -1329 -834 -153 370 612
1002 612 185 -32 -916 -1594 -2053 -2314 -1518 -908 -1052 -1834 -2448 -2555 -2151 -2154 -1684 -1019 -226 274 583 -24 587
980 1448 2062 2212 1868 1571 1020 785 633 1542 3051 4222 4379 3456 1491 -635 -2808 -3838 -3915 -2651
962 -2651 -765 -222 -1919 -3582 -4237 -3664 -2605 -1863 -2070 -2725 -3083 -2923 -2131 -1278 -1534 -1806 -1373 -675 509
942 1506 2139 1819 1236 608 98 163 403 683 1931 5328 7351 7237 4369 1160 -1104 -1013 1137 2370
924 2370 2628 2720 2520 1952 1107 124 -43 805 1600 2351 2972 3120 2361 634 -1827 -3811 -5411 -4548 -1478
904 306 647 1784 2661 3731 5071 5867 7414 8159 5544 2461 679 -1202 -2459 -1796 -633 49 499 -12
885 -2546 -3062 -49 3111 6352 6364 7300 6901 3428 -302 -2457 -2652 -2534 -2675 -2133 -1221 -615 -394 -833 -1698
$$ packed form
1021b288l82O40J73K55f47A036J817L14n06o32m92E64a22j010j97M95a53C70K42
1002F12A85c2q84o78m59k61P96O10j44p82o14j07M04lM70O65b26B74L09b4E87
980A448O14J50l44k97n51k35j52R09J509J171J57r23A491f35k173j030p7J264
962b651g65b22j697j663o55N73J059P42k07o55l58J60P92Q53k56k72M33f75E09
942A506O33l20n83F08I8O5K40K80J248L397K023j14k868A160a104R1A137J233
924B370K58R2k00n68q45A24d3H05P95P51O21J48p59F34a827j984j600Q63a478
904C06L41J137Q77J070J340P96J547P45k615B461F79a202j257O63f33D9M50a2
885b546n16d9C111L241J2R36l99C428c02k155j95J18j41N42R12O06K21m39q65
$$ plain form
866 -1698 -2322 -2036 -562 1285 2440 2947 2169 1737 2145 2463 3096 3117 2668 1987 1295 1221 1348 849 55 44 148
845 148 273 330 -138 -482 293 2063 3777 4276 4073 3546 2951 2646 2060 836 -844 -2560 -3962 -5323 -2593
825 263 2700 4037 5766 5053 3180 999 173 1007 1633 1058 777 1816 1924 993 -882 -2427 -1891 -1731
807 -1731 -1682 -2307 -2547 -2601 -2977 -3331 -3775 -2371 4 1139 1037 -77 -2171 -3248 -213 2630 4150 4719 3541
788 3541 1836 -181 -1340 -1958 -2214 -1969 -974 302 201 135 -352 -857 -575 -968 -1270 -1289 163 2461 3131 1358
767 -774 -2899 -5153 -7497 -8727 -7855 -8917 -12485 -14592 -15193 -13381 -10477 74 2844 4060 3730 2314 1107
749 958 766 -361 -1853 -2787 -6182 -3951 326 1777 15 -2405 -4093 -4764 -4182 -1452 1597 2728 3081 2834
731 2834 1896 493 -1341 -1903 -2601 -3053 -2518 -1614 -1400 -1047 -836 -696 405 479 -455 -79 385 523 618 -55 -1128
$$ packed form
866a698o24K86e62A285J155N07p78m32M08L18O33K1m49o81o92p4J27m99E5j1J04
845A48J25N7a38l44B93J770J714M99k03n27n95l05n86H36h44j716j402j361b593
825B63K437J337J729p13j873I99A73Q34O26n75k81J039J08r31h82j545N36J60
807a731M9o25k40n4l76l54m44J404DJ135j02g7k094j077b13B630J520N69j178
788C541j705a81j159o18k56K45i74C02j01o6c52n05K82l93l02j9A63K298O70A358
767g74k125k254k344j230Q72j062l568k107o01J812K904G4K770J216l30j416A107
749I58j92c61j492r34l395K231C26J451A5b405j688o71N82a452A597J131L53k47
731B834r38D93a341n62o98m52N35R04K14L53K11J40D05P4d55g9C85J38R5e5j073
$$ plain form
710 -1128 -2341 -3570 -3910 -4441 -4769 -5455 -5707 -5349 -4773 -3406 -1171 1273 2992 3404 2525 1358 391 -32
691 -638 -1864 -3051 -2642 175 2453 3710 3649 2992 2141 1245 1224 1251 1141 498 -456 -1800 -3104 -3014 -2860 -2116
671 -2116 -1792 107 1836 2013 277 -1648 -3031 -1320 710 1879 1602 430 -1084 -2117 -463 2525 3473
654 3473 3401 1742 7225 6750 -593 -1136 -946 88 1591 3021 4132 4163 2882 1040 -1271 -1399 840 2221
636 2221 2712 2560 1231 1219 2138 2692 2315 741 13 -598 685 840 6 -1456 -3512 -4329 -1979 291 1207 854
616 854 -427 -258 497 409 -231 -1491 -3726 -5431 -5933 -5409 -4313 -2988 -1899 -1653 -961 -791 -2522 -3286
598 -3286 -3373 -2830 -1683 -695 -743 -1785 -2238 -808 734 2071 1792 930 672 1416 2351 3004 3224 2942 2332 1370
578 1370 1030 1475 529 -544 -1659 -2127 -2027 -1758 -1432 -1324 -838 22 1244 2512 5038 5293 5806 5584 2930
$$ packed form
710a128j213j229l40n31l28o86k52L58N76J367a171A273J719M12q79j167C91c2
691f38j226j187M09A75K278J257o1o57q51q96k1K7j10D98d56j344j304R0J54P44
671b116L24A07J729J77B77a648j383a320G10J169k77D30a084j033d63B525R48
654C473p2j659N483m75e93n43J90H8J503J430J111L1j281A040a271j28H40J381
636B221M91j52A231j2R19N54l77G41A3e98F85J55Fa456k056q17a979B91R16l53
616H54d27J69D97q8b31j260k235j705n02N24J096J325J089K46O92J70j731p64
598c286q7N43J147f95m8j042m53h08G34J337k79q62k58P44R35O53K20k82o10r62
578A370l40M45E29e44j115m68J00K69L26J08M86B2J222J268K526K55N13k22k654
$$ plain form
559 2930 -1329 -2446 -1833 -466 -238 -699 696 1495 748 152 546 1428 2088 2841 1894 -882 -3266 -3587 -1423
539 -517 -53 316 918 1701 2446 3182 2823 1527 -915 -4030 -4959 -4838 106 965 361 -565 -2374 -2761 531 2762
519 2762 3054 3048 3525 3981 4345 4755 5092 5123 3426 1987 561 -535 -1423 -1082 378 1653 2800 3268 2565 1054
498 -477 -1417 -1011 -23 582 1441 2570 3997 5410 5611 4208 3543 3304 3304 2980 1797 -186 -2132 -3055 -2817
479 -2817 -2233 -1356 -1276 -118 -255 -1564 -3298 -2548 -1281 -496 -516 -910 -1896 -2971 -3331 -2618 -1063 -336 -342 -504
459 -504 -1058 -1430 -1709 -1672 -972 19 635 952 541 -122 -818 -221 382 402 -349 -1612 -2558 -3789 -4508 -847 638
437 275 -405 -1281 -1799 -2539 -3547 -3505 -2781 -1469 -141 952 1349 1481 1031 936 -615 -2550 -2645 -971 686 1839
417 1839 2285 2073 1912 1898 2027 1979 1422 955 276 -452 -766 -2314 -2468 -553 503 800 313 465 240 -11 -44
$$ packed form
559B930a329j117O13d66K28m61F96P99p47A52L94Q82O60P53r47h82k384l21a423
539e17e3C16O02P83P45P36l59j296i15l115r29J21A06Q59C61e65j809l87E31K231
519B762K92oM77M56L64M10L37L1j697j439E61e35q88L41C78J275J147M68p03A054
498d77r40M06b3E82Q59J129J427J413K01j403o65k39%l24j183a86j946r23K38
479b817N84Q77Q0a18j37j309j734P50J267d96k0l94r86j075l60P13a063c36oj62
459e04n54l72k79L7P00A9O16L17m11a22o96b21C82K0c49j263r46j231p19h47F38
437B75d05q76n18p40j008M2P24J312a41I52L97J32m50r5f15j935r5i71F86J153
417A839M46k12j61j4J29m8n57m67B76d52l14j548j54e53E03K97C13J52k25a1l3
$$ plain form
396 -44 320 1488 1694 1312 1105 1099 691 308 20 568 1675 2720 3291 2767 1988 1337 -117 -1140 -2426 -2976
376 -2976 -3266 -2966 -1178 1112 2332 1859 550 -623 -2066 -3292 -2953 -847 1338 1689 1365 403 115 -264
357 647 910 366 163 -117 -174 -923 -2421 -1552 107 2481 4275 5216 5980 7560 3613 1961 467 -335 -941
338 -941 -1160 -1013 -742 -439 -402 -471 149 697 756 351 -452 502 2327 3087 2678 1718 167 -1856 -1217 -935 -1397
317 -1397 -1655 -1114 -369 301 1028 2270 3390 4077 3511 1741 -15 -1881 -3202 -4349 -5871 -5313 -2260 -128
298 542 697 1041 1538 1637 -16 -1439 -1392 158 1377 1592 1246 331 -236 -564 -1294 -1427 -253 764 1896 1980 1387
277 1387 -402 -2015 -1186 1207 1728 794 -536 -1618 -2498 -2148 -602 1784 2918 3191 1230 -1324 -1434 -660
258 -612 -845 -1045 -1010 -154 1824 3710 5892 8883 10258 10921 9524 6916 2617 1098 315 -918 -1820 -2050
$$ packed form
396d4C20J168K06l82k07om08C08B0N48J107J045N71n24p79o51a17j023j286n50
376b976k90L00a178A112J220m73E50f23j443j226L39h47A338L51l24D03A15b64
357F47K63C66A63a17n7p49j498Q69A07K374J794R41P64J580C613j652D67c35o06
338i41k19J47K71L03L7o9A49N48N9C51d52E02J825P60m09r60A67a856O39K82m62
317a397k58N41c69C01P27J242J120O87n66A741a5j866j321j147j522N58b260a28
298E42J55L44M97R9a6j423M7A58J219K15l46C31b36l28p30j33b53G64J132Q4n93
277A387d02j613Q29A207N21G94e36j082q80L50f02A784J134K73A230a324j10f60
258f12k33k00L5a54A824J886K182K991J375O63j397k608B617A098C15i18r02k30
$$ plain form
240 -2050 -1588 -197 2020 2887 2584 1783 896 -477 -525 811 929 164 -1595 -3567 -5651 -5157 -2256 -823 -480
221 -480 -620 -888 -909 -548 -206 342 622 649 821 1021 1009 716 250 162 1079 1465 1093 355 255 252 650 939
199 939 1525 1603 677 -999 -2196 -2198 -1695 -1197 -691 -144 92 -280 -1168 -2033 -2147 -1850 -1797 -3018 -3973 -4449 -4268
178 -4268 -3227 -2092 -1242 -313 216 967 1826 2627 3382 3930 3613 2993 2056 1251 994 837 319 -107 -754
159 -754 -960 -1881 -2921 -3601 -4649 -6715 -7218 -3563 -1669 -727 -681 -302 -495 -359 212 -90 -690 -1411 -1903
140 -1903 -2148 -1757 -421 890 1365 1298 1302 1366 1477 1528 1052 829 373 183 190 954 1706 1999 1291 313 -658 -1008
118 -1008 -826 -327 250 869 839 263 -791 -1490 -2268 -870 1080 2217 3304 3401 2641 1171 -524 -1997 -2027
99 -2027 -1765 -1577 -1773 -1939 -2239 -2395 -2629 -2814 -2602 -3663 -1467 -853 -822 -1393 -1979 -2109 -1631 -609 -48 -181
$$ packed form
240b050M62a97B020Q67l03q01q87d77m8H11J18A64a595j972k084M94b256h23L43
221d80j40k68k1L61b06C42K80K7J72K00j2k93B50q8R17L86l72C55j00lL98K89
199I39N86P8F77i99j197kN03M98N06a44I2b80q88q65j14K97N3j221r55m76J81
178d268J041J135Q50c13B16P51Q59Q01P55N48l17o20r37q05k57j57C19a07o47
159g54k06r21j040o80j048k066n03c563a669g27M6c02j93J36B12i0o00p21m92
140a903k45L91d21H90M75o7MO4J11N1m76k23C73A83PP64P52K93p08C13f58l50
118a008J82c27B50O19l0B63g91o99p78h70A080J137J087R7p60A171e24j473l0
99b027K62J88j96j66l00j56k34j85K12j061a467O14L1n71n86j30M78f09d8j33
$$ plain form
79 -181 -1130 -1360 -1411 -1575 -1601 -1030 -303 158 154 616 1265 1895 2314 2380 2530 2934 3214 3106 2462 1373 486 332
57 332 533 462 -133 -2070 -3456 -4216 -2745 -780 434 1236 1287 832 -11 -1157 -1634 -1219 -819 -1670 -1698 -1286 -1823
36 -1823 -1857 -1032 -347 97 526 344 -28 -657 -1373 -1728 -72 1141 1172 440 -357 -859 -1199 -1121 -1025 -1117 -1069 -876 -436
12 -182 -59 195 967 1802 2997 4210 2984 1344 -686 -2163 -2771 -2116
0 -2116
$$ packed form
79a81r49k30n1j64k6N71c03A58mM62O49O30M19O6J50M04K80j08o44j089D86j54
57C32K01p1a33j937j386p60J471g80D34Q02N1m55a1j146m77M15M00q51k8M12n37
36a823l4Q25c47I7M29j82b8o29p16l55g2A141L1D40c57n02l40P8R6r2M8J93d36
12a82e9A95P72Q35J195J213j226A344f86j477o08O55
0b116
##PAGE= F1=25.89129138603
##FIRST=     25.9928259484165, 8223.18227667557, -1379
##DATA TABLE= (F2++(Y..Y)), PROFILE
$$ plain form
16383 -1379 -1396 -1136 872 221 -645 -1420 -2482 -3252 -3882 -4060 -3991 -5395 -2881 -1795 -384 371 364 -298 -1255
16364 -1255 -2278 -3059 -3662 -4485 -2697 -1338 -1099 -1608 -1426 -1416 -1573 -1792 -3467 -3051 -1955 -1310 -1079 -987
16346 -987 -811 -962 -538 78 632 1194 1541 955 -447 -864 -672 -386 216 -987 -3223 -2175 -1410 -2149 -2127 -1300
16326 -1300 -1071 -1133 -1342 -1676 -1742 -990 265 -252 -1216 -1443 -201 78 -661 -1267 -781 362 977 470 -568 -1212
16306 -1212 -1256 -1051 -1223 -969 -1933 -3147 -4038 -3383 -3062 -2593 -4937 -4102 -4122 -3732 -3958 -3608 -2869 -1764 -759
16286 -355 241 342 110 -713 -1097 -53 193 -965 -2210 -1842 -812 189 -728 124 1064 1640 2715 945 -1656
16266 -1839 -340 779 1378 1374 1975 2067 625 -688 -984 -512 -152 41 -193 -1227 -1664 -1153 185 1800 2899 2620
16246 2620 3244 2870 1131 -375 -1990 -2420 -2226 -1447 -835 -528 -1498 -2440 -3144 -3652 -3518 -2197 -1107 -994
$$ packed form
16383a379j7K60H72B21f45p75j062p70o30j78O9j404K514J086c84C71pb98r57
16364a255j023p81o03q23J788a338K39n09J82J0j57k19j675M16J096O45K31R2
16346i87J76j51M24G8N54N62L47n86d47m17J92K86B16i87k236J048P65p39K2Q27
16326a300K29o2k09l34o6P52B65b52r64k27b01G8f61o06M86C62O15D70e68o44
16306a212m4K05j72K54r64j214q91O55L21M69k344Q35k0L90k26L50P39J105g59
16286c55B41J01A10g13l84e3A93i65j245L68h12A89g28A24R40N76J075I45a656
16266a839c40G79N99mO01R2F25f88k96M72a52D1a93j034m37N11A85J615J099k79
16246B620O24l74A131c75j615m30J94P79O12L07r70r42p04n08J34J321J090J13
$$ plain form
16228 -994 -1748 -2783 -2754 -4603 -5709 -6198 -4680 -4503 -3191 -2420 -1916 -1365 -1997 -974 -708 -1949 -3041 -3560
16210 -3560 -3528 -2836 -1932 -941 -401 -3391 -8676 -12515 -5744 -3030 -2763 -3301 -4972 -5390 -6652 -3534 -1784
16193 -1784 -124 -720 -1843 -2600 -2150 -1207 -420 -329 -290 -373 -247 484 1639 2267 2240 -418 -1231 5 1502 2202
16173 2202 1083 -181 -1075 -3245 -4844 -4594 -4070 -2292 -1406 1662 1103 -63 -1952 -2479 -31 1319 798 414
16155 414 -101 -11 -101 -640 -1040 -3132 -3944 -2518 -787 806 321 -1646 -3374 -2314 -1479 -1018 -1006 -979 -637
16136 -637 -289 8 637 1899 1716 -1988 -5695 -6961 -6709 -4960 -2821 -1433 -643 495 932 791 961 852
16118 852 46 133 539 233 -39 -206 -1453 -1383 28 -623 -599 -2998 -2991 -1466 -25 1158 2218 2169 706 -556 -1366
16097 -1366 1443 1697 1142 330 -611 -1548 -1496 -1811 -2815 -5313 -7723 -3157 -321 1083 448 -243 -431 -750
$$ packed form
16228i94p54j035K9j849j106m89J518J77J312P71N04N51o32i74K66j241j092n19
16210c560L2O92R04i41d01k990n285l839e744K714K67n38j671m18j262L118J750
16193a784a24n96j123p57M50R43d20R1L9q3J26D84J155O28k7d18q13EJ497P00
16173B202A083a81q94k170j599K50N24J778Q86A662n59f3j889n27c1A319n21l84
16155D14a01a1r0n39m00k092q12J426g87H06C21a646j728J060Q35M61J2K7L42
16136f37b89HO29J262j83a988l707j266K52J749K139J388f43D95M37j41J70j09
16118H52D6Q7M06B33c9j67j247P0B8f23K4k399Pa466b5A158J060m9G06e56q10
16097a366A443K54n55C30f11r37N2l15j004k498k410c157c21A083D48b43j88l19
$$ plain form
16079 -750 -1071 -495 58 416 1465 556 -952 -2366 -1964 -1692 -2044 -2515 -1433 -854 -559 -468 -1133 -1368 -1054
16060 -1054 -335 -9 -1207 -2824 -2351 -579 -916 -1292 -2001 -2688 -2895 -1822 -1163 -1896 -2749 -2819 -2099 -1299 -766
16041 -766 -1901 -4041 -6020 -5549 -3555 -1465 126 714 611 -1889 -8282 -10687 -7260 -4111 -1580 593
16024 -120 -1014 -2395 -1657 -1371 -1516 -2021 -3620 -2613 -833 -885 -873 -1429 -2340 -2799 -2086 -2427 -3927 -4704 -7366
16005 -7366 -6615 -3522 -3983 -2754 644 2849 3245 2584 1261 250 -508 -2170 -1700 -347 829 1400 -829 -2450
15987 -2450 -2933 -1947 -409 906 1055 -838 -502 219 576 -444 -1648 -3035 -3666 -3798 -2341 -2945 -3070 -2671
15969 -2671 -1742 -1940 -1988 -2346 -2901 -2279 -1792 -1484 -1855 -3202 -6438 -7560 -7238 -4376 -3932 -3129 -2562 -2582 -2688
15950 -2688 -2706 -3109 -3901 -4603 -7406 -11787 -10169 -5162 -3979 -2478 -389 73 -1089 -849 1198 -934 -304
$$ packed form
16079g50l21d95E8L58J049E56i52j414M02K72l52m71J082N79K95R1o65k35L14
16060a054c35ij198j617M73e79l37l76p09o87k07J073O59p33q53p0P20Q00N33
16041g66j135k140j979M71J994a465A26N88j03a889o393k405L427L149a580E93
16024a20q94j381P38K86j45n05j599J007h33n2J2n56r11m59P13l41j500p77k662
16005g366P51L093m61J229F44K205L96o61A261B50e08j662M70c47H29N71h29j621
15987b450m83R86d09I06J49h38L36B19L57d44j204j387o31j32J457o04j25L99
15969b671R29j98m8l58n55O22M87L08l71j347l236j122L22K862M44Q03N67k0j06
15950b688j8m03p92p02k803m381J618N007J183J501c89G3a089K40A198i34c04
$$ plain form
15932 1367 2296 2279 932 -530 -631 -648 -469 -430 -1014 -1565 -2307 -3156 -2996 -2299 -3290 -2503 -1003 -697 326 5 -739
15910 -1469 -1696 -1283 -818 -281 314 714 851 477 -356 -1260 -2316 -2294 -2357 -2580 -2597 -2006 -1256 -2347 -3682
15891 -3682 -5331 -4286 -2280 -603 437 447 -334 -1678 -3860 -4654 -4452 -2860 -2299 -2318 -2451 -3173 -5085 -3619
15873 -3619 -608 1785 1761 1085 -66 -1670 -3345 -2740 -2331 -2161 -2308 -3168 -2769 -2499 -2980 -2843 -2446 -2285 -2720
15854 -2720 -2516 -2065 -2231 -2380 -2858 -3517 -2975 -1692 116 -1085 -3098 -4680 -4696 -3916 -3794 -3209 -2847 -2416
15836 -2416 -3414 -3570 -5199 -4569 -3219 -2153 -2345 -623 879 1610 -480 -153 109 126 830 1538 1515 1846 908
15816 -7 82 557 1159 700 -254 -472 -1036 -1109 -1392 -1291 -1214 -1019 -886 -1323 -1816 -2144 -2261 -2633 -3009 -3672 -3908
15795 -3908 -2759 -1254 207 1051 1009 980 709 149 403 -183 -1383 -2348 -2674 -2079 43 1296 -560 -2249 -2336
$$ packed form
15932A367R29j7I32e30j01j7J79L9n84n51p42q49J60O97r91P87a003L06C26Eg39
15910a469k27M13M65b81C14M00J37l74c56r04j056K2o3k23j7N91P50j091j335
15891c682j649J045K006f03D37J0c34j344k182p94K02J592N61j9j33p22j912J466
15873c619f08A785k4o76f6j604j675O05M09J70j47q60L99K70m81J37L97J61m35
15854b720K04M51j66j49m78o59N42J283A16a085k013j582j6P80J22N85L62M31
15836b416r98j56j629O30J350J066j92f23H79P31d80a53A09J7P04P08k3L31I08
15816gH2M75O02m59b54k18n64p3k83J01P7J95J33m37m93l28j17l72l76o63k36
15795c908J149a254B07Q44m2k9k71A49K54a83j200r65l26N95D3J253e60j689q7
$$ plain form
15776 -2336 -2915 -2372 -1907 -2463 -2958 -3037 -1590 -132 1551 1574 -809 -2302 -3172 -3586 -4038 -2701 -2728 -2206 -1447
15757 -1447 -1484 -1889 -2118 -68 31 -34 -1200 -2760 -4100 -3844 -3568 -3174 -3757 -4564 -2640 -963 -1137 -864 -384
15737 641 1792 2960 1528 1279 1175 -499 -2086 -2787 -1507 -732 -621 -1188 -2060 -1733 337 1999 2775 2918
15719 2918 2678 2639 2351 1570 1019 48 -981 -1233 1613 2123 328 -1871 -2846 -1782 -2674 -3511 -4553 -4767 -3524
15700 -3524 -2725 -2291 -2428 -3015 -4762 -5849 -5567 -3664 -3413 -3457 -3927 -2958 -1638 -877 -1384 -2418 -2897 -2727
15682 -2727 -2189 -1602 -1394 -2191 -2245 -2394 -2543 -2823 -2439 -2024 -2223 -1909 -970 -975 -1408 -1012 -1404 -1549 736 1753
15662 1753 1099 214 -521 -1160 -1450 920 -201 -2880 -4535 -5186 -2326 -1113 2849 1261 -14 1445 651
15644 -3715 -6329 -5990 -4427 -2872 -1829 -2137 -2527 -3112 -4079 -4249 -3596 -2967 -1624 -925 476 1445 1145 1372
$$ packed form
15776b336n79N43M65n56m95p9J447a32A551K3h09j493q70m14m52J337k7N22P59
15757a447l7m05k29f8C1c4j166j560j340K56K76L94n83q07J924i63j74K73c84
15737F41J151J168j432k49j04d99j587p01J280g32J11n67q72L27C37J662P76J43
15719B918k40l9k88p81n51D8i81k52A613N10C28a871r75J064q92q37j042k14J243
15700c524P99M34j37n87j747j087K82J903K51m4m70R69J320P61n07j034m79J70
15682b727N38N87K08p97n4j49j49k80L84M15j99L14R39nm33L96l92j45G36J017
15662A753o54B14e21o39k90I20b01k679j655o51b326a113B849A261a4A445F51
15644c715k614L39J563J555J043l08l90n85r67j70O53O29J343O99D76R69l00K27
$$ plain form
15626 1372 -1821 -1410 -608 -460 -1158 -2574 -2317 -707 -1266 -2220 -2913 -3370 -2973 -3426 -2999 -2097 -6371 -11308
15608 -11308 -10288 -6473 -769 -992 -735 -861 -546 -693 -2828 -2058 -1582 -1571 -1382 -587 -1382 -3018 -4550 -3930
15590 -3930 -1358 -282 -516 -844 -1336 -1693 -2580 -3261 -3077 -2072 -2363 -2152 -1144 370 1593 2171 2226 2204 2130
15571 2130 1498 811 -137 -736 -292 321 465 60 227 545 662 1123 929 237 -365 -145 -3975 -6898 -6651
15552 -6651 -4694 -2926 -1655 130 -56 214 1154 1721 -709 -2553 -2739 -4024 -4757 -5205 -5217 -4321 -1703 -976
15534 -976 -1379 -1063 -249 373 205 -289 -874 -1723 -2227 -2085 -1329 -1050 -822 -333 -1071 -2185 -2890 -2138 -646
15514 147 -740 -2198 -1249 -856 -633 -1136 -227 -102 -772 -2011 -3017 -3131 -2691 -4022 -4773 -5375 -6297 -9060
15496 -9060 -7695 -6186 -3554 -2753 -2911 -2241 -1787 -1577 -3505 -3785 -2423 -1247 -1305 649 3403 2635 675
$$ packed form
15626A372a821M11f08J48o98j416K57g07n59r54o93m57L97m53M27R02m274m937
15608a1308J020L815g69k23K57j26L15j47k135P70M76J1J89e87p95j636j532O20
15590c930a358b82k34l28m92l57q87o81J84J005k91K11J008C70J223N78N5k2p4
15571B130o32o87a37n99b92C21J44F0J67L18J17M61j94B37c65a45l830k923K47
15552f651J957J768J271A30e6B14R40N67g09j844j86j285p33m48j2Q96a703P27
15534i76m03L16b49C73j68b89n85q49n04J42P56K79K28c33p38j114p05P52f46
15514A47g40j458R49L93K23n03b27a02o70j239j006j14M40j331p51o02r22k763
15496i060J365J509K632Q01j58O70M54K10j928k80J362J176n8F49K754p68F75
$$ plain form
15478 -730 -1378 -1286 -1059 88 1094 -165 -1003 -896 -91 547 368 -911 -3460 -5914 -6963 -5121 -3216 44 -126
15458 -100 310 805 -2458 -6564 -8646 -2230 -877 -522 -221 -549 -360 -1458 -8216 -2898 -2825 -2232 -2288 -2805
15440 -2805 -2212 -1102 -265 416 733 770 -1406 -2846 -2211 -1412 -1951 -2606 -3565 -4518 -4632 -3477 -2129 -786
15421 -2130 -9543 -10368 -9165 -4107 -3303 -1266 -897 -718 -1190 -2531 -8038 -9242 -10192 -8623 -6840 -4921
15405 -4921 -3431 -1971 -351 1371 2180 2473 1447 -572 -895 -2112 -1231 -21 -594 -1511 -2348 -3202 -3431 -2769
15387 -2769 -2189 -2065 -1280 -200 879 1931 1532 -283 -2666 -2147 -2724 -1938 -412 1000 2556 4187 4585 3434
15369 3434 1446 -681 -2151 324 2886 4369 4764 1688 9 -1870 -2724 -1496 293 1314 4045 6094 5847
$$ packed form
15478g30o48R2K27H8J006a65q38J07i1E47j79i11k549k454j049J842J905D4a26
15458a00C10M95b458m106k082b230h77L55b21l28J89j098o758b898P3N93n6n17
15440b805N93a102b65D16L17L7a406j440O35P99n39o55r59r53j14J155J348g86
15421b130p413q25J203d107Q04a266L69J79m72j341n507j204r50J569J783J919
15405d921J490J460c51A371Q09K93j026e72l23j217Q81b1n73r17q37q54k29O62
15387b769N80J24P85b00H79J052l99b83k383N19n77P86d12A000J556J631L98j151
15369C434A446f81j470C24K562J483L95A688Ia870q54J228B93J021K731K049k47
$$ [...]