
##TITLE=AC1410_ECUAH12219_7653105_wtmQEQFSva
##JCAMPDX= 6.0         $$ Bruker NMR JCAMP-DX V2.0
##DATA TYPE= NMR SPECTRUM
##DATA CLASS= NTUPLES
##ORIGIN= BRUKER
##OWNER= Administrator
$$ 1.72 TOPSPIN		Version 2.1
$$ 2013-03-19 19:16:29.819 -0500  Administrator@X
$$ Compression mode = diff/dup
##.OBSERVE FREQUENCY= 400.02188249412
##.OBSERVE NUCLEUS= ^1H
##.ACQUISITION MODE= SIMULTANEOUS (DQD)
##.ACQUISITION SCHEME= undefined
##.AVERAGES= 64
##.DIGITISER RES= 22
##SPECTROMETER/DATA SYSTEM= spect
##.PULSE SEQUENCE= noesygpps1d.comp
##.SOLVENT NAME= COFFEE_meoh
##.SHIFT REFERENCE= INTERNAL, COFFEE_meoh, 1, 14.9606
##AUDIT TRAIL= $$ (NUMBER, WHEN, WHO, WHERE, PROCESS, VERSION, WHAT)
$$ ##TITLE= Audit trail, TOPSPIN		Version 2.1
$$ ##JCAMPDX= 5.01
$$ ##ORIGIN= Bruker BioSpin GmbH
$$ ##OWNER= Administrator
$$ $$ E:\/data/COFFEE/nmr/AC1410_ECUAH12219_7653105_wtmQEQFSva/22/pdata/1/auditp.txt
$$ ##AUDIT TRAIL=  $$ (NUMBER, WHEN, WHO, WHERE, PROCESS, VERSION, WHAT)
(   1,<2013-03-19 19:16:23.866 -0500>,<Administrator>,<X>,<go>,<TOPSPIN 2.1>,
      <created by zg
	started at 2013-03-19 19:04:54.022 -0500,
	POWCHK enabled, PULCHK disabled,
       configuration hash MD5:
       86 BA 57 50 F2 9D 5C 9B 26 00 A9 28 5F 66 2E 89
       data hash MD5: 64K
       F1 F5 9A 73 6D 13 69 C3 D9 16 21 87 3D 30 90 B4>)
(   2,<2013-03-19 19:16:27.085 -0500>,<Administrator>,<X>,<proc1d>,<TOPSPIN 2.1>,
      <Start of raw data processing
       efp LB = 0.3 FT_mod = 6 PKNL = 1 PHC0 = 0 PHC1 = 0 SI = 128K 
       data hash MD5: 128K
       D5 D7 9C 94 ED 61 97 61 69 3A 3F D2 BB F6 9C D3>)
(   3,<2013-03-19 19:16:28.163 -0500>,<Administrator>,<X>,<proc1d>,<TOPSPIN 2.1>,
      <pk PHC0 = -76.28906 PHC1 = 0 
       data hash MD5: 128K
       51 14 5F B8 6D 96 51 E8 93 BF 01 59 2D 32 68 B2>)
(   4,<2013-03-19 19:16:28.850 -0500>,<Administrator>,<X>,<proc1d>,<TOPSPIN 2.1>,
      <abs ABSG = 1 
       data hash MD5: 128K
       52 B9 8D DA 9E 88 B5 10 24 3A 39 5C 9D F5 17 E5>)
(   5,<2013-03-19 19:16:29.022 -0500>,<Administrator>,<X>,<proc1d>,<TOPSPIN 2.1>,
      <abs ABSG = 2 
       data hash MD5: 128K
       0E 8D 39 0A 3F F8 04 0A 65 46 F7 F1 97 7F C6 B9>)
(   6,<2013-03-19 19:16:29.210 -0500>,<Administrator>,<X>,<proc1d>,<TOPSPIN 2.1>,
      <abs ABSG = 3 
       data hash MD5: 128K
       3C 9E 2F 00 B4 DF 72 16 DA 67 03 F4 BE 8C C1 7B>)
(   7,<2013-03-19 19:16:29.381 -0500>,<Administrator>,<X>,<proc1d>,<TOPSPIN 2.1>,
      <abs ABSG = 4 
       data hash MD5: 128K
       E5 94 49 1A 47 0C E4 95 42 43 D2 A8 51 B1 49 50>)
(   8,<2013-03-19 19:16:29.522 -0500>,<Administrator>,<X>,<proc1d>,<TOPSPIN 2.1>,
      <abs ABSG = 5 
       data hash MD5: 128K
       A2 B0 66 7F 2E 77 02 CC 97 D9 4C 52 99 20 E6 7F>)
$$ ##END=
$$ 
$$ $$ hash MD5
$$ $$ 4A 2E A1 C2 12 04 C6 0F 7A DD AD E9 68 57 8D 38
##$RELAX= 
##$RELAX= 
##$RELAX= 
##$RELAX= 
##$RELAX= 
##$RELAX= 
##$RELAX= 
##$RELAX= 
$$ Bruker specific parameters
$$ --------------------------
##$DU= <E:\>
##$EXPNO= 22
$$ [...]
150 150 150 150 150 150 150 150
##$TP07= 0
##$TPNAME0= <>
##$TPNAME1= <>
##$TPNAME2= <>
##$TPNAME3= <>
##$TPNAME4= <>
##$TPNAME5= <>
##$TPNAME6= <>
##$TPNAME7= <>
##$TPOAL= (0..7)
0.5 0.5 0.5 0.5 0.5 0.5 0.5 0.5
##$TPOFFS= (0..7)
0 0 0 0 0 0 0 0
##$TUNHIN= 0
##$TUNHOUT= 0
##$TUNXOUT= 0
##$USERA1= <user>
##$USERA2= <user>
##$USERA3= <user>
##$USERA4= <user>
##$USERA5= <user>
##$V9= 5
##$VALIST= <valist>
##$VCLIST= <CCCCCCCCCCCCCCC>
##$VD= 0
##$VDLIST= <DDDDDDDDDDDDDDD>
##$VPLIST= <PPPPPPPPPPPPPPP>
##$VTLIST= <TTTTTTTTTTTTTTT>
##$WBST= 2048
##$WBSW= 25
##$XGAIN= (0..3)
0 0 0 0
##$XL= 0
##$YL= 0
##$YMAX_a= 5982982
##$YMIN_a= -12018356
##$ZGOPTNS= <>
##$ZL1= 120
##$ZL2= 120
##$ZL3= 120
##$ZL4= 120
##$ABSF1= 14.9606
##$ABSF2= -5.597582
##$ABSG= 5
##$ABSL= 3
##$ALPHA= 0
##$AQORDER= 0
##$ASSFAC= 0
##$ASSFACI= 0
##$ASSFACX= 0
##$ASSWID= 0
##$AUNMP= <proc_prof1d_extract.lims>
##$AXLEFT= 0
##$AXNAME= <>
##$AXNUC= <1H>
##$AXRIGHT= 0
##$AXTYPE= 0
##$AXUNIT= <>
##$AZFE= 0.1
##$AZFW= 0.1
##$BCFW= 0
##$BC_mod= 0
##$BYTORDP= 0
##$COROFFS= 0
##$CY= 15
##$DATMOD= 1
##$DC= 0
##$DFILT= <>
##$DTYPP= 0
##$F1P= 0
##$F2P= 0
##$FCOR= 0.5
##$FTSIZE= 131072
##$FT_mod= 6
##$GAMMA= 0
##$GB= 0
##$INTBC= 1
##$INTSCL= 1
##$ISEN= 128
##$LB= 0.3
##$LEV0= 0
##$LPBIN= 0
##$MAXI= 10000
##$MC2= 0
##$MEAN= 0
##$ME_mod= 0
##$MI= 0
##$NCOEF= 0
##$NC_proc= -2
##$NLEV= 6
##$NOISF1= 0
##$NOISF2= 0
##$NSP= 0
##$NTH_PI= 0
##$NZP= 0
##$OFFSET= 14.9606
##$PC= 1
##$PHC0= -76.28906
##$PHC1= 0
##$PH_mod= 1
##$PKNL= yes
##$PPARMOD= 0
##$PPDIAG= 0
##$PPIPTYP= 0
##$PPMPNUM= 2147483647
##$PPRESOL= 1
##$PSCAL= 4
##$PSIGN= 0
##$PYNMP= <proc.py>
##$REVERSE= no
##$SF= 400.020009796039
##$SI= 131072
##$SIGF1= 0
##$SIGF2= 0
##$SINO= 400
##$SIOLD= 131072
##$SPECTYP= <>
##$SREGLST= <1H.CDCl3>
##$SSB= 0
##$STSI= 131072
##$STSR= 0
##$SW_p= 8223.68421052631
##$SYMM= 0
##$S_DEV= 0
##$TDeff= 65536
##$TDoff= 0
##$TI= <>
##$TILT= no
##$TM1= 0
##$TM2= 0
##$TOPLEV= 0
##$USERP1= <user>
##$USERP2= <user>
##$USERP3= <user>
##$USERP4= <user>
##$USERP5= <user>
##$WDW= 1
##$XDIM= 131072
##$YMAX_p= 417729678
##$YMIN_p= -11796
##$CURPLOT= <Network HP LaserJet P1505>
##$CURPRIN= <$Network HP LaserJet P1505>
##$DFORMAT= <normdp>
##$LAYOUT= <+/1D_H.xwp>
##$LFORMAT= <normlp>
##$PFORMAT= <normpl>
##$SURQMSG= 1
$$ End of Bruker specific parameters
$$ ---------------------------------
##NTUPLES= NMR SPECTRUM
##VAR_NAME=  FREQUENCY,     SPECTRUM/REAL,   SPECTRUM/IMAG
##SYMBOL=    X,             R,               I
##VAR_TYPE=  INDEPENDENT,   DEPENDENT,       DEPENDENT
##VAR_FORM=  AFFN,          ASDF,            ASDF
##VAR_DIM=   131072,        131072,          131072
##UNITS=     HZ,            ARBITRARY UNITS, ARBITRARY UNITS
##FACTOR=    0.0627417313425164, 1,          1
##FIRST=     8223.62146879497, 1233,         -55032
##LAST=      0,             3287,            -55112
##MIN=       0,             -11796,          0
##MAX=       8223.62146879497, 417729678,    0
$$ Real data points
##PAGE= N=1
##DATA TABLE= (X++(R..R)), XYDATA
$$ [...]
63951F70309M3203M9747N6155O3386P2649Q3880R6031J08443J21207J34283J46988
63940A646281J58483J68405J76866J83924J89099J91353J89717J83982J74431
63931C262541J60883J42561J19340R2640O4539L6234P885k0375m7988p4570j00200
63920C643490j24752j47203j65828j79075j86395j88562j87085j83153j77129
63911B104308j69091j59419j48553j36555j23588j10489r8227q6905p6032o5685
63901I29764n6660m9346m3245l7828l3073k8902k4807k0588j6902j4447j2961
63890E91005j1595j0025q638p762p159o278m745k628m29J316K559L813N584P888
63876E52906J0357J2583J4364J5889J7701K0101K2583K4308K5163K5821K6660
$$ plain form
63951 670309 713512 763259 819414 882800 955449 1039329 1135360 1243803 1365010 1499293 1646281
63940 1646281 1804764 1973169 2150035 2333959 2523058 2714411 2904128 3088110 3262541
63931 3262541 3423424 3565985 3685325 3777965 3842504 3878738 3886623 3866248 3818260 3743690 3643490
63920 3643490 3518738 3371535 3205707 3026632 2840237 2651675 2464590 2281437 2104308
63911 2104308 1935217 1775798 1627245 1490690 1367102 1256613 1158386 1071481 995449 929764
63901 929764 873104 823758 780513 742685 709612 680710 655903 635315 618413 603966 591005
63890 591005 579410 569385 560747 552985 545826 539548 534803 532175 531746 533062 535621 539434 545018 552906
63876 552906 563263 575846 590210 606099 623800 643901 666484 690792 715955 741776 768436
63865G68436K7342K7584K7594K7314K6107K3772K1088J8700J6132J2795R289O560
63853A012713M230R96l463q224j2753j7498k2568k6991k9954l1901l3667l5170
63841G95750l5635l4788l3197l1604l0349k9318k8195k6829k5450k4343k3298
63830D72744k1849j9965j8083j6404j4737j3208j2372j2314j2212j1309r819q435
63818C02037p451o803o526o519o289n577m950n084n628n456m091k281j114r60
63804B33308j396j754j675j358j278j543j698j382r01p51q75r21r78j425k073
63789B13300k242j781j392j661k262k509k279k000j946j941j706j216o64k01K08
63774A89708N88P23L89j77m27l31n34j318j884j437n48n00j374j898j302k98K02
$$ plain form
63865 768436 795778 823362 850956 878270 904377 928149 949237 967937 984069 996864 1006153 1012713
63853 1012713 1016943 1017939 1014476 1006252 993499 976001 953433 926442 896488 864587 830920 795750
63841 795750 760115 725327 692130 660526 630177 600859 572664 545835 520385 496042 472744
63830 472744 450895 430930 412847 396443 381706 368498 356126 343812 331600 320291 310472 302037
63818 302037 294586 287783 281257 274738 268449 262872 257922 252838 247210 241754 237663 235382 234268 233308
63804 233308 231912 230158 228483 227125 225847 224304 222606 221224 220323 219572 218697 217776 216798 215373 213300
63789 213300 211058 209277 207885 206224 203962 201453 199174 197174 195228 193287 191581 190365 189701 189500 189708
63774 189708 190296 191019 191408 191231 190804 190473 189939 188621 186737 185300 184752 184252 182878 180980 179678 179380 179582
63757A79582K96M72O26N09M56Q20J183R97N32M59P29Q06P16R30J359J366Q54M58
63739A93150N81R42J215J440J686J934K339L027L534L224K343J866K225K939L650
63724B26095M522N327N257M282L696M446N674N876M951M053L854L887L504K552
63710B87976J203k50j399k217l271m861o210o280n217m130l522k902j967j151
63696B45802p66m42R6M49K19k45k43M42J440K223K421K105J901K465L681M734
63680B66282N037M638L722K306P03l49l41N49J789K844L151K423J262Q11J402
63665B96229K159K338K280K581K901K459J187l58j865l315m381m713m678n009
63651B87815n690n919n278m313l743l601l454k999k180j041J93J067J277J091
$$ plain form
63757 179582 179878 180350 180976 181485 181941 182761 183944 184941 185473 185932 186661 187467 188183 189113 190472 191838 192692 193150
63739 193150 193731 194673 195888 197328 199014 200948 203287 206314 209848 213072 215415 217281 219506 222445 226095
63724 226095 230617 235944 241201 245483 249179 253625 259299 265175 270126 274179 278033 281920 285424 287976
63710 287976 289179 288929 287530 285313 282042 277181 270971 264691 259474 255344 251822 248920 246953 245802
63696 245802 245036 244594 244690 245139 245358 245113 244870 245312 246752 248975 251396 253501 255402 257867 261548 266282
63680 266282 271319 275957 279679 281985 282688 282339 281998 282547 284336 287180 290331 292754 294016 294827 296229
63665 296229 298388 300726 303006 305587 308488 310947 312134 311776 309911 306596 302215 297502 292824 287815
63651 287815 282125 276206 270928 266615 262872 259271 255817 252818 250638 249597 249790 250857 252134 253225
63637B53225J217K099L394M259M292L998M132M729N210N364N612O171O637O749
63623C17088O986P862R062R886J0262J0761J1824J3450J5405J7268J8592J9485
63611D67931K0750K2869K5174K6785K7959K9708L2181L4444L5822L6505L6555
63600G96683L5269L2033K7099K1012J3883N872k041q397j2326j3893j3629j2166
63588H69399j0351r250r737j2069j5770k0005k4020k7341k9632l0689l0657k9904
63576F19974k8500k6084k2652j9044j6194j4081j1988r603p204m872k272N82L008
63563D61070M435N111N779O893Q354R754J0806J1654J2717J4018J5054J5683J6745
63550E98073J9120K2417K5483K8081L1083L4970L9200M3352M7756N2233N4945
$$ plain form
63637 253225 254442 256541 259935 264194 268486 272484 276616 281345 286555 291919 297531 303702 310339 317088
63623 317088 324074 331936 340998 350884 361146 371907 383731 397181 412586 429854 448446 467931
63611 467931 488681 511550 536724 563509 591468 621176 653357 687801 723623 760128 796683
63600 796683 831952 863985 891084 912096 925979 931851 929810 921413 909087 895194 881565 869399
63588 869399 859048 849798 840061 827992 812222 792217 768197 740856 711224 680535 649878 619974
63576 619974 591474 565390 542738 523694 507500 493419 481431 471828 464624 459752 457480 458062 461070
63563 461070 465505 470616 476395 483288 491642 501396 512202 523856 536573 550591 565645 581328 598073
63550 598073 617193 639610 665093 693174 724257 759227 798427 841779 889535 941768 996713
63539I96713N3282M5761L2852J6781R43j1324j8521k1551k2139k1065j8333j4471
63527A018928j0803q589q460j0607j4846k0476k6488l1981l6393l9508m1458m2455
63515G26864m2376m0868l8039l4559l0953k7289k3792k1004j8928j6770j4154
63504D18132j1858j0575r707q333o856o416o969p180o295m935l859k963j958j111
63490C29117p56p21p05p35q06n79J43R35J231J002P62J035K010L389M468M690
63474C44480M351M392N226O149O139M934K995P98j435l442m903n730o104o184
63460C51666n949n348m472l568k900k546k259j681p15L58J170J598J809K149K934
63445C32246M160N365O047O282O678P679R146J0755J2471J4440J6673J9202K2380
$$ plain form
63539 996713 1049995 1095756 1128608 1145389 1146332 1135008 1116487 1094936 1072797 1051732 1033399 1018928
63527 1018928 1008125 999536 991076 980469 965623 945147 918659 886678 850285 810777 769319 726864
63515 726864 684488 643620 605581 571022 540069 512780 488988 467984 449056 432286 418132
63504 418132 406274 395699 385992 377659 370803 364387 357418 350238 343943 339008 335149 332186 330228 329117
63490 329117 328361 327640 326935 326200 325394 324815 324958 325893 327124 328126 328888 329923 331933 335322 339790 344480
63474 344480 348831 353223 358449 364598 370737 375671 378666 379464 378029 374587 369684 363954 357850 351666
63460 351666 345717 340369 335897 332329 329429 326883 324624 322943 322228 322586 323756 325354 327163 329312 332246
63445 332246 336406 341771 347818 354100 360778 368457 377603 388358 400829 415269 431942 451144 473524
63432D73524K6676L2062L7709M2201M3900M1478L4730K5138J5222P031J334j711
63420G79294j662J790P731J4208J9810K4674K9605L4710L9362M3038M5409M5710
63408A083679M2890L6650K7780J7395O453l749j1414j5444j6565j6647j6981j7590
63396A116457j8057j8504j9682k2443k7046l2711l7956m1668m3748m4507m3779
63385G66356m1220l7262l3056k9354k6003k2643j9386j6473j3742j0886p979n384
63373E02968l257j365N57K583M652O686Q577J0173J1436J2702J4615J7589K1227
63360F09143K4563K7069K9170L1540L4138L6356L8072L9896M2259M4627M5903
63349A002736M5315M2682L8019L1315K2778J3158L600m815j1409j5847j8005j8175
$$ plain form
63432 473524 500200 532262 569971 612172 656072 697550 732280 757418 772640 779671 781005 779294
63420 779294 777632 779422 787153 801361 821171 845845 875450 910160 949522 992560 1037969 1083679
63408 1083679 1126569 1163219 1190999 1208394 1214847 1211098 1199684 1184240 1167675 1151028 1134047 1116457
63396 1116457 1098400 1079896 1060214 1037771 1010725 978014 940058 898390 854642 810135 766356
63385 766356 725136 687874 654818 625464 599461 576818 557432 540959 527217 516331 508352 502968
63373 502968 499711 498346 498903 501486 506138 512824 521401 531574 543010 555712 570327 587916 609143
63360 609143 633706 660775 689945 721485 755623 791979 830051 869947 912206 956833 1002736
63349 1002736 1048051 1090733 1128752 1160067 1182845 1196003 1199603 1194788 1183379 1167532 1149527 1131352
63337A131352j7311j6644j6767j7450j8539k0696k4658l0026l5325l9294m1594
63326H53048m2238m1053l8039l3805k9177k4579k0070j5703j1393o711j496L021
63314E91805M348O01p446j6488k3052k5855k5948k4967k3595k1583j8657j5094
63302C94069j1595q885p281o508o055n749n730n837n505m512l509l303l906m641
63288C11053m948m721m070l258k707k633k754k658k315j886j334p16m62p81j087
63273B74723p47j30l9k96K5R93J588J345J060J336J577J133N80Q50J733K243K121
63256B90095K035K452L180L901M426M436L784L115L553N398P619Q853Q681P816
63242C59344P296P706Q989J0744J2619J4364J5712J6519J7091J7940J9098K0036
$$ plain form
63337 1131352 1114041 1097397 1080630 1063180 1044641 1023945 999287 969261 933936 894642 853048
63326 853048 810810 769757 731718 697913 668736 644157 624087 608384 596991 590280 588784 591805
63314 591805 596153 596754 589308 572820 549768 523913 497965 472998 449403 427820 409163 394069
63302 394069 382474 373589 366308 359800 353745 347996 342266 336429 330924 326412 322903 319600 315694 311053
63288 311053 306105 301384 297314 294056 291349 288716 285962 283304 280989 279103 277769 277053 276591 275810 274723
63273 274723 273976 273846 273807 273511 273536 274529 276117 277462 278522 279858 281435 282568 283148 283998 285731 287974 290095
63256 290095 292130 294582 297762 301663 306089 310525 314309 317424 320977 326375 333994 342847 351528 359344
63242 359344 366640 374346 383335 394079 406698 421062 436774 453293 470384 488324 507422 527458
63230E27458K0494K0898K1632K2340K2453K2091K1756K1415K0615J9449J8767
63219G59368J9245K0681K2269K3211K3101K2088K0664J8929J6238J2012O642R53
63207I65401n013j1771j8909k4869k8654l0924l2753l4035l3899l2197k9673k6889
63195F55815k3814k0475j7210j4103j0833p274l758n00K688N844Q516J0397J1964
63182E97257J3929J6172J7832J8421J8420J8535J8793J8613J7653J6253J5111
63171G86989J4694J4919J5189J4737J3107J0454P314M059N74l471q083j2780j7004
63158H40698k0684k4278k8088l1580l3651l3738l2492l1019k9650k7784k4998
63147E22736k1800j9031j6857j4836j2761j0938r583q401p057n711m762m240l830
$$ plain form
63230 527458 547952 568850 590482 612822 635275 657366 679122 700537 721152 740601 759368
63219 759368 778613 799294 821563 844774 867875 889963 910627 929556 945794 957806 964448 965401
63207 965401 960388 948617 929708 904839 876185 845261 812508 778473 744574 712377 682704 655815
63195 655815 632001 611526 594316 580213 569380 562106 558348 557848 560536 566380 574896 585293 597257
63182 597257 611186 627358 645190 663611 682031 700566 719359 737972 755625 771878 786989
63171 786989 801683 816602 831791 846528 859635 870089 877403 881462 882036 878565 870482 857702 840698
63158 840698 820014 795736 767648 736068 702417 668679 636187 605168 575518 547734 522736
63147 522736 500936 481905 465048 450212 437451 426513 416930 408529 401472 395761 390999 386759 382929
63134C82929l421l198l113k696j730q27p96j444j502q0K149L603L538K692K191
63119C78295K253K319K095J965K341L010L386L213K758K452K524K924L334L245
63105D16114K404J291Q32J377K190K348J897J700K214K936L154K764K161J689
63091D45071J508J626J807J681J193O97L74q6q42j386j160m18P7J63M58J393K637
63074D54793L627M249M792N523O512P649Q692R463J0109J1013J2392J4068J5606
63061E68488J6610J7073J7631J9227K2176K5697K8842L1604L4681L8205M1424
63050H61658M3727M5455M7361M9717N2117N3899N4565N4153N3336N2862N2827
63039A421677N2805N2658N2756N3331N4106N4703N4868N4151N1924M7998M2707
$$ plain form
63134 382929 379508 376310 373197 370501 368771 367944 367148 365704 364202 364122 366271 369874 373412 376104 378295
63119 378295 380548 382867 384962 386927 389268 392278 395664 398877 401635 404087 406611 409535 412869 416114
63105 416114 418518 419809 420641 422018 424208 426556 428453 430153 432367 435303 438457 441221 443382 445071
63091 445071 446579 448205 450012 451693 452886 453583 453957 453871 453029 451643 450483 450065 450142 450305 450763 452156 454793
63074 454793 458420 462669 467461 472984 479496 487145 495837 505300 515409 526422 538814 552882 568488
63061 568488 585098 602171 619802 639029 661205 686902 715744 747348 782029 820234 861658
63050 861658 905385 950840 998201 1047918 1100035 1153934 1208499 1262652 1315988 1368850 1421677
63039 1421677 1474482 1527140 1579896 1633227 1687333 1742036 1796904 1851055 1902979 1950977 1993684
63028A993684L6146K7823J7398N268p839k1366l4634m6679n6843o5087p1312p4971
63016A701588p5876p4792p2536o8918o3364n6162m8285m0279l2169k4333j7448
63005A127426j1478n530R86P672J3714J8588K2113K4401K6081K7896K9810L0967
62993A312646L0875L0170K9819K9928K9794K8904K7464K5927K4318K2123J8685
62982A610653J3738P506L97p392j5823k4696l3580m2026m9581n5688n9854o2049
62970A281605o2687o2118o0339n7354n3607m9727m5930m1855l7196l2380k8341
62959G50071k5515k3292k0792j8046j5983j5170j5058j4717j3906j3062j2577
62948E61953j2429j2357j2089j1541j1020j0934j1108j0808r774q785q610q845
$$ plain form
63028 1993684 2029830 2057653 2075051 2080319 2072480 2051114 2016480 1969801 1912958 1847871 1776559 1701588
63016 1701588 1625712 1550920 1478384 1409466 1346102 1289940 1241655 1201376 1169207 1144874 1127426
63005 1127426 1115948 1110418 1111404 1119076 1132790 1151378 1173491 1197892 1223973 1251869 1281679 1312646
62993 1312646 1343521 1373691 1403510 1433438 1463232 1492136 1519600 1545527 1569845 1591968 1610653
62982 1610653 1624391 1631897 1632294 1624902 1609079 1584383 1550803 1508777 1459196 1403508 1343654 1281605
62970 1281605 1218918 1156800 1096461 1039107 985500 935773 889843 847988 810792 778412 750071
62959 750071 724556 701264 680472 662426 646443 631273 616215 601498 587592 574530 561953
62948 561953 549524 537167 525078 513537 502517 491583 480475 469667 459893 451108 442498 433653
62936D33653q510p524o718o435o080n199m214l722l685l679l461k915j951q02
62922C68758r8k40r80j901k861l657l657k450o57M76M01k30n36m02l34n90q79
62905C50163q96p97r04j201j364j279j210j351j569j652j574j301o90J76Q41J003
62889C36395R58J134J431J430J094P45M72P6m04o04l53J50P13J271J563J202K35
62872C47508p40j172j042o34j89J39K76K54K1o83j874k847k678j298L80J436J636
62855C38493J153K80l94k43N85J134P65k5k99K07R98J511J461Q59N9l78k38J24
62837C46052K73J99M4k47o75q83n38J75P83J132J378J597J670J525J232R29Q71
62820C55517J295K070K646K646K286K057K151K509L090L786M269M314M133M137
$$ plain form
62936 433653 425143 417619 410901 404466 398386 393187 388973 385251 381566 377887 374426 371511 369560 368758
62922 368758 368660 368420 367440 365539 362678 359021 355364 352914 352257 352733 353134 352904 352368 351966 351632 351042 350163
62905 350163 349267 348470 347566 346365 345001 343722 342512 341161 339592 337940 336366 335065 334375 334551 335392 336395
62889 336395 337353 338487 339918 341348 342442 343187 343659 343735 343331 342727 342374 342524 343237 344508 346071 347273 347508
62872 347508 346768 345596 344554 343920 343731 343870 344146 344400 344421 343738 341864 339017 336339 335041 335421 336857 338493
62855 338493 339646 339926 339532 339289 339874 341008 341773 341748 341449 341656 342654 344165 345626 346485 346544 346166 345928 346052
62837 346052 346325 346524 346568 346321 345646 344763 344225 344400 345183 346315 347693 349290 350960 352485 353717 354646 355517
62820 355517 356812 358882 361528 364174 366460 368517 370668 373177 376267 380053 384322 388636 392769 396906
62806C96906M482N020N571O001O305O780P829R328J0522J0969J1252J2268J4069
62793E07302J5871J7087J7843J8588J9684K1365K3734K6711L0228L4363L9044
62782G71820M3878M8685N3930O0122O6916P3348P8898Q3684Q7696R0469R1636
62771A551082R1205Q8993Q4336P6613O5792N2329L6930K0536L990j2505k9103
62760B030198m5173n9026o9324p6410q1630q5581q7717q7591q5766q3158p9994
62749A188828p5828p0413o4203n8047n2653m8256m4613m1164l7442l3469k9692
62738F33048k6502k3845k1405j8992j6572j4096j1626r597q493q089p466o140
62726D60225m782m287m337l657j758K76J200J235J652K942M243M699M770N650
$$ plain form
62806 396906 401388 406408 411979 417980 424285 431065 438894 448222 458744 469713 480965 493233 507302
62793 507302 523173 540260 558103 576691 596375 617740 641474 668185 698413 732776 771820
62782 771820 815698 864383 918313 978435 1045351 1118699 1197597 1281281 1368977 1459446 1551082
62771 1551082 1642287 1731280 1815616 1892229 1958021 2010350 2047280 2067816 2071806 2059301 2030198
62760 2030198 1985025 1925999 1856675 1780265 1698635 1613054 1525337 1437746 1351980 1268822 1188828
62749 1188828 1113000 1042587 978384 920337 867684 819428 774815 733651 696209 662740 633048
62738 633048 606546 582701 561296 542304 525732 511636 500010 490413 481920 473831 466365 460225
62726 460225 455443 451156 446819 443162 441404 441680 442880 444115 445767 448709 452952 457651 462421 468071
62712D68071P729J0244J2382J4172J6099J8252K0356K2375K4708K7740L1515L5840
62700G09483M0447M5042M9465N3763N7911O1487O4084O5983O7824O9413O9468
62689A354370O6959O2189N5998M8404L8716K6850J3670O3j3590k6880l9032m9498
62677A538219n8301o5439p0364p2552p2316p0580o8041o4909o1354n7646n3861
62666H22856m9822m5490m1122l6975l3093k9467k6174k3251k0629j8361j6664
62655D81808j5495j4259j2363j0011q162p514p745p933p504o593n650m993m712
62642C68874m658m472l846k868j947j349r50n54k21q0%L02Q64J372J494J162N14
62625C53637k75j016j479j487j119p44p22j001j118o56L57J591K824L995M968
$$ plain form
62712 468071 475800 486044 498426 512598 528697 546949 567305 589680 614388 642128 673643 709483
62700 709483 749930 794972 844437 898200 956111 1017598 1081682 1147665 1215489 1284902 1354370
62689 1354370 1421329 1483518 1539516 1587920 1626636 1653486 1667156 1667219 1653629 1626749 1587717 1538219
62677 1538219 1479918 1414479 1344115 1271563 1199247 1128667 1060626 995717 934363 876717 822856
62666 822856 773034 727544 686422 649447 616354 586887 560713 537462 516833 498472 481808
62655 481808 466313 452054 439691 429680 421518 414004 406259 398326 390822 384229 378579 373586 368874
62642 368874 364216 359744 355898 353030 351083 349734 348784 348230 348009 347929 347929 348231 349095 350467 351961 353123 353637
62625 353637 353362 352346 350867 349380 348261 347517 346795 345794 344676 344020 344377 345968 348792 352787 357755
62610C57755N567N909O410P319Q456R533J0545J1645J2861J4117J5460J7030J8872
62597E01479K0960K3323K6031K9065L2326L5681L8892M1578M3407M4286M4212
62586H81240M3012M0376L6148L0391K3194J4594M906m989j3955k1364k7460l2766
62574I73327l7174m0018m1110m1291m1478m1500m0400l7813l4420l1081k8087
62563E58955k5437k3139k0983j8513j5688j3211j1737j1068j0386r120p281n369
62551C87023m187m283n218n699m966l631k705k216j501n14O2l2j75K47J140K101
62535C55446K974L711M057L723K738J586J051J669L086M191M430M658O093Q555
62521D07968J0635J1665J2625J4692J7759K0898K3693K6329K8879L1203L3508
$$ plain form
62610 357755 363322 369231 375641 382960 391416 400949 411494 423139 436000 450117 465577 482607 501479
62597 501479 522439 545762 571793 600858 633184 668865 707757 749335 792742 837028 881240
62586 881240 924252 964628 1000776 1031167 1054361 1068955 1073861 1068872 1054917 1033553 1006093 973327
62574 973327 936153 896135 855025 813734 772256 730756 690356 652543 618123 587042 558955
62563 558955 533518 510379 489396 470883 455195 441984 430247 419179 408793 399673 392392 387023
62551 387023 382836 378553 373335 367636 362670 359039 356334 354118 352617 352103 352165 352133 351958 352205 353345 355446
62535 355446 358420 362131 366188 369911 372649 374235 375286 376955 380041 384232 388662 393320 399413 407968
62521 407968 418603 430268 442893 457585 475344 496242 519935 546264 575143 606346 639854
62510F39854L6174L8972M0904M1096L9615L7285L4703L1587K7093K0832J3454
62499A001569O024j020p833j4154j9049k1979k3591k4851k5790k5668k4185k1795
62487G97678j8834j5065j0348n263o76L103O464J0036J4222J8978K3732K7625
62475H51652L0126L1386L1903L1927L1293K9606K6354K1022J3642N309k347q546
62463A093327j4051k0153k7221l4470m0816m5463m7911m8159m7058m5770m4528
62452F77727m2371l8540l3673k9114k5418k2131j8818j5610j2775j0386q554p414
62440D12923o714n895m797l865l367k884j895o15K62M20J78j24n40j223k015k588
62424C77261k904l306m034m816n099m723m129l808l794l807l758l768l791l527
$$ plain form
62510 639854 676028 715000 755904 797000 836615 873900 908603 940190 967283 988115 1001569
62499 1001569 1007593 1006573 998740 984586 965537 943558 919967 895116 869326 843658 819473 797678
62487 797678 778844 763779 753431 748168 747492 750595 757059 767095 781317 800295 824027 851652
62475 851652 881778 913164 945067 976994 1008287 1037893 1064247 1085269 1098911 1104220 1101873 1093327
62463 1093327 1079276 1059123 1031902 997432 956616 911153 863242 815083 768025 722255 677727
62452 677727 635356 596816 563143 534029 508611 486480 467662 452052 439277 428891 420337 412923
62440 412923 406209 400314 395517 391652 388285 385401 383506 382891 383153 383573 383751 383627 383087 381864 379849 377261
62424 377261 374357 371051 367017 362201 357102 352379 348250 344442 340648 336841 333083 329315 325524 321997
62410C21997k779j723p40j24O0l6k17m25p21j029j082q01n05m95n82l63J63O54
62392C11252J023J535K294K990L241K925K131J139M79O23J455K368K993L530M275
62377C44253N152N942O681P564Q625R664J0461J0957J1297J1783J2639J3808J5129
62364D73955J6635J8558K1040K4050K7458L1025L4497L7946M1857M6494N1399
62353H24914N5943O0180O4522O8606P1179P1183O8303O2405N3230M1150K7590
62342A469205J4232K057q607j7644k5224l1917l8203m4129m9601n4638n8895o1404
62330A095232o1319n8832n4951n0570m6037m1399l6670l1997k7781k4425k1837
62319F39414j9569j7633j6627j6681j6934j6558j5810j5350j5054j4355j3385
$$ plain form
62410 321997 319218 317495 316755 316631 316691 316655 316438 316013 315292 314263 313181 312380 311875 311380 310798 310435 310598 311252
62392 311252 312275 313810 316104 319094 322335 325260 327391 328530 329009 329632 331087 333455 336448 339978 344253
62377 344253 349405 355347 362028 369592 378217 387881 398342 409299 420596 432379 445018 458826 473955
62364 473955 490590 509148 530188 554238 581696 612721 647218 685164 727021 773515 824914
62353 824914 880857 941037 1005559 1074165 1145344 1216527 1284830 1347235 1400465 1441615 1469205
62342 1469205 1483437 1485494 1476887 1459243 1434019 1402102 1363899 1319770 1270169 1215531 1156636 1095232
62330 1095232 1033913 975081 920130 869560 823523 782124 745454 713457 685676 661251 639414
62319 639414 619845 602212 585585 568904 551970 535412 519602 504252 489198 474843 461458
62308D61458j2817j2640j2106j0947r744q887p998o707n315m176l091j843q38
62295C64349n56o68l58N19J146P87k90j061p71M83K023L195L719L642L205K817
62279C82181K892L561M525N281N550N414N217N372O125P381Q709R651J0023J0059
62265D71941J0406J1820J4538J7892K0934K3599K6835L1312L6424M0973M4644
62254G51318M8321N3056N9082O5674P1500P5121P5601P2820O7056N8462M7261
62243A445272L4308K0973Q256l619j4647k4471l2599l9135m4934n0937n7251o2910
62231A178306o6654o7901o6913o4129n9836n4571m9278m4537l9993l5063l0014
62220E99417k5734k2574k0037j7699j5755j4436j3398j2072j0358q642p345o653
$$ plain form
62308 461458 448641 436001 423895 412948 403204 394317 386319 379612 374297 370121 367030 365187 364349
62295 364349 363793 363125 362767 363286 364432 365219 364929 363868 363097 363580 365603 368798 372517 376159 379364 382181
62279 382181 385073 388634 393159 398440 403990 409404 414621 419993 426118 433499 442208 451859 461882 471941
62265 471941 482347 494167 508705 526597 547531 571130 597965 629277 665701 706674 751318
62254 751318 799639 852695 911777 977451 1048951 1124072 1199673 1272493 1339549 1398011 1445272
62243 1445272 1479580 1500553 1508809 1505190 1490543 1466072 1433473 1394338 1349404 1298467 1241216 1178306
62231 1178306 1111652 1043751 976838 912709 852873 798302 749024 704487 664494 629431 599417
62220 599417 573683 551109 531072 513373 497618 483182 469784 457712 447354 438712 431367 424714
62208D24714o536o702o650n998m854l710k945k486k012j384p09l4P82J690K287
62193C85453K373K483L339M779N933O537P329Q804J0337J1057J1037J0958J1155
62180D81574J1623J2445J3368J3461J2142J0264R170Q922Q566Q004Q278R944J2366
62167F20127J5138J8910K4203L0313L6194M1697M7170N2459N7010O0432O2206
62156A065859O1314N6930M9328L9581K8686J7508P112j654q791j4882k0405k5750
62144A254836l1529l8051m4585m9781n2815n3705n2687m9926m5802m0906l5714
62133G59335l0646k6251k2700j9226j4870r895n760l336j826J57K865N419P204
62120F40470Q622J0328J2134J2967J1916R168N841K977Q64o51j507j460o71J9
$$ plain form
62208 424714 418178 411476 404826 398828 393974 390264 387319 384833 382821 381437 380728 380694 381476 383166 385453
62193 385453 387826 390309 393648 398427 404360 410897 418226 427030 437367 448424 459461 470419 481574
62180 481574 493197 505642 519010 532471 544613 554877 564047 572969 581535 589539 597817 607761 620127
62167 620127 635265 654175 678378 708691 744885 786582 833752 886211 943221 1003653 1065859
62156 1065859 1127173 1184103 1233431 1273012 1301698 1319206 1326318 1324664 1315873 1300991 1280586 1254836
62144 1254836 1223307 1185256 1140671 1090890 1038075 984370 931683 881757 835955 795049 759335
62133 759335 728689 702438 679738 660512 645642 635747 629987 626651 624825 624982 627847 633266 640470
62120 640470 649092 659420 671554 684521 696437 705605 711446 714423 715287 714636 713129 711669 710998 711017
62106G11017m16k526o041j0016j3281j5005j4936j3282j0458p055l687o73K026
62093F15667M287N653N923N733N992O854P738Q297Q729R100R048Q520Q300R233
62079G19074J1181J3242J4880J6341J7943J9483K0574K1325K2296K3761K5331
62068I25431K6420K6938K7236K7466K7379K6949K6845K7870L0111L2947L5744
62057A241336L8013L8960L7545L3356K7043J9647J1778L776l790j0348j5963k1293
62045A400060k6818l2425l7785m2697m7006n0410n2607n3485n3096n1553m9091
62034I03087m6061m2785l9448l6160l2921k9554k5867k2042j8599j5852j3608
62023E80190j1590r913q795q000p116o265o059o627p243p247o946p098p712p952
$$ plain form
62106 711017 710601 708075 702034 692018 678737 663732 648796 635514 625056 618001 614314 613641 615667
62093 615667 619954 625607 631530 637263 643255 650109 657847 666144 674873 683973 693021 701541 709841 719074
62079 719074 730255 743497 758377 774718 792661 812144 832718 854043 876339 900100 925431
62068 925431 951851 978789 1006025 1033491 1060870 1087819 1114664 1142534 1172645 1205592 1241336
62057 1241336 1279349 1318309 1355854 1389210 1416253 1435900 1447678 1451454 1447664 1437316 1421353 1400060
62045 1400060 1373242 1340817 1303032 1260335 1213329 1162919 1110312 1056827 1003731 952178 903087
62034 903087 857026 814241 774793 738633 705712 676158 650291 628249 609650 593798 580190
62023 580190 568600 558687 549892 541892 534776 528511 522452 515825 508582 501335 494389 487291 479579 471627
62009D71627p208n792m360l077j622J80K022L389M042M309M928O360Q126R063
61995D91987Q424O629M758L449K513J464R1j487l012m224n039n708o645p982r417
61980D75801j0547j1180j1266j0736r690q577p855p438o752n472m048l228l178
61967C75834l283k928k261j948k292k814k870k400j869j517j019l5J155J826J621
61952C55200R47N32P79J564K535L435M271N250O580Q252J0042J1743J3254J4517
61938D38901J5507J6467J7879J9913K2015K3317K3505K3015K2309K1331J9858
61927F64017J8080J6504J5313J4066J2147R339N951K487o82l349n423o992q362
61914G33096r706j0633j0381q612n804k589R51M942Q912J2070J4261J6044J7647
$$ plain form
62009 471627 464419 458627 454267 451190 449568 449748 451770 455159 459201 463510 468438 474798 482924 491987
61995 491987 500411 507040 511798 515247 517760 519224 519315 517828 514816 510592 505553 499845 493200 485218 475801
61980 475801 465254 454074 442808 432072 422382 413805 405950 398512 391760 386288 382240 379012 375834
61967 375834 372551 369623 367362 365414 363122 360308 357438 355038 353169 351652 350633 350598 351753 353579 355200
61952 355200 356147 356679 357458 359022 361557 364992 369263 374513 381093 389345 399387 411130 424384 438901
61938 438901 454408 470875 488754 508667 530682 553999 577504 600519 622828 644159 664017
61927 664017 682097 698601 713914 727980 740127 749466 755417 757904 757222 753873 748450 741458 733096
61914 733096 723390 712757 702376 693764 687960 685371 686322 691264 700176 712246 726507 742551 760198
61901G60198J8508J8119J6662J4471J1396P256K430k543p557j2541j6853j9734
61889G89812k1188k1820k1989k1728k1246k0753j9908j8196j5895j3908j2634
61878E80547j1723j0999j0836j1351j1974j2221j2206j2030j1325r891q222o866
61866D50903n656m087k093P0K273M396O076P136Q048R367J0962J2314J3446J5006
61852E28161J7421K0487K3778K6993K9833L2006L3530L4766L5956L6824L6778
61841H56533L5397L2765K9281K5112J9947J3508O306n81o503j1598j5935j8876
61829I65356j9743j8680j6333j2963q439k955K780Q028J2308J5412J7423J8528
61817I60722J8387J6088J1208M625k354r353j6684k4025l0336l5082l8550m0817
$$ plain form
61901 760198 778706 796825 813487 827958 839354 846610 849040 846497 838940 826399 809546 789812
61889 789812 768624 746804 724815 703087 681841 661088 641180 622984 607089 593181 580547
61878 580547 568824 557825 546989 535638 523664 511443 499237 487207 475882 465991 457769 450903
61866 450903 445247 441160 439067 439137 441410 445806 451882 459018 467066 476433 487395 499709 513155 528161
61852 528161 545582 566069 589847 616840 646673 678679 712209 746975 782931 819755 856533
61841 856533 891930 924695 953976 979088 999035 1012543 1018849 1018268 1011765 1000167 984232 965356
61829 965356 945613 926933 910600 897637 889198 886243 889023 897051 909359 924771 942194 960722
61817 960722 979109 995197 1006405 1011030 1008676 999323 982639 958614 928278 893196 854646 813829
61805H13829m1362m0102l7910l5576l3001k9903k6684k3937k1596j9332j7250
61794D87176j5553j3852j1674r404p958p508p289o641n648m645l759l119k964
61781C87162l293l766m116m269l962k869j302j61K26O15J655K659K405J007%L90
61765C72381J454J873J389P71N79P13J004J463J919J972J594J293J429J681J544
61750C93059J068P82J030J682K366K713K452J592M74n20j282j842k090j925j618
61735C97941j603j890j994j557p20J84J052J862K443K688K829L162L561L615L280
61720D14853L060L364L912M085L721L331L446M045M728N184N261M752L515J796
61706D69053J14j262k455l593m561n356o183o984p177o362n063m296m392m690
$$ plain form
61805 813829 772467 732365 694455 658879 625878 595975 569291 545354 523758 504426 487176
61794 487176 471623 457771 446097 436693 428735 421227 413938 407297 401649 397004 393245 390126 387162
61781 387162 383869 380103 375987 371718 367756 364887 363585 363424 363650 364265 365920 368579 370984 371991 371991 372381
61765 372381 373835 375708 377097 377868 378447 379160 380164 381627 383546 385518 387112 388405 389834 391515 393059
61750 393059 394127 394909 395939 397621 399987 402700 405152 406744 407218 406698 405416 403574 401484 399559 397941
61735 397941 396338 394448 392454 390897 390177 390361 391413 393275 395718 398406 401235 404397 407958 411573 414853
61720 414853 417913 421277 425189 429274 432995 436326 439772 443817 448545 453729 458990 463742 467257 469053
61706 469053 469167 467905 465450 461857 457296 451940 445757 438773 431596 425234 420171 415875 411483 406793
61692D06793m479l790l116k694k407k167k129k433k927l189k914k282j820j798
61678C68648j870j572j023p85j094j546j721j673j614j484j121p07o29r28j201
61663C49680j049m57K87Q16Q65M45m6p8N21J345J805J785J714J976K368K343J846
61646C66166J576K251L732N125N707N510N015M600M410M441M530M407L911L105
61632D24486K016N19j350l121m275m791n039n127m746l802k767k203k129k138
61618C85533j947j524q55L4Q04R56M58j41l87m75q58j553k241k903l856n065n896
61601C60084n834n194m766m883n087m760l865k961k587k724k929k886k708k611
61587C06289k497k185j863j986k587l104l059k605k194j963j803j752j947k270
$$ plain form
61692 406793 402314 398524 395408 392714 390307 388140 386011 383578 380651 377462 374548 372266 370446 368648
61678 368648 366778 365206 364183 363398 362304 360758 359037 357364 355750 354266 353145 352438 351809 350881 349680
61663 349680 348631 348174 348461 349277 350142 350587 350541 350463 350984 352329 354134 355919 357633 359609 361977 364320 366166
61646 366166 367742 369993 373725 378850 384557 390067 395082 399682 404092 408533 413063 417470 421381 424486
61632 424486 426502 427021 425671 422550 418275 413484 408445 403318 398572 394770 392003 389800 387671 385533
61618 385533 383586 382062 381207 381241 382045 383001 383459 383318 382931 382456 381598 380045 377804 374901 371045 365980 360084
61601 360084 354250 349056 344290 339407 334320 329560 325695 322734 320147 317423 314494 311608 308900 306289
61587 306289 303792 301607 299744 297758 295171 292067 289008 286403 284209 282246 280443 278691 276744 274474
61573B74474k433k420k454k551k390j836j234j033j248j490j439j139q61p46o70
61558B50530l71J94O78N84k33j289j758j196j2Q53Q48L43J17M11P53O81K77o4
61540B51346q4K46P77J153J026N42L20O89J218J314J041R35J173J347J062M13
61524B64518j97m67m68o45j404k518l149k822k069j720j777j569r20m98q37j546
61508B41912j829j419p03j08L30P90J277J470J036J10p22j013r25q84j022j184
61492B37116j301j358j169n76J40N02M48L12L07L17K22Ll70q09r42n55j1K58N22
61473B33056J318K357K676J997J112O56L86m7l94m25n10q75r68k75O49Q56L32
61456B41901j25j51r7j45K9N36R91J174J372J726J781J146K64m9L66Q51Q52N54
$$ plain form
61573 274474 272041 269621 267167 264616 262226 260390 259156 258123 256875 255385 253946 252807 251946 251200 250530
61558 250530 250159 250353 251031 251615 251382 250093 248335 247139 247127 247980 248828 249171 249288 249699 250452 251133 251410 251346
61540 251346 251262 251508 252285 253438 254464 255006 255326 256015 257233 258547 259588 260523 261696 263043 264105 264518
61524 264518 264321 263854 263386 262741 261337 258819 255670 252848 250779 249059 247282 245713 244793 244295 243458 241912
61508 241912 240083 238664 237961 237853 238183 238973 240250 241720 242756 242866 242144 241131 240206 239322 238300 237116
61492 237116 235815 234457 233288 232712 232852 233354 233802 234114 234421 234738 234960 234963 234593 233784 232842 232287 232276 232534 233056
61473 233056 234374 236731 239407 241404 242516 243172 243558 243511 243117 242692 242182 241307 240339 240064 240713 241569 241901
61456 241901 241776 241625 241528 241383 241412 241948 242939 244113 245485 247211 248992 250138 250402 250353 250719 251570 252422 252976
61438B52976M64P01J029J387J952K642L066L119L245L738M141L837K959K206J823
61423B89285J385O21j65n92o36l87J08O72J050J317J725K106J963J354R16Q49
61407C01571N20m54j478j907k046k524l203l488l333l149k981k538j954j681j730
61392B69625j651j310j024q59m73J93O48N59K21Q3J13L4j11L4O00J193J331J076
61374B70282J036J595K279K302J700J357J808K531K786K595K457K494K446K266
61360B99934K189K360K772L384L889L792L112K661L084L992M612M958N576O481
61346C52796P141P325P172O562N325M001L418L509L393K806K489K931L656M105
61332D16629M347M461M010K800J435N27j30r99j939k598l170l980m625m345l264
$$ plain form
61438 252976 253440 254141 255170 256557 258509 261151 264217 267336 270581 274319 278460 282297 285256 287462 289285
61423 289285 290670 291291 291126 290534 289898 289511 289619 290291 291341 292658 294383 296489 298452 299806 300722 301571
61407 301571 302091 301637 300159 298252 296206 293682 290479 286991 283658 280509 277528 274990 273036 271355 269625
61392 269625 267974 266664 265640 264781 264308 264501 265149 265708 265929 266012 266125 266159 266048 266082 266682 267875 269206 270282
61374 270282 271318 272913 275192 277494 279194 280551 282359 284890 287676 290271 292728 295222 297668 299934
61360 299934 302123 304483 307255 310639 314528 318320 321432 324093 327177 331169 335781 340739 346315 352796
61346 352796 359937 367262 374434 380996 386321 390322 393740 397249 400642 403448 405937 408868 412524 416629
61332 416629 420976 425437 429447 432247 433682 434209 434079 433080 431141 428543 425373 421393 416768 412423 409159
61317D09159k451k561l015k832j874q63l17R1R83K345L518M097M456N161O207
61302D22104P163P794Q045P670O481M848L336J867p1k361m186n140n645n980n768
61287D40157m882m072l970m125l766l012k508k225j619p67l39l64j7J092K245
61272D11828K734L005L954N470O508O517O149O221O633O721O331N976O011O260
61258D90318O533O988P709Q407Q783Q819Q385P117N156L469K781K585K073J588
61244E70711J992K792K324J34k144k998l005l682n184o335o454o067n917o157
61230E30010o609p050p096o351m895l298k149j683j721j700j098j29L49Ml31K17
61214D86470J220J578J238J262K142L071L227K834K442J935J055K90L49R71J170
$$ plain form
61317 409159 406708 404147 401132 398300 396426 395563 395246 395337 396320 398665 402183 406280 410736 415897 422104
61302 422104 429267 437061 445106 452776 459257 464105 467441 469308 469237 466876 462690 457550 451905 445925 440157
61287 440157 435275 431203 427233 423108 419342 416330 413822 411597 409978 409211 408872 408508 408491 409583 411828
61272 411828 414562 417567 421521 426991 433499 440016 446165 452386 459019 465740 472071 478047 484058 490318
61258 490318 496851 503839 511548 519955 528738 537557 545942 553059 558215 561684 564465 567050 569123 570711
61244 570711 572703 575495 577819 577953 575809 572811 569806 566124 560940 554605 548151 542084 536167 530010
61230 530010 523401 516351 509255 502904 498009 494711 492562 490879 489158 487458 486360 486231 486580 486584 486253 486470
61214 486470 487690 489268 490506 491768 493910 496981 500208 503042 505484 507419 508474 508764 509113 510084 511254
61199E11254P89R54K593N111P061P878Q325R402J1306J3536J5404J6256J5626
61186F25495J3644J1061Q591O415M603L555L499L881L902L520L258L127K595J654
61172F98800J034J022R47K61o23j087j235j449j622j629k030l397n239o527p152
61157F70074q017r547j0962j1320j0692r917r554r419q963p891o347m646k986
61144E59813j555r31j833m252p167r493j1008j2008j2453j2034j0851r401p889
61131D58938o155m246k625j681j345j236q49K60K121M156N702O732P778R178J0732
61116D87460J2065J3044J3845J4858J6401J8272J9763K0413K0573K0893K1484
61105F79071K1941K2036K1820K1295K0408J9282J7983J6198J3685J0874Q392O071
$$ plain form
61199 511254 512043 512997 515590 520701 527762 535640 543965 553367 564673 578209 593613 609869 625495
61186 625495 639139 650200 658791 665206 669809 673364 676863 680744 684646 688166 691424 694551 697146 698800
61172 698800 699834 700856 701803 702064 701441 700354 699119 697670 696048 694419 692389 688992 683753 677226 670074
61157 670074 662057 652510 641548 630228 619536 609619 600065 590646 581683 573792 567445 562799 559813
61144 559813 558258 557327 555494 551242 544075 534582 523574 511566 499113 487079 476228 466827 458938
61131 458938 452783 448537 445912 444231 442886 441650 440801 441061 443182 447338 453040 459772 467550 476728 487460
61116 487460 499525 512569 526414 541272 557673 575945 595708 616121 636694 657587 679071
61105 679071 701012 723048 744868 766163 786571 805853 823836 840034 853719 864593 872985 879056
61093H79056L140n68m225p059r172j1126j3106j4815j5909j6317j6337j6420j6720
61080G40422j6926j6791j6578j6604j6572j5914j4687j3517j2677j1818j0732
61069E77606r749r165q705p830o311m418k694j604j139q22k66M63J229K186L447
61054E32228M719N728O639P550Q065P990Q013Q907J0474J2016J3447J5028J6494
61041F57298J7510J8636K0711K3527K6207K8647L1363L4205L6631L9005M2093
61030I75833M5389M7519M8287M8659M8872M8459M8309N0451N5334O1518O8484
61019A547114P7421Q8413R9510J09883J21567J36735J55733J79351K10224K49959
61009B975910K97807L54605M25012N12914O18063P40786Q85471J054158J242665
$$ plain form
61093 879056 882196 881628 877403 870344 861172 850046 836940 822125 806216 789899 773562 757142 740422
61080 740422 723496 706705 690127 673523 656951 641037 626350 612833 600156 588338 577606
61069 577606 567857 558692 549987 542157 535846 531428 528734 527130 525991 525169 524903 525366 526595 528781 532228
61054 532228 536947 542675 549314 556864 564929 572919 580932 589839 600313 612329 625776 640804 657298
61041 657298 674808 693444 714155 737682 763889 792536 823899 858104 894735 933740 975833
61030 975833 1021222 1068741 1117028 1165687 1214559 1263018 1311327 1361778 1417112 1478630 1547114
61019 1547114 1624535 1712948 1812458 1922341 2043908 2180643 2336376 2515727 2725951 2975910
61009 2975910 3273717 3628322 4053334 4566248 5184311 5925097 6810568 7864726 9107391
61000I107391J451452J689505J939895K111579K054940J669867J016651L05819
60992B1347099k38209n06884n15744l27422j2704L12853M70441L00705k10203
60983B0619932q98156j527072j932534k080172k024033j840507j595726j340211
60975G381521j105918r04617p35806n97143m86418l98533l27054k68670k23004
60966B334358j88749j62756j42425j26479j13610j02408r2454q3849p5956o8004
60956A177668o0291n3417m6898m0075l3827k9783k8179k7847k7946k8198k7898
60945G73309k6257k3663k1229j9200j7039j4832j3221j2145j1013j0013r870j0321
60933E84506j0293r712r641j0425j1090j0980j0612j0437j0001r082q437q610
$$ plain form
61000 9107391 10558843 12248348 14188243 16299822 18354762 20024629 21041280 21347099
60992 21347099 21108890 20602006 20086262 19758840 19746136 20058989 20529430 20830135 20619932
60983 20619932 19721776 18194704 16262170 14181998 12157965 10317458 8721732 7381521
60975 7381521 6275603 5370986 4635180 4038037 3551619 3153086 2826032 2557362 2334358
60966 2334358 2145609 1982853 1840428 1713949 1600339 1497931 1405477 1321628 1245672 1177668
60956 1177668 1117377 1063960 1017062 976987 943160 913377 885198 857351 829405 801207 773309
60945 773309 747052 723389 702160 682960 665921 651089 637868 625723 614710 604697 594827 584506
60933 584506 574213 564501 554860 544435 533345 522365 511753 501316 491315 482233 473796 465186
60921D65186q878q274o966n831n179m665m047l396k768k142j540q65O6J115J760
60906D13576J737J406J258J347J430J329R07J17p11r80n57m0l8m40p17o60n27
60889D18437o74j312k475l882m959n324n251n394o046o794o978o362n306m286
60875C53394l412k519j594q55l84j6L58O84J053J752K773L661M132M442M918N450
60859C73837N845O236O635O500N418L971L286L754M716N308N132M264L095K061
60845D40058J204K10q09j058j71J006J427J182R38N79m58j893k921l685n018o693
60829D23898p377o667n744n475n223m283l284l115l419l234k483j773j228n20
60815C70073K42O21O47P46R97J136J223J719K860M356N701O521O759O802P236
$$ plain form
60921 465186 456308 448034 441068 435237 430058 425393 421346 417950 415182 413040 411500 410635 410701 411816 413576
60906 413576 415313 416719 417977 419324 420754 422083 422990 423107 422396 421416 420859 420819 420781 420341 419624 418964 418437
60889 418437 417763 416451 413976 410094 405135 399811 394560 389166 383120 376326 369348 362986 357680 353394
60875 353394 349982 347463 345869 345014 344630 344614 344972 345656 346709 348461 351234 354895 359027 363469 368387 373837
60859 373837 379682 385918 392553 399053 404471 408442 411728 415482 420198 425506 430638 434902 437997 440058
60845 440058 441262 441472 440663 439605 439434 440440 441867 443049 443987 444566 444108 442215 439294 435609 430591 423898
60829 423898 416521 409854 404110 398635 393412 389129 385845 382730 379311 376077 373594 371821 370593 370073
60815 370073 370315 370936 371583 372329 373326 374462 375685 377404 380264 384620 390321 396842 403601 410403 417639
60800D17639Q322R839J1474J3084J4452J5368J6073J7107J8567K0047K1519K3465
60788F06956K5850K7721K8458K8738K9607L1100L2411L2895L2354L0788K8435
60777I35313K5546K1716J6076Q803J622m046q735j3763j9039k3247k5773k7225
60765H87248k8137k8500k8498k8607k8680k7958k6318k4640k3621k2925k1891
60754E97473k0471j9144j8282j7827j7270j5964j3799j1539r992r037p996o760
60742D29392n852n514n473n630o134o752o924o666o631p066p361o925n947m994
60728C41523m372m045l714k888j354L60J482J913K124K220J876J200P23N12J72
60713C37732r8M31J540J745J74k091l328l190k633k461k733l227l670l783l615
$$ plain form
60800 417639 425961 435800 447274 460358 474810 490178 506251 523358 541925 561972 583491 606956
60788 606956 632806 660527 688985 717723 747330 778430 810841 843736 876090 906878 935313
60777 935313 960859 982575 998651 1007454 1009076 1005030 996295 982532 963493 940246 914473 887248
60765 887248 859111 830611 802113 773506 744826 716868 690550 665910 642289 619364 597473
60754 597473 577002 557858 539576 521749 504479 488515 474716 463177 453185 444148 436152 429392
60742 429392 423540 418026 412553 406923 400789 394037 387113 380447 373816 366750 359389 352464 346517 341523
60728 341523 337151 333106 329392 326504 325150 325510 326992 328905 331029 333249 335125 336325 337048 337560 337732
60713 337732 337634 338065 339605 341350 341524 339433 336105 332915 330282 327821 325088 321861 318191 314408 310793
60698C10793l611l917m021l545k920k732k827k683k266j885j533j033n96n15o06
60683B76103n74o34j053j364q43L66J355J648J487J076L72k40nJ112K124K211
60667B83141J609J013O31K72o8k65l45l34j4O78J241J090L86L6P55K320L778M268
60649C00192L777L262L860N697P574Q139P303O125N375M725L608K231J147K22
60635C63237j187k984m127l979l244l023l500m099m519m850m940m512l877l690
60621C10706l895l690k749j708j134p56k28Q4k52q56j068r92j221j664j536n72
60605B88469M35N88q4p88q59k84M43Q52R43J131J673K299K502K097J264K94m74
60588C00501o46j21O27R69P74M08J53mj09j22r7q5R3O84J517K124K426K928M094
$$ plain form
60698 310793 307182 303265 299244 295699 292779 290047 287220 284537 282271 280386 278853 277820 277224 276709 276103
60683 276103 275529 274895 273842 272478 271635 272001 273356 275004 276491 277567 277939 277699 277694 278806 280930 283141
60667 283141 284750 285763 286394 286666 286598 286333 285988 285654 285640 286318 287559 288649 289035 289071 289826 292146 295924 300192
60649 300192 303969 307231 311091 316788 324362 332501 339804 345929 351304 356029 359637 361868 363015 363237
60635 363237 362050 359066 354939 350960 347716 344693 341193 337094 332575 327725 322785 318273 314396 310706
60621 310706 306811 303121 300372 298664 297530 296774 296546 296630 296378 295522 294454 293462 292241 290577 289041 288469
60605 288469 288904 289492 289408 288620 287761 287477 287920 288772 289715 290846 292519 294818 297320 299417 300681 300975 300501
60588 300501 299855 299734 300361 301330 302104 302512 302665 302661 302552 302430 302333 302248 302341 303025 304542 306666 309092 312020 316114
60569C16114N706P078P822Q205Q802R779J0610J0589R554P896N804L032l37l384
60555D07270n230o072o761p398p173n630l367j231N77K295L989N581P098Q537
60541C92485R726J0535J0986J1002J0394R315Q261P308N806L276K09k519m638
60528D72146o251p018o399m719l137k361k054j691j299j001n75l4j6q87j794j482
60512D31428L7J532K265K786L744M745N085N049N676P448R971J2865J6250K0202
60498E29083K4342K8320L2199L5963L9029M0721M1008M0227L8149L3807K6441
60487I09289J6287M368q269k0742l2048m0990m6639m8855m8279m5851m2318l8079
60475E57874l3330k8332k3569j9612j6769j4837j3320j1892j0537r267p950o607
$$ plain form
60569 316114 321820 328898 336720 344925 353727 363506 374116 384705 394259 402155 407959 410991 410654 407270
60555 407270 402040 395968 389207 381809 374636 369006 365639 364408 364985 367280 371269 376850 383948 392485
60541 392485 402211 412746 423732 434734 445128 454443 462704 470012 475818 479094 479303 476784 472146
60528 472146 465895 458877 452478 447759 444622 442261 440207 438516 437217 436216 435641 435607 435591 434704 432910 431428
60512 431428 431465 432997 435262 438048 441792 446537 451622 456671 462347 469795 479766 492631 508881 529083
60498 529083 553425 581745 613944 649907 688936 729657 770665 810892 849041 882848 909289
60487 909289 925576 929944 921675 900933 868885 827895 781256 732401 684122 638271 595953 557874
60475 557874 524544 496212 472643 453031 436262 421425 408105 396213 385676 376409 368459 361852
60463C61852n579n134m996m657m054l574l385l183k689k059j599j392j424j823
60449C16304k565l210l272k858k589k782l009k591j413k4R47J347J411J306R39
60434B97941K44n75j172j378j280j053q04m91K8P18J151Q75Q6m32l25j05k10j20
60416B93098Q88K453L434L400K914K357J448J68p97j060j143j537j802j263j04
60401C02454R62J642K038J966J173R6l36K65J317J945J789J182P57Q55J212J358
60385C20675J285J399J725J794J491J355J640J787J372R32J106J606J800J825
60371C41792K176K620K470J728J042O70M07L29O31R20O48J87L22P88N21m84q88
60354C55879j0J152J476J291J575K554L809N046N988O126N398M573M182L635K222
$$ plain form
60463 361852 356273 351139 346143 341486 337432 333858 330473 327290 324601 322542 320943 319551 318127 316304
60449 316304 313739 310529 307257 304399 301810 299028 296019 293428 292015 291991 292938 294285 295696 297002 297941
60434 297941 298185 297610 296438 295060 293780 292727 291923 291432 291460 292178 293329 294204 294290 293858 293533 293428 293218 293098
60416 293098 293986 296439 299873 303273 306187 308544 309992 310160 309363 308303 307160 305623 303821 302558 302454
60401 302454 303416 305058 307096 309062 310235 310331 309995 310260 311577 313522 315311 316493 317250 318105 319317 320675
60385 320675 321960 323359 325084 326878 328369 329724 331364 333151 334523 335455 336561 338167 339967 341792
60371 341792 343968 346588 349058 350786 351828 352498 352905 353234 353865 354785 355433 355620 355942 356730 357251 356767 355879
60354 355879 355869 357021 358497 359788 361363 363917 367726 372772 378760 384886 390284 394857 399039 402674 404896
60339D04896M74m45m24n00j363k649l756m527m896m590l572k408j817k003k570
60324C69850k892k556j631n81J14K85L7l74n76k36N22J151J363J603K506M023
60308C72608N496O481P128P813Q791J0312J2613J5410J7626J8048J6398J3555
60296E12279J0495P153K668l156r061j3368j5566j6380j6432j5545j3578j1201
60284D18308r328q082o882n421m066l208k700k110j384r21j045j550j889j824
60270C67898j661j823k320k838l161l258l044k419j516p52n40j044k011k768k629
60255C36114j631o17k39k52j78k19p20j131n05R58J935J764J172Q68N18k54p67
60238C36816j87J097J933J875J362P39j0o45o05K26J305K059K328K192J801J439
$$ plain form
60339 404896 405370 404925 404501 404001 402638 399989 396233 391706 386810 382220 378648 376240 374423 372420 369850
60324 369850 366958 364402 362771 362190 362304 362589 362626 362252 361676 361440 361962 363113 364476 366079 368585 372608
60308 372608 378104 384585 391713 399526 408317 418629 431242 446652 464278 482326 498724 512279
60296 512279 522774 529927 532595 529439 520378 507010 491444 475064 458632 443087 429509 418308
60284 418308 408980 400898 394016 388595 384529 381321 378621 376511 375127 374206 373161 371611 369722 367898
60270 367898 366237 364414 362094 359256 356095 352837 349793 347374 345858 345106 344566 343522 341511 338743 336114
60255 336114 334483 333866 333627 333375 333197 332978 332258 331127 330622 331580 333515 335279 336451 337319 337837 337583 336816
60238 336816 336629 337726 339659 341534 342896 343635 343625 342980 342375 342601 343906 345965 348293 350485 352286 353725
60222C53725J381J627J954K180K211J992J649J518J759K154K526L035L693M006
60208C85410L671L283L669M627N112M706M114M052M358M649N142O135P015O638
60194D52581M840K904K167K545K832K263J185K77k77n25l27K49N00k20j557k475
60178D66962k545k315k431l038m037n145n703n120l770k692k306k134j980k289
60164D21457k980l060k067q93m08j68N14J154R38K50P0L00J08l94k32P59J676
60147D17024K054K287K427J895P82K23Q58J925K448K502K668L051L569M512N982
60132D54207P177P019N444L538K500K668L354L433K369Q29j5J14L75O0m45l70
60116D92257L50J102J417J312J042Q73Q89Q64M52l09r51j156j075r66q63p27n79
$$ plain form
60222 353725 355106 356733 358687 360867 363078 365070 366719 368237 369996 372150 374676 377711 381404 385410
60208 385410 389081 392364 396033 400660 405772 410478 414592 418644 423002 427651 432793 438928 445943 452581
60194 452581 457421 460325 462492 465037 467869 470132 471317 471594 471317 470792 470465 470714 471214 470994 469437 466962
60178 466962 464417 462102 459671 456633 452596 447451 441748 436628 432858 430166 427860 425726 423746 421457
60164 421457 418477 415417 413350 412457 412049 411881 412395 413549 414487 414737 414807 415107 415215 414821 414589 415348 417024
60147 417024 419078 421365 423792 425687 426469 426692 427550 429475 431923 434425 437093 440144 443713 448225 454207
60132 454207 461384 468403 473847 477385 479885 482553 485907 489340 491709 492538 492523 492637 493012 493072 492627 492257
60116 492257 492607 493709 495126 496438 497480 498353 499242 500106 500558 500249 499298 498142 497067 496101 495238 494511 493932
60099D93932l94k50n83j746l174l702l028k194k164k555k443j762j143p99l84
60084D67611J97P03J142J701K090J715P31J99R16K467L790M246L899L085K022
60069D96514P13j011l174n340o821p340p248o961o510n867n370n408n880o324
60055D23973o524o542o235n276l816k549j830j154j9J072J208M76R8R44K528L754
60039D00108M153M031L834L850M229M817N121M787M007L191K401J476M94l37j032
60024D45130j748k425k981l672m773o011o736o725o350n993n675n271m704l963
60010C78103l273l150l754m367m017k688j310n80l92m44o48p63l78L61O87K72
59994C53659j74J71J110J753J606R12K12kN15J517K425K988L532M297M912M968
$$ plain form
60099 493932 493538 493288 492705 490959 487785 484083 481055 478861 476697 474142 471699 469937 468794 467995 467611
60084 467611 467808 468511 469653 471354 473444 475159 475890 476089 477005 479472 483262 487508 491407 494492 496514
60069 496514 497227 496216 493042 487702 480881 473541 466293 459332 452822 446955 441585 436177 430297 423973
60055 423973 417449 410907 404672 399396 395580 393031 391201 390047 390028 391100 392308 392784 392882 393826 396354 400108
60039 400108 404261 408292 412126 415976 420205 425022 430143 434930 438937 442128 444529 446005 446499 446162 445130
60024 445130 443382 440957 437976 434304 429531 423520 416784 410059 403709 397716 392041 386770 382066 378103
60010 378103 374830 371680 367926 363559 359542 356854 355544 354964 354572 354128 353480 352717 352339 352700 353387 353659
59994 353659 353485 353656 354766 356519 358125 359037 359249 359247 359762 361279 363704 366692 370224 374521 379433 384401
59978C84401M661M407M169L722L246K989K541J299l79j288q90n3Q6n30j077r89
59962D06315l68N50J688K858L607L609L027K307J730J274Q38L97m3n05j021j581
59946D24682k125k552k754k768k756k734k403j595p40n34j050j659j948k234k848
59931C93982l419l335k620j788j119o00l25l35k40L50J111J373J178J220J764
59916C87197K302K513K747L271L737L850L954M456N107N382N328N412N763N933
59902D46952N475M451L366K718K530K257J362m8j380k317l047l734m164m090l594
59887D46737k912k179j434n69P02K439M063M806M673M414M565N012N567O190O448
59872D88522N638L874K350J897J899J256j03j422k368l269m203m647m138k873
$$ plain form
59978 384401 389062 393469 397638 401360 404606 407595 410136 411435 411056 409768 408878 408825 408911 408381 407304 406315
59962 406315 405947 406497 408185 411043 414650 418259 421286 423593 425323 426597 427435 427832 427789 427284 426263 424682
59946 424682 422557 420005 417251 414483 411727 408993 406590 404995 404255 403721 402671 401012 399064 396830 393982
59931 393982 390563 387228 384608 382820 381701 381101 380776 380441 380201 380551 381662 383035 384213 385433 387197
59916 387197 389499 392012 394759 398030 401767 405617 409571 414027 419134 424516 429844 435256 441019 446952
59902 446952 452427 456878 460244 462962 465492 467749 469111 469063 467683 465366 462319 458585 454421 450331 446737
59887 446737 443825 441646 440212 439643 440345 442784 446847 451653 456326 460740 465305 470317 475884 482074 488522
59872 488522 494160 498034 500384 502281 504180 505436 505333 503911 501543 498274 494071 489424 485286 482413
59858D82413j535o80l07J05R80K072K808L235M046N494O845P192O328M524K059
59843E25579n68k597l671m077l953l012j568j051k495n042o958p670p889q006
59829D67022p577o375m927l770k954k375j962j515r57p45j318k219k455j837j139
59814D24897r65j136j357j661j942j809j290r76j203j551j554j314j068p39l10
59799D06022j61n27r81j006q20j114k003k804k894k471k282k700l302l443l085
59784C76429k782k862k965k595j753p75J04O43M50m77j373j466r03l13K81J264
59768C60907K338K613J922J141R51J118J276J560K057K465K751L419M469M903
59754C93890M109L079L266M571N545N418M923M982N497N816N749N637N769O069
$$ plain form
59858 482413 480878 480198 479891 479996 480976 483048 485856 489091 493137 498631 505476 512668 518996 523520 525579
59843 525579 525011 522414 518743 514666 510713 507701 506133 505082 502587 497545 490587 482917 475028 467022
59829 467022 459445 453070 448143 444373 441419 439044 437082 435567 434610 433865 432547 430328 427873 426036 424897
59814 424897 423932 422796 421439 419778 417836 416027 414737 413761 412558 411007 409453 408139 407071 406332 406022
59799 406022 405861 405334 404353 403347 402527 401413 399410 396606 393712 391241 388959 386259 382957 379514 376429
59784 376429 373647 370785 367820 365225 363472 362697 362801 363444 363894 363417 362044 360578 359675 359362 359643 360907
59768 360907 363245 365858 367780 368921 369872 370990 372266 373826 375883 378348 381099 384518 388987 393890
59754 393890 397999 401078 404344 408915 414460 419878 424801 429783 435280 441096 446845 452482 458251 464320
59740D64320O147N560M263K879K207K327K500K094J218K78o61j648k370k426j972
59725D84716j586j505j438j182r13p55n90m88q76j809k548k392j680j387j773
59710D63794k092j666o90K11O97Q49R47J346K137K830K815K231J886K110K304
59695D79709J978J551J660K168K486K439K213J741Q42k62j142j721k096k051j432
59680D88083p26n89q30o86j55j80j249k572l173l209l537m308m697m179l438l515
59664D51040m275m386l061j235l64m69l22N03J004N40O9O57J776K184J857J795
59648D47313K298K713K757K800K823K274J141P3p82j997l590m623m531l926l554
59633D41189l297k765k127j684j278p22l02k93m69n96r15j652k484k945k947k548
$$ plain form
59740 464320 470467 476027 480290 483169 485376 487703 490203 492297 493515 493793 493132 491484 489114 486688 484716
59725 484716 483130 481625 480187 479005 478092 477337 476747 476259 475383 473574 471026 468634 466954 465567 463794
59710 463794 461702 460036 459346 459557 460254 461103 462050 463396 465533 468363 471178 473409 475295 477405 479709
59695 479709 481687 483238 484898 487066 489552 491991 494204 495945 496787 496525 495383 493662 491566 489515 488083
59680 488083 487357 486768 485938 485252 485097 484917 483668 481096 477923 474714 471177 466869 462172 457993 454555 451040
59664 451040 446765 442379 439318 438083 437719 437250 436928 437431 438435 438975 439044 439701 441477 443661 445518 447313
59648 447313 449611 452324 455081 457881 460704 462978 464119 464192 463410 461413 457823 453200 448669 444743 441189
59633 441189 437892 435127 433000 431316 430038 429316 429014 428721 428252 427656 426741 425089 422605 419660 416713 414165
59617D14165j780j086j273k422l501l651l295l204l155k455j380q69r70o82M71
59602C84913J659J898J248M68Ok20l99n50n54k95J42L71R7m16n38m4O14R09Q49
59583C90158P73Q05P63N02N5n60j386k323l081l493l738m034m172l695k618j732
59567C62224j830k839l822l844k656p55R75J825J834J719J953K127J551L78m44
59552C58396l20L84J036J550K183K891L296L264L208L693M746N700O014O150P155
59537D09346R225J1415J3283J5867J9786K2803K1019J3076K101p118j2061j3194
59525E05548j2026r725p060m396j590J425L930M907M285L104K384K241K178J676
59511D96881M14j616l841n332n678n564o064p367q536q691q076p575p377o786
$$ plain form
59617 414165 412385 411299 410026 407604 404103 400452 397157 393953 390798 388343 386963 386094 385124 384442 384913
59602 384913 386572 388470 389718 390186 390192 389972 389573 389023 388469 388174 388316 388687 388784 388368 387830 387786 388400 389309 390158
59583 390158 390931 391736 392499 393001 393056 392496 391110 388787 385706 382213 378475 374441 370269 366574 363956 362224
59567 362224 360394 357555 353733 349889 347233 346478 347453 349278 351112 352831 354784 356911 358462 358840 358396
59552 358396 358076 358460 359496 361046 363229 366120 369416 372680 375888 379581 384327 390027 396041 402191 409346
59537 409346 418571 429986 443269 459136 478922 501725 522744 535820 537921 530803 518742 505548
59525 505548 493522 483797 476737 472341 470751 472176 476106 481013 485298 488402 490786 493027 495205 496881
59511 496881 497295 495679 491838 486506 480828 475264 469200 461833 453297 444606 436530 428955 421578 414792
59497D14792n382l806k999l124l582l758l349k388j389j060j377j353l29R96J533
59482C83425J307J117J125R85R94J869L281M018L759L498L845M157L803L097K417
59467D22697J527M48r2K11N30J98k71j91J29J80L69J258K382K911L040L630M842
59450D43798O094P071P903Q500Q623Q366P978P332O264M998L693J954n31l255
59436E18788n475p057q107q321p591o660o266o049n309m363m039m187l805k442
59422D39117n20J575L663N333O400P552R577J2188J4576J6713J8927K0843K2292
59409E78236K4559K8419L1035K7490J6411K130r802j7335k1088k1272j7845j2314
59397F08624o678r72N615J1145J1089L230r119k0083k6316k8221k7362k4584k0579
$$ plain form
59497 414792 409410 405604 402605 399481 395899 392141 388792 386404 385015 383955 382578 381225 380896 381892 383425
59482 383425 384732 385849 386974 387959 388953 390822 394103 398121 401880 405378 409223 413380 417183 420280 422697
59467 422697 424224 424672 424580 424791 425321 425519 425248 425057 425186 425366 425735 426993 429375 432286 435326 438956 443798
59450 443798 449892 456963 464866 473366 481989 490355 498333 505665 511929 516927 520620 522574 522043 518788
59436 518788 513313 506256 498149 489828 482237 475577 469311 463262 457953 453590 449551 445364 441559 439117
59422 439117 438597 440172 443835 449168 455568 463120 472697 484885 499461 516174 535101 555944 578236
59409 578236 602795 631214 662249 689739 706150 708280 698478 681143 660055 638783 620938 608624
59397 608624 601946 600974 606589 617734 628823 632053 622934 602851 576535 548314 520952 496368 475789
59384D75789j6518j3220j0464p817n662m690m648m441l515k361j494o25O37J841
59370D02812K104J332M11J87O10R91Q02K20o5L89J180J546J456J707K748L997
59354D22427M734N129N781O728P576Q270R005R663J0094J0684J1885J3325J4220
59341E39521J4551J5031J5894J6543J6483J5809J4636J2875J0773Q912P365N463
59329F93856K715n59l720o365q196q968q993r110r747j0363j0170r083p668o448
59315E97181n553m848m151l400k718k185j642r03j3R89K375M296O299P868R286
59300F02881J1151J2899J2606Q708J569o736j3797j8011j9143j8214j6556j4733
59288E42624j2583j0125p811n871m039k231r33n62q26r79m60Q11K472L918M755
$$ plain form
59384 475789 459271 446051 435587 427770 422108 417418 412770 408329 404814 402453 400959 400334 400971 402812
59370 402812 404916 406248 406659 406846 407456 408447 409249 409469 409404 409793 410973 412519 413975 415682 418430 422427
59354 422427 427161 432290 438071 444799 452375 460645 469650 479313 489407 500091 511976 525301 539521
59341 539521 554072 569103 584997 601540 618023 633832 648468 661343 672116 681028 688393 693856
59329 693856 696571 696012 692292 685927 677731 668763 659770 650660 640913 630550 620380 611297 603629 597181
59315 597181 591628 586780 582629 579229 576511 574326 572684 571781 571768 572757 575132 579428 585727 593595 602881
59300 602881 614032 626931 639537 648245 649814 643078 629281 611270 592127 573913 557357 542624
59288 542624 530041 519916 512105 506234 502195 499964 499031 498469 497643 496664 496204 497015 499487 503405 508160
59273E08160N178N698O558P719R146J0654J1650J1667J1100J0759J0791J0613
59261F19693R803Q339O111L072q0k348l670m945o632q236r302j0013j0467j0372
59247E80953r772r273r040q462p249n930m843l537j868p23q28j507j573q65l5
59232E15448O89J593K586L148L059K624K188J871J590J006k98k236m182n730p044
59217E16312q136q468p865p176p290p882p853o778n188l755k790k392k449k533
59203D35757k294j794j164k58Q81J635J497R42R24J643K428K732K663K498K214
59188D50304J714J144Q18R32J366J776J979K250K985M036M834N213N568N995N924
59173D96838N040M038L877M674N747O441O514O106N685N765O273O624O692P098
$$ plain form
59273 508160 513338 519036 525594 533313 542459 553113 564763 576430 587530 598289 609080 619693
59261 619693 629496 637835 643946 647018 646938 644590 640920 635975 629343 621107 611805 601792 591325 580953
59247 580953 571181 561908 552868 544406 537157 531227 526384 522847 520979 520256 519428 517921 516348 515483 515448
59232 515448 516137 517730 520316 523464 526523 529147 531335 533206 534796 535802 535504 533268 529086 523356 516312
59217 516312 508176 499708 491843 484667 477377 469495 461642 454864 449676 445921 443131 440739 438290 435757
59203 435757 433463 431669 430505 430247 431128 432763 434260 435202 436126 437769 440197 442929 445592 448090 450304
59188 450304 452018 453162 453980 454912 456278 458054 460033 462283 465268 469304 474138 479351 484919 490914 496838
59173 496838 501878 505916 509793 514467 520214 526655 533169 539275 544960 550725 556998 563622 570314 577412
59159E77412Q101Q838Q362O918N467M275K775N58k139m803o877p880p881p731
59145E85395q250r336j0206j0346r791q819p825p148o589n490l792k525k578l404
59131D89296l686k929j601j20J399K556K879K638K743L646M938O048O811P273
59117E21891P548P826Q233Q659R006R386R691R498Q822Q432Q735Q930Q124O813
59103F41594O171O266O154N557N178N242M997M002K819J960J109j40j486k391
59089F87032k808k957k943k906l115l584m001m224m437m765n194n938p254q801
59075F24105r856j0290j0588j0775j0222q972q180q589r264q765p077n465m673
59062E11389m266l797l641m188m831m508l121j829j710k508l077k875k388k168
$$ plain form
59159 577412 585513 594351 602713 609631 615098 619373 622148 622706 620567 615764 608887 601007 593126 585395
59145 585395 577145 567809 557603 547257 537466 528647 520822 513674 507085 501595 497803 495278 492700 489296
59131 489296 485610 482681 481080 480960 482359 484915 487794 490432 493175 496821 501759 507807 514618 521891
59117 521891 529439 537265 545498 554157 563163 572549 582240 591738 600560 608992 617727 626657 634781 641594
59103 641594 647765 654031 660185 665742 670920 676162 681159 685161 687980 689940 691049 690909 689423 687032
59089 687032 684224 681267 678324 675418 672303 668719 664718 660494 656057 651292 646098 640160 632906 624105
59075 624105 614249 603959 593371 582596 572374 563402 555222 546633 537369 528604 521527 516062 511389
59062 511389 507123 503326 499685 495497 490666 486158 483037 481208 479498 476990 473913 471038 468650 466482
59048D66482k062j754j414j320j229p73j57J64K28M25P33P94N97M81N70P59J134
59031D63658J748K173K057J974K834M475N797O366O915Q028R318J0277J1026J1752
59017E48398J2239J2530J3312J4881J6234J5970J3765J0423O816L328J17k607
59005F65406m559n446n252m512l914l505k722j382M8J347K899M682N677N025L269
58990F57061J630M94n90j723k426k566k702l351m521o000p568q797r211q788p870
58975E93072o554m698k630j182o46j70J265L566N676O819P104P006O764O472O331
58960F28195O502O838P010O798O165N150L901K611J204p41l387o082p864q555
58946F47745q877r399r883r899r557r171q578p371n653m080l116k668k465k450
$$ plain form
59048 466482 464420 462666 461252 459932 458703 457930 457773 457937 458165 458590 459323 460117 460714 461195 461765 462524 463658
59031 463658 465406 467579 469636 471610 474444 478919 484716 491082 497997 506025 515343 525620 536646 548398
59017 548398 560637 573167 586479 601360 617594 633564 647329 657752 664568 667896 668013 665406
59005 665406 660847 655401 650149 645637 641723 638218 635496 634114 634162 635509 638408 643090 648767 653792 657061
58990 657061 658691 659185 658595 656872 654446 651880 649178 645827 641306 635306 627738 618941 609730 600942 593072
58975 593072 586518 581820 579190 578008 577362 577192 578457 582023 587699 594518 601622 608628 615392 621864 628195
58960 628195 634697 641535 648545 655343 661508 666658 670559 673170 674374 673633 670246 664164 656300 647745
58946 647745 638868 629469 619586 609687 600130 590959 582381 575010 569357 565277 562161 559493 557028 554578
58932E54578k726l238l671l704l404l233l388l328k449j144m84p37j079j051j276
58917E19666k127k674k004p88l65q38j278j391j521j299M3J952K785K216J970
58902E14347L451N882P668Q505R152R917J0429J0478J0159R523Q729Q259Q286
58889F24785Q226P609P072P779R977J2713J4887J6075J6377J6049J5320J4247
58877G71116J2679J0550Q072N503K824j11l276o485r553j2270j4322j5451j5572
58864G33704j4777j3359j1817j0537r462q376p469p203p556p979q099q054q037
58851F10979q053q177q464q529p846o667n862n618n103l805k395j671j419j083
58837E36287r37j699l319n000o144o596o210n017l688l089l257l434l131k604
$$ plain form
58932 554578 551852 548614 544943 541239 537835 534602 531214 527886 525437 524293 523809 523072 521993 520942 519666
58917 519666 517539 514865 512861 512073 511708 510870 509592 508201 506680 505381 505424 507376 510161 512377 514347
58902 514347 517798 523680 531348 539853 549005 558922 569351 579829 589988 599511 608240 616499 624785
58889 624785 633011 640620 647692 655471 665448 678161 693048 709123 725500 741549 756869 771116
58877 771116 783795 794345 802417 807920 810744 810633 807357 800872 791319 779049 764727 749276 733704
58864 733704 718927 705568 693751 683214 673752 665376 657907 650704 643148 635169 627070 619016 610979
58851 610979 602926 594749 586285 577756 569910 563243 557381 551763 546660 542855 540460 538789 537370 536287
58837 536287 535350 533651 530332 525332 519188 512592 506382 501365 497677 494588 491331 487897 484766 482162
58823D82162k244k073j950j842j692j358p81m9P62J524J919J708J205J145J861
58808D80297K865L409L332L073K891K394J093o69j810j671p55nK48K10j38r90
58792D93774k028k617k694k817l134l117k465j586p86K38J672L022L785M148M464
58777D89859M628M596M881N809O640O309M774K928J253n52k633m393n154m987
58763E13958m606m656n172n610n384m442l232k135j218n89n08q37q05J90J772
58748D76726L006L444L367L167K912K512K007J657J808K499L154L009K056J189
58734E12513J225K059L081L919M477M626M336L961L969M441N066N394N005L793
58720E67865K301J390J312J488J441J391J618J894K057K593L909N448O239O055
$$ plain form
58823 482162 479918 477845 475895 474053 472361 471003 470222 470173 470935 472459 474378 476086 477291 478436 480297
58808 480297 483162 486571 489903 492976 495867 498261 499354 498685 496875 495204 494449 494444 494692 494902 494764 493774
58792 493774 491746 489129 486435 483618 480484 477367 474902 473316 472530 472768 474440 477462 481247 485395 489859
58777 489859 494487 499083 503964 509773 516413 522722 527496 530424 531677 531125 528492 524099 518945 513958
58763 513958 509352 504696 499524 493914 488530 484088 480856 478721 477503 476914 476406 475569 474764 474954 476726
58748 476726 479732 483176 486543 489710 492622 495134 497141 498798 500606 503105 506259 509268 511324 512513
58734 512513 513738 515797 518878 522797 527274 531900 536236 540197 544166 548607 553673 559067 564072 567865
58720 567865 570166 571556 572868 574356 575797 577188 578806 580700 582757 585350 589259 594707 600946 607001
58706F07001N380M493L254J698J63j155k302l319m293n549p292r202j0849j2244
58692E65784j3541j4412j4328j3340j1997j0587r003p316n880m785l724k577j681
58679D52613j357j495j742j930k168k598l105l230k542j139L95J609K503L173
58665D38987L599L950M709O114P762R007R490R091P768N715L370J046j106k736
58651E06766l466l625m107n137n874n623m725l775k741j558q23j051j727j900
58637D60634j309k57J030K108K106Q19m59k98J039K169K573K778K890K339J200
58622D79362M29M31M65j02q24r01k09Q48J944K962L888M771N561N931N655M975
58606E15186M213L253J900M81n86j503k648l604l536k450j264o62o82j304k535
$$ plain form
58706 607001 612381 616874 620128 621826 621989 620834 618532 615213 610920 605371 598079 588877 578028 565784
58692 565784 552243 537831 523503 510163 498166 487579 478576 471260 465380 460595 456871 454294 452613
58679 452613 451256 449761 448019 446089 443921 441323 438218 434988 432446 431307 431702 433311 435814 438987
58665 438987 442586 446536 451245 457359 465121 474128 483618 492709 500477 506192 509562 510608 509502 506766
58651 506766 503300 499675 495568 490431 484557 478934 474209 470434 467693 466135 465312 464261 462534 460634
58637 460634 459325 459068 460098 462206 464312 465131 464672 464374 465413 467582 470155 472933 475823 478162 479362
58622 479362 479791 480222 480687 480585 479761 478860 478651 479499 481443 484405 488293 493064 498625 504556 510211 515186
58606 515186 519399 522652 524552 525033 524447 522944 520296 516692 513156 510706 509442 508780 508098 506794 504259
58591E04259l784m088l194j798n96K37O66P21Q86J774L244M561N428O126O651
58576E21093O671O484O946Q174R216R374Q999Q589Q069P448P343Q180R520J0808
58562F36914J2181J3938J5761J7117J8039J8949J9949K0820K1393K1483K0640
58551H37184J8466J5069J0933O482K062j854m790o628p690q427r062r439r277
58538H33029q729q522r317j1116j3446j5907j8107j9433j9488j8598j7368j5850
58526F57148j3765j1330r175p475n781l831j905l60O60J034P67K69k1j98n32p04
58510F04801j63Q63J502J431J140J000Q12M22n2p11j784k915l317k905k448k361
58494E95315k175j492p07l76m45m85k02N26J588K497K845K939L348L943M211M471
$$ plain form
58591 504259 500475 496387 493193 491395 490799 491036 491702 492423 493309 495083 498327 502888 508316 514442 521093
58576 521093 527764 534248 541194 549368 558584 567958 576957 585546 593615 601063 608406 616586 626106 636914
58562 636914 649095 663033 678794 695911 713950 732899 752848 773668 795061 816544 837184
58551 837184 855650 870719 881652 888134 890196 888342 883552 876924 869234 860807 851745 842306 833029
58538 833029 824300 815778 806461 795345 781899 765992 747885 728452 708964 690366 672998 657148
58526 657148 643383 632053 622878 615403 609622 605791 603886 603526 604186 605220 605987 606256 606235 606037 605505 604801
58510 604801 604638 605501 607003 608434 609574 610574 611386 611808 611756 611045 609261 606346 603029 600124 597676 595315
58494 595315 593140 591648 590941 590565 590120 589635 589433 589959 591547 594044 596889 599828 603176 607119 611330 615801
58478F15801N682P896R952J1149J2126J3566J5000J5568J5120J3854J1643Q442
58466G55799M800J241k242n541p865q634q390q059p630o394m250k018m08P64K234
58451G03407M407O835Q507Q776P987O947N849M181J719r85l358n468p582r417
58437G31805j0243r543p515n035l149k238j635m28J515L569N206O298O831P001
58423G22439P399Q411R551J0098J0200J0491J0792J0240Q672O803M932K574l41
58410H22261k999m807o027o912p167o758o346o381o419n891m925l973l131k229
58396G48296j154J27J477K500L106L915N389O744O757N577M549M300M147L604
58382G99334L090K846K409J680J380J869K501K622K341J884J216O23O96J342J830
$$ plain form
58478 615801 621483 629379 639331 650480 662606 676172 691172 706740 721860 735714 747357 755799
58466 755799 760599 761840 759598 754057 746192 737558 729168 721109 713479 707085 702835 700817 700409 701173 703407
58451 703407 707814 714649 723156 731932 739919 746866 752715 756896 758615 757630 754272 748804 741222 731805
58437 731805 721562 712019 704504 699469 696320 694082 692447 692019 693534 697103 702309 708607 715438 722439
58423 722439 729838 738249 747800 757898 768098 778589 789381 799621 808293 815096 820028 822602 822261
58410 822261 819262 814455 808428 801516 794349 787591 781245 774864 768445 762554 757629 753656 750525 748296
58396 748296 747142 747269 748746 751246 754352 758267 763656 770400 777157 782734 787283 791583 795730 799334
58382 799334 802424 805270 807679 809359 810739 812608 815109 817731 820072 821956 823172 823795 824491 825833 827663
58367H27663K075K852M408O029P317Q634R940J0466J0084R740J0058J0690J1433
58354I31389J2663J4134J4792J4289J3310J1919R280N678K974K087J696O10j67
58341A034654Q09L069N147O672Q052R081R403R640J0678J2297J3579J4163J4281
58328A151525J4165J4114J4413J4648J3984J2560J1477J0981R990Q123O604O251
58316A288835O180N550N120N812P023P732Q079Q647R304R899J0994J2756J4261
58303A400192J4974J5729J7236J8796J9510J9562J9327J8611J7694J7590J8319
58292A597540J8497J7691J7347J8324J9432J9747K0369K2331K4693K6358K7893
58281A830222K9837L1101L0923L0619L1478L2624L2911L3188L4698L6895L8773
$$ plain form
58367 827663 829738 832590 836998 843027 850344 858978 868918 879384 889468 899208 909266 919956 931389
58354 931389 944052 958186 972978 987267 1000577 1012496 1021776 1027454 1030428 1032515 1034211 1034821 1034654
58341 1034654 1035463 1038532 1043679 1050351 1058403 1067484 1076887 1086527 1097205 1109502 1123081 1137244 1151525
58328 1151525 1165690 1179804 1194217 1208865 1222849 1235409 1246886 1257867 1267857 1275980 1282584 1288835
58316 1288835 1295015 1300565 1305685 1311497 1318520 1326252 1334331 1342978 1352282 1362181 1373175 1385931 1400192
58303 1400192 1415166 1430895 1448131 1466927 1486437 1505999 1525326 1543937 1561631 1579221 1597540
58292 1597540 1616037 1633728 1651075 1669399 1688831 1708578 1728947 1751278 1775971 1802329 1830222
58281 1830222 1860059 1891160 1922083 1952702 1984180 2016804 2049715 2082903 2117601 2154496 2193269
58270B193269M0709M3157M5251M6542M8271N1052N3399N4489N6090N9532O3099
58259B754860O4815O5606O7143O8870O9861P1297P4262P7210P8485P9279Q1235
58248C552923Q3478Q4977Q7364R2234R8083J03195J09033J17323J26401J34129
58238D589140J41787J51204J60796J68525J76137J86198J97674K08768K21234
58229F201463K37196K54716K71449K89709L12610L38306L63684L90574M22386
58220I082093M57736M93816N33042N79683O33013O90693P55767Q33096R22206
58211A4981145J021321J134998J269992J427646J609034J823462K082925K393494
58203B7744017K762540L208677L752267M401288N159555O043850P081192Q299326
$$ plain form
58270 2193269 2233978 2277135 2322386 2368928 2417199 2468251 2521650 2576139 2632229 2691761 2754860
58259 2754860 2819675 2885281 2952424 3021294 3091155 3162452 3236714 3313924 3392409 3471688 3552923
58248 3552923 3636401 3721378 3808742 3900976 3999059 4102254 4211287 4328610 4455011 4589140
58238 4589140 4730927 4882131 5042927 5211452 5387589 5573787 5771461 5980229 6201463
58229 6201463 6438659 6693375 6964824 7254533 7567143 7905449 8269133 8659707 9082093
58220 9082093 9539829 10033645 10566687 11146370 11779383 12470076 13225843 14058939 14981145
58211 14981145 16002466 17137464 18407456 19835102 21444136 23267598 25350523 27744017
58203 27744017 30506557 33715234 37467501 41868789 47028344 53072194 60153386 68452712
58195F8452712R737399J1456346J3515962J5944397J8741020K1886554K5323462
58188A85057852K8945587L2601985L5958867L8138457L7502067L2172715K1292194
58181D11669724O059954j0485995k4907266l4898773l9878395m0579338l8297570
58174B28682341l4331458k9710644k5115413k0916605j7276109j4232160j1744237
58167G5355715r729484q102255o791431n733077m868362m154262l564771l078517
58159B9333556k673774k334757k051831j814027j609631j433669j285846j160946
58151A4969075j049451r47365q57030p78083p05676o38129n78477n27180m80267
58142H407417m36023l97389l66382l41562l21773l07047k94951k81166k64766
$$ plain form
58195 68452712 78190111 89646457 103162419 119106816 137847836 159734390 185057852
58188 185057852 214003439 246605424 282564291 320702748 358204815 390377530 411669724
58181 411669724 417729678 407243683 382336417 347437644 307559249 266979911 228682341
58174 228682341 194350883 164640239 139524826 118608221 101332112 87099952 75355715
58167 75355715 65626231 57523976 50732545 44999468 40131106 35976844 32412073 29333556
58159 29333556 26659782 24325025 22273194 20459167 18849536 17415867 16130021 14969075
58151 14969075 13919624 12972259 12115229 11337146 10631470 9993341 9414864 8887684 8407417
58142 8407417 7971394 7574005 7207623 6866061 6544288 6237241 5942290 5661124 5396358
58133E396358k48535k33653k18442k02629j88178j75407j62630j50148j40302
58124C676434j33105j25892j17880j11074j06131j01222r5618r0751q7053q3234
58114B624474p9174p6179p3923p0527o6086o2758o0875n8421n4838n1943n0358
58103A919392m8468m5715m3757m3343m3015m1847m0671l9713l7845l5099l3201
58092A466718l2630l1736k9699k7820k6864k5626k3279k0866j9338j8190j7077
58081A193593j6759j7446j8091j8183j8442j8975j8780j7829j7627j8770j9824
58070I92867j9586j8675j7948j7161j6147j5654j5914j5883j4881j3666j3051
58059H14301j2675j1928j0896r807q813q608r865j1707j2343j1539j0782j0587
$$ plain form
58133 5396358 5147823 4914170 4695728 4493099 4304921 4129514 3966884 3816736 3676434
58124 3676434 3543329 3417437 3299557 3188483 3082352 2981130 2885512 2794761 2707708 2624474
58114 2624474 2545300 2469121 2395198 2324671 2258585 2195827 2134952 2076531 2021693 1969750 1919392
58103 1919392 1870924 1825209 1781452 1738109 1695094 1653247 1612576 1572863 1535018 1499919 1466718
58092 1466718 1434088 1402352 1372653 1344833 1317969 1292343 1269064 1248198 1228860 1210670 1193593
58081 1193593 1176834 1159388 1141297 1123114 1104672 1085697 1066917 1049088 1031461 1012691 992867
58070 992867 973281 954606 936658 919497 903350 887696 871782 855899 841018 827352 814301
58059 814301 801626 789698 778802 768995 760182 751574 741709 730002 717659 706120 695338 684751
58047F84751r693p610n884n739o250o040n263m669m206l780m080n351o452o371
58033F03363n717n566n860o026o271p120q347r403j0230j0817j0629r407p862
58020E00108o819o243n772n508n516n308m570l802l505l362k937k549k662k887
58006D38668k444j381o80j250l112n346o695o593n707n059m689l858k466j265
57992C88123n95Q5J072J817J932J852J973K020J744J490J411R07m04j829k444
57977C99154k330k301k737l276l494l338k983k532j846p79L69R03N81J05J85N54
57961C76235O29P06J455K529K897K464K088J968J312j00j333j637j333r02l10
57946C86668L72P20P94J224K117K813L088L480M107M389M346M847N998O636O160
$$ plain form
58047 684751 675058 667448 661564 655825 649575 643535 638272 633603 629397 625617 621537 616186 609734 603363
58033 603363 597646 592080 586220 580194 573923 566803 558456 549053 538823 528006 517377 507970 500108
58020 500108 493289 487046 481274 475766 470250 464942 460372 456570 453065 449703 446766 444217 441555 438668
58006 438668 436224 434843 434163 432913 429801 424455 417760 411167 405460 400401 395712 391854 389388 388123
57992 388123 387528 387613 388685 390502 392434 394286 396259 398279 400023 401513 402924 403831 403427 401598 399154
57977 399154 396824 394523 391786 388510 385016 381678 378695 376163 374317 373538 373907 374810 375391 375496 375681 376235
57961 376235 376864 377570 379025 381554 384451 386915 389003 390971 392283 392183 390850 389213 387880 386978 386668
57946 386668 387040 387760 388554 389778 391895 394708 397796 401276 405383 409772 414118 418965 424963 431599 437759
57931D37759N570N800O174N613M261K783R86j562m259o074o923p423p796p983
57917D26926q414r518j0808j1303j0671r341p781o323n234m356l061j175N80J578
57903C41099K116K554K428J315j00q09q30q07o68J55J454K286K217J635Q48k24
57887C54669j414k149k075j351l38N34P61J57q34j670k325k985l514l793m204
57872C29469n039n686n257l920k824k666l006l166l112l165l304l113k285r48
57858B81978M78J739K952M219N159N264M706M257M226M087L471K848K790L058
57844C31232K959K237J096j89j193j376q51o83j720l374m259l861k906k198j772
57829C13142j200k33R56J932K393K560L038M031N095N748N984N920N458M631L763
$$ plain form
57931 437759 443329 449129 455303 460916 465177 467960 468946 467384 463125 457051 450128 442705 434909 426926
57917 426926 418512 408994 398186 386883 376212 366871 359090 352767 347533 343177 340116 338941 339521 341099
57903 341099 343215 345769 348197 349512 349412 348603 347773 346966 346298 346453 347907 350193 352410 354045 354893 354669
57887 354669 353255 351106 349031 347680 347342 347876 348637 348794 347960 346290 343965 340980 337466 333673 329469
57872 329469 324430 318744 313487 309567 306743 304077 301071 297905 294793 291628 288324 285211 282926 281978
57858 281978 282456 284195 287147 291366 296525 301789 306495 310752 314978 319065 322536 325384 328174 331232
57844 331232 334191 336428 337524 337335 336142 334766 333915 333232 331512 328138 323879 320018 317112 314914 313142
57829 313142 311942 311709 312665 314597 316990 319550 322588 326619 331714 337462 343446 349366 354824 359455 363218
57814C63218K877J476o57k962m924o752q586r750r636q850q465q459p912o588
57800B84030n317m734m542m193l574k752j686n32K40K90j49m41l7J062K155K400
57784B62220J766J189J465K349L116L660M453N656O874P704Q029P889P453P028
57770C30851O671N972M570K685P98r77k779m560o190p691q974r659r593r181q770
57755B83173q088o789n229m057l428l141l136l226k816j662n82n19j168j368o77
57740B37287K87R72J483K017K498K845L008K719J775N59k36l67j21J71K61o4n80
57723B54514n84J15O30J97n84o38j00L7m17q01j063j816k849k979j794l82J26
57706B41612k64j052k027k903l101k525j828j445j061l84L10P82J199J473R94
$$ plain form
57814 363218 366095 367571 366914 363952 359028 352276 343690 333940 324304 315454 306989 298530 290618 284030
57800 284030 278713 273979 269437 265244 261670 258918 257232 256700 256940 257230 257081 256640 256603 257665 259820 262220
57784 262220 263986 265175 266640 268989 272105 275765 280218 285874 292748 300452 308481 316370 323823 330851
57770 330851 337522 343494 348064 350749 351547 350570 347791 343231 337041 329350 320376 310717 301124 291943 283173
57755 283173 275085 268296 263067 259010 255582 252441 249305 246079 243263 241601 241019 240500 239332 237964 237287
57740 237287 237574 238546 240029 242046 244544 247389 250397 253116 254891 255450 255214 254847 254726 254897 255158 255094 254514
57723 254514 253930 254045 254675 254872 254288 253650 253550 253587 253170 252369 251306 249490 246641 243662 241868 241486 241612
57706 241612 241348 240296 238269 235366 232265 229740 227912 226467 225406 225022 225332 226114 227313 228786 229780
57691B29780m00j922k764k904k583j780p57k59n02o10J62J299J972K531L972O217
57675B31452Q061Q891R650J1671J5154J9132K2703K5945K9625L4122L8695M1545
57663D96646M0410L3250J9339N77j8538l3208m1133m2954m0543l5699l0135k5232
57651C22780k1133j6985j2587r017p133o279n234l757k474j732j286q09j53N88
57637B34789R05K88p71q82M97K074K288J233J35n33j192j776j590o67l9l10q90
57620B33559j141j361j999k617k434j556q32o77o20j56M68N44k95j658k697k735
57604B13793j860r79j004j836k381j835p27k43o81j212j218j137j611k347k511
57589A92211j945j315j217j633k212k529k233j391o05l41l51k79m61j333k273
$$ plain form
57691 229780 229380 227458 224694 221790 219207 217427 216670 216411 215909 215299 215461 216760 218732 221263 225235 231452
57675 231452 239513 248404 258054 269725 284879 304011 326714 352659 382284 416406 455101 496646
57663 496646 537056 570306 589645 590222 571684 538476 497343 454389 413846 378147 348012 322780
57651 322780 301647 284662 272075 263058 255925 249646 244412 240655 238181 236449 235163 234354 234201 234789
57637 234789 235694 235982 235211 234329 234826 236900 239188 240421 240556 240023 238831 237055 235465 234798 234759 234449 233559
57620 233559 232418 231057 229058 226441 224007 222451 221619 220942 220322 220166 220634 221178 220883 219225 216528 213793
57604 213793 211933 210954 209950 208114 205733 203898 203171 202928 202247 201035 199817 198680 197069 194722 192211
57589 192211 190266 188951 187734 186101 183889 181360 179127 177736 177131 176790 176439 176160 175699 174366 172093
57574A72093k094p56M16M72o5k76j10j17n43j234j914k130j463j44R48J301J263
57557A65647J289J309J190J127J192J088Q16R47J695K331K112J217K86m71j009
57542A80766r88l57J46q7m89pJ341K514K841K610K273J877J356Q86O67O82P02
57525A96733M45j55p30q68p50r42j402j403p70l57p35j173p41K64Q81R61J127
57508A90385J676K415L249M031M205L547K872K962L215K576J466J274J964J851
57494B27688J49j786k445k179k250k909l459l657l933m495m981n001m516l754
57480A82472l066k704k507j989j023j63n6p50j779k616k836k246j192m70n05p75
57464A57795m23N83J312R09l85j479j601j055o18m53n1P11J118O16k56n68l00
$$ plain form
57574 172093 169999 169243 169659 170131 170066 169790 169680 169563 169020 167786 165872 163742 162279 162135 163083 164384 165647
57557 165647 166936 168245 169435 170562 171754 172842 173658 174605 176300 178631 180743 181960 182246 181775 180766
57542 180766 179778 179421 179567 179480 178991 178984 180325 182839 185680 188290 190563 192440 193796 194682 195349 196031 196733
57525 196733 197178 197023 196293 195425 194675 193733 192331 190928 190158 189801 189066 187893 187152 187416 188297 189258 190385
57508 190385 192061 194476 197725 201756 205961 209508 212380 215342 218557 221133 222599 223873 225837 227688
57494 227688 227837 226051 223606 221427 219177 216268 212809 209152 205219 200724 195743 190742 186226 182472
57480 182472 179406 176702 174195 172206 171183 171020 170964 170214 168435 165819 162983 160737 159545 159075 158570 157795
57464 157795 157372 157955 159267 160176 159791 158312 156711 155656 155038 154585 154534 155245 156363 156979 156723 156155 155855
57447A55855k05n23o59k06M66Q40Q88P76N05J80J68N92J021J001O68N44Q53J272
57429A64036J322Q86L51K40O35J098J269J290J341J138M13l78m93J2L42J72L2
57412A73706K84N09K85j3K02P57Q93L01m80p14k68K78K21n15j240j212l92O35
57394A73237J346J623J588J458J472J632J652J484J593K255K847K600J833J610
57380A98230K193K739K643K248J942J498Q07L88N47O95J56q77j785k408k765k458
57364B03793j203L42J094Q72N11O59J063J146P41J26l39m18j36K03K73K5l16m42
57346B07994j40M93R24N85l83j107r48k34K67K35j49p37j441j916j708q55Q5N97
57328B01562O18L57P1L1M27J128J731J948J900J918K106K219J961J350P12L48
$$ plain form
57447 155855 155650 155127 154468 154262 154728 155568 156456 157232 157737 157917 158085 158677 159698 160699 161367 161911 162764 164036
57429 164036 165358 166244 166595 166835 167470 168568 169837 171127 172468 173606 174019 173641 173148 173160 173502 173674 173706
57412 173706 173990 174499 174784 174771 174973 175730 176623 176924 176444 175730 175462 175740 175961 175446 174206 172994 172602 173237
57394 173237 174583 176206 177794 179252 180724 182356 184008 185492 187085 189340 192187 194787 196620 198230
57380 198230 200423 203162 205805 208053 209995 211493 212300 212688 213235 213930 214086 213209 211424 209016 206251 203793
57364 203793 202590 202932 204026 204898 205409 206068 207131 208277 209018 209144 208805 208387 208251 208454 208727 208752 208436 207994
57346 207994 207854 208347 209271 209856 209473 208366 207418 207184 207451 207686 207537 206800 205359 203443 201735 200880 200965 201562
57328 201562 202180 202537 202608 202639 203066 204194 205925 207873 209773 211691 213797 216016 217977 219327 220039 220387
57312B20387L71Q05J576K269K275J533Q31Q53J206J003K60k9O12J407J438Q24
57296B37621L85N05R33J353J671J792J578J074O24P33J670L025L768L188J823
57281B61743R77J288K195K877L048K708J851P93J93K28K53j97o40m42J45M20L82
57264B77822O29J283J759J666J341J269J425J408J048P20J064K230L469L753K919
57249C03805J890J629K225L112L731L754L203K639K709L187L016J783N09M03J328
57234C38923K250K675K835K818K476K113K307K987L396L128K665K646L094L513
57220C77826L439K866K269K203K666L082L077K934K998L113L123L374M116M782
57206D21868M726M320M535N654P243R215J1882J4947J7409J8610J8749J8158J6927
$$ plain form
57312 220387 220758 221563 223139 225408 227683 229216 230047 230900 232106 233109 233369 233340 233952 235359 236797 237621
57296 237621 238006 238511 239444 240797 242468 244260 245838 246912 247536 248269 249939 252964 256732 259920 261743
57281 261743 262720 264008 266203 269080 272128 274836 276687 277480 277673 277901 278154 277957 277317 276875 277020 277440 277822
57264 277822 278451 279734 281493 283159 284500 285769 287194 288602 289650 290370 291434 293664 297133 300886 303805
57249 303805 305695 307324 309549 312661 316392 320146 323349 325988 328697 331884 334900 336683 337192 337595 338923
57234 338923 341173 343848 346683 349501 351977 354090 356397 359384 362780 365908 368573 371219 374313 377826
57220 377826 381265 384131 386400 388603 391269 394351 397428 400362 403360 406473 409596 412970 417086 421868
57206 421868 426594 430914 435449 441103 448346 457561 469443 484390 501799 520409 539158 557316 574243
57193E74243J5348J4064J3466J3497J4133J5334J6539J7027J6969J7276J8209
57182G46105J8947J8946J8773J9075J9493J9334J8732J8416J8602J8859J8769
57171I54051J8219J7252J6107J5221J4849J4804J4877J5202J5837J6338J6280
57160A129037J5985J6173J6985J7767J7891J7446J7037J7136J7725J8449J9102
57149A320733J9894K1149K2770K4271K5370K6261K7221K8223K9172L0160L1321
57138A606545L2651L4135L5806L7512L8894L9876M0847M2124M3450M4384M5065
57127B041289M6196M8284N1150N4232N7274O0567O4557O9216P3992P8510Q3144
57116B728411Q8620R5180J02642J11140J21295J33412J47123J62186J79244J99318
$$ plain form
57193 574243 589591 603655 617121 630618 644751 660085 676624 693651 710620 727896 746105
57182 746105 765052 783998 802771 821846 841339 860673 879405 897821 916423 935282 954051
57171 954051 972270 989522 1005629 1020850 1035699 1050503 1065380 1080582 1096419 1112757 1129037
57160 1129037 1145022 1161195 1178180 1195947 1213838 1231284 1248321 1265457 1283182 1301631 1320733
57149 1320733 1340627 1361776 1384546 1408817 1434187 1460448 1487669 1515892 1545064 1575224 1606545
57138 1606545 1639196 1673331 1709137 1746649 1785543 1825419 1866266 1908390 1951840 1996224 2041289
57127 2041289 2087485 2135769 2186919 2241151 2298425 2358992 2423549 2492765 2566757 2645267 2728411
57116 2728411 2817031 2912211 3014853 3125993 3247288 3380700 3527823 3690009 3869253 4068571
57106D068571K22853K49793K80540L16478L59601M11955M75536N52363O44264
57097G581954P52332Q76529J015984J169966J338395J520964J715522J917484
57089A7889130K120496K316985K498007K653550K773275K844751K848020K751931
57081C8696145K520949K133528J600342R66798K96041l55365r51982j478012j927266
57072D1501178k295395k578214k773006k879648k901436k845941k725198k554515
57064A9947825k350427k128580j901910j679826j468916j274225j099385r45727
57056G098829q12243o97061n98719n15843m46303l87432l36916k93239k55478
57047B755595k23057j95479j71989j51607j33681j18173j05149r4283q4937p6464
$$ plain form
57106 4068571 4291424 4541217 4821757 5138235 5497836 5909791 6385327 6937690 7581954
57097 7581954 8334286 9210815 10226799 11396765 12735160 14256124 15971646 17889130
57089 17889130 20009626 22326611 24824618 27478168 30251443 33096194 35944214 38696145
57081 38696145 41217094 43350622 44950964 45917762 46213803 45858438 44906456 43428444 41501178
57072 41501178 39205783 36627569 33854563 30974915 28073479 25227538 22502340 19947825
57064 19947825 17597398 15468818 13566908 11887082 10418166 9143941 8044556 7098829
57056 7098829 6286586 5589525 4990806 4474963 4028660 3641228 3304312 3011073 2755595
57047 2755595 2532538 2337059 2165070 2013463 1879782 1761609 1656460 1562177 1477240 1400776
57037A400776o8257n9869n1327m2853l4120k4475j4159m237N470J7060L0981M1878
57025A196868M0395K1063j1792m6658p3047q6981r0121q5983p7732o7990n8754
57014F59268n0864m4102l8099l2958k8901k5754k3171k1179k0057j9674j9287
57003C35222j8266j6753j5486j4995j5156j5423j5295j4624j3517j2108j0386
56992A73213q315o033l810j792J16K090M185O308Q347J0185J1594J2048J0841
56979B18977P634L000j831n926r139j1557j2844j2644j1338r901q937q261p446
56966A29787o269m707k935j349r0J447L998P212R822J1292J2362J3455J3297J0140
56952A97462L996l183r408j3902j6646j7705j7349j6126j4336j1842q715n625
$$ plain form
57037 1400776 1332519 1272650 1221323 1178470 1144350 1119875 1105716 1101479 1106949 1124009 1154990 1196868
57025 1196868 1237263 1258326 1246534 1199876 1126829 1039848 949727 863744 786012 718022 659268
57014 659268 608404 564302 526203 493245 464344 438590 415419 394240 374183 354509 335222
57003 335222 316956 300203 284717 269722 254566 239143 223848 209224 195707 183599 173213
56992 173213 164898 158865 155055 153263 153379 155469 159654 165962 174309 184494 196088 208136 218977
56979 218977 226611 229611 227780 221854 212715 201158 188314 175670 164332 154431 145494 137233 129787
56966 129787 123518 118811 115876 114527 114437 115884 119882 127094 136916 148208 160570 174025 187322 197462
56952 197462 201458 198275 188867 174965 158319 140614 123265 107139 92803 80961 72246 66621
56940F6621l168j148J086L707O376Q926J1671J4830J8092K0952K3089K4070K2871
56927B17975J8316J0263J83r592j7208k1969k4158k4501k3646k1892j9344j6330
56915F8097j3424j0947q747o709n145m325l923l421k913k848B611b64j887o58
56901b809K25Q12c35A806K782L413M122M820N531O597Q299J0385J2330J3928J5379
56886H9392J6954J8682K0161K0488J8589J3993P333L1o401j0857j2920j2954j1733
56873A50758r836p492m869k091J036M807Q906J2492J5331J8363K2629K7971L3319
56860B71324L8006M2126M5440M6343M2371L1941J5935k270j8572l0200l6372l7526
56848D08546l4636k9156k2708j6268r898l494K711Q624J4645K1141K8007L5157
$$ plain form
56940 66621 63453 62305 63391 67098 73474 82400 94071 108901 126993 147945 171034 195104 217975
56927 217975 236291 246554 246737 237145 219937 197968 173810 149309 125663 103771 84427 68097
56915 68097 54673 43726 34979 28270 23125 18800 14877 11456 8543 5695 2611 -264 -2151 -2809
56901 -2809 -2584 -1772 -335 1806 4588 8001 12123 16943 22474 29071 37370 47755 60085 74013 89392
56886 89392 106346 125028 145189 165677 184266 198259 205592 205623 199222 188365 175445 162491 150758
56873 150758 140922 133430 128561 126470 127506 132313 141219 153711 169042 187405 210034 238005 271324
56860 271324 309330 351456 396896 443239 485610 517551 533486 531216 512644 482444 446072 408546
56848 408546 373910 344754 322046 305778 295880 292386 295097 303721 318366 339507 367514 402671
56836D02671M2867N1149N9372O6912P3215P6259P1830N6132K9647k227l2454n5843
56824H39530p0078p5243p3232o6724n7802m7534l6794k6683j7762r684k049M919
56812C60864J1066J7092K3842L1121L7968M3949M9234N3019N2450M3969K6286
56801G50860K241k2325m1932n4232n9930o0620n7305n0888m2985l5313k8476k2011
56789B77084j5552r358l681J584O462J0679J4288J7898K1835K5354K7162K6306
56777D00061K2146J4090K301j1324k3772l2727l7463l8255l5916l1995k8257k5266
56765A73623k2213j8568j5074j2546j0609q588o914o412o659o341n105l846l181
56752D7567k802k489k551k885k675j594n09l84j047j573j349m72M69P27L6q56
$$ plain form
56836 402671 445538 496687 556059 622971 696186 772445 844275 900407 930054 927827 895373 839530
56824 839530 769452 694209 620977 554253 496451 448917 412123 385440 367678 357994 355945 360864
56812 360864 371930 389022 412864 443985 481953 525902 575136 628155 680605 724574 750860
56801 750860 753101 730776 688844 634612 574682 514062 456757 405869 362884 327571 299095 277084
56789 277084 261532 252174 248493 250077 256539 267218 281506 299404 321239 346593 373755 400061
56777 400061 422207 436297 438598 427274 403502 370775 333312 295057 259141 227146 198889 173623
56765 173623 151410 132842 117768 105222 94613 86025 79111 72699 66040 59699 54594 50748 47567
56752 47567 44765 42276 39725 36840 34165 32571 32062 31678 30631 29058 27709 27237 27706 28433 28469 27613
56736B7613q67nN91K68k84j92L84P40O85M90K89J52L18Q41J318J400J271J287
56718C6299J539K010K669L115K745J574M09j86l89l74J22J038J607J408J034J057
56702E5677J087N74j42m47n20q65j282j144l51P04J687K225J820O54j19K71J120
56685F0949J381J213J383J760J677J337J512K049K025J418J244J871K389K002
56671H4210J081L91O3j72l50k57J97P77R89N13j93j18J025K119J897M71r96j768
56653H9879j911j589q97j86K41N52Q48N96n25j711j864j092l79j27l2q0m38o41
56635H0644q7P29P50P9j02O57J588K117K488K776K572J931J532J508J198L94k50
56618A00524l85n08r82j470j709j889j942j420m49J74J24r7k56p41j505j696r37
$$ plain form
56736 27613 26746 26741 27332 27600 27316 27124 27508 28248 28933 29423 29712 29864 30182 31023 32341 33741 35012 36299
56718 36299 37838 39848 42517 45632 48377 49951 50360 50174 49785 49411 49533 50571 52178 53586 54620 55677
56702 55677 56764 57338 57196 56749 56229 55364 54082 52938 52587 53291 54978 57203 59023 59677 59558 59829 60949
56685 60949 62330 63543 64926 66686 68363 69700 71212 73261 75286 76704 77948 79819 82208 84210
56671 84210 85291 85682 85745 85573 85223 84966 85163 85940 86929 87442 87249 87131 88156 90275 92172 92643 91647 89879
56653 89879 87968 86379 85482 85296 85537 86089 86937 87533 87008 85297 83433 82341 81962 81835 81803 81723 81285 80644
56635 80644 80557 81286 82036 82115 82013 82670 84258 86375 88863 91639 94211 96142 97674 99182 100380 100774 100524
56618 100524 100139 99631 98649 97179 95470 93581 91639 90219 89770 89944 90068 89971 89715 88974 87469 85773 84836
56601H4836M1N41P13P97N23p8k60L60J048R91M09jj00j52j76j6K87O06P86N04
56581I1659l22j017p42K48Q52P21O01R46J306J436J790K452K693K206J743J917
56565A08489K394K822L521M595N389N595N906O871P990Q659Q955Q700O928L359
56551A90173n53l118m162m379l904k773j839j916k488k609k491k917l522l178
56537A50324j893r21r07j172j076r73j408k118k295j506q5J141J446P72l51j467
56521A37511k429k966k642j644r51j141j573j341n46J5O5KR4J75L4l12o79q15
56503A20857o37m62o03p31k53O15R70N63J08m9m73j311j619p81L17N44P3k81l99
56484A16448m88j86P74J533J061j97q50m96J2P9j3L3Q3J70O41J464K044J966J506
$$ plain form
56601 84836 84877 85418 86131 86928 87451 87373 87113 87473 88521 89512 89921 89920 89820 89668 89492 89476 89763 90369 91155 91659
56581 91659 91337 90320 89578 89826 90678 91399 92000 92946 94252 95688 97478 99930 102623 104829 106572 108489
56565 108489 110883 113705 117226 121821 127210 132805 138711 145582 153572 162231 171186 179886 186814 190173
56551 190173 189620 186502 182340 177961 174057 171284 169445 167529 165041 162432 159941 157024 153502 150324
56537 150324 148431 147510 146603 145431 144355 143382 141974 139856 137561 136055 135970 137111 138557 139329 138978 137511
56521 137511 135082 132116 129474 127830 126879 125738 124165 122824 122278 122293 122358 122360 122454 122629 122663 122351 121672 120857
56503 120857 120220 119758 119155 118424 118171 118786 119756 120319 120427 120378 119905 118594 116975 116194 116511 117055 117128 116847 116448
56484 116448 115960 115774 116548 118081 119142 118945 118095 117599 117611 117690 117677 117710 117793 117963 118604 120068 122112 124078 125584
56465A25584J220J346J604J444O56j58j39P01J430J478J269J227J030M25k4K22
56449A39315P45Q30N24K66L8l24n02j98J57K9l55n23o17r52j160p15M9L70K50
56430A37227L39Q53J366J548J428J074O03L03L14L54K02P5K48O30J044J392J362
56413A50362P26J33O19J951K586J777N72Ol32r70j222m00P21J085J024J355J765
56396A61758J585J302J791K587K637K149K166K781L262L466L640L294J901L29
56382A94648p2M49M80l27j132j682k440k992k211k74J148J083K47m73j099j749
56366A83604k088k057k157k570k845k698k274j576n20M88Q70P88Q68J172J388
56351A70393J727K540L262K930J626L48l80o19j92R75J906J520L89J16J028J927
$$ plain form
56465 125584 126804 128150 129754 131198 131854 131696 131557 132258 133688 135166 136435 137662 138692 139117 139093 139315
56449 139315 140060 140890 141414 141680 141718 141394 140892 140694 140851 140880 140525 140002 139385 138433 137273 136558 136607 136977 137227
56430 137227 137566 138419 139785 141333 142761 143835 144438 144741 145055 145409 145611 145686 145934 146564 147608 149000 150362
56413 150362 151088 151221 151840 153791 156377 158154 158726 158732 158400 157430 156208 155808 156529 157614 158638 159993 161758
56396 161758 163343 164645 166436 169023 171660 173809 175975 178756 182018 185484 189124 192418 194319 194648
56382 194648 194576 195025 195505 195178 194046 192364 189924 186932 184721 184447 185595 186678 186925 186452 185353 183604
56366 183604 181516 179459 177302 174732 171887 169189 166915 165339 164819 165307 166177 166965 167833 169005 170393
56351 170393 172120 174660 177922 180852 182478 182826 182446 181827 181635 182610 184516 186036 186425 186541 187569 189496
56335A89496K188K495L299M037M230M153M034L723L358L315L392L084K635K627
56321B36066K671J782J55q84p79l19j82k05l06p85j454j667j394j176j002m13
56305B30108L38N44M39R02J815K224K142K535L354L342K159J071J034J574J993
56290B55574K299K429K065J580J851K684K959K616K913M190N054M577L702L630
56276B98123M149M522M759N120N334N179N032N179N419N711O354P205P735Q109
56262C77930R040J0408J1290J1665J2672J4728J6827J8242J9565K1456K3680K6042
56250E73545K8986L2627L6303L9690M3302M7317N1051N4098N6791N9062O0028
56239A082800N9293N7539N5266N2025M7309M1137L3459K4200J4144M475m786j4444
$$ plain form
56335 189496 191684 194179 197478 201515 205745 209898 213932 217655 221013 224328 227720 230804 233439 236066
56321 236066 238737 240519 240674 239790 239011 238692 238510 238305 237999 237214 235760 234093 232699 231523 230521 230108
56305 230108 230446 230990 231429 232331 234146 236370 238512 241047 244401 247743 249902 250973 252007 253581 255574
56290 255574 257873 260302 262367 263947 265798 268482 271441 274057 276970 281160 286214 290791 294493 298123
56276 298123 302272 306794 311553 316673 322007 327186 332218 337397 342816 348527 354881 362086 369821 377930
56262 377930 386970 397378 408668 420333 433005 447733 464560 482802 502367 523823 547503 573545
56250 573545 602531 635158 671461 711151 754453 801770 852821 906919 963710 1022772 1082800
56239 1082800 1142093 1199632 1254898 1306923 1354232 1395369 1428828 1453028 1467172 1471647 1466861 1452417
56227A452417k4013l1714l7032m1495m6177n0056n1801n1690n0703m9058m6684
56216I71994m4102m1807l9563l7071l4520l2060k9585k7337k5681k4151k1902
56205F14215j9225j7240j5997j4377j2122j0249r184q197p059o500o470n848m384
56192D77363l257l020k784k001j286q74q9R92J266O23L35P86Q58L33O10K087L034
56175D74976K307J183J148J800K231K630L209L298K800K847L792M350L957M046
56161E14574N607P409Q158Q603R839J1214J1700J1869J2813J4373J5893J7650
56149F49702K0108K2930K5842K9335L3678L8572M4534N2885O3457P4071Q3248
56138A138362R1577R9413J05148J06843J03779R5572Q2093O5533N0277L9337L2646
$$ plain form
56227 1452417 1428404 1396690 1359658 1318163 1271986 1221930 1170129 1118439 1067736 1018678 971994
56216 971994 927892 886085 846522 809451 774931 742871 713286 685949 660268 636117 614215
56205 614215 594990 577750 561753 547376 535254 525005 515821 507624 500565 494065 487595 481747 477363
56192 477363 474106 471086 468302 466301 465015 464141 464052 465044 466310 466933 467268 468054 468912 469245 469855 471942 474976
56175 474976 477283 478466 479614 481414 483645 486275 489484 492782 495582 498429 502221 506571 510528 514574
56161 514574 520181 527590 535748 544351 554190 565404 577104 588973 601786 616159 632052 649702
56149 649702 669810 692740 718582 747917 781595 820167 864701 917586 981043 1055114 1138362
56138 1138362 1229939 1329352 1434500 1541343 1645122 1740694 1822787 1888320 1938597 1977934 2010580
56127B010580K9461K9605L0972K9039K1225R681j933j2137k0420k5330k6617k7418
56115B046708l1739m1007n4364p0208q5594r6484j00939j00452r6554q8556p6415
56104A204396o3132n1805m2437l3900k6697k1400j6663j1477p300n431m349k240
56092I17565NR19J465L120N013N724O074P368Q653Q397P209O352N470M144L698
56077I91176M887N910N297M635N825P841Q969R904J1749J3246J2986J2188J2402
56064A107015J2721J2112J2041J3726J5350J5204J4976J6569J8341J8133J7402
56053A273590J8515K0338K0426J9406J9328J9884J9891K0357K2303K3885K3347
56042A501270K2433K3236K4342K3870K3493K5393K8087K9460L0842L3806L6113
$$ plain form
56127 2010580 2040041 2069646 2100618 2129657 2150882 2160563 2158630 2146493 2126073 2100743 2074126 2046708
56115 2046708 2014969 1973962 1919598 1849390 1763796 1667312 1566373 1465921 1369367 1280811 1204396
56104 1204396 1141264 1089459 1047022 1013122 986425 965025 948362 936885 929585 924154 919805 917565
56092 917565 917570 918489 919954 923074 928087 933811 939885 947253 955906 964303 971512 977864 983334 987478 991176
56077 991176 996063 1001973 1007270 1011905 1017730 1025571 1034540 1044444 1056193 1069439 1082425 1094613 1107015
56064 1107015 1119736 1131848 1143889 1157615 1172965 1188169 1203145 1219714 1238055 1256188 1273590
56053 1273590 1292105 1312443 1332869 1352275 1371603 1391487 1411378 1431735 1454038 1477923 1501270
56042 1501270 1523703 1546939 1571281 1595151 1618644 1644037 1672124 1701584 1732426 1766232 1802345
56031A802345L5567L4629L6319L8752L8944L8752M1373M5124M6583M7039M9663
56020B255090N2989N3511N2387N3283N5717N6777N7325O0338O5017O8504P1329
56009B902267P5514P9729Q2094Q4970R1019R7631J01433J04771J11286J18890
55999C849604J24141J29507J38682J48818J55486J61254J70898J82314J91131
55990E251835K00060K14159K30997K45515K60380K81163L05472L27716L50256
55981G667553L78621M10316M40291M72626N14214N62093O10439O64550P33360
55972A2454063Q13919Q99017R94459J111961J251170J407249J590409J818626
55964B2340873K097673K429293K831417L326110L914638M590706N371896O292019
$$ plain form
56031 1802345 1837912 1872541 1908860 1947612 1986556 2025308 2066681 2111805 2158388 2205427 2255090
56020 2255090 2308079 2361590 2413977 2467260 2522977 2579754 2637079 2697417 2762434 2830938 2902267
56009 2902267 2977781 3057510 3139604 3224574 3315593 3413224 3514657 3619428 3730714 3849604
55999 3849604 3973745 4103252 4241934 4390752 4546238 4707492 4878390 5060704 5251835
55990 5251835 5451895 5666054 5897051 6142566 6402946 6684109 6989581 7317297 7667553
55981 7667553 8046174 8456490 8896781 9369407 9883621 10445714 11056153 11720703 12454063
55972 12454063 13267982 14166999 15161458 16273419 17524589 18931838 20522247 22340873
55964 22340873 24438546 26867839 29699256 33025366 36940004 41530710 46902606 53194625
55956E3194625P374002Q643704J0158628J1981784J4132434J6596490J9362370
55949A41444037K2394749K5596409K8831686L1845094L3893242L3441975K8649650
55942C46096842J8688991M814957r978929k2534488l0978561l5044452l5494398
55935B35569962l3445987k9990348k6003257k2051674j8428708j5269725j2622271
55928G7757992j0454775q686996p247200o086467n151690m384083l746448l223455
55920B8776878k794638k431656k120389j861043j645871j457655j289585j146561
55912A4029480j026681r19430q21940p39828o71835o09288n50538n01264m60832
55903G727844m22385l85835l57094l34869l11519k86721k67485k54505k40776
$$ plain form
55956 53194625 60568627 69212331 79370959 91352743 105485177 122081667 141444037
55949 141444037 163838786 189435195 218266881 250111975 284005217 317447192 346096842
55942 346096842 364785833 369600790 359621861 337087373 306108812 271064360 235569962
55935 235569962 202123975 172133627 146130370 124078696 105649988 90380263 77757992
55928 77757992 67303217 58616221 51369021 45282554 40130864 35746781 32000333 28776878
55920 28776878 25982240 23550584 21430195 19569152 17923281 16465626 15176041 14029480
55912 14029480 13002799 12083369 11261429 10521601 9849766 9240478 8689940 8188676 7727844
55903 7727844 7305459 6919624 6562530 6227661 5916142 5629421 5361936 5107431 4866655
55894D866655k24086k09171j96998j83083j67185j54135j44281j32883j19578
55885C335255j09041j02027r5015q8887q8540r3300r6624r5993r4658r3272q8539
55874B289359q0936p5256p2413o8538o3118o0182o0451n9807n6782n4316n3091
55863A584469n0179m5413m2238m1082l8479l3873l0784l0159k8996k6568k5651
55852A191047k6436k5643k2932k1981k3753k4779k3563k2776k3463k3036k0778
55841I31907j9655k0594k0435j7737j5562j6151j7477j7345j6699j6635j6107
55830G37510j4506j3041j2046j0292q102p533q604r008q371q835j0741j1803j1422
55817F03206j1648j2917j3014j1351j0120j0055r238p301o604p771q194o614n187
$$ plain form
55894 4866655 4642569 4433398 4236400 4053317 3886132 3731997 3587716 3454833 3335255
55885 3335255 3226214 3124187 3029172 2940285 2851745 2758445 2661821 2565828 2471170 2377898 2289359
55874 2289359 2208423 2133167 2060754 1992216 1929098 1868916 1808465 1748658 1691876 1637560 1584469
55863 1584469 1534290 1488877 1446639 1405557 1367078 1333205 1302421 1272262 1243266 1216698 1191047
55852 1191047 1164611 1138968 1116036 1094055 1070302 1045523 1021960 999184 975721 952685 931907
55841 931907 912252 891658 871223 853486 837924 821773 804296 786951 770252 753617 737510
55830 737510 723004 709963 697917 687625 679523 671990 663386 654378 646007 637172 626431 614628 603206
55817 603206 591558 578641 565627 554276 544156 534101 524863 517562 510958 503187 494993 488379 483192
55804D83192n292n120l408j878j930k114r57N97J345J705J883R00j086k075j226
55789D64536r7J87L69Q35P16K25R72K818L106J78m790j0138j5209j8847j9414
55774D05447j7321j4875j2887j0183o930n185n320n227m049l432m059m235l303
55761C08441l122m662o114n984n185m640l678k270j958k989l307j951q04j326
55747B60451k338k549k720l578m120l672l289l491l045j460l33o85j353j484k078
55732B24256l479l935k423n73m9l10o09j699l770n018m364l377l645m252l792
55717A82961k797k270j785r28o53j281j182N92K293K200J460K022L444M015L627
55702A91718L233K685J299m46j635k556l900n290n976o103n983n234l834k806
$$ plain form
55804 483192 477900 472780 469372 467494 465564 463450 462493 463090 464435 466140 468023 468923 467837 465762 464536
55789 464536 464439 464626 464995 465830 466546 466771 467743 470561 473667 473845 469055 458917 443708 424861 405447
55774 405447 388126 373251 360364 350181 343251 338066 332746 327519 323470 320038 315979 311744 308441
55761 308441 305319 300657 294543 288559 283374 278734 275056 272786 270828 267839 264532 262581 261777 260451
55747 260451 258113 255564 252844 249266 245146 241474 238185 234694 231649 230189 229856 229171 227818 226334 224256
55732 224256 220777 216842 214419 213846 213797 213487 212878 211179 207409 202391 198027 194650 191005 186753 182961
55717 182961 180164 177894 176109 175181 174528 173247 172065 172657 174950 177150 178610 180632 184076 188091 191718
55702 191718 194951 197636 198935 198489 196854 194298 190398 185108 179132 173029 167046 161812 157978 155172
55688A55172k729k823k470k142j778j76K688M590L929K087J311J773K376K799
55674A64607L023K295M17j168j266p43r05j407j344j101j385j663j204n76n10
55659A57070l87N68J732K221K422K909L067K350J627J761K004J416N72K71j57
55644A79446j515k907l058k435k216k262j849j465j968k829l010k798l144l895
55630A44095m279m297m129l233j574o99j714l183k983j414n11r09j438j356j044
55615A11332p54l45j09l49n52k14K7n93j499j775j825k456l028k398j041m26o59
55598I3336o36j92k35r11j340j196j015q87l19N49R33O73L57J72k68r66j387j245
55580H5423o45K38J004J034M23K14Q55J350R50O74J733L408M046L461K729K223
$$ plain form
55688 155172 152443 149620 147150 145008 143230 143054 145742 150332 154261 156348 157659 159432 161808 164607
55674 164607 167630 169925 170342 169174 167908 167165 166260 164853 163509 162408 161023 159360 158156 157580 157070
55659 157070 156683 157251 158983 161204 163626 166535 169602 171952 173579 175340 177344 178760 179332 179603 179446
55644 179446 177931 175024 171966 169531 167315 165053 163204 161739 159771 156942 153932 151134 147990 144095
55630 144095 139816 135519 131390 128157 126583 125884 124170 120987 118004 116590 116079 115170 113732 112376 111332
55615 111332 110578 110233 110124 109775 109223 109009 109036 108443 106944 105169 103344 100888 97860 95462 94421 93995 93336
55598 93336 92700 92508 92273 91362 90022 88826 87811 86924 86605 87154 88087 88760 89117 89289 89021 88055 86668 85423
55580 85423 84778 85016 86020 87054 87477 87691 88546 89896 90846 91520 93253 96661 100707 104168 106897 109120
55564A09120J540Q66P39P04j16j423k146k232k436k684k236j320j002j471j923
55549I3980k102k434k759k390j516j080j211j123o37m22o21n91k11j15m31n17
55533G5820k24j96o24q02l23L11N88O72Q81J158J280J022J62j102j947j840j361
55516G3475j353j558j152k75K8o32j560k059k041j669j240j331k192l101l128
55501E0212k315j298j84J199K323K443J838J482J565J474J053P36N35P3m19k92
55485F0425K52K87l69r32j020j130j524j627r69R5Q88J080P41L25M64J187J529
55468E9702O86p30j456j320j166j254r48n6P05Q40P09P32P54N31J26l79r73j376
55450E5127j184m25M30R80J021M14o23j344j272q36o14l94K86J077J266R52Q42
$$ plain form
55564 109120 110660 111526 112265 112969 112853 111430 109284 107052 104616 101932 99696 98376 97374 95903 93980
55549 93980 91878 89444 86685 84295 82779 81699 80488 79365 78728 78306 77685 77094 76883 76768 76337 75820
55533 75820 75596 75400 74776 73974 73651 73962 74550 75222 76103 77261 78541 79563 79725 78623 76676 74836 73475
55516 73475 72122 70564 69412 69137 69165 68533 66973 64914 62873 61204 59964 58633 56441 53340 50212
55501 50212 47897 46599 46415 47614 49937 52380 54218 55700 57265 58739 59792 60528 61063 61136 60717 60425
55485 60425 60677 60964 60595 59663 58643 57513 55989 54362 53393 53488 54376 55456 56197 56522 56986 58173 59702
55468 59702 60388 59658 58202 56882 55716 54462 53514 53458 54163 55003 55712 56444 57198 57729 57855 57476 56503 55127
55450 55127 53943 53518 53948 54928 55949 56363 55740 54396 53124 52288 51674 51280 51566 52643 53909 54861 55703
55433E5703J054J087P85M57K51J44L44Q82J138O54L3Q9N40N52J45o7q7k44j47
55414F3313O94J502J052k76q05l0P50M54m92j268j723j870j491p00l3L61P89J160
55396F1387J022M95K10J99q4n43m52J36K44m65j108j025o88p01q37o74l66k48
55378E6502l23n28q25q47j10J113J877J718J058L40m83j360j895j947j835j729
55362E0726j512j264j186r91k26P79J188R52Q78J281J511J072L11k21l58n2O48
55345E3536J185R47K38m0K09J63n50j331j700j836j799j221j62O75R89J199J452
55328E1954J230L64m86q05p82n80N8R92J398R10J76j79l86p70r44m61L38P86P75
55309E3588N87L06j10m49m33o9M15P67P64L96j7j79k16l24k64K22P49P51M28M17
$$ plain form
55433 55703 56757 57844 58629 59086 59337 59481 59825 60707 61845 62499 62532 62621 63161 63713 63858 63791 63704 63460 63313
55414 63313 64007 65509 66561 66285 65480 65450 66200 66654 66162 64894 63171 61301 59810 59110 59077 59438 60227 61387
55396 61387 62409 62904 63114 63313 63229 62686 62234 62370 62614 62149 61041 60016 59328 58627 57790 57116 56750 56502
55378 56502 56179 55651 54826 53979 53869 54982 56859 58577 59635 59975 59492 58132 56237 54290 52455 50726
55362 50726 49214 47950 46764 45773 45547 46326 47514 48466 49344 50625 52136 53208 53519 53298 52940 52888 53536
55345 53536 54721 55668 55906 55866 56075 56238 55688 54357 52657 50821 49022 47801 47639 48314 49303 50502 51954
55328 51954 53184 53548 53062 52257 51475 50895 50953 51945 53343 54253 54429 54250 53864 53094 52150 51689 52027 52813 53588
55309 53588 54175 54481 54371 53922 53489 53420 53835 54602 55366 55762 55745 55566 55350 55026 54762 54984 55733 56484 56912 57329
55289E7329P68R87R89J005P95j2q78q25L6N74L95K47N41O66J95l69n19m59m84
55270F0981n16o04r70j248o87N93J429J138K48m91r05q97k18Q53J482J341Q96
55253F2425M50j23n25r8R15J345P65O5k6J28R3J38M14M53J45P8L72K10p81j706
55233F4737j673r31j90K44J58o63j625j580m89L46L07L46J074J490O96l98m68
55216F1381K47O78P46J035J368J129N08J93J63j27p44j331j734j814j165R4R11
55199F1538N74k21m76l14l26k21O13J684J852R69m2n16n36k90R4K60l6m19l88
55180F3799n0K37N11Q02O65p4o49l73J82J8p01r82o35m27o84q52n48r6J54L07
55160F0604N51Q02Q97P60M30J78L80R29J119N54j95l51L6L27K21o1k60k22J58
$$ plain form
55289 57329 58097 59084 60073 61078 61873 61861 60983 60158 60194 60768 61163 61410 61951 62617 62812 62443 61924 61465 60981
55270 60981 60465 59861 58891 57643 56956 57549 58978 60116 60364 59873 58968 58071 57853 58706 60188 61529 62425
55253 62425 62875 62752 62227 62129 63044 64389 65154 65219 65193 65321 65414 65552 65966 66419 66564 66642 67014 67224 66443 64737
55233 64737 63064 62133 61943 62187 62345 61682 60057 58477 57988 58334 58641 58987 60061 61551 62247 61849 61381
55216 61381 61628 62306 63052 64087 65455 66584 67092 67285 67448 67321 66577 65246 63512 61698 60533 60627 61538
55199 61538 62112 61891 61415 61101 60775 60554 61167 62851 64703 65672 65630 65114 64578 64288 64382 64642 64606 64187 63799
55180 63799 63749 63986 64497 65299 65964 65890 65241 64868 65050 65068 64367 63385 62750 62323 61639 60787 60239 60143 60297 60604
55160 60604 61155 61957 62854 63614 64044 64222 64602 65531 66650 67204 67009 66658 66694 67021 67242 67181 66921 66699 66857
55141F6857P03R58Q10O31N93L15k99o56l58J39L83O94J346J700J057j17p57n57
55123G3442mN35R40R45M64OM3K77K16lp3k73q97j467j357r00q77j198j046j99
55103F8574O14P11J44m79m40N36J719J855P05m38m50J42J14o12j112r51m11L30
55085G0551J249J835J428J74j143j958k072j253L42J758K094J569J006O00Q7l14
55069G5953j11N03Q52Q06P31O41K25m24r08j148j232j006n05l67r22j372q56R8
55051G0958L09k30n25k31N3O6K35O58Q75P52O52O47M94L36N25P87M92k91q60r52
55031G4750q04l79M55J125Q38j04n72k57K1k60o31o27m63m49n09n03l94p6L64
55012G1525L84l34j179j397j154r54m93O74J765J572M47p6L99Q05P14J006J918
$$ plain form
55141 66857 67560 68518 69328 69959 70552 70867 70568 69912 69554 69693 70076 70770 72116 73816 74873 74756 73999 73442
55123 73442 73438 73973 74913 75858 76322 76328 76371 76648 76864 76861 76788 76515 75618 74151 72794 71894 71017 69819 68773 68574
55103 68574 69188 69899 70043 69564 69124 69660 71379 73234 73939 73501 73051 73193 73307 72695 71583 70632 70221 70551
55085 70551 71800 73635 75063 75237 74094 72136 70064 68811 69153 70911 73005 74574 75580 76180 76267 75953
55069 75953 75842 76345 77197 78003 78734 79375 79600 79176 78268 77120 75888 74882 74377 74010 73088 71716 70860 70958
55051 70958 71267 71037 70512 70281 70334 70400 70635 71293 72168 72920 73572 74219 74713 75049 75574 76361 76853 76562 75702 74750
55031 74750 73946 73567 74022 75147 75985 75881 75309 75052 75073 74813 74182 73555 73092 72643 72134 71631 71237 71161 71525
55012 71525 71909 71575 70396 68999 67845 66891 66398 67072 68837 70409 70856 70780 71179 71984 72698 73704 75622
54995G5622K182R60o30r27K69J862K838K780J753L49o90j162j289r43R5J127J059
54978H5255J12k76L46P76K09m18n3Q01J089Q70Q43R86P92L09j27o67j527k139
54960H7181j702m13P01J001O94K51n6q4J43L94M37K58j00n56p94m57K75P31O01
54941H8505K69J70K64L41L13J2p26j533j677j014k39K5j48m77q75j133q94k45
54923H0938K69M85P77J213J315J040J071J705K306K434K641L499M532M880M472
54908A13577L804L058K202J439Q35j47j930l889m910m727m139l883l835l385k323
54893I1747j240j005j749k471k089p86L06O54Q03J193J419J103O30M66M42L15
54877H9738L52P54J105J040R30J298K011K691L408M287M841M512L590K875K617
$$ plain form
54995 75622 77804 78764 78134 77207 77476 79338 82176 84956 86709 87058 86368 85206 83917 82974 83069 84196 85255
54978 85255 85367 85091 85437 86213 86422 86004 85951 86752 87841 88711 89554 90540 91332 91641 91514 90847 89320 87181
54960 87181 85479 85066 85767 86768 87462 87713 87657 87573 87716 88110 88547 88805 88705 88149 87355 86898 87173 87904 88505
54941 88505 88774 88944 89208 89549 89862 89874 89148 87615 85938 84924 84685 84710 84562 84085 83210 82077 81183 80938
54923 80938 81207 81692 82469 83682 84997 86037 87108 88813 91119 93553 96194 99693 104225 109105 113577
54908 113577 117381 120439 122641 124080 124915 124768 122838 118949 114039 109312 105173 101290 97455 94070 91747
54893 91747 90507 89502 87753 85282 83193 82407 82713 83367 84170 85363 86782 87885 88515 88981 89423 89738
54877 89738 90090 90844 91949 92989 93919 95217 97228 99919 103327 107614 112455 116967 120557 123432 126049
54862A26049K363J699N80q87k454l654m185m268m278m214l867l248k530j794j162
54847I4150q61q69q38o44o61j103j599j792j885k084j999j253k89J29K9J27P43
54830G9301J401J529J087M95K56N95J193J354P24l26j168j522j417r38l37m8j62
54813H2017j66L54J047J179N39m51j267j568j158j51R04J429J322Q54K50m01r50
54796H3783j175r36k68N17Q75M90k05l70K34R83J241J050P80N69M41N06P19P06
54778H9940K36m01p01m81O0N02M49L4R6J287K971L703L012J925J544J879K446
54761A08501L079L606L516K718K028K158K713K847K450J971J489O98m39j625k648
54746A33062l408l771l781l707l572l100k391k011k014j611m20O61O19k33q09
$$ plain form
54862 126049 128412 130111 130691 129804 127350 123696 119511 115243 110965 106751 102884 99636 97106 95312 94150
54847 94150 93289 92420 91582 90938 90277 89174 87575 85783 83898 81814 79815 78562 78273 78402 78431 78558 79301
54830 79301 80702 82231 83318 83813 84069 84664 85857 87211 87935 87609 86441 84919 83502 82564 82227 82179 82017
54813 82017 81851 82205 83252 84431 84970 84519 83252 81684 80526 80375 81279 82708 84030 84884 85134 84733 83783
54796 83783 82608 81672 81404 81921 82796 83286 83081 82711 82945 83928 85169 86219 86999 87568 88009 88515 89234 89940
54778 89940 90176 89775 89074 88593 88653 89155 89604 89638 89734 91021 93992 97695 100707 102632 104176 106055 108501
54761 108501 111580 115186 118702 121420 123448 125606 128319 131166 133616 135587 137076 137774 137335 135710 133062
54746 133062 129654 125883 122102 118395 114823 111723 109332 107321 105307 103696 103276 103937 104556 104323 103514
54731A03514p47n06m32n62r80j539j560o02P40J608K021K476K809K498J807J599
54715A12144K049K541K776K968L038K539J634J075J014O14p84k748m344n030m754
54700A14732l804k783k317k376k289j591n87Q1J39j18j19M83J349J641J005J05
54684A03551k49k23n85j429k031j962j604j393j214q62n13l95l49j20J62P1n55
54667I0300j292j419o79K96N60J2m47j48L97L45j52j87N32J285J416J107R47J157
54649I4030J462J426P76k69j065j155p62m32l20j90M2K50M61Q30J194J154O37
54632I8069P8k1M15R54R21j9j306j837j183j21L50J15k93o45r75j037n73j7j10
54613I2765q33j345j063j88Q42J771K341K255J589Q31L60K18L51O50P79M21k47
$$ plain form
54731 103514 102767 102261 101829 101267 100287 98748 97188 96586 97326 98934 100955 103431 106240 108738 110545 112144
54715 112144 114193 116734 119510 122478 125516 128055 129689 130764 131778 132392 131608 128860 124516 119486 114732
54700 114732 110928 108145 105828 103452 101163 99572 98985 99066 99205 99087 98968 99451 100800 102441 103446 103551
54684 103551 103302 103079 102494 101065 99034 97072 95468 94075 92861 91999 91486 91091 90742 90622 90784 90855 90300
54667 90300 89008 87589 86910 87206 87766 87778 87331 87183 87580 87925 87773 87586 88118 89403 90819 91926 92873 94030
54649 94030 95492 96918 97694 97425 96360 95205 94443 94011 93691 93501 93543 93793 94254 95084 96278 97432 98069
54632 98069 98147 98126 98541 99495 100416 100397 99091 97254 96071 95950 96300 96415 96122 95477 94502 93465 92892 92875 92765
54613 92765 91932 90587 89524 89336 90178 91949 94290 96545 98134 98965 99325 99543 99894 100544 101323 101744 101497
54596A01497p11p42n26j90L36R82J446J503J148M68l50r82j216j124q02k05M63
54579A00995O23Q6m60k78L16L75l48j160j395j042m78r7j23l35j19P37J590J762
54561A00649J404R75L56o19j217n41R55J795J410O76N15Q54J192J184N88m98j194
54544A08484o62N30R02J97j89P06K035K467J910J093M48J85O36J618K037J201
54528A23598Rq2R67J753J193l71j814k238j498k82K66m21j635k138j507m28K76
54511A15648M13K15n7k29j97j16l06q78j524j825j672j295r01m71M9M94O47N89
54493A08584N90O59N33K34K08O19J031J087J095J367J473R16K09L54J293J769
54477A22021R98k97q17j09J212K176K162J270K36k40j27K31P88J634K354K270
$$ plain form
54596 101497 100786 100044 99518 99328 99664 100646 102092 103595 104743 105211 104861 103879 102663 101539 100737 100532 100995
54579 100995 101618 101704 101244 100966 101282 101657 101309 100149 98754 97712 97234 97137 97014 96679 96560 97297 98887 100649
54561 100649 102053 103028 103384 102765 101548 101007 101962 103757 105167 105843 106358 107212 108404 109588 110176 109678 108484
54544 108484 107822 108352 109254 109451 109262 109968 112003 114470 116380 117473 117921 118106 118742 120360 122397 123598
54528 123598 123607 123525 124492 126245 127438 127067 125253 123015 121517 121235 121501 121080 119445 117307 115800 115372 115648
54511 115648 116061 116276 116219 115990 115793 115677 115371 114493 112969 111144 109472 108177 107276 106805 106854 107348 107995 108584
54493 108584 109174 109833 110366 110600 110808 111427 112458 113545 114640 116007 117480 118396 118605 118959 120252 122021
54477 122021 123019 122722 121905 121796 123008 125184 127346 128616 128852 128612 128485 128716 129504 131138 133492 135762
54461A35762J419N69J48j10l82m10k04l06r19j361r73l1O74P91N76M03M36N40
54443A36622L21m58j430j991k089k078j907j193k46m6p92j355p61M77J201J141
54427A25416Q69O90M24qm15o60o76l70J22L41J07j10J04M34L60mj67q4j00k24
54407A26049j64jj56o24q87o96l93k28J53J110K205K505J710O41L51R51J602J662
54389A35790J389J288J209O45l12r63r94q65j009j173q87k42J79l8p52j390j404
54372A30471p79j25Nj99j16M10R29J096J007P80L74p8k50j50j47l76n83o33o41
54353A30995n55k00J82J37j59n4L74K57o02j173p23L3P8l47k91M06J016J054O34
54334A31062l0o93q58k31P04J196J193J226J485J594J227M12o58j650k047j646
$$ plain form
54461 135762 137181 137750 137898 137788 137406 136996 136792 136486 135567 134206 133233 133202 133876 134667 135243 135646 136082 136622
54443 136622 136943 136485 135055 133064 130975 128897 126990 125797 125551 125505 124713 123358 122597 123074 124275 125416
54427 125416 126285 126975 127399 127391 126976 126316 125640 125270 125392 125733 125840 125730 125834 126268 126628 126624 126457 126373 126273 126049
54407 126049 125885 125884 125728 125104 124217 123521 123128 122900 123053 124163 126368 128873 130583 131224 131575 132526 134128 135790
54389 135790 137179 138467 139676 140321 140009 139046 138052 137187 136178 135005 134118 133876 134055 134017 133265 131875 130471
54372 130471 129692 129567 129572 129373 129257 129667 130596 131692 132699 133479 133853 133775 133525 133375 133228 132852 132269 131636 130995
54353 130995 130440 130240 130422 130559 130400 130346 130720 130977 130375 129202 128479 128512 128590 128243 127952 128358 129374 130428 131062
54334 131062 131032 130339 129481 129250 129954 131150 132343 133569 135054 136648 137875 138287 137629 135979 133932 132286
54318A32286r82q08j205j693j980k107j961j272j66P60J003N78j36o94q21o36
54302A20166n02n06k95K90P72O89L72M89J001J212Q18K99J76L56M78M95O12Q39
54284A27761Q81M85j53n28l79k2R1lK7O6l77j258j709j108N0P72P29M07L45O12
54264A26689R15Q98N08J10P7K01l3n94q91p22n14m00J48J271K138J993J143K87
54246A33224m29j014j013k52M29K13m43o05m10o28j081r05k41k09j011j428o93
54229A23504L33M69j91p20o82l30J8K11J66J0L2J96R6l95p93o73k41M4R8N5j58
54208A21049o85j305j561j283p34k40J26M47P08P11L68k6k1L72O35N00L84P07
54190A20152J122J014N26L93P47Q29Q7j036j701j590r70k34K94M27K98K38L24
$$ plain form
54318 132286 131304 130496 129291 127598 125618 123511 121550 120278 120112 120872 121875 122453 122317 121623 120802 120166
54302 120166 119664 119158 118863 119153 119925 120614 120986 121475 122476 123688 124506 124805 124981 125337 125815 126310 126922 127761
54284 127761 128642 129127 128974 128446 128067 128045 128136 128133 128160 128226 127849 126591 124882 123774 123824 124596 125325 125732 126077 126689
54264 126689 127604 128502 129010 129120 129197 129398 129365 128771 127880 127158 126644 126244 126392 127663 129801 131794 132937 133224
54246 133224 132795 131781 130768 130516 130945 131158 130715 130110 129700 129072 127991 127086 126845 126636 125625 124197 123504
54229 123504 123837 124306 124115 123395 122713 122383 122401 122612 122778 122788 122820 123016 123112 122717 121924 121251 121010 121054 121152 121207 121049
54208 121049 120364 119059 117498 116215 115481 115241 115367 115814 116522 117233 117601 117575 117554 117926 118561 119061 119445 120152
54190 120152 121274 122288 122814 123207 123954 124783 124870 123834 122133 120543 119573 119339 119633 120060 120358 120596 120920
54173A20920L04J11L5J63M7o60j519j796j390q55n48k63J86N32M49O5k34l20l02
54154A14925j17M21J136J474J157N41J36M1J15L56P05P58K39l89l47M49J323J726
54136A24649J626J057J2j052j362p79n6K16K91N77Q86Q17M27Rl49n77m26J17O08
54117A26691P15O14N17L96L85Q08J368J138J5p75l61L40L0r15j059j83M91J99
54099A30414n31j086j512j834j659r19j22M11R27J518J769J483J083R99J083J015
54083A33039P60L80j56p20r51o71r4M81Q99J062R57P75P30P39O33M65L41J57o8
54064A38758P1P45J338J161M41j20m04p06p40L2J201J653J130N72P08J270J770
54047A48880K120K224J962J816K519L693L944K882J992K749M657O052O109N293
$$ plain form
54173 120920 121224 121335 121370 121533 121580 120920 119401 117605 116215 115360 114812 114549 114735 115267 115716 115781 115547 115227 114925
54154 114925 114808 115229 116365 117839 118996 119537 119673 119714 119829 120185 120890 121648 121887 121498 121151 121600 122923 124649
54136 124649 126275 127332 127344 126292 124930 124151 124095 124311 124602 125179 126065 126882 127309 127318 126969 126392 125966 126083 126691
54117 126691 127406 128020 128537 128933 129318 130126 131494 132632 132647 131872 131511 131851 131881 130966 129907 129724 130215 130414
54099 130414 129883 128797 127285 125451 123792 122873 122751 123162 124089 125607 127376 128859 129942 130941 132024 133039
54083 133039 133799 134179 134023 133303 132352 131681 131587 132068 132967 134029 134986 135761 136491 137230 137863 138328 138669 138826 138758
54064 138758 138829 139574 140912 142073 142514 142394 141990 141284 140544 140576 141777 143430 144560 145132 145840 147110 148880
54047 148880 151000 153224 155186 157002 159521 163214 167158 170040 172032 174781 179438 185490 191599 196892
54033A96892M339L723L762M355M825M644M104L855M014M315M689N101N103M339
54019B58060L354L208M160N303N604M915L849K929K004L63k518o230r489j1146
54005B64366j1133j0317r544q977q308p360o321n398m413l046j459l66k12o61
53991A86851j118j491j969k369k352k062j999k255k463k380k059j533r06n61o50
53976A60684n80J55Q70M28r46j731j225m02k54m06j48K00p4o85o80J60J046J300
53958A57712J043Q22R33J214J276J033R34J465K399K946K711K016J332R77J361
53943A80174K673M151M521L595K708L046M256N206N432N194M687M005L471L334
53929B36453L332L062K570K169J943J798J737J758J801J986K578L480M212M530
$$ plain form
54033 196892 201231 204954 208716 213071 217896 222540 226644 230499 234513 238828 243517 248618 253721 258060
54019 258060 261414 264622 268782 274085 279689 284604 288453 291382 293386 293749 291231 285001 275512 264366
54005 264366 253233 242916 233372 224395 216087 208727 202406 197008 192595 189549 188090 187724 187512 186851
53991 186851 185733 184242 182273 179904 177552 175490 173491 171236 168773 166393 164334 162801 161895 161334 160684
53976 160684 160104 160259 161129 161557 160611 158880 157655 157253 156999 156593 156445 156645 156571 155886 155206 155366 156412 157712
53958 157712 158755 159577 160510 161724 163000 164033 164967 166432 168831 171777 174488 176504 177836 178813 180174
53943 180174 182847 186998 191519 195114 197822 200868 205124 210330 215762 220956 225643 229648 233119 236453
53929 236453 239785 242847 245417 247586 249529 251327 253064 254822 256623 258609 261187 264667 268879 273409
53915B73409M630M609M447M538N361O400O378N024L587L016K691J759N96o7n16
53900C25862j378k286k495k282k488l062l353l471m131n252o001o111o073o029
53886B71450n640n047m827m900m569l813l479l852m072l361k030q52k30k89j058
53871B23431k064k421j794q25k60j07P3N40J401K749M406N878O909P805Q905R929
53855B64555J0084Q618N401J210k610n107o395p097p338o852n905n279n223n192
53841B32870m876m783n319n938n799m909m055l768l850l791l285k355j277m51
53827A78414j53k95n10m75k06k0j41l31j59L19M73Mm75k07O46J257J351J427J819
53808A82738K171K142J988K085K378K693L207M093M947N098M430L540L004K876
$$ plain form
53915 273409 278039 282648 287095 291633 296994 303394 309772 314796 318383 321399 324090 325849 326445 326378 325862
53900 325862 324484 322198 319703 317421 314933 311871 308518 305047 300916 295664 289663 283552 277479 271450
53886 271450 265810 260763 255936 251036 246467 242654 239175 235323 231251 227890 225860 225008 224778 224489 223431
53871 223431 221367 218946 217152 216327 216067 215960 216033 216573 217974 220723 225129 231007 237916 245721 254626 264555
53855 264555 274639 283257 288658 289868 287258 282151 275756 268659 261321 254469 248564 243285 238062 232870
53841 232870 227994 223211 217892 211954 206155 201246 197191 193423 189573 185782 182497 180142 178865 178414
53827 178414 178261 177966 177456 176981 176775 176755 176614 176283 176124 176443 176916 176920 176445 176238 176884 178141 179492 180919 182738
53808 182738 184909 187051 189039 191124 193502 196195 199402 203495 208442 213540 217970 221510 224514 227390
53794B27390K959L213L581L624K792J238RM1J075J915J746Q31r7o74r68j133j387
53777B46155j979k824l415l403l090l064l520m170m572m322l304k008j275j330
53763B03879j465j069o02q61j720k264k083j654j473j448j327j179j207j396j518
53748A82613j336q30l00j23k54k67n1n8n32r91r66o97n38k20N11J060P85K49N30
53729A78585J478J875J290O12N01N51L86M82J248K188K628K650K614K487K144
53714B01719J825J653J237L96j84L06J732L213M076M103L302K046J209J368K021
53699B30022K170J680J417K016L085L824L953L758L520L263K901K313J309j95
53685B65036j815k779k618j745j033q51q27o43n49q51j332j599j607j414q11K31
$$ plain form
53794 227390 230349 233562 237143 240767 243559 244797 244806 244847 245922 247837 249583 250414 250317 249643 248675 247542 246155
53777 246155 244176 241352 237937 234534 231444 228380 224860 220690 216118 211796 208492 206484 205209 203879
53763 203879 202414 201345 200743 199882 198162 195898 193815 192161 190688 189240 187913 186734 185527 184131 182613
53748 182613 181277 180447 180147 180024 179770 179503 179452 179394 178862 177871 176905 176208 175670 175450 175961 177021 177806 178055 178585
53729 178585 180063 181938 183228 183840 184341 184892 185278 185760 187008 189196 191824 194474 197088 199575 201719
53714 201719 203544 205197 206434 206830 206646 206952 208684 211897 215973 220076 223378 225424 226633 228001 230022
53699 230022 232192 233872 235289 237305 240390 244214 248167 251925 255445 258708 261609 263922 265231 265036
53685 265036 263221 260442 257824 256079 255046 254195 253368 252725 252176 251325 249993 248394 246787 245373 244562 244793
53669B44793J065J036M16m2j96m07n32p9O64P37l5o81n80l56p61j498j811j562
53651B40171j128o96k97j05j16K9N13J021J329J662K079K140J713J468J812J995
53635B53590J121l23r51k15J108K109K514K351J749J208J355K187K969L087K649
53620B76508K195K254L158M712N970N804M096K082J317K358M358N827N863M889
53606C31391M127M255M753M784M212L395K390J123Q9m0M91O20j23j028j316j088
53590C58035q12m77M8L23k35j417k332k461k084j667j373j238j392j735j765j104
53574C38314n6O08M82j25n92n01K32J441K692L344K990J836N42l65p56p32m74
53557C48880l01n20j021j270r69n22m95p61o08K94J390J984K127K470L255L935
$$ plain form
53669 244793 245858 246894 247310 247268 247072 246665 246133 246054 246718 247455 247420 246739 246159 245803 245042 243544 241733 240171
53651 240171 239043 238347 238050 237945 237829 237858 238371 239392 240721 242383 244462 246602 248315 249783 251595 253590
53635 253590 254711 254388 253437 253222 254330 256439 258953 261304 263053 264261 265616 267803 270772 273859 276508
53620 276508 278703 280957 284115 288827 294797 300601 304697 306779 308096 310454 314812 320639 326502 331391
53606 331391 335518 339773 344526 349310 353522 356917 359307 360430 360519 360479 360970 361590 361467 360439 359123 358035
53590 358035 357223 356746 356794 357117 356882 355465 353133 350672 348588 346921 345548 344310 342918 341183 339418 338314
53574 338314 338258 338866 339348 339223 338631 338130 338362 339803 342495 345839 348829 350665 351207 350842 350086 349354 348880
53557 348880 348579 348059 347038 345768 344799 344277 343782 343021 342413 342707 344097 346081 348208 350678 353933 357868
53541C57868L970L715M125N533P101P748P422P100P559Q493R073R059R105R947
53527D57818J1577J3289J4431J4934J5165J5400J5621J5813J6242J7234J8754
53516F26278K0338K1529K2277K2924K3835K5031K6165K6913K7363K7840K8360
53505H98853K8534K8123K7423K6822K6236K5327K4065K2707K1468K0557K0332
53494A170447K0827K1293K0934K0089J9958K0879K1659K1028J9218J7518J6675
53483A390525J6325J5805J4946J4069J3490J3070J2094R847O516L226Q99o53k245
53470A507914m278o643r308j2323j5387j7968j9852k1082k1475k0845j9804j9572
53458A319377k0663k2291k3490k4308k5352k6443k6592k5313k3364k1852k0964
$$ plain form
53541 357868 361838 365553 369678 375211 382312 390060 397482 404582 412141 420634 429707 438766 447871 457818
53527 457818 469395 482684 497115 512049 527214 542614 558235 574048 590290 607524 626278
53516 626278 646616 668145 690422 713346 737181 762212 788377 815290 842653 870493 898853
53505 898853 927387 955510 982933 1009755 1035991 1061318 1085383 1108090 1129558 1150115 1170447
53494 1170447 1191274 1212567 1233501 1253590 1273548 1294427 1316086 1337114 1356332 1373850 1390525
53483 1390525 1406850 1422655 1437601 1451670 1465160 1478230 1490324 1500171 1506687 1509913 1510812 1510159 1507914
53470 1507914 1503636 1496993 1487685 1475362 1459975 1442007 1422155 1401073 1379598 1358753 1338949 1319377
53458 1319377 1298714 1276423 1252933 1228625 1203273 1176830 1150238 1124925 1101561 1079709 1058745
53447A058745k0021j8552j6889j5629j4796j3815j2174r967p761o012m651l280
53435I15198j724k83P03J442K556M305O219P736Q926J0264J1853J3367J4716J6247
53421A011525J8146K0018K1423K2490K3678K5079K6354K7325K8339K9912L2148
53410A286437L4645L6911L8803M0547M2454M4692M7311N0227N3071N5293N6697
53399A787088N7749N9032O0441O1327O1447O1306O1418O1599O1295O0328N8935
53388B451965N7312N5421N3198N0598M7499M3854L9962L6189L2444K8179K3155
53377B919776J7913J3202R087M948L25m690r968j5898k3014l1177l9555m7341
53365B793608n4172n9828o4005o6597o7853o8051o7353o6133o5045o4266o3030
$$ plain form
53447 1058745 1038724 1020172 1003283 987654 972858 959043 946869 936902 929141 923129 918478 915198
53435 915198 913474 913191 913894 915336 917892 922197 928416 936152 945078 955342 967195 980562 995278 1011525
53421 1011525 1029671 1049689 1071112 1093602 1117280 1142359 1168713 1196038 1224377 1254289 1286437
53410 1286437 1321082 1357993 1396796 1437343 1479797 1524489 1571800 1622027 1675098 1730391 1787088
53399 1787088 1844837 1903869 1964310 2025637 2087084 2148390 2209808 2271407 2332702 2393030 2451965
53388 2451965 2509277 2564698 2617896 2668494 2715993 2759847 2799809 2835998 2868442 2896621 2919776
53377 2919776 2937689 2950891 2959978 2964926 2965251 2960561 2950593 2934695 2911681 2880504 2840949 2793608
53365 2793608 2739436 2679608 2615603 2549006 2481153 2413102 2345749 2279616 2214571 2150305 2087275
53354B087275o0451n6694n2835m9731m7510m6076m5493m5643m6002m5945m5098
53343A545797m3365m0913l8225l5763l3509l1096k8422k5779k3343k0922j8371
53332A206089j5898j3788j2110j0863j0204j0294j1013j1877j2256j1794j0766
53321A075226r824r122q008n990l690k250j870j561m25J418L333M979O476Q133
53307A056825J0163J2348J4027J4878J5615J7262J9805K2199K3809K5028K6316
53296A258275K7490K8359K9268L0491L1668L2306L2297L1564K9822K7164K4308
53285A583012K1795J9419J6909J4547J2562J0397P288L208j258n564r294j2130
53273A660891j4249j6313j8604k0654k2252k4048k6443k8615k9600k9859l0589
$$ plain form
53354 2087275 2026824 1970130 1917295 1867564 1820054 1773978 1728485 1682842 1636840 1590895 1545797
53343 1545797 1502432 1461519 1423294 1387531 1354022 1322926 1294504 1268725 1245382 1224460 1206089
53332 1206089 1190191 1176403 1164293 1153430 1143226 1132932 1121919 1110042 1097786 1085992 1075226
53321 1075226 1065402 1056280 1048272 1042282 1038592 1036342 1034472 1032911 1032486 1033904 1037237 1042216 1048692 1056825
53307 1056825 1066988 1079336 1093363 1108241 1123856 1141118 1160923 1183122 1206931 1231959 1258275
53296 1258275 1285765 1314124 1343392 1373883 1405551 1437857 1470154 1501718 1531540 1558704 1583012
53285 1583012 1604807 1624226 1641135 1655682 1668244 1678641 1685929 1689137 1687879 1682315 1673021 1660891
53273 1660891 1646642 1630329 1611725 1591071 1568819 1544771 1518328 1489713 1460113 1430254 1399665
53262A399665l1900l2842l3070l3307l4034l4855l5295l5358l4980l3845l2072
53251A028107l0361k9064k7830k6464k5505k5430k5767k5613k4710k3618k2916
53240G40829k2615k2229k1217j9408j7130j4943j3163j1698j0181q256n998m186
53228E69805l885n297p310q580q928r178r845j0607j1076j1381j1754j2059j2051
53215D47854j1724j1223j0560r692q694p745p010o546o222n855n472n295n363
53202C46453n478n721o506p792q615q183p029o412o631o767o093m914l840k989
53188B59483k295j966k126k413k369k020j724j624j555j328r47o22o19r74j303
53173B35598j152n45O9M15O10P42N71j16j090j772j662o90N92J284Q80j91j022
$$ plain form
53262 1399665 1367765 1334923 1301853 1268546 1234512 1199657 1164362 1129004 1094024 1060179 1028107
53251 1028107 997746 968682 940852 914388 888883 863453 837686 812073 787363 763745 740829
53240 740829 718214 695985 674768 655360 638230 623287 610124 598426 588245 579989 573991 569805
53228 569805 565920 560623 553313 544733 535805 526627 516782 506175 495099 483718 471964 459905 447854
53215 447854 436130 424907 414347 404655 395961 388216 381206 374660 368438 362583 357111 351816 346453
53202 346453 340975 335254 328748 320956 312341 304158 297129 290717 284086 277319 271226 266312 262472 259483
53188 259483 257188 255222 253096 250683 248314 246294 244570 242946 241391 240063 239116 238494 237875 236901 235598
53173 235598 234446 233901 233970 234385 234995 235737 236308 236192 235102 233330 231668 230978 231570 232854 233734 233543 232521
53156B32521j215j059q63o45n58j039k101k935k708j619o64m26m79j15O83J274
53140B18052J198O35J2n57j145j544j390p34p6K84N45Q13O88j61j357k153k213
53123B10897j706q79M3P14Q94P13M34J24q7J68R89J765J857J444J131R31L52o34
53105B19150j513k096k652l108k903j966j070q12r06q17o14o38q13p89n54l41
53089A97558j27K49N92M22l49j097j104l86L02L33k8K8P94J627J717J008J07m16
53071B01230l82M2L91J88m07n22L92J667K117J424K79o37j139j073k78P60R92
53054B05044j1j387j868j085K37J194J497J463J381J053J87q36j139n49k4l61
53038B04796j043j120o87n74r10j081j001j202j671j706j182q34r32q05q7N62
$$ plain form
53156 232521 231306 230247 229384 228739 228181 227142 225041 222106 219398 217779 217115 216689 216210 216095 216778 218052
53140 218052 219250 219885 219897 219340 218195 216651 215261 214527 214451 214735 215280 216093 216781 216620 215263 213110 210897
53123 210897 209191 208312 208355 209069 209963 210676 211110 211234 211147 211315 212304 214069 215926 217370 218501 219432 219784 219150
53105 219150 217637 215541 212889 209781 206878 204912 203842 203030 202124 201307 200693 200055 199242 198453 197899 197558
53089 197558 197431 197680 198272 198694 198345 197248 196144 195758 196060 196393 196365 196393 197187 198814 200531 201539 201646 201230
53071 201230 200848 200890 201281 201469 201062 200540 200932 202599 204716 206140 206419 205782 204643 203570 203292 204052 205044
53054 205044 205033 203646 201778 200693 200930 202124 203621 205084 206465 207518 207705 206869 205730 205181 205157 204796
53038 204796 203753 202633 201946 201372 200462 199381 198380 197178 195507 193801 192619 191785 190853 190048 189961 190523
53022A90523N89M34O12P81N60M74J153K082K144J158M2m52m51m43o11q00p71m12
53004A96612R7M23N15O51R57J154R49M07j70n02m20o0M7m39j025r05j28M59N23
52985A99145N93R69J213J146J292J761J689O39l52j33Q48J290R77P54R08Q83N78
52968B14200P05J554K332K257J628J380J919K759L056K379J078l1m59m74o06j004
52952B32673j513k076k653k970k805k423k220k129j792j244q78p40m43Q6L02k31
52936B08944j151j632j299n89j30k4P3K20l4q46j468j072j4N02O3m98n12m22p86
52917A99325j148p32K64R18Q49M66J57o8k40l23m19o28p96p70p47q84r13n77j98
52898A93536k09m35l77n2J31J15J71K59Q9j93j13L52O79N36J60r2p6J87M64K60
$$ plain form
53022 190523 191112 191546 192158 192939 193499 193973 195126 197208 199352 200510 200552 200100 199649 199206 198595 197795 197024 196612
53004 196612 196709 197132 197647 198298 199255 200409 201358 201765 201595 201093 200673 200613 200660 200221 199196 198291 198163 198622 199145
52985 199145 199738 200707 201920 203066 204358 206119 207808 208447 208095 207962 208810 210100 211077 211831 212739 213622 214200
52968 214200 214905 216459 218791 221048 222676 224056 225975 228734 231790 234169 235247 235216 234757 234283 233677 232673
52952 232673 231160 229084 226431 223461 220656 218233 216013 213884 212092 210848 209970 209230 208787 208873 209175 208944
52936 208944 207793 206161 204862 204273 204143 204119 204192 204412 204378 203532 202064 200992 200978 201480 201543 201045 200533 200111 199325
52917 199325 198177 197445 197709 198627 199476 199942 200099 200031 199791 199468 199049 198421 197625 196855 196108 195224 194311 193734 193536
52898 193536 193327 192892 192515 192463 192594 192709 192880 193139 193228 193035 192922 193274 193953 194489 194649 194557 194481 194668 195132 195392
52878A95392n61j266r28L12J349J506J164R34Q45P28P42J148J835K467K821K782
52862B11270K259J360M36k02n15n89m12K5M80M63l97j755k517j881m88L6r33k124
52844B04516k044r27k34o31j481k140k668l154l254k743j824p23L42P41r4j530
52828A82152j977p82R18J723J566J169P09J5n00k15N28N97l87j486j701j122n00
52811A80707j57J73O35R24P50M11N98J610K848L298K492R32n28j461j943k110
52795A89179j989j776j826k182k318j720o46P8J61L02J156K228K348J240l9m34
52779A83762o0L25M47N41O03L17k49n78m45k77n34j037j192o22M59J460J825J367
52761A86112L37q20j703k036j682q10J15O64P02K39o36j522j687p11R16K142K344
$$ plain form
52878 195392 194831 193565 192637 192949 194298 195804 196968 197902 198747 199475 200217 201365 203200 205667 208488 211270
52862 211270 213529 214889 215325 215123 214608 214019 213607 213632 214112 214575 214178 212423 209906 208025 207537 207573 206640 204516
52844 204516 202472 201545 201311 200680 199199 197059 194391 191237 187983 185240 183416 182693 183035 183776 183682 182152
52828 182152 180175 179393 180311 182034 183600 184769 185478 185493 184993 184778 185306 185903 185516 184030 182329 181207 180707
52811 180707 180550 180723 181358 182282 183032 183443 184041 185651 188499 191797 194289 195221 194693 193232 191289 189179
52795 189179 187190 185414 183588 181406 179088 177368 176722 176800 176961 177263 178419 180647 182995 184235 184196 183762
52779 183762 183702 184027 184474 185015 185618 185935 185686 185108 184663 184386 183852 182815 181623 181001 181460 182920 184745 186112
52761 186112 186449 185629 183926 181890 180208 179398 179513 180177 180879 181118 180482 178960 177273 176562 177478 179620 181964
52744A81964J742R92O04O87R96J182J151J109J216J380J502J649J801J725J361
52729B01061J040J056J304J606K050K562K587J685K54r02j485j713j731j582j557
52714B06235j902k316k318j909j346m98P24J567J063m86j640j613j036p19o46
52699A93160n79p05j026r35j69N02L04l25l63L02Q82J015J116J454J704J595J388
52682A99320J325J240R70P77R41J207J035K95n85j089j040o32l31n43j144j412
52666B00334q21R8K58n15j102n79N36J068Q17N42O38P37O27N92O85O10N82J334
52648B06441K805L756L328K078Q34n38k272l498l178j798q72r65j309j237q13
52633B02762j16R36J872J863Q84j07l43Q2Q14J635K163J974J223M10m47j587k515
$$ plain form
52744 181964 183706 184698 185302 185989 186985 188167 189318 190427 191643 193023 194525 196174 197975 199700 201061
52729 201061 202101 203157 204461 206067 208117 210679 213266 214951 215205 214303 212818 211105 209374 207792 206235
52714 206235 204333 202017 199699 197790 196444 195946 196670 198237 199300 198814 197174 195561 194525 193806 193160
52699 193160 192581 191876 190850 189915 189746 190248 190552 190227 189864 190166 191048 192063 193179 194633 196337 197932 199320
52682 199320 200645 201885 202855 203632 204573 205780 206815 207110 206525 205436 204396 203764 203433 202890 201746 200334
52666 200334 199513 199611 199869 199354 198252 197673 198209 199277 200094 200636 201274 202011 202638 203230 203915 204525 205107 206441
52648 206441 209246 213002 216330 218408 219242 218704 216432 212934 209756 207958 207086 206121 204812 203575 202762
52633 202762 202646 203582 205454 207317 208201 208094 207751 207833 208647 210282 212445 214419 215642 216052 215605 214018 211503
52616B11503k288j060j47k40n78m02j48m66r65q25j9Q05J205J103N73J8J0M55
52598B08534M86j96o17J32J481K151J843J254Q16L89L8O0K81J46l25m56M8O56
52580B16721Q13O71O73Q29Q41O01K87K2k67o27r35j037r74q58o15n2O85J067Q11
52561B18656L18J14J17j01n33q26r83j274j495j088j73L64N6n26o84m30n9M14
52543B11867R36J118P77K97j8l75q74j059p10l74n36o89j14Q85J349J049O49O33
52525B14811Q77J194J528J532O68j006k615l247k709j503m03P6J36N35J609K595
52509B14078K459J319M85R53K320L351L294K398J430R04P29M53j69q91j332j471
52493B30310j698k357l289l789l170j595j89O9m83o41P6R23J239J368J823K228
$$ plain form
52616 211503 209215 208155 208008 207768 207190 206788 206640 206174 205209 204384 204365 205170 206375 207478 208051 208069 208079 208534
52598 208534 209020 208824 208207 208339 209820 211971 213814 215068 215884 216273 216311 216371 216652 216798 216473 216017 216065 216721
52580 216721 217534 218205 218878 219707 220548 221149 221436 221458 221191 220564 219629 218592 217618 216760 216145 216093 216778 217845 218656
52561 218656 218974 219088 219205 219104 218571 217745 216762 215488 213993 212905 212732 213096 213152 212626 211942 211512 211453 211867
52543 211867 212803 213921 214698 214995 214977 214602 213728 212669 211959 211585 211049 210360 210246 211131 212480 213529 214178 214811
52525 214811 215688 216882 218410 219942 220610 219604 216989 213742 211033 209530 209127 209203 209339 209874 211483 214078
52509 214078 216537 217856 218341 219294 221614 224965 228259 230657 232087 232991 233720 234173 234004 233113 231781 230310
52493 230310 228612 226255 222966 219177 216007 214412 214223 214292 213809 213168 213244 214167 215406 216774 218597 220825
52477B20825J894J006L87K83J79j93m37j85L60P93R87J057J115J224J367J509
52461B32171J721K130K601K686K250J829J885J964J165n90k250k808k298j563
52447B40893j322j703k314k634k421j938j650j717j899j964j956j986j920j487
52433B13982o49K50Q48J178J571K034K056J273J32n24m72k12n3K87J036J813K086
52416B26636J868J582J527J742K176K704L163L526L940M543N431O714Q296R649
52402B83497J0222R919Q719O039J472l834p647q915q671q275p767o676n367m521
52388B58195l908k840j442m86j47J47P36J395J886K150K116J885J890K278K485
52373B66340K052J568J911K921L653L816L940M218M146L505K780K306J758P81
$$ plain form
52477 220825 222719 223725 224112 224395 224574 224381 223944 223759 224119 224912 225899 226956 228071 229295 230662 232171
52461 232171 233892 236022 238623 241309 243559 245388 247273 249237 250402 249812 247562 244754 242456 240893
52447 240893 239571 237868 235554 232920 230499 228561 226911 225194 223295 221331 219375 217389 215469 213982
52433 213982 213333 213583 214431 215609 217180 219214 221270 222543 222675 222151 221679 221467 221414 221701 222737 224550 226636
52416 226636 228504 230086 231613 233355 235531 238235 241398 244924 248864 253407 258838 265552 273848 283497
52402 283497 293719 303638 312357 318396 319868 316034 308387 299472 290801 282526 274759 268083 262716 258195
52388 258195 254287 251447 250005 249519 249372 249519 250255 251650 253536 255686 257802 259687 261577 263855 266340
52373 266340 268392 269960 271871 274792 278445 282261 286201 290419 294565 298070 300850 303156 304914 305695
52359C05695m03j314j754j814j648j322p25K44J217J482R64O45J324K429K861
52344C07881K696L015M164N330N890O179O630P077P369P858Q807R863J0612J1213
52330D04584J2091J3340J4649J5600J5950J6006J6616J8352K0649K2285K2747
52319E92869K2542K2252K1881K1231K0256J8883J7126J5481J4552J4150J3416
52308G94639J2009J0512R431Q608P823P267O913O130M458K302M23q66j645k021
52294H65983k224k660l433m168m658n291o468p980r213r688r114p404n016k847
52280G85819j348k7J788M015O091P794R334J0796J2012J2874J3416J3637J3620
52267H89821J3694J4209J5056J5666J5485J4380J2651J0746Q937P263N817M823
$$ plain form
52359 305695 305292 303978 302224 300410 298762 297440 296715 296959 298176 299658 300622 301267 302591 305020 307881
52344 307881 310577 313592 317756 323086 328976 335155 341785 348862 356231 364089 372896 382759 393371 404584
52330 404584 416675 430015 444664 460264 476214 492220 508836 527188 547837 570122 592869
52319 592869 615411 637663 659544 680775 701031 719914 737040 752521 767073 781223 794639
52308 794639 806648 817160 826591 835199 843022 850289 857202 863332 867790 870092 870515 869649 868004 865983
52294 865983 863759 861099 857666 853498 848840 843549 837081 829101 819888 810200 801086 793682 788666 785819
52280 785819 784471 784444 786232 790247 796338 804132 813466 824262 836274 849148 862564 876201 889821
52267 889821 903515 917724 932780 948446 963931 978311 990962 1001708 1010645 1017908 1023725 1028548
52255A028548M270L642K413P40p00j512j811j788j623j812k953n031p356r401
52241A005626j1191j2765j3845j4280j4271j3890j2904j1430j0173r653r561r211
52229H62452q252o671m629k705j717j801k067j713j018o19l55L71J354J734J418
52214H35782J453K592M234N276N515N592N834N921N714N729O285O686N909M087
52200I06609K611K480L180L567L373L141L030K544J462K74m62o76n27j11K91K13
52184I30999l75q33n91N0J65q07k484l881m317m124m281n237o273o386n481m248
52168H81896l121k093j386j430j973k100j365k35Q25J970L237M070M127L996M331
52153H90749M758M388L143J887J311J212R93M04k40l83K37J267K056K372K589
$$ plain form
52255 1028548 1032818 1036460 1038873 1039613 1038913 1037401 1035590 1033802 1032179 1030367 1027414 1022383 1015027 1005626
52241 1005626 994435 981670 967825 953545 939274 925384 912480 901050 890877 881224 871663 862452
52229 862452 854200 847529 842900 840195 838478 836677 834610 832897 831879 831260 830905 831276 832630 834364 835782
52214 835782 837235 839827 844061 849337 854852 860444 866278 872199 877913 883642 889927 896613 902522 906609
52200 906609 909220 911700 914880 918447 921820 924961 927991 930535 931997 932271 931809 931133 930606 930495 930786 930999
52184 930999 930624 929791 929200 929250 929415 928608 926124 922243 917926 913802 909521 904284 898011 891625 886144 881896
52168 881896 878775 876682 875296 873866 871893 869793 868428 868193 869018 870988 874225 878295 882422 886418 890749
52153 890749 895507 899895 903038 904925 906236 907448 908441 908845 908605 908222 908459 909726 911782 914154 916743
52138I16743L088L741M188M362M564N204O573Q613J0763J2340J3226J3969J5097
52125A022471J6652J8434K0392K2533K4832K7258K9650L1511L2232L1641L0036
52114A307642K7775K5212K2820K0778J8509J5307J1427P787M649J496j752m476
52102A457174o648r118j2037j4111j4294j3340j2683j2572j2325j1732j1069j0182
52090A317063q750p258o569o621o553o129o079o822p727p803o525l953o33K492
52076A238133M742O441Q518J1242J3869J5589J6286J6298J5986J5674J5543J5372
52064A393693J4823J3992J3253J2473J1019Q742O343M375K381m11l882p028r111
52051A460662j0253j0898j1237j1450j2109j3726j5944j7687j8332j8415j8901
$$ plain form
52138 916743 919831 923572 927760 932122 936686 941890 948463 957076 967839 980179 993405 1007374 1022471
52125 1022471 1039123 1057557 1077949 1100482 1125314 1152572 1182222 1213733 1245965 1277606 1307642
52114 1307642 1335417 1360629 1383449 1404227 1422736 1438043 1449470 1457257 1461906 1463402 1461650 1457174
52102 1457174 1450526 1441408 1429371 1415260 1400966 1387626 1374943 1362371 1350046 1338314 1327245 1317063
52090 1317063 1308313 1301055 1294486 1287865 1281312 1275183 1269104 1262282 1254555 1246752 1240227 1236274 1235641 1238133
52076 1238133 1242875 1249316 1257834 1269076 1282945 1298534 1314820 1331118 1347104 1362778 1378321 1393693
52064 1393693 1408516 1422508 1435761 1448234 1459253 1467995 1474338 1478713 1481094 1480683 1476801 1469773 1460662
52051 1460662 1450409 1439511 1428274 1416824 1404715 1390989 1375045 1357358 1339026 1320611 1301710
52040A301710k0021k1252k2091k2387k2023k0871j9131j7238j5311j3194j0999
52029A097192r112p614o268n136m517m119l126j532o04j406l438n300o286o681
52015A032053o967p338p774q050p886p526p757q938j0474j1809j3364j5707j8261
52002I00202j9797k0027j9748j9481j8866j7670j6519j6233j6859j7659j7805
51991F99538j6851j4900j2515j0416r079q527q377q029p058n651m417l713l412
51978E86593l482m242n816p710r372j0697j1607j1729j0966r957r247q412o750
$$ plain form
52040 1301710 1281689 1260437 1238346 1215959 1193936 1173065 1153934 1136696 1121385 1108191 1097192
52029 1097192 1088080 1080466 1074198 1069062 1064545 1060426 1057300 1055768 1055164 1053758 1050320 1045020 1038734 1032053
52015 1032053 1025086 1017748 1009974 1001924 994038 986512 978755 969817 959343 947534 934170 918463 900202
52002 900202 880405 860378 840630 821149 802283 784613 768094 751861 735002 717343 699538
51991 699538 682687 667787 655272 644856 635777 627250 618873 610844 603786 598135 593718 590005 586593
51978 586593 583111 578869 573053 565343 555971 545274 533667 521938 510972 501015 491768 483356 476606
$$ [...]
##END NTUPLES=NMR SPECTRUM
##END=
