
##TITLE=AC1410_ECUAH12219_7653105_wtmQEQFSva
##JCAMPDX= 6.0         $$ Bruker NMR JCAMP-DX V2.0
##DATA TYPE= nD NMR SPECTRUM
##DATA CLASS= NTUPLES
##NUM DIM= 2
##ORIGIN= BRUKER
##OWNER= Administrator
$$ 1.72 TOPSPIN		Version 2.1
$$ 2013-03-19 19:31:09.647 -0500  Administrator@X
$$ Compression mode = diff/dup
##.OBSERVE FREQUENCY= 400.02188249412
##.OBSERVE NUCLEUS= ^1H
##.ACQUISITION MODE= SIMULTANEOUS (DQD)
##.ACQUISITION SCHEME= NOT PHASE SENSITIVE
##.AVERAGES= 4
##.DIGITISER RES= 22
##SPECTROMETER/DATA SYSTEM= spect
##.PULSE SEQUENCE= jresgppsqf.2
##.SOLVENT NAME= COFFEE_meoh
##.SHIFT REFERENCE= INTERNAL, COFFEE_meoh, 1, 14.9606
##AUDIT TRAIL= $$ (NUMBER, WHEN, WHO, WHERE, PROCESS, VERSION, WHAT)
$$ ##TITLE= Audit trail, TOPSPIN		Version 2.1
$$ ##JCAMPDX= 5.01
$$ ##ORIGIN= Bruker BioSpin GmbH
$$ ##OWNER= Administrator
$$ $$ E:\/data/COFFEE/nmr/AC1410_ECUAH12219_7653105_wtmQEQFSva/23/pdata/1/auditp.txt
$$ ##AUDIT TRAIL=  $$ (NUMBER, WHEN, WHO, WHERE, PROCESS, VERSION, WHAT)
(   1,<2013-03-19 19:31:00.569 -0500>,<Administrator>,<X>,<go>,<TOPSPIN 2.1>,
      <created by zg
	started at 2013-03-19 19:16:37.303 -0500,
	POWCHK enabled, PULCHK disabled,
       configuration hash MD5:
       86 BA 57 50 F2 9D 5C 9B 26 00 A9 28 5F 66 2E 89
       data hash MD5: 8K * 40
       41 31 B2 6F 7F DF 05 1C D1 1A C3 66 23 54 29 28>)
(   2,<2013-03-19 19:31:04.960 -0500>,<Administrator>,<X>,<proc2d>,<TOPSPIN 2.1>,
      <Start of raw data processing
       xfb same F2: SI = 16K WDW = 3 SSB = 0 FT_mod = 6 PKNL = 1 F1: SI = 512 WDW = 3 SSB = 0 FT_mod = 6 PH_mod = 2
       data hash MD5: 16K * 512
       01 76 F7 19 07 CE 08 00 5B ED 7B D0 C6 67 5E 0B>)
(   3,<2013-03-19 19:31:05.975 -0500>,<Administrator>,<X>,<proc2d>,<TOPSPIN 2.1>,
      <abs2 F2: ABSG = 5 ABSF1 = 10.00049 ABSF2 = 0.001209814
       data hash MD5: 16K * 512
       02 C4 FF B0 B3 E9 91 10 DB 65 B2 4A DC DE DA F1>)
(   4,<2013-03-19 19:31:06.678 -0500>,<Administrator>,<X>,<proc2d>,<TOPSPIN 2.1>,
      <tilt
       data hash MD5: 16K * 512
       62 0F 57 A1 A5 F2 30 9F 99 4E 0D 01 0B 9B 3D EF>)
(   5,<2013-03-19 19:31:08.085 -0500>,<Administrator>,<X>,<proc2d>,<TOPSPIN 2.1>,
      <abs1 F1: ABSG = 5 ABSF1 = 0.06497851 ABSF2 = -0.06497862
       data hash MD5: 16K * 512
       08 C8 FA 52 18 CD 99 78 10 03 74 72 36 A7 82 7C>)
(   6,<2013-03-19 19:31:09.272 -0500>,<Administrator>,<X>,<proc2d>,<TOPSPIN 2.1>,
      <symj
       data hash MD5: 16K * 512
       7A 98 CE 2B 34 9D 47 A2 0D 9D D0 39 92 43 A3 C8>)
$$ ##END=
$$ 
$$ $$ hash MD5
$$ $$ D1 B2 62 EF 62 2C C7 44 01 2F 0E A7 04 50 63 75
##$RELAX= 
##$RELAX= 
##$RELAX= 
##$RELAX= 
##$RELAX= 
##$RELAX= 
##$RELAX= 
$$ Bruker specific parameters
$$ --------------------------
##$DU= <E:\>
##$EXPNO= 23
##$NAME= <AC1410_ECUAH12219_7653105_wtmQEQFSva>
##$PROCNO= 1
##$TYPE= <nmr>
##$USER= <COFFEE>
##$ACQT0= 1000000
##$AMP= (0..31)
100 100 100 100 100 100 100 100 100 100 100 100 100 100 100 100 100 100
100 100 100 100 100 100 100 100 100 100 100 100 100 100
$$ [...]
##$TD0= 1
##$TE= 300
##$TE2= 300
##$TE3= 300
##$TEG= 300
##$TL= (0..7)
0 120 120 120 120 120 120 120
##$TP= (0..7)
150 150 150 150 150 150 150 150
##$TP07= 0
##$TPNAME0= <>
##$TPNAME1= <>
##$TPNAME2= <>
##$TPNAME3= <>
##$TPNAME4= <>
##$TPNAME5= <>
##$TPNAME6= <>
##$TPNAME7= <>
##$TPOAL= (0..7)
0.5 0.5 0.5 0.5 0.5 0.5 0.5 0.5
##$TPOFFS= (0..7)
0 0 0 0 0 0 0 0
##$TUNHIN= 0
##$TUNHOUT= 0
##$TUNXOUT= 0
##$USERA1= <user>
##$USERA2= <user>
##$USERA3= <user>
##$USERA4= <user>
##$USERA5= <user>
##$V9= 5
##$VALIST= <valist>
##$VCLIST= <CCCCCCCCCCCCCCC>
##$VD= 0
##$VDLIST= <DDDDDDDDDDDDDDD>
##$VPLIST= <PPPPPPPPPPPPPPP>
##$VTLIST= <TTTTTTTTTTTTTTT>
##$WBST= 2048
##$WBSW= 25
##$XGAIN= (0..3)
0 0 0 0
##$XL= 0
##$YL= 0
##$YMAX_a= 62213
##$YMIN_a= -116993
##$ZGOPTNS= <>
##$ZL1= 120
##$ZL2= 120
##$ZL3= 120
##$ZL4= 120
##$ABSF1= 0.06497851
##$ABSF2= -0.06497862
##$ABSG= 5
##$ABSL= 0
##$ALPHA= 0
##$AQORDER= 0
##$ASSFAC= 0
##$ASSFACI= 0
##$ASSFACX= 0
##$ASSWID= 0
##$AUNMP= <>
##$AXLEFT= 0
##$AXNAME= <F1>
##$AXNUC= <1H>
##$AXRIGHT= 0
##$AXTYPE= 0
##$AXUNIT= <>
##$AZFE= 0.1
##$AZFW= 0.5
##$BCFW= 0
##$BC_mod= 0
##$BYTORDP= 0
##$COROFFS= 0
##$CY= 15
##$DATMOD= 1
##$DC= 0
##$DFILT= <>
##$DTYPP= 0
##$F1P= 0
##$F2P= 0
##$FCOR= 0.5
##$FTSIZE= 512
##$FT_mod= 6
##$GAMMA= 0
##$GB= 0
##$INTBC= 1
##$INTSCL= 1
##$ISEN= 128
##$LB= 0
##$LEV0= 0
##$LPBIN= 0
##$MAXI= 10000
##$MC2= 0
##$MEAN= 0
##$ME_mod= 0
##$MI= 1
##$NCOEF= 0
##$NC_proc= -5
##$NLEV= 6
##$NOISF1= 0
##$NOISF2= 0
##$NSP= 0
##$NTH_PI= 0
##$NZP= 0
##$OFFSET= 0.06497851
##$PC= 4
##$PHC0= 0
##$PHC1= 0
##$PH_mod= 2
##$PKNL= no
##$PPARMOD= 1
##$PPDIAG= 0
##$PPIPTYP= 0
##$PPMPNUM= 2147483647
##$PPRESOL= 1
##$PSCAL= 1
##$PSIGN= 0
##$PYNMP= <proc.py>
##$REVERSE= no
##$SF= 400.021882494141
##$SI= 512
##$SIGF1= 0.06497851
##$SIGF2= -0.06497862
##$SINO= 16
##$SIOLD= 512
##$SPECTYP= <>
##$SREGLST= <1H.MeOD>
##$SSB= 0
##$STSI= 512
##$STSR= 0
##$SW_p= 51.9856959427865
##$SYMM= 3
##$S_DEV= 2674
##$TDeff= 40
##$TDoff= 0
##$TI= <>
##$TILT= yes
##$TM1= 0
##$TM2= 0
##$TOPLEV= 0
##$USERP1= <user>
##$USERP2= <user>
##$USERP3= <user>
##$USERP4= <user>
##$USERP5= <user>
##$WDW= 3
##$XDIM= 16
##$YMAX_p= 297608890
##$YMIN_p= 0
$$ End of Bruker specific parameters
$$ ---------------------------------
##NTUPLES= nD NMR SPECTRUM
##VAR_NAME=  FREQUENCY1,    FREQUENCY2,      SPECTRUM
##SYMBOL=    F1,            F2,              Y
##.NUCLEUS=  1H,            1H
##VAR_TYPE=  INDEPENDENT,   INDEPENDENT,     DEPENDENT
##VAR_FORM=  AFFN,          AFFN,            ASDF
##VAR_DIM=   512,           16384,           16384
##UNITS=     HZ,            HZ,              ARBITRARY UNITS
##FACTOR=    0.101534562388255, 0.501933850740131, 1
##FIRST=     25.9928259484165, 8223.18227667557, -332
##LAST=      -25.8913354319817, 0,           -1258
##MIN=       -25.8913354319817, 0,           0
##MAX=       25.9928259484165, 8223.18227667557, 297608890
##PAGE= F1=25.99282594842
##FIRST=     25.9928259484165, 8223.18227667557, -332
##DATA TABLE= (F2++(Y..Y)), PROFILE
$$ [...]
##PAGE= F1=0.1015125394115
##FIRST=     25.9928259484165, 8223.18227667557, -2098
##DATA TABLE= (F2++(Y..Y)), PROFILE
15062b088g80h0r0p10m25Q4A8J641J570P86l26j475A31b443k022J135O94n50j23
15043c309a263D51M63C43f14j705j460N95M44K2O2o59J29J81K7J51L4K09L68L85
15023a831L86L77M61b34k22J71C61Q43J025O31M97k1l35q49I33h4j122l54j41
15004a701r3j11j69j25n23j059p10l88O95R10P28a253B16J400K01F06a062j492
14986b554L02b13A816J319J271l42j303A248B37d76l29l31l31M0J33Lb85H69Q33
14967A702M49l43B09b254r29c42B723K125J406q52j714j457n48n83m03r6nN28
14949A124K56o25c30j116l4N54L92a10A9i4Lr92j462r08l67M59O36R82g08a00
14928C00j11n2b14nA91K61M57L81K91o9k42m04m09c79j553r34P79f08H34Q90M28
$$ y = [-2088, -780, -80, -170, -880, -1305, -1221, 18, 1659, 3229, 4015, 3689, 2214, 131, -2443, -4465, -3330, -2636, -3186, -3309, -1263, 451, 914, 343, -614, -2319, -3779, -3184, -2740, -2718, -2656, -3315, -3186, -3005, -2978, -2827, -2793, -2584, -2216, -1831, -1445, -1068, -607, -234, -456, -285, 361, 1204, 2229, 2860, 3357, 3336, 3001, 2152, 933, -84, -1206, -1560, -1701, -1794, -1905, -2074, -2199, -2722, -3781, -4491, -4879, -4184, -3274, -2546, -1253, 216, 1616, 1817, 606, -1062, -2554, -2252, -213, 1816, 3135, 4406, 4064, 2761, 1248, 237, -476, -805, -1136, -1467, -1427, -1294, -1291, -285, 869, 1702, 2151, 1808, 209, -2254, -3183, -342, 2723, 4848, 6254, 5402, 3688, 2231, 1683, 1100, 697, 601, 596, 1124, 1380, 755, -330, -1446, -1480, -926, -534, -110, 19, -94, -91, -1083, -2545, -3453, -3820, -3361, -2725, -1743, -708, -100, 300, 189, 137, -214, -219, 191, 452, 909, 1290, 1581, 1512, 1270, 866, 457, -379, -1932, -2866, -2087, -608, 834, 1724, 2152]
14907B152m25F78h46j226p91o43k98j6R71a227A29N10j53n5K1L66N69M92Q24K78
14887B981k92l29O45J024R38K98r1o46j187j575C62A11i8l22o39k70e40A261J495
14868B756Q30q16E67a118l52c71A592J536L57p09A144i11j628p12J342M50j5J00
14850a374K74M60b57C0c2o76n91k19n46p27j87j11K02N15M77J89m73j538N98J130
14830a989M67J19R9O10D76J637J189j27r24p09j18K47R64J181Q73Q72K61n99j244
14811C979j523j063n46J3N73P26O49M10m26r77D90a024j421n38Q98e13G79J078
14793A857L02K1n1o89a1k034j753O56J529c70B53j18e75r90j035o60n18P18i97
14773f51G08N71K63k89C94a43D82K43C33e08j060j441P96h87L11g6k26j030j414
$$ y = [2152, 1727, 678, -846, -2072, -2863, -3506, -3804, -3820, -2849, -1227, 129, 639, 486, 431, 452, 818, 1387, 1879, 2703, 2981, 2689, 2360, 3005, 4029, 4967, 5265, 5174, 4528, 3341, 1766, 362, 111, -98, -420, -1059, -1329, -540, 1261, 2756, 3586, 2770, 567, -1118, -1470, -371, 1592, 3128, 3485, 2776, 1144, -911, -2539, -3251, -1909, -1459, -1474, -1374, -1100, -640, -257, 30, -32, -708, -1299, -1518, -2064, -2791, -2978, -3089, -2887, -2372, -1895, -1706, -2179, -3717, -3119, -1989, -1522, -1403, -1304, -694, 476, 2113, 3302, 3175, 2251, 1542, 1424, 1671, 2635, 3816, 4689, 5561, 5822, 5223, 3979, 2456, 1393, 847, 860, 1433, 2159, 2808, 3218, 2792, 1815, 490, -1024, -2445, -2983, -2085, -513, 779, 1857, 2159, 2180, 2129, 1440, -11, -2045, -3798, -3142, -1613, -370, 253, 135, -575, -1565, -2600, -3260, -3778, -3060, -997, -651, 708, 1279, 1542, 1253, 394, -143, 482, 725, 333, -508, -1568, -3009, -2213, -887, -576, -76, -302, -1332, -2746]
14754b746n39Q90f02E25O00K10j29l23D27C4N41J018Q40M26n2k37l14p63B55a033
14733a578d37I89N49m0o71l45H5P2K07B7K62J43J5k11b45q71q77j009j99L3Q60
14712b308g20K01j306j262Q40g54E36O56J3G9a334j321l68k15l70J21P58O85j8
14693b062m2M49f75E15J221J704J244l28j35L88m69r96j473D69f85j289j566k40
14675c780J365M71o0k99O55O58M01j0b80o47j447j119J034R56Lq23j67J211C96
14655A279L32l9C96a010j518p34L9M21J6J13k28o19l94Q75a467a72D66M44k71
14636F39a00j018j382o20j2O33J036f64N7n69r39p00j15M38O24N20n46j153p34
14617c781J070Q66P8m67j002n98R82a162A851J600J209M36m35n79n95p66r06F45
$$ y = [-2746, -3285, -2395, -602, 525, 1125, 1335, 1206, 883, 427, 34, 575, 1593, 2433, 2859, 2807, 2570, 2256, 1493, 255, -1033, -1578, -437, 989, 1538, 1498, 827, 482, 85, 157, 364, 27, 289, 432, 447, 236, -245, -1116, -1993, -3002, -3201, -3168, -2308, -720, -519, -1825, -3087, -2247, -754, 536, 1192, 1205, 79, -1334, -2655, -3023, -3238, -3608, -3487, -2729, -2044, -2062, -2104, -1655, -675, 515, 1736, 3440, 4684, 4356, 4221, 4609, 4140, 3144, 1671, 469, -685, -1974, -3540, -3780, -2415, -1944, -2004, -2303, -1648, -990, -589, -599, -280, -927, -2374, -3493, -2459, -1503, -1500, -2323, -2490, -1279, 396, 1279, 1611, 1572, 396, -1010, -2528, -3262, -3223, -2802, -2786, -2673, -2901, -3520, -3914, -3039, -1467, -172, 466, 910, 639, -100, -1118, -2500, -3120, -3132, -2499, -1463, -664, -607, -1176, -2115, -2815, -2930, -2492, -1868, -1348, -1894, -3047, -3781, -2711, -1845, -1767, -2234, -3236, -3834, -2852, -1162, 1851, 3451, 4660, 5096, 4661, 4082, 3487, 2721, 1815, 645]
14598h28j248k07i65F15K02r2A91c65r76j358j735a969A024J838J94j434g12k889
14580c601a684A779J812k60A244a247k092a553G94K297K012J187j69j106j137
14565C878r04q73r36B30c21a31D65L16K64P02J166Q53J4j096j048E91g34j269
14547b003p18J1O15M60M2l58j126p93k3J133O18j43n3K12N75N51J67q9L75A636
14526D093K063Q92j37o56o08n98p65n71p73q95m91Q22K103J820O22j140k687g9
14507a884q97m80J528A040K728J731%j728A279a101j080N19L73k77M05b87C2i16
14488b922q54a828c04D24N25L72L59j33p49h69j560j657N0a811A138K530K050
14471E718M97j021j020j086j246G94B10b16n70m77j112p31m60K19O21L77j31l97
$$ y = [-828, -2076, -2283, -965, 615, 817, 725, 191, -365, -1341, -2699, -4434, -1969, 1024, 2862, 3056, 1622, -712, -3601, -1684, 1779, 3591, 3331, 1244, -1247, -3339, -1553, 794, 3091, 5103, 6290, 6121, 5015, 3878, 2974, 2101, 1165, 230, -321, -131, 465, 781, 1045, 1747, 2913, 3766, 3780, 2684, 1636, 591, -734, -2003, -2721, -2710, -2095, -1635, -1593, -1951, -3077, -3870, -3893, -2760, -2142, -2285, -2338, -2126, -1551, -1000, -833, -922, -547, 1636, 4093, 6156, 7048, 6911, 6255, 5647, 5049, 4284, 3713, 2940, 2045, 1554, 2376, 4479, 6299, 6921, 5781, 3094, -79, -1884, -2781, -3261, -1733, 1040, 3768, 5499, 5499, 3771, 1279, -1101, -2181, -1662, -1289, -1566, -1161, -287, 32, -916, -2922, -3776, -1828, -304, 424, 949, 1321, 1680, 1547, 798, -869, -2429, -4086, -4036, -1811, 1138, 3668, 5718, 6215, 5194, 4174, 3088, 1842, 794, 210, -216, -786, -1263, -2375, -3106, -3566, -3347, -2726, -2349, -2480, -2877]
14453b877q74q97L73a403H28J460K85p91l27M3N27M94m15G46g67j828p07L33L90
14434b579K27l09j215j83a740C54J729M12l98A014B66K8M76M20J28n89f93k439
14416c132j309J658J098L06l89j132j490J391Q77P99b85D80L60p6A12g22p41j
14398a464O60G5N34K25C59h00j395j139QM80a390a36E26j39a59j597j891j247
14380d894Q49Q95J164O24f53b4A48b43j242j419J75K11P16L13k65m71Q8O4j33
14361b206J12J58J27O76a09A109Q87l22F78f78j199o53l8P25J65j75J95L56j07
14342a409K78K62b09L6m04k78m38p12l77n51k47J29P0j26L06r7j08J185d17E87
14321A508P76M21M22j506g13k469l15O43J50m75K04J191f11B37L12N44J79J063
$$ y = [-2877, -3751, -4648, -4275, -1403, 828, 2288, 2573, 1782, 1455, 1498, 2025, 2519, 2104, 746, -767, -2595, -3302, -2969, -2579, -2352, -2661, -3876, -4059, -1740, 354, 2083, 2495, 2097, 1014, 266, 294, 770, 1190, 1318, 729, -693, -3132, -4441, -2783, -1685, -1379, -1768, -2900, -4390, -2999, -2122, -1323, -285, 480, 840, 764, 112, -722, -1463, -1464, -804, 75, 609, 834, 359, -800, -2195, -3334, -3326, -2846, -1390, -136, 526, 387, -159, -1756, -3647, -4894, -4045, -3150, -1986, -1362, -653, -24, 148, -243, -1485, -2904, -2729, -2518, -1802, -1489, -1754, -2225, -2137, -2073, -2206, -2094, -1936, -1809, -1133, -109, 1109, 1996, 1674, 678, -678, -1877, -2530, -2568, -1843, -1678, -1853, -1658, -1302, -1409, -1131, -869, -209, -173, -577, -855, -1293, -2005, -2382, -2933, -3180, -3051, -2981, -3107, -2801, -2898, -3006, -1821, -417, 587, 1508, 2284, 2705, 3127, 1621, -713, -3182, -3497, -2854, -2704, -3179, -2975, -1784, -611, 237, 549, 1093, 1272, 2335]
14303B335O39k26q77E49g56j323j128n06kJ225a008D57J027L01E37a252k438j195
14285d885N58J017M33Q8J033e65E07O1e53p69c75I17J258Q29k30A255f22j332
14267a954L61K68k01k12Ng52c52m24p16r72k3J064a72E65J088J267Q99J269J053
14248F141O96k0o43k146A467a006k128j292Q32J034P41L49m17j359j225k2J268
14231c225J408M82k02l12k99l71l23k80m56q2m46m41L10J375a064G23J848O77
14213C248m00j086b10j553k69P99d59J9q9O3j66m09n59j026l5J94m9o1L09n7j14
14192b439l76m35m24r1J664f60B10Kh02j384q84L64Q69J29R6L16c2A576J095M90
14172C161m17j174B44a226j154l10K99K76l81n38mK29R9Q20N60K40k15j396q22
$$ y = [2335, 2974, 2748, 1871, 549, -756, -2079, -3207, -3713, -3715, -2490, -1008, 457, 1484, 1785, 537, -1252, -3690, -4885, -4327, -3310, -2877, -2789, -1756, -565, 507, 568, -553, -1322, -375, 917, 2175, 3004, 2774, 1255, -622, -1954, -1593, -1325, -1526, -1738, -1733, -752, -352, -776, -1492, -2464, -2487, -1423, -172, 565, 1653, 2920, 3819, 5088, 6141, 6837, 6817, 6174, 4028, 1467, -1006, -3134, -4426, -3594, -2560, -1819, -1470, -1887, -3246, -4471, -4493, -3225, -1817, -1335, -1537, -1849, -2148, -2519, -2842, -3122, -3578, -3660, -4106, -4547, -4237, -2862, -1064, 723, 2571, 3248, 2848, 1762, -210, -1763, -2032, -1233, -459, -440, -529, -466, -632, -1041, -1600, -2626, -2661, -2467, -2516, -2577, -2268, -2325, -2439, -2815, -3250, -3674, -3765, -2101, -660, 210, 212, -802, -2186, -3070, -2706, -1837, -1708, -1612, -1296, -32, 1576, 2671, 3161, 2744, 1570, 244, -1226, -2380, -2690, -2391, -2115, -2496, -3034, -3038, -2809, -2710, -1890, -1330, -1090, -1305, -2701, -3523]
14153c523k16N47K92m0p5K24O67h81D19P94K15k07E98D6b14j0k40l96p46q23M
14132b425f54B400K253J545J07j6p04j198j355j211l48O83J729J755N18n48j339
14115D271j837C24a231l29K13N16L72l66j133k27e96A104J344J00j058a78j844
14098b022j305J72O80O35P80b97E66L13j62B78b77l99c15C5J109m08g92j711q64
14079c367N79M41N56J63K47k43l30N81c78B82O40L61M47Q86J008J065O11M3M8
14060E391j76o53k026D44a902k770j103J891a806dA740J269O88k81q44A285B38
14042g69l34o61j357k60a594f8A503Q30r61h45k610M13a417f84b13E46J7F2f7
14022A403K572K976J966P11q38k543l105A33b746j692K58R60L30J358B41J318
$$ y = [-3523, -3739, -3192, -2900, -2940, -3015, -2791, -2124, -881, 419, 1213, 1428, 1221, 598, 46, -214, -224, -464, -860, -1606, -2429, -2425, -654, 2400, 4653, 6198, 6305, 6289, 5585, 4387, 3032, 1821, 1473, 2156, 3885, 5640, 6158, 5610, 4271, 2434, 324, -1231, -1560, -1347, -831, -459, -825, -1958, -2185, -596, 1104, 2448, 2548, 1490, -178, -2022, -3327, -3155, -2475, -1840, -1060, -297, 566, 879, 717, 278, -277, -676, -315, 35, 1144, 736, -792, -2503, -3367, -2788, -2347, -1791, -1628, -1381, -1624, -1954, -1373, -378, 282, 922, 1283, 1730, 2616, 3624, 4689, 5300, 5343, 5391, 5215, 4562, 2536, 444, -1902, -4672, -5775, -3884, -1806, -4, 1740, 3009, 3697, 3416, 2572, 1285, 238, -769, -1103, -1764, -3121, -3381, -1594, -68, 1503, 2333, 1372, -845, -3455, -3042, -1417, -684, -213, 546, 563, 62, -67, 1403, 3975, 6951, 8917, 9628, 8790, 6247, 3142, 133, -2746, -4438, -4180, -3220, -2890, -1532, 241, 1559]
14006A559M92j50l93F47e17j067q45m16L32j19m44o25m82L78J025J230J02p14
13988b162j373N15J385d46F6J88K35J62L0l35c64j082j757j217Q1Q80R81J035
13970a443N65c03M6P8K1j4j93l51k15K39p88p91j60M83h41c14m73j694k792O9
13950e204a198B149K330Q28q12q52n01l78l72n13N7k17F42f78j292P7A2K103J136
13931C251Nj144A029l67J48o1i8q15l19I02K954K593J142l41j008j363k014F95
13912a376j014J92O0M04j70j30R93H37J856J618P40p58j793F86d77j058q62l97
13894b794Q7a228E31J419P02j37j007b28r19L68D77R42J232J765J988J714J165
13877I283O53k91q25j538j777r71q22j023j318D0a136m52K69K52J9j64m11j145
$$ y = [1559, 2051, 1901, 1508, 647, -517, -1584, -2429, -2845, -2513, -2632, -3076, -3701, -4183, -3805, -2780, -1550, -1448, -2162, -3535, -3020, -1635, -446, 66, 254, 489, 651, 681, 346, -364, -1446, -3203, -4420, -4339, -3459, -2478, -1443, -878, -303, -257, -179, -158, -172, -365, -716, -931, -692, -1480, -2271, -2431, -1948, -841, -314, -787, -2481, -5273, -5204, -1198, 2149, 4479, 5307, 4495, 3643, 3142, 2764, 2392, 1879, 1936, 1719, 642, -678, -1970, -1893, 12, 2115, 3251, 3256, 2112, 1029, 662, 810, 749, -98, -913, -1232, 902, 3856, 6449, 7591, 7250, 6242, 4879, 2865, 695, -1376, -2390, -2198, -2138, -1734, -1904, -2034, -1041, 837, 2693, 4311, 5051, 4293, 2500, 686, -477, -1535, -2397, -2794, -2707, -1228, 531, 1950, 2652, 2515, 1508, -228, -1147, -779, 477, 1419, 2651, 4416, 6404, 8118, 9283, 9936, 9645, 8820, 7282, 5505, 4534, 3712, 2689, 1371, 40, -1136, -1588, -1319, -1067, -1048, -1212, -1623, -2768]
13859b768k51j95K39M39L30M39K02F19L097K492R40p90k124A546a629k323J689
13842b263J043N4j28m1k45o70j217M25a365A08J014O00L65P6M41Q78Q29K67j72
13823D406j091j463o19o0J433J894K314J433N66p8p43j898C007f83l179O03J494
13806a765g27C3R33J482J599J227K66o85j034j096j152F35f4n74p75j188m12J90
13788b823a228C87J390R59j63q70E97b42p74l18K71L52K20a96A58N7e13r55j022
13769b490n18k48j31l54O64a468F89J676N57j19j054F63g8r2e9r2o49p56o67m98
13749b721M79R87c45B80d4k10j26D62J245J245k60A203a488j681a284b23I2e46
13730a830j265k67J262e81C41O32K02K46N98L22o90k90j90N84O54k54H29a237
$$ y = [-2768, -3019, -3214, -2975, -2536, -2206, -1767, -1565, 619, 3716, 6208, 7148, 6358, 4234, 1546, -1629, -3952, -2263, -1220, -1166, -1294, -1335, -1580, -2250, -3467, -3042, -1365, 108, 1122, 1722, 2087, 2163, 2604, 3482, 4311, 4578, 4406, 3315, 1852, 1233, 1173, 2606, 4500, 6814, 8247, 8813, 8735, 7992, 6094, 3007, -683, -3862, -3259, -1765, -727, 33, 966, 2448, 4047, 5274, 5540, 4855, 3821, 2725, 1573, 635, -64, -638, -1413, -2601, -3013, -2823, -1228, 387, 1777, 2736, 2573, 1703, 597, -242, -1016, -1334, -1063, -711, -491, -196, 158, 215, -513, -1468, -2490, -3008, -3256, -3387, -3741, -3077, -1468, 689, 2365, 2922, 2803, 1749, 663, -78, -170, -59, -151, -800, -1556, -2223, -2721, -2242, -1255, -345, 280, -44, -254, -380, 462, 1707, 2952, 2692, 1203, -1488, -3169, -1284, -223, 92, -546, -1830, -3095, -3362, -2100, -581, 341, 973, 1175, 1421, 2019, 2341, 1651, 1361, 1171, 1755, 2409, 2155, 829, -1237]
13711c977j337J932Q89k95J147b32n7j276j923O74a000C16L05A4h93J00D01J490
13693A891J217O20l9o13j119F99f30j428j283o53j59L32n92j22N38J114J311b31
13674A14a75j089q71a011A711K804J861O75K46r79j463k229a63k739k0a417H2
13656A146M40K69k09k94F45c44p61j151q71J309a14H57k46C4g45p4H3O83M40j98
13636A008B68a083k666j608P10J171P90J03j18k84n99m68nn5J090R79L98L25p2
13617a392l73p28m64j92J41k4k67N79M51K0o00p74J019J047J44o89j155r67N36
13598c688J205a051E26J054K53m90m35J62R51R47M03m55j404b60j794o21O98J62
13580a815l39o80o85o91J62Q77P68K39N4m13k1P50h42a1k23j076n66e50A829K700
$$ y = [-3977, -5314, -3382, -2493, -2788, -1641, -232, -289, -1565, -3488, -2814, -1000, 316, 621, 14, -893, -793, 401, 1891, 3108, 3728, 3689, 3076, 1957, 699, -630, -2058, -3341, -3994, -4153, -3821, -4413, -4535, -3997, -2883, -1572, -231, 114, -175, -1264, -2135, -1011, 1711, 4515, 6376, 7051, 7297, 6318, 4855, 2626, -163, -2902, -2922, -1417, 82, 1146, 1586, 1855, 1646, 1352, 645, -344, -1105, -2256, -3127, -1818, -114, 857, 611, 34, -745, -819, 83, 766, 1206, 1008, 268, -1083, -3749, -5357, -4647, -3476, -2686, -2583, -2701, -2985, -3584, -4052, -4057, -4112, -3022, -2043, -1645, -1320, -1392, -1765, -2493, -2957, -3149, -3008, -3032, -3299, -2720, -2269, -2249, -2849, -3623, -2604, -1557, -1413, -2102, -3257, -4224, -3688, -2483, -1051, 526, 1580, 1833, 1343, 908, 1070, 2021, 2968, 3371, 2916, 1512, -260, -2054, -2675, -1977, -1815, -2154, -2834, -3519, -4210, -4048, -3171, -2403, -2164, -2110, -2523, -2544, -1794, -842, -11, -234, -1310, -1876, -550, 1829, 4529]
13560D529K365R82o17k231B102i27j717m11K8j57O87a044a64B0f43j203r37d87
13541A391J285Q30K05k10o59p08l84l74o71g45k382j135a697E32J192q6F47a359
13522c700M10J217h84A46J024Q14L12l79G38d57K26I04J075O84l49o54p21N00
13504A439J003M31q46F1b290K29I5J682J183J464J144P47R7n98j185r88o93q4
13486B864Q8p69E09a564r29a107A435J862J110M91j80k30l51m51j72m25m44p73
13468A872H95a94q25d39E1J62Qd81j029n79P72F59K155K015J327L47o76j258j608
13449B961F73a489j490k92J366c52A083J179Q39l78p2n44o69o24B64a06l17o92
13431a115l36J7J55o59j153r30J500d65A312J222M30m51A094a024j315F89K828
$$ y = [4529, 6894, 7876, 7259, 5028, 2102, -927, -2644, -3055, -3027, -3184, -2497, -1044, -164, 20, -643, -1846, -2783, -487, 1391, 2676, 3506, 3711, 3501, 2842, 2134, 1750, 1376, 705, -745, -3127, -4262, -1697, 532, 1724, 1638, 647, -1359, -3700, -3290, -2073, -884, 146, 1170, 1984, 2296, 1917, 738, -457, -231, 904, 1979, 2663, 2314, 1660, 939, 1439, 2442, 2873, 2027, 61, -2290, -2061, 95, 1777, 2960, 4424, 5568, 6315, 6412, 5814, 4629, 3641, 2948, 2864, 2952, 2183, 509, -1564, -2493, -1107, 1435, 3297, 4407, 4898, 4718, 4488, 4137, 3686, 3514, 3089, 2645, 1872, 895, -194, -1019, -439, 51, 213, 221, -481, -1510, -2089, -1317, 659, 2814, 4829, 6156, 6503, 5827, 4569, 2961, 673, -1489, -2979, -3271, -1905, -352, 1083, 2262, 3101, 2723, 2651, 2107, 1438, 814, 264, -106, -423, -1115, -1451, -1434, -1279, -1938, -3091, -4021, -2521, -465, 1312, 2534, 2964, 2513, 1094, -1024, -2339, 689, 3517]
13414C517K386Q45o16j641j671r78k81j28E04g91j507n62p23k7J429c74A187N92
13396A779r9o82f1j262j225o20j52k52m8o1K74N48P92M78M43K50M9l11l73l9m99
13375b069l99m46j30N71O83P71A6P43O9q8C39b82n05n06k33M07d2G61M73K40K13
13354A687l44q3l68m13E8f76j278N4J69R9l52m6L09e25G34K59m87g41j859m14
13334c014J24J074L85M02m1m61o91p87k25n82n4J68L10J95J26J036e65I21Q83
13315A804J58l93D05a210l60A40J195J3m41B33c0I00J725R62j45o85j40N89J281
13296D487N70l38j034r77A250b85q06J09d60E38J537J874J304Q61J70n89j035
13279D660j463j446n03L93Q26P87Q75O67j2n78j641E85h20j048j75Q8O49b73I29
$$ y = [3517, 5903, 6748, 6132, 4491, 2820, 1842, 1561, 1433, 504, -791, -2298, -2860, -3583, -3610, -2181, -374, 1187, 1779, 1680, 998, -61, -1323, -2548, -3168, -3320, -3572, -3620, -3681, -3407, -2859, -2067, -1589, -1146, -896, -847, -1158, -1531, -1570, -2069, -2468, -2914, -3044, -2473, -1790, -1019, 16, 759, 828, 740, 339, -282, -787, -1293, -1526, -1119, -42, 761, 1234, 1474, 1687, 1343, 1260, 892, 479, 58, -676, -1954, -1900, -1731, -1632, -1984, -2030, -1721, -525, 734, 993, 506, -741, -2600, -3014, -2890, -1816, -1431, -1029, -1070, -1531, -2222, -3009, -3234, -3816, -3870, -3702, -3392, -3197, -3071, -2035, -565, 921, 1804, 1962, 1569, 405, -1210, -1570, 140, 1335, 1348, 907, 233, -30, 900, 2625, 3587, 3442, 2757, 2617, 3206, 4487, 5057, 4719, 3685, 2708, 1250, -285, -1091, -982, -460, 538, 2075, 3949, 5253, 6114, 6284, 5695, 4660, 3197, 1751, 1248, 1641, 2467, 3254, 4129, 4796, 4784, 4206, 2565, 585, -820, -1868, -2043, -1955, -1306, -273, 929]
13259B489J404P06m2j149A277g23k67c89I3a97m59p66m47n36m61J9j38M02P32
13240a851N90f20b15a06C26O82M34k36B24d84B30J748J499J139j12j494C42b519
13221e313Q47J597O7j426J579g50A021J288J967J644J153O00k62j424k883F98
13204a703p85L09e80G01J364L81l26p91n67C35p1K6j35b39q52r67k5R30L74l85
13184a164j270q14K60J237L74l99o77p51l54R06a195F59J928J776R83l72j227
13167C747A728f13j481q74m36j59O80R82N33l13m69K79b07A210J134m24h3k801
13149b884k195K128a61A501J34F1b580f96A050J741O88m67j420b34j887j568J070
13132b619O82P24k66M19d08E52R54M20r3H68i04j570P63c73I4d18r27m28M29L18
$$ y = [2489, 3893, 4599, 4557, 3408, 1277, -723, -990, -389, 93, -197, -656, -1422, -1869, -2405, -2866, -2847, -2985, -2583, -1851, -1261, -620, -215, -106, 326, 1008, 1442, 1206, 224, -484, 230, 1978, 3477, 4616, 4504, 3010, 342, -2519, -5313, -4466, -2869, -2802, -4228, -2649, -750, 1021, 2309, 4276, 5920, 7073, 7673, 7411, 5987, 3104, 698, -1703, -2488, -2179, -580, 701, 2065, 2446, 2120, 1329, 762, 335, 264, 290, 155, -239, -1091, -2058, -2083, -1153, -779, -1164, -2434, -3248, -2988, -1751, -1377, -1776, -2453, -3204, -3558, -2652, -1195, 659, 2587, 4363, 5346, 4974, 3747, 1728, -613, -2094, -2968, -3404, -3563, -2883, -1901, -1368, -1681, -2150, -1871, -207, 1210, 2344, 1920, -83, -2884, -5079, -2951, -161, 1501, 1635, 61, -2580, -696, 1050, 2791, 3479, 3012, 1592, -234, -2121, -3689, -2619, -1937, -1213, -1479, -1060, -408, 552, 1506, 1926, 1833, 868, -904, -2474, -1711, -373, 94, -418, -1345, -1773, -1344, -1026]
13112a026k72j050j349J42J259g01H93J751J624J077M78o81j353j360A095c3m86
13095e19A11J124J635J446K84j036j474m23l5G96i67j558j633p13o32R4J676a610
13076a78I74L97k71C70f38q96m73M14g50Q6l03o44j45q60l16J1j9M55R45A14J352
13055A466O77J35J3q10C00i35o29k15k07o05K3qk95M35K81L70O28b77C45K85N8
13034F88K5C54g8B60P87R63R65O44o86A432d82k083j387O20j33L72Q4L51J37K96
13014b225O25j01K48g18E69J523J726J847J481M27m92j237j640j437j186G10j97
12997E13J99O44Q09P6p72a06j906j181Q86a094N02Q0o59o63J77P29c62J1m95p82
12977a628j206L86g40E96N40m70c84j174j24P76L85C0J95G3a36q92j400j49a240
$$ y = [-1026, -1298, -2348, -3697, -3555, -2296, -701, 893, 2644, 4268, 5345, 5823, 5142, 3789, 2429, 1095, -33, -519, 111, 1235, 2870, 4316, 4600, 3564, 2090, 1667, 1632, 796, -967, -2525, -4158, -4871, -5503, -5409, -3733, -1610, -178, 974, 1371, 1100, 370, -638, -1534, -2007, -1593, -750, -664, -967, -1611, -1756, -2616, -2932, -2921, -2940, -2485, -1540, 114, 1466, 2143, 2278, 2291, 1481, 300, -935, -1564, -1779, -1986, -2591, -2568, -2576, -2871, -2436, -2155, -1785, -1157, -277, 345, 630, 688, 713, 354, -78, 260, 1047, 2010, 2975, 3619, 2933, 1432, -482, -2565, -3952, -3332, -3465, -3093, -3009, -2658, -2521, -2225, -1600, -1701, -1453, -718, 569, 2092, 3818, 5665, 7146, 7573, 7081, 5844, 4204, 2767, 1581, 710, 513, 712, 1356, 2165, 2241, 1469, -106, -2012, -3193, -2307, -1094, -592, -512, -1171, -1834, -1657, -928, -362, -351, -846, -1628, -2834, -2448, -740, 596, 1136, 666, -384, -1558, -1682, -906, -521, 30, 225, 73, -136, -1028, -2428, -2577, -1240]
12957E1J237J335J616K112K276J605Q82l13j253k713k905A869B99b22B89J147
12941A436R27N91P18N45J212R90P71k68j459j775j321A013c76j865k061K48J215
12924b839j76j531p31J877R19Q08M47J19K40b70d9k51k88k90d18B90R41J689J366
12905D286K25q13j034p46n15K54O15M7q64F96F5h01j142j352j066l0J042J574
12887a775g70L15r04j276q46J019J034f73j70l5c87B59O35M18M37M33j63p61A91
12867b47N8l68j027j673j799J43J034K44l76p6Q77J107P13N91c04B45J84D9O0
12848A09M02N56O10M40n83F78g62k083Q3i21C63M93C70g09j610j512N07R02N17
12829a905K03J90N76i8A261J362P11Qq02I12a437k209k14J709f49a60o09p42j83
$$ y = [51, 1288, 2623, 4239, 6351, 8627, 10232, 11114, 10801, 9548, 6835, 3930, 1869, 299, -222, 289, 1436, 2363, 2954, 3672, 4217, 5429, 6419, 7190, 6922, 5463, 3688, 2367, 1013, -376, -2241, -4302, -4054, -2839, -3015, -4546, -5277, -3400, -2481, -1673, -1226, -1107, -867, -270, -49, -300, -588, -878, -418, 290, 1231, 2920, 4286, 4511, 3698, 2664, 1918, 1403, 1657, 2272, 2319, 1455, 696, 65, -801, -1943, -3295, -4361, -4391, -3349, -1775, -770, -455, -1359, -2635, -3481, -2462, -1428, -673, -843, -878, -387, 259, 894, 1312, 1749, 2182, 2019, 1258, 191, -247, -189, -557, -1584, -3257, -5056, -4913, -3879, -3635, -4011, -4087, -3210, -2103, -1390, -799, -304, 245, 429, 49, 109, 511, 1067, 1677, 2117, 1534, 678, -762, -2845, -2762, -921, 363, 856, 370, -709, -2319, -3831, -3324, -2422, -1905, -1702, -1512, -936, -98, 1261, 2623, 3334, 3342, 2540, 912, -1437, -3646, -3860, -2151, -649, -160, -769, -1511, -1694]
12810a694M54j66K64K24m0j55l79m43J1K10M94J45b47A050O23k25o93B7e49m09
12790i58j007j151o0a202A262J989J709M28J59r3l01q39j368j196q11C35L74L15
12772A024M96N02J41l12p63@a760j896j296Q3R73J313f97A854K080K180J363L93
12754G870l08j154k410A142a662j239J179Q24l2l99l03N30d94K16m86l47p24m78
12736b313p29j106j004k14J001J009l52q36n85J160a755A43J132R13J19l78I58
12718d15p22M45D91J250J024O18j059g64k478O85CK321P51k48A265g35j883j667
12700d285j7L69R15a473E59J854R00l4j524a117j280G43K309L81j576a568c90
12682C427K923J057p50k459A261a069j127n37M00B66K915K513K269L51j691l189
$$ y = [-1694, -1240, -1406, -1142, -918, -958, -1113, -1492, -1935, -1924, -1714, -1220, -1075, -247, 1050, 1673, 1448, 755, 27, -549, -958, -1965, -3116, -3176, -1202, 1262, 3251, 4960, 5388, 5547, 5454, 5153, 4314, 2946, 1750, 939, 335, 709, 1024, 1520, 2022, 2163, 1851, 1088, 0, -1760, -3656, -4952, -4869, -3896, -2583, -697, 1854, 3934, 6114, 7477, 7870, 7562, 6408, 3998, 1142, -1662, -2901, -1722, -898, -930, -1329, -1632, -1102, -494, -278, -764, -1111, -1835, -2313, -3042, -4148, -5152, -5366, -4365, -3356, -3708, -4544, -5129, -3969, -1755, 143, 1275, 2188, 2307, 1929, 958, -415, -1137, -692, 491, 1741, 2765, 3383, 2324, -764, -3242, -2557, 3, 2324, 3075, 2827, 1265, -735, -2618, -4285, -4302, -3933, -3018, -1473, 559, 2413, 3313, 3279, 1755, -1117, -2397, 743, 3052, 3433, 1857, -1568, -390, 3427, 6350, 7407, 6657, 4198, 1261, -1069, -2196, -2733, -2333, 266, 3181, 5694, 7963, 8314, 6623, 3434]
12666C434A44b095i70A232J809Q28j51l71m98n44l37p1n66A01a921k644J628D34
12647B755J061O04P2l26j03o57r77j107B44i66j912k78J116O90K26R7J86L73F25
12627A792P86J060J51q72j169p85C08A50J49K01E2J08Ne26o73j462j378J160f82
12607A375J444O38p62j265A95b85l07l09L62aC60J17J94M35L39m9m76a71j022
12588a193j300l30m5j09n01m54N29K89R90h25E73R63m9n80B32D9R2l6c9A25L91
12567E16n3c6j163p29m40o02j49P81L32O20N40c43j0k03m72k38L03c27B01P2a03
12545f20J7K93C07ri75j485N74P66M2m31j562a334A119J845P29n71j329D6a275
12525a664N03e26a61O1n07j428j567r20M93L27QN41J444D3Q52o2m01i2j55j28
$$ y = [3434, 144, -2095, -970, 1232, 3041, 3869, 3718, 3347, 2849, 2305, 1968, 1897, 1331, 101, -1921, -4565, -2937, 434, 2755, 3816, 4420, 4492, 4166, 4063, 3406, 2429, 1322, 244, -966, -2878, -3156, -2040, -1350, -1124, -1027, -841, -468, 625, 1792, 2578, 3638, 3789, 2917, 1748, 963, 308, 150, 299, 500, 52, 160, 165, -526, -1199, -2661, -4039, -2879, -682, 1375, 2819, 3457, 2695, 1430, 195, -285, -592, -901, -539, -1, 360, 477, 671, 1106, 1445, 1396, 920, -171, -1193, -2493, -2823, -2868, -2977, -3478, -3932, -3403, -3114, -2124, -825, 573, 1536, 1487, 907, 232, 49, 141, 105, -39, 125, 516, 463, -36, -1199, -1928, -2368, -2970, -3119, -2338, -2006, -1386, -846, -343, -353, -556, -1028, -1266, -963, -327, 201, 273, -103, -620, -603, -310, 307, 298, -975, -2460, -1886, -1120, -1078, -1509, -3071, -1334, 1119, 2964, 3693, 3122, 1793, 46, -1275, -1664, -1161, -526, -161, -100, -607, -2035, -3602, -4522, -4029, -3702, -3694, -3153, -1709, 43, 895, 833, 432, -92, -247, -375]
12505c75j87j83q36p00p75j98M8N32N50Q95M02L30k35l74J02n49o21l86o53R9
12485c114J3J99J43J91m79O25J172A052K038J773k8j969Ib727a085A200L65D69
12466b192k806M34J020P8j009o22O82J714c19A991K185J215j75r18j299q78p94
12449A327H9a967j277K13J167@A602Q08K66Q2J183J389L61q13j560r35J149J875
12431E407B360K606P61m48k163D32b206j777J777g0I97L93Q8E77c82o96j79N35
12413g22B32J066J012R88O02Q28P17M64J44o94j848I07b103k060K33J468J155
12396a307e68l22K24K75l27r50j038n44N48i87C95P41r2m81c25p60J4L3J12K57
12376f69D33J161M26l62o02k09J058J280O09j03j217I22C6a44D70rg05m34i6A722
$$ y = [-375, -562, -745, -1581, -2281, -3056, -3254, -3206, -2674, -2124, -1229, -827, -497, -732, -1106, -1004, -1553, -2174, -2560, -3213, -3114, -3101, -2902, -2759, -2568, -3047, -2422, -1250, 1052, 3090, 4863, 4835, 2866, 9, -2727, -1085, 1200, 1565, 469, -2192, -4998, -4564, -3544, -3466, -4475, -5097, -4415, -2701, -319, 1991, 4176, 5391, 5216, 4298, 2999, 2121, 1327, 89, -1967, -3244, -3031, -1864, 0, 1602, 2410, 2676, 2758, 3941, 5330, 5691, 4878, 3318, 2383, 3532, 5407, 2360, 4966, 5727, 5279, 3116, 432, -2206, -3983, -2206, -70, 997, 1390, 1478, 577, -382, -1078, -1257, -722, 232, 1298, 2310, 3298, 3900, 4728, 5445, 5909, 6053, 5359, 3511, 907, -2103, -4163, -3930, -2462, -1307, -568, -890, -666, -391, -718, -1668, -2706, -3250, -2702, -987, 395, 1136, 1044, 563, -325, -1085, -1071, -1038, -926, -669, 433, 1594, 2020, 1658, 1056, 847, 1905, 3185, 3794, 3691, 2474, 922, 36, -144, 470, 461, -705, -1139, -96, 1722]
12355C040K29o31n32L4M90N8Q8m13r71E67c43o77J27F5R90M76l39B26a071r98
12335b069r5j78L25M17N47M93B81J065J246R53N36J93l67p76j494C4a894j626
12317c520O81R45k3m46j531m20J216J501d88L1q89k195r53K233D4K030P50M30
12299C254l29p32I71c48j221j379r49p03K18J057a520E06K013J318J40j014G30
12281b037j485e21B088J343k5p31j129I9a474l31d80B65i8j413j460r25k17O00
12263c513L60P8K03O35M44O11k19o03k26M40O52d14E27P50M27l58B31b59D14J131
12243A545Q32k70F86f83j416N24c12M0o73r27M42N79p3p66q59k95P63h18b99k86
12223e85o68q96q58j234j580P77J464J280g42I78J134L18m10E34a717j492J161
$$ y = [3040, 3269, 2638, 2106, 2140, 2630, 2688, 2776, 2363, 1392, 567, -343, -1020, -893, 65, 1055, 1531, 1192, 226, -1071, -2069, -2164, -2342, -2017, -1600, -1053, -560, 281, 1346, 2592, 3545, 4081, 4274, 3907, 3131, 1637, 34, -1894, -3520, -2839, -1894, -1917, -2363, -3894, -4314, -3098, -1597, -488, -457, -1346, -3541, -4494, -2261, 44, 2074, 2824, 3254, 2925, 2193, 971, -348, -1569, -2948, -3897, -4600, -4382, -3325, -1520, 506, 2519, 3837, 3977, 2963, 730, -2037, -3522, -521, 2088, 3431, 3406, 2675, 1546, 99, -1474, -1805, -480, 265, -98, -1511, -2971, -3896, -4113, -3513, -3153, -3075, -2872, -2237, -1793, -1182, -1401, -2004, -2230, -1790, -1138, -414, 527, 1277, 1704, 1346, 231, -259, 414, 1545, 2377, 2107, 686, -683, -2099, -1575, -312, -272, -945, -1872, -1430, -851, -924, -1690, -2549, -2844, -2081, -818, -299, -585, -1253, -2149, -3007, -4241, -5821, -5044, -3580, -2300, -742, 978, 2112, 2430, 2020, 534, -1717, -3209, -2048]
12206b048K00o21j408J535B7K070J739O79k56j237A505g36k111q42O24P44N57
12189a764N01K55b63B94K74M4A69a240j099B03M531L580K657P55j417j772k886
12172E651A870b635J84i18d12l5o54j230j170p75r21k68N59P27P43J099Q03K67
12154a267l35o66p30L49P40N73J40K06J69J34M9R8p6L0a56G23J218R11L97J3o89
12133B573q48n38m05B44a032j423j179p38N08J315J023J37J18R3j028j135j0J504
12115a847O28r74k186m96a041B019J347m63j294J252K336N178N081L022l18k717
12099A5443n948C184b558q75g81D85A24a041n03O16j16o96j125r33M99Q30k8o43
12081c140j054n55P73L39N50J172c97H88J530J552J78r98j349C80f08B73K284
$$ y = [-2048, -1848, -2469, -3877, -2342, 27, 2097, 3836, 4515, 4259, 3022, 1505, -736, -2847, -3689, -3065, -2321, -1764, -1263, -1008, -263, 294, 568, 612, 169, -1240, -2339, 203, 4734, 8314, 10971, 11726, 10309, 8537, 5651, 1870, -2635, -2451, -918, -412, -447, -1101, -2331, -3501, -4276, -5197, -5465, -4906, -4179, -3436, -2337, -1534, -1267, -1602, -2268, -2998, -2649, -1909, -1336, -1196, -990, -821, -687, -638, -540, -616, -586, -156, 723, 1941, 2852, 3249, 3262, 2573, 1725, 1187, 782, 244, -1032, -2455, -3634, -4372, -3864, -2549, -1526, -1389, -1271, -1178, -2206, -3341, -3351, -1847, -1219, -2193, -4379, -4875, -1041, 2019, 3366, 2903, 1609, 2861, 5197, 10375, 15456, 18478, 18160, 15443, 9495, 3184, -2558, -3433, -781, 485, 124, -1041, -1544, -928, -1044, -1740, -2865, -3798, -3299, -2469, -2497, -3140, -4194, -4749, -3976, -3637, -3087, -1915, -397, 888, 2418, 3970, 4148, 3150, 1801, 380, -608, 273, 2557]
12064B557N52c7k318A1887J8783K0471J7976J0790K170p265j4301j8118j8155
12051B4238I116h79k311Q93j580J317d24G82J59A44h22m56jK23B6J114J193K77
12033B610o45H83e17j889j121m13J390c34A099K94n27e82k026k442R05a629A451
12015D492K512J083q71k150B233a78j440k79l48r54r96O46Q38L47m02j555n00
11998d821J685P58J58o97q20M78a376A056K426K116M86j144k128B7b411j288J762
11981a937A997O074O908N497N401K472j153m262o926p581B161A91K98b37j856
11966b093q47g20G39M21L79O21Q13N88P82Q84Q83L77k50j732B164B49a183l85
11948a568L83P4q1m78n89l44q56o96J091J496I09K578J934K70o73j838D74b749
$$ y = [2557, 3109, -37, -2355, 11887, 30670, 51141, 69117, 79907, 82077, 74812, 60511, 42393, 24238, 9116, -879, -3190, -2297, -3877, -2560, -424, 782, 941, 144, -822, -1278, -1279, -1056, 26, 1140, 2333, 2610, 1965, 883, -517, -2406, -3527, -3940, -2550, -334, 1099, 1393, 866, -582, -2608, -5050, -4145, -1629, 1451, 4492, 7004, 8087, 7216, 5066, 2233, -178, -1618, -1897, -2245, -3199, -4195, -3549, -2711, -2364, -2766, -4321, -4821, -3136, -2378, -2220, -2917, -3737, -3259, -1376, 1056, 3482, 5598, 6084, 4940, 2812, 27, -2411, -3699, -1937, 1997, 8071, 14979, 20476, 25877, 28349, 27196, 22934, 16008, 8427, 2161, 191, 489, -237, -2093, -2940, -720, 739, 1160, 1539, 2160, 2973, 3561, 4343, 5227, 6110, 6487, 6237, 4505, 2164, 249, -1183, -1568, -1185, -1111, -1192, -1670, -2259, -2603, -3459, -4155, -3064, -1568, 909, 3487, 5421, 5691, 5018, 3180, 474, -2749]
11929b738e19A184R23n00g2k363k265P19R35N00N59L56lM52e86j72r67k70M31
11910a564d10A056J367J262M45q82o69j215n67A59m3n4e6o48j124j890r52a579
11891A264J633M79j315f99p37E56K784K810K236R07K06j076k168k513A868B94
11874a068r50l72n2J05l89p38p75m14j16M89J146J492g37j44j845j730p3a762
11855G00J058J25o29D20B3a59D65J455J433M86p69G95b194k384K3a645F75J015
11837A690O96l21H86f56j586q65J66J133b57A702J512J484J591J488J279P19p41
11820I034k297B539b448l503K966J423K71M9N71b01D6c8m94k45L01P9j023j643
11802c063J049A669M834L061r4o24L204R692J0285P435J790m057q115j1519F014
$$ y = [-2738, -519, 1184, 2107, 1607, -72, -2435, -4700, -3981, -3046, -2546, -1987, -1631, -1634, -1182, -586, -758, -1725, -1995, -1564, -410, 1056, 2423, 3685, 4130, 3248, 2579, 1364, 797, 159, 116, 62, -56, -704, -1828, -3718, -4670, -1579, 1264, 2897, 3376, 2061, -699, -1436, 556, 3340, 6150, 8386, 9293, 9499, 8423, 6255, 3742, 1868, 294, -1068, -2018, -2390, -2442, -2337, -2726, -3464, -4239, -4653, -4769, -4280, -3134, -1642, -737, -881, -2726, -4456, -4529, -1762, 700, 1758, 1883, 1254, 420, 23, -159, 465, 1920, 3353, 3839, 3070, 795, -2194, -4578, -4555, -1645, 675, 1690, 2386, 2065, 886, -656, -2242, -3107, -2941, -1808, -257, 1702, 3214, 4698, 6289, 7777, 9056, 9775, 9034, 6737, 2539, -2448, -5951, -2985, -1562, -1291, -1242, -671, -201, 46, -38, -532, -777, -476, -397, -1420, -3063, -2014, 1669, 6503, 9564, 9470, 8846, 12050, 21742, 32027, 39462, 41252, 37195, 29080, 17561, 6014]
11786c561n13a445A247J328K76m80H36f86c36B236K231J478q54B425a547j356
11770b903g29I07Q31L54M1J98Q47J146R72m26j830f99m222a554G86O31N0D53e66
11750b464j273p97l79p11J501J174J260M13L70l93j351j508j484M62J428J304
11734b448J042J22l74p50p03n94N37J346e85B86Q45N42N13O52J407J535M86K11
11716F477n61j240j294j341r64m21J75N34P22N53R3k30q09o70C0a300j607j046
11698c953R14J145i13c99m96q71l77O35f53A7a38p95j165l51M63Q25K90q0j62
11679a113k64K50M60J23a37G95J169J038K02J81n38p89I90C50F7J90J60K43a24
11659a177j209r52n55K38Q19N19R53B19K107J049l6j228E91d46q42q85k57M88
$$ y = [-3561, -4074, -1445, 1247, 2575, 2851, 2371, 836, -686, -336, 2236, 4467, 5945, 5091, 2425, -1547, -2903, -729, 907, 1738, 2092, 2133, 2331, 3178, 4324, 5296, 4870, 3040, -699, -4921, -1554, 786, 1417, 1467, 453, -566, -2464, -3737, -4534, -4913, -5624, -4123, -2949, -1689, -1276, -906, -1299, -2650, -4158, -5642, -5180, -3752, -2448, -1406, -1284, -1658, -2408, -3111, -3705, -3168, -1822, -585, 286, 1131, 1673, 2186, 2838, 4245, 5780, 6266, 6477, 5916, 4676, 3382, 2041, 1077, 656, 831, 1365, 2087, 2640, 2733, 2503, 1694, 1024, 30, -1300, -2907, -3953, -3039, -1894, -913, -399, -895, -1766, -2143, -1508, -653, 17, -138, -933, -2098, -2449, -1986, -1161, -871, -951, -1113, -1377, -1127, -667, -544, -137, 795, 1964, 3002, 3204, 3385, 2847, 2058, 990, 350, 67, 257, 417, 660, -124, -1177, -2386, -3338, -3893, -3655, -2836, -2317, -1364, 219, 2326, 3375, 3339, 2111, 591, -446, -1288, -2173, -2430, -1942]
11641a942B65J801Q57l61A226g84j955J89J138C7Q91M35m90a88o78c22A465K249
11623C714J351O09j50r54j199j536F28G1h85o03m09Q6l78k3J78k45m96o72N39
11604b908J227L96K51N6o6l85l89p6Q6M18M96c85B15R54J5m56d4j790k538q6g78
11582C643L313J225j084k968A609a00j414r74M99i0G27N2g47k667l052M90b402
11564F94J314H79a585j587k217P96K277k65M6j262o26J174j45l85P15J445D40
11546B439N40o19D04a729j906j564M14k09q66K07J015K120A9K335P56q31I45d73
11527b396j278a522A512L059J885K919r70l229A007b122n20J252D003L844J422
11512I269j005k334k771F29a592r64M90P45c95F23N94L84j84o66A04i04l22n0
$$ y = [-1942, 265, 2066, 2923, 2562, 1226, -784, -2739, -2550, -1412, 37, 928, 1363, 873, -188, -866, -322, 1465, 3714, 5065, 5674, 5524, 4570, 3371, 1835, 628, 71, -885, -1488, -1897, -1811, -2189, -2212, -2034, -2279, -2775, -3447, -2908, -1681, -1285, -1034, -978, -1044, -1429, -1818, -1894, -1808, -1390, -894, -385, 215, 1169, 1184, 728, -44, -1834, -4372, -4458, -778, 3643, 6956, 8181, 7097, 4129, 1609, -100, -1514, -2488, -1989, -90, 727, 779, -747, -3414, -6466, -5976, -2402, 694, 2008, 879, -1585, -3172, -5389, -4593, -2316, -2581, -2535, -3797, -4423, -3249, -3394, -3779, -3064, -1619, 440, 2439, 2979, 2360, 404, -1729, -3635, -5199, -4785, -4994, -5860, -5653, -4638, -2518, 19, 2354, 3110, 2279, 945, -473, -2396, -3674, -1522, 1512, 4571, 6456, 9375, 8405, 5176, 1007, -2122, -2642, -1390, 4003, 7847, 9269, 8264, 5930, 3159, 629, -1592, -2556, -2066, -1321, -395, 623, 1217, 1601, 1417, 751, 104, -904, -1226, -1276]
11494a276N56E91Q59L55k46B77a782k034k15J529d65A326J352N57n2k06l62j36
11476B479n80l49l13m77l10m5d13q36p57m78n21l00o49l53J1P33J615c70D59Q
11456D67d7j181j219n16j97n01l18l4J354a080D51M64J29l77c29j472j164o29
11438c594M39J017O05m67j281j090R80R88R22L07K16L67q3J70B41L23K07C69a315
11418c676k635J597b092g10L36a59P6J4C87Q16P53J121Q26P32n08j682B42b450
11399d649j159k74J272P01O20M14J51J0L22O35h4C144L146K668R72k79j386k709
11381E556B085i47j784P54R70d35H5L76A07a275j923k381K90R19Q77J743G72K630
11363C402J901J434m51j425k365d88j435m99e67D91Q72J046J957K067L86q51k200
$$ y = [-1276, -720, 591, 1450, 1805, 1559, 277, -1782, -3816, -4031, -2502, -465, 1326, 2678, 3235, 3183, 2977, 2615, 2479, 1899, 1550, 1237, 760, 450, 405, -413, -1249, -2006, -2484, -3005, -3305, -3954, -4307, -4296, -3563, -1948, -370, 459, 467, -47, -1228, -2447, -2963, -3160, -3661, -3979, -4013, -2659, -1080, 451, 915, 1044, 667, -329, -1801, -2965, -3594, -3155, -2138, -1533, -2000, -3281, -4371, -3391, -2403, -1481, -1174, -958, -591, -674, -504, 241, 564, 771, 369, -1315, -3676, -6311, -4714, -2092, -710, -374, -159, -83, -69, 387, 1203, 1956, 3077, 3903, 4635, 4127, 2445, 242, -2450, -4649, -5808, -6082, -4810, -4109, -3489, -3075, -2924, -2914, -2592, -1957, -84, 3144, 6290, 8958, 9930, 9651, 8265, 5556, 2085, -947, -2731, -1977, -1007, -435, 85, 461, 107, -1275, -3198, -5579, -5289, -4370, -3493, -1750, 772, 3402, 5303, 6737, 6286, 4861, 2496, -488, -1923, -2422, -567, 491, 1363, 2409, 4366, 6433, 6819, 5968, 3768]
11346C768G26a565O64A087J427M3I54B46K641M155L255J875O24m85j552k617k932
11329E210B601D80a230j074o34L44J296F34J938J278J14m72r55G24a497j843K21
11312c119M33r9N56J099i3G2h36j125i25I74J473R0q47F59K17J438J416N93n26
11293C797j536a36j996k04f45A397J289P38O67N44J4j131j460H39C77J70e50j782
11275b332j173J017e08F29j19f97j273j69P12b33A35a07L1j8B79J32d25j788k583
11256d796j366J581J760J29j463R21a553L13j438k189p07m75K294a548N65o16
11240a599p12J027A32J36g67j484Q35G3oa979k624Q52E01L172J735j760a827k882
11222d709F77K331j145a26A91c80l316J583B708k45c495F262J2776N564n618H156
$$ y = [3768, 726, -1565, -901, 1087, 2514, 2557, 954, 246, 2887, 7042, 10297, 12172, 12796, 12311, 10759, 8142, 5210, 2601, 480, -1230, -2304, -2938, -2594, -1298, 634, 2572, 3850, 3964, 3492, 2537, 724, -1497, -3340, -3119, -2686, -2785, -2229, -1130, -93, 72, -836, -1961, -925, 974, 2447, 2537, 1690, 659, 876, 2314, 3730, 4323, 3797, 2261, -136, -2132, -2336, -645, 1397, 2686, 3424, 4091, 4635, 4649, 3518, 2058, 839, 377, 547, -550, -2332, -3505, -2488, -508, 629, 510, -697, -1970, -2139, -1427, -233, 135, -107, -76, -94, 279, 411, -425, -2213, -4796, -6162, -4581, -2821, -2692, -4155, -3234, -1553, -1240, -2678, -4867, -5574, -6049, -3755, -1548, -983, -1599, -2311, -1284, 132, 268, -767, -2251, -1416, 73, 67, -1979, -4603, -3751, 501, 3673, 5408, 3648, -1827, -4709, 677, 3008, 1863, -126, 191, -380, -3696, -2113, 2708, 2463, -3495, 6262, 19038, 24602, 18984, 8156]
11205A5732Q414q037K913L6487K7156r252j957J52074K42951K77587K55735J77506
11193A177309N7389p7657j93351k64669k77817A86338E8812K5637M936l1981A9247
11181A4959O087p531n327P486J525q405c000C659O728j385B461b456i55j941k675
11166e571f80C185Q02q48j76L75o11G70a389j513M11G24L233J957q33A342a014
11148A124M97a8l492L21a011A116Q12k85F57h18j289p69j413q73K265B1K363J839
11130D223K025N48p39k126E69c216k11a250i9d1o69j021j062m83K61J88l7n2j93
11111c109P83J081O1o34j136J90J222N83j96j025j225q09P01J060J056K49k66
11094a414o93N1R26b91G4K4a41I3M0L16j01b54r58k230q86K145E01K697L019J988
$$ y = [15732, 24146, 16109, 19022, 55509, 82665, 73413, 71456, 223530, 466481, 744068, 999803, 1177309, 1234698, 1157041, 963690, 699021, 421204, 186338, 58812, 84449, 89385, 57404, 19247, 14959, 21046, 13515, 8188, 15674, 17199, 8794, -3000, 3659, 10387, 9002, 2461, -2456, -955, -2896, -5571, -680, 3185, 3987, 3139, 2963, 3338, 2727, 770, -1389, -2902, -2491, 724, 3957, 5914, 5081, 1342, -1014, 1124, 1621, -18, -3510, -3189, -1011, 1116, 1928, 1643, 657, -818, -2107, -2876, -4289, -5162, -2897, 21, 2384, 4223, 6248, 6796, 6057, 3931, 569, -3216, -3427, -1250, -99, -41, -710, -1731, -2793, -3276, -3015, -2827, -2864, -2916, -3109, -2326, -1245, -1184, -1818, -2954, -2764, -1542, -959, -1155, -2180, -3405, -4214, -3513, -2453, -1397, -1148, -1414, -2107, -2056, -1130, -291, 74, 98, -141, 93, 133, 449, 348, -254, -1212, -3442, -4328, -2183, 501, 3198, 6217, 8205]
11074H205P78j259k864A269b814l596J15K062J182O32J85K29R62C87K356K064
11058D807K004J237J14n89k136k391A140b22l84k81K91K27n62j207j202n79J347
11041b572a175b91o21j659k310j077J774J783N58p00j812k92J994J124f42e6j84
11024b40m58j453k204k068L76J481R18R56J317b04C92b81j516J91a98I30L68j65
11006A133j33l88B72i75j931j095N12Q33P03P77F94N05j94b4j221m10M41M74J43
10987e97j99o79j99l59r20k064M66a154A852K967K029J292P00o27j623k589A399
10969B7J473K921K201R92p21k223A795b72A329K554J442m13j655G61h20L69B82
10951a27j681k171M17J728Q20j84q43j030j45M39L67M14P18d47E5M20h2k071j754
$$ y = [8205, 8983, 7724, 4860, 1269, -2814, -6410, -6295, -4233, -3051, -2419, -2234, -2005, -1043, 387, 2743, 4807, 6811, 8048, 8162, 7573, 5437, 3046, 1140, -222, -606, -887, -596, -369, -931, -2138, -3340, -3919, -2572, -1175, -291, -912, -2571, -4881, -5958, -4184, -2401, -1843, -2543, -4355, -4647, -2653, -1529, -642, -56, -240, -698, -2151, -4355, -6423, -6047, -4566, -3648, -2692, -1375, -204, 392, -281, -1797, -1606, -198, 930, 1298, 1133, 1000, 612, 272, -975, -2906, -4001, -3489, -2656, -1953, -1176, 694, 1199, 1005, -24, -1245, -1655, -1214, -740, -597, -796, -1475, -1674, -2033, -2953, -5017, -4551, -1154, 1852, 4819, 6848, 8140, 8840, 8213, 6590, 4001, 1399, 27, 1500, 4421, 6622, 7614, 6893, 4670, 1795, -272, 1329, 3883, 5325, 4912, 3257, 761, -820, -451, 282, -127, -1808, -3979, -3562, -1834, -1014, -1198, -2041, -3071, -3216, -2777, -2410, -1996, -1278, -447, 55, 475, -82, -2153, -3907]
10932c907k32J232a224C64J306P64QL07Q47J042Q37K81r5j262B153i44k328j00
10914c372J154g77D48J195N33r44a041k273M06N94k97j805J230B044N527M370
10898A1941K179j672m484A180c776B75K992J332j1r71A729a347k116j732q49P53
10882e291b518A63K488j088C4a723j760p96k43N73J348J058e29l97j372j187o08
10865d093l81M85O67a344A221J698R39Q0n36l19l36k91j81l86D08a732j049R92
10847a789P09q24j792j936J084J528r9n51P2P89K82Q99c14A537J160R7A23b543
10828a877A571M882L211l15k465C332h94m183a760C60qf41D55L116K737R59q16
10811F451k529D88a959o26j54r45j669K139O30k95l11J453D24J887J271O72q90
$$ y = [-3907, -4139, -2907, -1224, 364, 1670, 2434, 2442, 2749, 3596, 4638, 5475, 5756, 5661, 4399, 2153, -944, -3272, -3372, -2218, -777, 448, 1643, 2176, 1232, -1041, -3314, -2908, -2314, -2611, -4416, -3186, 2044, 7571, 11941, 14120, 12448, 7964, 1180, -3776, 275, 3267, 4599, 4588, 3617, 1729, -1347, -3463, -5195, -6044, -5291, -2518, 163, 2651, 1563, 34, -1723, -3483, -4279, -4522, -3949, -2601, -1543, -529, -926, -2298, -3485, -4093, -4474, -3989, -3322, -1344, 1221, 2919, 3858, 3938, 3402, 3083, 2747, 2456, 2275, 1889, 408, -1732, -2781, -1789, -1080, -1904, -3696, -5632, -4548, -3020, -3119, -3670, -3598, -2809, -2527, -1628, -314, 1537, 2697, 2794, 123, -2543, -1877, 1571, 6453, 9664, 9349, 6884, 3332, -894, -5077, -1760, 360, 352, -641, 455, 3571, 6308, 7267, 6451, 3922, 488, -1959, -2585, -2739, -3684, -5353, -3214, -2584, -2879, -3190, -1737, 424, 2311, 3582, 4254, 3364]
10794C364A607d47k792q36a536A632L400L084N18k434A657c215k363b574i41k50
10778a191k398j625J781J680n54n24J036d25F78A77h70k21j57j060j825j974K667
10761c440J139l68l25J447A274J791J12O5M62NA851B16J728L015J564j008A878
10743b749k146B345P837N929N846L811K072m094p835p14P989R758N753M235J1462
10728E4394J7653K0468K9544N4656Q5375J08130J15978J08999Q9099N8631K705
10717G45632m1620p6527j05570j21682j20557r9736n9940k0648q435j3850j7714
10706E9353j6513j3416j0312m367L70J742n55j901r67r74k277k736J36J384n98
10691H369l786e57l792J052J551L00P5k21K86b51A822K310K187J46j681A784a729
$$ y = [3364, 1607, -447, -3239, -4075, -1536, 1632, 5032, 8116, 8634, 6200, 1657, -3215, -5578, -2574, -941, -1191, -3589, -5214, -3433, -1753, -2307, -2831, -1795, -425, 678, 177, -870, -1091, -1248, -2308, -4133, -6107, -3440, -2301, -2669, -2994, -1547, 1274, 3065, 3177, 3242, 3704, 3709, 1851, 216, 1944, 4959, 6523, 5515, 1878, -2749, -4895, 2345, 10182, 16111, 21957, 25768, 27840, 23746, 15911, 15197, 23186, 32944, 38697, 42932, 54394, 72047, 92515, 122059, 176715, 262090, 370220, 486198, 595197, 684296, 742927, 745632, 704012, 627485, 521915, 400233, 279676, 179940, 120000, 99352, 90917, 77067, 59353, 42840, 29424, 19112, 14745, 15115, 16857, 16302, 14401, 13434, 12460, 10183, 7447, 7583, 8967, 8369, 4583, -557, -4349, -3297, -1746, -1446, -1371, -1592, -1306, -251, 1822, 4132, 6319, 6465, 4784, 1784, -1729]
10673b744e06H59J82n04a047k100m25E75L132J699q71A513b588j434h18E83D7
10655a833j722Q62J325K96k15f07C61N62L46K33K64j10p09k45J540J205k3j262
10637B162a279k338j360J672a102B05L99A84i34j581j869J534a222D89J096P68
10621B353m22G61i43j162m37m32m10J635C10J009M56l90n16l62e5m09n62o00L75
10602a251N76eH74R96P56N25K44o62q11p40k05k41e45k092q73M75J120M42p5j15
10582a663q41n72j7J89r7j09k36L11k23j67J21J230g04K55a51I9d4o61j97n1r2
10561a045o30l63N62d0B096J619Q92o61j715B86a271j192p85k40m76n04n69K52
10543d785Q52Q23J189K87NJ93r5J73N6M11L28A67J243J422J028N57q58j298C09
$$ y = [-2744, -506, 859, 1041, 537, -1047, -3147, -3572, 575, 3707, 5406, 4535, 1513, -2588, -4022, -818, 583, 47, -1833, -3555, -2693, -1368, -1072, -1287, -607, 361, 923, 1269, 1502, 1766, 1656, 947, 702, 2242, 3447, 3424, 2162, -1279, -3617, -4977, -3305, -1102, 205, 604, 184, -934, -2515, -4384, -2850, -1222, 489, 1585, 2353, 1931, 761, -943, -2105, -2542, -2974, -3384, -1749, 310, 1319, 1775, 1385, 869, 507, -55, -464, -1026, -1626, -1251, -675, -5, 874, 1870, 2626, 3151, 3395, 2733, 1922, 1182, 977, 736, -545, -2637, -3510, -3035, -1915, -1473, -1548, -1663, -2504, -3076, -3093, -2904, -3001, -3110, -3346, -3035, -3258, -3425, -3304, -2074, -704, -449, -151, 99, -44, -705, -902, -953, -1045, -1675, -2038, -1476, -40, 2096, 3715, 4607, 3946, 2231, 286, -1271, -2463, -3248, -3488, -3964, -4468, -5037, -4785, -3933, -3110, -1921, -1634, -1629, -1436, -1531, -1358, -1302, -891, -563, 167, 1410, 2832, 3860, 4417, 3559, 2261, 309]
10523a042p55j65m88j08o7J80P82K27l76k73k45p45q12O69N43j10q79j585k51
10504e500P84J640d26A003J614J623J748O80j081j447A398a548k231n80j10O32
10488c837a095A969K682J883J291J54r46j901k348E77b193k936j868J766K329
10473b902h43A507K064J841J079m36j003k523D0a813h82A631J602J63j391A17
10456a335l86k48n54q86j372l95K71O15N91N0k25q9L60r3K75J167g41D51L70l85
10436D36c18r98j23h7A649J755R68p42A432a713j649I8L331K817J962N30j180
10419G558k679A991h62k230j214lR46R48P59M21n0O16K94k58k80j108r91J203
10401a809g93j507j237J516F634O238J294m728H22J349K6791L2125K9446K1334
$$ y = [-1042, -1797, -1962, -2450, -2558, -2625, -2445, -1663, -1436, -1812, -2085, -2330, -3075, -3887, -3218, -2675, -2785, -3664, -5249, -5500, -4716, -3076, -426, 1003, 2617, 4240, 5988, 6668, 5587, 4140, 1398, -1548, -3779, -4359, -4469, -3837, -1095, 1969, 4651, 6534, 7825, 7979, 7033, 5132, 2784, 577, -2193, -5129, -6997, -5231, -2902, -843, 1507, 3571, 5412, 6491, 6055, 5052, 2529, 40, -1813, -882, 1631, 3233, 3396, 2005, 117, -1335, -1721, -1969, -2523, -3409, -4781, -5176, -4905, -4290, -3699, -3649, -3874, -3963, -3603, -3696, -3421, -2254, -741, 451, 821, 436, -318, -1316, -1439, -87, 1649, 3404, 4372, 3630, 1432, -1713, -3362, 98, 3429, 6246, 8208, 8738, 7558, 4879, 1991, -862, -3092, -4306, -4309, -3363, -2415, -1656, -1235, -1285, -669, -375, -633, -913, -2021, -3012, -1809, -793, -2300, -3537, -2021, 6634, 12872, 14166, 9438, 822, 2171, 28962, 61087, 90533, 111867]
10387A11867O080j0259k2488k9521B4779d04l882D884L765p37B679b915r09J468
10373b356K13k53j287j012b273i47A075K183Q54O44r11m24J095J923J111k0p88
10356F742j376p71n06q29q39I51i84j382O23G7J368J390J346R04l24j380A655
10338f17k045j611p30l63M98J097J771b53I40P09j14A34a900l85N80O7q29o65
10320c132M00R00g83j06p06j489p68a500D47L2c104k631a696B111J116D08c153
10302g495C66J2001R729R02J4814O8444J21112J60276J80145J69294J29251O2825
10290I29159m7779j19426j64534j78622j62388j25323E3718B4755n399o593m214
10279H549k055A261b518l782b414L98Q82C971M262k64l807A35a691n71k48k123
$$ y = [111867, 117947, 107688, 85200, 55679, 24779, -404, -4286, 4884, 8649, 7912, 2679, -2915, -3824, -2356, -2143, -2396, -3683, -4695, -2273, -947, 1075, 3258, 4112, 4756, 3845, 3421, 4516, 6439, 7550, 7530, 6742, 5366, 4595, 4089, 3260, 2421, 951, -984, -2366, -1743, 77, 1445, 2835, 4181, 5085, 4761, 3381, 1655, -617, -2662, -4273, -5003, -5366, -4868, -3771, -2000, -253, 940, 1649, 1535, 134, -1900, -2285, -1705, -1638, -2467, -3132, -2732, -1832, -783, -889, -1595, -3084, -3852, -1500, 447, 479, -3104, -5735, -1696, 2111, 3227, 408, -3153, -7495, 366, 12367, 22096, 22998, 37812, 106256, 227368, 387644, 567789, 737083, 866334, 929159, 881380, 761954, 597420, 418798, 256410, 131087, 53718, 24755, 19356, 12763, 8549, 6494, 1261, -2518, -6300, -2414, -2016, -1134, 3971, 8233, 7969, 4162, 135, -1691, -2262, -2510, -4633]
10263d633J692K78k91n2a202F54J46J44J041J361O54j263H75g65k99c17C87a824
10244b560J033A895N809M989P377O721k144J963m213K122J3440J5156J6631J5107
10230H4853J1934J1442P192p672o521p471j3291j9883k5043A0098a519H110L818
10217A1928j813D163b78r53c25r32p45o81N80M16R5f06E42J313J155N59L87q90
10199C066q63q24a082k327h98A934K434J905J899J730K588K652K354J169pr32
10183A7726j794l569l939l505B092F27h18n16j49J28M30d35r1qF54K33l15Ii77
10163a248f12G99J086L25q49c5l17q6O7l88n95r63j34J200C97J273L45n78O6J
10143A504m34A27a35c4j51l31r4a9D81M77m63b34o93l94L29d40B75j1h39k014
$$ y = [-4633, -2941, -2663, -2954, -3006, -1202, 654, 800, 944, 1985, 3346, 4000, 2737, 875, -765, -1064, -317, 387, -1824, -2560, -1527, 1895, 7704, 12693, 20070, 26791, 24647, 26610, 22397, 24519, 37959, 53115, 69746, 84853, 96787, 108229, 115421, 107749, 101228, 93757, 80466, 60583, 35540, 10098, -1519, 8110, 11928, 10115, 4163, -278, -1231, -325, -1257, -2002, -2683, -2103, -1687, -1592, -606, 542, 1855, 3010, 3569, 3956, 3066, 2203, 1379, -1082, -3409, -898, 1934, 4368, 6273, 8172, 9902, 12490, 15142, 17496, 18665, 18658, 17726, 15932, 12363, 8424, 4919, 2092, 627, -818, -1334, -1483, -1355, -925, -435, -526, -534, 654, 887, 572, 9, -977, -1248, -612, 799, 1885, 2210, 1361, -35, -352, -438, -371, -759, -1354, -2317, -2451, -1251, 397, 1670, 2015, 1437, 1503, 1504, 1070, 127, -135, -34, -185, -516, -610, -19, 481, 958, 495, -234, -927, -1321, -992, -440, 275, 264, -839, -2853]
10123b853j400o34N90L32o65n67J749a305b34K6n69l74l03j574r25J233P88m18
10105b350j449j091k26K555Q60m18g66F520J0267J0788R237N061j658n455n554
10090B9206j976J157P667Q851N725j522m983n954l684J340M641J0452J2107Q130
10076G1157n514k3291I825j20M7810N3006M5930L1197M051j9485l1660l7925l6543
10063F6086k9231A5788G618k363j391j777o56L29O76L898L955J903j361l342B918
10047a033k172k75L58M43e22A548K047J173P50J7o96j500p04m95L77l69o3F05
10028a710E01L569J805q48B395a06j979G53L968K755k0k262A702b472l243K92
10012e423J037k41J854d01A774L461K953P38j461j721n53B541G66a358k227M04
$$ y = [-2853, -4253, -4887, -4297, -3965, -4630, -5197, -3448, -1305, -234, -208, -777, -1151, -1454, -3028, -3953, -2720, -1932, -2350, -3799, -4890, -5116, -2561, -1701, -2119, -766, 6520, 16787, 27575, 36812, 41873, 40215, 34760, 29206, 27230, 28387, 36054, 44905, 50630, 49108, 44125, 38171, 34487, 35827, 40468, 50920, 63027, 71157, 65643, 42352, 9825, 9705, 57515, 110521, 156451, 187648, 191699, 172214, 140554, 102629, 66086, 36855, 15788, 7618, 5255, 3864, 2087, 1431, 1760, 2436, 6334, 10289, 12192, 10831, 7489, 2918, -1033, -3205, -3480, -3122, -2679, -522, 1548, 3595, 4768, 5518, 5535, 4839, 3339, 2635, 2140, 2517, 2148, 2085, 605, -1710, 501, 4070, 5875, 5027, 2395, -106, -2085, 753, 4721, 7476, 7456, 5194, 1702, -2472, -5715, -5423, -4386, -4627, -2773, -401, 1774, 5235, 8188, 8926, 7465, 5744, 5191, 2541, 766, -1358, -3585, -3181]
9996c181o78m16j484m824L66K06j526J47M331K734F39R838k319J080Q711J4513
9980C2462J4767J3180Q747K198m969j0559j3838j4725j3218B828b664j199a01
9966A439j23k84m38j87d79j271k142j885K070J802P49K17K21R2J72J38a38n32
9948f70j083q48p06L49P52R67b99A00a18n01j95L71b7j92j263j846p06K007G1
9928A534M24m72A74a142o18M99K17r3j214r78l60P27J239b46A665J093o34E84
9909b183j828l2R72j50p2J233d41J86J6n03L6n0l16n31j111q51j12j87J01R4K80
9888c389l67l39k1Q00J002J084b54C43c68j511j934j559m79p75m8R77a114E017
9869A0711L688J251p05l457m908l070O60K544J355K29k626B587c49k208j374j125
$$ y = [-3181, -3859, -4275, -5759, -10583, -10217, -10011, -11537, -11390, -7059, -4325, 639, 10477, 8158, 9238, 17949, 32462, 47229, 60409, 69156, 71354, 66385, 55826, 41988, 27263, 14045, 2828, -2664, -3863, -101, 1439, 1316, 1032, 594, 407, -479, -1750, -3892, -5777, -3707, -1905, -1156, -939, -718, -626, -454, -316, -138, -670, -1753, -2601, -3307, -2958, -2206, -1239, -299, 100, -118, -619, -814, -443, -27, -219, -1482, -3328, -4034, -2027, 71, 1534, 1958, 1486, 174, -1142, -1760, -1261, -1044, -1137, -2351, -3329, -3689, -2962, -1723, -246, 1665, 2758, 2124, 584, -2183, -4011, -4043, -3071, -3221, -3293, -2060, -441, -255, -239, -742, -706, -756, -1072, -1603, -2714, -3565, -3677, -3864, -3763, -3669, -3389, -3756, -4095, -4116, -3316, -2314, -1230, -254, 343, -368, -1879, -3813, -5372, -5851, -6626, -6674, -5697, -1114, 5017, 10711, 14399, 15650, 14945, 11488, 6580, 3510, 4170, 6714, 8069, 8298, 5672, 2587, -349, -2557, -3931, -5056]
9853e056j58J263J418l24k111p70b332F26J637j33a03p92j060J20E83Q56l43b15
9834F97k92M09J531M93k19F25d65j111j828j282Q83a751a14A325P19n56E27h97
9815b496r06J76J454g53L35m87q34m75p08n94K80a377A67M28j93i33j774m82d36
9795B373j56a954D1J4215J6937J5607J1839M774k717q863j3254j5289A0733C104
9780A414E57a555o33O54L59L75G92J847j69A220b722m821K767a0B428J172J245
9763D845n32F04b021e64C376K365K466J043O54j368j435j788A827b45f8C095K857
9746E952O25o93k666c6k290O8f98L29j163k382k141n54K116D79P278Q276O977
9729B3010M087j45m513q054D633c100I78K680j48j541b52j519L56a47A084J118
$$ y = [-5056, -5214, -3951, -2533, -2857, -4968, -5738, -2332, 626, 2263, 2130, -103, -895, -1955, -1835, 583, 1439, 1096, -215, 697, 405, 814, 2345, 2838, 2619, 625, -465, -1576, -3404, -4686, -3803, -1751, -114, 1325, 2044, 1488, 527, -897, -2496, -3402, -3226, -1772, -753, -418, -905, -1739, -2214, -2922, -3516, -3236, -1377, 167, 595, 402, -933, -2707, -3189, -436, 2373, 2217, -1954, 41, 14256, 31193, 46800, 58639, 63413, 60696, 51833, 38579, 23290, 10733, 3104, 1414, 557, -1555, -2188, -1534, -1175, -800, 792, 2639, 2470, 1220, -2722, -7543, -4776, -10, 2428, 3600, 4845, 4313, 604, -2021, -564, 3376, 5741, 8207, 9250, 9904, 8536, 7101, 5313, 1827, -245, -68, 3095, 5952, 6577, 5884, 3218, -36, -2326, -2258, -698, -369, -1532, -3914, -6055, -6609, -4493, 479, 7757, 16033, 23010, 27097, 26952, 22439, 14385, 4633, -3100, 978, 3658, 3510, 1969, -252, -1771, -1415, -147, 1084, 2202]
9713B202Q84K12q89F41f72j88o21p93q76p88J65J136a226D94J536N79R0n07j020
9694A172d24k055j293O13P39L03m6k3J66K16O75b84A87B9d22n11m04j36L07n07
9674a673o46j175j974J373a668F97J473O15j14p35E63a136j694P46a45F49b02
9656a799j470a542a39H63K09B50F6J140J532M49p05I19a496k202m29J556Q78N00
9638a193e89a12E84O69P33l21D38i1B897L909K985J219o86k358l483A463f40o57
9620a297J78b31H81N31j24l34A51e96l80a92I51Q18Q13J299K102K322P46n64k066
9601F421C105h69m322i13A386O51p15A78a528l16a19A480N55r49a579l834J310
9584d103I35L699J258p73B499a209l193a048A169j45g65k597j196J119J517c35
$$ y = [2202, 3086, 3298, 2409, 641, -672, -860, -1481, -2274, -3150, -3938, -3773, -2637, -1226, 494, 2030, 2609, 2699, 2192, 1172, -424, -2479, -3772, -3159, -2420, -2117, -2163, -2186, -2020, -1804, -1129, -284, 187, 29, -422, -933, -1337, -1473, -1166, -1673, -2319, -3494, -5468, -4095, -1668, 697, 2170, 2785, 2671, 1936, 563, -1136, -2830, -2084, -145, 649, -202, -1799, -3269, -1542, -139, 863, 1072, 250, 66, 1206, 2738, 3187, 2482, 919, -1496, -3698, -4127, -2571, -1693, -1193, -589, -112, 584, 1253, 1986, 1665, 438, -91, 2897, 6806, 9791, 11010, 10324, 7966, 4483, 1463, -640, -1297, -1119, -231, 881, 1412, 1288, 954, 151, -596, -976, -192, 951, 1769, 2582, 3881, 5983, 8305, 9051, 8487, 6421, 3105, -869, -5191, -913, 1386, 2037, 1322, 178, -1528, -1844, -119, 1480, 2035, 1086, -1579, -5413, -4103, 935, 4634, 5892, 5119, 2499, -1209, -4402, -1048, 1169, 1024, -765, -3362, -4558, -3439, -1922, -335]
9567F76J396J152Q01L82n81j089A239e17j875j609j20a531F14J199J65n58f59
9549d234j725b718d63A928K099P33j510F14b058k204a808E46J396Q22M1A145e79
9531a548k939k427J132d54A270d271o997D538J7273J5317J0885M462j1254j3559
9517B7662j1583M6839M4233M4764L6516J3617k106k0459l1162l4159l5452l3275
9505D5435A9175B285j104K493D85c056o08b03B314n6k2Q36J687j253q60p55E16
9487b316l843p98R28o77J957a73B919P29j153a84l587l317J943b52D154K936L503
9470A0593Q822R710L592L177J829N242j821q301q065q610p974A786b097e14B12
9454f56o69j45G22R081J0759J2035R257O988M61o290j1470j3760D631d803a559
$$ y = [676, 2072, 3224, 4025, 4407, 3826, 2737, 1239, -517, -2392, -4001, -4121, -1531, 614, 1813, 1978, 1420, -659, -4234, -5959, -2718, -463, 1928, 4027, 4760, 3250, 614, -2058, -4262, -1808, 546, 1942, 2764, 2805, 1145, -579, -1548, -4487, -6914, -5782, -454, 1270, -4271, -11268, 4538, 21811, 37128, 48013, 52475, 41221, 27662, 16079, 62918, 107151, 151915, 188431, 202048, 199942, 179483, 148321, 114162, 78710, 45435, 19175, 2285, 1181, 3674, 485, -3056, -3664, -203, 2314, 2258, 2236, 3072, 4759, 3506, 2646, 1891, 516, -2316, -6159, -6957, -6029, -6706, -4749, -173, 2919, 3648, 2495, -184, -3771, -7088, -5145, -252, 4154, 7090, 10593, 19415, 29125, 32717, 35894, 37723, 42965, 41144, 32843, 24778, 16168, 8194, 1786, -2097, -514, 212, -656, -1325, -1470, 722, 9803, 20562, 32597, 41854, 48842, 49303, 43013, 31543, 17783, 4631, -4803, -1559]
9438B607J90I76a789l629k548q7J619K743G63M670K384j657D95e359l390M49D782
9420D287c84l905A9Q083O652Q892L0925O6073l424K28761J35305J23850R0575
9407F95711K7697m8877r8617j25826j40071j17225r5123C4235A81a346B306J282
9395C588m11I52a904l607I84K798l05o67n13p3p29f28k015r72n64o67l10L75j35
9376d916R24J012K63j12j95L36J247N75J24l51p20j057j338N23a145b44e4o39
9358f93q33q54r40l52O29P47L99k11k08j13j508R6J545N67j3K7j80m62m32j134
9338c923j023o67%R33J196O56i05A05J040n6A67a245j475q30k07q1L59J141P91
9319a547j98j164m85a189A283J455M86q14A023b14n52k12N9L34K49o27J35I13
$$ y = [2607, 2797, 976, -1789, -5418, -7966, -8053, -6434, -3691, 763, 5433, 7817, 6160, 495, -5359, -8749, -8300, 4782, 4287, -384, -4289, 19, 8102, 14754, 23646, 54571, 120644, 117220, 345981, 481286, 605136, 695711, 723408, 674531, 575914, 450088, 310017, 192792, 97669, 34235, 181, -1346, 2306, 3588, 3177, 952, -1904, -5511, 984, 3782, 3477, 2810, 2297, 2224, 1495, -628, -2643, -3615, -4179, -4846, -5156, -4781, -4916, -3992, -2980, -2717, -2829, -3024, -2688, -1441, -866, -742, -1093, -1813, -2870, -4208, -3685, -1145, -244, -54, -693, -1526, -2380, -3320, -3672, -3043, -2296, -1897, -2108, -2316, -2429, -3937, -3841, -2296, -1729, -1742, -1715, -1895, -2357, -2789, -3923, -4946, -5613, -5613, -4680, -3484, -2828, -905, 105, 1145, 1089, 167, -1245, -2720, -3550, -3757, -3838, -3479, -2338, -1547, -1745, -2909, -3394, -1189, 1283, 2738, 3224, 2410, 1023, -214, -766, -978, -919, -585, -336, -963, -828, 913]
9300B652Q83q52H06b166k781b314e95k55j772l04i04I18J334O50O6J27M26J81
9282C702M19K6m66r77r76o80m00J037J880J138J50p27j005m26R3M04m8q40m81
9263A823l65o24b66j237q4j65PM61N78b01A50J91a42m82j487k778K35K000O57
9244a997j27p00m00j494j206J805a913F37K183J428L39q71A570g64k355j658J74
9227d603M80O78K78K12k13n50N87O08L93Q46k36r18l88m4N98a069a89rm50p70
9207a418j51L16L97m17N40B846G25b221j4850d173a557N69K83n33p78l50l45O43
9189b068l58j026j799O41R36O98m262j570o59Q10J829J347O37R57N90J106P79
9172a412q4L56k01K44e4A282J522J92p11j032Q7Q99P32K5A276a086l378j224K295
$$ y = [2652, 3535, 2683, 806, -2166, -4947, -2314, -595, -850, -2622, -2926, -904, 918, 2252, 2902, 2968, 3095, 3521, 3702, 4121, 4147, 3681, 2704, 1728, 1048, 648, 1685, 3565, 4703, 4853, 4126, 3121, 2695, 2788, 3192, 3144, 2304, 1823, 1458, 834, -266, -1503, -1587, -1752, -1745, -1284, -706, -201, 150, 341, -142, -624, -2111, -4889, -4654, -2654, -1997, -2124, -2824, -3224, -4718, -5924, -4119, -1913, 637, 2820, 4248, 4587, 3716, 1570, -764, -3119, -4777, -4603, -4123, -3445, -3167, -2955, -3168, -3718, -3131, -2523, -2130, -1284, -1520, -2438, -2826, -2870, -2272, -1069, -189, -198, -648, -1418, -1569, -1253, -856, -1273, -733, 2846, 725, -2221, -17071, -4173, -1557, -988, -705, -1238, -2016, -2366, -2711, -2068, -2426, -3452, -5251, -4610, -3674, -2976, -7238, -8808, -9467, -8657, -6828, -5481, -4844, -3887, -3297, -2191, -1412, -1496, -1140, -1341, -1097, -54, 1282, 2804, 2996, 2285, 1253, 1340, 2239, 2971, 2996, 1276, -1086, -4464, -5688, -3393]
9153c393h66C85L35O7l44A48l1J70J38a23j291j724o33P14m72r26R9K073b68D94
9132G62h4o45o12p77p95p87j22n54j279r86L04J94J216M68P42M42K87j85L35J397
9112a441a50G26K20m44b68p27M09B63J44D6a508j592J246f12K56q31j461r57p01
9093d306K04Q3j64L66P42P58L26l72r27k59J256a096L61n39n74K45c35G50N04
9074A254n77c63p32l66k48O66K17k56n77j002m57l58R47J191d83k75j392r82r53
9055d085k34P68P0R08O83O52f09H21R66M63m08H40D5a03H68Q73Q9o07E43b31j025
9034a256o03j98O9J37N26d63D95J054P58K71j54r44a0j192j401j095j91J348h20
9014C34N04A80a309j766k602j86J652J835a053b11F21K50m1l76f35j657k601j466
$$ y = [-3393, -866, 385, 720, 787, 443, 148, 117, 287, 425, -123, -1414, -3138, -3771, -3057, -3529, -4455, -4356, -2283, -268, 494, 762, -84, -729, -1341, -2118, -2913, -3700, -3822, -4376, -5655, -6641, -6337, -6143, -4927, -4459, -3717, -3275, -2988, -3173, -2838, -1441, -150, 726, 946, 502, -268, -995, -586, 263, 407, 46, -1508, -3100, -1854, -612, -356, -1187, -2648, -3605, -4306, -4102, -4019, -4183, -3817, -3075, -2317, -1991, -2363, -3290, -3549, -2293, -1096, -735, -1274, -1848, -1603, -335, 750, 1254, 677, -363, -1095, -1461, -1709, -1043, -826, -1082, -1659, -2661, -3118, -3476, -2529, -1338, -483, -758, -2150, -3132, -4085, -4319, -3551, -3481, -2573, -1890, -1238, -609, 821, 1787, 2250, 1842, 840, 45, -103, 868, 1741, 1830, 1223, 543, -231, -1256, -1859, -2057, -1988, -1851, -1325, -463, 495, 1549, 2307, 2578, 2424, 1480, -10, -1202, -2603, -3698, -3889, -2541, -820, 334, 838, 180, -1309, -3075, -5677, -5863, -4211, -2376, -1053, -211, 621, 871, 830, 454, -635, -2292, -4893, -6359]
8996f359K274b036Q40j90p47j88a138A39J171O61N56L5m25j066h96k064r77o00
8978d537j93P42J732f73C7M77J75C34L5M52J99k31a97j280j125k38i32A140J644
8959B784J142j54r45A173i87j806J66i38d67J9o14J11r62o97m70k54m42O48R86
8940b142a001D13J085M86L21J8o2K8KK95O00O75P4r14I65a419k201a452B333L120
8920E453J716k07k204B212j077J529J452L5o98j290F00a344j767N47g26H43N42
8903A385M76J37M43O44Q6o00j229i82j913J119E09J333R47J95o35r49F84K99Q06
8884A789L31n11E96g14r18k75K18J51p60k90Q50c66A208J663J023o78H55b195
8865e283P96a361A376J999J171N62j9r24j489b81l756j6a210A195Q21m44k72C90
$$ y = [-6359, -4085, -2036, -1196, -1386, -2133, -2321, -1138, 139, 1310, 1971, 2527, 2562, 2137, 1071, -896, -2960, -3937, -4537, -4730, -3988, -2256, -673, 37, 514, 689, 334, 369, 821, 1020, 789, -197, -1477, -2602, -2840, -932, 1140, 2784, 3926, 3772, 2827, 1173, -987, -2793, -2627, -938, -467, -448, -1062, -951, -1913, -2610, -3080, -3334, -3776, -3128, -2142, -1001, 413, 1498, 1984, 2305, 2323, 2261, 2289, 2291, 2586, 3186, 3861, 3935, 3021, 965, -1419, -3620, -1452, 2333, 5453, 7169, 6962, 4758, 2212, 1135, 2664, 4116, 4151, 3453, 2163, 600, -1344, -3111, -2564, -726, 843, 1385, 1861, 1998, 2441, 3085, 3171, 2571, 1342, -982, -2895, -1776, 509, 1842, 2789, 2984, 2349, 1400, 684, 983, 1789, 2120, 1609, 596, -714, -1632, -1907, -1689, -1538, -2298, -2588, -1738, -366, 1208, 2871, 3894, 3216, 855, -2195, -5283, -4487, -1361, 1376, 3375, 4546, 5108, 5089, 4165, 2676, -281, -4037, -4053, -1210, 1195, 2016, 1572, 1300, 390]
8846i05l80b05A919J758M00r75A093a285k645j849o65K820b10B812K112Q63k04
8829E583o92j543A055b061l615m29K647a197c26m52j319j116j185j25L92Q29J05
8812c197m17M56J003M32J38L52I0P96K14j73d76j723m8a104O9p30n35a118B68
8792D63g14j862j242rNa152A888J736n70A65d110k61d30B673K005J196N7p45j052
8773D134j376N04O34J634P13L42m55qn79j274j991a558j727O70N12p26q03N32
8755c100a518M22j324k146l739j98R19l227m019N93l47n62n93K915d805a317e98
8737g969c961A0424J8752Q793P193o316j5745G372O922K8686K5033K3237O734
8724I7984R531n453l4920j0478L1509N3770R806R187m51M818P341n463k4453j0574
$$ y = [-905, -1285, -205, 1919, 3677, 4077, 3102, 1093, -1285, -3930, -5779, -6444, -3624, -210, 2812, 4924, 5787, 5583, 4891, 3348, 1055, -2061, -5676, -6105, -3458, -1197, -326, -778, -2097, -3213, -4398, -4523, -4131, -3302, -3197, -3614, -3158, -2155, -1723, -1585, -1233, 90, 886, 1100, 927, -476, -2199, -2247, -1104, -1035, -1765, -2300, -1118, 268, 463, -714, -2576, -3818, -3827, -3822, -1152, 1888, 3624, 3054, 165, -4110, -4371, -430, 2673, 4678, 5874, 5931, 5186, 4134, 2758, 3262, 3896, 5530, 6243, 6585, 6130, 6122, 5543, 4269, 2278, -1558, -3285, -2615, -2103, -2829, -3632, -3100, -1518, -1096, -2420, -4566, -8305, -8503, -7584, -10811, -14830, -14237, -14584, -15146, -15739, -12824, -4805, -1317, -598, -7969, -3961, 10424, 29176, 37969, 45162, 38846, 23101, 7372, 14294, 42980, 68013, 91250, 97984, 107515, 102062, 67142, 56664, 88173, 141943, 151749, 160936, 160485, 165303, 172644, 167181, 142728, 132154]
8710A32154l064m0936l0897k2420A711a0333A4255J0937N356n013j1281k661m892
8697F701l92Q431K980F724K884B100a2490n412h046c199j636K242M52o35K76Q61
8681a639K08o3j044j105j98a471A772J362A128c528q48a077d76D74Q529R716N581
8664B4300M852J8670L2167M5337N1684K5544L062n915k2638m0127n2591l8723
8652D5622A6155p130J289m216k310J614M07B491a016D92K697K08F20b893j794
8637d687J59k67R27a547H72J156o38l5o6N43H72a110k570l375M90J181MN89a744
8617A220J552M1m56m27n21F56f16j051j69N95Q0j002j883J233a008K44j250j124
8599c138a289A260J632k31A271c95j156j053j635k407l22L68K429a858c94a88
$$ y = [132154, 129090, 88154, 57257, 34837, 1711, -10333, 14255, 25192, 30548, 25535, 14254, 11593, 6701, 6309, 14740, 17720, 6724, 9608, 2100, -12490, -17902, -8046, -3199, -4835, -2593, -2141, -2776, -2500, -1639, -1431, -1494, -2538, -3643, -3841, -1471, 1772, 3134, 1128, -3528, -4376, -1077, -476, 474, 9003, 18719, 24300, 29152, 47822, 79989, 125326, 177010, 202554, 205616, 199701, 177063, 136936, 84345, 45622, 16155, 9025, 10314, 6098, 3788, 5402, 5809, 2491, -1016, 492, 3189, 3397, 620, -2893, -4687, -4528, -4795, -3868, -1547, 872, 2028, 1390, 1355, 1289, 1832, 872, -1110, -3680, -7055, -6565, -5384, -5380, -4791, -1744, 1220, 2772, 2813, 2357, 1930, 1409, 656, -616, -1667, -1836, -1241, -1161, -2163, -4046, -2813, -1008, -764, -2014, -3138, -1289, 1260, 2892, 2661, 1271, -395, -1551, -2604, -4239, -6646, -6968, -6600, -4171, -1858, -394, -188]
8582a711j552j064k04J495a385L11q76k85a045B78M86l55b61j003o17p46q06n67
8564d000J343J190Oj023j679L79J634f63E83R22Q14J041Q76N21M74p66j903a058
8545d902J51a908d15B04m3b1p64k83o25r08j949j314J636a433B030L813K681P07
8527I231j343l352A709d56q4A49J61n5c25j316j220P66E46K894J993R12k57j235
8509D853j412j260q32Ca361r59r25J382g52f1A43K42M15K10A52b100k445J605
8491b940J82k53l9K74M37j516o30h35D773M826L596J813J319Q68L58j419k288
8474A3846l216l443l496e2l274P01i61d17r47j901P42F43K617P59j139B16a764
8456g93E25K44J64J090R36k2r89D36e95r34l84n74k75q49j543k291K509a879f45
$$ y = [-1711, -3263, -4327, -4531, -3036, -1385, -1074, -1950, -2235, -1045, 278, 764, 409, -261, -1264, -1881, -2627, -3433, -4000, -2657, -1467, -1461, -2484, -4163, -3784, -2150, -663, 583, 1505, 2319, 3360, 4236, 4757, 5231, 4465, 2562, -1058, -4902, -4751, -1908, -415, 204, 161, -21, -785, -1068, -1693, -2601, -4550, -5864, -4228, -1433, 2030, 5843, 8524, 9231, 7888, 4536, 1709, -456, -540, 149, 310, 255, -325, -1641, -2861, -2095, 546, 3440, 5433, 6345, 6088, 4853, 3441, 2181, 1349, 3, -1361, -2320, -3245, -1863, -752, -61, 143, 385, 800, 1010, 152, -2100, -4545, -2940, -2758, -3011, -3050, -2776, -2339, -3855, -4485, -835, 4773, 9599, 13195, 15008, 16327, 17195, 17553, 16134, 13846, 10630, 7187, 3691, -52, -3326, -2625, -961, -417, -1364, -3265, -2523, 643, 3260, 4019, 2880, 216, -1764, -793, 525, 769, 933, 2023, 2959, 2937, 1948, 436, -595, -1529, -1913, -2487, -2762, -3611, -5154, -7445, -4936, -1879, -645]
8436A30d96j214j060l6J06r81j734J295b052J022l05j133j363j040o80K671c07
8418A059l8f4k66A015J549k37d40m399J680a059N16n50j897N71c81I22k4m01b76
8398h41j365k56C58K611Q17j445a321k168e82B173K35h11l917a85E574M567N05
8381A0646n100a469A342N634J0421P036L065j353j126O295J2504J2388J3195J3742
8367H3143J4308J8618K4420L3104M2119M8679M8627M1978K7440Q423j2757l1965
8355C46137m6210n2366m9568m0496k9478k3135k0127j8482j5048r983p112j840
8343C2292Q20l364n242q463o585j422L861J680K942k683m955A671d457j430b844
8327A551K473J427O59l07m1k75k589A74b215f26B844K610J197m95j831B021b04
$$ y = [130, -496, -1710, -2770, -2806, -2700, -3681, -5415, -4120, -2052, -1030, -1335, -2468, -3831, -4871, -5551, -2880, -307, 1059, 1021, -64, -330, 1015, 2564, 2327, -440, -4839, -3159, -1059, -543, -1093, -2990, -2419, -381, 922, 898, 497, -276, -841, -2206, -2462, 358, 2969, 3786, 2341, -1321, -3489, -582, 2173, 2408, -811, -4728, -185, 5574, 10141, 10646, 5546, -1469, 1342, 6976, 17397, 24433, 27498, 26145, 25019, 31314, 43818, 56206, 69401, 83143, 97451, 116069, 140489, 173593, 215712, 264391, 313018, 354996, 382436, 390859, 378102, 346137, 299927, 247561, 197993, 157497, 128019, 104884, 84757, 66275, 51227, 41244, 34132, 32292, 33112, 29748, 24506, 16043, 9458, 8036, 11897, 13577, 16519, 13836, 8881, 1671, -4457, -5887, -2844, 1551, 4024, 5451, 6110, 5803, 5762, 5487, 2898, 174, -2215, -626, 2844, 5454, 6651, 6156, 4325, 2021, -204]
8309c69A604K196P62j768Ic288k569b616a087p67k092j417J055J576Q41J06j46
8292a931r84j699k35a351A798P16p97A60a440j295L52d21I11k4g21k130o04a446
8273c01j423k137R21a324A48J69i61o02c67A865J842O18k51j016j515H4i22n30
8255a452AL310L139N54k492h1n334k95b487g46m84q14P38E18J330k01B87a615
8236b968j623k164b812A165M421L533J244j006l493F77P36J6499K1573K1404J8889
8221G9778J0598M03r838j7382k0122j7948j2411l548J246K300M931K838J154k685
8207A9314k827p4o43k542M024N104K256k322q570E498c080K23C567N022R22j692
8191G819k156r3J588l25k706I70A49J137N12f74m669J433J846J1j580j306Q21
$$ y = [-369, 1604, 3800, 4562, 2794, 9, -3288, -5857, -2616, -1087, -1854, -3946, -5363, -4308, -2732, -1891, -1785, -1931, -2915, -4614, -4849, -1351, 1798, 2514, 1717, 160, -1440, -2735, -2383, -421, 911, 887, -721, -2851, -3455, -1446, -301, -1724, -3861, -2940, -1324, 148, 317, -961, -1563, -367, 1865, 3707, 4325, 4074, 3058, 1543, 84, -922, -1452, 1, 3311, 6450, 7004, 4512, -81, -5415, -5710, -2487, -746, -1230, -2044, -1306, 518, 1848, 1647, 287, -1615, -2968, -4591, -6755, -2812, 1165, 5586, 9119, 10363, 9357, 5864, 677, 1413, 17912, 39485, 60889, 79778, 90376, 90779, 80941, 63559, 43437, 25489, 13078, 9530, 10776, 13076, 18007, 20845, 21999, 19314, 16487, 16413, 15770, 13228, 17252, 22356, 24612, 22290, 13720, 5498, -3080, -2857, 3567, 8589, 9511, 7819, 5663, 5570, 7158, 6833, 4127, 970, 149, 1286, 1798, -674, -5343, -3910, -2064, -2053, -3633, -4939, -4118]
8174d118A782R506R094R776O899L322N12k010m847o954q684q409C336B45b48o1
8158c09q11d20A840J724l40A250a633j983J20j078l312f11H856R117P829M477
8142C0279J704o99j228j073m60j103l254m915n769F641e39m052a713A27J337M94
8126A958I74b464l450b159A229J531m57c02l588k192b450B50J783J195R47J359
8110E534J489L29q64l42J139J999J835Q69K64q67k903l428p01L638N413N906P007
8093B6317M387K290p4l597n000m891n332F997o73M414Q261L856O88J646K476J67
8077B7832j353n369q554D019a708L14n01c69E564N890J766r44L003O579K773m245
8061B0386q299J8827L5790K8277K5094L4837P2767J10813J25577J12234P3080
$$ y = [-4118, 1782, 11288, 20382, 30158, 37057, 40379, 40891, 38881, 34034, 27080, 18396, 9987, 3336, 245, -248, -309, -1120, -420, 1840, 3564, 3224, 1250, -1633, -3616, -3496, -4574, -7886, -611, 8856, 17973, 25802, 30279, 31983, 31284, 30056, 28983, 28523, 27420, 24166, 19251, 13482, 6641, -539, -4591, -1713, 127, 1464, 1958, 974, -2464, -5914, -2159, 1229, 2760, 2303, -302, -3890, -6082, -2450, 250, 2033, 3228, 4175, 5534, 7023, 7352, 6488, 6146, 7285, 9284, 11119, 11988, 12252, 11385, 8482, 5054, 4353, 7991, 13404, 19310, 26317, 30704, 32994, 32920, 29323, 24323, 19432, 14100, 6997, 6324, 10738, 18999, 22855, 23543, 25189, 27665, 27832, 26479, 21110, 12556, 4019, -1708, -1394, -1895, -369, 5564, 11454, 13220, 12276, 15279, 21858, 24631, 20386, 12087, 30914, 66704, 94981, 120075, 154912, 227679, 338492, 464069, 576303, 649383]
8050F49383J6186m9825r7544j24138j24682j00796o2495l1762k1310k1753j1307
8039A9957N505P408p90q426j0046m906K500P256N113n39o794p449Q725J6687J4494
8024D8695P730M65l810m649k034m547p520o607q70J325l458r596o684N746J0087
8009B4273P642M345K137L78K04K895P460R461J5974L0854L9075L7908N3875J10778
7995C47259J89406K40223K41266J90405R5441l0456j36981k12478k41239k26698
7985D56148j82968j31095F8519K2809N4911L6948M272k4802m0394l5701j8094
7974F8468q533r017j2023p753k591m325n133l660j082p74j069k328m131j599J807
7959F257M096L647k898B752f296j425c337a467k526q43Kj902m19f08B004K585
$$ y = [649383, 665569, 615744, 518200, 394062, 269380, 168584, 106089, 74327, 53017, 31264, 19957, 25462, 32870, 32080, 23654, 13608, 8702, 11202, 18458, 23571, 23032, 16238, 8789, 17514, 34201, 48695, 56425, 56890, 53080, 48431, 46397, 41850, 34330, 27723, 26853, 28178, 24720, 15124, 8440, 14186, 24273, 31915, 36260, 38397, 38775, 38979, 41874, 49334, 58795, 74769, 105623, 144698, 182606, 236481, 347259, 536665, 776888, 1018154, 1208559, 1304000, 1273544, 1136563, 924085, 682846, 456148, 273180, 142085, 68519, 91328, 146239, 183187, 187459, 162657, 122263, 86562, 68468, 59935, 50918, 38895, 31142, 28551, 24226, 19093, 15433, 14351, 13577, 12508, 10180, 6049, 4450, 6257, 10353, 14000, 11102, 2752, -6296, -7721, -3337, -1467, -3993, -4836, -4834, -6736, -7155, -608, 2004, 4589]
7943D589K97M787m743c79A1619a048k933B200M426M506K0609L1979L4781K9446
7929A27947K1345Q776l8427j4141k0693l1915B3778j1793l82n331A469e356qb172
7914h16B585M172K814j095j083j174B909c795m919b317B426K155k055a141n035
7899f176b532B785K09H54c734k991b629A181O17j87R60m41L39Q35M624M776J0712
7882B3416Q316P310O898O35m747j1634A0137a733m512a993D058N254M737J434
7868A5483k72k564l032k042C568c83k524a348L06k314l623m897J874A175K078
7853C253J742k435F4L745J0347J2591J2440O395N10n782q316j1682L606J105j256
7838B3767K644j269j449j429m45m236qk57m948n078C124M828L804Q41l157C329
$$ y = [4589, 4886, 9673, 4930, -379, 11619, -1048, -3981, 2200, 6626, 11132, 31741, 63720, 98501, 127947, 149292, 158068, 119641, 105500, 84807, 52892, 23778, 11985, 11603, 6272, 1469, -5356, -5364, -2172, -816, 2585, 6757, 9571, 8476, 7393, 6219, 2909, -3795, -8714, -2317, 2426, 4581, 2526, -1141, -6176, -2532, 2785, 2994, 854, -3734, -6725, -2629, 1181, 1798, 1611, 2571, 2130, 2469, 3304, 7928, 12704, 23416, 31732, 39042, 45940, 46575, 41828, 30194, 10137, -1733, -6245, -1993, 4058, 9312, 14049, 15483, 15211, 12647, 9615, 7573, 3568, -383, -2907, -1348, -1042, -3356, -6979, -11876, -10002, 1175, 3253, 4995, 2560, 64, 3809, 14156, 26747, 39187, 45582, 46092, 40310, 31994, 20312, 23918, 25023, 23767, 26411, 25142, 23693, 22264, 21819, 17583, 17575, 17318, 12370, 7292, 3124, 7952, 11756, 12597, 9440, 3329]
7821a122j238E568N765K972N054O703P204R916K5078M3918N2269M9001L2084J0179
7807B55711j4861l5079m7097m9826m2361k7776j0971m402l455M25K738K500N13
7794B6059k395m589o423E354k386J277J729k393c168j0378o101K408L845d420
7779A2556M636K421G574c460j7709i48j37o378D572J3887J1024j3747n213J4005
7765B4528L946K483o285o633D719J2135K1845J8399P354o782k0000A7986H559
7751b34j0190j799M002a909k480l971n634L2N836K469J854f07B780M029J755k1
7735H543K68k843B38f19E70O078O698J903k765E351b812l997A89K524N21L99j489
7718B144H32a918r92a078G82p3g28C563O595L032k718C055b099B948M285J666
$$ y = [-1122, -2360, 5568, 11333, 14305, 19359, 26062, 33266, 43182, 68260, 112178, 164447, 213448, 245532, 255711, 240850, 205771, 158674, 108848, 66487, 38711, 27740, 23338, 19883, 20308, 23046, 25546, 26059, 23664, 19075, 12652, 5354, 2968, 4245, 5974, 3581, -3168, -13546, -19647, -17239, -13394, -4420, 12556, 17192, 19613, 7574, -3460, -21169, -948, -1085, -7463, 4572, 18459, 29483, 15736, 10523, 24528, 28474, 30957, 24672, 18039, 4719, 16854, 38699, 57098, 64452, 57670, 37670, 17986, 8559, -234, -10424, -12223, -8221, -1909, -4389, -8360, -13994, -13962, -8126, -5657, -3803, -607, 2780, 6809, 8564, 8543, 8811, 5968, 238, -619, 570, 6648, 13346, 15249, 12484, 5351, -2812, -6809, 189, 2713, 3234, 3633, 2144, 832, -1918, -2910, -1078, 782, 709, -728, 3563, 10158, 13190, 10472, 3055, -2099, 2948, 7233, 8899]
7702H899l25k853A499c691J704C745N706K531p73m020k480N04L892J116l671m82
7686F068O547P718J975k806l914J80L661K616k540n555k463J239N504N451K633
7671B6314j955m997j984P032R914M166l673K24O211P742N730J341K445k083j4441
7656D1986B0720h482E038L3602L0827L0211J5160j4965j9910m571K9430J4364
7644A19186Q346J7048M8129K1587p51o163M4261L4068o088N4095J92777J81621
7632G08116J03543J47927O47507J178686J552709J718747J647960J331723P99785
7623I836703j17080q84944j393260j685752j731513j536661j140514m84359n7795
7614H04825q5644j93184j66262l2571n124m7588o5842j1705L468j9305k6151L316
$$ y = [8899, 8574, 5721, 1499, -3691, -1987, 3745, 9451, 11982, 11209, 7189, 4709, 5213, 9105, 10221, 6550, 6068, 12615, 20333, 22308, 19502, 15588, 15768, 19429, 22045, 19505, 13950, 11487, 12726, 18230, 23681, 26314, 24359, 19362, 17378, 24410, 34324, 38490, 34817, 35041, 41252, 48994, 54724, 56065, 58510, 56427, 41986, 20720, -8482, 5038, 38640, 69467, 99678, 114838, 99873, 79963, 75392, 104822, 119186, 127532, 144580, 192709, 214296, 213545, 207382, 251643, 285711, 279623, 333718, 526495, 708116, 811659, 959586, 1607093, 2785779, 4338488, 6057235, 7705195, 9036918, 9836703, 9719623, 8834679, 7441419, 5755667, 4024154, 2487493, 1346979, 862620, 804825, 719181, 525997, 359735, 327164, 322040, 274452, 208610, 196905, 200373, 181068, 154917, 158233]
7602A58233J9493J6007k048j5868k3746j2256J0156J5259n79k5162l3275j6205
7590I0009J235j480j1739r435j0122j0195j1257O140R310K872k232M832Q858o7
7576F6729j3779n199J8779J8061K235j6132j5957J775O52k4084A3622Q9382J10173
7563B13177J12531R4854N8294J0257l8844q3659j07876j07124p4991j7847q03
7552E7969j2047p448O609K502p512k512J2940Q145j0198B2050n692L7735L4776
7539H8869K3668J3533R144O685k95j4278l0179l8846B8749r96K136j2351b611
7525A1377J0887k100m561Q19J906m074n394q79M6A277M378J3726Q084l267j1633
7510A2565D432M975Q651P805N622q85q814I858K259M591J288k936N354J111q473
$$ y = [158233, 177726, 193733, 191685, 175817, 152071, 139815, 149971, 165230, 164651, 139489, 106214, 90009, 91244, 89764, 78025, 68590, 58468, 48273, 37016, 43156, 52466, 55338, 53106, 57938, 66796, 66729, 52950, 47751, 66530, 84591, 86826, 70694, 54737, 56512, 57164, 33080, 13622, 103004, 213177, 325708, 420562, 478856, 489113, 450269, 366610, 258734, 151610, 76619, 58772, 57969, 45922, 38474, 45083, 47585, 40073, 37561, 50501, 58646, 48448, 22050, 16358, 54093, 88869, 112537, 126070, 135214, 141899, 141604, 127326, 97147, 58301, 28749, 27753, 29889, 17538, -2611, 11377, 22264, 20164, 15603, 16422, 18328, 14254, 8860, 7981, 8027, 1277, 5655, 19381, 27465, 24198, 12565, 4432, 9407, 18058, 25863, 31485, 30600, 21786, 9858, 12117, 16708, 17996, 15060, 20414, 21525, 13052]
7495A3052c532G775J6394O250m436O49N344m873I211c773A9549J2372r00r051
7481B1970r053k878P918J4879J0630k387j5279A2422P947O220n028n956L546P15
7467A9866I758l388J2701L633A0829a254A5440R800k576m84J3350Q664o101j5112
7453B2981n801j77F747J836K2040J0333p484J505K9997K5672L410j6337j5303
7440F2416K302M225m526o861o52l686j4256j1096N057N7A6047d337A1421L841
7426A5262J634J8786O244j4543G586L2536L1596j360k7075d340J255C4371J3787
7413D8158M74J3625J9227J3791P308L522j1607l3792B7147J9639J7232j3982B0444
7399C1849J6309r343m336L3109J9954j7845C1258K0180K9145j3235A5164J3626
$$ y = [13052, -3532, 7775, 24169, 30419, 25983, 26632, 31976, 27103, 9211, -3773, 19549, 31921, 31021, 21970, 12917, 10039, 17957, 32836, 43466, 41079, 25800, 12422, 20369, 26589, 21561, 15605, 19151, 19866, 9758, 6370, 19071, 22704, 10829, -1254, 15440, 25240, 22664, 22180, 35530, 44194, 38093, 22981, 17180, 17003, 6747, 8583, 30623, 40956, 33472, 34977, 64974, 90646, 94056, 77719, 62416, 64718, 68943, 64417, 57556, 56904, 53218, 38962, 27866, 32923, 32980, 16047, -4337, 11421, 15262, 16896, 35682, 41926, 27383, 7586, 40122, 71718, 70358, 43283, -4340, -3085, 34371, 48158, 48632, 62257, 81484, 95275, 102583, 106105, 94498, 60706, 27147, 46786, 64018, 50036, 20444, 31849, 48158, 38815, 34479, 67588, 87542, 69697, 31258, 51438, 80583, 67348, 15164, 28790]
7387B8790M1667l49k7519J6804L4232n952D1260R937M8995M543m2540r161M9642
7374A02676J2151m1700l5871M3688J6582l8299B1363N9265K0163l2808m890M8276
7362A11369Q441E8667B4267Q4173K4585n0617k0876R3776L7619n4874F5458Q0134
7350A45592N5849m3641G4085O9384O9975l4981q4648P1127P7484l6996F6874L4086
7338A00960R6196k8414G8195J28754J11742m3887A10844P3903J61509j0408j60615
7327A75233M1325J73658o408j89364N1984K30481J7391k26379l3350K87087N9241
7316E80899k35946r9569L34514P0046k41077r0462M28550J54495l20178k19275
7306C61997N35750K35286l48008l44849P00836L69012l96953n28750R15501N83719
$$ y = [28790, 70457, 70108, 42589, 59393, 93625, 87673, 41260, 51197, 100192, 104735, 62195, 53034, 102676, 114827, 73127, 37256, 80944, 97526, 59227, 21363, 80628, 100791, 67983, 63093, 111369, 119810, 58667, 24267, 108440, 133025, 82408, 61532, 155308, 192927, 138053, 65458, 145592, 201441, 157800, 74085, 143469, 213444, 178463, 93815, 164942, 242426, 205430, 66874, 100960, 197156, 168742, 78195, 206949, 318691, 274804, 110844, 184747, 346256, 335848, 175233, 216558, 390216, 383808, 194444, 246428, 476909, 494300, 267921, 234571, 521658, 580899, 344953, 245384, 579898, 649944, 408867, 318405, 746955, 901450, 581272, 361997, 897747, 1133033, 785025, 440176, 1141012, 1510024, 1113071, 584321, 1499822, 2083541]
7296B083541m56226G70404J261123R71451m78096A255721J735972J695523m99048
7287D188168k074452K811857L431214k11583l832821N394699Q977404K174799
7279B0859285p687885J9483519N1005008O4797077O5913721N2961562K7933914
7272B95266201l731770l4497130n7187695o6996598o2872259B3471542q923847
7265A4547695O796530m252390G615218k808982L614442p30852C843558j542271
7257B301287K171031k7677j996716j116669J392072J75800j167709H34268R44624
7248A778892K26866p30349E31370O71664K48562m78001C85404M77092K50502l15341
7238G97657C27343L27853K22721k18476B54418K10476K03197j42540A84292J50546
$$ y = [2083541, 1627315, 770404, 2031527, 3002978, 2524882, 1255721, 2991693, 4687216, 4188168, 2113716, 4925573, 8356787, 8145204, 4312383, 9707082, 18684486, 20859285, 13171400, 32654919, 83659927, 148457004, 214370725, 267332287, 295266201, 291534431, 257037301, 199849606, 132853008, 69980749, 23471542, 14547695, 21344225, 17091835, 7615218, 4806236, 8420678, 7689826, 3843558, 2301287, 4472318, 4444641, 2447925, 1331256, 2723328, 2899128, 1731419, 834268, 1778892, 2005758, 1275409, 531370, 1203034, 1451596, 973595, 385404, 862496, 1112998, 797657, 327343, 655196, 877917, 659441, 254418, 464894, 668091, 525551, 184292, 334838]
7228C34838K08973p6665A98905N5614J80966m1857A85955L3711J58271k0917j70357
7217A86663k6711J44428O961j41169l4830J97040J20899J0557o2072p6021o6349
7206B59396l9490K9704M8484k5447j04823q2138O9472M6258l7510n1688N2937
7195A65155M3019l7652p9353J3775M6356p099L095Q3028N5225k2872p1088j3750
7183A77839J7325o5264n3618J50221J00094j4190p5060N1246P1539l6271m1524
7172B82337J48143J19099o0922j35456J36580J87805m6962j92446J37277K28936
7162H04391n6037k52809K45525M36096Q266l22622K47614O22542J07836m79457
7152A361345K15874R25621J83601p42219N65328J882159O44262r41076J808534
$$ y = [334838, 543811, 467146, 198905, 254519, 435485, 393628, 185955, 219666, 377937, 357020, 186663, 159952, 304380, 311341, 170172, 135342, 332382, 453281, 463838, 401766, 325745, 259396, 219906, 249610, 298094, 272647, 167824, 85686, 155158, 201416, 163906, 112218, 165155, 208174, 170522, 91169, 104944, 151300, 144201, 147296, 230324, 285549, 262677, 191589, 177839, 195164, 129900, 76282, 226503, 326597, 312407, 237347, 288593, 360132, 323861, 282337, 430480, 549579, 488657, 353201, 489781, 677586, 630624, 438178, 575455, 804391, 748354, 495545, 741070, 1177166, 1185432, 862810, 1110424, 1732966, 1840802, 1361345, 1577219, 2502840, 2686441, 1944222, 2509550, 4391709, 5035971, 4094895, 5903429]
7143E903429M965235K932434j108014O510286K5323716L6488714M0000777L5192061
7135A56208638K2604452M761595j4161380k9752046l8627005l9209399B9865412
7127A2921591J06142k59245l660515k839738J5415l82251j779895j459302L93706
7118C055908J63176r59602A109680M04350M94788j78191k51047J61140Q6644l67450
7108A459914n13471N1557K16094j10079m59900A85335K788K214a4507B24621J03002
7097C27623j09167K5916L01328J61804p3405j82573j8449P9908n2137j67388k1127
7086B72333Q6028m5602j26194P9824J16420n0512A56960M6030J61109J0031j22946
7075B51184m5991J04685O883j04808j8929P9390l3313F6199P0468J59034L106
$$ y = [5903429, 10868664, 13801098, 12693084, 19203370, 44527086, 81015800, 121016577, 156208638, 178813090, 183574685, 169413305, 139661259, 101034254, 61824855, 29865412, 12921591, 13027733, 12768488, 9107973, 6268235, 6283650, 5901399, 4121504, 2662202, 3055908, 3219084, 2259482, 1109680, 1514030, 2008818, 1830627, 1579580, 1740720, 1827364, 1459914, 946443, 998000, 1214094, 1104015, 644115, 185335, 188123, 190337, -14507, 224621, 327623, 218456, 244372, 545700, 707504, 634099, 451526, 433077, 512985, 460848, 293460, 272333, 358361, 312759, 186565, 266389, 382809, 332297, 156960, 202990, 364099, 374130, 251184, 205193, 309878, 316761, 211953, 193024, 272414, 239101, 66199, 136667, 295701, 298807]
7064B98807j33771J2823J36335M52j43207o072J48980N503j51254K914J75318
7053C46828J4095j54773l902J88113K4667j72560l5359K13363L9653j80060l1034
7042B49031K49065N3639k16606q3480L21776J12673k10892q6108M31624K85259
7032A105981p1824l30138k90131j20148L1900N00288N26564J43548l89998l24866
7022G81176O25211M94195j26741l82463K39946L13386l97750m13075J080436Q43316
7012C057637m08952q36725J428439J441870n46328j897526K571144L202249k24766
7003G787042l560291N030877Q413694K009711p141090J8416450M7947692O0863836
6995A39767921O1860818M9639763K6121528l591652l2436117n3664722o2833891
$$ y = [298807, 165036, 177859, 314194, 314646, 171439, 165367, 314347, 319850, 168596, 171510, 346828, 360923, 206150, 202248, 390361, 415028, 242468, 207109, 420472, 460125, 280065, 249031, 498096, 551735, 335129, 251649, 573425, 686098, 475206, 389098, 820722, 1105981, 1034157, 704019, 413888, 293740, 325640, 825928, 1352492, 1496040, 1106042, 781176, 1406387, 1900582, 1773841, 1391378, 1631324, 1944710, 1546960, 1133885, 2214321, 3057637, 2648685, 1811960, 3240399, 4682269, 4135941, 2238415, 4809559, 8011808, 7787042, 4226751, 9257628, 17671322, 19681033, 12539943, 30956393, 78904085, 139767921, 201628739, 251268502, 277390030, 273798378, 241362261, 187697539, 124863648]
6988A24863648n8936375B2358536q623013O220703l991332G144344k414322L330388
6980H060410p37381l639208j437846K047012k2440j878634j149435J275833J52275
6971B670586j099672p42209R15655J97389p15878E43075O59299K26573m71695
6962I57252D00817M78265K35898l14227C35238L10279K13675k20964B55068K55243
6952E10311K05954j52364B31732J59543J98324r5550B00238O7019J91233n1607
6942D06883A91312N8182J58953l8149A79817K3888J49139j8270A63116k4691J44564
6931B82989J171j29574k3025J24469J0074j13102m7089J12497K1925r6982p1182
6920G2171J05864L1819p3542o4536Q6173L5169o1929E6341P6791L7277m9584o0347
$$ y = [124863648, 65927273, 22358536, 13735523, 19956226, 15964894, 7144344, 4730022, 8060410, 7323029, 3683821, 2245975, 4292987, 4270547, 2391913, 1242478, 2518311, 2670586, 1570914, 828705, 1744360, 1941749, 1225871, 543075, 1202374, 1428947, 957252, 400817, 879082, 1114980, 800753, 335238, 645517, 859192, 638228, 255068, 510311, 716265, 563901, 231732, 391275, 589599, 494049, 200238, 267257, 458490, 406883, 191312, 249494, 408447, 370298, 179817, 203705, 352844, 334574, 163116, 138425, 282989, 284160, 154586, 131561, 256030, 266104, 153002, 105913, 218410, 240335, 143353, 72171, 178035, 209854, 136312, 71776, 157949, 193118, 131189, 56341, 133132, 170409, 120825, 60478]
6908F0478O8454M0731m1540D7243M4897M6183k6493D8713L1776L9369k4661C6853
6895H0848M3567j8194D2016J3478M8107r088D5059J2978M2500n324m7555o21M0773
6882H7810k737C9196K245M6130M665l7232j7113L6057O161l4512A9783L4740R644
6869F4167k4784j4614L4342R956k5650k0987L2293J2739k4176A3149L3045J8135
6857F4329j6808A6455J9120J8352j1737k1055K0259J2817j7083f54B5386K6201
6845E1587n883A7469M294K1360l133A6981r0J7798k766j4025J2422J7369m098
6832D3591A7387n586K3252K778j5102k24J6656O95j8442n129J8184M694j6156
6819B3007D536J5341N953j1672m072J6996O055j2376r092J4958O587j2592h29
$$ y = [60478, 128932, 169663, 128123, 47243, 92140, 138323, 111830, 48713, 80489, 119858, 95197, 36853, 80848, 124415, 106221, 42016, 55494, 103601, 94513, 45059, 58037, 100537, 95213, 47658, 47037, 87810, 85073, 39196, 41441, 87571, 92236, 55004, 37891, 73948, 80109, 45597, 19783, 54523, 64167, 39383, 24769, 59111, 69067, 43417, 22430, 54723, 67462, 43286, 13149, 46194, 64329, 47521, 16455, 35575, 53927, 42190, 21135, 41394, 54211, 37128, -654, 25386, 51587, 45704, 17469, 21763, 43123, 39990, 16981, 16891, 34689, 31923, 17898, 30320, 47689, 43591, 17387, 11801, 35053, 37831, 22729, 22505, 39161, 39856, 21414, 16285, 34469, 39163, 23007, 4536, 19877, 25830, 14158, 10086, 27082, 33137, 20761, 11669, 26627, 33214, 20622, -829]
6805A6081R504p998H519J2306J0375p181H181L290R652m621E692J0836R722o252
6791A9998A301M890J3038q49q747O978J0170l924G490J964J4776J910r841o812
6777I487N256r97D580N688J0961M91r135q30Q767m5F958b185A4357N125p536m852
6761G094J0609N254p741F175J0978J4966Q003L788J305k578n405O94P844L148
6747D8918p811j2971n22R318R26j1467G411b768a63l726q57A0325J7791J4610
6733D2726J1289J0421Q208N974Q18j0120j9735k0390o046M631l735A0577B039
6719I140K822E020A775R168L064m316k655N394P78o022k388Q074L225m675l095
6704H327P418N279n044C430a595G494K239m208e41l675A597J0527O108l053C801
$$ y = [16081, 25585, 17587, 8519, 20825, 31200, 24019, 8181, 11471, 21123, 16502, 5692, 16528, 26250, 19998, 1301, 6191, 19229, 18380, 9633, 16611, 26781, 22857, 7490, 9454, 24230, 26140, 16299, 9487, 14743, 13746, 4580, 10268, 21229, 21720, 12585, 11755, 20522, 20477, 6958, -2185, 14357, 19482, 11946, 7094, 17703, 22957, 15216, 6175, 17153, 32119, 40122, 43910, 45215, 42637, 37232, 37926, 45770, 48918, 41107, 28136, 27614, 36932, 37858, 26391, 7411, -2768, -163, -3889, -4746, 10325, 28116, 42726, 54015, 64436, 72644, 78618, 79436, 69316, 49581, 29191, 23145, 27776, 24041, 10577, 2039, 9140, 11962, 5020, 1775, 10943, 14007, 9691, 7036, 12430, 13208, 7186, 4798, 12872, 16097, 11422, 8327, 15745, 21024, 15980, 3430, -1595, 7494, 9733, 5525, -541, -4216, 1597, 12124, 18232, 15179, 3801]
6688H482J9622J3050J482p382q69O555J950n407P161L044J0805K1786J5320L6218
6674A31817K4303L7787P816k778k0670k8556n8230m0685j3850P424J2170L850
6662F0398j0631j3701n40N800m35j0151A3052B375K150R70B616F88b709h00G758
6646A4997m02G051a977D403O127j816H60e167F11K998J034J730N95C322C89K414
6630B803K221j916E85J928J617A024h26F243M930j291A097e125C691N407L36k30
6614I204q64k743A197l40K827j626c926P89D011M147n57k034k170B40d624h56
6597E586J549A478e295b607A838D72d892a332G562O237K914k94l274n692B7f608
6580c716i52l55j313k711J301A770M907j09A177d080a097B586A259c355h76E443
$$ y = [8482, 28104, 41154, 42636, 35254, 34385, 40940, 42890, 37483, 44644, 47688, 58493, 80279, 95599, 131817, 156120, 193907, 201723, 198945, 178275, 149719, 91489, 50804, 36954, 44378, 56548, 60398, 49767, 36066, 35526, 41326, 40891, 30740, 13052, 2375, 4525, 5495, 2616, 688, -2709, -800, 7758, 14997, 14595, 7051, -1977, 4403, 10530, 8714, 860, -5167, 611, 3609, 4643, 6373, 6968, 3322, 389, 2803, 5024, 3108, 585, 2513, 4130, 1024, -826, 6243, 11173, 9882, 1097, -5125, 3691, 9098, 9434, 9204, 8340, 5597, 1197, 857, 3684, 2058, -3926, -3137, 4011, 8158, 7601, 5567, 3397, 240, -4624, -856, 5586, 7135, 1478, -5295, -2607, 1838, 472, -4892, -1332, 7562, 13799, 16713, 16419, 13145, 7453, 27, -6608, -3716, -952, -1307, -2620, -5331, -4030, 1770, 6677, 6568, 1177, -4080, -1097, 2586, 1259, -3355, -876, 5443]
6563H485j90j239j591A604d871o55a092C087J0282J6966J7718J2815M901k499
6549F3270p200r536j1531j1964j0451D478b259n785a715H781J1387J0544N220
6536C5932m89p256j2062D136d256k969j202O06K785m494q364r093M783M277M781
6521a3146K600J400J322k661K215b084C024L244R09k863b220p286i61H829N609
6506A4438P21j216K538M794P341O809N808L373L443O022M908j309p518j1027r485
6491B9640j3372F480j189N501R008M816K083R13q85j332k329m567o790H29i000
6475e219a213l86j260e78B267M272N008M328R23l767E721j618Q382J7808K1674
6460E1967K2251J8340J0194R89n966j0557j2727j2090r568n437m615n225o341
$$ y = [8485, 8295, 7056, 5465, 1604, -4871, -5526, -1092, 3087, 13369, 30335, 48053, 60868, 65769, 63270, 56070, 46534, 35003, 23039, 12588, 4478, -2259, -8044, -1715, 8781, 20168, 30712, 35932, 35443, 28187, 16125, 4136, -4256, -7225, -8427, -7821, -5036, -9530, -17894, -26987, -22204, -17927, -13146, -10546, -9146, -7824, -10485, -8270, -2084, 3024, 6268, 7177, 4314, -2220, -9506, -961, 8829, 14438, 15159, 13943, 16481, 21275, 28616, 35425, 41233, 44606, 48049, 54071, 58979, 57670, 50152, 39125, 29640, 16268, 6480, 5291, 10792, 19800, 24616, 26699, 27612, 26727, 25395, 23066, 18499, 11709, 829, -9000, -5219, -1213, -1599, -2859, -578, 2267, 6539, 11547, 15875, 16798, 13031, 5721, 4103, 12485, 30293, 51967, 74218, 92558, 102752, 103741, 97775, 87218, 74491, 62401, 52833, 47396, 42781, 37556, 31215]
6447C1215n888l430j203j562n640D675J589J6234J3378J2933P11p970j4809A0869
6432a111M43A657J491M314M764M902P162J0539J1326Q206M469K276P51k782q188
6417E0887j3013j6039G756C258L573K007j044C229c323l101b635e6D459Q126Q287
6402B0872L351l688I260b483D985P302L509k98N21J110m74j972L009O774P013
6387C1479K996p390o468R926J8532J2347l24j1149j0837O154K0581K3782J4347
6374A03976k643j8639k5203k4J9646j137k7886a1280C4100O2041N8042K4087J5966
6361A94236K3379M9513J44134K34162K78921K70980K14086J20404J9948o9362
6351A480401j34005j80970j93961k13291k25662j91230j27108l2496J887L271
$$ y = [31215, 25327, 21897, 20694, 19132, 13492, 4675, 6264, 22498, 35876, 48809, 49520, 41550, 26741, 10869, -1111, -668, 1657, 3148, 7462, 12226, 17128, 24290, 34829, 46155, 54361, 58830, 61106, 61857, 59075, 50887, 37874, 21835, 7756, 3258, 6831, 8838, 7794, 3229, -3323, -6424, -2635, -56, 4459, 12585, 20872, 24223, 20535, 9260, -2483, 4985, 12287, 15796, 15498, 16019, 17129, 16655, 14683, 17692, 24466, 31479, 34475, 27085, 20617, 30543, 49075, 61422, 61098, 49949, 39112, 45266, 65847, 89629, 103976, 101333, 82694, 57491, 57467, 77113, 75976, 48090, -11280, 34100, 96141, 154183, 178270, 194236, 217615, 267128, 411262, 645424, 924345, 1195325, 1409411, 1529815, 1549763, 1480401, 1346396, 1165426, 971465, 758174, 532512, 341282, 214174, 181678, 183565, 186836]
6341A86836j8968j6070M380K4827O5765J00879J01755O4066j551o6458j15255
6330C30206j40301E2142J3981R8540P8706M5186L1668L9085K2399J9593P1129
6319D72429K18597L40668L76568L00389J35154n8666k02808k14782q5959L7078
6309A318668J7363j06434k56019l07647l06968A41144D6739B0770N0142O5613
6299A36525M3195O55l2877m8501l2241l746J2069R198j122j2230q27L1668M1189
6286A42955K7620J1164J830P62o269k1735m1580n4915A4266J2507J7146J2041
6274E5960K207k486p426j050K1438K0272K4441M6565J17432J94306K29608K18161
6262I19428J57114O7481m0798j40732k05791k25976j99823j38656r3895D3755
$$ y = [186836, 167868, 151798, 156178, 181005, 246770, 347649, 449404, 513470, 511919, 445461, 330206, 189905, 52142, 66123, 164663, 243369, 288555, 320223, 359308, 381707, 401300, 472429, 691026, 1031694, 1408262, 1708651, 1843805, 1785139, 1582331, 1367549, 1281590, 1318668, 1336031, 1229597, 973578, 665931, 358963, 141144, 46739, 20770, 70912, 136525, 179720, 180375, 147498, 98997, 66756, 63010, 75079, 84277, 83155, 70925, 70098, 101766, 142955, 170575, 181739, 183569, 184331, 178062, 156327, 114747, 59832, 14266, 26773, 43919, 55960, 58167, 55681, 48255, 47205, 68643, 88915, 113356, 159921, 277353, 471659, 701267, 919428, 1076542, 1144023, 1103225, 962493, 756702, 530726, 330903, 192247, 98352, 43755]
6251G355i910C0244J8194o034k0455A0186J0112N270j0846d845A949K1136J4970
6238C8055O225o46p103j3678F182e558R85K031j408a801A910N109L535l115A116
6222g274k801M533b312a28I469Q691K870l824G801b174l614J97E475J7192J5267
6207C7934P970j942n148j805N8k853o506m162L201N297K61k191K012J0539J6934
6192E9599K0642K1797J9561J3912N548l501j2196k0276k7108l2878E585O486M2175
6179E4246L8835K8367J6274J806j4741k8249l8016A8985c263I590N530m77G251
6165D201L46P074J1964J9719J2314J5197K5021L7545L6699K5912O341j2861k9055
6152A60417l6805k3228K2872N3344M9659K8400J845j4172j2283Q167L5436P0861
$$ y = [7355, -9910, 30244, 48438, 42404, 21949, 10186, 20298, 25568, 14722, -4845, 1949, 23085, 38055, 44280, 43634, 36531, 22853, 6182, -5558, -4573, -2542, -3950, -1801, 1910, 7019, 10554, 7439, 1116, -7274, -10075, -5542, -2312, -128, 9469, 18160, 21030, 17206, 7801, -2174, -5788, -5591, 5475, 22667, 37934, 45904, 43962, 38814, 37009, 37067, 34214, 27708, 23546, 26747, 32044, 32305, 30114, 32126, 42665, 59599, 80241, 102038, 121599, 135511, 141059, 137558, 125362, 105086, 77978, 45100, 5585, 12071, 54246, 93081, 121448, 137722, 139528, 124787, 96538, 58522, 18985, -3263, 9590, 15120, 14643, 7251, 4201, 4547, 11621, 23585, 43304, 55618, 70815, 95836, 133381, 170080, 195992, 202333, 189472, 160417, 123612, 100384, 123256, 176600, 226259, 254659, 256504, 242332, 230049, 238216, 273652, 344513]
6140C44513J10037J29172J17332P3826j190p3436j29536j62673j55533A21416
6129D3053B184b0242H519L0055M961r152j2369B717d625o382j839A889J4889J1883
6115B8661O483L585p230A2459c562A365J2796J1588P845L387p047q614l272Q989
6101B7037Q527j810j4445C491i745R01a334G009j37c600l568E268P237D822A730
6085B7691K6124J7143J2966J1014M841l365j584L486q46j9293l0927B0914K133
6072B3047M785j2073b255k452o22C2655P1674P0286M2797j158m0136n2217m8982
6059G4919B5947J569N3603J7668l8114B3912Q5253M5562l7813C6883J15591Q4468
6047B36942m2307E6433J89604J81292k6443A79677L15894M46215K9749C24324
$$ y = [344513, 454550, 583722, 701054, 774880, 773690, 700254, 570718, 408045, 252512, 121416, 43053, 2184, -20242, 8519, 38574, 43535, 34383, 22014, 2717, -4625, -11007, -12846, 1889, 16778, 28661, 35144, 38729, 31499, 12459, -3562, 1365, 14161, 25749, 33594, 36981, 29934, 21320, 18048, 27037, 35564, 33754, 19309, 3491, -9745, -8844, -1334, 7009, 6872, -3600, -7168, 5268, 12505, 4822, 1730, 27691, 53815, 70958, 83924, 94938, 99779, 96414, 94830, 98316, 97470, 78177, 47250, 20914, 23047, 27832, 15759, -2255, -4707, -5329, 32655, 104329, 174615, 217412, 216254, 176118, 123901, 74919, 25947, 27516, 81119, 98787, 60673, 23912, 109165, 154727, 116914, 36883, 152474, 236942, 194635, 56433, 246037, 427329, 400886, 179677, 495571, 941786, 971535, 324324]
6036A672693K791675L421961L416387K689371J351840l05817j889571l031816
6028A0116723l500866l256168I13583l38177M25742k29911B84127l2920J86602
6019D37809o5010A55113m4270J26115j2907A03902D2260R3426J2923o0263C6373
6007G8508P474m2573A0563M5143J1835k3898j2791K4493M996k7582F565K9931
5995C6496J1567j6785B112J6261J4308p738H301N108Q327o798E508Q675K676A483
5980b4719i199a121A427e276b43F223B154a4862j4750f668D675j807A2M18J838
5965B268H71M469O243m6n369M407J2909Q537L568J6229L5926M8426M3583L1813
5951B11566J2659p195k4112l6087m3646m3674l4061j3050J140k553A0399B452
$$ y = [1672693, 4464368, 7886329, 11302716, 13992087, 15343927, 15038110, 13148539, 10116723, 6615857, 3359689, 913583, 575406, 1001148, 771237, 284127, 251207, 437809, 372799, 155113, 110843, 236958, 224051, 103902, 42260, 135686, 148609, 88346, 36373, 78508, 85982, 43409, 10563, 55706, 67541, 43643, 30852, 55345, 60341, 32759, 6565, 36496, 48063, 31278, 2112, 18373, 32681, 24943, 8301, 13409, 21736, 14938, 5508, 14183, 16859, 1483, -24719, -9199, -1121, 1427, -5276, -243, 6223, 2154, -14862, -29612, -6668, 4675, 2868, 12, 430, 2268, 871, 5340, 11583, 11537, 6168, 10575, 23484, 32021, 35589, 51818, 87744, 136170, 179753, 211566, 224225, 217030, 192918, 156831, 113185, 69511, 35450, 22400, 23540, 20987, 10399, 2452]
5938F616J221A822d634C416P721J062l103l996A183d397k625b96C740k14r91J542
5922D077R92A358e547l248j369k345L55d416a21l57l521j260J48j581L23E159
5905B6518K1327J6506Q604n23q491j3293j6740A5148c106j525D560M612P48k070
5891G850k077j680A774b239l389K495e3G72J93j6K8d45q42c18H02h95m612l505
5873i012K51L4K986C739J5873J8720J7935J1389M490l810j1195j7178j7113I856
5858E557Q57k389b69o636K564H56J882A320c153m704k477l769k21l685l521J162
5842b0368Q97K137j98J489N429M598m989k711l914l965l567Q350M008a839A715
5826b867o579l745e638a893K57l328m019N5c033c92r24k283k357r44J093j71M04
$$ y = [6616, 7837, 1822, -4634, 3416, 11137, 12199, 9096, 5100, 1183, -4397, -7022, -296, 3740, 3526, 2535, 4077, 5069, 1358, -5547, -8795, -10164, -12509, -12154, -4416, -121, -478, -3999, -5259, -5111, -6692, -6369, 5159, 26518, 47845, 64351, 72955, 72432, 63941, 50648, 33908, 15148, -3106, -4631, 4560, 9172, 9920, 7850, 5773, 4093, 1774, -2239, -5628, -3133, -53, 772, 965, 949, 977, -445, -1287, -318, 802, -895, -5507, -9012, -8761, -8727, -5741, 3739, 19612, 38332, 56267, 67656, 72146, 68336, 57141, 39963, 22850, 9856, 5557, 6414, 4025, -269, -6905, -4341, 856, 2738, 1320, -3153, -7857, -10334, -14103, -14324, -18009, -21530, -20368, -19471, -17334, -17532, -16043, -10614, -6016, -11005, -13716, -17630, -21595, -25162, -16812, -12804, -1839, 1715, -2867, -9446, -13191, -5638, -1893, -1636, -4964, -8983, -8928, -3033, -392, -1316, -3599, -5956, -6900, -5807, -5978, -5574]
5809e574J560O00j802J956q30m540J329b971B036b4794j885k239P120g675A5326
5793B1847k563I588c329k6252o695N922a4408f344F412a6006K377d023D033K392
5779F425r75A772b403J064A614O623J0048J3076J4407R270M279j553o386r323
5765D2055j0239j0135j0429A394a008D393P342P513K028j421l519k536J732M812
5751B0344O541K121k838r103C246a1986d939E443O135J589j230m031C305b296
5736a0021l218J421K953c827A468P295Q613M260L288l92k685o032m383m502l056
5721C874j815A74a255l778k431L724A466K328j70o8J070M55k293b437m669K827
5705d279J626k283l887c621H39N15n34a512j112L95F59J501q9E24i95A14K843
$$ y = [-5574, -4014, -3414, -5216, -3260, -4090, -8630, -7301, -2971, 2036, -24794, -26679, -28918, -21798, -7675, 15326, 21847, 19284, 9588, -3329, -29581, -36276, -30354, -14408, -6344, 6412, -16006, -13629, -4023, 4033, 6425, 5450, 1772, -2403, -1339, 1614, 8237, 18285, 31361, 45768, 55038, 59317, 57764, 51378, 42055, 31816, 21681, 11252, 1394, -1008, 4393, 11735, 19248, 21276, 19855, 16336, 13800, 15532, 20344, 26885, 29006, 26168, 17065, 3246, -11986, -4939, 5443, 11578, 13167, 11937, 7906, 3305, -2296, -10021, -13239, -11818, -8865, -3827, 1468, 8763, 17376, 21636, 24924, 24532, 21847, 15815, 11432, 6930, 3874, 2059, 174, -1255, -5033, -7464, -3740, 1466, 3794, 3624, 3556, 4626, 5081, 2788, -2437, -7106, -4279, -2653, -4936, -8823, -3621, 839, 1354, 820, -1512, -2624, -2229, 659, 2160, 2071, 524, -995, 114, 2957]
5688B957q03b453q671d592C294L818k057c63k104F961J2225J2658M800R24l761
5673C3807p86q782p508F953G46c187B93L324M174K663O4m63m8J65j278k995D45
5655f994j061h18E567M830P82j846C706b855r17C188M418j789i11m372C096P197
5639A0293J872E647c426l316F65N695M331L789J619m062B926f626B814P254P83
5624A0851D008g166g14A2103Q448N57p736A566I5J0218O498J287l385m174Q09
5609A1348N860O216L419p85n642p640k524N226P335L442j059m905l339Q17J487
5594A9256j472k590l179j222j217j904K925P257N105j241m406n497J294P653P558
5579B8320N483M91m280p069j466N870L379l460p764J3P947N81j2296e796E008
$$ y = [2957, 2154, -2453, -11124, -4592, 3294, 7112, 5055, -363, -2467, 6961, 19186, 31844, 36644, 37568, 33807, 33021, 24239, 16731, 6953, 746, -3187, 293, 3617, 7791, 10454, 10518, 10055, 10007, 10172, 8894, 5899, 445, -6994, -8055, -818, 5567, 10397, 11179, 9333, 3706, -2855, -3772, 3188, 7606, 5817, -911, -5283, 3096, 10293, 12165, 5647, -3426, -6742, 665, 6360, 10691, 14480, 16099, 12037, 2926, -6626, 2814, 10068, 10851, 4008, -7166, -714, 12103, 20551, 21108, 13372, 1566, 95, 10313, 16811, 18098, 14713, 10539, 11348, 17208, 23424, 26843, 26058, 20416, 12776, 10252, 15478, 22813, 26255, 25196, 20291, 16952, 17769, 19256, 17784, 15194, 12015, 10793, 9576, 7672, 10597, 17854, 22959, 21718, 17312, 11815, 13109, 20762, 28320, 33803, 34294, 30014, 22945, 21479, 27349, 30728, 27268, 19504, 19517, 27464, 28045, 15749, -5796, 5008]
5563C1847J6825N051m999o184q665r159r589k301Q288N794o257I906O323J4943
5549C1172J1577n684j5441p935J7222J9203J9775J1596K763J058J358J1507J5868
5536A14039J1893J2933J6999J3124R795k247O84J3352K4679J6845j1799m0896
5524A79401m9966E6905j2806N5915N6368M0282N0910L2553K5105J0820q869m1821
5512B65362l6713k9407M9650Q8071M3137K2395p485M5980P7540O4560K0983o250
5500E97823M0330J35031J93340K16255K16428K87722L50248N05771Q66807J403959
5490D813714J912580K170744K056532J527061O50008m30946j527847k452467l039316
5481E680063B441057E01400K346018J555048P05020n1528n46351p75228p76072
$$ y = [31847, 48672, 53723, 48724, 42540, 33875, 24716, 15127, 12826, 21114, 26908, 20651, 9906, 16229, 31172, 42749, 37065, 21624, 13689, 30911, 50114, 69889, 81485, 84248, 85306, 86664, 98171, 114039, 125932, 138865, 155864, 168988, 178783, 176536, 177220, 190572, 215251, 232096, 220297, 179401, 129435, 56905, 44099, 100014, 156382, 196664, 247574, 280127, 305232, 316052, 307183, 265362, 228649, 199242, 248892, 336963, 380100, 402495, 395010, 440990, 518530, 583090, 604073, 597823, 638153, 773184, 966524, 1182779, 1399207, 1686929, 2037177, 2542948, 3409755, 4813714, 6726294, 8897038, 10953570, 12480631, 13130639, 12699693, 11171846, 8719379, 5680063, 2441057, 501400, 2847418, 4402466, 5107486, 5055958, 4509607, 3734379, 2958307]
5472B958307o42391m82255l52674k60776j90633j39598j11841r3830p5495p9760
5462E29054o6163o3380m9896j4211k5361j8742j9485j7636k7761j5892j6216j4527
5450A79784j0437m760l258n128r336j1410q465n073p072q548r796q267k550k045
5436H3639k716j77P400R402O440L810O334K238p401j3846n615J0340J6671O892
5422A23411j0368k0947k0088p768r41l003p546n986o00N180N339J59q516j0705
5408C7621p924l570q59P872K0487K0909R121l960j4812j6843j3729j1557r653
5395A3103P042K0849J5407O639l139p319l372l039j1754j7088E845N708J252n380
5381G425c060A0080J8396J5171P241l763j2344A4966B84L671J3998R412Jq317
$$ y = [2958307, 2315916, 1833661, 1480987, 1220211, 1029578, 889980, 778139, 684309, 608814, 529054, 462891, 399511, 349615, 335404, 310043, 291301, 271816, 254180, 226419, 210527, 194311, 179784, 169347, 164587, 161329, 156201, 146865, 135455, 126990, 121917, 114845, 106297, 96501, 88234, 85684, 83639, 80923, 80746, 88146, 97548, 103988, 107798, 114132, 116370, 108969, 95123, 89508, 99848, 116519, 123411, 113043, 92096, 72008, 64240, 63299, 60296, 52750, 46764, 46164, 51344, 56683, 56842, 48326, 37621, 29697, 26127, 25268, 33140, 53627, 74536, 83657, 79697, 64885, 48042, 34313, 22756, 13103, 20145, 40994, 56401, 63040, 59901, 52582, 49210, 46171, 34417, 17329, 5845, 11553, 12805, 7425, -3060, 10080, 28476, 43647, 50888, 47125, 34781, 14966, 284, 3955, 17953, 27365, 27366, 19049]
5367A9049H629m263N781M259n76o586f47B368P250O741L936M02k139m36n90k949
5351A4583n132l159J13L176N285Q946Q680J227j2727A366L4441M8719M4901L4718
5337A64145K2113Q519q826k4567l9702m3882C5009A0620J809M795P93J670J915
5324B1602k014m369k438p09m40L58K76j504j070M705O183J945o12L414P103K576
5308C5006p902A2603l422J4118R650j211j0257j0531j546J760l861l153R918J1592
5294B5660K329r154q680O856J3309R308O437P621N079q58n648k295L007L424m414
5279E1981q994K431J7407J6598J1206P218R102J1555J0435K493j3697k6911k0339
5266G0485K251J177j9066Q829P3488R0391O8705K9978p03n743N493J2935K56l0203
$$ y = [19049, 8629, 4366, 10147, 14406, 13830, 7244, -647, 2368, 9618, 16359, 20295, 20697, 18558, 18122, 17532, 14583, 9451, 6292, 6405, 9581, 14866, 23812, 32492, 33719, 20992, 1366, 35807, 84526, 129427, 164145, 186258, 194777, 185951, 161384, 121682, 77800, 35009, 10620, 12429, 17224, 18017, 19687, 21602, 19588, 15219, 12781, 12072, 11632, 11990, 12266, 10762, 9692, 14397, 20580, 22525, 21913, 25327, 32430, 35006, 27104, 12603, 9181, 23299, 32949, 31738, 21481, 10950, 9404, 11164, 7303, 4150, 14068, 25660, 27989, 18835, 10155, 17011, 30320, 39628, 46065, 53686, 58765, 57907, 52259, 49964, 52971, 56395, 51981, 42987, 45418, 62825, 79423, 90629, 97847, 106949, 118504, 128939, 131432, 117735, 90824, 70485, 72736, 73913, 54847, 63676, 137164, 227555, 296260, 326238, 325535, 319792, 325285, 338220, 338476, 308273]
5252C08273o5209l4309R9448J43872P7813N0184L17082P21742R52891R62813P54223
5241D288823L65066j11236n65096q87124j005476q89211n32910r7657j8371j19494
5231D27314j42695n2589P637k6703n7878k2459Q180j0079l3515k3503O123K843
5219H2676k1312l0622k326K983p76L1692M0761J5625k1120m2371k4240J7629J5151
5206F3750J3271K2959J1338j8065l1820J9750L9875J904k9875O833M8236J8086
5194A66242m503P4554J30165O6168m3304J04836M79106O62731O49763M83646K20364
5183B989768o9478k92976l44628p3435M14773O91210O17352K97906j28344m81661
5173C620487o30509m80758j97126j08227k52436m63387n58195m23642o8208M1207
$$ y = [308273, 243064, 208755, 308203, 452075, 529888, 580072, 897154, 1618896, 2571787, 3534600, 4288823, 4653889, 4542653, 3977557, 3090433, 2084957, 1195746, 662836, 565179, 546808, 427314, 284619, 232030, 239667, 212964, 155086, 132627, 140807, 130728, 97213, 73710, 79833, 82676, 61364, 30742, 28416, 31399, 30623, 62315, 103076, 118701, 97581, 55210, 30970, 48599, 63750, 77021, 99980, 111318, 93253, 61433, 81183, 121058, 122962, 93087, 99920, 148156, 166242, 161739, 236293, 366458, 432626, 389322, 494158, 973264, 1635995, 2285758, 2769404, 2989768, 2920290, 2627314, 2282686, 2209251, 2624024, 3315234, 3932586, 4230492, 4102148, 3620487, 2989978, 2509220, 2312094, 2203867, 1951431, 1488044, 929849, 506207, 437999, 479206]
5163D79206o5107j55140o3300L1884j6716q1195k2473O4308L5911j2313n0069
5152A44996n0485r099J1397J74m300r936J0506M0367L0932J1177p567m128J8478
5139A82512K6901K1069L9648R7396J53735J86710J90334J74487J38060Q3184n106
5128A288930q5792j44682j81626j93699j80034j44037q9737m1731l5146n5373
5118A37073E5621B4406K9254L5644J0893j1242j8797k886K08p836j0492j7290
5106C1862G655a0549A4256K1883J1932J367o493q142k198J826M442o65o045j2184
5092A9979G489M846J2091O141j818o979q657F355r93K956J601j875N78L387K570
5077A4579k21j677p54P33M25n44j421k817l247j989L034M173J295k114P76M914
$$ y = [479206, 414099, 258959, 195659, 227543, 210827, 129632, 107159, 171467, 207378, 195065, 144996, 94511, 85412, 96809, 96983, 92683, 82747, 93253, 133620, 164552, 175729, 168162, 164034, 182512, 209413, 230482, 270130, 367526, 521261, 707971, 898305, 1072792, 1210852, 1294036, 1288930, 1203138, 1058456, 876830, 683131, 503097, 359060, 269323, 227592, 192446, 137073, 55621, 24406, 53660, 89304, 100197, 88955, 70158, 67272, 67480, 59644, 49152, 31862, 7655, -10549, 14256, 36139, 48071, 49438, 42945, 34803, 32605, 34431, 38873, 38208, 32163, 19979, 7489, 12335, 24426, 30567, 28749, 21770, 13113, 6355, 5362, 8318, 9919, 8044, 8622, 12009, 14579, 14358, 12681, 11927, 12660, 13085, 12541, 11120, 8303, 5056, 3067, 6101, 10274, 11569, 9455, 10231, 15145]
5061A5145L593k329p261b692B248J5015J2651J0330Q069Q475J0384J3626J5094
5048I5892J3105Q310R22p955j5383j8917j7902j2463l543O25N724J7226L0559
5035I6200M0336M2124L4648J9480j350k1144l7483m5209m2562l1628j7539j0227
5023B5646q800m326L810M293j128o035F345B952J75o77L33L077L444J929l85l632
5007G216A407b965N76g43b49k30l19r7C06K563L241R36k392h89n832L360a628
4989b078h63B960K042j108A354e50a51o17k293j743M44J900h10Rm36M04B279M014
4971F293R09k632i35n045a697I45a47l930m40g96a56j418j372a379F17B95b340
4953e173b098A997J882j268a436n217c154a429j411l150J584c71B335J332o87
$$ y = [15145, 18738, 16409, 9148, -2692, 2248, 17263, 29914, 40244, 48313, 56788, 67172, 80798, 95892, 108997, 117307, 118229, 110274, 94891, 75974, 58072, 45609, 42066, 42691, 48415, 65641, 96200, 136536, 178660, 213308, 232788, 231438, 210294, 172811, 127602, 85040, 53412, 35873, 25646, 16846, 12520, 16330, 20623, 19495, 13460, 6345, 2952, 3127, 2450, 2783, 5860, 9304, 11233, 10848, 7216, 1407, -2965, -2389, -743, -249, -479, -798, -895, 306, 2869, 6110, 7046, 4654, -889, -6721, -3361, -1628, -2078, -863, 2960, 5002, 3894, 1354, -550, -151, -768, -3061, -4804, -4360, -2460, -810, -801, -1237, -833, 2279, 6293, 7202, 4570, -935, -5980, -1697, 945, -147, -4077, -4517, -796, -156, -1574, -2946, -1379, 617, 295, -2340, -5173, -2098, 1997, 3879, 2611, -1436, -6653, -3154, -1429, -2840, -5990, -4406, -371, 2335, 3667, 2980]
4938B980G48a959n04R35q77j972j422J063b277I40K925K145o68B281a251l84d83
4920g89j066R0A522J922Q95J403J093Q38K58j53j71J3m47q85k138A046a209b69
4901A446L8g92l744j687K970c09A878n58b575m096a425B893J066j772d86j124
4885a610a20F47f99l332k127J853b049i16l54b18j41J26m12k210k729J049a755
4867f71m01P0q69j522k478J072a620a33p73k346k385J050J855J293L95q00l28
4850b172b32B018RA7c980k429R55J276a164A499J244q02b6j639k970j992L237
4833c390d37I84b74l045l352b930J386l72M55E56P24a57k799j749r82k44J247
4816d684J674P79g59E47P84A71b884l755J738J240k39M13q65l37d15D075K799
$$ y = [2980, 748, -1959, -2463, -1528, -2405, -4377, -5799, -4736, -2277, 940, 3865, 6010, 5342, 2281, -1251, -1635, -483, -789, -1855, -1765, 1522, 3444, 4339, 5742, 6835, 7673, 7931, 7778, 7607, 7620, 7173, 6288, 4150, 1046, -1209, -269, 1446, 1484, -792, -4536, -6223, -3253, -309, 1878, 1320, -2575, -6671, -1425, 2893, 3959, 2187, -486, -1610, -120, 647, -699, -4031, -6158, -4305, -2049, -916, -1270, -218, -359, -233, -645, -2855, -5584, -4535, -1755, -671, -1072, -1002, -1871, -3393, -5871, -4799, -1620, -133, -906, -3252, -5637, -4587, -2732, -1439, -1044, -1844, -2172, -232, 2018, 2027, 17, -3980, -6409, -5454, -4178, -1164, 1499, 2743, 1941, -26, -1665, -4635, -6627, -3390, -437, 984, -274, -3319, -6671, -2930, -1544, -1916, -1461, 556, 1280, -157, -2956, -4705, -5687, -5931, -4684, -3010, -2231, -759, 547, 1331, 171, -2884, -6639, -4901, -3661, -3900, -3487, -4352, -4689, -415, 4075, 6874]
4799F874M9k653b26k438J151E8e30j112l0O87l84j628l225l10b226F64j1b212
4780c628a77B690o91a513l441b064G89O7e83j908j423P88i41D59a685k589J277
4763b997a005k65k720m094L384K064l07j626m49q57j917l0L311b250P93M18l58
4746a397j219r28J398A83Q67d17k163j839r80a365C168K312p86I95B27L495J664
4729E386k528a171l1B46a184m389j11a966R45k922k047Q74j839c106C626M596
4713H222K55l944a586l351b328P48g34K91j942k446i14B694M31F11b164J7b52
4695B960M605L487M3m011B040i52l21L3c14A020c06n205J199B444L295j118f39
4677e189a029A026J701K380N94B245d609G35L442j605b647a189C390J019A988
$$ y = [6874, 6923, 4270, -226, -2664, -1513, 58, -530, -1642, -1672, -985, -1369, -2997, -6222, -6532, -2226, 664, 653, -2212, -3628, -177, 2690, 1999, -1513, -4954, -2064, 789, 856, -583, -2491, -3914, -3126, -941, 459, -1685, -4274, -2997, -1005, -1270, -3990, -8084, -4700, -2636, -2943, -4569, -5018, -5875, -7792, -7822, -4511, -2250, -1457, -1039, -1397, -2616, -3544, -2146, 183, 1050, -417, -2580, -4419, -5399, -1365, 3168, 5480, 4694, 995, 227, 3722, 5386, 2858, -1171, -1202, 246, -1184, -5573, -5684, -1966, -1021, -3943, -5990, -5116, -6955, -3106, 3626, 8222, 8477, 4533, -1586, -4937, -2328, -1580, -734, -443, -2385, -4831, -914, 2694, 3125, 611, -2164, -2147, -252, 2960, 7565, 11052, 11095, 7084, 2040, -952, -1273, -1240, -314, 1020, -306, -5511, -4312, 2444, 5739, 4621, -639, -5189, -1029, 1026, 2727, 5107, 5701, 2245, -4609, 735, 4177, 2572, -2647, -1189, 3390, 4409, 1988]
4661B65J24b245m420a162B235F16e295G41O026Q98C468a493A84J494L30M010M121
4644A0139m17C353c400B129K680B039m69M528M96H62a673G156L972k917B071F96
4627H79c327a537G842M677j926l473K882K468m141a835a42E769k745b757B171
4611E576F06g015F206R113q43E023A853O038j450b339B454R704K30C282J726J0111
4595A5119J704G800B006J2622N300m156l000N449J453n198J128J6368J8158K3286
4581G3416L4375M2179L8077K3502L710j7528l7066m8138m3972k3785p989j1262
4569B5519j0118Q993O146r404D468J4637J1224o172j1919J1482J0299p962G880
4555B4855J7370k923A5879p499J9966j757E035J4960K2646L56k0484j38K3317
$$ y = [265, 389, -2245, -6665, -1162, 2235, 616, -5295, 741, 6767, 7665, 3468, -1493, 184, 1678, 2008, 6018, 10139, 9722, 3353, -3400, 2129, 4809, 2039, 1570, 6098, 6594, 862, -1673, 7156, 11128, 8211, 2071, 696, 879, -3327, -1537, 7842, 12519, 10593, 7120, 10002, 12470, 8329, -1835, -142, 5769, 3024, -2757, 2171, 5576, 606, -7015, 6206, 15319, 14476, 5023, 1853, 7891, 6441, -2339, 2454, 12158, 12388, 3282, 5008, 15119, 16823, 7800, 2006, 14628, 19928, 15772, 12772, 18221, 19674, 14476, 15604, 31972, 50130, 73416, 107791, 149970, 188047, 211549, 215259, 197731, 160665, 112527, 68555, 44770, 36781, 25519, 15401, 24394, 30540, 21136, 4468, 19105, 30329, 24157, 12238, 23720, 34019, 26057, 7880, 24855, 42225, 39302, 15879, 8380, 28346, 26589, 5035, 19995, 42641, 42997, 22513, 22375, 45692]
4542D5692M555j5248l304J6664J627j3870J2051K5309j91l1617j6045L6848J0903
4529G3374k7388k2142L8639J4686l0022A2194N1750K2514k6863B2589N0797K5597
4517I8983l0535B2720O8218L8080k9867B2986O1538N1723k4410C4630O3180O3379
4505A61189k4305D4331P1819Q3608k1581F4996O3513J09948j4510H4730N8457
4494A43187J52399j096A29634M6997K05782J9808B00952J8683K91731N2631k59760
4483C04237k7957M40800J33175l33545j52439O92069K94570m30184l10788J205212
4473A815150P47989m14011n38281K030824J706398j254909A999443J1831722J6661858
4464C0493023J9003418J7662328J2500627M440254m667958j2666748j7738659
$$ y = [45692, 50247, 34999, 31695, 48359, 49986, 36116, 48167, 73476, 73285, 41668, 25623, 62471, 73374, 45986, 23844, 62483, 77169, 47147, 12194, 63944, 86458, 59595, 22589, 73386, 98983, 68448, 22720, 90938, 129018, 99151, 22986, 84524, 136247, 111837, 34630, 97810, 161189, 136884, 44331, 116150, 199758, 178177, 64996, 128509, 238457, 223947, 84730, 143187, 295586, 294490, 129634, 176631, 382413, 402221, 200952, 219635, 511366, 563997, 304237, 276280, 717080, 850255, 516710, 364271, 1056340, 1350910, 920726, 609938, 1815150, 2563139, 2149128, 1610847, 3641671, 5348069, 4093160, 1999443, 13831165, 30493023, 49496441, 67158769, 79659396, 84099650, 79431692, 66764944, 49026285]
4457D9026285j8963696A3519874A871407K211468J146288j747258A529880O54729
4449B184609L77469p88384E44822L94588M22108l11861C50300J76254L25951j43592
4439G08913B66579N1808K50833o5840B05041P004J99911k6282A73070m5175J66823
4428B94718k04A44476m6926J30685O470A15932m9500J18874J7993q8533D4987
4416A44325K7399o2895B7785P1423K7205m8482B2377P2254K4168m0160A8784N8779
4404G7563K7978l0840A9098M2652K7640k0461A5070K8522K9560j2466B3550J8775
4392D2325K3269j4222G072K8723K8618o628B4641N534K6345m241B0869q287K6757
4379C9339P1A7069J749K1515j102A4433m063K3831K503A5561G060K4270O450j3781
$$ y = [49026285, 30062589, 13519874, 1871407, 4082875, 5229163, 3481905, 1529880, 2184609, 2562078, 1773694, 544822, 939410, 1361518, 1049657, 350300, 526554, 852505, 708913, 266579, 318387, 569220, 503380, 205041, 212045, 411956, 385674, 173070, 127895, 294718, 294514, 144476, 97550, 228235, 234705, 115932, 66432, 185306, 203299, 114766, 44987, 144325, 171724, 108829, 27785, 99208, 126413, 77931, 22377, 94631, 118799, 78639, 18784, 77563, 105541, 74701, 19098, 61750, 89390, 68929, 15070, 43592, 73152, 60686, 23550, 42325, 65594, 51372, 7072, 35795, 64413, 57785, 24641, 30175, 56520, 52279, 20869, 12582, 39339, 39410, 17069, 18818, 40333, 39231, 14433, 10370, 34201, 36704, 15561, 7060, 31330, 37780, 23999]
4365B3999j0029J6300N718j3423A140J7612R514o553m760J2361O017j1085H355
4351B3220J2557m730A1689J4845L8892L7035L3934L1606K7096J7674K261j8292
4339A96740l8152n1536n3256B0374L124N03q197R98M593n194A309P361J1458K27
4325B0355r463l190P110j159A663J815J2528K980p232C323M242K473l554K002
4311H486P182M70p674B644J0122M678l567E896j807K874j494r95L589l25B227
4295i7H667M665k815A481B23O122J808l14J018K37m197b915C124M529j856D18
4278H76K998j232b754g31C991p27a993C371O346J893l209l039J232J146p61l70
4262F609K09k444b175r49B475Q49a914j71E665M373J029j101k672k409e01l479
$$ y = [23999, 13970, 30270, 35988, 22565, 1140, 18752, 28266, 21713, 16953, 29314, 35331, 24246, 8355, 23220, 35777, 31047, 11689, 26534, 65426, 102461, 136395, 168001, 195097, 212771, 215032, 196740, 158588, 107052, 53796, 20374, 23498, 24001, 15804, 16802, 21395, 16201, 1309, 8670, 20128, 20355, 10892, 7702, 14812, 13653, 1663, 3478, 16006, 18986, 11754, 3323, 7565, 10038, 6484, 8486, 15668, 16138, 8464, 2644, 12766, 17444, 13877, 5896, 4089, 6963, 5469, 4474, 8063, 7738, 2227, -97, 8667, 13332, 10517, 1481, 223, 6345, 8153, 7839, 8857, 9094, 4897, -2915, 3124, 7653, 5797, 418, 876, 3874, 2642, -2754, -731, 3991, 3264, -1993, 3371, 9717, 11610, 8401, 5362, 6594, 7740, 6979, 6609, 6818, 4374, -2175, -3124, 2475, 3324, -1914, -2085, 5665, 10038, 11067, 9966, 7294, 4885, -501, -3980]
4246c980B184K505k103b296j722a992k157e21C270J605k009c189k61D83J197e10
4229b306P60m76q91A237K274j166b010j701E11J744q15c37o63j234q26J449f85
4211a029b61D226L122j050F00g08F112K625j592B710c54A334J895R26L6j528G4
4193a989M65g01j685j87Q85M72n81k64A283J871q32e6j183b86n40r41H23K356
4175C179N52n53j504m83k59R17J427O90q77r50J182K297P13j881I37b484k058
4158d542J82J058R43J13o78o63J114g36A541K933K498N46j074j734j116j481a072
4140f062K729d25D93j82e20j030N93A790K656J159l87j680A658a49j361O33G83
4122A817o42a159j490i36J49j773k545l01j8O25Q17m43j597K797A390L539J240
$$ y = [-3980, 2184, 4689, 2586, -2296, -4018, -1992, -4149, -521, 3270, 4875, 2866, -3189, -3450, 483, 1680, -510, -2306, -1546, -2022, -2913, 1237, 3511, 2345, -2010, -3711, 511, 2255, 1440, -337, -1000, -2234, -3060, -1611, -685, -1029, -261, 4226, 7348, 6298, 600, -708, 6112, 8737, 7145, 2710, -354, 1334, 3229, 4155, 4191, 2663, 74, -1989, -1524, -701, -2386, -2573, -1688, -1216, -1797, -2061, 1283, 3154, 2322, -56, -1239, -286, -826, -1767, 823, 3179, 3731, 3178, 1674, 1191, 932, 1849, 3276, 3966, 3089, 2139, 3321, 5618, 6331, 4450, 937, -2484, -4542, -4360, -3302, -2359, -2246, -2924, -3587, -2473, -736, 1541, 4474, 6972, 7518, 6444, 4710, 3594, 2113, -1072, -6062, -3333, -425, 493, 311, -520, -1550, -957, 1790, 4446, 5605, 5218, 3538, 1658, -149, -1510, -877, 783, 1817, 1175, -1159, -2649, -936, -787, -2560, -5105, -5406, -5424, -4799, -3982, -4425, -6022, -3225, 1390, 4929, 6169]
4105F169r45j516k34N54p03n10L20k61n22j41N20K11p35F98i96p71L40M89K0j027
4085a945k243J267D77J528n18e72j828j71e36C01d57j299K35H00J512J02j015
4068A399F32R54J010q12e86j213A561J937L84K78M09O88L88l14j496j021l71m9
4050B394p41A07h77b76A156M26E74b029k489k6L55P98a690b58A27i42j533L68
4032b107g30J15j069k098j623K676i97K61m26B03J936N77o13p78M96J108L63j341
4014A951h9j880l92j27K49K11K10K04J87J8l50K50c8A114m57d25j466n73J028
3995a436B79K181K119J368L9j084j671j570c03k061p95l10j101K14J890a188d19
3977c02q74j092m25K95j76o24p6Q18M36M75d55E82N88E26a369j642a58A796R94
$$ y = [6169, 5224, 3708, 3474, 4028, 3325, 2815, 3135, 2874, 2352, 2211, 2731, 2942, 2207, 698, -996, -1767, -1427, -938, -918, -1945, -4188, -2921, 477, 2005, 1487, -572, -2400, -2571, -536, 301, -457, -1756, -1521, 800, 2312, 2414, 1399, 632, 1586, 2596, 1784, -586, -1799, 1561, 3498, 3882, 4160, 4569, 5257, 5645, 5331, 3835, 2814, 2443, 2394, 1653, 107, -877, -276, 1156, 1582, 574, -2029, -4518, -4544, -4189, -3391, -1690, -258, 127, -942, -2475, -2107, -730, -615, -1684, -3782, -5405, -2729, -997, -736, -1162, 203, 2139, 2716, 2103, 1325, 1821, 2929, 3292, 1951, -89, -1969, -2361, -2488, -2239, -2028, -1818, -1614, -1427, -1409, -1759, -1509, -38, 1114, 657, -425, -1891, -2464, -1436, 279, 2460, 4579, 5947, 5986, 4902, 3231, 1661, -303, -2364, -3159, -3469, -4570, -4356, -2466, -1188, -419, -302, -1176, -2268, -2693, -2398, -2574, -3198, -3274, -2456, -2020, -1545, -455, 582, 1170, 526, -1369, -3011, -158, 1796, 2790]
3958B790J79j13j97p09H93b89m31m38m45K10O34A71P81O06j5m30f61j860j873
3939d394R45a452C35J833J509J322P88r11j436A116a957j667J570a72A150J517
3923B667O04j35n20o11I71a221k368j284Q65a859g96K36h2A027J166N97n8j173
3905A559e7j720j581n10J321N58K61l40j060r87O53L74k0N46m10L67M50a46B126
3885C713K57j070A239d59j242j234j428j432K86K743B6J978N95k70q18C25e11
3867b19C68J88A19E2J55M87J029O69K21m56q60A59a754k50J81O11L22l44o18N31
3847a321A476K717K422J182J28o94j516k100A519c3r91n45k05n51j77J65K93k6
3829b070l34l98Q8b67B773L255L178J715l93k108l274A355a515j407L23N82L72
$$ y = [2790, 2969, 2856, 2659, 1950, 893, -289, -720, -1158, -1603, -1393, -759, 171, 952, 1558, 1543, 1113, -661, -2521, -4394, -3449, -1452, 335, 2168, 3677, 4999, 5787, 4876, 3440, 1116, -1957, -3624, -2054, -172, 1150, 2667, 3271, 3136, 2616, 2005, 971, -1221, -3589, -4873, -4008, -1859, -796, -560, -82, 1027, 2193, 2790, 2732, 1559, -57, -1777, -3358, -3868, -2547, -1989, -1728, -2068, -3128, -4115, -3462, -3088, -3108, -2562, -2972, -2605, -2155, -146, 2126, 3713, 3970, 2900, 1239, -459, -1701, -2935, -4363, -5795, -5509, -2766, 26, 2004, 2599, 2329, 1511, 325, -511, -219, 368, 556, 119, 52, 207, 694, 1723, 2392, 2613, 2157, 1297, 159, -1754, -2004, -1823, -1212, -890, -1234, -1852, -1321, 1476, 4193, 6615, 7797, 7925, 7231, 5715, 3615, 1519, -33, -1024, -1569, -1774, -2325, -2502, -2337, -2044, -2070, -2404, -2802, -2714, -267, 2773, 6028, 9206, 10921, 10528, 8420, 5146, 1355, -1515, -2922, -2599, -2017, -1645]
3812a645R8l0j58q5n52k39N12o0r26j261R43J326J025O2j007r70N21J113e5A641
3791B969L74l70I95e79H71K100J049o72A406a095j914Q69f19D13B05a303j678
3774b981j81J544g50A37P15Q82J70p89b38j237k50J77j71K31K49o91j124p03P97
3755b960R92O13L63k93o61n43J229A88J038O69L94L51o70r49a59j157j014J29
3737b201j65l51k11a391A129J005m70B6a728P81M65l45j098j038o68N85L85L29
3719b332N56Q57bE56K52k49i0o70K44F8P09J024P92O58L49O6K3L67J92j17o31
3698C500p57H56g67p14L01b65H01J347J132M32k60j128p46J107K001K004L75n33
3680F532j019o35n87q48A700B7f11q60p53j086j563j461J9J090K263A16K141O77
$$ y = [-1645, -1547, -1577, -1735, -1820, -2372, -2611, -2099, -2159, -3085, -4346, -3403, -2077, -1052, -990, -1997, -2967, -2446, -1333, -55, 1641, 2969, 3343, 2973, 995, -579, 871, 2971, 4020, 3348, 1406, -1095, -3009, -2140, -619, 413, 205, -1303, -2981, -3162, -1618, -750, 137, 852, 1734, 1904, 1115, -238, -1475, -1725, -1548, -1719, -1488, -1239, -1930, -3054, -3757, -2960, -1968, -1355, -992, -1285, -1946, -2489, -1260, 188, 1226, 1895, 2289, 2640, 1970, 1021, -159, -1316, -2330, -2201, -2366, -2717, -2928, -1391, 1129, 2134, 1664, 26, -1728, -947, -482, -827, -1925, -2963, -3631, -3046, -2661, -2332, -1776, -919, -2, 556, 808, 559, -90, -760, -516, 68, 777, 1801, 2593, 3251, 3600, 3666, 3689, 4056, 4248, 4131, 3500, 2743, 856, -767, -1481, -1180, -265, 801, 2148, 3280, 3712, 3452, 2324, 1578, 2685, 4686, 6690, 7065, 6532, 5513, 4878, 4291, 3443, 1700, 27, -611, -1471, -2224, -3310, -4873, -6334, -6315, -5225, -2962, 116, 2257, 2934]
3662B934J90j002E54a28D40L89B26a392k015j449l16J07J365J679f70a37Oo89
3644h20o84k92j03L86M47k49p93j504h71A346J412o3r61F89i4o33r01j323n95
3625c546J385a05A678J728J325P44j13j590j773a85k299K21i44M56m65q63j105
3608b921j737L35a892H30K470J363j50r39j303H49i51j638N97b87H49M15j46K11
3590A329N02O40K23n03G86a290k313J345a115M28a07A509J970J715L77m31j068
3573D072j354j049o71l40b2j128j769k011J266J359O99K25K25R5c38B92i2n38
3555f30n68k57K52N87A30f69j244j488j161K57R35P00M34N15j93J19K35J39l64
3536a785r90p90J355h93h2C77L85L98K13C67g26j38P4c1B014K200P61J55p20p95
$$ y = [2934, 3124, 2122, 554, -128, 440, 829, 226, -1392, -3407, -4856, -5172, -5065, -3700, -2021, -670, -137, -131, -820, -1504, -1796, -1899, -1513, -1066, -1315, -2108, -3612, -871, 1346, 2758, 2695, 1734, 689, -94, -727, -1628, -2951, -3546, -2161, -105, 1678, 3406, 4731, 5475, 5362, 3772, 1999, -185, -2484, -2263, -944, -488, -953, -1816, -2921, -4658, -4323, -1892, 830, 3300, 4663, 4513, 3574, 2271, 849, -951, -2589, -1992, -287, 849, 1264, 1118, 1329, 1831, 2471, 2694, 2191, 786, -1290, -3603, -2258, -1115, -687, -107, 1509, 3479, 5194, 5571, 5140, 4072, 2718, 1669, 998, 658, -22, -1150, -2919, -4930, -3664, -2305, -1606, -1381, -1156, -1061, -338, 292, -92, -630, -1198, -1455, -1203, -616, 130, -669, -1913, -3401, -4562, -4305, -3370, -2670, -2236, -1721, -1914, -1795, -1560, -1421, -1785, -2775, -3565, -2210, -893, -82, 377, 762, 1160, 1373, 367, -726, -864, -790, -31, 2014, 4214, 4975, 5130, 4410, 3615]
3516C615k76J145k21o62j067A181E6c92d5C73N98M48M87J14n86h1j923m57M8N31
3496a882Q70c19B14J91j13A7g65p26q95o83o44O23Q83Q29O34i1l60j070j843j935
3476e299p54o04j62K096J676a460f00n0n35q30K4O2N53K38l37p18n53P7Q46h30
3455C14J139Q63L17j28o68D55a441p12Q98e61a60B24K07j0l6e37p64n14l77J91
3435b001K7p79j069n55J515R63mJ73N3M78b25A113J639J015K99n75j097A116a22
3415f66a94E36Q20K63n82C62l6Q29N66n8o50b33p19L23F01J87g9j902o4d38A775
3393C066J82N58J224J459Q4j488k281A312n12K19N00O59j19q18k85k89J7k82d50
3373a802r23N03N74J21m27P2L86f56J10n28j100p98k31O48J137B59J273J679J595
$$ y = [3615, 3339, 4484, 4263, 3601, 2534, 1181, 56, -392, -45, 373, 971, 1419, 1906, 2020, 1434, -81, -2004, -2461, -2413, -1882, -1012, -319, 214, 405, 292, 17, -765, -1491, -2386, -3069, -3713, -3090, -2207, -1378, -744, -91, -451, -1521, -3364, -5299, -6053, -6657, -6819, -4723, -3047, -1460, -600, -650, -1185, -2015, -1991, -1929, -1376, -1138, -1475, -2193, -2746, -2669, -1823, -830, 314, 1453, 2316, 2633, 2505, 1837, 455, -1441, -2153, -1255, -561, -160, 224, 431, 421, 385, -537, -1301, -1815, -2192, -2001, -1974, -2753, -3822, -4377, -2862, -1899, -1903, -1730, -1677, -1199, -225, 1113, 2752, 3767, 4066, 3491, 2394, 1116, -122, -666, -194, 536, 1356, 1619, 1037, 362, 326, 1155, 1721, 1663, 1013, -233, -952, -629, 601, 788, -79, -1981, -2045, -438, 1775, 3066, 3248, 3806, 5030, 6489, 6573, 5085, 2804, 1312, 800, 1019, 1519, 2178, 2059, 1241, 956, 667, 684, 402, -450, -1802, -2725, -2222, -1648, -1527, -1954, -1882, -1496, -656, -546, -1074, -2174, -2972, -3203, -2555, -1418, 259, 1532, 3211, 4806]
3354D806K160M21o06j307r24k45ko86A797e01k351L64g60A90J175N91j13p14l33
3335G96N82P72K53l28l92mQ87J25l10j039C63f82j638j277n71j96Q81J033P65
3316a685c57B488M507L173N06j050k145l385A872E16c82o20j031k71Q68O20j25
3299i41j051j457j722N09J624J277Oj059m67L1o90j685q40K029K207h6A429M11
3281A840n25B13a646j241g36C32J09d60k446k122K149h67C12P0d01j059q26m17
3263b703k09k49k41p9L06J08R02h14B89J574J202R4j312A66b211j975J379j18
3245b925j136j349L9b231G43J867M36j275d31k070j079J388O24j45j63e04A573
3227C568J123p26A479a909j642J716F07J110n32a59k39a75G9e6A08K74a70m5D80
$$ y = [4806, 6966, 7387, 6781, 5474, 4550, 4305, 4303, 3617, 1797, -501, -2852, -2488, -760, 190, 1365, 1956, 1843, 1129, 796, 1378, 2150, 2403, 2075, 1683, 1679, 2566, 2691, 2381, 1342, 363, -682, -2320, -3597, -4168, -4364, -3483, -2450, -1685, -357, 2488, 6995, 10168, 10674, 9624, 7479, 4094, 1872, 516, -382, -1002, -2033, -2304, -1436, -816, -941, -1992, -3449, -5171, -4662, -3038, -1761, -1755, -2814, -3281, -3250, -3940, -5625, -6465, -4436, -2229, -86, 1429, 1840, 1315, 213, -1646, -2887, -736, 332, 441, -460, -2906, -5028, -2879, -867, 312, 382, -401, -1460, -2286, -2703, -2912, -3161, -3402, -3481, -3175, -3067, -2165, -814, 289, 1863, 3065, 3159, 1847, 166, -2211, -4186, -2807, -2925, -4061, -5410, -5371, -2231, 743, 2610, 3046, 1771, -431, -2501, -3580, -2192, -1568, -1713, -1876, -504, 1573, 3568, 4691, 3965, 1479, -1909, -3551, -1835, 607, 1717, 1185, -159, -398, -175, 79, -56, 108, 382, -170, -215, 480]
3207A337P68J60j011B54i18j275j422l9a745A52J015L63J48pQ6j11J93M54J140
3188C433O74l14j113j070E34a47q9A70M85J50c42k098J20h33C44N63J72J86n10
3169G55A67f10o50l59P7O21G7M69j65e24q25r6K17M58a78C63r7f06q54l61O09
3148a212A77J734J704J247O01l34j332r16p41H47a416k846p2b054g0A526N55l98
3130A683E16g17l72N08g9A72d2n78r25j023J25O10L31k01o41k88a218I05K133
3111C038Q20r92F09a928k406k49J291J480a73E79QB79h1D09P91M18L73P04Q53
3092C548M23K1K31l31n62l75q13p41QM71J138P48K47m82o44j091n26l7O72M39
3072B344P81N99k41m07j319a88k024j308n34L84R32L72j07m79l36l80O68a185
$$ y = [1337, 2105, 2265, 1254, 254, -918, -2193, -3615, -3654, -1745, 152, 1167, 1530, 1678, 1671, 1757, 1646, 1839, 2293, 3433, 4107, 3793, 2680, 1610, 534, -147, -236, 170, 655, 805, -342, -2440, -2320, -833, 344, 907, 1079, 1265, 755, 167, -610, -1260, -1619, -1542, -921, 77, 546, 381, -524, -1349, -1445, -1228, -770, -178, 363, 266, -606, -1460, -1821, -1212, 177, 1911, 3615, 4862, 5463, 5129, 3797, 2881, 2140, 847, -1416, -4262, -4334, -2054, -70, 1526, 2081, 1683, 516, -717, -1089, -581, -79, 172, -42, -620, -1545, -2568, -2443, -1833, -1502, -1703, -2344, -2632, -1218, 905, 3038, 3858, 2866, 609, -1928, -4334, -4583, -3292, -1812, -173, 579, 587, 279, -81, 409, 1200, 1618, 1991, 2695, 3548, 3971, 3992, 4223, 3892, 3330, 2955, 2142, 1401, 1409, 1880, 3018, 3766, 4013, 3531, 2887, 1796, 1270, 1233, 1905, 2344, 3125, 3724, 3483, 3076, 1757, -188, -2212, -3520, -4054, -3670, -2738, -2366, -2473, -2952, -3288, -3668, -3000, -1185]
3053E02J788J723K439K207J495j10j020k541k688j218n17o47A65h68n93k3O58
3036h26a58A150R66M61o25H21h19k10B94P50J75n34d75j576M10B86J534O75o88
3017A807E4a721p47N76N77j43m57N05e74m7r72r43K54h16H17R93R50J27j166d91
2996c161a282A688K203Q74o44j514G12a000j554l88j33k14j93Q3Q36g20A170R55
2978B125K61j14q11D74a2B8L50L1d63j078r29q02j84Q13R03K60o58j282q96P48
2958c568J539i22a79A4c05p64M11A021J640O57k23j300a20j819j411R01R56b10
2939I91K34A43a623j945L18J086M14J34Q7J89O47C84R88L79o29b13j635j638R91
2920b495Q35J23M4l45n31l64j54K05O11N15J67l42o42q09L0J04k5j92j35J09O86
$$ y = [502, 2290, 4013, 6452, 8659, 10154, 10044, 9024, 6483, 3795, 2577, 2060, 1413, 165, -868, -1461, -1484, -826, -158, 1150, 2116, 2577, 1952, 821, -819, -1029, 294, 1044, 1219, 685, -475, -2051, -1641, 286, 1820, 2495, 1807, 54, -1721, -2468, -1892, -1315, -1458, -1915, -1410, -574, -621, -1593, -2536, -2282, -816, 817, 1810, 2760, 2887, 1721, -491, -3161, -1282, 1688, 3891, 4765, 4121, 2607, 712, -1000, -2554, -2942, -3075, -3289, -3482, -3399, -2563, -720, 1170, 2125, 2386, 2272, 1461, 474, -12, 28, 378, 409, -463, -1541, -2470, -3272, -3456, -2643, -1740, -1480, -2138, -3420, -4316, -3568, -2029, -922, -179, 14, -305, -1069, -658, 1021, 2661, 3318, 3095, 1795, -120, -1939, -3350, -2449, -1493, -210, 991, 1225, 143, -1623, -3568, -3250, -2164, -1750, -1616, -1529, -1340, -693, 384, 1372, 1751, 1122, -213, -1848, -3486, -2495, -1660, -1537, -1493, -1838, -2369, -2733, -2887, -2682, -2071, -1556, -1389, -1731, -2373, -3182, -3152, -3048, -3073, -3265, -3400, -3291, -2605]
2899b605J286b59A37b95l03o1m0K59k27j235j016j304m11L40R81Q07O40k01p66
2880b832q89k66J080J416e40j44j028j374n43f78A300N40n49m84P37J478R71q8
2862C905j233j202Q14K117K222Q69k65j438j714j829D16f11j33a58D62a2p48m95
2844a255K10M47m83j195j326j264m66L27J134J520a074b68o70r35k09O4j12j30
2826b260kL69P63M34K95o14j321j273q53J317a317F44J784P07k21j002I22G6e82
2806a825j178n21P04a243e46K2l85r41p51l22k37k4n12n67Q54R03M91p8l30o12
2786c035M91g95A040Q82k13F69e95j079K32g21B54Q23M5A41a242n93M47e94K16
2767c78l77a41C92J120J679J628O38k78j079j746B63a877j555q00N73P25M37K37
$$ y = [-2605, -1319, -259, 137, -295, -598, -659, -699, -440, -667, -1902, -2918, -4222, -4633, -4293, -3312, -2505, -1865, -2066, -2832, -3721, -3987, -2907, -1491, -540, -684, -1712, -3086, -3629, -678, 1300, 1840, 1291, 807, 1544, 3022, 3993, 3905, 2672, 1470, 2284, 4401, 6623, 7492, 7227, 5789, 4075, 2246, 416, -611, -744, -158, 462, -12, -760, -1255, -1045, -598, -1081, -2276, -3602, -4866, -5332, -5005, -3871, -2351, -1074, -268, -938, -1873, -2082, -2018, -2130, -2260, -2262, -1893, -1130, -696, -401, -1015, -2336, -3609, -4462, -3145, -1317, 644, 2428, 3135, 2914, 1912, 922, 76, -582, -1825, -3003, -3524, -2820, -1243, -546, -524, -909, -1850, -2601, -2923, -3160, -3184, -3696, -4263, -3409, -2506, -2015, -2093, -2423, -3035, -2544, -795, 1040, 1922, 1709, 669, -595, -1674, -1442, -721, 254, 1077, 1122, 141, -1242, -1835, -1388, -594, -378, -755, -141, 392, 1512, 3191, 4819, 5457, 5179, 4100, 2354, 263, -1877, -3432, -4232, -3659, -2934, -2497, -2260]
2749b260M99d17f6j54m80j084o89o24l83o93n31O39J095O40K68k30n04n78o36
2730d010M80J267h46C24P01K15n0k83j67L37K00L67M80r8o08B50a149q57h07H55
2709A996M21j77p58G7a432j705j034j20L87Q86J358b22G83J52B22a283j088P78
2691a593f38a8B3a00n23n57k66k74M10N60J85k34o75p44l61k22K99J15o35l06
2671c328j28N83R07O58L01m4J98c60l2m20j157n05i86D58J083M14L4r06e41k045
2651b586j512K047d95G89R35M10n56E9a861q95R1a285M83Q4p55q22M30h65A37
2631A300O37r7G67h06l63a9B108J853J423R93O28K93o81j605j375j664F08k82
2613C26P99R93N09p34C97a120l42n74q56q07L06J056a126a22G46R07P57O23k3
$$ y = [-2260, -1761, -417, -66, -220, -700, -1784, -2473, -3097, -3480, -4173, -4704, -4065, -2970, -2330, -2062, -2292, -2796, -3374, -4010, -3530, -2263, -846, 324, 1025, 1240, 1190, 907, 740, 1077, 1277, 1644, 2124, 2026, 1418, 250, -1149, -2006, -807, 855, 1996, 2417, 2240, 1482, 77, -1432, -3137, -4171, -4291, -3904, -3018, -1660, -222, 783, 935, 222, -1283, -2371, -1593, -638, -18, 23, -100, -623, -1180, -1446, -1720, -1310, -750, -565, -799, -1474, -2218, -2579, -2801, -2502, -2387, -3022, -3328, -3456, -2873, -1966, -1308, -1007, -1051, -853, -360, -392, -812, -1969, -2474, -986, 458, 1541, 1955, 1989, 1083, -541, -2586, -4098, -2051, -495, 789, 1724, 2134, 1578, 59, -1861, -2756, -2665, -1285, -802, -718, -1473, -2295, -1865, -865, 137, 1300, 1937, 1840, 767, -806, -1169, -19, 2108, 3961, 5384, 6377, 7005, 7298, 6617, 5012, 3637, 1973, 608, 326, 1125, 2118, 2627, 1893, 397, -1120, -1462, -2036, -2892, -3699, -3393, -2337, -1126, -122, 746, 1653, 2410, 3033, 3010]
2594C010n81I09i67j78F18J819J114J15q22j226o57J74L46M1K56O99J280J720
2576E477J174n83k177A017a397r45K00L52L00f72H04J572J337k37n67o58j124
2559A127d04j682j524m13J258J359J76k28o0N3P29a93A78j0K48O25O86K87Q2k64
2539A832l04j93k22l59nK03j74C82a201k155o29J363J258M47l3o21k81j52K3M23
2519a558N53L2o11j257j074j102J705a192F21Q19m02f59k308j300J939h28d6D9
2500g61j353j509J33J220M88m07j192Q35N86k7q21j092o25J220a463E40J487N39
2482B566j78j032C34d68C59J532J463J151J95k94j043A549d53j802kJ127a32j9
2464a51j98j11l3K17B29Q66M17l46D4a396j298n52R65M66l51k57k7M75K95n50
$$ y = [3010, 2429, 909, -967, -1145, 618, 2437, 3551, 3666, 2844, 1618, 961, 1135, 1481, 1522, 1778, 2477, 3757, 5477, 6651, 6068, 3891, 1017, -1397, -2342, -2142, -1790, -1490, -672, 804, 2376, 3713, 3476, 2909, 2251, 1127, -404, -2086, -3610, -4023, -2765, -1406, -1230, -1458, -1518, -1465, -736, -193, 178, 168, 416, 1041, 1727, 2014, 2096, 1832, 1528, 1335, 1113, 754, 749, 952, 778, 382, -1201, -3356, -3985, -2622, -1364, -917, -950, -1571, -1852, -2004, -1981, -1558, -1005, -973, -1584, -2841, -3915, -5017, -3312, -1192, 621, 1440, 1038, -659, -2967, -4267, -2328, -828, -46, 49, -761, -2114, -3623, -3490, -2270, -1782, -2189, -3381, -2546, -1960, -1987, -2808, -3900, -4525, -3305, -1463, 540, 2027, 2566, 2388, 1356, 334, -468, 359, 1891, 3354, 4505, 4700, 4406, 3363, 1549, -453, -2255, -2257, -1130, -132, -151, -349, -460, -493, -276, 229, 1095, 1512, 1166, 44, -1396, -2694, -3246, -2281, -1815, -2166, -2423, -2450, -1975, -1680, -2230]
2444b230q34o38R11a040D65Q06R3F08c56r23j219n13K5Q0L9m42m34J31J24N98
2424b890j97j05M86l5k47R8P90O60P12b74a3E98N67P46R49J291O32o23r79q32
2404B349k36N70J013Q75o90l75j415f30k697a611B59J014KC48E6J271J912J868
2386E107J731Q14j36j146j971A561e08j274l5O54c72A74O82L27k91B52L63J481
2368B096K330K090O09n38j786j945j338D49c00m35k52k37L74D40J512J041j75
2351B818j302B6f21E5J055R81k83B24b371k251j83b392J105l2m90j238M39i34
2332E03N50B26h00p33O6d14E27M04J13q4m43b07q27l71d55A101J904K073J366
2313F444K14k34n97l9p73n96r02m61l72o53q44Ha292j508j383n02l1M61N60L40
$$ y = [-2230, -3064, -3702, -2791, -1040, 465, 1271, 1364, 608, -356, -1279, -2498, -3011, -2986, -2906, -2867, -3309, -3743, -3612, -3488, -2890, -3087, -3192, -2706, -2741, -2988, -2890, -2100, -1440, -728, -274, -13, 598, 1165, 1911, 2860, 4151, 4783, 4160, 3181, 2349, 2113, 2683, 3696, 4571, 3881, 3506, 2091, -630, -3327, -1611, 259, 1273, 1275, 348, 56, 1327, 3239, 5107, 6838, 7652, 7516, 6370, 4399, 1561, -508, -1782, -1817, -1163, -372, 174, 856, 1183, 892, 252, 615, 2096, 4426, 6516, 7125, 6587, 4801, 2856, 1518, 449, -300, -735, -987, -1224, -850, 440, 1952, 2993, 2818, 1516, 26, -621, 55, 1110, 2091, 1808, 224, -2371, -4622, -4805, -2392, -1287, -1319, -1809, -3047, -2608, -934, 503, 1053, 226, -800, -1533, -1467, -414, 527, 931, 1044, 960, 517, -207, -1034, -1405, -455, 1101, 3005, 5078, 6444, 6658, 6424, 5827, 5788, 5015, 4419, 3517, 3056, 2684, 2031, 1187, 8, -1292, -2800, -4183, -4685, -4716, -4255, -3695, -3355]
2293c355n4K77L97L37J1L74K4m7O67b15D01j45G7J94N89R41K83k97H14h50j262
2272b112n65j7K12K98J66n0o25j175l90J94M17N27J350H6J643Q58k67j092c10
2252b109j6e65b58j28j3J85F40J014O93j83I41e94n17c67B73j34g41j444j560
2233c745J093J229K10p96r59P16a22A412J250J042L42n35r16j263b64j595j076
2216b935j453O21a877A62J317L69J0o96n56j11K54N23M75J96p00A87h36n21R6
2197a261R7L16c21K9k74m85l28e61F98R87Q94R0o46G54c68J32B023J834J091J45
2177E093q85j344j377m30L64J045J382P21m57j713D0a571L62a0I15N55K48M27
2159B145K85p2o16G47a27m94j14K99C0M24M17M97M11N68L16l45p41p11m08l2P1
$$ y = [-3355, -3409, -3132, -2735, -2398, -2387, -2013, -1989, -2036, -1369, -215, 401, 256, 77, 271, 860, 1801, 2084, 1787, 814, -850, -2112, -2677, -2694, -2482, -2184, -2018, -2068, -2693, -3868, -4258, -4064, -3647, -3120, -1770, 86, 1729, 2587, 2320, 1228, -310, -2109, -2125, -565, -258, -386, -399, -214, 640, 1654, 2347, 2164, 941, -594, -1111, -367, 273, 139, -741, -2185, -3745, -2652, -1423, -1213, -2009, -2968, -2252, -122, 1412, 2662, 3704, 4046, 3511, 2595, 1332, -264, -1859, -2935, -4388, -3767, -1877, 162, 1479, 1848, 1858, 1162, 606, 495, 749, 1272, 1747, 1943, 1243, 187, -836, -1357, -1261, -1164, -848, -321, -292, -566, -1051, -1379, -561, 698, 1685, 2579, 2669, 2023, 754, -368, -236, 2023, 3857, 4948, 5093, 4208, 2864, 1487, 1057, 1421, 2466, 3848, 4569, 4112, 2399, 40, -1571, -1209, -10, 915, 1470, 1718, 2145, 2430, 2358, 1742, 747, -127, -621, -735, -436, 30, 454, 871, 1368, 1779, 2347, 2663, 2318, 1577, 866, 458, 426, 497]
2138D97a19j392j657J396A052J959R26J00j041A463g95j517e90B129J412O61o67
2121C535j512C42a154j132PO59N55L19a16E63N63K39jk20l74H4h70k072r81R59
2101b964a363e33a43j9l32J27n33j677j602J108J164Q55K34m64q30J29Q60@I24
2081A655k16k41D95A30m0d66p85d96A362K012J147J23m62j041A491c72j477m22
2063b271N85e85A38M66k35c76q96r40r25L3P44i83H9Q25O20P68J168Q20L45q44
2043C791r40j193G88q8M78M54o24f1j351r57nO95b69A186J396M33n89o93j23k83
2023A327C53a566k332q96M89N98K88l0j07Q29a144c34J04oH7R61J271J207P26
2004D252j26p14j132F72d31n47l30k69k77o01l76l65l7Q69N15j19m05P1J077N35
$$ y = [497, -119, -1511, -3168, -1772, 1052, 3011, 3937, 4037, 2996, 1463, -795, -2312, -590, 2129, 3541, 4202, 3535, 2023, 342, -1154, -2286, -2279, -1620, -1065, -746, -116, 563, 1126, 1365, 1364, 1144, 770, 84, -870, -2942, -3923, -2964, -1363, -533, -143, -162, -494, -367, -900, -2577, -4179, -3071, -1907, -1052, -818, -1282, -2112, -1983, -1123, 0, 924, 1655, 1439, 1198, 495, 130, 90, -466, -1251, -496, 1362, 3374, 4521, 4644, 4182, 3141, 1491, -372, -1849, -2271, -1686, -585, 138, 604, 369, -376, -1272, -2212, -3137, -3104, -2360, -983, 89, 914, 1534, 2302, 3470, 4290, 4635, 3791, 2851, 1658, 788, 700, 1178, 1632, 1008, -61, -1412, -2369, -2374, -1679, -269, 1186, 2582, 3015, 2426, 1733, 1610, 1327, 353, -1566, -3898, -4794, -4305, -3707, -3419, -3449, -3556, -2727, -1144, -334, -230, -236, 87, 1048, 2319, 3526, 4252, 4126, 3412, 2280, 672, -431, -978, -1308, -1577, -1854, -2455, -2831, -3196, -3233, -2364, -1849, -1968, -2373, -2302, -1225, -690]
1984f90j41q96j002m39L75M69J19L82f80I22K125J818Q51m50j588j280n58P9O82
1965B601K09r12a95j832J3O33J8r67j393R32J278M45l83r68j571k078k77J387
1947d958P79M08n06J50M32Q04P85R34A95R39M48k68D70b34r84j051p23p97r65
1928d754O91N86J173O69K14k08n30K90d74I01J163K86j78r7n66a47j140L8i7B74
1907aj022j214j555q73k9J072R92J194f18D4L03j25b32r75j440O79b27H37L48
1888A185k85l89A69c24m51n48r66j239k04J574f86C65j47i32j626k09Q24K87k62
1869a918j082j582K17b102e39f0l21m41p0c7A227J021J33o95F55a430j698l89
1851c517J09L63Q75h51D17J174P77J25k68m9j50N94M68M68N96L06J23j21p82j043
$$ y = [-690, -831, -1727, -2729, -3168, -2793, -2324, -2205, -1823, -680, 922, 3047, 4865, 5716, 5266, 3678, 2398, 1840, 1919, 2601, 2810, 1898, -195, -2027, -2014, -1381, -1363, -2330, -3723, -2791, -1513, -1068, -1451, -2419, -3990, -6068, -6345, -4958, -4179, -3771, -4277, -4127, -3695, -2891, -2106, -1172, 195, 1134, 1582, 1314, 470, -234, -1218, -2269, -2992, -3789, -4754, -4063, -3477, -2304, -1635, -1421, -1629, -2159, -1869, -474, 901, 2064, 2350, 2172, 2075, 1509, -147, -1287, -1249, -97, 274, -1, -1023, -2237, -3792, -4665, -4694, -3622, -2630, -1436, -618, 44, 347, 222, -232, -1207, -2647, -1968, -227, 837, 1185, 900, 511, 169, -324, -775, -1323, -2289, -3528, -3732, -2158, -686, 365, 218, -932, -2558, -2767, -1943, -1656, -1918, -3000, -4582, -4365, -2102, -539, -60, -381, -822, -892, -37, 1227, 2248, 2381, 1686, 655, -1430, -3128, -3517, -3408, -3045, -2170, -851, 417, 1591, 2368, 2493, 2225, 2176, 2026, 2620, 3088, 3556, 4152, 4458, 4581, 4460, 3678, 2635]
1831B635j181B64a258o55i41G08J641R38L48m98r09r13o02l44c54n22q1Pl55l78
1811a683q46m46a374D03R99N8C12i17b58A776J700Q13o30A825Ah48E8J039R18
1792B015N37L31O34P34L00k39q70j027r76E63H7f2K1H8N80N67P36M46P6L43K76
1771C112O38O76O49qn24j025j027A043C6a306o04m89k8J015c75E24P76L30n76
1752A054B79c29a36K0D11P33M59L20n34F61a35o38g7A508J920K167J262K06r74
1733F089j472j876a04k488j559J524e64F10p3d68j337K19c35A006J143o84A02
1715e78a87F74k04c79j539j688j43a694d67A0M44P50P43K61j30q13C5a425j288
1696b713J95Q56M18k27p47p69q46J009J030J46j376j30a271a41C39b4o42n28j0
$$ y = [2635, 1454, 264, -1258, -1913, -941, 708, 2349, 3287, 3635, 3137, 2228, 1315, 713, 369, -354, -876, -957, -950, -1305, -1683, -2529, -2975, -1374, 403, 1402, 1460, 312, -917, -258, 1776, 3476, 4289, 3659, 1825, 1, -848, 58, 1097, 2015, 2552, 2883, 3517, 4251, 4551, 4312, 3442, 2415, 1439, 563, 87, -62, -41, 88, 668, 1235, 1971, 2417, 2493, 2836, 3112, 3750, 4426, 5075, 5067, 4543, 3518, 2491, 1043, 36, -1306, -1910, -2399, -2427, -1412, -375, 524, 1300, 1630, 1054, 279, -329, -136, -116, 411, 1144, 1603, 1923, 1389, 661, -135, -773, -77, 1508, 3428, 5595, 6857, 7063, 6089, 4617, 2741, -104, -2592, -4151, -2627, -564, 610, 537, -468, -1805, -1586, -335, 1006, 2149, 1465, 102, -578, -187, 674, 470, -379, -1918, -3606, -3749, -1694, -467, 10, 454, 1204, 1947, 2208, 2078, 1265, 35, -1425, -2713, -2518, -1662, -1244, -1471, -2218, -2987, -3833, -2824, -1794, -1648, -3024, -3154, -1271, -141, 339, -24, -666, -1194, -1204]
1677a204c84B75P49J010P34J49o17j072b32j297p59N03Q35k46n88j757p31J049
1659c223P88N72O89K39m64k72j29l05m18k62k06n82K06J173R64M45k35m13j250
1640b683o59Q72Q29O27m32r69m06R44h02a74L9q90o60j115j183L31M91N51J2n26
1620c124r02P8R82J217P58J74J6j56J96K78A30K8b4m01o38j310j609J35J214N08
1600b125N5l33k53K25J67k83r70J93Q82O53K72j11j47L5l32m61r77m51P2M69O24
1579b796N77M84L31f92K21n39l74n16m17j29N12N06N20L24n59q64j066q76r85
1560d934rL05J81J552a366I7K01b84r89l89N81i0A17J80M24O28J318J058m09j452
1540A864C20hF03K94j93j20O37J381J476P25M79O61q64j136j760D21i72d79H64
$$ y = [-1204, -384, 275, 1024, 2034, 2768, 2917, 2300, 1228, -232, -1529, -2288, -1785, -950, -1196, -1784, -3541, -4272, -3223, -2435, -1863, -1174, -935, -1399, -1671, -1800, -2105, -2523, -2785, -2991, -3573, -3367, -2194, -1230, -785, -1020, -1433, -2683, -3342, -2470, -1641, -1014, -1446, -2415, -2821, -1877, -802, -174, -135, -1025, -1685, -2800, -3983, -3652, -3161, -2610, -2598, -3124, -4026, -3948, -2966, -1749, -991, -817, -801, -957, -761, -483, 130, 158, -24, -425, -1063, -2373, -3982, -3847, -2633, -2125, -2070, -2403, -2656, -2431, -2264, -2547, -3517, -3324, -2442, -1789, -1517, -1628, -1775, -1740, -2072, -2533, -3510, -3961, -3889, -3420, -2796, -2219, -1735, -1404, -692, -471, -1010, -1384, -1900, -2317, -2446, -1934, -1428, -908, -584, -1143, -2007, -3073, -3949, -4934, -4943, -4638, -4457, -2905, -1366, 97, 298, -284, -1273, -1662, -1081, -90, 117, 297, 721, 1349, 2667, 3725, 3316, 1864, 320, -8, 603, 897, 704, 584, 1221, 2602, 4078, 4803, 5282, 5943, 5079, 3943, 2183, 421, -972, -479, 864]
1520A920K40A076e01j571n21m40K20j66kO37i42D51P71k84C2a156j079n17k47
1501b999J94J027e44F80J031J130O68Km73o83j085c5j664j339J162h05E2M81J02
1482F35k03q8d97j71o46j506k135Q75a410I29J125n48h1j060d95a67A53J54O4
1463C71J03o8e3p02j010q66J162d40D81L82K37M78O32M46k15q44p24C90B9f17
1442a963j754q23J092a520d36m18j411j300L61O33k21j080N7a331A221J683J214
1425D118Q99K47m97j224A298a676m81c51D20K2a63o42o86o39j007o79K29J014
1407b573a252c46e0k6l69j129k50O64pm17L92e82b7B15K41j56b46j52I77K007
1387B984K082J346K84o66j639j643A302C43g99j202q42o72M2J074P89J87q05r62
$$ y = [1920, 2160, 1076, -501, -2072, -2593, -3033, -2813, -2979, -2981, -2344, -942, 451, 1222, 938, 32, -1156, -2235, -2752, -2999, -2805, -1778, -544, 680, 1711, 2841, 3509, 3511, 3038, 2355, 1270, -35, -1699, -3038, -1876, -805, 52, 533, 635, 432, 344, -497, -668, -1314, -2820, -4955, -4080, -1410, 929, 2054, 1506, -81, -1141, -495, -167, 153, 307, 371, 474, 406, -53, -755, -1765, -2631, -1469, -440, 481, 863, 1100, 1578, 2210, 2656, 2441, 1597, 873, 390, 29, -617, -1963, -3717, -4540, -3448, -1520, -436, -854, -2265, -3565, -3204, -2571, -2792, -3872, -3815, -1331, 1221, 2904, 4118, 5017, 5264, 4767, 3543, 1298, -1676, -2157, -351, 420, 442, -163, -805, -1491, -2130, -3137, -3816, -3587, -2573, -1252, -346, -50, -76, -445, -1574, -1824, -1160, -1167, -1584, -1192, -582, -27, 215, 456, 300, -246, -398, 977, 2984, 5066, 6412, 6696, 6030, 4391, 2748, 1302, 343, -799, -2001, -2843, -3515, -3473, -2399, -1610, -1423, -2228, -3190]
1369c190P17a68A763N80p29a22j964j595L91o10q12J049J092J066n37r30r24K29
1351c667N63J28k30R20d61A154M57o51g5p62j01A47J392J090L44k99o48B14b143
1331b978N39P4K22m46n35n53j10M26Q38J058L86J62M5j71m14l42O46L73l51k16
1311a347o41j104j434j184P08J054J470h14F37O38L3F20c3k79@F42J39C18a38
1291d41F21Q88K02p90h55j312l89p5J68Kk72o44r77k69J539a274B06R76O82r1
1271A773m99n97A97b55m42o26j56J37N00Q8J30B71K151K133J856J440K51p98k819
1252D485A378a734k784r94K354J114Q07I0J678J140K11r6j022F07f55j147l84
1235b186j41L08P32E21J536R14Q5n30j198b48j198p19r80o42j88K82O68M67j54
$$ y = [-3190, -2473, -168, 1763, 2343, 1614, -122, -2086, -3681, -3290, -3900, -4712, -3663, -2571, -1505, -2042, -2972, -3896, -3667, -3104, -2976, -3206, -2286, -461, 1154, 1611, 960, -75, -837, -938, 147, 1539, 2629, 2973, 2674, 2026, 214, -2143, -2978, -2439, -2365, -2143, -2589, -3124, -3677, -3787, -3361, -2523, -1465, -1079, -917, -872, -1043, -1457, -1799, -1153, -780, -1131, -1347, -1988, -3092, -4526, -5710, -5002, -3948, -2478, -814, 637, 1275, 1308, 620, -33, -312, 0, 642, 781, 318, -138, -441, 621, 1509, 1711, 921, -855, -2167, -2556, -2631, -2463, -2461, -2733, -3377, -4354, -4623, -3084, -1274, 206, 1182, 1864, 1773, 1274, 677, 197, -255, -697, -1323, -1479, -1342, -842, -754, -624, 271, 2422, 4555, 6411, 7851, 8102, 7304, 4485, 1378, -1734, -4518, -5512, -3158, -2044, -1237, 90, 1768, 2908, 3119, 3023, 2001, 607, -655, -1802, -2186, -2327, -2019, -1287, 521, 2057, 2971, 3056, 2526, 1328, -248, -1446, -2165, -3145, -3787, -3975, -3693, -3025, -2558, -2712]
1216b712p44P2J660A043K177J635L63p40j703A015B03Q45J091O22J89L17R70J226
1198E463N16m83q51j077j248j094k56n3q0j76J99l19d83j520j538j073L15K060
1180b239e28b32q08j199j471j017J851a247A57J098J073J46H83b223n94A330L799
1163E129J893j048B646a012k436O37P17j358j097J979i25a96O2l82n40m27Q3f18
1144A404J842P48o25A010a237K21B32Q23K10m22B49b23k30j3a78D17P36N55P17
1125B425Q33P50L19K0q01p47n50r21D38I5M54J362J884J808M83q75j656j173M36
1106B818K288K201Q30r64k060B504A2a877q78k4K66M41L00K50J14M94a10F64L84
1087A048l5K42M10K79l46F83a025k654k379K567e75H65N69E22a067j332k62L39
$$ y = [-2712, -3456, -3384, -1724, 1043, 3220, 4855, 5218, 4478, 2775, 1015, 203, 1048, 2139, 2761, 2950, 3267, 4237, 5463, 5979, 5496, 4645, 3568, 2320, 1226, 970, 917, 837, 661, 860, 541, -483, -2003, -3541, -4614, -4299, -2239, -528, -232, -1040, -2239, -3710, -4727, -2876, -1247, 157, 1255, 2328, 2474, 883, -2223, -2817, 1330, 5129, 7022, 5974, 2646, -1012, -3448, -2811, -2094, -3452, -4549, -2570, -925, -196, -134, -516, -1056, -1483, -1400, -618, 1404, 3246, 3994, 3369, 1010, -1237, -1016, 232, 1055, 1265, 843, 249, -223, -453, -466, -178, 417, 1153, 1708, 2425, 3258, 4008, 4327, 4347, 3546, 2799, 2249, 1328, 438, 95, 549, 1911, 3795, 5603, 6086, 5211, 3555, 2382, 2818, 5106, 7307, 8137, 7173, 5113, 2504, 12, -1877, -2755, -2779, -2513, -2072, -1772, -1522, -1408, -914, -110, 664, 1048, 1013, 1255, 1665, 1944, 1598, 683, -1025, -3679, -6058, -3491, -575, 865, 1434, 522, -1067, -2399, -2661, -2322]
1069b322J081d39J51o81p13k90K78N09e74e7F82Q55R06M51l21r99C41i46j38a39
1048C69a65j625j286a013a98D49J33B52R48K147K104J292l06j866k180I6a104
1030a884J87d64A638J106K88m34j211d03j832n14e08A448K212J392P91m24j174
1013D245j377F94a636j601o36P03J267f79A23J631J179N23l03n19o73p01m96l38
995D26j15A55L30J025J100J235J287N59l30j386j840C77i20p70Q0g99A27J013
977A140Q04O88L98l3j066A78b236r51a474dI59L85K67J00K88j42m22D31a462j929
957c391r42Q73J686e83a13m19j031n22N1n05q20p63N99a613D14K375J557O13q83
938D076j611A057D35q9a78r69o85M11e75b16l43n11J53a36B30e3j299j641o39
$$ y = [-2322, -1241, -439, -288, -969, -1682, -1972, -1694, -1185, -574, -57, 682, 1537, 2443, 2894, 2573, 1574, 341, -946, -1084, -139, 369, -165, -1790, -3076, -1013, -198, 449, 582, 252, 1200, 3347, 5451, 6743, 6437, 4571, 2391, 96, -1104, -1884, -1697, -464, 1638, 2744, 3032, 2598, 1387, -403, -2235, -2749, -508, 1448, 3660, 5052, 5843, 5419, 4245, 2868, 694, -1636, -3237, -3873, -3170, -1903, -679, 123, 1754, 2933, 3456, 3153, 2634, 1961, 1260, 764, 426, 311, 155, 485, 1510, 2610, 3845, 5132, 5691, 5361, 3975, 2135, 377, -920, -1690, -1610, -799, 127, 1140, 1944, 2632, 3030, 2997, 1931, 178, -2236, -3187, -1474, -4, 959, 1344, 1611, 1711, 1999, 1857, 1435, 431, -1462, -3391, -4333, -3460, -1774, -583, -113, -532, -1563, -2085, -2034, -2539, -3359, -4122, -3523, -1613, 414, 2789, 4346, 4959, 4076, 2465, 1057, 435, 346, -178, -1147, -1832, -1421, -575, -216, -559, -1070, -917, -136, 230, -53, -1352, -2993, -3632]
919c632J162R12P39J52l81q81j040j032J127J359f69b06B6O44R74O79K27k96q84
900A370B42a266j109j20M31J89l18q80o02l53j16M49N77Q89Q62L17r7q63m64Q37
880a637f14E46Q58j52E46f26j324j158q26J72J216i00D87R88L52J87M4J6l25p13
860A036a23j592j221J021f37B52N95L40L34L83M09M97N02J228J609J598O36m94
842G889L06J128J583J412O89o02k436k551l265A859E48B6a22b2Pk54m70m03P1
823a071a74A097Q34O49M86N57j41k31j81j7O07Q07Q7j10o57j586b0j372N2M18
803i22j9k07q09n22JK0j80q65j056p01J632J279K10m61k91O98i00h3A8a087j121
782b208l1K47L73O16D45J629J493P90j5q01j171j048m80l69A92Ed21j230j905
$$ y = [-3632, -2470, -1558, -819, -667, -1048, -1929, -2969, -4001, -2874, -1515, -669, -206, 26, 670, 1644, 2323, 2550, 2254, 1370, 242, -1266, -2375, -2495, -2064, -1875, -2193, -3073, -3675, -4028, -4144, -3695, -3118, -2229, -1367, -1050, -1147, -2010, -2474, -1637, -614, 546, 1404, 1252, 546, -626, -1950, -3108, -3934, -3762, -2546, -900, 487, 1475, 1827, 2014, 2058, 2074, 1749, 1036, -123, -1715, -2936, -1915, -637, 252, 847, 1187, 1521, 1904, 2313, 2810, 3312, 4540, 6149, 7747, 8383, 7889, 8195, 9323, 10906, 12318, 13007, 12405, 9969, 7418, 4153, 1859, 548, 26, -122, -22, -15, -269, -739, -1142, -1071, -174, 1097, 1931, 2580, 3066, 3623, 3482, 3251, 3070, 3053, 3660, 4467, 4554, 4444, 3787, 2201, -20, -1392, -1340, -922, -941, -1148, -1957, -2479, -2478, -2458, -2638, -3503, -4559, -5260, -3628, -2349, -2139, -2600, -2891, -2193, -900, -83, 18, -1087, -2208, -2239, -1992, -1619, -1003, 445, 2074, 3567, 4357, 4342, 3541, 2370, 1322, 842, 473, 192, 5, -421, -1651, -3556]
763c556k34J704a08A188K13k03A98HM7Ag42r18m76J13l03n48o02kP74J238e13
741b31l19r35q97p82l95J51J86L77k2n99j414M07J222J184L01m42o21R6Q08L37
721a588J04N32D0J363J232J413J346P53j02q58j360j608a04k257j742o83j21J024
703c883J329a263d03f3B0a39k19J22j46j48n21n30r96n69o94l35J02R67a488B08
682A663R34L91n76q95o68l78k09a61n92j119r11n03m64l70l05J036J002Q03P69
663h15G3Q66N34r7l9m36c04j266j462a401b58bk40q96j116j098p37R39R34N83
643a633P31L39e0D78P62L93n46c79k129k514k65b313D05J690N7n05B08a118j116
624b234q09j72k70N24R55h83B82R02N95L51K23L81N30N35O4p92j280D80a005j476
$$ y = [-3556, -3790, -2086, -108, 1188, 1401, 1198, 198, 8, 55, 1, -742, -1660, -2136, -2023, -2326, -2874, -3476, -3478, -2704, -1466, -513, -231, -550, -1485, -2382, -3164, -3559, -3408, -3222, -2845, -2867, -3466, -4880, -4473, -3251, -2067, -1766, -2208, -2829, -2733, -1925, -1588, -1484, -952, 40, 1403, 2635, 4048, 5394, 6147, 6045, 5187, 3827, 2219, -104, -2361, -4103, -4786, -4907, -3883, -2554, -1263, -403, -63, 20, -139, -358, -236, -382, -530, -1051, -1581, -2577, -3146, -3840, -4175, -4073, -3106, -1488, 208, 1663, 2597, 2988, 2412, 1517, 849, 471, 262, -161, -753, -1872, -2783, -3286, -3750, -4120, -4425, -3389, -2387, -1584, -815, 73, 939, 1473, 1376, 1337, 901, -304, -1570, -3032, -1401, -258, -2, -242, -1138, -2254, -3352, -4089, -3150, -2216, -1633, -902, -563, -50, 478, 1240, 1633, 1087, -379, -2508, -5022, -5287, -2313, 405, 2095, 2152, 1647, 208, -1118, -2234, -3043, -3215, -3485, -2961, -2006, -883, 282, 1184, 1779, 2130, 2353, 2734, 3264, 3799, 3863, 3071, 1791, 480, -1005, -2481]
604b481o62N76d10A368J208K42J43j76p95A22b502n77G7K374J052K11j82k11O6
585C387K14l40j148B23b440l70i57I16J688P45p15A224d86j362q52M10a076d85
566a41N5C3N44J123J374J219J354N14o52j140q44p34j375h74k684k78a312E05
547A649N57K03lp81D70g56q96p33m15J170d70I86J046K14l35p81C03b15o21m00
527a236n08n11m85n57L37J338L58o3m1M24M33D87J208J290P86Pr42A379g42j392
507b134L42g25G38J578J380Q11J59j56m59n43r24A017b04r10n88k65K45M47q8
488a363p06k55L44Q00M85J95p12j456n09J350c37F17B77a174j988q58J090O01
470b329J003c48E33M35K42l0l47q5N0lJ03K48o5C39a145j816J84M68m70j309j125
$$ y = [-2481, -3143, -2567, -410, 1368, 2576, 2818, 2961, 2785, 1990, 122, -2502, -3079, 77, 2451, 3503, 3714, 3532, 3321, 3387, 3601, 3261, 2113, 223, -2440, -2810, -957, 916, 2604, 3349, 2634, 1224, -486, -1848, -2700, -2290, -1076, -485, -141, -86, 33, 577, 1700, 3074, 4293, 5647, 6161, 5509, 4369, 3525, 2791, 1416, -874, -3558, -3836, -1312, 505, 1649, 2206, 2409, 2406, 1625, 470, -756, -1652, -2385, -2800, -1630, -470, 986, 2032, 2246, 1911, 1130, 303, -215, -836, -1236, -1744, -2255, -2740, -3297, -2960, -1622, -1264, -1327, -1368, -944, -511, 487, 1695, 2985, 3771, 3778, 2836, 1379, -742, -2134, -1792, -725, 738, 2316, 3696, 4507, 4666, 4510, 4051, 3508, 2584, 1017, -204, -1114, -1702, -1967, -1722, -1275, -1363, -2069, -2324, -1980, -1180, -695, -500, -1212, -2668, -3177, -1827, -337, 617, 277, -1174, -3162, -4020, -2930, -2329, -1326, -348, 533, 968, 1210, 1180, 833, 748, 798, 795, 898, 1146, 1081, 339, -1145, -2961, -2777, -2309, -2779, -4088, -5213]
449e213J800a420a00B42a60p76r25r91j120j350J96J098R34N84L32L41P53B0J286
430A306N60j15H21d54j223q00p42M65d65I92Q73K36l55p11h08j458q23K37L74
411b478K16j53l3O48h92C05J544J628J090L90l22r02j812a87j956j324L17L85
393b765P43i49a72kq38r72p17J00J168e04C83J058J051R59P2p45j190A77a823
373b881a334C13J299P40M28M40O86M26m27j636g07l727q78K418a384J80j425j845
355d474a858C64P54D07g00j252j932K95J154A11K349J736R2m72r14p95m40n48
337A119J64J057J600J233L03on15k23n18r77j238q72k40k54B13e84j066r42L84
318b208g65F18R02K87j23l17G1a833j523l23O36O80P39P02M57N0q54j262m04d43
$$ y = [-5213, -3413, -1420, -100, 242, -160, -936, -1861, -2852, -3972, -5322, -5126, -4028, -3094, -2510, -2178, -1837, -1084, 20, 1306, 1866, 1751, 821, -454, -1677, -2477, -3219, -2754, -465, 992, 1865, 2101, 1746, 1035, -808, -2266, -3089, -2852, -2478, -2262, -2415, -2448, -1800, -892, 305, 1849, 3477, 4567, 4957, 4635, 3733, 1921, -187, -2143, -3467, -3150, -2765, -2022, -949, -172, -174, -1012, -1984, -2701, -2601, -1433, -504, 383, 1441, 2492, 3451, 3523, 2778, 1588, 177, -1823, -2881, -1334, 313, 1612, 2352, 2780, 3220, 3906, 4332, 3905, 2269, -707, -4434, -5312, -2894, -1384, -1204, -2629, -4474, -1858, 364, 1118, 407, -700, -1952, -3884, -3589, -2435, 111, 2460, 4196, 4288, 3816, 2902, 2107, 1667, 1119, 1283, 2340, 3940, 5173, 5476, 5470, 4955, 4732, 4214, 3237, 1999, 1127, 887, 633, 213, -584, -1650, -2592, -2208, -765, 618, 1520, 1807, 1684, 1367, 71, -1833, -3356, -3679, -3043, -2363, -1624, -922, -465, -415, -1269, -2531, -2935, -443]
297A769J852J134N4q48r88A434a79k296Q80P74l63k39A34K560K836K092J069o04
279H087k251B254a760l064j717R64M06J200P50N14M01N95b27A537K085J373o1
262D934j310A485h97j243j70L6n47o21j252J406J534g78mj363j397j57J640c89
243A075K43j12l91B78d34n78n17NO16d07n6l21m18k37k26M08d81@A62hp29j497
221b234j860j219J752i98A429J479L72K28L33L11k33l49k55p26p46m55K9L47K86
202B050N12L10n18A157g21j749M87Q83d09g4B11K46Oj10A62c28p85p86q19o94
182c412J04n9P23J095P16L74Q8k43n06r0L76f9A124Q17M08O74N34l23l18k69K38
161B885L55P04J61oM99J453J638N73L0j249l222A075C25R50R37m55a17k575K95
$$ y = [1769, 3621, 4755, 4809, 3961, 2973, 1434, -179, -2475, -1595, -821, -1184, -1423, 134, 2694, 5530, 7622, 8691, 8087, 5836, 2254, -1760, -4824, -6541, -5577, -5171, -3971, -3221, -2707, -2306, -1711, -227, 1537, 3622, 4995, 4934, 3624, 1485, -897, -2140, -2310, -2274, -2821, -3442, -4694, -3288, -1754, -778, -782, -2145, -3542, -3699, -2059, -389, 1075, 1318, 1206, 815, 278, -434, -1012, -1529, -1524, -908, -407, -463, -784, -1202, -1439, -1665, -1257, -481, 0, 162, -8, -737, -2234, -4094, -5313, -3561, -998, 1429, 2908, 3280, 3508, 3841, 4152, 3919, 3570, 3315, 2589, 1843, 1388, 1417, 1764, 2050, 2562, 2872, 2354, 1157, -721, -2470, -1983, -1100, -409, -74, 211, 457, 463, 353, 162, -328, -1113, -1899, -2718, -3412, -3308, -3367, -2644, -1549, -833, -459, -371, -614, -1120, -1210, -834, -69, 1124, 1941, 2349, 3023, 3557, 3234, 2916, 2647, 2885, 3240, 3944, 4105, 4099, 4598, 6051, 7689, 8262, 8292, 7043, 3821, 1075, 325, 1275, 2212, 1757, -117, -2692, -2397]
142b397J110d36n8j182j776J161i37J71p24m28j01J74L1n24j240K00J568E22J633
123B155Q37k22j034E90A59a55k21DO03N95M69K06K92k39q60k83O84J023O87k41
103B940j152C40i95m72L86d93C0K66p4c38o76l48n57q10Ja75B274J338n38A088
82a658j590J188g39K29r86j227i35I50J163L07m57G49c10j150j080r76n88J301
64b803J210N19j42o94o63m99l14k9N96J378M36k70q98m0i85F8Q73J67E44a47E25
42A795Q94j30A064a427j958J624L56j236i49B180K885J501K31q80j683r58nN58
24C829p1r45j287d86j762K20P5n10j444J799h1A310J7D8a919q09O01L80k2O2L08
$$ y = [-2397, -1287, -436, -494, -1676, -3452, -2291, -937, -766, -1490, -1918, -2019, -1845, -1814, -2338, -3578, -3378, -1810, 522, 2155, 2992, 2770, 1736, 590, 159, -155, -376, 4, 607, 1202, 1671, 1877, 2169, 1930, 1070, 787, 1471, 2494, 3181, 2940, 1788, 340, -995, -1467, -1081, -493, 30, 296, 222, -338, -1014, -1362, -1919, -2729, -2728, -175, 2274, 3612, 3074, 1088, -1658, -3248, -2060, -739, -510, -1496, -2723, -935, 950, 2113, 2420, 1963, 749, -310, -1460, -2540, -3516, -4104, -2803, -1593, -1074, -1216, -1910, -2573, -3072, -3386, -3415, -2819, -1441, -1005, -1275, -2173, -2213, -985, 68, 941, 1108, 544, -147, 525, 1795, 2689, 2559, 1064, -1427, -3385, -1761, -1405, -2641, -949, 2180, 5065, 6566, 6797, 5917, 4234, 3276, 3271, 3829, 3758, 2813, 1526, -486, -2248, -2028, -1953, -2463, -3907, -2108, -81, 1310, 1327, 48, -1919, -2728, -2127, -1747, -1769, -1707, -1399]
$$ [...]