
##TITLE=AC1411_PERAH12220_7653061_aPTsmxzTha
##JCAMPDX= 6.0         $$ Bruker NMR JCAMP-DX V2.0
##DATA TYPE= NMR SPECTRUM
##DATA CLASS= NTUPLES
##ORIGIN= BRUKER
##OWNER= Administrator
$$ 1.72 TOPSPIN		Version 2.1
$$ 2013-03-20 02:30:14.282 -0500  Administrator@X
$$ Compression mode = diff/dup
##.OBSERVE FREQUENCY= 400.02188249412
##.OBSERVE NUCLEUS= ^1H
##.ACQUISITION MODE= SIMULTANEOUS (DQD)
##.ACQUISITION SCHEME= undefined
##.AVERAGES= 64
##.DIGITISER RES= 22
##SPECTROMETER/DATA SYSTEM= spect
##.PULSE SEQUENCE= noesygpps1d.comp
##.SOLVENT NAME= COFFEE_meoh
##.SHIFT REFERENCE= INTERNAL, COFFEE_meoh, 1, 14.96091
##AUDIT TRAIL= $$ (NUMBER, WHEN, WHO, WHERE, PROCESS, VERSION, WHAT)
$$ ##TITLE= Audit trail, TOPSPIN		Version 2.1
$$ ##JCAMPDX= 5.01
$$ ##ORIGIN= Bruker BioSpin GmbH
$$ ##OWNER= Administrator
$$ $$ E:\/data/COFFEE/nmr/AC1411_PERAH12220_7653061_aPTsmxzTha/12/pdata/1/auditp.txt
$$ ##AUDIT TRAIL=  $$ (NUMBER, WHEN, WHO, WHERE, PROCESS, VERSION, WHAT)
(   1,<2013-03-20 02:30:08.376 -0500>,<Administrator>,<X>,<go>,<TOPSPIN 2.1>,
      <created by zg
	started at 2013-03-20 02:18:38.470 -0500,
	POWCHK enabled, PULCHK disabled,
       configuration hash MD5:
       86 BA 57 50 F2 9D 5C 9B 26 00 A9 28 5F 66 2E 89
       data hash MD5: 64K
       3A 0A E6 62 74 D7 86 DB BA 9E 2E 47 ED 79 A2 E3>)
(   2,<2013-03-20 02:30:11.470 -0500>,<Administrator>,<X>,<proc1d>,<TOPSPIN 2.1>,
      <Start of raw data processing
       efp LB = 0.3 FT_mod = 6 PKNL = 1 PHC0 = 0 PHC1 = 0 SI = 128K 
       data hash MD5: 128K
       25 6C 6C D7 77 33 D4 AC 7F B6 F3 16 48 A0 E1 33>)
(   3,<2013-03-20 02:30:12.501 -0500>,<Administrator>,<X>,<proc1d>,<TOPSPIN 2.1>,
      <pk PHC0 = -78.35999 PHC1 = 0 
       data hash MD5: 128K
       5E 68 4D E5 22 DD AC F4 2A 4E FF C1 92 FE B8 5B>)
(   4,<2013-03-20 02:30:13.189 -0500>,<Administrator>,<X>,<proc1d>,<TOPSPIN 2.1>,
      <abs ABSG = 1 
       data hash MD5: 128K
       2E 7A 50 0C 18 A7 14 1F 8A 7E 20 09 39 1E 8C B1>)
(   5,<2013-03-20 02:30:13.361 -0500>,<Administrator>,<X>,<proc1d>,<TOPSPIN 2.1>,
      <abs ABSG = 2 
       data hash MD5: 128K
       61 7B 7B 92 CD 76 65 AF 17 2A 44 C0 4B 34 27 53>)
(   6,<2013-03-20 02:30:13.548 -0500>,<Administrator>,<X>,<proc1d>,<TOPSPIN 2.1>,
      <abs ABSG = 3 
       data hash MD5: 128K
       EC 2D B5 EE 82 97 08 53 8E 0E 7E 12 4E 30 C7 83>)
(   7,<2013-03-20 02:30:13.720 -0500>,<Administrator>,<X>,<proc1d>,<TOPSPIN 2.1>,
      <abs ABSG = 4 
       data hash MD5: 128K
       98 AB B1 C5 D3 9B C5 38 AE 8C C7 F5 52 BA 05 22>)
(   8,<2013-03-20 02:30:13.907 -0500>,<Administrator>,<X>,<proc1d>,<TOPSPIN 2.1>,
      <abs ABSG = 5 
       data hash MD5: 128K
       7C 62 A6 A9 C3 CA 16 89 D9 7B 8E 77 E0 76 45 CB>)
$$ ##END=
$$ 
$$ $$ hash MD5
$$ $$ B5 A9 9A C9 2E B9 5B 56 96 9B 38 1E 1C 1E 1E B9
##$RELAX= 
##$RELAX= 
##$RELAX= 
##$RELAX= 
##$RELAX= 
##$RELAX= 
##$RELAX= 
##$RELAX= 
$$ Bruker specific parameters
$$ --------------------------
##$DU= <E:\>
##$EXPNO= 12
$$ [...]
##$TP07= 0
##$TPNAME0= <>
##$TPNAME1= <>
##$TPNAME2= <>
##$TPNAME3= <>
##$TPNAME4= <>
##$TPNAME5= <>
##$TPNAME6= <>
##$TPNAME7= <>
##$TPOAL= (0..7)
0.5 0.5 0.5 0.5 0.5 0.5 0.5 0.5
##$TPOFFS= (0..7)
0 0 0 0 0 0 0 0
##$TUNHIN= 0
##$TUNHOUT= 0
##$TUNXOUT= 0
##$USERA1= <user>
##$USERA2= <user>
##$USERA3= <user>
##$USERA4= <user>
##$USERA5= <user>
##$V9= 5
##$VALIST= <valist>
##$VCLIST= <CCCCCCCCCCCCCCC>
##$VD= 0
##$VDLIST= <DDDDDDDDDDDDDDD>
##$VPLIST= <PPPPPPPPPPPPPPP>
##$VTLIST= <TTTTTTTTTTTTTTT>
##$WBST= 2048
##$WBSW= 25
##$XGAIN= (0..3)
0 0 0 0
##$XL= 0
##$YL= 0
##$YMAX_a= 5877950
##$YMIN_a= -12176319
##$ZGOPTNS= <>
##$ZL1= 120
##$ZL2= 120
##$ZL3= 120
##$ZL4= 120
##$ABSF1= 14.96091
##$ABSF2= -5.597272
##$ABSG= 5
##$ABSL= 3
##$ALPHA= 0
##$AQORDER= 0
##$ASSFAC= 0
##$ASSFACI= 0
##$ASSFACX= 0
##$ASSWID= 0
##$AUNMP= <proc_prof1d_extract.lims>
##$AXLEFT= 0
##$AXNAME= <>
##$AXNUC= <1H>
##$AXRIGHT= 0
##$AXTYPE= 0
##$AXUNIT= <>
##$AZFE= 0.1
##$AZFW= 0.1
##$BCFW= 0
##$BC_mod= 0
##$BYTORDP= 0
##$COROFFS= 0
##$CY= 15
##$DATMOD= 1
##$DC= 0
##$DFILT= <>
##$DTYPP= 0
##$F1P= 0
##$F2P= 0
##$FCOR= 0.5
##$FTSIZE= 131072
##$FT_mod= 6
##$GAMMA= 0
##$GB= 0
##$INTBC= 1
##$INTSCL= 1
##$ISEN= 128
##$LB= 0.3
##$LEV0= 0
##$LPBIN= 0
##$MAXI= 10000
##$MC2= 0
##$MEAN= 0
##$ME_mod= 0
##$MI= 0
##$NCOEF= 0
##$NC_proc= -2
##$NLEV= 6
##$NOISF1= 0
##$NOISF2= 0
##$NSP= 0
##$NTH_PI= 0
##$NZP= 0
##$OFFSET= 14.96091
##$PC= 1
##$PHC0= -78.35999
##$PHC1= 0
##$PH_mod= 1
##$PKNL= yes
##$PPARMOD= 0
##$PPDIAG= 0
##$PPIPTYP= 0
##$PPMPNUM= 2147483647
##$PPRESOL= 1
##$PSCAL= 4
##$PSIGN= 0
##$PYNMP= <proc.py>
##$REVERSE= no
##$SF= 400.020009671536
##$SI= 131072
##$SIGF1= 0
##$SIGF2= 0
##$SINO= 400
##$SIOLD= 131072
##$SPECTYP= <>
##$SREGLST= <1H.CDCl3>
##$SSB= 0
##$STSI= 131072
##$STSR= 0
##$SW_p= 8223.68421052631
##$SYMM= 0
##$S_DEV= 0
##$TDeff= 65536
##$TDoff= 0
##$TI= <>
##$TILT= no
##$TM1= 0
##$TM2= 0
##$TOPLEV= 0
##$USERP1= <user>
##$USERP2= <user>
##$USERP3= <user>
##$USERP4= <user>
##$USERP5= <user>
##$WDW= 1
##$XDIM= 131072
##$YMAX_p= 343953407
##$YMIN_p= -11051
##$CURPLOT= <Network HP LaserJet P1505>
##$CURPRIN= <$Network HP LaserJet P1505>
##$DFORMAT= <normdp>
##$LAYOUT= <+/1D_H.xwp>
##$LFORMAT= <normlp>
##$PFORMAT= <normpl>
##$SURQMSG= 1
$$ End of Bruker specific parameters
$$ ---------------------------------
##NTUPLES= NMR SPECTRUM
##VAR_NAME=  FREQUENCY,     SPECTRUM/REAL,   SPECTRUM/IMAG
##SYMBOL=    X,             R,               I
##VAR_TYPE=  INDEPENDENT,   DEPENDENT,       DEPENDENT
##VAR_FORM=  AFFN,          ASDF,            ASDF
##VAR_DIM=   131072,        131072,          131072
##UNITS=     HZ,            ARBITRARY UNITS, ARBITRARY UNITS
##FACTOR=    0.0627417313425164, 1,          1
##FIRST=     8223.62146879497, 183,          -55870
##LAST=      0,             1775,            -56438
##MIN=       0,             -11051,          0
##MAX=       8223.62146879497, 343953407,    0
$$ Real data points
##PAGE= N=1
##DATA TABLE= (X++(R..R)), XYDATA
$$ [...]
$$ plain form
61763 390230 392451 394737 396867 398516 399468 399735 399597 399643 400592 402805 405968 409385 412461 414835 416354 417225
61747 417225 418039 419214 420459 421045 420517 418927 416643 414287 412600 411814 411281 410299 409190 408887 409459 409873
61731 409873 409404 408547 408168 408463 409259 410699 412906 415364 417358 418927 420803 423472 426722 430014 432908
61716 432908 435196 436990 438635 440279 441686 442732 443749 444989 446014 446175 445486 444379 442775 440101 436308
61701 436308 432171 428393 424997 421776 418799 416168 413772 411573 409728 408133 406293 403994 401676 399787
61687 399787 398147 396411 394762 393595 392744 391589 389783 387422 384663 381716 379082 377203 375886 374648
61673 374648 373598 373319 373740 373857 372885 371145 369426 368028 366891 366138 365800 365343 364195 362681 361791 361986
61657 361986 362846 363930 365329 367099 368725 369652 370074 370752 372136 373949 375582 376613 377047 377301 377994 379510
$$ packed form
61763C90230K221K286K130J649R52K67j38M6R49K213L163L417L076K374J519Q71
61747D17225Q14J175J245N86n28j590k284k356j687p86n33r82j109l03N72M14
61731D09873m69q57l79K95P96J440K207K458J994J569J876K669L250L292K894
61716D32908K288J794J645J644J407J046J017J240J025J61o89j107j604k674l793
61701D36308m137l778l396l221k977k631k396k199j845j595j840k299k318j889
61687C99787j640j736j649j167q51j155j806k361k759k947k634j879j317j238
61673C74648j050k79M21J17r72j740j719j398j137p53l38m57j148j514q90J95
61657C61986Q60J084J399J770J626R27M22O78J384J813J633J031M34K54O93J516
$$ plain form
61641 379510 381637 383728 385260 386248 387082 388033 388970 389620 389997 390398 390911 391131 390600 389347 387713 385748 383207
61624 383207 380150 377080 374332 371729 369084 366649 364721 363148 361634 360362 359851 360284 361326 362464 363099
61609 363099 362403 359736 355395 350584 346338 342594 338469 333281 327252 321390 316770 313742 311662 309432
61595 309432 306340 302351 297770 292959 288390 284579 281733 279533 277451 275281 273347 272238 272189 272639 272497
61580 272497 271129 268944 266791 264928 262942 260578 258138 256027 254416 253462 253322 253720 254020 254033 254208 254665
61564 254665 254561 253112 250881 249316 249112 249734 250524 251476 252642 253529 253648 253368 253635 254961 257058 259366
61548 259366 261525 263275 264341 264671 264589 264449 264232 263706 262951 262469 262688 263625 265093 267019 269332 271777 274127
61531 274127 276417 278601 280142 280446 279731 279007 278974 279347 279433 278970 278071 276795 275264 273944 273224 272722 271515
$$ packed form
61641C79510K127K091J532R88Q34R51R37O50L77M01N13K20n31j253j634j965k541
61624C83207l057l070k748k603k645k435j928j573j514j272n11M33J042J138O35
61609C63099o96k667m341m811m246l744m125n188o029n862m620l028k080k230
61595C09432l092l989m581m811m569l811k846k200k082k170j934j109m9M50j42
61580B72497j368k185k153j863j986k364k440k111j611r54j40L98L00J3J75M57
61564B54665j04j449k231j565k04O22P90R52J166Q87J19k80K67J326K097K308
61548B59366K159J750J066L30q2j40k17n26p55m82K19R37J468J926K313K445K350
61531B74127K290K184J541L04p15p24l3L73Q6m63q99j276j531j320p20n02j207
$$ plain form
61514 271515 269199 266368 263971 262453 261683 261443 261678 262290 262925 263167 262956 262625 262377 261882 260766 259405 258734
61497 258734 259055 259486 258976 257536 256075 255296 255251 255760 256698 257814 258731 259221 259253 258889 258420 258452 259341 260604
61479 260604 261368 261438 261433 261848 262591 263530 264889 266752 268698 270299 271618 272819 273639 273659 272923 271948 271289 271333
61461 271333 272249 273796 275379 276589 277516 278259 278443 277675 276304 275223 274946 275227 275596 275880 276167 276595 277284
61444 277284 278229 279258 280286 281604 283610 286206 288760 290764 292270 293618 294982 296372 297833 299403
61430 299403 300946 302257 303356 304519 305938 307409 308534 309309 310346 312245 314751 316885 318052 318700 319654
61415 319654 321136 322809 324497 326259 327894 328982 329550 330087 330673 330625 329338 327116 324759 322681 320870
61400 320870 319398 318404 317637 316616 315319 314307 313986 314069 313964 313446 312709 311973 311295 310726 310392 310338 310362 310075
$$ packed form
61514B71515k316k831k397j518p70k40K35O12O35K42k11l31k48m95j116j361o71
61497B58734L21M31n10j440j461p79m5N09R38J116R17M90L2l64m69L2Q89J263
61479B60604P64P0nM15P43R39J359J863J946J601J319J201Q20K0p36r75o59M4
61461B71333R16J547J583J210R27P43J84p68j371j081k77K81L69K84K87M28O89
61444B77284R45J029J028J318K006K596K554K004J506J348J364J390J461J570
61430B99403J543J311J099J163J419J471J125P75J037J899K506K134J167O48R54
61415C19654J482J673J688J762J635J088N68N37N86m8j287k222k357k078j811
61400C20870j472r94p67j021j297j012l21Q3j05n18p37p36o78n69l34n4K4k87
$$ plain form
61382 310075 309189 307800 306390 305480 305270 305619 306342 307412 308871 310676 312639 314500 316093 317514 318994
61367 318994 320471 321371 321170 320213 319640 320318 322089 324213 326260 328247 330187 332076 334289 337470 341798
61352 341798 346681 351417 355944 360734 366152 372181 378668 385496 392445 399042 404659 408881 411860 414333
61338 414333 417056 420113 422964 425317 427677 430713 434248 437272 439026 439746 440221 440881 441486 441498 440591 438886
61322 438886 436833 434822 432912 431011 429326 428426 428703 429930 431512 433121 434944 437378 440660 444870 450209
61307 450209 457097 465756 475619 485411 494130 502010 510148 519057 527909 535373 540882 544702 547023 547578
61293 547578 546257 543610 540351 536559 531692 525390 518045 510474 503243 496433 489987 484006 478550 473348
61279 473348 468044 462760 458155 454755 452416 450607 449068 447975 447572 447917 448997 450796 453120 455545 457738
$$ packed form
61382C10075q86j389j410r10k10L49P23J070J459J805J963J861J593J421J480
61367C18994J477R00k01r57n73O78J771K124K047J987J940J889K213L181M328
61352C41798M883M736M527M790N418O029O487O828O949O597N617M222K979K473
61338D14333K723L057K851K353K360L036L535L024J754P20M75O60O05J2r07j705
61322D38886k053k011j910j901j685r00K77J227J582J609J823K434L282M210N339
61307D50209O888Q659R863R792Q719P880Q138Q909Q852P464N509L820K321N55
61293E47578j321k647l259l792m867o302p345p571p231o810o446n981n456n202
61279D73348n304n284m605l400k339j809j539j093m03L45J080J799K324K425K193
$$ plain form
61264 457738 459838 462422 466039 470772 476206 481814 487351 492870 498482 504287 510466 517179 524165 530658
61250 530658 535927 539855 542849 545336 547545 549603 551509 553041 553943 554258 554240 553966 553257 551986 550233 548183
61234 548183 546161 544700 544132 544024 543454 542068 540537 539761 539974 540957 542694 545280 548356 551248 553763 556413
61218 556413 559686 563378 566835 569651 572015 574478 577506 581121 584863 588124 590539 592092 593022 593842 595313
61203 595313 597970 601526 605030 607876 610533 614052 619031 625297 632495 640601 649691 659536 669721 680034
61189 680034 690513 701082 711379 720947 729358 736117 740718 743059 743668 743379 742860 742523 742534 742508 741485
61174 741485 738785 734943 731242 728129 724588 719395 712583 705249 698268 691666 685120 678456 671545 664033
61160 664033 655447 645578 634808 624050 614099 604894 595710 586296 577439 570048 564058 558828 554271 550862
$$ packed form
61264D57738K100K584L617M733N434N608N537N519N612N805O179O713O986O493
61250E30658N269L928K994K487K209K058J906J532R02L15j8k74p09j271j753k050
61234E48183k022j461n68j08n70j386j531p76K13R83J737K586L076K892K515K650
61218E56413L273L692L457K816K364K463L028L615L742L261K415J553R30Q20J471
61203E95313K657L556L504K846K657L519M979O266P198Q106R090R845J0185J0313
61189F80034J0479J0569J0297R568Q411O759M601K341O09k89n19l37J1k6j023
61174G41485k700l842l701l113l541n193o812p334o981o602o546o664o911p512
61160F64033q586r869j0770j0758r951r205r184r414q857p391n990n230m557l409
$$ plain form
61146 550862 548614 546848 545112 543548 542104 540065 536799 532432 527388 521731 515498 509252 503782 499474
61132 499474 496371 494584 494131 494605 495512 496879 499144 502622 507451 513865 522001 531543 542043 553537
61118 553537 566376 580561 595766 611997 629637 648720 668696 689107 710011 731507 753249
61107 753249 774680 795366 814928 833036 849816 865862 881393 895596 907215 915670 921298 924613
61095 924613 925656 924044 919344 911395 900464 887167 872114 855647 837993 819535 800737 781868
61083 781868 762955 744010 725186 706708 688757 671460 654952 639496 625502 613230 602388
61072 602388 592190 582029 572028 562830 554950 548509 543463 539813 537509 536322 535963 536294 537397 539438
61058 539438 542426 546102 550114 554368 559185 565041 572155 580326 589167 598548 608841 620680 634353
$$ packed form
61146E50862k248j766j736j564j444k039l266m367n044n657o233o246n470m308
61132D99474l103j787m53M74R07J367K265L478M829O414Q136R542J0500J1494
61118E53537J2839J4185J5205J6231J7640J9083J9976K0411K0904K1496K1742
61107G53249K1431K0686J9562J8108J6780J6046J5531J4203J1619Q455N628L315
61095I24613J043j612m700p949j0931j3297j5053j6467j7654j8458j8798j8869
61083G81868j8913j8945j8824j8478j7951j7297j6508j5456j3994j2272j0842
61072F02388j0198j0161j0001r198p880o441n046l650k304j187l59L31J103K041
61058E39438K988L676M012M254M817N856P114Q171Q841R381J0293J1839J3673
$$ plain form
61045 634353 649522 665689 682844 701424 721651 743236 765879 789778 815435 843066 872371
61034 872371 902790 933956 966085 999938 1036188 1074719 1114812 1156087 1198931 1243930 1291339
61023 1291339 1341429 1394913 1452548 1514675 1581818 1655665 1738864 1833729 1941553 2063303 2200641
61012 2200641 2356326 2534238 2739636 2979760 3264626 3607864 4027032 4542532 5174468
61003 5174468 5937075 6831509 7841021 8934572 10080467 11261632 12479708 13743370
60995 13743370 15049149 16366368 17631117 18749897 19616646 20146050 20312494 20169689 19832095
60986 19832095 19425844 19038834 18695132 18356424 17939250 17341427 16477894 15318602 13908271
60977 13908271 12352104 10775158 9282030 7937987 6771499 5785218 4965974 4292613
$$ packed form
61045F34353J5169J6167J7155J8580K0227K1585K2643K3899K5657K7631K9305
61034H72371L0419L1166L2129L3853L6250L8531M0093M1275M2844M4999M7409
61023A291339N0090N3484N7635O2127O7143P3847Q3199R4865J07824J21750J37338
61012B200641J55685J77912K05398K40124K84866L43238M19168N15500O31936
61003E174468P62607Q94434J009512J093551J145895J181165J218076J263662
60995A3743370J305779J317219J264749J118780Q66749N29404J66444j42805l37594
60986A9832095m06251l87010l43702l38708m17174n97823q63533j159292j410331
60977A3908271j556167j576946j493128j344043j166488r86281q19244o73361
$$ plain form
60969 4292613 3742265 3293806 2928304 2628746 2380806 2173650 1999362 1851594 1724915
60960 1724915 1614989 1518716 1433934 1359021 1292614 1233463 1180510 1133142 1091185 1054470 1022454
60949 1022454 994412 969868 948541 929743 912113 894238 875667 857145 839841 824382 810665
60938 810665 798313 786969 776200 765494 754604 743759 733368 723607 714361 705419 696593 687798
60926 687798 679215 671283 664397 658677 654122 650802 648676 647395 646603 646368 647023 648630 650933 653832 657545
60911 657545 662152 667322 672740 678605 685462 693623 702888 712777 722909 733211 743853 754988 766463
60898 766463 777827 788615 798560 807568 815618 822698 828750 833629 837257 839819 841659 842931 843406 842632
60884 842632 840136 835587 829005 820832 811544 801156 789409 776495 763247 750401 738008 725815
$$ packed form
60969D292613n50348m48459l65502k99558k47940k07156j74288j47768j26679
60960A724915j09926r6273q4782p4913o6407n9151n2953m7368m1957l6715l2016
60949A022454k8042k4544k1327j8798j7630j7875j8571j8522j7304j5459j3717
60938H10665j2352j1344j0769j0706j0890j0845j0391r761r246q942q826q795
60926F87798q583p932o886n720m555l320k126j281p92k35O55J607K303K899L713
60911F57545M607N170N418N865O857Q161R265R889J0132J0302J0642J1135J1475
60898G66463J1364J0788R945R008Q050P080O052M879L628K562J840J272M75p74
60884H42632k496m549o582q173r288j0388j1747j2914j3248j2846j2393j2193
$$ plain form
60872 725815 713853 702265 690920 679708 669056 659570 651181 643186 635198 627476 620181 612876 605197
60859 605197 597576 590853 585326 580540 575877 570963 565558 559488 552743 545523 538142 531043 524707 519265
60845 519265 514213 508788 502676 496155 489627 483287 477178 471243 465263 459022 452593 446167 439619 432680
60831 432680 425675 419567 414885 410943 406592 401561 396634 392665 389900 388177 387170 386294 384874 382778
60817 382778 380636 379142 378357 377927 377751 378005 378568 378866 378494 377767 377401 377691 378242 378550 378673 379054 379803 380448
60799 380448 380589 380503 380806 381581 382210 382135 381467 380665 379913 379034 377894 376571 375110 373341 371042 368282 365568
60782 365568 363585 362626 362254 361626 360242 358285 356174 354044 351811 349554 347498 345605 343559 341288 339334
60767 339334 338394 338459 338647 338121 337160 336968 338239 340172 341340 341350 341023 340879 340233 338339 335848 334274 334222 334960
$$ packed form
60872G25815j1962j1588j1345j1212j0652r486q389p995p988p722p295p305p679
60859F05197p621o723n527m786m663m914n405o070o745p220p381p099o336n442
60845E19265n052n425o112o521o528o340o109n935n980o241o429o426o548o939
60831D32680p005o108m682l942m351n031m927l969k765j723j007q76j420k096
60817C82778k142j494p85m30j76K54N63K98l72p27l66K90N51L08J23L81P49O45
60799C80448J41q6L03P75O29p5o68q02p52q79j140j323j461j769k299k760k714
60782C65568j983r59l72o28j384j957k111k130k233k257k056j893k046k271j954
60767C39334r40O5J88n26r61j92J271J933J168J0l27j44o46j894k491j574n2P38
$$ plain form
60749 334960 335761 336761 338210 339719 340884 342111 344025 346382 348347 349775 351392 353521 355348 355870 355050
60734 355050 353463 351118 347355 342002 336096 331120 327719 325354 323094 320504 317807 315403 313333 311204
60720 311204 308633 305749 303122 301142 299584 297933 296083 294466 293479 292999 292581 291960 291175 290307 289353 288357
60704 288357 287458 286703 285922 284881 283520 282024 280728 280000 280106 280988 282203 283169 283598 283707 283984 284779 286115
60687 286115 287798 289642 291558 293517 295516 297616 299967 302699 305805 309105 312391 315607 318891 322400
60673 322400 326092 329697 332865 335368 337247 338938 341220 344703 349112 353143 355390 355544 354575 353715 353398
60658 353398 353255 352838 352042 350920 349457 347769 346313 345612 345723 346172 346506 346758 347178 347673 347873 347742 347678 347814
60640 347814 347562 346218 343741 340581 337029 333286 329942 327614 326000 324036 321248 318342 316113 314415
$$ packed form
60749C34960Q01J000J449J509J165J227J914K357J965J428J617K129J827N22q20
60734C55050j587k345l763n353n906m976l401k365k260k590k697k404k070k129
60720C11204k571k884k627j980j558j651j850j617r87m80m18o21p85q68r54r96
60704B88357q99p55p81j041j361j496j296p28J06Q82J215R66M29J09K77P95J336
60687B86115J683J844J916J959J999K100K351K732L106L300L286L216L284L509
60673C22400L692L605L168K503J879J691K282L483M409M031K247J54r69q60l17
60658C53398j43m17p96j122j463j688j456p01J11M49L34K52M20M95K00j31o4J36
60640C47814k52j344k477l160l552l743l344k328j614j964k788k906k229j698
$$ plain form
60626 314415 312703 311030 309810 308984 308168 307433 307201 307436 307603 307406 306927 306107 304799 303425 302841 303267 304003
60609 304003 304476 304958 305877 307044 308059 308982 310030 310993 311507 311695 311972 312407 312790 313217 314083 315517 317250
60592 317250 319017 320706 322168 323319 324431 325861 327400 328321 328229 327573 327097 327059 327185 327236 327394 328087 329490
60575 329490 331314 333210 335403 338617 343191 348601 354219 360196 367072 374685 382202 389277 396489 404383
60561 404383 412629 420435 427246 432643 436081 437329 436868 435302 432587 428437 423367 418678 415323 413284
60547 413284 412208 412189 413720 417208 422772 430196 438797 447617 456074 464361 472946 481805 490368 498208 505499
60532 505499 512646 519581 525567 529742 531802 532030 530681 527572 522543 516182 509675 503860 498798 494424
60518 494424 491170 489432 488699 487833 486303 484661 483689 483536 483982 485146 487484 491230 496274 502566 510250
$$ packed form
60626C14415j712j673j220q26q16p35k32K35J67j97m79q20j308j374n84M26P36
60609C04003M73M82R19J167J015R23J048R63N14J88K77M35L83M27Q66J434J733
60592C17250J767J689J462J151J112J430J539R21r2o56m76l8J26N1J58O93J403
60575C29490J824J896K193L214M574N410N618N977O876P613P517P075P212P894
60561D04383Q246P806O811N397L438J248m61j566k715m150n070m689l355k039
60547D13284j076j9J531L488N564P424Q601Q820Q457Q287Q585Q859Q563P840P291
60532E05499P147O935N986M175K060K28j349l109n029o361o507n815n062m374
60518D94424l254j738p33q66j530j642r72j53M46J164K338L746N044O292P684
$$ plain form
60503 510250 519405 530050 542608 558008 577016 599505 624618 651635 680541 711722 745208 780200
60491 780200 815231 848735 879513 906730 929587 947103 958229 962070 958008 945826 925910 899262
60479 899262 867158 830806 791377 750219 708772 668266 629719 594244 563073 536961 515590
60468 515590 497711 481960 467638 454849 443964 434919 427010 419436 411988 405083 399125 394057 389563
60455 389563 385435 381553 377737 373910 370273 367107 364439 362155 360273 358856 357673 356302 354541 352441
60441 352441 350046 347469 345222 343912 343490 343274 342981 343247 344665 346686 348029 348028 347076 345830 344512 343098
60425 343098 341735 340718 340179 339943 339675 339236 338926 339161 339796 340177 340212 340967 343535 347516 351251 353579 354732
60408 354732 355505 356316 357227 358133 358594 358172 357362 357514 359290 361745 363531 364464 365218 365996 366471 366790 367661 369370
$$ packed form
60503E10250R155J0645J2558J5400J9008K2489K5113K7017K8906L1181L3486L4992
60491G80200L5031L3504L0778K7217K2857J7516J1126L841m062j2182j9916k6648
60479H99262l2104l6352l9429m1158m1447m0506l8547l5475l1171k6112k1371
60468E15590j7879j5751j4322j2789j0885r045p909p574p448o905n958n068m494
60455C89563m128l882l816l827l637l166k668k284j882j417j183j371j761k100
60441C52441k395k577k247j310m22k16k93K66J418K021J343jr52j246j318j414
60425C43098j363j017n39k36k68m39l10K35O35L81L5P55K568L981L735K328J153
60408C54732P73Q11R11R06M61m22q10J52J776K455J786R33P54P78M75L19Q71J709
$$ plain form
60390 369370 371437 373353 375006 376360 377393 378530 380473 383342 386478 389326 391952 394524 396854 398832
60376 398832 400747 402745 404455 405648 406884 408856 411301 413199 414084 414616 415680 417300 418687 419196 419074
60361 419074 419290 420679 423289 426557 430103 434150 439096 444748 450209 454622 458030 461437 465923 471680
60347 471680 478046 484472 491065 497882 504056 508233 509895 509748 508699 506928 504159 500358 495773 490541
60333 490541 484607 477967 470843 463737 457306 451944 447421 443232 439330 436108 433595 431184 428400 425450
60319 425450 422688 420033 417371 415164 414150 414666 416623 419823 423863 428138 432588 438188 446098 456394
60305 456394 468229 481085 495214 510838 527549 544551 560892 575335 586645 594313 598602 599671
60293 599671 597064 590273 579419 565182 548483 530512 512701 496201 481469 468587 457792 449407
$$ packed form
60390C69370K067J916J653J354J033J137J943K869L136K848K626K572K330J978
60376C98832J915J998J710J193J236J972K445J898Q85N32J064J620J387N09j22
60361D19074K16J389K610L268L546M047M946N652N461M413L408L407M486N757
60347D71680O366O426O593O817O174M177J662j47j049j771k769l801m585n232
60333D90541n934o640p124p106o431n362m523m189l902l222k513k411k784k950
60319D25450k762k655k662k207j014N16J957L200M040M275M450N600P910J0296
60305D56394J1835J2856J4129J5624J6711J7002J6341J4443J1310P668M289J069
60293E99671k607o791j0854j4237j6699j7971j7811j6500j4732j2882j0795q385
$$ plain form
60281 449407 443369 439076 435750 432866 430270 427977 425846 423590 421127 418769 416758 414760 412134 408721
60267 408721 405024 401593 398592 395982 393743 391800 390054 388619 387683 386993 385842 383807 381280 379075 377734
60252 377734 377286 377412 377714 378099 378996 380811 383066 384516 384402 383195 381889 381060 380957 381908 383886 385977
60236 385977 387114 387390 388040 389971 392741 395141 396386 396612 396600 397217 398885 401360 404126 406978 409984 412923
60220 412923 415205 416607 417743 419465 421961 424799 427810 431465 436191 441579 446635 450796 454473 458474
60206 458474 463150 468260 473519 478930 484644 490772 497334 504055 510193 514973 518425 521413 524594 527742
60192 527742 530418 532853 535517 538093 539647 539899 539552 539133 538148 535901 532664 529441 526741 524141 521029
60177 521029 517279 513133 508820 504519 500414 496595 493003 489617 486574 484000 481817 479807 477803 475804
$$ packed form
60281D49407o038m293l326k884k596k293k131k256k463k358k011j998k626l413
60267D08721l697l431l001k610k239j943j746j435r36o90j151k035k527k205j341
60252C77734m48J26L02L85Q97J815K255J450j14j207j306q29j03R51J978K091
60236C85977J137K76O50J931K770K400J245K26j2O17J668K475K766K852L006K939
60220D12923K282J402J136J722K496K838L011L655M726N388N056M161L677M001
60206D58474M676N110N259N411N714O128O562O721O138M780L452K988L181L148
60192E27742K676K435K664K576J554K52l47m19r85k247l237l223k700k600l112
60177E21029l750m146m313m301m105l819l592l386l043k574k183k010k004j999
$$ plain form
60163 475804 473956 472439 471204 469813 467816 465452 463755 463663 465063 466943 468377 469126 469389 469433 469582 470145
60147 470145 471058 471803 471943 471659 471627 472506 474655 478018 481971 485530 488176 490458 493434 497519 502209 506886
60131 506886 511436 515981 520368 524202 527242 529602 531679 533833 535921 537198 537070 536055 535545 536367 537883
60116 537883 538842 538837 538520 538632 539281 540184 541237 542621 544497 546639 548349 548853 547990 546469 545266 544663 543946
60099 543946 542101 538850 535121 532454 531726 532335 532766 532007 530281 528484 527334 527207 528282 530340 532697
60084 532697 534849 537054 539816 542881 545281 546398 546473 545932 544817 543191 541658 540845 540435 539133 535723
60069 535723 530021 522845 515263 507911 500849 493873 486901 480103 473722 467893 462579 457591 452678 447776
60055 447776 443207 439438 436539 434086 431786 430022 429449 430113 431373 432763 434482 436751 439144 441133 443127
$$ packed form
60163D75804j848j517j235j391j997k364j697r2J400J880J434P49K63M4J49N63
60147D70145R13P45J40k84l2Q79K149L363L953L559K646K282K976M085M690M677
60131E06886M550M545M387L834L040K360K077K154K088J277j28j015n10Q22J516
60116E37883R59nl17J12O49R03J053J384J876K142J710N04q63j521j203o03p17
60099E43946j845l251l729k667p28O09M31p59j726j797j150j27J075K058K357
60084E32697K152K205K762L065K400J117P5n41j115j626j533q13m10j302l410
60069E35723n702p176p582p352p062o976o972o798o381n829n314m988m913m902
60055D47776m569l769k899k453k300j764n73O64J260J390J719K269K393J989J994
$$ plain form
60040 443127 446197 450605 455290 459267 462928 467284 472227 476402 478824 479854 480393 480738 480584 479688 478091
60025 478091 475941 473424 470622 467229 462687 456875 450423 444146 438451 433477 429382 426082 423013 419626
60011 419626 415929 412224 408581 404920 401376 398118 395042 392055 389430 387431 385859 384474 383603 383656 384170
59996 384170 384068 382899 381266 380046 379792 380849 383334 386750 390218 393262 395930 398114 399420 399908 400296
59981 400296 401164 402430 403848 405436 407131 408606 409709 410546 410872 410064 408070 405749 403813 402075 400247
59966 400247 398750 398036 397673 397000 396305 396515 398010 400449 403472 406667 409154 410167 410112 410120 410521 410566 409730 408409
59948 408409 407131 405986 405175 405252 406319 407655 408748 410121 412484 415509 418118 419762 420772 421530 421895
59933 421895 421557 420557 419295 418217 417554 417228 416994 416702 416391 416173 416248 417026 418957 422015 425568 428895 431718
$$ packed form
60040D43127L070M408M685L977L661M356M943M175K422J030N39L45j54q96j597
60025D78091k150k517k802l393m542n812o452o277n695m974m095l300l069l387
60011D19626l697l705l643l661l544l258l076k987k625j999j572j385q71N3N14
59996C84170j02j169j633j220k54J057K485L416L468L044K668K184J306M88L88
59981D00296Q68J266J418J588J695J475J103Q37L26q08j994k321j936j738j828
59966D00247j497p14l63o73o95K10J495K439L023L195K487J013n5QM01M5q36j321
59948D08409j278j145q11P7J067J336J093J373K363L025K609J644J010P58L65
59933D21895l38j000j262j078o63l26k34k92l11k18P5P78J931L058L553L327K823
$$ plain form
59916 431718 434190 436667 439590 443214 447184 450701 453423 455921 458915 462303 465356 467684 469499 470986
59902 470986 471907 471985 471341 470339 469195 467867 466307 464729 463601 463247 463462 463737 463990 464799 466681 469393
59886 469393 472287 475146 478278 481980 486368 491579 497493 503214 507574 510491 513311 517324 522247 526603
59872 526603 529384 530856 531775 532286 531767 529531 525553 520581 515584 511066 506945 503044 499507 496690 494794
59857 494794 493777 493466 493609 494018 494837 496510 499270 502766 506470 510342 514810 520140 526097 532141 537623
59842 537623 541839 544309 545204 545178 544693 543762 542537 541667 541650 541978 541400 539116 535379 530910 526051 520785 515323
59825 515323 510244 505937 502192 498558 494993 491868 489311 486826 483772 480044 476061 472217 468671 465683
59811 465683 463778 463338 464119 465283 465903 465486 464200 462653 461302 460017 458360 456253 454073 451983 449554
$$ packed form
59916D31718K472K477K923L624L970L517K722K498K994L388L053K328J815J487
59902D70986R21P8o44j002j144j328j560j578j128l54K15K75K53Q09J882K712
59886D69393K894K859L132L702M388N211N914N721M360K917K820M013M923M356
59872E26603K781J472R19N11n19k236l978m972m997m518m121l901l537k817j896
59857D94794j017l11J43M09Q19J673K760L496L704L872M468N330N957O044N482
59842E37623M216K470Q95k6m85r31j225q70j7L28n78k284l737m469m859n266n462
59825E15323n079m307l745l634l565l125k557k485l054l728l983l844l546k988
59811D65683j905m40P81J164O20m17j286j547j351j285j657k107k180k090k429
$$ plain form
59796 449554 446344 442642 439234 436541 434337 432255 430276 428646 427582 427098 426987 426985 427147 427877 429305 430767
59780 430767 431412 431295 431348 432130 433170 433819 434165 434563 434796 434434 433817 433858 434785 435808 436232 436305 436655 437461 438614
59761 438614 440197 442213 444139 445419 446358 447934 450700 454308 458150 461907 465349 468208 470611 473277
59747 473277 476876 481412 486528 492026 497682 502829 506726 509335 511308 513239 515358 517840 520780 523695
59733 523695 525594 525951 525312 524635 524343 524301 524407 524712 525073 525120 524623 523615 522190 520479 518905 518112 518410 519322
59715 519322 519817 519054 517024 514532 512524 511389 510960 511101 511978 513606 515499 517096 518357 519556 520641
59700 520641 521316 521784 522893 525285 528686 532251 535346 537731 539271 539892 539840 539645 539673 539807 539663 539037 538079
59683 538079 537078 536160 535231 534143 532812 531180 529175 526793 524161 521428 518656 515864 513061 510120 506720
$$ packed form
59796D49554l210l702l408k693k204k082j979j630j064m84j11kJ62P30J428J462
59780D30767O45j17N3P82J040O49L46L98K33l62o17M1R27J023M24P3L50Q06J153
59761D38614J583K016J926J280R39J576K766L608L842L757L442K859K403K666
59747D73277L599M536N116N498N656N147L897K609J973J931K119K482K940K915
59733E23695J899L57o39o77k92m2J06L05L61M7m97j008j425j711j574p93K98R12
59715E19322M95p63k030k492k008j135m29J41Q77J628J893J597J261J199J085
59700E20641O75M68J109K392L401L565L095K385J540O21n2j95K8J34j44o26r58
59683E38079j001r18r29j088j331j632k005k382k632k733k772k792k803k941l400
$$ plain form
59668 506720 502611 497950 493218 488796 484735 480961 477585 474982 473522 473156 473267 473108 472525 472104 472457 473546
59652 473546 474876 476129 477319 478509 479747 481167 482709 483793 483757 482701 481500 480825 480535 480130 479340 478014
59636 478014 475873 472769 468988 465059 461427 458465 456445 455156 453832 451873 449548 447633 446508 445904
59622 445904 445429 444943 444406 443622 442251 439962 436695 432896 429339 426490 424236 422437 421385 421281 421511 421177
59606 421177 420343 420091 421046 422472 423236 423215 423224 423825 424812 425770 426529 426962 426944 426810 427394 429115 431270 432735 433227
59587 433227 433369 433543 433378 432598 431753 431525 431706 431500 430720 429927 429345 428276 425924 422417 418684 415584 413382
59570 413382 411815 410376 408668 406686 404655 402618 400441 398274 396590 395553 394769 393903 393237 393227 393861 394787
59554 394787 395839 397006 398173 399394 401228 404255 408249 412258 415617 418574 421963 426583 432872 440776
$$ packed form
59668E06720m109m661m732m422m061l774l376k603j460l66J11j59n83m21L53J089
59652D73546J330J253J190J190J238J420J542J084l6j056j201o75k90m05p90j326
59636D78014k141l104l781l929l632k962k020j289j324j959k325j915j125o04
59622D45904m75m86n37p84j371k289l267l799l557k849k254j799j052j04K30l34
59606D21177q34k52R55J426P64k1RO01R87R58P59M33j8j34N84J721K155J465M92
59587D33227J42J74j65p80q45k28J81k06p80p93n82j069k352l507l733l100k202
59570D13382j567j439j708j982k031k037k177k167j684j037p84q66o66j0O34R26
59554C94787J052J167J167J221J834L027L994M009L359K957L389M620O289P904
$$ plain form
59540 440776 449779 459244 468812 478480 488405 498761 509522 520224 530211 539252 547414 553991 557225
59527 557225 555904 550990 544856 539118 534068 529947 527515 527021 527643 528543 529694 531114 532053 531666 529989
59512 529989 527542 524405 520350 515557 510363 504518 497461 489301 480837 472594 464503 456643 449603 443791
59498 443791 438895 434463 430699 428218 427128 426743 426283 425620 425186 425334 425996 427015 428536 430779 433491 435963
59482 435963 437760 439276 441393 444642 448780 453108 457165 461197 465902 471586 477607 482987 487493 491744
59468 491744 496113 500066 502839 504368 505154 505511 505427 505011 504649 504768 505735 507851 511177 515461 520515 526492
59452 526492 533476 541047 548691 556456 564727 573430 581941 589739 596641 602384 606505 608764 609254 607966
59438 607966 604686 599481 592853 585244 576788 567801 559125 551563 545170 539412 533873 528582 523828 519940
$$ packed form
59540D40776R003R465R568R668R925J0356J0761J0702R987R041Q162O577L234
59527E57225j321m914o134n738n050m121k432m94O22R00J151J420R39l87j677
59512E29989k447l137m055m793n194n845p057q160q464q243q091p860p040n812
59498D43791m896m432l764k481j090l85m60o63m34J48O62J019J521K243K712K472
59482D35963J797J516K117L249M138M328M057M032M705N684O021N380M506M251
59468D91744M369L953K773J529P86L57q4m16l62J19R67K116L326M284N054N977
59452E26492O984P571P644P765Q271Q703Q511P798O902N743M121K259M90j288
59438F07966l280n205o628p609q456q987q676p562o393n758n539n291m754l888
$$ plain form
59424 519940 517226 515901 516040 517668 520897 525973 533246 543036 555412 570164 587069 605950 626161
59411 626161 646252 664691 680999 695747 709413 721599 731259 737048 737471 731701 720834 707768
59399 707768 695230 684268 674986 667930 663792 662072 660972 658555 653330 643968 629583 610733 589504
59386 589504 568200 548274 530492 515377 503071 493256 485618 480123 476633 474673 473867 474190 475465
59373 475465 477062 478526 480196 482684 485925 489179 491885 494097 496191 498581 501731 506011 511318 517060
59359 517060 522648 527993 533535 539797 546881 554377 561981 570198 580034 591720 604096 615746 626526
59346 626526 637493 649393 661872 674311 686842 700076 714039 727816 740238 750698 759188 765731
59334 765731 770016 771681 770800 767777 762723 755319 745538 734192 722324 710234 697580 684408 671537
$$ packed form
59424E19940k714j325J39J628L229N076P273R790J2376J4752J6905J8881K0211
59411F26161K0091J8439J6308J4748J3666J2186R660N789M23n770j0867j3066
59399G07768j2538j0962r282p056m138j720j100k417n225r362j4385j8850k1229
59386E89504k1304j9926j7782j5115j2306r815p638n495l490j960q06L23J275
59373D75465J597J464J670K488L241L254K706K212K094K390L150M280N307N742
59359E17060N588N345N542O262P084P496P604Q217R836J1686J2376J1650J0780
59346F26526J0967J1900J2479J2439J2531J3234J3963J3777J2422J0460Q490O543
59334G65731M285J665q81l023n054p404r781j1346j1868j2090j2654j3172j2871
$$ plain form
59321 671537 659741 648966 638657 628588 619151 610931 604203 598785 594318 590665 587899 585865 584061
59308 584061 582374 581697 583174 586843 591646 596850 602717 609513 616721 623840 631289 639612 648120 655105
59294 655105 659191 659747 656245 648352 636896 623887 611100 599144 588135 578550 570855 564863 560144
59281 560144 556717 554749 553796 553119 552740 553536 556164 560344 565354 570724 576274 581982 588171 595394 603659
59266 603659 612042 619550 626164 632499 638558 643451 646390 647372 646704 644481 640929 636601 631624 625177 616487
59251 616487 606227 596198 587608 580248 573415 567001 561455 557236 554517 553031 552019 550798 549595 549298
59237 549298 550269 552001 554184 557294 561548 566003 569470 571856 573778 575226 575606 574913 573864 572772 571100
59222 571100 568303 564462 559958 555143 550447 546140 541929 537511 533576 531342 530711 529850 527282 523654 520721
$$ packed form
59321F71537j1796j0775j0309j0069r437q220o728n418m467l653k766k034j804
59308E84061j687o77J477L669M803N204N867O796P208P119P449Q323Q508O985
59294F55105M086N56l502p893j1456j3009j2787j1956j1009r585p695n992m719
59281E60144l427j968r53o77l79P96K628M180N010N370N550N708O189P223Q265
59266F03659Q383P508O614O335O059M893K939R82o68k223l552m328m977o447q690
59251F16487j0260j0029q590p360o833o414n546m219k719j486j012j221j203k97
59237E49298R71J732K183L110M254M455L467K386J922J448L80o93j049j092j672
59222E71100k797l841m504m815m696m307m211m418l935k234o31q61k568l628k933
$$ plain form
59207 520721 519211 518582 518442 519034 520321 521525 521957 521776 521689 522249 523590 525427 527139 528190 528715 529528 531349
59190 531349 534137 537240 540009 542179 543820 545179 546583 548342 550592 553127 555424 556969 557699 558083 558740
59175 558740 559975 561664 563476 565185 566957 569353 572920 577605 582692 587401 591513 595441 599861 605303
59161 605303 611776 618622 624894 630060 634186 637425 639651 640752 640908 640226 638371 635052 630719 626271 622050
59146 622050 617563 612310 606490 600662 595028 589328 583324 577164 571305 566182 561884 558056 554143 549862
59132 549862 545446 541439 538282 536090 534675 533650 532580 531184 529536 528072 527369 527877 529763 532885 536843
59117 536843 541192 545788 550934 556990 563849 571013 578184 585422 592557 598967 604351 609402 615053 621231
59103 621231 626977 631812 636276 640927 645532 649564 652872 655375 656650 656489 655561 654897 654817 654886 654717 654291
$$ packed form
59207E20721j510o29j40N92J287J204M32j81q7N60J341J837J712J051N25Q13J821
59190E31349K788L103K769K170J641J359J404J759K250K535K297J545P30L84O57
59175E58740J235J689J812J709J772K396L567M685N087M709M112L928M420N442
59161F05303O473O846O272N166M126L239K226J101J56o82j855l319m333m448m221
59146F22050m487n253n820n828n634n700o004o160n859n123m298l828l913m281
59132E49862m416m007l157k192j415j025j070j396j648j464p03N08J886L122L958
59117E36843M349M596N146O056O859P164P171P238P135O410N384N051N651O178
59103F21231N746M835M464M651M605M032L308K503J275j61r28o64q0O9j69m26
$$ plain form
59087 654291 653548 652277 650434 648072 644906 640491 635017 629424 624469 620026 615508 610639 605397 599482
59073 599482 592423 584272 575836 568024 561117 554808 548773 542991 537566 532544 527990 523994 520441 517031
59059 517031 513746 511055 509239 507729 505646 502960 500464 498524 496497 493818 491043 489262 488769 488827 488551
59044 488551 487563 486009 484385 483283 482896 482861 482862 483124 483955 485085 486047 487022 488643 491004 493460 495554 497612
59027 497612 500354 504308 509726 516586 524488 532889 541626 550965 561055 571628 582271 592657 602466
59014 602466 611438 619546 626795 632812 637011 639233 639864 639302 637817 635977 634613 633978 633439 632388 631180
58999 631180 630767 631652 633580 636103 639057 642480 646249 649836 652426 653505 653424 653128 653120 652958 651942 650041
58983 650041 647770 645262 641909 637147 631493 626567 623896 623633 624606 625736 627177 629849 634183 639805 646336
$$ packed form
59087F54291p43j271j843k362l166m415n474n593m955m443m518m869n242n915
59073E99482p059q151q436p812o907o309o035n782n425n022m554l996l553l410
59059E17031l285k691j816j510k083k686k496j940k027k679k775j781m93N8k76
59044D88551r88j554j624j102l87l5JK62Q31J130R62R75J621K361K456K094K058
59027D97612K742L954N418O860P902Q401Q737R339J0090J0573J0643J0386R809
59014F02466Q972Q108P249O017M199K222O31n62j485j840j364o35n39j051j208
58999F31180m13Q85J928K523K954L423L769L587K590J079q1k96qj62j016j901
58983F50041k271k508l353m762n654m926k671k63R73J130J441K672M334N622O531
$$ plain form
58968 646336 653823 662216 670989 679667 688380 697490 706890 715978 724200 731331 737300 741966 745086 746479
58954 746479 746274 744930 742760 739413 734054 726179 716105 704729 693050 681835 671363 661347 651448
58941 651448 641827 632872 624528 616493 609055 602978 598342 594318 590502 587645 586353 585692 584027 580981
58927 580981 577719 575393 574075 573203 572388 571584 570975 570805 570943 570640 569148 566651 564159 562499 561809 561939
58911 561939 562667 563395 563366 562652 562538 564447 568706 574640 581530 589052 597024 605283 613902 623111 632930 643124
58895 643124 653613 664625 676277 688246 700061 711602 723087 734669 746312 758043 770027
58884 770027 782328 794846 807580 820632 833685 845731 855638 862913 867648 869925 869733 867383 863443
58871 863443 858067 850790 841251 829901 817797 805878 794526 783619 772899 762449 752833 744516
$$ packed form
58968F46336P487Q393Q773Q678Q713R110R400R088Q222P131N969M666L120J393
58954G46479k05j344k170l347n359p875j0074j1376j1679j1215j0472j0016r899
58941F51448r621q955q344q035p438o077m636m024l816k857j292o61j665l046
58927E80981l262k326j318q72q15q04o09j70J38l03j492k497k492j660o90J30
58911E61939P28P28k9p14j14J909M259N934O890P522P972Q259Q619R209R819J0194
58895F43124J0489J1012J1652J1969J1815J1541J1485J1582J1643J1731J1984
58884G70027J2301J2518J2734J3052J3053J2046R907P275M735K277j92k350l940
58871H63443n376p277r539j1350j2104j1919j1352j0907j0720j0450r616q317
$$ plain form
58859 744516 737160 729823 721878 713382 704600 695787 687462 680127 673338 665760 656699 647051 638125 630087
58845 630087 622333 614911 608537 603291 598339 593153 588219 584146 580635 576744 571858 566166 560445 555549
58831 555549 551801 548717 545502 541868 538106 534482 531006 527902 525782 525067 525438 526107 526512 526753 527579 529885
58815 529885 533793 538208 541749 544240 546751 549970 553179 555283 556347 557360 558757 559947 560360 560240 560080
58800 560080 559749 558680 556700 554177 551370 548097 544315 540643 537776 535407 532276 527656 522466 518460
58786 518460 516414 515559 514755 513774 513257 513872 515829 518901 522526 525983 528803 531015 532820 534180 534948 535282
58770 535282 535525 535630 534984 532950 529392 524605 519043 513284 507971 503423 499370 495422 491753 488967 487181
58755 487181 485679 483819 482021 481497 483005 486235 490340 494643 498712 502189 504921 507169 509380 511734
$$ packed form
58859G44516p356p337p945q496q782q813q325p335o789p578r061r648q926q038
58845F30087p754p422o374n246m952n186m934m073l511l891m886n692n721m896
58831E55549l748l084l215l634l762l624l476l104k120p15L71O69M05K41Q26K306
58815E29885L908M415L541K491K511L219L209K104J064J013J397J190M13j20j60
58800E60080l31j069j980k523k807l273l782l672k867k369l131m620n190m006
58786E18460k046q55q04r81n17O15J957L072L625L457K820K212J805J360P68L34
58770E35282K43J05o46k034l558m787n562n759n313m548m053l948l669k786j786
58755D87181j502j860j798n24J508L230M105M303M069L477K732K248K211K354
$$ plain form
58741 511734 514038 516109 518163 520788 524534 529529 535494 542093 549118 556229 562800 568378 573199 577947
58727 577947 583001 588214 593357 598362 603115 607437 611431 615373 619166 622373 625065 628081 632049 636602
58713 636602 641001 645150 649446 653947 658298 662319 666052 669231 671257 671720 670552 667683 662934 656283
58699 656283 647903 637973 626730 614584 601833 588440 574475 560589 547515 535274 523505 512506
58687 512506 503181 495765 489324 482848 476331 470408 465401 461124 457314 453836 450643 447858 445729 444283
58673 444283 443210 442262 441577 441448 441996 443342 445852 449863 455196 461086 466675 471565 476049 480846 486387
58658 486387 492303 497686 501867 504735 506315 506390 504752 501627 497664 493550 489629 485751 481497 476759 472088
58643 472088 468235 465350 462924 460436 457766 454983 452217 449838 448277 447494 447015 446674 446898 448022 449766
$$ packed form
58741E11734K304K071K054K625L746M995N965O599P025P111O571N578M821M748
58727E77947N054N213N143N005M753M322L994L942L793L207K692L016L968M553
58713F36602M399M149M296M501M351M021L733L179K026M63j168k869m749o651
58699F56283q380r930j1243j2146j2751j3393j3965j3886j3074j2241j1769j0999
58687E12506r325p416o441o476o517n923n007m277l810l478l193k785k129j446
58673D44283j073r48o85j29N48J346K510M011N333N890N589M890M484M797N541
58658D86387N916N383M181K868J580P5j638l125l963m114l921l878m254m738m671
58643D72088l853k885k426k488k670k783k766k379j561p83m79l41K24J124J744
$$ plain form
58628 449766 451727 453980 456777 459960 463151 466276 469477 472698 475763 478728 481719 484582 487155 489763
58614 489763 492944 496654 500287 503581 507034 511196 515913 520513 524483 527660 529998 531472 532224 532537 532635
58599 532635 532609 532514 532385 532111 531450 530212 528471 526572 525006 524234 524463 525532 527127 529178 532028 536064
58583 536064 541290 547364 553981 560997 568264 575637 583208 591219 599615 607949 615958 623927 632272 640956
58569 640956 649669 658482 667990 678852 691448 705855 721848 738923 756554 774492 792726 811254
58557 811254 830037 848926 867370 884393 899213 911709 921983 929684 934315 935994 935334 932554 927377
58544 927377 919946 911216 902062 892357 881318 868591 854782 840964 827634 814075 798851 781275
58532 781275 762224 743260 725245 708389 693284 680841 671010 662585 654750 648095 643514 640748 638767
$$ packed form
58628D49766J961K253K797L183L191L125L201L221L065K965K991K863K573K608
58614D89763L181L710L633L294L453M162M717M600L970L177K338J474P52L13R8
58599E32635k6r5j29k74o61j238j741j899j566p72K29J069J595K051K850M036
58583E36064N226O074O617P016P267P373P571Q011Q396Q334Q009P969Q345Q684
58569F40956Q713Q813R508J0862J2596J4407J5993J7075J7631J7938J8234J8528
58557H11254J8783J8889J8444J7023J4820J2496J0274P701M631J679o60k780n177
58544I27377p431q730r154r705j1039j2727j3809j3818j3330j3559j5224j7576
58532G81275j9051j8964j8015j6856j5105j2443r831q425p835o655m581k766j981
$$ plain form
58519 638767 637143 636241 636221 636611 636835 636607 635748 634147 632054 630069 628577 627341 625777 623580 621074 618974
58503 618974 617750 617225 616830 616184 615298 614341 613452 612758 612255 611710 610994 610451 610576 611375 612562 614333 617307
58486 617307 621536 626264 630984 636117 642242 649240 656779 665200 675245 687022 699729 712272 723929
58473 723929 734573 744577 754217 762961 769665 773737 775634 775900 774259 770243 764226 757145 749523 741543
58459 741543 733970 728187 725177 724933 726901 730534 735421 741332 748239 755947 763726 770648 776241 780528
58445 780528 783481 784827 784304 781734 776955 770078 761837 753313 745345 738442 733009 729131 726251 723675
58431 723675 721538 720781 722155 725646 730956 737909 746160 754965 763637 771995 780115 787893 795187 802124
58417 802124 808877 815123 820041 822970 823840 822864 820024 815201 808836 802038 795728 789847 783808 777616 772073
$$ packed form
58519F38767j624r02k0L90K24k28q59j601k093j985j492j236j564k197k506k100
58503F18974j224n25l95o46q86r57q89o94n03n45p16n43J25P99J187J771K974
58486F17307M229M728M720N133O125O998P539Q421J0045J1777J2707J2543J1657
58473G23929J0644J0004R640Q744O704M072J897K66j641m016o017p081p622p980
58459G41543p573n783l010k44J968L633M887N911O907P708P779O922N593M287
58445G80528K953J346n23k570m779o877q241q524p968o903n433l878k880k576
58431G23675k137p57J374L491N310O953Q251Q805Q672Q358Q120P778P294O937
58417H02124O753O246M918K929Q70r76k840m823o365o798o310n881o039o192n543
$$ plain form
58402 772073 767790 764517 761648 759006 756872 755605 755530 756839 759226 761867 764151 766277 768883 772289 776392
58387 776392 780992 785863 790640 795001 798894 802322 805170 807497 809752 812339 815149 817846 820402 823052
58373 823052 825930 829124 832845 837116 841449 845359 849092 853465 859010 865635 873092 881404 890688 900839
58359 900839 911467 922128 932669 943359 954469 965709 976356 986008 994803 1002775 1009448 1014405
58347 1014405 1017867 1020428 1022596 1024888 1027939 1032141 1037535 1044286 1052669 1062217 1071613 1080134 1088705 1098775
58333 1098775 1110552 1123106 1135862 1149071 1162905 1176948 1190697 1203969 1216702 1228774 1240042
58322 1240042 1250282 1259223 1266947 1273950 1280508 1286365 1291519 1296842 1303248 1310526 1317686 1324278 1330824 1338181
58308 1338181 1347041 1357759 1370059 1383162 1396793 1411688 1428450 1446293 1463727 1480263 1496643
$$ packed form
58402G72073m283l273k869k642k134j267p5J309K387K641K284K126K606L406M103
58387G76392M600M871M777M361L893L428K848K327K255K587K810K697K556K650
58373H23052K878L194L721M271M333L910L733M373N545O625P457Q312R284J0151
58359I00839J0628J0661J0541J0690J1110J1240J0647R652Q795P972O673M957
58347A014405L462K561K168K292L051M202N394O751Q383R548R396Q521Q571J0070
58333A098775J1777J2554J2756J3209J3834J4043J3749J3272J2733J2072J1268
58322A240042J0240Q941P724P003O558N857N154N323O406P278P160O592O546P357
58308A338181Q860J0718J2300J3103J3631J4895J6762J7843J7434J6536J6380
$$ plain form
58297 1496643 1513652 1531505 1550253 1569903 1590071 1610195 1630087 1649794 1669177 1688256 1707700
58286 1707700 1728263 1749951 1772418 1795900 1821004 1847829 1876088 1905843 1937238 1969752 2002607
58275 2002607 2035869 2070364 2106604 2144514 2184032 2225233 2268021 2312329 2358362 2406054 2454782
58264 2454782 2504369 2555830 2610202 2667156 2725770 2786081 2848767 2913852 2980958 3050366 3122454
58253 3122454 3196556 3271774 3348596 3428207 3510464 3594118 3679027 3766721 3858840 3956295 4059855
58242 4059855 4170180 4287297 4411233 4542954 4683461 4832479 4989431 5155206 5331356
58233 5331356 5518172 5715450 5924655 6148228 6387099 6641087 6911583 7201592 7513219
58224 7513219 7847500 8206808 8595133 9015828 9471387 9965654 10504109 11092042 11735101
$$ packed form
58297A496643J7009J7853J8748J9650K0168K0124J9892J9707J9383J9079J9444
58286A707700K0563K1688K2467K3482K5104K6825K8259K9755L1395L2514L2855
58275B002607L3262L4495L6240L7910L9518M1201M2788M4308M6033M7692M8728
58264B454782M9587N1461N4372N6954N8614O0311O2686O5085O7106O9408P2088
58253C122454P4102P5218P6822P9611Q2257Q3654Q4909Q7694R2119R7455J03560
58242D059855J10325J17117J23936J31721J40507J49018J56952J65775J76150
58233E331356J86816J97278K09205K23573K38871K53988K70496K90009L11627
58224G513219L34281L59308L88325M20695M55559M94267N38455N87933O43059
$$ plain form
58215 11735101 12442017 13224497 14094466 15064173 16149562 17371493 18754181 20325617 22119550
58206 22119550 24173737 26526249 29217399 32296848 35827680 39887218 44573399 50017928
58198 50017928 56397262 63938458 72924305 83690402 96591100 111919416 129794395
58191 129794395 150057801 172241452 195655655 219575449 243399388 266643118 288758574
58184 288758574 308915121 325890062 338124914 343953407 342001545 331674356 313494928
58177 313494928 289060220 260614970 230498077 200727063 172798956 147645290 125682299
58170 125682299 106931954 91171751 78056996 67197541 58209132 50750166 44535307
58163 44535307 39329170 34939007 31212799 28032951 25304312 22947469 20899276 19110851
$$ packed form
58215A1735101P06916P82480Q69969R69707J085389J221931J382688J571436J793933
58206B2119550K054187K352512K691150L079449L530832M059538M686181N444529
58198E0017928O379334P541196Q985847J0766097J2900698J5328316J7874979
58191A29794395K0263406K2183651K3414203K3919794K3823939K3243730K2115456
58184B88758574K0156547J6974941J2234852N828493j951862j0327189j8179428
58177C13494928k4434708k8445250l0116893k9771014k7928107k5153666k1962991
58170A25682299j8750345j5760203j3114755j0859455q988409p458966o214859
58163D4535307n206137m390163l726208l179848k728639k356843k048193j788425
$$ plain form
58155 19110851 17541047 16153796 14920540 13819823 12832782 11941919 11134064 10400561 9733765
58146 9733765 9126171 8572678 8069839 7612286 7192949 6807089 6453015 6128429 5828992
58137 5828992 5550795 5291250 5047164 4814941 4593448 4384098 4187465 4002180 3827476
58128 3827476 3664120 3512114 3369908 3236599 3112619 2997524 2889268 2786405 2689045 2597127
58118 2597127 2509805 2427077 2349832 2277636 2208548 2141816 2078692 2019810 1963849 1909696 1857856
58107 1857856 1808670 1761049 1714176 1668790 1625573 1583836 1542911 1503372 1465702 1429157 1393173
58096 1393173 1358621 1326411 1295986 1266381 1237751 1210652 1184731 1159327 1134662 1111393 1089607
58085 1089607 1069129 1050130 1032574 1015675 998674 981612 964650 947332 929281 910972 893039
$$ packed form
58155A9110851j569804j387251j233256j100717r87041q90863q07855p33503o66796
58146I733765o07594n53493n02839m57553m19337l85860l54074l24586k99437
58137E828992k78197k59545k44086k32223k21493k09350j96633j85285j74704
58128C827476j63356j52006j42206j33309j23980j15095j08256j02863r7360r1918
58118B597127q7322q2728p7245p2196o9088o6732o3124n8882n5961n4153n1840
58107A857856m9186m7621m6873m5386m3217m1737m0925l9539l7670l6545l5984
58096A393173l4552l2210l0425k9605k8630k7099k5921k5404k4665k3269k1786
58085A089607k0478j8999j7556j6899j7001j7062j6962j7318j8051j8309j7933
$$ plain form
58074 893039 875320 857293 839014 821046 803816 787508 772163 757579 743567 730461 718767
58063 718767 708244 698173 688612 680225 672626 664269 654646 645311 637761 631361 624467 616657 608641 600607
58049 600607 592035 582907 573985 565888 558642 552112 546271 541137 536805 533311 530123 526272 521426 516336
58035 516336 511697 507082 501670 495523 489448 483874 478580 473210 467438 460839 453227 444939 436372 427572
58021 427572 418779 410881 404614 399588 394806 389974 385601 381968 378717 375482 372276 369164 366069 363002
58007 363002 360092 357330 354612 352036 349797 347764 345499 342733 339587 336344 333266 330646 328767 327690
57993 327690 327227 327126 327241 327567 328211 329259 330614 332032 333350 334565 335695 336677 337320 337223 335937 333547
57977 333547 330862 328595 326490 323902 321124 319305 318811 318544 317372 315558 314142 313465 313030 312487 312006 311769
$$ packed form
58074H93039j7719j8027j8279j7968j7230j6308j5345j4584j4012j3106j1694
58063G18767j0523j0071r561q387p599q357r623r335p550o400o894p810q016q034
58049F00607q572r128q922q097p246o530n841n134m332l494l188l851m846n090
58035E16336m639m615n412o147o075n574n294n370n772o599p612q288q567q800
58021D27572q793p898o267n026m782m832m373l633l251l235l206l112l095l067
58007C63002k910k762k718k576k239k033k265k766l146l243l078k620j879j077
57993C27690m63j01J15L26O44J048J355J418J318J215J130R82O43r7j286k390
57977C33547k685k267k105k588k778j819m94k67j172j814j416o77m35n43m81k37
$$ plain form
57961 311769 311715 311840 312255 312881 313475 314013 314771 315890 316981 317240 316056 313672 311256 309982 309943 310179 309879
57944 309879 309233 309002 309726 311633 314898 319563 325339 331809 338667 345591 352212 358524 365058 372291 379988
57929 379988 387414 394056 399852 404823 408768 411307 412075 410942 408162 404193 399292 393457 386796 379758
57915 379758 372918 366692 361193 356096 350700 344573 338223 332651 328167 324141 320085 316355 313422 310970
57901 310970 308232 304960 301607 298725 296481 294613 292644 290373 288230 286900 286465 286394 286452 287087 288628 290732
57885 290732 293006 295566 298459 301040 302624 303388 304020 304760 305423 306094 307041 308036 308441 307993 306993 305706
57869 305706 304083 302119 300008 297839 295497 292971 290456 288120 285955 283919 282045 280507 279668 279828 280729
57854 280729 281573 281825 281805 282250 283548 285674 288526 291775 294631 296344 296927 297015 297052 296924 296277 294778 292191
$$ packed form
57961C11769n4J25M15O26N94N38P58J119J091K59j184k384k416j274l9K36l00
57944C09879o46k31P24J907L265M665N776O470O858O924O621O312O534P233P697
57929C79988P426O642N796M971L945K539P68j133k780l969m901n835o661p038
57915C79758o840o226n499n097n396o127o350n572m484m026m056l730k933k452
57901C10970k738l272l353k882k244j868j969k271k143j330m35p1N8O35J541K104
57885B90732K274K560K893K581J584P64O32P40O63O71R47R95M05m48j000j287
57869C05706j623j964k111k169k342k526k515k336k165k036j874j538q39J60R01
57854B80729Q44K52k0M45J298K126K852L249K856J713N83Q8L7j28o47j499k587
$$ plain form
57837 292191 288583 284495 280628 277389 274849 272837 270849 268301 265370 263265 263031 264252 265553 266301 267189
57822 267189 269165 272361 276144 279710 282453 284228 285439 286572 287638 288349 288729 289026 289046 288092 285705 282047
57806 282047 277514 272425 267211 262363 257941 253582 249316 245978 244397 244423 245128 245878 246825 248353 250360
57791 250360 252256 253510 254030 254044 253838 253708 253965 254616 255119 254850 253944 253303 253604 254711 256273 258448 261574
57774 261574 265429 269366 273028 276483 279786 282805 285403 287442 288684 289049 288845 288398 287590 286090 283861
57759 283861 281088 277850 274285 270869 268065 265911 264426 264062 265069 266664 267694 268084 268808 270389 272304
57744 272304 274083 276063 278627 281344 283480 284856 285677 285880 285207 283792 282198 280838 279501 277549 274557
57729 274557 270962 267905 266166 265314 264279 262648 260940 259627 258497 257119 255363 253222 250628 247753
$$ packed form
57837B92191l608m088l867l239k540k012j988k548k931k105k34J221J301P48Q88
57822B67189J976L196L783L566K743J775J211J133J066P11L80K97K0r54k387l658
57806B82047m533n089n214m848m422m359m266l338j581K6P05P50R47J528K007
57791B50360J896J254N20J4k06j30K57O51N03k69r06o41L01J107J562K175L126
57774B61574L855L937L662L455L303L019K598K039J242L65k04m47q08j500k229
57759B83861k773l238l565l416k804k154j485l64J007J595J030L90P24J581J915
57744B72304J779J980K564K717K136J376Q21K03o73j415j594j360j337j952k992
57729B74557l595l057j739q52j035j631j708j313j130j378j756k141k594k875
$$ plain form
57715 247753 245132 243209 241940 240933 239616 237283 233582 229188 225470 223141 221607 219829 217379 214406
57701 214406 211144 207883 205043 202798 200933 199353 198361 198072 197909 197200 196045 195169 195049 195551 196220 196604
57685 196604 196468 196024 195846 196351 197618 199873 203761 209687 217219 225664 235160 246827 261886 280891
57671 280891 303649 329487 357590 387342 418309 449832 480851 510275 537148 560096 576835
57660 576835 584608 581154 565460 538287 502515 462511 422374 384667 350835 322135 299362 281949
57648 281949 268247 256861 247284 239386 232995 228014 224343 221533 219091 217181 216402 216679 217038 216809 216444
57633 216444 216685 217382 217734 217392 216775 216353 216129 215844 215349 214679 213965 213328 212712 211910 210858 209840 209179 208761
57615 208761 208098 206845 205087 203126 201314 200133 200100 201258 202852 203876 204031 203963 204486 205727 207118 208016
$$ packed form
57715B47753k621j923j269j007j317k333l701m394l718k329j534j778k450k973
57701B14406l262l261k840k245j865j580r92k89j63p09j155q76j20N02O69L84
57685A96604j36m44j78N05J267K255L888N926P532Q445R496J1667J5059J9005
57671B80891K2758K5838K8103K9752L0967L1523L1019K9424K6873K2948J6739
57660E76835P773l454j5694k7173l5772m0004m0137l7707l3832k8700k2773j7413
57648B81949j3702j1386r577p898o391m981l671k810k442j910p79K77L59k29l65
57633B16444K41O97L52l42o17m22k24k85m95o70p14o37o16q02j052j018o61m18
57615B08761o63j253j758j961j812j181l3J158J594J024J55o8N23J241J391Q98
$$ plain form
57599 208016 208116 207424 206167 204714 203283 201670 199468 196688 193870 191417 189070 186322 183238 180511 178725
57584 178725 177778 177071 176011 174311 172054 169659 167680 166451 165930 165918 166272 166743 166758 165742 163786 161720
57568 161720 160255 159218 157895 156023 154052 152501 151530 151200 151558 152183 152232 151454 150748 151097 152222 152962 152826
57551 152826 152441 152506 153072 153975 155206 156566 157612 158322 159200 160319 160813 159859 157796 155820 154871 155238 156763
57534 156763 158894 160797 162020 162896 163892 164829 165223 165136 165089 165314 165649 166093 166887 168078 169477 171049 172787
57517 172787 174235 174703 174132 173308 173035 173419 174033 174477 174668 174835 175260 175839 176004 175381 174373 173672 173300 172624
57499 172624 171235 169317 167158 164927 163012 161955 161753 161707 161224 160349 159342 158244 157186 156601 156706 157084
57483 157084 157213 157097 157015 156935 156647 156249 155995 155792 155290 154450 153580 152797 151838 150489 148950 147615 146667 146013
$$ packed form
57599B08016J00o92j257j453j431j613k202k780k818k453k347k748l084k727j786
57584A78725r47p07j060j700k257k395j979j229n21j2L54M71J5j016j956k066
57568A61720j465j037j323j872j971j551r71l30L58O25M9p78p06L49J125P40j36
57551A52826l85O5N66R03J231J360J046P10Q78J119M94r54k063j976r49L67J525
57534A56763K131J903J223Q76R96R37L94q7m7K25L35M44P94J191J399J572J738
57517A72787J448M68n71q24k73L84O14M44J91J67M25N79J65o23j008p01l72o76
57499A72624j389j918k159k231j915j057k02m6m83q75j007j098j058n85J05L78
57483A57084J29j16q2q0k88l98k54k03n02q40q70p83r59j349j539j335r48o54
$$ plain form
57465 146013 145511 145207 145309 145907 146720 147231 147181 146799 146472 146324 146256 146231 146294 146391 146421 146449 146649 146990 147186 147060 146890
57444 146890 147246 148434 150109 151506 152111 152099 152071 152378 152826 153036 152915 152677 152524 152456 152417 152577 153320 154798 156454
57425 156454 157292 156859 155882 155632 156714 158716 160842 162460 163100 162559 161290 160245 159987 160209 160366 160379 160402
57408 160402 160265 159740 159146 159140 159849 160638 160877 160675 160739 161685 163468 165369 166595 167029 167232 167600 167846 167643 167428
57389 167428 167959 169263 170700 172127 174182 177109 179987 181774 182696 183949 186113 188471 190022 190688 191242
57374 191242 192265 193449 193925 193206 191701 190301 189515 189125 188583 187549 186045 184400 183191 182913 183474 184228
57358 184228 184776 185464 186804 188659 190424 191818 192973 193817 194039 193799 193864 194710 195901 196686 196894 196880 196972 197370
57340 197370 198309 199760 201098 201565 201119 200467 200310 200906 202218 203955 205434 206017 205908 206057 206958 207930 207948
$$ packed form
57465A46013n02l04J02N98Q13N11n0l82l27j48o8k5O3R7L0K8K00L41J96j26j70
57444A46890L56J188J675J397O05j2k8L07M48K10j21k38j53o8l9J60P43J478J656
57425A56454Q38m33r77k50J082K002K126J618O40n41j269j045k58K22J57J3K3
57408A60402j37n25n94oP09P89K39k02O4R46J783J901J226M34K03L68K46k03k15
57389A67428N31J304J437J427K055K927K878J787R22J253K164K358J551O66N54
57374A91242J023J184M76p19j505j400p86l90n42j034j504j645j209k78N61P54
57358A84228N48O88J340J855J765J394J155Q44K22k40O5Q46J191P85K08j4R2L98
57340A97370R39J451J338M67m46o52j57N96J312J737J479N83j09J49R01R72J8
$$ plain form
57323 207948 206851 205367 204235 203802 204322 206042 208729 211403 212858 212556 211124 210017 210543 212937 216300
57308 216300 219424 221618 222786 223045 222590 221834 221369 221643 222695 224191 225656 226816 227832 229034 230370
57293 230370 231350 231702 231870 232615 234331 237016 240589 244711 248479 250978 252315 253607 255713 258352 260722
57278 260722 262588 264367 266393 268579 270857 273564 277141 281519 285955 289643 292545 295542 299636 305097
57264 305097 311516 318480 325810 333142 339748 345052 349079 352219 354853 357512 361108 366431 373293 380536
57250 380536 387125 393109 399328 406324 413781 421114 428309 435901 444133 452464 460044 466486 472010 477125
57236 477125 482506 488939 496848 505779 514753 523226 531398 539562 547586 555250 562692 570237 578152 586853
57222 586853 596977 608795 621751 634954 648004 661004 674005 686905 699853 713277 727491
$$ packed form
57323B07948j097j484j132m33N20J720K687K674J455l02j432j107N26K394L363
57308B16300L124K194J168K59m55p56m65K74J052J496J465J160J016J202J336
57293B30370R80L52J68P45J716K685L573M122L768K499J337J292K106K639K370
57278B60722J866J779K026K186K278K707L577M378M436L688K902K997M094N461
57264C05097O419O964P330P332O606N304M027L140K634K659L596N323O862P243
57250C80536O589N984O219O996P457P333P195P592Q232Q331P580O442N524N115
57236D77125N381O433P909Q931Q974Q473Q172Q164Q024P664P442P545P915Q701
57222E86853J0124J1818J2956J3203J3050J3000J3001J2900J2948J3424J4214
$$ plain form
57211 727491 742575 758574 775307 792009 807703 822175 836223 850711 865744 880994 896359
57200 896359 911895 927407 942676 957993 973903 990345 1006486 1021590 1035750 1049614 1063682
57189 1063682 1078105 1092910 1108088 1123557 1139374 1155923 1173642 1192516 1212000 1231460 1250563
57178 1250563 1269366 1288287 1307949 1328693 1350152 1371569 1392649 1413806 1435495 1457663 1480046
57167 1480046 1502630 1525491 1548459 1571337 1594228 1617279 1640325 1663207 1686217 1709666 1733153
57156 1733153 1755906 1777891 1799932 1822654 1845941 1869669 1894242 1919838 1945601 1970213 1993140
57145 1993140 2014965 2036731 2059339 2083331 2108673 2134782 2161178 2188168 2216595 2246973 2279159
57134 2279159 2312822 2347889 2384485 2422740 2462730 2504390 2547417 2591367 2635878 2680736 2725872
$$ packed form
57211G27491J5084J5999J6733J6702J5694J4472J4048J4488J5033J5250J5365
57200H96359J5536J5512J5269J5317J5910J6442J6141J5104J4160J3864J4068
57189A063682J4423J4805J5178J5469J5817J6549J7719J8874J9484J9460J9103
57178A250563J8803J8921J9662K0744K1459K1417K1080K1157K1689K2168K2383
57167A480046K2584K2861K2968K2878K2891K3051K3046K2882K3010K3449K3487
57156A733153K2753K1985K2041K2722K3287K3728K4573K5596K5763K4612K2927
57145A993140K1825K1766K2608K3992K5342K6109K6396K6990K8427L0378L2186
57134B279159L3663L5067L6596L8255L9990M1660M3027M3950M4511M4858M5136
$$ plain form
57123 2725872 2771539 2818489 2867765 2920352 2977127 3039029 3107011 3181859 3264222 3354733 3453933
57112 3453933 3562279 3680648 3811007 3956615 4121884 4312412 4534978 4796788 5104114
57103 5104114 5461269 5870463 6332560 6849023 7425157 8073333 8814122 9674830 10686727
57094 10686727 11881798 13288462 14926261 16801554 18906388 21220514 23715104 26357340
57086 26357340 29115412 31961928 34872355 37817131 40750468 43601848 46275275 48657893
57078 48657893 50635908 52113146 53026256 53350936 53096748 52293612 50977467 49182852 46945468
57069 46945468 44311734 41348350 38145209 34809054 31450757 28172149 25056962 22166603
57061 22166603 19539175 17190828 15119454 13310086 11740266 10384050 9214728 8206796
$$ packed form
57123B725872M5667M6950M9276N2587N6775O1902O7982P4848Q2363R0511R9200
57112C453933J08346J18369J30359J45608J65269J90528K22566K61810L07326
57103E104114L57155M09194M62097N16463N76134O48176P40789Q60708J011897
57094A0686727J195071J406664J637799J875293K104834K314126K494590K642236
57086B6357340K758072K846516K910427K944776K933337K851380K673427K382618
57078D8657893J978015J477238R13110L24680k54188q03136j316145j794615k237384
57069D6945468k633734k963384l203141l336155l358297l278608l115187k890359
57061B2166603k627428k348347k071374j809368j569820j356216j169322j007932
$$ plain form
57053 8206796 7337351 6586652 5937889 5376406 4889047 4464233 4092626 3767226 3482276
57044 3482276 3232051 3010930 2814435 2639528 2483756 2344559 2219638 2107501 2007275
57035 2007275 1918298 1840264 1773476 1718369 1674650 1641004 1615564 1596485 1582377 1572626 1567234 1565718
57023 1565718 1565535 1561447 1546707 1515562 1465624 1398802 1320336 1236660 1153440 1074649 1002534 937926
57011 937926 880713 830405 786486 748299 714864 685099 658288 634210 612802 593788 576645
57000 576645 560836 546123 532691 520864 510512 500815 490833 480406 470238 461018 452716 444973
56988 444973 438012 432654 429283 427171 425218 423189 421780 421378 421166 419665 415857 409517 400779 389924
56974 389924 377539 364420 351143 338025 325535 314416 305205 297905 292268 288220 285858 285308 286749
$$ packed form
57053H206796q69445p50699o48763n61483m87359m24814l71607l25400k84950
57044C482276k50225k21121j96495j74907j55772j39197j24921j12137j00226
57035B007275q8977p8034o6788n5107m3719l3646k5440j9079j4108r751n392j516
57023A565718j83m088j4740l1145m9938o6822p8466q3676q3220p8791p2115o4608
57011I37926n7213n0308m3919l8187l3435k9765k6811k4078k1408j9014j7143
57000E76645j5809j4713j3432j1827j0352r697r982j0427j0168r220q302p743
56988D44973o961n358l371k112j953k029j409m02k12j501l808o340q738j0855
56974C89924j2385j3119j3277j3118j2490j1119r211p300n637m048k362n50J441
$$ plain form
56961 286749 290438 296449 304435 313729 323554 333063 341489 348481 354084 358062 359376 356607 348970 336810
56947 336810 321267 303744 285675 268473 253394 241361 232879 228048 226696 228541 233263 240577 250382
56934 250382 262740 277425 293466 309480 324635 338957 352459 364192 372375 375234 371549 360861
56922 360861 343807 322219 298377 273991 250079 227559 207408 190101 175382 162768 152024
56911 152024 142998 135357 128705 122797 117501 112775 108849 106182 105011 105071 105903 107303 109370 112263 116047
56896 116047 120661 125981 132096 139579 149158 160950 174228 188142 202409 217120 232189 247317
56884 247317 262200 276301 288559 297859 303796 306583 306213 302272 294851 285271 275577 267462 261784 258869
56870 258869 258953 262356 269386 280138 294480 312442 334482 360919 390964 422762 454661 486015
$$ packed form
56961B86749L689O011P986R294R825R509Q426O992N603L978J314k769p637j2160
56947C36810j5543j7523j8069j7202j5079j2033q482m831j352J845M722P314R805
56934B50382J2358J4685J6041J6014J5155J4322J3502J1733Q183K859l685j0688
56922C60861j7054k1588k3842k4386k3912k2520k0151j7307j4719j2614j0744
56911A52024r026p641o652n908n296m726l926k667j171O0Q32J400K067K893L784
56896A16047M614N320O115P483R579J1792J3278J3914J4267J4711J5069J5128
56884B47317J4883J4101J2258R300N937K787l70l941p421r580r694q115n678k915
56870B58869Q4L403P030J0752J4342J7962K2040K6437L0045L1798L1899L1354
$$ plain form
56858 486015 516433 544744 569270 588718 602011 607475 603274 589076 566797 539516 510272 482029
56846 482029 457724 439400 427660 422613 424970 435542 454136 479966 512962 553478 600421 650751
56834 650751 701464 751433 800653 848176 891396 926826 950762 959590 950677 923691 881017 826960
56822 826960 766749 705822 648887 598907 557071 523910 500185 486579 483013 488742 502923 524662
56810 524662 552493 584279 617893 651977 685899 718945 749467 774672 791160 795845 786731 763335
56798 763335 726870 680297 627985 574753 524596 479889 441561 409858 384968 367091 356253
56787 356253 352173 354209 361336 372261 385765 400930 417017 433242 448783 462864 474512 482194
56775 482194 483963 478155 464029 441963 413448 380919 347084 313966 282602 253696 228150 206641
$$ packed form
56858D86015L0418K8311K4526J9448J3293N464m201j4198k2279k7281k9244k8243
56846D82029k4305j8324j1740n047K357J0572J8594K5830L2996M0516M6943N0330
56834F50751N0713M9969M9220M7523M3220L5430K3936Q828q913k6986m2674n4057
56822H26960o0211o0927n6935m9980m1836l3161k3725j3606l566N729J4181K1739
56810E24662K7831L1786L3614L4084L3922L3046L0522K5205J6488M685r114k3396
56798G63335l6465m6573n2312n3232n0157m4707l8328l1703k4890j7877j0838
56787C56253m080K036P127J0925J3504J5165J6087J6225J5541J4081J1648P682
56775D82194J769n808j4126k2066k8515l2529l3835l3118l1364k8906k5546k1509
$$ plain form
56763 206641 188985 174443 162543 153109 145523 138609 131565 124635 118560 113601 109445 105863 102992
56750 102992 100989 99674 98639 97465 95814 93551 90978 88743 87298 86464 85696 84746 83833 83127 82369 81246
56734 81246 79969 79196 79352 80255 81429 82570 83614 84536 85294 85892 86385 86873 87496 88372 89502 90824 92308
56717 92308 93812 94862 95008 94489 94199 94662 95346 95429 95006 95046 96190 98063 99822 100936 101300 101085 100801 101129
56699 101129 102266 103618 104461 104823 105338 106291 107208 107494 107142 106621 106297 106206 106293 106554 106947 107386 107878 108438 108840
56680 108840 108721 108141 107770 108224 109344 110397 110868 110707 109961 108706 107396 106669 106561 106368 105662 104995 105190
56663 105190 106305 107803 109426 111227 112879 113683 113483 113072 113505 115256 118081 121299 124078 125863 126762
56648 126762 127363 128055 128768 129318 129666 129805 129768 129858 130439 131322 131795 131495 130936 130897 131623 132898 134564 136547 138564
$$ packed form
56763B06641j7656j4542j1900r434p586o914p044o930o075m959m156l582k871
56750A02992k003j315j035j174j651k263k573k235j445q34p68r50r13p06p58j123
56734H1246j277p73J56R03J174J141J044R22P58N98M93M88O23Q76J130J322J484
56717I2308J504J050J46n19k90M63O84Q3m23M0J144J873J759J114L64k15k84L28
56699A01129J137J352Q43L62N15R53R17K86l52n21l24r1Q7K61L93M39M92N60M02
56680A08840j19n80l71M54J120J053M71j61p46j255j310p27j08j93p06o67J95
56663A05190J115J498J623J801J652Q04k00m11M33J751K825L218K779J785Q99
56648A26762O01O92P13N50L48J39l7R0N81Q83M73l00n59l9P26J275J666J983K017
$$ plain form
56629 138564 140216 141304 141851 141878 141403 140523 139354 138013 136817 136227 136328 136533 136099 134814 132977 130922
56613 130922 128872 127044 125511 124034 122379 120736 119496 118689 118024 117496 117555 118524 120093 121502 122137 121946
56597 121946 121474 121398 121853 122284 122181 121840 122008 122883 123918 124657 125206 125730 126027 126027 126285 127416 129241 130993
56579 130993 132296 133396 134389 134819 134400 133747 133916 135307 137454 139887 142749 146310 150238 153873 157212
56564 157212 161150 166537 173220 180318 187280 194375 202206 211021 220589 230471 240237 249441 257506 263737
56550 263737 267674 269568 270384 271012 271464 271095 269562 267191 264432 261475 258645 256549 255236 253623 250550
56535 250550 246304 242282 239043 235539 230684 224884 219313 214236 208996 203356 197918 193125 188792 184864
56521 184864 181809 179774 178010 175745 173189 171066 169524 168146 166774 165638 164759 163867 162961 162361 162140
$$ packed form
56629A38564J652J088N47K7m75q80j169j341j196n90J01K05m34j285j837k055
56613A30922k050j828j533j477j655j643j240q07o65n28N9R69J569J409O35j91
56597A21946m72p6M55M31j03l41J68Q75J035P39N49N24K97%K58J131J825J752
56579A30993J303J100R93M30m19o53J69J391K147K433K862L561L928L635L339
56564A57212L938N387O683P098O962P095P831Q815R568R882R766R204Q065O231
56550B63737L937J894Q16O28M52l69j533k371k759k957k830k096j313j613l073
56535B50550m246m022l239l504m855n800n571n077n240n640n438m793m333l928
56521A84864l055k035j764k265k556k123j542j378j372j136q79q92r06o00k21
$$ plain form
56506 162140 162028 161996 162379 163281 164326 165221 166084 166998 167725 168182 168743 169650 170485 170699 170433 170306 170550 170812 170775
56487 170775 170503 170074 169315 168092 166669 165557 165061 165037 165038 164725 164195 163921 164301 165300 166560 167759 168758 169516
56469 169516 170023 170322 170538 170885 171550 172473 173194 173130 172172 170944 170359 170928 172456 174314 175879 176808 177028 176628
56451 176628 175870 175284 175443 176427 177704 178747 179557 180236 180353 179384 177719 176522 176409 176835 177020 176919 176965 177353
56433 177353 177957 178506 178527 177537 175676 173734 172240 170984 169750 168883 168614 168455 168049 168032 169169 171012 172391
56416 172391 173031 173666 174600 175173 174831 173796 172515 171238 170398 170537 171456 172188 172236 172176 172532 172755 171946 170128
56398 170128 168142 166663 165907 166023 167073 168654 170108 171216 172374 174058 176390 179182 182146 185037 187780
56383 187780 190484 193286 196187 199053 201623 203612 205023 206364 208202 210427 212297 213308 213651 213705 213614
$$ packed form
56506A62140j12l2L83R02J045Q95Q63R14P27M57N61R07Q35K14k66j27K44K62l7
56487A70775k72m29p59j223j423j112m96k4Jl13n30k74L80R99J260J199R99P58
56469A69516N07K99K16L47O65R23P21o4r58j228n85N69J528J858J565R29K20m00
56451A76628p58n86J59R84J277J043Q10O79J17r69j665j197j13M26J85j01M6L88
56433A77353O04N49K1r90j861j942j494j256j234q67k69j59m06j7J137J843J379
56416A72391O40O35R34N73l42j035j281j277q40J39R19P32M8o0L56K23q09j818
56398A70128j986j479p56J16J050J581J454J108J158J684K332K792K964K891K743
56383A87780K704K802K901K866K570J989J411J341J838K225J870J011L43N4r1
$$ plain form
56368 213614 213663 214511 216439 218684 220129 220529 220580 220850 221266 221676 222351 223622 225386 227239 228877 230115 230712
56351 230712 230516 229835 229426 229944 231383 233168 234804 236337 238027 239684 240605 240307 239153 238083 237823 238569
56335 238569 240276 242931 246393 250174 253676 256654 259313 261872 264207 266100 267677 269301 271001 272427
56321 272427 273507 274750 276562 278548 279933 280460 280401 279871 278790 277525 276873 277087 277445 277190 276591 276650 277963
56304 277963 280269 283043 286169 289863 294114 298447 302360 305947 309797 314114 318260 321528 324104 326733
56290 326733 329581 332088 334071 336275 339485 343587 347951 352366 357137 362471 368186 374013 379895 385967
56276 385967 392346 398922 405497 412346 420475 430743 442654 454619 465744 476874 489519 504195
56264 504195 520260 537043 554618 573688 595176 619833 647851 678918 712897 750288 791798
$$ packed form
56368B13614M9Q48J928K245J445M00N1K70M16M10O75J271J764J853J638J238N97
56351B30712j96o81m09N18J439J785J636J533J690J657R21k98j154j070k60P46
56335B38569J707K655L462L781L502K978K659K559K335J893J577J624J700J426
56321B72427J080J243J812J986J385N27n9n30j081j265o52K14L58k55n99N9J313
56304B77963K306K774L126L694M251M333L913L587L850M317M146L268K576K629
56290C26733K848K507J983K204L210M102M364M415M771N334N715N827N882O072
56276C85967O379O576O575O849Q129J0268J1911J1965J1125J1130J2645J4676
56264E04195J6065J6783J7575J9070K1488K4657K8018L1067L3979L7391M1510
$$ plain form
56253 791798 837770 888427 944476 1006870 1075980 1151364 1232419 1318936 1410973 1508324 1610163
56242 1610163 1715000 1821002 1926448 2029861 2129685 2223965 2310354 2386312 2449390 2497708
56232 2497708 2530299 2546711 2546307 2528452 2493532 2443327 2380153 2306174 2223707 2135384 2043262 1948169
56220 1948169 1850616 1752130 1655096 1561465 1472155 1387549 1307962 1233651 1164836 1101647 1043732
56209 1043732 990176 940322 894487 853298 816485 782912 751760 723075 697208 674327 654511
56198 654511 637647 623001 609457 596466 584425 573828 564438 555581 547008 539147 532542 527241 522771
56185 522771 518673 515013 512291 510866 510636 511274 512455 513707 514432 514386 513929 513574 513562 514116 515684 518477 522080
56168 522080 525960 530111 534726 539569 544218 548715 553393 558243 563075 568173 574165 581262 589198 597937
$$ packed form
56253G91798M5972N0657N6049O2394O9110P5384Q1055Q6517R2037R7351J01839
56242A610163J04837J06002J05446J03413R9824R4280Q6389P5958O3078M8318
56232B497708L2591J6412m04j7855l4920n0205o3174p3979q2467q8323r2122r5093
56220A948169r7553r8486r7034r3631q9310q4606p9587p4311o8815o3189n7915
56209A043732n3556m9854m5835m1189l6813l3573l1152k8685k5867k2881j9816
56198F54511j6864j4646j3544j2991j2041j0597r390q857q573p861o605n301m470
56185E22771m098l660k722j425k30O38J181J252P25m6m57l55j2N54J568K793L603
56168E22080L880M151M615M843M649M497M678M850M832N098N992P097P936Q739
$$ plain form
56154 597937 607889 619387 632422 646969 663192 681395 702189 726628 755643 789416 827752 871037
56142 871037 920224 975853 1037605 1104772 1176637 1252271 1330466 1409981 1489507 1567362 1641553
56131 1641553 1710101 1771060 1822669 1864303 1897316 1924287 1947214 1966708 1982591 1994389 2001119
56120 2001119 2001356 1993899 1978229 1954476 1923498 1886799 1845590 1799787 1748427 1691034 1628062 1560297
56108 1560297 1488855 1415901 1344398 1276666 1213733 1156230 1105172 1061503 1025459 996622 974119
56097 974119 956595 942640 931489 922901 916400 911361 907881 906706 908010 910990 914808 919132 923578
56084 923578 927589 931347 935947 942155 949609 957652 966171 975167 984298 993460 1003129 1013526 1024093 1034419
56070 1034419 1045103 1056987 1070014 1083442 1096789 1110017 1123249 1136870 1151468 1167166 1183404
$$ packed form
56154E97937R952J1498J3035J4547J6223J8203K0794K4439K9015L3773L8336M3285
56142H71037M9187N5629O1752O7167P1865P5634P8195P9515P9526P7855P4191
56131A641553O8548O0959N1609M1634L3013K6971K2927J9494J5883J1798O730
56120B001119K37p457j5670k3753l0978l6699m1209m5803n1360n7393o2972o7765
56108A560297p1442p2954p1503o7732o2933n7503n1058m3669l6044k8837k2503
56097I74119j7524j3955j1151q588o501n039l480j175J304K980L818M324M446
56084I23578M011L758M600O208P454Q043Q519Q996R131R162R669J0397J0567J0326
56070A034419J0684J1884J3027J3428J3347J3228J3232J3621J4598J5698J6238
$$ plain form
56059 1183404 1199887 1217219 1235990 1255675 1275110 1293744 1311844 1329776 1347736 1365992 1384824
56048 1384824 1404196 1423762 1443093 1461857 1480154 1498866 1519161 1541371 1564816 1588926 1613917
56037 1613917 1640023 1666871 1694211 1722701 1753277 1786112 1820712 1856624 1893506 1931007 1969240
56026 1969240 2009127 2051641 2096824 2143961 2192480 2242271 2293348 2345663 2399277 2454529 2512120
56015 2512120 2572985 2637690 2705900 2776789 2849961 2925587 3003844 3085057 3170298 3260902 3357126
56004 3357126 3458061 3563100 3672725 3787734 3908585 4035781 4170017 4311654 4460806
55995 4460806 4618115 4784579 4960595 5146278 5342827 5552315 5775901 6013586 6266131
55986 6266131 6535953 6825748 7137571 7473622 7836568 8228718 8652407 9111715 9612295
$$ packed form
56059A183404J6483J7332J8771J9685J9435J8634J8100J7932J7960J8256J8832
56048A384824J9372J9566J9331J8764J8297J8712K0295K2210K3445K4110K4991
56037A613917K6106K6848K7340K8490L0576L2835L4600L5912L6882L7501L8233
56026A969240L9887M2514M5183M7137M8519M9791N1077N2315N3614N5252N7591
56015B512120O0865O4705O8210P0889P3172P5626P8257Q1213Q5241R0604R6224
56004C357126J00935J05039J09625J15009J20851J27196J34236J41637J49152
55995D460806J57309J66464J76016J85683J96549K09488K23586K37685K52545
55986F266131K69822K89795L11823L36051L62946L92150M23689M59308N00580
$$ plain form
55977 9612295 10159320 10757523 11413934 12138799 12943308 13838773 14839342 15964167 17236709
55968 17236709 18684348 20339430 22238037 24416659 26912983 29772225 33052441 36826534
55960 36826534 41187669 46260606 52211553 59252585 67645830 77704408 89768324 104134435
55952 104134435 120946383 140083248 161109800 183348514 206069735 228685207 250781956
55945 250781956 271940727 291463357 308200450 320581707 326850486 325479138 315693775
55938 315693775 297899140 273725859 245605150 216095016 187319001 160717767 137067645
55931 137067645 116623667 99290823 84780471 72724282 62738589 54459734 47569406
55924 47569406 41806635 36961618 32863654 29375464 26389646 23820408 21595907 19657460
$$ packed form
55977I612295N47025N98203O56411P24865Q04509Q95465J000569J124825J272542
55968A7236709J447639J655082J898607K178622K496324K859242L280216L774093
55960C6826534M361135N072937N950947P041032Q393245J0058578J2063916J4366111
55952A04134435J6811948J9136865K1026552K2238714K2721221K2615472K2096749
55945B50781956K1158771J9522630J6737093J2381257O268779j371348r785363
55938C15693775j7794635k4173281k8120709k9510134k8776015k6601234k3650122
55931A37067645k0443978j7332844j4510352j2056189r985693q278855o890328
55924D7569406n762771m845017m097964l488190k985818k569238k224501j938447
$$ plain form
55916 19657460 17960283 16469259 15153803 13987589 12949929 12023925 11194031 10446732
55908 10446732 9771711 9160360 8604404 8097076 7633706 7209554 6818657 6456187 6120244
55899 6120244 5809753 5522025 5253885 5003738 4770911 4553972 4351159 4161628 3985104
55890 3985104 3820988 3668632 3527522 3396446 3273506 3157723 3049566 2949194 2855262 2766120
55880 2766120 2680866 2598398 2516821 2434980 2353656 2274315 2197525 2123310 2051935 1983412 1917209
55869 1917209 1853392 1793155 1737288 1684922 1634615 1585863 1538848 1493583 1450215 1409378 1371403
55858 1371403 1335819 1302197 1270627 1240739 1211302 1181737 1153139 1126863 1102762 1079633 1056702
55847 1056702 1033829 1010982 988354 966490 945560 925080 904843 885349 866695 848009 828849
$$ packed form
55916A9657460j697177j491024j315456j166214j037660r26004q29894p47299
55908A0446732o75021o11351n55956n07328m63370m24152l90897l62470l35943
55899F120244l10491k87728k68140k50147k32827k16939k02813j89531j76524
55890C985104j64116j52356j41110j31076j22940j15783j08157j00372r3932q9142
55880B766120q5254q2468q1577q1841q1324p9341p6790p4215p1375o8523o6203
55869A917209o3817o0237n5867n2366n0307m8752m7015m5265m3368m0837l7975
55858A371403l5584l3622l1570k9888k9437k9565k8598k6276k4101k3129k2931
55847A056702k2873k2847k2628k1864k0930k0480k0237j9494j8654j8686j9160
$$ plain form
55836 828849 810259 793424 778010 762875 747829 733607 720590 708549 697349 686961 676999 667018
55824 667018 657043 647273 637668 628370 619934 612405 604641 595377 584625 573410 562554 552421 543353
55811 543353 535584 528940 523216 518532 514889 511898 509392 507678 506627 505362 503588 502474 503240 505550
55797 505550 508271 511208 514883 519050 522661 525188 526927 528077 528468 528108 527121 525197 521917 517540 512708
55782 512708 507517 501650 495320 489147 483148 476632 469230 461369 453742 446871 441192 436992 434296 433222
55768 433222 434173 437076 440692 443287 443738 441382 435331 424989 411171 395775 380361 365765 352765
55755 352765 341987 333078 325019 317474 310940 305452 300146 294476 288935 284107 279762 275466 271464 268385
55741 268385 266402 265117 264019 262824 261644 260999 261270 262001 262119 260992 258911 256456 253841 251032 248039
$$ packed form
55836H28849j8590j6835j5414j5135j5046j4222j3017j2041j1200j0388r962r981
55824F67018r975r770r605r298q436p529p764r264j0752j1215j0856j0133r068
55811E43353p769o644n724m684l643k991k506j714j051j265j774j114P66K310
55797E05550K721K937L675M167L611K527J739J150L91l60r87j924l280m377m832
55782E12708n191n867o330o173n999o516p402p861p627o871n679m200k696j074
55768D33222R51K903L616K595M51k356o051j0342j3818j5396j5414j4596j3000
55755C52765j0778q909q059p545o534n488n306n670n541m828m345m296m002l079
55741B68385j983j285j098j195j180o45K71P31J18j127k081k455k615k809k993
$$ plain form
55726 248039 244887 241630 238480 235534 232363 228400 223868 219803 216977 215360 214812 215564 217568 219933 221693
55711 221693 222894 224420 226861 229996 233254 236222 238641 240275 240938 240488 238767 235628 231143 225710 219909
55696 219909 214167 208533 202794 196866 191069 186039 182353 180141 178874 177652 176034 174681 174777 176694 179511
55681 179511 182031 183849 185248 186588 188232 190594 193623 196501 198424 199480 200246 200746 200445 199161 197285
55666 197285 195177 193002 191183 190301 190339 190516 190105 189114 188090 187657 188204 189629 191309 192681 193826 195140
55650 195140 196657 198191 199888 201944 203853 204797 204799 204694 204800 204448 203102 201009 198309 194377 188845 182685
55634 182685 177472 173775 170908 167921 164285 159811 154672 149604 145533 142789 140897 139202 137511 136095
55620 136095 135227 134803 134381 133601 132524 131421 130258 128660 126408 123739 121115 118917 117358 116318 115210
$$ packed form
55726B48039l152l257l150k946l171l963m532m065k826j617n48P52K004K365J760
55711B21693J201J526K441L135L258K968K419J634O63m50j721l139m485n433n801
55696B19909n742n634n739n928n797n030l686k212j267j222j618j353R6J917K817
55681A79511K520J818J399J340J644K362L029K878J923J056P66N00l01j284j876
55666A97285k108k175j819q82L8J77m11r91j024m33N47J425J680J372J145J314
55650A95140J517J534J697K056J909R44Kj05J06l52j346k093k700l932n532o160
55634A82685n213l697k867k987l636m474n139n068m071k744j892j695j691j416
55620A36095q68m24m22p80j077j103j163j598k252k669k624k198j559j040j108
$$ plain form
55605 115210 113418 111060 109015 107922 107434 106756 105631 104510 103916 103947 104344 104774 104975 104771 104033 102746 101230
55588 101230 100148 99999 100596 101239 101416 101135 100680 100356 100379 100612 100458 99544 98530 98634 100168 102069 103231
55571 103231 103806 104771 106588 108750 110469 111402 111801 112217 113035 114132 115111 115836 116485 117047 117172 116675 115746
55554 115746 114493 112740 110559 108479 106718 104688 101866 98836 96782 96093 96102 96248 96828 98335 100500 102374
55538 102374 103258 103338 103417 104144 105526 107120 108541 109645 110326 110469 110203 109976 110131 110491 110398 109133 106426 102859
55520 102859 99678 97850 97260 97078 96819 96528 96031 94809 92857 90966 89752 88994 88341 88005 88217 88664 89163
55503 89163 90338 92723 95610 97702 98650 99109 99454 99473 99275 99432 99960 100066 99263 97974 96699 95346 93829
55486 93829 92622 92133 91964 91364 90076 88380 86663 85393 85069 85657 86352 86354 85673 84754 83711 82481 81431
$$ packed form
55605A15210j792k358k045j093m88o78j125j121n94L1L97M30K01k04p38j287j516
55588A01230j082j49N97O43J77k81m55l24K3K33j54r14j014J04J534J901J162
55571A03231N75R65J817K162J719R33L99M16Q18J097R79P25O49N62J25m97r29
55554A15746j253j753k181k080j761k030k822l030k054o89RJ46N80J507K165J874
55538A02374Q84Q0P9P27J382J594J421J104O81J43k66k27J55L60r3j265k707l567
55520A02859l181j828n90j82k59k91m97j222j952j891j214p58o53l36K12M47M99
55503H9163J175K385K887K092R48M59L45J9j98J57N28J06q03j289j275j353j517
55486I3829j207m89j69o00j288j696j717j270l24N88O95Ko81r19j043j230j050
$$ plain form
55469 81431 81037 81070 80861 80384 80352 81069 81926 82385 82802 83677 84543 84348 82775 80605 78763 77515 76685 76116
55451 76116 75653 75056 74261 73541 73150 72992 72860 72795 72932 73137 73178 73170 73454 74045 74538 74666 74565 74374 73954 73281
55431 73281 72813 73071 73987 74930 75376 75401 75603 76626 78524 80423 81052 80019 78408 77729 78358 79395 79969
55414 79969 80102 80204 80329 80352 80492 81096 82030 82775 83146 83485 84002 84293 83787 82543 81294 80702 80706 80669 80042 78814
55394 78814 77411 76332 75909 76223 77052 77917 78405 78526 78598 78665 78263 76992 75181 73640 72825 72575 72725 73462
55376 73462 74841 76345 77369 77922 78453 79118 79766 80544 81919 83902 85692 86368 85714 84248 82794 82111
55360 82111 82428 83077 82984 81872 80600 79997 79844 79469 78903 78708 78979 79287 79540 80091 80842 80967 79799 77580
55342 77580 75173 73445 72928 73560 74531 74880 74436 73792 73266 72504 71333 70342 70103 70334 70363 70149 70329 71392
$$ packed form
55469H1431l94L3k09m77l2P17Q57M59M17Q75Q66j95j573k170j842j248q30n69
55451G6116m63n97p95p20l91j58j32o5J37K05M1qK84N91M93J28j01j91m20o73
55431G3281m68K58R16R43M46K5K02J023J898J899O29j033j611o79O29J037N74
55414G9969J33J02J25K3J40O04R34P45L71L39N17K91n06j244j249n92Ml7o27j228
55394G8814j403j079m23L14Q29Q65M88J21P2O7m02j271j811j541q15k50J50P37
55376G3462J379J504J024N53N31O65O48P78J375J983J790O76o54j466j454o83
55360H2111L17O49r3j112j272o03j53l75n66j95K71L08K53N51P51J25j168k219
55342G7580k407j728n17O32R71L49m44o44n26p62j171r91k39K31K9k14J80J063
$$ plain form
55324 71392 73153 74844 75453 74313 71823 69420 68384 68666 69176 69091 68606 68444 68945 69700 70010 69708 69401
55307 69401 69675 70207 70160 69483 69106 69614 70418 70702 70504 70223 69657 68436 67060 66541 67081 67971 68788 69842
55289 69842 71288 72591 73273 73597 74203 75403 77066 78722 79603 79064 77304 75320 73944 73224 72958 73352
55273 73352 74730 76873 79039 80542 81070 80601 79328 77618 75839 74257 73109 72582 72596 72854 73262 74043
55257 74043 75183 76043 75907 74867 73794 73416 73672 74027 74112 73901 73491 73031 72800 73093 73894 74867 75743 76594
55239 76594 77560 78478 79023 79132 78996 78703 78213 77667 77345 77185 76760 75896 74944 74266 73878 73809 74291 75159 75614
55220 75614 75205 74670 75001 75888 75965 74667 73039 72431 72989 73773 73907 73240 72205 71351 70950 70970 71456 72720
55202 72720 74744 76579 77014 75935 74489 73738 73720 73973 74363 75007 75899 77023 78423 79788 80412 80006 79167
$$ packed form
55324G1392J761J691O09j140k490k403j036K82N10q5m85j62N01P55L10l02l07
55307F9401K74N32m7o77l77N08Q04K84j98k81n66j221j376n19N40Q90Q17J054
55289F9842J446J303O82L24O06J200J663J656Q81n39j760j984j376p20k66L94
55273G3352J378K143K166J503N28m69j273j710j779j582j148n27J4K58M08P81
55257G4043J140Q60j36j040j073l78K56L55Q5k11m10m60k31K93Q01R73Q76Q51
55239G6594R66R18N45J09j36k93m90n46l22j60m25q64r52o78l88o9M82Q68M55
55220G5614m09n35L31Q87P7j298j628o08N58P84J34o67j035q54m01K0M86J264
55202G2720K024J835M35j079j446p51j8K53L90O44Q92J124J400J365O24m06q39
$$ plain form
55185 79167 78627 78388 78070 77722 77720 78108 78607 79090 79475 79353 78431 77286 77019 77961 79301 80160 80556 81033 81777
55166 81777 82423 82554 82088 81308 80657 80358 80141 79555 78648 78108 78502 79598 80642 81142 81103 80673 79956 79240 78983
55147 78983 79351 79969 80423 80821 81460 82031 81693 80221 78556 77717 77495 76952 76084 76010 77229 78597 78782 78101
55129 78101 77964 78805 79681 79950 80191 80962 81628 81306 80341 79890 80287 80778 80868 80999 81578 82152 82077 81472 80900 80467
55109 80467 79867 79154 78831 79168 79885 80554 80936 80947 80731 80795 81541 82555 82904 82327 81610 81498 81789 81938 82037 82566
55089 82566 83521 84487 85379 86407 87325 87434 86517 85232 84372 84201 84688 85845 87479 88986 89834 90087 90175 90286
55071 90286 90246 89850 89155 88492 88245 88439 88496 87712 86179 84928 84902 85989 87287 88109 88448 88660 89063 89774 90589
55052 90589 91012 90671 89780 88982 88708 88814 88906 88848 88931 89565 90823 92203 92926 92608 91673 90975 90957 91237 91051 90081
$$ packed form
55185G9167n40k39l18l48kL88M99M83L85j22r22j145k67R42J340Q59L96M77P44
55166H1777O46J31m66p80o51k99k17n86r07n40L94J096J044N00l9m30p17p16k57
55147G8983L68O18M54L98O39N71l38j472j665q39k22n43q68p4J219J368J85o81
55129G8101j37Q41Q76K69K41P71O66l22r65m51L97M91R0J31N79N74p5o05n72m33
55109H0467o00p13l23L37P17O69L82J1k16O4P46J014L49n77p17j12K91J49R9N29
55089H2566R55R66Q92J028R18J09r17j285q60j71M87J157J634J507Q48K53Q8J11
55071I0286m0l96o95o63k47J94N7p84j533j251k6J087J298Q22L39K12M03P11Q15
55052I0589M23l41q91p98k74J06R2n8Q3O34J258J380P23l18r35o98j8K80j86r70
$$ plain form
55032 90081 88784 87890 87627 87571 87308 87003 87071 87434 87502 86992 86411 86473 87239 88092 88469 88390 88302 88614 89381 90283 90847
55011 90847 90766 90081 89077 88114 87525 87594 88433 89847 91335 92342 92626 92457 92368 92660 93248 93999 94992 96225
54993 96225 97327 97928 98187 98545 99015 99144 98722 98044 97333 96382 95004 93493 92338 91705 91479 91582 92010 92757
54975 92757 93830 95155 96381 97151 97730 98857 100651 102141 102418 101876 101703 102323 103003 102949 102137 101002 99868
54958 99868 98967 98574 98791 99424 100248 101214 102197 102810 102703 101992 101214 100949 101532 102945 104727 106047 106138 104939
54940 104939 103283 102281 102332 102809 102840 102299 101794 101794 102152 102550 103001 103667 104472 105201 105808 106364 106998 108030 109839
54921 109839 112254 114476 116070 117718 120359 123848 127247 130323 133882 138404 143218 147450 150981 153787
54907 153787 154955 153407 149515 145114 141622 138782 135535 131593 127636 124223 121212 118299 115633 113589
$$ packed form
55032I0081j297q94k63n6k63l05O8L63O8n10n81O2P66Q53L77p9q8L12P67R02N64
55011I0847q1o85j004r63n89O9Q39J414J488J007K84j69q9K92N88P51R93J233
54993I6225J102O01K59L58M70J29m22o78p11r51j378j511j155o33k26J03M28P47
54975I2757J073J325J226P70N79J127J794J490K77n42j73O20O80n4q12j135j134
54958I9868r01l93K17O33Q24R66R83O13j07p11p78k65N83J413J782J320R1j199
54940A04939j656j002N1M77L1n41n05%L58L98M51O66Q05P29O07N56O34J032J809
54921A09839K415K222J594J648K641L489L399L076L559M522M814M232L531K806
54907A53787J168j548l892m401l492k840l247l942l957l413l011k913k666k044
$$ plain form
54893 113589 112206 111206 110494 110284 110699 111511 112347 112936 113053 112524 111459 110392 109960 110483 111880 113802 115753
54876 115753 117323 118558 119978 122088 124998 128626 132946 137678 142009 145151 147111 148450 149309 149192 147837
54861 147837 145770 143676 141558 138947 135719 132307 129123 126140 123142 120141 117314 114628 111806 108778
54847 108778 106030 104213 103365 102740 101605 100052 98862 98639 99248 100017 100274 99795 98913 98174 97712 97068 95847
54830 95847 94412 93579 93652 94160 94527 94618 94516 94264 94110 94635 96155 98121 99513 99868 99593 99263 98923 98266
54812 98266 97262 96302 95754 95617 95697 95912 96236 96498 96559 96642 97191 98311 99584 100568 101196 101570 101692 101702 102026
54793 102026 102861 103691 103821 103332 103026 103395 104058 104301 103804 102702 101331 100125 99466 99428 99872 100809 102352 104224
54775 104224 105743 106561 107093 107911 109059 110319 111832 113902 116362 118721 121024 124043 128360 133584 138733
$$ packed form
54893A13589j383j000p12k10M15Q12Q36N89J17n29j065j067m32N23J397J922J951
54876A15753J570J235J420K110K910L628M320M732M331L142J960J339Q59j17j355
54861A47837k067k094k118k611l228l412l184k983k998l001k827k686k822l028
54847A08778k748j817q48o25j135j553j190k23O09P69K57m79q82p39m62o44j221
54830I5847j435q33P3N08L67R1j02k52j54N25J520J966J392L55k75l30l40o57
54812I8266j004r60n48j37Q0K15L24K62O1Q3N49J120J273R84O28L74J22J0L24
54793A02026Q35Q30J30m89l06L69O63K43m97j102j371j206o59l8M44R37J543J872
54775A04224J519Q18N32Q18J148J260J513K070K460K359K303L019M317N224N149
$$ plain form
54760 138733 143190 147050 150722 154464 158189 161424 163475 163901 162899 161014 158440 154942 150583 146167
54746 146167 142548 139639 136508 132517 128057 124108 121352 119741 118644 117371 115864 114892 115201 116420 117283
54731 117283 117138 116681 116883 117756 118700 119609 120884 122577 124234 125580 126803 128183 130013 132764 136672 141073
54715 141073 144789 147362 149351 151238 152640 152956 152315 151425 150698 149809 148015 144798 140423 135883 132013
54700 132013 128674 125185 121505 118386 116331 115064 114202 113698 113276 112181 110152 108068 106948 106684 106463
54685 106463 106065 105958 106284 106602 106680 106821 107241 107721 108081 108456 108838 108710 107531 105431 103219 101774 101433 101795
54667 101795 102090 101911 101622 101892 102888 104129 105060 105465 105311 104590 103489 102478 101964 101999 102448 103279 104473 105696
54649 105696 106354 106093 105165 104148 103330 102528 101566 100750 100678 101624 103301 105141 106549 106971 106159 104536 103009
$$ packed form
54760A38733M457L860L672L742L725L235K051M26j002j885k574l498m359m416
54746A46167l619k909l131l991m460l949k756j611j097j273j507r72L09J219Q63
54731A17283j45m57K02Q73R44R09J275J693J657J346J223J380J830K751L908M401
54715A41073L716K573J989J887J402L16o41q90p27q89j794l217m375m540l870
54700A32013l339l489l680l119k055j267q62n04m22j095k029k084j120k64k21
54685A06463l98j07L26L18P8J41M20M80L60L75L82j28j179k100k212j445l41L62
54667A01795K95j79k89K70R96J241R31M05j54p21j101j011n14L5M49Q31J194J223
54649A05696O58k61r28j017q18q02r62q16p2R46J677J840J408M22q12j623j527
$$ plain form
54632 103009 102180 101931 101868 101822 101719 101392 100881 100587 100731 100880 100477 99617 98842 98356 98033 98101 99109 101043 103066
54613 103066 104414 105121 105571 105811 105744 105677 106077 106786 106975 106089 104624 103683 103809 104421 104491 103658 102535 101990 102373
54594 102373 103430 104635 105419 105412 104851 104520 104919 105629 105963 106117 107033 109006 111067 112078 112016 111743 111852 112270
54576 112270 112761 113245 113555 113366 112643 111893 111703 112081 112439 112249 111594 111013 110872 111071 111342 111602 111795 111562 110541
54557 110541 109051 108099 108413 109685 111062 112133 113102 114075 114698 114682 114333 114326 115051 116329 117657 118621 119156 119533
54539 119533 120126 121185 122790 124858 126957 128299 128390 127808 127885 129298 131263 132428 132253 131115 129421 127273
54523 127273 124883 122627 120564 118503 116670 115652 115444 115241 114591 114156 114724 115968 116900 117186 117233 117194 116721
54506 116721 115755 114839 114475 114714 115471 116647 117835 118466 118498 118423 118447 118188 117453 116783 116867 117760 118962 119894 120135
$$ packed form
54632A03009q29k49o3m6j03l27n11k94J44J49m03q60p75m86l23O8J008J934K023
54613A03066J348P07M50K40o7o7M00P09J89q86j465r41J26O12P0q33j123n45L83
54594A02373J057J205P84pn61l31L99P10L34J54R16J973K061J011o2k73J09M18
54576A12270M91M84L10j89p23p50j90L78L58j90o55n81j41J99K71K60J93k33j021
54557A10541j490r52L14J272J377J071R69R73O23j6l49pP25J278J328R64N35L77
54539A19533N93J059J605K068K099J342R1n82P7J413J965J165j75j138j694k148
54523A27273k390k256k063k061j833j018k08k03o50m35N68J244R32K86M7l9m73
54506A16721r66r16l64K39P57J176J188O31L2p5K4k59p35o70Q4Q93J202R32K41
$$ plain form
54487 120135 119604 118836 118604 119054 119623 120026 120656 121595 121955 120939 119109 117845 117792 118578 119740 121102 122286
54470 122286 122775 122716 122967 124066 125620 126972 128020 129069 130197 131113 131534 131531 131553 132114 133238 134240 134322 133479
54452 133479 132559 132314 132659 132977 132941 132756 132698 132675 132374 131788 131322 131242 131168 130487 129252 128275 128163 128633 128982 128884
54432 128884 128393 127571 126563 125782 125554 125688 125711 125375 124681 123751 123120 123696 125746 128164 129462 129466 129270 129588
54414 129588 129896 129438 128345 127416 127312 128243 129993 131927 133296 133826 133829 133694 133641 133923 134729 135726 136282 136415
54396 136415 136977 138514 140405 141595 141856 141859 142221 142940 143689 144323 145036 146166 147785 149379 150127 149610 148140
54379 148140 146352 144701 143388 142412 141557 140629 139854 139733 140353 141161 141593 141644 141627 141724 142055 142872 144326 146193
54361 146193 148006 149302 149711 149142 148121 147564 147974 149083 150403 151736 152945 153756 154209 154862 156060 157346
$$ packed form
54487A20135n31p68k32M50N69M03O30R39L60j016j830j264n3P86J162J362J184
54470A22286M89n9K51J099J554J352J048J049J128R16M21lK2N61J124J002Q2q43
54452A33479r20k45L45L18l6j85n8k3l01n86m66q0p4o81j235r77j12M70L49r8
54432A28884m91q22j008p81k28J34K3l36o94r30o31N76K050K418J298Mj96L18
54414A29588L08m58j093r29j04R31J750J934J369N30Lj35n3K82Q06R97N56J33
54396A36415N62J537J891J190K61LL62P19P49O34P13J130J619J594P48n17j470
54379A48140j788j651j313r76q55r28p75j21O20Q08M32N1j7R7L31Q17J454J867
54361A46193J813J296M09n69j021n57M10J109J320J333J209Q11M53O53J198J286
$$ plain form
54345 157346 158115 158522 159127 159853 159945 158983 157372 155748 154387 153291 152403 151498 150176 148260 146132 144545
54329 144545 144037 144427 144818 144311 142866 141340 140552 140507 140663 140672 140533 140259 139769 139039 138067 136832 135528 134614
54311 134614 134323 134347 134360 134579 135335 136265 136542 135873 134727 133597 132588 131840 131749 132534 133935 135526 137006 138093
54293 138093 138547 138523 138497 138654 138647 138155 137308 136291 134974 133327 131922 131529 132317 133819 135544 137220 138516
54276 138516 139069 139021 139156 140153 141822 143325 144115 144407 144672 144920 144701 143724 142264 140883 139909 139286 138833 138556
54258 138556 138727 139678 141408 143328 144548 144579 143734 142773 142289 142488 143333 144590 145804 146527 146634 146299 145686
54241 145686 144837 143825 142831 142004 141344 140713 139906 138853 137901 137693 138431 139367 139446 138505 137404 136835 136435 135461
54223 135461 134060 133334 134116 136023 137927 139143 139876 140562 141065 140833 139723 138362 137533 137449 137799 138306 138920
$$ packed form
54345A57346P69M07O05P26R2r62j611j624j361j096q88r05j322j916k128j587
54329A44545n08L90L91n07j445j526p88m5J56Rj39k74m90p30r72j235j304r14
54311A34614k91K4J3K19P56R30K77o69j146j130j009p48r1P85J401J591J480J087
54293A38093M54k4k6J57pm92q47j017j317j647j405l93P88J502J725J676J296
54276A38516N53m8J35R97J669J503P90K92K65K48k19r77j460j381r74o23m53k77
54258A38556J71R51J730J920J220L1q45r61m84J99Q45J257J214P23J07l35o13
54241A45686q49j012r94q27o60o31q07j053r52k08P38R36P9r41j101n69m00r74
54223A35461j401p26P82J907J904J216P33O86N03k32j110j361q29q4L50N07O14
$$ plain form
54206 138920 139534 139888 139812 139340 138530 137402 136132 135039 134263 133668 133172 132926 132987 132976 132346 130969 129314 128009
54188 128009 127326 127077 126938 126863 127118 127886 128946 129930 130767 131607 132382 132787 132840 133038 133721 134586 135107 135173 134968
54169 134968 134501 133765 133172 133264 133935 134490 134582 134616 134996 135489 135698 135748 135997 136348 136382 135993 135356 134370 132813 131124
54149 131124 130360 130990 132274 133247 133944 135127 137038 138998 140161 140158 139088 137434 136104 135988 137094 138399
54133 138399 138852 138328 137460 136820 136585 136795 137465 138416 139337 140162 141193 142677 144312 145383 145462 144937 144731 145423
54115 145423 146706 147811 148314 148347 148119 147577 146703 145837 145418 145466 145592 145554 145646 146387 147793 149081 149211 147848
54097 147848 145679 143758 142680 142541 143392 145216 147426 148955 149210 148691 148385 148694 149228 149507 149504 149510 149687 149907
54079 149907 149960 149815 149666 149711 150060 150847 152181 153716 154574 154264 153668 154390 156938 160116 162570 164373 166548
$$ packed form
54206A38920O14L54p6m72q10j128j270j093p76n95m96k46O1j1o30j377j655j305
54188A28009o83k49j39p5K55P68J060R84Q37Q40P75M05N3J98O83Q65N21O6k05
54169A34968m67p36n93R2O71N55R2L4L80M93K09N0K49L51L4l89o37r86j557j689
54149A31124p64O30J284R73O97J183J911J960J163lj070j654j330j16J106J305
54133A38399M53n24q68o40k35K10O70R51R21Q25J031J484J635J071P9n25k06O92
54115A45423J283J105N03L3k28n42q74q66m19M8J26l8R2P41J406J288J30j363
54097A47848k169j921j078j39Q51J824K210J529K55n19l06L09N34K79lOJ77K20
54079A49907N3j45j49M5L49P87J334J535Q58l10n96P22K548L178K454J803K175
$$ plain form
54062 166548 169550 172999 176657 180749 185174 189122 191885 193707 195532 198141 201721 205940 210141 213562
54048 213562 215678 216417 215995 214592 212302 209438 206815 205493 206018 207914 210146 212170 214370 217474 221781
54033 221781 227090 232969 238761 243613 246994 249210 251146 253486 256307 259270 261970 264166 265949 267654
54019 267654 269450 271094 272206 272636 272374 271340 269500 267000 263913 260112 255673 251138 246970 242966 238698
54004 238698 234326 230450 227240 224237 221038 217696 214416 211270 208282 205398 202400 199223 196323 194270
53990 194270 192995 191933 190925 190430 190726 191432 191933 191821 190841 188937 186600 184644 183378 182409 181459 180859
53974 180859 180904 181246 181406 181553 182323 183983 186133 188096 189400 190052 190512 191246 192236 193178 194191 195847 198379
53957 198379 201308 204123 206867 209727 212464 214726 216617 218571 220849 223469 226292 228832 230351 230555
$$ packed form
54062A66548L002L449L658M092M425L948K763J822J825K609L580M219M201L421
54048B13562K116P39m22j403k290k864k623j322N25J896K232K024K200L104M307
54033B21781N309N879N792M852L381K216J936K340K821K963K700K196J783J705
54019B67654J796J644J112M30k62j034j840k500l087l801m439m535m168m004m268
54004B38698m372l876l210l003l199l342l280l146k988k884k998l177k900k053
53990A94270j275j062j008m95K96P06N01j12r80j904k337j956j266r69r50o00
53974A80859M5L42J60J47P70J660K150J963J304O52M60P34R90R42J013J656K532
53957A98379K929K815K744K860K737K262J891J954K278K620K823K540J519K04
$$ plain form
53943 230555 230012 229522 229378 229658 230826 233393 237118 241202 245246 249476 254033 258603 262877 266859 270552
53928 270552 273707 276126 277987 279720 281762 284547 288483 293724 299990 306718 313426 320052 327038 335027
53914 335027 344369 354947 366512 378956 392104 405469 418505 430913 442445 452578 460753 466840
53902 466840 470901 472451 470410 464042 453838 441374 428346 415697 403427 391106 378624 366458
53890 366458 355227 345112 335766 326637 317318 307900 299128 291888 286157 280737 274528 267885 262172 258006
53876 258006 254544 250666 246300 242238 239057 236560 234134 231327 228199 225301 223229 222026 221100 219799
53862 219799 217880 215406 212458 209245 206287 204096 202628 201336 199800 198141 196725 195651 194685 193647
53848 193647 192676 192080 191949 192012 191903 191545 191221 191240 191545 191752 191573 191094 190546 189933 189101 188159 187533 187433 187498 187243
$$ packed form
53943B30555n43m90j44K80J168K567L725M084M044M230M557M570M274L982L693
53928B70552L155K419J861J733K042K785L936N241O266O728O708O626O986P989
53914C35027R342J0578J1565J2444J3148J3365J3036J2408J1532J0133Q175O087
53902D66840M061J550k041o368j0204j2464j3028j2649j2270j2321j2482j2166
53890C66458j1231j0115r346r129r319r418q772p240n731n420o209o643n713m166
53876B58006l462l878m366m062l181k497k426k807l128k898k072j203r26j301
53862B19799j919k474k948l213k958k191j468j292j536j659j416j074r66j038
53848A93647r71n96j31O3j09l58l24J9L05K07j79m79n48o13q32r42o26j00O5k55
$$ plain form
53828 187243 186751 186599 187129 188068 188886 189306 189410 189438 189542 189604 189358 188929 189035 190256 192146 193673 194605 195861
53810 195861 198202 201207 204066 206862 210339 214672 219167 223186 226774 230330 234204 238688 243904 249464
53796 249464 254601 258855 262404 265608 268516 270999 273063 274800 276177 277099 277624 277948 278224 278425 278284 277314
53780 277314 275057 271520 267384 263716 261293 260017 258906 256795 253232 248701 243919 239128 234246 229547
53766 229547 225756 223339 221933 220666 218948 216811 214553 212239 209644 206626 203457 200740 199031 198511
53752 198511 198886 199491 199655 199159 198259 197101 195332 192697 189834 187976 187766 188837 190562 192556 194253 194836
53736 194836 194153 193203 193033 193547 194038 194496 195544 197272 199014 200369 201672 203292 205143 207120 209407 211963
53720 211963 214196 215549 216177 216707 217562 218742 220073 221413 222701 223910 224979 225801 226468 227453 229313 232154
$$ packed form
53828A87243m92j52N30R39Q18M20J04K8J04O2k46m29J06J221J890J527R32J256
53810A95861K341L005K859K796L477M333M495M019L588L556L874M484N216N560
53796B49464N137M254L549L204K908K483K064J737J377R22N25L24K76K01j41r70
53780B77314k257l537m136l668k423j276j111k111l563m531m782m791m882m699
53766B29547l791k417j406j267j718k137k258k314k595l018l169k717j709n20
53752A98511L75O05J64m96r00j158j769k635k863j858k10J071J725J994J697N83
53736A94836o83r50j70N14M91M58J048J728J742J355J303J620J851J977K287K556
53720B11963K233J353O28N30Q55J180J331J340J288J209J069Q22O67R85J860K841
$$ plain form
53704 232154 235537 238860 241703 244034 246356 249447 253509 257691 260886 262940 264607 266429 268236 269774
53690 269774 271122 272346 273347 274314 275729 277629 279329 280250 280570 280676 280425 279428 277778 275991 274407 273067
53674 273067 272036 271396 270946 270199 268807 266907 265123 264228 264570 265647 266444 266302 265325 263988 262681 261721
53658 261721 261323 261224 260680 259241 257352 255920 255440 255769 256514 257321 257917 258226 258403 258630 258950 259379 259940 260499
53640 260499 260893 261338 262329 263871 265240 265957 266677 268580 271970 275953 279437 282103 284384 286852 289693
53625 289693 292571 294991 296920 298933 301598 304884 308368 311754 314900 317607 319904 322410 325911 330460
53611 330460 335251 339532 343352 347297 351755 356596 361457 366136 370692 375176 379359 382840 385521 387827
53597 387827 390336 393246 396229 398689 400133 400464 400048 399321 398359 397022 395439 393906 392222 389651 385890
$$ packed form
53704B32154L383L323K843K331K322L091M062M182L195K054J667J822J807J538
53690B69774J348J224J001R67J415J900J700R21L20J06k51r97j650j787j584j340
53674B73067j031o40m50p47j392j900j784q95L42J077P97j42r77j337j307r60
53658B61721l98r9n44j439j889j432m80L29P45Q07N96L09J77K27L20M29N61N59
53640B60499L94M45R91J542J369P17P20J903L390L983L484K666K281K468K841
53625B89693K878K420J929K013K665L286L484L386L146K707K297K506L501M549
53611C30460M791M281L820L945M458M841M861M679M556M484M183L481K681K306
53597C87827K509K910K983K460J444L31m16p27r62j337j583j533j684k571l761
$$ plain form
53582 385890 381649 377881 374789 371974 369195 366439 363561 360470 357561 355402 353991 352805 351546 350425
53568 350425 349702 349356 349170 348838 348104 347190 346920 347920 349760 351362 352210 352675 353218 353886 354607 355399 356111 356506
53550 356506 356750 357347 358496 360022 361992 364801 368402 372069 375271 378248 381460 385016 389054 394142 400692
53535 400692 408324 416312 424375 432606 441001 449627 459001 469625 481209 492921 504415 516122 528526
53522 528526 541687 555561 570297 585984 602439 619479 637209 655856 675518 696222 718066
53511 718066 741127 765242 790023 815087 840245 865521 891005 916740 942714 968908 995178
53500 995178 1021097 1046119 1069996 1092890 1115004 1136305 1156766 1176675 1196418 1216087 1235526
53489 1235526 1254677 1273609 1292272 1310525 1328437 1346328 1364431 1382601 1400389 1417302 1433069
$$ packed form
53582C85890m241l768l092k815k779k756k878l091k909k159j411j186j259j121
53568C50425p23l46j86l32p34r14k70J000J840J602Q48M65N43O68P21P92P12L95
53550C56506K44N97J149J526J970K809L601L667L202K977L212L556M038N088O550
53535D00692P632P988Q063Q231Q395Q626R374J0624J1584J1712J1494J1707J2404
53522E28526J3161J3874J4736J5687J6455J7040J7730J8647J9662K0704K1844
53511G18066K3061K4115K4781K5064K5158K5276K5484K5735K5974K6194K6270
53500I95178K5919K5022K3877K2894K2114K1301K0461J9909J9743J9669J9439
53489A235526J9151J8932J8663J8253J7912J7891J8103J8170J7788J6913J5767
$$ plain form
53478 1433069 1447758 1461520 1474124 1484856 1493111 1498931 1502727 1504603 1504205 1501135 1495177 1486262 1474677
53465 1474677 1461286 1447033 1432102 1415999 1398582 1380501 1362376 1344013 1324820 1304597 1283495
53454 1283495 1261585 1239014 1216316 1193982 1171849 1149480 1127122 1105703 1085836 1067387 1050095
53443 1050095 1034019 1019165 1005329 992701 982125 974230 968597 964281 960881 958585 957418 957101 957641
53430 957641 959487 962913 967738 973833 981474 990894 1001782 1013561 1026052 1039605 1054652 1071323 1089531
53417 1089531 1109312 1130985 1154921 1181088 1208967 1238067 1268399 1300279 1333776 1368679 1405002
53406 1405002 1443139 1483435 1525905 1570443 1616973 1665255 1714923 1765962 1818759 1873389 1929182
53395 1929182 1985372 2041942 2099332 2157384 2215095 2271528 2326685 2381346 2436200 2491169 2545360
$$ packed form
53478A433069J4689J3762J2604J0732Q255N820L796J876l98l070n958q915j1585
53465A474677j3391j4253j4931j6103j7417j8081j8125j8363j9193k0223k1102
53454A283495k1910k2571k2698k2334k2133k2369k2358k1419j9867j8449j7292
53443A050095j6076j4854j3836j2628j0576p895n633m316l400k296j167l17N40
53430I57641J846L426M825O095P641R420J0888J1779J2491J3553J5047J6671J8208
53417A089531J9781K1673K3936K6167K7879K9100L0332L1880L3497L4903L6323
53406A405002L8137M0296M2470M4538M6530M8282M9668N1039N2797N4630N5793
53395A929182N6190N6570N7390N8052N7711N6433N5157N4661N4854N4969N4191
$$ plain form
53384 2545360 2597632 2647217 2693800 2737008 2776199 2811007 2841789 2869084 2892658 2911497 2924722
53373 2924722 2932116 2933785 2929795 2920311 2905614 2885640 2859805 2827609 2789270 2745528 2697065 2644459
53361 2644459 2588558 2530456 2470994 2410566 2349541 2288732 2229273 2172040 2117267 2064646 2013728
53350 2013728 1964217 1916002 1869075 1823551 1779656 1737535 1696968 1657341 1617991 1578655 1539733
53339 1539733 1502186 1467097 1435088 1406027 1379350 1354687 1332080 1311609 1293051 1276048 1260482
53328 1260482 1246436 1233733 1221759 1209894 1198020 1186406 1175075 1163566 1151533 1139415 1128284
53317 1128284 1118995 1111672 1105947 1101330 1097366 1093950 1091784 1092126 1095561 1101218 1107668 1114546 1122775 1133165
53303 1133165 1145303 1158124 1171241 1185422 1201894 1221290 1243128 1266228 1289823 1314279 1340489
$$ packed form
53384B545360N2272M9585M6583M3208L9191L4808L0782K7295K3574J8839J3225
53373B924722P394J669l990r484j4697j9974k5835l2196l8339m3742m8463n2606
53361B644459n5901n8102n9462o0428o1025o0809n9459n7233n4773n2621n0918
53350B013728m9511m8215m6927m5524m3895m2121m0567l9627l9350l9336l8922
53339A539733l7547l5089l2009k9061k6677k4663k2607k0471j8558j7003j5566
53328A260482j4046j2703j1974j1865j1874j1614j1331j1509j2033j2118j1131
53317A128284r289p323n725m617l964l416k166L42L435N657O450O878Q229J0390
53303A133165J2138J2821J3117J4181J6472J9396K1838K3100K3595K4456K6210
$$ plain form
53292 1340489 1368551 1397421 1425993 1454084 1482023 1509691 1536476 1561951 1585997 1608191 1627591
53281 1627591 1643402 1655663 1665080 1672284 1677276 1679440 1678038 1672833 1664270 1652989 1639195 1622757 1603885
53268 1603885 1583306 1561593 1538581 1513749 1487024 1458931 1430047 1400580 1370458 1339539 1307723
53257 1307723 1275180 1242566 1210770 1180252 1150737 1121714 1093025 1064822 1037110 1009663 982357
53246 982357 955365 929007 903570 879255 856064 833667 811545 789314 766927 744693 723296
53235 723296 703678 686548 671836 658795 646650 635087 624239 614472 606123 598997 592050 583989
53223 583989 574385 563890 553207 542249 530514 517890 504703 491318 478077 465355 453258 441488
53211 441488 429901 418977 409231 400308 391234 381567 371878 363086 355635 349262 343161 336498 329214 322243
$$ packed form
53292A340489K8062K8870K8572K8091K7939K7668K6785K5475K4046K2194J9400
53281A627591J5811J2261R417P204M992K164j402n205q563j1281j3794j6438j8872
53268A603885k0579k1713k3012k4832k6725k8093k8884k9467l0122l0919l1816
53257A307723l2543l2614l1796l0518k9515k9023k8689k8203k7712k7447k7306
53246I82357k6992k6358k5437k4315k3191k2397k2122k2231k2387k2234k1397
53235G23296j9618j7130j4712j3041j2145j1563j0848r767q349p126o947q061
53223E83989r604j0495j0683j0958j1735j2624j3187j3385j3241j2722j2097j1770
53211D41488j1587j0924r746q923r074r667r689q792p451o373o101o663p284o971
$$ plain form
53197 322243 316475 311593 306495 300792 295189 290305 285896 281499 277122 272812 268250 263422 259215 256601
53183 256601 255384 254372 252734 250658 248675 246896 245081 243164 241512 240728 241145 242307 243033 242266 239985
53168 239985 237182 234943 233625 232841 232024 230937 229726 228597 227515 226305 225017 223996 223537 223569 223772 223884
53152 223884 223869 223885 224149 224693 225197 225244 224721 223851 222844 221780 220859 220395 220479 220890 221416 221967 222296 222114 221735
53133 221735 222169 224074 226837 229089 230053 230059 229879 229945 230191 230322 230125 229706 229439 229616 230230 231104 231985 232456 232093
53114 232093 231015 230018 229875 230712 232239 234185 236089 237060 236484 234917 233687 233481 233702 233324 231968 230049
53098 230049 228263 227098 226552 226077 224925 222720 219746 216783 214762 214288 215164 216431 217164 217181 216809 216212
53082 216212 215435 214912 215316 216774 218668 220295 221321 221532 220746 219197 217569 216252 214909 213166 211449
$$ packed form
53197C22243n768m882n098n703n603m884m409m397m377m310m562m828m207k614
53183B56601j217j012j638k076j983j779j815j917j652p84M17J162P26p67k281
53168B39985k803k239j318p84q17j087j211j129j082j210j288j021m59L2K03J12
53152B23884j5J6K64N44N04M7n23q70j007j064r21m64Q4M11N26N51L29j82l79
53133B21735M34J905K763K252R64Oj80O6K46J31j97m19k67J77O14Q74Q81M71l63
53114B32093j078r97j43Q37J527J946J904R71n76j567j230k06K21l78j356j919
53098B30049j786j165n46m75j152k205k974k963k021m74Q76J267P33J7l72n97
53082B16212p77n23M04J458J894J627J026K11p86j549j628j317j343j743j717
$$ plain form
53067 211449 210734 211516 213320 215171 216306 216494 215960 215171 214574 214390 214486 214432 213873 213019 212571 212936 213655 213988
53049 213988 213907 214042 214672 215338 215611 215701 215970 216269 216120 215308 213974 212378 210855 209759 209148 208739 208445 208647
53031 208647 209612 210911 211847 212255 212469 212659 212639 212264 211572 210591 209438 208614 208698 209648 210830 211850 212970 214524
53013 214524 216318 217900 219122 220108 220852 221198 221184 221136 221327 221649 221682 221118 220141 219378 219352 219991 220732 221108 221124
52994 221124 221132 221506 222401 223615 224666 225252 225671 226478 227674 228526 228414 227570 226787 226608 227091 228119 229545 231126
52976 231126 232664 234254 236101 238117 239957 241458 242752 243915 244815 245383 245765 246087 246333 246554 246925 247479
52960 247479 248086 248846 250115 251851 253259 253477 252437 250685 248546 246034 243456 241416 240000 238442 236028
52945 236028 233023 230355 228523 227210 225946 224761 224019 223832 223876 223785 223492 223085 222488 221558 220514 219929 220099
$$ packed form
53067B11449p15P82J804J851J135J88n34p89n97j84R6n4n59q54m48L65P19L33
53049B13988q1J35O30O66K73R0K69K99j49q12j334j596j523j096o11m09k94K02
53031B08647R65J299R36M08K14J90k0l75o92r81j153q24Q4R50J182J020J120J554
53013B14524J794J582J222R86P44L46j4m8J91L22L3n64r77p63k6O39P41L76J6
52994B21124QL74Q95J214J051N86M19Q07J196Q52j12q44p83j79M83J028J426J581
52976B31126J538J590J847K016J840J501J294J163R00N68L82L22K46K21L71N54
52960B47479O07P60J269J736J408K18j040j752k139k512k578k040j416j558k414
52945B36028l005k668j832j313j264j185p42j87M4r1k93m07n97r30j044n85J70
$$ plain form
52928 220099 220620 220880 220820 220811 220861 220400 219026 217134 215592 214936 215050 215459 215774 215975 216363 217140 218023 218442 218152
52909 218152 217379 216349 214990 213278 211588 210455 210134 210519 211263 211856 211917 211663 211861 213043 214920 216747
52893 216747 218001 218491 218173 217309 216573 216537 217073 217573 217686 217529 217374 217487 218105 219089 219662 219037 217343 215564
52875 215564 214535 214380 214873 215767 216659 217053 216919 216865 217452 218585 219788 220828 221795 222729 223449 223723 223505 223047
52857 223047 222827 223222 224142 225102 225652 225687 225344 224817 224268 223709 222896 221520 219529 217181 214821 212770 211295
52840 211295 210392 209622 208482 206947 205384 203982 202636 201393 200597 200432 200642 200842 200805 200408 199697 199083 199082 199644
52822 199644 200155 200273 200346 200749 201208 201188 200627 199917 199393 199260 199824 201357 203656 206036 207834 208881 209538 210293
52804 210293 211194 211698 211325 210341 209372 208378 206673 204181 201989 201130 201366 201682 201553 201094 200376 199392 198501 198102
$$ packed form
52928B20099N21K60o0rN0m61j374j892j542o56J14M09L15K01L88P77Q83M19k90
52909B18152p73j030j359j712j690j133l21L85P44N93O1k54J98J182J877J827
52893B16747J254M90l18q64p36l6N36N00J13j57j55J13O18R84N73o25j694j779
52875B15564j029j55M93Q94Q92L94j34n4N87J133J203J040R67R34P20K74k18m58
52857B23047k20L95R20R60N50L5l43n27n49n59q13j376j991k348k360k051j475
52840B11295r03p70j140j535j563j402j346j243p96j65K10K00l7l97p11o14jN62
52822A99644N11J18P3M03M59k0n61p10n24j33N64J533K299K380J798J047O57P55
52804B10293R01N04l73r84r69r94j705k492k192q59K36L16j29m59p18r84q91l99
$$ plain form
52786 198102 197899 197222 196142 195530 195835 196505 196906 197225 198001 199229 200442 201405 202235 202986 203591 204173 204979 205826
52768 205826 205947 204732 202528 200477 199452 199386 199696 200094 200605 201027 200936 200357 199897 199964 200270 200440 200652 201210
52750 201210 201800 201843 201397 201125 201378 201876 202370 203097 204368 206084 207881 209544 211138 212873 214883 217063
52734 217063 219205 221379 223868 226524 228577 229591 230219 231343 232716 233287 232792 232073 231637 230864 229065 226531
52718 226531 224023 221871 220172 219269 219277 219493 218982 217618 216088 215073 214889 215573 216728 217464 217092 215827 214362
52701 214362 212942 211370 209759 208632 208289 208653 209698 211413 213255 214358 214465 214168 213985 213744 213191 212684
52685 212684 212845 213796 215134 216419 217378 217876 218077 218460 219315 220306 220858 220877 220756 220749 220727 220587 220504 220669 220979 221145
52665 221145 220931 220185 218879 217290 215990 215389 215405 215755 216504 218022 220353 222907 224972 226384 227511 228689
$$ packed form
52786A98102k03o77j080o12L05O70M01L19P76J228J213R63Q30P51O05N82Q06Q47
52768B05826J21j215k204k051j025o6L10L98N11M22r1n79m60O7L06J70K12N58
52750B01210N90M3m46k72K53M98M94P27J271J716J797J663J594J735K010K180
52734B17063K142K174K489K656K053J014O28J124J373N71m95p19m36p73j799k534
52718B26531k508k152j699r03QK16n11j364j530j015j84O84J155P36l72j265j465
52701B14362j420j572j611j127l43L64J045J715J842J103J07k97j83k41n53n07
52685B12684J61R51J338J285R59M98K01L83Q55R91N52J9j21pk2j40q3J65L10J66
52665B21145k14p46j306j589j300o01J6L50P49J518K331K554K065J412J127J178
$$ plain form
52649 228689 229892 230900 231587 231963 232067 231876 231297 230290 229061 227982 227171 226303 225143 224097 223811 224231
52633 224231 224634 224751 225258 226757 228735 230051 230218 229671 229038 228749 229189 230466 231914 232509 232045 231388 231270
52616 231270 231384 231001 230021 228873 227748 226498 225193 224320 224397 225623 227757 230044 231430 231361 230408 229719 229853
52599 229853 230437 230928 231218 231386 231363 231190 231219 231620 231798 230852 228678 226334 225088 225247 226093 226831 227377 228197
52581 228197 229638 231581 233614 235283 236256 236548 236687 237370 238734 240110 240698 240304 239255 237835 236263 235139
52565 235139 235336 237111 239546 241147 241031 239488 237532 236044 235260 234891 234610 234366 234254 234243 234162 233885 233387
52548 233387 232676 231897 231369 231218 230960 229772 227384 224485 222092 220687 220114 220078 220470 221242 222224 223176 223926
52531 223926 224477 224993 225693 226738 228176 229891 231525 232572 232828 232679 232696 232931 232963 232653 232466 232887 233861 235095
$$ packed form
52649B28689J203J008O87L76J04j91n79j007j229j079q11q68j160j046k86M20
52633B24231M03J17N07J499J978J316J67n47o33k89M40J277J448N95m64o57j18
52616B31270J14l83r80j148j125j250j305q73P7J226K134K287J386o9r53o89J34
52599B29853N84M91K90J68k3j73K9M01J78r46k174k344j246J59Q46P38N46Q20
52581B28197J441J943K033J669R73K92J39O83J364J376N88l94j049j420j572j124
52565B35139J97J775K435J601j16j543j956j488p84l69k81k44j12j1q1k77m98
52548B33387p11p79n28j51k58j188k388k899k393j405n73l6L92P72R82R52P50
52531B23926N51N16P00J045J438J715J634J047K56j49J7K35L2l10j87M21R74J234
$$ plain form
52513 235095 236555 238336 240272 242069 243689 245235 246618 247709 248793 250424 252754 255250 257151 257983
52499 257983 257626 256234 254235 252122 250000 247468 244191 240573 237618 236026 235553 235389 235087 234817 234754 234625
52483 234625 234230 234063 234853 236534 238252 239418 240213 240956 241646 242385 243575 245210 246565 247124 247310 247751 248375
52466 248375 248902 249716 251328 253358 255060 256601 258728 261204 262788 262987 262741 262921 263110 262435 260861 258991
52450 258991 257153 255277 253282 251092 248643 246241 244476 243425 242389 240800 238982 237666 237175 237408 238112
52435 238112 238723 238521 237406 236121 235268 234654 234024 233741 234058 234378 234095 233700 234108 235279 236493 237728 239679
52418 239679 242397 244959 246680 247873 249168 250820 252935 255778 259549 264274 269968 276455 283054 289043
52404 289043 294524 300217 306332 312264 317479 321975 325611 327608 327132 323990 318620 311865 304892 298615
$$ packed form
52513B35095J460J781J936J797J620J546J383J091J084J631K330K496J901Q32
52499B57983l57j392j999k113k122k532l277l618k955j592m73j64l02k70o3j29
52483B34625l95j67P90J681J718J166P95P43O90P39J190J635J355N59J86M41O24
52466B48375N27Q14J612K030J702J541K127K476J584J99k46J80J89o75j574j870
52450B58991j838j876j995k190k449k402j765j051j036j589j818j316m91K33P04
52435B38112O11k02j115j285q53o14o30k83L17L20k83l95M08J171J214J235J951
52418B39679K718K562J721J193J295J652K115K843L771M725N694O487O599N989
52404B89043N481N693O115N932N215M496L636J997m76l142n370o755o973o277
$$ plain form
52390 298615 292985 287348 281757 277297 274821 274002 273973 274259 274575 274450 273800 273451 274332 276365 278705 280823
52374 280823 282784 284720 286739 289264 292806 297323 302251 307150 311869 316138 319610 322392 325010 327659
52360 327659 329890 331230 331747 331767 331360 330480 329397 328618 328409 328685 329409 330811 333053 335796 338426 340720
52344 340720 343091 345983 349253 352441 355582 359389 364483 370680 377242 383768 390674 398838 408832 420376
52330 420376 432566 444702 456968 470168 484862 500987 518309 536872 556742 577556 598623
52319 598623 619503 640280 661253 682448 703450 723745 743192 762055 780464 798069 814484
52308 814484 829889 844777 859116 872274 883941 894657 905147 915472 925145 933822 941500 948108
52296 948108 953232 956329 957223 956435 954897 952980 949901 944566 937082 928856 921004 913297 905136 896912 889670
$$ packed form
52390B98615n630n637n591m460k476q19k9K86L16j25o50l49Q81K033K340K118
52374B80823J961J936K019K525L542M517M928M899M719M269L472K782K618K649
52360C27659K231J340N17K0m07q80j083p79k09K76P24J402K242K743K630K294
52344C40720K371K892L270L188L141L807N094O197O562O526O906Q164R994J1544
52330D20376J2190J2136J2266J3200J4694J6125J7322J8563J9870K0814K1067
52319E98623K0880K0777K0973K1195K1002K0295J9447J8863J8409J7605J6415
52308H14484J5405J4888J4339J3158J1667J0716J0490J0325R673Q677P678O608
52296I48108N124L097Q94p88j538j917l079n335p484q226p852p707q161q224p242
$$ plain form
52281 889670 883809 878937 874947 872493 872305 874617 879409 886616 895847 906240 916906 927467 938148
52268 938148 949509 962052 975772 990089 1004418 1018711 1033128 1047376 1060830 1073331 1085311
52257 1085311 1096986 1107893 1117467 1125681 1132877 1139275 1144955 1150035 1154518 1158119 1160431 1161154 1159966 1156493
52243 1156493 1150663 1142974 1134108 1124381 1113780 1102340 1090168 1077245 1063690 1050188 1037756 1026880
52231 1026880 1017214 1008274 1000156 993316 987905 983679 980408 977999 976225 974746 973533 972981 973415 974695
52217 974695 976545 979055 982513 986853 991529 996023 1000248 1004464 1009035 1014299 1020378 1026930 1033285 1039028
52203 1039028 1044399 1049936 1055782 1061497 1066581 1071004 1075134 1079265 1083425 1087644 1092138 1096928 1101466 1105067
52189 1105067 1107755 1110242 1112882 1115092 1116172 1116236 1115834 1114980 1113202 1110390 1106849 1102537 1096998 1090194 1082726
$$ packed form
52281H89670n861m872l990k454j88K312M792P207R231J0393J0666J0561J0681
52268I38148J1361J2543J3720J4317J4329J4293J4417J4248J3454J2501J1980
52257A085311J1675J0907R574Q214P196O398N680N080M483L601K312P23j188l473
52243A156493n830p689q866r727j0601j1440j2172j2923j3555j3502j2432j0876
52231A026880r666q940q118o840n411m226l271k409j774j479j213n52M34J280
52217I74695J850K510L458M340M676M494M225M216M571N264O079O552O355N743
52203A039028N371N537N846N715N084M423M130M131M160M219M494M790M538L601
52189A105067K688K487K640K210J080O4m02q54j778k812l541m312n539o804p468
$$ plain form
52174 1082726 1075021 1066948 1058576 1050657 1043864 1038028 1032663 1027858 1024147 1021771 1020521 1020108 1020309 1020952 1022088
52159 1022088 1023942 1026388 1028816 1030871 1032993 1035722 1038805 1041448 1043186 1043967 1043704 1042378 1040492 1038802
52145 1038802 1037598 1036715 1036155 1036201 1036942 1038140 1039582 1041178 1042832 1044613 1046904 1049906 1053252 1056728 1061194
52130 1061194 1068000 1077536 1089078 1102170 1117358 1135318 1155920 1178564 1202868 1228650 1255606 1283369
52118 1283369 1311631 1340023 1368183 1396050 1423720 1450885 1476838 1501085 1523447 1543383 1559819
52107 1559819 1572091 1580675 1586646 1590752 1593235 1594119 1593262 1590458 1585942 1580567 1575183 1569917 1564257 1557578
52093 1557578 1549502 1540095 1529920 1519528 1508647 1496330 1482244 1467388 1453144 1439931 1427256 1414801
52081 1414801 1403020 1392846 1385243 1380853 1379659 1381085 1384697 1390646 1399143 1409809 1421929 1435108 1449262
$$ packed form
52174A082726p705q073q372p919o793n836n365m805l711k376j250m13K01O43J136
52159A022088J854K446K428K055K122K729L083K643J738P81k63j326j886j690
52145A038802j204q83n60M6P41J198J442J596J654J781K291L002L346L476M466
52130A061194O806R536J1542J3092J5188J7960K0602K2644K4304K5782K6956K7763
52118A283369K8262K8392K8160K7867K7670K7165K5953K4247K2362J9936J6436
52107A559819J2272Q584N971M106K483Q84q57k804m516n375n384n266n660o679
52093A557578q076r407j0175j0392j0881j2317j4086j4856j4244j3213j2675j2455
52081A414801j1781j0174p603m390j194J426L612N949Q497J0666J2120J3179J4154
$$ plain form
52068 1449262 1464202 1479739 1495972 1512896 1529821 1545704 1560109 1573379 1585881 1597535 1608108
52057 1608108 1617383 1624895 1630003 1632512 1632912 1631737 1628997 1624442 1618077 1610013 1599973 1587368 1572048
52044 1572048 1554694 1536254 1517026 1496483 1474154 1450507 1426741 1403764 1381695 1360408 1340119
52033 1340119 1321150 1303445 1286760 1271125 1256725 1243444 1231000 1219511 1209431 1200773 1192848 1184961
52021 1184961 1177029 1169230 1161332 1152795 1143409 1133483 1123427 1113414 1103493 1093691 1083758 1073038 1060912
52008 1060912 1047368 1032935 1018006 1002469 986047 968683 950426 931230 911284 891332 872190
51997 872190 853918 835890 817723 799755 782522 766223 750884 736660 723659 711829 701224
51986 701224 692044 684069 676415 668213 659254 649706 639559 628854 618117 607949 598271 588538 578595
$$ packed form
52068A449262J4940J5537J6233J6924J6925J5883J4405J3270J2502J1654J0573
52057A608108R275P512N108K509M00j175k740m555o365q064j0040j2605j5320
52044A572048j7354j8440j9228k0543k2329k3647k3766k2977k2069k1287k0289
52033A340119j8969j7705j6685j5635j4400j3281j2444j1489j0080q658p925p887
52021A184961p932p799p898q537r386r926j0056j0013r921r802r933j0720j2126
52008A060912j3544j4433j4929j5537j6422j7364j8257j9196j9946j9952j9142
51997H72190j8272j8028j8167j7968j7233j6299j5339j4224j3001j1830j0605
51986G01224r180p975p654q202q959r548j0147j0705j0737j0168r678r733r943
$$ plain form
51973 578595 568844 559579 550667 541937 533473 525562 518764 513995 511872 511933 513040 514681 517243 520821 524609
51958 524609 527929 531191 535071 539126 542079 543379 543705 543822 543568 542231 539389 535121 529888 524659 520853
51943 520853 519508 520463 522711 525607 529398 534545 541000 548467 556984 566670 576939 586482 594303 600511
51929 600511 605888 610812 614694 616250 614201 607980 598134 586058 573152 560138 547113 534001 520849
51916 520849 507883 495547 484378 474622 466135 458848 453181 449733 448738 450087 453716 459496 466755 474394
51902 474394 481721 488940 496684 505194 513970 521908 527656 530144 529164 525418 519862 512976 504641 494584
51888 494584 482829 469851 456427 443401 431472 421132 412666 406159 401533 398635 397263 397143 398057
51875 398057 399996 403020 406922 411344 416372 422521 429670 436342 440762 442654 443385 444207 444919 444536 442713
$$ packed form
51973E78595r751r265q912q730q464p911o798m769k123O1J107J641K562L578L788
51958E24609L320L262L880M055K953J300L26J17k54j337k842m268n233n229l806
51943E20853j345R55K248K896L791N147O455P467Q517R686J0269R543P821O208
51929F00511N377M924L882J556k049o221r846j2076j2906j3014j3025j3112j3152
51916E20849j2966j2336j1169r756q487p287n667l448r95J349L629N780P259P639
51902D74394P327P219P744Q510Q776P938N748K488r80l746n556o886q335j0057
51888D94584j1755j2978j3424j3026j1929j0340q466o507m626k898j372j20R14
51875C98057J939L024L902M422N028O149P149O672M420J892P31Q22P12l83j823
$$ plain form
51860 442713 439937 436650 432850 428680 424911 422479 421639 421865 422536 423547 425082 427022 428990 430937 433165
51845 433165 435447 436653 435824 433325 430259 426907 422560 416955 411006 405718 401118 396862 393259 390926
51831 390926 389692 388674 387420 386375 386090 386534 387315 388143 388818 389089 388808 388088 387098 385782 383920 381405
51815 381405 378444 375585 373522 372680 372806 373038 372625 371657 370993 371406 372815 374507 376031 377610 379542 381459
51799 381459 382544 382357 381068 378929 376077 372976 370492 369035 367973 366418 364362 362472 360923 359074
51785 359074 356496 353738 351750 350830 350498 350179 349710 349308 349350 350147 351626 353154 353929 353709 353094 353000 353914 355735
51767 355735 358259 361583 365927 371265 377339 384025 391399 399284 406901 413205 417622 420380 422154 423407
51753 423407 424020 423361 420729 415874 409243 401750 394323 387632 382088 377934 375229 373777 373136 372774 372378
$$ packed form
51860D42713k776l287l800m170l769k432q40K26O71J011J535J940J968J947K228
51845D33165K282J206q29k499l066l352m347n605n949n288m600m256l603k333
51831C90926j234j018j254j045k85M44P81Q28O75K71k81p20r90j316j862k515
51815C81405k961k859k063q42J26K32m13r68o64M13J409J692J524J579J932J917
51799C81459J085j87j289k139k852l101k484j457j062j555k056j890j549j849
51785C59074k578k758j988r20l32l19m69m02M2P97J479J528P75k20o15r4R14J821
51767C55735K524L324M344N338O074O686P374P885P617O304M417K758J774J253
51753D23407O13o59k632m855o631p493p427o691n544m154k705j452o41l62l96
$$ plain form
51738 372378 372106 372497 374082 377085 381471 387143 393903 401296 408727 415825 422586 429000 434556 438342 439808
51723 439808 439453 438576 438236 438530 438870 438684 437563 434995 430594 424858 419190 414728 411295 407905 404143 400592
51707 400592 397868 395699 393195 389871 386214 383376 382364 383382 385817 388905 392394 396376 400514 403785
51693 403785 405256 404931 403598 401960 400220 398456 397014 396297 396241 396142 395044 392361 388240 383372 378460 373877
51677 373877 369918 367134 366084 366691 368201 370083 372713 376793 382157 387688 392558 397183 402605 409186
51663 409186 416237 422795 428282 432452 435194 436670 437294 437192 435922 433066 429013 424802 421254 418616 417043
51648 417043 416916 418367 420804 423286 425236 426452 426521 424682 420471 414280 407071 399708 392633 385998 379813
51633 379813 373968 368331 362908 357870 353443 349866 347378 346084 345776 346012 346483 347266 348633 350579 352494
$$ packed form
51738C72378k72L91J585L003M386N672O760P393P431P098O761O414N556L786J466
51723D39808l55q77l40K94L40j86j121k568m401n736n668m462l433l390l762l551
51707D00592k724k169k504l324l657k838j012J018K435L088L489L982M138L271
51693D03785J471l25j333j638j740j764j442p17n6r9j098k683m121m868m912m583
51677C73877l959k784j050O07J510J882K630M080N364N531M870M625N422O581
51663D09186P051O558N487M170K742J476O24j02j270k856m053m211l548k638j573
51648D17043j27J451K437K482J950J216O9j839m211o191p209p363p075o635o185
51633C79813n845n637n423n038m427l577k488j294l08K36M71P83J367J946J915
$$ plain form
51618 352494 353397 352674 350702 348643 347472 347243 347396 347498 347416 347000 346104 344949 343986 343285 342543 341907 342224 344055
51600 344055 346910 350011 353450 357861 363151 368408 373192 378127 383880 390192 396386 402226 407611 411715
51586 411715 413265 411792 408124 403562 398966 394809 391607 389875 389782 391213 394205 399066 405952 414565 424494
51571 424494 435797 448987 464294 481082 498173 514727 530776 547015 564250 582920 602855
51560 602855 623440 644192 665244 687126 710090 733963 758628 784263 810722 836792 860255
51549 860255 878677 890156 893705 889369 878025 860856 838846 812716 783115 750742 716475 681635
51537 681635 647972 616988 589182 564176 541569 521441 504000 489108 476355 465322 455514 446252
51525 446252 437018 427945 419700 412757 406966 401897 397406 393628 390500 387557 384271 380530 376785 373792
$$ packed form
51618C52494R03p23j972k059j171k29J53J02q2m16q96j155r63p01p42o36L17J831
51600C44055K855L101L439M411N290N257M784M935N753O312O194N840N385M104
51586D11715J550j473l668m562m596m157l202j732r3J431K992M861O886Q613R929
51571D24494J1303J3190J5307J6788J7091J6554J6049J6239J7235J8670J9935
51560F02855K0585K0752K1052K1882K2964K3873K4665K5635K6459K6070K3463
51549H60255J8422J1479L549m336j1344j7169k2010k6130k9601l2373l4267l4840
51537F81635l3663l0984k7806k5006k2607k0128j7441j4892j2753j1033r808r262
51525D46252r234r073q245o943n791n069m491l778l128k943l286l741l745k993
$$ plain form
51511 373792 372169 371985 372682 373497 374045 374472 375098 376119 377667 379806 382272 384421 385774 386454 386801 386692
51495 386692 385671 383752 381689 380247 379487 378885 377951 376548 374823 373028 371319 369585 367599 365377 363224
51480 363224 361312 359400 357112 354329 351156 347657 343844 339833 335816 331924 328254 325023 322485 320618
51466 320618 318964 316901 314136 310955 307971 305636 304101 303464 303809 304791 305578 305680 305663 306522 308438 310789
51450 310789 313404 316983 321928 327457 332574 337524 343560 351412 360624 370369 380340 390650 401245 411715
51436 411715 421463 429878 436394 440478 441713 440097 436297 431381 426099 420626 415068 409833 405151 400512
51422 400512 394983 388046 379893 371220 363100 356808 353113 351637 351240 351084 351087 351520 352645 354722 357845 361584
51406 361584 365101 367823 369845 371662 373690 376105 378884 381915 385106 388305 391117 393152 394758 397118
$$ packed form
51511C73792j623j84O97Q15N48M27O26J021J548K139K466K149J353O80L47j09
51495C86692j021j919k063j442p60o02r34j403j725j795j709j734j986k222k153
51480C63224j912j912k288k783l173l499l813m011m017l892l670l231k538j867
51466C20618j654k063k765l181k984k335j535o37L45R82P87J02j7Q59J916K351
51450C10789K615L579M945N529N117M950O036P852R212R745R971J0310J0595J0470
51436D11715R748Q415O516M084J235j616l800m916n282n473n558n235m682m639
51422D00512n529o937q153q673q120o292l695j476l97j56LM33J125K077L123L739
51406C61584L517K722K022J817K028K415K779L031L191L199K812K035J606K360
$$ plain form
51392 397118 401110 406347 411881 417618 424287 432162 440761 450028 461037 475063 492552 513393 537651
51379 537651 565462 596584 630559 667145 706141 746931 788520 829865 869902 907336 940647
51368 940647 968175 988160 999037 1000032 991366 973783 948159 915728 878243 837500 794789 750991
51356 750991 706955 663591 621884 583032 548186 517739 491184 467991 448241 432018 418644
51345 418644 407112 397050 388633 381676 375472 369580 364196 359673 356086 353329 351161 349033 346316 342952
51331 342952 339596 336964 335205 333868 332260 329880 326872 324065 322160 320893 319429 317595 316150 315650
51317 315650 315635 315388 314990 315020 315483 315689 315238 314579 314448 315160 316602 318587 320884 323120 325018 326717 328584
51300 328584 330636 332356 333251 333429 333480 333867 334634 335608 336551 337039 336529 334876 332646 330685 329391 328634 328247
$$ packed form
51392C97118L992N237N534N737O669P875Q599R267J1009J4026J7489K0841K4258
51379E37651K7811L1122L3975L6586L8996M0790M1589M1345M0037L7434L3311
51368I40647K7528J9985J0877R95q666j7583k5624l2431l7485m0743m2711m3798
51356G50991m4036m3364m1707l8852l4846l0447k6555k3193j9750j6223j3374
51345D18644j1532j0062q417o957o204n892n384m523l587k757k168k128k717l364
51331C42952l356k632j759j337j608k380l008k807j905j267j464j834j445n00
51317C15650j5k47l98L0M63K06m51o59j31P12J442J985K297K236J898J699J867
51300C28584K052J720Q95J78N1L87P67R74R43M88n10j653k230j961j294p57l87
$$ plain form
51283 328247 328307 328879 329806 330925 332273 333958 335939 338126 340595 343514 346771 349858 352271 353986 355390
51268 355390 356671 357481 357405 356683 356103 356170 356684 357278 357935 358620 358810 357955 356283 354496 352685 350207 346931
51251 346931 343943 342464 342367 342316 341245 339189 336800 334632 333066 332352 332323 332301 331735 330823 330203 330089 330054 329665
51233 329665 328974 328237 327458 326489 325381 324345 323451 322619 321833 321117 320319 319252 318064 317183 316790 316675 316696 317092
51215 317092 318083 319450 320771 321889 322899 323888 324954 326345 328239 330493 332882 335508 338616 342092 345500
51200 345500 348604 351453 353947 355722 356669 357246 358038 359152 360152 360452 359676 357875 355593 353598 352400
51185 352400 351999 351993 351775 350759 348791 346468 344695 343780 343261 342726 342393 342529 342695 342100 340661 339223 338608
51168 338608 338782 339122 339288 339611 340674 342679 345291 348084 350970 354045 357106 359618 361284 362401 363394
$$ packed form
51283C28247O0N72R27J119J348J685J981K187K469K919L257L087K413J715J404
51268C55390J281Q10p6p22n80O7N14N94O57O85J90q55j672j787j811k478l276
51251C46931k988j479r7n1j071k056k389k168j566p14k9k2n66r12o20j14l5l89
51233C29665o91p37p79r69j108j036q94q32p86p16p98j067j188q81l93j15K1L96
51215C17092R91J367J321J118J010R89J066J391J894K254K389K626L108L476L408
51200C45500L104K849K494J775R47N77P92J114J000L00p76j801k282j995j198
51185C52400m01ok18j016j968k323j773r15n19n35l33J36J66n95j439j438o15
51168C38608J74L40J66L23J063K005K612K793K886L075L061K512J666J117R93
$$ plain form
51153 363394 364147 364060 362752 360534 358165 356260 354928 353848 352667 351363 350166 349167 348223 347320 346729 346605
51137 346605 346658 346549 346409 346569 346922 346950 346419 345574 344585 343245 341459 339720 338780 338961 339959 341204 342269 343106
51119 343106 344010 345302 346973 348819 350865 353352 356218 358953 361232 363345 365767 368598 371714 375119
51105 375119 378671 381803 384114 386113 388667 391668 393983 394929 395139 395550 396089 395954 394880 393496 392546 392228
51089 392228 392299 392382 392164 391656 391279 391404 391802 391914 391644 391521 391915 392561 393013 393238 393431 393536 393369 393100 393264
51070 393264 394255 396058 398532 401747 405953 411326 417813 425187 433233 441938 451467 461905 473036 484499
51056 484499 496141 508132 520627 533336 545451 556087 564924 572492 579825 587858 597104 607623
51044 607623 618928 629886 639124 645872 650315 652925 653577 651529 646223 637869 627338 615759 604134
$$ packed form
51153C63394P53q7j308k218k369j905j332j080j181j304j197r99r44r03n91j24
51137C46605N3j09j40J60L53K8n31q45r89j340j786j739r40J81R98J245J065Q37
51119C43106R04J292J671J846K046K487K866K735K279K113K422K831L116L405
51105C75119L552L132K311J999K554L001K315R46K10M11N39j35j074j384r50l18
51089C92228P1Q3k18n08l77J25L98J12k70j23L94O46M52K25J93J05j67k69J64
51070C93264R91J803K474L215M206N373O487P374Q046Q705R529J0438J1131J1463
51056D84499J1642J1991J2495J2709J2115J0636Q837P568P333Q033R246J0519
51044F07623J1305J0958R238O748M443K610O52k048n306q354j0531j1579j1625
$$ plain form
51031 604134 593001 582153 570810 558227 544242 529362 514501 500635 488522 478516 470620 464686
51019 464686 460585 458250 457674 458863 461707 465922 471120 476874 482700 488245 493694 499795 507135 515440
51005 515440 523958 532456 541428 551210 561376 571268 580725 589969 599105 608199 617608 627666 638049
50992 638049 647947 656984 665601 674360 683199 691650 699476 706773 713573 719785 725618 731824 739304 748486
50978 748486 759083 770385 781827 793482 806168 820947 838286 857674 878309 900271 924868
50967 924868 953638 987147 1024900 1066271 1111179 1159837 1212184 1267740 1325860 1385998 1447840
50956 1447840 1511189 1575444 1639143 1700341 1757680 1810834 1859738 1903801 1942337 1975422 2003673
50945 2003673 2027276 2045880 2059538 2069056 2075207 2078269 2078784 2078185 2077911 2077975 2076950 2073347 2066594 2056747
$$ packed form
51031F04134j1133j0848j1343j2583j3985j4880j4861j3866j2113j0006p896n934
51019D64686m101k335n76J189K844M215N198N754N826N545N449O101P340Q305
51005E15440Q518Q498Q972R782J0166R892R457R244R136R094R409J0058J0383
50992F38049R898R037Q617Q759Q839Q451P826P297O800O212N833O206P480R182
50978G48486J0597J1302J1442J1655J2686J4779J7339J9388K0635K1962K4597
50967I24868K8770L3509L7753M1371M4908M8658N2347N5556N8120O0138O1842
50956A447840O3349O4255O3699O1198N7339N3154M8904M4063L8536L3085K8251
50945B003673K3603J8604J3658R518O151L062N15n99k74O4j025l603o753r847
$$ plain form
50931 2056747 2043826 2027679 2008188 1985331 1959144 1929660 1896751 1860006 1818981 1773655 1724529
50920 1724529 1672244 1617288 1560093 1501303 1441853 1382894 1325618 1270942 1219350 1171093 1126477
50909 1126477 1085703 1048553 1014589 983717 956188 931906 910163 890322 872437 856863 843534
50898 843534 831982 821888 813127 805366 798129 791289 785126 779805 775204 771391 768833 767762 767651 767706
50884 767706 767749 768241 769495 771294 773405 776110 779908 784821 790297 795821 801421 807575 814825 823599 834138
50869 834138 846390 860033 874856 891085 909121 928973 950275 972930 997488 1024708 1055027
50858 1055027 1088669 1126064 1167833 1214472 1266355 1323984 1387937 1458611 1536287 1621436 1714599
50847 1714599 1815839 1924635 2040465 2163238 2292863 2428507 2568466 2710721 2853457
$$ packed form
50931B056747j2921j6147j9491k2857k6187k9484l2909l6745m1025m5326m9126
50920A724529n2285n4956n7195n8790n9450n8959n7276n4676n1592m8257m4616
50909A126477m0774l7150l3964l0872k7529k4282k1743j9841j7885j5574j3329
50898H43534j1552j0094q761p761p237o840o163n321m601l813k558j071j11N5
50884G67706M3M92J254J799K111K705L798M913N476N524N600O154P250Q774J0539
50869H34138J2252J3643J4823J6229J8036J9852K1302K2655K4558K7220L0319
50858A055027L3642L7395M1769M6639N1883N7629O3953P0674P7676Q5149R3163
50847A714599J01240J08796J15830J22773J29625J35644J39959J42255J42736
$$ plain form
50838 2853457 2995012 3133482 3266540 3391703 3506724 3609634 3698492 3771486 3827650 3867419
50828 3867419 3892249 3903753 3903468 3893360 3876056 3854308 3830486 3806716 3785143 3767563 3754750 3746263
50816 3746263 3740859 3736876 3732251 3724403 3710316 3686912 3651538 3602335 3538343 3459418 3366119 3259510
50804 3259510 3140977 3012299 2875928 2734914 2592245 2450416 2311899 2179706 2056779
50795 2056779 1944656 1843232 1752001 1671085 1600845 1540994 1490557 1448520 1414149 1386831 1365819
50784 1365819 1350072 1338291 1329362 1322784 1318297 1314976 1311284 1306271 1300151 1293293 1285244 1275427 1264319
50771 1264319 1253023 1241756 1229566 1215625 1200138 1183801 1166944 1149420 1130986 1111566 1091424
50760 1091424 1071196 1051566 1032906 1015433 999488 985326 972801 961723 952429 945504 941052 938838
$$ packed form
50838B853457J41555J38470J33058J25163J15021J02910Q8858P2994N6164L9769
50828C867419K4830J1504k85j0108j7304k1748k3822k3770k1573j7580j2813q487
50816C746263n404l983m625p848j4087k3404l5374m9203o3992p8925r3299j06609
50804C259510j18533j28678j36371j41014j42669j41829j38517j32193j22927
50795B056779j12123j01424r1231q0916p0240n9851n0437m2037l4371k7318k1012
50784A365819j5747j1781q929o578m487l321l692n013o120o858q049r817j1108
50771A264319j1296j1267j2190j3941j5487j6337j6857j7524j8434j9420k0142
50760A091424k0228j9630j8660j7473j5945j4162j2525j1078r294o925m452k214
$$ plain form
50748 938838 939058 942305 948716 957808 969309 983458 1000374 1019930 1042597 1069637 1101873 1138841
50736 1138841 1179652 1224194 1272905 1325893 1382995 1444310 1509866 1578942 1650448 1723919 1799427
50725 1799427 1876488 1953685 2029525 2103103 2173764 2240626 2302741 2359339 2409602 2452404 2486524
50714 2486524 2511034 2525443 2529677 2524113 2509547 2487241 2459157 2428124 2397316 2369215 2345078 2325379
50702 2325379 2310490 2300731 2295893 2294950 2296253 2297869 2297817 2294200 2285292 2269564 2245672 2212524 2169468
50689 2169468 2116566 2054775 1985879 1912215 1836296 1760457 1686628 1616416 1551392 1493160 1442950
50678 1442950 1401173 1367535 1341575 1322977 1311529 1307117 1309759 1319256 1334648 1354332 1376934 1401842
50666 1401842 1428764 1457090 1485923 1514456 1541955 1567605 1590740 1611254 1629560 1646263 1662020
$$ packed form
50748I38838K20L247O411R092J1501J4149J6916J9556K2667K7040L2236L6968
50736A138841M0811M4542M8711N2988N7102O1315O5556O9076P1506P3471P5508
50725A799427P7061P7197P5840P3578P0661O6862O2115N6598N0263M2802L4120
50714B486524K4510J4409M234n564j4566k2306k8084l1033l0808k8101k4137j9699
50702B325379j4889r759m838r43J303J616n2l617q908j5728k3892l3148m3056
50689B169468n2902o1791o8896p3664p5919p5839p3829p0212o5024n8232n0210
50678A442950m1777l3638k5960j8598j1448m412K642R497J5392J9684K2602K4908
50666A401842K6922K8326K8833K8533K7499K5650K3135K0514J8306J6703J5757
$$ plain form
50655 1662020 1677446 1692796 1707891 1722688 1737801 1754097 1771911 1791153 1812168 1835916 1863047
50644 1863047 1893189 1925601 1960341 1998474 2041069 2088103 2138403 2190525 2243688 2297879 2353178
50633 2353178 2409144 2464825 2519130 2570965 2619058 2661894 2698013 2726449 2747037 2760248 2766493
50622 2766493 2765389 2755809 2736603 2707156 2667421 2618267 2562402 2504544 2449830 2401813 2362055 2331169
50610 2331169 2309354 2295920 2289150 2287133 2288325 2291064 2293052 2291790 2285275 2271999 2250621 2220167 2180424
50597 2180424 2131744 2074601 2009796 1939113 1865260 1790882 1717720 1646778 1578990 1515404 1456717
50586 1456717 1402833 1353114 1307099 1264909 1226965 1193394 1163848 1137822 1115026 1095413 1078951
50575 1078951 1065330 1053860 1043779 1034841 1027566 1022779 1020966 1022134 1025937 1031635 1038237 1045402 1054220
$$ packed form
50655A662020J5426J5350J5095J4797J5113J6296J7814J9242K1015K3748K7131
50644A863047L0142L2412L4740L8133M2595M7034N0300N2122N3163N4191N5299
50633B353178N5966N5681N4305N1835M8093M2836L6119K8436K0588J3211O245
50622B766493j104r580j9206k9447l9735m9154n5865n7858n4714m8017l9758l0886
50610B331169k1815j3434o770k017J192K739J988j262o515j3276k1378l0454l9743
50597B180424m8680n7143o4805p0683p3853p4378p3162p0942o7788o3586n8687
50586A456717n3884m9719m6015m2190l7944l3571k9546k6026k2796j9613j6462
50575A078951j3621j1470j0081q938p275m787j813J168L803N698O602P165Q818
$$ plain form
50562 1054220 1066369 1082229 1100382 1119375 1139444 1161940 1187503 1215532 1245298 1276767 1310086
50551 1310086 1344819 1380058 1415045 1449513 1483649 1517869 1552391 1586894 1620836 1654231 1687935
50540 1687935 1723012 1760108 1799708 1842756 1890623 1944444 2004770 2071876 2146070 2227639 2316675
50529 2316675 2413191 2517211 2628599 2746898 2871567 3002289 3138693 3279676 3423137 3566492
50519 3566492 3707245 3843002 3971165 4089006 4194043 4284118 4357078 4410682 4443070 4453330
50509 4453330 4441572 4408528 4355235 4283068 4194025 4090981 3977680 3858320 3736990 3617462
50499 3617462 3503501 3399134 3308289 3233957 3177700 3139878 3120135 3117461 3129840 3154093 3186272
50488 3186272 3222242 3257874 3288779 3310188 3317407 3306637 3275488 3222960 3149228 3055636 2944835
$$ packed form
50562A054220J2149J5860J8153J8993K0069K2496K5563K8029K9766L1469L3319
50551A310086L4733L5239L4987L4468L4136L4220L4522L4503L3942L3395L3704
50540A687935L5077L7096L9600M3048M7867N3821O0326O7106P4194Q1569Q9036
50529B316675R6516J04020J11388J18299J24669J30722J36404J40983J43461J43355
50519C566492J40753J35757J28163J17841J05037R0075P2960N3604L2388J0260
50509D453330j1758l3044n3293p2167q9043j03044j13301j19360j21330j19528
50499C617462j13961j04367r0845p4332n6257l7822j9743k674J2379K4253L2179
50488C186272L5970L5632L0905K1409P219j0770l1149n2528p3732r3592j10801
$$ plain form
50477 2944835 2820637 2687453 2549626 2411103 2275366 2145260 2022625 1908222 1802287
50468 1802287 1705188 1617391 1538805 1468512 1405386 1348903 1299133 1256048 1219053 1187253 1160032
50457 1160032 1137312 1119323 1106116 1097203 1091626 1088445 1087158 1087650 1089811 1093373 1098137 1104143 1111459
50444 1111459 1119751 1128164 1135795 1142377 1148470 1154874 1161796 1168717 1174980 1180308 1184764 1188594 1192339 1196802
50430 1196802 1202530 1209439 1217278 1226369 1237476 1250952 1266447 1283609 1302763 1324581 1349280 1376428
50418 1376428 1405634 1437293 1472595 1512707 1557910 1607544 1660810 1717530 1778060 1842594 1910713
50407 1910713 1981459 2053718 2126607 2199666 2272468 2343802 2411423 2472949 2526872 2572326 2608163
50396 2608163 2633002 2646269 2648480 2640100 2620596 2589029 2545332 2490655 2426822 2355900 2280107 2201691
$$ packed form
50477B944835j24198j33184j37827j38523j35737j30106j22635j14403j05935
50468A802287r7099q7797p8586p0293o3126n6483m9770m3085l6995l1800k7221
50457A160032k2720j7989j3207q913n577l181j287M92K161L562M764O006P316
50444A111459Q292Q413P631O582O093O404O922O921O263N328M456L830L745M463
50430A196802N728O909P839R091J1107J3476J5495J7162J9154K1818K4699K7148
50418A376428K9206L1659L5302M0112M5203M9634N3266N6720O0530O4534O8119
50407A910713P0746P2259P2889P3059P2802P1334O7621O1526N3923M5454L5837
50396B608163K4839J3267K211q380j9504l1567m3697n4677o3833p0922p5793p8416
$$ plain form
50384 2201691 2122909 2046281 1974712 1910966 1856958 1813614 1781202 1759520 1747892 1745249 1750187 1760820
50372 1760820 1774849 1790113 1805022 1818202 1827836 1831609 1827285 1813227 1788672 1753991 1710622 1660312
50360 1660312 1604315 1543531 1479331 1413776 1348954 1286441 1227464 1173049 1123641 1078809 1037728
50349 1037728 999932 965464 934406 906537 881431 858738 838417 820871 806868 797093 791589 789625
50337 789625 790188 792634 796889 803167 811632 822277 834883 848880 863361 877470 890828 903428 915061
50324 915061 925028 932390 936370 936547 933050 926841 919569 912829 907443 903433 900440 898062 895973 894031
50310 894031 892241 890538 888822 887406 887132 888653 891687 895287 898820 902374 906325 910886 916129 922074
50296 922074 928637 935742 943465 951833 960528 969188 978096 988139 999940 1013367 1028051 1043832 1060357
$$ packed form
50384B201691p8782p6628p1569o3746n4008m3344l2412k1682j1628k643M938J0633
50372A760820J4029J5264J4909J3180R634L773m324j4058k4555l4681m3369n0310
50360A660312n5997o0784o4200o5555o4822o2513n8977n4415m9408m4832m1081
50349A037728l7796l4468l1058k7869k5106k2693k0321j7546j4003r775n504j964
50337G89625N63K446M255O278Q465J0645J2606J3997J4481J4109J3358J2600J1633
50324I15061R967P362L980J77l497o209p272o740n386m010k993k378k089j942
50310H94031j790j703j716j416k74J521L034L600L533L554L951M561N243N945
50296I22074O563P105P723Q368Q695Q660Q908J0043J1801J3427J4684J5781J6525
$$ plain form
50283 1060357 1076630 1091620 1105238 1118296 1131540 1144977 1157883 1168827 1175630 1176022 1168883 1154837
50271 1154837 1135578 1113015 1089249 1066749 1047611 1032411 1020154 1009524 999980 991608 984431 978280
50259 978280 973133 969140 966277 964276 962974 962542 963300 965482 969191 974419 981072 989143 998901 1010713
50245 1010713 1024658 1040554 1058436 1078728 1101706 1127046 1154123 1182603 1212359 1242941 1273506
50234 1273506 1303350 1332205 1359854 1385672 1408766 1428502 1444703 1457359 1466324 1471394 1472567 1469997
50222 1469997 1463620 1452912 1437157 1415909 1389210 1357590 1322099 1284157 1245043 1205512 1166217
50211 1166217 1128402 1093725 1063256 1037006 1014487 995172 978201 962265 946365 930319 914085
50200 914085 896960 878173 858057 837919 818750 800685 783700 768103 754160 741816 731026
$$ packed form
50283A060357J6273J4990J3618J3058J3244J3437J2906J0944O803L92p139j4046
50271A154837j9259k2563k3766k2500j9138j5200j2257j0630r544q372p177o151
50259I78280n147l993k863k001j302m32P58K182L709N228O653Q071R758J1812
50245A010713J3945J5896J7882K0292K2978K5340K7077K8480K9756L0582L0565
50234A273506K9844K8855K7649K5818K3094J9736J6201J2656Q965N070J173k570
50222A469997o377j0708j5755k1248k6699l1620l5491l7942l9114l9531l9295
50211A166217l7815l4677l0469k6250k2519j9315j6971j5936j5900j6046j6234
50200I14085j7125j8787k0116k0138j9169j8065j6985j5597j3943j2344j0790
$$ plain form
50189 731026 721796 713635 705550 696961 688246 679970 671982 663741 655238 647085 639799 633450 627878 622852
50175 622852 618032 613143 608262 603739 599782 596338 593368 591013 589410 588510 588133 588157 588626 589693 591433
50160 591433 593728 596497 600043 604906 611230 618520 626232 634411 643477 653563 664357 675485 686689
50147 686689 697654 708010 717559 726228 733711 739459 743271 745749 748024 751064 755267 760547 766731 773972
50133 773972 782884 794238 808518 825902 846653 871274 900079 932792 968838 1007956 1050394 1096532
50121 1096532 1146500 1200039 1256390 1314330 1372675 1430964 1489323 1547428 1603876 1657008 1706231
50110 1706231 1751981 1794367 1832379 1864699 1890740 1910382 1922924 1926808 1920392 1902655 1873303 1832818
50098 1832818 1782713 1725395 1663437 1599009 1534010 1470381 1409883 1353594 1301851 1254792 1212914
$$ packed form
50189G31026r230q161q085q589q715q276p988q241q503q153p286o349n572n026
50175F22852m820m889m881m523l957l444k970k355j603r00l77K4M69J067J740
50160E91433K295K769L546M863O324P290P712Q179R066J0086J0794J1128J1204
50147F86689J0965J0356R549Q669P483N748L812K478K275L040M203N280O184P241
50133G73972Q912J1354J4280J7384K0751K4621K8805L2713L6046L9118M2438M6138
50121A096532M9968N3539N6351N7940N8345N8289N8359N8105N6448N3132M9223
50110A706231M5750M2386L8012L2320K6041J9642J2542L884o416j7737k9352m0485
50098A832818n0105n7318o1958o4428o4999o3629o0498n6289n1743m7059m1878
$$ plain form
50087 1212914 1177014 1147559 1124034 1104982 1088791 1074528 1062007 1051250 1042074 1034139 1027108 1020705
50075 1020705 1014799 1009468 1004737 1000188 995082 988976 982055 974686 966893 958440 949305 939820 930371 921111
50061 921111 911941 902750 893677 885089 877138 869399 861249 852710 844677 838189 833702 831138 830315 831070 833276
50046 833276 836999 842454 849495 857375 865412 873683 882602 891932 900831 908959 917002 925755 935069 944051
50032 944051 951988 958664 963969 967808 970515 972850 975204 976964 977104 975413 972807 970265 967694 964179
50018 964179 959248 953621 948614 945026 942678 940881 939140 937524 936543 936811 938856 943142 950100 960001 972886
50003 972886 988796 1007986 1030699 1056752 1085584 1116715 1149943 1185012 1221316 1257991 1294068
49992 1294068 1328505 1360365 1389147 1414755 1436975 1455089 1468011 1474584 1473747 1464814 1447821 1423254
$$ packed form
50087A212914l5900k9455k3525j9052j6191j4263j2521j0757r176p935p031o403
50075A020705n906n331m731m549n106o106o921p369p793q453r135r485r449r260
50061I21111r170r191r073q588p951p739q150q539q033o488m487k564q23P55K206
50046H33276L723N455P041P880Q037Q271Q919R330Q899Q128Q043Q753R314Q982
50032I44051P937O676N305L839K707K335K354J760J40j691k606k542k571l515
50018I64179m931n627n007l588k348j797j741j616r81K68K045M286O958R901J2885
50003I72886J5910J9190K2713K6053K8832L1131L3228L5069L6304L6675L6077
49992A294068L4437L1860K8782K5608K2220J8114J2922O573q37q933j6993k4567
$$ plain form
49980 1423254 1391234 1351321 1303530 1249339 1191425 1132549 1074936 1020288 969724 923699 882377
49969 882377 846104 815146 789007 766438 746284 728101 711938 697805 685502 674765 665493 657888
49957 657888 652261 648543 646104 644297 643091 642928 644153 646878 651215 657160 664285 672014 680210 689024
49943 689024 698113 706518 713476 718902 722898 725281 725903 725024 722957 719633 714854 708657 701022 691489 679665
49928 679665 666025 651675 637278 622701 607960 594015 582181 572923 565592 559369 554147 550424
49916 550424 548675 548985 551026 554004 556797 558604 559598 560642 562320 564613 567622 572023 578391 586457 595527
49901 595527 605328 615810 626336 635935 644496 653047 662458 672329 681525 689381 695967 701373 705174 706633
49887 706633 705248 701187 695264 688339 680632 671805 661733 650869 639668 628023 615562 602336 588880
$$ packed form
49980A423254l2020l9913m7791n4191n7914n8876n7613n4648n0564m6025m1322
49969H82377l6273l0958k6139k2569k0154j8183j6163j4133j2303j0737r272p605
49957F57888n627l718k439j807j206j63J225K725M337N945P125P729Q196Q814
49943F89024R089Q405O958N426L996K383O22q79k067l324m779o197p635r533j1824
49928F79665j3640j4350j4397j4577j4741j3945j1834r258p331o223n222l723
49916E50424j749L10K041K978K793J807R94J044J678K293L009M401O368Q066R070
49901E95527R801J0482J0526R599Q561Q551R411R871R196P856O586N406L801J459
49887G06633j385m061n923o925p707q827j0072j0864j1201j1645j2461j3226j3456
$$ plain form
49874 588880 575787 563530 552606 543497 536376 530981 526828 523521 520949 519233 518442 518382 518872 520199
49860 520199 523024 527629 533492 539754 546014 552584 560168 569337 580072 591679 603321 614673 625756
49847 625756 636216 645279 652662 658924 664514 668916 671269 671490 670237 667966 664651 660271 654923 648428
49833 648428 640476 631388 622232 613908 606448 599454 592965 587617 584005 582061 581129 580653 580821 582355 585615
$$ packed form
49874E88880j3093j2257j0924r109p121n395m153l307k572j716p91o0M90J327
49860E20199K825M605N863O262O260O570P584R169J0735J1607J1642J1352J1083
49847F25756J0460R063P383O262N590M402K353K21j253k271l315m380n348o495
49833F48428p952r088r156q324p460o994o489n348l612j944r32m76J68J534L260
$$ [...]
##END NTUPLES=NMR SPECTRUM
##END=
