
##TITLE=AC1411_PERAH12220_7653061_aPTsmxzTha
##JCAMPDX= 6.0         $$ Bruker NMR JCAMP-DX V2.0
##DATA TYPE= nD NMR SPECTRUM
##DATA CLASS= NTUPLES
##NUM DIM= 2
##ORIGIN= BRUKER
##OWNER= Administrator
$$ 1.72 TOPSPIN		Version 2.1
$$ 2013-03-20 02:44:54.986 -0500  Administrator@X
$$ Compression mode = diff/dup
##.OBSERVE FREQUENCY= 400.02188249412
##.OBSERVE NUCLEUS= ^1H
##.ACQUISITION MODE= SIMULTANEOUS (DQD)
##.ACQUISITION SCHEME= NOT PHASE SENSITIVE
##.AVERAGES= 4
##.DIGITISER RES= 22
##SPECTROMETER/DATA SYSTEM= spect
##.PULSE SEQUENCE= jresgppsqf.2
##.SOLVENT NAME= COFFEE_meoh
##.SHIFT REFERENCE= INTERNAL, COFFEE_meoh, 1, 14.96091
##AUDIT TRAIL= $$ (NUMBER, WHEN, WHO, WHERE, PROCESS, VERSION, WHAT)
$$ ##TITLE= Audit trail, TOPSPIN		Version 2.1
$$ ##JCAMPDX= 5.01
$$ ##ORIGIN= Bruker BioSpin GmbH
$$ ##OWNER= Administrator
$$ $$ E:\/data/COFFEE/nmr/AC1411_PERAH12220_7653061_aPTsmxzTha/13/pdata/1/auditp.txt
$$ ##AUDIT TRAIL=  $$ (NUMBER, WHEN, WHO, WHERE, PROCESS, VERSION, WHAT)
(   1,<2013-03-20 02:44:45.486 -0500>,<Administrator>,<X>,<go>,<TOPSPIN 2.1>,
      <created by zg
	started at 2013-03-20 02:30:22.111 -0500,
	POWCHK enabled, PULCHK disabled,
       configuration hash MD5:
       86 BA 57 50 F2 9D 5C 9B 26 00 A9 28 5F 66 2E 89
       data hash MD5: 8K * 40
       49 18 34 C4 FD CB 4D 42 03 81 B9 E5 F2 C1 30 C8>)
(   2,<2013-03-20 02:44:49.954 -0500>,<Administrator>,<X>,<proc2d>,<TOPSPIN 2.1>,
      <Start of raw data processing
       xfb same F2: SI = 16K WDW = 3 SSB = 0 FT_mod = 6 PKNL = 1 F1: SI = 512 WDW = 3 SSB = 0 FT_mod = 6 PH_mod = 2
       data hash MD5: 16K * 512
       34 D5 0C 14 B0 A3 15 B8 C9 78 70 DD 4E 7B A7 99>)
(   3,<2013-03-20 02:44:50.954 -0500>,<Administrator>,<X>,<proc2d>,<TOPSPIN 2.1>,
      <abs2 F2: ABSG = 5 ABSF1 = 10.0008 ABSF2 = 0.0002649815
       data hash MD5: 16K * 512
       07 3A 4B 8A 83 DA E8 3A C2 95 CF D4 D2 FA 10 78>)
(   4,<2013-03-20 02:44:51.907 -0500>,<Administrator>,<X>,<proc2d>,<TOPSPIN 2.1>,
      <tilt
       data hash MD5: 16K * 512
       34 7C C3 30 4B 77 D2 77 19 E6 49 85 ED D6 B3 31>)
(   5,<2013-03-20 02:44:53.314 -0500>,<Administrator>,<X>,<proc2d>,<TOPSPIN 2.1>,
      <abs1 F1: ABSG = 5 ABSF1 = 0.06497851 ABSF2 = -0.06497862
       data hash MD5: 16K * 512
       6F CC F2 FF 39 07 12 B2 9E B8 67 7F 98 77 E8 43>)
(   6,<2013-03-20 02:44:54.595 -0500>,<Administrator>,<X>,<proc2d>,<TOPSPIN 2.1>,
      <symj
       data hash MD5: 16K * 512
       94 2A F0 F8 FD AC 55 0E 7E 75 A1 C6 97 70 A3 A9>)
$$ ##END=
$$ 
$$ $$ hash MD5
$$ $$ D2 4D 46 95 3A D0 F7 C6 7E B5 E3 F1 59 D0 47 B1
##$RELAX= 
##$RELAX= 
##$RELAX= 
##$RELAX= 
##$RELAX= 
##$RELAX= 
##$RELAX= 
$$ Bruker specific parameters
$$ --------------------------
##$DU= <E:\>
##$EXPNO= 13
##$NAME= <AC1411_PERAH12220_7653061_aPTsmxzTha>
##$PROCNO= 1
##$TYPE= <nmr>
##$USER= <COFFEE>
##$ACQT0= 1000000
##$AMP= (0..31)
100 100 100 100 100 100 100 100 100 100 100 100 100 100 100 100 100 100
$$ [...]
##$TD0= 1
##$TE= 300
##$TE2= 300
##$TE3= 300
##$TEG= 300
##$TL= (0..7)
0 120 120 120 120 120 120 120
##$TP= (0..7)
150 150 150 150 150 150 150 150
##$TP07= 0
##$TPNAME0= <>
##$TPNAME1= <>
##$TPNAME2= <>
##$TPNAME3= <>
##$TPNAME4= <>
##$TPNAME5= <>
##$TPNAME6= <>
##$TPNAME7= <>
##$TPOAL= (0..7)
0.5 0.5 0.5 0.5 0.5 0.5 0.5 0.5
##$TPOFFS= (0..7)
0 0 0 0 0 0 0 0
##$TUNHIN= 0
##$TUNHOUT= 0
##$TUNXOUT= 0
##$USERA1= <user>
##$USERA2= <user>
##$USERA3= <user>
##$USERA4= <user>
##$USERA5= <user>
##$V9= 5
##$VALIST= <valist>
##$VCLIST= <CCCCCCCCCCCCCCC>
##$VD= 0
##$VDLIST= <DDDDDDDDDDDDDDD>
##$VPLIST= <PPPPPPPPPPPPPPP>
##$VTLIST= <TTTTTTTTTTTTTTT>
##$WBST= 2048
##$WBSW= 25
##$XGAIN= (0..3)
0 0 0 0
##$XL= 0
##$YL= 0
##$YMAX_a= 63307
##$YMIN_a= -122204
##$ZGOPTNS= <>
##$ZL1= 120
##$ZL2= 120
##$ZL3= 120
##$ZL4= 120
##$ABSF1= 0.06497851
##$ABSF2= -0.06497862
##$ABSG= 5
##$ABSL= 0
##$ALPHA= 0
##$AQORDER= 0
##$ASSFAC= 0
##$ASSFACI= 0
##$ASSFACX= 0
##$ASSWID= 0
##$AUNMP= <>
##$AXLEFT= 0
##$AXNAME= <F1>
##$AXNUC= <1H>
##$AXRIGHT= 0
##$AXTYPE= 0
##$AXUNIT= <>
##$AZFE= 0.1
##$AZFW= 0.5
##$BCFW= 0
##$BC_mod= 0
##$BYTORDP= 0
##$COROFFS= 0
##$CY= 15
##$DATMOD= 1
##$DC= 0
##$DFILT= <>
##$DTYPP= 0
##$F1P= 0
##$F2P= 0
##$FCOR= 0.5
##$FTSIZE= 512
##$FT_mod= 6
##$GAMMA= 0
##$GB= 0
##$INTBC= 1
##$INTSCL= 1
##$ISEN= 128
##$LB= 0
##$LEV0= 0
##$LPBIN= 0
##$MAXI= 10000
##$MC2= 0
##$MEAN= 0
##$ME_mod= 0
##$MI= 1
##$NCOEF= 0
##$NC_proc= -5
##$NLEV= 6
##$NOISF1= 0
##$NOISF2= 0
##$NSP= 0
##$NTH_PI= 0
##$NZP= 0
##$OFFSET= 0.06497851
##$PC= 4
##$PHC0= 0
##$PHC1= 0
##$PH_mod= 2
##$PKNL= no
##$PPARMOD= 1
##$PPDIAG= 0
##$PPIPTYP= 0
##$PPMPNUM= 2147483647
##$PPRESOL= 1
##$PSCAL= 1
##$PSIGN= 0
##$PYNMP= <proc.py>
##$REVERSE= no
##$SF= 400.021882494141
##$SI= 512
##$SIGF1= 0.06497851
##$SIGF2= -0.06497862
##$SINO= 16
##$SIOLD= 512
##$SPECTYP= <>
##$SREGLST= <1H.MeOD>
##$SSB= 0
##$STSI= 512
##$STSR= 0
##$SW_p= 51.9856959427865
##$SYMM= 3
##$S_DEV= 2686
##$TDeff= 40
##$TDoff= 0
##$TI= <>
##$TILT= yes
##$TM1= 0
##$TM2= 0
##$TOPLEV= 0
##$USERP1= <user>
##$USERP2= <user>
##$USERP3= <user>
##$USERP4= <user>
##$USERP5= <user>
##$WDW= 3
##$XDIM= 16
##$YMAX_p= 282905253
##$YMIN_p= 0
$$ End of Bruker specific parameters
$$ ---------------------------------
##NTUPLES= nD NMR SPECTRUM
##VAR_NAME=  FREQUENCY1,    FREQUENCY2,      SPECTRUM
##SYMBOL=    F1,            F2,              Y
##.NUCLEUS=  1H,            1H
##VAR_TYPE=  INDEPENDENT,   INDEPENDENT,     DEPENDENT
##VAR_FORM=  AFFN,          AFFN,            ASDF
##VAR_DIM=   512,           16384,           16384
##UNITS=     HZ,            HZ,              ARBITRARY UNITS
##FACTOR=    0.101534562388255, 0.501933850740131, 1
##FIRST=     25.9928259484165, 8223.18227667557, 1515
##LAST=      -25.8913354319817, 0,           -1029
##MIN=       -25.8913354319817, 0,           0
##MAX=       25.9928259484165, 8223.18227667557, 282905253
##PAGE= F1=25.99282594842
##FIRST=     25.9928259484165, 8223.18227667557, 1515
##DATA TABLE= (F2++(Y..Y)), PROFILE
16383 1515 1984 2316 2998 3255 3002 2186 1848 1435 1447 1686 1891 2263 2077 1513 -313 -1871 -438 -40 -597 -415
16363 -415 371 1160 1166 1685 350 -1062 -2705 -4433 -4735 -3209 -2751 -2895 -2698 -1796 -1220 -1479 -2464 -705 776
16343 1759 1300 663 367 -1948 -3347 -3818 -3740 -3705 -3642 -2572 -1659 -66 1543 2355 1925 -12 -626 -475 389 1359
16323 1359 2066 2277 2154 1104 -411 -2021 -2962 -3425 -3434 -3282 -2622 -2310 -1499 -1017 -773 -348 -631 -225 -7 211
16302 108 -282 183 103 -592 -1099 -2150 -2867 -2941 -2244 -1768 -454 1279 2690 3201 2264 911 -538 -2186 -4259
16283 -4259 -4679 -130 2426 3756 3981 2452 794 -513 -39 471 230 -723 -1036 -348 1465 3201 3170 2123
16265 2123 -99 -1988 -3199 -4379 -3551 -1692 237 1635 2269 2738 2012 885 -735 -1471 -673 327 975 703
16247 703 1756 3271 5429 7548 7617 5536 2319 773 -209 -820 -1179 -1722 -1919 -1341 -671 -637 -1136 -2006
16229 -2006 -2257 -1201 -106 461 817 917 1036 1150 1255 1542 2226 3191 3420 2835 617 -615 -2281 -2540 -2282
16210 -2282 -1972 -1359 -712 -670 -961 -1344 -2005 -1890 -2048 -2177 -1704 -1240 -1 1639 3022 3741 2966 1306 129
16190 -320 240 -277 -298 143 2288 4532 5673 4574 2985 954 -1129 -2278 -1652 -178 1115 1567 1315
16173 1315 141 -1113 -595 812 2009 1982 428 100 1931 2671 2942 2373 1320 536 139 117 396 562 1460
16154 1460 2652 3523 3778 3717 3347 2492 1254 102 -923 -1601 -1883 -1476 -483 631 1331 1241 682 1427 1716
16135 1716 2225 2420 1047 -526 -2309 -3917 -6311 -7179 -2908 -114 -316 -9 -295 -915 -847 -1458 -1610 -3199
16117 -3199 -4974 -4433 -213 2445 3196 2845 1074 1283 1067 1425 2883 3608 4141 7641 2515 -2537 -4524
16100 -4524 -6084 -6346 -2745 -117 1467 2137 1148 -748 -2803 -4632 -4942 -722 2374 4210 4643 3042 1364
16082 -471 -380 1053 1884 2385 2884 3573 5408 6617 7965 6753 5093 3840 2789 1927 735 -676 -2699
16065 -2699 -2819 -1597 -60 1036 1690 1742 1156 -342 -1218 -1000 -23 573 608 -387 -2063 -3167 -3489 -4417 -4991
16046 -4991 -4982 -2314 -703 -88 -281 -554 -93 736 1404 1778 1730 1604 1403 1581 1901 2042 2219 2757 3681 4877
16026 4877 3796 2598 1172 297 506 287 -210 -805 -1679 -1942 -1971 -2377 -2257 -1537 -114 1266 2574 3650
16008 3650 4156 3202 1483 -383 -1611 -1380 -148 872 893 382 -333 -505 960 2837 3903 3746 2904 1258
15989 340 707 1284 1742 2696 5089 8719 11883 14457 14729 12915 8780 2964 -978 -2180 -2170 -861 668
15971 1585 1079 -532 -1757 -1900 -969 723 2656 4584 5836 5216 3582 2474 1890 1393 533 -632 -1884
15954 -1884 -2170 -1656 -674 503 1595 2289 2233 1123 651 171 165 268 318 -104 -488 -615 -365 -291 -474 -1012
15934 -1012 -1403 -2538 -3699 -4266 -3736 -3263 -3416 -2695 -1081 1084 2720 3472 3835 4638 5644 6329 7758
15917 7758 7278 7587 7645 7453 3456 3314 28 -947 -2710 -3662 -1484 66 1090 1189 1100 -246 -1462 1188 3054
15898 3054 4755 5454 5586 1891 -379 -2778 -4996 -5696 -5876 -5571 -3547 -2100 -728 -1037 -1166 -269 454
15880 721 1584 2711 2677 2255 1832 910 210 -962 -2412 -3430 -4008 -3348 -2035 -822 -517 -57 658 1586 2158
15861 2158 1922 1343 933 448 -319 -1578 -2974 -2509 -1515 -2493 -2509 -834 -76 -614 -1770 -3021 -2938 -1174 -311
15841 -411 -1038 -972 -586 -121 158 584 295 -190 -1446 -3235 -4676 -2741 -1518 -982 -1552 -2113 -2196 -2113 -1258
15822 -1258 63 383 -272 -1363 -2443 -2736 -2685 -1571 -368 416 964 1696 2898 3664 3360 2494 1504 77 -1546
15802 -3436 -4829 -4478 -3985 -2139 -2760 -2118 -605 1035 2457 2403 1039 -178 -1834 -2690 -2244 -1019 -320
15784 -147 -1648 -3191 -2443 -2174 -2050 -3281 -4232 -9397 582 1273 669 -1949 -2883 -3950 -2262 74 1134
15767 1134 1566 1360 598 -57 -1233 -2442 -1950 -1283 -1380 -1403 -892 -48 352 164 -222 35 189 -344 -921 -894 -420
15745 -175 -61 -751 -2754 -4575 -4776 -3471 -734 907 2467 3493 3092 2856 1908 2677 2530 1596 918 281
15726 -343 -822 -888 -490 276 -497 -912 -1339 -1884 -2256 -1593 -155 631 728 -327 -1665 -2841 -2681 -1856 -1506 -2058
15706 -2058 -2475 -880 944 2197 6902 11879 13125 11494 8001 2901 -1309 -1851 -2528 -1658 -927 -91 801
15688 1524 731 -376 -1732 -2264 -1797 -594 268 897 1183 1409 1901 2675 3253 3607 3318 2698 1810 675 -638
15668 -1813 861 2708 3845 4637 4423 2592 794 -10 -1293 -2697 -4513 -5382 -4134 -2266 -178 1118 2209
15651 2209 3709 4221 3447 2355 996 360 1239 2848 3909 3104 2695 2293 1187 513 110 -237 -604 -1160
15633 -1160 -1230 -982 -889 -540 721 2131 1793 -22 -1727 -2630 -2512 -1158 374 1778 2410 985 -1557 -1422 -627
15613 608 2105 3669 5339 6125 5002 2760 623 -730 26 735 1053 634 504 1466 2421 3202 2635 2070
15595 2070 1966 2398 3254 3190 1990 639 -240 -146 203 411 5 102 -432 -1848 -2781 -1719 -985 -539 -724 -189
15574 382 1111 1638 1610 427 -641 1142 1102 2227 2906 2705 1827 630 -272 -474 149 -57 -692 -1648 -2577 -2915
15554 -2915 -3600 -6717 -2238 -660 144 1156 1010 316 -1280 -2686 -3298 -2162 -1822 -1694 -833 -127 529
15536 1181 786 298 -72 -166 239 647 1124 1990 2689 3734 4228 4342 4116 3039 1735 900 472 486 564 993
15516 993 1150 519 -574 -2113 -1790 -1193 -1041 -1746 -1384 721 1865 2220 1941 1397 615 946 1047 213 -1472
15496 -3367 -3202 -1716 -334 1389 2312 1790 731 -461 -1612 -831 -565 -639 -711 -509 -154 -759 -1743 -2699 -2592
15477 -2592 -1498 -244 221 411 535 -366 -1197 350 2201 2820 3012 2039 1155 -613 -518 -2180 -3820 -5068
15459 -5068 -2490 -351 116 -694 -792 -1939 -2545 -2606 -2369 -1600 -740 -397 -306 -1492 -3194 -5488 -6520 -6534 -4679
15440 -4679 -3307 -2626 -1025 383 1638 2554 3664 3532 2226 -401 -1995 -2673 -2870 -2477 -1800 -735 310
15422 1928 2842 3186 3051 2906 2832 2762 1740 421 -600 -1533 -1366 194 -1115 -1138 -1353 -631 -63 1822 2869
15403 2869 2381 1719 1211 1218 1180 1218 1225 1593 2439 3331 3535 2822 1723 1752 2816 3030 3442 3506 3645 3706 3574 2730
15381 2730 1484 420 -639 -1773 310 1092 841 233 -262 -94 520 1045 1129 1268 1502 2076 2940 3917 5021
15362 5021 6613 7453 8711 8297 6862 1605 654 817 2243 2545 2597 2450 1808 1185 831 521 557 446
15344 446 -3 -1150 -1696 -1910 -1131 -1140 -2058 -3396 -4471 -2858 -748 660 1348 1261 955 958 922 -67 -1796 -3067 -4066
15323 -4066 -4858 -6483 -7061 -7653 -7605 -7269 -5427 -3861 -4074 -4303 -4023 -3539 -2711 -2176 -1330 -617 -653 -1274 -1625
15304 -1625 -950 639 2001 2822 2473 2045 1426 685 195 -536 -1215 -2014 -3209 -4191 -4396 -5037 -5807 -5821 -4586
15285 -4586 -3017 -1371 -1206 -1974 -3033 -3274 -2243 -807 51 12 -62 -416 -451 -138 561 1837 1902 1593 1214
15266 1214 122 -828 -1636 -1850 -1687 -619 1455 2400 1897 -48 -2417 -4654 -5158 -3495 -1575 -863 800 815
15248 815 894 -102 -1819 -1367 117 709 277 -234 -1558 -2230 -1389 84 1099 1067 675 691 469 -169 -161 451 1673
15227 1673 2738 3395 3609 2873 2106 1417 632 -235 -646 -1796 -2672 -2336 -1739 -903 -77 828 1579 1905 1864
15208 1864 1771 1786 1691 1337 907 606 1036 2327 3295 3651 2660 1238 -159 -757 -476 199 1424 1891 1904 1191
15188 1191 414 231 1193 964 256 -242 -36 917 1574 1503 1121 675 142 -46 -633 -1209 -1122 -1225 264 37 110
15167 110 -7 -517 -1182 -1923 -1874 -907 287 1898 3178 3718 3396 2130 286 -1210 -2593 -4177 -1859 -353
15148 768 1364 1165 1406 1228 831 1152 40 -1919 -4920 -2478 1209 2753 2140 636 -1413 -3471 -4721
15131 -4721 -1234 2385 3949 4008 2890 1667 748 261 432 1260 1801 1910 1369 809 248 -610 -1153 -1234
15113 -1234 -1486 -1512 -1915 -2453 -2237 -2261 -1850 -1542 -716 338 1031 1294 1878 5213 6496 4101 2660 1255
15094 427 -1192 -3464 -1526 -191 939 1843 2536 2729 2580 2407 1756 950 404 -174 145 1308 2585 3129
15076 3129 3039 2584 2047 1484 229 -1238 -1490 -1318 -980 -911 -637 -245 551 1897 2526 2638 2274 1878 1346
15057 1346 815 553 783 1040 1945 2573 3092 1566 -1090 -2837 -2121 -169 1468 2845 3377 3237 2112
15040 2112 165 -2279 -3990 -3697 -2502 -2321 -3384 -4970 -6176 -1619 1013 1572 597 -909 -2423 -885
15023 501 -132 -172 505 612 -94 -1130 -2355 -1397 214 1551 2130 2222 1687 742 -130 -725 -782 -181 780 1244
15003 1244 1168 370 -204 -406 -362 21 481 602 253 671 1073 1010 232 -381 -1055 -1475 -1136 -504 1019 3557
14983 3557 3467 1704 -1 -1114 -2216 -1613 1161 3600 4820 4776 3064 1313 -351 383 741 626 -26 -1028
14965 -1028 -1784 -870 814 636 -581 -1997 -3908 -4651 -5032 -4907 -5246 -4177 -2929 -1845 -1499 -983 -338 1234
14946 2928 5140 8155 8666 7417 4479 981 253 28 -176 -32 73 91 312 574 474 236 71 143 651 976
14926 976 -294 -1265 -753 1168 2892 4119 5365 6258 7278 7558 6486 3818 2482 1990 2103 1892 926
14908 -21 -1551 -2997 -5335 -8299 -7536 -5664 -2851 -4 2367 3510 3346 2178 766 -692 -1562 641 1626 1888
14890 1888 1661 1125 124 -712 -1151 -1068 -828 -397 126 1147 2069 2842 2895 1698 453 -955 -2243 -2571 -2699
14871 -2699 -2647 -2339 -1314 -268 15 -387 -963 -1545 -1479 -956 -121 1341 2373 2492 1787 523 -1148 -2116 -1339
14852 -1339 614 962 33 -462 186 1486 2372 2915 3491 4087 4321 3953 3010 1888 627 -99 -686 -1205 -1633
14833 -1633 -1594 -2094 -2530 -2035 -1281 -425 372 1069 1562 1502 1291 1087 1105 1438 1925 2896 2992 3153 2978 2024 1717
14812 1717 2419 3825 5658 6950 7529 6712 4294 2619 1265 882 544 333 -227 -1060 -1742 -1754 -87 1008
14793 1961 1768 605 -402 -1818 -2688 -2918 -1943 623 1342 1854 2535 2724 2250 1176 -394 -1878 -3060 -2743
14775 -2743 -1830 -420 993 2705 3804 3043 1359 -314 -1124 -1436 -1408 -2147 -2486 -2315 -1283 86 1045 965 -155
14755 -1309 -1715 -770 -4 347 873 1277 1551 1345 43 -628 -1249 -1323 426 2473 4997 8222 11316 11826 9550
14736 9550 4230 958 -2007 -3616 -3680 -3186 -2929 -2676 -2619 -2016 -1105 -911 -1678 -2099 -1581 -1463 -1854 -2216 -1155
14717 -1155 -480 544 1066 1629 2330 4172 5333 7249 7450 4835 2196 -176 279 -547 -1678 -2653 -4118
14700 -4118 -3133 -1266 46 828 1069 615 -369 -1463 -2736 -3588 -2039 -45 1904 3451 4309 4140 2414 -77
14681 -1201 -600 445 986 862 755 618 677 284 366 -336 -999 -817 -224 650 1505 2066 1400 818 273 266 578
14660 578 718 1050 1989 2537 2403 1583 260 -1410 -1276 -681 -177 6 -441 -1339 -2123 -2749 -2739 -2137 -1065 -158
14639 515 761 997 731 -399 -1190 -1454 -257 1436 2540 1689 313 -805 -136 2330 3977 4153 2591 -1 -2734
14620 -2734 -4257 -3252 -653 1936 3043 2705 1473 470 -82 -672 -738 -1338 -506 2051 3949 5279 6397
14603 6397 6123 3675 1870 -122 -1464 -1946 -1642 -1759 -2045 -2046 -1138 -617 178 534 491 -22 -1032 388 2656
14584 2656 3240 2728 1556 -926 -3494 -4364 -5861 -7641 -6934 -3848 -2626 -2511 -2811 -3513 -1037 2118 3268
14567 3268 3558 3002 2314 1182 78 -1204 -2162 -2615 -2865 -2760 -2805 -1564 440 1376 1068 53 -1480 -3123 -4039
14548 -4039 -4107 -10418 -11410 -11698 -10336 -3356 -2175 -525 1239 2360 2280 1446 655 -273 513 -1061 -1889 -2652
14530 -2652 -3043 -3116 -3413 -3908 -5034 -3895 -1199 213 706 1813 1715 1171 -329 -2287 -901 1074 2564 2338
14512 2338 1343 -373 -1241 -1550 -259 1330 1654 744 -312 -975 -82 1335 1931 1769 872 -637 -2579 -4096
14494 -4096 -3493 -1834 -431 802 1196 869 -863 -1412 -510 821 2650 5070 6757 4733 1969 -401 -2330
14477 -2330 -2797 -2242 -775 721 827 171 -70 64 329 794 1438 2190 2093 1208 -59 -1053 -1862 -2082 -1471 -724 0
14455 675 1078 931 18 -519 400 19 -1046 -2379 -3907 -4213 -4976 -4848 -4946 -3051 -3148 -3509 -3524 -3447 -3938 -3409
14435 -3409 -2105 -1132 507 2557 4433 4975 3683 1506 -593 -3163 -6288 -8938 -10642 -11626 -4333 -1541
14418 -3089 589 3316 4016 4083 2545 583 -1394 -2799 -3957 -5653 -3515 -535 839 895 -555 -2726 -3677
14401 -3677 -2676 -1104 -698 -557 -327 545 1272 635 -343 -1670 -3130 -4061 -4342 -4489 -6039 -4136 -2721
14384 -2721 -526 304 -143 -750 109 819 1050 983 268 -839 -2543 -4005 -2680 -225 1148 286 -429 -576
14366 -576 -1483 -2816 -3640 -2651 -540 747 1314 1662 1184 152 -783 -1623 -2304 -2415 -2144 -730 1377 3620 6492
14347 6492 9716 12445 11351 7319 39 -1738 -2758 -2872 -1749 -466 -55 308 566 -126 -750 -1490 -146 1560
14328 2269 2128 1377 295 92 1828 5061 10729 12863 11325 8097 976 -1529 -2140 -738 1741 3826 5338
14311 5338 5368 3179 775 -449 -1860 -2105 -1163 312 -469 -1068 -2309 -3457 -4294 -4177 -1655 -685 -711 -1271
14293 -1271 -2458 -3511 -3666 -2908 -872 -929 -1557 -2938 -3554 -2644 -2389 -1610 -1802 -3006 -1548 992 2592 2825
14275 2825 2778 3134 3461 3446 2718 1572 127 -597 600 3107 3949 3397 2025 398 -1017 -2140 -1577 -379
14256 420 563 -73 -1284 -1062 364 1424 2159 2181 2189 1957 1892 1813 1346 -268 2257 593 -1695 -2260 -2848 -2544
14236 -2544 -2022 -1053 431 1276 757 -667 -1558 -2004 -2298 -1951 -1072 -98 32 -202 -736 -499 -193 578 1084 2112
14216 2112 3140 4380 4505 3867 2159 903 3218 6130 5974 5311 11052 2395 1635 712 422 679 105
14198 -1564 -3488 -4672 -2973 -1491 -780 603 1831 2673 3416 3590 2756 884 -1072 -2052 -1872 -582 -176
14180 38 -30 -364 608 1201 375 -1500 -2989 -4656 -4202 -2773 -2790 -4087 -6241 -5107 -2167 382 1534 2257
14162 2257 3142 3624 4045 4106 4059 3523 2175 1441 857 -189 -1112 -697 -221 648 1243 299 -865 -2209 -3554
14143 -3554 -112 1243 1443 640 -275 -1476 -2321 -2258 -2169 -2294 -2123 -1472 966 3355 4754 4008 2946 1417
14124 165 -382 -325 -114 -687 -1548 -2118 -1820 -1454 -997 -157 928 1507 1404 307 -1413 -2925 -3349 -268 1358
14104 742 -198 -1883 -2783 -1746 318 1097 1044 1387 1478 2339 3638 4555 5100 4461 3433 2255 1099 526
14085 -167 929 2513 3141 2624 1862 -98 -1174 -1606 -466 2091 2583 1847 774 -451 -1495 -2631 -3095 -2836
14067 -2836 -1732 212 2832 5753 9346 8954 4127 430 -2252 -3639 -1739 -894 -117 333 1674 2579
14051 2579 3851 4221 4700 4548 3723 2963 1723 124 -1030 -1621 -1756 -1676 -1112 -1204 -1825 -2366 -2523 -2304 -1529
14032 -1529 -374 -815 -2197 -3674 -6418 -10101 -10733 -9384 -7750 -3022 -1789 -8 2781 833 2569 1911 913
14014 0 -28 2912 6389 8237 9355 8844 7261 3597 1232 702 683 855 1295 1616 1599 1109 185 -904 -2312
13995 -2312 -3759 -1933 -289 259 737 823 1050 116 1042 2552 2925 3271 1962 124 -1299 -1998 -2668 -3209
13977 -3209 -2515 -1755 -3048 -1987 -1392 -695 1113 2192 2537 2055 1532 1047 575 489 267 136 -432 -760
13959 -760 -1239 -1945 -2401 -3318 -4377 -6001 -3711 -349 3352 6251 6619 5378 3838 2678 1983 1364 1084
13942 1084 734 334 411 414 277 -221 -566 -958 -660 -26 128 -173 -142 680 1264 1665 1897 1518 558 -1434 -2152
13921 -2152 -664 426 2656 2412 1877 -40 -1131 -56 1905 3135 3069 2649 2402 2014 935 432 670 1011 820
13902 820 -339 -2327 -4142 -6903 -7866 -8139 -4955 -3075 -1304 -81 -29 -1097 -2667 -3574 -1992 313 1436
13885 1436 1392 811 -7 43 738 2160 3138 3180 3070 2948 3386 3079 1722 -355 -2175 -2611 -4733 -3823 -1531
13865 1306 3453 6000 6407 5845 4632 3368 2109 592 -445 -351 -103 -486 -1273 -1377 -231 559 389 -740
13846 -2316 -3958 -4514 -2452 20 1481 2448 2849 2508 1435 -1363 -3340 -3972 -1051 741 1952 1328 -1209
13828 -3768 -5350 -5738 -5386 -3993 -2397 -539 1172 2752 3160 3038 2284 1117 -363 -1019 -397 417 920
13811 920 518 -585 -291 -124 -83 -255 -725 -1241 -1810 -3040 -3836 -3943 -2495 301 3034 3896 3861 3077 2603
13792 2603 6476 3721 3377 2101 818 1059 31 -683 -797 -1213 -1848 -2230 -2181 -1320 18 1338 1305 429 -667
13772 -1509 -1816 -1360 775 2336 2780 1852 553 -777 -954 146 507 -999 -5249 -7191 -2037 -702 1055 1649
13754 1649 1397 346 -443 -1257 -1143 -937 -885 -1154 -1229 -1399 -1576 -2016 -2184 -2429 -2266 -1343 -1411 -1743 -2379 -2741
13734 -2741 -2939 -3005 -2257 -800 663 1385 1321 928 335 414 1474 1730 2175 1269 -112 -1296 -2095 -1808 -1147 181
13713 1385 2153 3051 3888 4408 4979 4583 3906 2237 1004 323 276 729 1447 1342 422 -611 -2337 -3867
13695 -3867 -3861 -3499 -3750 -2681 -1674 -955 -1227 -1692 -2803 -4775 -6834 -6538 -4095 -327 569 685 1557 985
13677 985 909 432 -130 -204 -647 -992 -1413 -2134 -3703 -4247 -3289 -1542 -16 753 216 -140 -4 66 -581 -1467 -2309
13656 -2309 -2426 -661 153 -394 -1355 -1727 -587 584 644 -200 -1300 -2080 -2457 -1500 -1237 -1654 -1343 333 2180
13637 2180 2615 2036 1182 -311 -982 -940 -1055 305 2636 3392 3273 2646 1906 746 -348 -1502 -2128 -1530 -794
13618 -794 90 -306 -1188 -2297 -3346 -3743 -2309 38 2890 5098 5404 4264 3164 2799 1641 512 -519 -827
13600 -827 -588 -237 316 156 -378 -88 -575 -1040 -1678 -1603 -987 302 1516 2633 3201 3078 2378 2033 1415 1442
13580 1442 1868 1715 1246 1007 784 -108 -2094 -4383 -6620 -7961 -6399 -3233 -1399 -452 -326 -1081 -2172
13563 -2172 -2376 -940 -531 -1201 -3085 -5554 -7210 -3431 -2649 -2327 -2047 -2647 -1917 -1973 -1309 -1007 -1991 -2237
13545 -2237 -1793 -1528 -327 355 333 210 -135 -36 219 1013 1373 1019 -259 -2540 -4429 -5641 -3173 -378 1214
13525 1067 490 289 1083 1776 1627 548 -9 -474 -1357 -2023 -993 -1266 -1938 -2043 -1192 -165 856 710 202 -60
13504 -451 -302 21 857 1188 171 -1388 -2999 2591 2173 -1250 -5550 -2888 606 2474 2949 2723 2469 1031
13485 980 -313 -1769 -2664 -2101 1008 4641 7346 9859 10359 7948 1888 298 35 1399 2680 3247 2433
13468 2433 1926 1024 184 -341 -304 -384 -495 -729 895 2748 3471 3488 3391 3539 3630 3474 2485 21 392 1004 749
13447 749 182 -485 -715 -993 -1833 -2048 -2502 -2225 -2494 -2212 -787 -251 796 1075 292 -788 -1931 -2865 -2215
13428 -2215 -522 -138 -407 383 1182 1826 2152 1436 290 -779 -629 278 1737 1739 892 -157 -1752 -3300 -4536
13409 -4536 -6561 -7649 -2734 458 1421 672 -875 -2352 -3618 -4171 -4714 -4707 -3624 -663 2371 5388 8871
13392 8871 9812 6643 -1003 -3066 -3018 -2143 -1475 -735 203 1653 2440 3036 2699 1830 979 1299 2206 2565
13374 2565 2095 889 -759 -2433 -2389 -1609 -2481 -3420 -3560 -1592 -543 156 738 993 1043 654 -101 -392 8 395
13354 395 1113 1414 1962 2323 3023 3230 3194 3006 2396 1977 1636 1829 2942 3842 5278 5206 4177 3500 2341
13335 2341 2159 2057 2080 1708 1561 1938 1823 2074 1841 1307 506 -818 -2219 -2822 -2137 -450 1706 2720 2586
13316 2586 1917 1381 1589 2114 3084 4024 3086 833 -1388 -1653 770 2865 3583 2689 1469 -120 -1744 -1538
13298 -1538 906 2135 2004 1762 809 -514 -2150 -3211 -1466 -676 32 689 1969 2820 3139 2838 3086 3319
13280 3319 2965 2578 1730 1546 1431 387 -920 -2564 -4217 -6267 -6273 -3589 -1493 -464 89 -1151 -2487 -3363
13262 -3363 -4583 -2064 348 2025 2874 4027 4243 4611 4122 3747 2546 1049 0 -428 -806 -773 -1406 -1874
13244 -1874 -2082 -1956 -2527 -3414 -3734 -4190 -3985 -3896 -3925 -4294 -892 485 -521 -506 268 -1079 -2389 -3518 -4078
13225 -4078 -4017 -2569 -1115 -28 461 339 -339 -1275 -1503 192 2500 3741 3971 1759 1078 -747 -2634 -3100
13207 -3100 -864 1133 2833 3835 5632 7099 9366 9763 10433 10936 7715 6891 2412 685 -499 -1353 -1899
13190 -1899 -2504 -1133 725 1599 1935 2377 3266 4061 5012 5589 5301 3978 2763 1240 571 1153 2150 2935
13172 2935 3287 2984 2357 1578 162 -1977 -3605 -3834 -1506 -646 834 1107 -605 -825 -138 395 -460 -2704
13154 -2704 -3708 -4387 -4803 -4160 -2702 -1896 -1743 -2352 -3676 -3933 -3975 -3589 -2399 -2614 -2913 -4612 -4719 -5089
13136 -5089 -4156 -2322 -950 -80 268 -350 -1623 -3151 -4861 -7296 -1540 -1102 2120 3858 4162 2756 796
13118 -1401 -3460 -4186 -3811 -1925 -845 772 2066 2403 1838 1126 619 254 301 273 308 385 1264 1361 1196 631
13098 631 -416 -137 335 1993 3710 4794 4722 3760 2600 1798 1719 1959 1627 968 -102 610 1111 1633 1691
13079 1691 1272 538 -175 -664 -907 -658 778 1384 2098 2109 1453 969 991 1371 2040 2403 2268 1719 947 110
13058 -468 -603 -998 -1497 -1455 -727 84 974 1288 805 -760 -2938 -4628 -4215 -3844 -3531 -2828 -786 1248 3747
13039 3747 5863 7174 3952 457 -3289 -5015 -2861 -1946 -3140 -3622 -1991 1547 4941 5798 4232 2525
13023 2525 1120 911 1167 1499 956 21 -235 -243 -427 -428 -1020 -1186 -1479 -1286 -895 -1272 -1921 -2016 -1837 -1290 -523
13001 408 1216 1721 1322 681 420 551 712 367 -468 -1039 -1342 -1473 -1363 -1263 -792 -296 460 320 1184 1080
12981 1080 219 -409 -971 -1966 -3206 -4390 -3255 8 1445 3005 3583 3722 3182 2827 2527 1599 -170 -882
12963 -882 -1502 -982 -1583 -2146 -2729 -3307 -2171 -787 -843 -677 -1293 -1923 -2828 -2144 598 3490 6061 7208 7702
12944 7702 7883 7009 5753 3786 2030 426 -815 -1398 -1152 -274 148 651 506 -245 -1567 43 2283 3550
12926 3550 4021 3834 2934 2451 2086 2685 3552 3274 1730 -813 -3354 -5371 -2725 284 1690 1008 -630 -2403
12908 -2403 -3585 -3843 -4145 -5527 -1800 -7 1447 1968 1441 813 2382 4191 5389 3824 2153 224 -1672
12890 233 3391 5712 4683 2851 650 -1252 -2308 -2211 953 3276 4819 6522 6550 5824 3846 1988 39
12872 -1338 -1765 -2120 -2657 -3092 -2933 -1518 -586 113 984 177 -825 -1401 -878 -35 -677 -1943 -3164 -3712 -3046
12853 -3046 -2226 -1125 -219 -213 -679 -1335 -1334 -1329 -1164 -1216 -1099 -1437 -2123 -3386 -4264 -5698 -5575 -2655 -1147 -913
12833 -913 -1612 -2348 -2971 -1625 143 1236 1381 510 -100 -319 138 628 824 478 58 -30 596 1059 1140 1311
12813 1311 952 449 -385 -1028 -2599 -4313 -2194 -149 1483 2019 1566 -148 -1135 -1642 -903 8 920 1683 1860
12794 1860 1538 1842 1713 1205 764 513 -18 -374 -274 253 589 158 -428 -1243 -1995 -1364 -444 -520 723 322
12773 1431 2445 3151 3440 3353 2648 1995 1880 2460 2104 1434 575 330 874 1605 2777 4008 5823 6751
12755 6751 7421 6677 4332 2734 729 139 1821 2831 2592 1992 825 40 -47 12 339 682 986 906 827 436
12735 436 -115 -847 -1625 -2129 -2418 -2691 -1706 -1026 -1587 -2207 -3482 -2087 -117 1205 2243 1714 686 -415
12716 -1669 -2123 -2050 -1231 -457 324 95 0 -274 -722 3111 6598 7229 7621 5734 1415 -636 -1994 -2300 -1382
12697 -1382 541 1742 375 -1637 -3029 -3721 -2794 -1231 219 399 -8 -509 -1093 -2404 -1027 2026 4359
12680 4359 5837 5218 3154 363 -2820 -3187 -715 1525 2708 2538 1508 194 -1423 -2356 -2871 -2841 -1003
12662 -533 -965 -1419 -1265 -507 528 987 1646 2184 2770 3100 2811 2382 2172 2219 2320 2846 3156 3563 3941 4442
12642 4442 4854 4684 4137 2925 1251 -146 -1117 -1759 -1613 -1393 -1628 -2261 -3210 -4065 -5540 -6205 -6270 -2145
12623 538 1439 764 -1135 -2882 -3343 -1940 -226 111 -557 -1094 -1018 -878 -1090 -2341 -3079 -3636 -3482 -2487 -1899
12604 -1899 -1138 -293 380 776 1181 2259 2651 2914 3462 3460 2986 1961 875 -210 -1984 -3228 -4120 -3836 -2073
12585 -2073 -602 54 -51 -954 -1957 -2913 -2405 -2078 -1408 -499 699 1366 1608 1368 1138 588 -502 -1547 -1946
12566 -1946 -1356 -120 1180 1537 734 -458 -1649 -1669 -856 -874 -1171 -924 -160 591 812 1282 1826 2217 3403
12547 3403 4531 5777 5342 4212 1874 -639 -2537 -3679 -3875 -3452 -2957 -2817 -2541 -1778 -1302 -701 -206
12529 -140 288 1225 2514 2754 2274 749 -651 -508 173 442 259 -81 -160 -255 -735 -1294 -1692 -1195 -37 1247
12508 2195 1584 154 -1628 -2575 -2618 -1842 -472 808 1519 2429 2046 1754 1450 2085 3242 4369 5278 5693 6452
12489 6452 5100 2009 93 -1074 -1815 -1743 -6090 -3521 -2914 -4099 -5532 -6723 -6447 -3375 -1722 -678 -445
12472 -445 -976 -1889 -2795 -3139 -3152 -2910 -2651 -2361 -1052 -39 973 1571 1704 1467 1517 980 243 -484 -1695 -2082
12452 -2082 -1695 -857 -637 -1317 -2837 -4202 -5978 -3333 -310 725 987 131 -1165 -1921 -2143 -2764 -3502 -3886
12434 -3886 -4084 -3132 -1610 656 3270 4874 5071 3930 2928 1889 1641 1902 1418 1229 1373 2125 1580
12417 1580 1198 792 416 1159 2018 2368 1799 356 -1206 -2882 -3777 -4081 -3514 -1722 -580 -1208 -2605 -3520
12399 -3520 -3993 -6168 -7337 -7236 -1751 -1098 -1087 -1600 -1532 -1706 -1589 -1278 -966 -916 -1036 -988 -958 -322 755 1737
12379 1737 2199 2208 1835 1110 611 758 1584 2815 4638 5444 3954 1962 311 110 1223 1878 1829 963 87
12359 328 657 431 248 290 283 -159 -556 -301 857 1134 -279 -1755 -1296 -290 430 902 1668 2697 3851 4392
12339 4392 3739 2166 555 317 1723 2749 3017 2734 2181 1378 1337 1480 2377 3242 2885 2204 1127 128
12320 -1154 -2354 -3315 -2293 1141 3780 3899 2848 1896 2120 1109 791 -945 -1031 -2590 -2919 -3429 -3111
12303 -3111 -2129 -874 314 594 -142 -1340 -2604 -3700 -4102 -4288 -1084 1122 2189 2126 1101 -322 -1172
12286 -1172 -729 540 2071 3499 4886 5480 4522 2003 -887 -4956 -3611 -1223 824 1669 934 -21 -1093
12269 -1093 -1382 -625 949 3106 4746 5421 5474 5078 4236 2288 9812 -1473 -3455 -3325 -2681 -1477 -637
12251 -407 37 924 2205 4479 6957 9031 9420 7841 4141 -2311 -2547 -2528 -1839 23 1690 2512 2554 2227
12233 2227 1723 1638 1422 638 -729 -1795 -1484 82 993 1461 2106 6554 9367 10711 11587 6976 155 -546
12214 -1349 -788 1477 1821 1013 -46 -224 1728 2993 2339 529 -1633 -4136 -6780 -6613 -4993 -3979 -2577
12197 -2577 -1615 -255 312 489 547 989 1018 1562 1888 1741 1369 733 49 -299 303 266 33 -922 -1411 -1635 -687
12175 1094 3480 6433 7333 6889 4998 2171 789 1280 2558 3915 4802 5263 2923 1642 341 -778 -1599
12158 -1599 -1000 -1901 -3067 -3009 -2165 -142 1982 3402 3966 4423 5436 1899 1312 -331 -865 -920 -810 -554
12140 -554 -38 453 853 1020 528 918 741 940 604 -571 -420 -1163 -2132 -2715 -3028 -3001 -2860 -2175 -1294 -241
12119 1366 2032 1767 1337 1064 543 -461 -814 -821 -338 758 1826 2588 2228 2075 1945 1836 1752 2101 2217 2500
12099 2500 2656 2971 3084 2658 1776 -433 -2134 -5566 -4193 -2844 -2066 -1093 -658 225 1327 2588 3252
12082 3252 2654 1844 1559 2170 2699 2116 76 -2175 -4803 -5648 -2943 1942 5204 6292 4011 2197 523
12064 -344 -1191 -2660 -4770 -8290 -12900 -14266 -4516 -3063 -1597 -1988 -2226 -3182 -3592 -4307 -5537 -5040 -4872
12047 -4872 -5419 -3314 -3531 -2352 -1768 -1393 -1971 -3296 -3144 -3151 -3407 -3200 -3515 -3681 -2932 -1207 376 982 559
12028 559 -583 -2116 -3488 -4403 -1776 -864 -834 -890 -1023 -1147 -728 -227 408 584 455 74 3 30 458 -773 -1734
12007 -1734 -1938 -1383 -1130 -696 -434 -264 -322 -305 -121 455 510 -252 -371 375 985 999 1537 1144 1257 1444 978
11986 978 406 -742 -1907 -3133 -3980 -3800 -2144 -616 339 656 635 306 -382 -826 -1066 -917 -1022 -1002 -359
11966 500 541 -505 -1616 -2318 -2286 146 1200 1206 2083 1285 -30 -394 -564 -635 -111 2084 2730 2221 910 -831 -2698
11945 -2698 -805 1969 3264 3873 2848 884 -1055 -2698 -3681 -3002 -3385 -3884 -4521 -4472 -4013 -2862 -759 1378
11926 3305 4168 3319 1681 239 -610 -743 -320 171 879 1725 1094 589 737 893 836 913 1081 1539 2149 3060
11906 3060 1885 2952 2454 2246 3132 3911 3455 1967 -122 -727 730 1612 2199 2388 2063 1652 1268 395
11887 -125 -725 -1163 -712 -198 580 1717 2745 3054 2627 2107 1722 1236 1157 909 584 119 -706 -1085 -1291
11868 -1291 -907 -270 -90 354 615 713 -696 -53 416 243 75 -210 -916 304 1570 2037 2496 2472 1241 -1156
11847 -3088 -5255 -1692 1557 2344 1140 -97 -3314 -5340 -2078 193 558 -435 -1459 -2017 -1954 -991 -713
11830 -713 -952 -1202 -980 273 1177 1272 -128 -830 6876 -793 197 464 459 75 73 728 1349 1724 1623 1672 1698 1251
11808 1251 1528 2418 2556 2222 749 -1460 -3141 -4307 -4154 -3050 -691 1857 2715 1988 522 -227 -738 -996
11790 -996 -977 -1790 -2501 -2374 -1588 -437 -8 -165 -1092 -2813 -4106 -3514 -1649 -526 -328 -763 -1337 -1312 -682 794
11769 2292 3977 6137 8736 10769 11244 8685 2923 438 -623 -722 -170 -438 -67 1343 2638 3198 2934
11752 2934 2011 680 -218 516 518 282 599 1746 3043 3739 3449 2798 1639 301 -826 -1501 -1719 -1525 -818
11733 -818 176 11 -1090 -2372 -2775 -2430 -906 681 1737 2189 2100 1413 865 499 -237 -553 -523 -1339 -1663 -2971
11713 -2971 -2838 -2595 -2472 -1827 -1827 -2020 -1948 -1708 -1750 -2056 -2587 -3347 -2867 -774 481 797 56 -504 312 1090 1717
11692 1717 2191 1978 1643 1334 1024 1197 1496 2233 3054 4899 6348 5900 4284 2583 345 -1118 -1364 -1137
11674 -1137 -997 -1130 -1065 696 2423 2970 2200 954 45 -122 313 4 -2453 -4670 -5260 -4861 -4896 -4395 -4013 -3597
11654 -3597 -3276 -1933 43 819 381 -808 -1506 -1651 -766 553 472 -206 -978 -1438 -1869 -1652 -1253 -955 -252 2406
11633 3941 4433 3627 1949 148 -1708 -2967 -571 2213 3259 3587 3463 2665 1730 1756 1318 480 -86 -638
11615 -638 -236 158 451 574 692 578 178 -340 -561 -209 595 1414 2254 2757 3129 2945 2318 6145 848
11595 -384 -1877 -3519 -4204 -4864 -5380 -6651 -2676 -2918 -2839 -8278 -7257 -3324 -568 1673 2923 3626 3521
11578 3521 3028 2748 2975 3721 4791 5995 7166 8570 9372 11311 11570 10243 8024 1487 686 -244 -652
11561 -652 -474 937 753 -210 -1547 -1264 -1892 -188 403 1098 1757 2827 2688 2246 1429 346 -965 -1815 -2093
11542 -2093 -1234 730 1348 1000 473 -951 -1156 -1444 -1319 -1410 -1021 -263 301 484 271 -599 -1309 -1932 -2022 -1445
11522 -1445 -607 -4 -1002 -2169 -2939 -2462 -957 -947 -259 0 506 514 727 566 705 1005 1416 1219 1301 1507 1990 2190
11500 2190 2080 1705 2348 2273 2254 2582 2377 1674 1779 1821 1631 558 -543 -1133 -1450 -706 830 2669 3816 4208
11480 4208 4878 4430 -568 -1985 -2264 -1690 -487 -387 -1303 -1177 -1315 -1665 -2352 -2547 -2581 -1759 -599 854 1407
11461 1407 1895 2709 3314 3411 3049 2070 815 -1008 -2347 -3178 -1775 578 1841 1409 927 856 1375 1826 1904
11442 1904 1784 1781 2703 3334 3530 3063 1548 -545 -2509 -3194 -2394 -1397 -1000 -1239 -1764 -2233 -2467 -2066 -1802
11423 -1802 -2374 -3106 -2777 -233 1628 2911 2573 1141 -661 -1806 -1163 1172 3589 4278 3470 1582 -465
11405 -1326 -1113 -1147 -1501 -1894 -2355 -2442 -2458 -2091 -1367 -497 15 -125 -113 194 -955 -787 -896 -1173 -1973 -3072 -3630
11384 -3630 -3986 -3759 -2920 -1306 167 1291 1709 1463 193 -1794 -1873 -1197 -609 -199 879 2798 4658 5923
11366 5923 6598 2271 847 -977 -1418 -2304 -2351 -1778 -1141 -461 -587 -775 -1347 -2936 -4205 -1750 -4120 -3832
11348 -3832 -2622 -1018 -24 -94 -968 -1409 -1423 371 2405 4308 4712 3798 2149 744 15 939 2476 2596 2881
11329 2881 3556 3689 2669 1060 -1007 -1209 86 906 1046 852 633 219 404 1025 1713 1653 1226 309 290
11310 290 1744 3856 5162 8073 7685 7558 6453 2745 2000 1694 1983 3064 4372 4802 4356 2889 1095
11292 -1362 -3213 -4564 -7769 -2016 -1920 -2170 -2289 220 2907 5886 8193 8011 5741 2236 307 -841 -1441
11275 -1441 -2172 1009 2395 2840 3101 3234 2987 2581 2194 1702 1299 1369 1295 646 -517 -2004 -2896 -2882 -2015
11256 -2015 -1200 -1068 -870 -843 -767 -1428 -1584 -487 -787 -1863 -1466 12 1364 2321 2290 2063 1442 917 914 869 122
11234 -1189 -3813 -6405 -3806 -1304 832 2120 2215 1779 934 -434 -535 648 3200 4069 1919 -839 -3568
11217 -3568 -5939 -4549 -3032 -1704 -669 -522 59 1446 2965 4122 6963 8872 1763 -474 -2031 -2438
11201 -2438 -1258 -120 983 1732 1506 1140 526 600 -386 -521 -1397 -2156 -1778 -1457 -1088 -921 -759 -513 650
11181 766 -917 -2466 -4160 -4874 -4983 -5054 -4076 -3883 -3076 -3061 -3213 -2461 -983 1703 2831 2369 856 -692 -1736
11162 -1736 -1768 -2047 315 2028 3467 3924 3537 2203 352 -1250 -1005 151 409 112 -954 -2128 -3357 -2799
11144 -2799 -931 -964 -604 -59 1563 2493 4276 4348 3781 2945 2028 1648 1522 1104 -312 -3044 -4792 -4117 -3982
11125 -3982 -4355 -4262 -2672 -1390 136 1180 2104 2264 1734 501 -1418 -3083 -3581 -1676 754 2284 2082
11108 2082 963 -497 -1931 -2504 -1981 -1191 -1308 -2029 -3284 -2579 -2515 -2846 -2770 -2443 -2014 -118 1505 1247 -625
11088 -1739 -1877 -1610 -692 -116 563 639 1562 2640 3234 2356 868 -191 -1085 -2319 -2952 -2735 -1748 -352 334
11068 2691 2584 846 -58 -2818 -2682 -3166 -2269 -2131 -1942 -963 521 2245 2642 2117 830 -91 -604 -653 325 1034
11048 1034 805 1154 1067 736 1147 1732 1851 2297 2495 1994 1362 1006 2036 2872 3079 2545 1362 -1256 -3735
11029 -3735 -6008 -3014 -1786 -1707 -1198 -1244 634 3529 4762 4427 3324 1724 -199 -1671 -2376 -1408 -813
11012 -813 -1423 -2627 -4603 -8176 -10191 -9836 -3527 508 2761 3138 2156 588 -450 -280 1119 2761 4332
10995 4332 6096 6892 8590 11209 9212 7680 4784 966 736 88 981 1286 850 56 547 1935 3088
10978 3088 3436 3713 3672 2968 1788 374 -1011 -2091 -2006 -1648 -1772 -2015 -1355 -1555 -1108 -378 401 669 252
10958 552 1226 2280 2961 2541 1270 -131 -1676 -3073 -3269 -3315 -1956 -1325 -1070 -891 -783 -1256 -2357 -2872
10940 -2872 -2180 -929 106 1679 2598 2152 1049 383 -456 -1065 -867 -408 -11 -549 -2276 -2730 -308 1781
10921 1652 696 -961 -2115 -2484 -1751 -1294 -602 -635 -852 -1393 1406 2647 3167 2885 2155 1252 683 460 76
10901 -5 131 848 1953 3582 3173 2229 1459 1276 1731 1929 1355 344 -246 2817 4915 5478 5019 3756 2549
10882 2549 922 -700 -323 -1029 -2583 -3166 -491 2738 3742 2824 342 -2111 -3677 -3635 -2086 -411 696 953
10864 953 -418 -1113 -1570 964 2714 3785 4646 4851 5028 4230 3533 2674 1360 309 -227 -375 -320 -269 -89 -23
10843 -122 -485 -612 -713 -923 -2024 -3339 -4635 -4827 -4333 -3522 -2552 -1978 -2474 -3002 -3391 -3551 -3725 -3458 -3319
10824 -3319 -2045 -1189 -1160 -1216 -1053 -15 2049 3427 4442 4848 4746 4255 3529 2465 1755 1808 2882 4073
10806 4073 4379 4361 3256 2193 592 -662 -1623 -1123 -1332 -1517 -716 1585 4765 7446 6930 3382 277 -2585
10787 -4417 -3439 -1809 -816 -1521 -919 910 1657 1209 -233 -1726 -2739 -2110 156 848 454 -991 -1132 -108
10768 -385 -1080 -1516 -2071 -3112 -4818 -5635 -4436 -7955 -8776 -8188 -7628 -6167 -3521 -1096 1129 2460 2950
10751 2950 3432 3119 2552 1521 -9 -825 -816 -1122 -930 1647 3304 3485 2141 425 580 1412 2445 2584 2314
10732 2314 2187 1518 511 333 234 -446 -1132 -2125 -2227 -65 1075 382 -1221 -2449 -1844 -379 763 797 91 -1318
10711 -2948 -4046 -3570 -237 1497 2202 2521 2409 2123 1569 562 -757 -2183 -3056 -3065 -2718 -1388 -518 178 460
10692 460 1021 609 -406 -194 -787 -1622 -682 1064 3207 5566 7650 7879 7662 4815 2928 1533 942
10675 942 219 -1382 -3902 -3406 1053 4846 7919 9855 9160 6605 1319 -1126 -2212 -943 948 2143
10659 2143 2326 1530 1029 77 -1858 -3219 -2736 -801 1339 2044 2041 2008 1778 619 -726 -1630 -1960 -1967 -2559 -3934
10639 -3934 -5268 -5507 -3633 -2081 -1323 -1601 -2141 -2431 -2597 -2365 -1282 224 847 873 662 605 696 837 1217
10620 1217 1833 1898 2373 1612 794 642 1998 3213 3587 2879 1646 105 -1391 856 1784 2405 2640 2276
10602 2276 1408 277 -499 -570 -642 -498 -346 -38 838 1869 2557 2081 424 -1254 613 2339 3321 2659 1061
10582 216 -1092 -2111 -1900 -880 876 1984 1651 489 -1459 -2309 950 5766 11135 14540 13501 11034 3181
10564 1656 1397 1241 1071 265 -244 -1316 -2072 -2481 -1014 1067 3006 4492 5219 4455 2785 1087 -479
10546 -1409 -1559 -1239 -759 -640 -868 -1641 -2144 -2160 -1186 -2868 -3064 -2727 -1583 -1853 -959 -883 -850 -1278 -1675 -1806
10526 -1806 -2131 -2526 -2649 -281 1535 2193 1139 1431 986 311 543 2230 4235 5836 5129 4163 2596
10509 2596 393 -1447 -2949 -3685 -3232 -2765 -1963 -751 -407 69 522 -4 -2504 -4590 -2527 9 2640 4460 4680
10490 4680 3717 1139 -1350 -2856 -3370 -2374 -1429 -79 1214 1864 2038 1922 1601 1214 381 -461 -346 213
10471 416 -258 -630 -2355 -2491 -697 1343 2602 2762 5220 3476 229 -3259 -3611 -2248 -773 -920 -726
10454 -726 -579 -178 -278 -786 -1801 -2576 -3251 -1170 1125 2901 4303 4161 3000 831 -1531 -2991 -1762
10437 -1762 727 1498 2109 482 -1322 -2576 -4204 -5041 -3591 -1280 1156 2765 2545 1689 -342 -3256 -6592
10420 -6592 -8118 -7309 -4575 -6352 -5379 -1935 -982 -888 -1178 -1468 -1043 203 1148 1346 1238 395 674 873
10402 873 885 534 -202 -767 -728 -24 1049 1982 1961 709 -656 -836 -209 -3 69 221 -233 -994 -1874 -705 489 865
10380 865 443 865 1 -1950 -2118 -6113 -2050 -1317 -477 305 1225 2018 2216 2006 855 76 -43 1482 2881
10361 2881 3040 2538 1653 598 -426 -639 -32 335 338 -463 -1484 -2128 -2183 -1282 210 1692 2986 4253 4895
10342 4895 4810 5326 2010 -848 -3484 -6169 -7285 -6873 -3974 -2333 -1579 -1024 -1047 -876 -515 -246 -216 -446
10324 -446 -564 -697 -639 -818 -1540 -2575 -3313 -3797 -3784 -2945 -238 2458 4048 3239 1102 -1072 -2019 -2052 60
10304 1342 2236 2310 1895 845 -348 -1268 -2096 -2489 -3144 -3034 -2607 -1413 -1421 -1491 -2552 -2626 -1893 -391 1660 3616
10284 3616 4464 4330 3007 1440 -81 -1020 -1797 -2156 -399 1738 3848 4844 4300 3314 1455 -723 -3004 -2917
10266 -2917 -268 1648 2511 2360 1815 434 -1375 -3053 -4050 -3500 -1782 138 1235 1147 378 -1009 -2823
10249 -2823 -4576 -3830 -1863 -99 1418 2232 2063 1188 -1599 -2987 -2718 -3117 -817 -422 375 1135 1570 1915
10231 1915 2150 2589 2827 2523 1383 328 -737 -1143 -1705 -1387 -671 -1266 -1632 -1308 -1000 -630 -1336 -497 333
10211 598 -93 -691 -1185 -1072 -444 343 1138 1307 1676 1518 1882 841 -1166 -1364 -21 1360 3168 5413 8350
10192 8350 10328 10527 8473 907 2279 -2701 -5338 -2087 1942 3733 2992 1088 -782 -1944 -2498 -2942
10176 -2942 -3175 -3569 -3664 -3390 -4064 -6995 -9136 -8519 -6116 -1351 1018 1110 1653 2047 1880 1657 1474 2220
10158 2220 2607 2348 2162 1682 1420 486 -143 -569 -922 -1244 -1166 -246 683 1363 1712 1994 2042 1898 1592 1345
10138 1345 1002 1066 1500 1282 618 994 767 359 -318 -1488 -2772 -3541 -2095 712 2708 3613 2774 2327
10120 2327 2744 3231 3090 2223 1629 1280 2052 2567 2397 2598 2739 2206 1158 -300 -2508 -4091 -5486 -5850
10102 -5850 -5537 -4213 -2143 -392 585 1569 1920 808 -873 -1698 -1141 491 2281 3517 3855 3303 2191 831
10083 -257 -231 543 616 517 474 -161 -1334 -2962 -3878 -4835 -4753 -4437 -4057 -2902 -783 1247 828 467 -1140 -2240
10063 -2240 -3382 -6656 -10880 -8424 -2234 817 3674 5905 6686 4412 3054 1407 -67 -1145 -1688 -2973
10047 -2973 -3616 -3224 -1710 -537 786 1867 2791 4107 4885 4819 4994 4482 3861 3099 2015 -275 -1476 -2089
10029 -2089 -1998 -1544 -1040 250 125 2098 2742 1298 -835 -2057 -573 1440 2959 3706 3122 2084 524 -1052
10010 -2719 -4887 -6958 -7560 -2724 461 2526 3560 3092 1614 -95 -2032 -2950 -2656 -1952 -2274 -2429 -1211
9992 219 1962 2455 500 401 -1288 -1622 38 -1670 -1568 -2205 469 962 1234 1294 885 751 -526 -1168 -1574 -2413
9972 -2413 -3112 -3907 -3835 -2568 -263 2024 2607 2070 1657 899 -668 -1966 -3256 -4238 -2348 -1480 -871 -1366
9954 -1366 -1375 -1988 -1931 -1065 113 1114 1911 2509 2338 2243 1748 1487 1556 1532 1428 -223 -2171 -3951 -5141 -5876
9934 -5876 -4765 -3552 -2051 -772 -435 -701 -1510 -2917 -2525 -283 1107 1905 2130 2619 1392 -389 -1795
9917 -1795 -2661 -3170 -3907 -4446 -3671 -1245 1391 2644 2388 802 -1445 -2893 -4176 -3202 -545 486 84 88 1345
9898 1345 3257 4463 3190 1791 -184 -1298 -1366 -831 -48 905 1947 2383 2314 2867 3923 5109 5664 4655
9880 4655 3485 2311 994 -261 -729 -973 -1753 -2009 -1678 -1858 -1135 -1708 -2095 -1704 -1751 -1815 -1954 -1675 -1212 -235
9859 761 1146 -163 -566 -2264 -3721 -3551 -654 101 -688 -2766 -4972 -6237 -2743 -369 -211 -1633 -1973 -411
9840 1205 1777 1730 967 72 -801 -1972 -2484 -3085 -4050 -3386 -1979 -1858 -1182 -944 -1284 -2184 -2155 -743 -98 -612
9820 -612 -1717 -3411 -4974 -5038 -3817 -1134 -625 -1974 -4123 -4336 -3922 -2689 -3283 -4244 -3558 -1307 1490
9802 4450 6562 8048 9884 8989 2714 303 -1568 -1043 416 870 374 -603 -1468 -1859 -1546 -1096 -428 267
9783 1292 1977 2178 1850 1082 1168 1949 2723 3174 2491 1140 -517 -1197 397 2677 2073 2243 764 -2216 -3353
9764 -3353 -4205 -4212 -3753 -1914 -328 1040 1184 809 944 1014 936 577 351 680 634 1276 1849 2187 2153 2432 2823
9743 2823 2896 3374 4268 4818 3179 1536 -384 -1911 -3170 -3683 -3182 -2535 -2109 -2069 -2209 -1631 -597 815 1024
9724 1024 -159 -1553 -1415 233 1805 2573 2233 739 -1885 -1067 -1733 -2257 -1816 -198 1035 1123 952 106 -1072
9704 -1192 -1068 -1804 -2767 -3907 -4177 -3490 -2004 -751 1253 2936 2921 3207 3756 3912 5097 5964 5221 4249
9686 4249 4902 4767 4461 4298 3717 3156 2314 1557 661 72 -1450 -2933 -3544 -3587 -3464 -3041 -2538 -1353 341
9666 1675 3003 3921 3741 2414 959 1327 3203 4880 5002 3843 1296 -1779 -4320 -5942 -6746 -5515
9650 -5515 -3353 -1309 769 2032 2179 2059 1988 2323 3074 2842 1934 1191 -1153 -2276 -158 1476 2651 3364
9632 3364 3474 2846 1950 1073 414 -177 -500 -848 -1002 -775 -790 -1431 -1975 -1979 -1094 -1885 -2955 -4417 -4899 -3844
9612 -3844 -2016 -429 1257 2322 1458 379 -1368 -1779 -1849 -2038 -2486 -3688 -4901 -3605 -631 1639 2120
9595 2120 2738 1060 2306 -1107 -1097 -2841 -3776 -5681 -7765 -3776 -2277 -827 51 330 368 1490 3408
9578 3408 5529 6329 4191 1981 -186 -1423 -1780 -1862 -1700 -1838 74 2923 8455 14363 17688 20417 21292
9561 21292 23935 20351 10124 2397 -4815 -4366 -2273 62 1538 2090 1484 558 -804 -2377 -3666 -2962
9545 -2962 -1366 332 1697 1556 1145 749 -702 -1280 -696 -2 -471 -1282 -2696 -2793 -1870 -1040 -930 -951 -1153 -1913
9525 -1913 -2359 -2392 -2166 -1686 -304 873 2704 3645 2715 1585 1 -1399 -2028 -835 1098 3109 3539 3385 1965
9506 1965 -359 -1708 -3010 -1644 -917 -721 -257 50 1421 3447 5133 6293 7633 7753 7183 6551 5819
9489 5819 4086 2596 962 191 -842 -1588 -1931 -1351 -857 -548 400 1559 2310 1127 -1051 -2087 -4926
9472 -4926 -8038 -14567 -15780 -15408 -13059 -10494 -4940 1536 2267 1983 -239 -2732 1279 8701 14769 19285
9456 19285 19668 16192 8880 1586 1522 2708 1654 441 -1072 -1816 891 3283 3705 3691 3556 2642 2061 2215
9438 2215 2100 1124 -188 -1192 -2181 -3322 -3887 -2461 -647 1510 2672 2309 999 -1685 -3559 -3154 -1194
9420 2542 3095 2832 1393 237 -1601 -2707 -1281 -395 -39046 851 -398 499 1302 2081 1325 411 -24 -1406
9402 -1406 -2277 -3580 -3590 -2364 -1132 -768 -1583 -2570 -3340 -3809 -4702 -5716 -7404 -6901 -5053 -3757 -2049
9385 -2049 -1056 -1189 -2152 -2925 -3435 -2753 -2421 -2639 -3195 -3557 -3567 -3085 -2791 -3387 -3095 -901 1278 1566 543 -1917
9364 -4253 -3546 -1920 -1292 -1152 -2077 -1094 252 1899 3865 4016 1964 -691 -1552 -1624 -2434 -3417 -4899 -5587
9346 -5587 -3417 899 2839 3731 3693 3031 2130 1272 1083 1712 2315 2624 2509 2979 3967 6210 7160 6392 4532
9327 4532 2920 1100 -190 -141 1321 2963 4017 8586 6937 2105 934 605 541 331 194 1159 2408
9310 2408 3099 3303 2720 1751 719 -923 -2265 -2720 -872 1016 2824 4612 6453 5537 7610 7410 8347 7874
9292 7874 3376 -2292 -6729 -7102 -2955 240 2584 3480 2382 3613 2902 1168 -829 164 2540 2824 3372
9275 3372 4100 4393 4304 3894 3519 4305 4927 4359 3830 3407 3050 3203 2779 2489 1893 1779 1577 1109 -9 -699 -313
9253 527 1994 4147 6043 7576 9121 8883 9734 8237 3928 441 103 -62 -14 1591 2867 3308 2886 1526
9235 1526 403 5 719 1604 2089 2005 2223 2538 2322 2232 2603 3693 5930 9236 11431 9755 4940 2351 -293
9215 -2024 -2817 -2840 -2278 -2369 -2887 -2768 -1393 236 1408 2673 2629 1149 556 -917 -2548 -3017 -5974 -2923
9196 763 2014 2004 978 -97 -1447 -2068 -1417 -353 -72 -1141 -3772 -4418 -4191 -2973 -2701 -1560 -1027 -762 -438
9177 -438 95 -70 -1174 -1029 994 2601 4050 5830 5336 2761 959 59 718 2331 3717 5342 6339 5712
9159 5712 3167 1093 -1519 -3225 -2970 -1320 -471 -429 181 1098 2014 2538 3205 4461 8084 7859 6777
9142 6777 2723 631 -1088 -1834 -1457 -1026 -478 186 595 30 -818 -1475 -469 1245 1156 905 417 -483 -1954
9123 -1954 -3479 -4020 -4093 -4594 -4671 -4249 -3373 -1884 -467 464 1246 1756 2628 2898 2267 1228 1022 278 -961
9103 -1935 -2174 -1855 -2470 -3388 -3424 -3370 -3412 -2446 -2142 -1964 -1297 -380 -339 -1325 -3178 -7252 -3739 -995 780 1862
9083 1862 2609 1951 205 -1202 -1739 -1300 -138 1589 2156 679 -1080 -1269 -935 -1037 -854 -1078 -546 578 1309
9064 1309 1086 313 -705 -652 291 494 -139 -1955 -2452 -1872 -975 -168 -654 -1442 -2506 -3192 -2733 -2192 -1907
9045 -1907 -1865 -2458 -3347 -3756 -3746 -2242 -364 817 1175 1174 799 1107 1831 1796 1506 1095 11 -1012 -1439 -1410 -1269
9024 -1269 120 2422 3893 4163 3693 2225 505 -903 -2155 -2116 -1618 -1350 -1138 -869 -692 -1370 -1222 37 1085
9005 1085 1504 1915 2565 3228 3030 2559 2313 2377 2806 3497 3885 3787 3483 2571 1757 1235 504 -408 -779 -544
8985 -544 384 1100 1301 770 -244 -647 769 1426 939 7 -932 -1199 -618 -822 -1249 -2136 -3028 -3060 -1726 -168 1380
8963 2692 3328 3532 3508 2274 1361 403 16 -1195 -2789 -2387 -1759 -937 269 1322 2217 2709 2999 3233 3118
8944 3118 3214 3118 3453 3012 2052 349 -882 -907 -664 -234 187 85 -509 -1231 -1503 -1063 -965 -1042 -1200 -1485 -1324 -762
8922 -762 443 2044 3487 4605 9915 10046 10690 10122 8139 -1576 -5773 -8734 -10740 -9291 -2051 9 280
8905 280 -76 1171 4177 7676 10002 11133 9679 -1047 -4487 -3256 -539 1993 2695 2424 1192 184 -462
8887 -244 428 1538 2526 3190 2791 2107 1134 111 -1068 -1756 -1167 756 1635 2570 2731 1894 717 804 1780 2112
8867 2112 1547 646 -30 -214 1138 1752 2616 3249 3772 3361 2395 483 -524 -2438 -4015 -4592 -3811 -2078 809
8847 1897 2181 2173 2020 2253 2571 1406 -1818 -2217 -2143 -1836 -1982 -2045 -1197 1210 2489 2575 2505 2711 3380 3472 2726
8826 2726 1344 42 -115 118 1007 1964 2611 1979 524 -801 -919 -191 1059 1728 1755 756 -408 -1202 -1132 -530
8805 4 413 41 -1314 -3204 -5331 -6541 -6195 -4776 -4225 -3548 -2045 -1188 -646 959 1875 1861 591 -1415 -4180
8786 -4180 -5095 -572 1524 2255 2279 2073 2550 2147 2008 1304 -327 -1655 -2393 -764 225 690 1010 1195 606
8767 606 -842 -1997 -1307 -588 -388 -845 -1586 -2315 -2625 -936 346 346 -1664 -1026 -1721 -1279 203 1273 2384
8748 2384 3223 4263 3893 4083 4288 4308 3372 2324 326 -2213 -3718 -5016 -6044 -5812 -7187 -4411 -2966
8731 -2966 -3037 -3409 -3296 -1939 -10066 -8146 -7647 -7410 -6929 -16393 -20664 -7236 881 4662 6103 3373 3556
8714 3556 4287 3068 -11115 -16318 -10280 -8631 -5018 2525 3005 5619 5359 4563 1448 -240 -2243 -1566
8698 -1566 395 2876 2163 3429 -550 -2738 -2454 -6 141 -13 -42 167 1324 3102 5160 6192 5928 4359
8680 4359 1766 -810 -2443 -230 -321 443 633 -155 -1815 -2446 -2242 -1732 -1290 -364 1444 1841 -216 -3283
8662 -3283 -6126 -8076 -11748 -12087 -20347 -18959 -13889 -10390 -8508 -7543 -6112 -3943 -2594 -1778 -1735 -1521
8646 -1521 -1748 -2550 -1438 -507 57 -32 -526 -1546 -2149 -1791 -2766 -2754 -3030 -3566 -3793 -3907 -4188 -3405 -670 1132
8625 1716 1049 -604 -1700 843 2751 3442 2598 2262 1568 1499 1703 3453 4850 5456 5168 4041 2620 1392
8607 1392 677 1185 1038 -462 -246 989 1749 1924 1090 -597 448 1779 2188 1736 -322 -3243 -5030 -5089 -3575
8588 -3575 -1804 -107 1125 1474 1812 2285 2439 2095 1415 -97 -1574 -2304 -1490 910 2939 2569 -297 -3552
8570 -3552 -7729 -8438 -4843 -3284 -2408 -1445 -439 1058 3009 4504 6029 6239 4897 3454 1839 558
8553 600 1227 1390 1053 1878 2391 2423 2280 2165 3916 4904 5050 3819 2341 937 8 -556 -1498 -1437 -941 -226
8532 673 1126 651 -687 -2461 -3965 -4829 -5365 -4936 -1989 1740 4632 6955 6531 5162 3315 1207 -370
8514 -960 -1048 -1365 -1654 -2081 -1869 -1510 -886 -270 -287 -149 -410 -519 -726 -1963 -1568 15 1863 2877 3069 2633
8494 2633 1538 132 -1402 -2886 -3569 -3786 -3656 -734 2421 4573 6087 6827 7469 8593 4799 342 -2316
8476 -3849 -1096 1941 4217 4390 3212 281 -2659 -3727 -2349 -1580 -1019 1129 4450 6903 6567 6615 5396
8459 5396 224 -1167 -2431 -3449 -3112 -2536 -2913 -4520 -6970 -5568 -2324 -248 952 592 -930 -1946 -1747
8442 -1747 -1077 48 1714 3544 4257 3686 1643 -2612 -7850 -3757 1289 1273 1225 -925 -2304 -3382 -2661 -3706
8424 -3706 -4432 -798 7100 8041 10227 14482 17312 23757 30915 34759 44887 57800 60485 70574 77910
8409 77910 78872 73723 64209 54725 46671 39879 33726 29038 23094 17589 -12147 -10639 -5180 -3772 -822
8393 -1809 -2609 -3994 -942 5329 10611 13607 12298 12739 9812 10026 8866 2183 3058 2400 1500 255 -876
8375 -2166 -1007 393 118 -834 -1715 -299 1053 1463 1295 137 -1827 -3758 -4876 -5261 -4680 -3327 -2340 -1090
8356 -548 -281 335 589 -73 -843 -1553 -1477 446 1978 2061 581 -334 -107 764 1566 2093 1622 590 -412 -172 -305
8335 -305 -166 -144 -725 -1273 -2262 -3142 -2327 -776 545 245 -378 -1666 -1573 -1398 -1207 -1577 -1180 652 1833 2398
8315 2398 2186 1675 246 -856 -1131 -1074 -1286 -1294 -1285 -10 884 13 -1614 -2283 -1133 446 1311 956 44 -1010 -1445
8294 -1445 -1549 -1589 -369 250 911 1763 2319 2070 1619 711 -481 -1760 -3239 -4059 -3792 -2487 218 2219 3440
8275 3440 3202 2352 1867 2104 2807 3231 3335 2281 936 -484 -1434 -1829 -1727 -1488 -1136 -622 276 1316 2513
8256 2513 3609 3673 2120 -368 -2935 -3834 1361 4788 7943 9748 11150 10868 7682 2559 -1326 -4131
8240 -4131 -5679 -4746 -4738 -3650 -1437 679 1931 2580 2278 1935 1750 1931 1893 1183 686 -25 -328 -89 46 -94 -186
8219 -186 -124 211 1196 1132 -165 -794 -1992 -2666 -3149 -4198 -5982 -7086 -6704 -4201 -1676 285 993 163 -1775
8199 -4607 -6483 -4273 -1089 252 1649 1521 1391 2143 3416 4435 4710 4299 3217 1395 -1181 -1871 -2849
8182 -2849 -3223 -3272 -3738 -4352 -4352 -3082 -1814 -815 -584 -334 856 2739 4470 4279 2664 786 -782 -1838 -2449
8163 -2449 -2623 -2068 -372 933 1843 2354 2660 2558 2498 2542 2816 2936 3164 2706 3145 4333 5136 6993 9172
8144 9172 7567 2341 1093 890 2146 3337 3503 3699 2326 849 -811 -2163 -3807 -4684 -3061 -1312
8127 -194 4 -804 -1903 -2785 -3684 -1349 -29 1636 1336 239 -927 -2385 -3777 -4936 -5008 -4851 -4792 -5161 -4811 -4277
8107 -4277 -3148 -3007 -3239 -3859 -3885 -3513 -2693 -1939 -1096 -663 -499 -440 -876 -1630 -2607 -2355 -2852 -900 1427 3151
8087 3151 2810 1591 -1289 -2852 -3148 -927 250 -189 -1506 -1840 1159 3293 3576 2605 481 -946 -1855 -2155
8069 -2155 -2040 -1407 -201 1049 1564 1384 693 606 -209 -207 -648 -216 -114 -130 -386 -695 540 2459 2806 2611
8049 2611 1630 1416 2448 4289 7217 8283 7876 6245 5123 4468 3533 3260 2083 602 -1214 -1860 -2620
8032 -2620 -2858 -3805 -3724 -2386 -681 -686 -1950 -2005 -1657 -953 -357 -96 708 1950 2594 2013 161 -1721 -1692 -264
8011 671 1197 783 -603 -547 563 1250 1586 1715 1796 1393 601 -344 -797 -774 -1777 136 636 -792 -2467 -3289
7991 -3289 -5111 -4653 -2857 -2655 -2790 -2717 -3437 -3842 -4664 -3209 -800 262 -357 -2407 -2600 -1134 1037 1540
7973 1540 1369 150 -507 -775 -508 -617 215 643 -135 -1569 -3044 -3958 -2921 -931 -184 -716 -2691 -3592
7955 -3592 -3228 -1882 -630 -1299 -2343 -2379 -2928 -2647 -2445 -1354 -1158 -538 -1944 -3179 -4168 -3090 -173 828
7936 1799 1337 943 746 498 -489 -1858 -1729 -131 1755 -1180 -1023 93 432 294 1337 777 -488 -1128 -1199
7917 -1199 -526 436 969 286 -817 -1932 -2129 -1944 -638 1234 2167 1896 757 68 67 1516 3449 4624 5103
7898 5103 4764 3513 2226 1247 -272 -1369 -1270 -173 1511 2122 2423 1819 2071 933 -662 -1147 -617 -981 -1179
7879 -1179 -1363 139 1657 2620 2633 267 -1830 -3823 -4283 -3418 -1686 -495 1923 1716 1601 704 -17 -324 -1915
7860 -1915 -4256 -7061 -9934 -12159 -9081 -5380 -3526 -3244 -859 1368 5456 7104 8864 8853 7563 5404
7844 5404 2133 863 -2501 -1890 -2605 -2545 511 4496 7573 9456 9938 7070 11020 6750 9046 9113 3261
7826 725 -1377 -3233 -4480 -5807 -6278 -6410 -4335 -2434 116 1741 2509 1307 386 772 504 1992 1859
7809 1859 1472 986 686 -202 -888 -924 -90 802 1117 903 76 -1073 635 3711 5275 4566 1305 -2644 -4499
7790 -4499 -4437 -1342 874 2661 3204 3309 1251 -1683 -6772 -8872 -9921 -6112 -2797 -813 727 -8266 -2208
7772 -1964 -1371 -2700 -4716 -5417 -9332 -10747 -7981 -3859 -1820 -247 860 1887 2308 1572 1725 2128 1955
7755 1955 300 367 2568 2313 2589 3406 4323 3635 1766 -530 -2086 -4517 -6256 -8084 -12585 -7979 -6670
7738 -6670 -5273 -3996 -1750 259 2988 4718 6091 5586 4717 1910 -543 -3501 -3736 -1127 943 1207 154
7720 -1371 -2604 -3777 -4555 -4478 -3772 -2380 -1706 -1976 -798 66 -2489 -3561 -4218 -2200 -11 481 -275 -1399
7702 -1399 -2286 -2738 -2485 -2727 -3294 -4488 -6131 -6578 -6155 -5138 -4556 -3391 15 3055 5286 5989 5431 4842
7684 4842 4579 2383 -912 -4846 -1497 11434 22627 33353 38911 44299 43410 37311 28528 17944 12395
7669 12395 6946 1807 -1718 -618 -36 57 835 1124 2420 3480 4355 5162 5428 6016 4013 2433 1629 936
7651 936 -115 -1386 -1436 -1209 -1294 -900 -2782 -1880 -1566 -1355 -921 658 1916 1541 625 -432 -1073 269 587 433
7631 433 -125 -742 -1286 -1861 -2143 -1839 -1147 -570 -353 -398 -509 -695 -685 -891 -1351 -1550 -1648 -1499 -348 1404 1885
7610 1885 1756 830 -1811 -1920 -1393 660 3408 5780 6195 4947 2823 727 -1186 -1948 -2820 -3337 -3724 -3772
7592 -3772 -2772 -919 -144 -264 70 4215 6515 8615 7856 4804 2709 680 -1170 -1852 -610 -716 -1581 -3228
7574 -3228 -4630 -5686 -6304 -2745 -757 787 1115 1489 1559 1241 1476 1921 1450 1090 165 -1012 -380 -551 -1313
7555 -1313 -1876 -1879 -1205 -191 1000 1003 451 -700 -1894 -3077 -3606 -3916 -3367 -520 2031 1431 1552 2076 2534 3133
7535 3133 2875 1119 -623 -1699 -1698 -205 1553 2588 3269 4018 3302 1442 -998 -3558 -5094 -5946 -5756 -4791
7517 -4791 -3752 -3208 -2981 -2467 -1218 -597 -562 -1337 -2444 -1767 -802 116 1139 1292 552 -631 -496 410 2627
7498 2627 3925 4496 3943 3083 1485 227 -1429 -3347 -4868 -4591 -376 3095 4502 4373 3104 1352 384
7480 1195 2679 3074 3370 2489 1082 -1384 -2375 -199 3179 3368 7201 4134 1546 -5490 -7669 -10570
7464 -10570 -10155 -6469 -4127 -3243 -3243 -4282 -3173 -217 -505 704 1049 710 503 -1026 -1990 -2860 -3002 -2370
7446 -2370 -1930 -1609 -1818 -3350 -4067 -1029 513 882 1711 466 -488 -635 569 1708 3400 4237 4107 2732
7428 2732 1502 1152 1829 1453 -38 -1494 -2379 -2496 -1592 -33 1979 1853 702 488 -2133 -1112 -2283 -3038
7410 -3038 -2508 -887 829 1922 1602 -40 -1972 -1084 -63 -1104 -3516 -7206 -11564 -5740 -2017 -1711 -498 -1013
7392 -1013 2850 7886 10300 10449 10003 9020 6333 4741 3039 883 -1078 -4007 -7246 -10278 -11905 -10329
7376 -10329 -6491 -2319 2528 5401 2842 1670 1057 -70 -304 -2205 -193 4080 9816 18594 27992 35315
7360 35315 23475 11940 10469 5828 -4205 13072 22399 17293 12388 -4342 -3726 5445 7675 239
7345 -10095 -14948 -5529 -2351 -3540 -5881 -4783 1178 14589 31389 51123 45279 8232 -6884 -3776
7331 -3776 50202 161795 288702 434645 530619 660175 677562 618707 496873 333344 169245
7320 169245 44978 89409 129913 119000 89651 49276 13608 -2922 -30342 -42528 -76270 -27300
7307 -17219 -17429 -7283 5515 11216 3771 -1276 3461 -8474 -3303 1426 935 -8319 -923 13396 18419
7292 18419 30642 21831 14296 17810 13645 6825 -1274 -3472 -262 4767 8103 6315 5099 4211 2987
7277 2987 2994 4970 6798 6857 -1917 -7831 -14908 -21304 -18903 -3149 12443 22293 21900 14687 10456 10890
7261 10890 12011 12586 12785 12032 9821 -248 -7095 -9997 -11722 -16852 -19515 -17468 -16942 -15240 -10485 -1348
7244 4055 8504 14028 19352 22600 17427 14723 6080 4505 -335 6326 20215 40907 63080 66329
7230 66329 72936 63685 14210 -477 -12940 7435 32947 31086 827 -20697 -37422 -16568 13731
7216 46486 62992 76059 65261 63187 64083 52169 47926 73745 105828 100940 91753 130325 188361
7203 188361 199842 196099 101465 -16913 88718 205605 388672 517524 577524 571654 732946
7192 732946 1430360 2514942 3744398 4959811 5807500 6132578 5890152 5158075 4114654
7183 4114654 2973329 1963079 1224032 742370 462025 221536 26258 125713 180535 191034
7173 191034 -26464 18609 -11108 -42850 -60433 -86373 -63390 14119 27187 63215 -5121 -1377
7160 -10698 26175 29682 6059 -12394 -26462 -5323 5017 20829 24315 28589 14197 -1442 -20847
7147 -20847 -32790 -37168 -35076 -31962 -26702 -23717 -20817 -14090 -5123 3643 927 -3100 3313 5540 -7921
7131 -18517 -23285 -27439 -23267 -29181 -23714 -21216 -5207 5808 6411 3938 1673 -1514 -2719 948 957 307
7114 3202 5603 6710 5894 -2212 -6663 -1088 896 10604 17828 34443 28010 29547 17269 12461 16312
7099 16312 16306 14586 12194 9859 -309 -3076 -3643 7221 12012 7995 12876 7730 4570 -2144 2710 10166
7083 10166 17575 20971 26697 13732 6013 -2772 -9075 -13804 -15506 -10441 -6314 1219 8782 14933
7069 14933 13441 9848 5657 -538 -4536 -1845 -3284 -3064 -1367 -2456 -1320 9679 29144 40651 28471
7054 28471 4101 -11506 -23725 58538 206462 383025 600038 806279 946981 994241 931718
7043 931718 788037 570780 380561 180168 96630 136595 152927 127577 75128 -116 -22804
7032 -22804 -11751 -24010 -37851 -5636 -13591 -9836 -11250 -3615 -1979 -11042 -5232 -9266 -7712 6079
7017 161 1628 -528 -649 4478 15211 16517 14961 15060 15721 14540 22196 20921 14511 7013 -1190 -9470
7001 -9470 -8212 -10465 -8020 -4459 1112 1238 -2076 -7220 -10789 -9882 -6520 -3320 -272 2832 4678 284
6984 1331 540 -4263 -6520 -2320 182 1744 2475 3802 2540 2379 1688 942 -1660 -1057 -333 -1829 -1793
6967 -1793 -1071 -693 -285 866 -1077 2811 4699 5739 -312 1134 -1396 -52 -61 -1466 -377 860 2338 4787
6949 4787 5355 3084 1915 2327 2289 3130 2777 1818 -712 -1161 -671 -612 -370 619 -1614 -205 238 1193 1187 1192 -185
6927 -1223 -1560 -2834 -3473 -3473 -3313 -3383 -2766 -2542 -2118 -1911 -823 -131 295 340 -619 -2684 -2946 -3399 960 3786
6907 3786 6907 5895 7226 6615 2211 526 -1597 -2894 -3377 -2567 3 2388 3655 3438 2140 564 34 789
6889 789 1212 1325 920 390 -395 214 734 -455 -2452 -4300 -4473 -5228 -4565 -2782 -1516 488 2088 2564
6871 2564 1771 590 652 1184 2464 2836 2451 1820 1194 1460 2426 2899 2465 3075 3137 -1137 -6548 -5922 -3921
6852 -3921 -2603 -1624 -2571 -3682 -3430 -3157 -3076 -1187 1804 2728 3126 3227 2810 2512 3052 3207 3646 3499 3076
6833 3076 2442 1218 703 524 -321 -1963 -3570 -2531 -905 966 2529 3436 4019 3356 1810 1019 2281
6816 2281 3482 4018 3836 1280 -858 -2574 -3670 -3917 -3446 -3057 -2964 -2440 -1675 -316 791 850 342 -144 -78
6797 -78 -360 -809 -804 738 2868 3258 3269 2827 1750 960 -174 -1455 -2686 -3049 -2574 -1550 -251 1061 1481
6778 1481 2012 1844 308 -1250 -2071 -2199 -2030 -1014 226 761 1068 1975 3283 4641 5399 4842 2783 1382
6759 -469 -1051 -1363 -1517 -1579 -1987 -2395 -3536 -4655 -6946 -1697 2049 4517 4923 4140 2216 278 -687 -1015
6741 -1015 -1015 -1647 -1859 -608 842 1167 805 -83 -492 -2277 -4376 -4736 -3879 -2670 -1984 -2329 -3162 -3419 -2611 -2757
6721 -2757 -3538 -4467 -3668 -2320 -903 968 1244 218 -1479 -2656 -2599 -2139 -726 688 1160 939 859 899 972 600
6701 600 1336 3376 3828 3759 4030 3306 3853 3835 3715 2617 1259 823 -21 -669 -1439 -1890 -1461 -41 1104 1448
6681 1448 -1023 -1079 -1989 -1795 1672 2252 -347 -950 -3511 -1812 -56 -1739 -4308 -6287 -13003 -11583 -6832
6664 -6832 -3588 2777 4409 4096 2155 -225 -2554 -4064 -3548 -1681 -425 275 345 -493 -110 967 1695 1821
6646 1821 1877 1230 313 -1147 -1891 -2656 -2295 -711 1310 1900 2338 1707 1144 1007 1083 1554 2388 2557 3207 3710
6626 3710 3762 3996 6135 4196 4694 5204 4548 3662 3043 2064 985 -181 -1023 -1699 -2142 -682 2317 2323 363 -1434
6605 -3884 -6978 -7923 -7128 -4499 -3207 -2779 -1842 -2312 -1526 -1240 -460 -94 -731 -777 -1444 -1679 -1102 1261 3385
6586 3385 3048 1440 -326 -1003 -345 -428 -917 -1837 -2204 -2847 -3886 -3765 -2737 -1814 -1452 -1960 -3215 -4468
6568 -4468 -1798 974 2557 3181 2803 1738 544 -357 -329 31 628 479 -178 -1107 -1151 -813 -411 -1275 -1299 -1666
6548 -1666 -1699 -2357 -1760 -1904 -218 2115 3026 2753 2632 1768 1502 1630 1772 2556 2843 2389 1576 167 -1820
6528 -2805 -693 1636 2316 2216 1180 -366 -776 -598 1028 906 1031 511 120 -440 -601 -963 -1278 -1854 -2440
6509 -2440 -3591 -862 260 57 -867 -2198 -2858 -847 1421 2930 2541 1655 1571 -166 -2037 -3812 -3770 -2830 -1925
6490 -1925 -1110 -845 -750 -1486 -2562 -3207 -4374 -3167 -3060 -1915 -2000 -2921 -2963 -2652 -1889 55 1017 1108 677 -324
6469 -1567 -2682 -3757 -2521 -2880 -2773 -2655 -2393 -2010 -1303 369 1778 1850 610 -879 -2422 -3686 -4392 -4082
6451 -4082 -3408 -2415 -1401 374 2474 3520 3101 2117 367 -583 -76 347 836 595 1127 1834 2747 3231 2306
6432 2306 564 -1437 -3102 -4628 -4778 -3624 -2020 -396 917 961 660 -809 -1699 -2549 -3291 -3822 -3409 -1916
6414 -1916 -474 1138 2075 2691 1662 -606 -2912 -3945 -5454 -2076 -2150 -2111 -3115 -4280 -7308 -4569 -1800
6396 901 2542 2483 1475 681 415 326 28 -248 672 3813 4203 2867 275 -2788 -3991 -1055 1828 3385
6378 3385 4049 3942 3930 3694 2750 2333 152 -1564 -3546 -3678 -1586 -729 -2956 -5233 -8145 -7234 -6878 -6174
6360 -6174 3568 1192 -1536 -3836 -5103 -815 904 961 -584 -1313 -82 749 1019 -117 -2890 -1116 -5493 -2270
6341 -2216 -1082 -601 355 2866 4416 5852 5786 3801 1175 -743 -633 2564 3337 1275 -1477 -2757 -3320
6324 -3320 -3650 -3956 -450 -4625 1744 1929 1912 1629 262 -1440 -2828 -2871 -3755 -1677 965 1922 2653 2435 849
6304 -721 -5359 -8005 -6620 -1010 1333 1531 -594 -1939 -4803 -5302 -6555 -6152 -6518 -6769 -6497 -5894 -3275
6287 -3275 -1501 -618 -209 -800 -1557 -1697 486 2890 3216 2315 -2089 -4553 -5339 -4845 -4811 -5083 -5442 -4840 -4077
6268 -4077 -1913 906 1835 1272 202 -364 -1755 -3208 -2655 -1761 -1454 -2258 -6357 -7015 -3021 -1363 -1118 -428
6249 -183 -1384 -1141 -1226 -983 -743 103 985 1651 813 167 -1332 -3480 -5366 -8079 -8384 -6622 -7772 -9199
6231 -9199 -11924 -14103 -14589 -14166 -12649 -8925 -4968 -1507 559 1122 -346 -1441 -146 -779 -909 -1016 -1330
6214 -1330 -805 -409 -35 179 535 990 1303 1786 2045 1135 -1246 -3862 -5254 -3613 -1815 53 1726 2334
6196 2334 2444 901 -301 -3641 -3835 -5461 -4536 -3244 -1540 -660 411 1183 881 -594 -3177 -5517 -4243
6179 -4243 867 4205 6547 6674 7885 6488 740 -1141 -3876 -5054 -3617 -2012 -1420 -2925 -4771 -5463
6163 -5463 -8598 -10058 -10228 -7939 -6580 -4988 -2367 1376 3348 4310 4961 3779 2917 1236 -469 -1875
6147 -1875 -1658 -2155 -3381 -2895 -1926 -2289 -3382 -1755 -1085 -177 1498 2642 3416 2535 2432 834 -2782 -3068
6129 -3068 -800 -536 -976 -3511 -8144 -10257 -10229 -7475 -4696 -3154 -3079 -3885 -5475 -7598 -9072 -8953 -6794
6112 -6794 -4832 -3779 -1613 -4790 -6436 -9560 -12652 -13567 -10228 -9095 -7673 -7149 -6416 -3045 -1151 -161
6095 -688 -339 -2793 -4777 -5060 1975 11222 16028 30901 32319 30901 27224 13826 68 -3463 -3746 -6518
6079 -6518 -15372 -12238 -6584 -2604 -1150 -110 -715 -638 -287 454 1707 1257 1993 2832 2861 1413 32 332
6061 332 844 1087 1097 843 342 407 694 567 -270 -2931 -4184 -3213 -2558 -2401 -2214 -2701 -1238 34 1078 705
6041 705 -28 -2511 -3435 -3816 -3632 -2955 -2266 -2589 -3291 -2783 -227 1005 1245 1430 1915 579 -1039 -2485 -2784
6022 -2784 -1953 -3103 -1622 -1007 -1687 -316 -2244 -4596 -5202 -2246 181 216 -1344 -3233 -4985 -2861 -307
6004 1470 2606 3757 3353 3612 3220 2701 2662 1964 43 -1472 -1041 -334 44 785 1191 498 -599 -2539 -3688
5985 -3688 -4732 -5488 -5065 -4247 -3666 -3544 -5783 -9083 -10957 -9068 -5768 -3910 -3771 -4466 -5919 -5306 -4125
5968 -4125 -1456 1966 2655 2377 1902 756 -273 -1366 -2644 -3609 -4178 -4157 -2581 -1634 -2104 -2519 -3207 -3344
5950 -3344 -3420 -3418 -4085 -4899 -6088 -8117 -5082 -1467 3664 9383 14069 12904 14932 14109 10065 7365 4461
5933 4461 3140 1257 -721 -2481 -4276 -5587 -4381 -1373 -483 -1654 -2722 -2069 335 299 -2323 -4486
5917 -4486 -5184 -5615 -4555 -4404 -4834 -5528 -7071 -7716 -7882 -6464 -4534 -3188 -1909 -1143 -809 -1454 -2579
5900 -2579 -3037 -1755 132 635 -381 -696 -2621 -3758 -4280 -3774 -2505 137 2463 4184 2965 413 -1814
5882 -677 2515 4269 5150 5011 3720 2119 464 -200 712 3327 4606 5937 5580 5350 5345 4768 1889 -1347
5863 -3341 -2361 -922 -725 -853 -1265 -1705 -1879 -1329 -1210 -1713 -3282 -4502 -6545 -8969 -10968 -8206 -2454
5845 2015 4314 4980 4544 3238 2877 4709 7631 9497 9196 6062 3384 4374 4726 5926 6054 5410 1850
5827 -753 -2777 -2306 -1775 760 3185 3966 5540 6144 5895 5611 4963 4402 3951 4083 3614 3206 2520 1738 103
5807 -2275 -4491 -3448 -2312 -315 -1301 -3515 -14032 -18474 -21684 -22613 -23343 -21921 -19330 -17306 -16758 -16157
5791 -16157 -17923 -15854 -15054 -12709 -10458 -4512 -78 949 -151 -2063 -3553 -2815 -1187 -477 -1167 -1990 -1251
5774 -1251 -1283 -1276 -1811 -2822 -3447 -2706 -458 615 2062 2091 1833 846 -949 -4091 -6717 -7686 -7103 -5544 -3346
5755 -3346 -1565 -1449 -1979 -3075 -3686 -3664 -2657 -2867 -3230 -2804 -1991 -1431 364 -357 -1776 -3506 -3182 416
5736 2244 3557 1562 -747 -2630 -4224 -5287 -6358 -5134 -2156 -238 498 515 426 490 1443 1832 1452 2116
5718 2116 2439 2550 2898 2788 2402 943 -285 -965 -1446 -1462 -1736 -1128 -134 548 1204 1208 232 -1229 -3198 -2904
5698 -2904 -288 3097 5885 6735 6388 5568 4812 2483 -1032 -2039 -1826 -451 364 66 -714 -1364 -1771 -1746 -2265
5679 -2265 -1284 784 2658 2513 2487 740 -230 -1000 309 1859 1811 1629 560 -140 -802 -1499 -2282 -2683 -2760 -2057
5659 -2057 -666 95 838 671 -48 -1554 -3149 -3667 -1610 577 2498 3026 2573 1181 -657 -1452 -337 878 1093
5640 1093 275 -1779 -766 1584 2668 3146 3039 2975 2483 1755 1647 2484 2873 3067 2000 2076 3668 7438
5622 7438 7805 4209 -229 -5221 -9414 -4366 -675 1225 1517 1342 1294 2112 2982 3162 2371 867 -1170 -2738
5604 -2738 -3877 -3309 -1731 409 2275 3573 4588 4480 3802 2577 805 -898 -2647 -2638 -2327 -1817 -1422 -352
5585 1462 2968 1890 -247 -3494 -2172 2170 5560 4918 1497 -676 -4190 -5760 -2433 -1539 -2485 -4091
5569 -4091 -5089 -4358 -3344 -2846 -2661 -2565 -2319 -3020 -3611 -2693 -1905 -400 1936 1545 796 -889 -1786 -673 1123
5549 3959 5090 3413 -1091 -2322 -7873 -12168 -4428 2377 8144 8520 3250 18500 4310 -3001 -8534
5534 -8534 -22459 -56687 -84929 -72434 -18688 -10204 -11569 -23378 -34382 -39604 -33565 -23770 -12164
5521 -12164 -7848 -1547 -84 1155 -1175 -2684 -3010 -2440 -2262 1129 -2173 -2098 -363 274 -3710 -8721 1954
5503 4836 -2545 3395 2792 1422 992 -272 -1313 -2714 -3525 -5387 -5822 -6203 -6173 -5735 -4679 -3173 -2358
5486 -2358 -2106 -1356 -330 796 1241 1480 819 1012 163 -811 -2358 -3067 -1886 -1202 -898 -1174 -1514 -2508 -3070
5467 -3070 -2737 -192 3078 6213 -104 -2101 -2336 -2147 4153 914 -151 901 243 126 -167 -20 -1091 -2631
5449 -2631 -3769 -2520 -1919 -2516 -2598 -993 1096 2639 4305 5620 5886 4366 2302 -610 -2019 -3727 -5068
5432 -5068 -6029 -7530 -6392 -3674 -4515 -4238 -5245 -5431 -3810 -2485 -586 1156 2238 3020 3180 2301 207
5414 -1943 -3926 -2328 393 3341 6880 11045 11317 9617 4035 572 -1296 -2163 -850 1503 2204 2416 2860
5397 2860 659 -1468 -2559 -2751 -2915 -2777 -3352 -3524 -1742 193 -90 -645 -1329 -2510 -3276 -4709 -4550 -4119
5379 -4119 -4154 -3746 -2859 -1741 535 2615 4358 6405 6406 5436 5163 4358 3281 2230 927 -507 -983 1153
5360 2089 2635 2248 287 -1495 -2151 -882 693 1095 233 -872 -2169 -2124 1123 3566 4868 4545 2986 -122
5341 -2636 -4978 -6646 -6628 -3966 -2540 -1427 -1930 -1031 -237 207 201 -297 -632 -1167 460 1121 1166 1191 898 717
5321 717 524 61 56 120 231 -43 -1671 -2579 -1879 -1265 -1429 -2287 -2868 -4405 -5357 -5139 -4198 -2759 -1186 -348
5300 861 1459 1079 2 551 3083 6602 8080 10712 9877 7951 1124 204 -1358 -1548 -687 -982 -2 -1650 -1144
5281 -1144 -322 -845 -1609 -1310 -698 1376 4186 6448 6516 4846 2456 -245 -2131 -3484 -3602 -2603 -1333
5264 -1333 238 1393 2618 2531 2657 2930 3213 4764 4142 852 -2362 -66 7888 12670 18627 20086 20485 16521
5246 16521 10958 2903 -1025 -2723 -3156 -493 1273 2379 4774 6370 4104 -327 -4734 -6998 -12936
5231 -12936 -4344 -4933 9717 12760 14020 19637 -2131 -7063 -11868 -45115 -41097 -33543 -11918 -7942
5217 -7942 -4598 -8910 -5872 -4674 -1557 1651 3299 3620 2941 2669 2038 1918 -87 -2292 -5091 -4663 -3738
5200 -3738 -2353 -1127 -1801 -2791 -5195 -9228 -14235 -12688 -10260 -9103 -6419 -916 -537 -3325 -1117 277
5183 3011 5445 7240 5578 4165 2800 2113 2985 2698 105 -350 -443 -653 -645 -918 -830 -1541 -1676 -1030 -1874
5164 -1874 -2672 141 2225 2315 -963 1257 -847 -1954 -3086 -3419 -4602 -2655 -1954 -3330 -4694 -5267 -5908
5147 -5908 -6158 -5205 -4440 -4579 -3132 -2825 -2212 -2392 -2217 -2697 -3376 -3184 -2055 -195 1135 1615 1826 1756 2181
5128 2181 1788 1251 709 -10 -941 -3242 -3510 -3039 -4124 -3976 -4908 -4653 -5681 -5795 -3271 -747 104 635 745
5109 745 1316 1047 -545 445 -1116 -1850 -2795 -4052 -4984 -4037 -1541 363 957 1242 1347 1959 3037 3487 3204
5090 3204 2749 3987 4861 4480 3046 1289 -46 -1620 -3281 -5000 -5795 -6048 -6185 -5787 -5912 -5450 -4662 -2450
5072 -2450 416 2645 3599 3530 2460 1067 803 1248 935 1101 1815 1702 1185 327 46 -593 176 1303 1963
5053 1963 2062 1454 1153 1558 1539 191 -908 -1911 -1490 -552 1453 3065 3982 3979 3224 1518 -44 -832 -949 -1199
5033 -1199 -1988 -2909 -683 1452 2437 2470 1372 630 331 -804 -2132 -2004 -695 182 -366 -1743 -3065 -2772
5015 -2772 952 3110 3270 1465 -701 -2140 -2465 -1710 -595 337 1224 1564 1038 -388 -2092 -2692 -2001 -1632
4997 -1632 -1719 -2255 -3107 -3702 -3876 -3181 -3287 -2503 -723 1201 2451 1846 1274 120 -1121 -1918 -1262 -1601 -2655
4978 -2655 -3307 -3013 -4142 -3921 -3216 -1661 -77 1202 2199 2748 2496 1180 2 598 2338 4044 5358 6843
4960 6843 4863 2145 -542 -2057 -2796 -3588 -3068 -1695 -768 -756 -1016 -81 1322 2739 3788 4254 3815 2490
4942 2490 1406 -135 -1533 -1555 1314 2530 2912 3096 3812 4222 4769 4196 3305 2851 2230 1850 1945 2486 2886
4923 2886 2664 1674 1302 376 1216 1775 2170 1564 889 489 840 1637 2719 3597 4325 3812 3445 2827 2279
4904 2279 1776 1522 1173 813 576 919 2113 2830 3576 4952 5969 6709 8669 8178 7372 5698 2945 -690
4885 -2913 -327 1719 1636 369 -1218 -1570 121 2079 3251 3496 2972 2469 2067 1458 726 85 -368 -492 -236
4865 739 1333 1460 668 -370 -1757 -2545 -1990 -1041 4 858 2012 3380 3578 2859 1571 -646 -2766 -4767 -6811
4846 -6811 -6788 -6904 -1961 1545 3156 3804 3586 2879 2543 1936 1754 1634 1779 1965 1646 786 -724 -1398 835
4826 4049 6082 5672 3312 1056 -647 -932 -172 1120 1742 1613 645 -964 -2860 -4733 -4753 -1935 114 593
4808 593 312 101 1038 2212 2379 2168 195 -517 -312 367 1120 2022 2826 3949 3963 3658 2105 1237 926
4789 926 1787 2753 4102 5472 7608 6319 2500 2134 1829 1627 1261 1251 1545 1849 904 352 352 895 1433
4770 1433 1351 868 333 218 562 1365 2004 1755 961 -50 -77 491 1256 2366 3235 4001 3772 3024 2185 1843
4750 1843 975 1296 1060 303 -783 -2055 -3745 -7795 -9844 -7992 -5292 -2787 -817 1777 3985 5276
4734 5276 4944 3880 2552 635 -651 -498 37 860 707 -792 -2416 -2063 -1331 -993 -1365 -2591 -3244 -4022 -5748
4715 -5748 -8558 -8558 -9273 -9159 -8271 -5428 -1726 1054 2485 2654 1347 765 309 -159 -82 851 1928 2886
4697 2886 2980 2346 1155 616 112 -408 -1053 -726 -875 -479 -651 -1132 -1566 176 1902 2813 3241 1100 -1270
4677 -3866 -5019 -3123 -1888 -1328 -1272 -947 -724 -605 151 600 252 -542 -1512 -2263 -3432 -3827 -5613 -1832
4658 -4882 -4026 -1559 -195 -457 -2653 -2411 -310 1367 2248 2198 1574 933 481 1141 3118 5608 7466 6946
4640 6946 5708 2600 238 -1426 -3026 -2325 -1332 -420 152 330 -50 -435 -1210 -2056 -1724 618 1838 1878 2433
4621 2433 2554 3233 3164 2754 2174 1085 -17 -827 -1102 -1525 -276 2069 5133 5331 5870 4687 3610 2492
4603 2492 -341 -2627 -3706 -5131 -7824 -10493 -13623 -10179 -3829 -2879 -2719 -2955 -3264 -4146 -4297 -3815 -2179
4586 -2179 537 3293 3767 3042 1585 -459 -2503 -4499 -2612 -69 1938 1824 715 -1471 -3189 -4721 -5319
4569 -5319 -5060 -4057 -3293 -3342 -4823 -4920 -5335 -6789 -4579 -4023 -3213 -1486 -1433 -649 -1786 -307 503 1340 2278
4550 2278 3390 4077 5805 5653 5569 6860 5177 1521 -12013 -11746 -11433 -11982 -4474 -1637 -1742 -3144 -3239
4533 -3239 -1981 -1307 -919 -107 201 -1087 7428 8960 3060 8157 8081 3172 1025 -989 27709 59008
4517 59008 98989 141761 178556 196342 202861 181037 142543 94794 51272 28779 31135 31767 25690
4504 25690 15903 7835 4382 -5709 -4826 577 -917 681 1153 702 1077 -1708 -7219 -7624 -3811 -2082 787
4486 5514 5569 6591 6611 503 -2044 -3055 -6951 615 5163 5463 7199 6138 3854 1293 -1634 -2607 -3132
4469 -3132 -2370 -2916 -4188 -5675 -5319 -4312 -2953 -3428 -4486 -4215 -3829 -2244 450 3000 4092 4300 1982
4451 -1398 -3708 -5249 -5045 -1627 582 1535 2246 352 -1539 -3052 -1356 -23 375 1447 878 1691 1535 1628
4433 1628 163 -140 557 1548 2048 2300 1459 1570 2756 1979 892 -573 -2509 -871 2016 3045 1627 283
4414 -1089 -2649 -2487 -4045 -1884 -973 -1535 -222 -299 -1249 -1488 -872 -546 -562 -809 -1191 -262 2662 5019 5104
4395 5104 4865 3391 2593 2060 1829 1772 2419 2617 1150 -1406 -4622 -5936 -6066 -4118 -3087 -3806 -1918
4378 -1918 986 2232 1637 409 -93 -369 -714 -1104 -1306 -651 1004 1196 116 -1208 -2624 -3536 -3479 -3407 -2717
4359 -2717 -960 202 724 392 -616 -1407 -1683 -1597 -1000 -44 290 206 -663 -1270 -1481 -246 1442 2862 3764 4276
4339 4276 3266 5149 5377 4829 3484 2547 2252 2708 3318 4043 4393 4027 3371 2000 -186 -2340 -1347 1387
4320 2872 2800 2064 528 -1050 -2387 -3195 -3279 -1863 -886 -659 -629 -809 -1246 -1529 -1630 -832 1085 1551 1137
4301 1137 821 523 726 947 293 -1050 -1797 -2202 -911 0 1271 1930 1041 453 655 770 -72 -36 -2013 -4310
4281 -4310 -5743 -6262 -6909 -8034 -1500 -296 -141 -831 -480 527 1340 2884 4133 3613 2715 2448 1881 781
4262 -428 -1348 -1585 -1250 -1425 -654 1384 3192 4139 4716 2659 852 299 542 -81 0 683 1598 2343 1783 -396
4241 -958 280 2777 5333 4758 3373 -138 -2709 359 3933 5338 6055 4415 2263 591 -214 -108 632
4223 1729 1424 -229 -2294 -3185 -3838 -2393 -1167 -987 -1174 -1430 -1322 -1643 -2207 -2897 -3129 -2674 -1595 -698
4204 -254 -211 -591 -324 956 1618 739 -654 -1900 -1563 1354 3330 3711 3309 2152 1253 662 994 711 23
4184 -1350 -2450 -2243 -1094 -482 24 -323 -1251 -2412 -151 3007 3963 5494 4208 2599 290 -2322 -4599
4167 -4599 -6442 -5987 -4160 -2700 491 3802 7265 8281 8013 3036 1177 -471 -2081 -4713 -5430 -977
4150 750 1255 481 -792 -2029 -2352 -2514 -2785 -3097 -3132 -2022 -2025 -1112 -696 -867 -2056 -3692 -4527 -5644 -7314
4131 -7314 -9201 -8240 -3079 455 2852 3148 2149 -307 -2391 -2143 -434 1299 2394 2544 1946 1068 809 1656
4113 1656 3080 3869 3590 2638 652 -2234 -1698 -788 -372 -295 -172 -358 -445 -1147 -1609 -311 1571 2444 3706
4094 3706 4291 4673 2641 -702 -237 245 -594 -2477 1881 2106 1898 -13 -401 127 939 1075 726 -541 -946
4075 -946 -1441 -1542 -1249 -1724 -2710 -3382 -3556 -3214 -2640 -2392 -2175 -1933 -528 213 267 248 -21 55 173 385 1176
4054 1176 1958 2069 1921 683 -683 -763 122 1279 1218 110 -1539 -3148 -4098 -4712 -2540 -694 -483 -1410 -2699
4035 -2699 -2230 -2079 -2825 -3422 -3502 -3236 -2724 -1752 -292 1009 1713 1603 1503 1730 2172 2517 2384 2281 1787 690
4014 -516 -1825 -812 648 1528 1630 1455 1616 2453 3330 3362 2250 1078 -105 -915 -838 106 1685 3423 6719
3995 6719 7568 2757 283 -1598 -2485 -3039 -2095 -618 -212 -1138 -1788 -2659 -2082 -358 1551 2253 2327 1995 1535
3976 1535 1665 1970 1537 921 870 689 783 961 2346 4872 6428 6702 5883 4063 2255 730 -802 -2236
3958 -2236 -3212 -4313 -4730 -4084 -3478 -2614 -1965 -1494 -981 -331 -282 -116 -574 -1258 -2202 -2833 -2553 -2357 -1734 0
3937 133 -395 -290 -293 -336 -1303 -2744 -2152 -394 1560 3433 5888 8191 7098 2330 -2479 -4426 -6454 -6992
3919 -6992 -8003 -8089 -6803 -5682 -4253 -2519 -1704 -1943 -3328 -4994 -5077 -4508 -2851 -1603 -822 197 2087
3902 2087 3976 6693 8453 4191 1712 -722 -2138 -2286 -2736 -3551 -4196 -5039 -5896 -5821 -5103 -3221 -2098
3885 -2098 -2079 -2343 -1524 -756 -613 -784 -2003 -1465 -521 -440 273 309 -246 -946 -1180 -649 -541 -325 -152 168
3864 804 733 52 -912 -1632 -1337 -1179 -1289 -1565 -1804 -1858 -1561 -1293 -510 315 2008 3985 6922 9191 9686 7321
3844 7321 3489 1490 -747 -2240 -3054 -3720 -4091 -4416 -5895 -6824 -6209 -1319 1692 3596 4296 3689 2718
3827 2718 1544 545 -430 -974 -41 690 1460 1336 650 -303 -1332 -1454 -1225 -735 -322 51 -17 14 305 432
3807 432 -76 -533 -887 -1193 -1681 -1855 -1649 -1272 -1533 -2384 -3635 -3703 -1994 18 1759 3315 3914 3838 2786 1643
3787 1643 429 -890 -1443 -1248 -1232 -1185 -1537 -1587 -1156 -341 524 1313 1449 -488 -1384 -1328 -1470 -1864 -1701 -1158 -476
3765 262 285 -832 -1823 -2952 -3440 -3494 -2666 -2559 -2251 -2136 -2278 -2359 -2578 -2542 -2573 -3072 -3547 -3541 -3084 -2616 -3102 -3224
3743 -3224 -1893 -172 255 466 427 313 -1047 -1583 -2060 -1354 170 1742 1890 1678 825 216 -27 1649 3206
3724 3206 4797 3569 785 -2306 -5358 -3639 -167 2828 3971 3748 2333 1374 1172 1363 1531 2015 1893
3707 1893 1472 841 171 -75 -94 -628 -1365 -1939 -2072 -1406 45 1161 1230 866 329 719 2098 2407 1214 2671
3687 2671 2075 4741 4421 673 492 -160 -1170 -2177 -3243 -30 2868 5191 6242 5548 2297 1107 458
3669 660 162 -958 -2506 -4062 -3895 -3257 -3100 -2731 -3618 -2720 -1746 -1093 -419 -183 -733 -1887 -2624 -2267 513
3649 2622 3779 4771 3978 2427 1182 983 1252 1686 1408 915 129 -279 462 1092 1022 1523 1406 1028 370
3629 -426 -1331 -2133 -3128 -3319 -3360 -3648 -3272 -3094 -2635 -2082 -2358 -2072 -208 1372 1956 257 -649 -1731 -2094 -2167
3609 -2167 -1611 -140 355 -260 -1988 -3668 -3291 -721 1981 3565 3867 3180 1702 1058 1309 2348 3646
3592 3646 4231 4684 4232 3092 2430 1504 207 -1599 -3366 -3312 -2395 -2144 -2449 -2827 -749 1403 3286 5519
3574 5519 5483 3486 1619 249 -145 -1444 -1697 -303 1254 1760 1576 1578 1524 1351 636 -567 -1576 -2457 -2835
3555 -2835 -3420 -3938 -1871 1531 4505 7012 6671 6368 4484 3617 2672 1402 88 641 2191 3377 4315
3538 4315 3882 2981 2441 1100 161 -901 -1797 -2490 -2590 -2963 -3112 -1917 -322 494 650 48 2228 1807 -656
3518 -92 1248 2433 3761 4245 3589 935 -1998 -2910 -2062 -21 2895 4947 3794 1722 -79 -1126 -703 -226
3499 643 763 660 447 72 -639 524 1484 2114 2024 1229 376 -224 -252 631 1653 1864 1269 562 338 768 1373
3478 1373 1572 1154 1189 1436 1875 2559 3104 3124 2370 1849 1894 1944 1941 2006 2210 2319 2144 1850 846 32 -663 -1782
3456 -1782 -1939 -1468 -552 306 582 470 -598 -2304 -4295 -5146 -3400 -1085 786 1594 1229 424 54 161 342
3437 342 659 1016 1102 1054 1302 2296 3200 4643 5099 4867 3936 2532 1831 1577 2148 2973 3201 2974 2169 1275
3417 1275 1606 1145 1175 1863 2208 2200 1631 804 -737 -3172 -6865 -9088 -8378 -7295 -4035 -2952 -2682 -3640 -5984
3398 -5984 -6193 -4222 -2084 -1682 -2342 -3360 -4515 -6040 -6172 -6014 -5814 -5753 -5026 -2852 -1006 769 1464 1794
3380 1794 1230 -111 -933 733 1019 725 1 -817 -2136 -1375 -607 929 1825 1333 556 -309 -913 -1126 -1119 -1251 -1498
3359 -1498 -2039 -2684 -2879 -2702 -280 -74 -211 209 561 482 376 85 -91 -879 -1891 -3250 -3334 -3165 -2702 -1590
3339 -1590 -379 77 -1199 -2325 -2615 -1731 -1382 -1744 -1837 -1541 46 2218 2110 1841 2458 3835 5634 7058 9545
3320 9545 10366 7533 1221 367 -220 -701 -1464 -1715 -1590 -1112 -590 520 1967 3011 3884 4443 3910 2801
3302 2801 1439 -118 -1583 -2165 657 2648 3364 2921 2331 1993 1850 1883 1604 881 1600 1446 973 197 -333
3282 42 1409 3366 5900 8008 8940 5573 3053 1178 38 268 1291 2130 2402 1233 -515 -1651 -2592
3265 -2592 -3334 -5119 -5772 -3037 -341 1750 2341 2508 1589 -101 -1124 -2405 -2744 -2978 -1575 -769 333 367
3247 367 -449 -625 -491 161 540 572 106 -752 -802 -2038 -2386 -1974 -669 938 3013 4801 5875 6309 5216
3228 5216 726 -1048 -2282 -2659 1308 3775 4459 4767 3598 3174 2154 1959 2074 2349 2427 2983 2477 877
3209 -1805 -2713 -2530 -823 -499 -690 -644 -298 -604 875 1177 1164 84 -1086 -1662 -1731 -1097 1148 3685 6067 7749
3189 7749 8313 7642 3582 1907 140 -231 2272 2570 2184 2168 2188 2224 2370 1721 1341 800 883 1828 2876 3405
3169 3405 3161 2533 1841 668 -576 -1892 -2342 -1163 544 2104 3503 4454 4127 2903 2294 2006 2008 979 218
3149 -254 -514 -593 -574 -812 -372 880 2098 3259 4089 4066 3427 2322 1450 759 -75 -786 -432 -457 -288 125 80
3128 80 -243 -942 -1301 -1527 -1274 -443 918 2295 2893 3143 2289 1467 1011 1518 2834 2849 1563 -527 -2474
3109 -2474 -2875 -998 1372 3112 3389 2462 3293 4888 5340 4707 3771 2726 1854 1381 376 -471 -700 95 692
3090 692 1323 1260 1221 1100 1498 1965 2268 2140 1707 803 -196 689 2642 3889 5367 5843 4676 3877 2390
3071 2390 676 -1121 -2259 -2460 -2498 -1809 -917 -343 -462 -256 -681 -110 707 2648 3839 3580 2557 790
3052 -1666 -4465 -7591 -7470 -2724 -1575 -1779 -2687 -3564 -2254 -327 1364 1937 2041 1062 780 1813 2104
3035 2104 1811 781 -1122 -3884 -5259 -3779 -259 1950 3452 3938 3562 2652 1867 1507 1196 1220 212 -806
3016 -1976 -2212 -1863 -488 751 1413 1740 1509 1382 1310 2305 873 1347 2211 3180 3521 3258 2441 878 -349 1394
2995 2886 3383 2171 584 -1900 -3627 -4723 -3860 -4083 -3441 -2799 -2187 -1880 -1703 -821 366 1533 2466 2920
2977 2920 2890 2215 1671 2381 3827 5662 7366 8524 6592 2528 297 -2133 -3822 -9877 -4585 -11430
2961 -11430 -8602 -6955 -3869 -2153 -1668 -2817 -3279 -3347 -2734 -2238 -2076 -179 213 -285 -713 -1188 -1579 -1707
2943 -1707 -1309 -363 1245 1023 -536 -1401 -1212 -285 905 58 -2274 -4350 -4134 -2842 -2393 -3226 -4417 -4946
2925 -4946 -4118 -3528 -3495 -2902 -2360 -2407 -2516 -3086 -2801 -1768 185 2653 3734 2051 -224 -3072 -5912 -8227
2907 -8227 -8918 -3740 -588 1143 2289 2802 2930 2654 981 -1364 -1025 -1183 -1616 -1977 -2335 -2301 -2195 -2165 -2201
2888 -2201 -2496 -2375 -1734 -1036 -545 -508 -199 216 1347 2704 3137 3024 2892 2175 2251 2452 2189 -55 -1559 -5090
2868 -5090 -9024 -11222 -13460 -13909 -13770 -3525 -1765 -1997 -2242 -2825 -1599 -439 -477 690 1892 2784 2525 1455
2850 1455 865 1006 1581 1786 1146 -215 -2227 -2596 -2151 -1230 -331 661 790 239 -793 -2280 -3741 -5017
2832 -5017 -5100 -3847 -3022 -2658 -2788 -2691 -1443 -80 1271 2178 3153 3756 3975 4210 4557 4497 3405 2248 1168
2813 1168 -152 -758 -1391 -1866 -2487 -2969 -4582 -6761 -7247 -6566 -1685 -268 -251 430 578 386 370 707 989
2794 989 1376 1804 1790 1110 1249 2449 3856 5055 5539 4858 4263 2770 1516 951 960 -4 -773 -1350 -1010 119
2773 1064 650 -30 -1767 -3399 -3673 -1725 673 1900 1942 1669 1597 2970 2373 1441 512 722 1939 2673 2522
2754 2522 1501 -146 -1473 -2349 -1216 3 488 618 857 3131 3050 1299 -101 -1707 -2759 -2893 -3510 -3780
2736 -3780 -3082 -1313 86 -228 -534 62 1782 4623 6159 7262 4124 2798 1846 835 143 -637 -1455 -2309
2718 -2309 -3472 -5268 -6226 -1147 -258 -545 136 -296 503 1318 1664 1458 602 -854 -1781 -1059 1850 4078
2700 4078 3808 1376 -1979 -5532 -7644 -7565 -3805 -3098 -2906 -2986 -3227 -3158 -1473 395 1583 2821 4457 6823
2682 6823 9917 12519 11971 3273 1151 -86 -1154 -927 -427 -1038 -1817 -609 1386 2085 1468 -658 -3414 -7086
2664 -7086 -3775 168 2441 3912 4088 3789 4140 4757 4681 3969 2836 576 -454 -1636 -1824 910 4081 5104
2646 5104 3996 3163 1422 -279 -2146 -3757 -3240 -1609 -757 814 1585 2247 2362 2346 1653 660 -366 125
2627 1906 2696 2248 1400 86 -331 387 1309 1075 -34 -1651 -3041 -2408 -329 2290 4579 5422 3459 1873
2609 1873 1301 1585 2587 2395 890 -22 -966 -1654 -1654 -729 1080 2924 4227 4652 4583 4063 3267 1875 1827 3773
2589 3773 4765 5924 7787 9404 9910 8659 5246 2481 -713 45 -288 317 -951 -1263 -869 -1079 -1082 -758 759
2569 2853 3719 3579 3221 1223 -483 -904 -1184 -1522 -2042 -2783 -2498 -987 477 1686 2594 2993 2756 1840 1069
2550 1069 468 980 1449 1350 968 359 -189 -127 622 799 756 -295 -1986 -2306 854 3797 6260 7186 6877 3286
2529 -362 -2427 -1300 811 1764 2025 1411 1137 1172 2214 3001 2697 2204 1095 -192 -162 1396 2503 3074 3207
2510 3207 2796 2121 1271 528 332 638 1558 2609 3762 4134 4023 3542 2658 1706 5 -593 1092 2989 4065
2491 4065 4486 3984 3011 1391 -561 -1410 -3241 -5143 -7755 -9252 -6947 -3349 -1253 -1016 -1881 -1935 -1297
2474 -1297 -1564 -2185 -3329 -4478 -5123 -5652 -4505 -3172 -1274 -281 562 1275 1509 1425 651 586 -219 -1507
2456 -1507 -2245 -2450 -2167 -1943 -1837 -1786 -1578 -952 -615 403 1110 1961 2078 1800 999 -215 -1684 -967 -1552 -2864
2436 -2864 -3050 82 1727 1852 468 -947 -1738 -1195 -811 -758 -1512 -2304 -2279 -1171 -244 -12 256 1011 1115 1858
2416 1858 1402 407 -1077 -3021 -4632 -5849 -3310 -192 845 -407 -2404 -3560 -5060 -3205 -2398 -1244
2400 -1244 -412 -274 23 381 1154 1919 2149 1591 928 542 246 -319 -764 -1368 -1397 -1230 -937 -410 464 1442
2380 1442 2239 2125 1584 966 195 -665 -172 728 1170 1060 -647 -2786 -4023 -3376 -891 737 1529 1658 2327
2361 2327 3108 3021 2177 1807 2205 2408 2471 2357 1710 577 -695 -2062 -1825 -896 -37 955 1335 2190 3444 4244
2341 4244 4480 4576 3752 2527 950 -547 -1432 -1425 -540 461 1879 2695 2707 1870 656 -547 -1252 -1789 -2198 -2549
2321 -2549 -3023 -3269 -3148 -2594 -2074 -1563 -1212 -415 -407 -1051 -1455 -760 -505 346 1374 1941 2199 378 -2132 -4686
2301 -4686 -2289 -636 -142 379 -377 -996 -1420 -1445 71 771 1372 2124 2539 2179 1595 807 -404 -515 -394 -120
2280 15 311 589 1111 836 -43 -612 -347 104 297 1819 2026 2452 2660 2953 2937 2688 2325 1724 1020 656 375
2259 375 1130 2239 3189 3780 3953 3772 2709 1350 55 728 2752 2278 822 -561 -55 1907 3484 4572
2241 4572 4510 3068 1160 308 -235 1132 1099 -1239 -3103 -4126 -3705 -2684 -802 1772 3848 3366 1722
2224 1722 -48 -1879 -3326 -4268 -4964 -5428 -4492 -5023 -4115 -4427 -3581 -3423 -1173 705 1417 1150 -101 -1311 -2483
2205 -2483 -3131 -2937 -1611 52 1282 1576 807 -35 -1090 -1815 -2709 -3308 -1340 625 2052 2115 1608 1313 267
2185 -879 -1883 -2189 -2249 -2169 -1520 -425 645 1344 1143 697 1295 1974 793 572 -213 -1429 -2659 -3592 -3361 -3004
2165 -3004 -2713 -2713 -2794 -3282 -2419 -2247 -2325 -2462 -2356 -2041 -2105 -2645 -2920 -2594 -1982 -2070 -2045 -683 1348 4114 5491
2144 5491 5561 2953 1084 -1386 -1433 -2108 -3153 -4129 -5878 -6695 -4707 -1157 1208 2322 1896 1115 217
2126 -492 -1449 -2064 -2411 -1890 -970 -129 176 -442 -864 -1067 -653 -193 75 -143 -1067 -1854 -2072 -1306 -344 76 134
2105 134 -948 -1413 -1387 312 2243 3418 3843 2155 1294 548 1761 2986 3329 1978 547 -261 -351 -469 -1063
2086 -1063 -1301 -2289 -3488 -923 2076 5043 6820 5161 3033 628 -548 535 2924 3531 2686 1407 40
2068 -1260 -2281 -1973 98 1311 1878 1433 870 -345 -739 -268 825 2024 3084 3116 2256 1385 951 1234 1272
2049 1272 769 578 -658 -952 -1450 -1842 -1743 -1644 -1077 -80 580 648 673 453 377 578 1125 1872 2877 4081 6420
2028 6420 6789 6313 4378 3368 2092 1318 1100 1465 2347 3503 4763 5646 7452 8689 8546 5418 4081
2011 4081 3202 2568 2466 2528 2322 1401 -134 -2151 -3620 -2285 -1165 361 -176 -163 -674 -1388 -1179 -1508 -2492
1992 -2492 -3762 -5351 -6975 -5654 -4830 -2472 -1755 -1136 -708 -199 -481 -780 -1464 -1858 -2401 -2766 -3373 -3796
1974 -3796 -3056 -1707 -578 -34 277 652 742 844 658 390 98 -1328 -5097 -3597 -2200 -490 -374 95 600
1955 600 1571 2940 3609 3088 1662 -231 -2401 -4112 -5043 -5868 -6403 -6580 -5904 -4756 -3351 -2570 -2568 -3473 -4345
1936 -4345 -4074 -2502 -722 1542 3265 3564 3142 2244 1405 323 -356 319 1168 1658 1633 1547 1341 1002 710
1917 710 384 -106 -876 -1447 -4119 -3623 -4066 -2898 -1799 -485 1073 2322 2981 1733 -406 -2770 -4732
1900 -4732 -6641 -5397 77 3795 5779 4626 1409 -609 -1791 -2203 -2126 -2120 -2833 -3422 -3197 -2658 -1550 -762
1881 -262 -1744 -3498 -3195 -1163 -1243 -1314 -1489 -1679 -2008 -2555 -2785 -2008 -1763 -797 -1003 -1214 -1823 -2448 -2746 -1524
1861 -1524 -305 105 732 775 932 667 36 -743 -1942 -3979 -3575 -845 638 1675 1740 964 35 -1364 -1555 -614
1840 1076 2441 3058 2781 1189 -1 -1027 -1347 -812 1228 2493 2357 610 -1861 -3838 -2899 1125 4589
1823 4589 6663 6956 6908 5044 833 -2884 -4469 -6781 -7108 -3899 -2200 -1004 -30 154 -35 -632 -1345 -1912
1805 -1912 -374 2319 4390 5277 6886 6996 7354 5869 2836 1655 596 -415 -682 155 928 1122 1178 1468
1787 1468 751 738 945 2586 3854 4026 2592 1361 437 249 -132 -763 -1393 -1354 -481 715 1706 1412 1476
1768 1476 2226 2292 2460 2089 1787 1132 1022 942 110 -1100 -2492 -2892 -2952 -2733 -3252 -2239 -1145 728 1657
1749 1657 2076 1126 -385 -1760 -2248 -1841 -1638 -737 -639 -1083 240 2372 3992 5126 6387 6099 6368 6380 3620
1730 3620 2690 2699 2698 1556 765 905 1713 2811 4204 5447 6585 6126 4667 3244 2155 2191 2164 1475 -474
1710 -2308 -4092 -6158 -6314 -4382 -2126 -176 1278 1174 316 -782 -784 -829 -348 -188 -379 -1428 -3340 -3943
1692 -3943 -5434 -6648 -6128 -3547 -2575 -3334 -2223 -1426 -838 -772 -619 -93 1260 2760 3904 5861 6885
1675 6885 5138 3402 1753 5 -1616 -3142 -4188 -4631 -4162 -2699 -1075 200 1114 1464 978 877 3310
1658 3310 3014 1206 -740 -1308 -2016 98 915 712 206 1070 2991 3194 3237 1666 -238 -1166 304 2566 3715
1639 3715 4068 3723 2752 1670 1159 2036 2531 2383 2264 1256 1026 1163 2351 3874 6455 6725 8965 9033
1621 9033 7813 2953 2015 223 -527 -1361 -2828 -4846 -6138 -8270 -3082 1532 2311 2486 2798 2438 1830
1604 1830 980 -115 -1376 -1546 -1372 -1420 -1827 -2294 -2397 -1649 187 2846 5693 5694 3903 2229 633 -751 -1704
1585 -1704 -1910 -2075 -2140 -1565 -636 -654 -889 686 2016 3913 4523 3716 1862 800 -369 -2826 -6485 -6731 -7116
1566 -7116 -3734 -4920 -13820 -13509 -10997 -8872 -4609 -2668 -1674 -792 615 2031 3029 2302 -538 -3433 -2586
1549 -2586 -356 -546 -784 -2483 -4680 -1497 1046 901 -469 -2590 -2902 -1022 1548 1605 -291 -1767 -2423
1532 -2423 -2588 -2327 -2449 -1982 -1108 -871 -1114 -1492 -1519 -1236 192 2280 3873 7193 4126 3373 2713 1346
1513 -339 -1244 -1848 -1254 -361 723 1391 486 -1169 -3281 -3124 -2042 -1542 -1201 -612 125 947 1398 1438 1312
1494 1312 1268 977 1122 1022 395 -391 -929 -718 380 2194 3814 5663 6769 9295 9859 9111 7152 2303
1475 903 260 614 0 -1097 -2574 -4262 -5599 -4617 -3336 -3143 -2466 -1685 -1407 -1848 -1577 -827 -408 948 1342
1456 1342 155 -643 -1485 -1926 -817 568 971 577 -239 -1407 -2385 -3145 -3022 -1992 478 2073 2602 2834 2245
1437 2245 1124 -649 -2284 -4374 -7646 -4703 -3804 -2751 -2563 -1405 -612 563 2176 2502 1659 -101 -466
1420 -466 -764 -1358 -702 -619 -788 -409 645 1806 2339 1961 838 -670 -2740 -5672 -5081 -3461 -2122 -1169 -446
1400 346 742 1014 816 213 497 1278 1524 1790 922 -666 -2477 -4813 -5901 -3421 -1761 -1429 -2042 -647
1381 1506 2426 1919 -70 -3086 -4651 -6051 -4997 -3514 -665 1945 2871 2964 2322 1154 53 -689 -1137 -1306
1363 -1306 -1669 -512 518 1592 1999 1511 893 174 -1071 -1017 -312 464 694 130 -997 -2431 -3766 -5003
1345 -5003 -5114 -4382 -2988 -490 2011 3913 5668 8371 4474 3576 2887 3311 3377 1398 -745 -2695 -3905
1328 -3905 -4475 -3565 -1719 -919 -975 -1851 -3252 -4400 -4941 -3738 -2419 -1939 -1956 -895 1531 3415 4716 5019
1310 5019 4102 2705 1180 560 583 1540 2602 3631 4340 4530 4370 3352 1756 -223 -1517 -2368 -1332
1293 -1332 1521 3554 4220 3757 2652 2535 3665 4139 5356 5972 7298 4292 1826 -1165 -3242 -3693
1277 -3693 -405 1116 2053 3172 4016 3756 2845 1899 1162 525 14 -609 -109 1326 2720 2739 2199 1426 9 -1708
1256 1026 3359 3541 1998 18 -1165 -996 809 1326 57 -1448 -3514 -5864 -4434 -4500 -4282 -4645 -3910 -4110
1238 -4110 -3809 -3339 -3527 -3166 -1574 878 3409 5469 6513 7467 7707 7050 3739 1500 -1147 -3414 -4645
1221 -4645 -6346 -3795 -1139 668 1126 772 -82 -179 50 577 544 854 820 453 -709 -2594 -4137 -5815 -7162
1202 -7162 -8283 -7053 -4784 -2289 1043 2363 3318 3165 2892 2271 1997 1278 470 -545 -1798 -1799 -498 63
1183 277 -93 663 828 1118 -84 -1807 -3640 -3527 -2505 -1856 -1088 -1062 -420 1110 2237 3266 3237 2612 1818
1164 1818 1164 481 -386 -1311 -1875 -1271 -823 177 925 1700 1718 694 -451 -1591 -2460 -2503 -2120 -1508 -889 -345
1143 203 1037 2312 3747 5767 6456 6782 5729 1797 756 -252 -1365 -2307 191 1919 3066 2512 1653
1126 1653 507 -1033 -1634 -2315 -387 2508 3660 2996 1757 1261 1445 2086 1905 1774 992 -100 -1711 -2979
1108 -2979 -3405 -2726 -1466 -902 -1405 -1955 -2360 -2389 -1779 -988 -401 -30 45 660 1056 1065 304 -1158 -2517 -233
1087 -1042 285 1428 3018 4329 3340 3370 1777 1332 -314 -1911 -3067 -3479 -2670 -1551 -542 595 2016
1070 2016 3387 4449 4645 3900 2185 369 -1276 -2139 -1595 179 1770 2682 3283 3031 2478 1810 1005 401
1051 34 118 -547 -1397 -1717 -1144 -700 -1583 -2650 -2520 -1879 -1747 -2342 -3664 -4601 -3698 -2107 -1316 -1020 72 397
1031 397 685 1635 2496 3522 3862 4829 3743 2272 322 -1588 -3742 -6572 -7229 -3097 -270 446 2345
1014 2345 1519 1701 1731 1773 2425 2698 2578 1787 822 -356 13 225 264 -1167 -3482 -2779 -521 982 2067 1937
994 1937 643 -1261 -2459 -2427 -132 578 -44 -1493 -931 -2175 584 2335 4618 5565 6916 5650 4216 2564
976 2564 1767 2098 2862 3576 3860 3174 1844 60 -925 -1209 -1762 -2388 -3085 -3345 -2920 -2040 -2039 -3445 -4845 -7067
956 -7067 -7245 -6597 -5710 -5255 -4470 -6178 -6377 -5416 -2370 -2191 -1857 -813 -277 419 1165 845 357 210 292 198
936 198 -270 -220 1096 2451 2486 1002 -564 -732 174 976 1316 548 -506 -1258 -1878 -2683 -3245 -3220 -2173 -779
915 965 2346 3010 2205 813 -761 -2034 -2476 -412 964 707 -244 -1121 -1566 -990 -646 -1088 -2089 -634 1568
895 2498 2239 1123 -485 -2000 -2148 -1837 -1525 -1991 -2670 -3064 -2837 -1015 457 1106 742 79 -3126 -4672 -6893
876 -6893 -4940 -3896 -3197 -2288 -759 1093 2904 3636 2565 1233 -1551 -3550 -8284 -2048 549 2029
860 2029 2570 1627 -19 -1119 -2715 -3560 -2802 -1557 -685 -719 -901 -149 -292 722 574 331 -42 -492 -992 -1371
840 -1371 -1626 -2033 -2663 -1401 -1691 -2066 -2166 -395 1287 2062 1444 614 332 551 657 221 -195 -459 -84 1090
819 2737 3773 3644 2237 605 -993 -1825 -1529 -645 -79 345 278 -243 -899 -1508 -2125 -1653 -1192 -975 -462 62
798 -331 -653 -844 -651 -300 -695 -764 -1001 -876 -7 867 1637 1248 153 -1310 -2462 -2997 -2646 -1867 -1505 -998 -508
777 -508 -353 -488 -746 -1090 -1703 -2215 -3153 -3740 -3359 -3268 -3390 -3604 -3668 -3272 -1622 664 2521 3761 4362 3839
757 3839 2464 393 -1255 -1493 -155 1945 3612 3646 2449 981 -90 509 1544 2617 2854 2353 1209 -230
738 1357 4188 6847 9633 9472 9528 9646 9376 8091 3146 6 -2060 -2423 -1763 -1600 -1203 -581 401 132 -727
718 -1629 -870 427 1427 1561 876 51 -967 -1513 -1834 -1871 -1521 -1011 -413 582 1519 2593 2935 2180 660 -1001
697 -2695 -3953 -3571 -357 359 773 423 -750 -2229 -2897 -2222 -790 -59 -214 -1433 -2138 -2991 -3928 -3164 -2802
678 -2802 -2862 -3546 -3189 -2600 -1344 615 2486 5051 8043 3250 3296 2372 1256 722 149 56 101 876 1841
659 1841 2948 3802 3550 2817 2589 1866 874 -315 -1571 -1905 -1833 -208 -257 -375 -668 141 1574 1894 3299
640 3299 6612 9048 11520 12045 10523 5247 217 -2549 -3118 -539 -1113 -1783 -3081 -3606 -3566 -2164 183 2472
622 2472 4024 4034 3418 2442 1448 496 -212 -809 -954 -1210 -1282 -1593 -1994 -1984 -255 854 1106 746 -115 -658 -1735
601 -1735 -1642 -27 1246 1301 368 -886 -2314 -3095 -2844 -951 928 1111 822 414 210 -249 -934 -2748 -4340 -2712
581 -2712 -1189 437 1506 2104 7090 7269 6075 4333 1773 -1061 -60 -748 133 412 115 -289 -1644 -1922
563 -1922 -2310 -2627 -2344 -282 1751 2848 2983 3404 2937 2434 1431 44 -1709 -2343 1255 3904 4621 3919
545 3919 2994 2059 1278 337 192 -21 -428 -886 -686 -391 221 525 648 -3 -883 -1371 -1290 -553 113 367 -959
523 398 -3520 -4547 -233 3406 4810 4671 3760 2808 1838 1240 1836 1897 1499 496 -470 -757 -415 882 2096
504 2096 2541 2309 1707 329 -750 -1568 -1407 -660 512 1904 2956 4598 5744 5891 4321 1978 64 1012
486 1012 2034 1955 1023 -741 -2596 -4270 -4733 -4616 -3670 -2251 -349 574 177 -192 535 1427 1707 1161 538
466 -786 -260 -1391 -2439 -2024 -1945 -1751 -1433 -1160 -667 -513 -905 -941 -212 -1258 -1310 -797 -272 299 932 306
445 -1423 -3563 -5055 -2454 -1806 -1776 -3547 -3363 -2987 -2267 -1762 -1096 -766 118 685 877 820 511 426 686 113
424 -1830 -1890 -939 69 1627 2396 2834 2354 3303 3383 3537 2523 1375 1343 2656 4090 4836 4856 3538 2222
405 2222 1481 1258 842 -41 -1010 -1556 -1494 -1025 -749 -844 -771 -372 209 1116 2362 3400 4187 4200 5775 6076 5800
384 5800 4956 3304 2081 616 -1205 -3055 6167 5216 2795 -9026 -8239 -5409 -4198 -2517 -1832 -1758 -1835
367 -1835 -1632 -948 -50 1094 1456 1573 1466 1065 313 -53 -70 -610 -123 348 661 173 -1011 -2166 -177 3271
346 6398 7530 7911 6845 1319 -2557 -5762 -5645 -3898 -1726 470 1459 499 -1540 -2856 -3266 -2491 -1130
328 -558 -1320 -1059 478 1438 1389 845 101 -228 428 1510 1331 -311 -2066 -2748 -2401 -1340 25 1045 744 76
307 -147 -6 -567 -351 892 1987 2511 2333 1710 1295 784 368 -258 -327 104 1041 1600 1576 1291 221 -905 0 1100
284 1413 953 -466 -2533 -3745 -4173 -3814 -3793 -5212 -7957 -4000 -5268 -3548 -434 871 2790 3344 3385 3231
266 3231 2782 1935 114 -1305 0 550 984 1933 2461 2774 1804 -422 -2497 -460 1288 2158 2104 1340 -375 -1381
246 -1381 -1727 -1732 -706 -156 -1062 -1662 -2310 -2327 -1826 -1337 -1073 -620 -670 -560 -255 -307 -285 -47 1780 -1096 1250
224 -1319 -2937 -3836 -3077 -1224 316 159 786 694 -100 -1098 -769 786 1922 1948 1051 267 -267 -247 87 725
204 725 786 235 -666 -1295 -1169 -462 806 1902 2792 3067 1920 -362 -3284 -4703 -3496 -1185 -383 340 1327
185 1327 2103 2339 2056 2111 1963 1320 -110 -1556 -2861 -3065 -2142 -1326 -462 326 704 715 533 218 -21 145
164 605 1121 1086 113 -719 -1437 -1739 -1090 215 1579 2386 1720 711 -366 -1720 -2922 -4086 -5430 -5556 -4135
145 -4135 -3007 -1938 -507 1352 2311 2454 1961 1691 1589 1393 1490 1210 282 -778 -722 974 2153 2369 2208
126 2208 1500 725 64 -198 -499 -849 -1457 -2265 -2314 -1393 -536 180 368 240 227 441 574 718 627 1014 2375
105 2375 3363 4083 3846 3550 3102 2745 2560 2681 2241 1603 367 -975 -889 281 1810 2123 1568 138 -1576 -2250
85 -2250 -975 53 311 23 29 609 1673 2432 2743 2455 1858 1178 699 223 353 294 -138 -839 -1436 -1658 -2360 -3111
63 -3111 -3897 -3130 -1525 608 2053 2113 907 -585 -831 -295 391 1252 1365 1134 698 600 748 931 815 956
43 956 1107 1620 2244 2248 1485 182 -1075 -1564 -1153 -695 -494 -90 808 1473 1717 1810 -98 -1491 -943 1029 2905
22 2905 3316 2512 1478 1005 469 929 2203 3052 3763 4705 2624 1093 670 845 1167 1411 1192 637 -75
2 -822 -1940 -748
##PAGE= F1=25.89129138603
##FIRST=     25.9928259484165, 8223.18227667557, 1349
##DATA TABLE= (F2++(Y..Y)), PROFILE
16383 1349 1821 2112 2063 1099 -38 -323 1670 1376 1427 333 -1146 -240 1214 1532 -228 -2015 -632 -1024 -757
16364 -757 -530 351 1268 1395 888 610 -893 -2691 -4661 -5405 -3102 -2405 -2463 -2536 -1801 -1180 -1345 -2199 -1110
16345 -1110 -1755 -2661 -2761 -2177 -1135 -1963 -3205 -3439 -3170 -3065 -3025 -2138 -1454 -116 1265 1729 1206 -149 -689
16326 -689 -1514 -2222 -2356 -1349 -90 984 1570 -42 -1781 -2849 -3367 -3375 -3204 -2562 -2248 -1442 -987 -804 -469 -1755
16306 -1755 -3889 -3736 -1600 84 -357 78 53 -512 -894 -1874 -2710 -3087 -2604 -1781 -402 1137 2421 1645 700
16286 331 -486 -2046 -4055 -4904 -2093 -2702 -2397 -1904 -89 490 -987 -24 419 14 -1143 -1634 -902 1234 1575
16267 1575 1646 737 -1120 -3001 -3126 -4473 -3990 -2185 -319 1022 882 580 308 -257 -1661 -2837 -3173
16250 -3173 -2992 -2734 -9900 -5637 -3607 -2377 -2519 -4002 -2557 -1132 674 -134 -657 -1013 -1592 -1864 -2471
16233 -2471 -2726 -2774 -2428 -1908 -1871 -1250 -1168 -1338 -1319 -1958 -1449 54 1378 1681 2309 3236 3132 2414 1085 -19 -1593
16212 -1593 -1879 -1726 -1600 -1233 -825 -959 -1367 -1830 -2454 -2033 -2873 -3058 -3657 -4002 -3900 -3513 -1885 -704 104
16192 498 -500 -675 134 -1048 -1409 -792 79 1298 2486 3083 2602 784 -1093 -3461 -2303 -644 1142 2016
16174 2016 1786 560 -2495 -2814 -1246 -308 223 74 -42 1858 2635 2384 1974 1062 191 -1551 -4021 -6215
16156 -6215 -6291 -5349 -3795 -2659 -1438 584 572 664 424 222 -742 -1490 -1971 -1825 -1074 -120 545 697 997
16137 997 2150 2496 792 -926 -1574 -1848 -1850 -3547 -6023 -7024 -2794 -3112 -5180 -4863 -3804 -2649 -1245
16119 -1069 -1112 -2787 -4922 -4978 -1064 703 2500 2321 775 1192 1212 1753 1754 582 149 369 633 -1885 -3987
16100 -3987 -5898 -7105 -2721 282 -803 -1962 -1934 -1302 -2084 -4018 -4759 -958 -741 -747 -1127 -1908 693 -493 -747
16081 -747 395 -104 1069 1006 32 -1004 -1311 180 1915 3525 3130 2065 1337 -91 -507 -1894 -2135 -1206 178
16061 668 -763 -1390 -2295 -2692 -2142 -1384 -1298 -1185 -1151 -1091 -1886 -2553 -3108 -4296 -5160 -4687 -1646 77 566 27 -965
16039 -1819 -2291 -2671 -1835 -591 -441 -457 791 1512 1829 2203 2839 3717 4749 3489 2072 -399 -1894 -790
16020 162 -94 -840 -1857 -2232 -2944 -2877 -2855 -2751 -1761 18 2147 3533 3816 3116 1235 -842 -1380 -1303 -402 447
15999 456 73 -482 -3083 -5753 -5502 -1791 2411 1913 758 450 1003 1488 -229 -3149 -1573 -624 -157 417
15980 -1284 -3287 -4266 -4238 -3318 -1845 -1996 -866 612 1541 1049 -602 -1967 -2301 -1546 -252 -316 -865 -2578 -6130
15961 -6130 -5002 -2126 983 1401 659 -405 -1634 -2041 -2814 -3084 -1849 -463 669 1077 672 -685 -367 -833
15943 -833 -1691 -2744 -2485 -1019 -852 -567 -675 -1939 -1830 -1566 -2653 -3558 -3662 -3149 -2848 -3188 -2714 -2386
15925 -2386 -4004 -3561 -2390 -931 203 178 -1514 -2086 -1692 -1188 -243 863 1298 1968 133 -898 -2615 -3411
15907 -3411 -1612 -264 604 602 462 -830 -1385 -246 -1845 -958 457 1371 313 -1683 -2911 -4392 -5090 -5304
15889 -5304 -5068 -3159 -1828 -1577 -1444 -1118 -291 -1053 -1835 -2078 -1665 481 1954 1434 502 31 -953 -2303
15871 -2303 -3330 -3952 -3332 -2006 -911 -1909 -2587 -2763 -2500 -550 1337 727 470 305 -150 -1179 -2480 -2189
15853 -2189 -1538 -2538 -3571 -7908 -7948 -6635 -4440 -3294 -3158 -2240 -1612 -1400 -1687 -1360 -705 -152 152 588
15835 588 378 9 -1097 -2740 -4340 -3189 -2030 -1437 -1891 -2325 -2271 -2076 -1265 -198 -1426 -3302 -3115 -2647
15817 -2647 -2469 -2559 -1606 -557 75 419 1004 2376 3427 3383 2716 1552 -828 -4621 -3939 -3789 -3587 -3303 -1707
15798 -1707 -2505 -2225 -702 849 2243 2231 921 -297 -1961 -2790 -2208 -1484 -1276 -364 -1320 -3367 -3002 -2724 -2527
15779 -2527 -3692 -4616 -9604 218 1079 696 -1752 -2618 -3731 -2391 -23 1138 1685 1569 849 165 -1079
15761 -2437 -2130 -1434 -1551 -1672 -1323 -638 -271 -362 -637 -809 -1969 -2504 -2426 -2565 -1776 -1209 -508 -736 -2653
15742 -2653 -4387 -5023 -3868 -2499 -1276 -478 -47 461 1063 1509 1970 2347 1478 662 -113 -1500 -1086 -833
15724 -833 -210 622 -157 -663 -1476 -2012 -2444 -2532 -3088 -4373 -6084 -5783 -4465 -3689 -3514 -3453 -3363 -2880 -1795
15705 -1795 -44 1483 2279 2705 1805 1436 632 980 2133 -903 -1408 -2647 -3243 -3692 -3442 -3142 -3781 -2052
15687 -2052 -870 -1852 -2246 -1751 -551 388 477 -1833 -3678 -3411 -2020 -471 1437 2301 2090 1244 193 -1021
15668 -2151 -113 -1394 -180 1617 2431 1937 601 -56 -1163 -2367 -3986 -5901 -5022 -4484 -4885 -5873 -5456 -4620
15650 -4620 -2756 -1024 625 1144 169 839 666 -527 -1255 -1383 -1783 -3067 -4561 -4998 -4010 -2469 -816 -933
15632 -933 -1020 -1103 -747 683 2347 2237 598 -1090 -2167 -2399 -1468 -192 1243 802 969 -1470 -1940 -1104 201
15612 -99 367 1630 2532 2512 2067 301 -716 172 863 1092 -237 516 1288 2000 2555 1826 1151 1018 1556 94
15591 -1542 -2080 -2178 -1835 -1861 -1506 -997 -491 -456 -1071 -2515 -3037 -1412 -700 -310 -573 -1285 -2406 -3434 1512
15571 1483 361 -513 250 222 -295 -1625 -3545 -1716 397 -647 -942 -376 -581 -1214 -2145 -3005 -4588 -6646
15553 -6646 -6878 -2396 -782 107 1171 1092 422 -1188 -2659 -3557 -2272 -1847 -1701 -932 -340 226 831 444
15535 444 -7 -299 -264 299 342 -1276 -1861 -2252 -2312 -1957 -1434 -1095 -313 296 391 45 -778 356 834 869 138 -1031
15512 -2415 -1816 -880 -751 -1543 -1450 597 1798 2190 1881 1210 75 -181 -229 -1554 -2937 -4217 -4058 -2870 -1519
15493 -1519 248 -206 -927 -1714 -1999 -1651 -787 -608 -883 -1231 -1777 -2547 -2854 -2932 -3704 -3360 -2056 -585 -206
15473 -236 -314 -790 -1752 -317 1333 1163 415 -757 -1541 -1769 -1738 -1739 -3418 -4689 -2016 340 1026 355 303 -867
15452 -1586 -1819 -1782 -1230 -3168 -3215 -2118 -1349 -2946 -5135 -6167 -6277 -4616 -3433 -2920 -1485 -1348 -2713
15435 -2713 -2312 -1605 -524 -234 124 -1126 -1925 -2344 -2189 -2923 -4067 319 1910 2784 3079 2871 2672 2558
15417 2558 2450 1565 355 -629 -1495 -1179 481 -723 -1276 -1401 -1074 -469 -782 -1128 408 1173 1262 1097 203 -1588
15396 -2481 -2637 -2937 -3774 -5013 -1331 -243 -365 376 1594 2028 2147 1256 211 -873 -1497 -2192 -610 -1379
15378 -1379 -3143 -2643 -2682 -2586 -2242 -929 -48 -711 -2282 -2538 -2172 -1176 375 295 811 1311 1305 1677 1839 1789 836
15356 -419 -1786 -692 407 950 1975 2357 1579 841 426 217 468 470 3 -1247 -1987 -2579 -842 -624 -1450 -2809
15336 -2809 -4176 -3292 -1102 325 890 534 -27 -42 157 -380 -1584 -2540 -3499 -4348 -5998 -6625 -7278 -7517 -7908
15317 -7908 -5993 -4190 -4032 -4039 -3774 -3331 -2527 -4497 -1673 -3005 -1483 -1449 -2111 -1691 9 -126 -786 -1129 -1034
15298 -1034 -410 -484 -708 -630 -951 -1472 -2261 -3118 -3661 -4685 -5756 -5973 -4755 -2748 -965 -788 -1565 -2663
15280 -2663 -3040 -2243 -960 -105 -49 -2194 -4815 -2931 -812 503 1651 1167 -37 -1288 -2468 -3384 -3618 -2922
15262 -2922 -1649 -774 1038 1448 1450 -194 -1971 -3999 -4789 -3440 -1746 -1161 435 480 638 -169 -1567 -1301
15244 -1301 -61 375 -135 -671 -1915 -2509 -2869 -4163 -4218 -3780 -3417 -3549 -3703 -3091 -2555 -2233 -2417 -2337 -2194 -1731
15224 -1731 -1248 -1126 -1007 -98 90 -563 -1977 -3876 -6465 -6559 -5144 -3411 -2202 -1852 -1724 -371 1363 1631
15206 1631 1642 1236 -593 -2429 -2450 -1735 -1897 -1520 648 1006 -488 -1252 -1081 -358 487 -137 -1292 -4095 -6261
15187 -6261 -4850 -2822 -876 193 -238 -1396 -2753 -1940 -512 223 113 60 300 -468 -1250 -1405 -1711 -2312
15169 -2312 -3348 -3988 -3914 -3415 -2310 -2790 -2776 -1749 -1358 -3378 -4748 -4343 -2920 -1387 -682 -2027 -3187
15152 -3187 -3585 -4152 -3389 -2200 -1020 152 1511 1451 1156 -3423 -8167 -6376 -5038 -2544 727 -66 -2290
15135 -2290 -5542 -5214 -4495 -4286 -2924 -1173 653 1709 2525 1619 568 -7 227 186 822 1842 1448 875 322
15115 -461 -899 -1011 -1700 -1614 -1538 -2156 -2106 -2269 -1921 -1508 -623 112 726 728 -48 -848 -1128 -704 -222 54 -590 -1361
15093 -1361 -3222 -1944 -1285 82 941 945 727 275 -711 -1722 -3177 -3489 -1902 -366 637 836 1269 846 409
15073 -797 -834 -74 -998 -1472 -1404 -1018 -839 -423 -670 -449 -159 -245 -1036 -2107 -3208 -3881 -4701 -1785 616 711
15053 711 1410 1881 1508 754 -1806 -3273 -2216 -370 1143 2433 2970 2926 1979 224 -2094 -3904 -3902 -2765
15035 -2765 -2470 -3372 -4838 -6200 -1712 -112 -2624 -5755 -2945 -1885 -469 704 -80 -187 456 566 -122
15017 -1155 -2440 -1537 33 1299 1785 1764 1133 152 -677 -1148 -1015 -188 1001 1667 1705 913 213 -144 -191 169
14996 645 802 479 866 1254 1215 493 -260 -2594 -1326 -1113 -603 884 3421 3329 1556 -169 -1289 -2332
14978 -2332 -1716 -2330 -899 -1950 -420 2738 1223 -251 230 184 -2211 -4541 -4966 -4113 -3164 -2565 -1747 -816
14959 -843 -2749 -3635 -4274 -4499 -5187 -4405 -3231 -1969 -1436 -897 -310 851 379 212 -829 -3096 -4867 -2722
14941 -2722 1177 808 610 403 517 632 714 -550 -368 880 444 76 -1711 -3935 -2314 -787 -1549 -1304 524
14921 1414 -217 -1435 -1480 -1077 -759 -706 -1809 -3630 -6259 -6033 -4474 -2715 -1700 -1745 -2956 -5261 -8211
14904 -8211 -7589 -5907 -3145 -196 1602 1277 314 -477 -510 -763 -2406 151 1032 806 -697 -1223 -1017 -952 -1195
14885 -1195 -954 -653 -351 -336 -1084 -144 1212 2489 1609 618 -584 -3482 -4103 -2970 -2936 -2374 -1265 -1917
14867 -1917 -2813 -1098 -1441 -2101 -2110 -1516 -2757 -4492 -3176 -1579 30 322 -1460 -2532 -918 1085 997 468
14848 -371 -1946 -3161 -3739 -3718 -2678 -1383 557 2426 2892 1726 458 -270 -847 -1360 -1753 -1678 -2081 -2517
14830 -2517 -2041 -1231 -276 620 1377 1300 -324 -2497 -5024 -4085 -1952 1472 2258 2333 2506 2302 1335 1030 1767
14811 1767 2851 2591 1941 1118 -147 -1922 -3501 -4393 -4100 -3204 -1802 -546 -674 -1405 -1541 -170 613 881
14793 881 589 -410 -2452 -3425 -2371 -2390 -1869 -1492 166 1237 1834 1408 -1066 -4356 -4555 -4044 -2765 -2534
14775 -2534 -1750 -492 782 2369 1000 -2096 -3678 -3420 -3242 -2713 -2062 -1781 -2181 -2395 -1832 -1021 -1561 -2214
14757 -2214 -2681 -2236 -2217 -1172 -389 -160 212 -1601 -3428 -2213 -4608 -6737 -7774 -6666 -5083 -3327
14741 -3327 -1524 -52 991 1710 2863 2405 612 -1876 -3651 -4231 -3128 -2405 -2314 -2423 -1927 -1031 -772 -1460
14723 -1460 -1892 -1522 -1486 -1751 -1897 -712 -46 -1094 -1012 -475 446 1434 1503 1444 1176 769 459 10 97 -394 -1469
14702 -1469 -2324 -3583 -2887 -1414 -186 608 915 250 -932 -1634 -2990 -3605 -1811 184 2084 3556 4338
14685 4338 4116 2406 -57 -1286 -824 222 892 1028 1109 1090 1182 800 -177 -91 -584 -563 -222 470 406 -73 -427
14664 -427 -1190 -1220 -788 -1449 -2350 -3315 -3678 -2847 -1676 -343 -52 -1562 -1327 -1745 -2883 -3401 -2875 -1565 -2519
14645 -2519 -3182 -3106 -2374 -1149 -400 -2175 -3040 -3208 -2762 -1600 -1069 -1274 -144 1476 1772 1031 -992 -873
14627 -873 -167 1574 2526 3291 3384 1055 -1650 -3388 -2689 -403 459 580 -340 -1873 -2214 -1811 -675 -692 -1275
14608 -1275 -647 1670 1856 1742 1564 2739 2308 1431 -601 -2085 -3209 -4713 -4230 -2643 -2061 -837 -277
14590 419 624 257 -1690 -3632 -3495 -1942 811 3091 2030 -338 -2941 -4257 -6173 -8160 -7492 -4280
14574 -4280 -2765 -2345 -2427 -3003 -1567 1551 2756 1086 195 712 832 -260 -1481 -2319 -2634 -2758 -2584 -2606
14556 -2606 -1944 -799 -187 -396 -712 -1315 -3015 -4190 -4588 -10905 -11936 -12178 -10746 -3766 -2298 -360 1010
14538 466 -371 -886 -1975 -1761 -1738 -663 -1379 -2183 -2679 -2863 -3222 -3695 -4696 -3839 -1477 -244 169 1246 1193
14519 1193 713 -667 -2590 -3263 -2576 -1687 -845 -17 -47 -953 -1475 -1044 -2267 -3936 -6664 -4976 -2238 -187
14500 1243 1953 1964 1248 -137 -2086 -4037 -4001 -2193 -570 -541 -1275 -1077 -440 -1262 -706 486 1179 -2512 -4587
14481 -4587 -2030 62 -142 -2185 -2900 -2511 -940 888 1302 780 503 553 738 -1349 -5486 -4018 -2303 -593
14462 529 -459 -1378 -1850 -1553 -995 -284 -169 -1756 -6100 -10847 -11390 -4601 -3706 -2127 -2235 -3474 -4489
14445 -4489 -5196 -4836 -5505 -3615 -3674 -3952 -3808 -3486 -3600 -3505 -2772 -1973 -272 2023 2569 877 -416 -286 70 -2188
14424 -5102 -7518 -9045 -10245 -5485 -4067 -4312 -1360 -63 573 603 -85 -2426 -2104 -2999 -4330 -6438 -3577
14407 -3577 -527 782 -1390 -3172 -3494 -3224 -3266 -3222 -4679 -4117 -2839 -1641 -1102 -1315 -1977 -3063 -3416 -4086
14389 -4086 -4422 -4519 -6042 -4255 -2872 -2902 -3388 -3143 -1341 -84 509 711 635 -74 -1200 -2950 -4577 -2461
14371 -2461 177 -352 -1053 -1728 -2242 -2510 -2568 -3353 -2411 -465 -109 -811 -1323 -2137 -2569 -2461 -1818 -2129 -2058 -1987
14351 -1987 -3157 -3464 -3050 -2011 -545 1164 1816 1822 30 -1942 -4191 -6697 -6032 -4330 -2910 -1803 -859
14333 -2714 -5685 -5927 -4763 -3028 -2797 -1495 -879 44 462 2113 2599 2350 693 -2015 -2566 -4052 -1794
14315 -2369 -1169 1222 3346 2426 2612 2775 1082 -11 -1357 -1734 -992 114 -503 -1064 -2268 -3405 -4225
14298 -4225 -3701 -1227 -141 -51 -568 -1798 -2981 -3347 -2810 -887 -842 -1414 -2810 -3595 -2964 -2645 -1640 -1664 -2800
14279 -2800 -1841 -172 -2059 -2044 -1766 -727 628 1690 2210 1528 115 -572 654 3120 3960 3414 2055 467
14260 -4213 -10311 -6313 -5462 -3019 -649 -696 -1909 -747 564 1461 807 771 860 1002 520 567 544 19 -113 -657
14240 -657 -1344 -1011 -1957 -3088 -3217 -3039 -2542 -1804 -1158 -136 -939 -1433 -1768 -1442 -601 306 343 32 -580 -429
14220 -429 -147 600 1079 1998 2860 3883 3215 -683 -3553 -3194 -489 2255 3946 4910 5150 2152 1481 563
14201 245 449 -118 -1723 -3629 -5527 -3635 -2103 -3726 -2753 -1567 -1587 -644 1324 898 -1076 -3648 -3467
14184 -3467 -3366 -3090 -2974 -2326 -2305 -1591 -1471 -5191 -5225 -3474 -1888 -3556 -3273 -2109 -2386 -3899 -6217 -5326
14166 -5326 -2481 113 1215 -12 706 2233 2917 3188 3833 3121 910 -1722 -2701 -2051 -1559 -1573 -2280 -3083 -1458
14146 16 -1075 -2591 -3509 -6608 -4039 -1930 -2155 -3457 -2230 -1931 -1924 -1873 -1986 -1665 -1035 728 1241 1896 1372
14127 1372 961 827 -283 -776 -684 -460 -997 -1880 -2592 -2383 -1833 -1054 57 760 908 1447 336 -1564 -3269
14108 -3269 -3530 -4242 1457 753 -342 -2109 -2790 -1229 683 -696 -1773 -3040 -6138 -8263 -9217 -8944 -7037
14091 -7037 -5131 -3643 -2267 -891 -232 -985 1099 2897 3633 3132 1913 84 -1252 -1911 -387 395 -529
14073 -1392 -1831 -542 -1416 -2511 -2958 -2593 -1409 321 -836 -2186 -4462 -4117 -3326 -2321 -2018 -3370 -2134
14056 -2134 -1605 -1105 -293 1299 2312 3147 2301 1747 1140 504 63 155 15 -979 -1643 -2497 -6070 -3581 -1228
14036 -1048 -1669 -1973 -1917 -1274 -1185 -1147 -1994 -3517 -6218 -9533 -9946 -8742 -7261 -2825 -1891 -1622 -2060 -913
14017 -899 -1623 -2386 -2537 -2119 -554 297 220 210 741 1034 1201 604 -1101 -3339 -1937 353 1580 1529 1092
13998 1092 309 -1545 -1745 -2916 -2644 -1082 -399 -644 -1050 -616 -71 898 1845 1241 -735 -2732 -4052 -2816
13980 -2816 -2047 -2967 -3896 -3123 -2164 -3330 -2278 -3611 -1586 748 2248 2586 2040 1416 817 295 266 140
13962 140 84 -506 -968 -1432 -1970 -2211 -2911 -3817 -5468 -4433 -3289 -2826 -1603 42 1983 3769 2760 2078
13944 2078 1423 1086 59 -949 -1398 -2562 -3515 -4173 -5584 -5217 -3419 -1520 -837 -1030 -1242 -1383 -1096 841
13925 1372 1285 628 -1447 -2328 -801 330 913 -1276 -2238 -1240 -1092 -201 1613 2601 1181 -434 448 1460
13907 1460 453 -23 432 911 891 -29 -1722 -3331 -6045 -7089 -7490 -4560 -2895 -1288 -175 -1093 -2684 -2801
13889 -2801 -3505 -1691 186 58 900 1111 76 -255 147 161 376 545 321 -506 -1546 -2392 -2368 -1609 -2261 -2766
13869 -2766 -4831 -3701 -2521 -3271 -2929 -2495 -1079 41 1119 1343 275 -960 -1519 -780 -156 -560 -1348 -1442
13851 -1442 -1480 -4051 -4181 -3559 -3133 -4100 -4710 -2489 -719 -1535 -2057 -2107 -747 477 -1251 -3358 -4148 -907 1001
13831 468 -254 -863 -3141 -4830 -5428 -5293 -4089 -2599 -749 1002 1731 1052 -623 -1515 -278 -623 -1211 -509
13812 281 681 -1046 -1193 -406 452 615 553 170 -320 -938 -2258 -3228 -3594 -2517 -1222 -1613 -1659 -874 896
13792 2662 1989 2603 2564 2562 1425 1379 133 -1866 -2181 -1765 -1747 -2169 -2104 -1945 -1159 -367 498 268 -689 -1532 -1968
13771 -1968 -1478 -490 400 802 611 -224 -2536 -8812 -11023 -11314 -5164 -7093 -7295 -2057 -849 741 1223
13754 1223 635 -1013 -1896 -1991 -1771 -2924 -2909 -1815 -1065 -1044 -1140 -1563 -1810 -2375 -2197 -1394 -1472 -1682 -2201 -2489
13734 -2489 -2728 -2955 -2393 -2552 -723 771 1094 675 71 -368 257 1236 2049 1385 189 -840 -1559 -1358 -941 132
13713 -4 -750 -2132 -2531 -1744 -215 953 1400 1038 925 518 388 648 1214 1053 192 -694 -2152 -3319 -3605
13694 -3605 -3571 -3689 -2192 -1026 -256 -491 -979 -2171 -4246 -6503 -6685 -4356 -560 403 552 1437 910 882
13676 882 71 -2169 -2438 -1267 -769 -1110 -1672 -3081 -4045 -3703 -3204 -2187 -749 -22 -501 -531 -353 -854 -1650
13657 -1650 -2470 -2357 -1310 -777 -495 -1526 -1826 -498 741 807 -71 -1209 -2001 -2372 -1445 -1254 -1780 -1595 200
13637 2240 2837 2340 1449 -185 -1094 -1328 -1654 -1058 -1697 -1854 -2253 -2312 -2512 15 -478 -1582 -2157 -1472 -657 239
13616 -129 -979 -2059 -3080 -3478 -2170 -80 74 1459 1775 1377 1359 1993 1246 246 -602 -693 -2223 -2260 -1094
13596 -96 -783 -443 -743 -1396 -2735 -2992 -2704 -2712 -2332 -819 1402 2021 1363 1256 1008 825 -765 760 1523 1559
13576 1559 1612 865 -1064 -3397 -5777 -7317 -6338 -3232 -1299 -300 -1057 -4052 -4959 -3943 -2905 -2153 -1873
13559 -1873 -2485 -4937 -6658 -3047 -2293 -1939 -1621 -2168 -1398 -1408 -775 -569 -2073 -2250 -1949 -1910 -861 -181 14
13539 167 12 -1313 -2256 -2122 -356 1545 458 -1794 -3766 -5362 -3532 -1116 -716 -1665 -1379 295 1245 1038
13521 1038 1985 920 292 -307 -1311 -1839 -1498 -1006 -1644 -1753 -972 -12 -948 -2365 -2385 -1236 -396 -411 -255
13502 -255 605 643 -564 -1556 -2085 -2422 -2347 -2153 -5540 -3379 -2555 -1134 133 617 405 -34 1190 39 -1452
13482 -2562 -2416 648 1718 2222 2336 1775 1076 1120 387 65 718 1023 1173 984 593 465 -93 -527 -392 -403
13462 -403 -1355 -2606 -3597 -4498 -3502 -1892 -85 1295 2234 2949 2532 43 -472 101 -36 -401 -836 -892 -1074 -1571
13442 -1571 -1750 -2139 -2119 -2419 -2319 -2023 -1983 -1313 -63 883 -430 -1914 -3275 -1962 -19 -220 -1415 -412 627
13422 766 174 -1445 -2959 -2874 -2304 -1530 -661 392 -175 -1058 -2169 -5317 -5617 -8201 -7977 -7090 -4816 -3789
13404 -3789 -2913 -1659 -2877 -4229 -4245 -4556 -4720 -3655 -2222 -567 1048 2049 2058 630 -1630 -2512 -2431 -1737
13386 -1737 -1248 -661 146 1484 2249 2880 2488 -1268 -4029 -2546 -433 2393 2000 875 -766 -2647 -3266
13369 -3266 -2439 -2910 -3341 -2968 -1625 -947 -1817 -2762 -3220 -3175 -4285 -5110 -6400 -6207 -4861 -3547 -1726 -879
13351 -879 735 1084 54 -2362 -4230 -2966 -769 1284 1399 1956 567 -681 -1526 -1378 -1131 -1229 -997 -564 -227
13331 -854 -239 278 -1015 -1619 -1836 -2019 -2503 -3226 -3545 -3357 -2220 -609 1293 2065 1624 140 -2035 -3242
13313 -3242 -2745 -1784 48 1660 810 -1232 -1561 484 -2250 -5579 -2599 -516 -151 -1946 -2044 -1807 -4194 -4900
13295 -4900 -5228 -5938 -6110 -4347 -2858 -939 -268 292 812 1991 1164 410 496 679 967 1046 1428 954 547
13276 547 959 658 -843 -1906 -3469 -5474 -5592 -3216 -1273 -2675 -4174 -4971 -6211 -7624 -7564 -5550 -2957
13259 -2957 -1274 -899 -1237 -1727 -2034 -1972 -1939 -2150 -2421 -2603 -2554 -2539 -1753 -1261 -1823 -2235 -2272 -2919 -3796 -4135 -4704
13238 -4704 -4741 -4703 -4606 -4659 -908 809 104 282 607 -304 -1741 -3063 -3848 -3978 -2587 -1086 78 654 590 -85
13217 -1151 -1690 -187 533 1109 836 1112 1042 -818 -2813 -3520 -1080 994 2675 2105 930 1349 2198 2692 2438
13198 2438 1944 439 -1720 -2922 -2701 -1280 -1146 -1648 -2365 -1672 14 -515 167 573 340 -567 -1474 -1708 -1494
13179 -1494 -978 -273 266 267 -318 -1440 -2533 -3202 -2695 -1384 -1119 -573 -1760 -2708 -3069 -919 -203 1082
13160 1155 -749 -1200 -690 -372 -856 -2682 -3413 -4012 -4604 -4640 -3387 -2363 -1983 -2426 -3686 -4055 -4154 -3684 -2387
13141 -2387 -2464 -2649 -4238 -4278 -4487 -3588 -2033 -1376 264 702 208 -958 -2413 -4124 -6723 -2325 -1668 1768
13122 720 -1121 -2521 -1952 -1099 -3226 -4057 -3803 -1937 -1403 -1968 -550 1510 2098 1384 845 408 327 -1301
13103 -3409 -3629 -3358 -2937 -2335 -1443 -205 69 285 1570 3004 3936 3832 2930 1880 1223 1270 -1885 -6421
13085 -6421 -7503 -7017 -10377 -10245 -6918 -4617 -2429 -491 -712 -973 -1028 -747 574 1095 1717 1318 -383 -2332
13067 -2332 -3666 -2974 -1758 -2174 -2544 -3740 -3426 -4221 -2191 -1126 -1746 -2471 -2317 -1735 -2220 -2109 -1635 -1217
13049 -1217 -2234 -3373 -3771 -4864 -4654 -4171 -3307 -1671 -1051 -185 1007 2394 3418 725 -2669 -4295
13033 -4295 -2447 -1663 -2929 -3637 -2353 1021 2666 4293 3363 1261 -1981 -931 937 1014 243 -797 -525
13016 -525 -251 -406 -467 -1135 -1408 -2174 -3465 -3394 -2701 -2179 -2476 -2526 -2042 -1067 160 1197 1170 841 587 179
12995 338 639 474 -1630 -2527 -1877 -1194 -1214 -1243 -881 -479 -64 -617 -371 -53 -177 -1732 -2410 -2383 -3579 -4658
12975 -4658 -3368 -295 0 -630 -1498 -2035 -1669 -1017 -473 -152 361 -348 -1016 -631 -1300 -2048 -2527 -2987 -2142 -2626
12955 -2626 -1993 -3358 -2774 -1791 -2204 -2323 187 1 -903 -1752 -3374 -4921 -4662 -3070 -2599 -1989 -1971 -1631 -1334
12936 -1334 -1030 -263 66 510 392 -268 -1467 -314 1392 242 -1155 -815 1425 2271 1939 2644 3641 2689
12918 2689 363 -510 -3123 -5270 -2719 -2793 -3034 -2901 -2749 -2602 -3881 -4251 -4553 -5843 -2979 -1949 -1072
12901 -1072 -332 -114 271 34 273 229 379 1095 -367 -2125 337 3403 5452 2629 425 -1264 -2661 -3139
12883 -3139 -2848 -2105 -2070 -3168 -3903 -3811 -3321 -2406 -981 187 -602 -1067 -1572 -2330 -3158 -3622 -2116 -932 -65 885
12862 163 -802 -1434 -1029 -178 -729 -1928 -3093 -3656 -3233 -2422 -1378 -541 -1335 -2628 -4098 -6162 -4506
12845 -4506 -2343 -540 -462 -862 -1589 -2846 -3728 -5155 -5597 -3017 -1490 -1205 -1856 -2597 -3129 -1347 -274 313
12826 -300 -3049 -2231 93 325 600 652 214 -270 -394 268 699 554 939 459 -146 -1756 -2718 -2770 -4025 -2023
12806 -2023 -218 1209 1614 1100 -591 -1495 -1646 -590 398 1337 1452 -279 1830 1995 1745 1142 652 388 -90
12786 -1510 -173 405 794 439 -104 -920 -1773 -3516 -3533 -3116 -1889 2 1031 2093 2829 2988 1369 -971 -2107
12767 -2107 -3102 -3475 -3683 -3442 -2542 -1061 747 1487 2619 3225 2011 1342 1569 1929 1228 -162 -1748 -2732
12749 -2732 -3239 -3110 -2429 -1367 -6 331 222 179 352 563 813 802 889 700 201 -2722 -3865 -2773 -2581 -2893
12729 -2893 -3292 -4558 -7054 -5349 -3236 -2020 -1148 -182 703 1505 839 -331 -1678 -2261 -2286 -1816 -3620
12712 -3620 -4443 -4935 -4938 -4188 -3534 -3275 -2614 -2423 -2709 -1963 -1023 -380 -1707 -2036 -1215 556 -403 -53 -1581 -2761
12692 -2761 -3394 -2656 -1294 64 -732 -1911 -2746 -3254 -3526 -2690 -1164 665 2021 2468 2638 836 -2306 -2983
12674 -2983 -776 1411 1462 367 -1096 -661 -1078 -2029 -2634 -2618 -851 -262 -609 -1087 -1069 -508 344 -896 -1813 -1601
12654 -1601 -259 1909 2565 2208 2071 2143 1560 -970 -2738 -3114 -2388 -1409 -181 1109 1664 1605 388 -1046 -1941
12635 -1941 -1989 -1386 -1058 -1250 -1813 -2673 -3468 -4952 -5767 -6514 -2431 -3413 -4224 -6245 -7027 -6530 -5295 -4708
12617 -4708 -4856 -5284 -4254 -3124 -1355 -31 -228 -1540 -2440 -3186 -3210 -2348 -1787 -4734 -4910 -3240 -602 1252
12598 2115 2348 2530 3095 3177 2823 1919 960 19 -1532 -4821 -3921 -2983 -1672 -537 -40 -158 -962 -1800 -2645
12579 -2645 -3009 -2739 -2023 -1016 279 1083 1493 72 -1707 -205 -359 -1365 -1690 -1062 128 1346 1650 340
12560 -482 -1184 -1135 -476 -707 -1234 -1187 -951 -860 -497 -51 390 47 -1201 -3090 -4558 -5490 -5388 -5884 -4752 -3921
12540 -3921 -3892 -3553 -3204 -3751 -4265 -5560 -6085 -5269 -4515 -3431 -1998 -335 1031 2374 2714 2351 802 -1399
12521 -3328 -3096 -2104 -1125 -545 -754 -1017 -733 -1033 -1400 -866 -275 450 2110 2276 800 -1081 -2213 -2466
12503 -2466 -1868 -621 616 1344 1218 603 31 -744 -1348 -1214 -1393 -1100 -845 -324 141 287 484 -330 -3098
12484 -3098 -5815 -6291 -4787 -2618 -3788 -5282 -6585 -6493 -5991 -5013 -3875 -2897 -1673 -1422 -2290 -2614 -2743
12467 -2743 -2703 -2549 -2266 -1381 -666 423 172 509 1094 1182 677 -71 -808 -1953 -3179 -3332 -2462 -1066 -986 -2550
12447 -2550 -3991 -5756 -3393 -268 -590 -742 -35 -501 -1000 -1930 -2791 -3489 -4307 -3463 -2784 -2335 -1934 -1486 -1041
12428 -1041 -91 212 327 528 1229 1864 1248 881 896 610 809 737 364 2 772 1074 -801 -1966 -914 -808 -2564
12407 -2564 -3645 -4148 -3552 -1375 -90 -604 -1982 -3478 -4612 -6952 -8023 -7610 -1969 -1086 -892 -1263 -1131
12390 -1131 -1317 -1302 -1167 -1092 -1282 -1570 -1577 -1557 -907 195 1224 -2180 -1860 -1972 -2300 -2457 -2176 -1679 -456 144
12369 188 -415 -1304 -2201 -2625 -2726 -2290 -2424 -2673 -2894 -3369 -3637 -3662 -3117 -2077 -507 -246 -779 -632 467 736
12349 736 -655 -2070 -1319 -326 363 819 740 -1327 -553 340 874 1207 139 92 1474 1597 1529 848 19 -550
12328 -1207 -953 -168 1254 2644 2220 1124 122 -1183 -2425 -3444 -2308 -748 -1172 -1134 -1052 -982 -1437 -1520
12310 -1520 -1238 -399 -507 -2063 -2445 -3024 -2807 -1907 -947 -1598 -1676 -1916 -2674 -3313 -4114 -4848 -4942 -2537 -2342
12291 -2342 -1568 -182 1386 132 -662 -438 556 1817 1647 61 -1552 -3216 -4105 -4635 -5811 -3742 -1070
12273 598 1102 681 -149 -545 -982 -406 200 -353 -1559 -3455 -4511 -3925 -2086 705 3133 -1237 -3168
12256 -3168 -3026 -2357 -1131 -285 -183 -245 13 1404 2493 2054 1547 298 -2129 -2110 -1752 -2166 -2300 -1650 94
12236 -1265 -1232 -980 -887 -521 329 921 -23 -1450 -2303 -1317 423 1457 1062 1408 3017 7072 9158 8540 6226
12217 6226 -164 -1025 -1958 -3506 -2183 -418 821 -42 250 2301 3383 2996 1267 -796 -3183 -5783 -6010
12200 -6010 -5055 -4444 -3131 -2299 -3563 -8290 -10198 -11415 -8638 -5664 -3609 -1223 585 1300 487 -270
12183 -1037 -3182 -3796 -3488 -2631 -1701 -1723 -988 -160 -438 -175 -507 -739 -578 874 668 1200 2565 2801 1892
12164 1892 734 -498 -673 31 -1306 -1788 -411 -1275 -2465 -2559 -2055 -322 1707 940 -293 -1391 -2674 -5374
12146 -5374 -4923 -3090 -1271 -1533 -1522 -1239 -578 147 -471 -2419 -6033 -3447 -1437 1003 1021 -171 -1155 -2331
12128 -2331 -2844 -2132 -2309 -2374 -2393 -1903 -1161 -140 1398 1900 1402 738 310 -197 -1012 -1211 -1175 -1694 -2662 -1601
12108 -1601 705 -732 -527 -1681 -289 1043 2410 2573 2768 1397 -1019 -2431 -2668 -2508 -2289 -2939 -4767
12091 -4767 -3424 -2155 -1496 -699 -432 300 1349 2645 3307 2213 72 -1624 -1726 -721 471 155 -1976
12073 -4616 -6055 -3379 -1725 -1092 401 2196 1723 626 194 -557 -1986 -4084 -7598 -12251 -14240 -4597
12056 -2943 -1320 -2115 -2773 -2792 -3265 -4026 -5254 -4760 -4576 -5087 -3039 -3392 -2405 -1973 -1730 -2398 -3115 -2881 -2906
12037 -2906 -3222 -3115 -3540 -3693 -2734 -914 -861 -1147 -1202 -935 -2141 -3552 -4426 -1865 -967 -927 -941 -883 -856 -462
12017 -462 -2055 -3059 -3279 -3226 -2648 -2314 -1958 -1996 -1871 -1548 -2292 -2038 -1829 -1296 -838 -448 -307 -158 -173 306
11996 296 -449 -725 -103 420 402 910 509 636 -1517 -238 78 -950 -2044 -3240 -4097 -3756 -2056 -467 578
11976 697 28 -624 -509 -708 -806 -1160 -2402 -2533 -527 328 460 -462 -1554 -2449 -2695 -519 -342 -43 223 -1325
11955 -2897 -2282 -1337 -721 -535 -540 -821 -731 67 -564 -2238 -1003 1594 1257 420 308 716 -847 -2381 -3244
11936 -3244 -3089 -3682 -3167 -3822 -3861 -3556 -2564 -577 93 962 1252 647 -649 -2088 -4576 -5095 -2884 -1762 -2001
11917 -2001 -3060 -8191 -7901 -6829 -5620 -3768 -2437 1354 1965 2670 2564 -654 -5152 -4200 -2663 -282
11900 813 2579 1786 -228 -1500 -199 -2542 -3495 -3332 -3859 -5313 -3735 -3646 -1097 -1429 -1334 -975 -506 281
11881 1328 795 719 536 113 -123 76 176 141 492 409 -371 -768 -1208 -1253 -804 -550 169 826 1201 -86 480
11859 -217 -762 1 -227 -1038 -105 1105 658 -103 -740 -1886 -2492 -3370 -5126 -2302 -2308 -4195 -6856 -8625 -5884
11840 -5884 -5359 -2359 -876 212 -783 -1735 -2093 -1787 -749 -529 -866 -1118 -555 770 1249 1259 159 -557 -251
11820 -626 -77 730 589 -97 -544 -166 520 504 -383 -550 -485 -647 -450 -120 -152 315 895 -897 -2561 -3835 -3964
11799 -3964 -3262 -1119 1493 1634 -132 -2591 -2833 -1561 -1216 -1262 -1995 -2555 -2302 -1438 -224 -285 -744 -914 -2035
11780 -2035 -3474 -3910 -2130 -1426 -1632 -739 -1216 -1202 -789 -2594 -2395 -1741 -1007 -758 -728 -1006 815 2305 -286
11760 -1519 -1243 -258 -386 -36 1294 2517 2995 2316 -1358 -2331 -1796 -1075 -631 161 1063 1412 -444 -2730
11742 -2730 -1979 -745 -347 -1183 -2117 -3288 -5040 -2881 -1015 22 81 -808 -2308 -2983 -2763 -1916 -2101 -3765
11724 -3765 -4285 -3378 -1046 1045 588 -153 -380 -190 -776 -1965 -2865 -3074 -2221 -1897 -1457 -1601 -1817 -1646
11706 -1646 -1235 -1216 -1615 -2320 -3283 -3143 -1077 129 413 -324 -1004 -870 -363 340 425 0 -478 -333 603 1088
11686 1088 1293 1928 2652 2877 2765 2616 2034 792 -1152 -3454 -5630 -3232 -1615 -1774 -945 -2277 -4016
11669 -4016 -5028 -3752 -1788 -364 -663 -265 -471 -2536 -4251 -4711 -4254 -4242 -3747 -3447 -3191 -3028 -1744 275
11650 1107 659 -622 -1509 -1890 -1837 -218 281 -420 -1202 -1632 -2002 -1761 -1418 -1267 -714 1976 2009 1132 -50 -1049
11630 -1049 -1921 -2845 -3979 -4953 -4333 -2986 -1891 -766 316 1503 1645 1267 436 -485 -549 -21 551 881 990
11611 990 1067 902 448 -130 -432 -197 522 1322 2195 2043 1574 573 -1212 -3444 -4509 -3412 -1724 -2797
11593 -2797 -3381 -3987 -4532 -5849 -2343 -2806 -2828 -7959 -6945 -3073 -469 -838 -2045 -3231 -3805 -3384 -2547
11576 -2547 -1692 -1706 -2877 -3996 -4305 -3134 -2849 -2482 -4514 -4344 -3791 -3529 -2623 -2141 -1156 -1400 283 3 -1306
11556 -3052 -1512 -1797 -103 474 366 63 -140 -368 -178 -198 -466 -1068 -1956 -3192 -4510 -5065 -4244 -2770 -588
11536 -1248 -1818 -1992 -1711 -1605 -1036 -386 433 582 307 -616 -1398 -2083 -4124 -2813 -1021 -366 -1211 -1828
11518 -1828 -2136 -1578 -217 -417 -293 -2115 -4129 -4645 -3528 -1961 -74 176 461 288 543 1017 595 -788
11499 -1463 -1404 -628 546 1665 2083 1889 1111 1063 974 974 514 -134 -519 -818 -277 1019 2751 2063 -295 -2164
11479 -2164 -2561 -2746 -2501 -2449 -2111 -873 -213 -553 -292 -445 -894 -1743 -2197 -2539 -2069 -1126 409 1104 1651 2461
11459 2461 21 -2521 -4984 -5332 -4296 -3526 -2745 -3178 -1614 813 2113 1626 897 472 739 1092 1128 921
11441 921 352 -242 -1140 -1795 -1184 -549 -306 -1848 -2620 -2055 -1175 -796 -1023 -1535 -2019 -2345 -2084 -1886 -2462
11422 -2462 -3230 -2942 -311 439 72 -530 -1556 -2884 -3671 -3880 -3600 -2548 -870 750 1974 218 -697 -2317
11404 -2317 -6208 -8530 -8127 -5824 -2341 -2297 -2222 -1745 -1653 -2835 -1977 -805 378 -117 -70 -357 -816 -1703 -2780
11385 -2780 -3344 -3819 -3803 -3251 -1810 -825 784 1387 1322 303 -1403 -1958 -1582 -1073 -1140 -1620 -1602 -991 546 1682
11365 1682 2220 654 -1320 -1952 -3005 -2841 -1720 -881 -23 96 116 -320 -1816 -3122 -962 -3555 -3612 -2678 -1229
11345 -278 -264 -867 -2011 -2370 -1165 428 1075 1397 1142 1100 451 -382 579 2261 2493 1685 1269 2019 2076 1279
11325 1279 -677 -1178 -1502 -3100 -3127 -2690 -2745 -4446 -4110 -1470 944 1563 1084 158 296 700 -738 -1861 -160
11305 1791 2589 2282 -258 -457 454 794 859 157 -487 -1061 -1126 -598 -1874 -3978 -5464 -8363 -5730 -9010
11287 -9010 -4895 -4077 -2944 -1938 -1719 -1794 -2430 -2667 -2871 -2707 -1542 -1824 -2564 877 2232 805 -1961 -1480
11269 -1480 -174 1727 2263 1717 1293 1398 1429 912 -81 -1376 -2165 -2254 -1620 -1751 -974 -870 -872 -847 -1532 -2058 -889
11247 -1096 -1738 -1130 242 -302 -391 199 570 965 878 160 1087 478 -767 -3304 -6060 -4323 -1831 -2278 -3265
11228 -3265 -1527 -105 -181 -1147 528 1908 1688 -1470 -2101 269 -2685 -5396 -4477 -3386 -2373 -1459 -1134
11211 -1134 -259 1358 2273 3083 3316 2043 968 -225 -1917 -2472 -1440 -620 -333 163 311 83 -137 267
11192 187 138 -662 -1452 -1239 -1050 -1359 -1812 -1654 -260 -852 -1930 -2207 -1614 -2558 -3482 -3915 -4304 -3593 -3580 -2892
11172 -2892 -2965 -3215 -2627 -1299 1339 2259 2179 702 -910 -2084 -2234 -2156 412 2003 3283 1471 -1113 -2918
11154 -2918 -3077 -2177 -1303 -28 371 135 -1212 -4114 -6570 -6468 -6386 -3393 -1610 -1548 -626 -253 114 225 -619
11134 -668 -938 -1394 -2488 -4550 -7556 -9134 -7338 -5179 -3590 -4030 -4028 -2625 -1507 -123 -851 638 1705
11117 1705 1523 340 -1550 -3181 -3487 -1729 73 -29 -409 -930 -1083 -2519 -2928 -2360 -1471 -1387 -1758 -2427 -2143
11098 -2143 -2299 -2714 -2701 -2427 -2043 -269 1257 997 -769 -1773 -1826 -1476 -413 210 751 608 1239 2109 1129
11079 1129 229 -57 72 -879 -2312 -3181 -2953 -1055 583 1147 2406 2321 842 -646 -2926 -2561 -2684 -1615 -1413
11060 -1413 -1264 -452 819 766 1279 1836 654 -428 -1086 -1260 317 -846 -1508 -542 235 408 -324 -1974 -4084
11041 -4084 -4495 -3533 -2730 -2032 -1516 -692 507 2144 2664 1498 -1076 -3540 -5801 -2875 -2052 -2000 -2709 -3241
11023 -3241 -2483 -2557 -2915 -3810 -4324 -4535 -4565 -4878 -3478 -1983 -1238 -1375 -2095 -3798 -7239 -9311 -10004 -4221
11004 -2689 -3499 -4246 -4971 -4893 -4134 -2834 -2010 -2171 -3100 -2518 -1402 12 940 1770 1912 1638 1417 731 -482
10984 -1134 -2175 -2229 -1914 -1670 -2666 -3018 -1808 -325 651 2589 1342 -51 -1329 -2236 -1957 -2081 -4828 -4672
10966 -4672 -2842 -1451 -907 -97 21 -934 -1877 -1560 -304 1356 1833 1853 886 -291 -1657 -2943 -3052 -2970 -1546
10947 -1546 -1186 -2436 -1317 -888 -1582 -2993 -3797 -5240 -7772 -6729 -5377 -4247 -3246 -2571 -2362 -1583
10931 -1583 -1031 -698 -160 287 -201 -1923 -2984 -979 1146 1183 -146 -1806 -1633 -1933 -1342 -1050 -543 -707
10913 -707 -1021 -1461 1285 2545 1527 -210 67 -205 -1704 -4497 -4798 -3249 -1132 131 1045 2576 2241
10896 2241 1493 453 18 88 1499 1021 -81 -777 2404 4388 2256 -2190 -6524 -9126 -7616 -5617 -2656
10878 -1101 -2624 -3281 -993 345 695 49 -703 -1778 -3604 -3895 -2554 -1786 -2064 -2909 -3447 -3599 -2664 -1021
10859 -1301 627 1851 2865 2279 724 -1282 -2582 -2837 -2213 -952 -245 -305 -442 -610 -691 -589 -695 -584 -842
10840 -842 -1306 -1346 -2565 -3876 -4230 -3980 -3444 -2690 -2167 -2385 -3142 -2728 -3012 -3320 -3136 -3008 -1745 -886 -3052
10821 -3052 -3787 -1515 -6 1806 2471 1083 73 -80 452 748 -65 -1466 -5715 -6423 -4396 -2698 -614 1327
10802 1914 162 -1263 -2241 -720 -948 -1290 -777 -1773 977 2298 1558 -392 -1717 -2578 -4359 -3554 -4720 -6598
10784 -6598 -2460 -1035 738 1535 1194 -127 -1605 -2816 -2374 238 -32 -2305 -2390 -717 -123 -442 -922 -1096
10766 -1096 -1486 -2498 -4441 -5566 -4453 -7853 -8635 -8020 -7443 -6281 -4229 -1825 386 1374 2142 2537 2185
10749 2185 1623 675 -638 -899 -1422 -3229 -4103 -5412 -5048 -3801 -1680 222 836 1286 1998 1935 1439 399
10730 39 32 -163 -306 -908 -1085 -2019 -2303 -2677 -2618 -2425 -1676 -1881 -1456 -1442 -2026 -1828 -725 -1472 -3012 -4022 -3660
10709 -3660 -931 -1053 -1486 -1427 -2739 -1874 -485 60 -311 -1554 -2333 -2433 -2261 -2817 -3226 -2030 -1401 -428 262
10689 -798 -633 -1207 -1955 -781 771 649 1344 2076 1437 -930 -2018 -1640 -964 -818 -1158 -1346 -4199 -4434 -3305
10670 -3305 -2451 -2318 -2153 -860 810 1167 -1343 -2491 -1202 -1012 -2393 -2408 -2168 -2284 -2819 -4546 -5278 -5125
10652 -5125 -4744 -3747 -2636 -1050 687 1821 696 -514 -1173 -1269 -1534 -1776 -3143 -4443 -5359 -3936 -2437
10635 -2437 -1679 -3187 -3137 -2722 -2893 -2710 -1773 -435 262 668 702 714 780 443 -1417 -2998 -1923 -637 -361
10616 -361 -1291 -2673 -1562 826 3148 3028 1683 34 -1524 -7361 -7331 -4707 -2102 487 1191 -36 -925 -1055
10598 -1055 -601 -313 -273 -252 317 956 1228 1055 176 -1018 87 -207 58 -827 -2199 -4873 -6159 -4618 -2688
10579 -2688 -824 590 1585 1315 306 -1385 -1928 1054 550 -708 -3524 -3871 -1571 1308 1752 1664 1488 1185
10561 1185 269 -397 -1888 -2597 -3365 -2049 146 2268 3955 4216 2589 72 -2011 -1614 -1501 -1641 -1151 -438
10542 -101 -115 -689 -1069 -1079 -181 -1882 -2114 -3742 -3057 -1358 -514 -550 -636 -1158 -1619 -1806 -2187 -2683 -2927 -2528
10522 -2528 -1652 -456 775 1718 1223 349 107 1481 2386 1870 -114 -1197 -396 773 -994 -2597 -3564 -3376
10504 -3376 -3029 -3348 -836 -467 -47 365 -113 -2392 -4188 -2621 -951 -766 -1140 -1901 -1281 -351 -2086 -3505
10486 -3505 -4014 -2979 -1799 -264 1156 1888 2076 1880 1417 -944 -1984 -935 107 595 622 -232 -782 -2500
10468 -2500 -2275 -216 1866 3082 3188 5495 3698 439 -3026 -3368 -2471 -1249 -1425 -5010 -5459 -4983 -5936
10451 -5936 -3487 -1926 -2655 -2796 -897 1228 2683 2249 1885 1262 495 -1927 -3469 -2193 -1580 -874 -576
10434 -576 -171 -1426 -2444 -3912 -4836 -3790 -1389 1299 3011 617 -1026 -1750 -2682 -5954 -7182 -7459
10418 -7459 -5131 -6758 -5028 -2067 -2408 -2692 -2273 -1940 -1774 -654 308 598 566 -221 261 603 576 -100 -248
10399 -248 -792 -2304 -1432 133 1585 1480 -1084 -5576 -4565 -2700 -1572 -656 -535 -871 -1398 -2097 -2289
10382 -2289 -3161 -2967 -2322 -1463 -871 -2726 -2776 -6515 -2512 -1833 -1133 -2348 -3413 -1706 303 2190 979
10364 27 -442 965 2389 2540 2000 1093 140 -572 -621 -2653 -1284 87 -215 -2314 -3290 -3471 -3282 -2938 -3167
10345 -3167 -2577 -4925 -4366 -3849 -3378 -3494 -3420 -3090 -5131 -6647 -6685 -4026 -2464 -1782 -1310 -1377 -1148 -655 -226
10325 -1549 -2140 -1514 -425 14 -118 -779 -1813 -2691 -3472 -3969 -3773 -1034 -419 -518 -809 -1725 -2710 -3137 -2258
10306 -2258 -1589 157 1648 1078 -117 -1628 -1577 -762 -1645 -2118 -2877 -2839 -2337 -2252 -2144 -1407 -2211 -2565 -2201 -1178
10286 -1178 -340 1264 2030 1725 332 -2681 -3701 -5843 -4779 -1969 -1456 51 -658 -2366 -3984 -4561 -4232
10269 -4232 -4155 -4353 -3906 -2305 -603 284 87 -715 -1660 -2184 -3081 -4425 -4360 -2867 -1140 -711 -248 -161 -1283
10250 -1283 -2831 -4320 -3736 -1861 -453 -619 -1616 -1937 -2222 -2739 -2575 -2579 -3173 -1103 -732 52 429 -2402 -2980
10231 -2980 -1277 116 868 314 -1481 -2755 -3203 -2804 -2828 -2490 -1362 -1372 -1781 -1465 -1062 -912 -1338 -1020 -449
10211 -272 -672 -589 -1064 -1009 -519 81 708 777 -215 970 1349 319 -1740 -1234 109 1446 3172 3729 2970 1730
10191 1730 417 -842 -104 -413 -2270 -5066 -2386 717 589 1280 1454 -442 -1671 -2248 -2618 -2726 -3051 -3284
10173 -3284 -4209 -4024 -7003 -9212 -8521 -6220 -1713 450 518 -706 -2913 -1702 -1122 -342 1665 1933 1582
10156 1582 645 -1108 -2089 -2278 -2096 -900 -1048 -1056 -1145 -2095 -3283 -4857 -3899 -1766 485 1794 1421 1114 775
10137 775 792 -123 -142 423 1011 -108 -1699 -2995 -2825 -2611 -3551 -2128 -1274 -545 -5 571 419 145 -102 -672
10117 -672 -844 -609 389 898 767 -592 -2279 -3373 -3085 -2478 -2047 -2145 -3756 -5175 -5606 -5380 -4216 -2242
10099 -2242 -579 339 801 -707 -4391 -6127 -5764 -4846 -3226 -1390 767 2912 2664 1618 380 -646 -756
10082 -756 -2590 -1282 705 845 342 -770 -2372 -3312 -4314 -4329 -4196 -4267 -3216 -1443 -674 -62 -1696 -3243
10064 -3243 -2463 -3213 -6355 -10236 -8456 -3682 -3833 -3335 -2848 -2531 -2309 -1732 -1146 -495 -545 -1107 -2406 -3056
10046 -3056 -2739 -1390 -374 746 1016 1085 1476 2261 2624 2564 1900 988 -1194 -2544 -3575 -3856 -3328 -1529
10027 -1294 -1207 -5643 -8887 -8674 -7637 -5248 -2165 -2777 -1247 -426 571 2050 2498 1763 610 -642 -2230
10010 -2230 -4500 -6793 -7572 -2602 656 2734 3722 3176 1656 -99 -2056 -2906 -2786 -3253 -3773 -3907 -2556
9993 -2556 -762 190 -1410 -7818 -10402 -11383 -8328 -1516 -1347 -1256 -1895 597 -1074 -3497 -5007 -4157 -2086
9976 -2086 -367 -995 -1415 -2218 -2834 -3492 -3440 -2474 -3053 -3130 -1884 -296 1513 1408 -227 -1715 -3248 -4214 -2069
9956 -3045 -3256 -1709 -1084 -1937 -2191 -1579 -509 527 1444 2202 2244 2330 1767 356 -469 -618 -739 -1144 -2220 -2913
9936 -2913 -4071 -4834 -3825 -2739 -1385 -244 -11 -362 -1222 -2610 -2647 -571 156 944 2158 2802 1785 199
9917 -1077 -1880 -3212 -4166 -3683 -3177 -1426 1071 2339 1215 -851 -2055 -2856 -4381 -6640 -5005 -2591
9901 -2591 -565 -264 690 2470 2877 935 -340 251 -551 -572 -140 -1396 -1380 -580 1418 1912 2244 3275 4587
9882 4587 3238 764 -1177 -938 68 -376 -622 -784 -1496 -1708 -1353 -1465 -666 -1081 -1516 -1316 -2444 -1652 -1890
9863 -1890 -1646 -1102 -32 1029 599 -792 -2126 -3129 -3696 -3071 -1695 -1473 -1822 -2725 -4765 -6161 -2969 -665
9844 -566 -2025 -1829 -131 1481 2027 1931 1148 288 -493 -1540 -1965 -2493 -3390 -2785 -1476 -1451 -888 -807 -1377 -2658
9824 -2658 -2771 -4150 -3670 -862 -784 -2518 -4268 -4734 -4053 -1542 -853 -2041 -4105 -4454 -4410 -3104 -3625 -4365
9806 -4365 -3351 -1207 -1260 -2322 -4290 -5679 -4001 -1034 374 -484 -2274 -2632 -2050 -1266 -386 -42 -1069
9789 -1069 -1835 -1866 -1454 -599 322 836 982 1281 1529 888 743 1485 2016 2052 1077 596 -1008 -2773 -2592 -2124
9769 -2124 -1697 -2310 -3139 -4060 -3863 -3365 -3448 -3083 -1417 -335 -482 142 970 1214 1404 1377 967 -2599 -4736
9750 -4736 -1353 738 1157 1455 1471 1592 -2494 -1231 187 1057 1071 -141 654 -612 -1922 -3002 -3405 -2911 -2223
9731 -2223 -1797 -1835 -2137 -1709 -587 681 182 -272 -1430 -1643 -2502 -3256 -2350 -781 782 -1201 -353 -987 -1547
9712 -1547 -1352 -721 -1179 -2166 -3391 -4436 -3569 -2495 -1401 -3083 -6121 -5899 -5327 -3452 -2246 -1191 695
9694 1445 2509 2414 675 433 1904 3179 3167 1724 451 357 586 426 -213 -464 -223 -1026 -808 -2289 -5867
9675 -5867 -4747 -2860 -2907 -2814 -2449 -2049 -2518 -4191 -3147 104 3692 3494 2191 746 1126 1188 617 912 1445
9656 1445 1385 -1618 -4082 -5620 -6341 -5049 -2775 -636 1435 2599 2567 2212 1923 2127 2903 2850 2085 108
9637 -1111 -2663 -424 -181 197 617 617 -986 -2229 -1899 -731 -160 -691 -1254 -1593 -1010 -788 -1397 -2173 -2406 -1830
9617 -1830 -2529 -3352 -4436 -4568 -3462 -1756 -267 -605 -1489 -2145 -2038 -1115 -1170 -1355 -1692 -2273 -3534 -4693
9599 -4693 -3423 -489 -672 -1763 -2968 -3191 -3128 -2273 -1329 -2299 -3454 -5518 -7693 -3950 -2391 -683 408
9581 755 587 1379 3185 5399 6372 4459 2370 200 -1187 -1781 -2271 -3401 -3051 -2094 -1542 -1475 -1746 -2164
9563 -2164 -1946 -959 769 1904 1919 164 -4815 -4610 -2685 -457 1194 1844 1344 499 -770 -2194 -3227 -2632
9545 -2632 -1168 -536 -16 380 905 545 -1089 -1934 -1510 -1075 -2339 -4135 -4411 -3026 -1445 -704 -538 -684
9527 -684 -1012 -1875 -2450 -2681 -2685 -2394 -1055 232 716 -2004 -773 -2186 -2742 -2144 -1798 -765 638 -784 -1589 -1137
9507 -1137 361 63 -1271 -2985 -2494 -1728 -1481 -974 -343 1623 3027 892 372 1126 1096 1363 3044 3954 4233
9488 4233 2788 1166 387 -584 -1354 -2315 -1366 -627 -382 -214 -919 -817 -523 -528 -1455 -4244 -7388 -13986 -15462
9469 -15462 -15276 -14217 -15740 -13805 -11573 -9813 -4031 214 -2212 1075 8012 13809 16621 10909 5839
9454 5839 974 -3900 -6090 -11166 -9006 -5964 -2708 -1902 469 -228 -1525 -3109 -2107 -762 657 1808
9438 1808 2362 1443 147 -879 -2030 -2954 -3653 -3271 -3669 -4358 -5257 -5491 -6041 -6084 -5997 -4553 -2205 -1193 -876
9419 -876 -826 -933 -1180 -1176 -2170 -899 -712 -39208 753 -592 -2470 -3062 -1312 1178 615 240 -1109 -1975 -4929
9400 -4929 -9497 -8316 -5754 -5096 -6042 -5958 -5979 -4382 -4442 -5337 -6984 -6536 -4746 -3375 -1540 -423 -469 -1394
9382 -1394 -2219 -2954 -2710 -2572 -2808 -3269 -3469 -3370 -2882 -2669 -3367 -3101 -837 1401 1747 638 -1719 -4133 -3750
9363 -3750 -2134 -1476 -1287 -2088 -1128 114 -1561 3537 3646 1524 -1277 -1871 -1732 -2399 -3293 -4730 -5565 -3526
9345 -3526 756 2129 145 786 1936 1988 1249 1117 1626 1415 1417 1600 2427 1718 550 -1209 -3754 -5222 -3703
9326 -3703 -1784 280 458 1173 559 409 537 551 855 1070 683 587 381 220 1176 -763 -3245 -4419 -2571
9307 -2571 -2886 -2751 -1711 -2038 -3303 -1289 747 857 1220 1068 -1081 -1550 -3402 -6160 -7584 -5003 -2799
9290 -2799 -6139 -6861 -3002 177 2542 2377 1103 61 -982 -1528 -2467 -2973 -3923 -4400 -3599 -2304 -659 469
9271 1629 2244 2771 2620 1918 1576 1316 1728 2107 922 -1335 -4170 -3434 -1559 128 -1054 -1089 -978 -607 639
9251 772 -80 -1221 -1706 -1233 -711 -82 987 612 -1668 -969 123 1220 2116 3046 2480 1029 -126 -387 632
9231 1647 2209 1190 -262 -546 1097 2090 2247 3084 4591 3369 1418 -209 -392 -451 -471 -2226 -3120 -3141 -2292
9212 -2292 -1969 -2329 -2185 -895 -674 -1206 -1363 -942 -512 -644 -989 -2452 -2865 -7554 -3281 -1579 -618 1327
9193 1206 294 -1007 -1886 -1823 -1190 -1056 -2006 -3777 -3927 -3941 -3046 -2851 -1868 -1414 -1233 -1761 -1988 -2573 -3215 -1638
9173 -1638 712 2548 3823 5456 4934 2433 688 -240 204 495 1143 1083 880 11 -183 -474 -1607 -3216
9155 -3216 -3084 -2325 -3018 -2731 -815 681 2079 2544 3211 4518 7791 6223 5223 2861 859 -955 -1285 -949
9137 -949 -608 -100 555 902 198 -831 -1527 -766 -2544 -3088 -2652 -1655 -633 -1762 -3091 -3449 -3527 -4065 -4157 -3748
9117 -3748 -2913 -1538 -296 449 445 224 73 -291 -635 -850 -1088 -1160 -1071 -2176 -2155 -1427 -1899 -2785 -2925 -3082 -3361
9096 -3361 -5192 -6928 -5821 -1960 -851 -855 -1805 -3471 -6973 -3573 -3276 -1975 -915 -1299 -3013 -3413 -1666
9078 -1542 -1414 -476 -687 -1540 -2015 -1174 -1084 -795 -2784 -4394 -4279 -2922 -1402 -517 -656 -1892 -3950 -4591
9060 -4591 -1296 344 -120 -2010 -2662 -2031 -893 97 -530 -2009 -1783 -2275 -1723 -1145 -882 -922 -1626 -2630 -3159
9041 -3159 -3253 -2186 -748 324 640 605 245 647 1619 1839 1656 1246 123 -979 -1532 -1640 -1575 68 2385 3818
9021 3818 2573 666 -961 -998 -822 -1953 -2065 -1850 -1843 -1874 -1788 -1649 -1467 -534 291 1052 753 545 1349 2801
9001 2801 2694 1583 -1733 -2934 -2851 -2739 -2449 -1703 -854 -234 44 178 -296 -687 -838 -1376 -3047 -4558 -2627
8982 -2627 579 -585 -903 878 1658 1198 -645 -1776 -1286 -936 -1328 -1771 -2539 -3214 -3832 -4100 -3449 -2633 -1794
8963 -1794 45 1139 1529 1137 559 -328 -763 -2002 -2994 -1995 -1483 -786 235 37 -744 -1731 -1929 -1706 -1391 -1069
8943 -1069 -424 291 510 709 311 -850 -3442 -4342 -2017 523 394 -271 -1074 -1438 -1107 -1077 -1154 -1244 -1419 -1159
8923 -1159 -1205 -958 -1638 -2894 -2254 -1087 728 2321 3231 3241 -488 -4706 -7770 -9906 -9174 -2155 -478 -791
8905 -791 -1914 -3349 -2285 -196 1933 4722 9900 -454 -3941 -3643 -937 1687 2539 2142 1218 195 -523
8887 -444 -1475 -1635 -1399 -731 420 1565 774 9 -865 -1331 -859 -938 -619 -57 -273 -1432 -2519 -3358 -1331 248
8866 828 347 -1809 -3874 -4330 -3327 -1794 -403 325 1900 2398 562 -387 -2278 -3905 -4590 -3930 -2226
8849 -2226 -2006 -2244 -2448 -948 918 1416 1634 458 -2769 -1832 -1790 -2206 -1957 -2278 -1783 816 2265 2414 2297
8830 2297 1999 1770 839 -503 -1618 -3912 -4360 -5398 -5202 -3621 -1111 1271 426 -448 -482 38 1130 1741
8812 1741 1779 846 -260 -1055 -1090 -641 -2196 -281 -136 -1329 -3024 -4965 -6295 -6242 -4749 -4051 -3178 -1494
8793 -512 -3484 -2813 -3546 -1350 173 -1692 -4418 -4613 -207 273 -163 -75 248 1325 1457 1763 1879 561 -1249
8773 -3196 -2527 -1761 -1344 -700 -516 -1046 -2867 -4262 -3447 -1557 -1457 -2076 -2879 -3425 -3664 -2027 -1488 -462
8754 -2259 -1414 -1881 -1223 357 1408 -328 -2610 -4330 -4803 -4665 -3316 -2406 -1087 -784 75 -1364 -2832 -4311
8736 -4311 -5639 -5796 -7419 -3954 -2549 -4248 -2860 -2945 -2214 -10253 -8640 -8209 -7869 -7061 -15414 -19496 -7614
8718 0 2535 4817 2173 2680 2960 -1221 -14076 -15576 -10041 -8455 -5040 438 -2309 -2666 -3559 -3914 -2171
8701 -2171 -1994 -1900 -1614 -1547 -3547 -4097 -2903 -4881 -6345 -4445 -2239 -393 -522 -548 -373 676 2372 3601
8683 3601 841 -2940 -1006 -301 -1162 -2792 -670 -731 31 238 -2674 -4425 -3978 -2609 -1854 -1645 -950 639
8664 965 -3405 -9099 -14019 -14846 -16538 -16047 -23924 -22197 -17893 -9956 -9389 -6899 -5450 -3364 -2108 -1379
8648 -1379 -1401 -1284 -1623 -2714 -1702 -759 -188 -262 -673 -1353 -1275 -1020 -2022 -2094 -2452 -3082 -3441 -4124 -10146 -11779
8628 -11779 -8542 -4826 -3129 -1674 -892 -1613 -553 -1835 -3376 -5027 -6505 -7308 -6490 -5612 -3472 -2050
8612 -2050 -956 -1152 -2362 -4497 -4708 -4155 -3429 -3212 -1743 303 1565 2233 2241 1232 -589 376 1759 1723 1986
8593 1986 16 -2909 -4872 -5158 -3666 -1812 -38 1237 1609 1923 252 -1724 -1886 1521 15 -1502 -2366 -1782
8575 -1782 412 -1728 -1891 -797 -4008 -7966 -7839 -4346 -3884 -3467 -2621 -1170 197 764 38 -1231 -2293 -2800
8557 -2800 -3145 -3249 -2563 -1241 -1012 -920 -2083 -1354 22 1325 2110 1958 3658 3392 2169 -186 -2556 -2590 -2270
8538 -2270 -1427 -1344 -1533 -1771 -2958 -575 567 29 -1136 -2401 -3521 -4276 -4841 -4627 -2184 1480 3524 3885
8520 3885 1588 -2241 -1947 -949 102 -367 -767 -1433 -2030 -2682 -2771 -2361 -1720 -980 -733 -274 -269 -298 -513 -1720
8500 -1720 -1540 -2060 -1188 -143 1091 1579 1445 261 -1329 -2844 -3557 -3798 -3598 -1210 -768 135 827 1458
8482 1458 1749 1532 1496 316 -2220 -3538 -1069 1763 2169 -236 -751 -67 -2365 -3280 -2142 -1542 -1261 -1511
8464 -1511 -1105 -960 -801 -600 -41 260 -955 -2259 -3405 -2931 -1952 -1949 -3259 -5708 -5538 -2509 -301 999 599
8445 599 -1131 -2497 -1573 -869 -262 1159 3069 4050 3772 1976 -2155 -7622 -4171 -1558 -2164 -2161 -1753 -1931
8427 -1931 -2867 -1970 -3239 -4128 -6192 -7445 -5660 -5433 -4349 -2270 -317 988 2292 3250 3609 3662 2387
8410 2387 1593 1789 2265 2373 2351 1932 1237 555 -200 -1000 -1749 -11290 -10229 -5084 -4764 -2990 -1589 -2349
8392 -2349 -3799 -1558 4655 5636 5151 4050 1916 -1393 -5072 -6031 -4834 -2592 124 1587 373 -876
8375 -2544 -1553 12 -3229 -1300 -2006 -332 1137 1677 1447 -1749 -4251 -3720 -4585 -5545 -6564 -3780 -2389
8358 -2389 -1102 -743 -1008 -589 -361 -1524 -3260 -3948 -3877 -3850 -4340 -4816 -3437 -2112 -1131 -567 -765 -1107 -1653
8339 -1653 -2487 -2828 -2245 -862 -254 -203 -778 -1326 -2257 -3601 -2853 -1506 -291 -612 -1219 -2493 -2369 -2168 -9806
8320 -9806 -14323 -1151 297 1435 2068 1981 1581 263 -812 -1182 -1217 -1489 -1556 -1641 -307 734 -95 -1696 -2393 -1383
8300 -1383 67 861 484 -387 -1410 -1818 -1937 -1318 -33 543 1159 1886 -1934 -2876 2173 1377 261 -1010 -2558
8281 -2558 -3542 -3483 -2375 210 2207 3439 3223 2389 1899 2075 2691 3044 3101 2019 -709 -2254 -2117 -1926 -1732
8262 -1732 -1377 -947 -458 3 -649 -1437 -1748 -2770 -4645 -7295 -8179 -7659 -6675 -4746 -3317 -2755 -2548 -2100 -1593
8243 -1593 -1252 -1772 -4244 -5491 -4469 -4500 -3556 -2319 -2376 -2211 -2121 -1891 -1573 -1005 104 439 -741 -2846 -2440
8224 -2440 -1567 -477 171 -10 1 -574 -1158 -1888 -3738 -4362 -2793 -1273 -1918 -2431 -3503 -5286 -6410 -6138 -3758
8205 -3758 -1215 391 -1490 -2919 -3435 -4007 -6263 -6269 -4751 -3032 -2839 -1299 126 302 -129 -993 -1934 -1876
8187 -1876 -1554 -1346 -1122 -1733 -2457 -2495 -2302 -2695 -3454 -3830 -2912 -1704 -1902 -1762 -1065 -736 -895 -2198 -4081
8168 -4081 -6020 -6439 -5571 -3877 -2088 -2601 -2410 -965 231 1068 -892 -3038 -3915 -3119 -1140 1390 2792
8151 2792 2930 2406 974 -2756 -3693 -1023 6708 7568 2499 1220 965 2152 2173 1227 462 -124 -15 -385
8133 -385 -1739 -3591 -4890 -3365 -1335 66 454 -266 -1362 -2297 -3217 -1193 -161 1398 1051 -70 -1213 -2375
8115 -2375 -3336 -4410 -4588 -4589 -4718 -5278 -5041 -4076 -2675 -2315 -2378 -2895 -2943 -2678 -2014 -1398 -670 -309 -164 -220 -1265
8094 -1265 -1268 -2298 -2100 -2570 -602 1697 1174 -143 -1032 -993 -2262 -2325 -364 574 -64 -1682 -2442 1148 1304 -32
8073 -1205 -1422 -994 -1344 -1793 -1818 -1308 -219 994 1544 1441 853 813 26 -77 -2732 -4253 -4668 -3957 -2558 -1139
8052 60 1225 1056 363 -395 -1164 -1958 -2141 -1259 -22 1058 2846 4146 4111 3557 3514 2397 762 -1349 -2292
8033 -2292 -3241 -3454 -3600 -3253 -2318 -989 -1280 -2759 -2907 -2359 -1392 -620 -354 -299 -2333 -3172 -3052 -3763 -4395
8014 -4395 -4400 -4274 -3716 -3231 -1762 -784 -538 -228 -811 -782 -1017 506 1217 488 -384 -756 -690 -1719 -385 70 -1291
7992 -2858 -3555 -5209 -4832 -3255 -3183 -2941 -2280 -2878 -3434 -4518 -3538 -806 -1044 -5234 -5599 -4328 -3646 -3733 -4028
7973 -4028 -2568 -1186 -904 -1087 -655 -569 350 837 123 -1232 -2592 -3477 -2627 -1786 -1467 -1832 -2319 -3190 -2966
7954 -2966 -1939 -829 -1454 -2396 -2958 -2753 -2156 -1793 -774 -1676 -3383 -3399 -2977 -3998 -2918 13 1091 2114
7936 2114 1688 1387 1244 1087 179 -1331 -1729 -555 -358 -9806 -9866 -6242 -5849 -5636 -3217 -2805 -3382 -3349 -3405
7917 -3405 -2995 -1790 -790 -671 -1660 -3220 -4351 -4317 -2932 -1246 -367 -381 -650 -1110 -1554 -1790 -2283 -2739 -2390
7898 -2390 -746 -272 -18 512 -3074 -7557 -6426 -4112 -1304 -271 -851 -1834 -1392 -1617 -2530 -2214 -2651 -3189
7880 -3189 -2892 -3375 -2495 -1569 -532 -1819 -4149 -3151 -3414 -3975 -3986 -2308 -968 1601 1644 -249 -1049 184 -388
7860 -2519 -5275 -8735 -11746 -13549 -10015 -5783 -3956 -3706 -1539 -1547 -1810 -7640 -9164 -5678 -4132 -5722
7844 -5722 -7908 -8924 -10129 -3935 -2667 -2568 533 103 -255 -119 686 108 3094 2812 3186 3122 371 -2802
7825 -4424 -4294 -3982 -5126 -5732 -6988 -4912 -2933 -361 1230 1262 -536 -2913 -4004 -5046 -3302 -2409 -1895
7808 -1895 -2344 -2639 -2281 -2186 -1000 191 734 -619 -2596 -3165 -3201 -1392 472 1747 2182 1196 -2583 -4498
7790 -4498 -4233 -3322 -4859 -4340 -3888 -2685 -2342 -2238 -5690 -7850 -9122 -5768 -2837 -1007 119 -7999 -2543
7772 -2340 -1581 -2623 -4346 -4832 -8429 -9748 -7147 -3191 -1843 -1024 -762 -90 -440 -2057 -3286 -3022 -1146
7754 -3797 -3010 -1278 -2717 -3707 -4021 -4689 -2985 -1699 -575 -2096 -4435 -6098 -7884 -12378 -8180 -7132
7738 -7132 -5863 -3929 -1304 581 -1353 388 4668 5341 4500 1811 -584 -3544 -4194 -1800 573 866 -696
7720 -1484 -2650 -3648 -4967 -5368 -3138 -1200 -352 -557 470 -339 -1953 -3526 -4394 -2167 270 735 -230
7702 -833 -1655 -1938 -2544 -2121 -1917 -3067 -4839 -5767 -6027 -5555 -5223 -4061 -361 1897 837 -2749 -7218 -5735
7684 -5735 -3820 -1776 588 -3322 -1060 7200 5543 2898 431 32 288 1010 1210 791 726 874 1309 -2750
7665 -983 150 417 847 744 910 2284 3042 2621 1289 1359 873 -131 466 1191 247 -965 -1080 -936 -1683 -852
7645 -852 -2689 -1985 -1733 -1665 -1495 -2458 -3671 -4124 -4065 -3476 -2677 -2108 -2849 -3635 -1884 -643 -1083 -1567 -1835 -1616
7625 -1616 -1094 -702 -860 -2849 -2769 -2313 -1832 -1834 -2306 -3133 -3959 -5117 -4952 -4707 -3126 -2119 -793 -1875 -2088
7606 -2088 -1681 -1206 -998 351 1652 2714 2977 1012 -830 -1632 -2572 -3188 -3672 -3772 -2790 -2578 -2622 -2503 -3214
7587 -3214 -1004 -1699 1336 6045 4662 2415 273 -1520 -1398 -109 -1283 -1426 -3178 -4656 -5718 -6093
7571 -6093 -2762 -932 465 752 1136 1257 970 -159 -1128 -718 592 -332 -642 -1083 -1003 -717 -1261 -1552 -1303 -475
7550 578 1327 844 -313 -1600 -2918 -3640 -4132 -3652 -1225 -956 -246 451 687 -61 -543 506 844 -652 -1755
7531 -1755 -1800 -454 674 -356 -1210 -1261 -1702 -1618 -1750 -3455 -4714 -5560 -5424 -4449 -3366 -2813 -2688 -2580 -1803 -1849
7511 -1849 -1503 -1387 -2662 -1965 -1041 -160 834 1057 -1108 -4078 -4960 -4275 -2065 -680 312 696 732 802 654
7492 654 -882 -2710 -4243 -4743 -1928 -889 -345 -1812 -5277 -4996 -3496 -1834 68 2821 2996 2073 -828 -4803
7474 -4803 -3584 -1350 803 1240 1188 -1349 -4595 -4788 -7208 -10233 -10086 -7162 -5203 -4387 -4331 -4584 -3881 -3638
7456 -3638 -4326 -3759 -2063 -239 382 -787 -1466 -2151 -2237 -1633 -1207 -905 -1155 -2755 -3618 -819 181 -1471 -1434
7437 -1434 -530 284 168 949 1623 2950 3596 3461 2269 1285 -1506 -4200 -6243 -6637 -5623 -4524 -3684
7420 -3684 -4017 -5404 -5385 -5603 -4754 -3358 -4191 -1817 -2889 -3697 -2891 -1311 249 -775 -1585 -1159 -1645 32 1175
7401 1175 181 -2267 -6085 -10755 -5806 -2559 -2194 -824 -1309 2439 7380 6661 5015 3100 1145 -1794
7384 -3517 -1835 -655 -498 -2789 -5507 -8255 -10063 -11726 -7757 -3340 1835 5095 2958 1924 1121 -213
7367 -433 -1496 1273 1611 490 -866 -3344 -4704 -6800 -8803 -6014 -4116 -2154 -1179 -1955 -1541 -947 -5322
7350 -5322 -5010 632 777 192 -7956 -14941 -7919 -3971 -4090 -5861 -4930 -2082 -2367 -1848 -979 -1678 -996 -9654
7332 -9654 -4962 -7885 -5890 -2889 323 829 5167 4652 977 -647 228 926 243 1376 1988 2254 2652 1917
7314 1917 1026 -2091 -25375 -37754 -72264 -25628 -17219 -18639 -8827 -3935 -2094 -2459 -1698 -2193 -7253
7299 -7253 -6790 -4079 -999 -9791 -3471 -6460 -4908 -454 1575 -1668 -2688 -2633 -481 -2890 -4589 -612 1516
7281 1830 3091 3566 1505 -5226 -10117 -13035 -15948 -12623 -11074 -4212 -11740 -19335 -20021 -4294 -2248
7266 -2248 -2286 321 2243 1806 6418 10795 11282 11524 10938 9030 -366 -6858 -9763 -11826 -16694 -18853 -16349
7249 -16349 -16156 -15678 -12278 -4479 443 -3400 -5388 -27619 -13919 -4262 884 -3434 -13767 -18262 -19901
7234 -19901 -13328 39751 -3012 63802 44303 15998 14567 -115 -12534 7177 32962 32212 3550 -17300
7219 -34142 -19793 7987 41174 -20573 42293 67317 18832 20622 12105 1210 -8948 -17373 -20390
7206 -20390 -16049 -13444 -10984 -8600 -888 1442 -20880 3906 -396 -7599 -16887 -18984 -13167 -10048 -9121
7191 -9121 -10931 -14115 -1859 4084 4611 2838 3989 6710 6729 2525 -2249 -7820 1465 5363 5881 2755
7174 1621 3721 -20245 4042 -10220 -40805 -57907 -84382 -62778 -147 -3771 11363 -8848 -5590
7161 -5590 -15924 -2346 -4609 -7282 -11777 -23653 -11450 -6454 -3592 -2 5144 7117 -2138 -18303 -29793
7146 -29793 -34508 -32808 -29471 -23946 -21252 -19529 -14673 -7364 615 -1630 -5406 1099 3802 -8432 -18389
7131 -18389 -23159 -27235 -23379 -28615 -22951 -20268 -4761 5644 6021 639 -88 -1334 -2255 1259 1270 -52194
7114 -61768 -53925 -28520 4423 -3374 -7811 -2860 -1069 8177 -14913 -4674 3160 -24975 16046 11659
7100 11659 15381 15338 13369 10319 7381 -2727 -5499 -3887 6755 11441 7657 12244 7289 4258 -1485
7084 3265 10764 18454 22177 28095 15710 8376 -120 -6335 -11068 -13100 -9232 -17731 105 7076 12935
7069 12935 11648 8569 5316 180 -3782 -33466 -12320 -4257 -3762 -5424 -3402 -9181 -38038 -9341
7054 20141 -1949 -13794 -28201 19343 37482 64437 73239 84726 77684 48362 38837 12919 4395
7040 5841 12253 11089 8725 7893 7209 10239 3279 -18303 -6663 -20169 -36038 -6362 -13945 -7291 -12191
7025 -12191 -25325 -21688 -21707 -14117 -12007 -7029 -421 -1571 1046 -1119 -3061 -3036 -6481 -10243 -17302 -19601
7009 -19601 -16978 -14220 -16179 -12372 -10710 -9151 -3973 -10191 -8210 -10232 -7876 -4355 1252 -2157 -8939
6994 -8939 -12034 -10309 -11024 -8056 -4646 -8699 -10255 -7998 -7008 -1107 -977 -3267 -8598 -2818 580 1847
6978 1847 2335 3469 2203 2128 1609 990 -1381 -773 -168 -1648 -1744 -1218 -990 -699 -1270 -13159 -9392 -1533
6959 -6170 -21023 -20013 -16873 -19576 -24799 -1181 -188 1049 2552 4939 5447 3126 1800 2052 2014 2881
6943 2881 2604 1640 -940 -1656 -1271 -784 -215 955 -969 444 873 1676 1504 1375 -2501 -5384 -1405 -2777
6925 -2777 -3581 -5978 -12639 -5800 -2946 -2607 -2128 -2022 -912 -4182 -8616 -4229 -508 -2570 -4011 -3800 605
6907 3502 6605 5775 7108 6558 2340 744 -1230 -2423 -2897 -2479 -598 1673 2859 2730 1706 567 -9282
6889 -7064 -10455 -16030 -8808 -2410 -898 -246 734 57 -1663 -3438 -3734 -4736 -4477 -3389 -3985 -4532 -4888
6872 -4888 -4915 -3633 -1711 -145 1433 2554 2747 2151 1305 599 1152 -479 -3304 -5716 -4116 -2771 -2297
6855 -2297 -5843 -5320 -3339 -1986 -1025 -2021 -3223 -3112 -2993 -3187 -1537 808 755 498 60 -934 -1542 -1496 -781
6836 -781 253 375 -514 -1000 -1330 -1519 -1549 -1654 -2062 -3176 -3059 -2001 -1509 -753 544 1879 2536 1537 1095
6817 1095 -36 -1318 -2473 -2710 -1924 -604 -2255 -3572 -4061 -3789 -5940 -8203 -6570 -3586 -811 869 757
6800 757 216 -3 167 -213 -880 -2758 -3842 -2950 -1287 653 1237 282 -1570 -2593 -2073 -2103 -2646 -2412 -1529
6781 -1529 -1021 -764 -337 544 1066 301 -1047 -2242 -2192 -1906 -813 399 845 1033 1209 -108 -2591 -4017 -5385
6762 -5385 -3981 -3353 -2140 -2232 -1507 -1601 -1605 -1918 -2206 -3248 -4343 -7045 -1965 1303 1273 326 -1120 -5504
6744 -5504 -8227 -10990 -9267 -9261 -9519 -9404 -9019 -4151 -3121 -1402 -877 -214 -1901 -3848 -4302 -3655 -2513
6727 -2513 -1780 -1977 -2637 -2957 -2609 -2781 -3180 -3645 -3146 -2183 -1097 486 654 -488 -1773 -2917 -3069 -2837 -1440
6708 -1440 74 727 -1224 -2828 -3311 -4069 -3757 -3542 -2981 -1514 -367 542 -232 -1354 -1723 -1073 -912 -1034 -669
6689 -669 273 -164 -948 -1505 -1269 -35 1013 -367 -4161 -5623 -8881 -10761 -7009 -4962 -4398 -952 -3399 -2148
6671 -2148 -655 -3930 -5805 -6757 -13056 -11574 -8541 -6496 -3675 -1119 -666 741 -498 -2685 -4196 -3798
6655 -3798 -2063 -887 -267 -288 -1051 244 1548 -14 -2738 -924 1415 980 -558 -1436 -2367 -2350 -1086 986 1767
6636 1767 1642 820 1100 1568 1529 1764 2298 2246 2152 430 383 2407 3418 2357 107 -2841 -4904 -4382 -2952
6617 -2952 -2246 -2779 -2429 -2885 -3434 -4316 -5660 -5943 -5587 -5502 -3936 -3347 -6195 -7000 -6425 -4131 -3116 -2920
6599 -2920 -1503 -2282 -1918 -698 -196 73 -547 -600 -1277 -1609 -1122 -193 1024 1953 1336 -462 -1037 -303 -2051
6580 -2051 -3637 -6181 -5692 -4843 -3938 -3484 -2739 -1768 -1245 -1599 -2790 -6990 -5368 -3155 -1188 229 1002
6563 1002 346 -2524 -2816 -1402 -233 455 372 -298 -1240 -2061 -1985 -1103 -1295 -1564 -2119 -1868 -2323 -2358 -2449 -784
6542 1520 2498 2371 2378 1653 1467 1608 642 390 1054 2181 1431 173 -1611 -2674 -1113 -145 100 151 -1066
6522 -2302 -3471 -4753 -4074 -4044 -3457 -2519 -1807 -687 -589 -456 -598 -1371 -2106 -3148 -3735 -4215 -1726 -874 -2275
6503 -2275 -3013 -1021 1265 706 172 -1719 -3325 -5509 -6767 -6357 -6277 -6185 -5103 -2550 106 132 -646 -1752
6485 -1752 -2478 -3725 -2729 -2717 -1631 -1653 -2512 -2661 -2554 -2017 -232 -650 -1942 -3306 -2731 -1556 -2478 -3531
6467 -3531 -2423 -3064 -3312 -3494 -3392 -2969 -1988 70 952 -963 -1783 -1630 -2066 -3184 -4144 -4075 -3544 -2625 -1695 4
6446 -613 -1720 -2358 -3474 -3665 -3004 -1987 -1150 -512 -211 414 407 -121 -1101 -2058 -2271 -1463 -2433 -4034 -4351
6427 -4351 -3413 -1998 -2663 -2672 -2610 -2215 -1972 -1471 -2441 -3402 -4170 -3862 -2083 -316 1465 2516 3207 2284 142
6407 -2114 -3215 -4853 -1657 -1728 -1569 -2402 -3486 -6729 -4922 -3790 -2072 -88 971 1545 1356 533 -706 -2303
6389 -2303 -3466 -3699 -1936 599 2123 -60 -2814 -3605 -915 -1230 -2447 -2793 -2622 -2472 -2772 -3410 -2866 -2131
6371 -2131 -1058 -3026 -4128 -3085 -2038 -3822 -5630 -7877 -8789 -10406 -11763 -3168 -2364 -2280 -4070 -4350
6355 -4350 -1233 246 412 -762 -1291 -341 214 347 -674 -5087 -8324 -11822 -9151 -8630 -5449 -4203 -3530
6338 -3530 -3045 -2946 -1853 -135 1105 585 -1255 -1071 1943 2579 595 -1968 -3079 -3498 -3796 -4108 -3437 -7101
6320 -7101 1319 1648 1725 1460 101 -1511 -2535 -2662 -3708 -1968 353 1200 1947 1829 417 -1007 -5178 -7530
6302 -7530 -6111 -908 -1000 -1605 -3652 -6069 -9195 -7800 -6694 -5212 -5718 -6142 -6064 -5720 -3396 -2645 -2790 -1900
6284 -1900 -1039 -1678 -2175 -326 2204 2853 -588 -2615 -3652 -4404 -4265 -4663 -5187 -5648 -5113 -4598 -3190 -809
6265 -1191 -877 160 -409 -1792 -3131 -3373 -4106 -2569 -2469 -6180 -6979 -3259 -3546 -5708 -1444 -534 -1708
6248 -1708 -4432 -6009 -1201 -1051 -95 994 1831 1216 736 -652 -2805 -4830 -7817 -8734 -6639 -7574 -8920
$$ [...]
1315