
##TITLE=AC1412_PERAH12221_7652973_ZHIX2eC7ob
##JCAMPDX= 6.0         $$ Bruker NMR JCAMP-DX V2.0
##DATA TYPE= NMR SPECTRUM
##DATA CLASS= NTUPLES
##ORIGIN= BRUKER
##OWNER= Administrator
$$ 1.72 TOPSPIN		Version 2.1
$$ 2013-03-20 02:53:19.579 -0500  Administrator@X
$$ Compression mode = diff/dup
##.OBSERVE FREQUENCY= 400.02188249412
##.OBSERVE NUCLEUS= ^1H
##.ACQUISITION MODE= SIMULTANEOUS (DQD)
##.ACQUISITION SCHEME= undefined
##.AVERAGES= 8
##.DIGITISER RES= 22
##SPECTROMETER/DATA SYSTEM= spect
##.PULSE SEQUENCE= zg30
##.SOLVENT NAME= COFFEE_meoh
##.SHIFT REFERENCE= INTERNAL, COFFEE_meoh, 1, 14.98509
##AUDIT TRAIL= $$ (NUMBER, WHEN, WHO, WHERE, PROCESS, VERSION, WHAT)
$$ ##TITLE= Audit trail, TOPSPIN		Version 2.1
$$ ##JCAMPDX= 5.01
$$ ##ORIGIN= Bruker BioSpin GmbH
$$ ##OWNER= Administrator
$$ $$ E:\/data/COFFEE/nmr/AC1412_PERAH12221_7652973_ZHIX2eC7ob/10/pdata/1/auditp.txt
$$ ##AUDIT TRAIL=  $$ (NUMBER, WHEN, WHO, WHERE, PROCESS, VERSION, WHAT)
(   1,<2013-03-20 02:53:11.251 -0500>,<Administrator>,<X>,<go>,<TOPSPIN 2.1>,
      <created by zg
	started at 2013-03-20 02:52:05.189 -0500,
	POWCHK enabled, PULCHK disabled,
       configuration hash MD5:
       86 BA 57 50 F2 9D 5C 9B 26 00 A9 28 5F 66 2E 89
       data hash MD5: 64K
       F7 70 30 64 0C 16 0B FF 42 85 24 E6 9B DE F4 E2>)
(   2,<2013-03-20 02:53:14.423 -0500>,<Administrator>,<X>,<proc1d>,<TOPSPIN 2.1>,
      <Start of raw data processing
       efp LB = 0 FT_mod = 6 PKNL = 1 PHC0 = 0 PHC1 = 0 SI = 32K 
       data hash MD5: 32K
       A8 4D 63 F9 5A 3D E7 58 C8 88 C7 CA BB 5F 27 EC>)
(   3,<2013-03-20 02:53:14.876 -0500>,<Administrator>,<X>,<proc1d>,<TOPSPIN 2.1>,
      <pk PHC0 = 97.17957 PHC1 = 0 
       data hash MD5: 32K
       DC 12 DA B9 54 F3 9A 46 76 FE 82 C6 96 9B 2A D0>)
(   4,<2013-03-20 02:53:15.126 -0500>,<Administrator>,<X>,<proc1d>,<TOPSPIN 2.1>,
      <abs ABSG = 1 
       data hash MD5: 32K
       17 01 CD BF 9E 07 15 82 5A BE 8A 00 01 80 67 99>)
(   5,<2013-03-20 02:53:15.267 -0500>,<Administrator>,<X>,<proc1d>,<TOPSPIN 2.1>,
      <abs ABSG = 2 
       data hash MD5: 32K
       6A BA 7B 7B C7 C9 88 7B 26 08 31 19 46 A4 64 42>)
(   6,<2013-03-20 02:53:15.423 -0500>,<Administrator>,<X>,<proc1d>,<TOPSPIN 2.1>,
      <abs ABSG = 3 
       data hash MD5: 32K
       CC B6 75 CA A3 E3 30 A8 39 0A E9 41 47 BA 76 D3>)
(   7,<2013-03-20 02:53:15.564 -0500>,<Administrator>,<X>,<proc1d>,<TOPSPIN 2.1>,
      <abs ABSG = 4 
       data hash MD5: 32K
       AD A9 69 5D C6 B7 76 92 3D 07 E2 B8 72 6C 03 A0>)
(   8,<2013-03-20 02:53:15.704 -0500>,<Administrator>,<X>,<proc1d>,<TOPSPIN 2.1>,
      <abs ABSG = 5 
       data hash MD5: 32K
       EA B3 88 48 F5 EE 80 CB C7 48 A0 CC 41 7B 32 82>)
$$ ##END=
$$ 
$$ $$ hash MD5
$$ $$ 01 2D A1 30 D6 32 22 58 3E 75 57 44 C6 D1 E7 D4
##$RELAX= 
##$RELAX= 
##$RELAX= 
##$RELAX= 
##$RELAX= 
##$RELAX= 
##$RELAX= 
$$ Bruker specific parameters
$$ --------------------------
##$DU= <E:\>
##$EXPNO= 10
##$NAME= <AC1412_PERAH12221_7652973_ZHIX2eC7ob>
$$ [...]
150 150 150 150 150 150 150 150
##$TP07= 0
##$TPNAME0= <>
##$TPNAME1= <>
##$TPNAME2= <>
##$TPNAME3= <>
##$TPNAME4= <>
##$TPNAME5= <>
##$TPNAME6= <>
##$TPNAME7= <>
##$TPOAL= (0..7)
0.5 0.5 0.5 0.5 0.5 0.5 0.5 0.5
##$TPOFFS= (0..7)
0 0 0 0 0 0 0 0
##$TUNHIN= 0
##$TUNHOUT= 0
##$TUNXOUT= 0
##$USERA1= <user>
##$USERA2= <user>
##$USERA3= <user>
##$USERA4= <user>
##$USERA5= <user>
##$V9= 5
##$VALIST= <valist>
##$VCLIST= <CCCCCCCCCCCCCCC>
##$VD= 0
##$VDLIST= <DDDDDDDDDDDDDDD>
##$VPLIST= <PPPPPPPPPPPPPPP>
##$VTLIST= <TTTTTTTTTTTTTTT>
##$WBST= 2048
##$WBSW= 25
##$XGAIN= (0..3)
0 0 0 0
##$XL= 0
##$YL= 0
##$YMAX_a= 656942
##$YMIN_a= -558928
##$ZGOPTNS= <>
##$ZL1= 120
##$ZL2= 120
##$ZL3= 120
##$ZL4= 120
##$ABSF1= 14.98509
##$ABSF2= -5.573092
##$ABSG= 5
##$ABSL= 3
##$ALPHA= 0
##$AQORDER= 0
##$ASSFAC= 0
##$ASSFACI= 0
##$ASSFACX= 0
##$ASSWID= 0
##$AUNMP= <proc_prof1d_extract_pilot.lims>
##$AXLEFT= 0
##$AXNAME= <>
##$AXNUC= <1H>
##$AXRIGHT= 0
##$AXTYPE= 0
##$AXUNIT= <>
##$AZFE= 0.1
##$AZFW= 0.1
##$BCFW= 0
##$BC_mod= 0
##$BYTORDP= 0
##$COROFFS= 0
##$CY= 15
##$DATMOD= 1
##$DC= 0
##$DFILT= <>
##$DTYPP= 0
##$F1P= 0
##$F2P= 0
##$FCOR= 0.5
##$FTSIZE= 32768
##$FT_mod= 6
##$GAMMA= 0
##$GB= 0
##$INTBC= 1
##$INTSCL= 1
##$ISEN= 128
##$LB= 0
##$LEV0= 0
##$LPBIN= 0
##$MAXI= 10000
##$MC2= 0
##$MEAN= 0
##$ME_mod= 0
##$MI= 0
##$NCOEF= 0
##$NC_proc= -8
##$NLEV= 6
##$NOISF1= 0
##$NOISF2= 0
##$NSP= 0
##$NTH_PI= 0
##$NZP= 0
##$OFFSET= 14.98509
##$PC= 1
##$PHC0= 97.17957
##$PHC1= 0
##$PH_mod= 1
##$PKNL= yes
##$PPARMOD= 0
##$PPDIAG= 0
##$PPIPTYP= 0
##$PPMPNUM= 2147483647
##$PPRESOL= 1
##$PSCAL= 4
##$PSIGN= 0
##$PYNMP= <proc.py>
##$REVERSE= no
##$SF= 400.02
##$SI= 32768
##$SIGF1= 0
##$SIGF2= 0
##$SINO= 400
##$SIOLD= 32768
##$SPECTYP= <>
##$SREGLST= <1H.CDCl3>
##$SSB= 0
##$STSI= 32768
##$STSR= 0
##$SW_p= 8223.68421052631
##$SYMM= 0
##$S_DEV= 0
##$TDeff= 65536
##$TDoff= 0
##$TI= <>
##$TILT= no
##$TM1= 0
##$TM2= 0
##$TOPLEV= 0
##$USERP1= <user>
##$USERP2= <user>
##$USERP3= <user>
##$USERP4= <user>
##$USERP5= <user>
##$WDW= 1
##$XDIM= 32768
##$YMAX_p= 466140845
##$YMIN_p= -706690
##$CURPLOT= <Network HP LaserJet P1505>
##$CURPRIN= <$Network HP LaserJet P1505>
##$DFORMAT= <normdp>
##$LAYOUT= <+/1D_H.xwp>
##$LFORMAT= <normlp>
##$PFORMAT= <normpl>
##$SURQMSG= 1
$$ End of Bruker specific parameters
$$ ---------------------------------
##NTUPLES= NMR SPECTRUM
##VAR_NAME=  FREQUENCY,     SPECTRUM/REAL,   SPECTRUM/IMAG
##SYMBOL=    X,             R,               I
##VAR_TYPE=  INDEPENDENT,   DEPENDENT,       DEPENDENT
##VAR_FORM=  AFFN,          ASDF,            ASDF
##VAR_DIM=   32768,         32768,           32768
##UNITS=     HZ,            ARBITRARY UNITS, ARBITRARY UNITS
##FACTOR=    0.250966925370066, 1,           1
##FIRST=     8223.43324360094, -17627,       264410
##LAST=      0,             -11786,          -73059
##MIN=       0,             -706690,         0
##MAX=       8223.43324360094, 466140845,    0
$$ Real data points
##PAGE= N=1
##DATA TABLE= (X++(R..R)), XYDATA
$$ [...]
19551h1488j54464m232c7352B5513J8031K69137A02155a03296j13802A11349C9072
$$ -81488 -235952 -240184 -37352 25513 43544 312681 102155 -103296 -217098 111349 39072
19539e2445k1205B40757d9874k55157m7629A55499a74460l8321H3186a13041m787
$$ -52445 -73650 240757 -49874 -305031 -352660 155499 -174460 -212781 83186 -113041 -117828
19528a17828c9713k0645J2135q462D4579b52631K6853G0920c6457B48612h5975
$$ -117828 -39713 -60358 -48223 -56685 44579 -252631 -225778 70920 -36457 248612 -85975
19516b5917j76460O7013j37680A55375j3988b68051A71413b67027c6681j21928
$$ -25917 -202377 -135364 -273044 155375 141387 -268051 171413 -267027 -36681 -158609
19506a58609A1961b36801a14325j91941G2380b67661e158B18196B5492a84432
$$ -158609 11961 -236801 -114325 -306266 72380 -267661 -5158 218196 25492 -184432
19495b80339J02529A52828o8794d19683a82683N8230O1514j06447N2549k1060
$$ -280339 -177810 152828 84034 -419683 -182683 -124453 -62939 -169386 -116837 -137897
19485a37897p0944m5376h8202j10067N2685A99894J21464f3876k24186E324c3379
$$ -137897 -208841 -254217 -88202 -198269 -145584 199894 321358 -63876 -288062 5324 -33379
19473b76902J35018A32310a18029k19616J17224r1736B64721h1494B63959A19918
$$ -276902 -141884 132310 -118029 -337645 -220421 -312157 264721 -81494 263959 119918
19462E2417k0630P2718b8027p4948E4926d00521E4579b31126c7544c97A75672
$$ 52417 31787 104505 -28027 -102975 54926 -400521 54579 -231126 -37544 -397 175672
19450c21181A48115d9861J1855k68845A67510a87205A9950i9389A21808J149r915
$$ -321181 148115 -49861 -38006 -306851 167510 -187205 19950 -99389 121808 122957 113042
19439A13042b72562g1783o8802f7350J8261j46265B75893a00710G1348e6972j49351
$$ 113042 -272562 -71783 -140585 -67350 -49089 -195354 275893 -100710 71348 -56972 -206323
19428b06323j8674N163a09090R050p7213A29349e9588J2932j3121C6152b5320
$$ -206323 -224997 -219834 -109090 -100040 -177253 129349 -59588 -46656 -59777 36152 -25320
19416B28000A13908K2480c66041E5306g6816A3868d0520j17428L1262A19993a38544
$$ 228000 113908 136388 -366041 55306 -76816 13868 -40520 -157948 -126686 119993 -138544
19404f3601A4086O0396a86991j29396A20275b94419A90360a01604M3599B5583
$$ -63601 14086 74482 -186991 -316387 120275 -294419 190360 -101604 -58005 25583
19393a5376m5376n0512E6133d1073k41307B53598a20644C5586J7105P6218a20963
$$ -15376 -60752 -111264 56133 -41073 -282380 253598 -120644 35586 52691 128909 -120963
19381F9620b29714c3029B81200a20271G8248a19004C5838o707b4868l6696o459
$$ 69620 -229714 -33029 281200 -120271 78248 -119004 35838 29131 -24868 -61564 -68023
19370f8023H9052k8987a66548j56455J34825c2763L480j27806m3927M5356A47679
$$ -68023 89052 60065 -166548 -323003 -188178 -32763 -29283 -157089 -201016 -155660 147679
19358a21367b1208q2950l4119h460o8453m714j09423l3588C17010e5893p5097
$$ -121367 -21208 -104158 -138277 -8460 -76913 -81627 -191050 -224638 317010 -55893 -130990
19347a30990G7241l6899c66909a43664a1303k29397A8907g988G21N7525a57861
$$ -130990 77241 40342 -366909 -143664 -11303 -240700 18907 -7988 721 58246 -157861
19335C8076c3626j89894r9476E0901e5576E8525b38714j38287B89217a8376k90321
$$ 38076 -33626 -223520 -322996 50901 -55576 58525 -238714 -377001 289217 -18376 -308697
19324c08697a20796K0689A04134A0667b31591j05264J56750D0378a6904A14532
$$ -308697 -120796 -100107 104134 10667 -231591 -336855 -180105 40378 -16904 114532
19313a07618k59668C29897b2033B3337c013k01253D0415a81766B7717M3451R4955
$$ -107618 -367286 329897 -22033 23337 -3013 -204266 40415 -181766 27717 71168 166123
19302A66123b9585j10509k8797D5887h0905j20340A56498G0977O3171M8822H5495
$$ 166123 -29585 -140094 -168891 45887 -80905 -201245 156498 70977 134148 182970 85495
19290a3215j56954L0823L5719C31628A33503K5551a19357j65750A97093a85440
$$ -13215 -170169 -139346 -103627 331628 133503 159054 -119357 -285107 197093 -185440
19279D13756A59071K393m6931a0313j58409A32082a4006A71704d40928a58649
$$ 413756 159071 161464 114533 -10313 -168722 132082 -14006 171704 -440928 -158649
19268a51084r3114I3070B5077a82557o7336e0936A6548N2050a87455H448a17263
$$ -151084 -244198 93070 25077 -182557 -249893 -50936 16548 68598 -187455 8448 -117263
19256G5715a63630M8755G7760O3904a34920B26246a63604e1602B2145R1950a20757
$$ 75715 -163630 -114875 77760 141664 -134920 226246 -163604 -51602 22145 114095 -120757
19244a19814b5933j75958P2565B34576l9989b9138j75850P8499A40237N6824c21378
$$ -119814 -25933 -201891 -129326 234576 194587 -29138 -204988 -126489 140237 197061 -321378
19232a36298j35109m5208e8906Q480q4254L028c5164A15418J90591a05080a7888
$$ -136298 -271407 -316615 -58906 -50426 -134680 -131652 -35164 115418 306009 -105080 -17888
19220b54126B7015k728b21112g0776B99612h7638A30517a77247M0068B9464c63236
$$ -254126 27015 24287 -221112 -70776 299612 -87638 130517 -177247 -137179 29464 -363236
19208a15516E6575a78439N3368j47298a22383q0728j52602a17542B80270D374
$$ -115516 56575 -178439 -125071 -272369 -122383 -203111 -355713 -117542 280270 4374
19197i8502j26988H9071a50868a561k0137C6134c9044a7603E0682h3398E4955
$$ -98502 -225490 89071 -150868 -1561 -21698 36134 -39044 -17603 50682 -83398 54955
19185A22458m8206e029k53945a16602b1499A6174a21645I7757J82742d4711A4340
$$ 122458 74252 -5029 -258974 -116602 -21499 16174 -121645 97757 280499 -44711 14340
19173C1614g0855C1728d0271r0768n3365j62076J46071n4913j689J05974R915
$$ 31614 -70855 31728 -40271 -131039 -184404 -346480 -200409 -255322 -257011 -151037 -141122
19162a41122d8905k20409r323O6717P7291k6579a9160j38539a0092A4788a53670
$$ -141122 -48905 -269314 -278637 -211920 -134629 -161208 -19160 -157699 -10092 14788 -153670
19150F8181a41646A46225h6891b0142j73901G2587k8037a81671a892A15701a22595
$$ 68181 -141646 146225 -86891 -20142 -194043 72587 44550 -181671 -1892 115701 -122595
19138C814b10505f0414J6566k45043a28351H8429a5617C53923a20564N9629D8650
$$ 3814 -210505 -60414 -43848 -288891 -128351 88429 -15617 353923 -120564 -60935 48650
19126G0428f0343k28598a00318A051h7844B03609e3477A76240a75251C3659N2729
$$ 70428 -60343 -288941 -100318 1051 -87844 203609 -53477 176240 -175251 33659 86388
19115H6388R0804e0047A02482F400J41000a69594K0744K3123a2498A31387M3296
$$ 86388 177192 -50047 102482 6400 147400 -169594 -148850 -125727 -12498 131387 174683
19104A74683k6069b22511A90641N7664c73383n5792J44526A46371a54113J6181
$$ 174683 148614 -222511 190641 248305 -373383 -429175 -284649 146371 -154113 -137932
19094a37932B11485c71564e8894I7635a16770p6646L3558d9233j23276L9469m3807
$$ -137932 211485 -371564 -58894 97635 -116770 -193416 -159858 -49233 -172509 -133040 -176847
19083a76847p4924e0718k46916D049J76191a53847k3818A22192c9367D2824d1087
$$ -176847 -251771 -50718 -297634 4049 180240 -153847 -177665 122192 -39367 42824 -41087
19071a18258B66568b04167A01633c08090A55356A4648J5688b00282A82453M5930
$$ -118258 266568 -204167 101633 -308090 155356 14648 30336 -200282 182453 228383
19061B28383h7245A49226a59561B25240a53108p4485B70203b37767j73054B10809
$$ 228383 -87245 149226 -159561 225240 -153108 -227593 270203 -237767 -410821 210809
19050a87815d3237A69323a10753A38901a09908d2264j29762A68323a75711l04046
$$ -187815 -43237 169323 -110753 138901 -109908 -42264 -172026 168323 -175711 -479757
19040d79757b9643p5703B98790f8943q9181B69295B2253a45688a820j61575j9951
$$ -479757 -29643 -105346 298790 -68943 -158124 269295 22253 -145688 -1820 -163395 -183346
19029a83346A55111b08626j37383I7299l4974K46656a59130H0064a1632k36653
$$ -183346 155111 -208626 -346009 97299 62325 308981 -159130 80064 -11632 -248285
19019b48285A61952B776Q0103b90994Q5481B25072b04836e4592G7802f5573j60844
$$ -248285 161952 2776 82879 -290994 -205513 225072 -204836 -54592 77802 -65573 -226417
19008b26417j67245e7662n6321A8085P4939l1065D971J23552J02305f6235n3801
$$ -226417 -393662 -57662 -113983 18085 93024 61959 4971 128523 230828 -66235 -120036
18997a20036G1719M943b57382a10219B8745i2366j44083d8454E6922K8080f4219
$$ -120036 71719 76662 -257382 -110219 28745 -92366 -236449 -48454 56922 85002 -64219
18985A33096a27156a4363A98246e36709A10O4086a16851j91839f2530R83B2691
$$ 133096 -127156 -14363 198246 -536709 110 64196 -116851 -308690 -62530 -61547 22691
18973b06290O00b5918C3636g2434j42568A3902c8905A58112d14356a41193j93182
$$ -206290 -205690 -25918 33636 -72434 -215002 13902 -38905 158112 -414356 -141193 -334375
18962c34375Q2933A21437b41140B01412a14919j74018R2609O4037O1040C2010
$$ -334375 -251442 121437 -241140 201412 -114919 -288937 -196328 -132291 -71251 32010
18951h1942r6313F9653B1807R5904K06003E9922a84336B36305f2973A36020D2034
$$ -81942 -178255 69653 21807 117711 323714 59922 -184336 236305 -62973 136020 42034
18939c05938C40522a85695h2378A58480b02535j1519f0360E2334a66882C6043
$$ -305938 340522 -185695 -82378 158480 -202535 -214054 -60360 52334 -166882 36043
18928G158b16382i4346l58820C46569a4709C3410G383c4393j75096k3935b1304
$$ 7158 -216382 -94346 -453166 346569 -14709 33410 7383 -34393 -209489 -233424 -21304
18916F1521N4044b17286l758K6736A37694D7918b41319e1674q1417p4590h5246
$$ 61521 115565 -217286 -221044 -194308 137694 47918 -241319 -51674 -133091 -207681 -85246
18904a08408A60637G5263c50251d8096E465P7512a15991D7784c12503c4509j46643
$$ -108408 160637 75263 -350251 -48096 5465 82977 -115991 47784 -312503 -34509 -181152
18893a81152B14281g7258A17040b58439B14361b06547L4031k57797A58753a89298
$$ -181152 214281 -77258 117040 -258439 214361 -206547 -172516 -430313 158753 -189298
18882f8710G3380K01414a38140k9890n5519l2239A73217c03500C4417R8053a62500
$$ -68710 73380 274794 -138140 -168030 -223549 -255788 173217 -303500 34417 132470 -162500
18870d2451j3136C04497b03659L1015H774a17013q1350A3745m415M3068a81105
$$ -42451 -55587 304497 -203659 -172644 8774 -117013 -198363 13745 9330 52398 -181105
18858d9944J4922A54492b28081A36003J44930b31845m0724F505J07085a93640
$$ -49944 -35022 154492 -228081 136003 280933 -231845 -272569 6505 113590 -193640
18847B85149a61964H7172J1138a91545B40202L343E986K16279B5639L2708f0761
$$ 285149 -161964 87172 98310 -191545 240202 243545 5986 222265 25639 58347 -60761
18835b64882C3590c21293J54238O9168K8337H0976P8877F1969b50657O2754f4460
$$ -264882 33590 -321293 -167055 -97887 -69550 80976 159853 61969 -250657 -187903 -64460
18823c9615k40832a07081B36819r161b3436j04462R726q5320B12814J04146r0299
$$ -39615 -280447 -107081 236819 227658 -23436 -127898 -118172 -203492 212814 316960 226661
18812B26661B216J81494F0754J260L50605g1988l3947o1130D9665R7689r609a50033
$$ 226661 2216 183710 60754 62014 412619 -71988 -105935 -167065 49665 147354 137745 -150033
18799I9273J56611b56475a01926A08661d455j67196M739c2619k13136B20019b9047
$$ 99273 255884 -256475 -101926 108661 -4455 -171651 -166912 -32619 -245755 220019 -29047
18787D85856B0716P1972e2312k07727a975D87705a72220j75865B1201P409R8370
$$ 485856 20716 92688 -52312 -260039 -1975 487705 -172220 -348085 21201 28610 126980
18776A26980E0661J22298b31754A38918b75056B37641C0982c02181J26222B1123
$$ 126980 50661 172959 -231754 138918 -275056 237641 30982 -302181 -175959 21123
18765B6518J25707d7754j24108b2709k22824D8614a4921j2808j50141A71470d9980
$$ 26518 152225 -47754 -171862 -22709 -245533 48614 -14921 -27729 -177870 171470 -49980
18753D558e1165A79890b32212C85647h3556k98631k3196J08324d7496A15331k5348
$$ 4558 -51165 179890 -232212 385647 -83556 -382187 -405383 -297059 -47496 115331 89983
18742H9983k7613Q6838I142O1360i9478d5468B2716f4738k39029A97278b88040
$$ 89983 62370 149208 9142 70502 -99478 -45468 22716 -64738 -303767 197278 -288040
18730D15340b3715l08153a24127j10521A49205D3136a42763k93775h5794l93B02405
$$ 415340 -23715 -331868 -124127 -234648 149205 43136 -142763 -436538 -85794 -86187 202405
18718d38898A27734i6901j61187A89460b1078k94599d9789k92112a00950j24513
$$ -438898 127734 -96901 -258088 189460 -21078 -315677 -49789 -341901 -100950 -225463
18708b25463d8272j78544b0008j18943k6779G2988O7192P2371c3581l08761p646
$$ -225463 -48272 -226816 -20008 -138951 -165730 72988 140180 212551 -33581 -342342 -349988
18697c49988J38709L6257j25353J28315A79706c20815a43835L0062p8612C22145
$$ -349988 -211279 -175022 -300375 -172060 179706 -320815 -143835 -113773 -192385 322145
18686F9284J9787j2844a65944B84428i6176L0942p9558j4162d2127j14701A6541
$$ 69284 89071 76227 -165944 284428 -96176 -65234 -144792 -158954 -42127 -156828 16541
18674a93684M9927a2946j36113M2826k10798B9397a01859k63896A88114a01795
$$ -193684 -143757 -12946 -149059 -106233 -317031 29397 -101859 -365755 188114 -101795
18663B28373g595H618a96976B03999c632k21115f9162H7948J64031c61920J78592
$$ 228373 -7595 8618 -196976 203999 -3632 -224747 -69162 87948 251979 -361920 -183328
18652a83328c7931j81340i8625j95035D6954K8410b88817F0643d42528a75967
$$ -183328 -37931 -219271 -98625 -293660 46954 75364 -288817 60643 -442528 -175967
18641b05840B22243b50130R6385f087A73262c5708a2092A64253a53371M2404e0741
$$ -205840 222243 -250130 -153745 -6087 173262 -35708 -12092 164253 -153371 -110967 -50741
18629A00296k6147c66343C47184a17163q6498D9570P6111a66954A87789c2218
$$ 100296 74149 -366343 347184 -117163 -203661 49570 125681 -166954 187789 -32218
18618f4551C6825A3055c4325j34013d2928j13629A34492a1753j09947B17741j07041
$$ -64551 36825 13055 -34325 -168338 -42928 -156557 134492 -11753 -121700 217741 110700
18607A10700N0654F694J28527a36490A38066b11023B44092a0907j76872B3094
$$ 110700 161354 6694 135221 -136490 138066 -211023 244092 -10907 -187779 23094
18596a33341j81422b36B45592Q8379m1537b87226R8351d3110C0456e2944H5240
$$ -133341 -314763 -236 245592 333971 292434 -287226 -188875 -43110 30456 -52944 85240
18584A28284c33275A60706c89177J08706D79b67635R0392K2752q2100b5822p0985
$$ 128284 -333275 160706 -389177 -280471 479 -267635 -177243 -154491 -236591 -25822 -96807
18573i6807C5301a71770C77008A62583G7162e3799k30827L6870J15096I7064a01975
$$ -96807 35301 -171770 377008 162583 77162 -53799 -284626 -247756 -132660 97064 -101975
18561a20097B8785h0400A23110L4296a13020d2914B51143q3533a15212D4952a94070
$$ -120097 28785 -80400 123110 157406 -113020 -42914 251143 167610 -115212 44952 -194070
18549A4752l863f9992J6968c628I0083B829a34547J4003m6008A8944O2631b8277
$$ 14752 10889 -69992 -53024 -3628 90083 2829 -134547 -120544 -166552 18944 81575 -28277
18536b60456A33666d2804j85005B4030a58249k4772A00125a42643J6130A0823
$$ -260456 133666 -42804 -227809 24030 -158249 -183021 100125 -142643 -126513 10823
18525F2853a39410B0669b00401o3377A06549a38316j87772J05591D3904a14308
$$ 62853 -139410 20669 -200401 -263778 106549 -138316 -326088 -220497 43904 -114308
18514A56427a10788j13019J02736A26400c88208D9570d5259I9622f0305E543N2322
$$ 156427 -110788 -223807 -121071 126400 -388208 49570 -45259 99622 -60305 5543 57865
18503E7865a79544D03795f1995j7639K7140A18064L5776O8424a36495K9836L2916
$$ 57865 -179544 403795 -61995 -79634 -52494 118064 153840 222264 -136495 -106659 -73743
18492g3743D4485a48200j50159J49042O1635q3394D7623J1050h3672m1504n4738
$$ -73743 44485 -148200 -298359 -149317 -87682 -171076 47623 58673 -83672 -125176 -179914
18481a79914e8412l10961B89815a86448l0408L2443A6838b10885k03150a73894
$$ -179914 -58412 -369373 289815 -186448 -216856 -184413 16838 -210885 -414035 -173894
18470f8031j39875A89167K98589a46833m7336P3542A70625R3757k0181A00246
$$ -68031 -207906 189167 487756 -146833 -194169 -120627 170625 264382 244201 100246
18459h2079M967E029b96254K2051M2240a4503p7523j50333a07906K0522L3119
$$ -82079 -77112 5029 -296254 -274203 -231963 -14503 -92026 -242359 -107906 -87384 -54265
18448e4265A3290a78688B827L51318A15663a54658q8457c001j32279B8837K62284
$$ -54265 13290 -178688 2827 354145 115663 -154658 -243115 -3001 -135280 28837 291121
18437B91121a33447B6720a69900B03931e99n37197B5397b90730a42933e625l17012
$$ 291121 -133447 26720 -169900 203931 -599 -537796 25397 -290730 -142933 -5625 -322637
18426c22637j04891G5173K80201b50863a04072A139K3181d21223A46526B6933
$$ -322637 -427528 75173 355374 -250863 -104072 1139 24320 -421223 146526 26933
18415a01385A74874a29722l8242O4838k07920J49974k6336A06511i9963B46680
$$ -101385 174874 -129722 -167964 -103126 -311046 -161072 -187408 106511 -99963 246680
18404I6095K3055l4678c567A00656a06703n8291j12418P3735E5085Q4402J30227
$$ 96095 119150 84472 -3567 100656 -106703 -164994 -277412 -203677 55085 139487 269714
18393B69714c45496P7727Q6385q2030a02913r555J0950F3673Q2666p2557e6109
$$ 269714 -345496 -267769 -181384 -263414 -102913 -112468 -101518 63673 146339 73782 -56109
18381b31508B22924G1535M15848A00398a5669p8596r3574A1980J26329e2235J844
$$ -231508 222924 71535 487383 100398 -15669 -94265 -187839 11980 138309 -52235 -50391
18370e0391B72502a17182A35058a60547O2107j64015c7478j91364I7798K0015
$$ -50391 272502 -117182 135058 -160547 -98440 -262455 -37478 -228842 97798 117813
18360A17813E612b5534A6642a530E6518B1565L656Q9665a58295M224A57055a20182
$$ 117813 5612 -25534 16642 -1530 56518 21565 25221 114886 -158295 -154071 157055 -120182
18347b39766a1509l3780C5613J69685e06492A66879a27995B37795c22372a52093
$$ -239766 -11509 -45289 35613 205298 -506492 166879 -127995 237795 -322372 -152093
18336h2441j77286f8340k55158o4951e607H3163K0440a55558C6056a87865F3297
$$ -82441 -259727 -68340 -323498 -388449 -5607 83163 103603 -155558 36056 -187865 63297
18324A47570a14885j20342Q6706d3372j09302J1060C26666e6296E5769a02326
$$ 147570 -114885 -235227 -148521 -43372 -152674 -141614 326666 -56296 55769 -102326
18313a89244r6198A55357P2080F2043a15776D6090e6231K7551j73097P5410F703
$$ -189244 -285442 155357 227437 62043 -115776 46090 -56231 -28680 -201777 -126367 6703
18301c8681Q983B8418K15304f4701K3417k19675d6005j3254j00257O3364A88503
$$ -38681 -29698 28418 243722 -64701 -41284 -260959 -46005 -59259 -159516 -96152 188503
18289a60433J8354j75181E5631a83195C4069a54886F6136b6808o5934L2649l8641
$$ -160433 -142079 -317260 55631 -183195 34069 -154886 66136 -26808 -92742 -60093 -98734
18278i8734D95954a60096e3597F5140K93865j63732a7147A21510a43833B5219
$$ -98734 495954 -160096 -53597 65140 359005 195273 -17147 121510 -143833 25219
18267a47784f0273M668b443j41001c5902C02455d01084F4800a33702A28748c31700
$$ -147784 -60273 -55605 -2443 -143444 -35902 302455 -401084 64800 -133702 128748 -331700
18255i3309A821e33418b34253B55584B2253b17143j88553g685j43750j90095a57715
$$ -93309 1821 -533418 -234253 255584 22253 -217143 -405696 -7685 -151435 -341530 -157715
18243B9652a29868D9804j0799g0632J1635b4535B11761a67288h1910j90002C4809
$$ 29652 -129868 49804 39005 -70632 -58997 -24535 211761 -167288 -81910 -271912 34809
18231a93061j50959H3414a93814N7451a4603j9252A21053a86272M4100A57841
$$ -193061 -344020 83414 -193814 -136363 -14603 -33855 121053 -186272 -142172 157841
18220b00725Q4996H0043b71146A37558a18522D7046N7422c09101k6200A74844
$$ -200725 -115729 80043 -271146 137558 -118522 47046 104468 -309101 -335301 174844
18209g5656E5185b7363l76509h633k1396A04990c35483H982K3520a53493C3982
$$ -75656 55185 -27363 -403872 -8633 -30029 104990 -335483 8982 32502 -153493 33982
18197a00933E4176e8245l4831j1745b8109D6723Q9846d03990a31264b8390L692
$$ -100933 54176 -58245 -93076 -104821 -28109 46723 136569 -403990 -131264 -28390 -24698
18186b4698l24720B42420d37426J49761C9847M4020k4220c2120l8200H400c72960
$$ -24698 -349418 242420 -437426 -287665 39847 83867 59647 -32120 -70320 8400 -372960
18174c20120B26521E2205a52818g2843A29179f3006A32162g1575J2265k49940
$$ -320120 226521 52205 -152818 -72843 129179 -63006 132162 -71575 -59310 -309250
18164c09250J19956D7749i3658j00198j45389H1020h223m0051A31046a00394d7055
$$ -309250 -189294 47749 -93658 -193856 -339245 81020 -8223 -48274 131046 -100394 -47055
18152f9839A08769a61623C8596J89597a18013k86156a46450K7048A48241j5944
$$ -69839 108769 -161623 38596 228193 -118013 -404169 -146450 -119402 148241 132297
18142A32297j8918O406Q2082e4151C02431M4707a0000k1584I5302a70321A84653
$$ 132297 113379 119785 201867 -54151 302431 347138 -10000 -31584 95302 -170321 184653
18130H3155C6004j5144J810a64499A44929a25180k01723I1113e65j02591D8717
$$ 83155 36004 20860 22670 -164499 144929 -125180 -326903 91113 -565 -103156 48717
18118a10962j40321J22722B79618H5703c07792A29319F937K08198a38333A54584
$$ -110962 -251283 -128561 279618 85703 -307792 129319 6937 215135 -138333 154584
18107c64332J24986j01566C4576a66591B13966B5746i8647J2537C4060a23657
$$ -364332 -239346 -340912 34576 -166591 213966 25746 -98647 -86110 34060 -123657
18096B19107M3658a29598k6617O6779D0856K1734J26459j7504L6309a47957b6220
$$ 219107 262765 -129598 -156215 -89436 40856 62590 189049 171545 207854 -147957 -26220
18084h7277j63421M027D2840a24632a5928l4963j58014P4583F5941a42186p9952
$$ -87277 -250698 -246671 42840 -124632 -15928 -50891 -208905 -134322 65941 -142186 -222138
18073b22138G4838J73126b724A82262K984b51853g8712D7769g7797A89702e6451
$$ -222138 74838 247964 -2724 182262 185246 -251853 -78712 47769 -77797 189702 -56451
18061A85691b03316A63799C7702j5801a62634r3201k08398J50081R6088B16592
$$ 185691 -203316 163799 37702 21901 -162634 -255835 -464233 -314152 -218064 216592
18050B87709f3473j60509h2376j10170M7267B23107c59815a39863F3670i2190
$$ 287709 -63473 -223982 -82376 -192546 -145279 223107 -359815 -139863 63670 -92190
18039H3692e39133a2407j09456C13239i962q0884A79745D7783a18329E9948K5459
$$ 83692 -539133 -12407 -121863 313239 -9962 -90846 179745 47783 -118329 59948 85407
18028H5407e9231j34416f3986j02520H1350J25862o6600b21319a05549R453b2016
$$ 85407 -59231 -193647 -63986 -166506 81350 207212 140612 -221319 -105549 -96096 -22016
18016a09684A07200D4036c47759K6728J35014G1433c0971C27316c40268F6416
$$ -109684 107200 44036 -347759 -321031 -186017 71433 -30971 327316 -340268 66416
18005i2126A6750a72858d8377j3549F5696b73107C0452a52031f9278A60484n7845
$$ -92126 16750 -172858 -48377 -61926 65696 -273107 30452 -152031 -69278 160484 102639
17994A02639D6572g733p1716j69376A97387c74274a32643G9476c9709m1173c9511
$$ 102639 46572 -7733 -79449 -248825 197387 -374274 -132643 79476 -39709 -80882 -39511
17982h4507A78721c5675J5275A88686c67041J27464h1970D2493b93058c245B65739
$$ -84507 178721 -35675 -20400 188686 -367041 -239577 -81970 42493 -293058 -3245 265739
17970a04559l6455N7479o1579K9849c4298B839L7038a90823a2674r0025n5314
$$ -104559 -141014 -83535 -145114 -115265 -34298 2839 39877 -190823 -12674 -102699 -158013
17959a58013A11111a09283p3740H2627g2288G8995i5949d7837j21683h1090j00423
$$ -158013 111111 -109283 -183023 82627 -72288 78995 -95949 -47837 -169520 -81090 -181513
17948a81513M913A03047C5510i3765C07862e9075J8873l0002O657j15764D9005
$$ -181513 -176600 103047 35510 -93765 307862 -59075 -40202 -70204 -63547 -179311 49005
17936d3676r8423A91942d46887e8029F8476c10547e0317D4974J81527p0920K17433
$$ -43676 -142099 191942 -446887 -58029 68476 -310547 -50317 44974 226501 155581 373014
17925C73014d4550k30174j47906a80037B1867q945h6757J3147E7746g5828c5668
$$ 373014 -44550 -274724 -422630 -180037 21867 12922 -86757 -73610 57746 -75828 -35668
17913a59263B69240A06878b15798j62177G9192J46809f6422A04709M8044P3226
$$ -159263 269240 106878 -215798 -377975 79192 226001 -66422 104709 152753 225979
17903B25979a21719I4504b92253p7824a65737P9117K5834n0789B63502l8310a44805
$$ 225979 -121719 94504 -292253 -370077 -165737 -86620 -60786 -111575 263502 225192 -144805
17891B21435g649k12338A50192a7923j59429N62j68481c0325G2473L1861i8268
$$ 221435 -7649 -219987 150192 -17923 -177352 -176790 -345271 -30325 72473 104334 -98268
17879C901c96857b6648n4389i381D7587J31988k4298C42c42743K6298C5051J536
$$ 3901 -396857 -26648 -81037 -9381 47587 179575 155277 342 -342743 -316445 35051 36587
17867C6587O9743J31634D9342i0406L115j37579R1959c3241m3508F416b07305
$$ 36587 106330 237964 49342 -90406 -87291 -224870 -132911 -33241 -76749 6416 -207305
17855F292J91496a6457H1291b72997f6997o2373P675A20478e0890l4378J0901
$$ 6292 197788 -16457 81291 -272997 -66997 -129370 -121695 120478 -50890 -85268 -74367
17844g4367A89672n2808b7973l0944B61760j15375d1518I9627J41820d5679j01869
$$ -74367 189672 136864 -27973 -58917 261760 146385 -41518 99627 241447 -45679 -147548
17833a47548n9424e9244r3613f7456q703e64q4606A94518r1413d578C32186B4481
$$ -147548 -206972 -59244 -152857 -67456 -76159 -564 -85170 194518 103105 -4578 332186 24481
17820A48342i7649A48584b90211a1956A01300a98941d5024k70387G2887c17817
$$ 148342 -97649 148584 -290211 -11956 101300 -198941 -45024 -315411 72887 -317817
17809C21011D509R9107j3437d9770q0001j54313b1201C8979R1460a40825c145
$$ 321011 4509 103616 90179 -49770 -129771 -284084 -21201 38979 130439 -140825 -3145
17797e9395J7751C7265L4115e0841E5178L31713A7560a53133E8993b41432A33914
$$ -59395 -41644 37265 71380 -50841 55178 386891 17560 -153133 58993 -241432 133914
17785C0573L6539f4168B1472j840n323b45010d4568P158B30574B435c9811j26795
$$ 30573 67112 -64168 21472 19632 14309 -245010 -44568 -37410 230574 2435 -39811 -166606
17773a66606B33322b15224H7940L3421b75275D8662a46539B2233J20250b51091
$$ -166606 233322 -215224 87940 121361 -275275 48662 -146539 22233 142483 -251091
17762A00325b08722A03595d53816B71972a52295B1201R8950g2209A01886b5002
$$ 100325 -208722 103595 -453816 271972 -152295 21201 120151 -72209 101886 -25002
17751e6776A10222R1819f0585j59551I8272g4434c0112o0703m8092A40429M2569
$$ -56776 110222 202041 -60585 -220136 98272 -74434 -30112 -90815 -138907 140429 182998
17740A82998a83178m5506L8058K7688B76139a84922k80998A09745a4193A31127
$$ 182998 -183178 -228684 -190626 -162938 276139 -184922 -465920 109745 -14193 131127
17729e5632j84538A76272c24899H7093d7470J0222p2615A44320C9255M0568J98720
$$ -55632 -240170 176272 -324899 87093 -47470 -37248 -109863 144320 39255 79823 278543
17718B78543c22388A01945J60960j17112a45333C53908J10247B2728H369k361
$$ 278543 -322388 101945 262905 145793 -145333 353908 464155 22728 8369 6008
17708F008c51916h1140E1380K44508j29539a2489k92965B22362a74059N8872C8357
$$ 6008 -351916 -81140 51380 295888 166349 -12489 -305454 222362 -174059 -115187 38357
17696c47080A06260k4244k0697d0495G1508a90037N7607B2902e359H8346A5459
$$ -347080 106260 82016 61319 -40495 71508 -190037 -132430 22902 -5359 88346 15459
17684a00391L011q0718e6651o0696d8577j73875B46156r4986J46954a3558j45295
$$ -100391 -97380 -178098 -56651 -117347 -48577 -222452 246156 151170 298124 -13558 -158853
17673a58853c0363I039a54543A76319k3297b0209j21585d0973A76636B1746J11791
$$ -158853 -30363 9039 -154543 176319 153022 -20209 -141794 -40973 176636 21746 133537
17662A33537b3715d622A2279J55067e1781A05339n0794a11844A63653J95996b67758
$$ 133537 -23715 -4622 12279 167346 -51781 105339 54545 -111844 163653 359649 -267758
17650B8940b43281A24647k5357l6116R0868b64775J13051A41507B8805J4595f011
$$ 28940 -243281 124647 99290 63174 154042 -264775 -151724 141507 28805 43400 -6011
17638B87788a02156k0702H6386l2484K85435B3268J37173P5327h452B39320j7904
$$ 287788 -102156 -122858 86386 53902 339337 23268 160441 235768 -8452 239320 221416
17627B21416I6270L5703J44868c2109B1975d7294a0651A53119c4317A22282P6480
$$ 221416 96270 131973 276841 -32109 21975 -47294 -10651 153119 -34317 122282 198762
17616A98762I9367I786J66470K86921B10635c21468D6590i5226B25941j10275
$$ 198762 99367 9786 176256 463177 210635 -321468 46590 -95226 225941 115666
17606A15666a11283G9477J98388a84995B37117b14489B983J55938L9443b75504
$$ 115666 -111283 79477 277865 -184995 237117 -214489 2983 158921 198364 -275504
17595B0666a82735n0937J4755P0048n4108e346j00124I8195A2166R6964a6718
$$ 20666 -182735 -233672 -218917 -148869 -202977 -5346 -105470 98195 12166 109130 -16718
17583A77187j5465f7047r4095B4830f6866B38256b88664A53436a28462A21660
$$ 177187 161722 -67047 -161142 24830 -66866 238256 -288664 153436 -128462 121660
17572a9002j03760H2924b26640B95025E7476P8001i0854C2393Q9051D0247a72320
$$ -19002 -122762 82924 -226640 295025 57476 135477 -90854 32393 121444 40247 -172320
17560C35215A37578A527J23260i3797j811j92123h7132k00958c4484B11257p8907
$$ 335215 137578 1527 124787 -93797 -95608 -287731 -87132 -288090 -34484 211257 132350
17549A32350E7911b86045B77518a88774f7119A27759c0708j15477C89303A49250
$$ 132350 57911 -286045 277518 -188774 -67119 127759 -30708 -146185 389303 149250
17538D5142K6541J49937I8234g9478j4420A76145R9010c7386K308F8037a2454
$$ 45142 71683 221620 98234 -79478 -93898 176145 275155 -37386 -35078 68037 -12454
17526G0170C3791I378J65332q5651f8655F1123L3339c10805B18060b40824l909
$$ 70170 33791 9378 174710 89059 -68655 61123 94462 -310805 218060 -240824 -244733
17515b44733b8991l31475A99285a7782A60173J52674E1425O9342B5178K89879
$$ -244733 -28991 -360466 199285 -17782 160173 312847 51425 120767 25178 315057
17505C15057J37596j70316a34038c9647a8918A10367h7071B53490O0753r9637
$$ 315057 452653 282337 -134038 -39647 -18918 110367 -87071 253490 314243 214606
17495B14606l7689f2232q6405C17484E0975a3277C76438A65699e4785A57666i803
$$ 214606 176917 -62232 -148637 317484 50975 -13277 376438 165699 -54785 157666 -9803
17483D10802A95539A7021J8016J01060K32586G4228I811L87149j49513m7274k6068
$$ 410802 195539 17021 35037 136097 368683 74228 9811 396960 247447 200173 174105
17472A74105G5239f7612A92293K7584c3590A30993b26140B87127I449M07258f0313
$$ 174105 75239 -67612 192293 219877 -33590 130993 -226140 287127 9449 416707 -60313
17460A82400J35031r8338b71224A08397J46753A7804K2698M59660b42156B09480
$$ 182400 317431 219093 -271224 108397 255150 17804 40502 500162 -242156 209480
17449C20114J06561o4181j45246L5587k7341J58601G4788L34045j40874a04324
$$ 320114 426675 362494 217248 252835 225494 384095 74788 408833 267959 -104324
17438A44537h9671A95613F7232O9789a84342D03305e4667B63328J7781j13192
$$ 144537 -89671 195613 67232 137021 -184342 403305 -54667 263328 281109 167917
17428A67917J12900J24800j45644K03115B02816L48576B8975K72683m9870N2662
$$ 167917 280817 405617 259973 463088 202816 551392 28975 301658 251788 304450
17418C04450a2832A27621J96809J05258j71796F4157K19931b76273B70417l7419
$$ 304450 -12832 127621 324430 429688 257892 64157 284088 -276273 270417 232998
17408B32998B0597L13881J4557H3533P9311J6654O7976i3381F5861J99355D2675
$$ 232998 20597 334478 349035 83533 162844 179498 247474 -93381 65861 265216 42675
17396A46819J59592j34297J03626c77626A13933M35768e8273C05977j49844J54540
$$ 146819 306411 172114 275740 -377626 113933 549701 -58273 305977 156133 310673
17386C10673K27070A13877J30872B0192i9417A71092A2832L10508A22501E9507
$$ 310673 537743 113877 244749 20192 -99417 171092 12832 323340 122501 59507
17375C50768A41830f0375C64523A56531R0619J2543q9052b3168J994A37463n0266
$$ 350768 141830 -60375 364523 156531 247150 259693 170641 -23168 -21174 137463 87197
17364H7197a54280B05057i0874C43075d5554B92049h4049C34281M5323b37728
$$ 87197 -154280 205057 -90874 343075 -45554 292049 -84049 334281 379604 -237728
17353F8077L81146H7438L53406k16128q2791g650A70480p145R4051A11739m6213
$$ 68077 449223 87438 440844 224716 141925 -7650 170480 163335 257386 111739 65526
17342F5526d4741C8544J61998G7465F639J78033e2744j04829F14685b08830A99788
$$ 65526 -44741 38544 200542 77465 6639 184672 -52744 -157573 614685 -208830 199788
17330e4976B34421c0995A90983q2876K05170A10050L7895n8623K53327A28690
$$ -54976 234421 -30995 190983 108107 313277 110050 147945 89322 342649 128690
17319b4906j55360A68210C3851b8729A45495N9076k6874J50269A08353a15148
$$ -24906 -180266 168210 33851 -28729 145495 204571 177697 327966 108353 -115148
17308A53903C8238L71883d032E7562i662B54195r1945k4506K05479E1054a94324
$$ 153903 38238 410121 -4032 57562 -9662 254195 162250 137744 343223 51054 -194324
17296G3926M2784L03226L2077j96596j10029K00848A55268e0438j29566G5365
$$ 73926 116710 419936 452013 255417 145388 346236 155268 -50438 -180004 75365
17285E79M63346j34121j17429b29909c7797C51720j22000J76328G1720J55478
$$ 579 463925 329804 212375 -229909 -37797 351720 229720 406048 71720 227198
17275B27198K4690M4744c07737A66310a43717B73752j02883J3050d9808N423J0661
$$ 227198 251888 296632 -307737 166310 -143717 273752 170869 183919 -49808 -44385 -33724
17264c3724A15410m3409L47044i0123E12786j43981j83276q6315J89884I0059
$$ -33724 115410 72001 419045 -90123 512786 368805 185529 99214 289098 90059
17253E3767J59468A286J38608a41888H0529K34946A00775a3556j14143A62108
$$ 53767 213235 1286 139894 -141888 80529 315475 100775 -13556 -127699 162108
17242B85918J3904A3425O5915K12607a9962o5731H0169J48532m9800J02508e5705
$$ 285918 299822 13425 79340 291947 -19962 -85693 80169 228701 178901 281409 -55705
17230A87728n0412J07062G093M10489G8430L49184F3600P8517K30970r0393J33660
$$ 187728 137316 244378 7093 417582 78430 427614 63600 142117 373087 282694 416354
17219D16354K5828A10684K58618A1430J45645K47480G5509J6274M67718k24888
$$ 416354 442182 110684 369302 11430 157075 404555 75509 91783 559501 334613
17209C34613k3856A38419J09461B6186L9326J40389F2120J79532G0775K59177
$$ 334613 310757 138419 247880 26186 65512 205901 62120 241652 70775 329952
17199C29952E0223Q7902P3012H0769M21625B06808J52130H4532J84873m4569K18583
$$ 329952 50223 138125 211137 80769 502394 206808 358938 84532 269405 224836 443419
17188D43419A49393M6285O1337h994C29444D1116M8226L7654M62540H904K95986
$$ 443419 149393 195678 257015 -8994 329444 41116 89342 126996 589536 8904 304890
17177C04890p2563C8830M42474k17900K08849m8461b08013E4339P7994N3550K66486
$$ 304890 232327 38830 481304 263404 472253 423792 -208013 54339 132333 185883 452369
17166D52369B0955g265r1823m6839A10032j4850J42713M9623j27538r530p221
$$ 452369 20955 -7265 -99088 -145927 110032 95182 237895 287518 159980 150450 143229
17155A43229L3080J98639j9937J05040j55093J37373j35328O5758r3910J32885
$$ 143229 176309 374948 355011 460051 304958 442331 307003 372761 278851 411736
17145D11736H3843f4139A66359p0763L87362A76496L27411k46229M1518K8677
$$ 411736 83843 -64139 166359 95596 482958 176496 503907 257678 299196 327873
17135C27873J35181H1410J38818J72129A47808O8756J6867J34782K02866B14846
$$ 327873 463054 81410 220228 392357 147808 216564 233431 368213 571079 214846
17124B10314p5641P9313J29437Q279m238J61784j57790O2083F2486J43137I3184
$$ 210314 134673 213986 343423 351702 347464 509248 351458 413541 62486 205623 93184
17112F4915M90910q9066j94710J85183n9214P8670R6437j94612p0650k9864m3082
$$ 64915 555825 466759 272049 457232 398018 476688 573125 378513 307863 277999 234917
17101B34917m6148R9926O119d7980E24163Q5550H6122J53420J50390K01645B20072
$$ 234917 188769 288695 294814 -47980 524163 609713 86122 239542 389932 591577 220072
17089D69655j0050A37930L24788K5346A23857O51111C36331J19613n0445K4900
$$ 469655 459605 137930 462718 488064 123857 774968 336331 455944 405499 430399
17079D30399J15885k0223d5204F15502j42312n5304j89744J18941L28730B78227
$$ 430399 546284 526061 -45204 615502 473190 417886 228142 347083 675813 278227
17068C43443k6225L10323j88297A32643M04829n3190L75173k98064k4722k63124
$$ 343443 317218 627541 439244 132643 537472 484282 859455 561391 536669 273545
17058B73545G9588K78739L33416q9234J28346j45262l1730A83291M47320k50384
$$ 273545 79588 358327 691743 602509 730855 585593 553863 183291 630611 380227
17048C80227l161M5500K73836j14597j03633j84531K80353k5271J9576J05584
$$ 380227 377066 422566 696402 581805 478172 293641 573994 548723 568299 673883
17038F73883M2304B94379K26522R3417P3419j95806m5446k8369J47117J5246k2770
$$ 673883 716187 294379 520901 614318 687737 491931 446485 418116 565233 580479 557709
17027E57709B45619L41348J33912j11990q2697L06983l67158J44649k22050K75004
$$ 557709 245619 586967 720879 608889 526192 833175 466017 610666 388616 663620
17017F63620n9911J53106C40398K62512K44297C94627K26843L7381j5519k03684
$$ 663620 603709 756815 340398 602910 847207 394627 621470 658851 643332 439648
17007D39648O8338J89253k99279K85884l4120K15282l46526K04597j4724j9597
$$ 439648 507986 697239 397960 683844 649724 865006 518480 723077 708353 688756
16997F88756N8132j63757K51412D04785L83863j90171j61457K44056k48178K55307
$$ 688756 746888 583131 834543 404785 788648 598477 437020 681076 432898 688205
16987F88205P3297l14540K34629R6801O9016J98473p0122k24336L2184J50382
$$ 688205 761502 446962 681591 778392 847408 1045881 975759 751423 783607 933989
16977I33989j45736R3820p2123j05708p3943J11165L0469J93135k73113Q8863
$$ 933989 788253 882073 809950 704242 630299 741464 771933 965068 691955 780818
16967G80818o8462M57512m23381r9767j63450K85656r6975m549l7825K41595j64191
$$ 780818 712356 1169868 746487 646720 483270 768926 671951 667402 629577 871172 706981
16956G06981Q3231K18753k66666O35660j44976l13146j0884J80155k25656L54931
$$ 706981 790212 1008965 742299 1377959 1232983 919837 908953 1089108 863452 1218383
16946A218383j49483Q8610l8114l33164K83772J14387j89887J52768K29691l64722
$$ 1218383 1068900 1157510 1119396 786232 1070004 1184391 994504 1147272 1376963 1012241
16936A012241J09502l4179J30479j66923O13177m03492k34851N0278Q1445r4645
$$ 1012241 1121743 1087564 1218043 1051120 1664297 1260805 1025954 1076232 1157677 1063032
16926A063032J94737P3121p3860k33037K95538P1907J26837j0912m10892K39346
$$ 1063032 1257769 1330890 1257030 1023993 1319531 1391438 1518275 1507363 1096471 1335817
16916A335817q4253N2624N8168K5053K34408k07218J53478J1484o484n2533K22461
$$ 1335817 1251564 1304188 1362356 1387409 1621817 1414599 1568077 1579561 1573077 1520544 1743005
16905A743005l7105l50077N10207k49638L9939j85681k12804M21082k61931J35138
$$ 1743005 1705900 1355823 1866030 1616392 1656331 1470650 1257846 1678928 1416997 1552135
16895A552135K43728J12047j03346K93n9927L40103j67760l8282j01546Q9491
$$ 1552135 1795863 1907910 1804564 1804857 1744930 2085033 1917273 1878991 1777445 1866936
16885A866936r7682J94779J63354l97259L05925K80854l01786J72910j63956J674
$$ 1866936 1769254 1964033 2127387 1730128 2036053 2316907 2015121 2188031 2024075 2025749
16875B025749J69300k5038K3352q8601J25315n538L66637l65287L37093j60893
$$ 2025749 2195049 2170011 2193363 2104762 2230077 2224539 2591176 2225889 2562982 2402089
16865B402089J55448j86162l99031P1783M76311K24100J74436j59251J16027m2776
$$ 2402089 2557537 2371375 1972344 2044127 2520438 2744538 2918974 2759723 2875750 2832974
16855B832974K22173l25964J87894J5698L07239k06697J70188L914k69014K70219
$$ 2832974 3055147 2729183 2917077 2932775 3240014 3033317 3203505 3207419 2938405 3208624
16845C208624J26067j34037K93966j28862k46162N69145l42562L66414q5376M17122
$$ 3208624 3334691 3200654 3494620 3365758 3119596 3688741 3346179 3712593 3627217 4044339
16835D044339l45052P2852j1141J85631j96980L55568K55569m7295j05720j61459
$$ 4044339 3699287 3772139 3760998 3946629 3749649 4105217 4360786 4313491 4207771 4046312
16825D046312L66676K36088N0173J70259K35741l79505J06992K97561r2898N80299
$$ 4046312 4412988 4649076 4699249 4869508 5105249 4725744 4832736 5130297 5037399 5617698
16815E617698j10503N5159J03356N4742L15334J12703K0323L69722j72534K50819
$$ 5617698 5507195 5562354 5665710 5720452 6035786 6148489 6168812 6538534 6366000 6616819
16805F616819L60805L61182m23738K37068l04119L76899Q12522p8326J82868K17025
$$ 6616819 6977624 7338806 6915068 7152136 6848017 7224916 8037438 7959112 8141980 8359005
16795H359005N9715L12303J00633q727N26979K01555O9825P72167Q6381J01001
$$ 8359005 8418720 8731023 8831656 8822929 9349908 9551463 9621288 10393455 10479836 10580837
16785A0580837O01527l1100J07403M18430P95041J40672K99731O12847L59982
$$ 10580837 11182364 11151264 11258667 11677097 12472138 12612810 12912541 13525388 13885370
16776A3885370M53060N92151R7255Q11366O54262K07122P22927L17653Q10966
$$ 13885370 14338430 14930581 15027836 15839202 16493464 16700586 17423513 17741166 18552132
16767A8552132Q53047O89706K67428J064710P19704J158759P29023J051626R71848
$$ 18552132 19405179 20094885 20362313 21427023 22146727 23305486 24034509 25086135 26057983
16758B6057983J266305J105778J401119J245269J088471J669895J636921J951775
$$ 26057983 27324288 28430066 29831185 31076454 32164925 33834820 35471741 37423516
16750C7423516J645893K117323J870031K125199K576690K664221K663045K512412
$$ 37423516 39069409 41186732 43056763 45181962 47758652 50422873 53085918 55598330
16742E5598330L461645L545833L705965L626907M323984M721917M758291N359427
$$ 55598330 59059975 62605808 66311773 69938680 74262664 78984581 83742872 89102299
16734H9102299N701746N291777O986002O725289P163421P638014Q062637P944868
$$ 89102299 94804045 100095822 107081824 113807113 120970534 128608548 136671185 144616053
16726A44616053Q472158Q127075Q374597P870258P205334O780248O021914M411469
$$ 144616053 153088211 161215286 169589883 177460141 184665475 191445723 197467637 201879106
16718B01879106L559739J512647L71519j439252l019909m185264n536001o686128
$$ 201879106 205438845 206951492 207323011 205883759 202863850 198678586 193142585 186456457
16710A86456457p181053q006329q622917q474750q568240q294850q273099p501203
$$ 186456457 179275404 171269075 162646158 154171408 145603168 137308318 129035219 121534016
16702A21534016p797286o845060o644463o274950o276592n170416m750317m589276
$$ 121534016 113736730 106891670 100247207 93972257 87695665 82525249 77774932 73185656
16694G3185656m444346m014685l375044l861545l212769k707221k869172k712937
$$ 73185656 68741310 64726625 61351581 57490036 54277267 51570046 48700874 45987937
16686D5987937k518128j959400k479647j468405j924478j869918j107962j682862
$$ 45987937 43469809 41510409 39030762 37562357 35637879 33767961 32659999 30977137
16678C0977137j430609j405469j275496j306526p74043j191502p70482j346080
$$ 30977137 29546528 28141059 26865563 25559037 24784994 23593492 22823010 21476930
16670B1476930q46296n26955p53550n21250r70413m63505n84084p50573o80134
$$ 21476930 20630634 20103679 19350129 18828879 17858466 17394961 16810877 16060304 15380170
16661A5380170o93424j08266p52923m03940j1448q19135k14608n10521k29082
$$ 15380170 14686746 14578480 13825557 13421617 13410169 12591034 12376426 11865905 11636823
16652A1636823n10969m56907j32458k35951k59554l77940l60003k31550k14239
$$ 11636823 11125854 10668947 10536489 10300538 10040984 9663044 9303041 9071491 8857252
16643H857252j16295l48657j18397l36049l34078R442k84560M6039n01184M03772
$$ 8857252 8740957 8392300 8273903 7937854 7603776 7613218 7328658 7374697 6873513 7277285
16633G277285m76535m29303L3923j56823p848q1048m86696L87505r4321p20295
$$ 7277285 6800750 6371447 6405370 6248547 6240699 6159651 5672955 6060460 5966139 5245844
16623E245844J60434m14128K80233l63626n5459J05382j40512K4093l52518o4480
$$ 5245844 5406278 4992150 5272383 4908757 4853298 4958680 4818168 4842261 4489743 4425263
16613D425263J25592l57662l15102J09859n8370j57977J09051L9798k32253l95730
$$ 4425263 4550855 4193193 3878091 3987950 3929580 3771603 3880654 3920452 3688199 3292469
16603C292469N16003n54268O16910l87507n2682J36076m36582p5407K34263k3515
$$ 3292469 3808472 3254204 3871114 3483607 3430925 3567001 3130419 3055012 3289275 3265760
16593C265760k3754J02320l29935l38300K62119J48182l41409l4056J64884k97229
$$ 3265760 3242006 3344326 3014391 2676091 2938210 3086392 2744983 2710927 2875811 2578582
16583B578582k43588J01411m75903O85785k39682m8859L11l90495K61028K12875
$$ 2578582 2334994 2436405 1960502 2646287 2406605 2357746 2358057 1967562 2228590 2441465
16573B441465l33118j0224k15882l5300M81923m85576J51287r2699j7271J33084
$$ 2441465 2108347 2098123 1882241 1846941 2328864 1843288 1994575 1901876 1884605 2017689
16563B017689k72107j90708K24757P4428J43869k14866l06167K11244m938J47782
$$ 2017689 1745582 1554874 1779631 1854059 1997928 1783062 1476895 1688139 1683201 1830983
16553A830983k54280K23784k96917j06350k646l1696k2337K15811n34846M73501
$$ 1830983 1576703 1800487 1503570 1397220 1394574 1362878 1340541 1556352 1021506 1495007
16543A495007k66603L30444j34516L85424j49734j46245Q4401l63336K13786k18887
$$ 1495007 1228404 1558848 1424332 1809756 1660022 1513777 1598178 1234842 1448628 1229741
16533A229741M0016R7956k70301N0925J45038J69989m66672L92776l55220N4637
$$ 1229741 1269757 1367713 1097412 1148337 1293375 1463364 996692 1389468 1034248 1088885
16523A088885J88894n1241m3078l4J63068j03083l91084L06888m59960K99327
$$ 1088885 1277779 1226538 1183460 1183426 1346494 1243411 852327 1159215 699255 998582
16513I98582p5732K82583l08234K19617l7805k75381K59208l3477k30450j0230
$$ 998582 922850 1205433 897199 1116816 1079011 803630 1062838 1029361 798911 788681
16503G88681n969r463K6943L00167k65668j72949K28767r3344l711L90778E12795
$$ 788681 782712 773249 800192 1100359 834691 661742 890509 797165 793454 1184232 512795
16491H17528j41443J06591j54937o4677R5848K84933j59774r1947K37045m20326
$$ 817528 676085 782676 627739 563062 658910 943843 784069 692122 929167 508841
16481E08841K11452m4539j78672K27632J9708J20528n1935K4887l72952L39553
$$ 508841 720293 675754 497082 724714 744422 864950 813015 837902 464950 804503
16471H04503N9368m3925k46537K90967P1844m15780J5761K07790B99226M55721
$$ 804503 863871 819946 573409 864376 936220 520440 536201 743991 299226 754947
16461G54947P0640j89850j0774m4507j34394J04184r9286m5675M17828j48677
$$ 754947 825587 635737 624963 580456 446062 550246 450960 405285 823113 674436
16451F74436p1683R8865j77390K68520k71901k43213L40012R8929m3212q2743
$$ 674436 602753 701618 524228 792748 520847 277634 617646 716575 673363 590620
16441E90620K5021l6263K67488C37839J49664j69338K73829J74294C47701p8988
$$ 590620 615641 579378 846866 337839 487503 318165 591994 766288 347701 268713
16431B68713r3282K21682P150J73887j87509Q5704R2731B69215O5360J47602j36410
$$ 268713 175431 397113 404263 578150 390641 476345 569076 269215 334575 482177 345767
16420C45767J4490J96517q1952O6953A53646J62794J43244R4517B34811L0471
$$ 345767 360257 556774 474822 541775 153646 316440 459684 554201 234811 265282
16410B65282J11494J18394j90590J85496J7739A85893M17431k05355j70626J36077
$$ 265282 376776 495170 304580 490076 507815 185893 603324 397969 227343 363420
16400C63420M142j03024K77102j33276a17240C03011O4271p4891M6609k8942J05305
$$ 363420 367562 264538 541640 408364 -117240 303011 367282 292391 339000 310058 415363
16389D15363j20581K12632k07152r2131k5737M27328k86794K17874n2875j29744
$$ 415363 294782 507414 300262 208131 182394 609722 322928 540802 487927 358183
16379C58183J26833f4999B38264K89089A41621K62929R6875B19457I8233M65168
$$ 358183 485016 -64999 238264 527353 141621 404550 501425 219457 98233 563401
16369E63401k69356A24632E3020M0477J84523K13144j62661A22595K7542L04254
$$ 563401 294045 124632 53020 93497 278020 491164 328503 122595 150137 454391
16359D54391A06022O8620J14709J06806O7382k20251n0800k9285E3047J82603
$$ 454391 106022 174642 289351 396157 463539 243288 192488 163203 53047 235650
16349B35650K49267j28579j66165J5208d4876D34513G4489L3046L22706j35980
$$ 235650 484917 356338 190173 205381 -44876 434513 74489 107535 430241 294261
16339B94261O4834K0841j26200Q4072R2059B01760J35478j07065h0570B64033
$$ 294261 359095 379936 253736 337808 429867 201760 337238 230173 -80570 264033
16328A75419J67260j59972K5836c4399G4461K41780j44648o1803o422K28366P9222
$$ 175419 342679 182707 208543 -34399 74461 316241 171593 109790 103368 331734 410956
16317D10956C919L50047J09073G9752b17108l6112C3407O24377B85391o8274O4714
$$ 410956 3919 353966 463039 79752 -217108 -253220 33407 657784 285391 217117 281831
16306B81831b8096A87528A2067L46800n8461j09910R6003i0145A65972C7512L0724
$$ 281831 -28096 187528 12067 358867 300406 190496 286499 -90145 165972 37512 68236
16295F8236J97417L3759j02891M5096b6191A35356P3022j125C7263K05357L2344
$$ 68236 265653 299412 196521 241617 -26191 135356 208378 207253 37263 242620 274964
16284B74964P066n0189N4822a07267D8563f9989G5528e3927C23536p9751b315
$$ 274964 282030 231841 286663 -107267 48563 -69989 75528 -53927 323536 243785 -2315
16272B56128F5590q612K745f6378C6381K51722a72379B6855i5899B27780J34469
$$ 256128 65590 56978 59723 -66378 36381 288103 -172379 26855 -95899 227780 362249
16261C62249A13791i115C26822A55623J69905H2009J16252e4534p0322G5831O1695
$$ 362249 113791 -9115 326822 155623 325528 82009 198261 -54534 -124856 75831 137526
16250A37526J86746j23807c53194I7506J80883J32109a16767B27964A6556K44475
$$ 137526 324272 200465 -353194 97506 278389 410498 -116767 227964 16556 261031
16240B61031l2936b41023b3088A46694J82079b06111A30815C9851e0763A66672
$$ 261031 228095 -241023 -23088 146694 328773 -206111 130815 39851 -50763 166672
16229B6423J21177n0300J15824O5128j14182L9521k0679J74691A8452L0990Q870
$$ 26423 147600 97300 213124 278252 164070 203591 182912 357603 18452 49442 58312
16218E8312J98139i6457l6800A06269a35022A25254R2835Q4788C4449L51968j31657
$$ 58312 256451 -96457 -133257 106269 -135022 125254 218089 302877 34449 386417 254760
16207B54760p4301a79662A44370l2917L65764a13325A68044a29089B52658m1219
$$ 254760 180459 -179662 144370 111453 477217 -113325 168044 -129089 252658 211439
16197B11439f5972E16632b24777I0806J36229J22062A03327J18977o1846m4452
$$ 211439 -65972 516632 -224777 90806 227035 349097 103327 222304 160458 116006
16187A16006m5824J2235b9860m9428m1152k09387A0460J91282b111A81931G1701
$$ 116006 70182 82417 -29860 -79288 -120440 -329827 10460 201742 -2111 181931 71701
16175d5832A58454G4882O133b53872b4163j29934A77771p39j0198K4383a74199
$$ -45832 158454 74882 81015 -253872 -24163 -154097 177771 177032 166834 191217 -174199
16163B91678b78129A20483C9711d0046k830k42038B74137G3937N26576B89640
$$ 291678 -278129 120483 39711 -40046 -42876 -284914 274137 73937 600513 289640
16152d5331C5983l789a69478M8529j31095D193b59395h1890A30318a45965a7859
$$ -45331 35983 32194 -169478 -120949 -252044 4193 -259395 -81890 130318 -145965 -17859
16140A74171B9932J40248a08727G8067c31084J48738N0637A73056b04104l7208
$$ 174171 29932 170180 -108727 78067 -331084 -182346 -131709 173056 -204104 -241312
16130b41312j45043h5041j28733A52661a79783f7729F1833O1137n3985K06826
$$ -241312 -386355 -85041 -213774 152661 -179783 -67729 61833 122970 68985 275811
16120B75811a99727E6309j0422Q5431G284c4059j63590A02060J5177M9721b12120
$$ 275811 -199727 56309 45887 131318 7284 -34059 -197649 102060 117237 166958 -212120
16108F2363N3418f7080A00557N8126b27940A65144a7599A56841J54037j27657
$$ 62363 115781 -67080 100557 158683 -227940 165144 -17599 156841 310878 183221
16098A83221a95344K2417o4189Q3116d6290a997o059k7283A10116b24922A60834
$$ 183221 -195344 -172927 -237116 -154000 -46290 -1997 -8056 -35339 110116 -224922 160834
16086c2266q8548l15211I7290b9735A19662n4847K7038K40676j63941a24274j81152
$$ -32266 -120814 -436025 97290 -29735 119662 64815 91853 332529 168588 -124274 -305426
16075c05426J43735f8001B48548a58023R766a6533C50901j05736G6043b2856m4932
$$ -305426 -161691 -68001 248548 -158023 -148257 -16533 350901 245165 76043 -22856 -67788
16064f7788A4526L0250e9861b05k01485R2621I489L04811A31746F4000d4449k49309
$$ -67788 14526 44776 -59861 -205 -201690 -109069 9489 314300 131746 64000 -44449 -293758
16052b93758a25457A80755B2398J16323J38508A01325c5872A73350J0330c05897
$$ -293758 -125457 180755 22398 138721 277229 101325 -35872 173350 183680 -305897
16041C09R9104a27283a9418A28012a14726M4440B63359a84799A36355c8010B77908
$$ 309 99413 -127283 -19418 128012 -114726 -70286 263359 -184799 136355 -38010 277908
16029a96872c4461B06638C7465f4914m2136r4856R8163D3279a73766A73406h945
$$ -196872 -34461 206638 37465 -64914 -107050 -201906 -103743 43279 -173766 173406 -8945
16017c3550k29247G8905k3024f766j8187G1277M8599b84035a04155E6444b6670
$$ -33550 -262797 78905 55881 -6766 -24953 71277 119876 -284035 -104155 56444 -26670
16005a96958B3034L4697f755j43780A33060P0613H1905b58568d5451j14375l26651
$$ -196958 23034 57731 -6755 -150535 133060 203673 81905 -258568 -45451 -159826 -486477
15994d86477d3758H1998b88127F692J43273J80675b31494A54590a3518C79883
$$ -486477 -43758 81998 -288127 6692 149965 330640 -231494 154590 -13518 379883
15983B53729R0424I2882M2289j5165O1786K59784e6410A39921l1126f4286m42638
$$ 253729 344153 92882 135171 120006 181792 441576 -56410 139921 108795 -64286 -506924
15972e06924a03633k25285a32616o2636G3785c56211A60044E3085J42877H9837
$$ -506924 -103633 -328918 -132616 -195252 73785 -356211 160044 53085 195962 89837
15961D8103a80140A2303a54943j00420M1568C8101P829K7559e1880I4751a52891
$$ 48103 -180140 12303 -154943 -255363 -213795 38101 45930 73489 -51880 94751 -152891
15949H4482j246b3085j6387k01267q1917k46940a64126A5511K08395c09464C3390
$$ 84482 83236 -23085 -39472 -240739 -322656 -569596 -164126 15511 223906 -309464 33390
15937g3480D37067A26566a40506j89742b2470C51110a42873A827R7355j6340b90258
$$ -73480 437067 126566 -140506 -330248 -22470 351110 -142873 1827 99182 82842 -290258
15925a41902E7227b4407j10286n0737A6431O8799c3109n2170m7486A5645Q5310
$$ -141902 57227 -24407 -134693 -185430 16431 85230 -33109 -85279 -132765 15645 100955
15914A00955K4718a31988K0873j68211P5178o8433q8592L1266c8870r7334a4555
$$ 100955 125673 -131988 -111115 -279326 -204148 -272581 -361173 -329907 -38870 -136204 -14555
15902d4614a5705B10810b88398A7277J80099I4168m6306l206c67991J67851D3588
$$ -44614 -15705 210810 -288398 17277 197376 94168 47862 44656 -367991 -200140 43588
15890b54370A00416b70561B25028F0161a15293C33982c7177C3880p455l19K20805
$$ -254370 100416 -270561 225028 60161 -115293 333982 -37177 33880 26425 26106 246911
15879B46911n5577e09006b07933B756K82122D1767a64380c7304H1200J9202a25586
$$ 246911 191334 -509006 -207933 2756 284878 41767 -164380 -37304 81200 100402 -125586
15867C8442P5381C4888N9480b9167k27500M2161A56342D390a09944h63b08j99380
$$ 38442 113823 34888 94368 -29167 -256667 -214506 156342 4390 -109944 -863 -208 -199588
15855a99588j25247J15115A0306J92352a86349D65807h1885J1572E0824a65624
$$ -199588 -324835 -209720 10306 202658 -186349 465807 -81885 -70313 50824 -165624
15844D8604a5480j6812B3512K87678b06838C1649A5379b48592D9967M8121b04252
$$ 48604 -15480 -32292 23512 311190 -206838 31649 15379 -248592 49967 98088 -204252
15832b52843G3417M79050a40176D0797k0281a97641M786f3455j4818L4911H8906
$$ -252843 73417 552467 -140176 40797 20516 -197641 -192855 -63455 -78273 -43362 88906
15820A76254c24818a04526F1207N1441g2323B67890a37303d1106f320j45562b9289
$$ 176254 -324818 -104526 61207 112648 -72323 267890 -137303 -41106 -6320 -151882 -29289
15808E2330a23537l28303B5890b28693C2157N875b02026b6964n5577m2984O2099
$$ 52330 -123537 -451840 25890 -228693 32157 38032 -202026 -26964 -82541 -125525 -63426
15797f3426g859k06227I7781J54342q0442A5200c3034j5034m6163k19554e4094
$$ -63426 -7859 -214086 97781 252123 171681 15200 -33034 -48068 -94231 -313785 -54094
15785A22814i1155j65930B20124K1587b67028C4561L26074i8881L6353B18714
$$ 122814 -91155 -257085 220124 241711 -267028 34561 360635 -98881 -62528 218714
15774B04154k0240E0537d3426A25855b28820E6480a08714F3746k6636a77964A5080
$$ 204154 183914 50537 -43426 125855 -228820 56480 -108714 63746 37110 -177964 15080
15762a84540A93486d2250a1242j64057P5003A91037a35076E3475a56060c7577
$$ -184540 193486 -42250 -11242 -175299 -100296 191037 -135076 53475 -156060 -37577
15751f8463H999b21819E7429j5932A0579K05475N1781j26490k7397b89462g4972
$$ -68463 8999 -221819 57429 41497 10579 216054 267835 141345 113948 -289462 -74972
15739A51105b64457G3806H807h5248M2021D10850j74417b22159R6852B32838g1896
$$ 151105 -264457 73806 8807 -85248 -43227 410850 236433 -222159 -125307 232838 -71896
15727g4404j05164a4687l02478f7016l6809l8727A71322b15826A91752G487b17284
$$ -74404 -179568 -14687 -317165 -67016 -103825 -142552 171322 -215826 191752 7487 -217284
15715a02796f736B2287K59112a21416f0275A28296a12737j7482K2933B68768a83983
$$ -102796 -6736 22287 281399 -121416 -60275 128296 -112737 -130219 -107286 268768 -183983
15703a82003E755L8936b92031k7792M87N7232H0742a7503l5783D323Q5912a60094
$$ -182003 5755 44691 -292031 -319823 -319336 -262104 80742 -17503 -53286 4323 90235 -160094
15690a78267C91552a21103d9258B6247b16434R6458B7930f5190j9072A913K64770
$$ -178267 391552 -121103 -49258 26247 -216434 -119976 27930 -65190 -84262 1913 266683
15679B66683a51781c5187J5666j39029A0174a58059O2667k11005A37063l1360
$$ 266683 -151781 -35187 -19521 -158550 10174 -158059 -95392 -306397 137063 105703
15669A05703a41427d5217o7007k66099J29784F5908c14239H9736b0566j6348I8736
$$ 105703 -141427 -45217 -112224 -378323 -248539 65908 -314239 89736 -20566 -36914 98736
15657c97751F4798b22407O8019f2444p1080r5029D6227j6858L3436e2987j08517
$$ -397751 64798 -222407 -154388 -62444 -133524 -228553 46227 29369 62805 -52987 -161504
15646a61504f050j15018c196l46192i5454M391L4110A19212O1150E6674a358D52142
$$ -161504 -6050 -121068 -3196 -349388 -95454 -91063 -56953 119212 180362 56674 -1358 452142
15633D3388c32178j92612H4674b43528a03955C3319N4089a9679i041k15987I2066
$$ 43388 -332178 -524790 84674 -243528 -103955 33319 87408 -19679 -9041 -225028 92066
15621d7894l4358G665b2404B5189a3516E1294e7349j02401A56115J45641a28578
$$ -47894 -82252 7665 -22404 25189 -13516 51294 -57349 -159750 156115 301756 -128578
15609h6564n4689B16350a51483B3941N6071e1176j82352A48720b37873j5590E4520
$$ -86564 -141253 216350 -151483 23941 80012 -51176 -233528 148720 -237873 -253463 54520
15597E8171d88846a22840o914m1267g838j00885j59869J05365g1477J1653G0622
$$ 58171 -488846 -122840 -129754 -171021 -7838 -108723 -268592 -163227 -71477 -59824 70622
15585b5315r6224E3104J30896h8514j72710D7071i1851H8615K24774a03304H8997
$$ -25315 -121539 53104 184000 -88514 -261224 47071 -91851 88615 313389 -103304 88997
15573d4593G7469f2422J1170k13905P1839N5035A11074b08175P2605c415j42447
$$ -44593 77469 -62422 -51252 -265157 -193318 -138283 111074 -208175 -135570 -3415 -145862
15562a45862a2961A5435O0193b27892H5669Q2923A4928a38712B00197a39499a1059
$$ -145862 -12961 15435 75628 -227892 85669 168592 14928 -138712 200197 -139499 -11059
15550D8602c44379g1872c1298j70322A7163L3612J13969j232H1298a41075B48380
$$ 48602 -344379 -71872 -31298 -201620 17163 50775 164744 163512 81298 -141075 248380
15538F8811J57331k4386J09902i8872B0065J24450d4748B2368g5628L6730O493
$$ 68811 226142 201756 311658 -98872 20065 144515 -44748 22368 -75628 -38898 -32405
15527c2405p8632L0814l9573p0598d954m3577B24117r4943a88091D58539b32913
$$ -32405 -111037 -80223 -119796 -190394 -4954 -48531 224117 129174 -188091 458539 -232913
15515B60641G6384h7264B50799B5197J75581F5277J83203D861i0464A13139J88075
$$ 260641 76384 -87264 250799 25197 200778 65277 248480 4861 -90464 113139 301214
15504C01214b71263A64917h675n16171K53551A66186j5972b95736e3355l13315
$$ 301214 -271263 164917 -8675 -524846 -271295 166186 150214 -295736 -53355 -366670
15494c66670h2490o0440o3974a02121A93028Q1507g1742j41026c1947k01318B13816
$$ -366670 -82490 -142930 -206904 -102121 193028 274535 -71742 -212768 -31947 -233265 213816
15482c4488p9766D7644J13752p5201d143B95433b35327I5514a37042A4805b10589
$$ -34488 -114254 47644 161396 86195 -4143 295433 -235327 95514 -137042 14805 -210589
15470A11562a04167A77640o3983b35594R0797D4088j4123b22760b2319O563A1717
$$ 111562 -104167 177640 113657 -235594 -144797 44088 29965 -222760 -22319 -15756 11717
15458f1691K4428A11747R4232b00796M0452B30819c87861A42920d11626A85852
$$ -61691 -37263 111747 205979 -200796 -160344 230819 -387861 142920 -411626 185852
15447A70735D9623e6437D3350b44831g7085A3281f2414G0956i4003m3299A82417
$$ 170735 49623 -56437 43350 -244831 -77085 13281 -62414 70956 -94003 -137302 182417
15435a57370g0067A25508b10600c1551A97599p1901D8293h1160j20517C05331
$$ -157370 -70067 125508 -210600 -31551 197599 125698 48293 -81160 -201677 305331
15424b59378L1139A15575K57268j06508n6279c2958r2111A45936a17282m4172
$$ -259378 -228239 115575 372843 266335 210056 -32958 -125069 145936 -117282 -161454
15414a61454O7171A60155K1437a70489O4787O139B60203a78850h7887j69591j06990
$$ -161454 -94283 160155 181592 -170489 -105702 -99563 260203 -178850 -87887 -257478 -364468
15403c64468C15257g7511j3346A00511D9721a11177B8671a34870m947A38243a9170
$$ -364468 315257 -77511 -90857 100511 49721 -111177 28671 -134870 -139817 138243 -19170
15391a63990L7202k15855A0388a41121C15255c08969J18432J6982C5282J08423
$$ -163990 -126788 -342643 10388 -141121 315255 -308969 -190537 -173555 35282 143705
15381A43705F9710c32719J57955k3949a1363k33865g8236j66710f8676G9242Q0078
$$ 143705 69710 -332719 -174764 -198713 -11363 -245228 -78236 -244946 -68676 79242 159320
15370A59320O8687G8867k9059b04252b1084k5163l1796A85459a03284K8834B30655
$$ 159320 228007 78867 49808 -204252 -21084 -46247 -78043 185459 -103284 -74450 230655
15358i6868B4649a48253B9195R2570b4766C51024E3039K33513a34007A3042c50595
$$ -96868 24649 -148253 29195 121765 -24766 351024 53039 286552 -134007 13042 -350595
15346a75889G5644A9673a93850H9923f767A51635a75380d993A06311b12226B96564
$$ -175889 75644 19673 -193850 89923 -6767 151635 -175380 -4993 106311 -212226 296564
15334A66078E3604b23971A65242J99654B9211K06404m1507C623b61648I2233a38356
$$ 166078 53604 -223971 165242 364896 29211 235615 194108 3623 -261648 92233 -138356
15322B11905h5140A25144a34155A14991J78361g0863l22871B8865a27530A84789
$$ 211905 -85140 125144 -134155 114991 293352 -70863 -393734 28865 -127530 184789
15311e02C4198a87960i1600H3300a36627C4429c5772A72620N2102b5388j77953
$$ -502 34198 -187960 -91600 83300 -136627 34429 -35772 172620 224722 -25388 -203341
15300b03341A30996f539B26903C451M3065Q9455i2305j9528C17470H174a99293
$$ -203341 130996 -6539 226903 3451 46516 135971 -92305 -111833 317470 8174 -199293
15288a44889A32968b2459o3886j30215I7544b3781j19385A36227b73226A19889
$$ -144889 132968 -22459 -86345 -216560 97544 -23781 -143166 136227 -273226 119889
15277C11582c18283a38123H2035M34326a04947C1303a19492e4862o9862A19355
$$ 311582 -318283 -138123 82035 516361 -104947 31303 -119492 -54862 -124724 119355
15266b5646k4321E1860M94484H062J71603Q7929J95540H2966Q1115P8360A20922
$$ -25646 -49967 51860 546344 8062 179665 267594 463134 82966 164081 242441 120922
15254B2041K15210a63344C9845R3645J40962M55895M58794o6008j8045L21397
$$ 22041 237251 -163344 39845 133490 274452 730347 1189141 1123133 1105088 1426485
15244A426485F44266k46668j60422p5102a91853B688K43040N0333e9203A2526
$$ 1426485 644266 397598 237176 162074 -191853 2688 245728 296061 -59203 12526
15233g9490D22555c39685A95761N672R1420M9297a0506F9573d9813a4688A45280
$$ -79490 422555 -339685 195761 201433 292853 342150 -10506 69573 -49813 -14688 145280
15221A72359A8551b887k43010G8202K97163a77100C6906K2236J98144N0710j06600
$$ 172359 18551 -2887 -245897 78202 375365 -177100 36906 59142 257286 307996 201396
15210B01396o1465a8342k35340G7899M06652C3747K20272a11985A696a19523a3409
$$ 201396 139931 -18342 -253682 77899 484551 33747 254019 -111985 1696 -119523 -13409
15198A23045K0976d72499E78541h7576B00945N3559a66259G770a09531A12549
$$ 123045 144021 -472499 578541 -87576 200945 254504 -166259 7770 -109531 112549
15187A07913e1399A19284a56617G2731c8052A67572c0543A6962P8928a77943c7652
$$ 107913 -51399 119284 -156617 72731 -38052 167572 -30543 16962 95890 -177943 -37652
15175A1804M1056a05874A13552K6367G232J9242K5866G607N9643f2833A92337
$$ 11804 52860 -105874 113552 139919 7232 26474 52340 7607 67250 -62833 192337
15163a33939A87345D1420R1676f0945j6710C84676i7184C01344J5348j38748D4190
$$ -133939 187345 41420 133096 -60945 -77655 384676 -97184 301344 316692 177944 44190
15151G0844R1485b0782G7057J25882I6483j1238L55588A01779a76909j16306C72912
$$ 70844 162329 -20782 77057 202939 96483 85245 440833 101779 -176909 -293215 372912
15139A42448g1122j9146b9468A5875L09523k9256j8099p1071D2981h4118C62770
$$ 142448 -71122 -90268 -29468 15875 325398 296142 278043 206972 42981 -84118 362770
15127B59033K08654A2314Q2600M3710j0682M5130E2890M8461K30350d9507F3303
$$ 259033 467687 12314 94914 138624 127942 173072 52890 101351 331701 -49507 63303
15115C02476g018n8130C10916A45593K75319a87085D1914R2096j6627R0998A5790
$$ 302476 -7018 -65148 310916 145593 420912 -187085 41914 134010 117383 208381 15790
15103C42737j38328l6985k3557a2805E68189B09409c0063D29555i3745A75781
$$ 342737 204409 167424 143867 -12805 568189 209409 -30063 429555 -93745 175781
15092a50395D68738A58486J92908D3799a47482B03644J0784D1973b0547D7099
$$ -150395 468738 158486 351394 43799 -147482 203644 214428 41973 -20547 47099
15081B20414F8313K32573j14880C9940L63578o6953A13875J85026g2640B02652
$$ 220414 68313 300886 186006 39940 403518 336565 113875 298901 -72640 202652
15070g2A22529l5381J56829c6072j38001F7565K49876m6622K97375q4211k24722
$$ -72 122529 87148 243977 -36072 -174073 67565 317441 270819 568194 483983 259261
15059B59261M245N0220c99B80393i0931B1059a81862C73828I5298K51398a37061
$$ 259261 263506 313726 -399 280393 -90931 21059 -181862 373828 95298 346696 -137061
15047a79242C1376J03135e0087B59692J6282M5349j33786b27969C57572A55659
$$ -179242 31376 134511 -50087 259692 275974 321323 187537 -227969 357572 155659
15036C59526b30558D6623L16249a2650B87997e5749B01548R7842j32180M5612
$$ 359526 -230558 46623 362872 -12650 287997 -55749 201548 299390 167210 212822
15026B12822D4155J42264E9147P5315O4183k7183E9275J99691K5392A34093K72879
$$ 212822 44155 186419 59147 134462 198645 171462 59275 258966 284358 134093 406972
15015D06972C8327P9359h4946C3945A2748L34450g8250j0248D36028a0462e183
$$ 406972 38327 117686 -84946 33945 12748 347198 -78250 -88498 436028 -10462 -5183
15003D57057A98600n474n7116j7694E8461K5792N56983B31055b075B8501P7632
$$ 457057 198600 193126 136010 118316 58461 84253 641236 231055 -2075 28501 106133
14992A06133K66g979B52545i5368A8405Q534K59231k3990K711D4120J62793G6918
$$ 106133 106399 -7979 252545 -95368 18405 26939 286170 262180 264891 44120 206913 76918
14979C20508A33348n1041L81894B23366D5570K85400a53138D17353A48153L2887
$$ 320508 133348 82307 464201 223366 45570 330970 -153138 417353 148153 181040
14969A81040J66888H1539h0000G1198L33539a39482B74200l2694j02093J18707
$$ 181040 347928 81539 -80000 71198 404737 -139482 274200 241506 139413 258120
14959B58120J67534H4430a50454A71374L4201j7788b0773C76540A56065J83447
$$ 258120 425654 84430 -150454 171374 205575 187787 -20773 376540 156065 339512
14949C39512K8208j76317K01374A78741K91685A30373K07959K5526D1483H702
$$ 339512 367720 191403 392777 178741 470426 130373 338332 363858 41483 8702
14938A62813J63032p1673r4735R5751j9112L7501K16299j82130R727A57688J87609
$$ 162813 325845 254172 159437 255188 236076 273577 489876 307746 317473 157688 345297
14927C45297A68504a920C23265J3441J22144j05950Q7706A38626K40478K88668
$$ 345297 168504 -1920 323265 336706 458850 352900 440606 138626 379104 667772
14917F67772B77671G1638M85357k59602J94183j61772q3459K91149A98773l2070
$$ 667772 277671 71638 556995 297393 491576 329804 246345 537494 198773 166703
14907A66703K15439j27737L0906j37952J70599M9457n6886p6919q6221o4126M7945
$$ 166703 382142 254405 285311 147359 317958 367415 310529 233610 147389 83263 131208
14896A31208L11729J67475j63494j19838M0931J51527j91942d4468C56650j16237
$$ 131208 442937 610412 446918 327080 368011 519538 327596 -44468 356650 240413
14886B40413N07843l01552J49895A45603J85931J44446L3629j96633N8976j27696
$$ 240413 748256 446704 596599 145603 331534 475980 509609 312976 371952 244256
14876B44256k3842J6722k1498L3432J01731j15967J05102o239R6652j05164J74648
$$ 244256 220414 237136 215638 249070 350801 234834 339936 333697 430349 325185 499833
14865D99833J70309l29511q0635K53163i796E01599j85309l8311l9592K21610
$$ 499833 670142 340631 259996 513159 -9796 501599 316290 277979 238387 459997
14855D59997J96151B09800M41452j51412j81338j38181J16966L96527k56783B03361
$$ 459997 656148 209800 651252 499840 318502 180321 297287 693814 437031 203361
14844C03141M09440B62607J66348J66017k15956J22757j34519q4226L36021B84117
$$ 303141 712581 262607 428955 594972 379016 501773 367254 283028 619049 284117
14833B52298Q9026J10713J2669j33429J32132o1297K3386K0969P5809j30205n5250
$$ 252298 341324 452037 464706 331277 463409 402112 425498 446467 522276 392071 336821
14822C36821A37310M06320Q7731j87345L45791C25825I4551N72552k34915J27073
$$ 336821 137310 543630 631361 444016 789807 325825 94551 667103 432188 559261
14812E59261l4604Q6932L9924j86210G2015Q11603k88310j78397j15175K32581
$$ 559261 524657 611589 651513 465303 72015 883618 595308 416911 301736 534317
14802E34317k11681L80958j90356K07958j85642o1563J47029j75763j65795J36889
$$ 534317 322636 703594 513238 721196 535554 473991 621020 445257 279462 416351
14792D16351r6178K92821j89972L09545j92986j40535J78449L21595k03447K5911
$$ 416351 320173 612994 423022 732567 539581 399046 577495 899090 695643 721554
14782G21554B75222F102L08664K48199J70308N3521k26503J43657O9624k17886
$$ 721554 275222 6102 314766 562965 733273 786794 560291 703948 773572 555686
14772E55686j4532B9545N90759B90943J37977J22798L04265M7969D47580j99795
$$ 555686 541154 29545 620304 290943 428920 551718 855983 903952 447580 247785
14762B47785K42523J51115L7029k9602n5215Q4266Q9460j81304K9917R7401C21298
$$ 247785 490308 641423 678452 648850 593635 677901 767361 586057 615974 713375 321298
14750G62650l66585N77704l83733j53747J82372j31580L2291K80667k95985K48207
$$ 762650 396065 973769 590036 436289 618661 487081 519372 800039 504054 752261
14740G52261M308Q5291k86744K9145L43715k62744J27477C70751R6920L13718
$$ 752261 756569 841860 555116 584261 927976 665232 792709 370751 467671 781389
14730G81389C75265M28568J4768j63319L22268k63578q7165k0890K46606L8496
$$ 781389 375265 803833 818601 655282 977550 713972 626807 605917 852523 891019
14720H91019l19658J42415q0649J99050Q6258n139j15299N4698l1606r4191J33836
$$ 891019 571361 713776 633127 832177 918435 913296 797997 852695 821089 726898 860734
14709H60734P1868L6455k70729P2399j62154L0053K42538L8472M556L26128m68572
$$ 860734 932602 969057 698328 770727 608573 638626 881164 919636 924192 1250320 781748
14698G81748J4019m8253k91305N36238m003p2647N3737K93254j88104k93898J83970
$$ 781748 795767 747514 456209 992447 988444 915797 969534 1262788 1074684 780786 964756
14687I64756l07829L46557Q6718J01939k46516K34355j15100j80663j79960L23045
$$ 964756 656927 1003484 1090202 1192141 945625 1179980 1064880 884217 704257 1027302
14677A027302j57031J46853J58755l18131J20366k05571N27744k3946m05717L95507
$$ 1027302 870271 1017124 1175879 857748 978114 772543 1300287 1276341 870624 1266131
14667A266131l80887L3050K68329k68356L28897k42899N67904j75574l51591j80136
$$ 1266131 885244 918294 1186623 918267 1247164 1004265 1572169 1396595 1045004 864868
14657H64868J77643K21644J57041n56984M54678J81797p16185M30305j31746K37506
$$ 864868 1042511 1264155 1421196 864212 1318890 1500687 784502 1214807 1083061 1320567
14647A320567m25785J60384K02054r5559n0412K32594j27937L48495l52048k44483
$$ 1320567 894782 1055166 1257220 1161661 1111249 1343843 1215906 1564401 1212353 967870
14637I67870L41862m3659j01392R5464j71289J44410J37696j5484o068j30313
$$ 967870 1309732 1266073 1164681 1260145 1088856 1233266 1370962 1355478 1349410 1219097
14627A219097J89963n675M8681l7441J10314k74541j26477N66266l62855N6532
$$ 1219097 1409060 1403385 1452066 1414625 1524939 1250398 1123921 1690187 1327332 1383864
14617A383864J41564L0557n60717K31796K15122J72062o3127k72563L00187j10782
$$ 1383864 1525428 1555985 995268 1227064 1442186 1614248 1551121 1278558 1578745 1467963
14607A467963J5059K33773j58083K19659m1469k38257K11072l83444K64457J59012
$$ 1467963 1483022 1716795 1558712 1778371 1736902 1498645 1709717 1326273 1590730 1749742
14597A749742J36095J2342j64955j08678K6777K66049n30991M98547k13976K63925
$$ 1749742 1885837 1898179 1733224 1624546 1651323 1917372 1386381 1884928 1670952 1934877
14587A934877o3653N117P1811K26794r6386o6479n0154m2296K37874q7105l1542
$$ 1934877 1871224 1876341 1948152 2174946 2078560 2012081 1961927 1919631 2157505 2070400 2038858
14576B038858k50105J68947L54369j73223L22043k8829J12367j57184M6189k29422
$$ 2038858 1788753 1957700 2312069 2138846 2460889 2432060 2544427 2387243 2433432 2204010
14566B204010K65960k8499M7966J76452J89029J12502p1941l32129O39821j1942
$$ 2204010 2469970 2441471 2489437 2665889 2854918 2967420 2895479 2563350 3203171 3191229
14556C191229N6465J23261m5227L96449P86569L61852R87627J585774L907752
$$ 3191229 3247694 3370955 3325728 3722177 4508746 4870598 5858225 7443999 11351751
14547A1351751Q770561J4844913J0717674j9902786A0377067E141073j881546
$$ 11351751 20122312 34967225 45684899 25782113 10377067 5141073 3259527
14540C259527m11594o83057N2881k11648K68156l06032K19036q0227j46474L40106
$$ 3259527 2847933 2164876 2217757 2006109 2274265 1968233 2187269 2107042 1960568 2300674
14530B300674L4347J51968k41540K47063j76467M03900r6279j00497k24301K66106
$$ 2300674 2335021 2486989 2245449 2492512 2316045 2719945 2623666 2523169 2298868 2564974
14520B564974j00589Q633k34694K74211J05801M62509k41758k61758N8471L19836
$$ 2564974 2464385 2473018 2238324 2512535 2618336 3080845 2839087 2577329 2635800 2955636
14510B955636j24715J77272j71239J58889j7119k98887M90021L34679l17203k06717
$$ 2955636 2830921 3008193 2836954 2995843 2978724 2679837 3169858 3504537 3187334 2980617
14500B980617K12324j96975N54373P5801k71178l3040P5948j11757J71685k2290
$$ 2980617 3192941 2995966 3550339 3626140 3354962 3321922 3397870 3286113 3457798 3435508
14490C435508L08103k44915L14644r8333O7035J33973l369o03148L90643L95507
$$ 3435508 3743611 3498696 3813340 3715007 3782042 3916015 3912646 3309498 3700141 4095648
14480D095648k74414M26820k52780M09654l94068J55422k6631K11335J72186k87
$$ 4095648 3821234 4248054 3995274 4404928 4010860 4166282 4139651 4350986 4523172 4522885
14470D522885j29287J26414N4891p5701J8147j48334N20345j08787j34539L35803
$$ 4522885 4393598 4520012 4574903 4499202 4517349 4369015 4889360 4780573 4646034 4981837
14460D981837K11745j130095J083917p6000k88842M77460N7620j2317K78963j4714
$$ 4981837 5193582 4063487 5147404 5071404 4782562 5260022 5317642 5305325 5584288 5569574
14450E569574q5605K48149k60402J50661K87348j27463m940l7501J96212K29869
$$ 5569574 5483969 5732118 5471716 5622377 5909725 5782262 5777322 5739821 5936033 6165902
14440F165902k67318M62098J36991M2453r4965N07132O5592j47314K17317J12749
$$ 6165902 5898584 6360682 6497673 6540126 6445161 6952293 7017885 6870571 7087888 7200637
14430G200637j64760M1760K68565J79821j36858L92989J73469J4939j47169L28612
$$ 7200637 7035877 7077637 7346202 7526023 7389165 7782154 7955623 7970562 7823393 8152005
14420H152005l94670M33824j02014K12494J28315N65439r1353Q6844l77410O32136
$$ 8152005 7757335 8191159 8089145 8301639 8429954 8995393 8904040 8990884 8613474 9245610
14410I245610J96342J79593J26332p237M76547J21801m44192N59269k0087J76217
$$ 9245610 9441952 9621545 9747877 9740640 10217187 10338988 9894796 10454065 10433978 10610195
14400A0610195K25300J37136K57468K69498L4324M68360L9785j26404L56001L28606
$$ 10610195 10835495 10972631 11230099 11499597 11533921 12002281 12042066 11915662 12271663 12600269
14390A2600269j60554N39969P3971N69699k5969K3289N15622M53419j63139L27842
$$ 12600269 12439715 12979684 13053655 13623354 13597385 13620674 14136296 14589715 14426576 14754418
14380A4754418M90006L03982J3919M80171M12285L90307O13280J2601m2642O99770
$$ 14754418 15244424 15548406 15562325 16042496 16454781 16845088 17458368 17470969 17428327 18128097
14370A8128097L41213R0141Q37354k70020Q34200P16572K46165L03176M19700
$$ 18128097 18469310 18559451 19396805 19126785 19960985 20677557 20923722 21226898 21646598
14361B1646598O47857K93615O30866K39135O35584P96994O51367M46026O58354
$$ 21646598 22294455 22588070 23218936 23458071 24093655 24890649 25542016 25988042 26646396
14352B6646396P24324R04566N38595N79989O69408R23449N87599R18164P26310
$$ 26646396 27370720 28275286 28813881 29393870 30063278 30986727 31574326 32492490 33218800
14343C3218800J002281P73326R40991R40878R25380J099699R21110J551152J052561
$$ 33218800 34221081 34994407 35935398 36876276 37801656 38901355 39822465 41373617 42426178
14334D2426178R42654J434703J656325J192958J755579J252195J336603J952172
$$ 42426178 43368832 44803535 46459860 47652818 49408397 50660592 51997195 53949367
14326E3949367J367715K378893J684940J799700K498571J929670K664730K235124
$$ 53949367 55317082 57695975 59380915 61180615 63679186 65608856 68273586 70508710
14318G0508710K534477K468429K905502K722942L246726L378272L573541L853599
$$ 70508710 73043187 75511616 78417118 81140060 84386786 87765058 91338599 95192198
14310I5192198L814235L890816M365558M592516M995550N197445N559554N846964
$$ 95192198 99006433 102897249 107262807 111855323 116850873 122048318 127607872 133454836
14302A33454836O053666O309247O518525P967568P078891Q626371Q254247R229751
$$ 133454836 139508502 145817749 152336274 160303842 167382733 176009104 184263351 193493102
14294A93493102R332250J0198428J0738456J1391252J1683576J2114322J2775744
$$ 193493102 202825352 213023780 223762236 235153488 246837064 258951386 271727130
14287B71727130J3541141J4132432J4101422J4426539J5015998J4692620J4979996
$$ 271727130 285268271 299400703 313502125 327928664 342944662 357637282 372617278
14280C72617278J4763718J4492571J3697126J2574078J1664788J0297091P997657
$$ 372617278 387380996 401873567 415570693 428144771 439809559 450106650 458104307
14273D58104307N728071K308467n98669k227698r30120l106946m644452o892674
$$ 458104307 463832378 466140845 465542176 463314478 462384358 459277412 454632960 447740286
14265D47740286r771246j1390908j3292010j4018962j4692018j5215866j5203464
$$ 447740286 437969040 426578132 413286122 399267160 384575142 369359276 354155812
14258C54155812j5501054j5458144j5036462j3831427j3794072j3530072j2928440
$$ 354155812 338654758 323196614 308160152 294328725 280534653 267004581 254076141
14251B54076141j2343072j1797171j1409815j0852038r614510r759666q691347
$$ 254076141 241733069 229935898 218526083 207674045 198059535 188299869 179608522
14244A79608522p922150q289228p516263p471921o498706o128524n689961n349310
$$ 179608522 171686372 163397144 155880881 148408960 141910254 135781730 130091769 124742459
14236A24742459n354293n437399m748303m551722m233801l641468l449460l837421
$$ 124742459 119388166 113950767 109202464 104650742 100416941 96775473 93326013 89488592
14228H9488592l362160l037142l594546k728564k886905k737680k583188k073536
$$ 89488592 86126432 83089290 79494744 76766180 73879275 71141595 68558407 66484871
14220F6484871k012806k484288j913193j985498j977262j536175j802370r78997
$$ 66484871 64472065 61987777 60074584 58089086 56111824 54575649 52773279 51794282
14212E1794282j891184j584081j578222j549501o39814j111867j394887j098052
$$ 51794282 49903098 48319017 46740795 45191294 44551480 43439613 42044726 40946674
14204D0946674j396337r54490j363866n19849r14869j124954p40209p44029j348166
$$ 40946674 39550337 38595847 37231981 36712132 35797263 34672309 33932100 33188071 31839905
14195C1839905n86936m97911n32593j176760n59250o68623l71286j222813k13483
$$ 31839905 31252969 30755058 30222465 29045705 28486455 27817832 27446546 26223733 26010250
14186B6010250p83928m67582o93310o79570j12269p84901n00627n05228j63395
$$ 26010250 25226322 24758740 24065430 23385860 23273591 22488690 21988063 21482835 21319440
14177B1319440n24858n96354j64137m32741k28118k08926l96849l69126p77749
$$ 21319440 20794582 20198228 20034091 19601350 19373232 19164306 18767457 18398331 17620582
14168A7620582j69428j53976n78223J67890q04289j66572m01696M5372n93611
$$ 17620582 17451154 17297178 16718955 16886845 16082556 15915984 15514288 15559660 14966049
14159A4966049j27190k08118l15715q9170k59501l11739k63573r2135M7746n38553
$$ 14966049 14838859 14630741 14315026 14225856 13966355 13654616 13391043 13298908 13346654 12808101
14149A2808101j10438l95925J1738m13411K1416j95727n16891K72459m95025j06151
$$ 12808101 12697663 12301738 12313476 11900065 11921481 11725754 11208863 11481322 10986297 10880146
14139A0880146k12074j56175j12791n99588N17096o98308q5600q3916K27869l24454
$$ 10880146 10668072 10511897 10399106 9799518 10316614 9618306 9532706 9448790 9676659 9352205
14129I352205o3514k16315l02087l599J67073k10792m32576L36956k89771O1868
$$ 9352205 9288691 9072376 8770289 8766690 8933763 8722971 8290395 8627351 8337580 8399448
14119H399448l30832m22724L73569n68189L178L86392l74594R1330m24067n5821
$$ 8399448 8068616 7645892 8019461 7451272 7454450 7840842 7466248 7557578 7133511 7077690
14109G077690r5670l6563N3573r2936o3399j95969R3343k76869J50356J42145
$$ 7077690 6982020 6945457 6999030 6906094 6842695 6646726 6740069 6463200 6613556 6755701
14099F755701m86245J58244j33560k75495J44737j36000p1027j08523P7067m55564
$$ 6755701 6269456 6427700 6294140 6018645 6163382 6027382 5956355 5847832 5924899 5469335
14089E469335N2118m4343K82885j09532k99249l40374R0413j90014J83101M8595
$$ 5469335 5521453 5477110 5759995 5650463 5351214 5010840 5101253 4911239 5094340 5142935
14079E142935K7531m11888L09323k51324K65902k38938k95143L08348k05519k44208
$$ 5142935 5170466 4758578 5067901 4816577 5082479 4843541 4548398 4856746 4651227 4407019
14069D407019N53922l89678j94969q953J38546k56407J45030J12365m34244K39746
$$ 4407019 4960941 4571263 4376294 4367341 4505887 4249480 4394510 4506875 4072631 4312377
14059D312377m21569N43948n20747R3707o4479P9367N2054L2443j31211Q866j11347
$$ 4312377 3890808 4434756 3914009 4007716 3943237 4022604 4074658 4107101 3975890 3984756 3873409
14048C873409j22155R794j31463O6128O1726Q992k47736L6947J12398m41779K86561
$$ 3873409 3751254 3761048 3629585 3695713 3757439 3766431 3518695 3555642 3668040 3226261 3512822
14037C512822k56981J32915n4473L06660l00574m24050K55844L3621l13235K18874
$$ 3512822 3255841 3388756 3334283 3640943 3340369 2916319 3172163 3205784 2892549 3111423
14027C111423j39226J73403J1319k51007J34371j44308j17705R8963k17437j56184
$$ 3111423 2972197 3145600 3156919 2905912 3040283 2895975 2778270 2877233 2659796 2503612
14017B503612K73758N1946l28668K80268o3807R7000j44784k11706K17928n8446
$$ 2503612 2777370 2829316 2500648 2780916 2717109 2814109 2669325 2457619 2675547 2617101
14007B617101j27915J73970J81131k39592r006l07180o6413M0134L68051j33874
$$ 2617101 2489186 2663156 2844287 2604695 2595689 2288509 2222096 2262230 2630281 2496407
13997B496407k73205J00121l21690J23506J96941L84091n5338J60795J210159
$$ 2496407 2223202 2323323 2001633 2125139 2322080 2706171 2650833 2811628 4021787
13988D021787K248679P049236J5593519J5374019j5366984j4108845o146736k566831
$$ 4021787 6270466 13319702 28913221 44287240 28920256 14811411 8664675 6097844
13980F097844j192819n45758l60997n44181j11055K38948p71138M07610m38715
$$ 6097844 4905025 4359267 3998270 3454089 3343034 3581982 2810844 3218454 2779739
13971B779739Q483m6525j34805m95850L79033N0842M0974o1790m26097J23551
$$ 2779739 2788222 2741697 2606892 2111042 2490075 2540917 2581891 2520101 2094004 2217555
13961B217555j8958Q4575J08150m3700n7471j32191l4845N3728l12346L83953
$$ 2217555 2198597 2283172 2391322 2347622 2290151 2157960 2123115 2176843 1864497 2248450
13951B248450j8348j02647r4410p2191J72135N91J9187l39666k1167j0807J83473
$$ 2248450 2230102 2127455 2033045 1960854 2132989 2133580 2152767 1813101 1791934 1781127 1964600
13940A964600m04555M09446j52057K6500J59958k32813J66342J8637O058j37256
$$ 1964600 1560045 1969491 1817434 1843934 2003892 1771079 1937421 1956058 1962116 1824860
13930A824860n23329M65305O522J6333R6199j57084r4692k0724P083M70914n67063
$$ 1824860 1301531 1766836 1773358 1789691 1885890 1728806 1634114 1613390 1620473 2091387 1524324
13919A524324J67201P9298m03865L08120J31900l71236O27402n37380M3360O4134
$$ 1524324 1691525 1770823 1366958 1675078 1806978 1435742 2063144 1525764 1569124 1633258
13909A633258j66455n8451k2552K62462k40532J88384k29993j01514N7037M03977
$$ 1633258 1466803 1408352 1385800 1648262 1407730 1596114 1366121 1264607 1321644 1725621
13899A725621k88344J75969k17554K23479j42226K7649l23434m1378K93152M1177
$$ 1725621 1437277 1613246 1395692 1619171 1476945 1504594 1181160 1139782 1432934 1474111
13889A474111j79130j18363J59929O0794j56604J75594p3324j72210K09217n6901
$$ 1474111 1294981 1176618 1336547 1397341 1240737 1416331 1343007 1170797 1380014 1323113
13879A323113j94257j9039J19649j65707L84964j29213j57878J08880j99594J36935
$$ 1323113 1128856 1109817 1229466 1063759 1448723 1319510 1161632 1270512 1070918 1207853
13869A207853K92875j60220n7173J0562K84796m05239J71413k79331L7685k4366
$$ 1207853 1500728 1340508 1283335 1293897 1578693 1173454 1344867 1065536 1103221 1078855
13859A078855J01902j72149J58664j2772n64051M95036j0594K09327o8352k58560
$$ 1078855 1180757 1008608 1167272 1154500 590449 1085485 1074891 1284218 1215866 957306
13849I57306M9784l5265r7090J01479L20435r2565k27420K90701k82194L1045
$$ 957306 1007090 971825 874735 976214 1296649 1204084 976664 1267365 985171 1016216
13839A016216j68118j58710L46500J48645m55919L75159l1236j4032n338J69635
$$ 1016216 848098 689388 1035888 1184533 728614 1103773 1072537 1058505 1053167 1222802
13829A222802l76423k27764M83551j17972J52264L2796o7136j24978j72156o3470
$$ 1222802 846379 618615 1102166 984194 1136458 1169254 1102118 977140 804984 741514
13819G41514M9682j8952J89668Q3640j61807J74705l37452O6083M02301k91814
$$ 741514 791196 772244 961912 1045552 883745 1058450 720998 787081 1189382 897568
13809H97568J46167j1702j10411p4158j34545L11403m5437o1518q8586Q167Q840
$$ 897568 1043735 1032033 921622 847464 712919 1024322 978885 917367 828781 836948 845788
13798H45788K0934K029J95704K42152m02373L8952j42449L61383m74003K8165
$$ 845788 866722 868751 1064455 1306607 904234 943186 800737 1162120 688117 716282
13788G16282p804k5161J05636J25146k15417K88558k23741L4055j56725L47153
$$ 716282 708478 683317 788953 914099 698682 987240 763499 797554 640829 987982
13778I87982K7515l76739P5204n5671Q4862n0581k31706K13095j2074l4046K8612
$$ 987982 1015497 638758 713962 658291 743153 692572 460866 673961 661887 627841 656453
13767F56453K93974n8144K33041k16194j15264Q0731o3757J77278l22383L43164
$$ 656453 950427 892283 1125324 909130 793866 874597 810840 988118 665735 1008899
13757A008899m81256J83751j66652L19356m21836J94990R0371L5992j62794K41621
$$ 1008899 527643 711394 544742 864098 442262 637252 727623 763615 600821 842442
13747H42442l55866K49557p3686k3490r990j8730j92089K76785O7770j41269L4291
$$ 842442 486576 736133 662447 638957 628967 610237 418148 694933 762703 621434 655725
13736F55725k5905k29116M31357k80716R0316J25288L5661k16507J20614k35162
$$ 655725 629820 400704 832061 551345 641661 766949 802610 586103 706717 471555
13726D71555R0440K3264k53376M10703O0073n2254j87206K0478p0340M36856D69055
$$ 471555 561995 585259 331883 742586 802659 750405 563199 583677 513337 950193 469055
13714D30678J57704K22233Q1193m14667J03391L12639k43621O6664k20370l4523
$$ 430678 588382 810615 891808 477141 580532 893171 649550 716214 495844 461321
13704D61321j71569K28814K43290C42168n9785N75104k46272P9490k4527k93257
$$ 461321 289752 518566 761856 342168 282383 857487 611215 690705 666178 372921
13694C72921K38005k77657L35689j24193p5392L94383l01018J64959l13592K10129
$$ 372921 610926 333269 668958 544765 469373 863756 562738 727697 414105 624234
13684F24234J01242j64823l02j35608j80474L55514J28544j74682j10838A39534
$$ 624234 725476 560653 560351 424743 244269 599783 728327 553645 442807 139534
13673E63554p9718K04388j56793j07102K49160C08337J40688B07135L12838K61773
$$ 563554 483836 688224 531431 424329 673489 308337 449025 207135 519973 781746
13663G81746k98778R0817j33076J35205L04094m13081l43K66586k50149r6829
$$ 781746 482968 573785 440709 575914 880008 466927 466584 733170 483021 386192
13653C86192J40479M7590B35040j00710L31715j44723J22106j99024L07247J58449
$$ 386192 526671 574261 235040 134330 466045 321322 443428 244404 551651 710100
13643G10100p6389B87673L42619m3254A65217N5123j0819K46781K63048j57667
$$ 710100 633711 287673 630292 587038 165217 220340 209521 456302 719350 561683
13633E61683K23268B95813k1773Q8781k412J95117n6917O6930j72857J43977K95527
$$ 561683 784951 295813 274040 362821 360409 555526 498609 565539 392682 536659 832186
13622H32186A15161N79296l44011Q8686p672P8424k5257L6469k34740M50868e691
$$ 832186 115161 694457 350446 439132 431460 509884 484627 521096 286356 737224 -5691
13610G69546B54666d5645E06593j11013K20724j10467j36783A34758K02773r6182
$$ 769546 254666 -45645 506593 395580 616304 505837 369054 134758 337531 241349
13600B41349k8328L3557K62852k48193M00931C15314K68559A01469J68616K04954
$$ 241349 213021 246578 509430 261237 662168 315314 583873 101469 270085 475039
13590D75039B12375K61147B10917K17328K37186j65309k49529p583N36121C54926
$$ 475039 212375 473522 210917 428245 665431 500122 250593 243010 779131 354926
13579E32517a02685B98362K52909O3508F2547L29819A05567J30571J95014l1014
$$ 532517 -102685 298362 551271 614779 62547 392366 105567 236138 431152 400138
13569D00138r2625L63197k13173J7916k05501J70375p8926j23544N0546J96619
$$ 400138 307513 670710 457537 475453 269952 440327 361401 237857 288403 485022
13559D85022j0514j17882A48549J80370R0324j0211m5712G2099J27166c5809F42591
$$ 485022 474508 356626 148549 328919 419243 409032 363320 72099 199265 -35809 642591
13547D28607B06087J16763l4898K48923A31697M10220j43589J2972j56440p7365
$$ 428607 206087 322850 287952 536875 131697 541917 398328 411300 254860 177495
13537A77495R8895K554p939J7822K20770b04A08179L17286K6865A16843K94940
$$ 177495 276390 278944 271005 288827 509597 -204 108179 425465 452330 116843 411783
13526D11783o5149j18016J50568j00381E7354J56287L36373j457j76411J33938
$$ 411783 346634 228618 379186 278805 57354 213641 550014 548557 372146 506084
13516E06084B02936J17973p2303N97941C22308J7053o6232J30097j39412q5677
$$ 506084 202936 320909 248606 846547 322308 339361 273129 403226 263814 178137
13506A78137L58784A96462l4595J28997J12858j8878j32587J00506A05081K34475
$$ 178137 536921 196462 161867 290864 403722 384844 252257 352763 105081 339556
13496C39556R298q1110N1230i1967b4819B33071A38L9754K41723P801I0504g8150
$$ 339556 348854 267744 318974 -91967 -24819 233071 138 39892 281615 289416 90504 -78150
13483C61234q648j48286B9274N77900k84593j44372G1674K09684K14848j14135
$$ 361234 352586 204300 29274 607174 322581 178209 71674 281358 496206 382071
13473C82071K58923j96484A82953c7546E04816G0999l5408L62731A32183J14437
$$ 382071 640994 444510 182953 -37546 504816 70999 35591 398322 132183 246620
13463B46620J39672n7029A02491K9264L67619R5645k92653J10487j4841O0293
$$ 246620 386292 329263 102491 131755 499374 595019 302366 412853 398012 458305
13453D58305k21397l4561C0629K24226k4123J04657j38574A4666J70792L16282
$$ 458305 236908 202347 30629 254855 230732 335389 196815 14666 185458 501740
13443E01740k42579K21251n7957A82804H1802K59288l0259k4848A07835Q4507
$$ 501740 259161 480412 422455 182804 81802 341090 310831 285983 107835 192342
13433A92342R0500l8604a8133C03674A66L06573d3316A76349M9953J06563j22971
$$ 192342 282842 244238 -18133 303674 166 306739 -43316 176349 226302 332865 209894
13422B09894H7629M7577L42955q1747J27722l6737j63127j61168C660a56102B97495
$$ 209894 87629 135206 478161 396414 524136 487399 324272 163104 3660 -156102 297495
13410B64056k8362G5838M11080B05298M5084j05429l5681M9156j4666j4058Q6504
$$ 264056 235694 75838 486918 205298 250382 144953 109272 158428 143762 129704 216208
13399B16208l4362K23378n8742j11140A074K32714R5405n3502j34612D99N21842
$$ 216208 181846 405224 346482 235342 1074 233788 329193 275691 141079 499 522341
13388E22341I2074P8670J2447F4041K25138Q2478O913a52170A09983R176K7546
$$ 522341 92074 170744 183191 64041 289179 371657 378570 -152170 109983 119159 146705
13377A46705P2693J9778M9093P5239F8269L61201A05814L60096B03137q6058K28383
$$ 146705 219398 239176 288269 363508 68269 429470 105814 465910 203137 117079 345462
13366C45462j20178q2028o7326J78974J566p8577N7377J55301A62500L2654J0825
$$ 345462 225284 143256 75930 254904 256470 177893 235270 390571 162500 195154 205979
13355B05979j4860J38639j30667J29444r4821j5075i0223C32401K17040b05171
$$ 205979 191119 329758 199091 328535 233714 218639 -90223 332401 549441 -205171
13344B00075L28379k19871N1845I7288L76974l749A28831K30602j65283m490J209
$$ 200075 528454 308583 360428 97288 474262 470513 128831 359433 194150 189660 190869
13333A90869L75818j73122A62354C7952R5185K6089K23583o4350A35769q91N4353
$$ 190869 566687 393565 162354 37952 133137 159226 382809 318459 135769 134878 189231
13322A89231n8018J83335K66079k59868n3887A00555M8940J39637A29032J19297
$$ 189231 131213 314548 580627 320759 266872 100555 149495 289132 129032 248329
13312B48329A03266I052J08888L8161q906L0161n6470K59390K81391a14930F8787
$$ 248329 103266 9052 117940 156101 147195 177356 120886 380276 661667 -114930 68787
13300G1715L41503e2198k8553B68567j7223a60199F3088O7597K89119A01198a41458
$$ 71715 413218 -52198 -80751 268567 251344 -160199 63088 130685 419804 101198 -141458
13288B25983F2110h2725B79607j02826E7406J5239N16581D9840h0563l227C00556
$$ 225983 62110 -82725 279607 176781 57406 72645 589226 49840 -80563 -83790 300556
13276A11871L49255A37407g136l3316E45384a04341E44980B0849M09401A02896
$$ 111871 461126 137407 -7136 -40452 545384 -104341 544980 20849 430250 102896
13265A73867L4833P3493b8419j20640B81032A32521P6639b55158B11074N2679
$$ 173867 208700 282193 -28419 -149059 281032 132521 209160 -255158 211074 263753
13255B63753E7666J489N29464B55592b8612B24318f4967C44106F0681K97821I5349
$$ 263753 57666 59155 588619 255592 -28612 224318 -64967 344106 60681 358502 95349
13243A18098L6883G5714M4319J9727k2550Q46g0206F6068C747J07115M0987M139
$$ 118098 154981 75714 120033 139760 117210 118056 -70206 66068 3747 110862 151849 155988
13231A55988A9715J08880o4164R0136l8376a68322A80033M9564f4002o9618A5198
$$ 155988 19715 128595 64431 154567 116191 -168322 180033 229597 -64002 -133620 15198
13219B80134R290a74604E8413O3279N3231q4790J09968H3292C1396J70048E3655
$$ 280134 289424 -174604 58413 121692 174923 90133 200101 83292 31396 201444 53655
13207A69O1716J20288J22304d160j9339C37726j10577j03351a93058H9599J8831
$$ 169 61885 182173 304477 -4160 -23499 337726 227149 123798 -193058 89599 108430
13196A08430f9100I4246b53355B81351o9595J25492l0426p3143b8714C9879K41610
$$ 108430 -69100 94246 -253355 281351 211756 337248 306822 233679 -28714 39879 281489
13185B81489J39282A50732j3744i048j0240B20861k9158K5817J01468A48105P8081
$$ 281489 420771 150732 136988 -9048 -19288 220861 191703 217520 318988 148105 226186
13174B26186B1589K53867D773N0311e7982A11091K55411H7968K51116F1904J38039
$$ 226186 21589 275456 4773 55084 -57982 111091 366502 87968 339084 61904 199943
13163A99943I0217K42190j04310l6421g9551D16284g079A08550h394j9574b315
$$ 199943 90217 332407 228097 191676 -79551 416284 -7079 108550 -8394 -27968 -2315
13151E4111L40250A32706a71289A37877l3222M039a38052E04565j49356a3328
$$ 54111 394361 132706 -171289 137877 104655 108694 -138052 504565 355209 -13328
13140D0271d062A0848K18505J00958I7953J32713K9176g4536A42407m4067b26206
$$ 40271 -4062 10848 229353 330311 97953 230666 259842 -74536 142407 98340 -226206
13128B36656J53344B320a37544B4418f0219D14841A18679D3685L21998j21050
$$ 236656 390000 2320 -137544 24418 -60219 414841 118679 43685 365683 244633
13118B44633n2330G08K58838k6221b34245C69312J61564G5786J76293a9524F3521
$$ 244633 192303 708 259546 233325 -234245 369312 530876 75786 252079 -19524 63521
13106C36761b54864A6456i4841c0268l62160a7597n9567D33181d631G2948N18851
$$ 336761 -254864 16456 -94841 -30268 -392428 -17597 -77164 433181 -4631 72948 591799
13095E91799a43961A89249l8939J1932J12660J12721f2962A65023f8992H4379
$$ 591799 -143961 189249 150310 162242 274902 387623 -62962 165023 -68992 84379
13084C99967G5219L12095A1495L82385n7029a72708e0086j9461j16362A75164
$$ 399967 75219 387314 11495 393880 336851 -172708 -50086 -69547 -185909 175164
13073I4218K65020A03407n1181A4628R8514K03472a01740I9312j5714l3663J54680
$$ 94218 359238 103407 52226 14628 113142 316614 -101740 99312 83598 49935 204615
13062B04615n2465M48401A39964J99409f119G2205b616B34872n8518o4619a72373
$$ 204615 152150 600551 139964 339373 -6119 72205 -2616 234872 176354 111735 -172373
13050A46487M5059M6761m9362c0020A13209l6507d4554C28120b98842A05815d6681
$$ 146487 191546 238307 188945 -30020 113209 76702 -44554 328120 -298842 105815 -46681
13038B13758c105B84225A36543a74563A80361K29374e5984D44516a1052A68991
$$ 213758 -3105 284225 136543 -174563 180361 409735 -55984 444516 -11052 168991
13027A69706o2625b6071A03569J62987A28748N3476Q1675b17166A38718C3043
$$ 169706 107081 -26071 103569 266556 128748 182224 263899 -217166 138718 33043
13016E2935J31243o6024c50648f7536B49324K17745f3871k59926D55732g2235
$$ 52935 184178 118154 -350648 -67536 249324 467069 -63871 -323797 455732 -72235
13005f1759A1427b5928I6883l4727J25944F6314K27646o7695p5788N2459A8382
$$ -61759 11427 -25928 96883 62156 188100 66314 293960 226265 150477 202936 18382
12993c1108D02022A24029i9666A9288K56847K34509I8080a7238j77860H9473J77334
$$ -31108 402022 124029 -99666 19288 276135 510644 98080 -17238 -195098 89473 266807
12982B66807b5645k6151E2737a0656A62799E2268a03309G2053r965a84496h4812
$$ 266807 -25645 -51796 52737 -10656 162799 52268 -103309 72053 62088 -184496 -84812
12970D20091i6601p5065A94510a79276d2819B11188L17935D1935a34682H6876
$$ 420091 -96601 -171666 194510 -179276 -42819 211188 529123 41935 -134682 86876
12959i7904B00219q4248k1079c4822A57609R3689E3003J71259C9119b3567k1152
$$ -97904 200219 115971 94892 -34822 157609 251298 53003 224262 39119 -23567 -44719
12948d4719j70751E9425n06J7050a11405E3891L46881j98185q9895a34660d2922
$$ -44719 -215470 59425 58919 75969 -111405 53891 400772 202587 112692 -134660 -42922
12936c03053i1656B41848B7022i8501E9352M3532J51054J15844F857J61658f2720
$$ -303053 -91656 241848 27022 -98501 59352 102884 253938 369782 6857 168515 -62720
12924d2965B43541i8601c8362M513I953J47156a2145A02469j8595k6510N5191
$$ -42965 243541 -98601 -38362 -33849 9953 157109 -12145 102469 83874 57364 112555
12913A12555I469M01480k01511j03166d82335j2814B60385J06663G9972J35132
$$ 112555 9469 410949 209438 106272 -482335 -495149 260385 367048 79972 215104
12903B15104q0933a96924C1272b57331I7687k6513b17043H6624H082R157K48498
$$ 215104 134171 -196924 31272 -257331 97687 71174 -217043 86624 8082 17239 265737
12892B65737A01496b8934D42639B4670j1147k335J42804a27625A93873o3659a78443
$$ 265737 101496 -28934 442639 24670 13523 11188 153992 -127625 193873 130214 -178443
12880A6378a8233c288C51612L8015a38047j6793A50081j2438g9396C61187A03249
$$ 16378 -18233 -3288 351612 389627 -138047 -154840 150081 137643 -79396 361187 103249
12868B0354K27905b65030a5407n8740F0338h7416L0796A02456k11D3603j9420
$$ 20354 248259 -265030 -15407 -74147 60338 -87416 -56620 102456 102245 43603 24183
12857B4183J21677L3836q1596k5741A4737K54625b5439k5215E9256O1662J61019
$$ 24183 145860 179696 98100 72359 14737 269362 -25439 -50654 59256 120918 281937
12846B81937F893a29574G2091J10287j9810K6049l9577a59510g6942Q222F4470
$$ 281937 6893 -129574 72091 182378 162568 188617 149040 -159510 -76942 -68720 64470
12834b39994c0224A77640a04566l6549j76184A39879J86476A56992a52790q4560
$$ -239994 -30224 177640 -104566 -141115 -317299 139879 326355 156992 -152790 -237350
12824b37350Q8215A44145P70a35490m3199B80972j22888J92411E722a3830F7267
$$ -237350 -149135 144145 144915 -135490 -178689 280972 158084 350495 5722 -13830 67267
12812A27268K4010K68694a04993m8610f7470d676D2278b0874O159n6187E0383
$$ 127268 151278 419972 -104993 -153603 -67470 -4676 42278 -20874 -14715 -70902 50383
12800e2740G6507b60404A82219m2945a06069A96123a88123B1918J04870a03432
$$ -52740 76507 -260404 182219 139274 -106069 196123 -188123 21918 126788 -103432
12789b24255C60079a43002b6791q9733a9750o6739B47393c01061h880r0289G2684
$$ -224255 360079 -143002 -26791 -116524 -19750 -86489 247393 -301061 -8880 -99169 72684
12777B7837k134N4098J61572a5069m0728l0146q1039B48105q4378M0602a1353
$$ 27837 25703 79801 241373 -15069 -55797 -85943 -166982 248105 163727 204329 -11353
12765f1365f2A51589D2665K91622A10791m208b52515A07636m6729K22989a08368
$$ -61365 -62 151589 42665 334287 110791 106583 -252515 107636 60907 283896 -108368
12753a90668h6959A52055G4799J60077j16828d311A59172J57299A38978j5373
$$ -190668 -86959 152055 74799 234876 118048 -4311 159172 316471 138978 123605
12743A23605F392a72458d345C8626b2723D60250F0336J55005a19562A32292o1650
$$ 123605 6392 -172458 -4345 38626 -22723 460250 60336 215341 -119562 132292 70642
12732G0642k5702j0355a59670N9682C4890a3628D17007C9312c052I6013P4665
$$ 70642 44940 34585 -159670 -99988 34890 -13628 417007 39312 -3052 96013 170678
12721A70678O6265d9708r658I2575M7355f0690j44643D31376A36498n2241K26989
$$ 170678 236943 -49708 -59366 92575 139930 -60690 -205333 431376 136498 84257 311246
12710C11246i8906B80259C9078J05802C1339N78828d4896B47933k9933o3675j175
$$ 311246 -98906 280259 39078 144880 31339 610167 -44896 247933 218000 154325 153150
12699A53150P1008k5733J1308R7223E6300p822K9389K19211e2904K1967j83935
$$ 153150 224158 198425 209733 306956 56300 48478 77867 297078 -52904 -30937 -214872
12688b14872i4284B37972b39819D3871N2116b3755q8183k3008B67917h4962I7171
$$ -214872 -94284 237972 -239819 43871 95987 -23755 -111938 -134946 267917 -84962 97171
12676C52130a57169C0482L0406k5746J49883K00145a17746A17143J4293K23885
$$ 352130 -157169 30482 60888 35142 185025 385170 -117746 117143 131436 355321
12666C55321G0051K57234j20711E8735M1690m1150J1796a49663a4095E08858A15463
$$ 355321 70051 327285 206574 58735 100425 59275 71071 -149663 -14095 508858 115463
12654C49954A66568l6153b9974A50066p3389a13750J9188K4031D4848J03151D0291
$$ 349954 166568 130415 -29974 150066 76677 -113750 -94562 -70531 44848 147999 40291
12642A50011J89671E9503J74492H1890a10296F3523i7319A07854c79A78007G2665
$$ 150011 339682 59503 233995 81890 -110296 63523 -97319 107854 -379 178007 72665
12630D80679j4396B14561p3292J95598O5868A65859C4034a15760F5336a738G6108
$$ 480679 466283 214561 141269 336867 402735 165859 34034 -115760 65336 -1738 76108
12618d6670E8795R438b39145D8311a4247A4926b62590C44044j07758c6092B50486
$$ -46670 58795 68233 -239145 48311 -14247 14926 -262590 344044 236286 -36092 250486
12606B89216F2399j412a07675B41428j596k8026p462g5460k46964E3524J85038
$$ 289216 62399 60987 -107675 241428 239832 211806 204344 -75460 -322424 53524 238562
12595B38562H4887J46767J36683m7300a12624C69908G9977M0200J55064L8698
$$ 238562 84887 231654 368337 321037 -112624 369908 79977 120177 275241 313939
12585C13939b3147D4192b10425B4613b01853E2687J1171b123D26206b28042l1012
$$ 313939 -23147 44192 -210425 24613 -201853 52687 63858 -2123 426206 -228042 -259054
12574b59054A9378J62062b50834d9420d598j37747e5469B95376A7138D859J00455
$$ -259054 19378 181440 -250834 -49420 -4598 -142345 -55469 295376 17138 4859 105314
12563A05314c5443g496A57696d9717A30016J42672a66794I0533a8018B81937a78479
$$ 105314 -35443 -7496 157696 -49717 130016 272688 -166794 90533 -18018 281937 -178479
12551d6548k00002A28529D7100b73949C6627J93441b04497l6361H4013A6669J9529
$$ -46548 -246550 128529 47100 -273949 36627 230068 -204497 -240858 84013 16669 36198
12540C6198L9274J89246j19854f3267B2838b97090F9616J26078a00790A3673J74478
$$ 36198 75472 264718 144864 -63267 22838 -297090 69616 195694 -100790 13673 188151
12529A88151n5380N2842f7197A2796L1606J79758b2806j73217C62950a09541C27832
$$ 188151 132771 185613 -67197 12796 44402 224160 -22806 -196023 362950 -109541 327832
12517A68372B5406J287J91897A01413a97349K577A02891k9308P8741K113h155
$$ 168372 25406 26693 218590 101413 -197349 -194772 102891 73583 152324 154437 -8155
12505b26043f1895A6824J10128k8009a68545C2458a56558M4883j3985C79644j29558
$$ -226043 -61895 16824 126952 98943 -168545 32458 -156558 -111675 -125660 379644 250086
12494B50086C6550g6535j8657m9097r619O7403j75930G3965g749c569j55794j8055
$$ 250086 36550 -76535 -95192 -144289 -153908 -86505 -262435 73965 -7749 -3569 -159363 -177418
12482a77418h5749G898a30507A000i8248M7088m2728B3021f1631p0368e7666l3513
$$ -177418 -85749 7898 -130507 1000 -98248 -51160 -93888 23021 -61631 -131999 -57666 -91179
12470i1179B05246a55722c3388B49728B90b17471C3048J96326B4047h5415A52164
$$ -91179 205246 -155722 -33388 249728 290 -217471 33048 229374 24047 -85415 152164
12458B79207A039a62947B42159p2110l5938P5451j1151H8246C8552M3521J57811
$$ 279207 1039 -162947 242159 170049 134111 209562 198411 88246 38552 82073 239884
12447B39884i6140E8879b19788A31622c73833A64829k1060m0218a7795l9762m58965
$$ 239884 -96140 58879 -219788 131622 -373833 164829 143769 103551 -17795 -57557 -516522
12436e16522B66525a91118H3179J95107b08180f1250j35554c2790m018k02014
$$ -516522 266525 -191118 83179 278286 -208180 -61250 -196804 -32790 -36808 -238822
12426b38822C2311A5792J37300d3358l68415f790B03664c88220B06939j2636b81524
$$ -238822 32311 15792 153092 -43358 -411773 -6790 203664 -388220 206939 194303 -281524
12414h3248l1782C1774J46356e4978l00872A35280d8942A21820J1140a7600l65073
$$ -83248 -115030 31774 178130 -54978 -355850 135280 -48942 121820 132960 -17600 -382673
12403c82673a27406e2236A00425g9988G1316d00013p910D2788g3592k39912A60819
$$ -382673 -127406 -52236 100425 -79988 71316 -400013 -407923 42788 -73592 -313504 160819
12391A5061J04444B0641M57440a01217C8163L23759b0586A57584e8430A27050
$$ 15061 119505 20641 478081 -101217 38163 361922 -20586 157584 -58430 127050
12380B20499j01563e6423J9392D90352b14997E8541J90018A4070a06394H8995
$$ 220499 118936 -56423 -37031 490352 -214997 58541 248559 14070 -106394 88995
12369A90178J11764n5052G5090a6730B00672n9681A6850a53383D50254b23604
$$ 190178 301942 246890 75090 -16730 200672 140991 16850 -153383 450254 -223604
12358D6040Q2189J73781h6094A80384b07924A11861a63835L7907k9558A79465
$$ 46040 128229 302010 -86094 180384 -207924 111861 -163835 -125928 -155486 179465
12347B3715b05628n2601E4036c05795c4804A34600d6643B41038k0214b15192P3410
$$ 23715 -205628 -258229 54036 -305795 -34804 134600 -46643 241038 220824 -215192 -141782
12336a41782p4694D7192b84867B75434j19347a3991j34329A07483k0926A9781
$$ -141782 -216476 47192 -284867 275434 156087 -13991 -148320 107483 86557 19781
12325b4458B51007i7386m7663c9783D1420j82K23137a26307C94188i1987B48423
$$ -24458 251007 -97386 -145049 -39783 41420 41238 264375 -126307 394188 -91987 248423
12313b14174Q1527e6876Q538E7547a07526j93216B50494k6661r2170A6879J90644
$$ -214174 -132647 -56876 -48338 57547 -107526 -300742 250494 223833 131663 16879 207523
12302B07523d6809C3059K39562G4747M3485D1248i1937A9566E444N0376g1894
$$ 207523 -46809 33059 272621 74747 118232 41248 -91937 19566 5444 55820 -71894
12290b41734B08623J82726a41402B7151c96289C3806K137L20237A5551a26508
$$ -241734 208623 391349 -141402 27151 -396289 33806 35943 356180 15551 -126508
12279D16868C9920K05742e0693l6147C07630A48745M4651C4982j99a06681C39677
$$ 416868 39920 245662 -50693 -86840 307630 148745 193396 34982 34783 -106681 339677
12267a30252A54237Q630M6733A03421k675g6922a2183k17420B26240K9625r0765
$$ -130252 154237 162867 209600 103421 100746 -76922 -12183 -229603 226240 255865 165100
12256A65100l5672K39035A19028A261J50313c1104A1036O6261b42521B37158K3022
$$ 165100 129428 368463 119028 1261 151574 -31104 11036 77297 -242521 237158 260180
12245B60180a3195B37068b1656A62359b76H4395d9696A57007N1808C3281b29405
$$ 260180 -13195 237068 -21656 162359 -276 84395 -49696 157007 208815 33281 -229405
12233C81980A43819M205J32061K26805A18220K46443P3591b2201C67681A01275
$$ 381980 143819 148024 280085 506890 118220 364663 438254 -22201 367681 101275
12222B32930d6262B26322l1062R3378J4968p1799A7702M5188d0240B63952m6309
$$ 232930 -46262 226322 195260 288638 303606 231807 17702 62890 -40240 263952 217643
12211B17643j07390B3023J01604J7626J47414c8589r8441E67094o9488B48401
$$ 217643 110253 23023 124627 142253 289667 -38589 -137030 567094 497606 248401
12200A6191P5347b3330I043L20379i8224d2313A3432J45792o7041J03092j4067
$$ 16191 91538 -23330 9043 329422 -98224 -42313 13432 159224 92183 195275 181208
12189A81208o7326J64421q4115a97212f5301A31801j8969J79690a42800A80231
$$ 181208 113882 278303 194188 -197212 -65301 131801 112832 292522 -142800 180231
12178A6166J30523b39842b8613A40409a22492B1284a57677B44794i699H9333l5446
$$ 16166 146689 -239842 -28613 140409 -122492 21284 -157677 244794 -9699 89333 53887
12167E3887A8683K03521I4562h8938B23356F4546K08404c3249B7244a82060A71878
$$ 53887 18683 222204 94562 -88938 223356 64546 272950 -33249 27244 -182060 171878
12155B81848f7807l9051K7846r3934j3461C31758n2617j00283b56382F0304a38497
$$ 281848 -67807 -106858 -79012 -172946 -186407 331758 279141 178858 -256382 60304 -138497
12143a58743A72130G8434K12979d8726A27450h8661r8417D74625A78288b6114
$$ -158743 172130 78434 291413 -48726 127450 -88661 -187078 474625 178288 -26114
12132A0946N3322R345k3333b87557H8890a92846d7187B11951e2178H354P2118
$$ 10946 64268 73613 50280 -287557 88890 -192846 -47187 211951 -52178 8354 80472
12121H0472b20529i0727B78418H2806J31322a77291n4132a15031H9890a0651n884
$$ 80472 -220529 -90727 278418 82806 214128 -177291 -231423 -115031 89890 -10651 -16535
12110a6535j72668B03009F9259i4248d3239j58554a9742n4056A49099a83629l1710
$$ -16535 -189203 203009 69259 -94248 -43239 -201793 -19742 -73798 149099 -183629 -215339
12099b15339B65997L0586q2624b20165Q2502O4675k57051A10238E4926c46821
$$ -215339 265997 296583 213959 -220165 -137663 -72988 -330039 110238 54926 -346821
12088b53975B7209a77654A69318a5746q5386B63908j17333n5448N3694J02244
$$ -253975 27209 -177654 169318 -15746 -101132 263908 146575 91127 144821 247065
12078B47065H4267i2522l3482F6063J93157P1186A0642Q8144M46132M32643J024524
$$ 247065 84267 -92522 -126004 66063 259220 330406 10642 98786 544918 977561 2002085
12067B002085E30310l2791b71752B32144R1331H8470a25464j46309F7400a69679
$$ 2002085 530310 497519 -271752 232144 323475 88470 -125464 -271773 67400 -169679
12056e9191F9222j5861d5084C69702A3914h8457k06746D9447M7110l8108J7790
$$ -59191 69222 53361 -45084 369702 13914 -88457 -295203 49447 96557 58449 76239
12045G6239i9737L5460J7755p83a504k84908D9184f2607J995B77558a39752H2093
$$ 76239 -99737 -64277 -46522 -47305 -1504 -286412 49184 -62607 -60612 277558 -139752 82093
12032C081R5201b0768C4958L03244G206M6437f8382j02749k1854a747l37113a07904
$$ 3081 98282 -20768 34958 338202 7206 53643 -68382 -171131 -192985 -1747 -338860 -107904
12019C19259A36326k5202a29460e917G432M3418R9973a63783k0383B44970a95632
$$ 319259 136326 111124 -129460 -5917 7432 50850 150823 -163783 -184166 244970 -195632
12007A28742J70191a23256F9198J05694c6728B7611K23311d8632j62270e9861
$$ 128742 298933 -123256 69198 174892 -36728 27611 250922 -48632 -210902 -59861
11996g2275B65338a00155B09087f3849G6896a36171r5762J05229B54516a58857
$$ -72275 265338 -100155 209087 -63849 76896 -136171 -231933 -126704 254516 -158857
11985a36135B05878E7639h5283b2822r5696C8074K0451k0385c20081G9843J25370
$$ -136135 205878 57639 -85283 -22822 -118518 38074 58525 38140 -320081 79843 205213
11974B05213a1557C8843N7560a87548A6746d25685A78699a64597F5386a16574
$$ 205213 -11557 38843 96403 -187548 16746 -425685 178699 -164597 65386 -116574
11963F4058j7906e2031a3465B17829q2470D3392b7786F0915g5460j76190A18941
$$ 64058 46152 -52031 -13465 217829 135359 43392 -27786 60915 -75460 -251650 118941
11951b98516J33319h2224F8904b32447c9368j14047P3453A22729b69322j1139
$$ -298516 -165197 -82224 68904 -232447 -39368 -153415 -79962 122729 -269322 -280461
11941b80461h1052m3524A09725k3956d7443F9421a40496A87791a99852G7179a33787
$$ -280461 -81052 -124576 109725 85769 -47443 69421 -140496 187791 -199852 77179 -133787
11929A0780J5901L715l439g4286I1755j0876K2657l0722M9955G246J4954L6082
$$ 10780 26681 30396 26957 -74286 91755 80879 103536 72814 122769 7246 22200 58282
11917E8282e6466A18002j3535b01346D3798K31697a87338b2835D01951a06810
$$ 58282 -56466 118002 104467 -201346 43798 275495 -187338 -22835 401951 -106810
11906c4413H4224K96536A4643J21016o1199J25889r0035k3145j5852a47318l1352
$$ -34413 84224 380760 14643 135659 74460 200349 110314 87169 71317 -147318 -178670
11895a78670C11459a88621q790a3682I5360J67060A23170J41016b52518B37618
$$ -178670 311459 -188621 -197411 -13682 95360 262420 123170 264186 -252518 237618
11884e0304H0921c4868H0545b86622a21882E481L48557e9047k34838B08993a52309
$$ -50304 80921 -34868 80545 -286622 -121882 5481 354038 -59047 -293885 208993 -152309
11872a95542e5403B26213a02898J0587j21214C32703j46763E4335K88649a71776
$$ -195542 -55403 226213 -102898 -92311 -213525 332703 185940 54335 342984 -171776
11861b88103a33020j44037f5814p8323B62710b8642A0447K1930j174J41869a12825
$$ -288103 -133020 -277057 -65814 -144137 262710 -28642 10447 32377 31203 173072 -112825
11849G0038b16559A06391b33373a12464A78310c18680C35654a14957A09651M967
$$ 70038 -216559 106391 -233373 -112464 178310 -318680 335654 -114957 109651 114618
11839A14618d7221J2512r9558H1769K11348b93695C7357N8136l1909k3031d5335
$$ 114618 -47221 -34709 -134267 81769 293117 -293695 37357 95493 63584 40553 -45335
11827a47767B04801J72657E9472K62931g7881B64933C1502b24939B5948J38844
$$ -147767 204801 377458 59472 322403 -77881 264933 31502 -224939 25948 164792
11817A64792B1652H516K57716d3819k4004k8546c9667e975o5733C81068C4047
$$ 164792 21652 8516 266232 -43819 -67823 -96369 -39667 -5975 -71708 381068 34047
11805B90026f3497l45594B36575B8260h2438j91299A17159c7648B03075J85276
$$ 290026 -63497 -409091 236575 28260 -82438 -273737 117159 -37648 203075 388351
11795C88351q6703a234F7239O3558J59436c85376A46069n9712f0915J3460l384
$$ 388351 301648 -1234 67239 130797 290233 -385376 146069 86357 -60915 -47455 -50839
11784e0839m1435r9833H9331C5194b7647k09713e2228m84115A79882e234A3080
$$ -50839 -92274 -192107 89331 35194 -27647 -237360 -52228 -536343 179882 -5234 13080
11772a36405C15876q0971D9207J52743h6009c6499C3430b37064N5595A6446b5518
$$ -136405 315876 234905 49207 201950 -86009 -36499 33430 -237064 -181469 16446 -25518
11760b5413F2994a02782A34476b9584B01273Q5066a89873a6069A37212C8411R178
$$ -25413 62994 -102782 134476 -29584 201273 286339 -189873 -16069 137212 38411 47589
11749D7589K01673F3105P5617R2928g7562l200m5599A9766O5068a76129j19964
$$ 47589 249262 63105 138722 231650 -77562 -80762 -126361 19766 84834 -176129 -296093
11738b96093b1895C54377h3612d0252A31867a08276A0837L0749L1404b6339B08290
$$ -296093 -21895 354377 -83612 -40252 131867 -108276 10837 41586 72990 -26339 208290
11726G585i1204H8044b49982A05137J30350i3151C7421a17852H7902P4662K31595
$$ 7585 -91204 88044 -249982 105137 235487 -93151 37421 -117852 87902 162564 394159
11715C94159A04675f1334C5413O5246j4335J45529a7087I6672e3D2469a3915D5374
$$ 394159 104675 -61334 35413 100659 86324 231853 -17087 96672 -53 42469 -13915 45374
11702D2011J40582o4368a75728K8014E5540B1553O490Q4688K23520c588C08136
$$ 42011 182593 118225 -175728 -147714 55540 21553 28043 112731 336251 -3588 308136
11690A15694a00297D485a20164n1508A31851b81150A80904a41923K2651o3046
$$ 115694 -100297 4485 -120164 -171672 131851 -281150 180904 -141923 -119272 -182318
11680a82318c1615j05076f0937D05861A36333M0565C8911K32973B2528J55386
$$ -182318 -31615 -136691 -60937 405861 136333 176898 38911 271884 22528 177914
11670A77914H870a956j39813N2342A89816D5253O1190b9643H1009P2931m2142
$$ 177914 8870 -1956 -141769 -89427 189816 45253 106443 -29643 81009 153940 111798
11659A11798c8419B25867N2244A03158a00986E3338J64043i8506j42306d5363
$$ 111798 -38419 225867 278111 103158 -100986 53338 217381 -98506 -240812 -45363
11648A47093C8001a27242A14048j4281e111D859b49095K7434C25741b79199C43327
$$ 147093 38001 -127242 114048 99767 -5111 4859 -249095 -221661 325741 -279199 343327
11636E9325d3966j55016j33553E66a9632m9421B32250H893R7903l4905J98364
$$ 59325 -43966 -198982 -332535 566 -19632 -69053 232250 8893 106796 71891 270255
11625B70255a53839l361N9548A74620P1241a46500k4751k37271a39686M3932C03948
$$ 270255 -153839 -157200 -97652 174620 245861 -146500 -171251 -408522 -139686 -95754 303948
11613b3415A02849c1585j19391A58597A0041L8996h435k8754L587n1954r806A64992
$$ -23415 102849 -31585 -150976 158597 10041 49037 -8435 -37189 -33602 -85556 -95362 164992
11600B16902e9926k2084B55362B6908a41004A48246d7072k7602H1425a9747i287
$$ 216902 -59926 -82010 255362 26908 -141004 148246 -47072 -74674 81425 -19747 -9287
11588A65350K75375k08944F2383G793R2725K20437J23544b0238j4193A55166R698
$$ 165350 440725 231781 62383 7793 100518 320955 444499 -20238 -34431 155166 164864
11577A64864a0146j56351B18073I500b55089A22571J20761a6273I2039d0483A90145
$$ 164864 -10146 -166497 218073 9500 -255089 122571 243332 -16273 92039 -40483 190145
11565d0363o4256C10959q1876n4196C2784J50453a54102N3572G3514J66222C0859
$$ -40363 -104619 310959 229083 174887 32784 183237 -154102 -100530 73514 239736 30859
11553A8104K1498c4915B3134L11227I1755Q7559a09598A65045o9318J14564j0659
$$ 18104 39602 -34915 23134 334361 91755 179314 -109598 165045 95727 210291 199632
11542A99632b99565A92698r043b10328H6333J90518o4078J53887a52090k3332
$$ 199632 -299565 192698 183655 -210328 86333 276851 212773 366660 -152090 -175422
11532a75422C78226D7201K53032B2819J36581l2932E6257J09911b08566m8040
$$ -175422 378226 47201 300233 22819 159400 126468 56257 166168 -208566 -256606
11522b56606H4523J10148b04621E3483N3613K02328A16401b15408A34793K55735
$$ -256606 84523 194671 -204621 53483 107096 309424 116401 -215408 134793 390528
11512C90528b9716k83688C51743Q8415O2900B25429c2625C40524J42501A35274
$$ 390528 -29716 -313404 351743 440158 503058 225429 -32625 340524 483025 135274
11501C1653f9497B63084A05506b33811B78118P0831R5450k09904B81L27650j54169
$$ 31653 -69497 263084 105506 -233811 278118 348949 444399 234495 281 327931 173762
11490A73762q6648l1593J36815j4769o6500J28076C5836J21256J66802F9479O14585
$$ 173762 87114 55521 192336 177567 111067 239143 35836 157092 323894 69479 684064
11479F84064j00506A34817O8686H6373J339R8014O304f8598A57532o8531m3112
$$ 684064 583558 134817 203503 86373 87712 185726 192030 -68598 157532 89001 45889
11468D5889P5473m7811A3596L38740j22225a54064j7839b2328A15371P3008I3608
$$ 45889 121362 73551 13596 352336 230111 -154064 -171903 -22328 115371 188379 93608
11456A08960P6841a85206A78055j7939o5622O3701F6897Q0009B1755a16507e6877
$$ 108960 185801 -185206 178055 160116 94494 158195 66897 146906 21755 -116507 -56877
11444A32685F4824F863K13599P2818C1434J76504j00975g7225B72186l8819n9809
$$ 132685 64824 6863 220462 293280 31434 207938 106963 -77225 272186 233367 173558
11433A73558c07370A90982N7913a97950A71565e3155k64477J28167A99067G0027
$$ 173558 -307370 190982 248895 -197950 171565 -53155 -317632 -189465 199067 70027
11422A18804O064n9331J78303B4703P0814m3904J16066a82286a60B19784f9761
$$ 118804 124868 65537 243840 24703 95517 51613 167679 -182286 -160 219784 -69761
11410b63570A55838a07036l48881B2705b26095C8601a87153g1321B13536G4242
$$ -263570 155838 -107036 -455917 22705 -226095 38601 -187153 -71321 213536 74242
11399G5054c3592j0126A91079p2942n8929J3455K22351a59765C9808J33d8813
$$ 75054 -33592 -43718 191079 118137 59208 72663 295014 -159765 39808 39941 -48813
11387a77128A73587c40065d8498M475l2840L812I0022J1716h2239C4883c6649
$$ -177128 173587 -340065 -48498 -44023 -76863 -73051 90022 101738 -82239 34883 -36649
11375b70121A16345b56421B67774K84184a53131A99295c54434B00898b18917I1370
$$ -270121 116345 -256421 267774 551958 -153131 199295 -354434 200898 -218917 91370
11364I0114b5501B42747a66713K7813j29063a10533N1380a7523A05655K83471
$$ 90114 -25501 242747 -166713 -138900 -267963 -110533 -59153 -17523 105655 389126
11354C89126j38638b43980K0477j67114D21804a15018J4111K0641A56117J3071
$$ 389126 250488 -243980 -223503 -390617 421804 -115018 -100907 -80266 156117 169188
11344A69188d47628A29642J11791I5620B2676b02025i4927l2701M1874C09814
$$ 169188 -447628 129642 241433 95620 22676 -202025 -94927 -127628 -85754 309814
11333c9686A74306o002D9864L23828g9073D0925J41220c09964A53841b5482G2394
$$ -39686 174306 168304 49864 373692 -79073 40925 182145 -309964 153841 -25482 72394
11321i0480j02440N1756c9844F5795b0400j60728a2672p6670B32126b30983P5032
$$ -90480 -192920 -141164 -39844 65795 -20400 -181128 -12672 -89342 232126 -230983 -155951
11310a55951B12438n4852a44450e3989B00624J14736b01386H2216B7431d0258
$$ -155951 212438 157586 -144450 -53989 200624 315360 -201386 82216 27431 -40258
11299c24438b2342k52466r2973R5341N7605l012O196b222j03105r393E9774c59256
$$ -324438 -22342 -274808 -367781 -272440 -214835 -217847 -211651 -2222 -105327 -114720 59774 -359256
11286b57323E02015r3556c557r3150B54497a68667G691K605c23239a8161o8037
$$ -257323 502015 408459 -3557 -96707 254497 -168667 7691 10296 -323239 -18161 -86198
11275h6198a4590A05422c60278b9409A00927i9347L3058B13247a33749r7618M7759
$$ -86198 -14590 105422 -360278 -29409 100927 -99347 -66289 213247 -133749 -231367 -183608
11264a83608b855k81246M6830F7275i2892A91180a84464d0761r0824j7204G0818
$$ -183608 -2855 -284101 -237271 67275 -92892 191180 -184464 -40761 -131585 -148789 70818
11252E779a46689M4701L8672C4875J89165L3812I0602F176a43435A10002b33858
$$ 5779 -146689 -101988 -63316 34875 224040 257852 90602 6176 -143435 110002 -233858
11240c4940k52501Q6577R6763o3183k05658B9752J81786e0570l37248H6606J75359
$$ -34940 -287441 -200864 -104101 -167284 -372942 29752 211538 -50570 -387818 86606 261965
11229B61965a24020L4606b7836l69083g800k24383C06777g4786o788e211H4985
$$ 261965 -124020 -89414 -27836 -396919 -7800 -232183 306777 -74786 -81574 -5211 84985
11217D4376L6155g2965n793n8228a1414k62102I4104A4693R1476n1937J42397
$$ 44376 80531 -72965 -78758 -136986 -11414 -273516 94104 14693 106169 54232 196629
11206A96629a93447B3137K3352g0763A60593J7262m6439C8551a46049o7016B17597
$$ 196629 -193447 23137 46489 -70763 160593 177855 131416 38551 -146049 -213065 217597
11194A85609D6370b46930L9521J01326K8884A32680b29258A01745e21140A19309
$$ 185609 46370 -246930 -207409 -106083 -77199 132680 -229258 101745 -521140 119309
11183b7537A84968i8697F9677J11781e6893q5382L8575A6239k095a26930A07695
$$ -27537 184968 -98697 69677 181458 -56893 -142275 -103700 16239 14144 -126930 107695
11171a06354a689H0699Q0577p8087L3473Q7579M8784A0089B871b16277i5319D56027
$$ -106354 -1689 80699 161276 83189 116662 204241 253025 10089 2871 -216277 -95319 456027
11158a8924i257A13259D5461n692J37378e6168k81731J16479B44129b77944c8526
$$ -18924 -9257 113259 45461 39769 177147 -56168 -337899 -221420 244129 -277944 -38526
11146b68616a4159k4953F2909J15951o9867b78563a2908A89397K9492q1990m3346
$$ -268616 -14159 -39112 62909 178860 108993 -278563 -12908 189397 218889 136899 93553
11135I3553e7499J8350B13747c8164l9024L3615A96325l5814q467i7719f810B60821
$$ 93553 -57499 -39149 213747 -38164 -77188 -43573 196325 160511 152044 -97719 -6810 260821
11122I8861l3367L61657G6010O1401a962C15448A10443m0493J56540H0540J84792
$$ 98861 65494 427151 76010 137411 -1962 315448 110443 69950 226490 80540 265332
11111B65332H0673R0795n0312C759N0859J31759J3131K2447J6601B7298J91780
$$ 265332 80673 171468 121156 3759 54618 186377 199508 221955 238556 27298 219078
11100B19078H4677L9256F0831K46368A38867K07158H2321a20016B80253m5655
$$ 219078 84677 123933 60831 307199 138867 346025 82321 -120016 280253 234598
11090B34598K6397j17150h5047F0269J11997B405N2762L89289J5110j70417B6005
$$ 234598 260995 143845 -85047 60269 172266 2405 55167 444456 459566 289149 26005
11078D44102H4494J43114K4200E3398K76561Q2007b6839C51134K84221j62448
$$ 444102 84494 227608 251808 53398 329959 411966 -26839 351134 635355 472907
11068D72907A23696L7917J19623A14738J53889M51108C07070L83645k59385q2102
$$ 472907 123696 161613 281236 114738 268627 719735 307070 690715 431330 349228
11058C49228L6612L05273j12969K42905j79603p679K15463j36007j89372j7127
$$ 349228 385840 691113 578144 821049 641446 633767 849230 713223 523851 506724
11048E06724L1230K6652M72411k55146J20303r969j12575R7845k88899L19517
$$ 506724 537954 564606 1037017 781871 902174 892205 779630 877475 588576 908093
11038I08093m42722M47950l02892N0708K7262k9591J5872k14749K19461K0011
$$ 908093 465371 913321 610429 661137 688399 658808 674680 459931 679392 699403
11028F99403K4800K29987k18329m9185m5299P8872J17423k32773j58678L99067
$$ 699403 724203 954190 735861 686676 641377 720249 837672 604899 446221 845288
11018H45288q8738j55343J67305k39676k9672m787K43278j18728J10964J49799
$$ 845288 756550 601207 768512 528836 499164 494377 737655 618927 729891 879690
11008H79690j27179l0394j99202J70008P8473J19541k45727l9842J06211K31150
$$ 879690 752511 722117 522915 692923 771396 890937 645210 605368 711579 942729
10998I42729m05837m0819N7892N67066n47014L40186P4817l95778K98621j30121
$$ 942729 536892 496073 553965 1121031 574017 914203 989020 593242 891863 761742
10988G61742J99344K17703m91477J53987L86556l16895J5062J65490K86141K70814
$$ 761742 961086 1178789 687312 841299 1227855 910960 926022 1091512 1377653 1648467
10978A648467l1534l1845M99712j2163Q35404m3584M36660q35869K20256M0733
$$ 1648467 1616933 1585088 2084800 2072637 2908041 2864457 3301117 2465248 2685504 2726237
10968B726237k97240k3991m63493l3990r0794r6263m06529L39937R4823j27268
$$ 2726237 2428997 2405006 1941513 1907523 1816729 1720466 1313937 1653874 1748697 1621429
10958A621429Q9974o1583j1727J79605k61771j12780k51311k70326p1386l1973
$$ 1621429 1711403 1649820 1638093 1817698 1555927 1443147 1191836 921510 850124 818151
10948H18151p2449K7982B10229K65957j25819p4029a08408A52903A5296R4528
$$ 818151 745702 773684 210229 476186 350367 276338 -108408 152903 15296 109824
10938A09824J62133m6663J55133A50261b2846R999h65A06082B9080K38944Q4336
$$ 109824 271957 225294 380427 150261 -22846 -12847 -865 106082 29080 268024 352360
10927C52360B7145K29786l6569A03226c3362A16917a64645A38605b61532B45092
$$ 352360 27145 256931 220362 103226 -33362 116917 -164645 138605 -261532 245092
10916b53765c1703J4542M451j5657j91551q9674J10506J7631B00885c8032J3657
$$ -253765 -31703 -17161 -12710 -28367 -219918 -309592 -199086 -181455 200885 -38032 -24375
10905b4375I0992g0833A51752d7123k157B31981c27135i2981B94529j11101f3230
$$ -24375 90992 -70833 151752 -47123 -49280 231981 -327135 -92981 294529 183428 -63230
10893a67868E24211a19367A44633a9517G100b2811A97791a61726c2934f144j05607
$$ -167868 524211 -119367 144633 -19517 7100 -22811 197791 -161726 -32934 -6144 -111751
10882a11751j49103J24721L0791L998A47740E7424g7665k2115C01902a33645A29155
$$ -111751 -260854 -136133 -105342 -101344 147740 57424 -77665 -99780 301902 -133645 129155
10870a81779M6622k5228j55831A65613K8887I3496b40792i1201D0501d43720D6862
$$ -181779 -135157 -160385 -316216 165613 194500 93496 -240792 -91201 40501 -443720 46862
10858g8997j63585b3917B20568J7411B3788K78066d7052l05139a49205A63705
$$ -78997 -242582 -23917 220568 237979 23788 301854 -47052 -352191 -149205 163705
10847c19682A31863D1688K031g6290D5659a06000A34334a72312A3948f0873C97044
$$ -319682 131863 41688 43719 -76290 45659 -106000 134334 -172312 13948 -60873 397044
10835i5146j99256A43983a30233n1171L9167f9727k11015I4516d416C0995k644
$$ -95146 -294402 143983 -130233 -181404 -142237 -69727 -280742 94516 -4416 30995 28351
10824B8351J69443E0468J9557a52167B90443l3227G6700b67801c796n3565h882
$$ 28351 197794 50468 70025 -152167 290443 257216 76700 -267801 -3796 -57361 -8882
10812B623a28226A67072a3839D6509f3483B75667a530E400a43641d762I9722a8785
$$ 2623 -128226 167072 -13839 46509 -63483 275667 -1530 5400 -143641 -4762 99722 -18785
10799A14641M2819d11191M8829j37720c056I0895e3388D2511i4072J8919m2721
$$ 114641 157460 -411191 -362362 -500082 -3056 90895 -53388 42511 -94072 -75153 -117874
10788a17874k01607A88795a11042j78944A2761a54867g6306A31607i5299A20054
$$ -117874 -319481 188795 -111042 -289986 12761 -154867 -76306 131607 -95299 120054
10777H405c76175r8618B61420o4391k1028a82726j2904B43027a82667C29645b07765
$$ 8405 -376175 -474793 261420 197029 176001 -182726 -195630 243027 -182667 329645 -207765
10765A17291J22418a9651L152A30840c49035H2853i1420L0644A64778a19405J336
$$ 117291 239709 -19651 -16499 130840 -349035 82853 -91420 -60776 164778 -119405 -118069
10754a18069e2017J4035n7101k2539q1881O9159b9970m6245k894B46175G8570
$$ -118069 -52017 -37982 -95083 -117622 -199503 -130344 -29970 -76215 -79109 246175 78570
10742D9361b2412r8054F1248a28581A12946b73213F7851e2596A15829c33503g4495
$$ 49361 -22412 -120466 61248 -128581 112946 -273213 67851 -52596 115829 -333503 -74495
10730a27118A74394c4661A12934a8984B23402a26616O3267B46591e36037A50427
$$ -127118 174394 -34661 112934 -18984 223402 -126616 -63349 246591 -536037 150427
10719a17741k8238k636A5319J681L2113f2583D4282F716b84839K1278C2233K67389
$$ -117741 -145979 -148615 15319 17000 49113 -62583 44282 6716 -284839 -263561 32233 299622
10707B99622G4248c6084l40981J50568A03926b04694A41562a47972B20054b01043
$$ 299622 74248 -36084 -377065 -226497 103926 -204694 141562 -147972 220054 -201043
10696b78245p8038h8294E056b2159j01253L1052F602c60813d4108b1732A86537
$$ -278245 -356283 -88294 5056 -22159 -123412 -92360 6602 -360813 -44108 -21732 186537
10684f0097B9113b00422p1535g9887J7925j8361k2411k60255C37013b08959A01695
$$ -60097 29113 -200422 -271957 -79887 -61962 -80323 -102734 -362989 337013 -208959 101695
10672A7109N8031R2634c8831r7659E0566O413M40736g526l26532J64759A20012
$$ 17109 75140 167774 -38831 -136490 50566 56979 497715 -7526 -334058 -169299 120012
10660b83009a38631c1808B3452a48089b4289D5845a88976E371d02801a06231K8172
$$ -283009 -138631 -31808 23452 -148089 -24289 45845 -188976 5371 -402801 -106231 -78059
10649g8059b9460a4081B60924d7322H7431b10322O6102a6596m7223A08153d6781
$$ -78059 -29460 -14081 260924 -47322 87431 -210322 -144220 -16596 -63819 108153 -46781
10637E1266J47468n2757N0205C3949j5896R2141J2791h6286B16249a39765M2566
$$ 51266 198734 145977 196182 33949 18053 110194 122985 -86286 216249 -139765 -97199
10626i7199I9349e18940b6995j09601H4346O7802p4507l54g8164l2054l92590
$$ -97199 99349 -518940 -26995 -136596 84346 152148 77641 77287 -78164 -110218 -502808
10615e02808a98105j93679f3654j02964C656i7839K7393B2917f7933r2351A73365
$$ -502808 -198105 -391784 -63654 -166618 3656 -97839 -70446 22917 -67933 -160284 173365
10603a93064j03064A3563b44375J9472a06642M9823A04317a8101D8796L4200j6720
$$ -193064 -296128 13563 -244375 -224903 -106642 -56819 104317 -18101 48796 82996 66276
10592F6276Q551m135a1869k08963M7936A3054J4023K90709E5799a7988o7886a0604
$$ 66276 74827 70692 -11869 -220832 -172896 13054 27077 317786 55799 -17988 -85874 -10604
10579i6167j2669L6504A6687O3824M648k5964J12751a26293j00472a489k30449
$$ -96167 -108836 -72332 16687 80511 85159 59195 171946 -126293 -226765 -1489 -231938
10568b31938I3692k6437J82309a52664P5590G9930o253J01884J33001h8161D3609
$$ -231938 93692 67255 249564 -152664 -77074 79930 73677 175561 308562 -88161 43609
10556a34939I4599b26746A28411h7483E6188a33446N7517k31138L441O3986B03898
$$ -134939 94599 -226746 128411 -87483 56188 -133446 -75929 -307067 -303626 -239640 203898
10544A45588F003a12405N3276j52556B85594c50688d8660j01761M7785A10820
$$ 145588 6003 -112405 -59129 -211685 285594 -350688 -48660 -150421 -102636 110820
10533b48198J18370n9952l80452G1439l3099K0617b94242d1721q2049e6190m1419
$$ -248198 -129828 -189780 -570232 71439 38340 58957 -294242 -41721 -123770 -56190 -97609
10522i7609A23793c48250C5877c0353A22753b2326l0280k2653p9536j33909c70
$$ -97609 123793 -348250 35877 -30353 122753 -22326 -52606 -75259 -154795 -288704 -370
10510a81472H4609b94403h0207a7091A18530m6067b45448A32098b43790a15912
$$ -181472 84609 -294403 -80207 -17091 118530 72463 -245448 132098 -243790 -115912
10499b8951A46098l0140J70863r8324C0347Q2707b57523A45362h500l3780q4443
$$ -28951 146098 115958 286821 188497 30347 113054 -257523 145362 -8500 -42280 -126723
10488a26723A81971d66655A96396a53356C43808j43112R585L05025R9863B30008
$$ -126723 181971 -466655 196396 -153356 343808 200696 210281 515306 615169 230008
10477D38157g7104B49782m8195k7458i6607a0041l13736Q5250E9265b2136B0334
$$ 438157 -77104 249782 201587 174129 -96607 -10041 -323777 -238527 59265 -22136 20334
10465B41225a57659m0404c1906D0007j1219M1435K64166H4526J10145F5504M6200
$$ 241225 -157659 -198063 -31906 40007 28788 70223 334389 84526 194671 65504 111704
10454A11704k7810d0760j6693A69696a53701d3521l82831B33187a8000r1472l87345
$$ 111704 83894 -40760 -57453 169696 -153701 -43521 -426352 233187 -18000 -109472 -496817
10443d96817b5383q0388G9342A5665O528d0669e941n6145p4266A73900a48170
$$ -496817 -25383 -105771 79342 15665 22193 -40669 -5941 -62086 -136352 173900 -148170
10431F1820M4156M4059d60600H0933b35491A37266i8393J5361D7683a90619G9504
$$ 61820 105976 150035 -460600 80933 -235491 137266 -98393 -83032 47683 -190619 79504
10419E5855i824m6269j68787A3214i9165q9424E0199a82893O1032j70859R3154
$$ 55855 -9824 -56093 -224880 13214 -99165 -188589 50199 -182893 -121861 -292720 -199566
10408a99566n1547B99039L9673J5066j38996r9455b27323m5905b8099G9605b54984
$$ -199566 -251113 299039 338712 353778 214782 115327 -227323 -273228 -28099 79605 -254984
10396a79358C47258D3700c6717D36573g266B46620E2391O7537O2638E8971J8412
$$ -179358 347258 43700 -36717 436573 -7266 246620 52391 119928 182566 58971 77383
10385G7383a56760O8269B01904q7095C6564J10285K9886N18191B66946q7001J18185
$$ 77383 -156760 -88491 201904 114809 36564 146849 176735 694926 266946 179945 298130
10374B98130p4196H7186i0821D98562j72979J7784R5417K3407R9819R1208A75337
$$ 298130 223934 87186 -90821 498562 325583 343367 438784 462191 562010 653218 175337
10362D8650J54441K48082A48098C1501L52838b3025B77116p7839J94124r6700
$$ 48650 203091 451173 148098 31501 384339 -23025 277116 199277 393401 296701
10352B96701L3099l172J68808k25590K8233P0045K32296B75526K15507o7468j81539
$$ 296701 329800 326628 495436 269846 298079 368124 600420 275526 491033 423565 242026
10341B42026J86175j07268D5704J41764d8330A78956g2885B60885J07277j27405
$$ 242026 428201 320933 45704 187468 -48330 178956 -72885 260885 368162 240757
10331B40757G0221J61919l0990J48414a84263B32224a01981C08234a26937C01613
$$ 240757 70221 232140 201150 349564 -184263 232224 -101981 308234 -126937 301613
10320e2865a0643l359A91744K4100H507M60317E6808F937O3119a34463j94230
$$ -52865 -10643 -14002 191744 215844 8507 468824 56808 6937 70056 -134463 -328693
10309c28693F3685C0498M8727N415l8767b16514o6488A75983E7178J46200a52330
$$ -328693 63685 30498 79225 84640 45873 -216514 -283002 175983 57178 203378 -152330
10297b20039I0273J84191h5549J7219A3748J86860G4791a09872A8297M5905J61205
$$ -220039 90273 274464 -85549 -68330 13748 200608 74791 -109872 18297 64202 225407
10286B25407a25244A8683a01707I8013a64280A21633e990k76246L0456D5197J5919
$$ 225407 -125244 18683 -101707 98013 -164280 121633 -5990 -282236 -251780 45197 61116
10275F1116R5516c0095k58478J24304e119A49321g4668B9103M288G209a55404
$$ 61116 156632 -30095 -288573 -164269 -5119 149321 -74668 29103 33391 7209 -155404
10263a15931B25696h2144A81059M14911j55088A28714k1740P9589J1753e5766
$$ -115931 225696 -82144 181059 595970 440882 128714 106974 186563 198316 -55766
10252i1649j99535H2947h0308B02444i1394D6457d57725B0915b03715g4472B12418
$$ -91649 -291184 82947 -80308 202444 -91394 46457 -457725 20915 -203715 -74472 212418
10240A12345K4696J86744A17334J69637H70b9864k64557b4391D05526E9406K93541
$$ 112345 137041 323785 117334 286971 870 -29864 -294421 -24391 405526 59406 352947
10229C52947f238k09856R1375A20563b62456A29991a44524A73493q5154a1932
$$ 352947 -6238 -216094 -124719 120563 -262456 129991 -144524 173493 88339 -11932
10218b11687r2262C34963a17450a571k6791j87552J07002A12237a4934j46376
$$ -211687 -303949 334963 -117450 -1571 -28362 -215914 -108912 112237 -14934 -161310
10208a61310F0874a64663k5330c1458a1652m17570B11537F33g5696p1997O7418
$$ -161310 60874 -164663 -189993 -31458 -11652 -429222 211537 633 -75696 -147693 -80275
10197h0275B67266I2354a26256n3434o5528j6337G3394K7141d3075j8653A33917
$$ -80275 267266 92354 -126256 -179690 -245218 -261555 73394 100535 -43075 -61728 133917
10185A20870a73804k5760j15258C9000b12795e6585j73126A00332C7540Q9209
$$ 120870 -173804 -199564 -314822 39000 -212795 -56585 -229711 100332 37540 126749
10175A26749i8145A71148p1887a59775e6971A79872a28389j44017H763a84239
$$ 126749 -98145 171148 99261 -159775 -56971 179872 -128389 -272406 8763 -184239
10164a13362A12366a35823A9176a7748j80181H690e5349k2248j79846m8692A28497
$$ -113362 112366 -135823 19176 -17748 -197929 8690 -55349 -77597 -257443 -306135 128497
10152a80831A22167A2098M9762J53667a3046j77o1996B6014K3453K15484o5417
$$ -180831 122167 12098 61860 215527 -13046 -13223 -75219 26014 49467 264951 199534
10141A99534a00756I2302b21394i2742G7885e2906N289a0548q7318E526a91871
$$ 199534 -100756 92302 -221394 -92742 77885 -52906 -47617 -10548 -97866 5526 -191871
10129a0352j62676j31097A06467J19694H7689K3777b38602g358j25712F5044a23344
$$ -10352 -173028 -304125 106467 226161 87689 111466 -238602 -7358 -133070 65044 -123344
10117B76275H2564h5798A74200a20923b4493A86391F7914b8137n2124A57649J23990
$$ 276275 82564 -85798 174200 -120923 -24493 186391 67914 -28137 -80261 157649 281639
10106B81639a82785k7716C03406c25690a11765f421j6319p3008j9818F5473D172
$$ 281639 -182785 -210501 303406 -325690 -111765 -6421 -22740 -95748 -115566 65473 4172
10094a67848A0362i3601a1897H1962c7623F8933c4918E4049n088M2558c7846A2617
$$ -167848 10362 -93601 -11897 81962 -37623 68933 -34918 54049 48961 91519 -37846 12617
10081G1378d2154A74438m8253J88228A2780a63346L4633A21592c47886h0388b9198
$$ 71378 -42154 174438 126185 314413 12780 -163346 -128713 121592 -347886 -80388 -29198
10069d9984L167H8777b21910A73378h6949q3406A879J02789J59373A153f2025
$$ -49984 -46817 88777 -221910 173378 -86949 -170355 1879 104668 264041 1153 -62025
10057b91619D5722b4288p1177A34787a32486B89553o5193a59265N8698r1216F8942
$$ -291619 45722 -24288 -95465 134787 -132486 289553 224360 -159265 -100567 -191783 68942
10045g3217B96532c42775J62200A33617a33212h19n5244G2852b7676n3339j420
$$ -73217 296532 -342775 -180575 133617 -133212 -819 -56063 72852 -27676 -81015 -82435
10034h2435A2871h7122A67804b77383b1130A76809a19245j33160D6350P1826a32849
$$ -82435 12871 -87122 167804 -277383 -21130 176809 -119245 -252405 46350 118176 -132849
10022c7603k71479r2396c1523k68611K8908e3313k24548a17241k60958A51918
$$ -37603 -309082 -401478 -31523 -300134 -271226 -53313 -277861 -117241 -378199 151918
10011i3243j36686j48674H8915e1335C7453j6528J20651F9154k6929a69674C1157
$$ -93243 -229929 -378603 88915 -51335 37453 20925 141576 69154 42225 -169674 31157
9999a85662c5748A17198a08553b2918A93270q9375a21509j90407A867K3880c18521
$$ -185662 -35748 117198 -108553 -22918 193270 103895 -121509 -311916 1867 25747 -318521
9987d5811l4620C6102M0248a64713e8072C52615e9139j11779G7414e9007j64974
$$ -45811 -80431 36102 76350 -164713 -58072 352615 -59139 -170918 77414 -59007 -223981
9976b23981O1104B20308M2959b63881Q5325j41547B72886d47308a59214j37089
$$ -223981 -162877 220308 263267 -263881 -178556 -320103 272886 -447308 -159214 -296303
9966b96303J5001a5561n29262a65821b583m89666A7560a93823D17073i2355A0391
$$ -296303 -281302 -15561 -544823 -165821 -2583 -492249 17560 -193823 417073 -92355 10391
9954b29940A6597a06849j90303a7329k43543A58168D8400a13926A01813K7679
$$ -229940 16597 -106849 -297152 -17329 -260872 158168 48400 -113926 101813 129492
9944A29492a37647j9464e4546b0604r2300a9002G0145K4788k3725N5109a5768
$$ 129492 -137647 -157111 -54546 -20604 -112904 -19002 70145 94933 71208 126317 -15768
9932B53345M7432a69486j52052J4417O6107C80240b4607j12342e3838l0268D1281
$$ 253345 300777 -169486 -321538 -307121 -241014 380240 -24607 -136949 -53838 -84106 41281
9920c47255c2805A63787G4352c9082E3817a44915j07384b6845B7920g5177A43663
$$ -347255 -32805 163787 74352 -39082 53817 -144915 -252299 -26845 27920 -75177 143663
9908b19480q1870h7923j39157a2219C01541A2137L1330b75828B3484K57582e6478
$$ -219480 -301350 -87923 -227080 -12219 301541 12137 43467 -275828 23484 281066 -56478
9896b82570B0241K8267b34471o8966F9200q492K4999b85534A09018g1876a9127
$$ -282570 20241 48508 -234471 -303437 69200 60708 85707 -285534 109018 -71876 -19127
9884g5997a3990l46230a61114r9925j23800E149d0617A16352a32983G7683i4001
$$ -75997 -13990 -360220 -161114 -261039 -384839 5149 -40617 116352 -132983 77683 -94001
9872B54383B6955d6625A74890b39756L9024n6768A5083a30526B72349a54967N5434
$$ 254383 26955 -46625 174890 -239756 -200732 -257500 15083 -130526 272349 -154967 -99533
9861i9533B7327a65652p6752A82412n4533a46850q903K9772j24191L2282R3627
$$ -99533 27327 -165652 -242404 182412 127879 -146850 -155753 -125981 -250172 -217890 -124263
9850a24263l02360B64525j10421e7951F2917b66273D351a88332E6814b10296c3361
$$ -124263 -426623 264525 154104 -57951 62917 -266273 4351 -188332 56814 -210296 -33361
9838a56137o1638A62908b6103m31644A3195h3345B02524a36197K6363j91115Q2936
$$ -156137 -217775 162908 -26103 -457747 13195 -83345 202524 -136197 -109834 -300949 -218013
9827b18013N884d7063j01196K1309k59A19597E4527J4934g3102k11281A9162O3057
$$ -218013 -212129 -47063 -148259 -126950 -127209 119597 54527 69461 -73102 -284383 19162 82219
9815H2219L6080m5672B7531c98628e2091b3512l28987f7736j19551A1916J11069
$$ 82219 118299 72627 27531 -398628 -52091 -23512 -352499 -67736 -187287 11916 122985
9804A22985a18702K8707j38537e412F0918n495a27223b461A8830b07599d0024
$$ 122985 -118702 -89995 -228532 -5412 60918 55423 -127223 -2461 18830 -207599 -40024
9792G3542a51648G1211h7342G2015b08249A29758a97654D8324h4755l41947b8708
$$ 73542 -151648 71211 -87342 72015 -208249 129758 -197654 48324 -84755 -426702 -28708
9780d548n949B05647a3212E3367a60648e9810k84872J43666A89706a03781j71801
$$ -4548 -10497 205647 -13212 53367 -160648 -59810 -344682 -201016 189706 -103781 -275582
9769b75582e3603j2194j4264B63991a82081I6278h3315K8290a4372j04033A88463
$$ -275582 -53603 -65797 -80061 263991 -182081 96278 -83315 -55025 -14372 -118405 188463
9757G3060B6934c82960J8882A07825a99410k41284b10682B6202a27258E7807P4237
$$ 73060 26934 -382960 -364078 107825 -199410 -440694 -210682 26202 -127258 57807 132044
9746A32044b37637i7281B1255a48221L7074j6952p4401A64420k1025a64109A74081
$$ 132044 -237637 -97281 21255 -148221 -111147 -128099 -202500 164420 143395 -164109 174081
9734h8391d0140A79213l038c58810b3753j1948P503q3062J2555A15257a96254
$$ -88391 -40140 179213 176175 -358810 -23753 -35701 -28198 -111260 -98705 115257 -196254
9722d14019G6490N2386e642q316H8298c27189J57586c1942k0323B3372b14236
$$ -414019 76490 128876 -5642 -13958 88298 -327189 -169603 -31942 -52265 23372 -214236
9710A40554h8109n9244A84046a08717B0106e9710j33737O07F1848d65363a05295
$$ 140554 -88109 -147353 184046 -108717 20106 -59710 -193447 -192840 61848 -465363 -105295
9698b81990J29767M4948A37280c15937H6248B9704i8527I0807c75413l4012A23304
$$ -281990 -152223 -107275 137280 -315937 86248 29704 -98527 90807 -375413 -409425 123304
9686b15593G5896J70554A9838d0475A92023J3301b89570h9261j35045j90638a71269
$$ -215593 75896 246450 19838 -40475 192023 205324 -289570 -89261 -224306 -414944 -171269
9674A61729a809A30412b0251E6018c5150j5681J5827A29883a16636c5976I0884
$$ 161729 -1809 130412 -20251 56018 -35150 -50831 -35004 129883 -116636 -35976 90884
9662a30867J6321j64968N4922P3206O6799F3605f7946A55257K0297a35822K0140
$$ -130867 -114546 -279514 -224592 -151386 -84587 63605 -67946 155257 175554 -135822 -115682
9651a15682N4509l5255I8756b5764k83374A81572d8715A10811a50532m09293A24939
$$ -115682 -61173 -96428 98756 -25764 -309138 181572 -48715 110811 -150532 -559825 124939
9639a79016K2908P017R002A16668e0436k26461N2950J10222j60099J01806E9004
$$ -179016 -156108 -149091 -140089 116668 -50436 -276897 -223947 -113725 -273824 -172018 59004
9627c24998B9355J73214n7193D9052k4047J15486a89247L4805B2285M2799c76963
$$ -324998 29355 202569 145376 49052 25005 140491 -189247 -154442 22285 65084 -376963
9615a71377D0551b5654q0531j4561D8301g930E8654B3806a63374j65636a5730
$$ -171377 40551 -25654 -106185 -120746 48301 -7930 58654 23806 -163374 -329010 -15730
9603a36653A01564c32069a01128G3342A075J59807G5249a58245B53602c7595A51798
$$ -136653 101564 -332069 -101128 73342 1075 160882 75249 -158245 253602 -37595 151798
9591D6975A4103e7793l86283A5182e5669l93197B11996e0492j5107b6000B7149
$$ 46975 14103 -57793 -444076 15182 -55669 -448866 211996 -50492 -65599 -26000 27149
9579I0174b58297a9274G6685Q9668b24720e0795B02045a37952N574C366J43308
$$ 90174 -258297 -19274 76685 166353 -224720 -50795 202045 -137952 -132378 3366 146674
9568A46674b6055G278a33162j69209b857k44005e4237j25242B36706k7752h3256
$$ 146674 -26055 7278 -133162 -302371 -2857 -246862 -54237 -179479 236706 208954 -83256
9556G708a95045B53913d27068b7794D9858a30802D1068c86997d0640m3349r7870
$$ 7708 -195045 253913 -427068 -27794 49858 -130802 41068 -386997 -40640 -83989 -181859
9545a81859f6223a2483k1090j00800b3243j86839C7755L3499K27156d62153F5501
$$ -181859 -66223 -12483 -33573 -134373 -23243 -210082 37755 71254 298410 -462153 65501
9533a49450d6965J440N111a0720A16427n4611f4846M583m0734I7242K42972a64464
$$ -149450 -46965 -45525 -40414 -10720 116427 61816 -64846 -60263 -100997 97242 340214 -164464
9520B91663c29674D3801c29715J55515C00914E3679a90670M0704d8228j37513
$$ 291663 -329674 43801 -329715 -174200 300914 53679 -190670 -149966 -48228 -185741
9510a85741K6166J1010A5675e1074A37198a24659M9327F5025a63763M7039H8285
$$ -185741 -159575 -148565 15675 -51074 137198 -124659 -75332 65025 -163763 -116724 88285
9498C9230a50175e9635j17060d5217F5061J5980b8864C46583j43855A7074a54550
$$ 39230 -150175 -59635 -176695 -45217 65061 81041 -28864 346583 202728 17074 -154550
9486A03563K8401e3524k690k98782g5430j07201a6644j71928h0104D3010O9692
$$ 103563 131964 -53524 -56214 -354996 -75430 -182631 -16644 -188572 -80104 43010 112702
9475A12702a44347H2051H271b77169j83981a23657p1875a5781A86625a07356b6764
$$ 112702 -144347 82051 8271 -277169 -461150 -123657 -195532 -15781 186625 -107356 -26764
9463b29472d346k81347R2930P9074A55343d9502A61964a53554h122k64427p7896
$$ -229472 -4346 -285693 -192763 -113689 155343 -49502 161964 -153554 -8122 -272549 -350445
9452c50445B26449b69490r6097a68133P7650k09895H2368b3795I281e9710b8436
$$ -350445 226449 -269490 -365587 -168133 -90483 -300378 82368 -23795 9281 -59710 -28436
9440i2618A27770n4549K03334C9972a41103c0602d620m73752a8249e812r871p3209
$$ -92618 127770 73221 276555 39972 -141103 -30602 -4620 -478372 -18249 -5812 -15683 -88892
9428h8892A62940l4248h0848L9060A68674F973a97880A35987d50171e1501A41791
$$ -88892 162940 128692 -80848 -41788 168674 6973 -197880 135987 -450171 -51501 141791
9416c2450j19622E3827B702i7624L4000f977j25486a962H2863d1146A08007O26
$$ -32450 -152072 53827 2702 -97624 -63624 -6977 -132463 -1962 82863 -41146 108007 108633
9404A08633a27561k44646p6200A21054h3394c0736D6980K0297f8485B33612C2556
$$ 108633 -127561 -372207 -448407 121054 -83394 -30736 46980 67277 -68485 233612 32556
9392a31653A45849O288a6190k06491A8655K26400f5825j30385A87721i8494l12765
$$ -131653 145849 152137 -16190 -222681 18655 245055 -65825 -196210 187721 -98494 -411259
9381d11259a86216p6861j1526A60617b47142O5604A56043G2865A160a65503b1225
$$ -411259 -186216 -263077 -274603 160617 -247142 -181538 156043 72865 1160 -165503 -21225
9369d4478o3792A74153D8411a52990M7802A02268i0951A66454J6166n9342L8175
$$ -44478 -108270 174153 48411 -152990 -105188 102268 -90951 166454 182620 123278 161453
9358A61453i7702b8095A01742b45469A96183C9253a77966e7223A8918K20497A00344
$$ 161453 -97702 -28095 101742 -245469 196183 39253 -177966 -57223 18918 239415 100344
9346d09j79788B9445b74587E3597b03825l730B7796Q9546a30343k59125D690b6463
$$ -409 -180197 29445 -274587 53597 -203825 -207555 27796 117342 -130343 -389468 4690 -26463
9333B2131a61822B00696b50679r117A32615D3143d5247B3687L6929a40079l6518
$$ 22131 -161822 200696 -250679 -259796 132615 43143 -45247 23687 60616 -140079 -176597
9322a76597k005k5235A68968a57833d9054I2380b43667i7733j93409N9374E5286
$$ -176597 -178602 -203837 168968 -157833 -49054 92380 -243667 -97733 -291142 -231768 55286
9310b7540j95160l5920A23663D6998a4249j83348d3310j04924m9684D3295c52580
$$ -27540 -222700 -258620 123663 46998 -14249 -197597 -43310 -148234 -197918 43295 -352580
9298A60929a32028O5469p0474G7563a9564A21976n2822c22774a41945B18566a67160
$$ 160929 -132028 -66559 -137033 77563 -19564 121976 69154 -322774 -141945 218566 -167160
9286c85982j12189J98995A16875K3416D6000j550J8241b6029A51600k7991b1937
$$ -385982 -498171 -299176 116875 140291 46000 44450 62691 -26029 151600 123609 -21937
9274e82772A49968J83235G7088h9399E4407J11479P4975j10838c36535g0398n5578
$$ -582772 149968 333203 77088 -89399 54407 165886 240861 130023 -336535 -70398 -125976
9263a25976n5239N4464o2001A1531a43544A99386k8423C1946d19284a22234k8835
$$ -125976 -181215 -126751 -188752 11531 -143544 199386 170963 31946 -419284 -122234 -151069
9252a51069b8504n4640n4605j15396f0292F0264a47106p5398H6647J6306a77383
$$ -151069 -28504 -83144 -137749 -253145 -60292 60264 -147106 -222504 86647 102953 -177383
9240b3008k2751n6112M7652k23708b9273C5026a08168M9870A34533b37795E3296
$$ -23008 -45759 -101871 -54219 -277927 -29273 35026 -108168 -58298 134533 -237795 53296
9228b57605R2296A09372a41823P756j04611j9997Q1311I0972c38686a22193C6702
$$ -257605 -165309 109372 -141823 -134067 -238678 -258675 -177364 90972 -338686 -122193 36702
9216C0080h8832j98747E0030F496a45380k785q9862I1661b24992H4240b45416
$$ 30080 -88832 -287579 50030 6496 -145380 -148165 -238027 91661 -224992 84240 -245416
9204C08959d1619A28477b01894j06779J35680B26093a60750B32037p8072c03706
$$ 308959 -41619 128477 -201894 -308673 -172993 226093 -160750 232037 153965 -303706
9193a91776H711i5526A54768a52890E1302K5100a27421C24276d42160G1369c71726
$$ -191776 8711 -95526 154768 -152890 51302 76402 -127421 324276 -442160 71369 -371726
9181B67050a57785F2439A8107a3318B32532c0307k44157A14779C141b62453I8155
$$ 267050 -157785 62439 18107 -13318 232532 -30307 -274464 114779 3141 -262453 98155
9169g1072B5533O0695b0878A46706b44616h9281k1562b2065p1018C00992b26211
$$ -71072 25533 86228 -20878 146706 -244616 -89281 -110843 -22065 -93083 300992 -226211
9157c4257j03428B52065j00895a63228E2919b78573L6241O5072A68548b75278
$$ -34257 -137685 252065 151170 -163228 52919 -278573 -242332 -177260 168548 -275278
9146c50603G3504b74057b4915I1416i1373d4348j7822h522l61659i0946k10426
$$ -350603 73504 -274057 -24915 91416 -91373 -44348 -62170 -8522 -370181 -90946 -301372
9135c01372a01635a04l04697a05885m4394f57l06651I422b6640l32264i6522l0711
$$ -301372 -101635 -104 -304801 -105885 -150279 -657 -307308 9422 -26640 -358904 -96522 -127233
9123a27233K5824A00895k1715b99684d9045C0120d3929H9998J55233o5728b53254
$$ -127233 -101409 100895 79180 -299684 -49045 30120 -43929 89998 245231 179503 -253254
9111H1856a23987A3508d74621B20703H9707P3968a03734K833G6071g0234n0221
$$ 81856 -123987 13508 -474621 220703 89707 163675 -103734 -100901 76071 -70234 -120455
9100a20455K0399H7199J14075g1889A48463a22106j5098B6063P6014m2441p071
$$ -120455 -100056 87199 201274 -71889 148463 -122106 -137204 26063 102077 59636 52565
9089E2565f8463J6939j85051J10928d3493A57981M8575i4542K6553n8412a4260
$$ 52565 -68463 -51524 -236575 -125647 -43493 157981 206556 -94542 -67989 -126401 -14260
9077c14955a00665j4946B31819a20337D7074B2737g5040b5162p6836B78083b68987
$$ -314955 -100665 -115611 231819 -120337 47074 22737 -75040 -25162 -101998 278083 -268987
9065A80531C3894b56799K7781C6109J4771a0805B48868b36531a01114J0571b4405
$$ 180531 33894 -256799 -229018 36109 50880 -10805 248868 -236531 -101114 -90543 -24405
9053A2911a05059k2783k9527P1732P427k67659a07477C6299b1606j50466A05178
$$ 12911 -105059 -127842 -157369 -85637 -78210 -345869 -107477 36299 -21606 -172072 105178
9041G7255b79454i2456l2575H5670A0024J83628a07290B69475B187J61151J7567
$$ 77255 -279454 -92456 -125031 85670 10024 193652 -107290 269475 2187 163338 180905
9030A80905e0221q3695f6225j1517G9979E75c5607B4382a44218a3181n7911m8470
$$ 180905 -50221 -133916 -66225 -77742 79979 575 -35607 24382 -144218 -13181 -71092 -119562
9018a19562G8624d9358G532b90891j21970C9373j2928b64442a2440A45141b08665
$$ -119562 78624 -49358 7532 -290891 -412861 39373 26445 -264442 -12440 145141 -208665
9006f6580E5736j1915a03585A04188b07874A43446c31964J45745f5089k84709
$$ -66580 55736 43821 -103585 104188 -207874 143446 -331964 -186219 -65089 -349798
8996c49798a34318E1242K578a25372E7727P5315J73102A08506b22537J8007g261
$$ -349798 -134318 51242 53820 -125372 57727 133042 306144 108506 -222537 -204530 -7261
8984A34567a14717k87332J93232b4961B82743a21982A78810E6676b05880P686
$$ 134567 -114717 -402049 -208817 -24961 282743 -121982 178810 56676 -205880 -198194
8974a98194D4301J27245K6263B0242g2214I4881b06195O115a6064k12854B94611
$$ -198194 44301 171546 197809 20242 -72214 94881 -206195 -200080 -16064 -228918 294611
8962C14353C96c05579M2847M6536G8929b26523B83465b2638l75962a82968p5619
$$ 314353 396 -305579 -262732 -216196 78929 -226523 283465 -22638 -398600 -182968 -258587
8951b58587A352a20970A72560c96505E584a42591j73643i5593E0649a69660F0279
$$ -258587 1352 -120970 172560 -396505 5584 -142591 -316234 -95593 50649 -169660 60279
8939A04324a46598j08050q5644g2505E2675L15784b06086g8969D9850c4927q8923
$$ 104324 -146598 -254648 -340292 -72505 52675 368459 -206086 -78969 49850 -34927 -123850
8928a23850b1372B75730F6294N23669q50J864528L900180L435140A959490G53015
$$ -123850 -21372 275730 66294 589963 589113 2453641 6353821 9788961 1959490 753015
8917b3694B73900q5316q6277R1302a17048C52611I1285j58m1501K96752d8697
$$ -23694 273900 188584 102307 193609 -117048 352611 91285 91127 49626 346378 -48697
8905A43728a83280F8818a52897A2079c0370C610b33662b6996k6627J250A11312
$$ 143728 -183280 68818 -152897 12079 -30370 3610 -233662 -26996 -53623 -52373 111312
8893B81449a64013L4975Q541I1702a92942B02797J12984J2556b98384a3094A24525
$$ 281449 -164013 -129038 -120497 91702 -192942 202797 315781 328337 -298384 -13094 124525
8881B30524d977q910k76469n7721a72527k8939J2424B12750h0757A5828a48827
$$ 230524 -4977 -13887 -290356 -348077 -172527 -201466 -189042 212750 -80757 15828 -148827
8869B81799A8241P1315e7843l40674c3415H055a31122G7765f7191A18772c43576
$$ 281799 18241 89556 -57843 -398517 -33415 8055 -131122 77765 -67191 118772 -343576
8857a92826A779f88k02859B5780c25869D28060a32525l8137a2983G012N6532J99500
$$ -192826 1779 -688 -203547 25780 -325869 428060 -132525 -170662 -12983 7012 63544 263044
$$ [...]
##END NTUPLES=NMR SPECTRUM
##END=
