
##TITLE=AC1412_PERAH12221_7652973_ZHIX2eC7ob
##JCAMPDX= 6.0         $$ Bruker NMR JCAMP-DX V2.0
##DATA TYPE= nD NMR SPECTRUM
##DATA CLASS= NTUPLES
##NUM DIM= 2
##ORIGIN= BRUKER
##OWNER= Administrator
$$ 1.72 TOPSPIN		Version 2.1
$$ 2013-03-20 03:21:02.690 -0500  Administrator@X
$$ Compression mode = diff/dup
##.OBSERVE FREQUENCY= 400.02188249412
##.OBSERVE NUCLEUS= ^1H
##.ACQUISITION MODE= SIMULTANEOUS (DQD)
##.ACQUISITION SCHEME= NOT PHASE SENSITIVE
##.AVERAGES= 4
##.DIGITISER RES= 22
##SPECTROMETER/DATA SYSTEM= spect
##.PULSE SEQUENCE= jresgppsqf.2
##.SOLVENT NAME= COFFEE_meoh
##.SHIFT REFERENCE= INTERNAL, COFFEE_meoh, 1, 14.96095
##AUDIT TRAIL= $$ (NUMBER, WHEN, WHO, WHERE, PROCESS, VERSION, WHAT)
$$ ##TITLE= Audit trail, TOPSPIN		Version 2.1
$$ ##JCAMPDX= 5.01
$$ ##ORIGIN= Bruker BioSpin GmbH
$$ ##OWNER= Administrator
$$ $$ E:\/data/COFFEE/nmr/AC1412_PERAH12221_7652973_ZHIX2eC7ob/13/pdata/1/auditp.txt
$$ ##AUDIT TRAIL=  $$ (NUMBER, WHEN, WHO, WHERE, PROCESS, VERSION, WHAT)
(   1,<2013-03-20 03:20:53.112 -0500>,<Administrator>,<X>,<go>,<TOPSPIN 2.1>,
      <created by zg
	started at 2013-03-20 03:06:29.923 -0500,
	POWCHK enabled, PULCHK disabled,
       configuration hash MD5:
       86 BA 57 50 F2 9D 5C 9B 26 00 A9 28 5F 66 2E 89
       data hash MD5: 8K * 40
       8C 26 7F 48 99 0D E8 32 18 32 D6 08 EE 7C 12 D7>)
(   2,<2013-03-20 03:20:57.565 -0500>,<Administrator>,<X>,<proc2d>,<TOPSPIN 2.1>,
      <Start of raw data processing
       xfb same F2: SI = 16K WDW = 3 SSB = 0 FT_mod = 6 PKNL = 1 F1: SI = 512 WDW = 3 SSB = 0 FT_mod = 6 PH_mod = 2
       data hash MD5: 16K * 512
       C3 66 57 9F C3 70 F1 3E 2D BE 4F 7C 2E BA F1 19>)
(   3,<2013-03-20 03:20:58.550 -0500>,<Administrator>,<X>,<proc2d>,<TOPSPIN 2.1>,
      <abs2 F2: ABSG = 5 ABSF1 = 10.00084 ABSF2 = 0.0003050352
       data hash MD5: 16K * 512
       6F 40 AC 45 BE F8 A2 E3 3F D3 46 DE FB A2 12 3E>)
(   4,<2013-03-20 03:20:59.269 -0500>,<Administrator>,<X>,<proc2d>,<TOPSPIN 2.1>,
      <tilt
       data hash MD5: 16K * 512
       C2 D6 10 BB AC 87 94 CA 93 72 7E 8A 14 48 45 C9>)
(   5,<2013-03-20 03:21:01.097 -0500>,<Administrator>,<X>,<proc2d>,<TOPSPIN 2.1>,
      <abs1 F1: ABSG = 5 ABSF1 = 0.06497851 ABSF2 = -0.06497862
       data hash MD5: 16K * 512
       7C 1F 4A FE C2 24 8A EC F0 06 50 7A 02 66 88 F9>)
(   6,<2013-03-20 03:21:02.315 -0500>,<Administrator>,<X>,<proc2d>,<TOPSPIN 2.1>,
      <symj
       data hash MD5: 16K * 512
       9A EF 36 A8 FB E5 05 7E 3C 38 25 EE D8 14 A8 AA>)
$$ ##END=
$$ 
$$ $$ hash MD5
$$ $$ 1F 00 7C 56 2D B0 EA A9 AF 4D ED FE 09 13 D4 13
##$RELAX= 
##$RELAX= 
##$RELAX= 
##$RELAX= 
##$RELAX= 
##$RELAX= 
##$RELAX= 
$$ Bruker specific parameters
$$ --------------------------
##$DU= <E:\>
##$EXPNO= 13
##$NAME= <AC1412_PERAH12221_7652973_ZHIX2eC7ob>
##$PROCNO= 1
##$TYPE= <nmr>
##$USER= <COFFEE>
##$ACQT0= 1000000
##$AMP= (0..31)
100 100 100 100 100 100 100 100 100 100 100 100 100 100 100 100 100 100
$$ [...]
##$TD0= 1
##$TE= 300
##$TE2= 300
##$TE3= 300
##$TEG= 300
##$TL= (0..7)
0 120 120 120 120 120 120 120
##$TP= (0..7)
150 150 150 150 150 150 150 150
##$TP07= 0
##$TPNAME0= <>
##$TPNAME1= <>
##$TPNAME2= <>
##$TPNAME3= <>
##$TPNAME4= <>
##$TPNAME5= <>
##$TPNAME6= <>
##$TPNAME7= <>
##$TPOAL= (0..7)
0.5 0.5 0.5 0.5 0.5 0.5 0.5 0.5
##$TPOFFS= (0..7)
0 0 0 0 0 0 0 0
##$TUNHIN= 0
##$TUNHOUT= 0
##$TUNXOUT= 0
##$USERA1= <user>
##$USERA2= <user>
##$USERA3= <user>
##$USERA4= <user>
##$USERA5= <user>
##$V9= 5
##$VALIST= <valist>
##$VCLIST= <CCCCCCCCCCCCCCC>
##$VD= 0
##$VDLIST= <DDDDDDDDDDDDDDD>
##$VPLIST= <PPPPPPPPPPPPPPP>
##$VTLIST= <TTTTTTTTTTTTTTT>
##$WBST= 2048
##$WBSW= 25
##$XGAIN= (0..3)
0 0 0 0
##$XL= 0
##$YL= 0
##$YMAX_a= 61859
##$YMIN_a= -126789
##$ZGOPTNS= <>
##$ZL1= 120
##$ZL2= 120
##$ZL3= 120
##$ZL4= 120
##$ABSF1= 0.06497851
##$ABSF2= -0.06497862
##$ABSG= 5
##$ABSL= 0
##$ALPHA= 0
##$AQORDER= 0
##$ASSFAC= 0
##$ASSFACI= 0
##$ASSFACX= 0
##$ASSWID= 0
##$AUNMP= <>
##$AXLEFT= 0
##$AXNAME= <F1>
##$AXNUC= <1H>
##$AXRIGHT= 0
##$AXTYPE= 0
##$AXUNIT= <>
##$AZFE= 0.1
##$AZFW= 0.5
##$BCFW= 0
##$BC_mod= 0
##$BYTORDP= 0
##$COROFFS= 0
##$CY= 15
##$DATMOD= 1
##$DC= 0
##$DFILT= <>
##$DTYPP= 0
##$F1P= 0
##$F2P= 0
##$FCOR= 0.5
##$FTSIZE= 512
##$FT_mod= 6
##$GAMMA= 0
##$GB= 0
##$INTBC= 1
##$INTSCL= 1
##$ISEN= 128
##$LB= 0
##$LEV0= 0
##$LPBIN= 0
##$MAXI= 10000
##$MC2= 0
##$MEAN= 0
##$ME_mod= 0
##$MI= 1
##$NCOEF= 0
##$NC_proc= -5
##$NLEV= 6
##$NOISF1= 0
##$NOISF2= 0
##$NSP= 0
##$NTH_PI= 0
##$NZP= 0
##$OFFSET= 0.06497851
##$PC= 4
##$PHC0= 0
##$PHC1= 0
##$PH_mod= 2
##$PKNL= no
##$PPARMOD= 1
##$PPDIAG= 0
##$PPIPTYP= 0
##$PPMPNUM= 2147483647
##$PPRESOL= 1
##$PSCAL= 1
##$PSIGN= 0
##$PYNMP= <proc.py>
##$REVERSE= no
##$SF= 400.021882494141
##$SI= 512
##$SIGF1= 0.06497851
##$SIGF2= -0.06497862
##$SINO= 16
##$SIOLD= 512
##$SPECTYP= <>
##$SREGLST= <1H.MeOD>
##$SSB= 0
##$STSI= 512
##$STSR= 0
##$SW_p= 51.9856959427865
##$SYMM= 3
##$S_DEV= 2617
##$TDeff= 40
##$TDoff= 0
##$TI= <>
##$TILT= yes
##$TM1= 0
##$TM2= 0
##$TOPLEV= 0
##$USERP1= <user>
##$USERP2= <user>
##$USERP3= <user>
##$USERP4= <user>
##$USERP5= <user>
##$WDW= 3
##$XDIM= 16
##$YMAX_p= 291190547
##$YMIN_p= 0
$$ End of Bruker specific parameters
$$ ---------------------------------
##NTUPLES= nD NMR SPECTRUM
##VAR_NAME=  FREQUENCY1,    FREQUENCY2,      SPECTRUM
##SYMBOL=    F1,            F2,              Y
##.NUCLEUS=  1H,            1H
##VAR_TYPE=  INDEPENDENT,   INDEPENDENT,     DEPENDENT
##VAR_FORM=  AFFN,          AFFN,            ASDF
##VAR_DIM=   512,           16384,           16384
##UNITS=     HZ,            HZ,              ARBITRARY UNITS
##FACTOR=    0.101534562388255, 0.501933850740131, 1
##FIRST=     25.9928259484165, 8223.18227667557, -929
##LAST=      -25.8913354319817, 0,           -374
##MIN=       -25.8913354319817, 0,           0
##MAX=       25.9928259484165, 8223.18227667557, 291190547
##PAGE= F1=25.99282594842
##FIRST=     25.9928259484165, 8223.18227667557, -929
##DATA TABLE= (F2++(Y..Y)), PROFILE
$$ [...]
##PAGE= F1=-2.202297678447e-005
##FIRST=     25.9928259484165, 8223.18227667557, 3196
##DATA TABLE= (F2++(Y..Y)), PROFILE
15113A524Q16l57m54C3b261O39A572L239K211N12j483k735C74b406D84K710J906
15096E100O73o00j775A333b57j6G84J566J136K30n06j366C19i72p28M58a11A009
15077A761K17n23E40f02p78k86M26K02K47m65o50m43j45M1Q4K03N64e86F9K16
15057B85a26p97j031k48j92K46L44M19d87D80N37j5A31a435j752L59i95E76L48
15038I24E1a919O44A547K486J058n91j477j305F95b89j708k029J93h14A093Q92
15021A985J6r26j80M66Q5n92h48k153j664L92Q44o05J465C16L321L110K136Q48
15003I731n68k203l042F76b090k022J586d68A266J329J142J475J143P73K69j91
14987G206j129j688k121D22e41q0J55D4O66P22L76N23r9q46c67j613q7g13E08
$$ plain form
15113 1524 2340 1983 1529 33 -2261 -1622 1572 4811 7022 7534 6051 3316 374 -2406 484 3194 5100
15096 5100 5773 5173 3398 1333 -257 -273 784 2350 3486 3716 3210 1844 319 -972 -1700 -1242 -111 1009
15077 1761 1978 1455 540 -602 -1380 -1666 -1240 -1038 -791 -1256 -1906 -2349 -2494 -2453 -2369 -2166 -1602 -586 69 285
15057 285 -126 -923 -1954 -2202 -2394 -2148 -1804 -1385 -487 480 1017 1002 131 -1435 -3187 -2828 -995 576 924
15038 924 51 -1919 -1275 1547 4033 5091 4500 3023 1718 695 -289 -1997 -4026 -3833 -814 1093 1985
15021 1985 2001 1075 895 1361 1446 854 -848 -3001 -4665 -4273 -3429 -4034 -2569 316 3637 6747 8883 9731
15003 9731 9163 6960 3918 676 -2090 -4112 -2526 -468 1266 2595 3737 5212 6355 7128 7397 7206
14987 7206 6077 4389 2268 422 -541 -621 -466 44 710 1432 1808 2331 2232 1386 -367 -1980 -2067 -713 508
14967I87A97a771j641j62a761c20E93K76R2P11J175J321O54l32j220A437d71j608
14949b079r52P36R55D9J522J630J337J082N09j56j467k022A32b193j096J15l5
14932c209O27a180E79J765J949J402P23J84n50j138j385j486F27d28q93q29l42
14915b492J93N94P28M02m93l19K31gA090P98L62l72F60a419p69c08H36M56m41
14896H51b83j487j109j45J48J94O36h98E18J491Q92L62k64j039F17k14O81O70
14878A754l36B67a630j753J383a14A795J345K33m91p31r52A22a270j211j248q68
14861d597R14J792a17A547J132L96l82q12r39A43b87e9o6q92j585k036R07a054
14842A763K999J870L42j137k062A635D86L98J052L44I56i40n15H79L147K632J756
$$ plain form
14967 987 197 -1771 -3412 -3574 -1761 -320 593 869 961 1672 2847 4168 4822 4490 3270 1437 -471 -2079
14949 -2079 -3031 -2295 -1340 49 1571 3201 4538 5620 6129 5973 4506 2484 132 -2193 -3289 -3174 -3209
14932 -3209 -2582 -1180 579 2344 4293 5695 6418 6602 6052 4914 3529 2043 627 -428 -1321 -2150 -2492
14915 -2492 -2299 -1705 -977 -575 -1068 -1387 -1156 -7 1090 1888 2250 1878 660 -1419 -2188 -308 836 1292 851
14896 851 -283 -1770 -2879 -3024 -2876 -2682 -2046 -898 518 2009 2901 3263 2999 1960 617 403 1084 1754
14878 1754 1418 267 -1630 -3383 -2000 -114 1795 3140 3373 2882 2151 1199 122 -1270 -2481 -3729 -4597
14861 -4597 -3683 -1891 -117 1547 2679 3075 2693 1881 942 143 -287 -59 -125 -1017 -2602 -4638 -3731 -1054
14842 1763 4762 6632 6974 5837 3775 1635 486 884 1936 2280 956 -940 -1455 879 4026 6658 8414
14825H414k79j570j935j370j307F70c04K0A16O1a90j025k061a159A223J135r2
14808B266F96a076a49B623K220J117p47k018C37b530i16B72L49N5L51j14D4f69
14789a930M00H21L030K462P40k34j565j457j617G41b8j91b1C49J91B63c35r04
14771a239j132p47O3L76L18J32o02o93m80l7O83P16J039d88G78Q05L29l6j32m05
14751A339F50g31j093o28N83b96I92R28O50l80j022a76q98A74J471K86n88A57
14732a073l97N42b65g7D6L3J10c85q67j14M95EQ29M70n0j85C66d7p46j026r12
14711b731m51J25J63P3M83O71P71J43k65q69j255q60J083a266B43N48l18b93o07
14692i00l83Q1L01M26J58k24k15l15j007kP60d54A76m6b37k59g7E24J137J578
$$ plain form
14825 8414 8135 6565 4630 3260 1953 670 -304 -284 116 177 -190 -1215 -3276 -1159 1223 2358 2266
14808 2266 696 -1076 -149 2623 4843 5960 5213 3195 337 -2530 -916 272 621 676 1027 913 44 -669
14789 -1930 -1530 821 3851 6313 7053 6819 5254 3797 2180 741 -28 -219 -21 349 540 263 -335 -1239
14771 -1239 -2371 -3118 -3055 -2679 -2361 -2229 -2831 -3524 -4004 -4041 -3358 -2642 -1603 -488 778 1583 1912 1876 1744 1339
14751 1339 650 -731 -1824 -2452 -1869 -296 992 1920 2570 2190 1168 -176 -1074 174 1645 1931 1343 157
14732 -1073 -1470 -928 -265 -77 46 79 189 -385 -1252 -1366 -871 5 834 1304 1254 1069 366 -47 -793 -1819 -2731
14711 -2731 -3182 -3057 -2894 -2821 -2338 -1667 -896 -753 -1018 -1887 -3142 -4002 -2919 -1266 243 791 473 -293 -900
14692 -900 -1283 -1202 -901 -475 -317 -541 -756 -1071 -2078 -2080 -1320 -454 176 130 -237 -496 -77 524 1661 3239
14672C239J169O55l28j084A817f8k106k127J126J018R33d44D08J053R39pk05O5
14654B253r33i1r53k97K96m9l1q1n16o04q57m34P69a302A97J209R80Q16R85R54
14634E141J053O33j05j356k387D15h43l24k28p81O06A91J616J138k96p86H17d80
14615a531n72l47m60j60L03L34L45M63N67K93p6k11M89K12a73l1j46l66j7l6K27
14594e42a14j63m98k39M82K29N4A88N4Oc10r21n19h04A26N10N17N90j40k40m90
14573H73k36k91B3a76p0A10N67O86k5C69i50j123n92m4M64h78A095K095J559Q97
14553E646n22j822E60a668g33A203J091m85E39a772j074N42J99p71j335l45O31
14536c925J59J61R87a243a36C71A30J8J60N02J48B45a076j176M16R11L62j039
$$ plain form
14672 3239 4408 5063 4735 3651 1817 -68 -2174 -4301 -3175 -2157 -1224 -444 408 1461 2400 2393 2188 2253
14654 2253 1320 -91 -1044 -1341 -1045 -1094 -1125 -1206 -1722 -2326 -3183 -3617 -2848 -1302 197 1406 2386 3202 4187 5141
14634 5141 6194 6827 6722 5366 2979 415 -843 -1167 -1395 -2176 -1570 191 1807 2945 2649 1863 817 -480
14615 -1531 -2103 -2450 -2910 -3070 -2767 -2433 -2088 -1625 -1058 -765 -841 -1052 -563 -351 -173 -204 -350 -716 -733 -769 -542
14594 -542 -114 -277 -775 -1014 -532 -303 -249 188 242 248 -310 -1231 -1750 -804 126 636 1153 1743 1603 1363 873
14573 873 637 346 23 -176 -246 110 677 1363 1338 369 -950 -2073 -2665 -2709 -2245 -878 1095 3190 4749 5646
14553 5646 5124 3302 560 -1668 -733 1203 2294 1809 539 -1772 -2846 -2304 -2105 -2876 -4211 -4556 -3925
14536 -3925 -3766 -3605 -2618 -1243 -136 371 130 148 308 810 958 245 -1076 -2252 -1836 -925 -563 -1602
14518a602k014k781K204a471C16P51j74N9m9m38g95n67l72j27J91L83e7B82b77
14498a037j710l02a066F52J124N60l0J1N7N3l81p82A36g94k87J17l4k71m25o20
14478b314q80l97J84N36P09O79M74M52a49d9J0j175o64m93O88c44I29R07K09q63
14458A182B27a16F50L51m10a65q86l16K20J2m06l19j60n81q71j408O93J823d18
14438A569J036M81n44p73m75K27O79R12m37j328e2k110j392M24P82a167A51J081
14420A232L1m09A89c76o99K13A84J412J366O78l09j325f6k446q52J627b90F45
14401G44a07j518j088Q14E65J660j89G22f53j460q25N84P83j15K55L4J89K76k62
14382a194j3M99D91J803J917J680R63M5j283k202G39a975k647n31J596J054M11
$$ plain form
14518 -1602 -3616 -6397 -4193 -1471 316 1067 893 952 903 465 -795 -1362 -1734 -1861 -1670 -1287 -57 282 -277
14498 -1037 -2747 -3049 -1066 652 1776 2336 2306 2317 2374 2427 2046 1264 136 -794 -1081 -964 -998 -1269 -1694 -2314
14478 -2314 -3194 -3591 -3407 -2871 -2162 -1483 -1009 -557 -149 -49 -39 -1214 -1878 -2371 -1683 -344 929 1836 2045 1182
14458 1182 227 -116 650 1001 591 -165 -1051 -1367 -1147 -1135 -1541 -1860 -2020 -2601 -3472 -4880 -4187 -2364 -418
14438 1569 2605 3086 2542 1769 1294 1521 2200 3112 2675 1347 -52 -2162 -3554 -3130 -2348 -1167 151 1232
14420 1232 1263 854 189 -376 -1075 -862 184 1596 2962 3640 3331 2006 -66 -2512 -3364 -1737 -290 645
14401 744 -107 -1625 -2713 -1899 565 2225 2036 722 -653 -2113 -2938 -2354 -1571 -1686 -1431 -1397 -1208 -932 -1194
14382 -1194 -1207 -708 491 2294 4211 5891 6854 6899 5616 3414 739 -1975 -4622 -5153 -3557 -2503 -2092
14365b092l94p32m69r3M49P93M45l53j068j809Q14R73P86j98n45a709A215K767
14347C982K471J701O02p45j775k431H69a830k83P93k78k83N94d09B43m3c88j123
14329a511r72L3k07l0N50f86A652J976J920J187J80j011j808j713A166E72B9a012
14310b288p11j823r78R85R75P89M50o8n39m01L48J017R26K71l71l85Q65C13Q18
14291A131P0C89a679j904j440J816i94B52O49l87a023k032j982j85J612J456g22
14273d02n2l66J27J05M2j59K0q2K28a21D36J84b18j742k322J934c69A022J092
14254B114J36n42E44i44p94p90L25j41K78J59M11J97K33J2n12n11l90k86k6K15
14234b564M83L40o11j358Ja520D50J228J80H41h38q77C32K121J451Q84k61r45
$$ plain form
14365 -2092 -2486 -3218 -3687 -3780 -3331 -2538 -2093 -2446 -3514 -5323 -4509 -3536 -2750 -2948 -3493 -1709 1215 3982
14347 3982 6453 8154 8756 8011 6236 3805 869 -1830 -2113 -1320 -1598 -1881 -1287 -409 243 200 -388 -1511
14329 -1511 -2483 -2450 -2657 -2687 -2137 -686 1652 3628 5548 6735 6915 5904 4096 2383 1166 572 29 -1012
14310 -2288 -2999 -4822 -5800 -4815 -3840 -3051 -2601 -2669 -3208 -3609 -3261 -2244 -1318 -1047 -1418 -1803 -938 313 1131
14291 1131 1201 389 -1679 -3583 -5023 -3207 -994 252 901 514 -1023 -3055 -5037 -5222 -3610 -2154 -722
14273 -402 -454 -820 -693 -588 -546 -705 -685 -767 -539 -121 436 620 -218 -1960 -4282 -2348 -369 1022 2114
14254 2114 2250 1708 544 -944 -1738 -2528 -2203 -2344 -2066 -1907 -1496 -1299 -1066 -1054 -1566 -2077 -2467 -2753 -2779 -2564
14234 -2564 -2081 -1741 -2352 -3710 -3709 -1520 450 1678 1858 841 -838 -1715 332 2453 3904 4788 4527 3582
14216C582r87q84q09g5j389j488R07G9J574J033p9p78p20k18N15M02l71F57i38
14196b683h03D46L40k0j84q9M38L63p6n58g60j591a006A600K031Q31m53j451E80
14176i12m23J52l98n61M26a20A539J471J379O45l59k23q4K88M38L13m42j059r41
14157B965j002b57k503j716P76J18j59M7K13M82Q85a026D66J205L88r20A26a165
14138b372n89K51J155C30J638J334J439J048L36p30j427j304n98K48O20N98o65
14121B867j342h0j694p57J84J39j18N46h14C23J133Q18K49n16r02b7o88m61N22
14102f54G98J324P46M41lp74r45p02D12J04M06J79m39I6b41R2I93R16P21M25j64
14081B891j280A21a484r41O3N09L38M04N39B89J292R80N45q15A125C81h41j392
$$ plain form
14216 3582 2595 1711 902 -75 -1464 -2952 -2045 79 1653 2686 2607 1829 1109 891 1406 1808 1437 657 -938
14196 -2683 -803 446 786 766 582 493 931 1294 1218 660 -760 -2351 -1006 1600 3631 4462 4009 2558 580
14176 -912 -1335 -1183 -1581 -2142 -1716 -120 1539 3010 4389 5034 4675 4452 4368 4656 5094 5407 4965 3906 2965
14157 2965 1963 -257 -2760 -4476 -3700 -3582 -3741 -3694 -3481 -2999 -2114 -1026 466 1671 2059 1139 126 -1165
14138 -2372 -2961 -2710 -1555 330 1968 3302 4741 5789 6125 5395 3968 2664 2066 2314 2934 3532 2867
14121 2867 1525 -80 -1774 -2531 -2347 -2208 -2326 -1780 -814 323 1456 2274 2523 2007 1105 -27 -715 -1176 -654
14102 -654 798 2122 2868 3309 3306 2532 1587 885 412 516 922 1101 662 96 -241 -149 993 1909 2630 3055 2891
14081 2891 1611 121 -1484 -2425 -2362 -1853 -1515 -1111 -572 289 1581 2561 3106 2291 1125 381 -841 -2233
14063b233j71Q52P17b21C40M80J49j75C87b87o91p41j065r79K09P01J222f92C
14043C33a18o45J21C78J431J075M95n30j287d50j473q9P96L99k46r24L81A45J421
14024A566R75kr70c04k161N46A257K993K058Q03k0j082j808A978g38j845d52A588
14005C504K020J610N53l26j212j485p79q96r55G56c99l36k3m16o47l92J02a016
13986A284K211J531J76j563A171a938p83e16A617P11o55A97a132j288p15R96O56
13969a483j60M6f59E88J385M23l54E09a630j865l55N58N1p84q51o3J828g21A530
13949C009M95r26A016b33p46k96l12k84ON64c75C64K06j82b92j518j768k26J313
13930b491J198e95E8L98k0j72b41l58l09c79E14Q30K99p57f47j912L37f77C81
$$ plain form
14063 -2233 -2404 -1552 -835 -221 340 820 969 794 387 -287 -978 -1719 -2784 -3763 -3554 -2853 -1631 -692 3
14043 333 -118 -763 -642 378 1809 2884 3379 2849 1562 -450 -1923 -2012 -1216 -817 -1063 -1987 -1606 145 1566
14024 1566 2541 2539 1569 -304 -2465 -1919 1257 4250 6308 7111 7091 6009 4201 1978 -738 -2583 -452 1588
14005 3504 5524 7134 7687 7361 6149 4664 3885 2989 2034 756 -399 -735 -758 -1174 -1821 -2213 -2111 -1016
13986 1284 3495 5026 5202 3639 1171 -1938 -2721 -516 1617 2328 1673 197 -1132 -2420 -3135 -2139 -1483
13969 -1483 -1643 -1597 -659 588 1973 2396 2042 509 -1630 -3495 -3850 -3292 -3241 -4025 -4876 -4939 -3111 -721 1530
13949 3009 3504 2578 1016 -233 -979 -1275 -1587 -1871 -1865 -1301 -375 364 570 388 -292 -1810 -3578 -3804 -2491
13930 -2491 -1293 -595 58 456 436 264 -241 -599 -908 -379 514 1344 1643 886 -647 -2559 -2222 -677 381
13910G24k68I3a85k39n36j32j83j36R4J10N2e75D72J283J300J196J085N4r72j954
13890B464A05b389P9a26A557J201Q3q16F17a296k069J461b81A554J490J287J450
13873E781R31o41k388I78e59D82J143O54K14l83q11D04d40o30J94C59J240P21
13855B320k97I10a042k845j644R82K092h97L54m57p36J29P07a64B68L15L4O04
13837A221P94J415J373R77L87k09q61j908C78b642K02d80H19J39a00q13B68J712
13819A980J209O14k82p84j100A92a235m24a61A853J673J899J095L42n08m73o80
13802E201j424A878e40k390N59J049e73k23q90L02B13J493L94m95f5k642k95B12
13783C087K684J481l40j766k098q39l24M10k3n28p53B21c26o85p62p18P42J60
$$ plain form
13910 724 456 93 -185 -424 -960 -1092 -1275 -1411 -1317 -1207 -1155 -575 472 1755 3055 4251 5336 5390 4418 2464
13890 2464 105 -2389 -2310 -126 1557 2758 2841 2025 617 -1296 -3365 -1904 -281 1554 3044 4331 5781
13873 5781 6712 6071 3683 978 -559 482 1625 2279 2493 2110 1299 404 -440 -1070 -876 359 1599 2320
13855 2320 2023 910 -1042 -3887 -5531 -4549 -2457 -897 -543 -1000 -1736 -1607 -900 -164 268 583 617 1221
13837 1221 2015 3430 4803 5780 6167 5958 5097 3189 378 -2642 -2440 -480 819 958 -100 -913 268 1980
13819 1980 3189 3803 3521 2737 1637 192 -1235 -1659 -161 1853 3526 5425 6520 6862 6354 5881 5201
13802 5201 3777 1878 -540 -2930 -2371 -1322 -573 -796 -1686 -1384 213 1706 2100 1605 -65 -2707 -3002 212
13783 3087 5771 7252 6912 5146 3048 2209 1885 2295 2272 1744 991 221 -326 -1011 -1773 -2491 -1749 -1589
13765a589J04p21q86j347J142J431e39D77P34N08L87K35k95m01j87P19J648J912
13747E737J282N44l71q77j678j623j281n35n1J37Rk79J02N6M83K04m89l87l10
13728F73c4q81j030j006k93p2J39P69a186b96do94j419j895j557M44L97M7O26
13709d055J200J132K06m88j26P46N20M9k84l36o79l99R2i91A061J964J634K59
13691D918j344A238a126k090n55N09L17R33c3A238L05G53A00K61Q13J022L77n57
13673B016I98m53J90L76j84m02b43p67m15M55d01a89o4o94q19q57m16L65J151
13654a523G0J016O50k11G03g9r41o56m05m44n05O52a041A43P72K90l25B7a268
13634b778j33K49j50l85j67Q83J014e81i2n25j610o11O37a076N31l88k67J46M23
$$ plain form
13765 -1589 -1485 -2206 -3092 -4439 -3297 -1866 -539 477 1211 1719 2106 2341 2046 1645 1458 2177 3825 5737
13747 5737 7019 7563 7192 6315 4637 3014 1733 1198 1147 1284 1293 1014 1116 1172 1655 1859 1370 983 673
13728 673 -34 -915 -1945 -2951 -3244 -3316 -3177 -2408 -1186 -296 -4 -698 -2117 -4012 -5569 -5125 -4728 -4681 -4055
13709 -4055 -2855 -1723 -1517 -2005 -2131 -1385 -865 -816 -1100 -1436 -2115 -2514 -2422 -991 1061 3025 4659 4918
13691 4918 3574 1238 -1126 -3216 -3771 -3262 -2945 -2012 -33 1238 1543 753 100 361 1174 2196 2573 2016
13673 2016 998 545 735 1111 927 525 -243 -1010 -1425 -970 -401 -189 -253 -947 -1766 -2623 -3039 -2674 -1523
13654 -1523 70 1086 1736 1525 703 -79 -1020 -1676 -2081 -2525 -3030 -2378 -1041 143 915 1205 880 27 -1268
13634 -2778 -2911 -2662 -2812 -3197 -3364 -2481 -1467 -581 -92 -617 -2227 -2838 -2201 -1076 -545 -933 -1200 -1054 -631
13615f31K04n62n24l06P4e39B90M31L20n17b49j093l12j32o7l80l24k86m10k20
13595c473l81J34J047a046H08J472J361Q02K81q0K11q0k33n88j135I42a093o25
13577a718d96A349J267O30l72o75A088F5e13q72q17J40i89D32J589J095O56Mn03
13558C273j207B80a870Q5D99J456L61q67a75r96e37H74J814J384M92m30j282A276
13539A37i18m49M84G13J399O55l68I11a240j869L25i38C99M70K4k19A96h7j581
13520a668j879m49R74a086C36Q16K55l03C38d22J02D29M16j45C20B2b53k34J11
13501c76B03J17A18a064j587j266J355a198d57J32k53j73K82m98m95p5L70N27
13483f40a36B13N32L19L40k1J38l54l84l21d04P6l31m08p85m70P57c10D57M00
$$ plain form
13615 -631 -427 -989 -1513 -1819 -1745 -539 290 721 1041 524 -249 -1342 -1654 -1786 -1853 -2233 -2557 -2843 -3253 -3473
13595 -3473 -3854 -3720 -2673 -1046 808 2280 3641 4443 4724 4644 4855 4775 4542 3954 2819 942 -1093 -1718
13577 -1718 -496 1349 2616 3246 2874 2199 1088 65 -513 -1385 -2202 -2062 -989 432 2021 3116 3772 3776 3273
13558 3273 2066 280 -1870 -1785 499 1955 2316 1449 -175 -1171 -537 874 2688 4072 4564 4134 2852 1276
13539 137 -918 -1367 -883 713 2112 2767 2399 911 -1240 -3109 -2784 -938 399 869 893 674 196 -87 -1668
13520 -1668 -3547 -3996 -3022 -1086 336 1152 1407 1104 338 -422 -320 429 845 700 320 22 -253 -487 -376
13501 -376 203 320 118 -1064 -2651 -3917 -2562 -1198 -457 -325 -578 -751 -469 -967 -1462 -1537 -1167 -640
13483 -640 -136 213 745 1064 1404 1383 1521 1167 783 462 -404 -328 -659 -1067 -1852 -2322 -1565 -310 457 857
13463H57k31h1o82j10@A031R25N00J77K44L3j77k08p42B87a715m46g99B39M31
13443F70j13g5j215j267q66a691b84G67N97M07j21o18b70l69A966K839K500J502
13425H807p6j681l027E38b828j781L08N0K49J398e82B16K57j6a18n16k32l42n79
13406a787k75N36f91A40M20k68d75p31m62g91R4l18q15j034j174Q97Q47K32l25
13387b387k13K24a122F3P84J94k37B19g14q38m40n14o55j373k02J338J485h39
13368c74k29m22J41b17D27Q21k28D53c21o95l55m4L27J71k78k38r03j98J140D42
13347B441J311J129j8n58p44q39q32o16j99n31B50r1d02o27n22j84r9n67p72o90
13327c863j31J313J039O00a27H34P40L17J55J04j06n05o45l26K15O71P04J46j081
$$ plain form
13463 857 626 -81 -763 -873 0 1031 1956 2456 2633 2877 2910 2733 2525 1783 287 -1715 -2161 -799 239 670
13443 670 557 -75 -1290 -2557 -3423 -1691 -284 767 1364 1771 1650 1032 -270 -639 1966 4805 7305 8807
13425 8807 8731 7050 4023 538 -2828 -4609 -4301 -4251 -4002 -2604 -582 216 473 457 -118 -634 -866 -1208 -1787
13406 -1787 -2062 -1526 -691 140 560 292 -475 -1206 -1668 -791 -697 -1015 -1830 -2864 -4038 -3141 -2294 -2062 -2387
13387 -2387 -2600 -2376 -1122 63 847 1041 804 219 -714 -1552 -1992 -2506 -3161 -4534 -4736 -3398 -1913 -839
13368 -374 -603 -1025 -884 -217 427 1248 1020 453 -321 -1016 -1371 -1415 -1088 -917 -1195 -1433 -2336 -2534 -1394 442
13347 2441 3752 4881 4863 4305 3561 2722 1890 1274 1075 544 250 159 -402 -1029 -1551 -1735 -1834 -2401 -3173 -3863
13327 -3863 -3994 -2681 -1642 -1042 -127 834 1574 1891 2046 2150 2044 1539 894 568 783 1454 2158 2304 1223
13308A223g56k025k113N50J496R65h89E08J117P45p8l32p84c61j395k96C44K165
13290B509J607K086R98l9j179k183H74a903k311n26M56p63J262a861D5J876R21
13273B842L52m95p98r30a1m73k02L04l41n02j028r27o04O65J307f39B14N38j53
13254E99I0c22m41m81l32j11m51j256j395J925d8B962K215N17j361j794I01b22
13235h16n86r08q56O81L23L40j00k77m27j180p14J444a103D17Q25j3j20Ba453
13215c271l37R10J223g23B30K56N5A89d67r91m93j57o19m41Q71a138c47G52J289
13196B041O59n11A65b383q53a094A592K457J698L19j745B089A40A5J381J643J218
13179D257J442Q94k02j026j956A650C88e3j49n69j203j282p90M27Q84Q51N13c68
$$ plain form
13308 1223 -756 -2781 -4894 -4344 -2848 -1883 -889 508 1625 2370 2292 1960 1176 -361 -1756 -2052 344 2509
13290 2509 4116 6202 7200 7161 5982 3799 874 -1903 -4214 -4740 -4284 -5047 -3785 -1861 45 1921 2842
13273 2842 3194 2699 1901 971 -11 -484 -686 -382 -723 -1225 -2253 -3180 -3784 -3119 -1812 -639 214 752 599
13254 599 90 -322 -763 -1244 -1576 -1687 -2138 -3394 -4789 -2864 -48 2962 5177 5694 4333 2539 901 -222
13235 -816 -1402 -2310 -3166 -2485 -2162 -1822 -1922 -2199 -2626 -3806 -4520 -3076 -1103 417 1242 1229 1109 2 -1453
13215 -3271 -3608 -2698 -1475 -723 230 486 541 189 -467 -1458 -1951 -2108 -2727 -3168 -2297 -1138 -347 752 2041
13196 2041 2700 2189 165 -2383 -3236 -1094 1592 4049 5747 6066 4321 2089 140 15 1396 3039 4257
13179 4257 5699 6593 6391 5365 3409 1650 388 -53 -202 -771 -1974 -3256 -4046 -3619 -2735 -1884 -1371 -368
13160H98J579J594R32k0J84q44j307j027o07m46k42C7a218k255a494D05J200R7
13142A702o91f44j944O04F87K977K448Q56o91j848j845j259m31N20R17Q14N5r23
13124B277B19b625j806a785B28R04PC26a109j368l81M07M70O7p49p40M12O29M71
13105a891L20j88k11p44k92J62N68O74K19k01l47n87m98O53e43A704K501K064
13087F269Q33n89j299j446p41m11m86l47l27m28k86l56c52k92a9A162J357J284
13069C803N72J48m19l52m11k82k8R9L18Q6j66p44r80k63P31J326O98p0m63j101
13049B502A208f55j159r04K13O04L44j46NpJ75J3j99j48M08M73M51J53k33o65
13029a277j078m21O40R92N17b87l89o54p47L02d78H38J366O66L9o42j030m72R8
$$ plain form
13160 898 2477 4071 5003 4983 5167 4323 3016 1989 1382 936 694 37 -1218 -3473 -1494 405 1605 1702
13142 1702 1011 -644 -2588 -1984 687 3664 6112 6968 6277 4429 2584 1325 894 1414 2331 3145 3200 2277
13124 2277 219 -2625 -4431 -1785 228 1132 1139 326 -1109 -2477 -2858 -2451 -1981 -1914 -2663 -3403 -2991 -2362 -1891
13105 -1891 -1571 -1759 -1970 -2714 -3006 -2844 -2276 -1602 -1383 -1584 -1931 -2518 -3016 -2363 -543 1704 4205 6269
13087 6269 7102 6513 5214 3768 3027 2616 2130 1783 1456 1028 742 386 -352 -644 -19 1162 2519 3803
13069 3803 4375 4523 4104 3752 3341 3059 3031 3130 3448 3534 3368 2624 1644 1381 2112 3438 4136 4066 3603 2502
13049 2502 1208 -655 -1814 -2718 -2505 -1901 -1557 -1703 -1698 -1705 -1530 -1517 -1716 -1864 -1456 -983 -532 -379 -612 -1277
13029 -1277 -2355 -2776 -2136 -1144 -627 -287 -676 -1330 -2077 -1775 -478 838 2204 2870 2909 2267 1237 765 863
13010H63j68c57j049j64N11M05b92f6k69j382j613J400a83H83M58k00D80c29o53
12991i82l17p0m17q94j108J81O98N17L63O82f19B27O00J3R0j28J76L56P92Q92
12971C018J173N88k54q73q59q41H64b73j104j001j1J088a32A105R27R03J55J49
12953C239m25q60o61j31O00M48L9m32q91A16c28k94l45J10m21p71n54Q58i8A721
12932C237Q32j42j263I23d30j637o44K91R88A23K039K137K162J400k28j534k136
12915C963A834F22P6M32P4B20a323j779J429A36Q92K5l99A71a68o22o13o04m86
12896b493q2m04n10J05J87M87L12P77O90c20B01J125J252J149P68L30M4j20k90
12877D459p02m53k43n68k99N5m72J352P85m53m34k58p50o41o18e98j580j451M02
$$ plain form
13010 863 695 -357 -1406 -1570 -1059 -654 -292 -66 -335 -1717 -3330 -1930 -183 883 1341 1141 480 -329 -982
12991 -982 -1299 -1369 -1786 -2680 -3788 -3607 -2909 -2392 -2029 -1347 -619 227 827 840 930 802 978 1334 2126 3018
12971 3018 4191 4779 4525 3652 2793 1952 864 -273 -1377 -2378 -2389 -1301 -132 1105 2032 2935 3090 3239
12953 3239 2814 1954 1293 1162 1762 2210 2249 1817 926 116 -328 -622 -967 -857 -1278 -2049 -2603 -1745 -98 1721
12932 3237 4069 3927 2664 923 -430 -2067 -2711 -2420 -1432 123 2162 4299 6461 7861 7633 6099 3963
12915 3963 1834 622 698 1130 1204 220 -1323 -3102 -1673 136 1028 1053 654 171 -168 -790 -1403 -2007 -2493
12896 -2493 -2575 -2979 -3489 -3384 -3197 -2710 -2398 -1621 -931 -320 201 1326 2578 3727 4495 4825 4869 4749 4459
12877 4459 3757 3304 3061 2493 2194 2249 1777 3129 3914 3461 3027 2769 2019 1378 760 -598 -2178 -3629 -3227
12858c227O31m15n82Q54J164e35a69G56K56k75f31k014j383a572A238K146R44
12841D328l85j708C48a664j443K94P75L90M97M5J35d46B7g0E6N53J225O05L68
12822B807j08n24I15d50r69o61L8P92B74J146M68N5J88m17m00o22e4m15m07r10
12802a786j283o69M45Q29L71P8l97R10D56J465O09k4q92a43k363j263a076B249
12783D574O99p67j848a29k615P40b48E94L30D44f29p7A62J059K10l45I6h55j229
12764b084j396o88a560H76J105K10j0o20G80b3l99J85B98N73J35l13A66a47r8
12745b45r0a11D30L14K89J42j36k9j55K65l6L04l5m72c83j530j743J120d76A389
12724C304K136J083j320A821b002k087J298a347e11m82l39q12m40K24a012D60
$$ plain form
12858 -3227 -2596 -3011 -3593 -2739 -1575 -535 -169 756 1012 737 -631 -2645 -4028 -1572 1238 3384 4328
12841 4328 3943 2235 348 -1664 -3107 -2813 -2038 -1648 -1151 -1106 -971 -446 27 -70 56 609 1834 2439 2807
12822 2807 2699 2175 915 -450 -1419 -2080 -2042 -1250 274 1420 1888 1943 2131 1714 1314 692 -54 -469 -876 -1786
12802 -1786 -3069 -3738 -3293 -2464 -2093 -2015 -2412 -1502 456 1921 2530 2506 1614 -143 -2506 -3769 -1076 2249
12783 4574 5273 4506 2658 -129 -2744 -2004 -248 594 924 444 -629 -706 162 1221 1431 1086 96 -855 -2084
12764 -2084 -3480 -4168 -1560 876 1981 2191 2181 1561 780 -23 -422 -237 298 871 1006 693 166 -147 -245
12745 -245 -335 -111 430 744 1033 1175 1039 1010 855 1120 1084 1388 1353 881 -383 -1913 -3656 -2536 -476 1389
12724 3304 5440 6523 5203 1821 -2002 -4089 -2791 -1347 -511 -993 -1332 -2144 -2584 -2360 -1012 460
12707A319l53G7a473j748P11d99A075J005J142J102R65M5j054j463A031a71m52
12690f23a67F33M90M5C44g95j239q09o41o15P57J118a055B10N86M71O37N66L18
12671B788j63q17H03M20K043K535J673L46j312k354A648a67j053j192j79J83N31
12654a877M07J98l88p9L19M78K84K33J55p52p58o33m45L6j38l44l51O51J348b03
12633H10J170L04N0n98p91l50j28o8a04j181j014L68N40l9j40K20a39M8q72j453
12613b416j93J274B59O34A63a697j988j133J975i52E06J021J57l49E65A3K25P80
12595A018Q17N66K83k83A101h30j114R05b27D91L75j81b99j486j453R09O36j5
12577a708k81n96j193j136j66R1N13P66J040Q45K73m38q84m36J124c62A839J759
$$ plain form
12707 1319 966 77 -1473 -3221 -2510 -499 1075 2080 3222 4324 5289 5334 4280 2817 1031 -171 -623
12690 -623 -167 633 1123 1168 344 -795 -2034 -2843 -3484 -4099 -3342 -2224 -1055 210 796 1267 1904 2470 2788
12671 2788 2625 1808 803 1223 3266 5801 7474 7820 6508 4154 1648 -167 -1220 -2412 -2591 -2408 -1877
12654 -1877 -1470 -1272 -1660 -1739 -1420 -942 -658 -425 -270 -1022 -1780 -2413 -2858 -2822 -2960 -3304 -3655 -3004 -1656 -203
12633 810 1980 2284 2334 1736 945 595 467 399 -104 -1285 -2299 -1931 -1391 -1430 -1570 -1350 -139 -91 -963 -2416
12613 -2416 -2609 -1335 259 893 163 -1697 -3685 -4818 -2843 -952 506 1527 1684 1335 565 13 238 1018
12595 1018 1835 2401 2684 2401 1101 -830 -1944 -1039 -227 491 866 685 -299 -1785 -3238 -2329 -1693 -1708
12577 -1708 -1989 -2585 -3778 -4914 -5080 -4989 -4476 -3710 -2670 -1825 -1552 -1990 -2874 -3310 -2186 -362 1839 3598
12559C598J544O58p91k070D91a445K7A69J038P64J29l24F71g05j414j106o47M06
12541c466K75N2J89M30O45J84k04l02J94N12J9p05j389j475J325J286K90q56p16
12522c712j40J120R67g03f9C13q3b85l23b07D86L75M18J43o2k39j58l3q1C23h32
12500b622L75D57J874N74n9p01q71n09Ca223k112k759J634a047B034J972J078
12483E084l67j222A402b62m07b11F51P12J224J036O12K02k81k56o42q88F81a228
12464b962n74n8k87m85O74P34K36k61j266Q26a641c91A390R18L16P1m8k38k58
12445B151o16n80J4J56K41l23ij364c12A314L479J789n02j290a865j055p09j97
12427c826p64L8P93N73Ll23L19J133d28G94N59l41A78c65d2A651K228J660K19
$$ plain form
12559 3598 5142 5800 5009 2939 491 -1445 -1418 169 1207 1971 2100 1776 671 -705 -2119 -3225 -3872 -3466
12541 -3466 -3191 -3139 -2950 -2520 -1875 -1691 -1895 -2197 -2003 -1491 -1472 -2177 -3566 -5041 -3716 -2430 -2140 -2996 -3712
12522 -3712 -3852 -2732 -1765 -703 -69 313 230 -285 -608 -207 486 861 1279 1422 1360 1121 963 930 849 323 -832
12500 -2622 -2247 457 2331 2905 2846 2145 1274 765 3 -1223 -3335 -6094 -4460 -1047 2034 4006 5084
12483 5084 4717 3495 1402 -262 -669 -211 651 1363 2587 3623 4235 4437 4156 3900 3258 2370 681 -1228
12464 -2962 -3536 -3594 -3881 -4366 -3692 -2958 -2722 -2983 -4249 -3423 -1641 -391 1390 2308 2624 2695 2647 2409 2151
12445 2151 1535 955 969 1125 1366 1043 -9 -1373 -312 1314 4793 6582 6080 4790 -1865 -2920 -3629 -3826
12427 -3826 -4590 -4552 -3759 -3186 -3183 -3506 -3187 -2054 -428 794 1353 1012 178 -365 -42 1651 3879 5539 5758
12408E758q17r57q45J05K64j61p38A088C90L21J638J987R43O04Nk09p18q90j447
12389B624B68b644n49a114i4l45n60o06j61K06L22K49M26K64J44l4j107q01d74
12369A520J239J73A390g64j441M25P34k65j174l76O75Q25k2k87M22b36E97J067
12351A664N78Om81n30k27N5M89o58I4i20r47j82g99B32N86l76i62j969j105J338
12331b698J038N68J43k95o07k75n29k34n95Q65e46A319J191q4G62a335k037J082
12313b290a36H82J01l66d0A60R0d58j515k688j26b169d76D56L45L98J086J050
12295C335J363J064J175R95Q06j69p50k178k432j348G18d26n73o54o27j395J389
12278b286h51B04J248J63m22F7f46p98l79O60c20A163J258O40l83A308i23j067
$$ plain form
12408 5758 4941 3984 3139 3244 3508 3347 2609 1088 390 711 2349 4336 5279 5883 5888 5679 4961 4071 2624
12389 2624 268 -2644 -3193 -1114 -94 -439 -999 -1605 -1766 -1560 -1238 -989 -563 -299 -155 -189 -1296 -2097 -474
12369 1520 2759 2932 1390 -764 -2205 -1780 -1046 -1311 -2485 -2861 -2186 -1361 -1383 -1670 -1248 -236 597 1664
12351 1664 2242 2248 1767 1237 1010 1065 1554 896 94 -920 -1867 -2049 -799 232 818 442 -962 -2931 -4036 -2698
12331 -2698 -1660 -1092 -949 -1244 -1851 -2126 -2655 -2889 -3484 -2619 -546 1319 2510 2426 762 -1335 -3372 -2290
12313 -2290 -136 882 983 617 -40 160 250 -458 -1973 -4661 -4787 -2169 -476 456 801 1199 2285 3335
12295 3335 4698 5762 6937 7932 8738 8569 7819 5641 3209 1861 718 -426 -999 -1653 -2280 -3675 -2286
12278 -2286 -851 204 1452 1615 1193 67 -646 -1444 -1823 -1163 -320 1163 2421 3061 2678 1308 -923 -1990
12260a990C49J577O14j96o24p43a61j486j817l97a573A087J914L79o16j164E3
12242i73m37l21k24J12o7j19o75o4R5J7l63p01M28J609b69H83J160P73K03m68
12222B551A185i43k575q51K065h83a58el68j151j900K30h98F71N91E45i46k713
12204c659j417J837i94A312K086J284k47k033e65j689N19b61A776Q40k65I07a233
12186b568J116E20J288m99d53l579b003A313K160J469M42n53q57r77j167G26f39
12168a583o92l58m37m19r9L66N41L78M96O23L32j26j57j390k49J193g61J45j15
12149g31n00l15k11j75j71NK16O57b49F54O76J54n43B27h60j750k158j858J118
12130e508b502a17A588K13k14D43a283m93N57l77j174j764Q62a253H31J095o98
$$ plain form
12260 -1990 349 1926 2540 2344 1720 977 -161 -1647 -3464 -3861 -1573 1087 3001 3380 2764 1600 53
12242 -973 -1410 -1731 -1955 -1843 -1910 -2029 -2704 -2768 -2673 -2656 -3019 -3720 -3292 -1683 -269 883 2043 2816 3019 2551
12222 2551 1185 -943 -3518 -4369 -2304 -883 -158 -5 -373 -1524 -3424 -3194 -898 671 1262 545 -946 -3659
12204 -3659 -5076 -3239 -994 1312 3398 4682 4435 2402 -565 -2254 -1735 -261 1776 2616 2351 907 -1233
12186 -2568 -1452 520 1808 1309 -453 -4032 -2003 1313 3473 4942 5384 4831 3974 2997 1830 726 -639
12168 -1583 -2275 -2633 -3070 -3489 -3588 -3222 -2681 -2303 -1807 -1184 -852 -978 -1135 -2525 -2774 -1581 -761 -616 -731
12149 -731 -1231 -1546 -1757 -1932 -2103 -2098 -1882 -1225 -249 654 1330 1484 941 227 -860 -2610 -4768 -6626 -5508
12130 -5508 -2502 -117 1588 1801 1587 443 -1283 -1776 -1219 -1596 -2770 -4534 -3672 -1253 831 1926 1228
12113A228a430j808A583N207L714J381j547l781l249R35L957K096j83j139j773
12098G201j809q74j031j133H58c65l95K07a17B82L95j84a9j79E7R16P13m6o98
12079I42c37j756j023L49a207I63J710O44k73r69G83H7b74l46C93J331l28J147
12061B543R376J7254K0169J9558J4629O128m188j3411j9406k1289A2569a928m09
12048b337h96a90F53M48K78C88J94J290J058L23j282a51j742N84E70J011l35c96
12029b743g11B508K601Q17n25j909I59a560k505R27i60D87L75J50C30e39j797
12012b336k35b4B900K361J533l25k327I02c091f83A114l16e37k377k063J472J664
11995a841c07E45M59K0m47A49P15J981J419k10j975a330k422J680i20C378P725
$$ plain form
12113 1228 -1430 -3238 1583 6790 10504 11885 10338 6557 3308 4243 8200 10296 10113 8974 7201
12098 7201 5392 4518 3487 2354 858 -365 -760 -553 -117 282 677 493 -19 -198 57 973 1686 1640 942
12079 942 -337 -2093 -3116 -2767 -1207 963 2673 3317 3044 2075 783 87 -274 -620 393 1724 1396 2543
12061 2543 11919 29173 49342 68900 83529 89657 85469 72058 52652 31363 12569 -1928 -2337
12048 -2337 -896 -190 653 1101 1379 388 582 1872 2930 3253 1971 -151 -1893 -1309 570 1581 1246 -396
12029 -2743 -711 2508 5109 5926 5401 3492 959 -1560 -4065 -3138 -960 487 862 1012 330 -539 -2336
12012 -2336 -2571 -24 2900 5261 6794 6469 4142 902 -3091 -683 1114 798 -537 -2914 -4977 -3505 -1841
11995 -1841 -307 545 1004 1024 577 149 864 2845 4264 4054 2079 -1330 -3752 -2072 -920 3378 11103
11978A1103R690R082O538K082k224o116q308q553F631A883k62P80J110O80m85
11963C706j401I37C40o6K21P3K86K8k01k54J08P4J08N7l79b93j330j137j389J331
11943b818a389a08A378J069K47l38j076f09k473o19P33N1j82K86M91N71L61d53
11924A392J440R13j21j281B90a513j16P89K18j010j074o69J12O15O55P16K9p36
11906a984p70j89P00K2m74j205j822L84K050a370G4J116J168R71J09p58p53N26
11888B453J830K014R39j042k950G9b073C32K341P65k85o37k89l05K23m00E16h32
11869a021C09K113J739J405Q46N45K17m64j489k487I2b868l32J290M76m49k354
11852d237J101h73G71P64J2L52J1L01K17m19G06a363q00g20a85j18p27o47j32
$$ plain form
11978 11103 20793 29875 36413 38495 36271 30155 21847 13294 6631 1883 1621 2401 3511 4191 3706
11963 3706 2305 937 340 274 495 568 854 882 681 427 535 609 717 774 395 -293 -1623 -2760 -4149 -2818
11943 -2818 -1389 -108 1378 2447 2694 2356 1280 -609 -3082 -3701 -2968 -2917 -3099 -2813 -2322 -1751 -1390 -453
11924 1392 2832 3745 3624 2343 290 -1513 -1629 -840 -622 -1632 -2706 -3375 -3263 -2648 -1993 -1277 -1248 -1984
11906 -1984 -2754 -2943 -2243 -2221 -2695 -3900 -5722 -5338 -3288 -1370 74 1190 2358 3329 3438 2680 1927 2453
11888 2453 4283 6297 7236 6194 3244 79 -2073 332 2673 3438 3153 2516 2227 1922 2145 1745 516 -832
11869 -1021 309 2422 4161 5566 6412 6957 7174 6710 5221 2734 92 -2868 -3200 -1910 -1434 -1883 -4237
11852 -4237 -3136 -873 771 1535 1547 1899 1910 2211 2428 2009 706 -1363 -2163 -720 -185 -303 -1030 -1677 -1809
11833a809Q3K86N8K00K13b40I95J105J3H93a301k370N0J590i89d00J25B17P02
11814I19J505P45r85b54k436M38g93L25j511j641P52D14L152J958R71P50L839
11797A1084R096J2392J2408Q415K301m306r259j0928q206n307m342n069C473j399
11783B074K982Q45j631G51f51A171Q81H99a316e18B942L678J806q9j480j892j286
11766C679l12o96m89l93J53Q1j80j24p81e90m89a71H47P38m16B12a117j077K2
11747b172P12N89J67m49l89l05K44f34F68R34M36N55N21o87A131A64l7R80R16
11728B023q8p65A44i98n68l99J23l93m80k30J42J66M30P17c76A007J651J584O10
11709D852j010A692a205k129m62N70Q48O23M9j84K85g21E34J353J206J035M6o78
$$ plain form
11833 -1809 -1726 -1440 -1382 -1182 -969 -240 995 2100 2113 893 -1301 -3671 -3621 -2031 -989 -400 -275 217 919
11814 919 2424 3169 2184 -254 -2690 -2252 -793 -468 -1979 -3620 -2868 414 3566 5524 6495 7245 11084
11797 11084 20180 32572 44980 53395 55696 51390 42131 31203 22997 17690 13348 8279 3473 2074
11783 2074 5056 5901 4270 751 -651 1171 2052 899 -1316 -518 2942 6620 8426 8337 6857 4965 3679
11766 3679 3367 2671 2182 1789 1942 2023 1843 1719 938 -590 -1079 -171 847 1585 1169 212 -1117 -2194 -2172
11747 -2172 -1460 -871 -704 -1153 -1542 -1847 -1603 -634 668 1602 2038 2593 3114 2427 1131 164 127 1107 2023
11728 2023 1935 1170 144 -998 -1566 -1965 -1842 -2235 -2715 -2945 -2803 -2637 -2207 -1490 -376 1007 2658 4242 4852
11709 4852 3842 1692 -1205 -3334 -3796 -3226 -2378 -1755 -1706 -1890 -1605 -721 534 1887 3093 4128 4174 3496
11691C496q96j095l13C06a049j262j262j242j191O82J278O58M63M50O8n06pQ43
11673b077N83O45c00H94J627J504J734Q32N25L5o34j016p54r02j304I83a135k066
11655c201j739J809J151L58pJ06j53k90l17j44k72p8n4K85N7J46m13m91k55J78
11635c324J068O67j9r6O31F11J664J137J074M09j001A485h91j922j080m41l57
11618d691J019M28Q9J87k27j02O92J068a74G09L85K26Q3j68j45l04k65J09B81
11598F7b15r17j688j739J255O40O50i95a87E37P0K90K90j67I9i51J35K51N6O2
11578d47l30o71q93l93L10R41e01E85O96P11N66k0m47G1a558l29Q71q33j445L41
11558b953l440l553K97J04c588a263C000j271pf04j466A564M480M083J631l0k053
$$ plain form
11691 3496 2600 1505 1192 306 -1049 -2311 -3573 -4815 -6006 -5324 -4046 -3388 -2925 -2475 -2407 -2913 -2920 -2077
11673 -2077 -1494 -849 -300 894 2521 4025 5759 6591 7116 7151 6517 5501 4747 3845 2541 983 -1135 -3201
11655 -3201 -4940 -3131 -1980 -1622 -1629 -1523 -1676 -1966 -2283 -2427 -2699 -2777 -2831 -2546 -2489 -2343 -2756 -3247 -3502 -3324
11635 -3324 -2256 -1589 -1608 -1704 -1073 611 2275 3412 4486 4895 3894 1485 -891 -2813 -3893 -4334 -4691
11618 -4691 -3672 -3244 -3155 -2968 -3195 -3297 -2605 -1537 -174 709 1094 1320 1403 1235 1090 786 521 630 281
11598 67 -215 -1132 -2820 -4559 -3304 -2664 -2014 -995 -187 537 607 897 1187 1020 99 -951 -816 -565 -509 -447
11578 -447 -777 -1448 -2341 -2734 -2424 -1483 -501 585 1281 1992 2558 2538 2091 71 -1558 -1887 -1016 -1849 -3294 -2953
11558 -2953 -6393 -9946 -9649 -9545 -3588 -1263 3000 1729 1722 -604 -2070 1564 6044 10127 11758 11728 9675
11541I675l504B963B66L77J263J794Q48j82n64j65L8r06I59a336e07B059J037
11524C096I61c320j693B53K949J544j554p03J420m34J66o15g54j251E05K894Q75
11507D274p46j755g11k027j217J912b64H93O52l95c82k038k066j356J5n20q94
11490g241O33J907J422N40qm20L61K58m2l40Q2N0O78J057I5K74B9i31q86q04P1
11469b550r59L0P34Q68R35b72kl79o80K51c21E97N92L64n50a62r16n65l28j34
11449b105l84j70K74K13j84m59J33M83L03m88j035q23J794g43B71c68j763j881
11431d012J492g92a78k28q77j321r47J317g79C77O97L68L55o8l70o60j07J181
11413A773Q89K69r60I9a732K51a16A040P50N26O41O46L04k09q55A263e63k168
$$ plain form
11541 9675 6171 2963 266 643 1906 3700 4548 4366 3802 3637 3675 2769 959 -1336 -507 2059 3096
11524 3096 961 -3320 -5013 253 3202 4746 3192 2489 3909 3475 3641 3026 -754 -2005 505 3399 4274
11507 4274 3528 1773 -711 -2738 -3955 -2043 -264 893 1545 1150 -382 -2420 -4486 -5842 -5827 -6347 -7241
11490 -7241 -6608 -4701 -3279 -2739 -2747 -3167 -2806 -2548 -2590 -2930 -2848 -2798 -2120 -1063 95 369 29 -931 -1817 -2621 -2550
11469 -2550 -3509 -3479 -2745 -1877 -942 -272 -274 -653 -1333 -1082 -321 597 1189 1553 1003 -162 -1078 -1643 -1971 -2105
11449 -2105 -2489 -2659 -2385 -2172 -2356 -2815 -2682 -2199 -1896 -2384 -3419 -4242 -2448 -743 271 -368 -2131 -4012
11431 -4012 -2520 -792 -178 -406 -1283 -2604 -3551 -2234 -779 377 1074 1442 1797 1729 1359 699 592 1773
11413 1773 2662 2931 1971 99 -1732 -1481 -116 1040 1790 2316 2957 3603 3907 3698 2843 1263 -563 -2731
11395b731o19a644E1J133M04r1k89n72b20j080o91L92a7B272J907R02m46j628
11377C007g1l820a221H90J315k36i5k443O14A290K363J144J07j613I62a655n96
11360b251A43J859J240J10r16E93B34J536J420J204P13P98K21j77l40l47p6j42
11342E044l06m57o57j256p48J663L743L828K461O81j070j661j676j824j439q75
11326E451r60j544F07h81j042o39q2L42J91K31M89N54J91m1k52n2j5j89m01l61
11306a957K40j42Q02H6N98j08f89k006q70a548A079K573K056Q65r13j650A641
11288f60j462m40m36r25J065a045I09J153Lp86b54j862j769j375r8M18N95R40
11270c405J086Q45K68J59l90p45r79j018j55L97N89O32R15m66m1j68j87O87c78
$$ plain form
11395 -2731 -3350 -1644 51 1184 1588 1497 1208 636 -220 -1300 -1991 -1599 -17 2272 4179 5081 4635 3007
11377 3007 -71 -3891 -1221 890 2205 1969 -95 -2538 -1924 1290 3653 4797 4904 3291 962 -1655 -2251
11360 -2251 143 2002 3242 3352 2436 593 234 1770 3190 4394 5107 5905 6126 5949 5609 5262 5186 5044
11342 5044 4738 4281 3624 2368 1620 3283 7026 10854 13315 13996 12926 11265 9589 7765 6326 5451
11326 5451 4491 2947 607 -881 -1923 -2562 -2644 -2302 -2111 -1880 -1391 -837 -646 -687 -939 -991 -1006 -1195 -1596 -1957
11306 -1957 -1717 -1859 -1057 86 684 576 -689 -2695 -3565 -1548 1079 3652 5708 6573 5660 4010 1641
11288 -660 -2122 -2562 -2998 -3923 -2858 -1045 909 2062 2065 1279 -254 -2116 -3885 -5260 -5358 -4940 -4345 -3405
11270 -3405 -2319 -1474 -1206 -1047 -1437 -2182 -3161 -4179 -4334 -3937 -3348 -2716 -1801 -2267 -2308 -2476 -2663 -1976 -378
11250C394L838L132J493q74k927l620k154J115J775J43j851D77b586P05O16p5
11234a340m96n20K09N50K47m02q71o13O05a173F01J537K33r06o81J841L109J573
11216G307j445A951b062j955a393J8j092a26C847K564j82B442c076p78E26J327
11200A853a31A296O223L752j738m497N04J334l204J875J2056Q118l316M12K5575
11185D8390K6577O333P406R6204J80180K17700K08794J53520O2959m2947j38118
11174H26998k01298k19067j90950I5380k2454P57k0503k4630p743N06p723n509
11162H081M363L431l413E652k026N11k064r68L705K631j166A528c109k157P91
11147d475G44O389M139N54l253C404F45J138J285N78j92p34j263o96J69J032J03
$$ plain form
11250 3394 7232 10364 11857 10983 8056 4436 2282 3397 5172 5315 3464 477 -2586 -1881 -1265 -1340
11234 -1340 -1836 -2356 -2147 -1597 -1350 -1752 -2623 -3236 -2631 -1173 601 2138 2371 1465 784 2625 5734 7307
11216 7307 5862 1951 -2062 -4017 -1393 -1375 -2467 -126 3847 6411 6229 2442 -3076 -3854 526 1853
11200 1853 -131 1296 7519 11271 9533 5036 5540 6874 3670 5545 17601 25719 22403 22815 48390
11185 48390 74967 81300 88706 184910 365090 582790 791584 945104 1008063 965116 826998
11174 826998 625700 406633 215683 95380 72926 73683 53180 28550 20807 21313 13590 8081
11162 8081 12444 15875 12462 5652 3626 4137 2073 1105 4810 7441 6275 1528 -3109 -5266 -4475
11147 -4475 744 7133 11272 11826 8573 3404 645 1783 3068 3646 3454 2720 1457 761 930 1962 2065
11130B065E16a599k67c19d7j145p86i71c94k09a93A087J648P00n42A315d85A73
11111A424O82l61C72i82j478j286p68k49L50N81J276i20I80J395J33r77b32p31
11093i63b0A449K27k95m92j68K17K5B21i27j591n12a100A140K074K458J904J324
11075H900M36j68q22j390j818j811A574G13B54H2M25N65m6A44h03b67I77N81k06
11056A352b90j923j083J53K02k65o0P18O27k66j358J472i12D42J187J539J736
11039D904Q74R6r86j404l96J170J223K43j241k057d72k391J428A973L196K292
11023G461Q37j460k854A065a126J47a88C67a30j109p53M04g82b28k37p49j402
11006b616j108M63J346O69O0J27K94n3J6J73F49J148N73o51a29k142j381M6m47
$$ plain form
11130 2065 516 -1599 -1866 -319 -47 -1192 -1978 -971 -394 -603 -193 1087 2735 3435 2893 1315 -485 173
11111 1424 2106 1745 372 -982 -2460 -3746 -4514 -4763 -4413 -3832 -2556 -920 980 2375 2508 1531 -232 -963
11093 -963 -20 1449 1676 1381 889 721 938 963 221 -927 -2518 -3030 -1100 1140 3214 5672 7576 8900
11075 8900 9336 9168 8346 6956 5138 3327 1574 713 254 82 507 1072 1026 144 -803 -267 977 1558 1352
11056 1352 -290 -2213 -3296 -3143 -2941 -3206 -3266 -2548 -1921 -2187 -3545 -2073 -912 442 1629 3168 4904
11039 4904 5778 5874 4888 3484 3088 4258 5481 5724 4483 2426 -472 -2863 -1435 1973 5169 7461
11023 7461 8298 6838 3984 1065 -1126 -979 -188 367 -130 -1239 -1992 -1588 -782 -228 -465 -1214 -2616
11006 -2616 -3724 -3261 -1915 -1246 -1186 -1059 -765 -818 -802 -629 649 1797 2370 1719 -129 -2271 -3652 -3606 -4053
10987d053j8J444g16A391K226L477K032J261m53j983l670gl922k015K005M09m31
10970c961m99Q51K95M2Q96f46H43L37B78a778r84A191K823Q42p64j362p96L52
10952B286Q75L42n35A359g75j842J050C72R16p6n49B0e0E18Q43J160J506J348
10934E375l1j269A253b635k803b591a195O4j545j366J358B48K847J523n79A959
10917a78q28a9G74B69a221j708j233J035J518d79E80J135J026j16A069f36B402
10899G642M556K470k39l317m404A651a259r55j068j802a971A483J35c13l593J750
10883b156B317L601J910j244l06k278q67A137e66r11J41L62C96R49O9B07a688
10865c634r88R39P16n39j46J102J064O90a48A79fm73J90E43O75j2A57a388j796
$$ plain form
10987 -4053 -4071 -2627 -716 1391 3617 7094 9126 10387 9934 7951 4281 -7 -3929 -5944 -3939 -3530 -3961
10970 -3961 -4460 -3609 -3314 -3272 -2376 -646 843 1180 278 -1778 -2762 1191 4014 4856 4092 2730 1934 2286
10952 2286 3161 3503 2968 1359 -775 -2617 -1567 372 1288 1212 663 20 -50 518 1361 2521 4027 5375
10934 5375 5344 4075 1253 -2635 -5438 -2591 -1195 -1131 -2676 -4042 -2684 248 3095 4618 4039 1959
10917 -178 -1006 -19 774 269 -1221 -2929 -4162 -3127 -1609 -479 580 1715 2741 2625 1069 -636 2402
10899 7642 12198 14668 14429 11112 6708 1651 -1259 -2214 -3282 -5084 -1971 1483 1618 -313 -3906 -2156
10883 -2156 2317 5918 7828 6584 6278 4000 3133 1137 -566 -1477 -1336 -974 396 1345 1414 207 -1688
10865 -3634 -4622 -3683 -2967 -3506 -3652 -2550 -1486 -796 -148 179 -6 -479 -289 543 1218 1206 157 -1388 -3184
10846c184j232J37L44N49J325R79d06l56m69K94A304K646J149P54J73J3K646L098
10828A1783K835K588J243N34j816k970l955m306A338h43B36J192N89n52n21j4
10812I30M76q4A85a052r07m74O27g3A790J508o3A595g38j573K67J84L04f91A67
10792C88h98j973a83A986K88G60a432j294M82d30B087L290J612o87j959k117r18
10775A308n42C42i49j374p68M47h24A485J960O80o33j308A046d50k266O66D03
10757A841l85b11lA919M80A115b74E82J393l80o52J611K921K042J422J945K742
10740A3626J288l01J291L938L992J115n45q69J490M992J0993J8044K0020J7973
10726I7047K1714M3263P7251J05935J17655J12165R1338O0177K2640k0289n9754
$$ plain form
10846 -3184 -4416 -4279 -3935 -3386 -2061 -1082 -406 -762 -1231 -937 1304 3950 5099 5853 6026 6039 8685 11783
10828 11783 14618 17206 18449 18983 17167 14197 10242 5936 1338 -843 236 1428 2017 1465 944 930
10812 930 1406 1322 185 -1052 -1959 -2433 -1806 -73 1790 3298 3235 1595 -738 -2311 -2044 -1860 -1556 -691 167
10792 388 -898 -2871 -183 1986 2274 760 -1432 -2726 -2244 -430 2087 5377 6989 6302 4343 2226 1308
10775 1308 766 342 -949 -2323 -3091 -2644 -824 1485 3445 4125 3492 2184 1046 -450 -2716 -2050 403
10757 1841 1456 -211 -214 1919 2399 1115 -274 582 1975 1595 943 2554 5475 7517 8939 10884 13626
10740 13626 14914 14613 15904 19842 23834 24949 24404 23535 25025 30017 41010 59054 79074 97047
10726 97047 118761 162024 239275 345210 462865 575030 666368 726545 749185 728896 669142
10715F69142r5326j17135j22885j07362p4292l8918k1325k0921k0684j2720l507
10704C4067k266m721j680Q42r84m802o496m877j782K52N77O9Mk04n08r09r20N7
10686E719k79p63B196d48F32K583J100m55j839a54k451r6f60A952K029R56k07
10669D730j487A122E08J588J783N34q71j671C4a271j537o59J248g06B62K90J66
10652G18J53Q0J48J75K87K65J02J80R82J099N32j053A590f22r89n73J95L5n7l55
10632b366p5R54A96J472L31I23e96j061n5e93c3k27j088k049P04A38K825K412
10614E375O75l76j374j101p40k78O97n56H55a306M80D97P8f05j610r82K48P41
10596b208O8j63o08J020c25A589J432N93l49p86j151D66a45p54j143j185J77i96
$$ plain form
10715 669142 573816 456681 333796 226434 152142 113224 91899 70978 50294 37574 34067
10704 34067 31801 27080 25400 26242 25258 20456 13960 9083 7301 7553 8130 8199 8203 7999 7491 6582 5662 5719
10686 5719 5440 4677 2196 -448 632 3215 4315 3860 2021 -154 -2605 -2701 -660 1952 3981 4937 4730
10669 4730 3243 1122 508 2096 3879 4413 3542 1871 34 -1271 -2808 -3467 -2219 -706 262 552 718
10652 718 871 951 1099 1274 1561 1826 1928 2108 3090 4189 4721 3668 1590 -622 -1611 -2184 -1989 -1954 -2011 -2366
10632 -2366 -2441 -1487 196 1668 1999 923 -596 -1657 -1712 -593 -33 -260 -1348 -3397 -2693 138 2963 5375
10614 5375 6050 5674 4300 3199 2459 2181 2878 2322 855 -1306 -826 497 575 -605 -2215 -3197 -2949 -2208
10596 -2208 -2140 -2303 -2911 -1891 -325 1589 3021 3614 3265 2479 1328 466 -145 -899 -2042 -3227 -3050 -996
10577H62J130k33E21e40j193m57N61J69A70J328K95l71n33j47B47c64o91K14E66
10557B178J160J142N78P1r79j674j157C3a116p31N48D9Q28Q5B09a036j246j092
10539c374o04n37p3L35L07L76N89J177h57C1J74d0C36R22N43m77A66h70k5b34
10518B57l5f29j618k180N22J366i98F61J473J917J034o74j999E14b657l625b625
10500B39J471Q09o98G59e40m04j055k121j729l90J785b143h40L61j6o47q4n80
10482a806J5p75j489m63J524g00B61R68j83b21r39D17J984N80m21I08a579j030
10464b609a036G76Q35m72C15c29m42j116k79P66b5H51M05m37a99n98b73G47Q78
10445A625J76F85i33o52m50j72M71h44C12M54B05a127j137l19L79M32O2J77M18
$$ plain form
10577 862 1992 1759 521 -540 -1733 -2190 -1629 -1460 170 1498 1793 1422 889 742 247 -364 -1055 -841 566
10557 2178 3338 4480 5058 5129 4150 2476 1319 33 -1116 -1847 -1299 49 877 962 209 -1036 -2282 -3374
10539 -3374 -3978 -4515 -4588 -4253 -3946 -3570 -2981 -1804 -857 31 205 -40 336 1258 1801 1324 166 -870 -895 -234
10518 257 222 -629 -2247 -4427 -3905 -2539 -998 661 2134 4051 5085 4411 2412 514 -2657 -6282 -2625
10500 239 1710 2519 1821 759 -540 -944 -1999 -4120 -5849 -6239 -4454 -2143 -840 -479 -495 -1142 -1226 -1806
10482 -1806 -1791 -2566 -4055 -4518 -2994 -700 261 1229 1046 -221 -1160 417 2401 2981 2560 908 -1579 -2609
10464 -2609 -1036 776 1611 1139 315 -329 -771 -1887 -2166 -1400 -25 851 1256 819 -199 -797 -273 747 1625
10445 1625 1801 685 -933 -1585 -2035 -2207 -1736 -844 312 766 205 -1127 -2264 -2583 -2204 -1772 -1710 -1533 -1115
10426a115a25I71J258J324R35J12l32j053j195E93c67p07M33A65K84m4d16q55
10408a271q20i46A894K006N70r92A048a945k626j651J730a638C675L934k10C373
10391I041J9008K3247K1852J7264R094k799j2790k1627k3866A6284i4j507A424
10377F55b756j061J748P17M01D30J333N78l19G30f24A02M07d40k153l057k86J960
10359c976J166J335e63e5p7H2f92p38l20P91a77D75K81e8p49j415p89r29L97J275
10339b268i72H5B4a38kA066j90h3j160j260n33R78P10L96j90o83q54P26e78A99
10318D55K09lJ68N7B26a923j599L66N67r05j276j332M07a591C872N957Q570J0674
10300B9073Q639j450N403O4606J20111J58920J76661J66742J25940O2275j6431
$$ plain form
10426 -1115 -125 971 2229 3553 4488 4600 4268 3215 2020 593 -367 -1074 -641 165 449 405 -416 -1271
10408 -1271 -2091 -946 1894 3900 4470 3478 1048 -1945 -4571 -6222 -4492 -1638 3675 7609 7399 3373
10391 9041 28049 51296 73148 90412 99506 96707 83917 62290 38424 16284 -94 -1601 1424
10377 655 -2756 -3817 -2069 -1352 -951 430 1763 2341 2022 730 -624 102 509 -440 -2593 -5650 -5936 -3976
10359 -3976 -2810 -1475 -563 -55 -132 82 -692 -1430 -1750 -959 -177 475 756 -58 -807 -2222 -3011 -3940 -3543 -2268
10339 -2268 -972 85 24 -138 -140 1066 876 -83 -1243 -2503 -3036 -2058 -1348 -952 -1142 -1825 -2679 -1953 -578 199
10318 455 664 661 829 886 226 -1923 -3522 -3156 -2589 -3494 -4770 -6102 -5695 -1591 3872 9829 18399 29073
10300 29073 37712 36262 41665 106271 226382 385302 561963 728705 854645 916920 900489
10289I00489q9957j45497j73007j69903j41680H3038C8066r986q202r143l095
10278G640k196A136c593k383b616i63j22n55j253j628g16C563K483N08j943j737
10262B874q96E09c64q85k33K02d42H88R18j43g28k398Q56f98e5q33j998o06a530
10242B29N570R104J1097R127L592j705o59P663J8929J7244J6938J3007M712J844
10228A16692J949O397N541j40j1656k2926l3501l0740H411J857N247k254E990
10214a562k037J363j250l346K138a976g25A16J40c3GJ748J968K127O39n06k058
10197C925A543i31p58D4J874J873J779J444O68J191K533L454L513J103j513m388
10181A3575o598A366b426n02h79F42Q19j90m46k66k57m0K03M14Q34J016J058N59
$$ plain form
10289 900489 810532 665035 492028 322125 180445 83038 38066 28080 19878 10735 7640
10278 7640 5444 1136 -3593 -5976 -2616 -963 -1085 -1640 -2893 -4521 -716 3563 6046 6554 4611 2874
10262 2874 1978 509 -364 -1249 -1482 -1280 -442 888 1806 1663 -728 -3126 -2270 -698 -55 -888 -2886 -3492 -1530
10242 229 5799 14903 26000 35127 38719 37014 36355 44018 62947 80191 97129 110136 114848 116692
10228 116692 118641 125038 130579 130439 118783 95857 62356 31616 8411 10268 15515 13261 5990
10214 -1562 -3599 -2236 -3486 -6832 -4694 -1976 -725 116 256 -33 7 1755 3723 5850 6489 5983 3925
10197 3925 1543 -931 -1689 44 1918 3791 5570 7014 7682 8873 11406 14860 18373 19476 17963 13575
10181 13575 6977 1366 -2426 -2928 -879 642 1461 1271 825 559 302 262 465 879 1713 2729 3787 4346
10163D346k8q74j337A14a600o97k32J70l69m20m12P27Jm62J67R03R25N63J26h0
10142h5b3j62n69q09k85O06M69L4DJ138Q25M8n28aj319l31g63F5P75k33b57j625
10120a882r16N49J086b83B87A7a092j450j666M0J866N41j422j90C26M093L608
10103H027j70k941G61K414Q417Q468P717O933N751N133P72l061o120p57N419R658
10087E1505Q949N014r43n180p586p161l063L906R889J1947P064l609j8255A8082
10072B2030N7334N8728M9129L1854Q865j4197l2355m4108m6100m0242B3691j0474
10060A3217J039O19l257n122j828K639K966O73k002l176k736q89j69j60q56c56
10043a586j739j55J349h51E89N85p3J53L67R33M41l15j268h68l90A923J534j291
$$ plain form
10163 4346 4318 3444 2107 114 -1600 -2297 -2529 -2359 -2728 -3148 -3560 -2833 -2832 -3294 -3127 -2224 -1299 -736 -610 -80
10142 -85 -23 -185 -754 -1563 -1848 -1242 -773 -739 4 1142 1967 2015 1487 -1 -1320 -1651 -763 65 840 607 -257 -1882
10120 -1882 -2798 -2249 -1163 -283 287 17 -1092 -2542 -4208 -4168 -2302 -1761 -3183 -3373 326 4419 8027
10103 8027 7857 4916 761 3175 11592 20060 27777 34710 40461 45594 46366 43305 37185 36428 41847 51505
10087 51505 60454 65468 64525 59345 51759 44598 41535 45441 55330 67277 74341 70732 52477 18082
10072 22030 79364 138092 187221 219075 227940 213743 181388 137280 91180 50938 23691 13217
10060 13217 14256 14875 11618 6496 4668 7307 10273 10946 8944 5768 3032 2143 1974 1814 958 -356
10043 -1586 -3325 -3480 -2131 -851 589 1174 1101 1254 1621 2554 2995 2680 1412 -868 -1258 1923 3457 2166
10025B166a247n289n84b180C165L957N17k964A66c903Q64a162r00j859j774j162
10009f857J489J883L36n46r42J155J117f75J86A380J06a730B378M162K145J584
9993A0269J311Q11p92c1m997n426j942L817B145K693K409L282J3324J1079J0495
9978D5427O918L693k233p168j0620j2860A0692I87d350a800j119m95g29A929J579
9963C508J434J518K133P69j023k968A931a085k556K57M25P26J110C27J456P93
9947B576Q49M19J49k01l98k61n01M1k09M96l17p40C18a813j324J401f56H34J145
9928A979R74K9k64J89J07k58j091d50j280N97G5N37B66g62j351q33L07J7p52l70
9908c744O92J74k19o21j70J86K76J077J004FJ277Q58N65j56K07N44Q12J018J25
$$ plain form
10025 2166 -1247 -6536 -7120 -2180 3165 7122 7639 4675 166 -3903 -3039 -1162 -2062 -3921 -5695 -6857
10009 -6857 -5368 -3485 -3149 -3695 -4637 -3482 -2365 -675 -489 1380 1486 -1730 2378 6540 8685 10269
9993 10269 11580 12391 11599 -31 -5028 -10454 -12396 -8579 2145 4838 7247 10529 23853 34932 45427
9978 45427 52345 56038 53805 46637 36017 23157 10692 987 -4350 -1800 -2919 -3414 -729 1929 3508
9963 3508 4942 6460 8593 9362 8339 5371 1931 -1085 -3641 -3384 -2959 -2233 -1123 327 1783 2576
9947 2576 3425 3844 3993 3792 3394 3133 2632 2673 2464 2960 2643 1903 318 -1813 -3137 -1736 -656 834 1979
9928 1979 2953 2982 2718 2907 3014 2756 1665 -450 -1730 -1133 75 612 266 -762 -2113 -2946 -2639 -2622 -3374 -3744
9908 -3744 -3052 -2878 -3097 -3718 -3888 -3702 -3426 -2349 -1345 6 1283 2141 2706 2550 2757 3301 4113 5131 5256
9889E256m74m02k27m43j007A04b275j800O80g92A111J137l2H81b049j368A443
9871G611N172L553R31j155m200m941p65J446K789P00l29k435K35m181A026f68
9854b095k89l21j06j050m08k28O52P16j29pO80L53n4P2f90B085K003j94j188A345
9833G10l2b93j178p15j458j48J055j74l77k43K28N44M14J090e22K24k3a24C51
9813H93P55l3o63b19j559j007m16p17J465A50K328J022l4j037H48e91o68k49C139
9793A1392R253Q110N605K573j268n448p752q746E899e5j274c94C46I7g04j897
9777b601j847J745e74A168J153J09r80B5a951j669J798d00A750L95G49A78J423
9760A601K479J386J25k088d4k098F06L504K031k58j591j153L14J416J114R62J26
$$ plain form
9889 5256 4782 4380 4153 3710 2703 104 -2275 -4075 -3395 -792 1111 2248 2216 881 -2049 -3417 1443
9871 7611 12783 16336 17267 16112 11912 6971 6206 7652 10441 11141 10812 8377 8612 4431 1026 -668
9854 -2095 -2384 -2705 -2811 -3861 -4269 -4497 -3845 -3129 -3258 -3265 -2585 -2232 -2286 -2214 -690 2085 4088 3894 2706 1345
9833 710 678 -293 -1471 -2186 -3644 -3792 -2737 -2911 -3288 -3531 -3303 -2759 -2345 -1255 -522 -298 -321 -124 351
9813 893 1648 1615 952 -219 -1778 -2785 -3201 -3918 -2453 150 2478 3500 3466 2429 848 -591 -1259 -1508 3139
9793 11392 20645 28755 34360 36933 35665 30217 22465 13719 5899 -55 -1329 -394 346 97 -704 -2601
9777 -2601 -4448 -2703 -574 1168 2321 2430 1450 25 -1951 -3620 -1822 -400 1750 2145 749 178 1601
9760 1601 4080 5466 5591 3503 -44 -2142 606 4110 6141 5883 4292 3139 3453 4869 5983 6945 7071
9743G071l2k12j050q22j218j071j087D55I1J562M654O149O498N326K960r41m197
9726B2102o703o660k521K887K879O4j616l361C028A024k63Q1C67a206k108j435
9710d749J223J370e14A114L96l53n35a045k504j495b164e0D47b38j298r96p23
9693c255o86J07J201a091D25L69K4B64a022r88l66a125d48k2o3b05G89J017P41
9674B547K18j08k1m02j56J77K65k65o16n9o3K84K37j56l41p51b12p91p34l07K06
9653a838M14k23n41qi4B941K918J044k61j927j839A213J46N26M5j95l91m12l92
9634E40e7p01q58k56b82B031K226K845K135J367O77n81j306j917j896j533j145
9617B903r44m16E90d97i4B362K984J542N12o97k160B221f52j537K36d67H11k60
$$ plain form
9743 7071 7039 6827 5777 4955 3737 2666 1579 455 91 1653 6307 12456 18954 24280 27240 26299 22102
9726 22102 15399 8739 6218 9105 11984 12048 10432 7071 3028 1024 761 842 367 -1206 -3314 -4749
9710 -4749 -3526 -2156 -514 1114 1510 1157 622 -1045 -3549 -5044 -2164 -50 447 -238 -1536 -2532 -3255
9693 -3255 -3941 -3834 -2633 -1091 425 794 818 264 -1022 -2010 -2376 -1125 -448 -470 -533 -205 789 1806 2547
9674 2547 2765 2657 2636 2234 2078 2255 2520 2255 1639 1580 1517 1801 2038 1882 1541 790 -212 -1003 -1737 -2044 -1838
9653 -1838 -1424 -1647 -2188 -2196 -94 2941 5859 6903 6642 4715 2876 1213 1359 1885 1930 1735 1344 932 540
9634 540 -57 -758 -1616 -1872 -282 2031 4257 7102 9237 10604 11281 10700 9394 7477 5581 4048 2903
9617 2903 1959 1543 590 -497 -94 2362 5346 6888 7400 6703 4543 2221 -652 -2189 -1953 -467 811 551
9599E51f49p06k89h16H97K063J069N17n55j650c48l747K001A840L335J833P87
9582G795n36k414k368B68f08J63J23k41l37o07o32p01l30L31O59P49g04c33p06
9563a039j406j576R05L80P25i08@D07K87d96k041M79F19Q06j2h83k936j071J993
9544b897k20k160K03f25B944K151k91k360a2j193P1K00d03j111l494k961R2c733
9525f95A133N342R620J3719Q933l5j1187A636K7151M4789M7390M4234K9198K2371
9511B16769J486j5875l0765l6444l8461l3273k3801j2323k894k171m819p418C240
9497c022n259N89K55J226L024P65k75l55r74m59O82O41Q51j253o62J884B054L322
9479E376K690m72l678b835j856B062O830N242L743N246P868L833m696O363J27
$$ plain form
9599 551 -649 -1355 -1644 -816 897 2960 4029 4546 3991 2341 -348 -4095 -2094 1840 5175 7008 7795
9582 7795 7259 4845 2477 268 -608 -445 -322 -563 -900 -1507 -2139 -2840 -3170 -2839 -2180 -1431 -704 -333 -1039
9563 -1039 -2445 -4021 -3116 -2736 -2011 -908 0 407 694 -496 -2537 -2058 619 1425 1413 -883 -3819 -4890 -2897
9544 -2897 -3117 -5277 -5074 -625 2944 5095 4804 2444 -12 -1205 -1134 -934 -403 -1514 -5008 -7969 -7877 -3733
9525 -695 1133 6475 16095 29814 38747 38712 27525 1636 28787 73576 120966 165200 194398 216769
9511 216769 218255 202380 171615 135171 96710 63437 39636 27313 24419 22248 17429 10011 3240
9497 -3022 -8281 -7692 -7437 -6211 -3187 -2422 -2697 -3052 -4026 -4485 -3803 -3162 -2311 -3564 -4226 -2342 2054 5376
9479 5376 8066 7594 3916 -2835 -4691 2062 8892 14134 17877 23123 30991 34824 30128 36491 36618
9464C6618J536n478q945n839q434C724A635j54N58J790J812J486M304M969O458
9449B2858P419O261K435o99m392p591r006q468A625c661l28R14o92j819j300J697
9433e189K274J339P59L84I06J189J774j754b094l139k764L196H07L085J450M465
9417I807Q424N878M901K9172P2205j939K45298J55005J35018R7344M1774k2335
9405G80552q2495j26022j47493j42797j19179G6735C6011j2448q334A852a926
9393B090j92a778m639k400J890J608R70N64l91o3J427J353O36o46j24M09c54A1
9374H02l89P12J137J324R99o4n60n37q85q23p31k32a29m75p41L5K39B32N38k31
9354E39B46e5o32j010j136q80r28J239a093A021J500N91M33l22j366b22k323o80
$$ plain form
9464 36618 38154 32676 23731 17892 9458 3724 1635 1481 2039 3829 5641 7127 11431 16400 22858
9449 22858 30277 36538 38973 38274 33882 26291 17285 8817 1625 -3661 -3989 -3075 -3767 -5586 -6886 -5189
9433 -5189 -2915 -1576 -817 -433 906 2095 3869 2115 -2094 -5233 -7997 -4801 807 3892 5342 9807
9417 9807 18231 24109 29010 58182 130387 128448 373746 528751 663769 761113 802887 780552
9405 780552 698057 572035 424542 281745 162566 76735 36011 23563 15229 1852 -1926
9393 2090 1898 -1778 -6417 -8817 -6927 -5319 -4349 -3785 -4176 -4239 -2812 -1459 -823 -1469 -1593 -1184 -354 11
9374 802 413 1125 2262 3586 4585 4521 3961 3424 2539 1716 985 753 -129 -604 -1345 -1310 -1071 232 770 539
9354 539 246 -55 -687 -1697 -2833 -3713 -4641 -3402 -1093 1021 2521 3112 3545 3223 1857 -222 -2545 -3225
9336c225Q54L27k41j31J082f63k42j042n23b17A539J415Q67L84K18L52k17j364
9318C194H88a790m61G24L208J232m48j198j756B58e41J18k61r27j381r55j146
9301e093J70Q23O54K80J19L17R58d28A007Q06l39a30k076j608k16K84J71j48l18
9282d041M76L31j46j177J04K206D11K383J781R51q9l38q31m70q79j357D29c61
9263e79k31m77d81A460J708Q39l42q38j308D57a01j39A11N09L23J84j79m18d7
9243a090j330m79q67L1L36P22J169e3A021K25l16F6a124k92K54K12Q8l2n62j219
9223b675j182k324K332a259G98J106NF50a290k150j734L52b233E34J717J559O58
9206D468l9k112a158c73e9k197E60d841j6497c265J230O34l09j781j89J549h97
$$ plain form
9336 -3225 -2371 -2044 -2285 -2416 -1334 -663 -905 -1947 -2470 -217 1539 2954 3821 4205 4423 4775 4558 3194
9318 3194 888 -1790 -2251 724 3932 5164 4716 3518 1762 258 -541 -423 -684 -1611 -2992 -3947 -5093
9301 -5093 -4923 -4100 -3446 -3166 -3047 -2730 -1772 -428 1007 1813 1474 -130 -2206 -3814 -4030 -3746 -3575 -3723 -4041
9282 -4041 -3565 -3234 -3380 -4557 -4453 -2247 411 2794 4575 5526 5437 5099 4268 3798 2919 1562 429 -361
9263 -579 -810 -1287 -481 1460 3168 4007 3665 2827 1519 457 -101 -240 111 620 943 1127 948 530 -47
9243 -1090 -2420 -2899 -3766 -3735 -3399 -2677 -1508 -53 1021 1246 930 66 -1124 -1416 -1162 -950 -862 -894 -1456 -2675
9223 -2675 -3857 -6181 -3849 -1259 798 1904 1909 650 -1290 -3440 -5174 -4822 -2233 534 2251 3810 4468
9206 4468 4429 2317 -1158 -373 -59 -2256 560 -4841 -21338 -3265 -2035 -1401 -1710 -3491 -3680 -2131 -897
9188a235r65j676j703J982c29A040K436R64qm92j717G20f82q36m57l65k36k91
9170b867K92j74Q34P67B36J078L41m65B68g22l43L39f1F4d83j345j844P49e52
9150A532J177j67j269c06j817j685j497j83J026J003J508G9K449J631J37q85j698
9133A713c13j720n57Po19j021m24K37J253J493C40J816J218m59I97a503k255j438
9115e196j240P07b365G29J997L44K95n62j010H42a261j056q42L35P72N51k74j291
9097c066j088J990c74H06M03j98d17k130r89h84H98K76l28h24J24K7p34p33p34
9078b874l65o9N56O59a031I1N86J14K91E04c73n66m77m08m45o58j91a384F80J294
9058A974l0D95a833k113J792i12l07j307q71a678a66A9e80n55p6o6n6e79E59Q51
$$ plain form
9188 -1235 -2200 -3876 -5579 -3597 -329 1040 3476 4440 4432 3940 2223 720 -682 -1518 -1975 -2340 -2576 -2867
9170 -2867 -2575 -2749 -1915 -1148 236 1314 1655 1190 268 -722 -1065 -726 -61 64 -483 -1828 -3672 -2923 -552
9150 1532 2709 2542 1273 -306 -2123 -3808 -5305 -5488 -4462 -3459 -1951 79 2528 4159 4296 3411 1713
9133 1713 -313 -2033 -2590 -2583 -3202 -4223 -4647 -4410 -3157 -1664 340 2156 3374 2915 997 -1503 -3758 -5196
9115 -5196 -6436 -5729 -2365 729 2726 3070 3365 2803 1793 842 -1261 -2317 -3159 -2824 -2052 -1501 -1775 -3066
9097 -3066 -4154 -2164 -374 806 1209 1011 -417 -2547 -3536 -884 898 1174 846 -824 -700 -673 -1407 -2140 -2874
9078 -2874 -3239 -3308 -2752 -2093 -1031 91 677 791 1082 504 -373 -939 -1416 -1824 -2269 -2927 -3118 -1384 680 1974
9058 1974 1944 495 -1833 -3946 -2154 -912 -1219 -2526 -3397 -1678 -166 19 -580 -1135 -1211 -1277 -1333 -579 559 1410
9038A410E60a070j251j194J184B91K616J756N64p89j195r79o03o29B00a167j243
9021b410l59P39i70d44l01q70N64B956M145L437J141n10k563l771I99a066n05
9004a571j86Q3N33a0A659J954J583Q04p48j449j688G74c66q60q66r29l62j14k45
8985c742K86P73O53Q16L16c32G50J163N53J46m25H47g66j275j175r73n78m75J272
8966c970R19K00m30q27Q81P26L01K13m27p61k64J641e7A476O75o30bk209j789
8947d000Q12R16J069M29m38j436k433b348I24K393J564J175q03j941r89r87H6
8929a007r17n72K37R10d83b01j45l29N1c00Q1D16J268J495Q69j1o97r65I45e0
8908b95C88O04j85a63k241j097R20Q67Q31c09A657J060K83l46q14p25D65a39n80
$$ plain form
9038 1410 560 -1070 -2321 -3515 -2331 291 2907 4663 5227 4438 3243 2264 1661 1032 200 -1167 -2410
9021 -2410 -2769 -2030 -970 -444 -745 -1615 -1051 2956 7101 10538 11679 11169 8606 4835 999 -1066 -1571
9004 -1571 -1757 -1674 -1141 -10 1659 3613 5196 6000 5252 3803 2115 774 -366 -1226 -2092 -3021 -3383 -3497 -3742
8985 -3742 -3456 -2683 -2030 -1214 -898 -332 750 1913 2466 2612 2187 847 -766 -2041 -3216 -4189 -4767 -5242 -3970
8966 -3970 -3051 -2851 -3281 -4108 -3227 -2501 -2200 -1987 -2414 -3175 -3439 -1798 -57 1476 2151 1521 -2 -2211 -4000
8947 -4000 -3188 -2272 -1203 -774 -1212 -2648 -5081 -2348 924 3317 4881 6056 5253 3312 2323 1336 86
8929 -1007 -1924 -2496 -2259 -1349 -483 -201 -346 -675 -624 -300 -219 416 1684 3179 4048 4037 3340 2375 945 -50
8908 -295 388 992 807 -163 -2404 -3501 -2581 -1714 -883 -309 1657 2717 3000 2654 1840 1115 465 -139 -719
8889g19J97D04J439N33o07H26q9N80k66L02R3k27k38C63h41k89N6M63b07H44Q65
8868A709M29o8o17C83d62m30m39l89r18q01J85O56N81M03l47o97k97J11O6m32
8848c210l46j015O46J578c43B150J849J436O22j13p48j323j592C12f44G22K019
8831B741J247p74A391d23p63J09c41F96J771J509N34r67j452I49C67a77C5R26
8813I61J185O47o19G07a369j743L96J158B86J659J324R41N63M0q45j815g46l054
8795c800J23a530b12A033R96J61q69e47j773Q8O53q37j480N78J529g4G57N28P81
8776B066O74m39G84b104j855e13A950R63r6L36K092K842J621M16r80j753j404
8759E987j847B060A01a563K45f52r57j820l566K201J806k238l794k613O19m42
$$ plain form
8889 -719 -522 404 1843 2376 1769 826 737 1317 1051 1353 1446 1219 981 363 -841 -1130 -1074 -611 -207 844 1709
8868 1709 2138 2070 1453 383 -462 -892 -1331 -1720 -2638 -3439 -3254 -2598 -2017 -1614 -1961 -2658 -2955 -2844 -2778 -3210
8848 -3210 -3556 -4571 -3925 -2347 -343 2150 3999 5435 6057 5944 5196 3873 2281 312 -644 722 2741
8831 2741 3988 3214 1391 -423 -1186 -1077 -341 696 2467 3976 4510 3543 2091 949 367 -177 35 961
8813 961 2146 2793 2174 707 -1369 -3112 -2716 -1558 286 1945 3269 4210 4773 4813 3968 2153 -746 -3800
8795 -3800 -3677 -1530 -212 1033 2029 2190 1321 -547 -2320 -2232 -1579 -2416 -3896 -3318 -1789 -74 757 1285 2066
8776 2066 2740 2301 784 -2104 -3959 -513 1950 2913 2817 3153 5245 8087 9708 10124 9144 7391 5987
8759 5987 4140 2060 101 -1563 -1318 -652 -1609 -3429 -6995 -4794 -2988 -5226 -9020 -11633 -11014 -11456
8743a1456n59O33e479B13N163j220f721j614A6706J5396J5021j445j1685A2420
8728A414K3295K5638K3680J1567J9094J0443k4584l5435K2275L6090o878l158
8716A03441K107K3324K2280J7720k8143k1166j2894p706k7719k3982B2808h269
8703H963K0468R163K055l073m229r283p808q13J302N045I653d199l797M3b156
8687D34J044a550k533q04J832a35B228J529N91j586E61b616l690J099A662P384
8671I046N625J945m812B55a82A3377O353N310K3204L0927M8103M7485M2572j211
8657B16120n41m267m6250m9383m2742l5616j7411k617m721E477k073O24j098e57
8642d268j491M1j937k284m579L398M004L153a680m04j162k669b269c24Q2q63q1
$$ plain form
8743 -11456 -12015 -11382 -5479 213 5376 4156 -6721 -8335 16706 32102 47123 45678 33993 12420
8728 1414 24709 50347 74027 85594 104688 115131 90547 55112 77387 113477 106599 103441
8716 103441 105548 128872 151152 168872 140729 119563 106669 98963 71244 47262 22808 -8269
8703 8963 29431 38594 40649 37576 33347 24064 16256 15443 16745 21790 9653 -4199 -7996 -7953 -2156
8687 434 1478 -1550 -4083 -4887 -3055 -135 2228 3757 4348 2762 561 -2616 -6306 -5207 1662 9046
8671 9046 14671 16616 11804 255 -182 13377 19730 25040 48244 79171 127274 174759 217331 216120
8657 216120 215579 211312 165062 115679 72937 37321 19910 17293 12572 5477 3404 4028 2930 -557
8642 -4268 -5759 -5718 -7655 -9939 -14518 -11120 -7116 -3963 -1680 -2084 -3246 -5915 -2269 -324 -242 -1105 -1186
8625a186J65l31K97C11J482J045P7j203e11p22j209n93L17Q1n88L78J123f8A640
8605C272M66o02j342G4a865j028K74j33j008L99b10B864J714o66A556b836m491
8588g327b530A423K668J104l3l94R3m57j525E96a733j990r60n61p21j29L02J504
8570d288K060C19K667J046j94j717e49k276k29r4J098i67C73J754J742K007J316
8553G192K88j275k445A209n25J293Q23J86n79A073g55j831j934q12J682f87A528
8535C723N03j732e87k975L08P65k3j074m27J884f04I2M6g44j127o00M98i39c87
8515c28j008j427q41P0n74j48o68m7N89Q95J525d96a24L2n99p10o56m01K13o95
8495b940j051r68J90O71M62m59R56R99Q29D56K007J783J219N3j10K41P52J323
$$ plain form
8625 -1186 -1021 -1352 -1055 311 1793 2838 2915 1712 -511 -1233 -2442 -3035 -2718 -2637 -3225 -2847 -1724 -68 1640
8605 3272 3738 3136 1794 74 -1865 -2893 -2619 -2752 -3760 -3361 -210 2864 4578 3912 1556 -2836 -7327
8588 -7327 -2530 1423 4091 5195 5162 4768 4861 4404 2879 596 -1733 -3723 -4683 -5244 -5965 -6094 -5792 -4288
8570 -4288 -2228 319 2986 4032 3838 2121 -549 -2825 -3054 -3148 -2050 -967 373 2127 3869 5876 7192
8553 7192 7480 6205 3760 1209 684 1977 2800 2986 2407 1073 -755 -2586 -4520 -5332 -3650 -687 1528
8535 3723 4226 2494 -587 -3562 -3254 -2489 -2512 -3586 -4013 -2129 -604 92 138 -744 -1871 -2471 -1973 -939 -387
8515 -328 -1336 -2763 -3604 -3534 -4108 -4256 -4924 -4971 -4382 -3487 -1962 -496 -124 -92 -691 -1401 -2057 -2458 -2245 -2940
8495 -2940 -3991 -4959 -4769 -4098 -3636 -4095 -3139 -2140 -1311 456 2463 4246 5465 5518 5408 5649 6401 7724
8477G724J127K11r30k165B514a341l825K536J180j02j356k247p04J328J637K97
8461b597Q06b41A072P17J56m84F76b83o22c66H29O73j17m98q0N66J093R34J002
8442D402K020J701P44k053C382f35j433J84j32n35j594j14N76R10a034G27O71
8425A398m69A03f69j439j886r65J456J185M5j418j788n46R11K028b70B225J259
8408C484m46F59c711J503B262L421J566q34k643A26c619L32I94N317K785J48k757
8391F487A927c863j552a021B863K232J45j799A100J967N096K896J73M89N585M348
8375B1654K040K743M687J2500J2077M299K857O029J0387K0845K8571L4260L8489
8362B01438M2039M2712L8537K7976J1884o841k6978m1792m7831m3853l2928k6655
$$ plain form
8477 7724 8851 9062 8132 5967 2514 -1341 -5166 -2630 -1450 -1552 -2908 -5155 -5859 -4531 -2894 -2597
8461 -2597 -1791 -241 1072 1789 1945 1461 676 -283 -905 -366 829 1502 1385 887 807 1373 2466 3400 4402
8442 4402 6422 8123 8867 6814 3382 -635 -2068 -1884 -2016 -2551 -4145 -4259 -3683 -2773 -1034 727 1398
8425 1398 929 103 -669 -2108 -3994 -4959 -3503 -2318 -2273 -3691 -5479 -6025 -5114 -3086 -270 2225 3484
8408 3484 3038 659 -3711 -2208 2262 5683 7249 6415 3772 126 -3619 -3287 994 6311 9096 9244 6487
8391 6487 1927 -3863 -5415 -1021 2863 5095 5240 3441 1100 3067 8163 11059 11232 11721 17306 21654
8375 21654 23694 26437 31124 43624 55701 60000 62857 68886 79273 100118 128689 162949 201438
8362 201438 243477 286189 324726 352702 364586 357745 330767 288975 241144 197291 164363 137708
8350A37708k4486k2802j7858j1979j0225j2170j8049A0052N500L612k111m849
8338A2204m387k385K274J456l369b96l850C794O963J336l138A531e988h01D018
8322D959B441a942k61A521J053F02c344k342a80C019j087B86a898j276J6K09N68
8305b381Q56o29k093L54a147A123P26l83e5j505o59P46e47D48L73q7e4j249j064
8286b367r0O6k63k170J027b55A212J67A79a013c58I40K23b67k203q86a253E33
8267E04a580k820J274d53F19o9B55J083K497K618J927L94o53j800k807C09a639
8249d22A932J617k45A505a091k148o55ko61J499O92ML4N68C58K760K821J714N06
8230H159j191k020A406e479K641A4758K1551K1876J7979J0905J168p534j4979
$$ plain form
8350 137708 113222 90420 72562 60583 50358 38188 20139 10052 15552 19164 17053 12204
8338 12204 7817 5432 7706 9162 5793 -296 -4146 3794 10757 12093 8955 1531 -5988 -801 4018
8322 4959 2441 -1942 -2203 1521 2574 602 -3344 -5686 -180 3019 1932 286 -1898 -3174 -3158 -2949 -2381
8305 -2381 -1525 -2154 -4247 -3893 -1147 1123 1849 1466 -55 -1560 -2219 -1473 -547 448 821 734 -54 -1303 -2367
8286 -2367 -2457 -2391 -2654 -4824 -3797 -255 1212 1379 179 -1013 -358 940 1163 -267 -2470 -3356 -1253 533
8267 504 -1580 -4400 -3126 -453 619 550 255 1338 3835 6453 8380 8774 8121 6321 3514 309 -1639
8249 -422 1932 3549 3304 1505 -1091 -3239 -3894 -3896 -4557 -3058 -2366 -2362 -2328 -1760 358 3118 5939 7653 8159
8230 8159 6968 4948 1406 -5479 -2838 14758 36309 58185 76164 87069 88237 80703 65724
8217F5724j8389j7952j3434n781n36K116M108L233J517j335j371j17J851M740
8203B4374L576J810k216o337j0077B736c86D800P558O155K640q98k873l680l176
8188A0526k464j950j663n48k87j794a605d84D579K920k005a261p385L356G873
8172B0618R322P743M908J727q94l953n782o668p388p534n888A971f41j249Q37
8157a053l25j967l669K530c08C133K310N6k396i88A509Q914J0273R024P165N974
8141D2859M513K438p83m560q125j0483j0526p574j515J385Q09o14j525j977j605
8126B717r06M23N70l03H36a393j87F39J073o90a908j729G16K939Q57l51p88l94
8108B979n35N93K336L224J932q95l323A376h97D793R509R542Q624P692N663L236
$$ plain form
8217 65724 47335 29383 15949 10168 9632 11748 15856 19089 20606 19271 17900 17783 19634 24374
8203 24374 27950 29760 27544 21207 11130 2736 -386 4800 12358 18513 21153 20255 17382 13702 10526
8188 10526 8062 6112 4449 3901 3614 1820 -1605 -484 4579 7499 5494 -1261 -8646 -5290 7873
8172 20618 29940 37683 42591 44318 43424 39471 33689 27021 19633 12099 6211 1971 -641 -1890 -1053
8157 -1053 -1378 -3345 -7014 -4484 -308 3133 5443 5499 3103 -988 1509 10423 20696 29720 36885 42859
8141 42859 47372 49810 49027 44467 36342 25859 15333 7759 6244 7629 8438 7824 6299 4322 2717
8126 2717 1811 2234 2804 2501 836 -1393 -1580 639 1712 1022 -1908 -3637 716 3655 4512 4161 3373 2979
8108 2979 2444 3037 5373 8597 10529 9634 6311 1376 -897 4793 14302 23844 32468 40160 45823 49059
8092D9059q25m106p112o918n977o400p586l708O585J3695Q520N617J515j883n300
8077C5176q338j0014G413k455J032j477A840K282P638N210j024o188n7R018O509
8062B5228l794m891J8238L0214K5299J9814L5459P5205J09862J21330J05978O7076
8050F25018J3530m0580q5124j11076j14402r7179o7236l7978k2977k0523j8968
8039B2505p222P242O604R61n499q594n537K346M431J120j586J01P297J2135J0215
8024D6519N653K154q29j287N21j799p477j1093o195n54l45l367m117r17J284M609
8008B2760J0709J2297O679k431l919K313J1277K0142L1606L9196M3862N9749J15637
7995C69877J91770K44298K51486K03717J08537j0294j26577k14826k58800k53168
$$ plain form
8092 49059 48234 44128 37016 30098 24121 17721 10135 6427 13012 26707 35227 40844 42359 40476 35176
8077 35176 26838 16824 7413 4958 5990 4513 1840 4122 11760 16970 15946 9758 9701 18719 25228
8062 25228 21434 16543 34781 64995 90294 110108 145567 220772 330634 451964 557942 625018
8050 625018 638548 597968 512844 401768 287366 190187 122951 84973 61996 41473 22505
8039 22505 15283 22525 29129 30090 24591 15997 10460 12806 17237 18357 16771 16872 24169 36304 46519
8024 46519 52172 54326 53497 52210 52731 50932 43455 32362 26167 25613 25268 21901 17784 16867 18151 22760
8008 22760 33469 45766 52445 50014 46095 48408 59685 79827 111433 150629 194491 254240 369877
7995 369877 561647 805945 1057431 1261148 1369685 1359391 1232814 1017988 759188 506020
7985E06020k09098j46734E2858A0391O4834M9001K3845l753k3586k8930k3126
7974F8676j5439j1071o393r5p17l422q965A1104D969L416N012O05n448A277c757
7958A591L645O54j497f20j619r43a565E56K701J648a973p595j288c558A172L981
7942E153K946K023J3491p848E909A723L097j31K547J9759K8397L1796K8190J9701
7928A35079Q100j8732k7484j6956k4686k7462H488l362A275b181p963p91L190
7915g745K908a573C222J168A690a96k58p43j338m62C47J377n71h25k636l350K890
7898c921a045K78k581m671c12I372M117k574A953e496F86P996O945K234L12L977
7882B2150J1277J2709J0268J909o612j4464A6180b567F44J1344Q993N302j034
$$ plain form
7985 506020 296922 150188 52858 10391 75225 124226 148071 144318 120732 91802 68676
7974 68676 53237 42166 35773 35678 34961 31539 22574 11104 4969 8385 13397 14002 8554 1277 -3757
7958 1591 5236 5890 4393 -620 -2239 -3182 -1565 556 3257 4905 -1973 -9568 -10856 -3558 1172 5153
7942 5153 8099 10122 23613 15765 5909 1723 4820 4689 7236 26995 55392 87188 115378 135079
7928 135079 143179 124447 96963 80007 55321 27859 8488 5126 1275 -2181 -10144 -10935 -7745
7915 -7745 -4837 -1573 3222 4390 1690 -196 -454 -1197 -2535 -2997 347 1724 1153 -825 -3461 -6811 -3921
7898 -3921 -1045 -767 -3348 -8019 -312 9372 13489 10915 1953 -5496 686 8682 15627 17861 18173 22150
7882 22150 33427 46136 56404 58313 51701 37237 16180 -2567 644 11988 20981 26283 25249
7869B5249m775o383n647j218p2j332B148c553j950M84Q17F86b975j987A91d274
7852i72G852N591N201L398M638J0100Q311m64q245r454p414J888j224k599m273
7837A3306P4N780M172M388N7j1591P577n872o960n111B586K9l35c609j661b46
7820D646M123Q17M511R766Q082Q727J2396L1189M9767N5606N1248L6279R737j7576
7806B69318l9654n2576n2762m4076k9715j4935r392o109l514J020L736J976q61
7793B2456m332o128l797J697L755J576j474E324d699j1780P946O29b442A3605
7778B4186P966l975k31G313L0657L389L022M046M078L10k1286j4205j653N538
7764B1209o302p031G29i088E451K0727K3530J1355j583j6237j9662H371e403j1083
$$ plain form
7869 25249 20474 14091 8444 7226 7154 5822 2148 -3553 -5503 -5019 -4202 686 -2975 -4962 191 -4274
7852 -972 7852 13443 18644 22042 26680 36780 45091 44627 36382 26928 19514 21402 20178 17579 13306
7837 13306 13380 19160 23332 27720 27777 16186 23763 17891 10931 5820 2586 2615 2280 -3609 -5270 -246
7820 4646 8769 9586 14097 23863 31945 40672 53068 84257 134024 189630 240878 277157 286894 269318
7806 269318 229664 177088 124326 80250 50535 35600 26208 20099 16585 17605 21341 23317 22456
7793 22456 18124 11996 8199 9896 13651 15227 13753 5324 -4699 -16479 -8533 -7904 -2442 13605
7778 24186 32152 28177 27946 7313 37970 41359 44381 48427 52505 52815 31529 17324 15671 21209
7764 21209 14907 7876 729 -9088 5451 26178 49708 61063 59480 43243 23581 8371 -5403 -16486
7750a6486j50P229b887H31k1c392n611l48c458a266iF384M485J586j641k632l688
7733D494a76l007D001J0379P357K054l387n685F238a7F06L245J337k135J08K841
7717F002L671j269C163a232B710M329M02k358A981J77M320N586M231O81k103n444
7701I429C100h30B677N023K259o27R2J05r73l780H38M274O994L048R62J193K093
7684A9402K084J086R78L32j872n139m584K148M865K404j361l415J440Q907Q375
7669C5650L592m60r83k439n741n330R887J9003J2886L510m875r736k0478r959
7655B4527D954O259K3517K5826K8770J9430J201j5027l268K5354L0830o92K273
7642A49427K8354L4392R618j417L0059M4881J4626L3764J63995K25347J43337
$$ plain form
7750 -16486 -16636 -9407 -2887 831 810 -3392 -9003 -9351 -3458 -1266 -9 6384 10869 12455 10814 8182 4494
7733 4494 -176 -3183 4001 14380 21737 23791 20404 14719 6238 -17 606 3851 5188 3053 3161 6002
7717 6002 9673 8404 3163 -1232 2710 7039 7441 5083 1981 2158 6478 12064 16295 16976 14873 9429
7701 9429 3100 -830 2677 7700 9959 9332 9424 9529 8556 4776 838 5112 12106 15154 16116 17309 19402
7684 19402 21486 22572 23550 23882 22010 16871 12287 14435 19300 21704 20343 16928 18368 27275 35650
7669 35650 39242 38782 37799 35360 29619 24289 34176 53179 66065 69575 64700 54964 34486 24527
7655 24527 4954 11213 34730 60556 89326 108756 109957 94930 91662 117016 147846 147154 149427
7642 149427 177781 212173 221791 220374 250433 295314 309940 343704 507699 733046 876383
7631H76383Q2778M35311J102207J597523J821180J754585J415139Q61836J82601
7622A0129543n18000j138808j589262j801618j740812j406459q15701k03132o0387
7613H55364j63727k02380j27484o4912q4562q9398J8336N8900J1708k3161k3456
7602A65228n492q784k0521j8036n183n568j0871j3033j0253q709n326Q379J2709
7589G4540N819m010o415q281j5399k1044k635K1002J4592K485K22N419N780r77
7575G1098j113J0477J5577L361j3664k1157l365J0271p445A8555M0525J22596
7563A81676J35213J24095Q8925L6464k2605p6226j11920j20744r6929m5594q371
7552H3984r369j3430o608j770j070P619J8416J4752P8j6446k1064j80K5856L2725
$$ plain form
7631 876383 959161 1394472 2496679 4094202 5915382 7669967 9085106 9946942 10129543
7622 10129543 9611543 8472735 6883473 5081855 3341043 1934584 1118883 915751 855364
7613 855364 691637 489257 361773 296861 212299 122901 141237 200137 211845 188684 165228
7602 165228 159736 150952 130431 112395 107212 101644 90773 77740 67487 58778 53452 61831 74540
7589 74540 80359 76349 69934 61653 46254 25210 22575 43577 58169 60654 60876 66295 72075 71098
7575 71098 69985 80462 96039 99400 85736 64579 61214 71485 64040 18555 59080 181676
7563 181676 316889 440984 529909 566373 543768 467542 355622 234878 137949 92355 83984
7552 83984 74615 61185 54577 52807 51737 59356 77772 92524 92602 76156 55092 54912 80768 113493
7538A13493L0304K5688J6763K307j7180l6037m4425l6238j1666k627j0597A1837
7525A3544J0137M59m164j535R71j523j02J304n185a332B669K3548J4318K97j1040
7510B9792j3053j968O790P998O330M84p681r828l852l973C994L547J3491J0884
7496C1916m075H316b818A9617J3287K074l798p428A0070b685A7870J8172N112
7483D1154o481j0383n365l774j588R607J1201J031p814q53R419K375j1260A3053
7468A8757O032p732F577J3132J0899l732j1432o856o73l763J5181K2223J1529
7455E3085n746j6224o356L668m648m046J1799Q105p181j671K8863K6563M858j7520
7441G3549j8799O822J7511R221J711l674j2295k2486j8811L102P572o74J387O736
$$ plain form
7538 113493 143797 169485 186248 188555 171375 135338 90913 54675 43009 40382 29785 11837
7525 13544 23681 24140 19976 18441 19412 17889 17787 19091 13906 -1332 2669 26217 40535 40832 29792
7510 29792 16739 14771 21561 29559 35889 36373 28692 18864 15012 11039 3994 7541 21032 31916
7496 31916 27841 8316 -2818 19617 32904 34978 31180 23752 10070 -2685 17870 36042 41154
7483 41154 34673 24290 18925 15151 13563 23170 34371 35402 27588 26735 36154 38529 27269 13053
7468 18757 24789 17057 6577 19709 30608 26876 15444 8588 7915 4152 19333 41556 53085
7455 53085 47339 31115 24759 28427 23779 19733 31532 39637 32456 30785 59648 86211 91069 73549
7441 73549 54750 61572 79083 88304 90015 86341 74046 51560 32749 35851 43423 42749 44136 50872
7427E0872M949K819N794K122j7108A8042J8834L2288K787k7595c073F819L1914
7414C8733J2619p311m479J8618K3979K0659J0336j3317l7701B9822K2300J6815
7402F8937j9421A4657K2891L0101l400j8897J2746K0437o464k4862J0673K4154
7390H2036r803B4470o845M4228O983j6397J8483L0155o089m1597K837M5310P083
7377A08621m0208j8039M5525J4804l4848k7596M4867J8385l5667l6382M8085K9436
7365A16983j8720j6498L2698J0234n4443D314Q9582L5005l1582j9561P3422L8423
7353A89603m2626n9766O4493N5534l5779q4724N0503P6033j6313o9872M2301P1747
7341B41134k8563H5726j5397J00201o163n2067J11146J04683l7347A40032M4431
$$ plain form
7427 50872 55821 58640 64434 66556 49448 18042 36876 69164 71951 44356 -3073 6819 38733
7414 38733 51352 44041 39562 58180 82159 102818 113154 99837 62136 29822 52122 68937
7402 68937 49516 14657 37548 67649 64249 45352 58098 78535 72071 47209 57882 82036
7390 82036 72233 24470 17625 61853 68836 52439 70922 101077 94988 53391 56228 101538 108621
7377 108621 68413 50374 95899 110703 75855 48259 93126 111511 75844 39462 87547 116983
7365 116983 98263 81765 114463 124697 70254 4314 93896 128901 97319 77758 151180 189603
7353 189603 146977 87211 151704 207238 171459 86735 137238 213271 196958 127086 169387 241134
7341 241134 212571 85726 70329 170530 164367 112300 223446 328129 290782 140032 184463
7330A84463J57181P711j35584P863J68277K2290j57094l2162J99476M3151j75270
7319B90302m1849K53366P0357j96756r3817L01553J10441k06567j37725L63038
7309G12343J64334k43884k15360M55070K60277k72827l47494N61082L92160k98439
7299A167262n09576P60122O14732l01137p27996R54879R87996k99998j111074
7290A535210J300197J683658k13540j702822K131137L336564K18714l054469M112877
7281I347526Q578607K954357n660082J6231747M7765841O2622300O5075755N3834467
7273B60750518L0440029r5413l0599717n3911478o5054138o2491992C1477973
7265A5326728N503195k972878q534192m169241K968973k58109l334617k034042
$$ plain form
7330 184463 341644 349355 213771 221634 389911 412201 255107 222945 422421 465572 290302
7319 290302 248453 501819 572176 375420 281603 583156 693597 487030 349305 712343
7309 712343 876677 632793 417433 872503 1132780 859953 512459 1073541 1465701 1167262
7299 1167262 657686 1417808 2032540 1731403 1003407 1958286 2946282 2646284 1535210
7290 1535210 2835407 4519065 4305525 2602703 4733840 8070404 8289118 5234649 9347526
7281 9347526 17926133 20880490 15220408 31452155 79217996 141840296 206916051 260750518
7273 260750518 291190547 291095134 260495417 206583939 141529801 79037809 31477973
7265 15326728 20829923 17857045 9322853 5153612 8122585 7864476 4529859 2495817
7257B495817J777769K05316j672671j278807J102906K88387r85058I26595P09353
7248A635948L06150n73813o77078N00960K79780l93454D93476L09747K65265k46424
7238H22064C88152K21811K35173j61462C18697J25842K08612j04056B60537R4602
7228C55139J92087o3268B40389L3826J81167k0134j84819k0029J47630o613j70066
7217B01351o4850J56205K6981j25369m4372J91461J34241L5290k2244m7405o7598
7206C73691p6614k8787K1765k6067j03873p5066R7626O2220m3600p4673N3091
7195A79713O3190k8898q0460M1680P9307q978o8312K2361O2362l2034j11847J8630
7183A36714J02477j3195r5372Q1641J25002n211j19624P4410J81933J6977j11795
$$ plain form
7257 2495817 4273586 4478902 2806231 1527424 2630330 2918717 1933659 926595 1635948
7248 1635948 1942098 1368285 691207 1192167 1471947 1078493 493476 803223 1068488 822064
7238 822064 388152 609963 845136 683674 318697 444539 653151 549095 260537 355139
7228 355139 547226 483958 240389 274215 455382 435248 250429 230400 378030 371417 201351
7217 201351 136501 292706 319687 194318 149946 341407 475648 510938 488694 441289 373691
7206 373691 297077 268290 290055 263988 160115 85049 182675 244895 201295 126622 179713
7195 179713 242903 214005 133545 175225 254532 245554 177242 199603 261965 229931 118084 136714
7183 136714 239191 225996 130624 212265 337267 332056 212432 286842 468775 485752 373957
7172C73957K0054J55918j2317j98295P2003L10832Q9336k18774n3165L48385J24390
7161A012324k40272n2909M58551K14476k87426j80139O30515L07410m61194k05697
7151A195639J139919O57966n40445j25285K014939J292573q18931K20607N218845
7142A0255827M679871L17632L447295K4036269L9970078M7335751M5250608L3653526
7134B08946857J4363284q257327k8888429m3020152m7930643m3160445B2136805
7126A3666184J330437k796554m231312j087086K38236j395937k215996m31593
7118C076379N63405n53860j292613j50007O48762n2496n62346o4905K42046q0311
7108A774054m63329j21437K44406l5642m64711C29744r0117J00690j66408O522
$$ plain form
7172 373957 394011 549929 537612 339317 411320 722152 811488 592714 539549 887934 1012324
7161 1012324 772052 719143 1177694 1392170 1104744 924605 1555120 1862530 1401336 1195639
7151 1195639 2335558 2993524 2453079 2327794 4342733 5635306 4816375 5036982 10255827
7142 10255827 14935698 15253330 18700625 42736894 82706972 130042723 175293331 208946857
7134 208946857 223310141 215052814 186164385 143144233 95213590 52053145 22136805
7126 13666184 14996621 12200067 7968755 6881669 7119905 5723968 3507972 3076379
7118 3076379 3639784 3085924 1793311 1643304 2292066 2239570 1677224 1612319 1854365 1774054
7108 1774054 1310725 1189288 1433694 1398052 933341 329744 239627 340317 173909 180431
7098A80431J76356n7460j33346L18079K79299J8241j65655j02997P3346k1038
7088E65256j75985q8739J30959L5879j22867m7517J22264K2851j48446j18135
7078A75520J08041M5104j00690m3919J36270N9530p5419o7812N4558j1225A24834
7066H9243J95510M5672j00940l4181J26425K4830j27901n6809J55128M0973j25461
7055B32489l9152J67386M6815j30272q0071J75265O2148j31074o2268J94022O9132
7044E04420j52032r5288K37394J02107j64914r9338L10879J72955j38465q9161
7034E88557M69313N06445K22228o3830j72915q4272J12830K91041K53558q5780
7024B037175n23741m35139M24619M25590j50802l99463K45448L40510m51363D81202
$$ plain form
7098 180431 356787 299327 165981 484060 763359 781600 615945 512948 586294 565256
7088 565256 389271 300532 431491 467370 344503 296986 419250 442101 293655 175520
7078 175520 283561 328665 227975 184056 320326 379856 304437 236625 291183 279958 124834
7066 89243 284753 330425 229485 195304 321729 346559 218658 161849 316977 357950 232489
7055 232489 193337 360723 407538 277266 197195 372460 434608 303534 241266 435288 504420
7044 504420 352388 257100 494494 596601 431687 332349 643228 816183 677718 588557
7034 588557 1057870 1564315 1786543 1722713 1549798 1465526 1578356 1869397 2122955 2037175
7024 2037175 1513434 1078295 1502914 1928504 1777702 1378239 1623687 1964197 1512834 481202
7013A665149J060059j64304o37246J268844J435557l47686j675331K084962L144396
7004G834400Q7207l006910M137386Q167608K580514n675732J6287987M5945425
6996G6357885N9704003O1657952N0594115K8128302r47886k9784565n1618233
6989A94091573o1817381n9044387B8624632j4218992N286420l062884q179029
6982H450147l531339K928343l58968l256391j808447J760974J63027j640232j275400
6973A431714J009465K35684r89063H04228Q36744L00255n77828o64064M81680
6964A181015K56591l99860D75130L42396K55323k47042D07509K31373K24784j81609
6954F82057C18232J66686K19088j11347B89443Q7608K00685o3410k51237K2157
$$ plain form
7013 1665149 2725208 2560904 1923658 3192502 4628059 4280373 2605042 4690004 7834400
7004 7834400 7921607 4914697 9052083 17219691 19800205 14124473 30412460 76357885
6996 76357885 136061888 197719840 248313955 276442257 275494371 245709806 194091573
6989 194091573 132274192 73229805 28624632 14405640 19692060 16629176 8450147
6982 8450147 4918808 7847151 7488183 4231792 2423345 4184319 4347346 2707114 1431714
6973 1431714 2441179 2676863 1687800 804228 1640972 1941227 1363399 699335 1181015
6964 1181015 1437606 1037746 475130 817526 1072849 825807 407509 638882 863666 682057
6954 682057 318232 484918 704006 592659 289443 377051 577736 514326 263089 285246
6944B85246J77182l2206j92828J6989J59313j8949j80908m3745J48577J0892j33780
6933A95783m7214J26353J7366j12331n2876J08136K1004r5149m9548J04426K8018
6922B43968q6100G7178R4289M2179o1124p0876P3837M1334n0436G2984N6732M2849
6910A72565l8622o6661N0241M7336k7553F6133J7205M4413j6959m7364L0824L9288
6898A33540k0712D9545J8966M8700p618n1790M903M5213j977m8438r278M2998
6886I1224K879l9732j2672L4978J689l7081k030M4258Q614l4322k4871L5029J4810
6873H2773k2662j9343K3918P771k8130B1988L7874J7583k0762B2985J8389J8238
6861E9612j4527k1993K1047J7868j3442B0781J1662J5816j0366A2915K8555K1790
$$ plain form
6944 285246 462428 430222 237394 254383 413696 394747 213839 170094 318671 329563 195783
6933 195783 148569 274922 292288 179957 127081 235217 256221 161072 111524 215950 243968
6922 243968 157868 77178 171467 213646 152522 81646 155483 196817 146381 72984 129716 172565
6910 172565 133943 67282 117523 164859 137306 66133 83338 127751 110792 63428 94252 133540
6898 133540 112828 49545 68511 117211 109593 57803 62706 107919 105942 57504 48226 91224
6886 91224 94103 54371 41699 76677 78366 41285 39255 83513 92127 57805 32934 67963 82773
6873 82773 60111 40768 64686 72457 44327 21988 59862 77445 56683 22985 41374 59612
6861 59612 45085 23092 44139 62007 48565 20781 32443 48259 37893 12915 41470 63260
6849F3260p658B6399J045K0493j823B1924J309K3239J345j9720r461J4344R56
6836C3936j4003M857J7022m90j8278m197J6726m67A5332m634K4125P099j2703
6823B9219j3366J3074O854j0689r506J3622O988j0405A1056R501O014j1117m863
6810A0591K1682J1318p193j5979o8O428o981H754J2797J2029l506j2523L150J2413
6796C3114J255r070p087j960G349A664K0022J3588j160j2452m709O918l102E294
6781C235J5787M464r794n955Q313K392o908J745J1433K295j0458E884R888O206
6767B1978o652D660O520Q826j35j118O406P861L477L509K248k551m417L957R964
6752D9207K512j0965j6447l609N274j044J861J6606J4344k896k4637i774C4208
$$ plain form
6849 63260 55602 26399 27444 47937 46114 21924 23233 46472 47817 28097 18636 32980 33936
6836 33936 19933 24790 41812 41322 23044 18847 35573 35106 15332 10698 34823 41922 29219
6823 29219 15853 28927 35781 25092 15586 29208 36196 25791 11056 20557 26571 15454 10591
6810 10591 32273 43591 36398 20419 20351 26779 19798 8754 21551 33580 30074 17551 20701 33114
6796 33114 34369 25299 18212 16252 7349 1664 21686 35274 34114 21662 16953 23871 20769 5294
6781 3235 19022 23486 13692 7737 16050 18442 11534 13279 24712 27007 16549 5884 15772 21978
6767 21978 15326 4660 11180 20006 19871 18753 25159 33020 36497 40006 42254 39703 35286 39243 49207
6752 49207 51719 40754 24307 20698 25972 24928 26789 43395 57739 54843 30206 -9774 34208
6738G4996K8876J5603J959p097j3744k0466k5352k6955A0097Q123P934m059H883
6724b97G568L313j643M506O331k74q026n174M833K638n228D259N682K477m839
6709G579j501Q056M837n720A691M736J1654N329k84k082l196m453L31N791L270
6694B2787l959p677k168J232l473k21J3441J2559N435o04O23N864J266r887N999
6679D1217K059J3711J6166K0711M4628L8562L2245J6462m124j9396m8481l5690
6667A18070m8042k7316o975J4511K199r111o157k07O111O37j1157A5943B531h28
6652D404L335J009l273b187j15G657M000l761B402R55K858j755A137N66L09b234
6635b363H593O781l65o047A816o79K026J529K511J491k790A039K297N886K75B943
$$ plain form
6738 74996 103872 119475 121434 114337 100593 80127 54775 27820 10097 18220 26154 22095 8883
6724 -297 7568 10881 9238 13744 20075 19801 11775 6601 11434 14072 8844 4259 9941 12418 7579
6709 7579 6078 14134 18971 13251 1691 6427 18081 23410 23126 21044 17848 13395 13726 19517 22787
6694 22787 18828 11151 8983 10215 6742 6521 19962 32521 37956 37352 37975 43839 45105 35218 41217
6679 41217 43276 56987 73153 93864 138492 177054 209299 225761 221637 202241 153760 118070
6667 118070 70028 42712 35737 50248 52447 43336 37179 36972 43083 43720 32563 15943 2531 -828
6652 4404 7739 8748 5475 -2187 -2302 7657 11657 7896 2402 3357 6215 4460 1137 1703 2012 -2234
6635 -2363 8593 15374 15009 8962 1816 1137 3163 4692 7203 8694 5904 1039 3336 9222 9497 2943
6618f774K564A088L428L091J581j240B765o88N358K093l845a156a40C977J301
6603E278j547A351b772n736a807F342K649l880F16M653N745r62C176c210A031
6587B721A073N86M648K901J58j423K6M67j008j288O86L716M049K120k551o713
6571G447b75A905M793j46A223f308K998B019N214M174M42m837b891a63H491O83
6555I174m510Q547J9369J7798J1386L839j846o375r157j1110j1378j1224C260
6541d888B244J0703R930R475P947K367m422j0367j1491F636B606k58N82a571j725
6526c296p300r507J903L496N024k81j324k787j598L809b845A082M217L811J337
6511A0447k756B354H86L196K287Q26N560R773R689O407M239K840j651M49J0080
$$ plain form
6618 -6774 -4210 1088 4516 7607 9188 7948 2765 2077 7435 9528 5683 -1156 -140 3977 5278
6603 5278 3731 1351 -2772 -8508 -1807 6342 8991 5111 616 5269 11014 10052 3176 -3210 1031
6587 2721 1073 1659 6307 9208 9366 7943 7969 8436 7428 6140 6826 10542 14591 16711 14160 7447
6571 7447 -275 1905 6698 6552 1223 -6308 -3310 2019 7233 11407 11849 7012 -2891 -163 8491 9174
6555 9174 4664 13211 32580 50378 61764 65603 63757 57382 48225 37115 25737 14513 3260
6541 -4888 2244 12947 22877 32352 40299 42666 38244 27877 16386 6636 2606 2348 2930 -1571 -3296
6526 -3296 -10596 -20103 -18200 -14704 -9680 -9961 -11285 -14072 -15670 -11861 -2845 1082 5299 9110 10447
6511 10447 7691 2354 886 4082 6369 7195 12755 22528 32217 38624 42863 45703 44052 44501 54581
6496E4581Q953O11j853j1116j8037A2015C696K0262J9169J0686M301L49o816j0601
6482D1046j6613G179c253k705j23m05b208A204d36k198A59M704L858J565Q38N48
6466A1672k632C961I06R498J5487J9287K0752J8654J2467L846m653j0403j2582
6453G3259j0027p166k136K054l92l313p710p913j0473q801p743D707K236Q614
6439A5557L063r15G487d471J114F705O087j031E781a9r37j77B634J6173J8127
6424C6934J4243J0623N272J967L44j475o930j3247j6868j4893p776l709c496r247
6410a2743d519d80n34k03D740P101M057J558l70n157A900f39A1745R441K016n722
6394A7480q237K1O214M101J514K250K090n2J15Q442J7030J7979Q640l599j5200
$$ plain form
6496 54581 63534 64145 62292 51176 33139 12015 3696 23958 43127 53813 58114 58463 51647 41046
6482 41046 24433 7179 -3253 -5958 -6081 -6486 -2208 1204 -436 -2634 159 4863 8721 10286 11124 11672
6466 11672 9040 3961 906 10404 25891 45178 65930 84584 97051 100897 96244 85841 73259
6453 73259 63232 56066 53930 55984 55592 52279 44569 36656 26183 17382 9639 4707 6943 15557
6439 15557 18620 17705 7487 -4471 -3357 6705 12792 11761 5781 -19 -956 -1133 2634 18807 36934
6424 36934 51177 61800 67072 69039 69383 67908 60978 47731 30863 15970 8194 4485 -3496 -12743
6410 -12743 -4519 -480 -1014 -1217 4740 11841 15898 17456 17086 11929 1900 -639 11745 21186 23202 17480
6394 17480 9243 9264 15478 19579 21093 23343 25433 25381 25496 33938 50968 68947 77587 73988 58788
6379E8788j5139K702J7971J8359R201m175j9748j9114Q897K3374Q669k4234A6403
6365B9852O7104M8659L3623J7127K5089O5150J43404K32156K82499K83956K35511
6354A464130J52693N6312l5241j08879j65463k07584k36627k44116k22357j59151
6344B93717p2964p818r638k8339k6381p711J4584M5472P0196O8397L5724j9468
6332C55771p6471j14572F4481L0107P1966O4017M9166L4864L2104K8151J8588
6321C93444J4990N3919J89194L20284L66915L11848J72523j371j49590j93823
6311A478333r9971L166j74j09204k49094l19115l32138A04051C7322M8581M0549
6300A26452L9691K9238N609l4471n5048l7770q215J4867P937n170j0663N760K1191
$$ plain form
6379 58788 43649 46351 64322 82681 91882 87707 67959 48845 57742 81116 89785 65551 16403
6365 29852 96956 145615 179238 196365 221454 286604 430008 662164 944663 1228619 1464130
6354 1464130 1616823 1673135 1637894 1529015 1363552 1155968 919341 675225 452868 293717
6344 293717 220753 212935 203297 174958 148577 140866 155450 200922 271118 339515 375239 355771
6332 355771 279300 164728 64481 94588 166554 230571 279737 314601 346705 374856 393444
6321 393444 408434 462353 651547 971831 1338746 1650594 1823117 1821746 1672156 1478333
6311 1478333 1378362 1381528 1381354 1272150 1023056 703941 371803 104051 37322 85903 126452
6300 126452 166143 195381 200990 166519 111471 73701 65486 80353 88290 83120 72457 78217 99408
6287I9408K0643N136o990k325P602M173j1542k9756l6888k1052K746J1094Q457
6274E0706J414l764J923Q309Q414P521N6398J16227J39851J44073J15096O2060
6262G08228O75o2246j12457j40644j37099j15199o3847j1188m689j7657A9582
6250G375J4643J1924M725m554p812o678k108k667F586f576a915A1119Q034L808
6236B2961r90m814F455c051j008a420A43K809M796N103N446J163j848o321n305
6221E986J23m06j980L940P031L649j966m335j373K485M725O552P973O725K680
6206D1809k178l706K04L246R38n480r928p205M161O303M035M936J1799J9850K3206
6191I1990K2178J9675J3721O365l162j3046k2019l1067l8983E499K5320M7600
$$ plain form
6287 99408 120051 125187 118197 115872 123474 127647 116105 86349 49461 28409 31155 42249 50706
6274 50706 52120 48356 50279 58588 67002 74523 130921 247148 386999 531072 646168 708228
6262 708228 708903 646657 534200 393556 256457 141258 77411 66223 61534 43877 19582
6250 7375 22018 33942 38667 34113 26301 19623 17515 14848 6586 -6576 -1915 11119 19153 22961
6236 22961 21971 17157 6455 -3051 -4059 -1420 143 2952 7748 12851 18297 19460 17612 11291 5986
6221 5986 6109 5703 3723 7663 14694 18343 16377 12042 10669 13154 17879 24431 32404 39129 41809
6206 41809 39631 35925 36129 39375 40313 34833 24905 17700 21861 28164 32199 37135 48934 68784 91990
6191 91990 114168 133843 147564 153929 150767 137721 115702 84635 45652 5499 30819 78419
6179G8419M3528L3660K0657M811j3044k7544m0591m6141A7017m353O408j676e398
6165D538K8976K0240J634j8156F011J2241O2878P1180N8710L3083N502j6524l3962
6152A99119m6109l5082M828M6411N1630K9774K300j6598j1262J2868M7013Q4397
6140C69289J24303J37532J21064P4689O133o7239j28119j63194j67910j53151
6130A53397D8199C764J1408J6324J5625J0591m680j4566j8811b523j3723b963
6117C527P968J1214P918N251l941j0394C194b304B775J0925L274n68J153K773
6103B0332l06Q94L391M361K7o785j0835B71b992k126n776c745E517K781l905l0
6087D363R463J4866J5751J6084J6052J6453J7331J0817p759k0197j8230r187l691
$$ plain form
6179 78419 121947 155607 176264 181075 168031 140487 99896 53755 17017 12664 19072 17396 -5398
6165 4538 33514 53754 55388 37232 6011 18252 81130 152310 211020 244103 249605 233081 199119
6152 199119 153010 117928 122756 169167 220797 250571 252871 236273 225011 237879 284892 369289
6140 369289 493592 631124 752188 826877 833010 765771 637652 474458 306548 153397
6130 153397 48199 3764 15172 31496 47121 57712 53032 38466 19655 -2523 -16246 -2963
6117 3527 11495 22709 30627 35878 31937 21543 3194 -2304 2775 13700 16974 16406 17559 20332
6103 20332 20026 20920 24311 28672 28699 21914 11079 271 -2992 -5118 -10894 -3745 5517 8298 4393 4363
6087 4363 13826 28692 44443 60527 76579 93032 110363 121180 113421 93224 74994 65807 62116
6074F2116j5400k2993G354P818L314p746J1764J8299L2161O5329P7421M8663j0591
6061B53786p5873F3490B1533N0002j7313K542O9118K2255n8113K187J27076N3947
6049B73234q0528n4293K06101J19662j15906o1733M88770L75310j89557l18566
6039F42494K126596L285748L768922L515218K499824R10838q89809k475268l488262
6030I896301l741800B895606G51861R4823J71264l64004B31304J65716J03375
6021E00395j35968A35886L5511Q0801n3952H0500K5013O0096k7005E4806M989
6010E9795N3489n497n3075A6877K7798l501A1579K2418K7035p186B1401L370K9109
5997E3880L518k2180A3641J0622K302H941D204K1127M480j3519p883J3412L932
$$ plain form
6074 62116 46716 23723 7354 15172 18486 10740 22504 40803 72964 138293 215714 264377 253786
6061 253786 177913 63490 21533 71535 54222 56764 125882 148137 90024 92211 219287 273234
6049 273234 192706 138413 344514 464176 348270 286537 775307 1150617 961060 642494
6039 642494 2769090 6054838 9823760 13338978 15838802 16749640 15859831 13384563 9896301
6030 9896301 6154501 2895606 751861 846684 1017948 653944 231304 397020 500395
6021 500395 364427 135886 171397 252198 198246 80500 105513 165609 138604 54806 59795
6010 59795 113284 107787 54712 16877 44675 41174 11579 33997 61032 53846 21401 24771 53880
5997 53880 57398 35218 13641 24263 26565 8941 4204 25331 29811 16292 8409 21821 25753
5984B5753r863p230N222l268e448j5551A819P170D098f694m562L649K025L35A801
5968H492j865c555A096J0521m16A962K730J1465O367P11Q57R791K1830L2540M1898
5953A30151M4919L6790J9836k949k5351m1447m6480l9057k5009j6325j1963q864
5941A4251k017l07L17l35j246E083e022h30A0646L827m857a061o412b69C348P55
5925D103k43L04J321K276j42C659d650r188J219R97j117L849L774j218m677M837
5909f174A1887K6286J9723J4753O153J679p522j3278j7121j7808A0710D022j096
5896B926e63p443c625E002O169K052k478E299e47m974j851L516a438c48A121K007
5880C128J533k71j050p51j065h64l242k738J87r29O40I54J3187J8753J8215J0950
$$ plain form
5984 25753 15890 8660 13882 10614 -5448 -20999 1819 8989 4098 -6694 -11256 -7607 -5582 -5247 1801
5968 8492 6627 -3555 1096 11617 11201 1962 4692 16157 22524 23235 24092 33883 55713 88253 130151
5953 130151 175070 211860 231696 228747 203396 161949 115469 76412 51403 35078 23115 14251
5941 14251 12234 11927 12244 11909 10663 5083 -5022 -830 10646 14473 9616 -1061 -7473 -269 3348 4103
5925 4103 3860 4164 5485 7761 7619 3659 -4650 -13838 -12619 -11622 -12739 -8890 -5116 -6334 -11011 -6174
5909 -6174 11887 38173 57896 72649 78802 80481 72959 59681 42560 24752 10710 4022 2926
5896 2926 -563 -8006 -3625 5002 11171 13223 10745 5299 -547 -5521 -7372 -3856 -1438 -348 1121 3128
5880 3128 4661 4390 3340 2589 1524 -864 -4106 -6844 -6657 -7586 -6946 954 14141 32894 51109 62059
5864F2059L296o141j2869j5129j1779o608l007l830G88d680n698J1M871M05j910
5849g001j644R10M12l707l188l359j412j753M63N650L761M206J14k914m103j190
5833a4755m076p93N392O336A818B15N916a74l203n167K551a232q43j444P27g96
5816a68k321k845k647q47J335K189b055A089K812J969N16j204a779j0550M054
5801h275J379r520k650m037N064Q639F490J8033L218o771B70b7252j6887P242
5787c6897J6067g382H960b488p089d672B436M951j181k993j503q26J836P772J0704
5772B1196J1706R726Q693M339N77k030n501o867r789j0273A0011b362k886D246
5757A4724O790K834q32k551j329J15M91J837k26l593q436b316m417B453P234L345
$$ plain form
5864 62059 65355 59214 46345 31216 19437 12829 9822 5992 788 -4680 -10378 -10367 -5496 -5091 -7001
5849 -7001 -8645 -7735 -7323 -11030 -14218 -17577 -18989 -20742 -20279 -14629 -10868 -6662 -6548 -9462 -13565 -14755
5833 -14755 -18831 -19624 -14232 -7896 1818 215 6131 -174 -3377 -8544 -5993 -1232 -2075 -3519 -2792 -796
5816 -168 -2489 -5334 -7981 -8828 -7493 -5304 -2055 1089 3901 5870 6386 5182 -1779 -12329 -8275
5801 -8275 -6896 -16416 -19066 -23103 -18039 -9400 6490 24523 27741 20970 270 -27252 -44139 -36897
5787 -36897 -20830 -7382 8960 -2488 -9577 -4672 2436 7387 6206 3213 1710 884 2720 10492 21196
5772 21196 32902 42628 51321 55660 56237 54207 48706 41839 32050 21777 10011 -2362 -5248 4246
5757 14724 21514 24348 23516 20965 19636 19751 20242 22079 21853 18260 9824 -2316 -6733 2453 9687 13032
5741A3032k347m777G85d773l104k146j039J337J608b914B837O305Q098P085M203
5726B8528J812l885q006r026C706J397J771k545d19j144A771K614J086N90O20
5711F681l70k812h63m111j932j605j026M625a877c93l95l711k891c530c01B42
5694b484r76K79j332j98J803B542L577k821c543M13E787J075k043a512l019E598
5677B4597J7918R836K324l449m557j0218j2687j0561E193A509K135L838p01L781
5663A0562O68k710j430J892K503j406D642a800j520F12M615L887L123J229k963
5648A0503n183a881n855a520C228J944J542K638K276k49n446a095j112D446P144
5633A1590M240J033k478n738B361h57b48j61J35C815M679J069j102o92O26j002
$$ plain form
5741 13032 10685 5908 785 -4773 -7877 -10023 -11062 -9725 -8117 -2914 2837 9142 17240 24325 28528
5726 28528 30340 26455 18449 9423 3706 5103 6874 4329 -419 -1563 1771 4385 5471 6061 6681
5711 6681 6311 3499 -863 -4974 -6906 -8511 -9537 -4912 -1877 -393 -788 -4499 -7390 -3530 -301 242
5694 -2484 -3460 -3181 -4513 -4711 -2908 2542 6119 3298 -3543 -3130 5787 6862 4819 -1512 -4531 5598
5677 24597 42515 52351 54675 51226 46669 36451 23764 13203 5193 1509 3644 7482 6781 10562
5663 10562 11230 8520 7090 8982 11485 10079 4642 -1800 -3320 612 5227 9114 12237 13466 10503
5648 10503 5320 -1881 -7736 -1520 3228 5172 6714 9352 11628 11379 5933 -1095 -2207 4446 11590
5633 11590 15830 16863 14385 8647 2361 -857 -248 -409 -274 3815 8494 9563 8461 7769 8395 7393
5617G393A830e784a365G392M915P26J77J913K769r06o825b125j778I343R164L927
5601B2434j772l033k228m84J03j528l193l205o1M606M468Q92l232m772k140K789
5585I644O811P721N850L8o045n452O175J0318M931m458p988l849j29m918H254
5569F992J3759R370l823H891A5K0194J7193Q645Q29r34n857n270q721l296l033
5554A9765J924l685K122Q737J1272j773K476j9800j607J1205J3870K1106J6927
5541H2539P932N890O792P288L271L191Q852K1670L1727K8026J2112l127j5995
5528B00168l231j2036j9641l5204m6435C9621j0219L9642N1936M6613M4228L6181
5516B48002K8278K3269L488j8299m2472k8003L4527P6908N1198J5913O284L4307
$$ plain form
5617 7393 1830 -5784 -1365 7392 12307 13033 13210 15123 17892 16986 10161 -2125 -3903 9343 18507 22434
5601 22434 20662 17629 15401 14917 15020 13492 10299 7094 7033 11639 16107 16999 13767 8995 6855 9644
5585 9644 16455 24176 30026 30064 24019 18567 24742 35060 39991 35533 27545 23696 23567 18649 8254
5569 6992 20751 30121 26298 8891 15 20209 37402 46047 46876 45942 40085 34815 26094 22798 19765
5554 19765 21689 18004 20126 28863 40135 38362 40838 21038 19431 30636 44506 65612 82539
5541 82539 90471 96361 103153 110441 113712 116903 125755 147425 179152 207178 219290 216163 200168
5528 200168 196937 184901 165260 130056 83621 39621 29402 69044 120980 167593 211821 248002
5516 248002 276280 299549 303037 284738 242266 214263 248790 325698 376896 392809 399093 433400
5504D33400O4717P6356L5154K6611M8682J23270J60352J73889K07892K72077L39726
5493A962126M57362P32318J216396J754361K087041K049230J592641P69380k69605
5484A2351250j343077k246550k840601B876629H4037K235172J654815Q85701J84964
5475E044689l52330o63480p53774o80056n38521m07119l08162k26157j59113j16194
5465H39783r8457q7720r4650p0740m6309m3701l4414k9486k5629k3177j8216k8069
5453B39215k1703j5836j3819r190j2265j2714j0791p266j172k166q21k405o140
5440A22927q724j0073r116q352m109N583J2993Q980l98l238R46N826M675j2076
5426A05844r640O233K0672J4509j724j9723k8649k4057p099J625r38o323l574
$$ plain form
5504 433400 498117 574473 609627 636238 684920 808190 968542 1142431 1350323 1622400 1962126
5493 1962126 2419488 3151806 4368202 6122563 8209604 10258834 11851475 12620855 12351250
5484 12351250 11008173 8761623 5921022 2876629 84037 2319209 3974024 4859725 5044689
5475 5044689 4692359 4028879 3275105 2595049 2056528 1649409 1341247 1115090 955977 839783
5465 839783 741326 653606 558956 488216 441907 398206 363792 334306 308677 285500 267284 239215
5453 239215 217512 201676 187857 178667 166402 153688 142897 135631 134459 132293 131472 129067 122927
5440 122927 114203 104130 95014 86662 82553 88136 101129 110109 109711 106473 107419 113245 117920 105844
5426 105844 96204 102437 123109 137618 135894 116171 87522 63465 56366 57991 57053 50730 47156
5413D7156O960J0867L326q215j6465j4217m503k854k410J2596K2103J7043J405
5400G2792j0599j6424j3407r058n886J464J3053J4160P300l26q28j220m022r774
5386C7225j5891F622J450N548m204d266D457K2409J8544R415K16r573j6992j1758
5372A6718Q372J3533N178o32q377j3678H540a019p98A292K69b42C586Q600O128
5357A8314J384k970l292M43L611K603k385o922j773L063O216O790O952J864r803
5342B4095I190K7188M8649M8230L9522K5322R598o429k3218l8611m8373D1979
5329A5061O718N389m691p978l572j086j111J052M333L008J184r19k847l025J073
5314A2589K471J905J746O731Q153K217q006A1439l531J7213J2085O34j0406j3079
$$ plain form
5413 47156 54116 64983 68309 60094 43629 29412 24909 22055 19645 32241 54344 71387 72792
5400 72792 62193 45769 32362 23304 17418 18882 31935 46095 53395 53069 52241 51021 46999 37225
5386 37225 21334 6622 8072 13620 9416 -4266 4457 26866 45410 54825 55041 45468 28476 16718
5372 16718 25090 38623 43801 43169 34792 21114 8540 -1019 -1817 1292 1561 -242 3586 12186 18314
5357 18314 19698 16728 13436 13879 17490 20093 17708 10786 9013 12076 18292 25082 32034 33898 24095
5342 24095 9190 36378 85027 133257 172779 198101 207699 201270 178052 139441 91068 41979
5329 15061 21779 27168 22477 14499 10927 9841 8730 9782 14115 17123 18307 17388 14541 11516 12589
5314 12589 15060 16965 18711 25442 33595 35812 27806 11439 7908 25121 37206 37840 27434 14355
5300A4355l92N488m84H537A696J4051J2895M565o059p964k239J0164J4435J5077
5286E6621J1758M322l258n532R1K211n322j4983j4230P045J9434J6046J2977J0778
5272I7958J2560J4060P341p154k0597k6897j1496O068n965j6269L7475P4151O2260
5259B23495K7478m533j2195O442K9049K9250N587l0548m0811M2942J31475J11739
5247E19370N9315J93836N69052Q72494R75391Q62684N50596J06807l62791p51431
5237C595323r64595r52720p16505l04466n6032q0311j37664j02589j8158j9906
5227B42377n7736n0227J785O682j6059k4638q121k436j7553k8537j0277M064J367
5214D0691J9687L8359K3732r597l9598C0209M88K1092K2781L0982K1471o753l3780
$$ plain form
5300 14355 13963 19451 18967 8537 1696 15747 28642 33207 27148 19184 16945 27109 41544 56621
5286 56621 68379 72701 69443 63911 64002 66213 60891 45908 31678 38723 58157 74203 87180 97958
5272 97958 110518 124578 131919 124765 104168 77271 65775 71843 65878 49609 87084 161235 223495
5259 223495 250973 246440 234245 240687 269736 298986 304573 274025 233214 276156 407631 519370
5247 519370 578685 772521 1341573 2214067 3189458 4052142 4602738 4709545 4346754 3595323
5237 3595323 2630728 1678008 961503 657037 601005 520694 383030 280441 262283 242377
5227 242377 184641 134414 136199 142881 126822 102184 94063 91627 74074 45537 35260 39324 40691
5214 40691 60378 98737 122469 112872 73274 30209 30697 51789 74570 105552 127023 120270 86490
5201H6490j5339K9080J3330j6080Q539M9602K9081j6060M5171J16380Q5359r618
5189D05935M3547L96933O29420O59011N18626K64225k7310k77479l90782k31724
5179A990402K17147N75718O00804L65050P780l18675m65271l54286j32801o4781
5169B421087k28196m51373n78533n04327j83850K0302m9666j38415r8940K2350
5159B30439R594n5880n3074L3092M8498j0219m3384n5233k3712Q845P071J6923
5147A12960j2503n273L2119L3881K4031j038m484J6739L2474K8250L4633Q7080
5135C78869J59661K10670K28409K14879J74147J10493L1324n3982j33390j90482
5125A130598k21699k23665j91375j32804p0382m4749n4413p7144B2760J0295N9074
$$ plain form
5201 86490 71151 100231 113561 97481 106020 155622 184703 168643 213814 330194 415553 405935
5189 405935 449482 846415 1475835 2134846 2653472 2917697 2890387 2612908 2222126 1990402
5179 1990402 2207549 2783267 3384071 3749121 3756901 3438226 2972955 2618669 2485868 2421087
5169 2421087 2192891 1741518 1162985 658658 474808 495110 445444 307029 208089 230439
5159 230439 240033 184153 131079 164171 212669 202450 159066 103833 80121 88966 96037 112960
5147 112960 100457 95184 127303 161184 185215 184177 179693 196432 228906 257156 291789 378869
5135 378869 538530 749200 977609 1192488 1366635 1477128 1508452 1454470 1321080 1130598
5125 1130598 908899 685234 493859 361055 290673 245924 191511 114367 22760 33055 92129
5114I2129K3240l435j5697j6654l479m868j0659k1192A4400f558A5012K5444J5478
5101E5934L767l447m016o173r051r805m099J063l818H253g253F471R490K736l46
5086A8351K617K889n87n841n953j345M283K944j34l595k996j15J07k358l274J440
5070F433L534J16l416k594M023N443L631K667K446J583k144o952C853a630A1649
5054B6619J3787J0400P518Q490J3540J8002J8186J3917N972m233j4146k1157k3168
5041G3727j7746p294L797O655J1389J9898L0869L6626L4785K6134R582q880k5919
5028A93623l8764m2419l6461k4200j3161r320r283n030J59O58q34j118j215j786
5014A0849k239j819r73j243k080i27k625O57L73Q40j514j664K300F22K735L86
$$ plain form
5114 92129 115369 111934 96237 79583 76104 71236 60577 39385 14400 -6558 15012 40456 55934
5101 55934 59701 56254 52238 46065 37014 27209 23110 24173 20355 8253 -7253 6471 15961 18697 18351
5086 18351 20968 23857 23270 17429 11476 10131 14414 17358 17224 13629 10633 10518 10625 8267 4993 6433
5070 6433 9967 10083 6667 4073 8096 13539 17170 19837 22283 23866 21722 14770 3853 -1630 11649
5054 26619 40406 50806 58324 66814 80354 98356 116542 130459 136431 132198 118052 96895 73727
5041 73727 55981 48687 52484 59139 70528 90426 121295 157921 192706 218840 228422 219542 193623
5028 193623 154859 112440 75979 51779 38618 29298 20015 14985 15144 15802 14968 13850 12635 10849
5014 10849 8610 6791 5818 4575 2495 -927 -3552 -2895 -2522 -1682 -3196 -4860 -2560 622 3357 3743
4998C743A386a257O16B390R37j556D03J951K793J002j294A312c945j914a117A612
4981C080j32j052H4a635J16g23K89j964l164o15K365P89P62b11I16L53c93j970
4963b363m8J046N75c8A046q3a986j772G48K950N25j349C99b755k835k14R37J341
4945c526a597B91J054j82h62j636a116b01j592l198k073c476a035a25D90q5c10
4927a249L55I5M91f04k453q61i98A062N7b70k90A918L331K501J609K97l49k75
4909I032p6K99Q99P47m14j769j398j218j545A812a176k095Q00a78A573M02D98
4891b535l25D64K580m8F92a637K56M93j086j966J066g40A078k84a404m742K60
4874e886a275E17A38a160c70I99Q1g04j686J019b85j256j987J296b51C81f44j365
$$ plain form
4998 3743 1386 -1257 -641 2390 3327 1771 403 2354 5147 6149 4855 1312 -3945 -5859 -1117 1612
4981 3080 2948 1896 84 -1635 -1519 -723 -434 -2398 -5562 -6177 -3812 -3023 -2261 -211 916 1269 -393 -2363
4963 -2363 -2411 -1365 -790 -38 1046 963 -1986 -3758 748 3698 4223 2874 399 -2755 -5590 -5804 -4867 -3526
4945 -3526 -1597 291 1345 1163 -862 -2498 -1116 -201 -1793 -4991 -7064 -3476 -1035 -125 490 405 -310
4927 -1249 -894 95 586 -604 -3057 -3918 -998 1062 1119 -270 -560 1918 5249 7750 9359 9656 9307 9032
4909 9032 8956 9255 10154 10901 10487 8718 7320 6102 4557 1812 -1176 -3271 -2471 -178 1573 1975 498
4891 -2535 -2860 464 3044 2996 692 -1637 -1381 -888 -1974 -3940 -2874 -740 1078 794 -1404 -6146 -5886
4874 -5886 -1275 517 138 -1160 -370 999 1080 -704 -2390 -1371 -285 -1541 -3528 -2232 -251 381 -644 -2009
4856b009B39M414L672O95k614A251d394M52a344K83k391L98D64J563q0F19a551
4838b755M98kj809j253b325A408K252p95a84k161a89I81l96a182j330L55f50A014
4819A138a309n238J692a114F5a686k642O53a801M67j141l60K2j138N06a424b63
4801g56j199O04I17J481R10p1j159d20k420L49h28A179K000J528r76A103a466
4783i24b26j094r18c11A674q9a116k991a618A019J376J95A174a730k127B31L643
4766C874M16k086g7F42Q61k44E6a966l018j119b963f61H62b78j887j43J030e13
4747A264K396N5A117c522a069B931R71q99B48b915k03G32L363O34j625D14a605
4729b599j322j423b050cp66l338j882b279J045j440n58i85a9j030j017L63o91
$$ plain form
4856 -2009 239 4653 8325 9020 6406 1251 -4394 -3942 -1344 -1061 -3452 -3054 464 2027 1947 619 -1551
4838 -2755 -2257 -2259 -4068 -5321 -2325 1408 3660 2865 -184 -2345 -189 981 585 -1182 -2512 -2157 -650 1014
4819 1138 -1309 -6547 -4855 -1114 65 -1686 -4328 -3675 -1801 -1334 -2475 -2835 -2813 -3951 -3445 -1424 -263
4801 -756 -1955 -1351 917 2398 3308 3237 2078 -420 -2840 -2491 -828 1179 3179 4707 3731 1103 -1466
4783 -924 -226 -1320 -2238 -311 1674 1585 -1116 -4107 -1618 1019 2395 2590 1174 -1730 -3857 231 3874
4766 3874 4290 2204 -77 642 1503 1259 56 -1966 -4984 -6103 -2963 -661 862 -278 -2165 -2308 -1278 -513
4747 1264 3660 3715 1117 -3522 -1069 2931 3902 3003 248 -2915 -3118 732 4095 4729 3104 414 -1605
4729 -2599 -3921 -5344 -2050 -3 -769 -4107 -5989 -2279 -1234 -2674 -3232 -985 -19 -1049 -2066 -1703 -2394
4712b394j557a121A285R5a296m021a806G56J69c07m75l65b68C189K794n74A359
4694d065a939Q40k658J714C173K716j377F09M51L295J484M8K42n09k808i5B854
4676F753q0B344d549O9J879J60K62N46p85K02A220K774q71g21n58A175m44c693
4657b019C803J674A546b048B703L359o1k229m90m34c45m049e84A097f85C32N108
4640E440K111l214B22K642K936k039a016B745M897J25l731G16a216m231A145P853
4624H998K529l689H39J312M871j156c07E52O785J603k430J16K629j260B561G32
4607D141j336a991E530P034r83A626b28A1440L086l724k559N163J032F611I5J2318
4591A2413N283o409C224J1906J0807J530l944Q17J0162J9784L1065L8629L7742
$$ plain form
4712 -2394 -3951 -1121 1285 1380 -1296 -5317 -1806 756 925 -307 -782 -1147 -268 3189 5983 5409 1359
4694 -4065 -1939 -1099 -3757 -2043 3173 5889 4512 609 1060 4355 5839 5887 6129 5620 2812 -95 2854
4676 6753 6673 2344 -4549 -4480 -2601 -2441 -2179 -1633 -2418 -2216 1220 3994 3123 -721 -1279 1175 731 -3693
4657 -2019 3803 5477 1546 -2048 2703 6062 6001 3772 3282 2848 -345 -4394 -584 1097 -685 332 5440
4640 5440 7551 4337 222 2864 5800 3761 -1016 2745 7642 7767 4036 716 -1216 -5447 1145 8998
4624 8998 11527 7838 839 2151 7022 5866 -307 552 7337 8940 6510 6626 9255 7995 2561 732
4607 4141 2805 -1991 5530 12564 11581 1626 -228 11440 14526 10802 8243 13406 14438 6611 95 12413
4591 12413 17696 11287 3224 15130 25937 27467 23523 24340 34502 54286 85351 123980 161722
4578A61722K7468J0969q707k7385m0681m3854l4183j7804r470k880R960O911n771
4565B6295j2149M682J0838l077A1620K171J4967J604j2691o246J1930J406A2367
4551A3781J5952P44A3114l701K3350O665j2871q726J6735M785j5496q524K2193
4538C7524O576k0009E776L6161J5658j2543j9093J7802J2549j6835A5805L3507
4526D9312K0447j5127A8910K8452K6835j4188A9963L3010L3060j1932C1299L0263
4514F1562M1073r246C9526J9888N1647n620D9127K5288O3328l077F4732J4703
4502G9435Q3256R515q1030o518J06895J9121r0276j5519J36502L5798j06348m1690
4490A29141J73556N9728j26579q1910K49261J13802j50257j57171L38377K01532
$$ plain form
4578 161722 189190 200159 191452 164067 123386 79532 45349 27545 18075 15195 25155 32066 26295
4565 26295 14146 18828 29666 26589 11620 13791 28758 30362 17671 11425 23355 24761 12367
4551 13781 29733 30477 13114 9413 32763 39428 26557 17831 34566 39351 23855 15331 37524
4538 37524 44100 24091 5776 41937 57595 45052 25959 43761 56310 39475 15805 49312
4526 49312 69759 54632 18910 47362 74197 60009 19963 52973 86033 74101 31299 61562
4514 61562 102635 93389 39526 59414 111061 105441 49127 74415 137743 134666 64732 79435
4502 79435 162691 172206 91176 84658 191553 210674 120398 104879 241381 277179 170831 129141
4490 129141 302697 362425 235846 153936 403197 516999 366742 209571 547948 749480
4480G49480j76417k68924N02490L69315j92802m18900Q20470Q03720n9004n50249
4470A579179J251746J683966l63470G86720Q598079J3699584J6415595J6118284
4462E5618262J2423415N914073j978693r399750j4634619j6645064j5335871D479220
4453B500011K056411q79879j753978q3825M58686m55476H30994j28091M64057
4444A166960j08968E28037j31970L21972k3551l27357j44064K37079J4386k08778
4434B65754j12210J80702K9043j45330I9975J35821L6252j00597H2018J08714
4424A90732L8690p3706E9885P5547L8803n1199D7705O4923L7808l9830C7448M8297
4412H5745M0542k5552D0431K3516L5580j7893B6901K1499L5024r498l6041J6295
$$ plain form
4480 749480 573063 304139 806629 1175944 983142 564242 1384712 2188432 2129428 1579179
4470 1579179 2830925 4514891 4151421 786720 9384799 23084383 39499978 55618262
4462 55618262 68041677 73955750 71977057 62577307 47942688 31297624 15961753 4479220
4453 2500011 4556422 3676543 1922565 1838740 2297426 1841950 830994 702903 1166960
4444 1166960 1057992 528037 396067 718039 694488 367131 223067 460146 474532 265754
4434 265754 153544 334246 363289 217959 99975 235796 272048 171451 82018 190732
4424 190732 229422 155716 59885 135432 174235 123036 47705 112628 150436 110606 37448 85745
4412 85745 126287 100735 40431 63947 99527 81634 26901 48400 83424 73926 37885 54180
4400E4180K7606j1063B5135L279L4793j275l0336l064K6457J84k5337n721K2179
4387D6294j36B1993j083K6894M770j9820H616J6955N700j4632l886J9852M488
4374C7093j5261E678J8249Q413r290r267J1557M028j2673q290K1471J0423r454
4361C0845G521m67J3748j252q116R458R492l386j2261L334J3233K156q063K526
4347B7923K5567L0375K8461K7492K3972J6768M240j2212k9963m2709m4546k6019
4335B9349K007n02j1702H461O864K431o907m644O557J760F286b55A0502M482m704
4320A0280D814N970L331m187B728J523K161B806O31P838L425m313B557J230L563
4305G350j549P30O908L677l648C979a064E460K56B39j15L714p65c37B998M398
$$ plain form
4400 54180 81786 70723 25135 28414 63207 61932 31596 28532 54989 55173 29836 24115 46294
4387 46294 46158 21993 20910 47804 52574 32754 8616 25571 31271 16639 12753 32605 37093
4374 37093 21832 5678 23927 32340 23050 13783 25340 29368 16695 8405 29876 40299 30845
4361 30845 7521 7054 20802 19550 11434 20892 30384 26998 14737 18071 31304 33460 25397 27923
4347 27923 53490 83865 112326 139818 163790 180558 184798 172586 142623 99914 55368 29349
4335 29349 31356 30854 19152 8461 15325 17756 10849 6205 12762 14522 6286 -255 10502 14984 10280
4320 10280 4814 10784 14115 9928 2728 4251 6412 2806 3437 11275 14700 10387 2557 3787 7350
4305 7350 5801 6531 13439 17116 13468 3979 -1064 5460 5716 239 124 3838 3073 -337 2998 7396
4289G396j130C80g61D757N27A326e43A715o3o22N129M581l26D909a992l35e81
4271b248c81C484J78a61k321A901M72a981A261O576K930j612C821a158l35j92
4255a685C99M073K246k74j909j307A569i85C76N995L335r19D336h80k454a441
4238A861L429J753m54k013r88K42j473a069L76A729Q96J368K720J526j362C002
4221H79K392J201B196a031G9K736K581K689J682n96m262h52F88J881H41c391J05
4204c286c12B15h41L86A290J98a06k448L27f18G40R34k75F8c56A268J302l92j085
4185A093E20Ba685J29B30J024D18b293l361K389J479L63M20C39M82A85c93P0j131
4166a454k264J790e06m90j991O23B36J280l45a21n60k01p60j515j18p3k09a161
$$ plain form
4289 7396 6266 380 -761 4757 5284 1326 -543 1715 1652 1030 6159 10740 10414 4909 -1992 -2327 -581
4271 -2248 -381 3484 3662 -161 -2482 1901 2373 -1981 1261 7837 10767 9155 3821 -1158 -1493 -1685
4255 -1685 399 4472 6718 6444 4535 3228 1569 -985 376 6371 9706 8787 4336 -880 -3334 -1441
4238 1861 5290 7043 6589 4576 3588 3830 2357 -1069 -693 1729 2625 3993 6713 8239 6877 3002
4221 879 3271 4472 2196 -1031 79 2815 5396 8085 9767 9171 4909 -852 688 2569 841 -3391 -3286
4204 -3286 -312 215 -841 -455 1290 1488 -106 -2554 -2227 -618 740 1674 1399 68 -356 1268 2570 2178 1093
4185 1093 520 2 -1685 -1556 230 1254 418 -2293 -5654 -3265 -1786 -1423 -1003 339 821 185 -393 -323 -1454
4166 -1454 -3718 -1928 -506 -996 -2987 -2364 236 1516 1171 -121 -681 -882 -1642 -3157 -3275 -3348 -3557 -1161
4147A071N52K51H17C4R04K301L640K455l40l173G63e394a750A988K093Q46p9j133
4129C715j721D06b60o65k022K57d91A023N77j27n89f4r62b09A334K17j19l63m74
4110E95A25d49l85p6n29j175N35Q69n23k048a301A875K254J080n28j457j116K19
4092B327L82j08r52n75R34J538Q00n56A672g39j580j067J162f5A776J149M28L5
4074C388q26A134e70q47M03K3p30l14j84r71o4J374N38p08j394P99f15B74qL75
4054F41R68M30n03l53n3p9b15k253k54f33A439J372P34q4j607e76j918P94L35
4035a365k83n15l53K84R16d43I8L62L36K22k95b55j573j454j233m84J098Q12N05
4016b584l19l45J77J358F34L036K826J544p91l006e8l630g03E83j58Q1O76Q11
$$ plain form
4147 1071 1623 1874 817 34 938 3239 6879 9334 8994 5821 763 -5394 -1750 1988 4081 4927 4848 3715
4129 3715 1994 406 -260 -925 -2947 -2690 -491 1023 1600 1473 884 -64 -1026 -209 1334 1551 1432 1069 595
4110 595 125 -449 -834 -910 -1439 -2614 -2079 -1210 -1733 -3781 -1301 1875 4129 5209 4681 3224 2108 2327
4092 2327 2709 2601 1649 1074 2008 3546 4346 3790 1672 -739 -2319 -3386 -2224 -65 1776 2925 3353 3388
4074 3388 2562 1134 -570 -1417 -1014 -991 -1721 -2035 -2219 -3190 -3254 -1880 -1342 -2050 -3444 -2645 -615 274 266 641
4054 641 1609 2039 1536 1183 1130 1051 -215 -2468 -2722 -633 1439 2811 3545 3461 1854 -576 -2494 -1700 -1365
4035 -1365 -1648 -2163 -2516 -2232 -1316 -443 98 460 796 1018 723 -255 -1828 -3282 -4515 -4999 -3901 -3089 -2584
4016 -2584 -2903 -3248 -3071 -1713 634 3670 6496 8040 7249 4243 -58 -3688 -703 583 425 506 1182 1993
3998A993Lm41l08l21l84B49K10L2J55L62J3J06M2m19j80A95c07n81r15J93c66
3976A65e93k543J413A446K315K79j533C77a412k74N91e01K46B95J125R04K7I41
3957a191j770J07J042O31K57M46o8j204j693l73J203O61p9o02n59n11m53l97k59
3938d812P65J720a06A945Q35k31o03p39K38J362P09j141a061m071a847H46J330
3921B176M58k6K24p27q80k86K41l29D13d88j10b40E28a09j371j715J60J459g22
3901f55k32M06B61J68J2j64J01A40c61q80n21K65g42K27q91j625j1a091a53j85
3881c38j619k149K49J290J32o62l15J21J04J380A16J809J332M43n59r67o65l78
3863A131J86J83J03J77M18o0A054C6M29J375R26k07r26D14f87j368j550l72a056
$$ plain form
3998 1993 1996 1555 1247 926 542 249 459 491 646 1008 1021 1127 1169 750 570 195 -307 -888 -1803 -1610 -366
3976 165 -593 -3136 -1723 1446 3761 4040 2507 377 -1412 -1686 -1095 -501 -255 295 1420 2324 2351 941
3957 -1191 -2961 -2854 -1812 -1181 -924 -478 -546 -1750 -3443 -3816 -2613 -1952 -2031 -2633 -3192 -3703 -4156 -4553 -4812
3938 -4812 -4047 -2327 -106 1945 2780 2549 1946 1207 1445 2807 3516 2375 -1061 -5132 -1847 846 2176
3921 2176 2634 2608 2832 2105 1225 939 1180 851 413 -488 -598 -240 528 -109 -1480 -3195 -3035 -1576 -722
3901 -655 -887 -481 261 429 441 277 378 140 -361 -1241 -1762 -1497 -742 -515 -1406 -3031 -3042 -1091 -153 -338
3881 -338 -1957 -4106 -3857 -2567 -2435 -3097 -3412 -3291 -3187 -1807 116 1925 3257 3700 3141 2174 1509 1131
3863 1131 1317 1500 1603 1780 2198 2138 1054 36 465 1840 2766 2559 1633 414 -687 -2055 -3605 -3977 -1056
3843A564J862Q70n99A750c38k704J11a313e58q9j138M69G73K409R88m82j669E93
3824A329K105K292Q58m76j078j706F88a673k021j014J143J527d66F67O22n56e04
3806a729j053k7R02d57A42e47j802k327a632G09R93M0G26a205j621n07J641D83
3787A801L97q7m29j46M66J053J267R90L16j181j046A330B2b41I8M63K34j6K3j01
3767G01Jj77J33a63o11O2I7J512J945K643K588J588k99k427l756c4k965p7J454
3748a622@A320J020J262J205K58P55K62M96o06j636j120r77o95o94c74j373p58
3730b505K70J96J8R1h55A88J021L96q3l51p7P6k62k40J0K79l60k04Bb6o1k87j24
3707d98q35j528j375J547h78D20N85l3h1j623q10R96P54m39j346k125J583i74
$$ plain form
3843 1564 3426 4296 3697 1750 -338 -3042 -2931 -1313 -558 -647 -1785 -1316 773 3182 4170 3688 2019 593
3824 1329 3434 5726 6584 6108 5030 3324 688 -1673 -3694 -4708 -3565 -2038 -466 667 1289 733 -504
3806 -1729 -2782 -2809 -1907 -457 142 -547 -2349 -4676 -1632 709 1702 1742 726 -1205 -2826 -3333 -1692 483
3787 1801 2198 2111 1682 1536 2002 3055 4322 5312 5628 4447 3401 1330 22 -241 98 561 795 779 802 701
3767 701 702 525 658 -163 -774 -712 97 1609 3554 6197 8785 10373 10074 7647 3891 -34 -2999 -3076 -1622
3748 -1622 0 1320 2340 3602 4807 5065 5820 6082 6578 5972 4336 3216 2239 1544 850 -374 -1747 -2505
3730 -2505 -2235 -2039 -2021 -1930 -855 188 1209 1605 1522 1171 1094 1170 908 668 678 957 597 393 2 -26 -87 -374 -498
3707 -498 -1333 -2861 -4236 -2689 -878 420 1005 972 -81 -1704 -2514 -1518 -764 -1203 -2549 -4674 -3091 -974
3688C50L92A78a121j521r00L42J522a91A467J258J068N07N41N0k08k83l83o31
3670C386r56r91H7a200p43j82M68L31k41j095j844q24J168J001J170O06a39A201
3651B103M22j22o15q19l69O66J246J190K59k04m89n82p40p54A18h71j30d89M7
3632d42p51j396P85B60J402N35k57J13L01L19j33l52o10F62d88j190j090q76O96
3613b948R25R85H9L93L8B58j8m1c07q83o34k17J57M70e87B27Q78R3m11G0d29j70
3591e99J86R8l12j116j889r45Q80O36j82p34j10Q74J088f16I39J406R00K53j022
3572B476A08b594n16e90A520J233N73k58l88O82J269J119J82j059B376g86k464
3555c250j431m53L58J822a346C41J889J957J098K57j76r20j531A007a198j807
$$ plain form
3688 350 742 178 -1121 -2642 -3542 -3200 -1678 -191 1467 2725 3793 4300 4841 4891 4683 4400 4017 3386
3670 3386 2430 1439 87 -1200 -1943 -2125 -1657 -1326 -1567 -2662 -4506 -5330 -4162 -3161 -1991 -1385 -139 1201
3651 2103 2525 2403 1788 969 600 1266 2512 3702 3961 3757 3268 2686 1946 1192 118 -871 -1001 -489 -442
3632 -442 -1193 -2589 -1804 260 1662 2197 1940 2053 2354 2673 2540 2188 1578 662 -488 -1678 -2768 -3644 -2948
3613 -2948 -2023 -1038 89 482 520 258 240 199 -307 -1190 -1824 -2041 -1884 -1414 -587 227 1105 1198 787 70 -429 -599
3591 -599 -413 -315 -627 -1743 -3632 -4577 -3697 -3061 -3243 -3977 -4087 -3213 -2125 -616 939 2345 3245 3498 2476
3572 2476 108 -2594 -3110 -590 1520 2753 3326 3068 2680 3362 4631 5750 5932 4873 2376 -786 -3250
3555 -3250 -4681 -5134 -4776 -2954 -1346 341 2230 4187 5285 5542 5366 4446 2915 1007 -1198 -3005
3539c005j363m65R70J493M30l43o95J178I98K868J383m81k317h95k586J373b30
3521D40j54e19j191j207n92J04L74n61j037p47M89J549J535g13a32j26r68q89
3503b115m71n1N30K87Q2K92n14r68m54J117P99O35b49A17M18P0B08e86p98j004
3483b388r13j15P31R42O83J38j55K61b03H95N76N67j86H06a011j664P9P67L12
3464a517P1r12i88d24n7j167j449j33M62q3q23P86a437d53C69b9r60m21R8L82
3444i30j25n32n18K70e59A260J589J066J46p77j347D06a345j950q94J461Q54l4
3426a908K18k85L2O43b71A024J439J862J452Q42p6o16j085j481q38j239d32j395
3408a827l82Q23b24D42J64N91L60q8B76a583r90g20A419J656J187K50j249A251
$$ plain form
3539 -3005 -4368 -4833 -3863 -2370 -1940 -2283 -2978 -1800 998 3866 5249 4768 2451 -895 -3481 -2108 -230
3521 440 286 -519 -1710 -2917 -3509 -3405 -3031 -3592 -4629 -5376 -4887 -3338 -1803 -713 -132 -258 -1226 -2115
3503 -2115 -2586 -2637 -2107 -1820 -1738 -1446 -1960 -2928 -3382 -2265 -1466 -831 -249 117 535 605 208 -586 -1384 -2388
3483 -2388 -3301 -3416 -2685 -1743 -1060 -922 -1077 -816 -203 895 1471 2038 1852 806 -1011 -2675 -2596 -1829 -1517
3464 -1517 -1446 -2358 -988 -424 -481 -1648 -3097 -3230 -2768 -2851 -3674 -2888 -1437 -453 369 -29 -989 -1410 -1312 -930
3444 -930 -1055 -1587 -2105 -1835 -559 1260 2849 3915 4061 3284 1937 406 -1345 -3295 -4189 -2728 -1874 -1908
3426 -1908 -1690 -1975 -1943 -1300 -271 1024 2463 4325 5777 6619 6543 5927 4842 3361 2523 1284 -432 -1827
3408 -1827 -2209 -1386 -224 442 606 1197 1557 1469 276 -1583 -2573 -720 1419 3075 4262 4512 3263 1251
3389i48j392r2N56N37e78J7o5c09J25B4J033Q99L22q58j86L4o05d04j233m79N10
3368a606d76G92O77m02C5a467j441J043a25E31Q70K14m33D77f34j164j142n52
3350c492J49R05c08B380K193J901J268L89l35k468A137c391p99g07A964J075l10
3333B729j358a92j190k36L04L23L64J44K21O0k66o93q85r0J17N72e45J79j32a59
3312D6J118R13O93L83P7q5o21q65n68M8J44l8n94d0l11a3G15O87K42M87Q05J416
3290D352J682O96j45j374k151A013K71J518J986K325J645P69o42j194k320B665
3273h74k125A78L781K398K10j231j504j901B53d44B12O07j8d19k336k053J885
3256b923h38E27M40j86a48q79k02j50l82k57M2L28O80M57A84M77j05A04g09q04
$$ plain form
3389 -948 -2340 -2432 -1876 -1339 -578 -561 -626 -309 -184 24 1057 1956 2278 1420 1234 1268 663 -404 -1637 -2116 -1606
3368 -1606 -476 792 1469 1067 35 -1467 -2908 -1865 -125 531 1401 1615 1182 477 -634 -1798 -2940 -3492
3350 -3492 -3343 -2438 -308 2380 4573 6474 7742 8131 7796 5328 1137 -3391 -4190 -707 1964 3039 2729
3333 2729 1371 -192 -1382 -1618 -1314 -991 -627 -483 -262 -202 -468 -1161 -2046 -2136 -2019 -1447 -545 -366 -498 -159
3312 46 1164 2077 2770 3153 3230 3145 2524 1659 1091 1139 1283 1245 651 -40 -351 -13 715 1402 1644 2131 2936 4352
3290 4352 6034 6730 6585 5211 3060 1013 1284 2802 4788 7113 8758 9527 8885 7691 5371 2665
3273 -874 -2999 178 3959 6357 6567 5336 3832 1931 253 -444 212 819 801 -419 -2755 -4808 -2923
3256 -2923 -838 527 967 781 -148 -1027 -1229 -1379 -1761 -2018 -1976 -1648 -968 -511 184 661 556 104 -709 -1513
3236a513O6O79J72q54j104m55J128c81I09N53M2F94F4h93q80k3P41E75K016K294
3216D885J806P89n94j864B264h59k670k86R10K65k91m49J280E90J662P46L36J51
3198C485m7J67R95P17L33j71m66j265j481E67i60m49f48L13l52j334j649Q21a306
3178a82j67j052j220l70Q90i89L47o83j470j766N07J370R56N81K63a60A059J008
3160B067R89L70k71p46j090k81p5N35K75k88G02a09o80j87I6K075J892J978N70
3141F611p70k382d19l785e60B264J291N3r96j099G31B57a37r77j372r96P81a252
3122f57l61j036P29G14J637P41j40j69J432K439J772K13j076j827j956j412j148
3105A220a70j589j714l2J690i8A119N89o13g17k293J19a023C36J004j41B73c37
$$ plain form
3236 -1513 -1447 -768 -596 -1450 -2554 -3009 -1881 -381 909 1462 1504 694 64 -893 -1773 -1796 -1055 575 2591 4885
3216 4885 6691 7480 6886 5022 2264 -859 -3529 -3815 -2905 -2640 -2931 -3380 -2100 590 2252 2998 3334 3485
3198 3485 3438 3605 4600 5317 5650 5479 5013 3748 2267 567 -960 -1409 -648 -335 -687 -2021 -3670 -2849 -1306
3178 -182 -349 -1401 -2621 -2991 -2101 -989 -642 -1325 -2795 -4561 -4054 -2684 -1728 -1147 -884 -160 1059 2067
3160 2067 3056 3426 3155 2409 1319 1038 963 1498 1773 1485 702 -109 -789 -976 96 2171 4063 6041 6611
3141 6611 5841 3459 -419 -4204 -560 2264 3555 3608 2612 1513 731 257 -137 -1114 -2486 -3482 -2701 -1252
3122 -657 -1018 -2054 -1325 714 2351 3092 2952 2783 4215 6654 8426 8639 7563 5736 3780 2368 1220
3105 1220 -170 -1759 -3473 -3505 -1815 -98 1119 1708 1095 -717 -3010 -2891 -1023 336 1340 1199 273 -337
3086e27k12n15j52K55c34B24F2e02l22k48o44j096o98P30Q50J79n14j557a033
3066A683J239Qk92J059K542K543R69n09k129l360A2a185c2G17M27O66O81M44K36
3047C171N6j56j37j66p3J49L39J27o13A053a628k830J346h07B16J93A05d06k31
3028f37a52F49J075M99M99L5q99C76a130j819k067K504c16A328P95j5l56q4j60
3009A508k28o03A6i45j335o4J003b77A5P8L96J53j46C2i60j671k061J41R30N35
2989c086P42j96j58p87m14n26m53L50P08P45P28N77J30K15N51b48I9K4f74j393
2969b067q91Q67h15A86M83k35e43j174m50N66P45L29l63j438p15Q27L18k87o4
2950b249J095I64K474J592j73j621m72l11j34qk91l00m11n56C63c28l99J4c43
$$ plain form
3086 -527 -739 -1254 -1406 -1151 -334 224 62 -502 -824 -1072 -1716 -2812 -3510 -2780 -1930 -1751 -2265 -3822 -1033
3066 1683 2922 2930 2638 3697 6239 8782 9751 9242 7113 3753 12 -1185 -32 717 1144 1810 2491 2935 3171
3047 3171 3227 3071 2934 2768 2695 2844 3183 3310 2697 1053 -1628 -4458 -3112 -807 216 409 105 -406 -637
3028 -637 -152 649 1724 2223 2722 2757 1858 376 -1130 -2949 -5016 -2512 -316 1328 2123 2108 1752 1668 1508
3009 1508 1280 677 16 -945 -2280 -2344 -1341 -277 15 93 489 642 496 32 -960 -2631 -4692 -4551 -3621 -3086
2989 -3086 -2344 -2540 -2698 -3485 -3899 -4425 -4878 -4528 -3820 -3075 -2347 -1770 -1640 -1425 -874 -248 99 123 -674 -2067
2969 -2067 -2958 -2091 -815 186 669 434 -543 -1717 -2167 -1601 -856 -527 -890 -2328 -3043 -2216 -1898 -2185 -2249
2950 -2249 -1154 964 3438 5030 4857 3236 2764 2453 2319 2311 2020 1720 1309 753 363 -328 -727 -713 -343
2930C61P01P59L99O9K26j66j17n07o78m35K62Q61J783J615J694O50o83j793k308
2911B693B14a593j309r10j15J84L11O15J060h29b04I0B7f49j380j951J25a657
2892C00J191J92l88A17i17o28J51m41l82M81b48A275P13o48d76k388l67a232L54
2873h78j093j743j759J088J444J117f03H77J728Q18K26k95q71m88q47B94e15r06
2855a421j81j7M43P4k00K1k41l6J72M19c83e0E51B72h76j645k066k268J150J631
2835d074J219J009P41N42A23N79L69j62b88j616j99Q14f17P1J97A116K090K069
2817E275J687O16m45j464k440F50b065k530k596K315J686J434b54E66K69C39c50
2799b75M8B05R27J033M72j15I51h58r44J08L06k65m44l81R76c78A91P27O36J069
$$ plain form
2930 361 1062 1821 2220 2289 2515 2349 2232 1725 1047 612 874 1735 3518 5133 6827 7477 6794 5001 2693
2911 2693 214 -1593 -2902 -3812 -3927 -3743 -3432 -2817 -1757 -829 -204 90 27 -649 -2029 -3980 -3855 -1657
2892 300 1491 1683 1295 117 -917 -1545 -1394 -1835 -2217 -1736 -248 1275 1988 1340 -476 -2864 -3231 -1232 -878
2873 -878 -1971 -3714 -5473 -4385 -2941 -1824 -603 877 2605 3423 3649 3354 2483 1995 1148 294 -515 -1421
2855 -1421 -1602 -1619 -1176 -1102 -1302 -1281 -1522 -1558 -1386 -967 -383 -50 551 272 -876 -2521 -4587 -6855 -5705 -4074
2835 -4074 -2855 -1846 -1105 -563 123 702 1071 909 -288 -1904 -2103 -1289 -617 -546 -349 1116 3206 5275
2817 5275 6962 7578 7133 5669 3229 650 -2065 -4595 -7191 -4876 -3190 -1756 -254 566 835 339 -350
2799 -275 -227 205 1132 2165 2637 2522 951 -858 -1802 -1694 -1388 -1653 -2097 -2478 -1502 -378 191 918 1554 2623
2779B623J158J385P75R1o09r30p66m72j35j84q61E57a365r01J036d31I5K83j24
2760B54L47P03Q70J374R44J030Q15l06j500j846A86a692j044j6Q34d68A079R42
2742B021J10l4J1o4k13o91c46o11F58J803J413N28J19j63o3N19R3m80r95r59q73
2721A600n58m23a32j260j499p43L79N13N6L67J158A35J464J099M78j41r12I46
2702b15k33J55E3c53j221j361N65i94C33J007L34k34E09f62r61o28j29K61O12
2683a507L87n11r52j018J102N76j42k73K42N03J79l26p36q74n38l79N47K72K32
2664c216P11L93O39L90K56J54n35j095j129n76O73N75j19l19R72b3A140j21k42
2645G77R53K103K347K088J535R17J008P3m88j942k564l021H19a486j011m28n89
$$ plain form
2779 2623 3781 5166 5941 6032 5423 4493 3727 3255 3120 2936 2075 557 -1365 -2266 -1230 -431 95 378 254
2760 254 601 1304 2174 3548 4492 5522 6337 6031 4531 2685 186 -1692 -2736 -2752 -1918 -468 1079 2021
2742 2021 2131 2097 2108 2044 1831 1140 -346 -957 658 2461 3874 4402 4521 4358 4295 4814 4907 4427 3432 2473 1600
2721 1600 1042 619 -132 -1392 -2891 -3634 -3255 -2742 -2686 -2319 -1161 135 1599 2698 3176 3035 2123 946
2702 -215 -448 -293 53 -353 -1574 -2935 -2370 -994 333 1340 1674 1440 509 -662 -1623 -2251 -2380 -2119 -1507
2683 -1507 -1120 -1631 -2583 -3601 -2499 -1923 -2065 -2338 -2096 -1593 -1414 -1740 -2476 -3350 -3888 -4267 -3720 -3448 -3216
2664 -3216 -2505 -2112 -1473 -1083 -827 -673 -1208 -2303 -3432 -4008 -3335 -2760 -2879 -3198 -2226 -23 1140 1019 777
2645 777 1730 3833 6180 8268 9803 10720 11728 11801 11313 9371 6807 3786 819 -1486 -2497 -2925 -3514
2628c514j77P81L11K86j74k36m39j14N25N17O11O67c58A179J290R69K06m19j491
2609A734D64r6P78Q74L35k70r73B27a449j328k68a449d44r8p99j027m10M61i15
2589C84J118M14r28B65f35p23j25K2l02k62P94B09J221J96E86a199k040j776J683
2570c332a623A1J453L81l54B30b078j126a103C76O16l33B34M27Q12P09m30G09
2551a034j140p21n58K13R2O07N28k1l23p21n40M52P94P21N72M24g5o9m60l7I7
2529A082M12o78i57k507qJ436d78A056J301J600J916J970J985J395Q28J37p21
2512A1467j689k288k310j736o30L30L58M8j91n81q18r64A23a55A186J602M07k3
2494C172r6o83I44i33k084k91a302H14J151M91m34n85l88J20L0j81l13k19L0L57
$$ plain form
2628 -3514 -3691 -2910 -2599 -2313 -2487 -2723 -3162 -3276 -2751 -2234 -1623 -956 -358 1179 2469 3438 3644 3225 1734
2609 1734 464 368 1146 2020 2355 2085 1112 227 -1449 -2777 -3045 -1449 -444 -542 -1341 -2368 -2778 -2317 -915
2589 384 1502 1916 988 265 -635 -1358 -1483 -1461 -1763 -2025 -1231 209 1430 1626 586 -1199 -3239 -5015 -3332
2570 -3332 -1623 11 1464 1845 1491 230 -2078 -3204 -1103 376 992 659 234 661 1473 2182 1752 709
2551 -1034 -2174 -2895 -3453 -3240 -3148 -2541 -2013 -2034 -2357 -3078 -3618 -3166 -2372 -1651 -1079 -655 -75 -144 -604 -641 97
2529 1082 1494 816 -957 -3464 -3472 -2036 -478 1056 2357 3957 5873 7843 9828 11223 12051 12188 11467
2512 11467 9778 7490 5180 3444 2814 3144 3502 3550 3359 2778 1960 996 123 -155 1186 2788 3195 3172
2494 3172 3076 2393 944 -933 -3017 -3308 -1302 814 1965 2456 2022 1437 1049 1169 1199 1018 705 486 516 873
2474H73Q1K92K67J28J15H49b28l56K6j85q97j376j502L30L20L46n7K55N61K32
2454b531J34N22g98B00L65b85j952j083J089f76E25Q15l48c85j742j236n70j04
2436d037M61J093J225A94J082M04Q8q81I1a208K44A284J591Q13J45q45A350d76
2417a391k56k10M3L8j77j70K5K95L38N72a53H46J450O53O59J135L0l98n58j27
2397C690N01P78rr50j012r88H67l84j75K19B55a150j565j125N16R04O21K67K29
2378a303c86I51J515J403J119J283J045Q75M76n79j497k527A445g61j675j652
2362d088m19k10m45J099J094J89o37n07J236a297d1D74j32f11j354j120k24L15
2344b994R93d73A297J516O09m46j343i24k659J430D39J514L97n58q17b43j168
$$ plain form
2474 873 954 1246 1513 1641 1756 849 -228 -584 -558 -743 -1640 -3016 -4518 -4188 -3868 -3522 -3579 -3324 -2763 -2531
2454 -2531 -2397 -1875 -798 200 565 -285 -2237 -3320 -2231 -676 525 1340 992 -385 -2127 -3363 -3933 -4037
2436 -4037 -3576 -2483 -1258 194 1276 1680 1768 887 91 -1208 -964 1284 2875 3688 3833 2988 1350 -476
2417 -1391 -1647 -1857 -1814 -1776 -1953 -2123 -2098 -1803 -1465 -893 -153 846 2296 2949 3608 4743 4773 4375 3817 3690
2397 3690 4191 4969 4960 4010 2998 2010 867 483 308 527 255 -1150 -2715 -3840 -3324 -2420 -1799 -1532 -1303
2378 -1303 -386 951 2466 3869 4988 6271 7316 8191 8667 8088 6591 4064 1445 -761 -2436 -4088
2362 -4088 -4507 -4717 -5162 -4063 -2969 -2780 -3417 -3924 -2688 -1297 -41 474 342 -611 -1965 -3085 -3309 -2994
2344 -2994 -2001 -473 1297 2813 3422 2976 1633 -924 -3583 -2153 439 1953 2350 1792 975 -243 -1411
2327a411j819q95J104a465B91J361Q11j7l55l44M8M1J59%q3lJ70L04Q3M75L59
2306C300R8q1m78o93q08C70A08N29L49R5D37e51p76J87b76F9g3m35J21A40O10
2285G50J88k55A0i43j449j686O09J544h13C05Q04J83j22b36j795r28R34h92d02
2265a040j220j435a488H98K074J280M45m1l44M58R91N36j34j206j643A384c59
2247a214M37h4H7K00j13e67o39n44j62Nj11j40L51O63c07B89G7g57j713j406J054
2226b822a176d85k80n80j117n11R06e17A138J633Q09J14o57q00A055A16k1Q96
2208I91J027Q31n33j132g16j485J4J089L63j29Q0b91H97J069N48k74p93B47a195
2188b377j115k67n14j70MJ460J409e14B5a019j490j592P5P58O86O76K48k27q44
$$ plain form
2327 -1411 -3230 -4125 -3021 -1465 291 1652 2463 2446 2091 1747 1795 1836 1995 1995 1912 1909 2079 2383 2466 2941 3300
2306 3300 3398 3317 2839 2146 1338 370 108 637 986 1081 437 -551 -1327 -1140 -276 69 -73 -508 -387 140 750
2285 750 938 683 10 -943 -2392 -4078 -3469 -1925 -813 305 1109 1292 1170 -236 -2031 -2959 -2025 -892 -402
2265 -1040 -2260 -3695 -1488 898 2972 4252 4697 4656 4312 4770 5761 6297 6163 4957 3314 1384 -359
2247 -1214 -777 -84 87 287 174 -567 -1206 -1750 -1912 -1907 -2018 -2158 -1807 -1144 -307 289 77 -757 -2470 -3876 -2822
2226 -2822 -1176 -485 -765 -1345 -2462 -2973 -2067 -517 1138 2771 3580 3694 3037 2237 1055 116 95 991
2208 991 2018 2849 2316 1184 -716 -2201 -2187 -1098 -735 -864 -784 -291 897 1966 2514 2240 1447 247 -1195
2188 -2377 -3492 -3759 -4273 -4443 -4439 -2979 -1570 -514 25 -1019 -2509 -4101 -4026 -3268 -2582 -1906 -1658 -1885 -2729
2169b729M89i44E02J388R78K39p25I25a031j173Q75C67Q62k45A25f38c9A378P52
2150B130k61q80D9b15m8j82j91n23n86j6k25p88j157o92K09J032J042P85K41l01
2130a615p02p25o7M39K02O59Q55d76m36j498k420l80K549d69H01N88N3l08m84
2111F50P3B6a105q58m09M95Q14N00l76p50j317p17L74N21P35h54f7a9j309k480
2091c808o69a063A801K161K89j142A519E46j19j10d77j468k042J56Q50N07L10
2074b164J063A34J171L26n67a08j156n5J68J50n16k65h44I43J661J133p0l15r70
2055B382A057g58j700q88L68N42R31F1J262Q40O99M45k7m42j107B67a664j373
2037c037a232d32m51j496j388l99P66J163h03H39J351O60l03r48C53a20C57N06
$$ plain form
2169 -2729 -2240 -944 502 1890 2868 3107 2382 925 -1031 -2204 -1329 367 1229 984 125 -638 -39 1378 2130
2150 2130 1869 989 49 -215 -263 -445 -636 -1159 -1745 -1761 -1986 -2774 -3931 -4623 -4414 -3382 -2340 -1555 -1314 -1615
2130 -1615 -2317 -3042 -3109 -2670 -2468 -1809 -954 -476 -912 -2410 -4830 -5210 -2661 -469 801 1389 1442 1134 650
2111 650 723 26 -1105 -1963 -2372 -1877 -1063 -563 -939 -1689 -3006 -3723 -3349 -2828 -2093 -854 -67 -19 -1328 -3808
2091 -3808 -4477 -1063 1801 3962 4251 3109 1519 546 427 317 -477 -1945 -3987 -3831 -2981 -2474 -2164
2074 -2164 -1101 134 1305 1631 1064 -108 -1264 -1319 -1151 -1001 -1517 -1782 -844 943 2604 3737 3667 3352 2382
2055 2382 1057 -758 -2458 -3346 -2978 -2436 -1505 61 1323 2163 2862 3307 3280 2838 1731 267 -1664 -3037
2037 -3037 -1232 -432 -883 -2379 -3767 -4166 -3400 -2237 -803 839 2190 2850 2547 1599 353 -120 357 863
2019H63m22c96A56K092K872K658K263P28j223l139B339i57C4L688L646K496J016
2002A0880K0j068j848j506j808j382j115p75j38l27B5h96o89m84m41n50k38R10
1984b388d51A319J302M28q26F53a261n59P03J92l89o60k81O5M51c93B184K029
1966D213J245N08m25j056o35J85M15k68l76r85A264d16j668r51P61Q07g00a36
1947F13J096J117Q02K66q78j144n12k83l83B11f57k72k03q09j712o54K127I2J719
1928A811O23j017b65j515o76N84P90M99b21E13J223J630J311R96k20j195j574
1911B684j105m49O58R74L79m9m86n37l6o3j34m88F62a16p01m62j39M37G9J378
1891A457J152O80op12I50g51n76f0A769J617Q73P4p16q27q60F95i73j763K47f51
$$ plain form
2019 863 441 -396 156 2248 5120 7778 10041 10769 9546 6407 2339 -957 34 3722 7368 9864 10880
2002 10880 10900 9832 7984 6478 4670 3288 2173 1398 1260 933 25 -896 -1585 -2069 -2510 -3060 -3298 -2388
1984 -2388 -451 1319 2621 3049 2223 653 -1261 -1820 -1117 -925 -1314 -1974 -2255 -2190 -1739 -393 2184 4213
1966 4213 5458 5966 5541 4485 3850 4035 4450 4182 3806 2821 1264 -416 -2084 -3035 -2274 -1467 -700 -136
1947 613 1709 2826 3628 3894 3016 1872 1360 1077 694 211 -657 -929 -1132 -1941 -3653 -4307 -2180 92 1811
1928 1811 2434 1417 -265 -1780 -2456 -1872 -1082 -583 -221 513 1736 3366 4677 5673 5453 4258 2684
1911 2684 1579 1130 1788 2762 3141 3092 2606 2069 2033 1970 1836 1348 662 -116 -817 -1279 -1418 -981 79 1457
1891 1457 2609 3289 3283 2571 950 -751 -1327 -60 1769 3386 4259 4333 3617 2790 1930 695 -973 -2736 -2489 -651
1870A558J592J630J324N15m36j417k075C49h41I2J895J777O57k69r42n95K51Q96
1852C762J051Q07M3p80j391j744D48h58m94r60k134O07J757c22A359N25m19d36
1833a791f35A672J776O61k40j016q14o37m69A42d20l15m49j66L47L34K22I6P65
1814H61Q99J121Q93O12m33j163G30a495j253J50J34o21j496j781J833a472H16
1796B365N46J25n17j128a38j635j559j5P62O29P28M11L21J81J2p6J0J31A91K03
1776C94J347R58L57L57l2l29m95n85n98o04A8f41j525j971j200j063N49J418J84
1757d249K37O38J171J097e29a40A42J92M26L42K34k15l10b4j005l43N26A41M67
1738F08J73j84F8e93l37k7L67b89m30j091j613j400k38K024e31I64N58o23a023
$$ plain form
1870 1558 3150 4780 6104 6619 6183 4766 2691 349 -841 92 1987 3764 4421 4152 3210 2615 2866 3762
1852 3762 4813 5620 5663 4883 3492 1748 448 -858 -1352 -2312 -4446 -3839 -2082 -322 1359 1884 1465 -436
1833 -1791 -635 1672 3448 4109 3869 2853 2039 1402 933 142 -420 -735 -1184 -1350 -1003 -669 -447 96 861
1814 861 1760 2881 3774 4386 3953 2790 730 -1495 -2748 -2598 -2464 -3085 -4581 -6362 -4529 -1472 816
1796 2365 2911 3036 2519 1391 -138 -1773 -3332 -3347 -2585 -1956 -1228 -817 -496 -315 -303 -379 -369 -238 191 394
1776 394 1741 2699 3056 3413 3381 3052 2557 1972 1374 770 18 -641 -2166 -4137 -5337 -6400 -5851 -4433 -4249
1757 -4249 -4012 -3374 -2203 -1106 -529 -140 142 334 760 1102 1336 1121 811 -24 -1029 -1372 -846 141 608
1738 608 781 597 68 -593 -930 -957 -590 -289 -719 -1810 -3423 -4823 -5061 -3037 -531 964 1522 899 -1023
1718c708K06a253b18n27j489j508P61J207j7k26m75m04k23O53a099A68R78Q70
1700B016P20M93N5k98q53G80b53r08j202j094j60L35J479a48H29M4i5j406j344
1681b845o89O21J80R75g85c52m23j382j276o69J454a076c1D02D5d09j029j063
1663b501p81N11a370a7G83J8C15c10l36l25j267j954J060f79A384P72K72k46q32
1644A350n06N13P19M27m90r34b74j872j260N94P62M30J65k84k16k80J43J36J23
1625a833%k21k6k0J4n1K52j1O03a19A181Q26L18q2m68m35k74J78K26N1j6G37d64
1601b128j602j670j489J585K017J248M96J22J58M26L90k13l62j27J02c56L7k90
1583f09L6F2P54M70O97L37Q26L05l29p83j032d94k039j118L79J242Q31J28q00
$$ plain form
1718 -3708 -3502 -1253 -218 -745 -2234 -3742 -2981 -1774 -1791 -2017 -2492 -2896 -3119 -2466 -1099 168 1146 2016
1700 2016 2736 3229 3284 2986 2133 780 -253 -1161 -2363 -3457 -3617 -3282 -1803 -148 829 873 -95 -1501 -2845
1681 -2845 -3534 -2913 -2733 -1758 -785 -352 -775 -2157 -3433 -4102 -2648 -1076 -31 402 45 -409 -1438 -2501
1663 -2501 -3282 -2771 -1370 -17 783 801 315 -310 -646 -971 -2238 -4192 -3132 -679 1384 2156 2428 2182 1350
1644 1350 844 1357 2076 2503 2013 1079 -274 -2146 -3406 -2812 -2050 -1620 -1455 -1739 -1955 -2235 -2092 -1956 -1833
1625 -1833 -1833 -2054 -2080 -2100 -2086 -2137 -1885 -1896 -1293 -119 1181 2007 2325 2243 1775 1340 1066 1244 1470 1521 1505 737 -464
1601 -2128 -3730 -5400 -6889 -5304 -3287 -2039 -1543 -1421 -1263 -837 -447 -660 -1022 -1149 -1047 -356 -319 -609
1583 -609 -573 62 816 1286 1983 2320 3146 3451 3122 2339 1307 -494 -2533 -3651 -3272 -2030 -1199 -1071 -1871
1564a871j670L33a314A68Q57M10qn52C05K22K70J144J815R99j63q55j92J00M79
1545D124q7m00j320k80n41l84K16O09P35M19l44q40D75a165j782o91J261J116
1527a261d50J6j1n8k07l00q69j162L19N49Q97I4J949K213J404M37J34j6r2j075
1507E048j560j324j076rM31M48J33o49E62c5B21J095L72q42C87N81J225M03o73
1488A923C98a184j438n73J79J50K82J037M61d44E5g4j6m01K18E5M95L18P40N67
1468B175l53G79f05p18K87e7A168R86O24j4o84A035c45j539r81k0a397D5J091
1449A136M18M53Q5J13J22o43E08a036j128k66R14g38A65Q96O18O96Q75R17M90
1430D657l21r30A666c02j720K16D77K247J190J036l08j409G76a921j009a221d0
$$ plain form
1564 -1871 -3541 -3208 -1314 168 1025 1435 1427 875 305 527 797 1941 3756 4755 4592 3737 3545 3645 4124
1545 4124 4037 3637 2317 2037 1496 1112 1328 1937 2672 3091 2747 1907 475 -1165 -2947 -3638 -2377 -1261
1527 -1261 -450 -434 -445 -503 -710 -1010 -1879 -3041 -2722 -2173 -1276 94 2043 4256 5660 6097 6231 6215 6123 5048
1507 5048 3488 2164 1088 1079 1510 1958 2091 1442 562 -35 221 1316 1688 846 387 968 2193 2596 1923
1488 1923 398 -1184 -2622 -3195 -3016 -2866 -2584 -1547 -1086 -444 55 -74 -90 -491 -273 55 550 868 1608 2175
1468 2175 1822 779 -605 -1323 -1036 -57 1168 2154 2778 2764 2080 1035 -345 -1884 -2865 -2885 -1397 45 1136
1449 1136 1554 2007 2092 2205 2327 1684 508 -1036 -2164 -2430 -1516 -738 165 1061 1679 2375 3250 4167 4657
1430 4657 4336 3406 1666 -302 -2022 -1806 477 2724 3914 4950 4642 3233 776 -1921 -2930 -1221 -40
1412H91M60L68l36D00B0Ma81j8k81oJ91A45L89L94QB46a030j869J221A641K937
1391D578K723J780M3j055k113k784A037C42a48j137j943J248H05K623J679N40
1375E647o75r18k09Q5N24j77q11j438d0j449j187k74J411G62K189J734O71o45
1357D711j355j176k00J018J111Q01n90j427F46a461j860p71J890C81J769R74o26
1340B498C28a746a95B049J516K85j88k0K97N06L51k96o32o90j198C24i04n29k94
1321a727o91r69m53J557a048b25B26k6a1l63l82j17L77I8M87P5E7b23l96m94l82
1300a495q29j287j534L97L2J68M25J968R35L71l63m20l85o9O93f00J97p5k74o50
1280a402j214j033J243R24O46c61a10B22L68K32p6n0J97L56M68K46r76h40k027
$$ plain form
1412 891 1351 1719 1383 400 20 24 -181 -199 -480 -486 -295 145 534 928 936 246 -1030 -2899 -1678 1641 4578
1391 4578 7301 9081 9124 8069 5956 3172 1037 342 -148 -1285 -3228 -1980 805 3428 5107 5647
1375 5647 4972 4054 3845 3930 4454 4277 3466 2028 -40 -1489 -2676 -2950 -1539 762 2951 4685 5356 4711
1357 4711 3356 2180 1980 2998 4109 4910 4320 2893 646 -1461 -3321 -4092 -2202 381 2150 3124 2498
1340 2498 328 -1746 -195 2049 3565 3850 3662 3642 3939 4445 4796 4500 3868 3178 1980 324 -904 -1433 -1727
1321 -1727 -2418 -3387 -3840 -2283 -1048 -225 226 200 -11 -374 -756 -873 -496 98 585 660 57 -223 -619 -1113 -1495
1300 -1495 -2324 -3611 -5145 -4748 -4716 -4548 -4123 -2155 -1220 -849 -1212 -1632 -2017 -2086 -1393 -600 -403 -478 -752 -1402
1280 -1402 -2616 -3649 -2406 -1482 -836 -361 -110 222 590 822 746 696 893 1249 1717 1963 987 -840 -2867
1261b867J59C6K044Q32m14A233Hi53l21L07a09A325J285J020O92M50p4n39q15
1242C344p70p55m33o18C48H0M46O95K61M0p3K0l5J78K82J02j59o11D15A93P76
1221I69Q80M3n61A86a142q97l07J8M67Q27B67Q70K64J56o17c78j797j232J21M47
1201b839J038c98C29A32d39j167r70m08J45L86Q58P26a29I02O96J10n50a11p76
1182h87n26j111l80M29e67A578J512L08j064A42b397O49A71J624J146o5j111B18
1163g14j69K09J50a41A36B3a008j785j41A63K898J375j22j553F44a524j496j07
1145c127O68M30M65J68L5l60K3J03l8m63j178n66J393a068B25J018O03L1o5k82
1125A530l70D59a48q68r55n02K3K47N88f34H64J345N89m60l68p49D27c58k9C77
$$ plain form
1261 -2867 -2708 36 2080 2912 2498 1233 8 -953 -1274 -967 -109 1325 2610 3630 4322 4772 4698 4159 3344
1242 3344 2574 1819 1386 768 348 80 526 1221 1482 1522 1449 1469 1434 1612 1894 1996 1837 1226 415 193 969
1221 969 1849 1892 1331 186 -1142 -2039 -2346 -2328 -1861 -1034 267 1137 1401 1557 940 -378 -2175 -3407 -3286 -2839
1201 -2839 -1801 -398 329 132 -439 -1606 -2576 -2984 -2839 -2453 -1595 -869 -129 902 1598 1708 1158 -111 -887
1182 -887 -1413 -2524 -2904 -2475 -567 1578 3090 3398 2334 142 -2397 -1748 171 1795 2941 2876 1765 218
1163 -714 -883 -674 -524 -141 136 23 -1008 -2793 -2934 163 3061 4436 4314 2761 644 -1524 -3020 -3127
1145 -3127 -2459 -2029 -1564 -1396 -1361 -1721 -1698 -1595 -1633 -2096 -3274 -3840 -2447 -1068 225 1243 1846 1877 1812 1530
1125 1530 1160 459 -148 -1016 -1971 -2473 -2450 -2203 -1615 -634 864 2209 2798 2338 1970 1221 427 -358 -387 377
1104A254N26J10M7r0j90o72D62f43j576r75l5J582c6A183M14n71F2a287j198k51
1084b736R07c42A152J609J730J816J143K53n13q21j053j844A131a891j630a572
1067D18Q43n88h10j748j174K97J478@A263L50G55d53r55r78q35j183n3R80L36
1048c141Q4j79R85e4A731N38k34p64a011l106j79J193J242e98a70N4k64m50q14
1029a644p96o36l46N17J038e35I12J140R50O6l88r03C93a281p05i42b21j20l12
1010f53j07K5J68J43j98m9j87n91q05r64k36M97a424O80r3K94E01J896J499J040
990D936k57j668H83a475j294m1L54L34N07P84FL41j38a00l75m48k66J32N26J04
970d27l86j344k034M87J039Q73g25A59Q49M42k52n41k58K25p1@g94o78m81o61
$$ plain form
1104 1254 1780 1890 1937 1847 1657 985 462 -643 -2219 -3194 -3229 -1647 -36 1183 1597 1026 62 -1287 -2485 -2736
1084 -2736 -1829 -342 1152 2761 4491 6307 7450 7703 7190 6369 5316 3472 1131 -1891 -3521 -1572
1067 418 1261 673 -810 -2558 -3732 -3435 -1957 0 1263 1613 755 -453 -1408 -2386 -3221 -4404 -4457 -3477 -3141
1048 -3141 -3057 -3236 -2251 -54 1731 2269 2035 1271 -1011 -4117 -4296 -3103 -1861 -598 -170 -116 -380 -830 -1644
1029 -1644 -2440 -3076 -3422 -2905 -1867 -535 912 2052 3002 3068 2680 1777 393 -1281 -1986 -942 -221 -341 -653
1010 -653 -760 -735 -567 -424 -622 -671 -858 -1449 -2254 -3218 -3454 -2957 -1424 -744 -837 -543 501 2397 3896 4936
990 4936 4679 3011 883 -1475 -2769 -2810 -2456 -2122 -1615 -831 6 347 209 -100 -475 -923 -1189 -1057 -531 -427
970 -427 -813 -2157 -4191 -3704 -2665 -1792 -725 159 1008 1450 1198 657 399 624 553 0 -794 -1472 -1953 -2614
950b614j034O47h14G03J111M34m50H57a61j110m84L44C37J832J614O55K20M89
932E147k01k4J83M39O13K58p48j606j785C01a211n74%M3m64q17J406A356L150
913D506K490J742O45j55j054j841k046j924G21a9D76M08B53d34o39M1j303p67
895c102N4J248b90G09K88m26f26j117j269p49o2J445d93H37R94K9o29b1j702m17
875b140J010D00J422R20N33k02r71G84i51j823l74a369e35p1l49J56D89J045J96
856A730G68a318j493H28K654J364o5j158A591f72k145j87a429a01F32J32l57j24
838B83L95N89M51M35N76L60j02o90m50l6N96K10m28P0N60L62k63j428d42o69F65
816B233O42m07A140m29J413J289J21j029F80a018M78B157K369O23j264j871A96
$$ plain form
950 -2614 -3648 -3001 -814 703 1814 2248 1798 857 -161 -1271 -1755 -1411 337 2169 3783 4438 4658 5147
932 5147 4946 4922 5105 5544 6157 6415 5667 4061 2276 301 -1211 -1785 -1785 -1742 -2206 -3023 -1617 1356 4506
913 4506 6996 8738 9383 9228 8174 6333 4287 2363 721 -19 476 884 253 -434 -1073 -1032 -2335 -3102
895 -3102 -3048 -1800 -290 709 997 571 -626 -1743 -3012 -3761 -3823 -2378 -493 837 1831 1860 1231 -21 -1723 -2140
875 -2140 -1130 400 1822 2742 3275 3073 2102 784 -951 -2774 -3148 -1369 -535 -606 -955 -799 489 1534 1730
856 1730 768 -1318 -2811 828 3482 4846 4781 3623 1591 -672 -2817 -3004 -1429 -101 632 764 407 283
838 283 678 1267 1718 2153 2729 3089 2987 2297 1847 1811 2407 2617 2189 2259 2819 3181 2918 1490 -442 -1111 665
816 2233 2875 2468 1140 711 2124 3413 3534 2505 680 -1018 -540 2157 4526 5149 3885 2014 196
798EO41A82a132j619J005e21K49j061j776n6a069F65P70o45h42j941q12J068Q25
779a702d42A038J406R72L34q52A328B54c14n22q06q34j00P14J63n21O10F44K540
760C184J896M34j327A741a594k817J557J415e07a48k15q99j447j271a674A325
743C550J524R77K04o44j164j785H52f10r21l80J15R3j12q9L52P63A81P39O13N21
723B054O56N45j67j61o07K4N00M22m9l43o82q74F25b70j322j461K08a282H75J789
703B664R46j3k68l91m76l11l20n24E21f89j237M47a83A021O64K1n63a08j903j074
683c085L94J214N07k22r96q67M63i45E89R26N37q29J479L74j291i89l247b070
664I40K354J725M87n39j206j472o90j36P56P83k79j085H04O73J351P02k08o96
$$ plain form
798 5 646 182 -1132 -2751 -1746 -521 -272 -1333 -3109 -3165 -1069 665 1435 790 -842 -2783 -3595 -2527 -1702
779 -1702 -442 1038 2444 3416 3750 2898 1328 254 -314 -836 -1642 -2476 -2576 -1862 -1699 -2220 -1610 644 3184
760 3184 5080 5514 4187 1741 -1594 -4411 -2854 -1439 -507 -148 -363 -1262 -2709 -3980 -1674 1325
743 3550 5074 6051 6255 5611 4447 2662 852 -610 -1531 -1911 -1796 -1703 -1815 -1904 -1552 -789 181 920 1533 2054
723 2054 2710 3255 3088 2927 2320 2344 2844 3266 3217 2874 2192 1318 625 -270 -1592 -3053 -2845 -1282 875 2664
703 2664 3610 3597 3329 2938 2462 2151 1831 1307 521 -689 -1926 -1479 -183 1021 1685 1706 1143 -108 -2011 -3085
683 -3085 -2691 -1477 -970 -1192 -2188 -3055 -2592 -945 589 1515 2052 1223 2702 3076 1785 -989 -4236 -2070
664 940 3294 5019 5506 4967 3761 2289 1599 1463 2219 3002 2723 1638 804 1477 2828 3530 3322 2626
646B626j049E70e86r41n55l24K16K58K96j50k49M33P79CQ83L19l53a99p04L52
626e51D05P38j5d8j812j953j89J226L23J11M10i58j01m18K85d39E74K92k50A8
605a284j991L30a098E65N99m08a03p83M9K05J24l54q92j378J455G4Q70C68i41
585a813k85N62f03i4A411J518J505J040R9j074k066D47i21p76l97p46r1i84A246
565C211R16j60j344A060c33B07J404J877L97j100E75a796O64A099J397L27n38
548B285j097A41d49q22p20j175j303r00L78L64j83J078Q84M89O94m36j174n17
530c792J698g78b23j03r16r23m76j28j117J45J410h22F92J075Q73K8p51F54e69
510a233j45f71D93J561J957K113P01J78q92j614k037C08a397j016K13L84M48Q6
$$ plain form
646 2626 1577 570 -586 -1527 -2082 -2406 -2190 -1932 -1636 -1786 -2035 -1602 -823 3 886 1205 852 -199 -903 -551
626 -551 405 1143 1128 -48 -1860 -3813 -4002 -2776 -2453 -2342 -1932 -958 -1059 -1477 -1192 -439 574 866 616 18
605 -1284 -3275 -2945 -1098 565 1164 756 -103 -886 -837 -632 -508 -862 -1754 -3132 -1677 74 944 368 -941
585 -1813 -2098 -1536 -603 -94 1411 2929 4434 5474 5573 4499 2433 447 -921 -1697 -2094 -2840 -2931 -984 1246
565 3211 4127 3967 2623 1060 -333 207 1611 3488 3885 2785 575 -1796 -1132 1099 2496 2823 2285
548 2285 1188 141 -449 -1271 -1991 -3166 -4469 -5369 -4991 -4627 -4810 -3732 -2848 -2359 -1665 -2101 -3275 -3792
530 -3792 -2094 -778 -223 -326 -1242 -2165 -2641 -2769 -3886 -3741 -2331 -822 692 1767 2640 2668 1917 654 -569
510 -1233 -1378 -671 493 2054 4011 6124 6825 7003 6111 4497 2460 308 -1397 -2413 -2200 -1816 -1368 -1282
492a282J11K5j63j97k74l69K3M17O10A56J514J488Q64l12j187E84a544j094O81
473a957N88m6o83n28r3M66N12J05k36j34P64a77B76e2o87r21l51L22K81K90K36
452h82J17J85b50B98N87N55K08k58n74C65a27l3L6B16O30Q63J617J561J434R03
432G224M63l6l11l53m00n56j69M47N49N73l95r01j794j723E88a117l63e50E69
412A445l31c88j895j521J5Q11j46q24M38J72J09NL94O31K58M43M38c32B08j03
392A05h52p02e52A358J043M20j109a75k457p46J652g79k2n7KJ99b91D8N08M95
372A051M32n6F74b39r15r94m74a142A316K836K262J229J71j201k014k062p94Q87
354B630J544R14r7j028j696C19g54F5J959K015K013J061Q9p67p85j642j746B78
$$ plain form
492 -1282 -1171 -1146 -1309 -1506 -1780 -2149 -2126 -1709 -1099 156 1670 3158 4022 3710 2523 584 -1544 -2638 -1957
473 -1957 -1369 -1415 -2098 -2626 -2719 -2253 -1741 -1636 -1872 -2006 -1242 -177 276 -52 -739 -1660 -2011 -1689 -1408 -1118 -882
452 -882 -765 -580 -250 298 885 1440 1648 1390 816 365 -127 -160 -124 216 846 1709 3326 4887 6321 7224
432 7224 7687 7651 7340 6987 6587 6031 5862 6309 6858 7431 7036 6135 4341 2618 588 -1117 -1480 -550 569
412 1445 1114 -388 -2283 -3804 -3789 -2978 -3124 -3948 -3510 -3338 -3229 -3224 -2830 -2199 -1941 -1498 -1060 -332 208 105
392 105 -852 -1554 -552 1358 2401 2821 1712 -175 -2632 -3378 -1726 -779 -801 -858 -856 -657 -291 48 556 1051
372 1051 1483 1427 674 -239 -1154 -2148 -2622 -1142 1316 4152 6414 7643 7814 6613 4599 2537 1743 2630
354 2630 4174 5088 4991 3963 2267 319 -754 65 2024 4039 6052 7113 7202 6435 5650 4008 2262 278
335a853k284j331K307i69D21O38M77k55A05b072r35g90A781J802J26j540A015
317G81P61R45M59N13p5j60n64r08D01a385j939n56J085a272a07G64K18k59a17
297a535j728j551K131e89A047J158R59J97j65l04J8J98l08k93R8J456J966J399
279G426q4j533j981j888E60c6p47k02J53b40H32M72M71M73O09O84P52j89k52j050
259B802I18i42j515o44l97r1r4J04K90M75J144P84a74A635R67K19m73q28p26k68
239E26k03E5e06q65m55g89A154K207J673P07p10j308A455e81j449r96K82P08i47
219c39Q5o82j124m38K37J100c0G74M04M49j31j95l16k43K8L25L27m9o61g86j988
198b774n50a129B68J58b39p54Pd78L2l62r7c81e4j49j67N8D03O61N2m37A31a14
$$ plain form
335 -1853 -4137 -5468 -3161 -969 421 1059 1536 1281 105 -2072 -3007 -790 1781 3583 3709 2169 1015
317 781 1542 2487 2946 3459 3384 3224 2660 1752 401 -1385 -3324 -3880 -2795 -1272 -107 764 982 723 -117
297 -1535 -3263 -4814 -2683 -589 1047 2205 3164 3361 3196 2892 2910 3108 2800 2507 2605 4061 6027 7426
279 7426 7342 5809 3828 1940 560 -36 -783 -985 -832 -240 832 1304 1775 2248 2857 3541 4293 4104 3852 2802
259 2802 918 -942 -2457 -3101 -3498 -3589 -3683 -3579 -3289 -2814 -1670 -886 -174 1635 2602 2821 2348 1520 794 526
239 526 323 55 -506 -1371 -1826 -789 1154 3361 5034 5741 5031 3723 1455 -581 -2030 -3026 -2744 -2036 -947
219 -339 -254 -936 -2060 -2498 -2261 -1161 -30 774 1178 1627 1496 1301 985 742 770 1095 1422 1373 712 -786 -2774
198 -2774 -3324 -1129 268 426 -239 -993 -986 -478 -446 -808 -905 -381 -54 -203 -370 -312 403 1064 1116 679 131 -114
175d00k49p26o44j12c60A962J686O07m2l72o03p90r82k95O78J029R65K19j677
156B385d82k918L47Q65L65K87M11q1o07p99k48l1m31j33J05O96N81J02j10j80
136b261m85N11d02A498J272P4j085p06Q21J246L15j109D5b857o90a511D3O87N76
117A306J13J46O3K07L15K18O7l01o09o33C87A14c38k28B19J347R74Q94O48m31
97C651j302H84k28R44Q47n33C37i87j56d27E6N12L68J97E39a28C4P96N09n87d80
75a490J02K11q0K55a48C58p3E9J069K497K708J762j82j871B994G9a653j01M44
56a310M38r9q36P20G89J293L80n32A71a921L70d81r1q53j653j54a087A48ma152
35c135M63Q63N9n21j222J580dI02C24a380j5G30J674K42j285d28g3A128j08d48
$$ plain form
175 -400 -649 -1375 -2019 -2131 -360 1962 3648 4255 4213 3841 3238 2448 1466 1171 1849 2878 3843 4062 2385
156 2385 -482 -3400 -3053 -2188 -1823 -1536 -1125 -1206 -1813 -2612 -2860 -2891 -3322 -3455 -3350 -2654 -2073 -1971 -2081 -2261
136 -2261 -2746 -2235 -402 1498 2770 2844 1759 1053 1874 3120 3435 2326 45 -2857 -3547 -1511 43 730 1306
117 1306 1419 1565 1628 1835 2150 2368 2435 2134 1525 892 387 114 -338 -566 219 1566 2540 3434 4082 3651
97 3651 2349 884 656 1600 2447 1914 337 -987 -1143 -427 56 568 936 1133 539 -128 34 830 1339 752 -480
75 -1490 -1388 -1177 -1257 -1002 -148 358 285 59 1128 3625 6333 8095 7913 6042 2994 79 -1653 -1754 -1310
56 -1310 -872 -971 -1807 -1087 789 2082 2462 1930 171 -1921 -1551 -481 -572 -1425 -3078 -3232 -1087 148 144 -1152
35 -3135 -2672 -1809 -1750 -2271 -3493 -1913 -4 902 324 -1380 -1395 730 2404 2646 1361 -428 -73 1128 1020 -448
14a812e56A282O57n69F47J082J670P05o68A713A54f73a58A391
$$ plain form
14 -1812 -556 1282 1939 1370 647 1729 3399 4104 3436 1713 154 -673 -158 1391
##PAGE= F1=-0.101556585365
##FIRST=     25.9928259484165, 8223.18227667557, 3056
##DATA TABLE= (F2++(Y..Y)), PROFILE
16383C056R70p66A230a869N50I42O04D08b111k329b000e66k2q93L62a49H86M7
16365I33l71RB44c69K6A077J658J218o0j184j090E65b13r81n48e72G60M05A71
$$ plain form
16383 3056 4026 3260 1230 -1869 -1319 942 1546 408 -2111 -4440 -2000 -566 -588 -1481 -1119 -149 886 933
16365 933 562 571 244 -369 -343 1077 2735 3953 3893 2709 1619 565 -213 -1194 -1742 -572 760 1165 171
$$ [...]
0c74
##END NTUPLES=nD NMR SPECTRUM
##END=
