
##TITLE=AC1413_GUAAH12222_7653369_UeGlL0LtLT
##JCAMPDX= 6.0         $$ Bruker NMR JCAMP-DX V2.0
##DATA TYPE= NMR SPECTRUM
##DATA CLASS= NTUPLES
##ORIGIN= BRUKER
##OWNER= Administrator
$$ 1.72 TOPSPIN		Version 2.1
$$ 2013-03-19 21:04:52.466 -0500  Administrator@X
$$ Compression mode = diff/dup
##.OBSERVE FREQUENCY= 400.02188249412
##.OBSERVE NUCLEUS= ^1H
##.ACQUISITION MODE= SIMULTANEOUS (DQD)
##.ACQUISITION SCHEME= undefined
##.AVERAGES= 64
##.DIGITISER RES= 22
##SPECTROMETER/DATA SYSTEM= spect
##.PULSE SEQUENCE= noesygpps1d.comp
##.SOLVENT NAME= COFFEE_meoh
##.SHIFT REFERENCE= INTERNAL, COFFEE_meoh, 1, 14.9609
##AUDIT TRAIL= $$ (NUMBER, WHEN, WHO, WHERE, PROCESS, VERSION, WHAT)
$$ ##TITLE= Audit trail, TOPSPIN		Version 2.1
$$ ##JCAMPDX= 5.01
$$ ##ORIGIN= Bruker BioSpin GmbH
$$ ##OWNER= Administrator
$$ $$ E:\/data/COFFEE/nmr/AC1413_GUAAH12222_7653369_UeGlL0LtLT/12/pdata/1/auditp.txt
$$ ##AUDIT TRAIL=  $$ (NUMBER, WHEN, WHO, WHERE, PROCESS, VERSION, WHAT)
(   1,<2013-03-19 21:04:46.513 -0500>,<Administrator>,<X>,<go>,<TOPSPIN 2.1>,
      <created by zg
	started at 2013-03-19 20:53:16.607 -0500,
	POWCHK enabled, PULCHK disabled,
       configuration hash MD5:
       86 BA 57 50 F2 9D 5C 9B 26 00 A9 28 5F 66 2E 89
       data hash MD5: 64K
       65 7C FA 99 55 F7 F4 96 A4 46 3A 0E 20 F6 75 32>)
(   2,<2013-03-19 21:04:49.670 -0500>,<Administrator>,<X>,<proc1d>,<TOPSPIN 2.1>,
      <Start of raw data processing
       efp LB = 0.3 FT_mod = 6 PKNL = 1 PHC0 = 0 PHC1 = 0 SI = 128K 
       data hash MD5: 128K
       40 2B 1F B6 F6 B4 74 CC 78 31 68 DA 73 00 A3 A7>)
(   3,<2013-03-19 21:04:50.716 -0500>,<Administrator>,<X>,<proc1d>,<TOPSPIN 2.1>,
      <pk PHC0 = -77.09106 PHC1 = 0 
       data hash MD5: 128K
       E7 08 18 FB CE CC A8 D4 22 DE 01 0C 1D 0E A4 A1>)
(   4,<2013-03-19 21:04:51.373 -0500>,<Administrator>,<X>,<proc1d>,<TOPSPIN 2.1>,
      <abs ABSG = 1 
       data hash MD5: 128K
       C1 41 6B 6E 90 44 68 B8 88 D9 72 CD 07 C6 D1 71>)
(   5,<2013-03-19 21:04:51.560 -0500>,<Administrator>,<X>,<proc1d>,<TOPSPIN 2.1>,
      <abs ABSG = 2 
       data hash MD5: 128K
       EF F0 10 21 FF EF 25 E3 EC 0B F7 E8 9F CD 22 93>)
(   6,<2013-03-19 21:04:51.763 -0500>,<Administrator>,<X>,<proc1d>,<TOPSPIN 2.1>,
      <abs ABSG = 3 
       data hash MD5: 128K
       B6 C0 43 32 E3 48 5E 2A 30 80 5B 40 1D 61 7D 59>)
(   7,<2013-03-19 21:04:51.935 -0500>,<Administrator>,<X>,<proc1d>,<TOPSPIN 2.1>,
      <abs ABSG = 4 
       data hash MD5: 128K
       06 74 52 96 87 0C 5A 9B 23 28 21 58 A3 0B CC AD>)
(   8,<2013-03-19 21:04:52.107 -0500>,<Administrator>,<X>,<proc1d>,<TOPSPIN 2.1>,
      <abs ABSG = 5 
       data hash MD5: 128K
       21 95 FC C1 1E 29 F8 49 D4 33 AC 7B 50 08 90 7E>)
$$ ##END=
$$ 
$$ $$ hash MD5
$$ $$ F1 73 99 F1 BB 13 9C A3 42 C8 B1 85 68 86 24 2E
##$RELAX= 
##$RELAX= 
##$RELAX= 
##$RELAX= 
##$RELAX= 
##$RELAX= 
##$RELAX= 
##$RELAX= 
$$ Bruker specific parameters
$$ --------------------------
##$DU= <E:\>
##$EXPNO= 12
$$ [...]
150 150 150 150 150 150 150 150
##$TP07= 0
##$TPNAME0= <>
##$TPNAME1= <>
##$TPNAME2= <>
##$TPNAME3= <>
##$TPNAME4= <>
##$TPNAME5= <>
##$TPNAME6= <>
##$TPNAME7= <>
##$TPOAL= (0..7)
0.5 0.5 0.5 0.5 0.5 0.5 0.5 0.5
##$TPOFFS= (0..7)
0 0 0 0 0 0 0 0
##$TUNHIN= 0
##$TUNHOUT= 0
##$TUNXOUT= 0
##$USERA1= <user>
##$USERA2= <user>
##$USERA3= <user>
##$USERA4= <user>
##$USERA5= <user>
##$V9= 5
##$VALIST= <valist>
##$VCLIST= <CCCCCCCCCCCCCCC>
##$VD= 0
##$VDLIST= <DDDDDDDDDDDDDDD>
##$VPLIST= <PPPPPPPPPPPPPPP>
##$VTLIST= <TTTTTTTTTTTTTTT>
##$WBST= 2048
##$WBSW= 25
##$XGAIN= (0..3)
0 0 0 0
##$XL= 0
##$YL= 0
##$YMAX_a= 6066924
##$YMIN_a= -13190703
##$ZGOPTNS= <>
##$ZL1= 120
##$ZL2= 120
##$ZL3= 120
##$ZL4= 120
##$ABSF1= 14.9609
##$ABSF2= -5.597281
##$ABSG= 5
##$ABSL= 3
##$ALPHA= 0
##$AQORDER= 0
##$ASSFAC= 0
##$ASSFACI= 0
##$ASSFACX= 0
##$ASSWID= 0
##$AUNMP= <proc_prof1d_extract.lims>
##$AXLEFT= 0
##$AXNAME= <>
##$AXNUC= <1H>
##$AXRIGHT= 0
##$AXTYPE= 0
##$AXUNIT= <>
##$AZFE= 0.1
##$AZFW= 0.1
##$BCFW= 0
##$BC_mod= 0
##$BYTORDP= 0
##$COROFFS= 0
##$CY= 15
##$DATMOD= 1
##$DC= 0
##$DFILT= <>
##$DTYPP= 0
##$F1P= 0
##$F2P= 0
##$FCOR= 0.5
##$FTSIZE= 131072
##$FT_mod= 6
##$GAMMA= 0
##$GB= 0
##$INTBC= 1
##$INTSCL= 1
##$ISEN= 128
##$LB= 0.3
##$LEV0= 0
##$LPBIN= 0
##$MAXI= 10000
##$MC2= 0
##$MEAN= 0
##$ME_mod= 0
##$MI= 0
##$NCOEF= 0
##$NC_proc= -2
##$NLEV= 6
##$NOISF1= 0
##$NOISF2= 0
##$NSP= 0
##$NTH_PI= 0
##$NZP= 0
##$OFFSET= 14.9609
##$PC= 1
##$PHC0= -77.09106
##$PHC1= 0
##$PH_mod= 1
##$PKNL= yes
##$PPARMOD= 0
##$PPDIAG= 0
##$PPIPTYP= 0
##$PPMPNUM= 2147483647
##$PPRESOL= 1
##$PSCAL= 4
##$PSIGN= 0
##$PYNMP= <proc.py>
##$REVERSE= no
##$SF= 400.020009675457
##$SI= 131072
##$SIGF1= 0
##$SIGF2= 0
##$SINO= 400
##$SIOLD= 131072
##$SPECTYP= <>
##$SREGLST= <1H.CDCl3>
##$SSB= 0
##$STSI= 131072
##$STSR= 0
##$SW_p= 8223.68421052631
##$SYMM= 0
##$S_DEV= 0
##$TDeff= 65536
##$TDoff= 0
##$TI= <>
##$TILT= no
##$TM1= 0
##$TM2= 0
##$TOPLEV= 0
##$USERP1= <user>
##$USERP2= <user>
##$USERP3= <user>
##$USERP4= <user>
##$USERP5= <user>
##$WDW= 1
##$XDIM= 131072
##$YMAX_p= 433696470
##$YMIN_p= -10644
##$CURPLOT= <Network HP LaserJet P1505>
##$CURPRIN= <$Network HP LaserJet P1505>
##$DFORMAT= <normdp>
##$LAYOUT= <+/1D_H.xwp>
##$LFORMAT= <normlp>
##$PFORMAT= <normpl>
##$SURQMSG= 1
$$ End of Bruker specific parameters
$$ ---------------------------------
##NTUPLES= NMR SPECTRUM
##VAR_NAME=  FREQUENCY,     SPECTRUM/REAL,   SPECTRUM/IMAG
##SYMBOL=    X,             R,               I
##VAR_TYPE=  INDEPENDENT,   DEPENDENT,       DEPENDENT
##VAR_FORM=  AFFN,          ASDF,            ASDF
##VAR_DIM=   131072,        131072,          131072
##UNITS=     HZ,            ARBITRARY UNITS, ARBITRARY UNITS
##FACTOR=    0.0627417313425164, 1,          1
##FIRST=     8223.62146879497, 422,          -62280
##LAST=      0,             3893,            -62592
##MIN=       0,             -10644,          0
##MAX=       8223.62146879497, 433696470,    0
$$ Real data points
##PAGE= N=1
##DATA TABLE= (X++(R..R)), XYDATA
$$ [...]
63915C391118k32775k30425k24377k15601k04553j90996j75082j57961j41020
63906A618328j25119j10787r8375q7557p7469o7887n9591n3008m7258m1221l5013
63895H15043k9595k5409k2164j9643j7836j6457j5083j3708j2639j1930j1441
63884F19138j1197j1143j0673r109o566l840j519M14K273M500P470J0909J3794
63871F04451J5501J6763J8668K0993K2510K2822K2780K2954K2811K1819K0358
63860H32430J8985J7496J5367J2571R429O118K786k75l037n868q940j1858j4336
63847H70868j6655j9051k1099k2256k2649k2825k3103k3654k4677k5890k6300
63836F22709k5282k3607k2600k2451k2191k1220k0027j9243j8739j8016j6833
$$ plain form
63915 3391118 3158343 2927918 2703541 2487940 2283387 2092391 1917309 1759348 1618328
63906 1618328 1493209 1382422 1284047 1196490 1119021 1051134 991543 938535 891277 850056 815043
63895 815043 785448 760039 737875 718232 700396 683939 668856 655148 642509 630579 619138
63884 619138 607941 596798 586125 577016 570450 566610 565091 565505 567778 572278 579748 590657 604451
63871 604451 619952 636715 655383 676376 698886 721708 744488 767442 790253 812072 832430
63860 832430 851415 868911 884278 896849 906278 912396 915182 914907 911870 906002 897062 885204 870868
63847 870868 854213 835162 814063 791807 769158 746333 723230 699576 674899 649009 622709
63836 622709 597427 573820 551220 528769 506578 485358 465331 446088 427349 409333 392500
63825C92500j5199j3185j1057r251q044p486p651q468r277r166q018o666n785
63812B73247n126m219l316k979l166l301l103k710k118j105J12P65M12m35q74
63797B42084o61m49r54k123l125l217k510j815j660j712j387p94o48j186j749
63782B18094j671j147p68n70j01O42J046P36R8l17m55n80p37q09q27q52p31l01
63764B10750K37M96L08k33r64j558j499o42L32N56O0l23j45K16M00O38J105J344
63746B11078R17K53K26J053K095K676K696K496K417K530K513J981J116P64J484
63731B36295K682L209K685J816J376J436J733K264L130M086M648M608M247M028
63717B78243M193M634N028N068M567L502K095Q28P2l73j104k305l396l821l830
$$ plain form
63825 392500 377301 364116 353059 343808 335764 328278 320627 312159 302882 293716 285698 279032 273247
63812 273247 268121 263902 260586 257607 254441 251140 248037 245327 243209 242104 242216 242981 243393 242958 242084
63797 242084 241423 240974 240020 237897 234772 231555 229045 227230 225570 223858 222471 221677 221029 219843 218094
63782 218094 216423 215276 214508 213938 213837 214479 215525 216261 216359 216042 215587 215007 214270 213461 212634 211782 211051 210750
63764 210750 210987 211483 211791 211558 210594 209036 207537 206895 207227 207783 207843 207520 207375 207591 207991 208629 209734 211078
63746 211078 211995 212248 212474 213527 215622 218298 220994 223490 225907 228437 230950 232931 234047 234811 236295
63731 236295 238977 242186 244871 246687 248063 249499 251232 253496 256626 260712 265360 269968 274215 278243
63717 278243 282436 287070 292098 297166 301733 305235 307330 308158 308230 307857 306753 304448 301052 297231 293401
63702B93401l986m145l635k415j312q94p51k99L13O44Q41J368K071K287J894J617
63686B86999J998K709L108L095K915K576J940J229Q26O13P2q33j423j221o32k89
63670C03682j10M47J416K218K490K470K462K420K247K044J837J385N63l81j202
63655C23988j997k971m042m932n410n272m491l544l176l489l661k978j768q10
63641B75447k28L77J007J277J293J676K607L517L999M393N106N932O414O558O749
63626C26124P130P467P531P458P704Q610R948J1018J1484J1957J3313J5481J7452
63613D62677J8547J9120J9928K1409K3782K7161L1140L4792L7657M0248M3043
63602G79504M5328M5730M3678L9628L3970K6517J7291P293j836q697j2734j4302
$$ plain form
63702 293401 289415 285270 281635 279220 277908 277014 276263 275964 276277 276921 277762 279130 281201 283488 285382 286999
63686 286999 288997 291706 294814 297909 300824 303400 305340 306569 307395 308008 308080 307247 305824 304603 303971 303682
63670 303682 303572 304019 305435 307653 310143 312613 315075 317495 319742 321786 323623 325008 325571 325190 323988
63655 323988 321991 319020 314978 310046 304636 299364 294873 291329 288153 284664 281003 278025 276257 275447
63641 275447 275219 275596 276603 277880 279173 280849 283456 286973 290972 295365 300471 306403 312817 319375 326124
63626 326124 333254 340721 348252 355710 363414 372024 381972 392990 404474 416431 429744 445225 462677
63613 462677 481224 500344 520272 541681 565463 592624 623764 658556 696213 736461 779504
63602 779504 824832 870562 914240 953868 987838 1014355 1031646 1038939 1037103 1028406 1015672 1001370
63590A001370j4349j3768j2967j2224j2259j3959j7420k1733k5882k9472l2367
63579G94970l4138l4401l3425l1900l0070k7619k4403k0860j7523j4510j1724
63568E14397r165o751m181j363J193K899L942N093O716Q400R712J0691J1449J1820
63554E64852J1860J2240J3628J5918J8588K1547K5078K9138L3253L7203M1264
63543H24569M5784N0752N5563N8636N7490N0181L7127K1157N612p297j6516k1678
63531A161380k3115k1821j8820j4888j1069q845r182j1759j5609k0221k5600l1541
63519I48910l7378m2278m5457m6409m5325m3029m0139l6551l2221k7961k4796
63508E27366k2722k0800j8414j5818j3519j1788j0751j0304r829q651o973n701
$$ plain form
63590 1001370 987021 973253 960286 948062 935803 921844 904424 882691 856809 827337 794970
63579 794970 760832 726431 693006 661106 631036 603417 579014 558154 540631 526121 514397
63568 514397 505232 498481 494300 492937 494130 497029 500971 506064 512780 521180 530892 541583 553032 564852
63554 564852 576712 588952 602580 618498 637086 658633 683711 712849 746102 783305 824569
63543 824569 870353 921105 976668 1035304 1092794 1142975 1180102 1201259 1206871 1199574 1183058 1161380
63531 1161380 1138265 1116444 1097624 1082736 1071667 1062822 1053640 1041881 1026272 1006051 980451 948910
63519 948910 911532 869254 823797 777388 732063 689034 648895 612344 580123 552162 527366
63508 527366 504644 483844 465430 449612 436093 424305 413554 403250 393421 384770 377797 372096
63496C72096n201m849m123l435l330l459l100k342j981k205k187j234K22J180
63482C36052J292J116J302J937K716L360L767M016M355M976N572N373L998K125
63468C81957R22P67R20M64p69k333l778m851n377n307m788m047l293k731k400
63453C45356j949r69L02J123J290J512K317L218L619M001N253P143Q517R032R636
63438C99401J1027J2709J4092J5636J8053K1028K3846K6883L1174L6226L9356
63427F49431L8051L2502K5112J7942J1549O265L350M031P915J3263J8745K4312
63415H52468L0411L7084M3958N0383N5288N7507N6634N3084M6944L7525K4709
63404A345995J0312k761j2551j8748k1830k2442k1520k0151j8954j8181j8506
$$ plain form
63496 372096 366895 362046 357923 354488 351158 347699 344599 342257 340276 338071 335884 334650 334872 336052
63482 336052 337344 338460 339762 341699 344415 347775 351542 355558 359913 364889 370461 375834 379832 381957
63468 381957 382879 383646 384566 385030 384261 381928 378150 373299 367922 362615 357827 353780 350487 347756 345356
63453 345356 343407 342438 342740 343863 345153 346665 348982 352200 355819 359820 365073 372216 380733 389765 399401
63438 399401 410428 423137 437229 452865 470918 491946 515792 542675 573849 610075 649431
63427 649431 687482 719984 745096 763038 774587 780852 784202 788233 796148 809411 828156 852468
63415 852468 882879 919963 963921 1014304 1069592 1127099 1183733 1236817 1283761 1321286 1345995
63404 1345995 1356307 1353546 1340995 1322247 1300417 1277975 1256455 1236304 1217350 1199169 1180663
63393A180663k1065k6347l3410m0466m5999m9252n0180m9166m6689m3107l8834
63382G36148l4508l0671k7391k4530k2043j9620j6439j2122p755m925l674k358
63370E30112K07L451O276Q583J0861J3098J4967J6616J8425K0375K2367K4843
63358F90181K8286L2306L6018L9266M2669M6454M9946N2407N3756N4045N2680
63347A178014M8609M1265L1121J9431P574l287j2102j7930k0479k0610j9817j9043
63335A212746j8432j8297j9618k3105k8235l3724l8701m2776m5415m6041m4713
63324H53689m2126l8892l5253l1392k7394k2912j7524j1560o229k840k244m782
63312F10541j0037j6437k1768k4514k4527k2545j9577j6748j4824j3478j1699
$$ plain form
63393 1180663 1159598 1133251 1099841 1059375 1013376 964124 913944 864778 818089 774982 736148
63382 736148 701640 670969 643578 619048 597005 577385 560946 548824 541069 536144 532470 530112
63370 530112 530319 533770 540046 548629 559490 572588 587555 604171 622596 642971 665338 690181
63358 690181 718467 750773 786791 826057 868726 915180 965126 1017533 1071289 1125334 1178014
63347 1178014 1226623 1267888 1299009 1318440 1326014 1322727 1310625 1292695 1272216 1251606 1231789 1212746
63335 1212746 1194314 1176017 1156399 1133294 1105059 1071335 1032634 989858 944443 898402 853689
63324 853689 811563 772671 737418 706026 678632 655720 638196 626636 620407 617567 615323 610541
63312 610541 600504 584067 562299 537785 513258 490713 471136 454388 439564 426086 414387
63301D14387r323p560p381q006p802o364m825m161m069l746l058k520k528l046
63287C39998l776m336m396l963l502l433l600l395k512j363o32o14j049j482j575
63272C00370j164l01O71J302J471J519J794K180K268J893J306P86M06J94L21Q90
63256C15906J704K439K986L445L837L999L905L824M059M601N216N878O821Q085
63242C76705R248R905J0302J1116J2603J4226J5361J6008J6673J7687J9005K0492
63230E49331K2048K3506K4678K5531K6089K6171K5491K4109K2495K1104K0071
63219H10624J9431J9360K0005K1207K2544K3527K3680K2633K0325J7045J3095
63208A033476Q497L180k684q691j4560k0194k5429k9848l2957l4499l4518l3309
$$ plain form
63301 414387 405064 397504 390123 382117 374315 367951 363126 358965 354896 351150 348092 345572 343044 339998
63287 339998 336222 331886 327490 323527 320025 316592 312992 309597 307085 305722 305090 304476 303427 301945 300370
63272 300370 299206 298905 299576 300878 302349 303868 305662 307842 310110 312003 313309 314095 314501 314695 315016 315906
63256 315906 317610 320049 323035 326480 330317 334316 338221 342045 346104 350705 355921 361799 368620 376705
63242 376705 385953 395858 406160 417276 429879 444105 459466 475474 492147 509834 528839 549331
63230 549331 571379 594885 619563 645094 671183 697354 722845 746954 769449 790553 810624
63219 810624 830055 849415 869420 890627 913171 936698 960378 983011 1003336 1020381 1033476
63208 1033476 1041973 1045153 1042469 1033778 1019218 999024 973595 943747 910790 876291 841773 808464
63196H08464l1276k8760k5862k2543j8905j5302j1983q774n284j487K132N125
63184F45545P573R866J2148J4205J5809J6875J7324J7171J6839J7009J7874J8788
63172H27026J8975J8402J7647J7026J6265J5060J3512J1815R735O721K507k559
63160I72132p792j2708j7273k1641k5692k8938l0987l1958l2307l2292l1828l0789
63148F67927k9209k7143k4559k1538j8435j5718j3709j2432j1617j0781r523p866
63136D65397o230m992m152l509l000k696k540k283j702q55J9Q22J698K726L574
63121D42277L767L334K950L175L795M206M241M225M272M097L615L229L281L572
63107D94036L714L637L434K981K123J140O41R25J611J962J533N68k32m46l96o23
$$ plain form
63196 808464 777188 748428 722566 700023 681118 665816 653833 645059 639775 638288 640420 645545
63184 645545 653118 662984 675132 689337 705146 722021 739345 756516 773355 790364 808238 827026
63172 827026 846001 864403 882050 899076 915341 930401 943913 955728 965463 972184 974691 972132
63160 972132 964340 951632 934359 912718 887026 858088 827101 795143 762836 730544 698716 667927
63148 667927 638718 611575 587016 565478 547043 531325 517616 505184 493567 482786 473263 465397
63136 465397 459167 454175 450023 446514 443514 440818 438278 435995 434293 433438 433457 434279 435977 438703 442277
63121 442277 446044 449378 452328 455503 459298 463504 467745 471970 476242 480339 483954 487183 490464 494036
63107 494036 497750 501387 504821 507802 509925 511065 511706 512631 514242 516204 517737 518305 518073 517627 517231 516608
63091E16608j049j030l69L03L72J1k29j72O5M86R95J159Q18O57J446K926M073
63074E27070M397M314M327M656N594P343R353J0664J1107J1484J2316J3307J4238
63061F40170J5478J7130J8649J9919K1834K4977K8542L1503L4148L7385M1198
63050I30933M4913M8580N2639N6466N8685N9121N9109N9571N9957N9479N8323
63039A547776N7036N5696N4367N3557N3467N3471N2985N2279N1691N0609M7973
63028B130907M3383L6992K8682J8154N743p555k0803l3520m5469n6521o6431p4425
63016A959137p9389q0959q0038p7681p3848o8013o0596n2821m5303l7695k9792
63005A273002k2039j4754p653n39O217J2298J7954K3382K8017L0994L2183L2391
$$ plain form
63091 516608 515559 514529 514160 514463 514835 514846 514617 514445 514510 514996 515991 517150 517968 518625 520071 522997 527070
63074 527070 531467 535781 540108 544764 550358 557701 567054 577718 588825 600309 612625 625932 640170
63061 640170 655648 672778 691427 711346 733180 758157 786699 818202 852350 889735 930933
63050 930933 975846 1024426 1077065 1133531 1192216 1251337 1310446 1370017 1429974 1489453 1547776
63039 1547776 1604812 1660508 1714875 1768432 1821899 1875370 1928355 1980634 2032325 2082934 2130907
63028 2130907 2174290 2211282 2239964 2258118 2263861 2256306 2235503 2201983 2156514 2099993 2033562 1959137
63016 1959137 1879748 1798789 1718751 1641070 1567222 1499209 1438613 1385792 1340489 1302794 1273002
63005 1273002 1250963 1236209 1228556 1228017 1234234 1246532 1264486 1287868 1315885 1346879 1379062 1411453
62993A411453L2553L2977L3276L2948L1991L0954L0295K9875K9111K7504K4744
62982A747681K0601J5103Q679J691o010j4543k3262l1208l8274m5238n2385n8766
62970A524069o3114o4981o4800o3242o0837n7800n3995m9317m4247l9627l5835
62959I26274l2645k9926k7824k6081k3905k1045j8453j7266j7435j7841j7572
62948F76281j6681j5805j5398j5268j4816j3799j2755j2332j2281j1776j0704
62937E24666r838r551r219q350p441p040o711n720m168k738j778j388j872l115
62923D45737l983l361j674m16k88o74q47p95p33p04q02j155j531j605j580j924
62907D23665k492k724k663k926l540l702k983j940j233r03q10j037j369j199m58
$$ plain form
62993 1411453 1444006 1476983 1510259 1543207 1575198 1606152 1636447 1666322 1695433 1722937 1747681
62982 1747681 1768282 1783385 1792064 1793755 1787745 1773202 1749940 1718732 1680458 1635220 1582835 1524069
62970 1524069 1460955 1395974 1331174 1267932 1207095 1149295 1095300 1045983 1001736 962109 926274
62959 926274 893629 863703 835879 809798 785893 764848 746395 729129 711694 693853 676281
62948 676281 659600 643795 628397 613129 598313 584514 571759 559427 547146 535370 524666
62937 524666 514828 505277 496058 487708 480267 473227 466516 460796 456628 453890 452112 450724 448852 445737
62923 445737 441754 438393 436719 436303 436015 435341 434494 433699 432966 432262 431460 430305 428774 427169 425589 423665
62907 423665 421173 418449 415786 412860 409320 405618 402635 400695 399462 398559 397749 396712 395343 394144 393686
62892C93686N2j76n02j01P55J115O73k6m34m60j94K10M58M36M93R59J500J417
62874C99861N59m33p75k41P29J359J123K20o24j067j498k245k810k415j108K47
62858C90882J010J260J294J218J117J142J198Q86N3q63j232q36M8R76J581J658
62842D01392J232N45j09n46p30p12o36p25j181j971k682k747k016j026m47k49
62826C87392J92J061J671J413P75P81J658K674L265L589L792L478K489J631J920
62811D17781L239M456M908N080N574O058N836N120N021O192Q007R298R615R478
62797E05663R642J0463J1801J3206J4144J4391J4370J4979J6847J9717K2705K5213
62785F93141K7604L0836L5401M0766M6025N0912N5906O1468O7618P4222Q1072
$$ plain form
62892 393686 393738 393562 393060 392959 393714 394829 395502 395476 395042 394582 394388 394598 395056 395492 395985 396944 398444 399861
62874 399861 400420 399987 399212 398971 399700 401059 402182 402402 401778 400711 399213 396968 394158 391743 390635 390882
62858 390882 391892 393152 394446 395664 396781 397923 399121 400007 400060 399197 397965 397129 397177 398153 399734 401392
62842 401392 402624 403169 403060 402514 401784 401072 400436 399711 398530 396559 393877 391130 389114 388088 387641 387392
62826 387392 387584 388645 390316 391729 392504 393285 394943 397617 400882 404471 408263 411741 414230 415861 417781
62811 417781 421020 425476 430384 435464 441038 447096 452932 458052 463073 469265 477272 486570 496185 505663
62797 505663 515305 525768 537569 550775 564919 579310 593680 608659 625506 645223 667928 693141
62785 693141 720745 751581 786982 827748 873773 924685 980591 1042059 1109677 1183899 1264971
62774A264971Q7490R2428R5369R6772R7100R5794R1762Q4511P4312O1471M6281
62763B188261K9481J2005n735k3573m0631n5571o7891p8078q6176r1329r3234
62752A687529r3083r2188r0386q6847q1873p6768p2071o7087o1289n5278m9961
62741H60698m5490m1368l7271l3382l0071k7413k4914k1844j8104j4612j2364
62730E53865j1228j0089q244o128m553l799l588l527l255k513j353o8J226K615
62716D99361L922M696M946N411O617Q118R274J0490J2833J6386J9812K1940K3262
62703F47068K5284K8780L3214L7768M2235M6800N1467N6028O0337O4250O7513
62692A160744O9998P1909P3401P4056P3009O9622O3790N5649M5311L3055J9473
$$ plain form
62774 1264971 1352461 1444889 1540258 1637030 1734130 1829924 1921686 2006197 2080509 2141980 2188261
62763 2188261 2217742 2229747 2224012 2200439 2159808 2104237 2036346 1958268 1872092 1780763 1687529
62752 1687529 1594446 1502258 1411872 1325025 1243152 1166384 1094313 1027226 965937 910659 860698
62741 860698 815208 773840 736569 703187 673116 645703 620789 598945 580841 566229 553865
62730 553865 542637 532548 524304 518176 513623 509824 506236 502709 499454 496941 495588 495520 496746 499361
62716 499361 503283 507979 512925 518336 524953 533071 542345 552835 565668 582054 601866 623806 647068
62703 647068 672352 701132 734346 772114 814349 861149 912616 968644 1028981 1093231 1160744
62692 1160744 1230742 1302651 1376052 1450108 1523117 1592739 1656529 1712178 1757489 1790544 1810017
62681A810017N257q995k2773l5637m7343n7733o6392p2686p6331p7705p7394p5676
62669A196609p2638o8612o4143n9559n4827m9871m4868m0253l6425l3358l0453
62658F41602k7076k3381k0367j8755j8038j6911j4656j1783r359q004p566p527
62646D58179p538p627p893q079p699o657n506m859m682m416l637k314o36J004
62632C87640K017K003J250M67kl79q78j306j408j238j000p42m40j68j1J04L28
62615C86237P10J248K020L114M459N778O754P257P450P660Q086Q679R389J0402
62601D69243J1909J3761J5554J7200J9077K1557K4526K7627L0789L4259L8123
62590G23625M1970M5147M7279M8349M8357M7085M4269L9830L3781K6099J6987
$$ plain form
62681 1810017 1815274 1806279 1783506 1747869 1700526 1642793 1576401 1503715 1427384 1349679 1272285 1196609
62669 1196609 1123971 1055359 991216 931657 876830 826959 782091 741838 705413 672055 641602
62658 641602 614526 591145 570778 552023 533985 517074 502418 490635 481276 473272 465706 458179
62646 458179 450641 443014 435121 427042 419343 412686 407180 402321 397639 393223 389586 387272 386636 387640
62632 387640 389657 391660 392910 393377 393375 392996 392118 390812 389404 388166 387166 386424 385984 385816 385805 385909 386237
62615 386237 386947 388195 390215 393329 397788 403566 410320 417577 425027 432687 440773 449452 458841 469243
62601 469243 481152 494913 510467 527667 546744 568301 592827 620454 651243 685502 723625
62590 723625 765595 810742 858021 906370 954727 1001812 1046081 1085911 1119692 1145791 1162778
62579A162778P195k338j1193j9464k7016l3244l7778m0916m3024m3966m3661m2717
62567H24656m1783m0535l8122l4658l1356k9021k7152k4926k2386k0071j7977
62556D96669j5541j2536r449p021n721n531n865n869n208m447m283m499m173k944
62542D03582j541q33q14q71o58k59L40J324K499L184K931K121J564J637K079K512
62526D18797K914L579M824O693Q755J0343J1258J2100J3586J5657J7788K0082
62514E46376K3237K7245L0937L3485L5650L8656M2217M4697M5187M4401M3247
62503I55335M1437L8072L2969K6755J9941J2576M747l055j0169j6074k0449k3187
62491A058898k4456k4567k3582k1175j7094j1827o556k134J811O336J1690J6874
$$ plain form
62579 1162778 1169973 1167635 1156442 1136978 1109962 1076718 1038940 998024 955000 911034 867373 824656
62567 824656 782873 742338 704216 669558 638202 609181 582029 557103 534717 514646 496669
62556 496669 481128 468592 459143 452122 446401 440870 435005 429136 423928 419481 415198 410699 406526 403582
62542 403582 402041 401208 400394 399523 398865 398606 398946 400270 402769 405953 408884 411005 412569 414206 416285 418797
62526 418797 421711 425290 430114 436807 445562 455905 467163 479263 492849 508506 526294 546376
62514 546376 569613 596858 627795 661280 696930 735586 777803 822500 867687 912088 955335
62503 955335 996772 1034844 1067813 1094568 1114509 1127085 1131832 1128777 1118608 1102534 1082085 1058898
62491 1058898 1034442 1009875 986293 965118 948024 936197 929641 927507 929318 935654 947344 964218
62479I64218K0999K4459K8238L2325L5576L6916L5931L2371K6087J7838R400K234
62467A266592l687r461j6069k3805l2313m0572m7236n1551n3810n4658n4258n2553
62455H26619m9902m6817m3270l8933l4037k9359k5318k1581j7767j4031j0800
62444D94804q300o528n328m269k846j083L42Q91R10J170J859K505K855L293M021
62429D84296M299L106M81k302m084m924n605o457p147p436p522p618p555p050
62415D24482o076m860l760l174l274l685l719l098k264j834j964k360k657k636
62401C79121k318j971j814j626r65J11R17R80O82P68J465K365K962K978K467J854
62385C87976J657J873J918J524J292J966L396M841N986P044P983Q471Q668R280
$$ plain form
62479 964218 985217 1009676 1037914 1070239 1105815 1142731 1178662 1211033 1237120 1254958 1264358 1266592
62467 1266592 1262905 1253444 1237375 1213570 1181257 1140685 1093449 1041898 988088 933430 879172 826619
62455 826619 776717 729900 686630 647697 613660 584301 558983 537402 519635 505604 494804
62444 494804 486504 479976 474648 470379 467533 466450 466792 467683 468593 469763 471622 474127 476982 480275 484296
62429 484296 488595 491701 492182 489880 485796 480872 475267 468810 461663 454227 446705 439087 431532 424482
62415 424482 418406 413546 409786 406612 403338 399653 395934 392836 390572 388738 386774 384414 381757 379121
62401 379121 376803 374832 373018 371392 370427 370538 371455 372435 373117 373885 375350 377715 380677 383655 386122 387976
62385 387976 389633 391506 393424 394948 396240 398206 401602 406443 412429 419473 427456 435927 444595 453875
62371D53875J0597J1996J2729J2817J2830J3220J4137J5622J7633K0063K2913
62360F18432K6260K9961L3752L7771M2627M8606N5150O1456O7245P2554P6938
62349A170752P9463P9385P6431P0436O1234M9204L5528K1728Q907k465j2433k1371
62337A616799k9742l7742m5169n1674n7058o1149o3539o3714o1557n7625n2833
62326A034997m7925m3213l8650l4072k9504k5368k2321k0657j9939j9452j9038
62315G14858j9141j9905k0631k0536j9713j8853j8061j6715j4625j2624j1493
62304E22561j0805r565p734o265n632n174m203l033k351k134j882j537j413j333
62290D59500p13M69J520K022K336K768K977K652K198K125K242K150K092K556L281
$$ plain form
62371 453875 464472 476468 489197 502014 514844 528064 542201 557823 575456 595519 618432
62360 618432 644692 674653 708405 746176 788803 837409 892559 954015 1021260 1093814 1170752
62349 1170752 1250215 1329600 1406031 1476467 1537701 1586905 1622433 1644161 1653068 1650603 1638170 1616799
62337 1616799 1587057 1549315 1504146 1452472 1395414 1334265 1270726 1207012 1145455 1087830 1034997
62326 1034997 987072 943859 905209 871137 841633 816265 793944 773287 753348 733896 714858
62315 714858 695717 675812 655181 634645 614932 596079 578018 561303 546678 534054 522561
62304 522561 511756 502191 494457 488192 482560 477386 473183 470150 467799 465665 463783 462246 460833 459500
62290 459500 458787 459256 460776 462798 465134 467902 470879 473531 475729 477854 480096 482246 484338 486894 490175
62275D90175L568L510L939N032N952O207O474P458Q702R405R957J1623J4790J8398
62261F05190K1351K3841K6902L1112L6104M1231M6356N1973N8597O6031P3248
62250A081936P9026Q2676Q4017Q2771P8306P0177N8745M5082L0370J5595J706
62239A710407j0357k0204k8448l6290m4515n2957o0849o7313p1519p2911p1690
62228A173354o8735o4672n9363n2731m5680l9364l3848k8401k3011j8565j5352
62217G23632j2535r615p383o594o608o294n681n611o281p168q106r275j0239j0231
62203F12011r525r281r814r995q918p134n712m874m240l633k865j354J136L742
62189E39544N359O014O617P522Q312Q922R958J1570J2843J2936J2272J1937J2183
$$ plain form
62275 490175 493743 497253 501192 506224 512176 518383 524857 532315 541017 550422 560379 572002 586792 605190
62261 605190 626541 650382 677284 708396 744500 785731 832087 884060 942657 1008688 1081936
62250 1081936 1160962 1243638 1327655 1410426 1488732 1558909 1617654 1662736 1693106 1708701 1710407
62239 1710407 1700050 1679846 1651398 1615108 1570593 1517636 1456787 1389474 1317955 1245044 1173354
62228 1173354 1104619 1039947 980584 927853 882173 842809 808961 780560 757549 738984 723632
62217 723632 711097 701482 694099 687505 680897 674603 668922 663311 657030 649862 641756 632481 622242 612011
62203 612011 602486 593205 583391 573396 564478 557344 551632 546758 542518 538885 536020 534666 535802 539544
62189 539544 544903 550917 557534 565056 573368 582290 592248 603818 616661 629597 641869 653806 665989
62176F65989J2136J0953Q766O480N068N136O713R180J1703J4116J7218K1879K7971
62163H23308L4495M0698M6633N2531N7990O1990O3423O1526N6241M8418L9305
62152A386558K9496J8760P268l532j2000j8071k3201k8639l4466m0242m5616n0007
62140A186308n2471n2575n0889m8183m4536l9806l4447k9277k4561j9987j5437
62129G74139j1334q163o003m550l323j966n11P26J724K933M672O636Q337R668
62115G72985J0504J0156Q007M554J124j517l543n023n383m317k584j382j318k414
62101G79849m573p394r836j0726r715p407m643j985L05K226L986N601O663O852
62087G49203O620O806P582Q247Q225P832P770Q302R241J0458J1979J3673J5248
$$ plain form
62176 665989 678125 689078 697844 704324 709392 714528 721241 730421 742124 756240 773458 795337 823308
62163 823308 857803 898501 945134 997665 1055655 1117645 1181068 1242594 1298835 1347253 1386558
62152 1386558 1416054 1434814 1442082 1438550 1426550 1408479 1385278 1356639 1322173 1281931 1236315 1186308
62140 1186308 1133837 1081262 1030373 982190 937654 897848 863401 834124 809563 789576 774139
62129 774139 762805 754642 748639 744089 740766 738800 738289 739015 740739 743672 748344 754980 763317 772985
62115 772985 783489 793645 801652 806206 807330 805813 802270 797247 791864 787547 784963 783581 782263 779849
62101 779849 775276 767882 758046 747320 737605 730198 725555 723570 723875 726101 730087 735688 742351 749203
62087 749203 755823 762629 770211 778458 786683 794515 802285 810587 819828 830286 842265 855938 871186
62074H71186J6564J7773J9084K0559K2068K3332K4071K4270K4269K4465K4999
62063A112640K5868K7240K9431L2567L6387M0293M3366M4429M2538L7612L0470
62052A502841K2119J3207M235m098j1246j7505k3852l0880l8049m4284m9122n2922
62040A270444n5984n7951n8380n7538n6107n4186n1219m7045m2507l8584l5224
62029G15719l1564k7216k2786j9090j6314j4079j2075j0347r088q359p957p613
62017E29231p308p349p863q380q210p254o062n060m093k853j412j0J327K650L769
62002D71123M492N009N754O840P893Q491Q521Q118P403O366M933L159J385K1q89
61987E48619j764l009m572o074p276q189q877r356r694j0016j0374j0658j0604
$$ plain form
62074 871186 887750 905523 924607 945166 967234 990566 1014637 1038907 1063176 1087641 1112640
62063 1112640 1138508 1165748 1195179 1227746 1264133 1304426 1347792 1392221 1434759 1472371 1502841
62052 1502841 1524960 1538167 1542402 1538304 1527058 1509553 1485701 1454821 1416772 1372488 1323366 1270444
62040 1270444 1214460 1156509 1098129 1040591 984484 930298 879079 832034 789527 750943 715719
62029 715719 684155 656939 634153 615063 598749 584670 572595 562248 553160 544801 536844 529231
62017 529231 521923 514574 506711 498331 490121 482867 476805 471745 467652 464799 463387 463377 464704 467354 471123
62002 471123 475615 480624 486378 493218 501111 509602 518123 526241 533644 540010 544943 548102 549487 549508 548619
61987 548619 546855 543846 539274 533200 525924 517735 508858 499502 489808 479792 469418 458760 448156
61974D48156r917q501o678n037l961l392l134l133l329l489l404l177k997k777
61960C85230k231j328l84K77O63J098J890K955L782L950L703L713M226M825N251
61945D17620N963P420R148J0163J0242J0297J1318J3362J5664J7469J8558J9151
61933E66375J9474J9497J9116J8499J7988J7543J6677J5144J3382J1868J0349
61922G45912Q159N171J978q76l387n856q406j0763j2293j2370j1011q957o869
61909F80432m650j888J398M928Q725J2814J6545J8955J9815J9637J8634J6377
61897H11722J2685Q162L586p43m829q656j2197j5335j7590j8464j8162j7524j7085
61884G05570j6664j5961j4957j3598j1825j0091r218r366r781r924j0097j0530
$$ plain form
61974 448156 438239 429738 423060 418023 414062 410670 407536 404403 401074 397585 394181 391004 388007 385230
61960 385230 382999 381671 381287 381564 382227 383325 385215 388170 391952 395902 399605 403318 407544 412369 417620
61945 417620 423583 431003 440151 450314 460556 470853 482171 495533 511197 528666 547224 566375
61933 566375 585849 605346 624462 642961 660949 678492 695169 710313 723695 735563 745912
61922 745912 754071 759242 761220 760344 756957 751101 742695 731932 719639 707269 696258 687301 680432
61909 680432 675782 673894 675292 680220 688945 701759 718304 737259 757074 776711 795345 811722
61897 811722 824407 832569 836155 835412 830583 821927 809730 794395 776805 758341 740179 722655 705570
61884 705570 688906 672945 657988 644390 632565 622474 613256 603890 594109 584185 574088 563558
61872E63558j0646r885q629p602o741n480l692j706L38K347L801M276M296M882
61858E29117O233P620Q612R706J1500J3931J6614J9426K2360K5149K7381K8900
61846G26549K9916L0761L1635L2402L2601L1788K9817K6720K2440J7005J0897
61835A022531M910n08n532j0475j5142j8747k0422j9803j7203j3309q744l883
61823H93673J015N739J0102J3816J6363J7319J6796J5187J2405P798J122o807
61811A004528j4704k1796k7892l2806l6148l7621l7242l5408l2954l0813k9316
61800F67828k7924k5994k3558k1101j8782j6327j3643j1124r356q577q428q185
61788D74829p406o438n910n757n279m301l525l372l211k440j615j609k117j985
$$ plain form
61872 563558 552912 543027 534398 526796 520055 514575 510883 509177 509515 511862 515663 519939 524235 529117
61858 529117 535350 542970 551582 561288 572788 586719 603333 622759 645119 670268 697649 726549
61846 726549 756465 787226 818861 851263 883864 915652 945469 972189 994629 1011634 1022531
61835 1022531 1027441 1026933 1021401 1010926 995784 977037 956615 936812 919609 906300 897556 893673
61823 893673 894688 900427 910529 924345 940708 958027 974823 990010 1002415 1010213 1011335 1004528
61811 1004528 989824 968028 940136 907330 871182 833561 796319 760911 727957 697144 667828
61800 667828 639904 613910 590352 569251 550469 534142 520499 509375 500019 491442 483014 474829
61788 474829 467423 460985 455075 449318 444039 439738 436213 432841 429630 427190 425575 423966 421849 419864
61774D19864r17J96O10N21L76K29%k07l25m00l60j07J69K87N65J318J991J652
61756D25462N33P8J093K606L112K360J347R50J144J280P65m43j759k607l080l623
61740D29218m078l729k534j494j364j622j349n68m6m2r8J11L64M39N44J102K298
61723D17152L765M585L941K164Q29J204K732L692L318K609K844L921M556L871
61709D61183K208N23o71j550k417l212l660l719l622l545l514l599l924m308m285
61694D21888l757l323l552m100m060l197k300k144k499k546k039j560j639k059
61680C83113k258k126j973j828j346n51j56p25j770k243j816j182r99j166j296
61665C61678j397j681k002j971j496q63l40K2K47L92O04R82J363J437J182R91
$$ plain form
61774 419864 418947 419143 419753 420274 420650 420879 420879 420672 420347 419947 419587 419480 419649 419936 420501 421819 423810 425462
61756 425462 425995 426073 427166 429772 432884 435244 436591 437541 438685 439965 440730 440287 438528 435921 432841 429218
61740 429218 425140 421411 418877 417383 416019 414397 413048 412480 412434 412392 412294 412405 412769 413208 413752 414854 417152
61723 417152 420917 425502 429443 431607 432436 433640 436372 440064 443382 445991 448835 452756 457312 461183
61709 461183 463391 463914 463243 461693 459276 456064 452404 448685 445063 441518 438004 434405 430481 426173 421888
61694 421888 418131 414808 411256 407156 403096 399899 397599 395455 392956 390410 388371 386811 385172 383113
61680 383113 380855 378729 376756 374928 373582 373031 372875 372150 370380 368137 366321 365139 364140 362974 361678
61665 361678 360281 358600 356598 354627 353131 352268 351928 351950 352197 352589 353193 354175 355538 356975 358157 359148
61649C59148J265J943K537K630K319K110K369K993L575L849L845L730L673L687
61635C99673L536K867J666M39l32p93j412k210k744k865k932l195l410l298k972
61620C82018k585k011j150k78K87N58O27L56k68p97p93n18o58j481k696m006n286
61603C61319o248o488o039n455n160n017m685m090l341k479j646j290j881l338
61589C04162m885n573m989l607k374j846j708j338p09m01o78j041r96q68j291
61574B71858k082k311j626q58r13j515j638r60k14p1l24l83j53J2oP8N48J340
61556B60782K106K468K256J694J223J086J211J477J780J754R79k64r37m64L82
61541B77533M68j38l38M16J569K427K817K619J585L6r64o87M63J621K372K527
$$ plain form
61649 359148 360413 362356 364893 367523 369842 371952 374321 377314 380889 384738 388583 392313 395986 399673
61635 399673 403209 406076 407742 408181 407849 407056 405644 403434 400690 397825 394893 391698 388288 384990 382018
61620 382018 379433 377422 376272 375994 376281 376839 377466 377822 377554 376757 375964 375446 374788 373307 370611 366605 361319
61603 361319 355071 348583 342544 337089 331929 326912 322227 318137 314796 312317 310671 309381 307500 304162
61589 304162 299277 293704 288715 285108 282734 280888 279180 277842 277133 276732 276054 275013 274017 273149 271858
61574 271858 269776 267465 265839 264981 264068 262553 260915 259955 259741 259670 259346 258963 258810 258822 258816 258894 259442 260782
61556 260782 262888 265356 267612 269306 270529 271615 272826 274303 276083 277837 278816 278552 277615 277151 277533
61541 277533 278001 277863 277525 277941 279510 281937 284754 287373 288958 288994 288030 287343 287806 289427 291799 294326
61525B94326J697j26j934k495j756q11n29q15j227j580j741j399m80M59O85J28
61509B82402m92m09L82J177J353J015O93N39J47p75j796k121j426k11O51O23q1
61492B81671p27p57k96J22K45K44K66J63k35q57j496j888j653o24P27J629J988
61475B78522K476L418M168M026L222K467J902J161J90n70p95n47o8K87J19n53
61459B99425j065q76l76l59q40j061o60j12J69M56J179K169K820K721J887O66
61443C06143m03q52o59k46K9K08N71J298K332L352L900L771L274K924K889K955
61427C31486K971K949K824K479K047J855J970K190K460K786K772J827J75r44n91
61412C59256O85J545J471J119J111J086L12j228k694l307l116k778k738k811k583
$$ plain form
61525 294326 296023 295897 293963 291468 289712 288901 288372 287557 286330 284750 283009 281610 281130 281589 282274 282402
61509 282402 281910 281501 281883 283060 284413 285428 286121 286660 286807 286032 284236 282115 280689 280478 281129 281752 281671
61492 281671 280944 280187 279891 280013 280258 280502 280768 280931 280696 279839 278343 276455 274802 274178 274905 276534 278522
61475 278522 280998 284416 288584 292610 295832 298299 300201 301362 301552 300982 300187 299640 299572 299859 299978 299425
61459 299425 298360 297484 297108 296749 295909 294848 294188 294076 294245 294701 295880 298049 300869 303590 305477 306143
61443 306143 305740 304888 304229 303983 304012 304220 304791 306089 308421 311773 315673 319444 322718 325642 328531 331486
61427 331486 334457 337406 340230 342709 344756 346611 348581 350771 353231 356017 358789 360616 360791 359847 359256
61412 359256 359941 361486 362957 364076 365187 366273 366585 365357 362663 359356 356240 353462 350724 347913 345330
61397C45330k057j710j832k064j816j110p04j136j897j874p30O21J113P27K29
61382C31090jk34n65n86m0O93J118J249J354J499J660J923K266K375K101J767
61366C47669J710J814J834J808J741J308M85R4R79K742M062M225L736L407L572
61351C81186M283N573P174Q488R094R042Q533P628O397N042L802K961K838L400
61337D65441M001M024L710L777M256M413L857L009K282J534O69Jl94j057k283
61322D97240l386l539k902k286j952j539j002p62p69j95J427L283M107L811L719
61307D95255M968P160Q965R735R952J0161J0108R235P485N249K882O69j182k845
61293E77797m821o989q273p935o828o457p076p603p344o750o390o176n932n793
$$ plain form
61397 345330 343273 341563 339731 337667 335851 334741 334037 332901 331004 329130 328400 329021 330134 330861 331090
61382 331090 331089 330855 330290 329704 329664 330357 331475 332724 334078 335577 337237 339160 341426 343801 345902 347669
61366 347669 349379 351193 353027 354835 356576 357884 358369 358463 359442 362184 366246 370471 374207 377614 381186
61351 381186 385469 391042 398216 406704 415798 424840 433373 441001 447398 452440 456242 459203 462041 465441
61337 465441 469442 473466 477176 480953 485209 489622 493479 496488 498770 500304 500973 500974 500580 499523 497240
61322 497240 493854 490315 487413 485127 483175 481636 480634 479872 479103 478908 480335 483618 487725 491536 495255
61307 495255 500223 507383 516348 526083 536035 546196 556304 565539 573024 578273 581155 581824 580642 577797
61293 577797 572976 565987 557714 549779 542951 536494 529418 521815 514471 507721 501331 495155 489223 483430
61279D83430n706n206m128k861j614j32J609L166M412N722O998P400O581N359
61265E05030M521L844L071K983M392O610Q101Q424Q502R022R499R044P433N209
61251E95685L261K306K368K795L022L127L331L314K542J081m32j510k073k233
61237F16584k271k653l600m744n605o104o319o114n450m747m354l976l104j809
61223E55734n35M80J199J531J634K080L110M193M865N529O625P619P686O979O194
61208F14923N253L559J301n97j688k090j587N3K047L183L589M533O342P990R055
61193F55866J0485J2735J4550J4582J3165J1433R661P538N320L646K629K067K035
61180G65712K455K515J489k21j672k672l712m827n412n148m439l965m187n103
$$ plain form
61279 483430 477724 472518 468390 465529 463915 463783 465392 468558 472970 478692 485690 493090 499671 505030
61265 505030 509551 513395 516466 519449 523841 530451 538552 546976 555478 564500 573999 583043 590476 595685
61251 595685 598946 601252 603620 606415 609437 612564 615895 619209 621751 622832 622400 620890 618817 616584
61237 616584 614313 611660 608060 603316 597711 591607 585288 579174 573724 568977 564623 560647 557543 555734
61223 555734 555199 555679 556878 558409 560043 562123 565233 569426 574291 579820 586445 594064 601750 608729 614923
61208 614923 620176 623735 625036 624439 622751 620661 619074 619127 621174 624357 627946 632479 638821 646811 655866
61193 655866 666351 679086 693636 708218 721383 732816 742477 750015 755335 758981 761610 763677 765712
61180 765712 768167 770682 772171 771950 770278 767606 763894 759067 753655 748507 744068 740103 735916 730813
61166G30813o027o025n035m256m804o373p836q768r494j0000r841r101q514q345
61152F26394q003o937n354l718k147o24N97J073M52j465m550q082j0937j2254
61138E64445j1928j0495q726p236o140n095l889k827k228j728o73Q79K179K842
61124E09380L393M466O013P639R290J1095J2812J3987J4656J5476J6933J8743
61112F43883K0200K1039K1623K2343K3095K3478K3345K2891K2309K1602K0719
61101H86527J9526J7652J4678J0692O414K562o94l619o498r383j2038j4078j5415
61088H96326j6575j8136j9770k0462j9927j9159j9126j9440j8993j7559j6043
61077F91136j5295j5230j5087j4132j2173r842q222p819p975p649o543n092l642
$$ plain form
61166 730813 724786 718761 713726 709470 704666 698293 690457 681689 672195 662195 652354 643253 634739 626394
61152 626394 618391 611454 606100 602382 600235 599611 600208 601281 601733 600268 595718 587636 576699 564445
61138 564445 552517 542022 533296 526060 519920 514825 510936 508109 505881 504153 503480 504359 506538 509380
61124 509380 512773 517239 523252 530891 540181 551276 564088 578075 592731 608207 625140 643883
61112 643883 664083 685122 706745 729088 752183 775661 799006 821897 844206 865808 886527
61101 886527 906053 923705 938383 949075 955489 958051 957357 953738 947240 937857 925819 911741 896326
61088 896326 879751 861615 841845 821383 801456 782297 763171 743731 724738 707179 691136
61077 691136 675841 660611 645524 631392 619219 609377 601155 593336 585361 577712 571169 566077 562435
61064E62435k226r97j75L75J005J749K421L156M313N794P074P897Q535R267J0075
61049F20698J0903J1778J2609J3259J3874J4782J6125J7811J9719K1568K2905
61038G96031K3709K4721K6622K9087L1304L3135L5073L7257L9419M1644M4315
61027A162317M7256M9713N1190N1636N1087N0031M9860N1942N6393O2727P1217
61016A755369Q2125R4037J04949J15073J26793J41898J61056J86150K20260K64579
61006C252289L18163L81913M59834N55253O69901Q09157R83625J201932J465917
60997A0097984J773367K107727K402030K518034K303182J713540Q91491J02522
60989B3909877m24516o07378m90794j67834K45708N83069O43836L02104l85384
$$ plain form
61064 562435 560209 559212 559037 559412 560417 562166 564587 567743 572056 577850 584924 592821 601356 610623 620698
61049 620698 631601 643379 655988 669247 683121 697903 714028 731839 751558 773126 796031
61038 796031 819740 844461 871083 900170 931474 964609 999682 1036939 1076358 1118002 1162317
61027 1162317 1209573 1259286 1310476 1362112 1413199 1463230 1513090 1565032 1621425 1684152 1755369
61016 1755369 1837494 1931531 2036480 2151553 2278346 2420244 2581300 2767450 2987710 3252289
61006 3252289 3570452 3952365 4412199 4967452 5637353 6446510 7430135 8632067 10097984
60997 10097984 11871351 13979078 16381108 18899142 21202324 22915864 23807355 23909877
60989 23909877 23485361 22877983 22387189 22219355 22465063 23048132 23691968 23994072 23608688
60980B3608688j193624j867515k260857k369491k270230k049927j776054j496253
60972H324737j239776j017842q30237o74107n46691m43845l60746k94166k42154
60963B675173k02206j71459j47876j29681j14414j00324q7862p8105p0085o1438
60953A511723n1381m1301l2451k4767j8270j3972j2520j2878j3165j2369j0706
60942A267943q725o552m039j399N00P78m99k421m379o557r042j1279j3013j4931
60928A186385j7552k0167k1893k3197k5137k7424k8646k8396k7813k7762k7698
60917I10700k6777k5094k3287k1742k0706k0423k0573k0179j8636j6487j4727
60906F82069j3713j3092j2346j1086r222p237n913n430n091m273l213k542k435
$$ plain form
60980 23608688 22415064 20547549 18286692 15917201 13646971 11597044 9820990 8324737
60972 8324737 7084961 6067119 5236882 4562775 4016084 3572239 3211493 2917327 2675173
60963 2675173 2472967 2301508 2153632 2023951 1909537 1809213 1721351 1643246 1573161 1511723
60953 1511723 1460342 1419041 1386590 1361823 1343553 1329581 1317061 1304183 1291018 1278649 1267943
60942 1267943 1259218 1252666 1248627 1247228 1247728 1248506 1248007 1245586 1241207 1234650 1225608 1214329 1201316 1186385
60928 1186385 1168833 1148666 1126773 1103576 1078439 1051015 1022369 993973 966160 938398 910700
60917 910700 883923 858829 835542 813800 793094 772671 752098 731919 713283 696796 682069
60906 682069 668356 655264 642918 631832 622610 615373 609460 604030 598939 594666 591453 588911 586476
60893E86476k586k713k604k057j178n71p49j552k506l512m743n995o735o791o588
60878E35596o577o729o748o520o241o187o364o410n890m853l924l672l916l904
60864D57661l214k236j674j725j931j718r54K8O89N98k49j232j566j184r45j551
60848D38797k484k589j663p55p47j381j993k482k969l142k773k438k886l864m398
60833D02233m178l852l959m233m187l685k809j685n67L39J168K076K679K469J674
60818C83483J069Q76O73M11O26J381J846J422N57n9m48r24j343j377j153j032
60802C86008j046j043j006q74m84o8l39j520k757l123k789k537k549k430k206
60787C61237k388k989l335l037k568k565k977l216k923k306j801j591j505j267
$$ plain form
60893 586476 583890 581177 578573 576516 575338 574767 574018 572466 569960 566448 561705 555710 548975 542184 535596
60878 535596 529019 522290 515542 509022 502781 496594 490230 483820 477930 473077 469153 465481 461565 457661
60864 457661 454447 452211 450537 448812 446881 445163 444209 444237 444926 445524 445275 444043 442477 441293 440348 438797
60848 438797 436313 433724 432061 431306 430559 429178 427185 424703 421734 418592 415819 413381 410495 406631 402233
60833 402233 398055 394203 390244 386011 381824 378139 375330 373645 373078 373417 374585 376661 379340 381809 383483
60818 383483 384552 385428 386101 386512 387138 388519 390365 391787 392344 392285 391837 390913 389570 388193 387040 386008
60802 386008 384962 383919 382913 382039 381555 381487 381148 379628 376871 373748 370959 368422 365873 363443 361237
60787 361237 358849 355860 352525 349488 346920 344355 341378 338162 335239 332933 331132 329541 328036 326769
60773C26769q03k03M05Q36Q75O23O93J532K661L168K920K655K732K650K118J709
60757C51340J928K347K388K268K421K485J842Q53N65J286K243K632K360J769J239
60742C79966J045J096Q28j96j738l338m987o705p839p646o468n529n466n781n733
60727C21509n117m125l132k643k820l066k732k151k104k314j608J54J487J208
60713B92546N5m37RM05J46k81k32J96L76q6r56j571j418n89L90J156J692J966
60695B93367J786J241Q84J219K116K960L221K779J956J392J630K568L482L765
60681C24366L526L362L629M130M404M306M225M657N441N715M936L694L045L155
60667C82591L238K696J650K49j704l985n548n576m602l916m041m348m123l340
$$ plain form
60773 326769 325966 325763 326168 327004 327879 328502 329195 330727 333388 336556 339476 342131 344863 347513 349631 351340
60757 351340 353268 355615 358003 360271 362692 365177 367019 367872 368437 369723 371966 374598 376958 378727 379966
60742 379966 381011 382107 382935 382739 381001 377663 372676 365971 358132 350486 344018 338489 333023 327242 321509
60727 321509 316392 312267 309135 306492 303672 300606 297874 295723 293619 291305 289697 289851 291338 292546
60713 292546 292601 292164 292173 292578 292724 292443 292211 292407 292783 292697 291741 290170 288752 288163 288553 289709 291401 293367
60695 293367 295153 296394 297278 298497 300613 303573 306794 309573 311529 312921 314551 317119 320601 324366
60681 324366 327892 331254 334883 339013 343417 347723 351948 356605 362046 367761 372697 376391 379436 382591
60667 382591 385829 388525 390175 390424 388720 384735 379187 373611 369009 365093 361052 356704 352581 349241
60653C49241k341j234l1R28J164P15L11O17J514K292K456J968Q28r77k863l748
60637C50840l260k425k506l412l949l458k427j618j295j431j873k153j779r54
60623C18300l95k93k6Q25J777K064J551P88N06J132K298K816J847J31p09k23M75
60606C32864N49N38R97J252N45m72o11N5M87M23N36R66J026N71M85J370K572L067
60588C47220K652J781P85k02r03j075q69o31m28j08K13J71k74n56p0J091K176
60571C50973K666K878L540M926O703Q447R956J1039J1479J1379J1138J0895J0253
60558D56272Q750O318L189k94l527n823o994p457p416o483m496k268q40k38L84
60543D29077J513K833M020N300O913Q523R566J0045J0664J2069J4056J5662J6085
$$ plain form
60653 349241 346900 345666 345635 346563 347727 348442 348753 349370 350884 353176 355632 357600 358428 357451 354588 350840
60637 350840 347580 345155 342649 339237 335288 331830 329403 327785 326490 325059 323186 321033 319254 318300
60623 318300 317905 317612 317586 318411 320188 322252 323803 324591 325097 326229 328527 331343 333190 333321 332612 332389 332864
60606 332864 333413 333951 334948 336200 336745 336273 335662 335717 336204 336627 337163 338129 339155 339726 340211 341581 344153 347220
60588 347220 349872 351653 352438 352236 351333 350258 349389 348758 348330 348222 348435 348606 348332 347776 347706 348797 350973
60571 350973 353639 356517 360057 364983 371686 380133 390089 401128 412607 423986 435124 446019 456272
60558 456272 465022 471340 474529 474235 470708 464885 457891 450434 443018 436535 432039 429771 428931 428693 429077
60543 429077 430590 433423 437443 442743 449656 458179 467745 477790 488454 500523 514579 530241 546326
60530E46326J5296J3593J0825O702J868k162m498n750o842p643p458o500n914
60517E47843o290o947o852n670l802j869m09K93M12M79R28J823K925L869M422
60502E31155M870O041Q578J2198J6006J9541K3135K7201L1537L5491L8534M0465
60490G94752M1246M0860L9324L6750L3280K8888K3345J6437Q289o92j0086j9423
60478A032970k7967l4980m0254m3998m6114m6159m4201m1127l7790l4351l0829
60467F05200k7622k4906k2127j8842j5671j3593j2564j1681j0501r334q359p308
60455D22692o138n220m693m241l666l176k913k702k414k122j869j628j527j665
60441C78718j735j352p03l45m25o14p46r19r68n74M6K54q4m63o68j022j493j414
$$ plain form
60530 546326 561622 575215 586040 592742 594610 592448 587950 582200 575358 567715 560257 553757 547843
60517 547843 541553 534606 527754 522084 518282 516413 516004 516297 516709 517188 518116 519939 522864 526733 531155
60502 531155 536025 542066 550644 562842 578848 598389 621524 648725 680262 715753 754287 794752
60490 794752 835998 876858 916182 952932 986212 1015100 1038445 1054882 1063171 1062479 1052393 1032970
60478 1032970 1005003 970023 929769 885771 839657 793498 749297 708170 670380 636029 605200
60467 605200 577578 552672 530545 511703 496032 482439 469875 458194 447693 438359 430000 422692
60455 422692 416554 411334 406641 402400 398734 395558 392645 389943 387529 385407 383538 381910 380383 378718
60441 378718 376983 375631 374928 374583 374158 373544 372798 371879 370911 370337 370383 370637 370553 370090 369422 368400 366907 365493
60423C65493n03M71O77K41j79m00o37p74l47P83K088K775K414J324L93K44O06
60406C74669P74O47P70J333J824J852J692J671J592J215Q19Q28J232J714K018
60391C94650J960J487J029J261K167K839K615J936J626J844K228K572K772K610
60377D23596K160K019K441K767K388J831J925K299J866O76O3O97J639J773J275
60362D49415R92J102J136R95J118J770K680L405L734L788L971M746O198P889R343
60347E02282J0541J1613J2262J1863J0188P636M667J415j900m650o307p166q008
60334E44436r073r802r693q923p890o651n255m225m012m213l985l254k838l180
60320D61442l643l392k495j714j472j440j066j93Q08J420J688K401M237O743Q716
$$ plain form
60423 365493 364990 365461 366138 366379 366200 365800 365163 364389 364042 364825 366913 369688 372102 373426 373819 374063 374669
60406 374669 375443 376090 376860 378193 380017 381869 383561 385232 386824 388039 388858 389686 390918 392632 394650
60391 394650 396610 398097 399126 400387 402554 405393 408008 409944 411570 413414 415642 418214 420986 423596
60377 423596 425756 427775 430216 432983 435371 437202 439127 441426 443292 443968 444031 444728 446367 448140 449415
60362 449415 450407 451509 452645 453640 454758 456528 459208 462613 466347 470135 474106 478852 485050 492939 502282
60347 502282 512823 524436 536698 548561 558749 566385 571052 572467 570567 565917 559610 552444 544436
60334 544436 535363 525561 515868 506945 499055 492404 487149 482924 478912 474699 470714 467460 464622 461442
60320 461442 457799 454407 451912 450198 448726 447286 446220 446027 446835 448255 449943 452344 456581 463324 472040
60305D72040R831J1188J3853J7336K0195K1638K1769K0583J7622J2857P068J076
60293F47056m973j1169j7030k1480k3540k2928k0216j6575j3206j0700q879p229
60281D69131n452l664k266j636j809k322k515k089j465j431k365l705m362l825
60267D30225k772k331k757l176k787j899j449j765k275k354j989j575j319j084
60253D00693o77j61J84J79O1K72Q89J413J358Q82O23R14J433J600J180M54q7k19
60235D10991k17n25j112j297m18J330K977L652L272K421J799J829K516L406L824
60220D34448L363K279J307J020J362J877K331K923L794M580M756M392M212M832
60206D77476O073P186P575P212O497N874N538N421N445N639N893N808N052L855
$$ plain form
60305 472040 481871 493059 506912 524248 544443 566081 587850 608433 626055 638912 645980 647056
60293 647056 642083 630914 613884 592404 568864 545936 525720 509145 495939 485239 476360 469131
60281 469131 463679 460015 457749 456113 454304 451982 449467 447378 445913 444482 442117 438412 434050 430225
60267 430225 427453 425122 422365 419189 416402 414503 413054 411289 409014 406660 404671 403096 401777 400693
60253 400693 400016 399855 400039 400218 400279 400551 401440 402853 404211 405093 405716 406630 408063 409663 410843 411297 411210 410991
60235 410991 410774 410249 409137 407840 407422 408752 411729 415381 418653 421074 422873 424702 427218 430624 434448
60220 434448 437811 440090 441397 442417 443779 445656 447987 450910 454704 459284 464040 468432 472644 477476
60206 477476 483549 490735 498310 505522 512019 517893 523431 528852 534297 539936 545829 551637 556689 560544
60192E60544K814K216J846J493J151O74l31j897l388m097m009l740l870m515n346
60177E39545n828n687n254n107n221m887l759k491j922j987j989j728j657k004
60163D90024k337k222j835j659j859k181k286j989j282k98P10J429J684J558J308
60148D78765J110R87J011J364J915K078J475O74O27J388K067K170K310L176M554
60133E05671N859O985P967Q279P405N837M660M117L395J947L56l56Q8R89J398
60118E64597J028N35P46J547J927J395Q12J246K385K953K416J441P49L50R3K5
60102E84245m6o70k007l507m595n250n635n628n089m228l442l011k999l075k498
60087E32565q36J162K105J585O38K83L58K86J91N36J100J221P95K67k46j138k539
$$ plain form
60192 560544 563358 565574 567420 568913 570064 570738 570407 568510 565122 561025 557016 553276 549406 544891 539545
60177 539545 533717 528030 522776 517669 512448 507561 503802 501311 499389 497402 495413 493685 492028 490024
60163 490024 487687 485465 483630 481971 480112 477931 475645 473656 472374 472076 472786 474215 475899 477457 478765
60148 478765 479875 480862 481873 483237 485152 487230 488705 489379 490006 491394 493461 495631 497941 501117 505671
60133 505671 511530 518515 526482 534761 542166 548003 552663 556780 560175 562122 562478 562122 562210 563199 564597
60118 564597 565625 566160 566906 568453 570380 571775 572587 573833 576218 579171 581587 583028 583777 584127 584220 584245
60102 584245 584199 583529 581522 578015 573420 568170 562535 556907 551818 547590 544148 541137 538138 535063 532565
60087 532565 531729 532891 534996 536581 537219 537502 537860 538146 538337 538873 539973 541194 541989 542256 542010 540872 538333
60070E38333m034n199n958o312o142n501m755m302m258m531m923n115m787l900
60056D68616k775j888j637k119k961l428l023j939p56K63J251K204K812K958L036
60041D60614L493M253M856N028M915M776M704M653M586M497M335L936L091J712
60027E19449lj683l075m220n179n788n887n754n914o398o522n791m708m282m749
60012D49496n340n380n132n170n444n455n128m853m672m009k529q07J78J49k52
59997C95652k69K22P69Q90M51k08m39K79J764L127L628L466L410L715L902L665
59981D24024L380L349L134K313J358J017J022L89j054k377k906k983l033k832
59967D24801k154j420j092r93q32p38p71n23J59O78O16N39J066J680J468N50k19
$$ plain form
60070 538333 534299 529100 523142 516830 510688 505187 500432 496130 491872 487341 482418 477303 472516 468616
60056 468616 465841 463953 462316 460197 457236 453808 450785 448846 448090 448353 449604 451808 454620 457578 460614
60041 460614 464107 468360 473216 478244 483159 487935 492639 497292 501878 506375 510710 514646 517737 519449
60027 519449 519446 517763 514688 510468 505289 499501 493614 487860 481946 475548 469026 463235 458527 454245 449496
60012 449496 444156 438776 433644 428474 423030 417575 412447 407594 402922 398913 396384 395577 395755 395904 395652
59997 395652 395383 395605 396374 397264 397715 397507 397068 397347 399111 402238 405866 409332 412742 416457 420359 424024
59981 424024 427404 430753 433887 436200 437558 438575 439597 439986 438932 436555 433649 430666 427633 424801
59967 424801 422647 421227 420135 419142 418310 417572 416801 416278 416437 417115 417731 418270 419336 421016 422484 423034 422815
59950D22815o71j252j815j675q80k45n5K11O66P27L33L14J041J655J191k55j967
59933D20138l390m039l451j861k92N87J102J681K119K317K841L946M813M707M340
59918D35558M915O292P222P254P175P460P429O336M484K746J510N95j47n94n96
59903D97639k46N8j61r94j885k115j606j000r05j255j521j285n35M58J329J791
59887D87767J790J575J588K099K948L693M153M674N626O766P360O998N986M890
59873E47913L937L014J991R25L1n15q73j524k658l715m017l709l519l578l251
59858E30452k309j426j085p69J44J274J833J951K529L943N687P259Q667R850J0168
59843E78168Q846N715J510k432m843n289m301k629o42J291K162Q90k365o035q489
$$ plain form
59950 422815 422144 420892 419077 417402 416522 416277 416222 416433 417099 417826 418159 418473 419514 421169 422360 422105 420138
59933 420138 416748 412709 409258 407397 407105 407692 408794 410475 412594 414911 417752 421698 426511 431218 435558
59918 435558 440473 446765 453987 461241 468416 475876 483305 489641 494125 496871 498381 498976 498829 498235 497639
59903 497639 497393 497451 497290 496296 494411 492296 490690 489690 488785 487530 486009 484724 484189 484647 485976 487767
59887 487767 489557 491132 492720 494819 497767 501460 505613 510287 515913 522679 530039 537037 543023 547913
59873 547913 551850 554864 556855 557780 557811 557296 556423 554899 552241 548526 544509 540800 537281 533703 530452
59858 530452 528143 526717 525632 524863 525007 526281 528114 530065 532594 536537 542224 549483 558150 568000 578168
59843 578168 587014 592729 594239 591807 586964 581675 577374 574745 574103 575394 577556 578446 576081 570046 561557
59828E61557r249q795p732o472n383m708m351m020l647l395l265k937k172j241
59814D94190o89o54p27n26j39J82L93M42Lj023k015k229j879j840k347k704k513
59797D75925k343k730l278l282k769k218j743j190o92m78l24R6M70P6j205k605
59781D51710l211k674j337k3M42q6q92j172p79oR76K021K733K870K757K790K805
59764D58924K533K327K726L450L676L200K638K431K415K436K613K804K591K117
59750D96881K219L349M812N594N581N507N931O562O566N383L335J461O10P29J148
59735E55668J380J307Q29r5j109j655j633j343r49m50j76n93j435j745j130l57
59719E46514l11q52j180j006q00j044j618j951j588o41K41M58R2k56j94J67N53
$$ plain form
59828 561557 552308 543513 535781 529309 523926 519218 514867 510847 507200 503805 500540 497603 495431 494190
59814 494190 493501 492847 492120 491594 491455 491637 492030 492472 492475 491452 489437 487208 485329 483489 481142 478438 475925
59797 475925 473582 470852 467574 464292 461523 459305 457562 456372 455680 455202 454878 454974 455444 455520 454315 451710
59781 451710 448499 445825 444488 444465 444907 444821 443929 442757 441978 441972 442948 444969 447702 450572 453329 456119 458924
59764 458924 461457 463784 466510 469960 473636 476836 479474 481905 484320 486756 489369 492173 494764 496881
59750 496881 499100 502449 507261 512855 518436 523943 529874 536436 543002 548385 551720 553181 553791 554520 555668
59735 555668 557048 558355 559184 559089 557980 556325 554692 553349 552400 551950 551774 551181 549746 548001 546871 546514
59719 546514 546203 545351 544171 543165 542365 541321 539703 537752 536164 535523 535764 536222 536314 536058 535864 536031 536584
59702E36584Q69J104J298J619K166K614K561K210K208K690L020K806K499K632
59688E66880K951K778J925P41m46j402j815j574j163j252j887k540k939l431m368
59673E52458n430n841n185l915k992l015l696m253m248l865l420k921k265j617
59659D99795j286j321j377r81R9J596K870L444L497L575L824L820L281K572K191
59644E25599K017J497M05q86j899k492k790k946l066l231l411l454l184k573j835
59629D97751j317j269j669k241k674k825k780k737k767k692k343j883j648j619
59615D67287j431j113j353k582m132m836m358l293k103o95Q35J824J793J171P42
59600D47756P24O89K46m97r92o86L83J384J414O06J05O45J608J852J164L51J03
$$ plain form
59702 536584 537453 538557 539855 541474 543640 546254 548815 551025 553233 555923 558943 561749 564248 566880
59688 566880 569831 572609 574534 575275 574829 573427 571612 570038 568875 567623 565736 563196 560257 556826 552458
59673 552458 547028 541187 536002 532087 529095 526080 522384 518131 513883 510018 506598 503677 501412 499795
59659 499795 498509 497188 495811 494830 494929 496525 499395 502839 506336 509911 513735 517555 520836 523408 525599
59644 525599 527616 529113 529518 528632 526733 524241 521451 518505 515439 512208 508797 505343 502159 499586 497751
59629 497751 496434 495165 493496 491255 488581 485756 482976 480239 477472 474780 472437 470554 468906 467287
59615 467287 465856 464743 463390 460808 456676 451840 447482 444189 442086 441391 442226 444050 445843 447014 447756
59600 447756 448480 449169 449415 448918 447926 447240 447623 449007 450421 451027 451132 451777 453385 455237 456401 456752 456855
59583D56855K95M03J09o17j679k793l519l625l367l232l321l206k515j557j087
59568D27144j405k010k258k024j537q78j08L73J51n48j021r24n56k75p3K30P15
59551D14996J411K211K801K948K857K880K947K747K437K588L386M509N758P222
59537D61698Q777J0174J1921J5135J9911K4214K4977K0278J0723o13r582j3396
59525E84217j2474r555o845m557k260k97Q83J660K427K548J319o18k017k809l915
59510E47707n463o523o675o667p124p674p738p400p059o853o769o792o600n734
59496D52636m363l336l103l050k366j098O6P36J054J201J143Q76N83M82O27Q89
59480D42977J185J692K681L954M772M683M277M517N449O120N857M972L991K881
$$ plain form
59583 456855 457150 457553 457662 457045 455366 452573 449054 445429 442062 438830 435509 432303 429788 428231 427144
59568 427144 425739 423729 421471 419447 417910 417032 416924 417297 417448 416900 415879 414955 414399 414124 414051 414281 414996
59551 414996 416407 418618 421419 424367 427224 430104 433051 435798 438235 440823 444209 448718 454476 461698
59537 461698 470475 480649 492570 507705 527616 551830 576807 597085 607808 607195 597613 584217
59525 584217 571743 562188 555343 550786 548526 548229 549112 550772 553199 555747 557066 556448 554431 551622 547707
59510 547707 542244 535721 529046 522379 515255 507581 499843 492443 485384 478531 471762 464970 458370 452636
59496 452636 448273 444937 441834 438784 436418 435320 435386 436122 437176 438377 439520 440396 440979 441461 442088 442977
59480 442977 444162 445854 448535 452489 457261 461944 466221 470738 476187 482307 488164 493136 497127 500008
59466E00008J523L58m3J45K06j11k77K08J105J733J803J710K057L003M153N113
59450E22694N886O693P479P942P972P789P560P105O147M547K269o49l881o751
59436E82802q652r453r389q721p668o496n443m592l979l700l620l144j620Q51
59422E07176L265M633M937N096O043P965J0371J2685J4664J6409J8111J9924K2084
59409F53363K4844K7805K9191K6333J7735M923q126j7599k1912k1567j8007j2819
59397F84164p173j160N729J2477J5479J1110j86j3390k3049k7242k7339k5163
59385F04257k1606j7299j3125r710p047m917l234j935q36K20J292K294K964L052
59371E34370K777K823L550M456M857M815M923N333N557N256M724M465M634N057
$$ plain form
59466 500008 501531 501889 501846 501991 502197 502086 501809 502017 503122 504855 506658 508368 510425 513428 517581 522694
59450 522694 528580 535273 542752 550694 558666 566455 574015 581120 587267 591814 594083 593434 589553 582802
59436 582802 574150 564697 555308 546587 538919 532423 526980 522388 518409 514709 511089 507945 506325 507176
59422 507176 510441 515074 520011 525107 531150 539115 549486 562171 576835 593244 611355 631279 653363
59409 653363 678207 706012 735203 761536 779271 784194 776068 758469 736557 714990 696983 684164
59397 684164 676991 675831 681560 694037 709516 720626 720440 707050 684001 656759 629420 604257
59385 604257 582651 565352 552227 542517 535470 530553 527319 525384 524548 524768 526060 528354 531318 534370
59371 534370 537147 539970 543520 547976 552833 557648 562571 567904 573461 578717 583441 587906 592540 597597
59357E97597N509N870O178O550P005P361P477P512P815Q588R676J0602J0864J0505
59343G09109J0270J0734J1375J1146J0077R334R441R383Q143O087L979J526j752
59330H08852m990o879p756r203j1530j3277j3506j3027j2724j2147j0650q868
59318F84295p877p642p270o332n074l725k475j809k055k723k932k380j389k25
59304F30387J146K742M521O483Q451J0055J1294J2709J4272J4421J1138M109m724
59291G27004j2824j8755k2202k3187k1875j8956j5581j2696j0453q404o293m454
59279E51324l324k732k074j118j31Q74K341M316O022O906P601R090J1161J2521
59265F02777J2425J1439J0435R514Q214O335M085J730o33k997n296p308q727r497
$$ plain form
59357 597597 603106 608976 615154 621704 628709 636070 643547 651059 658874 667462 677138 687740 698604 709109
59343 709109 719379 730113 741488 752634 762711 772045 781486 790869 799012 805099 809078 810604 808852
59330 808852 803862 796983 789227 780024 768494 755217 741711 728684 715960 703813 693163 684295
59318 684295 676418 668776 661506 655174 650100 646375 643900 642091 640036 637313 634381 632001 630612 630387
59304 630387 631533 634275 638796 645279 653730 663785 675079 687788 702060 716481 727619 731728 727004
59291 727004 714180 695425 673223 650036 628161 609205 593624 580928 570475 562071 555778 551324
59279 551324 548000 545268 543194 542076 541945 542819 545160 549476 555498 562404 570005 579095 590256 602777
59265 602777 615202 626641 637076 646590 654804 661139 665224 666954 666321 663324 658028 650720 641993 632496
59251F32496r880r953r298p619n544m141l614l141k225j441j362j437o50J028
59237E73219K661L627M107M315M064L467L320M150N276N406M122K338J254J140
59223F22466J197M51j286l154m016l567k595k022j938j870j719j919k651l423
59209E93954l635l192k397j559r66q76j218j474j258q29p68j262j898k192k036
59194E68394j662j339j135r44p68q71j394j905j701p08L58R01J159J679K488L152
59178E65704L423L380L160K870K647K435K051J718K129L492M939N547N643O311
59164F15449P787R164R679R477Q994Q374P675P017O232M979L353J744m0k660n889
59149F91335q243q670p955p732q498r409r725r617r522r430r137q748q602q788
$$ plain form
59251 632496 622616 612663 603365 595746 590202 586061 582447 579306 577081 575640 574278 572841 572191 573219
59237 573219 575880 579507 583614 587929 591993 595460 598780 602930 608206 613612 617734 620072 621326 622466
59223 622466 623663 624114 622828 619674 615658 612091 609496 607474 605536 603666 601947 600028 597377 593954
59209 593954 590319 587127 584730 583171 582205 581329 580111 578637 577379 576550 575782 574520 572622 570430 568394
59194 568394 566732 565393 564258 563314 562546 561675 560281 558376 556675 555967 556325 557226 558385 560064 562552 565704
59178 565704 569127 572507 575667 578537 581184 583619 585670 587388 589517 593009 597948 603495 609138 615449
59164 615449 623236 632400 642079 651556 660550 668924 676599 683616 689848 694827 698180 699924 699884 697224 691335
59149 691335 683092 674422 666467 658735 650237 640828 631103 621486 611964 602534 593397 584649 576047 567259
59135E67259q932q487p293n867m969m781m710m174l278k507j920j077K46J656
59121E11166K708L599M892O566P770P887P498P792R039J0272J0577J0049R217
59108F09032Q247P257O737O887P007O397N414M860M662M179L551L446L643L082
59094F84401J521j29j275k237l037k970j969j126j069r99k90J57p46k525l974
59079F63733m981o183p421p991q070q463q992q587p067n676n411n785n706m893
59065E68507l990l719m173m784m885m487m243m454m544l986l158k594k032j105
59051E16353m21p93j707j895j324j176j817k214j816j447j724j848r82K40P18
59036D98147N64O62J092J184Q98J008J885L014L833M356M791N208N766O753Q190
$$ plain form
59135 567259 558327 549840 542547 536680 531711 526930 522220 518046 514768 512261 510341 509264 509510 511166
59121 511166 513874 517473 522365 528931 536701 544588 552086 559878 568917 579189 589766 599815 609032
59108 609032 617279 624536 631273 638160 645167 651564 656978 661838 666500 670679 674230 677676 681319 684401
59094 684401 685922 685793 684518 682281 679244 676274 674305 673179 672110 671111 670821 670978 670232 667707 663733
59079 663733 658752 652569 645148 637157 629087 620624 611632 603045 595978 590302 584891 579106 573400 568507
59065 568507 564517 560798 556625 551841 546956 542469 538226 533772 529228 525242 522084 519490 517458 516353
59051 516353 515932 515139 513432 511537 510213 509037 507220 505006 503190 501743 500019 498171 497189 497429 498147
59036 498147 498711 499373 500465 501649 502547 503555 505440 508454 512287 516643 521434 526642 532408 539161 547351
59021E47351R689J0883J1669J2035J1981J1742J1605J1398J0489Q552O036L627
59009F67057J487o17k611l989m407m004l094j860n35M86J075J703K867M282N131
58994F62971N114M769M482L763J977n51k672l642l760l800m209m898n472n523
58980F48549m973m285m034m163l820k227L74K861M399N247O211P545Q729R416
58966F69829J0020J0914J1524J0917R256P844P533P757P493O508N208L729J786
58953G70318p59l675o532q912j0630j1988j3390j4560j4708j3744j2670j2225
58941F46525j1805j0469q368o355m675l030j612j016j239j717k213k799l126k754
58927E85347k131k094k406j997q28k05p90j560j437p73l98k05K33M35l70j813
$$ plain form
59021 547351 557040 567923 579592 591627 603608 615350 626955 638353 648842 657394 663430 667057
59009 667057 668544 667927 665316 661327 656920 652916 649822 647962 647427 647913 648988 650691 653558 657840 662971
58994 662971 668085 672854 677336 681099 683076 682525 679853 676211 672451 668651 664442 659544 654072 648549
58980 648549 643576 639291 635257 631094 627274 625047 625421 628282 632681 637928 644139 651684 660413 669829
58966 669829 679849 690763 702287 713204 722460 730304 737837 745594 753087 759595 764803 768532 770318
58953 770318 769559 765884 759352 750440 739810 727822 714432 699872 685164 671420 658750 646525
58941 646525 634720 624251 615883 609528 604853 601823 600211 599195 597956 596239 594026 591227 588101 585347
58927 585347 583216 581122 578716 576719 575891 575686 574896 573336 571899 571126 570728 570523 570756 571191 570821 569008
58911E69008k613k115p69P36K008K802L170L722N029O754Q062Q912J0162J2197
58897F27065J4121J4770J4102J3151J2783J2842J2503J1281R683Q811R343J0923
58885G71378J2646J3924J4716J5049J4759J3711J2016R848P293M486J714q29l292
58872H87419n957q795j1347j3133j4030j4201j3819j2995j1918j0823r743q529
58860G52129p190o051n506n686o431p412q228q644q856r249r749r749q929p803
58846F42646p079o787o453n931n504n333n323n474n883o336o439o161n829n576
58832E58538n190m581l888l087k051j095q85j526k174j999j149l45K07J020K454
58817E34249M091N169N480N472N503N269M348L115K498K704K829K094R13J08l66
$$ plain form
58911 569008 566395 564280 563511 564247 566255 569057 572227 575949 580978 587732 595794 604706 614868 627065
58897 627065 641186 655956 670058 683209 695992 708834 721337 732618 742301 751112 760455 771378
58885 771378 784024 797948 812664 827713 842472 856183 868199 878047 885340 889826 891540 890711 887419
58872 887419 881462 872667 861320 848187 834157 819956 806137 793142 781224 770401 760658 752129
58860 752129 744939 738888 733382 727696 721265 713853 705625 696981 688125 678876 669127 659378 650449 642646
58846 642646 635567 628780 622327 616396 610892 605559 600236 594762 588879 582543 576104 569943 564114 558538
58832 558538 553348 548767 544879 541792 539741 538646 537761 536235 534061 532062 530913 530568 530775 531795 534249
58817 534249 538340 543509 548989 554461 559964 565233 569581 572696 575194 577898 580727 582821 583734 583842 583476
58802E83476j138k193k837k783k460k284k344k827l917n182n829n738n504n404
58788E33036n025m157l217k511j745o09P84K201L481M272M309M066M306M822M553
58773E48566L299K156J810J392j33k410m349n591o391o702o356n686n053m207
58759E10345k902j705j222j054m81K13K43j45J47J295K198K088J513J334J590
58744E13457J860K040K288K623L041L699M624N501N989O135O232O423O505O132
58730E76549N206M157L622L758M015L886L516L312L218K865K262J778J540J353
58716F21037J266J685K795M217N405O074O201N857N227M534L798K821J431k99
58702F72049k152l953n669p386r172j0960j2629j4094j5170j5473j4763j3365
$$ plain form
58802 583476 582338 580145 577308 574525 572065 569781 567437 564610 560693 555511 549682 543944 538440 533036
58788 533036 528011 523854 520637 518126 516381 515772 516556 518757 522238 526510 530819 534885 539191 544013 548566
58773 548566 551865 554021 555831 557223 557090 554680 550331 544740 538349 531647 525291 519605 514552 510345
58759 510345 507443 505738 504516 503462 502981 503194 503437 503292 503439 504734 506932 509020 510533 511867 513457
58744 513457 515317 517357 519645 522268 525309 529008 533632 539133 545122 551257 557489 563912 570417 576549
58730 576549 581755 585912 589534 593292 597307 601193 604709 608021 611239 614104 616366 618144 619684 621037
58716 621037 622303 623988 626783 631000 636405 642479 648680 654537 659764 664298 668096 670917 672348 672049
58702 672049 669897 665944 660275 652889 643717 632757 620128 606034 590864 575391 560628 547263
58690E47263j1861j0451q995p667o888o537n954n001m370m426m479l834k933k664
58676D61203l007l107k464j245K19J590K415K650L049M249N629O061N687N980
58662D88909P752R962J0951J0154Q158N584K668l16k756m122m524m658n072n539
58648E17151n435m689m001l894m037l859l439l222l177k851k193j702j662j754
58634D71236j471o67M14J357J890K129K420K808K879K324J402N30j59o30p50o56
58618D85056q34j261j035M99K664M241N019N708O588P162P070O457N464M152K984
58603E39934K575K792K845K392J907J751J622J185O46L05k5p22j765k641k732
58588E50069j783j63J407K593L725N069O216O693O809P235P910Q126P596O758
$$ plain form
58690 547263 535402 524951 515956 508289 501401 494864 488910 483909 479539 475113 470634 466800 463867 461203
58676 461203 458196 455089 452625 451380 451599 453189 455604 458254 461303 465552 471181 477242 482929 488909
58662 488909 496661 506623 517574 527728 535886 541470 544138 543822 541066 536944 532420 527762 522690 517151
58648 517151 511716 507027 503026 499132 495095 491236 487797 484575 481398 478547 476354 474652 472990 471236
58634 471236 469765 469098 469512 470869 472759 474888 477308 480116 482995 485319 486721 487251 487092 486462 485712 485056
58618 485056 484222 482961 481926 482425 485089 489330 494349 500057 506645 513807 520877 527334 532798 536950 539934
58603 539934 542509 545301 548146 550538 552445 554196 555818 557003 557649 557954 557929 557207 555442 552801 550069
58588 550069 548286 548123 549530 552123 555848 560917 567133 573826 580635 587870 595780 603906 611502 618260
58574F18260O078N728N827O318O696O615O735Q046J0371J2465J3701J4748J6294
58561G37882J8116J9824K1600K3570K5080K5253K3898K1401J8140J4402J0465
58550I59631O387K091k064n270p118q022q439q253p370o504o624p861r554j1322
58536H79708j3503j6363j9316k1296k1841k1428k0646j9307j6816j3339j0056
58525F85797p908o585n182l479k005j130p02n31o62j156j967k965l798l902l074
58510F40751j854r68o43p62j260j889k071j601j070j018j083p52l42l49l68J87
58494F24908P81M42m77o04L68J343J677J987K787L596M001M514N698P299Q799
58479F67119J0115J1331J2359J3274J4327J5327J5676J5228J4384J3091J0582
$$ plain form
58574 618260 624338 630066 635893 642211 648907 655522 662257 670303 680674 693139 706840 721588 737882
58561 737882 755998 775822 797422 820992 846072 871325 895223 916624 934764 949166 959631
58550 959631 966018 968109 966045 960775 953657 945635 937196 928943 921573 915069 908445 900584 891030 879708
58536 879708 866205 849842 830526 809230 787389 765961 745315 726008 709192 695853 685797
58525 685797 677889 671304 666122 662643 660638 659508 658806 658275 657613 656457 654490 651525 647727 643825 640751
58510 640751 638897 637929 637286 636524 635264 633375 631304 629703 628633 627615 626532 625780 625438 625089 624721 624908
58494 624908 625689 626131 625654 625050 625418 626761 628438 630425 633212 636808 640809 645323 651021 658320 667119
58479 667119 677234 688565 700924 714198 728525 743852 759528 774756 789140 802231 812813
58468H12813O479J529l103o731r121j0302j0575j0221r102p033m455k050J51K469
58454G50748M693O402P895R637J1041J1098J0060R006P807N179R80l258o521r325
58440H15442j1901j3108j2121r852p725o140m865l789k524m46K083L732M131M542
58426G57459N888P490Q606R769J1490J3017J3574J3603J3515J2445R595N818K388
58413H84657q07m368p591r161r151q855q962r091q835q185p201o108n378n012
58399G85952m289k846j326k62P78K122L100L179L071L641M511M779M379L645K450
58384H12884Q70j28J44R11J069P83R03J528K311L379M797N891O204O414P162P885
58368H63007P908P820Q363Q993Q946Q880R800J1123J1522J1134J1272J2291J3329
$$ plain form
58468 812813 819292 820821 817718 810987 801866 791564 780989 770768 761666 754633 750178 748128 748279 750748
58454 750748 755441 761843 769738 779375 790416 801514 811574 820580 828387 833566 834546 831288 824767 815442
58440 815442 803541 790433 778312 768460 760735 754595 749730 745941 743417 742971 745054 748786 752917 757459
58426 757459 763347 770837 779443 789212 800702 813719 827293 840896 854411 866856 876451 882269 884657
58413 884657 883850 879482 871891 862730 853579 844724 835762 826671 817836 809651 802450 796342 790964 785952
58399 785952 781663 778817 777491 777229 778007 780129 783229 786408 789479 793120 797631 802410 806789 810434 812884
58384 812884 813754 813626 813770 814681 815750 816533 817436 818964 821275 824654 829451 835342 841546 847960 855122 863007
58368 863007 870915 878735 887098 896091 905037 913917 923717 934840 946362 957496 968768 981059 994388
58355I94388J3934J4367J4426J3333J0890P774M745K330R24M63M45Q09K066M030
58341A084924N590O440P669R667J1056J1028J1092J2796J5177J6415J6689J7216
58329A225759J7659J6830J5140J4006J3440J2391J0929R914Q980P095M766L570
58317A360479L749M185M546N407O577P177P277P713Q512R145R895J1318J2846
58304A458826J3655J4340J5962J7969J8972J8980J9044J9302J9217J9066J9344
58293A654677J9404J8610J7940J8503J9484J9648J9820K1438K3748K4973K5312
58282A883557K6215K7545K8143K8305K9022K9710K9427K9256L0620L2432L2994
58271B207226L3443L5899L9342M1147M1812M4125M8342N2098N4717N7571O0656
$$ plain form
58355 994388 1008322 1022689 1037115 1050448 1061338 1069112 1073857 1076187 1077111 1077574 1078019 1078828 1080894 1084924
58341 1084924 1090514 1096954 1104623 1114290 1125346 1136374 1147466 1160262 1175439 1191854 1208543 1225759
58329 1225759 1243418 1260248 1275388 1289394 1302834 1315225 1326154 1336068 1345048 1352143 1356909 1360479
58317 1360479 1364228 1368413 1372959 1378366 1384943 1392120 1399397 1407110 1415622 1424767 1434662 1445980 1458826
58304 1458826 1472481 1486821 1502783 1520752 1539724 1558704 1577748 1597050 1616267 1635333 1654677
58293 1654677 1674081 1692691 1710631 1729134 1748618 1768266 1788086 1809524 1833272 1858245 1883557
58282 1883557 1909772 1937317 1965460 1993765 2022787 2052497 2081924 2111180 2141800 2174232 2207226
58271 2207226 2240669 2276568 2315910 2357057 2398869 2442994 2491336 2543434 2598151 2655722 2716378
58260B716378O2728O4512O7766P1484P3106P3109P4253P6657P8030P8332P9705
58249C516060Q2084Q3631Q5248Q9625R5976J00928J04553J10242J18414J25931
58239D512692J32119J39696J49147J57881J65656J75138J86482J97136K07644
58230F023591K21512K38633K55198K70842K89380L11734L35017L59396L88609
58221H693912M22753M58139M95294N39095N89932O43266O99288P64216Q40746
58212A4146641R26626J024045J140398J278398J436353J619948J842436K112027
58204B5526872K431784K812868L273110L821093M458615N201952O084413P138228
58196F0748935Q396501R915014J1767112J4015350J6716858J9952045K3795513
$$ plain form
58260 2716378 2779106 2843618 2911384 2982868 3055974 3129083 3203336 3279993 3358023 3436355 3516060
58249 3516060 3598144 3681775 3767023 3856648 3952624 4053552 4158105 4268347 4386761 4512692
58239 4512692 4644811 4784507 4933654 5091535 5257191 5432329 5618811 5815947 6023591
58230 6023591 6245103 6483736 6738934 7009776 7299156 7610890 7945907 8305303 8693912
58221 8693912 9116665 9574804 10070098 10609193 11199125 11842391 12541679 13305895 14146641
58212 14146641 15073267 16097312 17237710 18516108 19952461 21572409 23414845 25526872
58204 25526872 27958656 30771524 34044634 37865727 42324342 47526294 53610707 60748935
58196 60748935 69145436 79060450 90827562 104842912 121559770 141511815 165307328
58189A65307328K8226914L3052818L7788830M1391495M2072229L7779494K7497611
58182D13116719J2440824m129506j8593597k8804046l4610449l7015368l7078774
58175B65325803l5480081l2675850k9115818k5255278k1468715j8001256j4971763
58168H8357042j2402533j0263582q508650p084925n933007m997371m236019l615196
58160C1315759l102732k673416k313681k014152j763145j551325j375016j229557
58152A5292735j105823r97517r04913q27127p57374o90280o27441n71482n20604
58143H290174m73050m30847l94727l60881l27035k96783k73949k57331k44379
58134E231192k35063k28450k20290k08096j94512j82358j70459j57590j46098
$$ plain form
58189 165307328 193534242 226587060 264375890 305767385 347839614 385619108 413116719
58182 413116719 425557543 421428037 402834440 374030394 339419945 302404577 265325803
58175 265325803 229845722 197169872 168054054 142798776 121330061 103328805 88357042
58168 88357042 75954509 65690927 57182277 50097352 44164345 39166974 34930955 31315759
58160 31315759 28213027 25539611 23225930 21211778 19448633 17897308 16522292 15292735
58152 15292735 14186912 13189395 12284482 11457355 10699981 10009701 9382260 8810778 8290174
58143 8290174 7817124 7386277 6991550 6630669 6303634 6006851 5732902 5475571 5231192
58134 5231192 4996129 4767679 4547389 4339293 4144781 3962423 3791964 3634374 3488276
58125C488276j37867j30668j22122j13670j07203j01310r4317q7733q3238p9363
58115B430785p4518p0307o8454o7123o3660n8698n4487n1230m7909m4855m2881
58104A786663m1558m0442m0170m0660m0376l8985l8349l9255l9848l9024l8421
58093A349575l9107l9203l7055l4031l1789k9547k6482k4084k3432k2672k0044
58082A022129j7119j6174j6551j6471j6395j7487j8607j7950j6366j6020j6841
58071H36148j7044j6242j5512j5162j4710j4293j4143j3506j1930j0498j0068
58060F83040r492p625n698n559o705p297p196p756r251j0626j1269j1232j0285
58047E73049q451o885o619o981o660n640m785m297l961m025m556m760m202l729
$$ plain form
58125 3488276 3350409 3219741 3097619 2983949 2876746 2775436 2681119 2593386 2510148 2430785
58115 2430785 2356267 2285960 2217506 2150383 2086723 2028025 1973538 1922308 1874399 1829544 1786663
58104 1786663 1745105 1704663 1664493 1623833 1583457 1544472 1506123 1466868 1427020 1387996 1349575
58093 1349575 1310468 1271265 1234210 1200179 1168390 1138843 1112361 1088277 1064845 1042173 1022129
58082 1022129 1005010 988836 972285 955814 939419 921932 903325 885375 869009 852989 836148
58071 836148 819104 802862 787350 772188 757478 743185 729042 715536 703606 693108 683040
58060 683040 673548 665923 660225 654666 647961 640664 633468 625712 616461 605835 594566 583334 573049
58047 573049 564598 557713 551094 544113 537453 531813 527028 522731 518770 514745 510189 505429 501227 497498
58033D97498l986m189l691l449m450n877o479o684p603q938r579r427r069q391
58019D05686p107n855n340n161m729m385m438m166l195k577k977l186k017m97
58005C50056k44r43j289j356j896k323j598l46R4J30J215L199M466M450L982L342
57989C60939J973N2j417k108k521k791k743k759l181l317k484j575j960l305m142
57974C28661m128m014l787k780j473j211k073k688k321j608j118o38n3L68O16
57959C01753R12J037P71O01Q35N52j202l549m617l903k460j100N2O38L75J32R79
57942B91806K445L248L514M433N908O555O195O321P620Q836Q786P965P373O984
57928C77989O153M660K736P45r23k191l517n124o405o883p244q206q932q083o026
$$ plain form
58033 497498 493512 489323 485632 482183 477733 471856 465377 458693 451090 442152 432573 423146 414077 405686
58019 405686 398579 392724 387384 382223 377494 373109 368671 364505 361310 358733 355756 352570 350553 350056
58005 350056 349812 348869 347580 346224 344328 342005 340407 340061 340155 340285 341500 344699 349165 353615 357597 360939
57989 360939 362912 362964 361547 359439 356918 354127 351384 348625 345444 342127 339643 338068 336108 332803 328661
57974 328661 324533 320519 316732 313952 312479 311268 309195 306507 304186 302578 301460 300822 300769 301137 301753
57959 301753 302665 303702 304473 305074 305909 306461 305259 301710 297093 293190 290730 289630 289682 290320 290695 290827 291806
57942 291806 294251 297499 301013 305446 311354 317909 324104 330425 338045 346881 355667 363632 371005 377989
57928 377989 384142 388802 391538 392283 391360 389169 385652 380528 374123 367240 359996 351790 342858 334775 328749
57913C28749m378l606k822j775j179q91K12K059K943J927J66r76j668k685l903
57898C12173m647m672m142l339k737k699k762k092p71K64O72J035J579J742J325
57883B90929R63J080J312J270J024N30m61j706k542k849l068l252l030k563k411
57868B75226k412j799n02P67J760K823L699L623K763K312K743L257L247L109L211
57853C03827L342L472L904M251L564J844K71m88j031j954l051m173n555o825p007
57838B94391o021n009m620m237l416k754k694k638k044j272p59l43J9n2l68p5
57822B58108R77J838J968J896J943J682J220J507K594L118K323J157L59r49l514
57807B76227o235p625p830p800p431o067m045k379j407q80p94j065j081n34n5
$$ plain form
57913 328749 324371 320765 317943 316168 314989 314098 314310 316369 319312 321239 321405 320429 318761 316076 312173
57898 312173 307526 302854 298712 295373 292636 289937 287175 285083 284312 284576 285248 286283 287862 289604 290929
57883 290929 291892 292972 294284 295554 296578 297108 296647 294941 292399 289550 286482 283230 280200 277637 275226
57868 275226 272814 271015 270513 271280 273040 275863 279562 283185 285948 288260 291003 294260 297507 300616 303827
57853 303827 307169 310641 314545 318796 322360 324204 324475 323987 322956 321002 317951 313778 308223 301398 294391
57838 294391 288370 283361 278741 274504 271088 268334 265640 263002 260958 259686 258927 258584 258603 258551 258183 258108
57822 258108 259085 260923 262891 264787 266730 268412 269632 271139 273733 276851 279174 280331 280690 279741 276227
57807 276227 269992 262367 254537 246737 239306 233239 229194 226815 225408 224528 223734 222669 221588 221054 220999
57792B20999j38k60J30O92J151K008L298L865L174K601L430M691M722L892L795
57777B58050M586N098N110N361N594M712K880J552J142M99j014k634l778m874
57763B82284o024o413n729m914m738m724m232l585l235k774j606q7Q76R49N28
57748B36576J41K03R70K207L132L103K264J267N63J34l09r69j616j674r23k5J56
57731B45200k49l01L06O79O3r23j011l0Q61O29m35j276j363j030p52o25o41j031
57713B38071j956l115l989m375m371m035l439k893k677k730k980l654m645m940
57699A88272l642j462j16j06k55K91Q60O87L19N82J043O96l28r49p33l16k28k13
57681A84402J90J021K033K976L764M638O064Q165J0445J2493J4758J8217K3297
$$ plain form
57792 220999 220861 220601 220731 221423 222574 224582 227880 231745 234919 237520 240950 245641 250363 254255 258050
57777 258050 262636 267734 272844 278205 283799 288511 291391 292943 294085 294584 293570 290936 287158 282284
57763 282284 276260 269847 264118 259204 254466 249742 245510 241925 238690 235916 234310 234223 235099 236048 236576
57748 236576 236717 236920 237890 240097 243229 246332 248596 249863 250426 250560 250251 249282 247666 245992 245069 245044 245200
57731 245200 244951 244650 244956 245635 245698 244775 243764 243734 244595 245224 244789 243513 242150 241120 240368 239743 239102 238071
57713 238071 236115 233000 229011 224636 220265 216230 212791 209898 207221 204491 201511 197857 193212 188272
57699 188272 184630 183168 183052 182946 182691 182982 183842 184529 184848 185430 186473 187169 186841 185892 185159 184843 184615 184402
57681 184402 184592 185613 187646 190622 194386 199024 205088 213253 223698 236191 250949 269166 292463
57668B92463K9509L6067M2648M9359N5785N9715N7216M4991K3392k976k7784m6093
57656F14292n5774n7446n3746m7828m1596l5417k9342k3815j9050j4761j1044
57645B24473q598p559o983o025m796l488j764K02J191N46n64o28K21Q13Q38Q24
57629A88703P97L76j89k84j08l88j084j533j694k115k763k944k441j789j415j338
57613A69791j621k211k502j945r69l90j08O28J790K535K525K242J922J226J67
57598A73080o25q11p26o93o97q52j361j946k038j691j476j506j375j109j318k101
57582A52755k684k432j606p98k34P8J19p4m35j105k203l377m030m000l546k872
57566A23556k140j734j832j920j461p63m46k60N44J846K635K475J992J769J708
$$ plain form
57668 292463 321972 358039 400687 450046 505831 565546 622762 667753 691145 688169 660385 614292
57656 614292 558518 501072 447326 399498 357902 322485 293143 269328 250278 235517 224473
57645 224473 215875 208316 201333 195308 190512 187024 185260 185462 186653 187199 186635 186007 186228 187041 187879 188703
57629 188703 189500 189876 189687 189403 189295 188907 187823 186290 184596 182481 179718 176774 174333 172544 171129 169791
57613 169791 168170 165959 163457 161512 160543 160153 160045 160673 162463 164998 167523 169765 171687 172913 173080
57598 173080 172455 171644 170918 170225 169528 168676 167315 165369 163331 161640 160164 158658 157283 156174 154856 152755
57582 152755 150071 147639 146033 145235 145001 145079 145198 145124 144689 143584 141381 138004 133974 129974 126428 123556
57566 123556 121416 119682 117850 115930 114469 113706 113260 113000 113544 115390 118025 120500 122492 124261 125969
57551A25969J686J940K471K841K828K639K249J291j67j432k045k249k352k260
57537A33409j843j261o73r9L13K90j51o94j129j369j242o68M2O38J306K121K524
57520A31514K137J685K067K853K820J879J201J444J989K098J764J147K40o56j056
57505A53126j076j244j475j228p22q30j568j962j644j386j622j728j356j247j944
57490A32094k746k757k109j399p38q8J84k1q3M59J069J078P80R24J560K087K093
57473A32387J575O58l68j071j339j514j764j762j272o15j70O6K01J94J60L49O02
57456A26317M28j33l66J7M24L88L18O84J123J006M14lJ05N19P69N35o5n01m33
57437A31546j83j75j53K92P68O15K21N11J217J100O4n04K4N55L15K49J245K313
$$ plain form
57551 125969 127655 129595 132066 134907 137735 140374 142623 143914 143747 142315 140270 138021 135669 133409
57537 133409 131566 130305 129632 129533 129846 130136 129985 129291 128162 126793 125551 124883 124925 125563 126869 128990 131514
57520 131514 133651 135336 137403 140256 143076 144955 146156 147600 149589 151687 153451 154598 154838 154182 153126
57505 153126 152050 150806 149331 148103 147381 146551 144983 143021 141377 139991 138369 136641 135285 134038 132094
57490 132094 129348 126591 124482 123083 122345 122257 122441 122420 122337 122796 123865 124943 125723 126647 128207 130294 132387
57473 132387 133962 134620 134252 133181 131842 130328 128564 126802 125530 124915 124745 124811 125012 125206 125366 125715 126317
57456 126317 126745 126612 126246 126263 126687 127075 127393 128077 129200 130206 130620 130617 130722 131241 132010 132545 132480 131979 131546
57437 131546 131363 131188 131035 131327 132095 132710 132931 133442 134659 135759 135823 135319 135343 135898 136213 136462 137707 140020
57419A40020J951M36o71o75k21q4n15j432k306k302j251p2M38N94R64J259R84
57402A37117M54K27R7l40p41o45n13r61j457r54M12J436J567J418J584J955K298
57385A42954K652K957K909K423J821J451J437J649J803J668J392J246J051M37
57371A67850k73k87L42N41j82r94j187j217j530j505o44J98M7n61n04J31N11O56
57353A61392J125J549J070l0n43r0O12J081J373J289N57j99o3O99R91O47M94O72
57335A72626M70m2J90J353K186J838R89M64J9p04j123o29L12Q93J077J104N72
57318A81595q76k380k489r65Q19J479R96L60L38Q83J487J729J495R40M36M10R11
57301A87168J380J249P26N49R36J328J404J579K125K564K496K316K411K302J511
$$ plain form
57419 140020 141971 142407 141736 141061 140840 140756 140241 138809 136503 134201 132950 132878 133316 133910 134874 136133 137117
57402 137117 137571 137798 137895 137555 136814 136169 135656 134695 133238 132284 132696 134132 135699 137117 138701 140656 142954
57385 142954 145606 148563 151472 153895 155716 157167 158604 160253 162056 163724 165116 166362 167413 167850
57371 167850 167577 167290 167632 168173 167991 166997 165810 164593 163063 161558 160914 161112 161159 160598 160094 160225 160736 161392
57353 161392 162517 164066 165136 165106 164563 164473 165085 166166 167539 168828 169385 169186 169123 169822 170813 171460 171954 172626
57335 172626 173096 173054 173244 174597 176783 178621 179610 180074 180093 179389 178266 177637 177949 178842 179919 181023 181595
57318 181595 180719 178339 175850 174885 175704 177183 178179 178539 178877 179760 181247 182976 184471 185411 185847 186257 187168
57301 187168 188548 189797 190523 191072 192008 193336 194740 196319 198444 201008 203504 205820 208231 210533 212044
57286B12044O22M73P77P05M37Q37J778K131J548R86J173J674J841J737J596J281
57270B31640P26L03K91M45M82N07O87R82J419K132K978L567L761L731L466K795
57254B59912J934J424J422J586J703J859J988J816J392J084J005J029J299K074
57240B81527L010L365L005K577K562K836L191L549L567K868J821J315J516J654
57226C18363J305J020J352K092K902L938N285O442O962P062P074O803N972M906
57212C81478M191M061M538N717P350Q513Q383P213O048N614N861O470P241P957
57198D70635Q302Q181P960Q193R030J0041J0768J1383J2523J4324J6042J6894
57186F04276J6902J6536J5882J4799J3596J2855J2716J2941J3546J4647J5741
$$ plain form
57286 212044 212666 213139 213916 214621 215058 215895 217673 219804 221352 222338 223511 225185 227026 228763 230359 231640
57270 231640 232366 232669 232960 233405 233887 234394 235081 236063 237482 239614 242592 246159 249920 253651 257117 259912
57254 259912 261846 263270 264692 266278 267981 269840 271828 273644 275036 276120 277125 278154 279453 281527
57240 281527 284537 287902 290907 293484 296046 298882 302073 305622 309189 312057 313878 315193 316709 318363
57226 318363 319668 320688 322040 324132 327034 330972 336257 342699 349661 356723 363797 370600 376572 381478
57212 381478 385669 389730 394268 399985 407335 415848 424231 431444 437492 443106 448967 455437 462678 470635
57198 470635 478937 487118 495078 503271 512301 522342 533110 544493 557016 571340 587382 604276
57186 604276 621178 637714 653596 668395 681991 694846 707562 720503 734049 748696 764437
57175G64437J5989J5400J4935J5260J6030J6669J7147J7620J7909J7862J7752
57164I47010J7958J8478J9091J9721K0362K0892K1225K1491K1832K2189K2384
57153A172633K2356K2265K2431K3126K4335K5847K7588K9587L1464L2524L2702
57142A466858L2860L3677L4761L5527L6343L7881L9819M1294M2413M4150M6695
57131A892278M9064N0571N1736N3436N6024N9621O4459P0446P6989Q3579R0184
57120B598387R7048J04616J13637J24605J37072J50202J64072J79553J96807K14980
57110D080979K33791K54604K79423L09431L45083L87148M37264M97863N71892
57101G397478O62462P72572R05409J064699J254189J476713J733964K026761K354477
$$ plain form
57175 764437 780426 795826 810761 826021 842051 858720 875867 893487 911396 929258 947010
57164 947010 964968 983446 1002537 1022258 1042620 1063512 1084737 1106228 1128060 1150249 1172633
57153 1172633 1194989 1217254 1239685 1262811 1287146 1312993 1340581 1370168 1401632 1434156 1466858
57142 1466858 1499718 1533395 1568156 1603683 1640026 1677907 1717726 1759020 1801433 1845583 1892278
57131 1892278 1941342 1991913 2043649 2097085 2153109 2212730 2277189 2347635 2424624 2508203 2598387
57120 2598387 2695435 2800051 2913688 3038293 3175365 3325567 3489639 3669192 3865999 4080979
57110 4080979 4314770 4569374 4848797 5158228 5503311 5890459 6327723 6825586 7397478
57101 7397478 8059940 8832512 9737921 10802620 12056809 13533522 15267486 17294247 19648724
57092A9648724K713796L098148L498150L902277M297407M669154N000905N271039
57084E2099600N450110N499950N375713N033584M447354L628219K630840J534545
57076H5699915M11999o88732j738277k710806l577462m309714m883736n282537
57068F2920650n498668n537314n416313n162985m810453m394047l946826l495768
57060B4658276l060871k656157k290195j966387j684460j442291j236454j062370
57052I259091r15286p91217o86625n98135n23342m60991m09465l65900l27736
57043D180394k94221k65278k39836k16515j95153j76209j59218j43265j28422
57034B362277j15228j03092r0703p7632o4110m9536l2794j3786P013K9885N3842
$$ plain form
57092 19648724 22362520 25460668 28958818 32861095 37158502 41827656 46828561 52099600
57084 52099600 57549710 63049660 68425373 73458957 77906311 81534530 84165370 85699915
57076 85699915 86111914 85423182 83684905 80974099 77396637 73086923 68203187 62920650
57068 62920650 57421982 51884668 46468355 41305370 36494917 32100870 28154044 24658276
57060 24658276 21597405 18941248 16651053 14684666 13000206 11557915 10321461 9259091
57052 9259091 8343805 7552588 6865963 6267828 5744486 5283495 4874030 4508130 4180394
57043 4180394 3886173 3620895 3381059 3164544 2969391 2793182 2633964 2490699 2362277
57034 2362277 2247049 2143957 2053254 1975622 1911512 1861976 1829182 1815396 1822409 1852294 1906136
57023A906136P2309P3610M9102J662n4542j02822j33062j44416j41880j31422
57013A394675j17370j02378q8060p5129o3576n3382m4962l8594l3803k9799k6275
57002G21347k3302k0699j8154j5815j4190j3427j3156j2965j2693j2287j1683
56991E52976j0818r579p926o159m590k862j26L693P304R162Q620N686N07o127
56977E39761j2478j7029j9728k1287k1699k0373j7510j4209j1231q461n717l287
56965C66752j430J57K092M742P989J1372J4554J7701K1026K3774K4182K0845J3817
56952E27573M265o292j5974k2758k5725k5823k4605k2636j9673j5921j2097q516
56940C31818n014j633J407M335P698J1612J5748J9956K4329K8594L1799L2472
$$ plain form
57023 1906136 1978445 2052055 2101157 2102819 2048277 1945455 1812393 1667977 1526097 1394675
57013 1394675 1277305 1174927 1086867 1011738 948162 894780 849818 811224 777421 747622 721347
57002 721347 698045 677346 659192 643377 629187 615760 602604 589639 576946 564659 552976
56991 552976 542158 532579 524653 518494 513904 511042 510916 514609 521913 531075 539695 545381 545888 539761
56977 539761 527283 510254 490526 469239 447540 427167 409657 395448 384217 375756 370039 366752
56965 366752 365322 365479 367571 372313 380302 391674 406228 423929 444955 468729 492911 513756 527573
56952 527573 531838 525546 509572 486814 461089 435266 410661 388025 368352 352431 340334 331818
56940 331818 326804 325171 326578 330913 338611 350223 365971 385927 410256 438850 470649 503121
56928E03121K8943K0179P056p431j9917k8584l3332l4752l3680l1144k7915k4264
56916C18280k0558j7572j5565j3699j1243q757p218o514n797m901m260l767k868
56903A95561j706j039j009r86n60J18R96K184L403M223M875O070P999J0214J2429
56888B42772J4697J6902J8792K0358K1328K0483J6480R568J685n193j0226j3358
56876C54288j4713j4510j2984j0243o635l033j49K322N202Q684J2364J6246K0939
56863C57778K6832L3661M0761M7163N1537N2515M8946L9767K4605N334j3714k8354
56851F86831l7227m1307m1563l8331l2398k5199j7789j0624m027K105Q692J6411
56839D65574K4615L2441M0537N0219O1278P2008Q0836Q6024Q4001P0586M5081
$$ plain form
56928 503121 532064 552243 559299 551868 531951 503367 470035 435283 401603 370459 342544 318280
56916 318280 297722 280150 264585 250886 239643 230886 223668 217154 211357 206456 202196 198429 195561
56903 195561 193855 192816 191807 190821 190261 190379 191375 193559 196962 201185 206060 212130 220129 230343 242772
56888 242772 257469 274371 293163 313521 334849 355332 371812 381380 383065 377872 367646 354288
56876 354288 339575 325065 312081 301838 295203 292170 292021 294343 299545 308229 320593 336839 357778
56863 357778 384610 418271 459032 506195 557732 610247 659193 698960 723565 728899 715185 686831
56851 686831 649604 608297 566734 528403 496005 470806 453017 442393 438366 440471 449163 465574
56839 465574 490189 522630 563167 613386 674664 746672 827508 913532 997533 1068119 1113200
56828A113200J1992k1787n0486p0456q0156q0699p5295o6986n7210m6682l6327
56817E39108k6683j7442q462m34O172J2188J9137K7904L8228M8814N7604O2443
56805G58577O1613N3575L7042J2856j4363l8155n4478o3222o5827o3272n6882
56794E67464m9030m1591l4633k7584k0731j4650r117l541K080P469J2727J7982
56782D06845K2970K7397L0910L2223K9166K0542P510p224k0974l1586l7711l9495
56770D40573l8479l6141l2959k9146k5318k1850j8449j5101j2566j1249j0328
56759A88987q853p107o007n681n385m505l091j710j117j605k463k632k099j805
56745A34927k003j832r42l13o44j097o37L07O30K25k20n10q42r09k80N39N51k67
$$ plain form
56828 1113200 1125192 1103405 1052919 982463 902307 821608 746313 679327 622117 575435 539108
56817 539108 512425 494983 486521 486087 492259 504447 523584 551488 589716 638530 696134 758577
56805 758577 820190 873765 910807 923663 909300 871145 816667 753445 687618 624346 567464
56794 567464 518434 476843 442210 414626 393895 379245 370128 366587 368667 376136 388863 406845
56782 406845 429815 457212 488122 520345 549511 570053 577563 570339 549365 517779 480068 440573
56770 440573 402094 365953 332994 303848 278530 256680 238231 223130 210564 199315 188987
56759 188987 180134 173027 167020 161339 155954 151449 148358 146648 145531 143926 141463 138831 136732 134927
56745 134927 132924 131092 130150 129837 129193 128096 127459 127766 128396 128621 128401 127891 127049 126140 125860 126399 126950 126683
56727A26683q81o05J59P08R60J290J826K159J792R04L91Q84J806K047J420P40
56711A42283N10M15L06O09J347J720J273P15Q76J538J911J779J539J529J739J931
56695A62020J755J185Q80J474K465K627J704P25M52N21M72N22P57O37m3n98m65
56678A77090J7L38M93M73M1n04l81L01M03m32j080p90m34r32j564j150J09J141
56660A73139J546J444O77o63j595j324m26J28M80J351K540L132K712J508j75j707
56644A82767k033q54O52J253J189J369J769J801J557J445J132J27j051j482j250
56629A88391j137j312j433j606k072k383k015j436j446j864j998j938k219k533
56615A62999k180j392r89r68o86k38k46n27l03K83K61m79r49p01m55q35j488j810
$$ plain form
56727 126683 125802 125197 125356 126064 127024 128314 130140 132299 134091 134995 135386 136270 138076 140123 141543 142283
56711 142283 142793 143208 143514 144123 145470 147190 148463 149178 150054 151592 153503 155282 156821 158350 160089 162020
56695 162020 163775 164960 165840 167314 169779 172406 174110 174835 175287 175808 176280 176802 177559 178196 178153 177555 177090
56678 177090 177107 177445 177938 178411 178452 177948 177567 177868 178271 177839 176759 175969 175535 174603 173039 171889 171998 173139
56660 173139 174685 176129 176806 176143 174548 173224 172798 172926 173406 174757 177297 180429 183141 184649 184474 182767
56644 182767 180734 179880 180532 181785 182974 184343 186112 187913 189470 190915 192047 192174 191123 189641 188391
56629 188391 187254 185942 184509 182903 180831 178448 176433 174997 173551 171687 169689 167751 165532 162999
56615 162999 160819 159427 158438 157470 156784 156546 156300 155773 155470 155753 156014 155535 154586 153885 153430 152595 151107 149297
56597A49297j653j072j98N01N66L04M32R22J011M34j56j37L76R27J233J174Q13
56580A54774M46L17L47M09O41J082J398J397J376J536J657J800K509L721M378
56565A77788L932L346L594M197M412M926O804R557J1820J3310J4394J4222J1381
56552B83683O333J348k156m569o219o496n325l943l407l513l724m029m317m033
56538B39633l119k393k387k606k472k196k216k413k460k361k248k013j521q44
56524B08384j42M75R03J198J616K168K389K027J528J280Q79j00j078j201o53k99
56508B19374l17k19O2J80K90Q02J372J207K93o45j310j916k328k171j721j637
56492B11316j864j867j718j829j844j061J02M08m25j411j772j545q34K61R53M06
$$ plain form
56597 149297 147644 146572 146374 146875 147441 147745 148177 149099 150110 150544 150388 150251 150627 151554 152787 153961 154774
56580 154774 155220 155537 155884 156293 156934 158016 159414 160811 162187 163723 165380 167180 169689 173410 177788
56565 177788 181720 185066 188660 192857 197269 202195 208999 218556 230376 243686 258080 272302 283683
56552 283683 290016 291364 289208 284639 278420 271924 266599 262656 259249 255736 252012 247983 243666 239633
56538 239633 236514 234121 231734 229128 226656 224460 222244 219831 217371 215010 212762 210749 209228 208384
56524 208384 208242 208717 209620 210818 212434 214602 216991 219018 220546 221826 222705 222605 221527 220326 219673 219374
56508 219374 219057 218838 218900 219080 219370 220172 221544 222751 223044 222399 221089 219173 216845 214674 212953 211316
56492 211316 209452 207585 205867 204038 202194 201133 201235 201643 201218 199807 198035 196490 195656 195917 196870 197276
56476A97276q17j246m98M27R58J564K386K757K433K038J851J422Q12Q38J617K080
56460B15898J467L11n54r23p88q4P44R00M05P9J46n9o86r67n85j99j55J58J052
56441B16160J843J968J715J292L69p94j022J12J314J194O3p48o36N7Q98J577J715
56424B27077J180L50l43p45p41k51K99K16m65q56l88N32J238J537J522J317J187
56407B32666J254J098L23n16n40M1J49m74r30p19m22n67q36q14o19m53l07k61
56389B28073k71J77J271K005J418M29Q04K260K545P79j171j427m43L24N57P71
56373B38101J017J158J494K208K846L055L062K915K235J216Q09J313J844J737
56359B65010J415J315J164R16J137J714J534L42m35K48J361J342L74k10L7M73
$$ plain form
56476 197276 196459 195213 194715 195142 196100 197664 200050 202807 205240 207278 209129 210551 211363 212201 213818 215898
56460 215898 217365 217676 217122 216199 215411 215327 216071 216971 217376 217455 217601 217542 216856 215889 215304 215105 214950 215108 216160
56441 216160 218003 219971 221686 222978 223347 222553 221531 221643 222957 224151 224214 223466 222830 222887 223785 225362 227077
56424 227077 228257 228607 228264 227519 226778 226527 226826 227042 226577 225721 225333 225865 227103 228640 230162 231479 232666
56407 232666 233920 235018 235341 234825 234285 234326 234475 234001 233071 232352 231930 231363 230527 229713 229094 228641 228334 228073
56389 228073 227802 227979 229250 231255 232673 233102 233906 236166 238711 239490 238319 236892 236449 236773 237330 238101
56373 238101 239118 240276 241770 243978 246824 249879 252941 255856 258091 259307 260116 261429 263273 265010
56359 265010 266425 267740 268904 269820 270957 272671 274205 274547 274112 274360 275721 277063 277437 277227 277264 277737
56343B77737O06M71J61j35K7P51J451J692J798K173K613K802K842K810K483J991
56327C02273J971K615L281L556L904M740N580N621M602K799P94n35o28l9K73L22
56311C41129P64J256P14o82j334n85L56M89M79J207K320L071L462L646L397K885
56295C62574K887L497L855L698L879M653M927M075L122L092L557L711L698L855
56281D15080L899L864M654O581Q481R221R100Q913Q800Q850R538J0733J1453J1459
56267E30626J1774J2833J3697J3986J4921J7303J9993K1805K3394K5855K8813
56256G35000L1474L4371L8472M3526M8815N4572O1385O8954P6621Q4277R1789
56245A369256R8569J04620J10769J16846J21009J21990J20593J17766J12680J04091
$$ plain form
56343 277737 278343 278814 278975 278840 278867 279618 281069 282761 284559 286732 289345 292147 294989 297799 300282 302273
56327 302273 304244 306859 310140 313696 317600 322340 327920 333541 338143 340942 341736 341201 340573 340534 340807 341129
56311 341129 341893 343149 343863 343181 341847 341262 341618 342107 342586 343793 346113 349184 352646 356292 359689 362574
56295 362574 365461 368958 372813 376511 380390 385043 389970 394045 397167 400259 403816 407527 411225 415080
56281 415080 418979 422843 427497 434078 442559 451780 460880 469793 478593 487443 496981 507714 519167 530626
56267 530626 542400 555233 568930 582916 597837 615140 635133 656938 680332 706187 735000
56256 735000 766474 800845 839317 882843 931658 986230 1047615 1116569 1193190 1277467 1369256
56245 1369256 1467825 1572445 1683214 1800060 1921069 2043059 2163652 2281418 2394098 2498189
56235B498189R2194P7667O0274L9995J8316l090k3842m3632o0973p4685q5422
56224B494991r4106j00202j03121j03992j04206j03382j00547r6305r1926q7369
56214A509835q1953p6133p0804o5736o0314n5029n0663m6906m3176l9854l7257
56203H82010l4485l0836k7215k4593k2269j9314j6480j4919j4084j2733j0996
56192F54086r677q573p145n844n118m258k776j691j807k049j305m40o02j017n10
56177F01274J90q6n72Q2J320J850K078L020M037M046L870M866O227O218N195M934
56161F48549N752O694P736R376J0857J1174J1185J2382J4353J5701J6684J8648
56149G89091K1641K4807K8339L2910L8176M3932N1571O2156P4309Q6255R8302
$$ plain form
56235 2498189 2590383 2668050 2728324 2768319 2786635 2783545 2759703 2716071 2655098 2580413 2494991
56224 2494991 2400885 2300683 2197562 2093570 1989364 1885982 1785435 1689130 1597204 1509835
56214 1509835 1427882 1351749 1280945 1215209 1154895 1099866 1049203 1002297 959121 919267 882010
56203 882010 847525 816689 789474 764881 742612 723298 706818 691899 677815 665082 654086
56192 654086 644409 635836 628691 622847 617729 613471 610695 609004 607197 605148 603843 603403 602801 601784 601274
56177 601274 601464 601378 600806 600888 602208 604058 606136 609156 613193 617239 621109 625975 632202 638420 643615 648549
56161 648549 654301 660995 668731 678107 688964 700138 711323 723705 738058 753759 770443 789091
56149 789091 810732 835539 863878 896788 934964 978896 1030467 1092623 1166932 1253187 1351489
56138A351489J10704J20605J24218J20823J11941R8241Q0611O2921M9874M2664
56128B274091L9540L9202M0129L8146K9266J4937P52r747j6711k0466k0961k0867
56116B387311k5080l6053n2214p0909q9702j05061j13585j15138j12070j05343
56106A562156r4471q0895o7843n6618m6198l6539k8997k3422j8169j3112r584
56095A086308p315m653j828o40r04m75J059K037K063K467L456M054M747O833R306
56080A106515R848Q784Q568R542R857R406J0000J1594J2261J2029J2884J4785
56068A236073J5529J4814J4691J5727J6380J6304J6656J7185J6775J6536J8428
56057A415098K1168K1756K0634K0868K2541K2829K1487K1127K1971K1516J9758
$$ plain form
56138 1351489 1462193 1582798 1707016 1827839 1939780 2038021 2118632 2181553 2231427 2274091
56128 2274091 2313631 2352833 2392962 2431108 2460374 2475311 2476063 2466316 2449605 2429139 2408178 2387311
56116 2387311 2362231 2326178 2273964 2203055 2113353 2008292 1894707 1779569 1667499 1562156
56106 1562156 1467685 1386790 1318947 1262329 1216131 1179592 1150595 1127173 1109004 1095892 1086308
56095 1086308 1078993 1074340 1072512 1071872 1070968 1070493 1071552 1073589 1075652 1078119 1081575 1085629 1090376 1097209 1106515
56080 1106515 1116363 1125147 1133715 1143257 1153114 1162520 1172520 1184114 1196375 1208404 1221288 1236073
56068 1236073 1251602 1266416 1281107 1296834 1313214 1329518 1346174 1363359 1380134 1396670 1415098
56057 1415098 1436266 1458022 1478656 1499524 1522065 1544894 1566381 1587508 1609479 1630995 1650753
56046A650753J9612K1507K2675K2445K3135K5056K5808K5228K5937K8119K8929
56035A919204K7929K7925K9634L0767L1121L3221L7083L9793M1113M3970M8574
56024B310334N1742N2836N4531N7005N7432N6124N6885O0336O3171O4855O8422
56013B953673P3774P7203P8650Q2302Q8756R3916R6856J01176J07230J11024J12446
56002C977006J16442J24166J31148J36069J42881J52398J60579J67121J76635
55993E284445J89259J99724K07843K19905K37332K54430K69882K89364L13932
55984G466116L37559L59503L87052M22229M58261M93247N34351N84195O36651
55975A1679164O90759P54716Q31414R15039J006815J118185J253381J406439J581082
$$ plain form
56046 1650753 1670365 1691872 1714547 1736992 1760127 1785183 1810991 1836219 1862156 1890275 1919204
56035 1919204 1947133 1975058 2004692 2035459 2066580 2099801 2136884 2176677 2217790 2261760 2310334
56024 2310334 2362076 2414912 2469443 2526448 2583880 2640004 2696889 2757225 2820396 2885251 2953673
56013 2953673 3027447 3104650 3183300 3265602 3354358 3448274 3545130 3646306 3753536 3864560 3977006
56002 3977006 4093448 4217614 4348762 4484831 4627712 4780110 4940689 5107810 5284445
55993 5284445 5473704 5673428 5881271 6101176 6338508 6592938 6862820 7152184 7466116
55984 7466116 7803675 8163178 8550230 8972459 9430720 9923967 10458318 11042513 11679164
55975 11679164 12369923 13124639 13956053 14871092 15877907 16996092 18249473 19655912 21236994
55966B1236994J794840K057610K367212K733136L181534L728467M373075N126823
55958D6599691O023353P091686Q353217R857896J1687932J3913244J6584904J9782338
55950A39894261K3602044K8055065L2982623L7973425M2099429M3606526M0216179
55943C88429552L0405763J4861155l325775k0135279l2584284l9668750m1974195
55936B96008187m0778392l7416721l3007783k8345017k3894907j9895973j6458982
55929I6210412j3598154j1249938r329100p770490o516248n498978m661874l975359
55921C3610271l417340k955569k563011k231729j957240j724414j520323j345488
55913A5895157j200636j075659r61889q62309p79733p06876o37436n75598n25707
$$ plain form
55966 21236994 23031834 25089444 27456656 30189792 33371326 37099793 41472868 46599691
55958 46599691 52623044 59714730 68067947 77925843 89613775 103527019 120111923 139894261
55950 139894261 163496305 191551370 224533993 262507418 304606847 348213373 388429552
55943 388429552 418835315 433696470 430370695 410235416 377651132 337982382 296008187
55936 296008187 255229795 217813074 184805291 156460274 132565367 112669394 96210412
55929 96210412 82612258 71362320 62033220 54262730 47746482 42247504 37585630 33610271
55921 33610271 30192931 27237362 24674351 22442622 20485382 18760968 17240645 15895157
55913 15895157 14694521 13618862 12656973 11794664 11014931 10308055 9670619 9095021 8569314
55904H569314m82921m42433m07731l81563l58081l31971l06802k86928k69340
55895E301544k50460k33119k19913k06944j90873j75299j63977j54180j42557
55886C564222j31292j22806j14452j03841r3705q6590q0488p4460p2505p6789
55876B607294q2530q4539q3725q2614p9894p4251o8620o5670o3456n9852n6821
55865A805322n6164n5461n2447m9117m7474m5539m1593l8095l7316l7194l5491
55854A309431l4064l4890l5762l4108l1523l0509l0080k8510k7095k7372k7602
55843I67916k5849k3611k2918k2683k1295j9909j9785j9241j6699j4025j3529
55832G48372j4169j3895j3222j3350j3199j1442r204p958p037n846n977q350j0773
$$ plain form
55904 8569314 8086393 7643960 7236229 6854666 6496585 6164614 5857812 5570884 5301544
55895 5301544 5051084 4817965 4598052 4391108 4200235 4024936 3860959 3706779 3564222
55886 3564222 3432930 3310124 3195672 3091831 2998126 2911536 2831048 2756588 2684083 2607294
55876 2607294 2524764 2440225 2356500 2273886 2193992 2119741 2051121 1985451 1921995 1862143 1805322
55865 1805322 1749158 1693697 1641250 1592133 1544659 1499120 1457527 1419432 1382116 1344922 1309431
55854 1309431 1275367 1240477 1204715 1170607 1139084 1108575 1078495 1049985 1022890 995518 967916
55843 967916 942067 918456 895538 872855 851560 831651 811866 792625 775926 761901 748372
55832 748372 734203 720308 707086 693736 680537 669095 659891 651933 644896 639050 633073 624723 613950
55819F13950j1124j0578j1032j1774j1396j0495r863q438n819m267n434p400p685
55806D98645o784o059m713j873P27J302J164K352M065M411L764L462K995J389
55792E04847k32l50J94k24j231j674j998k900l316k180o61l78j098k440n698j1273
55776D69388j6281j7660j6135j4381j2869j0475p530n197k870O98M494O088M834
55763C82104J968j488m837o801o770o050n888n483l869k256k166k801k707k636
55749C30320m051o092o842o619p148q296q415p393o670o589o186n361m860m453
55735B41345l257j715j180j706k048j681j209j063j243j979l227m096m021l709
55721B09211l743l396k240j549k368l469l162j952j350j176l00J014J743K308
$$ plain form
55819 613950 602826 592248 581216 569442 558046 547551 537688 529250 523431 519164 513730 506330 498645
55806 498645 491861 485802 481089 479216 479943 481245 482409 484761 488826 493237 497001 500463 503458 504847
55792 504847 504615 504265 504459 504235 503004 501330 499332 496432 493116 490936 490275 489897 488799 486359 480661 469388
55776 469388 453107 435447 419312 404931 392062 381587 374057 368860 365990 366688 371182 377270 382104
55763 382104 384072 382584 377747 370946 364176 358126 352238 346755 342886 340630 338464 335663 332956 330320
55749 330320 326269 320177 313335 306716 299568 291272 282857 275464 268794 262205 256019 250658 245798 241345
55735 241345 238088 236373 235193 233487 231439 229758 228549 227486 226243 224264 221037 216941 212920 209211
55721 209211 205468 202072 199832 198283 195915 192446 189284 187332 185982 184806 184506 185520 187263 189571
55707A89571L807N712O476N893M808L132L00k885m910n702o173o292n548m710
55693A83479m940n614n174l717k752k615k217j113O2J093K206K882K410J484J507
55678A66981K539L465L820L846L220J516m05j250j186j305j675j609j339j536
55664A75082j707r39J56K53l57k19P57J311J173J312J953K268K114K155K252J513
55648A89077N4r85j231j313j383j153j088j847k670k253j078r54k204l332l535
55633A64105l617m160m719n161n887o415n546l397j601r80o62P8O94O25J90k48
55617A23299q09j362j502j492j987k651k496j667j420k061k480k036j418j219
55603I8699j101q64r77j581k054j992j605j027l31j85j082j998j384L84J243M14
$$ plain form
55707 189571 193378 199090 205566 211459 216267 219399 219699 216814 211904 206202 200029 193737 188189 183479
55693 183479 178539 172925 167751 164034 161282 158667 156450 155337 155399 156492 158698 161580 163990 165474 166981
55678 166981 169520 172985 176805 180651 183871 185387 184982 183732 182546 181241 179566 177957 176618 175082
55664 175082 173375 172436 172592 172845 172488 172269 173026 174337 175510 176822 178775 181043 183157 185312 187564 189077
55648 189077 189131 188146 186915 185602 184219 183066 181978 180131 177461 175208 174130 173176 170972 167640 164105
55633 164105 160488 156328 151609 146448 140561 134146 128600 125203 123602 122622 121960 122038 122732 123357 123547 123299
55617 123299 122490 121128 119626 118134 116147 113496 111000 109333 107913 105852 103372 101336 99918 98699
55603 98699 97598 96734 95757 94176 92122 90130 88525 87498 87167 86982 85900 83902 82518 82902 84145 84559
55587H4559o06m64L13P31Q63J097J187R15O49N26Q3o88r17j23J040J789K141K323
55569I5418K294K164K289K549K417J967J860K113J997J336P75M73k43j518k470
55554A13421k585k494k854l402l624l463k962k093j212q19o75j34N93O26K5j77
55538H8171K39K62n10j103q14k72j03J87J134K222K717K680K374J635N37j77j18
55521I9061Q9j46m88n43o67j245j821j808j406j107q90n90n04r52j645k063k096
55504H1179j922j649j351j077o36R6O70N45J06K67J001J215L72q16j555j858j895
55487G2692j557j105j212j772j756p86J13O7l01K1Q56J225P91J05j78K29J133
55470F8565J786J415K36o36o24l80n87q95o26J02N50K93n44j509j956j406j25
$$ plain form
55587 84559 83953 83489 83802 84533 85396 86493 87680 88595 89244 89770 89853 89165 88248 88125 89165 90954 93095 95418
55569 95418 97712 99876 102165 104714 107131 109098 110958 113071 115068 116404 117179 117652 117409 115891 113421
55554 113421 110836 108342 105488 102086 98462 94999 92037 89944 88732 87913 87238 87104 87697 88323 88348 88171
55538 88171 88410 88672 88162 87059 86245 85973 85870 86057 87191 89413 92130 94810 97184 98819 99356 99179 99061
55521 99061 99150 99004 98516 97973 97306 96061 94240 92432 91026 89919 89029 88439 87935 86983 85338 83275 81179
55504 81179 79257 77608 76257 75180 74544 74640 75310 75855 75961 76228 77229 78444 78816 78000 76445 74587 72692
55487 72692 71135 70030 68818 67046 65290 64504 64617 64684 64383 64404 65260 66485 67276 67381 67203 67432 68565
55470 68565 70351 71766 72002 71366 70742 70362 69775 68880 68254 68356 68906 69199 68655 67146 65190 63784 63659
55453F3659J057J630J667J306O91M13J031K019K156J206J74l22p75j471j767j337
55437G1337r35j143j335p98K5L57L39N42Q66R02Q06R18R43L89n17j080j094q62
55419F9660o07l20M4N68J273J768J507N91k56o74r87j245r37m0N96M37K2j05l18
55400G0977j009j613j426p82m79n14k69L76Q89Q60L75k35n87m97k59l26o06o05
55382F4270l75m63q09o46J25N05r0r20j120q76o61l24K99P67R19J404K426K922
55364F7353K098Q99P44J478J897J659J328R58J49p22p09J49O45O5r44j402j151
55347G4494p33o21p78p15n4Q08R97L75j36N4K81k22r34q63k28j42q53j447j313
55328F7970q54o24o25o89p61o51r6P07J138R54N86N61R25J374J645J625J307P05
$$ plain form
55453 63659 64716 66346 68013 69319 70010 70423 71454 73473 75629 76835 77009 76687 75912 74441 72674 71337
55437 71337 70402 69259 67924 67126 67151 67508 67847 68389 69255 70157 70963 71881 72824 73213 72696 71616 70522 69660
55419 69660 69053 68733 68777 69345 70618 72386 73893 74484 74228 73554 72567 71322 70385 70345 70941 71378 71400 71295 70977
55400 70977 69968 68355 66929 66147 65668 65154 64885 65261 66150 67010 67385 67150 66563 66066 65807 65481 64875 64270
55382 64270 63895 63432 62623 61977 62102 62607 62517 61597 60477 59601 58940 58616 58915 59682 60601 62005 64431 67353
55364 67353 69451 70350 71094 72572 74469 76128 77456 78414 78563 77841 77132 77281 77926 77991 77047 75645 74494
55347 74494 73761 73140 72362 71647 71593 72401 73398 73773 73637 73691 73972 73750 72816 71953 71725 71583 70730 69283 67970
55328 67970 67116 66492 65867 65178 64417 63766 63670 64377 65515 66469 67055 67616 68541 69915 71560 73185 74492 75197
55310G5197j44r85j302q19l9K12j46m13j87K07M86P63Q89L43p11j214p20j42k82
55291G0993n13P2J009J176N45O0J11K75K91K75J47j67j73O21J669J947J348O97
55273H0383M57L67K58K74K56j62p86r86p07n47p32p86m15KO6j04k14k20j84j51
55253G6069k53o35j122j344j198q63l88L86J398K151K027Q53p54j687j362m36
55237G2842n2l67m89PM39K30j27Q2P43J333J730J818J153k54j429j599j186q88
55219G3986n62J04O08M58K09M90O79o2j120j226m70O6K57Q36J574J416M55K4N24
55200G8246Q26K54m21n01m71q56j266j269j111r14k49Q01J273P17j0p6J91K18
55182G5382K51O07P61K39l08m7O11O56J65J87J037J800J676R99N88P12R92R29
$$ plain form
55310 75197 75053 74068 72766 71947 71908 72120 71974 71561 71374 71581 72067 72830 73719 74062 73351 72137 71417 71275 70993
55291 70993 70480 70552 71561 72737 73282 73342 73453 73728 74019 74294 74441 74274 74101 74722 76391 78338 79686 80383
55273 80383 80840 81207 81465 81739 81995 81833 81047 80061 79354 78807 78075 77289 76874 76876 76942 76838 76624 76404 76220 76069
55253 76069 75816 75181 74059 72715 71517 70654 70266 70652 72050 74201 76228 77081 76327 74640 73278 72842
55237 72842 72790 72423 71934 71941 72380 72610 72483 72565 73308 74641 76371 78189 79342 79088 77659 76060 74874 73986
55219 73986 73424 73528 74136 74594 74803 75293 75972 75910 74790 73564 73094 73160 73417 74253 75827 77243 77698 77722 78246
55200 78246 79072 79326 78905 78404 77933 77077 75811 74542 73431 72517 72268 73069 74342 75059 75049 74973 75164 75382
55182 75382 75633 76240 77001 77240 76932 76885 77496 78152 78317 78504 79541 81341 83017 84016 84604 85316 86308 87237
55164H7237K91p68j732j993j386m26P6k04q01j000o64k38M7M88J206J676J437
55147H3246Q56N63M35j24r99j375r80n23o26r38p04J93J129J487J245R32J009
55130H4826J276J073K32n50n83p3L09L29J52k42q65j249r03j13M16N00M10J20
55112H5065n35j092q25J33Q25P40K58j19k58j55O3J2m21n14L89J687K175J702
55094H9130J133Q08L79J1L55J114J109J39o43o46o84j257j438m09J038J634J245
55077I3018N02k92r27q38O5Q28P28L44M77P18K50n59o78o6L46J17l06o02q87j075
55057I1163q00j23M19M97K24j98n19l35M23J104J006L15k33m65p57j150j206q16
55039H8549l78q1L65J079J637J575R59K15k80l91k86l22o50r33p53k41N9j03m15
$$ plain form
55164 87237 87528 86760 85028 83035 81649 81223 81299 81095 80294 79294 78630 78392 78439 78927 80133 81809 83246
55147 83246 84102 84665 85100 84976 83977 82602 81622 81099 80473 79535 78831 79024 80153 81640 82885 83817 84826
55130 84826 86102 87175 87407 86857 86274 86201 86510 86839 86991 86749 85884 84635 83732 83619 84035 84535 84945 85065
55112 85065 84530 83438 82613 82746 83571 84311 84569 84450 84192 84037 84100 84112 83691 83177 83566 85253 87428 89130
55094 89130 90263 91071 91450 91461 91816 92930 94039 94178 93535 92889 92205 90948 89510 89101 90139 91773 93018
55077 93018 93520 93228 92301 91463 91528 92356 93084 93428 93905 94623 94873 94314 93636 93570 93916 94033 93727 93125 92238 91163
55057 91163 90363 90240 90659 91156 91380 91182 90663 90328 90751 91855 92861 93176 92943 92478 91721 90571 89365 88549
55039 88549 88171 88090 88455 89534 91171 92746 93705 93920 93640 93249 92963 92641 91991 91058 90305 90064 90123 90020 89605
55020H9605n26m63l92k36J87P69J056O49k73j066j234q22j07Q49J894K398J746
55003I4034K93p81q11k89N4J68L71O19O87O91Q86J141J085O78K27l6j61l05o51
54984I7900j298j997k127j297J28J310J758J666J558J682J801J497P15l9k37O2
54968A03082L66L97K78J82J53K36L90L38m6l82k33J73K85J33J86M67N66M95O01
54949A07667O48K2r79j247n87j56o23j081n82L73Q26Q13P84M23o41j617j426l80
54931A02237L09M88J080K202K668J744K95m15k28J91M70P71J266J945K826L994
54915A21843N328O397O735O297N593N151M848M061K519N96j270l063m831o319
54901A53885p238p519p106n914m270k865j972j238n68n22j323k158k109j247k50
$$ plain form
55020 89605 89079 88616 88224 87988 88175 88944 90000 90649 90376 89310 88076 87254 87147 87996 89890 92288 94034
55003 94034 94327 93546 92735 92446 92500 92668 93039 93658 94345 95036 95922 97063 98148 98826 99053 99017 98856 98551 97900
54984 97900 96602 94605 92478 91181 91309 92619 94377 96043 97601 99283 101084 102581 103296 103257 103020 103082
54968 103082 103448 103845 104123 104305 104458 104694 105084 105422 105376 104994 104761 104934 105219 105352 105538 106005 106571 107066 107667
54949 107667 108315 108337 107358 106111 105524 105368 104745 103664 103082 103455 104281 105094 105878 106301 105660 104043 102617 102237
54931 102237 102546 103034 104114 106316 108984 110728 111023 110608 110380 110571 111041 111812 113078 115023 117849 121843
54915 121843 127171 133568 140303 146600 152193 157344 162192 166253 168772 169368 168098 165035 160204 153885
54901 153885 146647 139128 132022 126108 121838 118973 117001 115763 115195 114673 113350 111192 109083 107836 107586
54886A07586N24R73R04N05N49J292J788J220L41N05J740K965L780M675N670O111
54870A41128N912N761N808N391M279L072J967K93k145m310n272n421n603n750
54856A45110n325m538m162m311m274l584k625j992j756j616j431j331j359j307
54842A05499r88n69m06n74p65p07m25m9L68O65N61J35p7K46P60R69Q45N54K3o66
54822A05399r78o25k71p41j798k449k317j863j374o04M26J138J173R21J012J658
54806I8707K520K936K335R77J4K05Q08N32n86j221p17J06L40J53J13K61M60Q53
54788A08796J381J430O51l58p80n91k97m1L84Q65R70N29j63o82p16j07R70J967
54770A14208K349K024J338Q30R90J884K938L454L539M091N572P199P802P204O243
$$ plain form
54886 107586 108110 109083 109987 110492 111041 112333 114121 115341 115682 116187 117927 120892 124672 129347 135017 141128
54870 141128 147040 152801 158609 164000 168279 171351 173318 173611 171466 167156 161884 156463 150860 145110
54856 145110 139785 135247 131085 126774 122500 118916 116291 114299 112543 110927 109496 108165 106806 105499
54842 105499 104511 103942 103536 102962 102197 101490 101065 101016 101384 102049 102610 102745 102668 102914 103674 104643 105488 106042 106065 105399
54822 105399 104421 103796 103525 102784 100986 98537 96220 94357 92983 92379 92805 93943 95116 96037 97049 98707
54806 98707 101227 104163 106498 107475 107489 107694 108502 109034 108448 107227 106510 106616 106956 107109 107222 107483 107943 108796
54788 108796 110177 111607 112258 111900 111120 110529 110232 110191 110575 111440 112410 112939 112776 112094 111378 111271 112241 114208
54770 114208 116557 118581 119919 120749 121739 123623 126561 130015 133554 137645 143217 150416 158218 165422 171665
54755A71665N544M713K939J14k869m909n753o079o520o858o397n031l473k526
54741A34560k416k799l022k494j229o0J46m67r51p67l08o8K8J78K52J69L56J227
54723A22335K466L203K904J918J279J954L940O046O936O516N795N332M462K469
54709A77555j45k199l292m015m879n679n968n622m816l789k831k178j837j587
54695A28718j271r75q57r47j107j181j120j043j138j429j675j507p73K60J065
54680A15020J280R87M91k0m61n99k01M65P45L40l18o99p75p96q15q20r17j071
54662A11836j005p31o93r44q22j09K42n35j433p95J204K584K173Q76K6k43l86
54645A11245l04K45Q65R75O25K13j49m84n50j81L17M99K86k26r54j583j614j041
$$ plain form
54755 171665 177209 181922 184861 184975 182106 177197 171444 165365 158845 151987 145590 140559 137086 134560
54741 134560 132144 129345 126323 123829 122600 122540 122686 122219 121268 120501 120193 120125 120153 120331 120583 120752 121108 122335
54723 122335 124801 128004 130908 132826 134105 136059 139999 146045 152981 159497 165292 170624 175086 177555
54709 177555 177410 175211 171919 167904 163025 157346 151378 145756 140940 137151 134320 132142 130305 128718
54695 128718 127447 126472 125615 124668 123561 122380 121260 120217 119079 117650 115975 114468 113695 113955 115020
54680 115020 116300 117287 117778 117758 117297 116698 116497 116962 117707 118047 117729 117030 116255 115459 114644 113824 112907 111836
54662 111836 110831 110100 109407 108463 107641 107532 107774 107239 105806 105011 106215 108799 110972 111848 111874 111631 111245
54645 111245 110941 111186 112051 113026 113651 113864 113715 113231 112681 112500 112817 113316 113602 113376 112422 110839 109225 108184
54627A08184n36n57p37n63j45J58L82P01Q93O74K53O3J64K98L44L05J40q0j48
54608A09793j30m01r23j064n35%j63o68o31Q0P91J077J173J360J528J442J095
54591A13824P16N61O46N91P5n21m26L79R14N32j82l70j47j49l79l18P5L40L41
54572A16502L45L64J46k22l69l19m63q11r13n65q5K29M12N45N57M48L18J77jn2
54552A16243J85N32O72O04N36M64K69J03J97M16M73M92Q45J439J735J537J251
54535A27993J276J581J959K294K378J928R33j68q55r51o93n59r30j680k206k044
54519A30256j342n98r7J54K06K24M73R33J114O14l24j156j647j843j734j355r15
54502A22963m02M48J433J627N90p20j051n35k90n91o09J23J012J403J292Q20j5
$$ plain form
54627 108184 107648 107091 106354 105791 105646 105804 106186 106887 107780 108454 108707 108770 108934 109232 109576 109881 110021 109941 109793
54608 109793 109663 109262 108339 107275 106740 106740 106577 105909 105278 105358 106149 107226 108399 109759 111287 112729 113824
54591 113824 114540 115101 115747 116338 116413 115892 115466 115845 116759 117291 117109 116739 116592 116443 116064 115746 115821 116161 116502
54572 116502 116847 117211 117357 117135 116766 116447 115984 115173 114260 113695 113610 113839 114251 114796 115353 115801 116119 116296 116295 116243
54552 116243 116428 116960 117632 118236 118772 119236 119505 119608 119805 120221 120694 121186 122031 123470 125205 126742 127993
54535 127993 129269 130850 132809 135103 137481 139409 140342 140174 139319 138368 137675 137116 136186 134506 132300 130256
54519 130256 128914 128316 128219 128373 128579 128803 129276 130209 131323 131937 131613 130457 128810 126967 125233 123878 122963
54502 122963 122561 123009 124442 126069 126659 125939 124888 124353 124063 123472 122863 122986 123998 125401 126693 127513 127498
54485A27498q04p74J32R31Q15J50k09o1J51J02q5j04K00O07N99k1o15l12Q87K044
54465A31131K392J906R03k47r31o49K25P07M61J07R2J09p6j19Q7k5o73j026l64
54446A34010O70Q82J85m02k46K04J61n98j525j717p60O21J069J72r83j273r50
54429A29520r60j341j192p6J435K523K749K002N78o71r05k08O27J170J599J929
54413A38779J724Q62l9m00l88n25q75r91m97M77J375J607J049K52l9L21P63P35
54395A44190L09n6j37j02j28r7K33P78J041O63K7m9O29J248R81J10l53pM99M05
54375A50184k94j058j407j132k50R08J781K038J848J586J411J225Q86L18m19j024
54359A56601j102n51L59J407K643L957M741M408L204K035J413R25l3j317k220
$$ plain form
54485 127498 126694 125920 126052 126983 127798 127948 127739 127678 127829 127931 127846 127742 127942 128549 129148 129127 128512 128200 129087 131131
54465 131131 133523 135429 136332 136085 135154 134505 134730 135437 135898 136005 136097 136206 136130 136011 136098 136073 135400 134374 134010
54446 134010 134680 135562 135747 135345 135099 135303 135464 134866 133341 131624 130864 131485 132554 132726 131743 130470 129520
54429 129520 128560 127219 126027 125951 127386 129909 132658 134660 135238 134567 133662 133454 134081 135251 136850 138779
54413 138779 140503 141365 141326 140926 140538 140013 139138 138147 137650 138127 139502 141109 142158 142410 142371 142692 143455 144190
54395 144190 144499 144443 144306 144204 144076 143979 144212 144990 146031 146694 146721 146672 147301 148549 149530 149640 149287 149280 149779 150184
54375 150184 149890 148832 147425 146293 146043 146951 148732 150770 152618 154204 155615 156840 157726 158044 157625 156601
54359 156601 155499 154948 155307 156714 159357 163314 168055 172463 175667 177702 179115 180040 180007 178690 176470
54344A76470k392k215k194k320k225j800j339j150j215j284j221j127j172j346
54330A53470j459j379j219j181j218j057o62m13n95r03p33rO58P25L33N9K06N53
54312A45176O94M86J39p5j37l41q96j558j793j334m56K53L37k19q91r47j61P93
54294A39070J003L88k36k41Q0R5k59m78k15L33P28O95L22l2m2K26M18M10M54O76
54274A43395O96J25p87j340j153m41M10J137J487J254N77qq4K06L54J36j25K7
54256A45866N45Q39M96j29k35M32J242J418Q81J99n9K41P55Q59J29j121j945j758
54238A48655r92n20n51n76k77K8j02n96r85r03l39L89Q64Q51M42r4n07n43k7Q29
54218A45046J384J189N08p1l86o48q40p16l61j16OK24K73m44j707k360j819r94
$$ plain form
54344 176470 174078 171863 169669 167349 165124 163324 161985 160835 159620 158336 157115 155988 154816 153470
54330 153470 152011 150632 149413 148232 147014 145957 145295 144882 144287 143384 142651 142642 143300 144025 144358 144417 144623 145176
54312 145176 145870 146356 146495 146420 146283 145942 145046 143488 141695 140361 139905 140158 140495 140276 139385 138438 138277 139070
54294 139070 140073 140461 140225 139984 140064 140159 139900 139422 139207 139540 140268 140963 141285 141253 141211 141437 141855 142265 142719 143395
54274 143395 144091 144216 143429 142089 140936 140495 140905 142042 143529 144783 145360 145352 145268 145474 145828 145964 145839 145866
54256 145866 146411 147250 147746 147617 147382 147814 149056 150474 151355 151554 151495 151736 152491 153350 153479 152358 150413 148655
54238 148655 147663 147143 146592 146016 145739 145767 145665 145069 144084 143181 142842 143231 144095 144946 145388 145294 144787 144244 144217 145046
54218 145046 146430 147619 148127 148056 147670 147022 146182 145466 145105 144989 144995 145219 145492 145048 143341 140981 139162 138168
54200A38168r84j491j407n92J0q6k26K52J046J416J121M20l44p97o26J3M81M30
54182A36804K20K32K28j10l82O6J058J671J456R09N68L06j84o94p93m84j35P0
54164A40806K03K50J06j08r4K25N59N85K99pK5M74R71R44L21k39j08M31N26n6
54144A46113o30o48m08m16m77j49K87Q5o90j004k72O94P67P3k63K71J001J240
54126A45574J191J294J292O64l12p33l06L00M99N55R80J650J920J493P21J56P7
54109A57015L56O19N23J43r9P7M77P19O38K88k24o62p42n36m44n18k17P11J482
54090A59606J184J43m31q0M60N70N46P43P37M8q93j179n56M56J363K067K658L270
54072A70712M072M969N534N654N927O815P531O587L553l64l643n771o934p163
$$ plain form
54200 138168 137184 135693 134286 133694 133704 133618 133392 133644 134690 136106 137227 137647 137303 136506 135880 135893 136374 136804
54182 136804 137024 137256 137484 137374 136992 137058 138116 139787 141243 142152 142720 143026 142842 142148 141355 140871 140736 140806
54164 140806 141009 141259 141365 141257 141163 141388 141947 142532 142831 142824 142849 143323 144294 145238 145559 145320 145212 145643 146169 146113
54144 146113 145483 144835 144427 144011 143534 143385 143672 143757 143067 142063 141791 142485 143252 143325 143062 143333 144334 145574
54126 145574 146765 148059 149351 150015 149703 148970 148664 148964 149463 150018 150998 152648 154568 156061 156782 156938 157015
54109 157015 157371 157990 158513 158656 158557 158634 159111 159830 160468 160756 160532 159870 159128 158592 158148 157630 157413 158124 159606
54090 159606 160790 160933 160502 160422 160882 161452 161998 162741 163478 163526 162633 161454 160898 161354 162717 164784 167442 170712
54072 170712 174784 179753 185287 190941 196868 203683 211214 217801 221354 220990 217347 211576 204642 197479
54058A97479o412n151m113l486k879k115j499j171p54M4Q66J243J299J502J848
54043A76701J940J770J839K325K830L097L411L899M105L771L433L619L916L692
54029B20348L305L592M410M683L981K941K085J218L88K55R79J628J456R21P10
54014B52900N56r8q73j088j065j719l003l835l573k678j843j350j364j968k650
53999B26349k488j237L56J453J869J741J124K30m84q49j207j866k661l274l607
53984B15449l673l490l256l233l313l078k462j873j495j056m99l71j002j772j717
53969A83159o52O95J456J255L37n35o21M5O03M39k4N7Q10J637K046K008J638J125
53951A95478R20J377K184K607K407K065K018K240K682L544M729N541N472M954
$$ plain form
54058 197479 191067 185916 181803 178317 175438 173323 171824 170653 169899 169943 170809 172052 173351 174853 176701
54043 176701 178641 180411 182250 184575 187405 190502 193913 197812 201917 205688 209121 212740 216656 220348
54029 220348 223653 227245 231655 236338 240319 243260 245345 246563 246951 247206 248185 249813 251269 252190 252900
54014 252900 253456 253358 252485 251397 250332 248613 245610 241775 238202 235524 233681 232331 230967 228999 226349
53999 226349 223861 222624 222980 224433 226302 228043 229167 229397 228913 228064 226857 224991 222330 219056 215449
53984 215449 211776 208286 205030 201797 198484 195406 192944 191071 189576 188520 188021 187650 186648 184876 183159
53969 183159 182507 183202 184658 185913 186250 185715 185094 185139 185742 186181 186157 186214 187024 188661 190707 192715 194353 195478
53951 195478 196398 197775 199959 202566 204973 207038 209056 211296 213978 217522 222251 227792 233264 238218
53937B38218M852N289N586N336M996N177N823O447O997P955R636J1716J3499J4300
53923C45827J3437J0319N013j268o641r722j0237q740o112l373j457o60l96J76
53909C26166J214K142K517K588K829L100K719J363l66j514j768j642j777k287
53895C35284k844l119l016k720k639l137m121n092n730o176o596o762o516o245
53881B70571o365o447n669m149l066l101l459l012j885j178j372j873k034j933
53867B25028j842j630j172q98j372k382l055k917k429k223k252k013j461j109
53853A98273j288j710j976k007j758r54L34J250R15l36j202r37j13L09R2l60o81
53836A87851o98k83L96P74M61j87m49q1N52R61Q79L14l46n26j88j20q74j675j168
$$ plain form
53937 238218 243070 248359 253945 259281 264277 269454 275277 281724 288721 296676 306312 318028 331527 345827
53923 345827 359264 369583 374596 373328 366687 356965 346728 337988 331876 328503 327046 326386 325990 326166
53909 326166 327380 329522 332039 334627 337456 340556 343275 344638 344272 342758 340990 339348 337571 335284
53895 335284 332440 329321 326305 323585 320946 317809 313688 308596 302866 296690 290094 283332 276816 270571
53881 270571 264206 257759 252090 247941 244875 241774 238315 235303 233418 232240 230868 228995 226961 225028
53867 225028 223186 221556 220384 219486 218114 215732 212677 209760 207331 205108 202856 200843 199382 198273
53853 198273 196985 195275 193299 191292 189534 188580 188914 190164 191079 190743 189541 188604 188491 188800 188892 188532 187851
53836 187851 187153 186870 187266 188040 188501 188314 187865 187784 188336 189297 190176 190490 190144 189618 189430 189310 188436 186761 185593
53817A85593O81K291K396J486Q67R63J260J493J949K683L252L359L219L090K940
53802B17522K768K809L141L475L617L824M270M564M274L651L298L206K781J917
53788B65117J277J299J508J317R08P73P34J91q20j600j844j976k343k737l042
53773B58762l596m471m990m631l931l715l736l056j687p99j027j502j217n74o80
53758B19150j523j998j646j354j939k866l046k316j433q51l75J19M05M82O77Q87
53742B02373N12m86j081n03N10O55o3m46M1O04N68M21Q18J419J521J256J261J556
53724B10936J591J296J163J310J251Q15M97O88J152J573K053K614K760K163J447
53709B33309J636K866M120M380L616K586J935J721J673J640J735K076K592L187
$$ plain form
53817 185593 186274 188565 190961 192447 193314 194277 195537 197030 198979 201662 204914 208273 211492 214582 217522
53802 217522 220290 223099 226240 229715 233332 237156 241426 245990 250264 253915 257213 260419 263200 265117
53788 265117 266394 267693 269201 270518 271426 272199 272933 273124 272304 270704 268860 266884 264541 261804 258762
53773 258762 255166 250695 245705 241074 237143 233428 229692 226636 224949 224150 223123 221621 220404 219830 219150
53758 219150 217627 215629 213983 212629 210690 207824 204778 202462 201029 200178 199803 199922 200327 200809 201486 202373
53742 202373 202885 202399 201318 200815 201325 201980 201917 201471 201512 202116 202684 203105 203923 205342 206863 208119 209380 210936
53724 210936 212527 213823 214986 216296 217547 218362 218859 219547 220699 222272 224325 226939 229699 231862 233309
53709 233309 234945 237811 241931 246311 249927 252513 254448 256169 257842 259482 261217 263293 265885 269072
53695B69072L898M699N196M931M061L286K924K467J457L03k99m73r22j620j640
53680B97340n74N95N74o16j764j957j403q26n72n14m27k53j12j85n27r42j163
53663B86674j125r51o94l35j1j0m09q69r52n74p0J01k76r15j213q13p6K59k0k53
53643B77468L39J701K975L394K927K125J525J300J341J497J699J790J451N64l47
53628C01749l93P36K323L388L681L650L691L795L871L960M079M149M235M550N132
53613C52596N725O098O291O464O664O813O809O569O077N404M567L436K008O94
53599D26215N7J87N65N93L7r41j872k052j147J45M42q70k820l845l374k106j015
53582D08199n74p80j410k071k434k554k764l150l406l285k946k578k024j039J27
$$ plain form
53695 269072 272970 277669 282865 287796 291857 295143 298067 300534 301991 302294 301995 301522 300600 298980 297340
53680 297340 296766 297361 297935 297319 295555 293598 292195 291369 290797 290283 289856 289603 289491 289306 288779 287837 286674
53663 286674 285549 284598 283904 283569 283558 283548 283139 282270 281318 280744 280674 280775 280499 279584 278371 277558 277482 277741 277721 277468
53643 277468 277807 279508 282483 285877 288804 290929 292454 293754 295095 296592 298291 300081 301532 302096 301749
53628 301749 301356 302092 304415 307803 311484 315134 318825 322620 326491 330451 334530 338679 342914 347464 352596
53613 352596 358321 364419 370710 377174 383838 390651 397460 404029 410106 415510 420077 423513 425521 426215
53599 426215 426272 426459 427024 427617 427654 426713 424841 422789 421642 421787 422229 421359 418539 414694 411320 409214 408199
53582 408199 407625 406845 405435 403364 400930 398376 395612 392462 389056 385771 382825 380247 378223 377184 377311
53567C77311P79N84L2j02L33P79P30K61k48n52m70K33J476K580K891K635K603
53550C91855L012L263K915K331K058K100K231K519L047L515L624L615L880M323
53536D34288M671N148O080P039P182O650O739Q306J0615J2286J2954J3403J4284
53523E49645J5329J5847J5630J5151J5045J5559J6500J7648J9089K0957K3014
53512G39414K4736K5933K6954K8161K9440L0397L0894L1033L0837L0218K9265
53501A057282K8295K7529K6897K6287K5804K5642K5706K5571K4882K3738K2607
53490A340240K1853K1479K1332K1370K1643K2085K2476K2560K2179K1360K0367
53479A578944J9590J9164J8768J7878J6188J3677J0505P014L741J096j038l202
$$ plain form
53567 377311 378090 378674 378706 378604 378937 379716 380446 380707 380459 379907 379437 379670 381146 383726 386617 389252 391855
53550 391855 394867 398130 401045 403376 405434 407534 409765 412284 415331 418846 422470 426085 429965 434288
53536 434288 438959 444107 450187 457226 464408 471058 477797 486103 496718 509004 521958 535361 549645
53523 549645 564974 580821 596451 611602 626647 642206 658706 676354 695443 716400 739414
53512 739414 764150 790083 817037 845198 874638 905035 935929 966962 997799 1028017 1057282
53501 1057282 1085577 1113106 1140003 1166290 1192094 1217736 1243442 1269013 1293895 1317633 1340240
53490 1340240 1362093 1383572 1404904 1426274 1447917 1470002 1492478 1515038 1537217 1558577 1578944
53479 1578944 1598534 1617698 1636466 1654344 1670532 1684209 1694714 1701728 1705469 1706565 1705527 1702325
53467A702325n872r103j2595j5850j8373j9975k0878k1353k1431k1204k1180k1857
53455A492654k3016k3955k4463k5043k5996k6872k7133k6901k6600k6234k5478
53444A210963k4167k2367k0157j7786j5724j4085j2254r634o659m370l064k082
53432A058614r53mN85J521L546O312Q762J0436J1704J2857J3725J4425J5687J7951
53418A175168K0556K2419K3423K4548K6553K8997L0846L1786L2530L3918L6080
53407A486824L8536M0838M2865M4679M6442M8472N1089N4149N7000N9155O0947
53396B030996O3156O5896O8271O9407O9542O9703P0334P0792P0290O8906O7295
53385B784588O5703O3721O0933N7431N3619M9772M5855M1644L6937L1772K6456
$$ plain form
53467 1702325 1696453 1687350 1674755 1658905 1640532 1620557 1599679 1578326 1556895 1535691 1514511 1492654
53455 1492654 1469638 1445683 1421220 1396177 1370181 1343309 1316176 1289275 1262675 1236441 1210963
53444 1210963 1186796 1164429 1144272 1126486 1110762 1096677 1084423 1074789 1068130 1063760 1060696 1058614
53432 1058614 1057661 1057657 1058242 1059763 1063309 1069621 1078383 1088819 1100523 1113380 1127105 1141530 1157217 1175168
53418 1175168 1195724 1218143 1241566 1266114 1292667 1321664 1352510 1384296 1416826 1450744 1486824
53407 1486824 1525360 1566198 1609063 1653742 1700184 1748656 1799745 1853894 1910894 1970049 2030996
53396 2030996 2094152 2160048 2228319 2297726 2367268 2436971 2507305 2578097 2648387 2717293 2784588
53385 2784588 2850291 2914012 2974945 3032376 3085995 3135767 3181622 3223266 3260203 3291975 3318431
53374C318431K1254J6051J0576M810j031p017j3621k1226k9743l8769m7833n6279
53362C155603o3271o8269p1374p2969p3227p2321p0912o9941o9717o9546o8379
53351B385677o5702o1838n7693n4262n2081n0950n0278m9792m9670m9883m9723
53340A793805m8259m5236m1296l7443l4373l2168l0313k8074k5064k1561j8158
53329A431860j5238j2911j1382j1002j1874j3498j4947j5392j4603j3048j1464
53318A286501j0260r370q669q225p854o832m589j652P69K245L549N431P543R106
53304A257693J0123J1323J3072J4994J6676J8216K0032K2355K5040K7563K9382
53293A466469L0482L1501L3028L4898L6423L7102L6766L5347L2996L0313K7833
$$ plain form
53374 3318431 3339685 3355736 3366312 3371122 3370091 3363074 3349453 3328227 3298484 3259715 3211882 3155603
53362 3155603 3092332 3024063 2952689 2879720 2806493 2734172 2663260 2593319 2523602 2454056 2385677
53351 2385677 2319975 2258137 2200444 2146182 2094101 2043151 1992873 1943081 1893411 1843528 1793805
53340 1793805 1745546 1700310 1659014 1621571 1587198 1555030 1524717 1496643 1471579 1450018 1431860
53329 1431860 1416622 1403711 1392329 1381327 1369453 1355955 1341008 1325616 1311013 1297965 1286501
53318 1286501 1276241 1266871 1258202 1249977 1242123 1235291 1230702 1229050 1229819 1232064 1235613 1241044 1248587 1257693
53304 1257693 1267816 1279139 1292211 1307205 1323881 1342097 1362129 1384484 1409524 1437087 1466469
53293 1466469 1496951 1528452 1561480 1596378 1632801 1669903 1706669 1742016 1775012 1805325 1833158
53282A833158K5447K2828K0187J7847J5231J1260N944O01l840p840j2070j6123
53270A912630j9209k1411k3440k5590k7749k9987l2335l4251l5148l5326l5583
53259A592601l6119l6523l6765l7324l8252l8912l8855l8293l7486l6290l4582
53248A183200l2731l1317l0633l0595l0846l0886l0362k9303k7978k6646k5627
53237H56276k5174k4867k3564k0708j7379j5134j4002j2593j0299q199p478p935
53225F68944q631r185r738j0202j0397j0587j1223j2315j3460j4323j4767j4775
53213E29341j4495j4126j3564j2523j1169j0186r847r573q754p561o565o059o138
53200C98781o923q137q882q553p648p158p353p708p727p341o607n640m693l955
$$ plain form
53282 1833158 1858605 1881433 1901620 1919467 1934698 1945958 1951902 1952503 1948663 1940823 1928753 1912630
53270 1912630 1893421 1872010 1848570 1822980 1795231 1765244 1732909 1698658 1663510 1628184 1592601
53259 1592601 1556482 1519959 1483194 1445870 1407618 1368706 1329851 1291558 1254072 1217782 1183200
53248 1183200 1150469 1119152 1088519 1057924 1027078 996192 965830 936527 908549 881903 856276
53237 856276 831102 806235 782671 761963 744584 729450 715448 702855 692556 684357 676879 668944
53225 668944 660313 651128 641390 631188 620791 610204 598981 586666 573206 558883 544116 529341
53213 529341 514846 500720 487156 474633 463464 453278 443431 433858 425104 417543 410978 404919 398781
53200 398781 391858 383721 374839 366286 358638 351480 344127 336419 328692 321351 314744 309104 304411 300456
53186C00456l320k711k350k332k335k144k112k590l237l480l282k887k199j136
53172B64341l03m21j232j718j383o30OL16J99k42m80j36K63r9j031j563j428j330
53154B53129j624j731j235n77k41p9L7k85j194k028k113j636j126o08Q5O61P19
53137B40154M48L38M67N49M78L74K64J51J50K85L92M67P00R12N72k61n85K30J357
53118B47442J471M59n86q61n27m6L64N42L64k7m03q34j427j864j765j398j280
53101B39624j285q89k76k36q78j278p71J59O83O53L35j99r16j428j400r96n74
53084B30328j54L80Q93J175J241J129O85o3o79q60r06j155j371j159o60k07L90
53067B29007J363K055J399m59j994k091j273p14p05p00m43k69m45q04j001p56
$$ plain form
53186 300456 297136 294425 292075 289743 287408 285264 283152 280562 277325 273845 270563 267676 265477 264341
53172 264341 264038 263617 262385 260667 259284 258654 258660 258976 259175 258933 258453 258317 258580 258481 257450 255887 254459 253129
53154 253129 251505 249774 248539 247962 247721 247642 247679 247394 246200 244172 242059 240423 239297 238689 238774 239435 240154
53137 240154 240602 240940 241407 241956 242434 242808 243072 243223 243373 243658 244050 244517 245217 246129 246701 246440 245855 246085 247442
53118 247442 248913 249372 248786 247925 247398 247352 247716 248258 248622 248595 248192 247358 245931 244067 242302 240904 239624
53101 239624 238339 237450 237174 236938 236060 234782 234011 234170 234853 235506 235841 235642 234726 233298 231898 230902 230328
53084 230328 230174 230554 231447 232622 233863 234992 235677 235614 234935 234075 233169 232014 230643 229484 228824 228617 229007
53067 229007 230370 232425 233824 233365 231371 229280 228007 227293 226588 225888 225445 225176 224731 223927 222926 222170
53051B22170Q1J314K326K596K193J551R03L14QR9J09n44j545j861j154l39l66
53034B27855j028j499j517j383j172o92n2L99O47Q80Q75K08q50j426j176o58k59
53017B19152L59J346J966J596Q38O50Q17L47p36j127r3J398J994J669J373J463
53001B33012J393Q44K70J36K40J56K5K71P37O56l28j473j678p81K80O26L38K4
52983B34748n9m5Q0M56R03J070J143J740K890L665L323K365J849K013K190J972
52967B60303J684J599J398P63j5m04l27o4K32M98M88k4p65j181j176j226j648
52950B60135k136k238k005j858j938j948j651j221j008j077j121q07j92K89J85
52935B41409n58j553k288k404j787o19N68J081O00m10j128j169q92p96q58p04
$$ plain form
53051 222170 222251 223565 225891 228487 230680 232231 233134 233448 233456 233555 233664 233120 231575 229714 228560 228221 227855
53034 227855 226827 225328 223811 222428 221256 220564 220512 220911 221558 222438 223313 223521 222671 221245 220069 219411 219152
53017 219152 219511 220857 222823 224419 225257 225907 226724 227071 226335 225208 225115 226513 228507 230176 231549 233012
53001 233012 234405 235249 235519 235655 235895 236051 236076 236347 237084 237740 237412 235939 234261 233480 233760 234386 234724 234748
52983 234748 234689 234644 234724 235180 236083 237153 238296 240036 242926 246591 249914 252279 254128 256141 258331 260303
52967 260303 261987 263586 264984 265747 265732 265328 265001 264937 265169 265667 266155 266131 265366 264185 263009 261783 260135
52950 260135 257999 255761 253756 251898 249960 248012 246361 245140 244132 243055 241934 241127 240935 241224 241409
52935 241409 240851 239298 237010 234606 232819 232200 232768 233849 234449 234039 232911 231742 230850 230054 229196 228492
52919B28492k15K82M56L30J36K7J08M64J004J302R85J94n28q43r01r17p40j00
52901B29536Q99J685J687Q18m33j340j465j015n37k90j4N85J371J945K079J759
52885B37270J017Q9m92l51J85M12J12k54k71m7J21J98L15N44R32J474J907J847
52867B45008J315Q07O07M44O0k95k93r8KJ27M73P39M54k23o79o50l33J95R67J503
52847B50130R87p20k756m195m775m564l647k438j746j916k303k067j212m13j12
52832B18253k20m80o24m05J74P48J035J204J444J456Q62j20r10j340j667j904
52816B17506j722j044k17M59R02R74N81J65L99J191J653J297P33O79R40R00N30
52799B25926K01j61r32j891k309k033j675j592j335n81M0k98j395k107j675m76
$$ plain form
52919 228492 228277 228559 229015 229345 229481 229508 229616 230080 231084 232386 233371 233565 233037 232194 231293 230376 229636 229536
52901 229536 230435 232120 233807 234625 234192 232852 231387 230372 229835 229545 229531 230116 231487 233432 235511 237270
52885 237270 238287 238376 237884 237533 237718 238130 238242 237988 237717 237670 237791 237989 238304 238848 239780 241254 243161 245008
52867 245008 246323 247130 247737 248181 248241 247946 247653 247555 247557 247684 248157 248896 249350 249127 248448 247798 247465 247660 248627 250130
52847 250130 251117 250397 247641 243446 238671 234107 230460 228022 226276 224360 222057 219990 218778 218365 218253
52832 218253 218033 217553 216929 216524 216698 217446 218481 219685 221129 222585 223447 223327 222417 221077 219410 217506
52816 217506 215784 214740 214523 214982 215884 216858 217439 217604 218003 219194 220847 222144 222877 223556 224496 225396 225926
52799 225926 226127 225966 225034 223143 220834 218801 217126 215534 214199 213618 213658 213360 211965 209858 208183 207707
52783B07707N27P54M15J94O14J409J720J089K10J86J068J642R58m43j243r96m77
52766B15334m94r69j382j595j818j971j646p26K72P46O88O02Q65J362J723J683
52750B12674J171L35l68m04L06J213J730J846J907J959J771J410J326J732K316
52735B30924K692K814K779K544K112J575Q86r8j075j334o18M20R69Q91M41l04
52719B45618j175j652j610j865k996m033l429j375J62oq67q57N5P47O50J60k46
52702B27281m40m47m21p13j391j834j335p3J010J248Q50M70N35R39J213J042P07
52685B28641P67J279J673J597J386J343J143M52l68p55q20j024j280j147p42o92
52669B31453j114j377j008k77K65M21L25J91R8j30p50j462j362LJ786K714K607
$$ plain form
52783 207707 208234 208988 209403 209597 210211 211620 213340 214429 214639 214825 215893 217535 218493 218050 216807 215811 215334
52766 215334 214840 213871 212489 210894 209076 207105 205459 204733 205005 205751 206439 207041 207906 209268 210991 212674
52750 212674 213845 214180 213812 213408 213714 214927 216657 218503 220410 222369 224140 225550 226876 228608 230924
52735 230924 233616 236430 239209 241753 243865 245440 246326 246228 245153 243819 243201 243621 244590 245481 245922 245618
52719 245618 244443 242791 241181 239316 236320 232287 228858 227483 227645 227639 226772 225915 225970 226717 227367 227527 227281
52702 227281 226841 226394 225973 225260 223869 222035 220700 220627 221637 222885 223735 224205 224740 225679 226892 227934 228641
52685 228641 229408 230687 232360 233957 235343 236686 237829 238281 237913 237158 236338 235314 234034 232887 232145 231453
52669 231453 230339 228962 227954 227677 227942 228363 228688 228879 228977 228847 228097 226635 225273 225276 227062 229776 232383
52652B32383K363K610L190L834M357M200K774N71j021j381j288j582k081k287
52638B46642k268k182j744q92k93l85n55o3P53J171J381K081L109L701L887M421
52622B58764N128M579J988j465l840m410l833k955k087j305p95p19j016j476j899
52607B44659k136k044j485n08M66Q83O62L47M30P39Q45P67P97Q07L96k80m98j4
52589B44833N10M42N2QL96O94M78k08j014j372p05R45K523K786J687N33M90J248
52571B54326J521O80n40j046o75k19l33q03j022p87l92r1Q2J7n20j409j951j542
52553B45296m81K24o3r16j395j092m00J36M04N60N73K54l53q85j054q86n70k53
52535B39099m4j6r9p4J39M13O32P75P30L30k25m08o1K89J81o7J01N40O63M40M22
$$ plain form
52652 232383 234746 237356 240546 244380 248737 252937 255711 256282 255261 253880 252592 251010 248929 246642
52638 246642 244374 242192 240448 239556 239263 238878 238323 238260 239013 240184 241565 243646 246755 250456 254343 258764
52622 258764 263892 268471 270459 268994 265154 260744 256911 253956 251869 250564 249769 249050 248034 246558 244659
52607 244659 242523 240479 238994 238486 238952 239835 240497 240844 241274 242013 242858 243625 244422 245229 245625 245345 244847 244833
52589 244833 245343 245785 245837 245845 246241 246935 247413 247205 246191 244819 244114 245059 247582 250368 252055 252588 253078 254326
52571 254326 255847 256527 255987 254941 254266 254047 253714 252911 251889 251102 250710 250619 250701 250718 250198 248789 246838 245296
52553 245296 244815 245039 244976 244060 242665 241573 241173 241309 241713 242273 242846 243100 242747 241862 240808 239922 239352 239099
52535 239099 239055 239039 238940 238866 239005 239418 240050 240825 241555 241885 241660 241252 241191 241480 241661 241594 241695 242235 242898 243338 243760
52514B43760P78J033R47R54J460K239K864L212L232K825K316K431L225L551K353
52499B77180J18j681k375k536k786l033k988k674k191j593j227j550k293k397
52485B47974j265L89J395J424R79M51r7m38k05M95J007R81Q29J067J508J486Q08
52468B58788Q0j2M89R34R20P28Q76J504K410L388M163M220L228J704O64L97P7
52451B84558j055k595l580l725l494l203k784k401k476k905k885j932n99J54L3
52436B51111m50p16o43m56l90m51m55l10k14l33m38j78K79L35j33m86j26O87J238
52417B47871J189P42K88K25Q02J738K263K012J607J880K860M046N409P335R607
52402B89874J1291J1717J0981R278O455K593j509m848o940p763p445o329n014
$$ plain form
52514 243760 244538 245571 246518 247472 248932 251171 254035 257247 260479 263304 265620 268051 271276 274827 277180
52499 277180 277298 275617 273242 270706 267920 264887 261899 259225 257034 255441 254214 252664 250371 247974
52485 247974 246709 247098 248493 249917 250896 251347 251250 250812 250607 251102 252109 253090 253919 254986 256494 257980 258788
52468 258788 258868 258856 259345 260279 261199 261927 262803 264307 266717 270105 274268 278488 281716 283420 284084 284481 284558
52451 284558 283503 280908 277328 273603 270109 266906 264122 261721 259245 256340 253455 251523 250924 251078 251111
52436 251111 250661 249945 249302 248846 248456 248005 247550 247240 247026 246693 246255 246077 246356 246691 246558 246072 245946 246633 247871
52417 247871 249060 249802 250090 250315 251117 252855 255118 257130 258737 260617 263477 267523 272932 280267 289874
52402 289874 301165 312882 323863 333141 339596 342189 340680 335832 328892 321129 313684 307355 302341
52389C02341l941l096k400j971j775j397n90K37N08K61j2m7J37O12J468K362K715
52372B95412K480K255K540L205L806M117M138L922L536L095K665K236J823J444
52358C36674J000L93k45o40p27o79n50k28K36N88Q01J178J827K335K343K111K116
52341C48533K340K419K423K906M023N154N680N799O185P099Q242R402J0704J2198
52327D33107J3541J4384J4836J5317J6086J7093J8193J9297K0285K0983K1307
52316F24429K1358K1285K1036K0344J9058J7515J6456J6363J6901J7188J6715
52305H28648J5753J4845J4162J3510J2746J1895J0973R987R018Q078P012N744
52293I62371M473L300J789o58l951p210r560j0752j0995j0705j0411j0444j0440
$$ plain form
52389 302341 298400 295304 292904 290933 289158 287761 287171 287408 287916 288177 288165 288118 288255 288867 290335 292697 295412
52372 295412 297892 300147 302687 305892 309698 313815 317953 321875 325411 328506 331171 333407 335230 336674
52358 336674 337674 338067 337822 337182 336455 335776 335226 334998 335234 335822 336623 337801 339628 341963 344306 346417 348533
52341 348533 350873 353292 355715 358621 362644 367798 373478 379277 385462 392561 400803 410205 420909 433107
52327 433107 446648 461032 475868 491185 507271 524364 542557 561854 582139 603122 624429
52316 624429 645787 667072 688108 708452 727510 745025 761481 777844 794745 811933 828648
52305 828648 844401 859246 873408 886918 899664 911559 922532 932519 941537 949615 956627 962371
52293 962371 966844 970144 971933 971275 967324 960114 950554 939802 928807 918102 907691 897247 886807
52280H86807r542p416m742k448p33Q00K448M221O163Q261J0119J1151J1321J1394
52266I27804J2286J4173J6276J7438J7052J5504J3713J2282J1284J0759J0894
52255A079465J1570J2097J1880J1021R965Q829P536O292N326M260K442p8k536
52242A168069m622o975j0076j3150j4806j4714j4055j4173j5111j5735j5124j3553
52230A015975j2055j1232j0754r983q784p574o775o380o074n532m633l528k537
52217I20134j898j540j094j36J442L198M406M762M786N249O281P274P672P372
52203I67908O440M998L579K901K953K848K103J398J556K273K714K893L443M275
52189A012282M519L913L286L320L609L320K226P06p89j934k646l314m565o452
$$ plain form
52280 886807 877265 869849 865107 862659 861926 862726 865174 869395 875558 883819 893938 905089 916410 927804
52266 927804 940090 954263 970539 987977 1005029 1020533 1034246 1046528 1057812 1068571 1079465
52255 1079465 1091035 1103132 1115012 1126033 1135998 1144827 1152363 1158655 1163981 1168241 1170683 1170605 1168069
52242 1168069 1163447 1156472 1146396 1133246 1118440 1103726 1089671 1075498 1060387 1044652 1029528 1015975
52230 1015975 1003920 992688 981934 971951 963167 955593 948818 942438 936364 930832 926199 922671 920134
52217 920134 918236 916696 915602 915466 916908 920106 924512 929274 934060 939309 945590 952864 960536 967908
52203 967908 974348 979346 982925 985826 988779 991627 993730 995128 996684 998957 1001671 1004564 1008007 1012282
52189 1012282 1016801 1020714 1024000 1027320 1030929 1034249 1036475 1037181 1036392 1034458 1031812 1028498 1023933 1017481
52175A017481q244r232r470r457r411r094q175o633m918l705l174k701j596q8
52161I31583J023J560K194L311M453N066N171M963M379L431K401J394K38r03j435
52146I68829j225q83p29k60Q20J808K050K012K425K980K904K383K282K729L145
52131I91270L575M763O794Q754J0070J1224J2908J5280J8347K2160K6121K9009
52119A160275L0320L0918L1782L2680L2780L2020L0997K9796K7870K5118K2284
52108A486840K0016J8025J5507J2140Q334M700J553j006k840l832m176m376m789
52095A546096n307n638n874o493p802r568j1283j2633j3693j4784j6171j7749
52083A419101j8984j9242j8242j6202j3593j0805p956m945j802J048L136M620
$$ plain form
52175 1017481 1009237 1000005 990535 981078 971667 962573 954398 947765 942847 939142 935968 933267 931671 931583
52161 931583 932606 934166 936360 939671 944124 949190 954361 959324 963703 967134 969535 970929 971167 970264 968829
52146 968829 967604 966721 965992 965732 966552 968360 970410 972422 974847 977827 980731 983114 985396 988125 991270
52131 991270 994845 999608 1006402 1015156 1025226 1036450 1049358 1064638 1082985 1105145 1131266 1160275
52119 1160275 1190595 1221513 1253295 1285975 1318755 1350775 1381772 1411568 1439438 1464556 1486840
52108 1486840 1506856 1524881 1540388 1552528 1560862 1565562 1567115 1566109 1563269 1559437 1555261 1550885 1546096
52095 1546096 1540789 1535151 1529277 1522784 1514982 1505414 1494131 1481498 1467805 1453021 1436850 1419101
52083 1419101 1400117 1380875 1362633 1346431 1332838 1322033 1314077 1309132 1307330 1308378 1311514 1316134
52071A316134O215Q220J0115J1484J2836J4833J7111J8634J9083J8999J8590J7400
52059A489654J5374J3343J1927J0742R157P283N586M104K643J307J89j125l046
52046A567138n286p302r247j1708j4671j7430j9613k1502k3204k4279k4447k4155
52034A364294k3927k3565k2453k0430j7957j5560j3411j1477r797q518p716p248
$$ plain form
52071 1316134 1322349 1330569 1340684 1352168 1365004 1379837 1396948 1415582 1434665 1453664 1472254 1489654
52059 1489654 1505028 1518371 1530298 1541040 1550197 1557480 1563066 1567170 1569813 1571120 1571309 1570184 1567138
52046 1567138 1561852 1554550 1545303 1533595 1518924 1501494 1481881 1460379 1437175 1412896 1388449 1364294
52034 1364294 1340367 1316802 1294349 1273919 1255962 1240402 1226991 1215514 1205717 1197199 1189483 1182235
$$ [...]
##END NTUPLES=NMR SPECTRUM
##END=
