
##TITLE=AC1413_GUAAH12222_7653369_UeGlL0LtLT
##JCAMPDX= 6.0         $$ Bruker NMR JCAMP-DX V2.0
##DATA TYPE= nD NMR SPECTRUM
##DATA CLASS= NTUPLES
##NUM DIM= 2
##ORIGIN= BRUKER
##OWNER= Administrator
$$ 1.72 TOPSPIN		Version 2.1
$$ 2013-03-19 21:19:32.857 -0500  Administrator@X
$$ Compression mode = diff/dup
##.OBSERVE FREQUENCY= 400.02188249412
##.OBSERVE NUCLEUS= ^1H
##.ACQUISITION MODE= SIMULTANEOUS (DQD)
##.ACQUISITION SCHEME= NOT PHASE SENSITIVE
##.AVERAGES= 4
##.DIGITISER RES= 22
##SPECTROMETER/DATA SYSTEM= spect
##.PULSE SEQUENCE= jresgppsqf.2
##.SOLVENT NAME= COFFEE_meoh
##.SHIFT REFERENCE= INTERNAL, COFFEE_meoh, 1, 14.9609
##AUDIT TRAIL= $$ (NUMBER, WHEN, WHO, WHERE, PROCESS, VERSION, WHAT)
$$ ##TITLE= Audit trail, TOPSPIN		Version 2.1
$$ ##JCAMPDX= 5.01
$$ ##ORIGIN= Bruker BioSpin GmbH
$$ ##OWNER= Administrator
$$ $$ E:\/data/COFFEE/nmr/AC1413_GUAAH12222_7653369_UeGlL0LtLT/13/pdata/1/auditp.txt
$$ ##AUDIT TRAIL=  $$ (NUMBER, WHEN, WHO, WHERE, PROCESS, VERSION, WHAT)
(   1,<2013-03-19 21:19:23.466 -0500>,<Administrator>,<X>,<go>,<TOPSPIN 2.1>,
      <created by zg
	started at 2013-03-19 21:05:00.326 -0500,
	POWCHK enabled, PULCHK disabled,
       configuration hash MD5:
       86 BA 57 50 F2 9D 5C 9B 26 00 A9 28 5F 66 2E 89
       data hash MD5: 8K * 40
       DB CA 50 2C E7 E4 4F 61 8C 41 55 AD C1 B6 FC 2D>)
(   2,<2013-03-19 21:19:27.873 -0500>,<Administrator>,<X>,<proc2d>,<TOPSPIN 2.1>,
      <Start of raw data processing
       xfb same F2: SI = 16K WDW = 3 SSB = 0 FT_mod = 6 PKNL = 1 F1: SI = 512 WDW = 3 SSB = 0 FT_mod = 6 PH_mod = 2
       data hash MD5: 16K * 512
       A8 4D B0 CF F1 0A 65 3F 43 B0 5E 1D 9A C4 A0 65>)
(   3,<2013-03-19 21:19:28.920 -0500>,<Administrator>,<X>,<proc2d>,<TOPSPIN 2.1>,
      <abs2 F2: ABSG = 5 ABSF1 = 10.00079 ABSF2 = 0.0002554449
       data hash MD5: 16K * 512
       B4 BB 06 66 62 B2 22 62 47 04 4F BC 9B F2 9D 59>)
(   4,<2013-03-19 21:19:29.670 -0500>,<Administrator>,<X>,<proc2d>,<TOPSPIN 2.1>,
      <tilt
       data hash MD5: 16K * 512
       63 06 EE 5B CE 5A FB 58 1E 18 40 5D ED 2B FA E7>)
(   5,<2013-03-19 21:19:31.185 -0500>,<Administrator>,<X>,<proc2d>,<TOPSPIN 2.1>,
      <abs1 F1: ABSG = 5 ABSF1 = 0.06497851 ABSF2 = -0.06497862
       data hash MD5: 16K * 512
       67 E0 37 4F E6 02 63 D1 F3 B8 C8 F9 7D 68 A0 2C>)
(   6,<2013-03-19 21:19:32.420 -0500>,<Administrator>,<X>,<proc2d>,<TOPSPIN 2.1>,
      <symj
       data hash MD5: 16K * 512
       A2 05 3E A5 EA 1B A3 47 D3 92 EC FC 3E DA B9 84>)
$$ ##END=
$$ 
$$ $$ hash MD5
$$ $$ 0D 56 C2 ED CA 84 9C 54 06 75 AB 1A 33 27 48 25
##$RELAX= 
##$RELAX= 
##$RELAX= 
##$RELAX= 
##$RELAX= 
##$RELAX= 
##$RELAX= 
$$ Bruker specific parameters
$$ --------------------------
##$DU= <E:\>
##$EXPNO= 13
##$NAME= <AC1413_GUAAH12222_7653369_UeGlL0LtLT>
##$PROCNO= 1
##$TYPE= <nmr>
##$USER= <COFFEE>
##$ACQT0= 1000000
##$AMP= (0..31)
100 100 100 100 100 100 100 100 100 100 100 100 100 100 100 100 100 100
$$ [...]
##$TD0= 1
##$TE= 300
##$TE2= 300
##$TE3= 300
##$TEG= 300
##$TL= (0..7)
0 120 120 120 120 120 120 120
##$TP= (0..7)
150 150 150 150 150 150 150 150
##$TP07= 0
##$TPNAME0= <>
##$TPNAME1= <>
##$TPNAME2= <>
##$TPNAME3= <>
##$TPNAME4= <>
##$TPNAME5= <>
##$TPNAME6= <>
##$TPNAME7= <>
##$TPOAL= (0..7)
0.5 0.5 0.5 0.5 0.5 0.5 0.5 0.5
##$TPOFFS= (0..7)
0 0 0 0 0 0 0 0
##$TUNHIN= 0
##$TUNHOUT= 0
##$TUNXOUT= 0
##$USERA1= <user>
##$USERA2= <user>
##$USERA3= <user>
##$USERA4= <user>
##$USERA5= <user>
##$V9= 5
##$VALIST= <valist>
##$VCLIST= <CCCCCCCCCCCCCCC>
##$VD= 0
##$VDLIST= <DDDDDDDDDDDDDDD>
##$VPLIST= <PPPPPPPPPPPPPPP>
##$VTLIST= <TTTTTTTTTTTTTTT>
##$WBST= 2048
##$WBSW= 25
##$XGAIN= (0..3)
0 0 0 0
##$XL= 0
##$YL= 0
##$YMAX_a= 68839
##$YMIN_a= -122677
##$ZGOPTNS= <>
##$ZL1= 120
##$ZL2= 120
##$ZL3= 120
##$ZL4= 120
##$ABSF1= 0.06497851
##$ABSF2= -0.06497862
##$ABSG= 5
##$ABSL= 0
##$ALPHA= 0
##$AQORDER= 0
##$ASSFAC= 0
##$ASSFACI= 0
##$ASSFACX= 0
##$ASSWID= 0
##$AUNMP= <>
##$AXLEFT= 0
##$AXNAME= <F1>
##$AXNUC= <1H>
##$AXRIGHT= 0
##$AXTYPE= 0
##$AXUNIT= <>
##$AZFE= 0.1
##$AZFW= 0.5
##$BCFW= 0
##$BC_mod= 0
##$BYTORDP= 0
##$COROFFS= 0
##$CY= 15
##$DATMOD= 1
##$DC= 0
##$DFILT= <>
##$DTYPP= 0
##$F1P= 0
##$F2P= 0
##$FCOR= 0.5
##$FTSIZE= 512
##$FT_mod= 6
##$GAMMA= 0
##$GB= 0
##$INTBC= 1
##$INTSCL= 1
##$ISEN= 128
##$LB= 0
##$LEV0= 0
##$LPBIN= 0
##$MAXI= 10000
##$MC2= 0
##$MEAN= 0
##$ME_mod= 0
##$MI= 1
##$NCOEF= 0
##$NC_proc= -4
##$NLEV= 6
##$NOISF1= 0
##$NOISF2= 0
##$NSP= 0
##$NTH_PI= 0
##$NZP= 0
##$OFFSET= 0.06497851
##$PC= 4
##$PHC0= 0
##$PHC1= 0
##$PH_mod= 2
##$PKNL= no
##$PPARMOD= 1
##$PPDIAG= 0
##$PPIPTYP= 0
##$PPMPNUM= 2147483647
##$PPRESOL= 1
##$PSCAL= 1
##$PSIGN= 0
##$PYNMP= <proc.py>
##$REVERSE= no
##$SF= 400.021882494141
##$SI= 512
##$SIGF1= 0.06497851
##$SIGF2= -0.06497862
##$SINO= 16
##$SIOLD= 512
##$SPECTYP= <>
##$SREGLST= <1H.MeOD>
##$SSB= 0
##$STSI= 512
##$STSR= 0
##$SW_p= 51.9856959427865
##$SYMM= 3
##$S_DEV= 1344
##$TDeff= 40
##$TDoff= 0
##$TI= <>
##$TILT= yes
##$TM1= 0
##$TM2= 0
##$TOPLEV= 0
##$USERP1= <user>
##$USERP2= <user>
##$USERP3= <user>
##$USERP4= <user>
##$USERP5= <user>
##$WDW= 3
##$XDIM= 16
##$YMAX_p= 158175544
##$YMIN_p= 0
$$ End of Bruker specific parameters
$$ ---------------------------------
##NTUPLES= nD NMR SPECTRUM
##VAR_NAME=  FREQUENCY1,    FREQUENCY2,      SPECTRUM
##SYMBOL=    F1,            F2,              Y
##.NUCLEUS=  1H,            1H
##VAR_TYPE=  INDEPENDENT,   INDEPENDENT,     DEPENDENT
##VAR_FORM=  AFFN,          AFFN,            ASDF
##VAR_DIM=   512,           16384,           16384
##UNITS=     HZ,            HZ,              ARBITRARY UNITS
##FACTOR=    0.101534562388255, 0.501933850740131, 1
##FIRST=     25.9928259484165, 8223.18227667557, -105
##LAST=      -25.8913354319817, 0,           241
##MIN=       -25.8913354319817, 0,           0
##MAX=       25.9928259484165, 8223.18227667557, 158175544
##PAGE= F1=25.99282594842
##FIRST=     25.9928259484165, 8223.18227667557, -105
##DATA TABLE= (F2++(Y..Y)), PROFILE
$$ [...]
##PAGE= F1=-2.202297678447e-005
##FIRST=     25.9928259484165, 8223.18227667557, -125
##DATA TABLE= (F2++(Y..Y)), PROFILE
15268a497d85A57K85k7A92C6h9m9k0iA18O8l4M3J72M27M21M10J94j49m94n61j03
$$ -1497 -485 157 442 415 192 36 -89 -138 -158 -9 118 186 152 195 367 794 1215 1625 1819 1670 1176 615 512
15245E12j07r7M2L6K5J26j20F0b85m07J16b23B64L20K6j28b34j082r02k52Q9K32
$$ 512 405 308 350 386 411 537 417 60 -285 -692 -576 -223 264 584 610 482 -234 -1316 -2218 -2470 -2381 -2149
15223b149K18K94K64K87J59j41k06J87N19B88P10L03j09j34l58I4d61L7A30L47
$$ -2149 -1931 -1637 -1373 -1086 -927 -1068 -1274 -1087 -568 288 998 1301 1192 1058 700 94 -461 -424 130 477
15203D77N2A88d43o10o71l53K75K28Oj86J47O31c41A62M48J90K6k0L47L36J72
$$ 477 529 188 -443 -1053 -1724 -2077 -1802 -1574 -1568 -1754 -1607 -976 -341 162 610 800 826 806 1153 1489 1661
15182A661k13m05C06gA09P1n7b19m20m11j73K87c72dC42J05J13J8r8A76e70j056
$$ 1661 1448 1043 306 -7 109 180 123 -219 -639 -1050 -1223 -936 -372 -4 342 447 560 578 480 176 -570 -1626
15160a626j8h00a92Hc12l23n39l66l31J97g28C14J049J746J349Q38q9j117k006
$$ -1626 -1644 -800 -192 8 -312 -635 -1174 -1540 -1871 -1674 -728 314 1363 3109 4458 5296 5207 4090 2084
15141B084a74p89F20J121K77p52b77n86A79R06M08p08c14C09J729J444N69j94
$$ 2084 -174 -963 620 1741 2018 1266 -277 -863 179 1085 1493 785 -314 309 2038 3482 4051 3857
15123C857n89p71j74k74OP9oj90j98n72B99e42m86l82q4K1J80L71b50D12L81L09
$$ 3857 3268 2497 2323 2049 2055 2134 2128 1938 1740 1168 299 -542 -1028 -1410 -1494 -1473 -1293 -922 -250 412 793 1102
15101A102L90Qm58B69h93j021K69g47f1C0b83p06q62m40O96g75a0F64K74j4m24
$$ 1102 1492 1500 1042 269 -893 -1914 -1645 -747 -61 30 -283 -989 -1851 -2291 -1595 -775 -10 664 938 924 500
15080E00c35j055o21P08N89J23J21k93k75k66n3K81J65K77L10G4Q4N5K12M09P88
$$ 500 -335 -1390 -2011 -1303 -714 -591 -470 -763 -1038 -1304 -1357 -1076 -911 -634 -324 74 158 213 425 834 1622
15059A622M78p2l70o82Dg08k43R9L45B45Q39O20J11l60n36C06c29k72p9j81L6
$$ 1622 2100 2028 1658 976 4 -708 -951 -852 -507 245 1084 1704 1815 1455 919 306 -329 -601 -680 -861 -825
15038h25J47R4a60B42K75p6j25k0J55K17K98J25m7k19k20k6M5q4E2g97o87g21
$$ -825 -678 -584 -160 242 517 441 316 296 451 668 966 1091 1044 825 605 579 624 540 52 -797 -1484 -721
15015B07Q18M18J22j40k24l23C11b83k82j06k2m8j1P7L5m41n97L12C61J637J218
$$ 207 1025 1443 1565 1425 1201 878 311 -283 -565 -671 -693 -741 -752 -675 -640 -1081 -1678 -1366 361 1998 3216
14994C216N31m04r98A089a43n87L10F9L27Lj58A7a67I5M88L60L3q5K43M90N31
$$ 3216 3747 3343 2345 1089 -143 -730 -420 69 396 399 241 17 -167 95 583 943 976 891 1134 1624 2155
14973B155J48l54I65a29q41k83N0J75M56e1B64Na33n31k63M52D39J071J119R77
$$ 2155 2303 1949 965 -129 -970 -1253 -1203 -1028 -572 -51 264 269 -133 -664 -927 -475 439 1510 2629 3606
14953C606N82J08m37j006A384d48j245j101k85O30M89O58O21B3M81L96M44M53
$$ 3606 4188 4296 3859 2853 1384 -448 -1693 -2794 -3079 -2449 -1960 -1302 -681 23 504 900 1344 1797
14935A797L38L11L56k2o3k32l19l96k85j7J89O8J0n79B99g95o61O46d01J7l58
$$ 1797 2135 2446 2802 2780 2717 2485 2166 1770 1485 1468 1657 1725 1735 1156 299 -795 -1456 -810 -401 -384 -742
14914g42o74M5N97J45K83C1O48N50J04k22k22J9K12J11q4k59k97B50e4a3D22N39
$$ -742 -1416 -1371 -774 -629 -346 31 679 1229 1333 1111 889 908 1120 1231 1147 888 591 250 -54 -13 422 961
14892I61N71M92L19k41l80o51A18g45o21k95N86e03K05N8Q7A12J56K77J17l18
$$ 961 1532 2024 2343 2102 1722 1071 118 -745 -1366 -1661 -1075 -503 -298 -240 -153 112 268 545 662 344
14872C44f7m67l37J88G0Q17N85L74m6k60o98a88r72k50L99M32a72jm68o5nJ29
$$ 344 -67 -534 -871 -683 70 887 1472 1846 1800 1540 842 -188 -1160 -1410 -1011 -579 -172 -173 -641 -706 -711 -582
14850e82a86C83O06O41M72J21j67l79n88C28f11p56L29A57J026O64o4j99m05m01
$$ -582 -186 383 989 1630 2102 2223 2056 1677 1089 328 -611 -1367 -1038 157 1183 1847 1783 1584 1179 778
14830G78k95J27A52b78p45m37K34d66A00J13A9d51j094m98j44M01M22J95J33K72
$$ 778 483 610 152 -278 -1023 -1460 -1226 -466 100 213 19 -451 -1545 -2043 -2187 -1786 -1364 -1169 -1036 -764
14810g64c64A25J86jA27b38j34J09qj9q5j04J4D8N26O61J09l20m90A10a02j49
$$ -764 -364 125 311 310 127 -238 -372 -263 -271 -290 -375 -479 -465 48 574 1235 1344 1024 534 110 -102 -251
14788b51K4A87M84N37M27Q0j37l58m92a73j263l26a86A207J182Q35k82r26I44
$$ -251 -227 187 671 1208 1635 1715 1578 1220 728 -173 -1436 -1762 -186 1207 2389 3224 2942 2016 944
14768b2p45k83K5J79o8J5K29q1j31k7L5J17K62R7a27B83N50N16J39K3O8K07L49
$$ -22 -767 -1050 -1025 -846 -914 -899 -670 -751 -882 -909 -874 -757 -495 -398 -127 283 833 1349 1488 1511 1579 1786 2135
14745B135K50k14j33j11j27j75m95D86a50m78j76J64K09b08f9A16L93M59l6r1
$$ 2135 2385 2171 2038 1927 1800 1625 1130 486 -150 -628 -804 -640 -431 -208 -69 116 509 968 932 841
14725H41C93A74J19L74J85M0k01Kj5J58J25K03K78J80j78o08E6c27j0I4M27O90
$$ 841 393 174 293 667 852 892 691 693 678 836 961 1164 1442 1622 1444 836 56 -327 -337 94 521 1211
14703A211L72J29k18k85m50B97a25k3j8k19m54j68d60C04N64K81J31l0J1j24k55
$$ 1211 1583 1712 1494 1209 759 297 -125 -148 -166 -385 -839 -1007 -460 304 868 1149 1280 1250 1261 1137 882
14682H82C06b64n39J8L52J19j22j69K41f3GJ36L38L82K43J36m60q9q1B06A2J03
$$ 882 306 -264 -803 -785 -433 -314 -436 -605 -364 -63 7 143 481 863 1106 1242 782 693 612 206 12 115
14660A15L74M3j17A43a29k63l56j53K86L04a08n8l63o81j153m76Q75R47a80D45
$$ 115 489 532 415 143 -129 -392 -748 -901 -615 -311 -108 -166 -529 -1210 -2363 -2839 -1964 -1017 -180 445
14639H63J59J18N0m65A72b25E3L57K57J35k33B30a36l30j22P2J66hE28M68N97
$$ 863 1022 1140 1190 725 172 -225 53 410 667 802 569 230 -136 -466 -588 -516 -350 -8 528 996 1593
14618A593M68K81J04k61l05j01J49Q1l5j56m22n56C89j61J55K18J99o5B70d52
$$ 1593 2061 2342 2446 2185 1880 1779 1928 2009 1974 1818 1396 840 389 228 383 601 800 735 270 -452
14597a456p36P12c75C92K80J30p4l23a58k71a29C87J90k23D8c47l35K42A71K75
$$ -1456 -2192 -1480 -375 392 672 802 728 405 -158 -429 -129 387 577 354 48 -347 -682 -440 171 446
14577D46m9I1a87j6FN3a21m32m71m39n79k85N64g84A38P55L18p8m9j02J1k83B07
$$ 446 397 91 -187 -203 6 59 -121 -553 -1024 -1463 -2042 -2327 -1763 -784 138 893 1211 1133 1084 982 993 710 207
14553c48n70o05N8N54M46Q1l49o51l12O78A84Q11L46O2m08D32a53p10l76P0d87
$$ -348 -918 -1523 -1465 -911 -465 -384 -733 -1384 -1696 -1018 184 995 1341 1403 995 432 -153 -863 -1239 -1169 -487
14531a2j66l93m72o69j33m0K04P42gF44J57C58e26q94f65B46O41K51j39l64j90
$$ -12 -178 -571 -1043 -1712 -1845 -1885 -1681 -939 -7 644 801 358 -526 -1420 -665 246 887 1138 999 635 445
14510D45l6r9a42o26K31C45O85M79L64J65k05l58p32f7m22J2b16r5o15m49e70
$$ 445 409 310 -142 -768 -537 345 1030 1509 1873 2038 1833 1475 743 -67 -489 -477 -216 -311 -926 -1375 -570
14488B94N64J34p9K24L95L16k76o11@h43d08F02R48P06j22o66p08l72J38J82J0
$$ 294 858 992 913 1137 1532 1848 1572 961 0 -843 -408 602 1550 2256 2134 1468 760 388 526 708 718
14467G18k98b10o79k90M59b17J03l30q07M29b67A39J04d6m63k73J00K48J98O0
$$ 718 420 -210 -889 -1179 -720 -217 -114 -444 -1251 -822 -267 139 243 -46 -509 -782 -682 -434 -236 -176
14447a76C1L97L76L2j18k10B40b2k60l28l36k69l7K98b87D64P76P32K52k8n92
$$ -176 31 428 804 836 718 508 240 -22 -282 -610 -946 -1215 -1252 -954 -287 464 1240 1972 2224 2196 1604
14426A604E98c23J8C77P05M05K41j25m46D13g84q63N13a06G39L63o5D90i9n68
$$ 1604 598 -323 -305 377 1082 1487 1728 1603 1157 413 -784 -1647 -1134 -106 739 1102 1037 490 -99 -667
14406f67n7O0k89m67o4L75K73k7O1RJ43K86j10l38M1J44b80A31Q5G7d48p96o56
$$ -667 -724 -664 -953 -1420 -1484 -1109 -836 -863 -802 -793 -650 -364 -474 -812 -771 -627 -280 131 216 77 -448 -1244 -1900
14383a900k58o6N3K90M85M41L19J62j26m14a75G81Q10P41P57M07j01n18q64q29
$$ -1900 -2158 -2224 -2171 -1881 -1396 -955 -636 -474 -600 -1014 -175 781 1591 2332 3089 3496 3395 2877 2013 1184
14363A184C02c28m75j64J16M14A78Q64Q23J51k37n63C84g56r48j18h85A48O54
$$ 1184 302 -328 -803 -967 -851 -437 178 1042 1865 2016 1779 1216 384 -756 -1704 -1822 -885 148 802
14344H02o7B90a14m23l90o64n29m1Q50f18a92e9ej08j04m8j19j50j3a45D75N88
$$ 802 735 290 -114 -537 -927 -1591 -2120 -2161 -1311 -618 -192 -59 -5 -113 -217 -265 -384 -534 -547 -145 475 1063
14322A063L52L2q9l20D72d13p91n64j56J83O95c47A22K11A1e69n72oL14c70C46
$$ 1063 1415 1447 1358 1038 472 -413 -1204 -1768 -1924 -1741 -1046 -347 122 333 11 -569 -1141 -1147 -833 -370 346
14300I92M95L65j38l9k47m04m66k30L4D9b51M4A71J26j19b91j92R6hD11K70K5
$$ 992 1487 1852 1714 1675 1428 1024 558 328 362 49 -251 -207 171 297 178 -291 -483 -387 -8 411 681 706
14278G06k90Ac77l95l5L85A48L57N5j62J5M05N58M43O7k98n98B16b75k14l8K39
$$ 706 416 1 -377 -772 -807 -422 148 505 560 398 413 818 1376 1819 1886 1588 990 216 -275 -489 -527 -288
14256b88B62N44N13K15j07n85a7r53n45J11q2l44m97i81F92J286O96L17l05q67
$$ -288 262 806 1319 1534 1427 842 -17 -970 -1515 -1404 -1486 -1830 -2327 -981 692 1978 2674 2991 2686 1819
14236A819p10l45k27L0L90Q24O20M38k5p32H51f45m96b64C55k7a41o76n76l42
$$ 1819 1109 764 537 567 957 1781 2401 2839 2814 2082 851 -645 -1141 -264 355 328 -141 -817 -1393 -1735
14216a735l51j16L4J83K45r7J84P88d2G58O65N03J4n95B20h89n81K09K91J21K87
$$ -1735 -2086 -2202 -2168 -1985 -1740 -1837 -1653 -865 -42 758 1423 1926 1940 1345 220 -889 -1470 -1261 -970 -849 -562
14195e62b26B80L47J6j63N2K22R1n6N7L15N80O78L60k1q45p81B05e72k15L9m50
$$ -562 -226 280 627 643 480 532 754 845 789 846 1161 1741 2419 2779 2758 1913 1132 205 -572 -787 -748 -1198
14173a198k44d74B22J45B6e74p34r63J18i19A70P69L76L99J97K4k76k97l04k67
$$ -1198 -1442 -474 222 367 26 -574 -1308 -2271 -2153 -919 170 939 1315 1714 1911 1935 1659 1362 1058 791
14153G91l54a3m38k79k23j15J39L23K87A29M04M80M30J28M9j53l24E34a27n28
$$ 791 437 -13 -451 -730 -953 -1068 -929 -606 -319 129 533 1013 1443 1571 1620 1467 1143 534 -127 -655
14133f55k88J76c43C68Q70Q99K71J22J31l25n54H21c81n02@A202Q19K53q6J3J82
$$ -655 -943 -767 -343 368 1238 2137 2408 2530 2661 2336 1782 821 -381 -883 0 1202 2021 2274 2188 2201 2383
14112B383K94K22J26k10n91A062e06j476j095q4P88N87M40J55l8k70m21o42J23
$$ 2383 2677 2899 3025 2815 2224 1062 -506 -1982 -3077 -3161 -2373 -1786 -1346 -1191 -1229 -1499 -1920 -2562 -2439
14093b439L16K02K37Q6P0K70N91b23i5k00j73a11D93M33J89k55e9j202b43G88
$$ -2439 -2123 -1921 -1684 -1598 -1528 -1258 -667 -223 -95 -295 -468 -111 493 926 1115 860 -59 -1261 -243 788
14072A374N20p8o59g8j115KL79N0j31j97l25l32r4K21M76L80J75q4n1P6K03J76
$$ 1374 1894 1816 1157 -78 -1193 -1191 -812 -762 -893 -1090 -1415 -1747 -1841 -1620 -1144 -764 -589 -673 -724 -648 -445 -269
14050b69j25m20o90J34d23A07J33E1e18o70n80J45N15M79b79b9j89k45l10k17
$$ -269 -394 -814 -1504 -1370 -423 107 240 51 -518 -1188 -1768 -1623 -1108 -629 -279 -29 -218 -463 -773 -990
14030i90L1L50a19B91J18A03e55r11q79K38R17e05K51j68k21K90C07M42J38l85
$$ -990 -959 -609 -119 291 409 103 -555 -1466 -2345 -2107 -1190 -505 -254 -422 -643 -353 307 749 887 502
14010E02A3g89j35J58J71J12k41o02m47m2K79K58N2K92L29c6E75P56O63K70j12
$$ 502 13 -789 -924 -766 -595 -483 -724 -1326 -1773 -1815 -1536 -1278 -1226 -934 -605 -36 575 1331 1994 2264 2152
13989B152m46F98c96n66d27C27P07L96N5k36o14a30r68l52P16i6B18L7j9j12b17
$$ 2152 1706 698 -396 -962 -427 327 1034 1430 1485 1249 635 -130 -1098 -1450 -734 -96 218 255 236 124 -217
13967g43o69m02L07M08K90J81J13K1o7o1K3j28l13m12R2N72h8E41M44k4l32A74
$$ -743 -1412 -1814 -1507 -1099 -809 -628 -515 -494 -561 -622 -599 -727 -1040 -1452 -1360 -788 -88 541 985 961 629 174
13944a98l71m24o2M44a54P1m42o26q08M4N76O43B4O00K69j77k27k1J1j77kL16
$$ -198 -569 -993 -1055 -611 -154 -83 -525 -1151 -1959 -1915 -1339 -696 24 624 893 716 489 468 479 302 300 616
13922F16N40K75K9R3rj14j29k19l69C39B2M8J49M88J34J7r1oj23k04A57b20m22
$$ 616 1156 1431 1460 1553 1544 1430 1301 1082 713 339 22 70 219 707 841 858 767 761 638 434 157 -220 -642
13899f42k95j76J08K39J51K71A3L98P1p3j32q7K14L75J84j25j05l07I1a65j95
$$ -642 -937 -1113 -1005 -766 -615 -344 13 411 482 409 277 190 404 779 963 838 733 426 91 -165 -360
13878c60j98k00j30k06k6N15a78A13b5m16o17j25L70K93q9o60m49f83C49J000
$$ -360 -558 -758 -888 -1094 -1120 -605 -178 113 -25 -441 -1058 -1183 -813 -520 -609 -1269 -1718 -683 349 1349
13858A349J227R63O36J0n96j262A051c38q82d92G78J044N95L67n6n59r36a82j753
$$ 1349 2576 3539 4175 4185 3589 2327 1051 -338 -1220 -492 778 1822 2417 2784 2728 2169 1233 -182 -1935
13839a935N4Q77b65a11k95p20m59K41N01c8E70K63L1j02k14j17j2j22h5o35n50
$$ -1935 -1881 -1004 -265 -111 -406 -1126 -1585 -1344 -843 -38 570 833 864 762 548 431 419 297 -85 -720 -1270
13818a270k68O6k19n80K55Q33b93F09R01N49q7n63l40l99k64A62g2k70m9J35D5
$$ -1270 -1538 -1472 -1691 -2271 -2016 -1183 -293 609 1510 2059 1972 1409 1069 670 406 162 -72 -342 -391 -256 45
13796B72K81J15k7j7j84j1J35M4K38K95J87Q4j60l32A04a018r86P79G7J090R39
$$ 272 553 668 641 624 440 429 564 608 846 1141 1328 1412 1252 920 104 -1018 -2004 -1225 77 1167 2106
13775B106K38J9l31k55l46n36D21A77P1O2I1c06k46Q2a57B0a29n27p43Re91h6
$$ 2106 2344 2363 2032 1777 1431 895 421 177 248 310 91 -306 -552 -470 -157 20 -129 -656 -1399 -1390 -591 -86
13752B77K26J35J59N8m2j49k58G5i8A92O95Q64P08L09j33l11j067C73d91j64L16
$$ 277 503 638 797 855 813 664 406 75 -98 192 887 1751 2459 2768 2635 2324 1257 373 -491 -655 -339
13731c39D2O10N31M57N32J38k43m81m52n51b11q44j43M1J3J73J44J63J78j24k44
$$ -339 42 652 1183 1640 2172 2310 2067 1586 1134 583 -211 -1055 -1198 -1157 -1144 -971 -827 -664 -486 -610 -854
13710h54k67j30j30L8L47d15A58O60R44Q25L57k06r03G88B16Q00J267J296P97
$$ -854 -1121 -1251 -1381 -1343 -996 -415 158 818 1762 2587 2944 2738 1835 788 216 1016 2283 3579 4376
13691D376j35m05q64j178H96A58e61n95o85K04L97L35d40d9C11N09M54P3l26C90
$$ 4376 4241 3836 2972 1794 896 158 -561 -1156 -1841 -1637 -1240 -905 -440 -49 311 820 1274 1347 1021 390
13670d27q37k17N09L78O2J13J6n0j73k22L45D05R07P71Q0l04r15d76p53b7G51
$$ -427 -1264 -1481 -972 -594 -532 -419 -403 -453 -626 -848 -503 405 1312 2083 2163 1859 944 -476 -1229 -27 751
13648A023j51m05q8M04M45L86J96P2j63n39B86g42n62L05d41a66r1k49m63n33
$$ 1023 872 467 379 783 1228 1614 1810 1882 1719 1180 286 -742 -1304 -999 -441 -166 -257 -506 -969 -1502
13628a502J90e33B77O98L99J29l16E75A37J5L82L57m2C28c74k10b58I5J82J24
$$ -1502 -1312 -533 277 975 1374 1503 1187 575 137 152 534 891 849 328 -374 -584 -258 95 277 401
13608D01R8L8K06L17J88L9mk73m27D5c84n76k64K39J04N2nj31l04J29N46G9N13
$$ 401 499 537 743 1060 1248 1287 1283 1010 583 45 -384 -960 -1224 -985 -881 -829 -834 -965 -1269 -1140 -594 79 592
13585E92M94K81J45K2j89j62j96D73A3d02k53m2K5j2l4L1Q3P7mO0q0N9a92F16
$$ 592 1086 1367 1512 1534 1345 1183 987 473 13 -402 -655 -697 -672 -684 -718 -687 -604 -527 -531 -471 -551 -492 -192 616
13560A362M94Q7j36p20H3f62n73r5R5K75d58B3K28q5a69n77j73d7A182J098Q86
$$ 1362 1856 1943 1807 1087 83 -662 -1235 -1330 -1235 -960 -458 23 251 166 -169 -746 -919 -47 1182 2280 3166
13539C166L36n22j165C95a016m12K86K90L06A78Q01M65K8l89A87g63m75J47j63
$$ 3166 3502 2980 1815 395 -1016 -1428 -1142 -852 -546 178 979 1444 1472 1083 187 -763 -1238 -1091 -1254
13520a254m16J98M49L55j15p29j29e59E34P67L83q7p28d73j395M27d24D25M12
$$ -1254 -1670 -1472 -1023 -668 -783 -1512 -1641 -559 534 1301 1684 1597 869 -473 -1868 -1441 -424 425 837
13501H37j91A68g06r18f92L38k89m85b50D44M15r4B56b26k67J35J77j3l05k93
$$ 837 646 168 -706 -1624 -692 -354 -643 -1128 -250 444 859 765 256 -226 -493 -358 -181 -194 -499 -792
13481g92q1k07n47N0O65c04E0K34j09c81o51n29q4L63f19D37J047R17L10k81m61
$$ -792 -873 -1080 -1627 -1577 -912 -304 50 284 175 -381 -1032 -1561 -1645 -1282 -619 437 1484 2401 2711 2430 1969
13460A969q49A19e23n7K25a13A35J50J34Q3J6NJ99M61O66Q34R63N40K7m24q39
$$ 1969 1120 119 -523 -580 -355 -113 135 285 419 502 518 523 722 1183 1849 2683 3646 4186 4213 3789 2950
13439B950j186C87h56j23b07E2b9l40j58D0R24Q77O94k6n18H53c55j071l87l01
$$ 2950 1764 387 -856 -979 -207 52 -29 -369 -527 40 964 1841 2535 2509 1991 853 -355 -1426 -1813 -2114
13419b114m11J23L86K69K24K77d22B54L27j15b69j079M7B16J272R62M99L19J30
$$ -2114 -2525 -2402 -2016 -1747 -1523 -1246 -422 254 581 466 -269 -1348 -1301 216 1488 2450 2949 3268 3398
13400C398J8m04j018G86d88q84M64L96K12B6M62O07N37L63M4k49o12C09f50p20
$$ 3398 3416 3012 1994 786 -488 -1372 -908 -512 -300 26 488 1095 1632 1995 2039 1790 1178 309 -650 -1370
13380a370q9M99%l05o85QL75M42L24J39m64r23j7R35e37L5m92j047j65e24E21
$$ -1370 -1459 -960 -960 -1265 -1950 -1942 -1567 -1125 -801 -662 -1126 -2049 -2066 -1131 -537 -502 -994 -2041 -2206 -524 521
13358G60B87g00j019K70d03D85L69j0k29B31b17n35m76l94j29K72M44N03g3D87
$$ 760 287 -700 -1719 -1449 -403 485 854 844 615 231 -217 -752 -1228 -1622 -1751 -1479 -1035 -532 -73 487
13337H57L44K12J63O31K57j47r57e02j572j06M27K66K1n30n44P36M59L87J83P8
$$ 857 1201 1413 1576 2207 2464 2317 1360 -502 -2074 -2180 -1753 -1487 -1466 -1996 -2540 -1804 -1345 -958 -775 -697
13317f97pk04l93kN72B54J017J004M98K34r4k09o16n70j62J41L10M09J95n1m40
$$ -697 -704 -908 -1301 -1303 -731 254 1271 2275 2773 3007 2913 2704 2088 1518 1356 1497 1807 2216 2411 2360 1920
13296A920q21A07h07r23l30J16L15O31d81B26K86n9b31j105j014L96M30L64j73
$$ 1920 1099 107 -807 -1730 -2060 -1944 -1629 -998 -481 226 512 453 -231 -1336 -2350 -1954 -1524 -1160 -1333
13277a333j44O13i0C22J01C3e58l56c54F73O15M48J24j53m95n10k38A14g3A04
$$ -1333 -1477 -864 -90 322 423 33 -558 -914 -354 673 1288 1736 1860 1707 1212 702 464 114 -73 104
13256C96K74K19M9K88L52K94J74k81j47k14l38m24d9l76j156n48R99A74J025N12
$$ 396 670 889 938 1226 1578 1872 2046 1765 1618 1404 1066 642 -49 -425 -1581 -2129 -1130 174 1199 1711
13236A711j21l28p7L1M2j42l59B10d31j53b10B59K18J45J00J68J57L6k39B46e40
$$ 1711 1590 1262 1185 1216 1258 1116 757 210 -431 -584 -210 259 477 622 722 890 1047 1083 844 246 -540
13214a129j67J79O2l07m81K20e33E96J246R59L79k12p24A001e11p22d89A94L20
$$ -1129 -1296 -1117 -1055 -1362 -1843 -1623 -533 596 1842 2801 3180 2968 2244 1001 -511 -1233 -489 194 514
13195E14J89K61J27m5k27k42M4K69M59N26N40J49m64q75l14p8K26L57J40r7m00
$$ 514 703 964 1091 1046 819 577 621 890 1349 1875 2415 2564 2100 1225 911 833 1059 1416 1556 1459 1059
13174A059n06a75o40m53j80L02e29B7K93j0A05b4B10L57N5k42a49o08m80J49M24
$$ 1059 553 -175 -815 -1268 -1448 -1146 -529 27 320 310 105 -24 210 567 622 380 -149 -757 -1237 -1088 -664
13153f64b17F16O07P42J75k88o07B66f95k97b47F30L81l20a19m74J94b7B86M53
$$ -664 -217 616 1223 1965 2140 1852 1245 266 -695 -992 -247 630 1011 691 -119 -593 -399 -27 286 739
13133G39P93Q10M95J43l49l57m61m02k49j87J20q1l16C0d23f1A61A1d38n76n48
$$ 739 1532 2342 2837 2980 2631 2274 1813 1411 1162 975 1095 1014 698 30 -423 -61 161 11 -438 -1014 -1562
13112a562n03l29J50K59L84O81A70R14L82j18l51D12c32j64A56P42N85K33rk34
$$ -1562 -2065 -2394 -2244 -1985 -1601 -920 170 1084 1466 1348 997 412 -332 -496 156 898 1483 1716 1707 1473
13092A473l99l54k37oJ95M03L37N0o9k02k37n1j38Q4k3k47I2f10p37k27f80d8
$$ 1473 1074 720 483 477 672 1075 1412 1462 1393 1191 954 903 765 849 826 579 92 -610 -1347 -1574 -680 -48
13069G9b82p22l10O00b32A19E1c09m14l08q4J38L9J57K69a53B08Q9H5a58k94p7
$$ 79 -282 -1004 -1314 -714 -232 119 51 -309 -723 -1031 -1115 -977 -938 -781 -512 -153 208 297 85 -158 -452 -529
13047e29K0O6b09A49K82L38K53p0D75a29q84m85J30e92i5j72l62l04o9O4J1K7
$$ -529 -509 -443 -209 149 431 769 1022 952 475 -129 -1013 -1498 -1368 -592 -95 -267 -629 -933 -1002 -938 -927 -900
13025i00m9m16l13L82d43C7a80n05p86j25K30J36k8K71d03B46K27j27Da95G5M86
$$ -900 -949 -1365 -1678 -1296 -443 37 -180 -685 -1471 -1596 -1366 -1230 -1258 -987 -403 246 473 346 4 -195 75 561
13003E61K50k83a4l24l1a45A13L23K51J15Q5p0j36B78c12o35L38E5N90K28m17
$$ 561 811 528 -14 -338 -369 -145 113 436 687 802 887 817 681 278 -312 -947 -609 55 645 873 456
12982D56c2k93k0L8k66o74n00k77K24O78c24c5C7K6f15r66J13g14b66l78j034
$$ 456 -32 -325 -345 -307 -573 -1247 -1747 -2024 -1800 -1122 -324 -35 37 63 -615 -1581 -1468 -714 -266 -644 -1678
12961a678c57A460J349K00p29I60d30j234j091P61P59K94L2k10l12K65N07D93
$$ -1678 -357 1460 2809 3009 2280 960 -430 -1664 -2755 -1994 -1235 -941 -909 -1119 -1431 -1166 -659 493
12942A491J247J200M35k64r68j106q96D61D0c37j77j43l05l98k94k98Q88F1R76
$$ 1491 2738 3938 4373 4109 3141 2035 1139 461 40 -337 -514 -657 -962 -1360 -1654 -1952 -1064 61 1037
12923A037O28K12l09n68B62a58k09J4k08l62n04j37K26N26b42A41l4a29j53g7
$$ 1037 1665 1877 1568 1000 262 -158 -367 -353 -561 -923 -1427 -1564 -1338 -812 -242 141 107 -129 -282 -77
12902D64K64kj82P2K64N79Q51J118J029J018O76L45l05p82j155j202q87m81k77
$$ 464 728 726 544 616 880 1459 2310 3428 4457 5475 6151 6496 6191 5409 4254 3052 2165 1684 1407
12883A407k51n35g6p88p66m24Q79c98G3J49E8c11m87j76K72b06D64O10M46o8m51
$$ 1407 1156 621 -76 -864 -1630 -2054 -1175 -398 73 222 58 -311 -798 -974 -702 -206 464 1074 1520 1452 1001
12862A001m98A72H1J44J71Q9L60L98K38j35n02a15q61M70D21P51J32k00C64f17
$$ 1001 503 172 81 225 396 485 845 1243 1481 1346 844 -115 -976 -506 421 1172 1304 1104 364 -617
12841a645k39M44M43M22b03G2N1c47n95j48O4K44K99i5C22L51R6l40A48a31m07
$$ -1645 -1884 -1440 -997 -575 -203 72 123 -347 -942 -1090 -1026 -782 -483 -95 322 673 769 429 148 -131 -538
12820e38k59l3o8K0K02j01N0K22A25O59P53L77%m22p01e4k36C88M24k51a47j189
$$ -538 -797 -830 -898 -878 -676 -777 -727 -505 125 784 1537 1914 1914 1492 791 -54 -290 388 812 561 -147 -1336
12798a336j15b74G20L13l57c52j382J7d20D40L37j80A97i5p3H0J19L3K37K74J00
$$ -1336 -1451 -274 720 1033 676 -352 -1734 -1717 -420 440 777 597 197 -95 -168 80 199 232 469 743 843
12777H43j1J31L78N62N99L11k36r43D40h65p01e23a35j05l36m56r0c02D81M73
$$ 843 832 963 1341 1903 2502 2813 2577 1634 440 -865 -1566 -523 -135 -240 -576 -1032 -1122 -302 481 954
12757I54K15o0j42J41K97K87M8j36n38C50c19m34K65C33O89J6C19g74p60P02D86
$$ 954 1169 1109 967 1108 1405 1692 1740 1604 1066 350 -319 -753 -488 333 1022 1038 319 -774 -1534 -832 486
12735A241j16l10B78e23p75o70n01m26J99Q31O60L45R1l65n29J45g25A4M61K17
$$ 1241 1125 815 278 -523 -1298 -1968 -2469 -2895 -2696 -1865 -1205 -860 -769 -1134 -1663 -1518 -725 14 475 692
12715F92j98D1f42m73R3d20A39L60K27J94N5Q3ok3j59k75D8h31j006K90G0J438
$$ 692 494 41 -642 -1115 -1022 -420 139 499 726 920 975 1058 1052 1029 870 595 48 -831 -1837 -1547 70 1508
12693A508J121M65j80o91p40p10k42M98O97L20l6m05l29l97k96k17R3N77M69J40
$$ 1508 2629 3094 2914 2223 1483 773 531 1029 1726 2046 2010 1605 1276 879 583 366 459 1036 1505 1645
12673A645k01n76n5M96P30M93Nn89o47F50A68c50l53L5j52j99d55I52J351J288
$$ 1645 1444 868 813 1309 2039 2532 2537 1948 1301 650 168 -350 -703 -668 -820 -1019 -455 952 2303 3591
12653C591J018K40o97j071A367a09r34l97O71a1E38J16j83k01A19el1I8M83P53
$$ 3591 4609 4849 4152 3081 1367 -109 -1043 -1440 -769 -11 538 654 471 270 119 -5 -36 98 581 1334
12633A334M41J79k73m14F29b76p74L34d3C14k4h7m69n1b15F9N16N74O62O47L70
$$ 1334 1775 1954 1681 1267 629 -276 -1050 -716 -43 314 290 -87 -556 -607 -215 69 585 1159 1821 2468 2838
12612B838j1k34l57l63l4j09H39c37j179K70b62Ei2k93q1e4C49j35A01J09J97
$$ 2838 2827 2593 2236 1873 1839 1730 839 -337 -1516 -1246 -262 5 -92 -385 -466 -54 349 214 101 210 407
12591D07M9A27b17m27n9r5l26n36P7K75O2j72j50L63d53A22J82D3c89k22j04K3
$$ 407 456 127 -217 -644 -703 -798 -1124 -1660 -1583 -1308 -1246 -1418 -1568 -1205 -453 122 304 43 -389 -611 -715 -692
12569f92O7j13k87l24J58M48K49M3o5o81r9L04b42E23M06o1k93B34a02a8j5j48
$$ -692 -625 -738 -1025 -1349 -1191 -743 -494 -451 -516 -1197 -1296 -992 -242 523 929 868 575 234 -102 -18 -33 -181
12547a81k45p7j71q2k60n01M89c04A41L28J71m1j51A85c5I3L17J59J04J05J93
$$ -181 -426 -503 -674 -756 -1016 -1517 -1028 -304 141 469 640 599 448 185 -35 93 410 569 673 778 971
12526I71K2l08Gi22o95rL75M04L13J70a1C44N63K62J64k80D39e40j146K17a94
$$ 971 993 685 7 -922 -1617 -1626 -1251 -847 -534 -364 -11 344 907 1169 1333 1053 439 -540 -1686 -1469 -194
12504F37M56N9K03Q7M6j63l56C90c69j74b42E87Q76R30Q69N60L02j93p08r84r17
$$ 637 1093 1152 1355 1442 1488 1325 969 390 -369 -543 -242 587 1463 2393 3262 3822 4124 3931 3223 2239 1322
12483A322n27l83j36R2J44J0j81j17J02J56L6k00d5m52m72k87M6O1o8q9j38M4
$$ 1322 795 412 276 368 512 522 341 224 326 482 518 318 -45 -497 -969 -1256 -1210 -1149 -1217 -1306 -1444 -1400
12461a400J79N15g1D74L09J01D36a77k94K7K01A16L78M02M3l09k47A31J6N30J184
$$ -1400 -1221 -706 -71 474 783 884 436 -177 -471 -444 -243 116 494 896 939 630 383 131 147 677 1861
12440A861J249P09M10o0n46p49p75J50J026A413M93N0k45o07C25g22k95k1l89
$$ 1861 3110 3819 4229 4169 3623 2874 2099 2249 3275 1413 1906 1956 1711 1104 325 -722 -1017 -1038 -1427
12421a427j0N06A51J377J215Q64Nn22n87p07q02B61a31M3C57K21L3r3k18j5L01
$$ -1427 -1437 -931 151 1528 2743 3607 3612 3090 2503 1796 994 261 -131 -88 357 578 611 518 300 285 586
12400E86M27L43K35k03l54B68f60n91K29c51B35J24A13c50m36l80l50k80J2j31
$$ 586 1013 1356 1591 1388 1034 268 -660 -1251 -1022 -351 235 359 113 -350 -786 -1166 -1516 -1796 -1784 -1915
12380a915K01M97c22E25P93N90K64l55n56C03h25j201p01n80M05O79P50P36G7
$$ -1915 -1714 -1217 -322 525 1318 1908 2172 1817 1261 303 -825 -2026 -2727 -3307 -2902 -2223 -1473 -737 77
12360F15K02r2k02j04R1J10m7B77a81l55Mj06k02k55j06d04D54P07J62k38B29
$$ 615 817 725 523 419 510 620 573 277 -181 -536 -532 -638 -840 -1095 -1201 -404 454 1161 1323 1085 229
12338a067k66a95H78P12K72j7l91o34l61oK85O9POl68F7b49N0I9J33a63l11n18
$$ -1067 -1333 -195 878 1590 1862 1845 1454 820 459 453 738 807 814 820 452 67 -249 -199 99 232 -163 -474 -992
12315i92j61R4O5c97B9K86K32Q4J2k70De56m14j61L45L35q4j94K60A10J022J069
$$ -992 -1153 -1059 -994 -397 29 315 547 631 643 373 4 -556 -970 -1131 -786 -451 -535 -729 -469 110 1132 2201
12293B201J007O87K10M9l93n91m80l97k27n5O9K1j94l92o67e8q02l42J23J35j90
$$ 2201 3208 3895 4105 4154 3761 3170 2690 2293 2066 2011 2080 2101 1907 1515 848 -58 -860 -1202 -1079 -944 -1134
12272a134n85l25k26OK75L09J28J9L93N55h2C03m5b11m34l96q9K42K23j22k40
$$ -1134 -1719 -2044 -2270 -2264 -1989 -1680 -1552 -1533 -1140 -585 -82 303 258 -211 -645 -1041 -1130 -888 -665 -787 -1027
12251a027n6L52P1o8j83l43j95J78M63a84C04M43o6l09e79o48L16b55B47O2A13
$$ -1027 -1083 -731 -660 -728 -911 -1254 -1449 -1271 -808 -184 304 747 681 372 -579 -1227 -911 -255 247 309 113
12229b17r5J33C22K49K9j13A45c30q35m99J64M74L24j16k89L0N10B3M62L28J02
$$ -217 -312 -179 322 571 600 487 145 -330 -1165 -1664 -1500 -1026 -702 -818 -1107 -1077 -567 23 485 813 915
12208I15r8k91A66b17k36l30l38m02p29l10Q46P61b47A30J18P1J15J95J32l7j38
$$ 915 817 526 166 -217 -453 -783 -1121 -1523 -2252 -2562 -1716 -955 -247 130 248 319 434 629 761 724 586
12187E86B38c03r44j020Q45c70F88J132J860J487J279N73P7m60o45j072j195j568
$$ 586 238 -303 -1247 -2267 -1422 -370 688 1820 3680 5167 6446 7019 7096 6636 5991 4919 3724 2156
12169B156I36l96N66Q78O83L12k12p13p56F28a8o78J76B34O71N51L45L49K32K3
$$ 2156 936 540 1106 1984 2667 2979 2767 2054 1298 628 -18 -696 -520 234 905 1456 1801 2150 2382 2405
12149B405k22l7J47K82J82R8j62R3k50n34q44A62h27l50c99C30J34B03b82l63
$$ 2405 2183 2146 2293 2575 2757 2855 2693 2786 2536 2002 1158 162 -827 -1177 -399 330 464 203 -282 -645
12129f45M7i7G0f8j70l42m07o39o81M37f46F34J125J056P31l71j185D11jK343
$$ -645 -598 -97 70 -68 -238 -580 -987 -1626 -2307 -1870 -646 634 1759 2815 3546 3175 1990 411 410 2753
12109B753K312J210o7r57m68R43J484Q22m87j308j648j384p62l51q37a43j402
$$ 2753 5065 6275 6208 5251 4783 5726 7210 8032 7545 6237 4589 3205 2443 2092 1255 -143 -1545
12092a545j87M58o9m78l54l03l8l7j86O40R26M20o3m58k06R1J04k88K05O18a37
$$ -1545 -1732 -1274 -1343 -1821 -2175 -2478 -2516 -2553 -2739 -2099 -1173 -753 -816 -1274 -1480 -1389 -1285 -1573 -1368 -750 -137
12070g4m17k02k52r38J83A307K745N24A509M71J2108J4646J4246J0785M910k247
$$ -74 -491 -693 -945 -1883 -1700 1307 4052 4576 1509 1980 14088 28734 42980 53765 58675 56428
12054E6428q645j2986j4513G367a432I8Q99d80o94I61J049O5j91l61m46n32k03
$$ 56428 47783 34797 20284 7367 -1432 98 997 -480 -1174 961 2010 2075 1884 1523 1077 545 342
12037C42N0K92M17M95L14ql92E02g85q65N5O64a12A27a11o63o80m58L78P61a89
$$ 342 392 684 1101 1596 1910 1902 1510 502 -785 -1650 -1595 -931 -112 127 -111 -774 -1454 -1912 -1534 -773 -189
12015B7b22p66o63L39e66b42j96n85m65J02K04K36J87K36J02L9k57m26m13l39
$$ 27 -222 -988 -1651 -1312 -566 -242 -438 -1023 -1488 -1386 -1182 -946 -759 -523 -421 -382 -639 -1065 -1478 -1817
11995a817l13K10J40N30M40J29j52l37k03a80B001K290J536l57k582a202B676
$$ -1817 -2130 -1920 -1780 -1250 -810 -681 -833 -1170 -1373 -180 2001 4291 5827 5470 2888 -1202 2676
11977I391N903L869J424j372l437m460m288l415A222a62f1I03M76o76g13j643
$$ 9391 15294 19163 20587 19215 15778 11318 7030 3615 1222 -162 -61 903 1379 703 -713 -2356
11961b356i65B22K28c22q22K58e2D05O3c8o59q09o36N15P66h1D77L30J58j9j50
$$ -2356 -965 222 450 -322 -1144 -886 -52 405 468 -38 -697 -1506 -2142 -1627 -861 -81 477 807 965 946 796
11940G96B94c61m35p3O8R5m9j19j01p8p7j9L5e05F4M82L39J7j29l23e2o50r39
$$ 796 294 -361 -796 -869 -801 -706 -755 -874 -975 -1053 -1130 -1149 -1114 -505 64 546 885 902 773 450 -52 -702 -1641
11917a641LP44L62J4l79l67L92C02J163P13L57m33n42n42l51j9j30k22b03m26
$$ -1641 -1638 -894 -532 -518 -897 -1264 -872 302 1465 2178 2535 2102 1560 1018 667 648 518 296 -203 -629
11897f29O9J02k59n36p51j54R78N83R0j8b42C10P61N98M05kn50E27d62j82H5J021
$$ -629 -560 -458 -717 -1253 -2004 -2158 -1180 -597 -507 -525 -242 310 1071 1669 2074 2072 1522 527 -462 -644 85 1106
11875A106J094O23J26o53n86o20n24k31p7j07f1k42l95o21l84K20J56l5K04L30
$$ 1106 2200 2823 2949 2296 1710 1090 566 335 258 151 -61 -303 -698 -1319 -1703 -1483 -1327 -1362 -1158 -828
11855h28L76N3j77j08Q2K03J39k81l89j38o2J91L76e4B84R8o8I6a43j69P4B9f0
$$ -828 -452 -399 -576 -684 -602 -399 -260 -541 -930 -1068 -1130 -939 -563 -54 284 382 314 96 -143 -312 -238 29 -60
11831g76j083q42N43J0j85N22h85b93B6rPa1A63N48N63N75K48K6l84q38c35m52
$$ -776 -1859 -2701 -2158 -2148 -2333 -1811 -885 -293 26 17 24 -11 163 711 1274 1849 2097 2123 1739 901 -335 -787
11809g87L43C5L6b42a6A177J120N08m61j094N64M228P059P800O749N154J744j905
$$ -787 -444 35 71 -242 -16 1177 2297 2805 2344 1250 1814 6042 13101 20901 27650 32804 34548 32643
11791C2643n090p649p619E676A890H01e27rA351J979O78p94A222a317m46C46J437
$$ 32643 27553 19904 12285 5676 1890 801 -527 -536 1351 3330 4008 3214 1222 -1317 -1763 346 1783
11774A783N67l04p53E27G2a43j94m06p55r62P96O41J1o38o25L29O64M07k4k52
$$ 1783 2350 2046 1293 527 72 -143 -337 -743 -1498 -2460 -1664 -1023 -1012 -1650 -2275 -1946 -1282 -875 -899 -1151
11754a151j59J50L37K59O9l75o56l13K23M47P2k74R6N2m9j64j24M8L85j51k93
$$ -1151 -1310 -1160 -823 -564 -495 -870 -1526 -1839 -1616 -1169 -1097 -1371 -1275 -1223 -1272 -1436 -1560 -1512 -1127 -1278 -1571
11733a571J61d16E17M32k20B78h0A96N59N23K72O3k04l62j98k67j01j11a40q56
$$ -1571 -1410 -416 517 949 729 278 -80 196 755 1278 1550 1613 1409 1047 849 582 481 370 -140 -996
11713i96m13L86N06J96Kj6K5B86R24O57J15k80k20m54l10o4j08j02d29j550lb23
$$ -996 -1409 -1023 -517 -321 -319 -335 -310 286 1210 1867 1982 1702 1482 1028 718 654 546 444 -429 -1979 -1982 -223
11690I85Q36K08k11m45m1J36O6j3n46D20A36K14L87K31%m35a81p90p37m67L96
$$ 985 1821 2029 1818 1373 1332 1468 1534 1521 975 420 136 350 737 968 968 533 -181 -971 -1708 -2175 -1779
11669a779N63L12j66m77n86p07K28J074P30L99J02m94p19p17K55N43J54m25k16
$$ -1779 -1216 -904 -1070 -1547 -2133 -2840 -2612 -1538 -808 -409 -307 -801 -1520 -2237 -1982 -1439 -1285 -1710 -1926
11650a926R22a39H97O57N16N7k12k51n00E38g5m00N3K00O3B0J0b80k40p3k16l21
$$ -1926 -1004 -139 897 1554 2070 2127 1915 1664 1164 538 -75 -475 -422 -222 -159 20 30 -280 -520 -593 -809 -1130
11628a130n67M73e83a18B43b0n59r26r69P98f37a27n0l58Ki1E25L72K31J68J87
$$ -1130 -1697 -1224 -583 -118 243 -20 -579 -1505 -2474 -1676 -637 -127 -177 -535 -533 -91 525 897 1128 1296 1483
11607A483q6l01m54A40d9B67O27L23M5l16l05A86b05m49n8J11m6k1j8jo1K5j11
$$ 1483 1397 1096 642 140 -49 267 894 1217 1262 946 641 186 -205 -654 -712 -601 -647 -668 -686 -687 -748 -723 -834
11584h34l21j169n6N71O48d73HK23g2n72p57n76m46m08j21J003h12f6B24n9d72
$$ -834 -1155 -2324 -2380 -1809 -1161 -473 8 231 -72 -644 -1401 -1977 -2423 -2831 -2952 -1949 -812 -66 224 165 -472
11562g56J9j01kj950K44o05M46j06J127P81A15a58A33c93a19d3kB98K7c91p22
$$ -756 -737 -838 -840 -2790 -2546 -3151 -2705 -2811 -1684 -903 115 -158 133 -393 -119 -43 -45 298 325 -391 -1113
11541a113J29B9J107P03J61k49n43n34l9O00M07J7l56C42i31n28j09f77A910K765
$$ -1113 -984 29 1136 1839 2000 1751 1208 674 635 1235 1642 1659 1303 342 -931 -1459 -1568 -677 1910 4675
11521D675K122L80j158k422I48P80K850J927o7j519j564j310A018k53Q9K55j58
$$ 4675 6797 7177 6019 3597 948 1728 4578 6505 6438 4919 3355 2045 1018 765 854 1109 951
11504I51B57h13k66M72E4K64k9f3m02j89j89n1j28j98K13b46F67M86l9k83r3K15
$$ 951 257 -813 -1079 -607 54 318 289 -63 -465 -654 -843 -894 -1022 -1220 -1007 -246 667 1153 1114 831 738 953
11482I53L73M14km07n39C21j13H2a74l37k54j57l51R2e67H5M94J77l6l58a28p76
$$ 953 1326 1740 1738 1331 792 321 208 82 -174 -511 -765 -922 -1273 -1181 -567 85 579 756 720 362 -128 -904
11460i04o23m30N33P01M4n02o65P13A95J129N45J31m64F32d18j175r87K28L85
$$ -904 -1527 -1957 -1424 -723 -679 -1181 -1846 -1133 195 1324 1869 2000 1536 632 -418 -1593 -2580 -2352 -1967
11441a967L29J83P0M60c61A76L67j67i6j61a22A90L14N7k09j03p3Ga98m96o16
$$ -1967 -1638 -1455 -1385 -925 -361 176 543 376 -96 -257 -122 190 504 561 352 249 176 7 -198 -694 -1310
11420a310n45J26N21N93b01IJ15b4j97k43m88l8d02C20M23O4l39c7j32k65q7n8
$$ -1310 -1855 -1729 -1208 -615 -201 9 124 -24 -221 -464 -952 -990 -402 320 743 807 468 -37 -169 -434 -521 -579
11398e79k0j43m78m13N02b83F29N95Q0l97A52h43j089m18o0J78P88P08b00g1m06
$$ -579 -599 -742 -1220 -1633 -1131 -283 629 1224 1304 907 152 -843 -1932 -2350 -2410 -2232 -1444 -736 -200 -71 -477
11377d77o66r38L46c32D58K53m3k01f9p85p13j7J31K17J18K22K33J19n1r7j95
$$ -477 -1143 -2081 -1735 -332 458 711 668 467 -69 -854 -1567 -1584 -1453 -1236 -1118 -896 -663 -544 -595 -692 -887
11356h87k23JK47L52a97b5E34Q01O50J10l65q46D01L21N78J36n74l61J171K251
$$ -887 -1110 -1109 -862 -510 -197 -25 534 1335 1985 2095 1730 884 401 722 1300 1436 862 501 1672 3923
11336C923K524J797Q24l30j142j962k145A687E20b47k49a24D67M35K83J24k78
$$ 3923 6447 8244 9068 8738 7596 5634 3489 1687 520 -247 -496 -124 467 902 1185 1309 1031
11319A031k23l96A72a52m72l84j99J83c56D25N99j2l69b89r79r65q06R43I6K027
$$ 1031 808 412 172 -152 -624 -1008 -1207 -1024 -356 425 1024 1012 643 -289 -1268 -2233 -3039 -2096 96 2123
11299B123J726Q23j8n68j189r27p50C32e92n19k54N6J83K78c61P9I9j2h3l17o16
$$ 2123 3849 4672 4654 4086 2897 1970 1220 332 -592 -1111 -1365 -1309 -1126 -848 -361 -282 99 87 -83 -400 -1016
11278a016j43M76A10N62L42J04l18A12g98o91m14J11N96c15B42p8i96j416j454
$$ -1016 -1159 -683 110 672 1014 1118 800 112 -798 -1489 -1903 -1792 -1196 -315 242 164 -996 -2412 -3866
11259c866J635P43M33J17R6J22J63M3m17o21q17n76Q56i40a15B05a24l78k03O2
$$ -3866 -2231 -1488 -1055 -938 -842 -720 -557 -514 -931 -1552 -2369 -2945 -2089 -940 -115 205 -124 -502 -705 -643
11239f43b45C56P50O88N21R3n94p80C38K39K88O53J57m16E24d65j110r57j05N94
$$ -643 -245 356 1106 1794 2315 2408 1814 1034 338 577 865 1518 1675 1259 524 -465 -1575 -2532 -2637 -2043
11219b043P67N97c14A83O59O58J15p06B01k3P63R80M42j28p00L07P34P97K38j17
$$ -2043 -1276 -679 -314 183 842 1500 1615 909 201 178 941 1921 2363 2235 1535 1842 2576 3373 3611 3494
11199C494n25o71H94e75J01E59L98L98J473J484j92A880f52A439J348A390E21
$$ 3494 2969 2298 894 -575 -474 559 957 1355 2828 4312 4120 1880 -652 1439 2787 1390 521
11181C917J840j826p9O062M074j360L27J1845J0453o99J1404O5266J01877J16266
$$ 3917 5757 3931 3852 9914 13988 12628 12955 24800 35253 34554 45958 111224 213101 329367
11167C29367J06515P2656K1755l4712q3016j11936j16547H7416C5994J393j384
$$ 329367 435882 508538 530293 495581 412565 300629 184082 87416 35994 37387 36003
11156C6003j3731j0953K757J112n524A613J153L797r77k625R02K273N44j208j767
$$ 36003 22272 11319 14076 15188 9664 1613 2766 6563 5586 2961 3863 6136 6680 5472 3705
11141C705j327P96J820J344k92k015A057a243K68J42K27G15J077L55m22p72C35
$$ 3705 2378 3174 4994 6338 6046 4031 1057 -1243 -975 -833 -606 715 1792 2147 1725 953 335
11123a24j06B7L18K38L32M63K53l62n11a04q44m61l05n99l40J82N94g60C43K68
$$ -124 -230 27 345 583 915 1378 1631 1269 758 -104 -948 -1409 -1714 -2313 -2653 -2471 -1877 -760 343 611
11103F11j84em79k47j55k69N8M36c0D44P5A61g15j036q99J216L84q0m96m79Q24
$$ 611 427 -5 -484 -731 -886 -1155 -1097 -661 -30 444 519 161 -715 -1751 -2650 -1434 -1050 -1130 -1626 -2105 -1281
11082a281e46D55J033J210J271N54k95q18j269A014i9n05K06J00k03n81o75o79
$$ -1281 -546 455 1488 2698 3969 4523 4228 3410 2141 1014 -99 -604 -398 -298 -501 -1082 -1757 -2436
11064b436M3M73O41c77E74P44J59k75n34A1e88m56j29L01c69B3L05K90J91l5k28
$$ -2436 -2393 -1920 -1279 -377 574 1318 1477 1202 668 11 -588 -1044 -1173 -872 -369 23 328 618 809 774 546
11043E46A89b58o69m09O65A77M62K9c5j295j252M94Q14M02N9k01K58G8J289J108
$$ 546 189 -258 -927 -1336 -671 177 639 668 -35 -1330 -2582 -2088 -1274 -872 -813 -1014 -756 78 1367 2475
11023B475Q22k0n41j011m83j88K17L34j97o69a9r29p09m83L30N3J28N82b62B44
$$ 2475 3297 3277 2736 1725 1242 1054 1271 1605 1408 739 -19 -948 -1657 -2140 -1810 -1757 -1629 -1047 -262 244
11002C92l6j55C6a36k71m54l79m53L74L52Ql22m30m94m14K43J139C87K055K225
$$ 392 356 201 36 -136 -407 -861 -1240 -1693 -1319 -967 -959 -1281 -1711 -2205 -2619 -2376 -1237 387 2442 4667
10982D667J964J468O38j83p99j376j768j483j291H58Fc24k24m1R8a38B59M84J78
$$ 4667 6631 8099 8737 8554 7755 6379 4611 3128 1837 858 6 -324 -548 -589 -491 -138 259 743 921
10963I21l95c48j465j581J102h76H1Q61M94J62L31o8n20E10d93p66k57j62k51
$$ 921 526 -348 -1813 -3394 -2292 -876 81 942 1436 1598 1929 1861 1341 510 -493 -1259 -1516 -1678 -1929
10944a929k12Q90A8O79K9B26f42l7a29E83L54M40J60k13m24J51O75Q99P24K07
$$ -1929 -2141 -1251 18 697 726 226 -642 -679 -129 583 937 1377 1537 1324 900 1051 1726 2625 3349 3556
10924C556l43p75j012E67A55f20m85K00b6A194Q57J14m20H21e7n59M0i3E00M12
$$ 3556 3213 2438 1426 567 155 -620 -1105 -905 -26 1194 2051 2165 1745 821 -57 -616 -576 -93 500 912
10904I12j94d25j610A66L015K286O11q67k508e68j862i2A287j65a36j127j252
$$ 912 718 -425 -2035 166 3181 5467 6078 5211 2703 -568 -2430 -92 1287 1122 -136 -1263 -2515
10887b515L4N38i33d41A1R87J673K53L10n43p87q33D89B28P2P26R49M99k09p19
$$ -2515 -2481 -1943 -933 -441 11 998 2671 2924 3234 2691 1904 1071 489 228 300 1026 1975 2474 2265 1546
10867A546C43g13j74L66k4k95k80l44l24j71O52a58E96j38c60j072m03P2j20l4
$$ 1546 343 -713 -887 -521 -545 -840 -1120 -1464 -1788 -1959 -1307 -158 596 458 -360 -1432 -1835 -1763 -1883 -1917
10847a917P68e6G63K01l98a37j83F73M68J56k30a7j730m90J090M25o17L13A782
$$ -1917 -1149 -56 763 964 566 -137 -320 673 1141 1297 1067 -17 -1747 -2237 -1147 -722 -1339 -1026 1782
10827D530K000J356m09k042k602I17a56C59J21A3f62b1A136P15m43B04a036d62
$$ 4530 6530 7886 7477 5435 2833 917 -156 359 480 13 -662 -21 1136 1851 1408 204 -1036 -462
10808E05M39q8l68E7c35m23l43K43b83A70M93M26J96j23m44A66d08l85q31p8a89
$$ 505 944 856 488 57 -335 -758 -1101 -858 -283 170 663 1089 1285 1162 718 166 -408 -793 -1624 -1702 -189
10786A040P93Ol74m73I4g92q08L83e31f6j29o65j412P65D15J474P38o23E88i23
$$ 1040 1833 1839 1465 992 94 -792 -1600 -1217 -531 -66 -195 -860 -2272 -1507 415 1889 2627 2004 588 -923
10765c03A603J613R94J17j020A193a364k14B70J482j50D08a605J7E73J510j16
$$ -303 1603 3216 4210 4327 3307 1193 -1364 -1578 270 1752 1602 408 -1605 -1588 573 2083 1967
10748A967E76I3J908J795p12b83r56D468M520K597P47m18j867k277N75M738M496
$$ 1967 576 93 2001 3796 3084 -283 -1239 4468 8988 11585 12332 11914 10047 7770 8345 13083 17579
10731A7579L797M074P068Q750Q027J0847K4435M4279N8228O3531N9761M9274L3237
$$ 17579 21376 25450 32518 41268 49295 60142 84577 128856 187084 250615 310376 359650 392887
10718C92887J3181j0020l3582n4313o8138o9032n7595l4473j3936q602j2315j3777
$$ 392887 406068 396048 362466 308153 240015 170983 113388 78915 64979 56377 44062 30285
10706C0285j0075n908k264q93R82K52r99j178k75k51j728l463G53P50K167J201
$$ 30285 20210 14302 12038 11145 12127 12379 11380 10202 9927 9676 7948 4485 753 1503 3670 4871
10690D871J17o39j481H92a087j852e26A507J235k00A154a061o55g50l18q79G42
$$ 4871 4988 4349 2868 892 -1087 -2939 -526 1507 2742 2542 1154 -1061 -1716 -750 -1068 -1947 742
10672C232R78q01A082a567b0A394j40B83e54o67N06K43l11q25J44b06A204R36
$$ 3232 4210 3409 1082 -1567 -20 1394 1254 283 -554 -1221 -715 -472 -783 -1608 -1464 -206 1204 2140
10654B140M00l13m56H53F8e17k66p04m31P26b21A70f3o14n28L63J20j15k88j31
$$ 2140 2540 2227 1771 853 68 -517 -783 -1487 -1918 -1192 -221 170 -63 -677 -1205 -842 -722 -837 -1125 -1256
10634a256q0n2k90Q7g46G3L23I9d91o17J19M31a38k1k40k53k37l13m76n0h34C2
$$ -1256 -1336 -1388 -1678 -1591 -746 73 396 99 -491 -1108 -989 -558 -138 -159 -399 -652 -889 -1202 -1678 -1728 -834 32
10611G60M07J95k84D78d30p31K86c21B56K62J70L26M20J10l5m19l06B94a83o71
$$ 760 1167 1362 1078 478 -430 -1161 -875 -321 256 518 688 1014 1434 1544 1509 1090 784 294 -183 -854
10591h54m49k87M27a97G43O40Rl94c3j180r07j07N88f14F86J065R89P42L15k84
$$ -854 -1303 -1590 -1163 -197 743 1383 1392 998 -33 -1213 -2120 -2227 -1639 -614 686 1751 2740 3482 3797 3513
10571C513o20q82q76a09j352n41h34d05a79h9n76p77o24M98g45c58q2k41J08J31
$$ 3513 2893 2011 1135 -109 -1461 -2002 -834 -405 -179 -89 -665 -1442 -2066 -1568 -745 -358 -440 -681 -573 -442
10551d42J68j66m20o04l25K14f87b76dm0k45J4n51l56j45j05j27J39k50m17J49
$$ -442 -274 -440 -860 -1464 -1789 -1575 -687 -276 -4 -44 -289 -275 -826 -1182 -1327 -1432 -1559 -1420 -1670 -2087 -1938
10530a938O73d97B93R04K04l39D78a48C19Q72N35K25J15l44o13B94e95l72J39
$$ -1938 -1265 -497 293 1197 1401 1062 478 -148 319 1191 1726 1951 2066 1722 1109 294 -595 -967 -828
10511h28c80C69M56N81O3j8p25d54m52b60A499J435O67k73r85j021E29B19i6p10
$$ -828 -380 369 825 1406 1469 1451 726 -454 -906 -260 1499 2934 3601 3328 2343 1322 529 219 -96 -806
10491h06J66G0i7B9K28M34L20M59L30M32J26Q40Mn70k93q99n49C15m1M23P10O68
$$ -806 -640 70 -97 29 257 691 1011 1470 1800 2232 2358 3198 3202 2632 2339 1440 891 315 274 697 1407 2075
10469B075P39P35L76L80k41o84j365F28b45j19A83N38o2C17c19p46q44l1R24B42
$$ 2075 2814 3549 3925 4305 4064 3380 2015 628 -245 -364 183 721 659 317 -319 -1065 -1909 -1940 -1016 242
10448A130L76j91E80d45r01k84L25N38a60A61l6c67p13q54N9O63N02c42R3j35
$$ 1130 1506 1315 580 -445 -1346 -1630 -1305 -767 -160 161 125 -367 -1080 -1934 -1875 -1212 -710 -342 -249 -384
10428c84m91l81M7d44G05J265J033L65m96q39H88b07p22j44j13J00P0L85b84B91
$$ -384 -875 -1256 -1209 -444 705 1970 3003 3368 2872 2033 888 -207 -929 -1073 -1186 -1086 -1016 -631 -284 291
10407F66L82O8R7k1j03m42b8q40j01a04A143J626K63j481B33N986J0319J2067
$$ 666 1048 1116 1213 1192 1089 647 -28 -868 -969 -104 1143 2769 3032 1551 233 6219 16538 28605
10389B8605J1316Q531L645k014o655j0397j1452j0133D624A483C34a059j005P49
$$ 28605 39921 48452 52097 50083 43428 33031 21579 11446 4624 1483 334 -1059 -2064 -1315
10375a315D4R00L9j96a07j394j900J011a006D40R58P54R88N15j1n92o82p38F79
$$ -1315 44 944 983 787 -107 -1501 -3401 -2390 -1006 440 1398 2152 3140 3655 3644 3052 2370 1632 679
10355d1n32m20m96l62J9O32c71E70O27Q06N09J9R0j60o88D95a75o23k13j87l0
$$ -41 -573 -993 -1489 -1851 -1832 -1200 -371 570 1197 2003 2512 2531 2621 2461 1773 495 -175 -798 -1011 -1198 -1228
10334a228o80q54P83R15e24b11l97n67m83j24j10M77N88e4F34L40k66B57b31j46
$$ -1228 -1908 -2762 -1979 -1064 -524 -211 -608 -1175 -1658 -1782 -1892 -1415 -827 -54 634 974 708 257 -231 -377
10314c77J78A97a36o75j467j075N28n90J160A864L025J1k367K634P172L666P654
$$ -377 -199 197 -136 -811 -2278 -3353 -2825 -3415 -2255 1864 4889 4900 2533 5167 12339 16005 23659
10297B3659L5329O4735Q6930R7151R1815O9076L2959j0465n1183q2325r6838r5082
$$ 23659 58988 123723 210653 307804 399619 468695 501654 491189 440006 357681 260843 165761
10285A65761p8148C4701A2223j723k471k441J240n2k850B15b804i94I99J822J229
$$ 165761 87613 34701 12223 10500 8029 5588 6828 6776 3926 215 -2804 -994 999 2821 4050
10270D050J61j147j480o08l41B51c52m53k16Q1J01k9p3J68c71F5L52J74j97f01
$$ 4050 4211 3064 1584 976 635 251 -352 -805 -1021 -940 -839 -868 -941 -773 -371 65 417 591 394 -601
10249a511m10k21L93d01A292J15j4l11O230P634O307oP955L160M476O819P013
$$ -1511 -1921 -2142 -1749 -401 1292 1407 1393 1082 7312 14946 21253 21247 29202 32362 36838 43657 50670
10232E0670N743K936L10j263R2K437K659l29o537j2981j4525A4055C549j16L063
$$ 50670 56413 59349 59659 58396 58488 60925 63584 63255 56718 43737 29212 14055 3549 3433 6496
10217F496q88B661c38j520J03j20L27O07L62k0k03m36j52c25A181J504J068L00
$$ 6496 5608 2661 -338 -1858 -1755 -1875 -1548 -941 -579 -599 -802 -1238 -1390 -325 1181 2685 3753 4053
10199D053j85o06p71n57n42o32B00e81K50D73P05L60R46J765J438J410N78l56
$$ 4053 3868 3262 2491 1934 1392 760 200 -581 -331 473 1178 1538 2484 4249 5687 7097 7675 7319
10181G319j287k168j127j042C54g55k94d61B82O45M14K94L53K75K32J90P9l5m61
$$ 7319 6032 3864 2737 1695 354 -755 -1049 -461 282 927 1341 1635 1988 2263 2495 2685 2764 2729 2268
10162B268j019A89i54K42m92r55J31N20L46k43m51l19L86h45a48F92M73O50j45
$$ 2268 1249 189 -954 -712 -1204 -2159 -2028 -1508 -1162 -1405 -1856 -2175 -1789 -845 -148 692 1165 1815 1670
10143A670o26E16a82j423P20B78N84O73j66D39a147j100Q99c33A20N4b80n3G05
$$ 1670 1044 516 -182 -1605 -885 278 862 1535 1369 439 -1147 -2247 -1348 -333 120 174 -280 -333 705
10123B049J141L66q16A221d52q94f10a4B86j36b19k26K0j06k79k72j335J91c42
$$ 2049 3190 3556 2740 1221 -452 -1346 -610 -14 286 150 -219 -445 -425 -531 -810 -1082 -2417 -2226 -342
10103A562J305l23r53g4k905A791O121P210O037M464J655o05j528J12L222N299
$$ 1562 2867 2544 1591 -74 -2979 1791 7912 15122 21159 25623 27278 26673 25145 25257 28479 33778
10087C3778M891L035K34k625m776o141m758M02O349P607L499l721j3005A329K2992
$$ 33778 38669 41704 41938 39313 34537 28396 23638 24040 30389 37996 41495 37774 24769 1329 24321
10072B4321L7456L6708L0016J8719M084r717k0536k6335k7429k3750j7761j1103
$$ 24321 61777 98485 128501 147220 151304 141587 121051 94716 67287 43537 25776 14673
10060A4673o560l534B001D64QK011K714J824O20o01j926B489A53b248P45A21J773
$$ 14673 8113 4579 2001 464 472 2483 5197 7021 7641 7040 5114 2489 153 -2248 -1503 121 1894
10043A894J925J739R85J60j032j430j542j129j45L90K10p40d12J3B428L831K637
$$ 1894 3819 5558 6543 6703 5671 4241 2699 1570 1425 1815 2025 1285 -412 -399 2428 6259 8896
10026H896M82j893C403e32k454q74b15A326o55a88C07M12B73o4K30N85K81k87
$$ 8896 9378 7485 3403 -532 -2986 -3860 -215 1326 671 -188 307 719 273 209 439 1024 1305 1018
10008A018O21m8G93a9k961m2K27J120L92O21G8O45J530L366M44l98j753D65g511
$$ 1018 1639 1591 793 -19 -2980 -3022 -2795 -1675 -1283 -662 78 723 2253 5619 6063 5665 3912 465 -7511
9988i647N21K422K967a663B344N75J620P682O912O887M684K490n1l382n515o372
$$ -9647 -9126 -6704 -3737 -1663 2344 2919 4539 12221 19133 26020 30704 33194 33143 29761 24246 17874
9972A7874n902n718A367a951M08e58J09m50l82J61M62A69J051J042P45qp35q19
$$ 17874 11972 6254 1367 -1951 -1543 -558 -449 -899 -1281 -1120 -658 169 1220 2262 3007 2999 2264 1445
9954A445E90E7c9j92j52l78m79m28l26N0j2l2L6J63J42J72K6j48K51J05l52o23
$$ 1445 590 57 -39 -231 -383 -761 -1240 -1668 -1994 -1944 -1956 -1988 -1952 -1789 -1647 -1475 -1449 -1597 -1346 -1241 -1593 -2216
9932b216K6j32K56N90O69c58J70c3E3K23L91J69j0B57f21n26b84G07J82A08a091
$$ -2216 -2190 -2322 -2066 -1476 -807 -358 -188 -33 53 276 667 836 826 257 -621 -1147 -284 707 889 108 -1091
9910f90H92R91J56r67h18j539J52a077D97J187Q27L74n2m06j162a9p67F9R51J74
$$ -690 892 1883 2039 1072 -818 -2357 -2205 -1077 497 1684 2511 2885 2833 2427 1265 -19 -786 69 1020 1194
9890A194k42a11r44r62q07K60Q64Q19c3D99Q0j36a54j35r93j715J374H29L189
$$ 1194 952 -111 -1055 -2017 -2824 -2564 -1700 -881 -33 499 579 443 -154 -289 -1282 -2997 -1623 829 4018
9871D018L456K994J837l58k198l321k920A008D34P12M8m45b40n78q02n73l70k90
$$ 4018 7474 10468 12305 11947 9749 6428 3508 1008 434 1146 1194 749 -240 -818 -1620 -2193 -2563 -2853
9853b853k48K39L42N48h88H37J984J240J18q76A626d56q3A051J204K11k37C84
$$ -2853 -3101 -2862 -2520 -1972 -888 837 2821 4061 4179 3303 1626 -456 -539 1051 2255 2466 2229 384
9834a713m13R66L49m87g1A156J245J107o2j263H57g5k17j41m4N4m8K09B52O30
$$ -1713 -2126 -1160 -811 -1298 -71 1156 2401 3508 3446 2183 857 -75 -292 -433 -477 -423 -471 -262 252 882
9814H82O49N99P88P37J48o33A553c13r59A62K026K245R90L20k72j572A922i32
$$ 882 1531 2130 2918 3655 3803 3170 1553 -313 -1272 162 2188 4433 5423 5743 5471 3899 1922 -932
9795c06E553N803M529K471M95j480l227m373m639A216c94E15O69j25C21d84m98
$$ -306 5553 11356 15885 18356 18851 17371 14144 9771 5132 1216 -394 515 1184 1059 321 -484 -982
9778i82K90Q0j3J75e3D7b4j62E0K38M65M17K88n57C86g8l24o0l52L57b08a04O
$$ -982 -692 -612 -625 -450 -53 47 -24 -186 50 288 753 1170 1458 901 386 -78 -402 -462 -814 -457 -208 -104 -98
9755i8k83n13R2q99j582k84a739D6J066N41K18n01F55a93j07F42M73k0D14d02
$$ -98 -381 -894 -802 -1701 -3283 -3567 -1739 46 1112 1653 1871 1370 655 -193 -300 642 1115 1095 414 -402
9734a415q76b2C869M253L738K383K50j907l479m326E45a396c94C90J92k63J66
$$ -1415 -2291 -22 3869 8122 11860 14243 14493 12586 9107 4781 545 -1396 -394 390 582 319 485
9717D85A49J26A01a98k82J76E44J010J051N75l57j410a64k033l74a200c36I9c3
$$ 485 149 275 101 -198 -480 -304 544 1554 2605 3180 2823 1413 -164 -2197 -2571 -1200 -336 99 -33
9697A49L51M65N68M26j19k75o36b4n99j43L31G3N12L03J71j05D48b33p18l72l88
$$ 149 500 965 1533 1959 1840 1565 929 -24 -623 -766 -435 73 585 888 1059 954 448 -233 -951 -1323 -1711
9676a711m84j66M86M25P0n0M69B19J284J054R41L17m86j291E26i95p90L75N24
$$ -1711 -2195 -2361 -1875 -1450 -1380 -1430 -961 219 1503 2557 3498 3815 3329 2038 526 -995 -1785 -1410 -886
9657h86L00K13R6o1k36j09K6J39Qj65j12j9K8R9m5l68n94j23Q87d30N5m06o82
$$ -886 -586 -373 -277 -338 -574 -683 -657 -518 -510 -675 -787 -806 -778 -679 -724 -1092 -1686 -1809 -922 -430 -375 -781 -1463
9634a463k16O66C04J423J629J409J172M50j58q14j582A745A96d84j01n1n54j244
$$ -1463 -1679 -1013 304 1727 3356 4765 5937 6387 6229 5415 3833 1745 196 -484 -585 -636 -1190 -2434
9616b434j94a047F84K009J811J066J14o08n50j390r91n04k63k03J08K86K23l01
$$ -2434 -2628 -1047 684 2693 4504 5570 5684 5076 4526 3136 2145 1641 1378 1175 1283 1569 1792 1491
9598A491D02h54m49e64a52I1M8Q27J308J379Q17k82j222A279h01j866J88j63m05
$$ 1491 402 -854 -1303 -564 -152 91 139 966 2274 3653 4470 4188 2966 1279 -801 -2667 -2479 -2642 -3047
9579c047J052e77F23P53M21l98F66b46k95a15A96O9G3c90l60P5Q7f1Mm75j16L17
$$ -3047 -1995 -577 623 1376 1797 1399 666 -246 -541 -115 196 265 73 -390 -750 -675 -588 -61 -57 -532 -648 -331
9557c31A25K89B05H3K3J36R6o0L7A17c86q83l44K06q04k282a813A639K890J721
$$ -331 125 414 205 83 106 242 338 278 315 117 -386 -1269 -1613 -1407 -2211 -4493 -1813 1639 4529 6250
9537F250Q44l33l35j155p87j048j291E58b72l84j499k543N44B523J1111P629L889
$$ 6250 7094 6761 6426 5271 4484 3436 2145 558 -272 -656 -2155 -4698 -4154 2523 13634 21263 25152
9520B5152m75p820B549J1532K5080K5977K3011J6839R526N21p648j4296j8550
$$ 25152 24677 16857 2549 14081 39161 65138 88149 104988 114514 115035 107387 93091 74541
9507G4541k0591j9741j6400G830j230J012k039A807a562k123P31J008h26A022
$$ 74541 53950 34209 17809 7830 6600 7612 5573 1807 -1562 -3685 -2954 -1946 -826 1022
9492B760L68l47A030C43h99l20c0A183n74L24J126K007R35J591j051j864E32h84
$$ 2760 3128 2781 1030 343 -899 -1219 -30 1183 609 933 2059 4066 5001 6592 5541 3677 532 -884
9473H60L229K192n35j957J225O00J906J828K929p87j390m179k628H67a543j006
$$ 860 4089 6281 5746 3789 5014 5614 7520 9348 12277 11490 10100 5921 3293 867 -1543 -2549
9457b549M98l34m01R34e02B372N619O567O575N656L371l2l162o020p361E866e09
$$ -2549 -2051 -2385 -2786 -1852 -502 2372 7991 14558 21133 26789 30160 30128 26966 20946 13585 5866 -509
9439b646A84P21a49j770P5f81P4q65k550J992G25J714N07A363b439r34l33j319
$$ -2646 184 905 -149 -1919 -1844 -681 -607 -1472 -4022 -2030 725 2439 2946 1363 -2439 -3373 -3706 -5025
9421e025b292K70m24b08E496N527N301J4480L4525N1473O9988P7163O7766M8837
$$ -5025 -2292 -2022 -2446 -208 5496 11023 16324 30804 65329 116802 186790 263953 331719 380556
9407C80556K0910j1190m1190o2883p3010p1363n9438D0855A7857q760D408a277
$$ 380556 401466 390276 349086 286203 213193 141830 82392 40855 17857 9097 4408 -1277
9394c0A280b30l111Q03D3J269M40n91a46j225q71l62M28P65M3n58m95K20M10K7
$$ -30 1280 -230 -3341 -2538 43 1312 1752 1161 -146 -1371 -2242 -2604 -2176 -1411 -1368 -1926 -2421 -2201 -1791 -1764
9374a764J64j13M53e06A40K11d6p33o99k97p9L79N41c27B60O60M93P0F83i52j818
$$ -1764 -1600 -1713 -1260 -506 140 351 -46 -779 -1478 -1775 -1854 -1475 -934 -327 260 920 1413 1483 683 -952 -2770
9353b770J190d37B70D9e84j010n16J63Q89e6A081L39j25E51e22j088p54O4p3L71
$$ -2770 -1580 -437 270 49 -584 -1594 -2110 -1947 -1058 -56 1081 1420 1295 551 -522 -1610 -2364 -2300 -2373 -2002
9333b002J91L04n7j34K26N69G0J054J162J108K53p18j352f7j293K89eE24q7O0
$$ -2002 -1811 -1507 -1564 -1698 -1472 -903 70 1124 2286 3394 3647 2929 1577 -67 -1360 -1071 -5 524 437 497
9313D97A62c76m64m42k77R7K97M13L53Q4i4A94N07P85N19O3k39l23q6K78O1j62
$$ 497 162 -376 -840 -1282 -1559 -1462 -1165 -752 -399 -315 -94 194 701 1486 2005 2068 1829 1506 1420 1698 1759 1597
9291A597l43H1a344j23P1l91q27Q87D3J747J457R77M08m0j83l51p33j023A143
$$ 1597 1254 81 -1344 -1467 -1396 -1787 -2614 -1727 43 1790 3247 4224 4632 4592 4409 4058 3325 2302 1143
9271D78k10N0K3c06q98j017l83J142b85F22M26L56l4j94m85E6g78l84m40n41J46
$$ 478 268 318 341 -306 -1204 -2221 -2604 -1462 -285 622 1048 1404 1370 1176 691 56 -778 -1162 -1602 -2143 -1997
9250a997b92A154Q05J52n18E51a98k9D34J75k67CP3O42O76P12K21m88F38a013
$$ -1997 -292 1154 1959 2111 1593 551 -198 -227 434 609 342 3 76 718 1394 2106 2327 1839 638 -1013
9229b325f04D80J41A75C3O62J098J146N70j39p92r09E02e92q01K0M17M09K42J08
$$ -2325 -604 480 621 175 33 695 1793 2939 3509 3370 2578 1669 502 -592 -1393 -1373 -956 -547 -305 -197
9209a97D92K99J764J588J11J19N87l21j557G84b972n113C6M38P80M37k27F41a42
$$ -197 492 791 2555 4143 4254 4373 4960 4639 3082 784 -2972 -8085 36 474 1254 1691 1464 641 -142
9189g27P9i9C0J33n5b27j944o64J85k22k12L92P75O21d64a52A10J23Q6L06J21
$$ -727 -648 -99 30 163 108 -227 -2171 -2835 -2650 -2872 -3084 -2692 -1917 -1296 -464 -152 110 233 319 625 746
9168G46J13J52J74j32m18C10A46M04M69L74J33j3k02n10b59j046M16B07N98j04
$$ 746 859 1011 1185 1053 635 310 146 550 1019 1393 1526 1513 1311 801 -259 -1305 -889 207 805 701
9148G01gj036m65O36b79a03m51n64l94m61M71f75E6K50r5c60J12H95J202M86k87
$$ 701 -7 -1043 -1508 -872 -279 -103 -554 -1118 -1512 -1973 -1502 -675 56 306 211 -360 -248 895 2097 2583 2296
9127B296q93D30g9k46l2L9a51j27l99p20p03c60I36N64k1E93g13p48J52e11a79
$$ 2296 1403 430 -79 -325 -357 -318 -151 -278 -677 -1397 -2100 -360 936 1500 1479 593 -713 -1461 -1309 -511 -179
9105b9k62o1l10p68n36m91k34l02J58N62K13m27N13i03A19O46K10k95i8r65q82
$$ -29 -291 -352 -662 -1430 -1966 -2457 -2691 -2993 -2835 -2273 -2060 -2487 -1974 -903 119 765 975 680 -98 -1063 -1945
9084a945k05L70j66n17R9o4k85m68L27J210f76a53D4A0a71o0l72l66m28k70m13
$$ -1945 -2150 -1780 -1946 -2463 -2364 -2428 -2713 -3181 -2854 -1644 -676 -153 44 10 -171 -231 -603 -969 -1397 -1667 -2080
9063b080k37L07L23J50n1J47K67c78A11J06b49r08o59N91G22J813J240K93q88
$$ -2080 -2317 -2010 -1687 -1537 -1588 -1441 -1174 -378 111 217 -249 -1157 -1816 -1225 722 2535 3775 4068 3180
9044C180A446B13i51p30o3J17L08e94B02R81J014Q52O03K64l13j153I23d62k29
$$ 3180 1446 213 -951 -1681 -1744 -1627 -1319 -594 202 1183 2197 3049 3652 3916 3603 2450 923 -462 -691
9025f91A46O32N73K58j34m19A67h22p50j59m32n74j69N59P64N24l1j19p0m55o17
$$ -691 146 778 1351 1609 1475 1056 167 -822 -1572 -1731 -2163 -2737 -2906 -2347 -1583 -1059 -1090 -1209 -1279 -1734 -2351
9004b351j76a228a17D20P4B10d80r24m97l80o1J58P25e35C6pb34k98n51j107k48
$$ -2351 -2527 -1228 -117 420 494 210 -480 -1404 -1901 -2281 -2342 -2184 -1459 -535 36 29 -234 -532 -1083 -2190 -2438
8983b438Q47g78K86l12o63o41Q70b13C40A02h22p04J09a94I33K92n39a52j107
$$ -2438 -1591 -778 -492 -804 -1467 -2108 -1238 -213 340 102 -822 -1526 -1417 -194 933 1225 686 -152 -1259
8964a259l54g13A39J97j56e06j088r67N31O28O93b86R6k65l20L42C32L19C11e55
$$ -1259 -1613 -713 139 336 180 -506 -1594 -2561 -2030 -1402 -709 -286 -190 -455 -775 -433 332 651 311 -555
8943a568q68l33M73O23L44L5k17p4K0M69e32C75Q68M65o2n84C07a07k1D21A68
$$ -1568 -2436 -2769 -2296 -1673 -1329 -1294 -1511 -1585 -1565 -1096 -532 375 1243 1708 1646 1062 307 -107 -128 421 168
8921d54k82L19D29L33l12c94r66p21n04O40O52N05R2k81l81k92L32O08L01a79
$$ -454 -736 -417 429 762 450 -394 -1360 -2081 -2585 -1945 -1293 -788 -696 -977 -1358 -1650 -1318 -710 -409 -179
8900A76J64J90J73k85A57d85o13o57k8g68A97Q97J80m49Af48l9p9m15q44j007
$$ 176 340 530 703 418 157 -485 -1098 -1755 -1783 -768 197 1094 1274 825 1 -648 -687 -766 -1181 -2025 -3032
8879c032J14L07l24o38J132h53D80Q67O97P55M83J20m47r62I11@d40J03J43J1
$$ -3032 -2918 -2611 -2935 -3573 -2441 -853 480 1347 2044 2799 3282 3402 2955 1993 911 0 -440 -337 -194 -183
8859a83N0r0k97l32l58m11q25p19l09J4j0K7K82M80L93M93N59a78B45H1d60q53
$$ -183 -133 -223 -520 -852 -1210 -1621 -2446 -3165 -3474 -3460 -3470 -3443 -3161 -2681 -2288 -1795 -1236 -178 245 81 -460 -1313
8837a313j025ON31M37M65M11A18L38r3q0K06K35k74a14r21m28j97N4J68r8m71
$$ -1313 -2338 -2332 -1801 -1364 -899 -488 118 456 363 283 489 724 450 -114 -1035 -1463 -1660 -1606 -1438 -1536 -2007
8816b007q27J18Q13O80l17l8d76E14O01K0D76g15r43M08b24F19N95m1k50l75F0
$$ -2007 -2834 -2716 -1903 -1223 -1540 -1578 -476 514 1115 1135 476 -715 -1658 -1250 -224 619 1214 1173 923 548 60
8794g90r88r73R15d11D82J91l34d24m97j04L1j86P1M49P9l68o11J4f62I5N98o3
$$ -790 -1778 -2751 -1836 -411 482 673 339 -424 -921 -1025 -994 -1180 -1109 -660 -581 -949 -1560 -1546 -662 95 693 630
8772F30b87j105j183j27a137E49J698J258K64K24p57q17j118B05e73q76m51J24
$$ 630 -287 -1392 -2575 -2702 -1137 549 2247 3505 3769 3993 3236 2419 1301 205 -573 -1449 -1900 -1776
8754a776j46m44o79l66J110o9j840k433O69r4k06j476K104K561i6C079a562m805
$$ -1776 -1922 -2366 -3045 -3411 -2301 -2370 -4210 -6643 -5974 -6068 -6274 -7750 -5646 -3085 -96 3079 -1562 -6367
8736f367q05A0595J0435J0508r92q484F726B262K1991J1350Q688P255R579L890
$$ -6367 -7172 10595 21030 31538 30546 22062 6726 2262 24253 35603 44291 51546 61125 65015
8722F5015j5701B1589J2945J8396J540J732N930J4655J7728P595j1400j4498j3490
$$ 65015 49314 21589 34534 52930 54470 56202 62132 76787 94515 102110 90710 76212 62722
8709F2722p841j8682r289B517a548A2263J1943K404j094k900k797m120p67B167
$$ 62722 54881 36199 26910 2517 -1548 12263 24206 26610 25516 22616 19819 15699 14932 2167
8694I986C981A337g16r69j216l624J086J525P47p52J795a50A898P82j15j115A69
$$ 9986 3981 1337 -716 -1685 -2901 -6525 -5439 -3914 -3167 -3919 -2124 -150 1898 2680 2565 1450 169
8676f36K51D26b52j517h70A795J289A349a838D653O919L731K794R328K0093K8024
$$ -636 -385 426 -252 -1769 -870 1795 3084 1349 -1838 4653 11572 15303 18097 27425 47518 75542
8660G5542K8492J8343L658j574j3106j8796l0881k8385A2577n145J33k991F60
$$ 75542 104034 122377 126035 124461 111355 92559 61678 33293 12577 7432 7565 4574 660
8646A075J542q85A20L90Q13r4a02j874l15q18j003j71J194J526c87A102R60j69
$$ 1075 2617 1732 120 510 1323 1229 -102 -1976 -2291 -3109 -4112 -4283 -3089 -1563 -387 1102 2062 1893
8628A893D70a194O8A11O03j64c72j421n21a156B8N94R0k08A22C9Q2j4b91o59j133
$$ 1893 470 -1194 -1126 111 714 550 -372 -1793 -2314 -1156 28 622 712 504 122 39 121 107 -291 -950 -2083
8607b083o25R63d56F98N41m21d14r69a84A856J401K37n62j222A50i98l31c57F65
$$ -2083 -2708 -1745 -456 698 1239 818 -414 -1383 -184 1856 3257 3494 2932 1710 150 -998 -1329 -357 665
8587A145k14b18j724j733J549f45C91K08Qj24J10K11K1p2j5j76k06J51K07L9k95
$$ 1145 931 -218 -1942 -3675 -2126 -645 391 599 607 483 593 804 825 753 738 562 356 507 714 753 458
8566D58e77j551q02a445c6B76a78l67A07P82J98D28g02p00f89a38K4l49k70J73
$$ 458 -577 -2128 -2930 -1445 -36 276 -178 -545 107 889 1087 428 -702 -1402 -689 -138 -114 -463 -733 -560
8546e60J72Q6j60l35k30j37L70B47J126O60k62p76H6e08k8K34M4n2N8Q6o5j85
$$ -560 -388 -302 -462 -797 -1027 -1164 -794 247 1373 2033 1771 995 86 -508 -536 -302 -258 -310 -252 -166 -231 -416
8524d16R4d0F67M63k58b98j476og03J98p13n59O49CR33Q40O62k56l39n6o61D18
$$ -416 -322 -40 667 1130 872 -298 -1774 -1780 -703 -505 -1218 -1777 -1128 3 936 1776 2438 2182 1843 1787 1126 418
8501b56m06n3j83m05p01M11g50A34J97c2o48n04k88KK14i8A282J385K86l94L15
$$ -256 -662 -715 -898 -1303 -2004 -1593 -750 134 331 -32 -680 -1184 -1472 -1470 -1256 -98 1282 2667 2953 2559 2874
8480B874J319K161J770O01n94j750j891j913j042K3K75l51E62c96j085p79M22
$$ 2874 4193 6354 8124 8725 8131 6381 4490 2577 1535 1558 1833 1482 562 -396 -1481 -2260 -1838
8463a838Q60d85l0l37j42K0j99n13q33O29c65G48K47k98Hd24j07o7l78m00J88
$$ -1838 -978 -485 -515 -852 -994 -974 -1173 -1686 -2519 -1890 -365 748 995 697 8 -424 -531 -598 -976 -1376 -1188
8442a188M67K45M5p90p82P56C09N41k96d52j009l33l41n78J240A10Q86k35c41
$$ -1188 -721 -476 -431 -1221 -2003 -1247 309 850 554 -452 -1461 -1794 -2135 -2713 -1473 110 996 761 -341
8422a550M2G0J186j94d86q11C63K435K014O59o63j920G66f73k02L58J99e7A01
$$ -1550 -1508 70 1256 1062 -486 -1297 363 2798 4812 5471 4808 2888 766 -673 -875 -517 -318 -57 101
8402B47M3a15j004j308N46c22F91j5b36m00G15J276l9A28b583h3C521J841o43
$$ 247 290 -115 -1119 -2427 -1881 -322 691 676 -236 -636 715 1991 1952 128 -2583 -83 3521 5362 4719
8383D719j696J253L148K238k72j321j579p00L315M807K922L436N915N078O912
$$ 4719 3023 4276 7424 9662 9390 8069 6490 5790 9105 13912 16834 20270 26185 31263 38175
8368C8175R631J1728J2699J4864J6242K1405K3328K0844J3563M311o091j4072
$$ 38175 47806 59534 72233 87097 103339 124744 148072 168916 182479 186790 180699 166627
8356A66627j9574k1866k1160j9498j6672j1732r702p574p579o477m188j969j241
$$ 166627 147053 125187 104027 84529 67857 56125 46423 38849 31270 24793 20605 18636 17395
8343A7395k467j699j989l149j169B913p63g17H75J044M44K88k66m24p27k87M98
$$ 17395 14928 13229 11240 8091 6922 2913 2150 -717 875 1919 2363 2651 2385 1961 1234 947 1445
8326A445K40N5o28KR97Q32p11D76b84A310J231L59p45p60C21a075j446m00J046
$$ 1445 1685 1740 1112 1114 2111 2943 2232 476 -284 1310 2541 2900 2155 1395 321 -1075 -2521 -2921 -1875
8307a875d18A296J377P09k39j132D17h56k67d03D60N07k85b42p88j3d71K5pJ46
$$ -1875 -418 1296 2673 3382 3143 2011 417 -856 -1123 -403 460 967 682 -242 -1030 -1043 -471 -446 -453 -307
8287c07p9m85q71j081j88P12a051B53P67j2b65k016J18i39K07m10J34D23J830
$$ -307 -386 -871 -1742 -2823 -3011 -2299 -1051 253 1020 1008 -265 -2281 -2163 -939 -732 -1142 -1008 423 2253
8268B253J165j18r47n78J67J33l63H20A48J03L16j60c54o91M88I17O97F39a302
$$ 2253 3418 3300 2353 1775 1942 2075 1712 820 148 251 567 407 -354 -1045 -557 917 1614 639 -1302
8248a317E60J018m47a36o52B54J259p6F60D6e16A17a01l53m22j31b72A005J691
$$ -1317 560 1578 1131 -136 -788 254 1513 1437 660 46 -516 117 -101 -454 -876 -1007 -272 1005 2696
8229B696J104n28D15N4O596Q217P725O152L384k62l361n662o305o153m880B290
$$ 2696 3800 3272 415 469 7065 15282 23007 29159 32543 32281 28920 23258 16953 10800 5920 2290
8212F63P06J767J180K15q02R9J536J978P57N07p83j553l081a088l089a059C136
$$ 663 1369 3136 4316 4531 3729 3828 5364 7342 8099 8606 7823 6270 3189 -1088 -4177 -1059 3136
8194F611K076L58j637k679A539d69P2mn73m74P9P0l26e33A685J564m98C22a628
$$ 6611 8687 9045 7408 4729 1539 -469 -397 -401 -974 -1448 -1369 -1299 -1625 -533 1685 3249 2751 322 -1628
8174cD016L751L172K565J358M84n90j361k098k669l022k736F08i11J80a33B08
$$ -3 4016 7767 10939 13504 14862 15346 14756 13395 11297 8628 5606 2870 608 -911 -731 -133 208
8156f01p23c32G37j51a234j990F15L142J729J393K080L248L571L064J967Q32N4
$$ -601 -1324 -332 737 586 -1234 -3224 615 3757 5486 6879 8959 12207 15778 18842 20809 21641 21695
8139B1695j033k128k875m023m088l478A256i6G26J001k53b23k700a083A467J263
$$ 21695 20662 18534 15659 11636 7548 4070 1256 -96 726 1727 1474 -223 -2923 -1083 1467 2730
8123B730n26E07a460j277J017Q28M16C52J107J143O89n08q67l1M6l67o24j82M77
$$ 2730 2204 507 -1460 -2737 -1720 -892 -476 352 1459 2602 3291 2783 1916 1885 1931 1564 940 758 1235
8104A235K93L9G63f49b86B328L286L026K549K133K600J853J433K42r37j575k620
$$ 1235 1528 1567 763 -649 -286 2328 5614 8640 11189 13322 15922 17775 19208 19450 18513 16938 14318
8087A4318m438D218j567J461K525K303K791L482L056Q91j556l720m841l812B547
$$ 14318 9880 4218 2651 4112 6637 8940 11731 15213 18269 19160 17604 13884 9043 5231 2547
8071A695J642K716K610M39j669l456A774K871L082j91j481O131J1985J3251J2984
$$ 1695 3337 6053 8663 9102 7433 3977 1774 4645 7727 7536 6055 12186 24171 37422 50406
8056E0406J8819L0490M3238M6876M0651K4638M090j8957l7445m7339m7958l8275
$$ 50406 69225 99715 142953 189829 230480 255118 259208 240251 202806 155467 107509 69234
8044F9234k2982j1498r127j1146D696p38M409K398L21o55n72o89j130j408k344
$$ 69234 46252 34754 25627 14481 4696 3958 8367 10765 11086 10431 9859 9170 8040 6632 4288
8029D288A815K57N477P352O301L989Q35j410N66j16p69m315n716l525J36k16r88
$$ 4288 1815 2072 7549 14901 21202 25191 26026 24616 25182 25066 24297 19982 14266 10741 10877 10661 9673
8012I673j773m5J145M664O936N148Q45m068j098O689R020J0124J5039J9762K2045
$$ 9673 7900 7855 9000 13664 20600 25748 26593 22525 21427 28116 37136 47260 62299 82061 104106
7997A04106L4811P0465J13764J40143J39335J07925N3959j3050p6156j20924j41247
$$ 104106 138917 209382 323146 463289 602624 710549 764508 751458 675302 554378 413131
7986D13131j34612j09743p9211C3960E734K9515K0674O948m398r080q569o391
$$ 413131 278519 168776 89565 33960 5734 35249 55923 62871 58473 49393 40824 34433
7974C4433o003p592n830k548n60j72K88j74j622l397l118q72l07j187j0J448J418
$$ 34433 28430 20838 15008 12460 11900 11728 12016 11842 10220 6823 3705 2833 2526 1339 1329 2777 4195
7957D195p97j364M07J69q83i04l170R95K88m70k60J094e90A708q27J772i66l141
$$ 4195 3398 2034 2441 2610 1727 -904 -4074 -3079 -2791 -3261 -3521 -2427 -590 1708 881 2653 -966 -4107
7939d107D09c331B436M145L10k494M303J1869J4424J2111Q305L332k035j9997
$$ -4107 409 -3331 2436 6581 6891 4397 8700 20569 34993 47104 55409 58741 56706 36709
7925C6709n364j2881D499a423r84d24C59L46B69d31k839J83h46b33q92R4C83L14
$$ 36709 31345 18464 4499 -1423 -2407 -424 359 705 269 -431 -3270 -3087 -846 -233 -1125 -1031 383 697
7907F97A12a088m28M72o41l33Q38J91n19J87L14J84m37m9n2I23M3D10J262O86
$$ 697 112 -1088 -1516 -1044 -1685 -2018 -1180 -989 -1508 -1321 -1007 -823 -1260 -1309 -1361 923 966 410 1672 2358
7887B358J11j174J009M598O079N677N596L268m0l053n227q186I19a442b15C473
$$ 2358 2469 1295 2304 6902 12981 18658 24254 27522 27482 24429 19202 11016 919 -1442 -215 3473
7870E652k18j07j693A374j5K457J697k38j482A523f42j690j657a343K05B324b56
$$ 5652 5434 5327 3634 1374 1359 3816 5513 5275 3793 1523 -642 -2332 -3989 -1343 -1138 2324 -256
7852b452O51A582N296M740N481N282J886O57j620n668p449K166J593j336j080
$$ -2452 -1801 1582 6878 11618 17099 22381 24267 24924 23304 17636 10187 12353 13946 12610 11530
7837A1530L02J257O99R21o99k490j855j931k902B244k54r01C09M43O3l06J05K643
$$ 11530 11832 13089 13788 14709 14010 11520 9665 7734 4832 2244 1990 1089 309 752 815 509 614 3257
7819C257M616N022L697M473Q82O209J7500K5298K8353K3252J2836L39j1945k1735
$$ 3257 7873 12895 16592 21065 21947 28156 45656 70954 99307 122559 135395 135734 123789 102054
7805A02054k6364k6198k1444j2863k483J841M15j916l299l283j215r40j318F17
$$ 102054 75690 49492 28048 15185 12702 14543 14958 13042 9743 6460 5245 4305 2987 617
7790A70J419K109L051P9l104b13n992l309d461C438R551O372J0035m157j777n361
$$ 170 1589 3698 6749 6828 3724 -213 -6205 -9514 -4461 3438 12989 19361 29396 25239 23462 18101
7774A8101n383m335p72N960Q005j692m086l672K288l173C203f01l189a306H669
$$ 18101 12718 8383 7611 13571 21576 19884 15798 12126 14414 11241 3203 -601 -3790 -1306 8669
7758A8935P905R45k532o878q490D123e26k722R79D856n34j634A094B47a152j884
$$ 18935 26840 27785 25253 18375 9885 4123 -526 -3248 -2269 4856 4322 2688 1094 247 -1152 -3036
7742c036j170fD940N826K859q81l780G63a706B64M658M500K142k91j398j504j858
$$ -3036 -4206 -6 4940 10766 13625 12744 8964 763 -1706 264 4922 9422 11564 11273 9875 8371 6513
7725F513C175a99l740Q67b12Q1A140K279J117p88j499G75B60L36K710K964J388
$$ 6513 3175 -199 -3939 -3072 -212 -131 1140 3419 4536 3748 2249 775 260 596 3306 6270 7658
7708G658r49k812j563J028O45o56A230B5J392K402J099k74j317q55J069Q58L9
$$ 7658 6709 3897 2334 3362 4007 3351 1230 25 1417 3819 4918 4644 3327 2472 3541 4399 4438
7691D438N13Q66L16j188o62K503K527J88k032j087J920L133K109L94q79q85O27
$$ 4438 4951 5817 6133 4945 4283 6786 9313 9501 7469 6382 8302 11435 13544 13938 13059 12174 12801
7674A2801J350r81k418p58J700K618K283K531J573o77l11N141O736L464j670m711
$$ 12801 14151 13170 10752 9994 11694 14312 16595 19126 20699 20022 19711 24852 31588 35052 33382 28671
7658B8671n393A0839f65m9A1109J1634J0599J3270J0517Q52j1437m540J3463J4615
$$ 28671 23278 10839 -665 -714 11109 22743 33342 46612 57129 57981 46544 42004 55467 70082
7644G0082L623M497K0607J7611j141r449J8132K9845P052J2433Q8761J26131P1629
$$ 70082 73705 78202 98809 116420 115279 105830 123962 153807 160859 173292 262053 388184 459813
7631D59813K4259K21029O05552Q71843R83409R37038P46249M45054Q2466k90283
$$ 459813 484072 705101 1310653 2182496 3165905 4102943 4849192 5294246 5376712 5086429
7621E086429o19558q60657r76607r48663p73979m37853m9866M872p8308r9938
$$ 5086429 4466871 3606214 2629607 1680944 906965 469112 419246 424118 345810 245872
7611B45872m2545m899k5408m2296k3256r35r967j8943q213N267k095j2118r610
$$ 245872 203327 198428 173020 130724 107468 106533 96566 77623 69410 74677 72582 60464 50854
7598E0854J787K050o586j0986p526l691j927K990O802L701K69k544l956p339r926
$$ 50854 52641 54691 48105 37119 29593 25902 23975 26965 33767 37468 37737 35193 31237 23898 13972
7583A3972O80J0705O322o95k364J674L388o73k839K835P821L217o365j0738J772
$$ 13972 14652 25357 31679 30984 28620 30294 33682 33009 30170 33005 40826 44043 37678 26940 28712
7568B8712J1337K461j8706A0588O0925P0002O6409M9724K3295o886l5148n4909
$$ 28712 40049 42510 23804 10588 71513 141515 207924 257648 280943 274057 238909 184000
7556A84000o1321n1133k5224l978l750o422k519J144N66K067O061N475k3o087
$$ 184000 122679 71546 46322 42344 38594 32172 29653 30797 31363 33430 39491 44966 44943 38856
7542C8856o656J792R320J1881J1795J1206P729j94j0251j9259k2728j4839J39
$$ 38856 32200 33992 43312 55193 66988 78194 85923 85729 75478 56219 33491 18652 18791
7529A8791m7o964E325L944L793j724l043Q00O58j702j443K358J507k182m1N036
$$ 18791 18744 11780 5325 9269 13062 11338 8295 9095 9753 8051 6608 8966 10473 8291 8250 13286
7513A3286L279k127o532B976K128M126M219L045k59n121C793p41L571K77J636
$$ 13286 16565 14438 7906 2976 5104 9230 13449 16494 16235 11114 3793 3052 6623 6900 8536
7498H536M717J611m947A768R518J0766K620o210G715c614A703O625O643N243O0
$$ 8536 13253 14864 9917 1768 11286 22052 24672 18462 7715 -3614 1703 8328 14971 20214 20274
7483B0274n719p150B788A11K302Q919O708P54l722l85L438q90p583D636O285L203
$$ 20274 14555 7405 2788 111 2413 11332 18040 18794 15072 14687 18125 17235 9652 4636 10921 14124
7467A4124m642m160N433K746n921d378D966P364Q95K994P306L230m704r108l548
$$ 14124 9482 5322 10755 13501 7580 -4378 4966 12330 13225 16219 23525 26755 22051 12943 9395
7452I395J32D364K254J1798M810m752j346J4839J3513J810r229r768J59K879j177
$$ 9395 9527 4364 6618 18416 23226 18474 17128 31967 45480 47290 38061 28293 28452 31331 30154
7437C0154j153J085j742o690m085J468j884F894c377F957L392L468J0558O588
$$ 30154 29001 30086 28344 21654 17569 19037 17153 6894 -3377 6957 10349 13817 24375 30963
7423C0963p028E465O397J6110K798j3713g06D497K2400M523n357l554Q363J3305
$$ 30963 23935 5465 11862 27972 30770 17057 -706 4497 26897 31420 26063 22509 30872 44177
7409D4177J1998N366p520k0693A4713J0319O656j1906I608K1449J2666o363j5064
$$ 44177 56175 61541 54021 33328 14713 25032 31688 19782 9608 31057 43723 37360 22296
7396B2296O015R427o803j2981J4333J4107p922I766O506K3744J850j1209O269
$$ 22296 28311 37738 30935 17954 32287 46394 38472 9766 16272 40016 41866 30657 36926
7383C6926J4147n496B2736M340K2597o3k4772L908K7635M474k4570j4796K6215
$$ 36926 51073 45577 22736 27076 49673 49610 24838 28746 56381 60855 36285 21489 47704
7370D7704Q132k2171j2457L1876J1663j5627p348K2408L640C2838G644M2927J2061
$$ 47704 55836 33665 21208 53084 64747 49120 41772 64180 67820 32838 7644 50571 62632
7357F2632k4491n951M9664K0190k7359l6231L7585K5326k4429l5952M7006L5223
$$ 62632 38141 32190 81854 102044 74685 38454 76039 101365 76936 40984 87990 123213
7345A23213j9691m7735K8941L8829k1609B7149L1542N3632j4268m2697N9102N6122
$$ 123213 103522 55787 84728 123557 101948 27149 58691 112323 98055 55358 114460 170582
7333A70582k5421F1153M8382P9777j0667H7090K5660R5816k480r8469K1267J16828
$$ 170582 145161 61153 109535 189312 178645 87090 112750 208566 206086 107617 128884 245712
7321B45712P876j12272m182J41457K1905j30199l2964J84338M4932j39306n1216
$$ 245712 253588 141316 137134 278591 300496 170297 137333 321671 366603 227297 176081
7310A76081K19741P1353j61222r8008K77681J12587j91583j66174L67638J85587
$$ 176081 395822 467175 305953 207945 485626 598213 406630 240456 608094 793681
7300G93681k13848k51726M71837K96469k55279m19527O75111N06555k73161o26396
$$ 793681 579833 328107 799944 1096413 841134 421607 1096718 1603273 1330112 703716
7290G03716R03424Q67723k86256j078673J513983J769830j70464j967347L030567
$$ 703716 1607140 2474863 2188607 1109934 2623917 4393747 4223283 2255936 5286503
7281E286503M693106J031946l941241J0847269K7176715L4398386L4881571K7955609
$$ 5286503 9979609 11011555 7070314 17917583 45094298 79492684 114374255 142329864
7273A42329864J4646073k122311j8386919l0334802l5472872l3258452A2787883
$$ 142329864 156975937 154853626 136466707 106131905 70659033 37400581 12787883
7265G606615L517310k184149D046619j394550J830682m03310j999961q09825J090620
$$ 7606615 11123925 8939776 4046619 2652069 4482751 4079441 2079480 1269655 2360275
7256B360275l6813j049877n87588P27575Q4011o14011m22198M84021J13120l94710
$$ 2360275 2323462 1273585 685997 1413572 1497583 883572 461374 945395 1058515 663805
7246F63805B98261L45343J22187k55127B16281K46031J21667j71171A66126J77369
$$ 663805 298261 643604 765791 510664 216281 462312 583979 412808 166126 343495
7236C43495J17348j13223A44440J05470J00454p6775A15275R1409R6992n3519
$$ 343495 460843 347620 144440 249910 350364 273589 115275 206684 303676 250157
7226B50157I7600M0569R7494k3733A01444J1864P9778j4118H9260J3026P9464
$$ 250157 97600 138169 235663 211930 101444 113308 193086 178968 89260 102286 181750
7215A81750J314p8791j4970J07867P1725K3161q543k2053k6481j9198k443n522
$$ 181750 183064 104273 89303 197170 268895 292056 283513 261460 234979 215781 213338 207816
7203B07816m0275p6026m2313M5439J5080l2825l8009L2062K0277k5183B8037J8469
$$ 207816 167541 91515 49202 94641 109721 76896 38887 70949 91226 66043 28037 46506
7191D6506K3835j1516n500L7577J8060k5112l3387L9247L6248k0532k2937M5563
$$ 46506 70341 58825 53325 90902 108962 83850 50463 89710 125958 105426 82489 128052
7179A28052L8807k7774m7439N4148O3626j2226m9851M5381O0249k5739j05568
$$ 128052 166859 139085 91646 145794 209420 197194 147343 192724 252973 227234 121666
7168A21666N7644J12779r536j07210O6200J48126n292j58486M7105K21957L7539
$$ 121666 179310 292089 282553 175343 241543 389669 384377 225891 272996 494953 532492
7157E32492j38323J24752L31155M4606l09324N0568N39152J53709m46900L8417
$$ 532492 394169 518921 850076 894682 585358 635926 1175078 1328787 881887 920304
7147I20304R96874L98682n06231N63813K310651J276995j299107K724982J2946643
$$ 920304 1917178 2315860 1809629 2373442 4684093 5961088 4661981 7386963 20333606
7138B0333606J8338509K0252820J8173907J2107971L348873o221460j4314503
$$ 20333606 38672115 58924935 77098842 89206813 92555686 86334226 72019723
7131G2019723j9151341j9888423A6250014F313142n33734L02618j507557j257636
$$ 72019723 52868382 32979959 16250014 6313142 5779408 6082026 4574469 3316833
7123C316833J2970k02439r43711q39852J67602J14612m70380D66471J93011L17074
$$ 3316833 3329803 3127364 2183653 1343801 1511403 1626015 1155635 466471 659482 976556
7113I76556o0906j51830Q6938O4608j65135k79374l3542J46850n3623k32405C6875
$$ 976556 915650 763820 850758 915366 750231 470857 437315 584165 530542 298137 36875
7101H4117O636a26A07181N9960o0910j1991J48797Q6756l6093r5340O342N3476
$$ 84117 90753 -126 107181 167141 106231 94240 243037 329793 293700 198360 204702 258178
7089B58178l4718r9280J6924P4267j0450p8746j622N9381j0597p1156J2475O3276
$$ 258178 223460 124180 141104 215371 204921 126175 124553 183934 173337 102181 114656 177932
7077A77932j0972q2125j193P4785q66n5398o45M4811k1249B8976M0044Q3723p234
$$ 177932 166960 84835 83642 158427 157561 102163 101518 146329 125080 28976 69020 152743 145509
7064A45509p1367L7675Q2029o562q4024m907Q2765J147r0401j669R7931P251q8145
$$ 145509 74142 111817 193846 187284 103260 98353 181118 182265 91864 90195 188126 195377 107232
7051A07232j455J04096P864j00750Q977J25217J4427j09949l352J43321K3677
$$ 107232 105777 209873 217737 116987 125964 251181 265608 155659 152307 295628 319305
7040C19305j27878j6371J93787O5384j22987l9206K83091K30702M0229j13874
$$ 319305 191427 175056 368843 434227 311240 272034 555125 785827 826056 712182
7030G12182j34447m3704R8153K22394J91264l4676l04790k05092L45427K64712
$$ 712182 577735 534031 632184 854578 1045842 1011166 706376 501284 846711 1111423
7020A111423r9432k36434J39626J64756k53770j86957O76063M45302k67474m44070
$$ 1111423 1011991 775557 915183 1079939 826169 639212 1315275 1760577 1493103 1049033
7010A049033Q46323P77443l89649j131785J601963J778118k58154k065429L256469
$$ 1049033 1895356 2672799 2283150 1151365 2753328 4531446 4273292 2207863 5464332
7001E464332M745284Q90510m256154J1506114K7783843L4848637L5090732K7849938
$$ 5464332 10209616 11100126 6843972 18350086 46133929 80982566 116073298 143923236
6993A43923236J4252308k710396j9039783l0893322l5822958l3358509A1892417
$$ 143923236 158175544 155465148 136425365 105532043 69709085 36350576 11892417
6985G718364L474363k409625C759469j026341J875323m99917B010848p05396J141177
$$ 7718364 11192727 8783102 3759469 2733128 4608451 4108534 2010848 1305452 2446629
6976B446629o5635j102513o04276P44653N8750o44830l62157N41798R2185m24825
$$ 2446629 2380994 1278481 674205 1418858 1477608 832778 470621 1012419 1104604 679779
6966F79779C11647L82195J12948k83274B07929K84188J26039j89871A73741K01016
$$ 679779 311647 693842 806790 523516 207929 492117 618156 428285 173741 374757
6956C74757J14116j33560A34661J51201J11532r2592A25622J10881J04450o5473
$$ 374757 488873 355313 134661 285862 397394 304802 125622 236503 340953 275480
6946B75480A04069N0252J02374l6071I9542M7694Q7771k7149I5117J6394Q3737
$$ 275480 104069 154321 256695 220624 99542 147236 235007 207858 95117 111511 195248
6935A95248j4009H5934M824Q0316m255p9716j4982P0924L078o7493k2438O5562
$$ 195248 181239 85934 90758 171074 166819 87103 72121 143045 146123 78630 56192 121754
6923A21754R507n4343l2107N6658J3894m5853l1201N5010J6364l8821l4330M8427
$$ 121754 131261 76918 44811 101469 115363 69510 38309 93319 109683 70862 36532 84959
6911H4959J9834l1079B9905L4289K1030k4088B5755L6526K2973k0323B4651K4163
$$ 84959 104793 73714 29905 64194 85224 61136 25755 62281 85254 64931 24651 48814
6899D8814K3590j4275B4554K0135K2742j1754B1936J4555K3848q767A9659J3477
$$ 48814 72404 58129 24554 44689 67431 55677 21936 36491 60339 51572 19659 33136
6887C3136K5590m762B5154Q11K4956q55B4840m185K3848J738j9965n147J9463
$$ 33136 58726 53964 25154 25965 50921 50066 24840 20655 44503 46241 26276 21129 40592
6874D0592J143k0362p206K1784L138j9317I167K4104P150j3491j0528J4710N909
$$ 40592 41735 21373 14167 35951 39089 19772 9167 33271 40421 26930 16402 31112 37021
6861C7021j3736F461J7129Q908j0379H514J4174Q863q394E054J1504J2605p028
$$ 37021 23285 6461 23590 32498 22119 8514 22688 31551 23157 5054 16558 29163 22135
6848B2135I272J1402R751o337F142K714J2232k682q607J0133R905m211I593Q0
$$ 22135 9272 20674 30425 24088 6142 8856 21088 18406 9799 19932 29837 25626 9593 9673
6834I673J1895n72j0084K644R687j941H004j071J2294J123r863k203J0577K035
$$ 9673 21568 20996 10912 13556 23243 21302 8004 6933 19227 20350 10487 8284 18861 20896
6820B0896r016E322Q190J231E074O78J3380L692p525E970N774L892n195l406Q981
$$ 20896 11880 5322 13512 14743 5074 5752 19132 22824 15299 5970 11744 15636 10441 7035 16016
6805A6016L966o742A682P510N590m516E113R501P131k208I458I58K585j026p29
$$ 16016 19982 13240 1682 9192 14782 10266 5113 14614 21745 19537 9458 958 3543 2517 1788
6790A788P941M274l912C084M346N710j955D129K278N961q28D839B197M718p98
$$ 1788 9729 14003 10091 3084 7430 13140 11185 4129 6407 12368 11540 4839 2197 6915 6117
6775F117A552O344O752j439D664F93P826J873m520M23O263J788k933K549P981
$$ 6117 1552 7896 14648 13209 4664 693 8519 10392 5872 6295 12558 14346 11413 13962 21943
6760B1943L595l095n158R0K551n50j433J132M42m351F327B75K571R01N919J3312
$$ 21943 25538 22443 17285 17375 19926 19376 17943 19075 19517 15166 6327 275 2846 3747 9666 22978
6744B2978J3780R133K755j979m061m593n642o816r643E210k1P438K240n019B033
$$ 22978 36758 45891 48646 46667 42606 38013 32371 25555 15912 5210 5189 12627 14867 9848 2033
6728C703M918p46l927M29K772j346B087K970M299j204A894q80O281J597l235k685
$$ 3703 8621 7875 3948 4377 7149 5803 2087 5057 9356 8152 1894 1014 7295 8892 5657 2972
6712B972K533P30k728j472L747J500k344O59N430L159k040n860G93f94A562L992
$$ 2972 5505 6235 3507 2035 5782 7282 4938 5597 11027 14186 12146 6286 793 -694 1562 5554
6696E554L356J73l714A891K876J187A821I08Q371O452K484k45R18L960j17m577
$$ 5554 8910 9083 5369 1891 4767 5954 1821 908 9279 15731 18215 17970 18888 22848 22731 18154
6680A8154K274N622N440J0383J3514J7720J7888J5725Q486K57j0977j6009k1533
$$ 18154 20428 26050 31490 41873 55387 73107 90995 106720 115206 115463 104486 88477 66944
6667F6944k0041j5395q064J771j85j935k433K116M335k174p740p618D515A970
$$ 66944 46903 31508 23444 25215 25030 23095 20662 22778 27113 24939 17199 9581 4515 1970
6652d74A33L141J291j947r25J778R4D08a360B537K225j199E77h78j00J0B865M356
$$ -474 133 3274 4565 2618 1693 3471 3565 408 -1360 2537 4762 3563 577 -878 -978 -968 2865 7221
6634G221J597k618D10b425I30J127m91l98B44b785N61B724K834j372a105j794
$$ 7221 8818 6200 410 -2425 930 2057 1566 1168 244 -2785 -2224 2724 5558 4186 -1105 -2899
6618b899A833K190l58k32O80o66j623J475L060Q83k761C15f59I91O11p33d29k104
$$ -2899 1833 4023 3665 3433 4113 3447 1824 3299 6359 7242 4481 315 -659 991 1602 869 -429 -2533
6600b533n99A479L739R82j421j199O57j41A731f99B068L449O85q04p86n55j533
$$ -2533 -3132 1479 5218 6200 4779 3580 4237 4096 1731 -699 2068 5517 6202 5398 4612 4057 2524
6583B524E49k5J138L99q59D92R66K928K880J839r13m039d62D36J883I80c160i53
$$ 2524 549 524 1662 2061 1202 492 1458 4386 7266 9105 8192 4153 -462 436 2319 980 -3160 -953
6564B763M12A238f84J9k04j068i65E98K63K893P645Q672O777L268J83j877l143
$$ 2763 3175 1238 -684 -665 -869 -1937 -965 598 861 3754 11399 20071 26848 30116 30299 28422 25279
6547B5279l902m789n349E407a005j983B328M976M879M900K757L76l496o249D413
$$ 25279 21377 16588 11239 5407 -1005 -2988 2328 7304 12183 17083 19840 20216 16720 10471 4413
6531G92C01N8e78q99j306l261m158j442Q09Q07K877J188m28j406J538b948A00
$$ 792 301 359 -578 -1477 -2783 -6044 -10202 -11644 -10835 -10028 -7151 -5963 -6391 -7797 -6259 -2948 100
6513D682L512J279k404A335d843J400H01K876L631N130M667L092K676K406L26
$$ 4682 8194 9473 7069 1335 -4843 -3443 801 3677 7308 12438 17105 20197 22873 25279 25605
6498B5605J971N706L164q14l705m988q11O083R395Q407M426l08m647p454j0999
$$ 25605 27576 33282 36446 35632 31927 26939 26128 32211 41606 50013 54439 54131 49484 42030 31031
6483C1031j2495G045A091J086J087j576a278j834r65j302a238B653J870m48j618
$$ 31031 18536 7045 1091 2177 3264 1688 -1278 -3112 -4077 -5379 -1238 2653 4523 4075 2457
6468B457RJ163l93A371J478O937R982J1856J2484J0974P251K149k899o552q689
$$ 2457 2466 3629 3236 1371 2849 9786 19768 31624 44108 55082 62333 64482 61583 55031 46342
6453D6342r271o308l902k879k889l708l350k986k094k000k288H9g14B225O048
$$ 46342 37071 30763 26861 23982 21093 17385 14035 11049 8955 6955 4667 89 -714 2225 8273
6438H273M849J563o77j176j130m32k127m333a414k642B388O023O142P058O864
$$ 8273 13122 14685 14008 12832 11702 11270 9143 4810 -1414 -4056 2388 8411 14553 21611 28475
6423B8475M606L575J188J032l98k556n691q260q602E058a40B869N166K702j937
$$ 28475 33081 36656 37844 38876 38478 35922 30231 21971 13369 5058 -140 2869 8035 10737 8800
6408H800D239a160n77A780L842M472J449k569B619a519E446N141O32l322C545
$$ 8800 4239 -1160 -1737 1780 5622 10094 11543 8974 2619 -1519 5446 10587 11219 7897 3545
6392D253L637K289N44P72K336K533P75K838O487P544M401j467n257l062M190P097
$$ 4253 7890 10179 10723 11495 13831 16364 17139 19977 26464 34008 38409 36942 31685 28623 32813 39910
6376C9910P969J731n288j1751q059Q854J2465K612j3855H272J273L0459K5080
$$ 39910 47879 49610 44322 32571 24512 33366 45831 48443 34588 8272 9545 40004 65084
6363F5084J3501J0685J3046M3139P8977J24211J49529J46464J16978O9638J5203
$$ 65084 78585 89270 102316 145455 224432 348643 498172 644636 761614 831252 846455
6352H46455l3704p0534r4355j09613j18122j17850j06363o7077k0531P626o213
$$ 846455 812751 742217 647862 538249 420127 302277 195914 128837 108306 115932 109719
6341A09719j7723j3627o535J3169L2915M8891M8847L0061j500l4776n7060o5618
$$ 109719 91996 78369 71834 85003 117918 166809 215656 245717 244217 209441 152381 86763
6329H6763m1305J3082L2811L4321K3857K0726J8742J8859N294L0467J05612J84100
$$ 86763 45458 58540 91351 125672 149529 170255 188997 207856 213150 243617 349229 533329
6317E33329K06544J70936Q7655j8038j02087j12197n1981J6497J1250n5208j37085
$$ 533329 739873 910809 998464 980426 878339 766142 714161 730658 741908 686700 549615
6306E49615j75328j80283E2507B0380K1685J4429J9368K0272P007j6395k9134
$$ 549615 374287 194004 52507 20380 42065 56494 75862 96134 103141 86746 57612
6295E7612j9898k85R313J71o372j508J2477J7209J2435M703k0K706L364k197j5189
$$ 57612 37714 37429 46742 46913 40541 39033 51510 68719 81154 85857 85837 88543 91907 89710 74521
6280G4521k3464B4596q816J0390M943m21j972M041O175J541J6746N0271Q2457
$$ 74521 51057 24596 15780 26170 31113 30692 28720 32761 38936 40477 57223 107494 189951
6267A89951Q8018R1159O6331L2749r811m9890q1364r2701q6970o7098l3273o275
$$ 189951 277969 369128 435459 468208 458397 408507 327143 234442 147472 80374 47101 40826
6255D0826J11q223j3222E991c930D189P585M36n032k122N304L415k701C317j372
$$ 40826 40937 32714 19492 5991 -3930 4189 11774 12210 7178 5056 10360 13775 11074 3317 1945
6240A945R651P734K221j275l994n402C622b779k38a085k09O15C342L709M09j57
$$ 1945 11596 19330 21551 20276 16282 10880 3622 -2779 -3017 -1085 -1294 -679 3342 7051 7460 7303
6224G303l362A05a909J36P76A76M158M397K738j180l416B613m09L701N664O097
$$ 7303 3941 105 -1909 -1773 -997 176 4334 8731 11469 10289 6873 2613 2204 5905 11569 17666
6208A7666M955K343k30j218R28J682p90m478o214l361J591K147J614L229P113
$$ 17666 22621 24964 24734 23516 24444 26126 25336 20858 14644 11283 12874 15021 16635 19864 26977
6193B6977J0385J2400J2920J1652P861L003k649q066j3031j7604k1312g33A2055
$$ 26977 37362 49762 62682 74334 82195 85198 82549 74483 61452 43848 22536 -733 12055
6179C6764K2005J7148R593J378p322j5052k1088A9767B774J119K505B191K413
$$ 36764 58769 75917 85510 86888 79566 64514 43426 19767 2774 3893 6398 2191 4604
6166D604Q818N418j972q324j617J6097K5990K5373K4854J8073M912m065j1773
$$ 4604 13422 18840 16868 8544 6927 23024 49014 74387 99241 117314 122226 118161 106388
6153A06388j8624k0905j3161R880K5833K3500J2573k198p515l279J1193K8391
$$ 106388 87764 66859 53698 63578 89411 112911 125484 123286 115771 112492 123685 152076
6141A52076M7381O5955P3495O3834L8947K110l8769p2931r2781r2554F5450I612
$$ 152076 199457 265412 338907 402741 441688 443798 405029 332098 239317 146763 65450 9612
6128A649J4301Q591O417l691r800D294a156o10o07m238J184B221Q420O216N48
$$ 1649 15950 24541 30958 27267 17467 4294 -1156 -1766 -2373 -6611 -5427 2221 10641 16857 17405
6113A7405n468E605e920j039F288K303N011J447k378n860k68R190J1651k632l955
$$ 17405 11937 5605 -5920 -6959 6288 8591 13602 15049 12671 6811 6543 15733 27384 24752 20797
6098B0797H060b435p489q71K720j502q58E22J1230M215k562n859O308J4760J4404
$$ 20797 8060 -2435 -9924 -10795 -8075 -9577 -10435 522 11752 15967 13405 7546 13854 28614 43018
6083D3018Q348O311J310n183r030m59P463l772j5679A3292m489M326n168b389
$$ 43018 51366 57677 58987 53804 44774 44315 51778 48006 32327 13292 8803 13129 7961 -2389
6068A1219J980a712C8159M4475K8975M42k5583l0479j4932j6932C454M7814L0732
$$ 11219 13199 -1712 38159 82634 111609 112051 86468 55989 41057 24125 3454 51268 82000
6055H2000j2591B1804N0845N9710m821E7963N8652J11514Q949A07562J21961K88260
$$ 82000 69409 21804 72649 132359 127538 57963 116615 228129 237078 107562 229523 517783
6043E17783J00959k81039L35918J469784J908987K000070J676602R79000N0904
$$ 517783 618742 337703 673621 2143405 4052392 6052462 7729064 8708064 8758968
6034H758968q87990j616134j978600j925555H28215B39948L10333o6478B10152
$$ 8758968 7870978 6254844 4276244 2350689 828215 239948 550281 483803 210152
6024A02355J42175m866j10668E0497P0287Q221n5746B2752M4525J0732l2410A3840
$$ 102355 244530 239664 128996 50497 120784 129005 73259 22752 67277 78009 45599 13840
6011E1198J5454j6564B0780J588O720j3515F382K3355Q713j0727I286Q065Q900
$$ 51198 66652 50088 20780 22368 29088 15573 6382 29737 38450 27723 9286 17351 26251
5998B6251n940F801N547R278l365D903B333R940j38B667b247E451Q09j203M904
$$ 26251 20311 6801 12348 21626 18261 4903 2333 12273 12135 2667 -2247 5451 6260 5057 9961
5983I961M315m357a572n697g00F47b133j670J122M64j139a258B928J038B80g359
$$ 9961 14276 9919 -1572 -7269 -700 647 -2133 -3803 -2681 -2217 -3356 -1258 2928 3966 280 -7359
5966b219C036o59N81N597L776j401m066l40M273N695J0680J9278K3356K1746J4926
$$ -2219 3036 2377 2958 8555 12331 10930 6864 6524 10797 16492 27172 46450 69806 91552 106478
5951A06478N661l671j2120j8224k2195k3178A2207D287N478L111k545E125j985
$$ 106478 112139 108468 96348 78124 55929 32751 12207 4287 9765 12876 10331 5125 3140
5938C140J615o42H47h89B17J041P56J053l45h9m104i29B734Q37m54O18J800k49
$$ 3140 4755 4113 847 -889 217 1258 2014 3067 2722 -89 -4193 -929 2734 3571 3117 3735 5535 5286
5920E286B189a908k220M70J060i64A084B6h06D970P816J1615R573M151l28l913
$$ 5286 2189 -1908 -4128 -3658 -2598 -964 1084 26 -806 4970 12786 24401 33974 38125 37797 33884
5904C3884n669p482q256E493A595G56f5j921o57C93J835M44A233i36n51c03E59
$$ 33884 28215 20733 12477 5493 1595 756 -65 -1986 -2643 393 2228 2672 1233 -936 -1487 -303 559
5886G36P1B83a464k890J284f90G32R11L93K84G70b650k201K408h36k547j760A473
$$ 736 807 283 -1464 -4354 -3070 -690 732 1643 2036 2320 770 -2650 -4851 -2443 -836 -3383 -5143 1473
5867I517R954Q565M504K4l745p619q880D978o27K981J552j176l032A72c420k124
$$ 9517 19471 28036 32540 32564 28819 21200 12320 4978 4351 7332 8884 7708 4676 172 -3420 -5544
5851e544K087a559M12j169m908k087L21L47o46j189K487K121J266p6n3j157o16
$$ -5544 -3457 -1559 -1147 -2316 -7224 -9311 -8990 -8643 -9289 -10478 -7991 -5870 -4604 -4680 -4733 -5890 -6506
5834f506j55j731m336M757b591C574j137M95D10a982l6N00o86j821M32a173G95
$$ -6506 -6661 -8392 -12728 -7971 -2591 3574 2437 2932 410 -1982 -2018 -1518 -2204 -4025 -3593 -1173 795
5816I83d61k190j672L02J282R40O82K97J5J49A044R90p86a180j665J383D582g969
$$ 983 -461 -2651 -4323 -4021 -2739 -1799 -1117 -820 -805 -656 1044 2034 1248 -1180 -2845 -1462 4582 -7969
5797e503P98P07I30L944K488K45bj3947n772K845Q148b136G130C62c501n69A68
$$ -5503 -4705 -3998 930 4874 7362 7607 -2 -13949 -19721 -16876 -8728 -2136 7130 362 -3501 -4070 168
5779D91a071b43A891L759M84j055J079M436Q527P087L638o28l359m922m898m238
$$ 491 -1071 -243 1891 5650 6134 5079 6158 10594 19121 26208 29846 29218 25859 20937 16039 11801
5763A1801l355l235A309A09Q60J208N01m1M38J898K317K853K852M06k015m350
$$ 11801 8446 5211 1309 109 969 2177 2678 2637 3075 4973 7290 10143 12995 13401 11386 7036
5747G036F07e821K797C162M700K082K8j763l318A003c173l232l37P59J872f24
$$ 7036 607 -5821 -3024 3162 7862 9944 9972 8209 4891 1003 -3173 -6405 -6742 -5983 -4111 -624
5730B986K156N95J368l21l16J50P2m33j079j911E06b791J17f24E20O49j51A00
$$ 2986 5142 5737 7105 6784 6468 6618 6690 6257 5178 3267 506 -2791 -2674 -624 520 1169 1018 100
5711a246q7d46a88j089o93j55p13j498j970K46K696a407b56A74a97j669j453n24
$$ -1246 -1333 -446 -188 -1277 -1970 -2125 -2838 -4336 -6306 -6060 -3364 -1407 -256 174 -197 -1866 -3319 -3843
5693c843N2P23j01J226e68a79j698k011J202B50L742K048q46k474O38P738N643
$$ -3843 -3791 -3068 -3169 -1943 -568 -179 -1877 -3888 -2686 250 3992 6040 5194 2720 3358 11096 16739
5676A6739M422J621j257m010m372m741C345b335m043K567J465M92c83A560K661
$$ 16739 21161 22782 21525 17515 13143 8402 3345 -2335 -6378 -3811 -2346 -1854 -383 1560 4221
5661D221K390N74j605k786I99g87k928r1A324L822J139j751A107b237e16B869
$$ 4221 6611 7185 5580 2794 999 -787 -3715 -3806 1324 5146 6285 4534 1107 -2237 -516 2869
5644D561o86A629A56J229J132A221b098j489a255A1J851L632L888J897k271C599
$$ 4561 3875 1629 156 1385 2517 1221 -2098 -3587 -1255 11 1862 5494 9382 11279 9008 3599
5627a905A106K674l26C25a439A524M337K729K31k542A529c391A811N889L996K368
$$ -1905 1106 3780 3454 325 -1439 1524 5861 8590 8821 6279 1529 -3391 1811 7700 11696 14064
5611A4064J84j473m136B555A58M874L999Q28k217k463L38J792O24q11j067k52
$$ 14064 14248 12775 8639 2555 158 5032 9031 9859 7642 5179 5517 7309 7933 7122 6055 5803
5595E803K85L95p2j57j797A916J079L867K763q63k313R71M287K292j587k417K994
$$ 5803 6088 6483 6411 6254 4457 1916 2995 6862 9625 8762 6449 7420 11707 13999 12412 9995 12989
5578A2989N229K039l250n785k543J981m55l652n88O939L195l708A404d17A4938
$$ 12989 18218 20257 17007 11222 8679 10660 10205 6553 5965 12904 16099 12391 1404 -417 14938
5562B5237L059j260j515j116m774q659a44j679F220N325M54l41K939L736K746
$$ 25237 28296 27036 25521 24405 19631 10972 -144 -1823 6220 11545 11999 11658 14597 18333 21079
5547B1079k007n005K817J2347J0749Q691j154n045n557P321J6594J1805R570Q753
$$ 21079 19072 14067 16884 29231 39980 48671 47517 42472 36915 44236 60830 72635 82205 90958
5533I0958R674P604J236m111o90J1212J0556k349j9516l2157C0589I889K3370
$$ 90958 100632 108236 109472 105361 104671 115883 126439 124090 104574 72417 30589 9889 33259
5520C3259L6409K8616J7721J9769J2187R460O109j0307k3377j9484J3110M2224
$$ 33259 69668 98284 116005 135774 147961 157421 163530 153223 129846 110362 123472 165696
5508A65696K9388J9167K820N966K7925N1822L0428q415j0526M9991J00653J13963
$$ 165696 195084 214251 217071 223037 250962 302784 333212 324797 314271 364262 464915 578878
5496E78878J21233J38364J70446K23074L58812O23402R30874J137206J145762
$$ 578878 700111 838475 1008921 1231995 1590807 2214209 3145083 4282289 5428051
5487E428051R29521N04237n3359o42451j152958j499865j635013C34911O43806
$$ 5428051 6357572 6861809 6808450 6165999 5013041 3513176 1878163 334911 978717
5478I78717R21889N08382J24973j68340l40459l90288l49610k69997j98933j50835
$$ 978717 1900606 2408988 2533961 2365621 2025162 1634874 1285264 1015267 816334 665499
5468F65499j14449q1308n8931m7592m1005l3749n2864l2458j6481j1923j3753
$$ 665499 551050 469742 410811 363219 322214 288465 235601 203143 186662 174739 160986
5457A60986j3047j1356j3401p337o432o751n076m711n108o619n931m560l762l565
$$ 160986 147939 136583 123182 115845 109413 102662 97586 92875 87767 81148 75217 70657 66895 63330
5443F3330l469j111q91l295l089m512l488k432K811N536M250O8l005J348M957
$$ 63330 59861 58750 57859 54564 51475 46963 43475 41043 43854 49390 53640 53708 50703 52051 57008
5428E7008L334m452k998M451R714N039m468j2973j4325q555j050p60j766l880
$$ 57008 60342 55890 52892 57343 67057 72096 67628 54655 40330 31775 30725 29965 28199 24319
5414B4319k227L520M729J369l230n760m053j974m070k612P997J2264Q159P14o416
$$ 24319 22092 25612 30341 31710 28480 22720 18667 16693 12623 10011 18008 30272 38431 39145 32729
5399C2729q750p142n825C785L44J1619J0846N314j472m634l454j826l593p630
$$ 32729 23979 16837 11012 3785 4129 15748 26594 31908 30436 25802 22348 20522 16929 9299
5385I299A656K279M327j357D96b23A1277J0423O526J161m797q680p192K935O057
$$ 9299 1656 3935 8262 6905 496 -223 11277 21700 28226 29387 24590 15910 8718 11653 17710
5370A7710K288k067n664E568A170N83J966R46j668a188n81C910N908L080j6j680
$$ 17710 19998 17931 12267 5568 1170 1753 3719 4665 2997 -1188 -1769 3910 9818 12898 12882 11202
5354A1202j641n53j172k324l64J320J494o65r52K249J093l187K169J9431K5627
$$ 11202 9561 9008 7836 5512 5148 6468 7962 7297 6345 8594 9687 6500 8669 28100 53727
5339E3727K4987J9628J2464L782n417j4279k2938k7548A7064C067O792L307k097
$$ 53727 78714 98342 110806 114588 109171 94892 71954 44406 17064 3067 9859 13166 11069
5326A1069k487l51J79j268j655p08Q57K355J907l52l476k197K206K926J602K151
$$ 11069 8582 8231 8410 7142 5487 4779 5636 7991 9898 9546 6070 3873 6079 9005 10607 12758
5310A2758L176J052m478B944n23J0448O613M53n145n486q52J769L93o13M53J752
$$ 12758 15934 16986 12508 2944 2421 12869 19482 19935 14790 9304 8452 10221 10614 10001 10454 12206
5294A2206Q32j211r99J351K555J749K142M907O565M739J214k36R13J076l039p788
$$ 12206 13038 11827 10828 12179 14734 16483 18625 23532 30097 34836 36050 35814 36727 37803 34764 26976
5278B6976o773L640J1094J0781R508R707R470P483J629o619j4978j7706n972L726
$$ 26976 20203 23843 34937 45718 55226 64933 74403 81886 83515 76896 61918 44212 38240 41966
5264D1966l915j6346J0170L7644L1376J3410n168q431N738J9396J9063O955j4971
$$ 41966 38051 21705 31875 69519 100895 114305 109137 100706 106444 125840 144903 151858 136887
5251A36887k7618J7060P5521O5831K6291P3997K77830M57177N24330M74188L15739
$$ 136887 109269 126329 201850 267681 293972 367969 645799 1102976 1627306 2101494 2417233
5240B417233P9083j76551l90958n16266n21871l96547j68364j4075l7967p7951
$$ 2417233 2496316 2319765 1928807 1412541 890670 494123 325759 311684 273717 195766
5230A95766n5607r122p832l2153k8627O996J0815p529j7044o168N81o344j5489
$$ 195766 140159 131037 123205 91052 62425 69421 80236 72707 55663 49495 50076 43732 28243
5217B8243j0521l507k945J1548K3840J4990l726j9539A8517R39P534O750J4689
$$ 28243 17722 14215 11270 22818 46658 61648 57922 38383 18517 19456 26990 33740 48429
5204D8429J2904k412j7690k058K1126J0259j1041m829K2298J6316p415K3399O8506
$$ 48429 61333 58921 41231 39173 60299 70558 59517 54688 76986 93302 85887 109286 177792
5191A77792N2133o501L997K08725L54120L75762L05444J69557J1026j30184k03929
$$ 177792 229925 223424 227421 436146 790266 1166028 1471472 1641029 1652055 1521871 1317942
5180A317942j42537P7164K85327L20554K02696J702j96678l04753k57467j02862
$$ 1317942 1175405 1252569 1537896 1858450 2061146 2062848 1866170 1561417 1303950 1201088
5170A201088k1823q7240k10707k92909k69348r6288L0939j7211p5863n8727J1595
$$ 1201088 1179265 1092025 881318 588409 319061 222773 253712 236501 160638 101911 113506
5159A13506P808l2183l5670K4165L1664k272k0968j6033m564K844K608k487j0089
$$ 113506 121314 89131 53461 77626 109290 107018 86050 70017 65453 68297 70905 68418 58329
5146E8329r811P109J8969J1072n01m356N906J6219J5364J6274L7679P0624R5307
$$ 58329 48518 55627 74596 85668 85167 80811 86717 102936 118300 134574 172253 242877 338184
5133C38184J05846J01675Q5402N8032K4044j9028n8300r0738j08581j09778r5259
$$ 338184 444030 545705 631107 689139 713183 694155 635855 545117 436536 326758 231499
5122B31499o4676l0078k1894k8943l8116A4238P992K5471J2275k178o192q179
$$ 231499 166823 136745 114851 85908 47792 14238 22230 47701 59976 57798 51606 43427
5110D3427m668m747o868q744G855d208C272J2690Q601K992j534k832k824l100
$$ 43427 38759 34012 27144 18400 7855 -4208 3272 15962 24563 27555 26021 23189 20365 17265
5096A7265k378k63n84l925B613d039D523N959K237n41j851j960j663r97n00p80
$$ 17265 14887 14624 14040 10115 2613 -4039 4523 10482 12719 12178 10327 8367 6704 5707 5207 4427
5080D427n94K54R26o7m56Q18J121o74k447r55J937J922q22B187a289A525M981
$$ 4427 3833 4087 5013 4946 4490 5308 6429 5755 3308 2353 4290 6212 5390 2187 -1289 1525 6506
5063F506M348L527J295j532l903D735A2K694P752Q993Q350P014O205O337P146
$$ 6506 10854 14381 15676 14144 10241 4735 12 2706 10458 19451 27801 34815 41020 47357 54503
5048E4503P328N426J673l048p562j1022j1969q764j978K472K976M893J2310K0905
$$ 54503 61831 67257 68930 65882 58320 47298 35329 26565 24587 27059 30035 34928 47238 68143
5034F8143K5487K4013J7426O112o830j8073k5505k6942k2297j3591p968o079n478
$$ 68143 93630 117643 135069 141181 134351 116278 90773 63831 41534 27943 19975 13896 8418
5021H418j268J127q25l539F51M32J415k91j044K02J811J515J065K21q06j625r14
$$ 8418 7150 8277 7452 3913 651 1083 2498 2207 1163 1365 3176 4691 5756 5977 5171 3546 2632
5004B632Q65J910J043j30j459k249E73k00O17j11i07j032N08b66A15M80J210J670
$$ 2632 3497 5407 6450 6320 4861 2612 573 373 990 879 -907 -1939 -1431 -266 115 595 1805 3475
4986C475Q06l99j511B18a198a0B175J239k26j454c61k496j70c2B734J724M13j190
$$ 3475 4281 3882 2371 218 -1198 -10 2175 3414 3188 1734 -361 -2857 -3027 -32 2734 4458 4871 3681
4968C681A458a207k082a255F37J025j78C35a996j265a368a85j44j294k088a851
$$ 3681 1458 -1207 -3289 -1255 637 1662 1484 335 -1996 -3261 -1368 -185 -329 -1623 -3711 -1851
4951d10a72j511k095a392E89J43g51k396N62g03A48d76j486p03J11j87k47Q16
$$ -410 -172 -1683 -3778 -1392 589 732 -751 -3147 -2585 -703 148 -476 -1962 -2665 -2554 -2741 -2988 -2172
4933b172a055B11J348R67j1r03d4k031j025a416a41B98a15j546k182a302H48J530
$$ -2172 -1055 211 1559 2526 2515 1612 -44 -2075 -3100 -1416 -141 298 -115 -1661 -3843 -1302 848 2378
4915B378P35M45O13J370J862J525J219j28j279k756B428c70A54J598L33H58g75
$$ 2378 3113 3558 4171 5541 7403 8928 10147 10019 8740 5984 2428 -370 154 1752 2085 858 -775
4897a361k48q28j804b051B78J721N74j39q87A70a386j068l04k88J367c03D35K61
$$ -1361 -1609 -2437 -4241 -2051 278 1999 2573 2434 1547 170 -1386 -2454 -2758 -3046 -1679 -303 435 696
4879F96N3L68K29m63e85j264M69b73J1j172j466J245I6J425K58F97a309m24a6
$$ 696 749 1117 1346 883 -585 -1849 -1380 -273 -262 -1434 -2900 -1655 96 1521 1779 697 -1309 -1733 -16
4859A180M64l55D29i19j063Q19D43R95j57b7j769j599J11N63P85Q85d67C3M52
$$ 1180 1644 1289 429 -919 -1982 -1163 443 1438 1281 -27 -1796 -3395 -3284 -2721 -1936 -1051 -467 33 485
4840D85K72l07b58p74p56p43p7N84P6j093N7a029E78O34m40e41j566j076P55h24
$$ 485 757 450 -258 -1032 -1788 -2531 -2608 -2024 -1948 -3041 -2984 -1029 578 1212 772 -541 -2107 -3183 -2428 -824
4819C35A67a019j49E49R08l18B7a336k76f25H30P03n18i53k477n37J845e14A99
$$ 335 167 -1019 -1168 549 1457 1139 27 -1336 -1612 -625 830 1533 1015 -953 -3430 -3967 -2122 -514 199
4799D14A19h76q16K33O36o6q32j136k46Q76J093f4E53B63d35r04p04q25L17J016
$$ 414 119 -876 -1692 -1459 -823 -889 -1721 -2857 -3103 -2227 -1134 -64 553 263 -435 -1339 -2043 -2868 -2551 -1535
4779a535j31j229J366A127J929Q59p60A117a428q93a014b89N9p83j937j741N42
$$ -1535 -1666 -2895 -1529 1127 3056 3915 3155 1117 -1428 -2321 -1014 -289 -230 -1013 -2950 -4691 -4149
4762d149K64L06a411D87N01b1j959r44a366b16C81J13A91e40D34K608K158N23
$$ -4149 -3885 -3579 -1411 487 988 -21 -1980 -2924 -1366 -216 381 494 191 -540 434 3042 5200 5723
4744E723q43j677A291e72j691p65N38k88N39h54c70j32R8d3j30j476j940a164
$$ 5723 4880 3203 1291 -572 -2263 -3028 -2490 -2778 -2239 -854 -370 -502 -404 -43 -173 -1649 -3589 -1164
4725B0a68j255j007a002F61J035J381J105l97A536a090j076i07a70C81M00B95
$$ 20 -168 -1423 -2430 -1002 661 1696 3077 4182 3785 1536 -1090 -2166 -907 -170 381 781 295
4707a389n55c31E97j84C4b24p44k493a379F86P25B69b470j438J708J52j533J202
$$ -1389 -1944 -331 597 413 34 -224 -968 -3461 -1379 686 1411 269 -2470 -3908 -2200 -2048 -3581 -2379
4689b379F5J904J511L93r66D73b109E06J128E15b054p38O54r24J335A185J494
$$ -2379 65 1969 3480 3873 2907 473 -2109 506 1634 515 -2054 -2792 -2138 -3062 -1727 1185 2679
4672B679q60a035k371h65K77k786f76B917J972k44j137j207j121B34J463J939
$$ 2679 1819 -1035 -3406 -865 -588 -3374 -676 2917 4889 4645 3508 2301 1180 234 1697 3636
4656C636L83j546a25j525k71l89e41A451J30d94k668D17J954m48D44p9o9a573
$$ 3636 4019 2473 -125 -1650 -1921 -2310 -541 1451 1581 -494 -3162 417 2371 1923 444 365 296 -1573
4637b195H18J358G08i90B204K579n41A148b010O60q96a59C453J680p40o90J872
$$ -2195 818 2176 708 -990 2204 4783 4242 1148 -2010 -1350 -2246 -159 3453 5133 4393 3703 5575
4620E575J376j788A94g71C073n32a376F75M442J687j501j098J506J38B605b350
$$ 5575 6951 5163 194 -771 3073 2541 -1376 675 5117 6804 5303 4205 5711 5849 2605 -2350
4603a57A101h16g5C991R83k116o51K856nI01d96F225K207k569B924L772K956j817
$$ -157 1101 -816 -75 3991 4974 2858 2207 5063 5058 901 -496 6225 8432 5863 2924 6696 9652 7835
4585G835k765M430Q482J0876J4425J8022J7566J2447M433m881j3926j9995k0614
$$ 7835 5070 9500 17982 28858 43283 61305 78871 91318 95751 90870 76944 56949 36335
4572C6335j4598o755n960B626M851O084j195D458K56O939Q2E196M51P281N84F652
$$ 36335 21737 14982 9022 2626 7477 13561 12366 4458 4714 11653 11735 5196 5647 12928 13512 6652
4555B654O490N22B918M281R168Q80q101j587J0191J941r688C003J4222N440o436
$$ 2654 9144 9666 2918 7199 16367 17247 9146 7559 17750 19691 10003 3003 17225 22665 16229
4540A6229F054P136M082q512A626J5716N177r507D407J8263Q236r342C687J7879
$$ 16229 6054 13190 17272 8760 1626 17342 22519 13012 4407 22670 30906 21564 3687 21566
4526B1566J1300p831G067J7852J5018o104A1988J1615J8093m825A1225J3104K2695
$$ 21566 32866 25035 7067 24919 39937 33833 11988 23603 41696 36871 11225 24329 47024
4513D7024m402A5330J5648K8084k325B4555P163L3861p68B6677R988M6383O653
$$ 47024 42622 15330 30978 59062 56737 24555 31718 65579 64811 26677 36665 83048 89701
4500H9701m0448j8846N3670J1201m5280j815P2246J8725n7006l3843R8455L5221
$$ 89701 49253 30407 84077 95278 49998 48183 120429 139154 82148 48305 146760 181981
4488A81981o5497n7649J32585N9059p7398G4977J88330J06517q7813A20960K65676
$$ 181981 116484 58835 191420 250479 173081 74977 263307 369824 282011 120960 386636
4477C86636J94247j00113B01524M34145M22283l4193l64884O31361R10398r0878
$$ 386636 580883 480770 201524 635669 1057952 1023759 658875 1290236 2200634 2109756
4467B109756A52219M163260O696818Q070348P962732O168854K974721r26068m601384
$$ 2109756 152219 4315479 11012297 19082645 27045377 33214231 36188952 35262884 30661500
4458C0661500p204707q209691p569797A989808p26584J015517m96574H25694P955
$$ 30661500 23456793 15247102 7677305 1989808 1263224 2278741 1782167 825694 833649
4449H33649K88998k17340C77472o2929K57749n3368B37446p7125J83955p095A67387
$$ 833649 1122647 905307 377472 314543 572292 518924 237446 160321 344276 337181 167387
4437I7848J30816R260j09756E7381J00649J7325p5680C7772P9210K0479n2122
$$ 97848 228664 237924 128168 57381 158030 175355 99675 37772 116982 137461 85339
4426H5339B7384O1350K1928l6446B2607M4748K2029k6247A6202L3549K1100j9356
$$ 85339 27384 88734 110662 74216 22607 67355 89384 63137 16202 49751 70851 51495
4414E1495A1456K7797J9450j2954A5602J9093J7457j0835I775J5625J9305n921
$$ 51495 11456 39253 58703 45749 15602 34695 52152 41317 9775 25400 44705 38784
4402C8784A5272N012J7178l416A3665K888J5682j615A2638l017J6516R51j2865
$$ 38784 15272 20284 37462 34046 13665 16553 32235 30620 12638 9621 26137 27088 14223
4389A4223l997J2127N41A0297k652J2748J290A0646m712J3320L428q840D050J0408
$$ 14223 10226 22353 22894 10297 7645 20393 21683 10646 5934 19254 22682 13842 4050 14458
4375A4458L786p142c23A0707M367n714B869R459M854m361D836M521M025m822H03
$$ 14458 18244 11102 -323 10707 15074 9360 2869 12328 17182 12821 4836 9357 13382 8560 803
4359I315N383l005B929J812O271j166C142M444P428J205m072Q68J2787J5291J4552
$$ 9315 14698 11693 2929 4741 11012 9846 3142 7586 15014 16219 12147 13015 25802 41093 55645
4344E5645J3820J2139Q580K346o289j4883k1648k3680H181P05J381m112k950L874
$$ 55645 69465 81604 90184 92530 86241 71358 49710 26030 8181 8886 10267 6155 3205 7079
4330G079J057l222m08L697N36l653j944K999Q10C201a151D590K289k142c31Q0
$$ 7079 8136 4914 4506 8203 8739 5086 3142 6141 6951 3201 -1151 4590 6879 4737 -331 -251
4314b51A293d10B325M802J624k578A314J351L022o50B475Q06J877j063B45a231
$$ -251 1293 -410 2325 7127 8751 6173 1314 2665 5687 5037 2475 3281 5158 4095 245 -1231
4297A553l14f41B593J993q30B28a063A733J05a99k402J056M12D31L248K022l54
$$ 1553 1239 -641 2593 4586 3756 228 -1063 1733 1838 -199 -2601 -1545 -1133 431 3679 5701 5347
4280E347B196a812P57I4e04G78J579l68h05B80L194O81A905f61A242J872q25B5
$$ 5347 2196 -1812 -1055 94 -504 778 2357 1989 -805 280 3474 4155 1905 -661 1242 3114 2289 25
4261a877g98Q8k12A88N54d69p49I61J089k75m9J272P65p83G66i38c76M1q6E24
$$ -1877 -798 -710 -922 188 742 -469 -1218 961 2050 1775 1726 2998 3763 2980 766 -938 -376 -335 -421 524
4240F86e14j274A018J865K35q47K21O21n64D1a572H77J151o94a28p29J68K78h5
$$ 686 -514 -1788 1018 2883 3118 2271 2492 3113 2549 41 -1572 877 2028 1334 -128 -857 -689 -411 -85
4220F6e14k78H34J521k2I53a434O77D44E7g55D24P50n81h21o53M20k6e03F67P42
$$ 66 -514 -792 834 2355 2333 953 -1434 -757 444 57 -755 424 1174 593 -821 -1474 -1054 -1080 -503 667 1409
4199A409l77A4g12J76b19FK31F8g29j201h62i2a6o6G89J022O0p30A82i02j295
$$ 1409 1032 14 -712 -536 -219 6 237 68 -729 -1930 -862 -92 -16 -82 789 1811 1871 1141 182 -902 -2197
4178b197M61d20C86a1j145K08a70F2g68n56d49D9M9L95R16N18l08p14C79N00J531
$$ -2197 -1736 -420 386 -11 -1156 -948 -170 62 -768 -1324 -449 49 98 493 1409 1927 1619 905 379 879 2410
4157B410K195J845N78o77j969B113B82c21j80a70H51J524J650Q81l34j189j100
$$ 2410 4605 6450 7028 6351 4382 2113 282 -321 -501 -170 851 2375 4025 4906 4572 3383 2283
4140B283j34m2l31n35k90l86d81j523L06O02n11g17A303J463M87o59j054p11l51
$$ 2283 2149 2107 1776 1241 951 565 -481 -2004 -1698 -1096 -1607 -717 1303 2766 3253 2594 1540 829 478
4121D78j64J5k2JFa18aF1e29n77J0d08E73Q02M40q95g88j523J137M90J64qb56
$$ 478 314 329 307 308 6 -118 -1 61 -529 -1106 -1096 -408 573 1375 1815 920 -788 -2311 -1174 -684 -520 -528 -256
4097b51j09K8k87r78K89F70J431M02j151A05f19B50M67B73a7G52J544J386J012
$$ -251 -360 -332 -619 -1597 -1308 670 2101 2503 1352 105 -619 250 717 273 -17 752 2296 3682 4694
4078D694J43p85j211q25j85k11o08C87b39j51m18k6c79a26d2E3K90J67I5h33n62
$$ 4694 4837 4052 2841 2016 1831 1620 1012 387 -239 -390 -808 -834 -379 -126 -42 53 343 510 95 -833 -1395
4057a395k1j79p1O81F96K170J647N78r66j892D61d62j24j8j50J82K33r9l47o7
$$ -1395 -1416 -1595 -1666 -985 696 2866 4513 5091 4125 2233 461 -462 -586 -604 -754 -572 -339 -438 -785 -852
4037h52K46b45d9A1b7l62o87m10M84J56k20l17j5O56A7O74M11q1E00b08q80n66
$$ -852 -606 -245 -49 11 -27 -389 -1076 -1486 -1002 -846 -1066 -1383 -1398 -742 17 691 1102 1021 500 -208 -1088 -1654
4015a654Q9L12L30d04A98L40kC1f66m36c73E13K57j28P8L77P42R74N41j54p66
$$ -1654 -1565 -1253 -923 -404 198 538 536 31 -666 -1102 -373 513 770 642 720 1097 1839 2813 3354 3200 2434
3994B434r62D59c7a1B07M55N72O70N69J80m96r10n39L6n0i9j578n32g04A23J88
$$ 2434 1472 459 -37 -11 207 662 1234 1904 2473 2653 2157 1247 708 744 694 -99 -1677 -2209 -704 123 311
3973C11fn09o54m92j18L76N79FP45O97M20O4l98m72k86Nq3l16f76K04I27R91L61
$$ 311 -6 -515 -1169 -1661 -1779 -1403 -824 6 751 1448 1868 1932 1534 1062 776 781 698 382 -676 -472 927 1918 2279
3950B279n29G52i8l89k21k11j92o0N36a61P5k88j164g00H88J119L68j33k30k26
$$ 2279 1750 752 -98 -487 -708 -919 -1111 -1171 -635 -161 -86 -374 -1538 -700 888 2007 2375 2242 2012 1786
3930A786k71l02m01C31g7m5A37K54K96K80L04L9M3o00c30j130m52M61f04A35O37
$$ 1786 1515 1213 812 331 -77 -122 137 391 687 967 1271 1310 1353 753 -330 -1460 -1912 -1451 -604 135 772
3909G72L32J6m40f5q17o9c01a0k26n42o86p06o01N51N49P05b58C56L63M0C75b45
$$ 772 1104 1120 680 -65 -882 -951 -301 -10 -236 -778 -1464 -2170 -2771 -2220 -1671 -966 -258 356 719 759 375 -245
3886e72MJ80A72M76J35k36B35E8K0j7a18k65j31J51H3M92M58K75J12k61C90h09
$$ -572 -568 -388 172 648 783 547 235 58 78 61 -118 -383 -514 -363 83 575 1033 1308 1420 1159 390 -809
3863a432D97J055RG43c75j212o52K75K74O91L92K39P4e7C4gj86h0I6J17KL15N05
$$ -1432 497 1552 1561 743 -375 -1587 -2239 -1964 -1690 -999 -607 -368 -294 -57 34 -7 -193 -80 96 213 215 530 1035
3840A035K26j83D35b13j39O4k16n48l55J06O13C1J045J439J231N52l60q21j058
$$ 1035 1261 1078 435 -213 -352 -288 -504 -1052 -1407 -1301 -688 31 1076 2515 3746 4298 3938 3117 2059
3821B059l99l94n52A88d17k93m7r7J10Q0l4K64b0F25M50J20m96a28o10k4L72a53
$$ 2059 1660 1266 714 188 -417 -710 -757 -854 -744 -664 -698 -434 -20 625 1075 1195 699 -128 -738 -762 -390 -153
3798a24a9A21Ra80m40o37o24Q25c21a04j37k17j10Qk0J75b02j18k46l11L76D49
$$ -124 -19 121 130 -180 -620 -1257 -1881 -1056 -321 -104 -241 -458 -568 -560 -580 -405 -202 -320 -566 -877 -501 449
3775A432M06l06F31e90j159J14O13K12lk23j67R1K9J19d78C51O27N07J55j96n34
$$ 1432 1838 1532 631 -590 -1749 -1635 -1022 -810 -813 -1036 -1203 -1112 -1083 -964 -478 351 978 1485 1640 1444 910
3754I10A10g78q00j18P16a87F58N85M60J77o08I9a353m5O79K64j0J44c1C44Q1
$$ 910 110 -778 -1578 -1696 -980 -187 658 1243 1703 1880 1272 99 -1353 -1398 -719 -455 -465 -321 -31 344 425
3733D25A28c21l29k26k94o44j85N87K57M59C4Q97P40K16j66m30E39b17m4g6B12
$$ 425 128 -321 -650 -876 -1170 -1814 -1999 -1412 -1155 -696 34 931 1671 1887 1721 1291 539 -217 -261 -76 212
3711E13L87J38k17j74j19J93J37l8l36j41K98L41j17B72c7B75L56l05d07m93L76
$$ 513 900 1038 821 647 528 721 858 820 484 343 641 982 865 272 -37 275 631 326 -407 -900 -524
3690e24a1C7e08q04o33M19L35J05QJ23r9k77k73N67B57J421O56j33p35C77e63
$$ -524 -11 37 -508 -1312 -1945 -1526 -1191 -1086 -1078 -955 -1054 -1331 -1604 -1037 257 1678 2334 2201 1466 377 -563
3668a283L1N33b91N6j72m8l24m35k89O39d6F06L49j21B42i34l21A66J221Q09P63
$$ -1283 -1252 -719 -291 -235 -407 -455 -779 -1214 -1503 -864 -46 606 955 834 242 -934 -1255 166 1387 2196 2959
3647B959O40K33j12n66j021j043C7f91l42m6J08M27C0O50J87q3j43l7R4L55J94
$$ 2959 3599 3832 3720 3154 2133 1090 37 -691 -1033 -1079 -971 -544 30 680 867 784 641 604 698 1053 1247
3626A247k63C38c46n68l19N6K05K41J81K7j40n2J90R5k26k94k71J72L69b64I6
$$ 1247 984 338 -346 -914 -1233 -1177 -972 -731 -550 -523 -663 -715 -525 -430 -656 -950 -1221 -1049 -680 -264 96
3604D04M9K83M42P10N11J23j45l05k62n67D67c83q04o95K44P53c75k68n83K79
$$ 404 453 736 1178 1888 2399 2522 2377 2072 1810 1243 467 -383 -1187 -1882 -1638 -885 -375 -643 -1226 -947
3584i47a77D56L54J19J72n5k01a1p73m58f09B95N47K59n5D61d12j000q42q76K42
$$ -947 -177 456 810 929 1101 1046 845 -11 -784 -1242 -609 295 842 1101 1046 461 -412 -1412 -2254 -3130 -2888
3563b888J040f71b14q2k71m30o24l61M8J2O60e06C63N54N08p5n50A77c53j5D2
$$ -2888 -1848 -671 -214 -296 -567 -997 -1621 -1982 -1934 -1922 -1262 -506 363 917 1425 1350 800 177 -353 -368 42
3541C33Q5A40A4K51L3B9g22n59L37J41l44O8b63D28J89k82I5j3K01K11rB15d7
$$ 333 418 140 14 265 298 29 -722 -1281 -944 -803 -1147 -1079 -263 428 617 335 95 82 283 494 485 215 -47
3517F1M60N02N85O83N09J97l45q53q24N9N55P29M52o6o50H50c60j142o15M32L92
$$ 61 521 1023 1608 2291 2800 2997 2652 1799 975 1034 1589 2318 2770 2704 2054 850 -360 -1502 -2117 -1685 -1293
3496a293J73n7n82n54O06e64E97R90P47M85k83p10q31A68b62o9I2K55J54M6M42
$$ -1293 -1120 -1177 -1759 -2313 -1707 -564 597 1587 2334 2819 2536 1826 995 168 -262 -331 92 347 501 547 989
3475I89L66P29L83K5l31p50D04g62j199Q30a90C59K21B63e26j120q23N76O18K47
$$ 989 1355 2084 2467 2492 2161 1411 404 -762 -1961 -1131 -190 359 580 263 -526 -1646 -2469 -1893 -1275 -1028
3455a028j64n01l71R05M57O7j92lc62g0mk45n01k00k6K51Q1J13j46j91l8K01L33
$$ -1028 -1192 -1693 -2064 -1159 -702 -635 -827 -830 -362 -70 -74 -319 -820 -1020 -1046 -795 -714 -601 -747 -938 -976 -775 -442
3432d42a40J6l05o35o11l47J82J92J66J67J32L55L46K32j28n18p49K62N73L61
$$ -442 -140 -124 -429 -1064 -1675 -2022 -1840 -1648 -1482 -1315 -1183 -828 -482 -250 -378 -896 -1645 -1383 -810 -449
3412d49N4k0l42k73M36A50O00N80J78k60m32A93e53p78r52N89g01B39O18P8D09
$$ -449 -395 -415 -757 -1030 -594 150 750 1330 1508 1248 816 193 -553 -1331 -2283 -1694 -701 239 857 935 409
3390f97n22A51J222R54L28l78q14n83l42j50K22J01B40g54o46O62D96R52M79N8
$$ -697 -1219 151 1373 2327 2655 2277 1463 880 538 388 610 711 240 -754 -1400 -738 496 1448 1927 1985
3370A985l79m68n47B86O6J3j09j1K28L26J09j98f6r48k27e68GN31M6B82b1j9A7
$$ 1985 1606 1138 591 286 352 365 256 245 473 799 908 710 -66 -1014 -1241 -568 7 538 584 282 -21 -40 17
3346B49K02J74J47K83J68K5k95D74d9m59k51QL36d3Pm22n03j67N58B09N11J29
$$ 249 451 625 772 1055 1223 1248 953 474 -49 -508 -759 -751 -415 -43 -36 -458 -961 -1128 -570 209 720 849
3324H49l84b81q72m17k74m83K44P31L31M40G7J251J192O01J48o67j169C82d9A
$$ 849 465 -281 -1153 -1570 -1844 -2327 -2083 -1352 -1021 -581 77 1328 2520 3121 3269 2602 1433 382 -49 1
3303f90p84j67P83K96j38n33m08k7P45A71N06k1k86b87m90o42Q8c55F3J51G8b05
$$ -690 -1474 -1641 -858 -562 -700 -1233 -1641 -1668 -923 171 677 656 370 -287 -777 -1419 -1331 -355 63 214 78 -205
3280c59O8K6j15l62r15l79O94c60D45r4a91j236l76K11n42p46M2O39K17rk80K80
$$ -359 -291 -265 -380 -742 -1657 -2036 -1342 -360 445 351 -191 -1427 -1803 -1592 -2134 -2880 -2838 -2199 -1982 -1991 -2271 -1991
3258a991P22J74l56n47n6J4K67N48N32a48k0o21p46o80L97P83N02L5l35l50J49
$$ -1991 -1269 -1095 -1451 -1998 -2054 -2040 -1773 -1225 -693 -148 -168 -789 -1535 -2215 -1818 -1035 -533 -498 -833 -1183 -1034
3237a034M15b47g9m7p5k39l46p6c46B37L05l8k45j08b82k4J45f3j20k3ON7k09
$$ -1034 -619 -247 -79 -126 -201 -440 -786 -862 -346 237 542 504 259 151 -282 -306 -161 -63 -183 -206 -200 -143 -352
3214c52l25n16O3J41o8J5L60A34J081J096R36L71j69o92j070G98b6q99o64j21
$$ -352 -677 -1193 -1130 -989 -1057 -1042 -682 134 1215 2311 3247 3618 3449 2757 1687 798 -26 -925 -1589 -1710
3194a710R1K22J33N25A75J218J010M35l17q65F60d48n93d63C37O99M57L88L18
$$ -1710 -1619 -1397 -1264 -739 175 1393 2403 2838 2521 1656 660 -448 -1041 -463 337 1036 1493 1881 2199
3175B199M08J07j42k67n11m94F36c96j077q05M7M35Q44A95J383J148Q51K18l95
$$ 2199 2607 2714 2572 2305 1794 1300 636 -396 -1473 -2278 -2231 -1796 -952 195 1578 2726 3577 3795 3400
3156C400r89m75m51l85E42A6d50n13J17L72G4K70k2C8e18n68P0c98D56N41L86
$$ 3400 2411 1936 1485 1100 542 16 -450 -963 -846 -474 74 344 322 38 -518 -1086 -1016 -398 456 997 1383
3135A383k6m01k47k09j73j08g7k04l4a55o0j75a40F59J000R14K48l16q01p95C74
$$ 1383 1357 956 709 500 327 219 -77 -281 -315 -155 -215 -390 -140 659 1659 2573 2821 2505 1704 909 374
3113C79L64N60O82M63J81k3m91n77l85p6J15J20r3m17F2d68j22b48C49M11m7j79
$$ 379 743 1303 1985 2448 2629 2606 2115 1538 1153 1077 1192 1312 1219 802 62 -468 -590 -248 349 760 713 534
3091E34J5L69O14O13L77K81K5l66n33n24n04l59j18K98K86K26p5m17a50q55m03
$$ 534 549 918 1532 2145 2522 2803 2828 2462 1929 1405 901 542 424 722 1008 1234 1159 742 -150 -1005 -1408
3070a408N64f3C41K41A61d24m72j63p5K95o5k65q91N40e84g7A97K43M87Q70M55
$$ -1408 -844 -63 341 582 161 -424 -896 -1059 -1134 -839 -904 -1169 -2060 -1520 -584 -77 197 440 927 1797 2252
3049B252p3m54n27n45B76A32d8j79k07m30O6J30J54R1a56C55M39M18L12J95L16
$$ 2252 2179 1725 1198 653 276 132 -48 -227 -434 -864 -798 -668 -514 -423 -156 355 794 1212 1524 1719 2035
3028B035J16j71l23l02o60c83j045n06N72f22b89j26j71p4j03M1j6m8n9O4Lpm9
$$ 2035 2151 1980 1657 1355 695 -383 -1428 -1934 -1362 -622 -289 -415 -586 -660 -763 -722 -738 -786 -845 -781 -778 -785 -834
3005h34j20j74P5L19L06a05k12p44l84e35C66K68n3B23c64q34J9L03L74a47pm08
$$ -834 -954 -1128 -1053 -734 -428 -105 -317 -1061 -1445 -535 366 634 581 223 -364 -1198 -1179 -876 -502 -147 -154 -562
2983e62n62n07oK39N06L08M8l54q9L98I7O74P97N56M88L14k12p09r75m58l6J38
$$ -562 -1124 -1631 -1637 -1398 -892 -584 -536 -890 -979 -581 97 771 1568 2124 2612 2926 2714 2005 1030 572 536 674
2961F74K16l64a78p02K1A49J267Q39J99k37o69n31k04%K37J05m8j97k57a11r61
$$ 674 890 526 -178 -880 -859 149 1416 2255 2454 2217 1548 1017 813 813 1050 1155 1107 910 653 -111 -1072
2940a072j249j77O73N12K23j8j38j19j08k06l76K1P02L65L69Pq1J37a38A30j7
$$ -1072 -2321 -2498 -1825 -1313 -1090 -1108 -1246 -1365 -1473 -1679 -2055 -2034 -1332 -967 -598 -591 -672 -535 -138 130 113
2919A13e6A2J20J16D8b81n05m62r8L15b99C04L68j75D0g30p41J99O05J21j34m59
$$ 113 -56 12 132 248 48 -281 -786 -1248 -1346 -1031 -299 304 672 497 40 -730 -1471 -1272 -667 -546 -680 -1139
2897a139m48J78K06P4LO2Q2n4k25q6k50K6O95c13a43F5N71R30R22O07J30m64q05
$$ -1139 -1587 -1409 -1203 -1129 -1126 -1064 -982 -1036 -1261 -1347 -1597 -1571 -876 -313 -143 65 636 1566 2488 3095 3225 2761 1956
2874A956p08n07B75h3m30j86PJ17n0j7l84n68n67k71Q1M57M64M07L07b51C82L91
$$ 1956 1248 741 275 -83 -513 -699 -692 -575 -625 -642 -1026 -1594 -2161 -2432 -2351 -1894 -1430 -1023 -716 -251 382 773
2852G73L2k07j86j06k7K38K61L37J00j48D27f02j300j45Q98e66j43j50L31B89
$$ 773 805 598 412 306 279 517 778 1115 1215 1067 427 -602 -1902 -2047 -1149 -566 -709 -859 -528 289
2831I42M18k54l25l04J52M55O25O54M07J21n25q29E81a6l07r1j89k23l67k01J46
$$ 942 1360 1106 781 477 629 1084 1709 2363 2770 2891 2366 1537 581 -16 -323 -414 -603 -826 -1193 -1394 -1248
2810a248N53A23P21N28L57j2l67m94m16A69a06l21J9f8A46K19J52L27O84O32J68
$$ -1248 -695 123 844 1372 1729 1717 1350 856 440 169 -106 -427 -408 -68 146 365 517 844 1528 2160 2328
2789B328k48o65o22A55b15q1j02m81m79M51C6Q28L11j79B79d09m36n4J55K29K18
$$ 2328 2080 1415 793 155 -215 -296 -398 -879 -1358 -907 36 864 1175 996 279 -409 -845 -899 -744 -515 -297
2768b97a32A5h4l32o15n52n57nN84N15M33b14d2k2k47k94l92j83L12M23H8M41
$$ -297 -132 15 -84 -416 -1031 -1583 -2140 -2145 -1561 -1046 -613 -214 -42 -64 -311 -605 -997 -1180 -868 -445 88 529
2746E29L52K13o1k96B82b91n92l59m24j15J29J52L06L53K50N6O7b30A29N01J77
$$ 529 881 1094 1033 737 282 -291 -883 -1242 -1666 -1781 -1652 -1500 -1194 -841 -591 -535 -468 -230 129 630 807
2725H07R2Q7L35M87J04l87F71c64j051n68M81M47K86J21j4j44j83k78l96k92L66
$$ 807 899 986 1321 1808 1912 1525 671 -364 -1415 -1983 -1502 -1055 -769 -648 -662 -806 -989 -1267 -1663 -1955 -1589
2704a589L82d84B11O50R90J029R63P90m51q35j023q68E10g49j098N47b89E10N46
$$ -1589 -1207 -484 211 861 1851 2880 3843 4633 4182 3347 2324 1456 510 -749 -1847 -1300 -289 510 1056
2685A056N00K68m9m86C76d87q66r94Q72C56J689J186L92k74p39j007F87A53K60
$$ 1056 1556 1824 1775 1289 376 -487 -1353 -2347 -1475 356 2045 3231 3623 3349 2610 1603 687 153 413
2666D13O48P52K95M54k77KL07j14p50n59l52l19F3c49n20p81m74R39a4I75M61
$$ 413 1061 1813 2108 2562 2285 2287 2594 2480 1730 1171 819 500 63 -349 -869 -1650 -2124 -1185 -14 975 1436
2645A436J03k35k77l64a38j226m65O35d21J95o27j132Q66E86J486J076K30l25
$$ 1436 1539 1304 1027 663 -138 -1364 -1829 -1194 -421 -226 -853 -1985 -1119 586 2072 3148 3378 3053
2627C053p24q96C98f82p10k10J8L0j6j77J04N48c44B16L61N1k79a4m15n32k56
$$ 3053 2329 1433 398 -682 -1392 -1602 -1584 -1554 -1570 -1747 -1643 -1095 -344 216 577 628 349 -14 -429 -961 -1217
2606a217j61j33J30j98j67j29J21K95N45L87b09B89O40N55M31J67p4l56k61l78
$$ -1217 -1378 -1511 -1381 -1579 -1746 -1875 -1754 -1459 -914 -527 -209 289 929 1484 1915 2082 2008 1652 1391 1013
2586A013k13C75a65o56l10K71a47A46i5q86j300J115B06Q99K55k17E39a98q25
$$ 1013 800 375 -165 -821 -1131 -860 -147 146 -95 -981 -2281 -1166 206 1105 1360 1143 539 -198 -1023
2567a023m92j56l88J0M51L70M27c81C7M60M09K30J11k60C33c03l05a75D47P38
$$ -1023 -1515 -1671 -2059 -2049 -1598 -1228 -801 -381 37 497 906 1136 1247 987 333 -303 -608 -175 447 1185
2547A185O44J36k95l22q5L46K62nj37m15F53b08j037Jd91e1G8b57m67m02R9J72
$$ 1185 1829 1965 1670 1348 1263 1609 1871 1866 1729 1314 653 -208 -1245 -1244 -491 -51 78 -257 -724 -1126 -1027 -855
2525h55k57m03J00d66D16M35j19C36A3h1B19P15J191J140Q51K99j48p70j516F30
$$ -855 -1112 -1515 -1415 -466 416 851 732 336 13 -81 219 934 2125 3265 4116 4415 4267 3497 1981 630
2504a096j396d59A073Q71J09m99G45B03Q1L10J60n6j91j60j26a80n32o47l50N4
$$ -1096 -2492 -459 1073 1944 2053 1554 745 203 284 594 754 698 507 347 221 -180 -712 -1359 -1709 -1655
2484a655M09J85K0j63k06j28M67c31A70K37j42F5d64p32n86n00J4L10L61O06c15
$$ -1655 -1246 -1061 -1041 -1204 -1410 -1538 -1071 -331 170 407 265 65 -464 -1196 -1782 -2282 -2268 -1958 -1597 -991 -315
2462B5K52J44G1f30r14g43A72L84M1k10j80M0M73O67P01L02l71r70a04q78l82
$$ 25 277 421 71 -630 -1544 -743 172 556 597 387 207 247 720 1387 2088 2390 2019 1049 -104 -982 -1364
2441a364M93c65A72M31M06J71l84a84j388P52F05R64L35k15p08a87j073O17a78
$$ -1364 -871 -365 172 603 1009 1180 796 -184 -1572 -820 605 1569 1904 1689 981 -187 -1260 -643 -178
2421b23o70l72p5M47L14J64k8K08C7J73J7G8KJ7k3b82n57o84m74M58N25M06b40
$$ -223 -893 -1265 -1340 -893 -579 -415 -443 -235 37 210 227 78 80 97 74 -282 -839 -1523 -1997 -1539 -1014 -608 -240
2397f1o0j03N3C7M07M32K70j05C99e62j022k19g05D01O98j81a0j138r1d01C4K45
$$ -61 -121 -224 -171 37 444 876 1146 1041 399 -562 -1584 -1803 -705 401 1099 918 -10 -1148 -1239 -401 34 279
2375B79o0B2b87l21k00q8l05k46J78N43b2G26K12k05A49e38l94k73J5Q9K83c33
$$ 279 219 22 -287 -608 -808 -896 -1201 -1447 -1269 -726 -22 726 938 733 149 -538 -932 -1205 -1190 -1101 -818 -333
2352A29J24k0b34p81J7D6J209P52R7m14q13d59o84J18b48E64M59J79l00k37j01
$$ 129 253 233 -234 -1015 -998 46 1255 2007 2104 1690 877 -459 -1143 -1025 -248 564 1023 1202 902 665 564
2331E64Mj08B12b52q69n95O92a37G23L85P6k44B54e65q01l56J01J69L38M28GJ162
$$ 564 568 460 212 -252 -1121 -1716 -1024 -137 723 1108 1184 940 254 -565 -1366 -1722 -1621 -1452 -1114 -686 7 1169
2309A169J147R60M12j0o39j033I38A4f93l95J41K76L06J41HK72r2e2p6j38l22
$$ 1169 2316 3276 3688 3678 3039 2006 938 14 -693 -1088 -947 -671 -365 -224 8 280 188 -52 -128 -266 -588
2288e88j99n2b49H94R51M10j05I76A6i48r5L96G4N66K20Q0k60G5e78q3A52R30
$$ -588 -787 -839 -249 894 1845 2255 2150 976 16 -948 -1043 -647 74 640 860 940 680 75 -578 -661 152 1082
2266A082Q83O75L15K12j62r42E27a211m95N18L82j49l71O30B86O22J57j45j86
$$ 1082 1965 2640 2955 3167 3005 2063 527 -1211 -1706 -1188 -806 -955 -1326 -696 286 908 1065 920 734
2247G34Q2J72K68Q2Q7K41M42K58L06K68L25j03m89o83p48l81B85f08j214o58J025
$$ 734 816 988 1256 1338 1425 1666 2108 2366 2672 2940 3265 3162 2673 1990 1242 861 285 -608 -1822 -2480 -1455
2226a455B64J237M28nK79J21K23j10o70H75A0g56m11j37j57l6p8q7N1L64K47Q6
$$ -1455 264 1501 1929 1924 2203 2324 2547 2437 1767 875 10 -756 -1167 -1304 -1461 -1497 -1575 -1662 -1611 -1247 -1000 -914
2204i14K9l14n35J93M02K80J39o1l52o67l73J081a13A028J017Q60N31j33o01A265
$$ -914 -885 -1199 -1734 -1541 -1139 -859 -720 -781 -1133 -1800 -2173 -1092 -113 1028 2045 2905 3436 3303 2702 1265
2183C66c98k00Q6F6N63K29j9l98a55o11n27m94N8N25K05J40L26I7P16O15K81r1
$$ 366 -398 -598 -512 66 629 858 839 441 -155 -766 -1293 -1787 -1729 -1204 -999 -859 -533 97 813 1428 1709 1618
2161A618p16b23r41L52B55R95N28k31D82h85j089n64N1N23M27L37K23K15J84K57
$$ 1618 902 -223 -1164 -812 255 1250 1778 1547 482 -885 -1974 -2538 -2487 -1964 -1537 -1200 -977 -762 -578 -321
2141c21a2o5l91m08r0J60K5k6L11d4C45L89O90R90R25N85Jn48r82I31a069j049
$$ -321 -12 -77 -468 -876 -966 -806 -781 -807 -496 -44 345 734 1424 2414 3339 3924 3925 3377 2395 931 -1069 -2118
2119b118a057C50J007M97k51D00a44A450J419L31m53A187f23q84g46D63R92N50
$$ -2118 -1057 350 1357 1854 1603 400 -144 1450 2869 3200 2747 1187 -623 -1507 -746 463 1455 2005
2101B005j85j90j95m46A85i17j078Q4P83a93E84N31O3n12F6a102q29M14L02J93
$$ 2005 1820 1630 1435 989 185 -917 -1995 -1911 -1128 -193 584 1115 1178 666 66 -1102 -1931 -1517 -1215 -1022
2081a022M70a44C74M61J84j92B23g28k18a96E64K60k45B09c46j069n80J62N92
$$ -1022 -552 -144 374 835 1019 827 223 -728 -946 -196 564 824 579 209 -346 -1415 -1995 -1833 -1241
2062a241d95B54O48L35R1o1k54D37b39o04n04o29K13L88L68J43j76k22L23c24
$$ -1241 -495 254 902 1237 1328 1267 1013 437 -239 -843 -1347 -1976 -1763 -1375 -1007 -864 -1040 -1262 -939 -324
2041B12J47a20p01l52L71L95l6l82o92n31k6O87d3A365J176P49j9j091D32a497
$$ 212 359 -120 -821 -1173 -802 -407 -443 -825 -1517 -2048 -2074 -1387 -43 1365 2541 3290 3271 2180 432 -1497
2020a402D60J587J510P32M8o85j144r71p24H3g63q55k31f20F97R41N78J58R7K0
$$ -1402 460 2047 3557 4289 4337 3652 2508 1537 813 83 -763 -1618 -1849 -620 697 1638 2216 2374 2471 2491
2000B491j96o18G56g81r20Q21B12R91N76l4K1m28D45c10q29o68q62l68L34O63
$$ 2491 2295 1677 756 -781 -1701 -880 212 1203 1779 1745 1766 1338 445 -310 -1139 -1807 -2669 -3037 -2703 -2040
1980b040J99K75K52Q8j16j0M51d32J09l6j66M1j43o27k94O00e0E41K28k14j42
$$ -2040 -1841 -1566 -1314 -1226 -1342 -1352 -901 -432 -323 -359 -525 -484 -627 -1254 -1548 -948 -50 541 769 555 413
1959D13L4K21L65j14D20A1c00k94M4cE15O2D6a058n27a19A307P83j00m43E33i32
$$ 413 447 668 1033 919 420 11 -300 -594 -550 -3 515 577 46 -1058 -1585 -119 1307 2090 1990 1547 533 -932
1936a257C25J389J470Q15K34j38m65q74j003E45g73j369N02O51d83a12A91L60
$$ -1257 325 1714 3184 3999 4233 4095 3630 2756 1753 545 -773 -2142 -1640 -989 -483 -112 191 551
1918E51K05k3l55c09p24p25l80M43M48c10I64R36L71m14o72B66g97r10Q2M0k28
$$ 551 756 733 378 -309 -1033 -1758 -2138 -1695 -1247 -310 964 1900 2271 1857 1185 266 -797 -1707 -1625 -1585 -1813
1897a813j57K80Q43b12g6A77L71K35j66k73a39o35j081o92P04M61L68M37A0N29
$$ -1813 -1970 -1690 -847 -212 -76 177 548 783 617 344 -139 -774 -1855 -2547 -1843 -1382 -1014 -577 10 539
1877E39N82K95J54J64J68j13m03n48A34e48J48A81L72K81Q4j49C55h2n13j50c06
$$ 539 1121 1416 1570 1734 1902 1789 1386 838 134 -548 -400 181 553 834 918 769 355 -82 -595 -745 -306
1855E55J039O27k48q96b59j455K97f52K48k92p48o44M45e28E04M45q4C64b80m20
$$ 555 1594 2221 1973 1077 -259 -1714 -1417 -652 -404 -696 -1444 -2088 -1643 -528 504 949 865 364 -280 -700
1835g00J83J33a61C87O34K95j19j41l38A60e13j007p69j54Q09O89L92J41o4Q1
$$ -700 -517 -384 -161 387 1021 1316 1197 1056 718 160 -513 -1520 -2289 -2443 -1634 -945 -553 -412 -476 -395
1815c95a74fq3j41a11B80J74j3E7d60m53o0J83K59b65K0r0o42O2A04O59m3A60
$$ -395 -174 -6 -89 -230 -111 280 454 441 57 -460 -913 -973 -790 -531 -265 -245 -335 -977 -915 104 763 720 160
1791f47o05m33j24N25e41I8K07j19J44O37Q94P31N98L41j0l98o05m69m46l82m15
$$ -647 -1252 -1685 -1809 -1284 -541 98 305 186 330 967 1861 2592 3190 3531 3521 3123 2518 2049 1603 1221 806
1770H06C26Bd9l3q8k46j64J35G2M55J20k45f8q93j212Q61d45A04OJ63o1A2b49
$$ 806 326 2 -49 -82 -170 -416 -580 -445 72 527 647 402 -68 -961 -2173 -1312 -445 104 110 273 212 12 -249
1746d92j72l24m46m49j97N7j26L41O98a08E21k17b91r01p29l08J099c69J35j87
$$ -492 -664 -988 -1434 -1883 -2080 -2023 -2149 -1808 -1110 -108 521 304 -291 -1192 -1921 -2229 -1130 -369 -234 -421
1726d21j45J46a25C8b12p20K19G01J386J015K00m66j094E60c08H6J076P45L44
$$ -421 -566 -420 -125 38 -212 -932 -713 701 2087 3102 3302 2836 1742 560 -308 86 1162 1907 2251
1707B251M8l18J33L43P3l06n85n45l79j54p0qkK67K57M02L40K08r5k68n24D82
$$ 2251 2299 1981 2114 2457 2530 2224 1639 1094 715 561 491 483 481 748 1005 1407 1747 1955 1860 1592 1068 482
1684B98B8e28o04N0L84J02k40o24l16P51M50b85a03L8j57j41J29G6L61J41j58
$$ 298 28 -528 -1132 -1082 -698 -596 -836 -1460 -1776 -1025 -575 -285 -103 -65 -222 -363 -234 76 437 578 420
1663D20A78k8M22O50N82R2j81n27D98a69r52p20k32R19c16A48O7m5a60n23n90
$$ 420 178 150 572 1222 1804 1896 1715 1188 498 -169 -1121 -1841 -2073 -1154 -316 148 215 170 -160 -683 -1273
1642a273o6O7l06k56K35M45K73J1m56o13k91J043b38D15M16L69M30M11K82L91
$$ -1273 -1339 -1272 -1578 -1834 -1599 -1154 -881 -870 -1326 -1939 -2230 -1187 -238 415 831 1200 1630 2041 2323 2714
1622B714K68j74m74q66B90a144K04B90R83P42L63J39j33n69H33d67n67b33E17
$$ 2714 2982 2808 2334 1468 290 -1144 -940 290 1273 2015 2378 2517 2384 1815 833 -467 -1034 -233 517
1602A118J82k40l19k77q1K07J84N3j66A85c78k49b69F1d1l59l73o90l93M47N26
$$ 1118 1300 1060 741 464 383 590 774 827 661 185 -378 -627 -269 61 -41 -400 -773 -1463 -1856 -1409 -883
1581h83K5l49m72m25L5K48j8K32L08M69c19hA30j5a54l87k81J69a59A43J04C2
$$ -883 -858 -1207 -1679 -2104 -2069 -1821 -1839 -1607 -1299 -830 -319 -8 130 115 -154 -541 -822 -653 -159 143 247 32
1558c78l25l23j07j7m6r8k9p2j18k54R4O95H3J229R30L03k43p72E52a76n96l61
$$ -378 -703 -1026 -1133 -1150 -1196 -1294 -1323 -1395 -1513 -1767 -1673 -978 83 1312 2242 2545 2302 1530 552 -176 -772 -1133
1536a133k14K03K06p0j36p5J19Q5K8R2n3P4l6j88J76b55D39L43J09j98j03A25
$$ -1133 -1347 -1144 -938 -1008 -1144 -1219 -1100 -1015 -987 -895 -948 -874 -910 -1098 -922 -255 439 782 891 693 590 125
1513e29j34c10B40J89A91c57l59L8K45a62k41m25K9i6D78L8a40q77m3D2J515J221
$$ -529 -663 -310 240 429 191 -357 -716 -678 -433 -162 -403 -828 -799 -96 478 516 -140 -1017 -1060 42 1557 2778
1491B778L31rl77l58k24K06J9n6l96p52G7a301j142R21c75B69L48j87j57G0b31
$$ 2778 3109 3100 2723 2365 2141 2347 2366 2310 1914 1162 77 -1301 -2443 -1522 -375 269 617 430 273 70 -231
1469c82J70C10O34L52l76a88j408g71A401K049J730J061N64m11p29n90l73l28
$$ -382 -212 310 944 1296 920 -188 -1596 -771 1401 3450 5180 6241 6805 6394 5665 5075 4702 4374
1451D374r32j222E51a090j018K66h95b18H3M91O67M94K04j99n54D83e45r19q60
$$ 4374 3442 2220 551 -1090 -2108 -1842 -895 -218 83 574 1241 1735 1939 1740 1186 483 -545 -1464 -2324
1432b324J065h2A116Q40J91l96n15j94P6J09j07k94k91j4P0n1D1a111j220M15
$$ -2324 -1259 -82 1116 1956 2147 1751 1236 1042 1118 1227 1120 826 535 521 591 540 41 -1111 -2331 -1916
1412a916J58k01K42g13D11Q87R07L52k20o15H60a11r63l74e91g3B7b49m35o02
$$ -1916 -1758 -1959 -1717 -713 411 1298 2205 2557 2337 1722 860 -111 -1074 -1448 -591 -73 27 -249 -684 -1286
1392a286n02j02M42N76g1C78O06N92M54L4l08l88n35C96L5N19M15L07k69E07a021
$$ -1286 -1788 -1890 -1448 -872 -71 378 984 1576 2030 2064 1756 1368 833 396 431 950 1365 1672 1403 507 -1021
1370b448J116d38A37Jb97k53cH53P09O9m98B82f23n11j47p6k22j93O0J94J42M9
$$ -2448 -1332 -438 137 138 -297 -550 -3 853 1562 1631 1133 282 -623 -1134 -1281 -1357 -1579 -1772 -1712 -1518 -1376 -1327
1348a327R4K79K51J45j08k65m28k92J30L71Q0K26a94F51O70K12j58l31m35B80
$$ -1327 -1233 -954 -703 -558 -666 -931 -1359 -1651 -1521 -1150 -1070 -844 -194 651 1321 1533 1375 1044 609 280
1327a34l54l60k24Q7K84K60P0j86o05l77P5K9j09l51J83Q41a99B87L27O43M62
$$ -134 -488 -848 -1072 -985 -701 -441 -371 -557 -1162 -1539 -1464 -1435 -1544 -1895 -1712 -871 -199 287 614 1257 1719
1306A719K87K1j28l42m83D49c03n09k35M15A70P54O32L74o7k87m74n50C0d95o33
$$ 1719 2006 2027 1899 1557 1074 449 -303 -812 -1047 -632 170 924 1556 1930 1863 1576 1102 552 30 -495 -1128
1285a128l41m11l89l45l1R5N5L90L61K62J95N27a88B83K15l5A35c99j15K42B18
$$ -1128 -1469 -1880 -2269 -2614 -2645 -2550 -2495 -2105 -1744 -1482 -1287 -760 -188 283 498 463 135 -399 -514 -272 218
1263D38m7j02j25A8c87n14n57m36j56J91L04O3m24k38R89A10J022O43k95D97d73
$$ 438 391 289 164 18 -387 -901 -1458 -1894 -2050 -1859 -1555 -1492 -1916 -2154 -1165 110 1132 1775 1480 497 -473
1241a355J27e96b19FJ42a39o29q64r12r7J53J92PL88P93b47C58K34k94b44h0F13
$$ -1355 -1228 -596 -219 6 148 -139 -768 -1632 -2544 -2641 -2488 -2296 -2289 -1901 -1108 -247 358 592 298 -244 -80 613
1218A312L20q6n4r4p7m9n3m6j93l01B71b02l92n80m63L1K11J6j67l26n15P7P23
$$ 1312 1632 1546 1492 1398 1321 1272 1219 1173 980 679 271 -202 -594 -1174 -1637 -1606 -1395 -1379 -1546 -1872 -2387 -2310 -1587
1195a587P23c54e4j24k32J6J67DJ21J50K9J46R6J23M13K15J3l63k91B22b79n99
$$ -1587 -864 -354 -54 -178 -410 -394 -227 4 125 275 304 450 546 669 1082 1297 1310 947 656 222 -279 -878
1173h78o13L66d30C27O53M98J18j89n92A54L2R69R78N24o8p31H53H8g7qj61j32
$$ -878 -1491 -1125 -430 327 980 1478 1596 1407 815 154 186 1155 2133 2657 2589 1858 853 88 -77 -85 -246 -378
1151c78A09R88J074O78N5k55l39o45p69I6b32j91k16m4L30b2D07M04M75L60J62
$$ -378 109 1097 2171 2849 2904 2649 2310 1665 896 96 -232 -423 -639 -683 -353 -22 407 811 1286 1646 1808
1130A808j51k06k04P2L81N64N79K70o2n94A161A29h04n51k63O0J01L33N07CO30
$$ 1808 1657 1451 1247 1319 1700 2264 2843 3113 3051 2457 1161 129 -804 -1355 -1618 -1558 -1457 -1124 -617 3 633
1109F33J22k16A43d21o43l22K83L30a03C37L39MJ1J40L69L69L7k19o37A07f45
$$ 633 755 539 143 -421 -1064 -1386 -1103 -773 -103 337 676 680 691 831 1200 1569 1606 1387 750 107 -645
1087g20E4O18K58J4j0L31M44K73p5n45E60b54q21o81P4O14M63J64j5Q0NJ37F6
$$ -720 54 672 930 944 934 1265 1709 1982 1907 1362 560 -254 -1075 -1756 -1682 -1068 -605 -441 -456 -376 -371 -234 66
1063C85K39k4k91a26m1A05M6a78m47k10L89B89O18O69M37N56K43k60k69m08p76
$$ 385 624 600 309 -126 -167 105 151 -178 -625 -835 -446 289 907 1576 2013 2569 2812 2552 2283 1875 1099
1042A099b25j370N98F27J228P78O03l73n08o95H25k84J63L45K82K7j44k97m18
$$ 1099 -225 -1595 -997 627 1855 2633 3236 2863 2355 1660 825 541 704 1049 1331 1358 1214 917 499
1023D99A31h4a6D29L78M80M39K01J74Q05O02K01j38o76q85p70A77h13q23k49J01
$$ 499 131 -84 -16 429 807 1287 1726 1927 2101 2906 3508 3709 3571 2895 2010 1240 177 -813 -1636 -1885 -1784
1002a784J00K45P13C04J126R68Q02L46l38q38j067B2a381q82MJ95J50K28M63L77
$$ -1784 -1684 -1439 -726 304 1430 2398 3200 3546 3208 2370 1303 22 -1381 -2263 -2259 -2064 -1914 -1686 -1223 -846
982h46J40O2q4J17a65D15L85O8k29i3n70k29R9m6l50k86L48b99B20E3f86q65k38
$$ -846 -706 -644 -728 -611 -165 415 800 868 639 -93 -663 -892 -793 -839 -1189 -1475 -1127 -299 220 53 -686 -1551 -1789
959a789N28L48l5J6L24K75o3j99l11J00f8A085R31P90N46K34k54o07r37G13c94
$$ -1789 -1261 -913 -948 -932 -608 -333 -396 -595 -906 -806 -68 1085 2016 2806 3352 3586 3332 2725 1788 713 -394
937a148J73L95O6l02q49o33L96d69A019P95K05m35n85C15a97k55j4a37B65L01
$$ -1148 -975 -580 -514 -816 -1665 -2298 -1902 -469 1019 1814 2019 1584 999 315 -197 -452 -466 -137 265 566
917E66Kk38d7o28m26k32J56M44b20A55L7a03n11o48k16K38J39L6k10j64p9P9j19
$$ 566 568 330 -47 -675 -1101 -1333 -1177 -733 -220 155 192 -103 -614 -1262 -1478 -1240 -1101 -1065 -1275 -1439 -1518 -1439 -1558
894a558K33Q7ok08l98k72K72K73K32l63l38mj14K1k16J92K36L68M34M90a53D88
$$ -1558 -1325 -1238 -1244 -1452 -1850 -2122 -1850 -1577 -1345 -1708 -2046 -2050 -2164 -2143 -2359 -2167 -1931 -1563 -1129 -639 -153 488
871A220M04K2k33n13B35b30O8B1im03l9a87a6k33m38j94e9E88N69J44j18k23l65
$$ 1220 1624 1646 1413 900 235 -230 -162 21 -9 -412 -451 -187 -16 -249 -687 -881 -59 588 1157 1301 1183 960 595
848E95a27r27l04J39k34p27m67M83Q66c65G23R33O57k8m28m44k48J35O8m04E4
$$ 595 -127 -1054 -1358 -1219 -1453 -2180 -2647 -2164 -1298 -365 723 1656 2313 2285 1857 1413 1165 1300 1368 964 54
826a236j050e94H02O47l19A55a267j315i91B04N52l73e64r47o5N88a66E35M29
$$ -1236 -2286 -594 802 1449 1130 155 -1267 -2582 -991 204 756 383 -564 -1511 -1576 -988 -166 535 964
807I64Q2j83j36B38e93j084Q34F74J359J140O71J06m71o92j240E17c58j013l69
$$ 964 1046 863 727 238 -593 -1677 -843 674 2033 3173 3844 3950 3479 2787 1547 517 -358 -1371 -1740
788a740O11N03p5l38q4L81A57O09M84O5P9m08C36a93k55l93l22k31l18j69J64
$$ -1740 -1129 -626 -701 -1039 -1123 -742 157 766 1250 1315 1394 986 336 -193 -448 -841 -1163 -1394 -1712 -1881 -1717
767a717M51K62P5n9k43l18n8O34b13C89K23K4j12k52N04R96Q49M06l2k06o13j008
$$ -1717 -1266 -1004 -929 -988 -1231 -1549 -1607 -973 -213 389 612 636 524 272 776 1772 2621 3027 2995 2789 2176 1168
745A168b7j266o58O57e09cD5K20J9em75n19l14j72L71c99E25R31L89k26p09b51
$$ 1168 -27 -1293 -1951 -1294 -509 -3 45 265 284 -5 -480 -999 -1313 -1485 -1114 -399 525 1456 1845 1619 910 -251
722a363n44L4N16M11d45a64k21o27L68G30J254O46J09l63q01D19f68p48LN62L64
$$ -1363 -1907 -1873 -1357 -946 -445 -164 -385 -1012 -644 730 1984 2630 2739 2376 1575 419 -668 -1416 -1413 -851 -487
701d87K42B43N36Q22J090J243Q74K87l92j115j470A051P5Q29P36M58j01o38n04
$$ -487 -245 243 779 1601 2691 3934 4808 5095 4703 3588 2118 1051 1126 1955 2691 3149 3048 2410 1906
682A906k25J28J35N2O4j68m56m12m67A84e05o98l08M28c16D43N07N5l3K75K75
$$ 1906 1681 1809 1944 1996 2060 1892 1436 1024 557 184 -505 -1203 -1511 -1083 -316 443 950 1005 972 1247 1522
661A522K74k1l58E63h00j250L77a15A228R89M20K03p4o38r90G0a72E78J043Q18
$$ 1522 1796 1775 1417 563 -800 -2050 -1673 -115 1228 2217 2637 2840 2766 2128 1138 70 -172 578 1621 2439
641B439J12q61C01i32N7C62J227P91J16n58p32A6a374o70h61A63N60R8k51B34
$$ 2439 2551 1690 301 -932 -875 362 1589 2380 2496 1938 1206 16 -1374 -2044 -861 163 723 821 570 234
620a96j62e7B39J45j42c21n63k02L79h2D86J71k55F9c83m25j41Q4d30i8a6j32
$$ -196 -358 -57 239 384 242 -321 -884 -1086 -707 -82 486 657 402 69 -383 -808 -949 -865 -430 -98 -16 -148
598a48m55p03o83P50e60b03Q1m2k77m01n61n85R5N98N38J98r9k44m1M7k87m77
$$ -148 -603 -1306 -1989 -1239 -560 -203 -122 -164 -441 -842 -1403 -1988 -1893 -1295 -757 -559 -658 -902 -943 -896 -1183 -1660
576a660O6R6L3q6m93L88f9A595J748J116N17k71j168j434q03K8K75j52E44h61
$$ -1660 -1594 -1498 -1465 -1551 -2044 -1656 -69 1595 3343 4459 4976 4705 3537 2103 1300 1328 1603 1451 544 -861
555a772g97B63O80M46J20K67M02L27O3l02m83o12l16k55j88j31E0b08j76O0dD93
$$ -1772 -797 263 943 1389 1509 1776 2178 2505 2568 2266 1783 1171 855 600 412 281 50 -208 -384 -324 -4 493
532A012L61J25k62l36m40a20o91j149R5M06g17G5L25J31M1K43m6M89O43L11n9
$$ 1012 1373 1498 1236 900 460 -120 -811 -1960 -1865 -1459 -717 75 400 531 572 815 769 1258 1901 2212 2153
511B153m45p93C52c61p34n51k07k04J4L31M30M73L54r5m42m07q06m26h27A209
$$ 2153 1708 915 352 -361 -1095 -1646 -1853 -2057 -2043 -1712 -1282 -809 -455 -550 -992 -1399 -2205 -2631 -827 1209
490C095O74O5n57j131E08c57p29o69k31O0j0K59N48N16K74K4l6j57K40I8K42L73
$$ 3095 3769 3834 3277 2146 508 -357 -1086 -1755 -1986 -1926 -1936 -1677 -1129 -613 -339 -315 -351 -508 -268 98 340 713
468G13N35N34N77R5J29o8k84m33m97m64B35f12q09n13K18N15N12A22P10P45M76
$$ 713 1248 1782 2359 2454 2583 2515 2231 1798 1301 837 235 -612 -1421 -1934 -1716 -1201 -689 122 832 1577 2053
447B053n7o07E14c98m05L67a3E00J40l01c39r23l91f79E90Q53J81k23n29B16d9
$$ 2053 1996 1389 514 -398 -803 -436 -13 500 640 339 -339 -1262 -1653 -679 590 1443 1624 1401 872 216 -49
425C7J51F4e06p95r62q05P41a127N58b30l44J53A11P93P52L11m16F73c68r57p66
$$ 37 188 64 -506 -1301 -2263 -3068 -2327 -1127 -569 -230 -574 -421 111 904 1656 1967 1551 673 -368 -1325 -2091
404b091m98j25J77K12R5r8O22O63d99q3m07k58M92c42j3j97n29m09n12O8L09R1
$$ -2091 -2589 -2714 -2537 -2325 -2230 -2328 -1706 -1043 -499 -582 -989 -1247 -755 -342 -355 -552 -1081 -1490 -2002 -1934 -1625 -1534
382a534J78L52d29a15j54l50m35l29k32M5J42M85c74hm6n43j087f00E46J064O60
$$ -1534 -1356 -1004 -429 -115 -269 -619 -1054 -1383 -1615 -1570 -1428 -943 -374 -8 -54 -597 -1684 -600 546 1610 2270
361B270J95l54r01b6j253o45N93b39D99p6a22j024o03O57b59A68D9f59j156Q17
$$ 2270 2465 2111 1210 -26 -1279 -1924 -1331 -239 499 423 -122 -1146 -1749 -1092 -259 168 49 -659 -1815 -998
341i98C70Q37M24j36n20C45F5L39M10J76oK8k32B32a59l67k23j85l4o2K69L22
$$ -998 370 1207 1631 1495 975 345 65 404 814 990 984 1012 780 232 -159 -526 -749 -934 -968 -1030 -761 -439
319d39I2N41N56L91O44L27j80q03B70a267r10M02M29j48n60q6Q23N82L52a78A0
$$ -439 92 633 1189 1580 2224 2551 2371 1568 270 -1267 -2177 -1775 -1346 -1494 -2054 -2140 -1317 -735 -383 -178 10
297A59J65J17j18d02j116L08b16C63K78O4j16K48N05K62rm97l68B40c99q9h9C89
$$ 159 324 441 323 -402 -1518 -1210 -216 363 641 705 589 837 1342 1604 1595 1098 730 240 -399 -488 -89 389
274H00K07L32K57L18M01l5k89o50E67a00m22k17J5J96b49B7N16M33L37j01l97
$$ 800 1007 1339 1596 1914 2315 2280 1991 1341 567 -100 -522 -739 -724 -528 -249 27 543 976 1313 1212 815
253H15B72b72l78j69J42a33G45P04O19M20J45j87m70p93E20J44O59M33m2n81B70
$$ 815 272 -272 -650 -819 -677 -133 745 1449 2068 2488 2633 2446 1976 1183 520 664 1323 1756 1714 1133 270
231d28j50Nm58p53n0O43M41K02K66b1A65M2J82M9A86g0l19m2h0D09M40L55L9j53
$$ -428 -578 -573 -1031 -1784 -1834 -1191 -750 -548 -282 -21 165 207 389 438 186 -70 -389 -431 -80 409 849 1204 1243 1090
207A090m22C07e09q31o82qN53M97M55b34j41l44l13J30b72B49K23I0h38j235N44
$$ 1090 668 307 -509 -1340 -2022 -2030 -1477 -980 -525 -234 -375 -719 -1032 -902 -272 249 472 90 -838 -2073 -1529
186a529N34K09j38k1rO5k57k65N05M45j40n01m01J13L11K38P1O7pk38k89R7N34
$$ -1529 -995 -786 -924 -945 -954 -889 -1146 -1411 -906 -461 -601 -1102 -1503 -1390 -1079 -841 -770 -703 -710 -948 -1237 -1140 -606
163f06F9P41K23R5l56A20e40b70B10K42J75L54M73L87m8l59o04l92j69PJ78K73
$$ -606 69 810 1033 1128 772 120 -540 -270 210 452 627 981 1454 1841 1793 1434 830 438 269 276 454 727
141G27L88N32K91p23H7a000n60K5L90J98j1J28d10D38Q14N52p6m62l31J3J95J66
$$ 727 1115 1647 1938 1215 87 -1000 -1560 -1535 -1145 -947 -958 -830 -410 438 1252 1804 1728 1266 935 948 1143 1309
119A309k30D04e92o90c46D29K52C26e34j040M43d91J98j09q37m39P27M51P0l99
$$ 1309 1079 404 -592 -1282 -346 429 681 326 -534 -1574 -1131 -491 -293 -402 -1239 -1678 -951 -500 -430 -829
99h29n04k65J73k15J02O68b64A85Q6c2o62m44d28E24P07K69j70m94C88a50m68
$$ -829 -1333 -1598 -1425 -1640 -1538 -870 -264 185 271 -32 -694 -1138 -428 524 1231 1500 1330 836 388 -150 -618
78f18j33L34J96l12n50b78F24M85j03m82cl53n97q44h89G07J196O53j33r31b28
$$ -618 -751 -417 -221 -533 -1083 -278 624 1109 1006 524 -3 -356 -953 -1797 -889 707 1903 2556 2423 1492 -228
56a833a52A066M91k48D47h15K28C35N85j5C96c66k63K47J08q4J57E38Q93O02k03
$$ -1833 -152 1066 1557 1309 447 -815 -587 335 920 905 396 -366 -629 -382 -274 -358 -201 538 1431 2033 1830
35A830r09h4C25N44k27a45n40a46D88R1A55f7F09J043O72J98l41p20F06D3a25
$$ 1830 921 -84 325 869 642 -145 -685 -146 488 579 155 -67 609 1652 2324 2522 2181 1461 606 43 -125
13b11j81l3J84r3o49b37A432J241L73n88A016h89n04
$$ -211 -392 -425 -241 -334 -983 -237 1432 2673 3046 2458 1016 -889 -1393
0a393
$$ -1393
##PAGE= F1=-0.101556585365
##FIRST=     25.9928259484165, 8223.18227667557, -143
##DATA TABLE= (F2++(Y..Y)), PROFILE
16383a43B65a33r79Ra86A61b9o99o6A15L77A14d13E28J670J186K69q41A296b08
$$ -143 265 -133 -1112 -1103 -186 161 -29 -728 -794 115 492 114 -413 528 2198 3384 3653 2812 1296 -208
16362a270J48M86C18R20L60k53E80b96m93J07m68l34O52d14Q5r8J88j08j52k15
$$ -1270 -1122 -636 318 1238 1598 1345 580 -296 -789 -682 -1150 -1484 -832 -414 -329 -427 -239 -347 -499 -714
16342g14k53c71G67J004L4n68B55a44A95K56j03c6k56f3E2c35n60k75d91A84M69
$$ -714 -967 -371 767 1771 1805 1237 255 -144 195 451 348 -36 -292 -63 52 -335 -895 -1170 -491 184 653
16321F53j50e5o02o23e47C84M33j15B74a37l25j63j56K38J70k98p77n65i49B41
$$ 653 503 -55 -657 -1280 -547 384 817 702 274 -137 -462 -625 -781 -543 -373 -671 -1448 -2013 -949 241
16300A214M99p6m60E65B07D0Q4N7P9j26b54o39p31Jd65E90M75J35JK5l15A73g72
$$ 1214 1713 1637 1177 565 207 40 124 181 260 134 -254 -893 -1624 -1623 -465 590 1065 1200 1201 1226 911 173 -772
16276a419M55J12n67ON56K01l46k96a2A515J157L06p78G75g99r78M56K16J5M13
$$ -1419 -964 -852 -1419 -1413 -857 -656 -1002 -1298 -12 1515 2672 2978 2200 775 -799 -1777 -1321 -1105 -1090 -677
16256f77b17H9N9J6NJ20j5Db59m01n23K76M47J48m48p21n10Q3M89N57c62A1c7
$$ -677 -217 89 148 164 169 289 274 4 -259 -660 -1183 -907 -460 -312 -760 -1481 -1991 -1908 -1419 -862 -362 11 -37
16232f48j002Jh21b6B54a45n55A57J408J281N24m8o20j246F4h38c38I61J479J193
$$ -648 -1650 -1649 -821 -26 254 -145 -700 157 1565 2846 3370 3322 2702 1456 64 -838 -338 961 2440 3633
16212C633O03n9q76j439D29g02n90l19k05J58O68c1A017R16N13J07m77m99n76
$$ 3633 4236 4177 3301 1862 429 -702 -1292 -1611 -1816 -1658 -990 -31 1017 1933 2446 2553 2076 1577 1001
16193A001D53F4e22n84m4N50b39N8L4B75R03P11J36m38E19h12j464J039B55Q18
$$ 1001 453 64 -522 -1106 -1150 -600 -239 -181 -147 275 1178 1889 2025 1587 519 -812 -2276 -1237 255 1073
16173A073L87J00j37k09k99D06b69q53k19M72L36M1j91j63k59k89l69o74M38c66
$$ 1073 1460 1560 1423 1214 915 406 -269 -1122 -1341 -869 -533 -492 -683 -846 -1105 -1394 -1763 -2437 -1999 -366
16152A145J333Q33L95j60m87o21o24k44R6K80K49O1j77l22o27B59G5Q37P54K03
$$ 1145 2478 3311 3706 3546 3059 2438 1814 1570 1666 1946 2195 2256 2079 1757 1130 259 75 912 1666 1869
16132A869j68o56C51h80j048O71e42b01l7l65J69B51N89P75N85N77M74J71k37
$$ 1869 1701 1045 351 -880 -1928 -1257 -542 -201 -238 -603 -434 251 840 1615 2200 2777 3251 3422 3185
16113C185l54n21l56m39n87C12b85l40b35F40L63r2k79J99P56P21M03k26r17C00
$$ 3185 2831 2310 1954 1515 928 312 -285 -625 -235 640 1003 911 632 831 1587 2308 2711 2485 1568 300
16092a189O6J39k12m14O57c80A30N22K25Q9Q5N08N65K03n43p78E1a017r66n89
$$ -1189 -1123 -984 -1196 -1610 -953 -380 130 652 877 966 1051 1559 2124 2327 1784 1006 51 -1017 -1983 -2572
16072b572O5L08M75Q10C7R13R66L82j56m13H02h2o60L55E20N20l84d22m38A8J431
$$ -2572 -2507 -2199 -1724 -914 37 950 1916 2298 2142 1729 802 -82 -742 -387 520 1040 656 -422 -860 18 1449
16051A449Q43M33k89k64n88o06m16A13d1B72J16j34p1b09k57i1A79O7C7c09p6
$$ 1449 2292 2725 2436 2172 1584 978 562 113 -41 272 388 254 183 -209 -466 -91 179 246 37 -309 -385
16030c85M1N3l70l50j88e64B15N03K17k19A55d62p00M45a19C16j13c66p00p44
$$ -385 -344 -291 -661 -1011 -1199 -564 215 718 935 716 155 -462 -1162 -717 -119 316 203 -366 -1066 -1810
16010a810h24A25L97l0F3d89o14n57r1L08J1K3J35L16M69g1A8h6D5K50P9b4n47
$$ -1810 -824 125 522 492 63 -489 -1103 -1660 -1751 -1443 -1432 -1409 -1274 -958 -489 -71 18 -86 45 295 374 -24 -571
15987e71n56K61a16E95N32K92J52K65L89N27N83Ql15j366p87a84q69K36h1C31
$$ -571 -1127 -866 -116 595 1127 1419 1571 1836 2225 2752 3335 3343 3028 1662 875 -184 -1053 -817 -81 331
15966D43m0P4N0NI0g35r35n30m76M36P25N61b59G3N5a30n96p33k07M23L38K32
$$ 443 403 477 527 532 90 -735 -1670 -2200 -2676 -2240 -1515 -954 -259 73 128 -130 -726 -1459 -1666 -1243 -905 -673
15944f73J82g6C45L46L66L71J40k42n49D8d55j43b33C1dm8dD8N6i1m55n87l99
$$ -673 -491 -76 345 691 1057 1428 1568 1326 777 48 -455 -598 -233 31 -4 -52 -4 48 104 -91 -546 -1133 -1532
15921a532kJ31M48d44B3K56b45j246K31F1Q03L56k30D05e15p27m74K30K83K19
$$ -1532 -1534 -1403 -955 -444 23 279 -245 -1491 -1260 61 864 1220 990 405 -515 -1242 -1716 -1486 -1203 -984
15901i84o1l94K64d40B04L44j69a01m31m4j4q4l46k06J47J45j49k46k20k88M4
$$ -984 -1045 -1439 -1175 -440 204 548 379 -101 -532 -576 -590 -674 -1020 -1226 -1079 -934 -1083 -1329 -1549 -1837 -1793
15880a793K99L90M74i6C78n7a98m18b45E00O65K90O9k43n31A22a48H9M28L14J29
$$ -1793 -1494 -1104 -630 -96 378 321 -198 -616 -245 500 1165 1455 1524 1281 750 122 -148 89 517 831 960
15859I60J5q1n4j07k36E2d39J63D21M61j32l32e5n53k65J41Q6J48J83M0q0k72
$$ 960 975 894 840 733 497 52 -439 -276 421 882 750 418 -55 -608 -873 -732 -646 -498 -315 -275 -355 -627
15837f27q8i2E50J47B60c81n34m08r9j05K35f02I1O32L75Lk93C16c41q93m14P1
$$ -627 -715 -92 550 697 260 -381 -915 -1323 -1422 -1527 -1292 -602 91 723 1098 1101 808 316 -341 -1234 -1648 -1577
15815a577L89J01j23k99q9J39M31K10J25k3PJ11J97J33n0l16j94j23J01L04n2
$$ -1577 -1188 -1087 -1210 -1509 -1598 -1459 -1028 -818 -693 -716 -709 -598 -401 -268 -318 -634 -828 -951 -850 -546 -598
15794e98N8J10j83l29m22l79L7L62f62b00m0j33m36l33j91O53B83N53K63k79A53
$$ -598 -540 -430 -613 -942 -1364 -1743 -1706 -1344 -662 -200 -240 -373 -809 -1142 -1333 -680 283 836 1099 820 153
15772f30n3D4P29K81%l07B14d78o05j16J80J95J56jl92k94L92K48K44a71e9A27
$$ -630 -683 44 773 1054 1054 747 214 -478 -1083 -1199 -1019 -824 -668 -669 -1061 -1355 -963 -715 -471 -171 -59 127
15749D99O39N89N60L53K09k0l91m21l58l80F18B51f52j047n81k07R5L61K91R7
$$ 499 1138 1727 2287 2640 2849 2829 2438 2017 1659 1279 618 251 -652 -1699 -2280 -2487 -2392 -2031 -1740 -1643
15729a643N63a54G70Q90M31Qp53B50f88l88J8L49a53D17J70k35A10J1L66K78k00
$$ -1643 -1080 -154 770 1660 2091 2099 1346 250 -688 -1076 -1058 -709 -153 417 587 352 110 121 487 765 565
15708E65a07p85m69L43c96a70r6m91j006n51K89N22O61a28F75P58L84j03m96m94
$$ 565 -107 -892 -1361 -1018 -396 -170 -266 -757 -1763 -2314 -2025 -1503 -842 -128 675 1433 1817 1714 1218 724
15688G24B90A21B5b15n20p77O94GM85J09j06j75m8m1m8a23m75o68l95k43L42O01
$$ 724 290 121 25 -215 -735 -1512 -818 7 492 601 495 320 272 231 183 -123 -598 -1266 -1661 -1904 -1562 -961
15666i61b06D67K23k40E1c49j82j6RO3P2%j94l62l33J93e30B80M49P1l98a5l72
$$ -961 -206 467 690 450 51 -349 -531 -547 -538 -475 -403 -403 -597 -959 -1292 -1099 -530 280 729 800 402 -15 -387
15643c87P0B02Q65Q40O66O4k59p53E52a124m60d05B94D7i91p78e0A304P75p2o83
$$ -387 -317 202 1067 1907 2573 2637 2378 1625 552 -1124 -1584 -405 294 47 -991 -1769 -50 1304 2079 2007 1324
15622A324E14a37j78l09n28L39B31P80N40j83m23m70E3d25m87j26K00o3r8K01
$$ 1324 514 -137 -315 -624 -1152 -813 231 1011 1551 1368 945 475 53 -425 -912 -1038 -838 -901 -999 -798
15602g98c31B35O18O84N50L22K52r4m94q42C46g10p21P00A71O54M49J44j7j34
$$ -798 -331 235 853 1537 2087 2409 2661 2567 2073 1231 346 -710 -1431 -731 171 825 1274 1418 1401 1267
15582A267k80k63k42A47d09p35r54L9O20O03b32B12J06j22a60m79l71j8q1l07
$$ 1267 987 724 482 147 -409 -1144 -2098 -2059 -1439 -836 -232 212 318 196 -160 -639 -1010 -1028 -1109 -1416
15562a416k29J75N97J17P5l43o87N98C6R55L79k67D36d89m79M46a44A24K54L6
$$ -1416 -1645 -1470 -873 -756 -681 -1024 -1711 -1113 36 991 1370 1103 436 -489 -968 -522 -144 124 378 414
15542D14I2a70m25p07o75K2O95L26o1k31j38f26I4O35M45K80qj01K0J08M0j43
$$ 414 92 -170 -595 -1302 -1977 -1955 -1260 -934 -995 -1226 -1364 -626 94 729 1174 1454 1446 1345 1365 1473 1513 1370
15520A370n64b15j278q04N45g79i2B34J05H9A4M36M32L60J89k16E67b47n97R5
$$ 1370 806 -215 -1493 -2297 -1752 -779 -92 234 339 89 14 450 882 1242 1431 1215 567 -247 -844 -749
15500g49K25J49j35k01j14m4M0m9j22M31A21L82r6j49A06b38l69j33K18e0C96
$$ -749 -524 -375 -510 -711 -825 -869 -829 -878 -1000 -569 121 503 407 258 106 -238 -607 -740 -522 -50 396
15478G59L53M56L43Q5k24m61m49j64N86O85N01q4p76C79i80j282k20M72J00n6
$$ 759 1112 1568 1911 1996 1772 1311 862 698 1284 1969 2470 2386 1610 379 -980 -2262 -2482 -2010 -1910 -1966
15458a966N46f51B4O22j71@e13n43l96l30K9J96j6l87Q23a64F84N67m2n70a75
$$ -1966 -1420 -651 24 646 475 0 -513 -1056 -1452 -1782 -1753 -1557 -1573 -1960 -1137 -164 684 1251 1209 639 -175
15436a006l24n8K54M18b71A74L09q1a14e3A042J461J178Rr03A103c59q83r3L56
$$ -1006 -1330 -1388 -1134 -716 -271 174 483 402 -114 -53 1042 2503 3681 3690 2787 1103 -359 -1242 -1335 -979
15416i79a96F10O00J91j76n20A75d28p87n42L36N48J71K11b25B42O83P62N91M43
$$ -979 -196 610 1210 1401 1225 705 175 -428 -1215 -1757 -1421 -873 -702 -491 -225 242 925 1687 2278 2721
15396B721J76j8r83I45C88f4n09l37k74l73m28k85O3K32L00J92m2J25j54k95m06
$$ 2721 2897 2879 1896 945 388 -64 -573 -910 -1184 -1557 -1985 -2270 -2207 -1975 -1675 -1483 -1525 -1400 -1554 -1849 -2255
15375b255k4M82J7K4J09M35e87J51l98q26J7P13M37K23k46p59o40R13c94E4K20
$$ -2255 -2279 -1797 -1780 -1756 -1647 -1212 -587 -436 -834 -1660 -1643 -930 -493 -270 -516 -1275 -1915 -1002 -394 54 274
15354B74N8n5G8i1k93k77k70k92Qm38g14C85M66R1D02g75j783i47A292J502M99
$$ 274 332 277 78 -91 -384 -661 -931 -1223 -1215 -1653 -714 385 851 942 402 -775 -2558 -947 1292 2794 3293
15333C293m03p37r03m40j37l04a51l48J43A41%b33l88n5b96A51J35A19b00n84
$$ 3293 2890 2153 1250 810 673 369 -151 -499 -356 141 141 -233 -621 -676 -296 151 286 119 -200 -784
15313g84m96l69o66P2K39J99j41n98j45a179C43J091L67R6l05l17l63m13i7q98
$$ -784 -1280 -1649 -2315 -2243 -2004 -1805 -1946 -2544 -2689 -1179 343 1434 1801 1897 1592 1275 912 499 -97 -995
15293i95q37O38d98a18N2A58M09P74P76J23q48ij373e55B93O41j54k65JJ29RA93
$$ -995 -1832 -1194 -498 -118 -66 158 567 1341 2117 2240 1392 -9 -1382 -555 293 934 780 515 516 645 654 193
15270g37j326N15e84G3L33k7A23c1q7o0j04P1Q2f2J5H3K53M53M05M06J87j56m96
$$ -737 -2063 -1548 -584 73 406 379 123 -31 -118 -178 -282 -211 -129 -62 -47 83 336 789 1194 1600 1787 1631 1135
15247A135n52j05j26j48o0E4b2F4c0k86k49k99K20b87A42K90J8j17c61j049q17
$$ 1135 583 478 352 204 144 54 -22 64 -30 -316 -565 -864 -644 -287 142 432 450 333 -361 -1410 -2227
$$ [...]