
##TITLE=AC1414_VIERS12223_7653325_TJb4ygoicq
##JCAMPDX= 6.0         $$ Bruker NMR JCAMP-DX V2.0
##DATA TYPE= NMR SPECTRUM
##DATA CLASS= NTUPLES
##ORIGIN= BRUKER
##OWNER= Administrator
$$ 1.72 TOPSPIN		Version 2.1
$$ 2013-03-20 00:41:15.045 -0500  Administrator@X
$$ Compression mode = diff/dup
##.OBSERVE FREQUENCY= 400.02188249412
##.OBSERVE NUCLEUS= ^1H
##.ACQUISITION MODE= SIMULTANEOUS (DQD)
##.ACQUISITION SCHEME= undefined
##.AVERAGES= 64
##.DIGITISER RES= 22
##SPECTROMETER/DATA SYSTEM= spect
##.PULSE SEQUENCE= noesygpps1d.comp
##.SOLVENT NAME= COFFEE_meoh
##.SHIFT REFERENCE= INTERNAL, COFFEE_meoh, 1, 14.96082
##AUDIT TRAIL= $$ (NUMBER, WHEN, WHO, WHERE, PROCESS, VERSION, WHAT)
$$ ##TITLE= Audit trail, TOPSPIN		Version 2.1
$$ ##JCAMPDX= 5.01
$$ ##ORIGIN= Bruker BioSpin GmbH
$$ ##OWNER= Administrator
$$ $$ E:\/data/COFFEE/nmr/AC1414_VIERS12223_7653325_TJb4ygoicq/12/pdata/1/auditp.txt
$$ ##AUDIT TRAIL=  $$ (NUMBER, WHEN, WHO, WHERE, PROCESS, VERSION, WHAT)
(   1,<2013-03-20 00:41:09.185 -0500>,<Administrator>,<X>,<go>,<TOPSPIN 2.1>,
      <created by zg
	started at 2013-03-20 00:29:39.279 -0500,
	POWCHK enabled, PULCHK disabled,
       configuration hash MD5:
       86 BA 57 50 F2 9D 5C 9B 26 00 A9 28 5F 66 2E 89
       data hash MD5: 64K
       94 64 D8 C0 7C 87 20 0E 83 4A 13 2C FF 9C 82 6E>)
(   2,<2013-03-20 00:41:12.279 -0500>,<Administrator>,<X>,<proc1d>,<TOPSPIN 2.1>,
      <Start of raw data processing
       efp LB = 0.3 FT_mod = 6 PKNL = 1 PHC0 = 0 PHC1 = 0 SI = 128K 
       data hash MD5: 128K
       20 AE C2 A7 1E 86 0D AE D7 3A 20 AD C8 70 E2 D0>)
(   3,<2013-03-20 00:41:13.326 -0500>,<Administrator>,<X>,<proc1d>,<TOPSPIN 2.1>,
      <pk PHC0 = -76.97021 PHC1 = 0 
       data hash MD5: 128K
       20 10 F0 29 3A 4B 4C 64 54 B9 F1 FD A6 C0 E3 FF>)
(   4,<2013-03-20 00:41:13.966 -0500>,<Administrator>,<X>,<proc1d>,<TOPSPIN 2.1>,
      <abs ABSG = 1 
       data hash MD5: 128K
       2C A3 D3 9D 56 88 4D 22 80 3E E5 4E 09 1D 56 0D>)
(   5,<2013-03-20 00:41:14.170 -0500>,<Administrator>,<X>,<proc1d>,<TOPSPIN 2.1>,
      <abs ABSG = 2 
       data hash MD5: 128K
       7E 3D 1F CD DB C8 89 D6 DF D1 16 0F 77 91 E4 9D>)
(   6,<2013-03-20 00:41:14.341 -0500>,<Administrator>,<X>,<proc1d>,<TOPSPIN 2.1>,
      <abs ABSG = 3 
       data hash MD5: 128K
       9E 1C 45 50 C4 35 77 3B 50 39 E1 AB 25 33 08 02>)
(   7,<2013-03-20 00:41:14.529 -0500>,<Administrator>,<X>,<proc1d>,<TOPSPIN 2.1>,
      <abs ABSG = 4 
       data hash MD5: 128K
       CA 9B 0F B2 E6 BB 9C 7B 47 46 05 7F 86 DE 0C 43>)
(   8,<2013-03-20 00:41:14.701 -0500>,<Administrator>,<X>,<proc1d>,<TOPSPIN 2.1>,
      <abs ABSG = 5 
       data hash MD5: 128K
       E0 04 5A 2F 3C A5 2C 5B 40 09 CA 0E 8A 03 82 6C>)
$$ ##END=
$$ 
$$ $$ hash MD5
$$ $$ C0 64 8B 44 04 14 62 7C 12 8B 09 17 F7 9F DB DB
##$RELAX= 
##$RELAX= 
##$RELAX= 
##$RELAX= 
##$RELAX= 
##$RELAX= 
##$RELAX= 
##$RELAX= 
$$ Bruker specific parameters
$$ --------------------------
##$DU= <E:\>
##$EXPNO= 12
$$ [...]
##$TP07= 0
##$TPNAME0= <>
##$TPNAME1= <>
##$TPNAME2= <>
##$TPNAME3= <>
##$TPNAME4= <>
##$TPNAME5= <>
##$TPNAME6= <>
##$TPNAME7= <>
##$TPOAL= (0..7)
0.5 0.5 0.5 0.5 0.5 0.5 0.5 0.5
##$TPOFFS= (0..7)
0 0 0 0 0 0 0 0
##$TUNHIN= 0
##$TUNHOUT= 0
##$TUNXOUT= 0
##$USERA1= <user>
##$USERA2= <user>
##$USERA3= <user>
##$USERA4= <user>
##$USERA5= <user>
##$V9= 5
##$VALIST= <valist>
##$VCLIST= <CCCCCCCCCCCCCCC>
##$VD= 0
##$VDLIST= <DDDDDDDDDDDDDDD>
##$VPLIST= <PPPPPPPPPPPPPPP>
##$VTLIST= <TTTTTTTTTTTTTTT>
##$WBST= 2048
##$WBSW= 25
##$XGAIN= (0..3)
0 0 0 0
##$XL= 0
##$YL= 0
##$YMAX_a= 6437781
##$YMIN_a= -13125434
##$ZGOPTNS= <>
##$ZL1= 120
##$ZL2= 120
##$ZL3= 120
##$ZL4= 120
##$ABSF1= 14.96082
##$ABSF2= -5.597362
##$ABSG= 5
##$ABSL= 3
##$ALPHA= 0
##$AQORDER= 0
##$ASSFAC= 0
##$ASSFACI= 0
##$ASSFACX= 0
##$ASSWID= 0
##$AUNMP= <proc_prof1d_extract.lims>
##$AXLEFT= 0
##$AXNAME= <>
##$AXNUC= <1H>
##$AXRIGHT= 0
##$AXTYPE= 0
##$AXUNIT= <>
##$AZFE= 0.1
##$AZFW= 0.1
##$BCFW= 0
##$BC_mod= 0
##$BYTORDP= 0
##$COROFFS= 0
##$CY= 15
##$DATMOD= 1
##$DC= 0
##$DFILT= <>
##$DTYPP= 0
##$F1P= 0
##$F2P= 0
##$FCOR= 0.5
##$FTSIZE= 131072
##$FT_mod= 6
##$GAMMA= 0
##$GB= 0
##$INTBC= 1
##$INTSCL= 1
##$ISEN= 128
##$LB= 0.3
##$LEV0= 0
##$LPBIN= 0
##$MAXI= 10000
##$MC2= 0
##$MEAN= 0
##$ME_mod= 0
##$MI= 0
##$NCOEF= 0
##$NC_proc= -2
##$NLEV= 6
##$NOISF1= 0
##$NOISF2= 0
##$NSP= 0
##$NTH_PI= 0
##$NZP= 0
##$OFFSET= 14.96082
##$PC= 1
##$PHC0= -76.97021
##$PHC1= 0
##$PH_mod= 1
##$PKNL= yes
##$PPARMOD= 0
##$PPDIAG= 0
##$PPIPTYP= 0
##$PPMPNUM= 2147483647
##$PPRESOL= 1
##$PSCAL= 4
##$PSIGN= 0
##$PYNMP= <proc.py>
##$REVERSE= no
##$SF= 400.020009708789
##$SI= 131072
##$SIGF1= 0
##$SIGF2= 0
##$SINO= 400
##$SIOLD= 131072
##$SPECTYP= <>
##$SREGLST= <1H.CDCl3>
##$SSB= 0
##$STSI= 131072
##$STSR= 0
##$SW_p= 8223.68421052631
##$SYMM= 0
##$S_DEV= 0
##$TDeff= 65536
##$TDoff= 0
##$TI= <>
##$TILT= no
##$TM1= 0
##$TM2= 0
##$TOPLEV= 0
##$USERP1= <user>
##$USERP2= <user>
##$USERP3= <user>
##$USERP4= <user>
##$USERP5= <user>
##$WDW= 1
##$XDIM= 131072
##$YMAX_p= 419710698
##$YMIN_p= -12217
##$CURPLOT= <Network HP LaserJet P1505>
##$CURPRIN= <$Network HP LaserJet P1505>
##$DFORMAT= <normdp>
##$LAYOUT= <+/1D_H.xwp>
##$LFORMAT= <normlp>
##$PFORMAT= <normpl>
##$SURQMSG= 1
$$ End of Bruker specific parameters
$$ ---------------------------------
##NTUPLES= NMR SPECTRUM
##VAR_NAME=  FREQUENCY,     SPECTRUM/REAL,   SPECTRUM/IMAG
##SYMBOL=    X,             R,               I
##VAR_TYPE=  INDEPENDENT,   DEPENDENT,       DEPENDENT
##VAR_FORM=  AFFN,          ASDF,            ASDF
##VAR_DIM=   131072,        131072,          131072
##UNITS=     HZ,            ARBITRARY UNITS, ARBITRARY UNITS
##FACTOR=    0.0627417313425164, 1,          1
##FIRST=     8223.62146879497, 3069,         -57998
##LAST=      0,             4813,            -58041
##MIN=       0,             -12217,          0
##MAX=       8223.62146879497, 419710698,    0
$$ Real data points
##PAGE= N=1
##DATA TABLE= (X++(R..R)), XYDATA
$$ [...]
$$ plain form
63919 4671961 4495444 4295017 4076205 3845126 3607431 3367673 3129615 2896739 2672287
63910 2672287 2459072 2259416 2075022 1906696 1754373 1617593 1495866 1388443 1293979 1210771
63900 1210771 1137489 1073420 1017879 969576 926849 888523 854293 824154 797696 774203 753220
63889 753220 734614 717971 702318 686673 670791 655190 640537 627217 615412 605362 597413 591845
63877 591845 588731 588011 589681 593821 600311 608657 618360 629490 642586 657829 674630 692316 710945
63864 710945 730940 751967 772677 791774 808956 824566 838665 850859 860906 868933 874891 878123
63852 878123 877769 873573 866172 856653 845901 834178 821081 805938 788487 769247 749075 728312
63840 728312 706597 683656 659973 636429 613437 590856 568651 547098 526182 505335 484241
$$ packed form
63919D671961j76517k00427k18812k31079k37695k39758k38058k32876k24452
63910B672287k13215j99656j84394j68326j52323j36780j21727j07423r4464q3208
63900A210771p3282o4069n5541m8303m2727l8326l4230l0139k6458k3493k0983
63889G53220j8606j6643j5653j5645j5882j5601j4653j3320j1805j0050p949n568
63877E91845l114p20J670M140O490Q346R703J1130J3096J5243J6801J7686J8629
63864G10945J9995K1027K0710J9097J7182J5610J4099J2194J0047Q027N958L232
63852H78123l54m196p401r519j0752j1723j3097j5143j7451j9240k0172k0763
63840G28312k1715k2941k3683k3544k2992k2581k2205k1553k0916k0847k1094
$$ plain form
63829 484241 463619 444643 427659 411934 396734 382169 368830 356976 346373 336693 327704 319190
63817 319190 310996 303176 295911 289320 283433 278280 273899 270319 267652 265952 264819 263361 260988 258160
63803 258160 255980 254930 254354 253310 251634 249901 248561 247428 246001 244122 242173 240578 239185 237349
63789 237349 234787 232115 230161 228900 227544 225679 223713 222062 220507 218740 217006 215695 214727 213883 213340
63774 213340 213187 212740 211216 208981 207329 206955 207430 208211 209253 210351 210835 210469 209942 209849 209861 209516 209213 209568
63756 209568 210324 210862 211479 213086 215623 217814 218713 218701 218686 219031 219613 220313 221004 221528 222051 223055 224613 226101
63738 226101 226968 227478 228322 229778 231609 233506 235307 237075 239256 242389 246311 250065 253076 256067 260180
63723 260180 265420 270637 274916 278357 281537 284963 289130 294316 299916 304571 307409 308833 309717 310241 309917
$$ packed form
63829D84241k0622j8976j6984j5725j5200j4565j3339j1854j0603r680q989q514
63817C19190q194p820p265o591n887n153m381l580k667j700j133j458k373k828
63803B58160k180j050n76j044j676j733j340j133j427j879j949j595j393j836
63789B37349k562k672j954j261j356j865j966j651j555j767j734j311r68q44n43
63774B13340j53m47j524k235j652l74M75P81J042J098M84l66n27r3J2l45l03L55
63756B09568P56N38O17J607K537K191Q99j2j5L45N82P00O91N24N23J004J558J488
63738B26101Q67N10Q44J456J831J897J801J768K181L133L922L754L011K991M113
63723B60180N240N217M279L441L180L426M167N186N600M655K838J424Q84N24l24
$$ plain form
63708 309917 308488 306258 303681 301035 298467 295973 293349 290395 287216 284156 281587 279959 279820 281340
63694 281340 283779 285843 286714 286595 286289 286546 287802 290174 293434 297133 300889 304464 307572 309861 311180
63679 311180 311696 311681 311331 310838 310420 310222 310402 311288 313065 315238 316870 317595 318025 318902 320336 322269 325086
63662 325086 328995 333058 335661 335967 334296 331167 326845 321935 317429 313625 309720 305076 300327 296561
63648 296561 293875 291464 288782 285840 282633 279222 276385 275244 275946 277401 278654 279935 281960 284817
63634 284817 288086 291642 295669 300060 304496 309112 314512 320884 327568 333849 339926 346739 354876 364011
63620 364011 373514 383320 393926 405714 418638 432616 447822 464452 482558 502442 524907 550679
63608 550679 579663 611121 644464 679493 716042 753898 793090 833503 873913 911859 944772
$$ packed form
63708C09917j429k230k577k646k568k494k624k954l179l060k569j628j39J520
63694B81340K439K064Q71j19l06K57J256K372L260L699L756L575L108K289J319
63679C11180N16j5l50m93m18j98J80Q86J777K173J632P25M30Q77J434J933K817
63662C25086L909M063K603L06j671l129m322m910m506l804l905m644m749l766
63648B96561k686k411k682k942l207l411k837j141P02J455J253J281K025K857
63634B84817L269L556M027M391M436M616N400O372O684O281O077O813Q137R135
63620C64011R503R806J0606J1788J2924J3978J5206J6630J8106J9884K2465K5772
63608E50679K8984L1458L3343L5029L6549L7856L9192M0413M0410L7946L2913
$$ plain form
63597 944772 971001 989732 1000658 1004271 1002067 995865 987087 976966 966873 957607 948456 937676 924016
63584 924016 907219 887168 863362 835639 804911 772708 740265 708354 677648 648789 622179
63573 622179 598064 576805 558785 544060 532300 523102 516235 511630 509271 509125 511065 514858 520262
63560 520262 527098 535122 543896 552928 562047 571582 582178 594412 608571 624670 642643 662550 684749
63547 684749 709943 738980 772434 810309 852211 897762 946485 997037 1046630 1091533 1128345
63536 1128345 1154932 1170602 1175984 1172861 1163721 1150998 1136655 1122348 1109471 1098567 1088709 1077893
63524 1077893 1064216 1046642 1024729 998082 966450 930294 890871 849566 807262 764533 722295
63513 722295 681935 644678 611024 580864 553940 529917 508217 488196 469656 452943 438407
$$ packed form
63597I44772K6229J8731J0926L613k204o202q778j0121j0093r266r151j0780j3660
63584I24016j6797k0051k3806k7723l0728l2203l2443l1911l0706k8859k6610
63573F22179k4115k1259j8020j4725j1760r198o867m605k359j46J940L793N404
63560E20262O836Q024Q774R032R119R535J0596J2234J4159J6099J7973J9907K2199
63547F84749K5194K9037L3454L7875M1902M5551M8723N0552M9593M4903L6812
63536A128345K6587J5670N382l123r140j2723j4343j4307j2877j0904r858j0816
63524A077893j3677j7574k1913k6647l1632l6156l9423m1305m2304m2729m2238
63513G22295m0360l7257l3654l0160k6924k4023k1700k0021j8540j6713j4536
$$ plain form
63502 438407 425893 414889 405018 396236 388617 382096 376419 371223 366185 361180 356433 352539 350304 350258
63488 350258 352077 354526 356309 357186 358031 359638 361693 363244 364039 364989 367158 370583 374275 377278 379516
63473 379516 381633 384165 386972 389408 390923 391388 390886 389382 386790 383307 379441 375591 371705 367488 362903
63458 362903 358409 354679 352060 350251 348552 346547 344617 343611 343973 345348 347173 349466 352782 357494
63444 357494 363391 369956 376755 383595 390693 398823 408945 421373 435607 451197 468568 488642 511914
63431 511914 538272 567456 599017 631792 663939 693720 719929 741640 758292 770509 780389 790466
63419 790466 802511 817537 836447 860020 888453 921584 959563 1002678 1050269 1100247 1149848
63408 1149848 1196566 1238175 1272432 1297399 1312211 1317391 1314449 1305356 1292264 1277311 1262189 1247582
$$ packed form
63502D38407j2514j1004r871q782p619o521n677n196n038n005m747l894k235m6
63488C50258J819K449J783Q77Q45J607K055J551P95R50K169L425L692L003K238
63473C79516K117K532K807K436J515M65n02j504k592l483l866l850l886m217m585
63458C62903m494l730k619j809j699k005j930j006L62J375J825K293L316M712
63444C57494N897O565O799O840P098Q130J0122J2428J4234J5590J7371K0074K3272
63431E11914K6358K9184L1561L2775L2147K9781K6209K1711J6652J2217R880J0077
63419G90466J2045J5026J8910K3573K8433L3131L7979M3115M7591M9978M9601
63408A149848M6718M1609L4257K4967J4812N180k942r093j3092j4953j5122j4607
$$ plain form
63396 1247582 1232880 1216521 1196790 1172520 1143279 1109195 1070757 1028750 984222 938523 893202
63385 893202 849636 808618 770463 735491 704039 675867 650080 626197 605044 588000 575412
63374 575412 566226 559246 554245 551752 552183 555386 560730 567453 575187 584308 595584 609442 625819 644663
63360 644663 666140 690285 717016 746665 780009 817367 858075 901232 946629 994415 1043949
63349 1043949 1093377 1140292 1182536 1218492 1247063 1267559 1279614 1283346 1279722 1270590 1258094 1243951
63337 1243951 1229134 1213937 1198122 1181167 1162449 1141046 1115549 1084661 1048326 1007946 965366
63326 965366 921971 878852 837124 797597 760652 726977 697973 674781 657252 644426 635537 629675
63314 629675 624805 618237 608249 594586 577517 557434 535596 514097 494402 476376 459257 443067
$$ packed form
63396A247582j4702j6359j9731k4270k9241l4084l8438m2007m4528m5699m5321
63385H93202m3566m1018l8155l4972l1452k8172k5787k3883k1153j7044j2588
63374E75412r186o980n001k493M31L203N344O723P734R121J1276J3858J6377J8844
63360F44663K1477K4145K6731K9649L3344L7358M0708M3157M5397M7786M9534
63349A043949M9428M6915M2244L5956K8571K0496J2055L732l624r132j2496j4143
63337A243951j4817j5197j5815j6955j8718k1403k5497l0888l6335m0380m2580
63326I65366m3395m3119m1728l9527l6945l3675k9004k3192j7529j2826q889n862
63314F29675m870o568r988j3663j7069k0083k1838k1499j9695j8026j7119j6190
$$ plain form
63302 443067 428606 416520 406879 399357 393311 387985 383037 378688 375042 371596 367799 363843 360394 357666
63288 357666 355110 351938 347655 342282 336394 330915 326584 323615 321901 321218 320971 320192 318377 316191 314874
63273 314874 314913 315722 316575 317346 318181 318859 318879 318049 316816 315971 316059 317017 318390 319859 321420 323118 324905 326982
63255 326982 329910 333978 338649 343056 346960 350797 354881 359116 363616 368976 375597 383103 390906 399144
63241 399144 408632 419947 432932 447142 462428 478966 496897 516202 536844 558857 582167 606505
63229 606505 631597 657425 684074 711284 738366 764733 790359 815517 840210 864231 887772
63218 887772 911586 936362 962084 988118 1013705 1038200 1061047 1081694 1099438 1113225 1121791 1124243
63206 1124243 1120402 1110478 1094660 1073364 1047646 1018802 987545 954045 919027 884296 851822 822564
$$ packed form
63302D43067j4461j2086r641p522o046n326m948m349l646l446l797l956l449k728
63288C57666k556l172m283n373n888n479m331k969j714o83k47p79j815k186j317
63273C14874L9Q09Q53P71Q35O78K0q30j233q45Q8R58J373J469J561J698J787K077
63255C26982K928M068M671M407L904L837M084M235M500N360O621P506P803Q238
63241C99144R488J1315J2985J4210J5286J6538J7931J9305K0642K2013K3310K4338
63229F06505K5092K5828K6649K7210K7082K6367K5626K5158K4693K4021K3541
63218H87772K3814K4776K5722K6034K5587K4495K2847K0647J7744J3787Q566K452
63206A124243l841r924j5818k1296k5718k8844l1257l3500l5018l4731l2474k9258
$$ plain form
63194 822564 796538 773748 754520 739015 726996 718253 712892 711045 712609 717416 725334 736005 748820
63181 748820 763443 780112 799115 820163 842546 865718 889318 912766 935305 956568 976776
63170 976776 996349 1015525 1034314 1052416 1069034 1083058 1093611 1100179 1102190 1098823 1089503 1074381
63158 1074381 1054066 1029041 999583 966201 929914 892078 853982 816544 780282 745557 712813
63147 712813 682512 654838 629662 606790 586175 567873 551985 538618 527637 518473 510402 503075
63135 503075 496566 490900 485885 481441 477709 474694 472201 470279 469351 469647 470891 472798 475477 478957 482683
63120 482683 485979 488833 491818 495411 499683 504401 509066 513132 516587 520037 523768 527104 529295 530711
63106 530711 532377 534496 536325 537536 538770 540580 542615 544258 545437 546337 546863 546924 546899 547304 548233 549390
$$ packed form
63194H22564k6026k2790j9228j5505j2019q743n361j847J564M807P918J0671J2815
63181G48820J4623J6669J9003K1048K2383K3172K3600K3448K2539K1263K0208
63170I76776J9573J9176J8789J8102J6618J4024J0553O568K011l367r320j5122
63158A074381k0315k5025k9458l3382l6287l7836l8096l7438l6262l4725l2744
63147G12813l0301k7674k5176k2872k0615j8302j5888j3367j0981r164q071p327
63135E03075o509n666n015m444l732l015k493j922r28K96J244J907K679L480L726
63120D82683L296K854K985L593M272M718M665M066L455L450L731L336K191J416
63106E30711J666K119J829J211J234J810K035J643J179R00N26O1k5M05R29J157
$$ plain form
63090 549390 550465 551224 551606 551962 552849 554262 555439 555782 555612 555626 556014 556639 557815 560213 564041 568840 574121
63073 574121 579815 586047 592875 600323 608404 617055 626235 636122 647002 659062 672495 687719 705132
63060 705132 724680 745901 768537 792956 819966 850325 884405 922199 963679 1009082 1058611
63049 1058611 1111789 1167532 1225059 1284345 1345388 1407515 1469978 1532846 1596505 1660444 1723401
63038 1723401 1784824 1845457 1906212 1967134 2027849 2088347 2148695 2208207 2265398 2318557 2365958
63027 2365958 2405626 2435395 2453398 2458401 2449748 2427231 2391110 2342234 2282145 2212990 2137166 2057019
63015 2057019 1974906 1893340 1814581 1740023 1670307 1606214 1549126 1500462 1460919 1430430 1408570
63004 1408570 1394798 1388598 1389708 1397988 1412932 1433560 1459015 1488913 1522749 1559324 1597250 1635862
$$ packed form
63090E49390J075P59L82L56Q87J413J177L43j70J4L88O25J176K398L828M799N281
63073E74121N694O232O828P448Q081Q651R180R887J0880J2060J3433J5224J7413
63060G05132J9548K1221K2636K4419K7010L0359L4080L7794M1480M5403M9529
63049A058611N3178N5743N7527N9286O1043O2127O2463O2868O3659O3939O2957
63038A723401O1423O0633O0755O0922O0715O0498O0348N9512N7191N3159M7401
63027B365958L9668K9769J8003N003q653k2517l6121m8876o0089o9155p5824q0147
63015B057019q2113q1566p8759p4558o9716o4093n7088m8664l9543l0489k1860
63004A408570j3772o200J110Q280J4944K0628K5455K9898L3836L6575L7926L8612
$$ plain form
62992 1635862 1675174 1715065 1755018 1794609 1833738 1872231 1909596 1945185 1978237 2007574 2031602
62981 2031602 2048858 2058415 2059648 2051778 2033887 2005394 1966549 1918445 1862441 1799555 1730659 1657394
62969 1657394 1582487 1508642 1437274 1368742 1303594 1242835 1186878 1134986 1086189 1040356 998021
62958 998021 959544 924854 893701 865685 840211 816775 795209 775319 756473 737870 719158
62947 719158 700460 681939 663721 646160 629750 614638 600552 587288 574993 563777 553337
62936 553337 543223 533370 524167 515989 508805 502329 496475 491475 487436 483894 480122 475962 472129 469482
62922 469482 468148 467550 467127 466680 466112 465176 463621 461409 458717 455803 452881 450016 447164 444384 441864
62907 441864 439615 437349 434905 432621 430894 429495 427756 425419 422805 420051 416762 412735 408586 405209
$$ packed form
62992A635862L9312L9891L9953L9591L9129L8493L7365L5589L3052K9337K4028
62981B031602J7256R557J233p870j7891k8493l8845m8104n6004o2886o8896p3265
62969A657394p4907p3845p1368o8532o5148o0759n5957n1892m8797m5833m2335
62958I98021l8477l4690l1153k8016k5474k3436k1566j9890j8846j8603j8712
62947G19158j8698j8521j8218j7561j6410j5112j4086j3264j2295j1216j0440
62936E53337j0114r853r203q178p184o476n854n000m039l542l772m160l833k647
62922D69482j334n98m23m47n68r36j555k212k692k914k922k865k852k780k520
62907D41864k249k266k444k284j727j399j739k337k614k754l289m027m149l377
$$ plain form
62893 405209 402862 401194 400018 399587 400127 401442 403010 404290 404996 405298 405734 406657 407847 408825 409472 410052
62877 410052 410729 411394 411933 412270 412143 411366 410456 410500 411941 413785 414459 413366 411275 409351 408266 408120 408606
62860 408606 408994 408488 407034 405601 405223 405887 406720 407200 407752 409022 410921 412625 413387 413134 412385 411779 411631
62843 411631 411781 411823 411504 410859 410018 409045 408031 407129 406374 405634 404882 404329 404138 404159 404238 404546 405244 405929 405934 405269
62823 405269 404825 405414 406966 408922 411116 413820 417002 420057 422516 424792 427874 432185 436980 441165 444672
62808 444672 448634 454037 460547 467031 472998 479027 485858 493678 502394 512021 522485 533428 544576
62795 544576 556100 568445 582041 597316 614557 633551 653847 675700 700304 728641 760544
62784 760544 795495 833944 877144 925960 980683 1041896 1110519 1186766 1269770 1358555 1452672
$$ packed form
62893D05209k347j668j176m31N40J315J568J280P06L02M36R23J190R78O47N80
62877D10052O77O65N39L37j27p77r10M4J441J844O74j093k091j924j085j46M86
62860D08606L88n06j454j433l78O64Q33M80N52J270J899J704P62k53p49o06j48
62843D11631J50M2l19o45q41r73j014r02p55p40p52n53j91K1P9L08O98O85No65
62823D05269m44N89J552J956K194K704L182L055K459K276L082M311M795M185L507
62808D44672L962N403O510O484N967O029O831P820Q716R627J0464J0943J1148
62795E44576J1524J2345J3596J5275J7241J8994K0296K1853K4604K8337L1903
62784G60544L4951L8449M3200M8816N4723O1213O8623P6247Q3004Q8785R4117
$$ plain form
62773 1452672 1551449 1653277 1756190 1858693 1959343 2055677 2144167 2221250 2284146 2330974
62763 2330974 2360663 2372891 2367730 2345272 2305962 2251370 2184266 2107535 2023141 1932374 1836970
62752 1836970 1739542 1642714 1548068 1456278 1368145 1284992 1207842 1136575 1070347 1008733 952019
62741 952019 900469 853750 811225 772466 737342 705899 678319 654716 634733 617513 602243
62730 602243 588599 576516 565788 556136 547561 540363 534783 530760 528011 526234 525281 525222 526167 528081
62716 528081 530895 534774 540071 546939 555270 565149 577099 591681 609031 629023 651766 677668 707080
62703 707080 740082 776650 816910 861258 910280 964457 1023867 1088334 1157887 1232818 1312986
62692 1312986 1397134 1483124 1568909 1653220 1735320 1814053 1887009 1950659 2001567 2037643 2058196
$$ packed form
62773A452672R8777J01828J02913J02503J00650R6334Q8490P7083O2896M6828
62763B330974K9689J2228n161k2458l9310n4592o7104p6731q4394r0767r5404
62752A836970r7428r6828r4646r1790q8133q3153p7150p1267o6228o1614n6714
62741I52019n1550m6719m2525l8759l5124l1443k7580k3603j9983j7220j5270
62730F02243j3644j2083j0728r652q575p198n580m023k749j777r53n9R45J914
62716E28081K814L879N297O868Q331R879J1950J4582J7350J9992K2743K5902K9412
62703G07080L3002L6568M0260M4348M9022N4177N9410O4467O9553P4931Q0168
62692A312986Q4148Q5990Q5785Q4311Q2100P8733P2956O3650N0908L6076K0553
$$ plain form
62681 2058196 2062968 2051671 2024589 1983154 1929460 1865476 1793067 1714421 1631841 1547095 1461451
62670 1461451 1376349 1293575 1214605 1140136 1070480 1006138 947652 894947 847114 803099 762522
62659 762522 725673 692618 662631 634800 609040 585969 565785 547842 531536 516991 504408
62648 504408 493289 482971 473529 465394 458225 450965 443098 435174 427991 421861 416837 413001 410131 407623
62634 407623 405195 403393 402971 403887 405216 406001 406019 405797 405994 406642 406992 406260 404560 402835 401853 401560 401458
62617 401458 401313 401336 401966 403659 406589 410404 414517 418790 423626 429289 435510 442048 449293 457926 468230
62602 468230 480092 493497 508651 525695 544681 565871 589782 616927 647631 682050 720156
62591 720156 761755 806651 854669 905320 957445 1009347 1059219 1105390 1146342 1180751 1207511
$$ packed form
62681B058196M772j1297k7082m1435n3694o3984p2409p8646q2580q4746q5644
62670A461451q5102q2774p8970p4469o9656o4342n8486n2705m7833m4015m0577
62659G62522l6849l3055k9987k7831k5760k3071k0184j7943j6306j4545j2583
62648E04408j1119j0318r442q135p169p260p867p924p183o130n024l836k870k508
62634D07623k428j802m22R16J329P85J8k22J97O48L50p32j700j725r82k93j02
62617D01458j45K3O30J693K930L815M113M273M836N663O221O538P245Q633J0304
62602D68230J1862J3405J5154J7044J8986K1190K3911K7145L0704L4419L8106
62591G20156M1599M4896M8018N0651N2125N1902M9872M6171M0952L4409K6760
$$ plain form
62580 1207511 1225686 1234626 1234305 1225340 1208455 1184087 1152788 1115800 1074819 1031192 985682 939020
62568 939020 892317 846824 803527 763079 725854 691888 660893 632471 606316 582250 560183
62557 560183 540088 521955 505851 492087 481089 472764 466041 459517 452716 446403 441482 437893 434855
62544 434855 431875 429076 426664 424626 423067 422404 422957 424581 426941 429882 433222 436380 438732 440317 441739
62529 441739 443269 444533 445400 446772 449972 455557 463214 472653 484017 497378 512464 529207 548178
62516 548178 570136 595417 624014 655968 691355 730095 772082 817285 865345 915197 965472
62505 965472 1015179 1063601 1109507 1150974 1186206 1214237 1234651 1246974 1250753 1246195 1234396 1216806
62493 1216806 1194677 1169122 1141502 1113410 1086280 1061211 1039272 1021689 1009525 1003322 1003266 1009501
$$ packed form
62580A207511J8175Q940l21q965j6885k4368l1299l6988m0981m3627m5510m6662
62568I39020m6703m5493m3297m0448l7225l3966l0995k8422k6155k4066k2067
62557E60183k0095j8133j6104j3764j0998q325o723o524o801o313m921l589l038
62544D34855k980k799k412k038j559o63N53J624K360K941L340L158K352J585J422
62529D41739J530J264Q67J372L200N585P657R439J1364J3361J5086J6743J8971
62516E48178K1958K5281K8597L1954L5387L8740M1987M5203M8060M9852N0275
62505I65472M9707M8422M5906M1467L5232K8031K0414J2323L779m558j1799j7590
62493A216806k2129k5555k7620k8092k7130k5069k1939j7583j2164o203n6O235
$$ plain form
62481 1009501 1021921 1039850 1062442 1089485 1121354 1157998 1198346 1240841 1284059 1326446 1365884
62470 1365884 1400051 1427152 1446090 1456245 1457520 1450356 1435130 1411564 1379153 1338086 1289452 1234704
62458 1234704 1175520 1114080 1052705 992910 935206 880086 828681 782126 740658 703753 670965
62447 670965 642247 617630 597015 580266 567152 557101 549282 543069 538263 534774 532245 530251 528804
62434 528804 528370 529210 530862 532530 533888 535120 536137 536162 534355 530548 525049 518089 509957 501451 493558
62419 493558 486531 479764 472717 465542 458637 452037 445606 439511 434124 429547 425509 421712 418017 414344
62405 414344 410579 406662 402726 399128 396312 394482 393382 392475 391447 390451 389862 389861 390279 390783 391251 392016 393575
62388 393575 395903 398233 399841 400932 402350 404530 407241 410340 414164 418893 424059 429174 434496 440781
$$ packed form
62481A009501J2420J7929K2592K7043L1869L6644M0348M2495M3218M2387L9438
62470A365884L4167K7101J8938J0155J275p164j5226k3566l2411m1067m8634n4748
62458A234704n9184o1440o1375n9795n7704n5120n1405m6555m1468l6905l2788
62447F70965k8718k4617k0615j6749j3114j0051p819o213m806l489k529j994j447
62434E28804m34Q40J652J668J358J232J017K5j807l807n499o960q132q506p893
62419D93558p027o767p047p175o905o600o431o095n387m577m038l797l695l673
62405D14344l765l917l936l598k816j830j100r07j028r96n89jM18N04M68P65J559
62388C93575K328K330J608J091J418K180K711L099L824M729N166N115N322O285
$$ plain form
62374 440781 448468 457424 467201 477200 486900 496458 506930 519384 533862 549620 566298 584300 604105
62361 604105 625895 650163 678104 710936 749051 792223 840430 894057 953298 1017755 1086696
62350 1086696 1159315 1234406 1309838 1382628 1449696 1508548 1557341 1594702 1619901 1633264 1636052
62339 1636052 1629631 1614717 1591441 1559976 1520958 1475456 1424739 1370120 1312903 1254492 1196552
62328 1196552 1140943 1089277 1042419 1000367 962534 928228 897102 869225 844500 821980 800139
62317 800139 778104 756285 735386 715079 694273 672648 651267 631411 613299 596298 579994
62306 579994 564592 550470 537876 527081 518381 511660 506138 500820 495228 489660 484791 481138 478867
62293 478867 477868 477716 477647 476957 475704 474836 475271 476891 478764 480341 481980 484104 486358 488121 489630 491945
$$ packed form
62374D40781P687Q956R777R999R700R558J0472J2454J4478J5758J6678J8002J9805
62361F04105K1790K4268K7941L2832L8115M3172M8207N3627N9241O4457O8941
62350A086696P2619P5091P5432P2790O7068N8852M8793L7361K5199J3363K788
62339A636052o421j4914k3276l1465l9018m5502n0717n4619n7217n8411n7940
62328A196552n5609n1666m6858m2052l7833l4306l1126k7877k4725k2520k1841
62317H00139k2035k1819k0899k0307k0806k1625k1381j9856j8112j7001j6304
62306E79994j5402j4122j2594j0795q700o721n522n318n592n568m869l653k271
62293D78867r99j52o9o90j253q68M35J620J873J577J639K124K254J763J509K315
$$ plain form
62277 491945 495669 500240 504799 509351 514580 520724 527248 533754 540675 548721 557963 567936 578542 590393
62263 590393 604213 620361 639155 661298 687572 718262 753269 792790 837552 888274 945102
62252 945102 1007718 1075695 1148428 1224645 1302178 1378343 1450554 1516559 1574242 1621525 1656821
62241 1656821 1679664 1690752 1691186 1681692 1662574 1634191 1597184 1552208 1499724 1440376 1375656 1308140
62229 1308140 1240873 1176292 1115544 1058795 1006131 958047 915048 877034 843371 813495 787202
62218 787202 764263 744009 725515 708095 691500 675667 660486 645865 631927 618956 607108
62207 607108 596191 585775 575549 565531 555986 547168 539124 531772 525201 519907 516565 515435 516045
62194 516045 517670 520013 523184 527096 531333 535782 540940 547271 554572 562411 570950 580763 591882 603639
$$ packed form
62277D91945L724M571M559M552N229O144O524O506O921Q046R242R973J0606J1851
62263E90393J3820J6148J8794K2143K6274L0690L5007L9521M4762N0722N6828
62252I45102O2616O7977P2733P6217P7533P6165P2211O6005N7683M7283L5296
62241A656821K2843J1088M34r494j9118k8383l7007m4976n2484n9348o4720o7516
62229A308140o7267o4581o0748n6749n2664m8084m2999l8014l3663k9876k6293
62218G87202k2939k0254j8494j7420j6595j5833j5181j4621j3938j2971j1848
62207F07108j0917j0416j0226j0018r545q818q044p352o571n294l342j130O10
62194E16045J625K343L171L912M237M449N158O331P301P839Q539R813J1119J1757
$$ plain form
62180 603639 615583 627967 640984 653934 665724 676048 685558 694861 703790 711954 719764 728638 740224
62167 740224 755606 775242 799396 828370 862317 901105 944509 992423 1044566 1099868 1156278
62156 1156278 1211251 1262460 1308068 1346554 1376523 1396919 1407537 1409337 1404012 1392880 1376068 1352863
62144 1352863 1322885 1286788 1245952 1201884 1156128 1110339 1065844 1023102 982006 942893 906996
62133 906996 875742 849824 829062 812825 800264 790399 782499 776443 772372 769953 768387 767249 766940
62120 766940 768110 770991 775559 781898 789917 798930 808003 816537 823982 829220 831110 829815 826913 823853
62106 823853 820918 818022 815674 814307 813084 810343 805270 798533 791241 783971 776987 770780 766003 763099
62092 763099 762244 763339 765923 769313 773086 777250 781888 786861 792013 797445 803442 810320 818449 828159
$$ packed form
62180F03639J1944J2384J3017J2950J1790J0324R510R303Q929Q164P810Q874J1586
62167G40224J5382J9636K4154K8974L3947L8788M3404M7914N2143N5302N6410
62156A156278N4973N1209M5608L8486K9969K0396J0618J800n325j1132j6812k3205
62144A352863k9978l6097m0836m4068m5756m5789m4495m2742m1096l9113l5897
62133I06996l1254k5918k0762j6237j2561r865p900o056m071k419j566j138l09
62120G66940J170K881M568O339Q019R013R073Q534P445N238J890j295k902l060
62106H23853k935k896k348j367j223k741n073o737p292p270o984o207m777k904
62092G63099q55J095K584L390L773M164M638M973N152N432N997O878Q129R710
$$ plain form
62078 828159 839419 851751 864695 878296 893050 909501 927909 948125 969659 992017 1015090
62067 1015090 1039038 1063801 1089006 1114542 1140992 1169280 1200107 1233848 1270637 1310065 1350866
62056 1350866 1391300 1429872 1465396 1496437 1521208 1538295 1547307 1548631 1542776 1530166 1511333 1486831
62044 1486831 1456833 1421074 1379415 1332391 1281082 1226669 1170372 1113736 1058531 1006094 956908
62033 956908 910904 868012 828283 791765 758553 728805 702420 678824 657440 638322 621981
62022 621981 608569 597597 588452 580780 574151 567783 560993 553802 546825 540549 534853 529151 522965 516468
62008 516468 510520 506033 503260 501799 501285 501748 503225 505337 507536 509623 511758 514098 516648 519435 522534
61993 522534 525797 528631 530254 530323 529304 528019 526732 524837 521657 517211 511912 505738 498305 489690 480572
$$ packed form
62078H28159J1260J2332J2944J3601J4754J6451J8408K0216K1534K2358K3073
62067A015090K3948K4763K5205K5536K6450K8288L0827L3741L6789L9428M0801
62056A350866M0434L8572L5524L1041K4771J7087R012J324n855j2610j8833k4502
62044A486831k9998l5759m1659m7024n1309n4413n6297n6636n5205n2437m9186
62033I56908m6004m2892l9729l6518l3212k9748k6385k3596k1384j9118j6341
62022F21981j3412j0972r145p672o629o368o790p191o977o276n696n702o186o497
62008E16468n948m487k773j461n14M63J477K112K199K087K135K340K550K787L099
61993E22534L263K834J623O9j019j285j287j895l180m446n299o174p433q615r118
$$ plain form
61978 480572 471436 462195 452808 443729 435445 428021 421473 416167 412362 409615 407119 404486 401906 399701
61964 399701 397981 396630 395374 394053 392973 392664 393114 393630 393746 393798 394257 394953 395534 396268 397704 399807 402051
61947 402051 404203 406391 408608 410863 413771 418224 424380 431633 439692 449095 460450 473728 488501
61934 488501 504381 520867 537197 552674 567046 580455 593203 605533 617353 628165 637512 645363
61922 645363 651734 656142 658033 657652 655824 652825 648129 641465 633506 625323 617726 611419 607193 605599
61908 605599 606727 610486 616644 624568 633618 644053 656794 671793 687330 701430 713419 723483
61896 723483 731348 736214 737660 735827 730924 723359 714192 704655 695114 685091 674354 663470 653225
61883 653225 644028 636012 629191 623268 617577 611427 604334 595963 586180 575261 563835 552500 541639
$$ packed form
61978D80572r136r241r387r079q284p424o548n306l805k747k496k633k580k205
61964C99701j720j351j256j321j080l09M50N16J16N2M59O96N81P34J436K103K244
61947D02051K152K188K217K255K908M453O156P253Q059R403J1355J3278J4773
61934D88501J5880J6486J6330J5477J4372J3409J2748J2330J1820J0812R347P851
61922F45363O371M408J891l81j828k999m696o664p959q183p597o307m226j594
61908F05599J128L759O158P924R050J0435J2741J4999J5537J4100J1989J0064
61896G23483P865M866J446j833m903p565r167r537r541j0023j0737j0884j0245
61883F53225r197q016o821n923n691o150p093q371r783j0919j1426j1335j0861
$$ plain form
61870 541639 531562 522599 515025 509027 504681 501767 499729 498034 496510 495206 494173 493661 494354 496977
61856 496977 501697 508211 516338 526193 537875 551367 566775 584288 603879 625279 648237 672520
61844 672520 697716 723352 749148 774758 799235 821140 839281 853096 862389 867092 867404 863757
61832 863757 856560 846323 834126 821573 810042 800259 792738 788235 787433 790402 796640 805556 816645
61819 816645 829311 842697 855689 866989 875245 879280 878304 872051 860830 845349 826343 804446
61807 804446 780513 755723 730993 706468 682037 658263 636230 616476 598645 582258 567150
61796 567150 553001 539215 525789 513699 503764 495556 488052 480986 474767 469283 463768 457951 452536
61783 452536 448156 444470 440772 437061 433989 431940 430633 429635 428845 428373 428153 427866 427266 426548 426309 427063
$$ packed form
61870E41639j0077q963p574n998m346k914k038j695j524j304j033n12O93K623
61856D96977M720O514Q127R855J1682J3492J5408J7513J9591K1400K2958K4283
61844F72520K5196K5636K5796K5610K4477K1905J8141J3815R293M703L12l647
61832H63757p197j0237j2197j2553j1531r783p521m503q02K969O238Q916J1089
61819H16645J2666J3386J2992J1300Q256M035r76o253j1221j5481j9006k1897
61807H04446k3933k4790k4730k4525k4431k3774k2033j9754j7831j6387j5108
61796E67150j4149j3786j3426j2090r935q208p504p066o219n484n515n817n415
61783D52536m380l686l698l711l072k049j307r98p90m72k20k87o00p18k39P54
$$ plain form
61767 427063 428758 430875 432998 435111 437280 439337 441124 442951 445474 449048 453406 458045 462754 467591
61753 467591 472472 477017 480809 483748 486056 488026 489753 491114 491982 492386 492259 491095 488139 483232 477325
61738 477325 471802 467291 463427 459779 456548 454113 452254 450340 448272 446806 446800 448259 450244 451691 452282
61723 452282 452550 453196 454402 455913 457640 459828 462548 465424 468157 471051 474660 479003 483407 487003 489138
61708 489138 489527 488487 486922 485639 484602 483135 480831 477869 474528 470953 467454 464393 461548 458090
61694 458090 453682 449150 445597 443108 440817 438095 435171 432637 430756 429315 427803 425723 423029 420346
61680 420346 418363 416913 414985 411852 407959 404492 402273 401342 401361 401919 402416 402194 401142 399949 399357 399242
61664 399242 398806 397674 396396 395761 395995 396809 397894 399007 399872 400381 400779 401295 401786 402099 402595 403793 405515
$$ packed form
61767D27063J695K117K123K113K169K057J787J827K523L574M358M639M709M837
61753D67591M881M545L792K939K308J970J727J361Q68M04j27j164k956m907n907
61738D77325n523m511l864l648l231k435j859j914k068j466oJ459J985J447N91
61723D52282K68O46J206J511J727K188K720K876K733K894L609M343M404L596K135
61708D89138L89j040j565j283j037j467k304k962l341l575l499l061k845l458
61694D58090m408m532l553k489k291k722k924k534j881j441j512k080k694k683
61680D20346j983j450j928l133l893l467k219r31J9N58M97k22j052j193n92j15
61664C99242m36j132j278o35K34Q14J085J113Q65N09L98N16M91L13M96J198J722
$$ plain form
61647 405515 406968 407785 408487 409773 411746 414038 416273 418183 419630 420813 422181 423901 425640 427079 428314
61632 428314 429489 430322 430315 429306 427588 425666 424037 422937 422096 420985 419467 417898 416409 414538 411959
61617 411959 409121 406657 404504 402202 399846 398044 396929 395870 394273 392172 389838 387256 384217 380600
61603 380600 376305 371196 365305 358935 352434 346068 340242 335590 332576 331008 330045 328669 326220 322734
61589 322734 318923 315733 313676 312505 311501 310109 308337 306572 305031 303449 301390 298807 296145 293877
61575 293877 292153 290949 290274 290040 289966 289780 289378 288690 287625 286354 285378 285059 285292 285815 286556 287400 288006 288267
61557 288267 288680 289747 291236 292532 293484 294317 294917 294996 294958 295741 297514 299236 299898 299655 299312 299197 299131 299134 299551
61538 299551 300500 301674 302757 303718 304641 305448 305947 306104 306241 306803 307816 308671 308765 308311 308203 308977 310204 311029
$$ packed form
61647D05515J453Q17P02J286J973K292K235J910J447J183J368J720J739J439J235
61632D28314J175Q33pj009j718j922j629j100q41j111j518j569j489j871k579
61617D11959k838k464k153k302k356j802j115j059j597k101k334k582l039l617
61603C80600m295n109n891o370o501o366n826m652l014j568r63j376k449l486
61589C22734l811l190k057j171j004j392j772j765j541j582k059k583k662k268
61575B93877j724j204o75k34p4j86m02o88j065j271r76l19K33N23P41Q44O06K61
61557B88267M13J067J489J296R52Q33O00P9l8P83J773J722O62k43l43j15o6LM17
61538B99551R49J174J083R61R23Q07M99J57J37N62J013Q55R4m54j08P74J227Q25
$$ plain form
61520 311029 310966 310033 308460 306612 304997 304012 303674 303703 303779 303640 303122 302292 301432 300785 300443 300493 301050 301966 302759
61501 302759 303054 302950 302788 302712 302623 302413 302072 301694 301583 302251 304031 306640 309248 311044 311800 311939 312021 312080 311576
61482 311576 310157 308308 306907 306249 305933 305733 306044 307288 309340 311825 314533 317193 319197 320125 320349 320704
61466 320704 321646 322977 324238 324979 324840 323806 322379 321181 320341 319560 318725 318107 317933 318050 318121 317943 317593
61449 317593 317415 317870 319107 320658 321733 321965 321747 321834 322729 324412 326462 328353 329765 330755 331724 333236
61433 333236 335747 339322 343508 347617 351214 354287 356965 359236 360981 362095 362575 362692 363065 364236 366061
61418 366061 367872 369361 370956 373091 375521 377592 378811 378841 377462 375105 373056 372418 372908 373177 372276 370311
61402 370311 367842 365295 363030 361299 359866 358107 355778 353370 351492 350192 349122 348143 347513 347545 348203
$$ packed form
61520C11029o3r33j573j848j615r85l38K9P6j39n18q30q60o47l42N0N57R16P93
61501C02759K95j04j62p6q9k10l41l78j11O68J780K609K608J796P56J39Q2N9n04
61482C11576j419j849j401o58l16k00L11J244K052K485K708K660K004R28K24L55
61466C20704R42J331J261P41j39j034j427j198q40p81q35o18j74J17P1j78l50
61449C17593j78M55J237J551J075K32k18Q7Q95J683K050J891J412R90R69J512
61433C33236K511L575M186M109L597L073K678K271J745J114M80J17L73J171J825
61418C66061J811J489J595K135K430K071J219L0j379k357k049o38M90K69r01j965
61402C70311k469k547k265j731j433j759k329k408j878j300j070r79o30L2O58
$$ plain form
61387 348203 349032 349522 349583 349556 349696 349876 350006 350340 350995 351517 351537 351662 352900 355221 357486 359010 360405 362471
61369 362471 364911 366793 367888 368898 370503 372647 374732 376171 376822 377160 377997 379824 382447 385322 388094
61354 388094 390724 393370 396389 400231 405055 410575 416475 422832 429858 437342 444574 450839 455855 459828
61340 459828 463157 466047 468418 470318 472333 475170 478834 482632 486145 489677 493471 497026 499677 501424
61326 501424 502577 502883 501765 499367 496724 494784 493758 493464 493684 494009 493863 493094 492258 492047 492721 494278
61310 494278 496860 500592 505262 510548 516564 523808 532560 542520 553068 563682 574000 583615 591964
61297 591964 598459 602701 604583 604206 601784 597707 592592 587055 581312 575155 568390 561195 553926 546717
61283 546717 539495 532377 525767 519956 514741 509671 504661 500241 497155 495785 495957 497223 499221 501779
$$ packed form
61387C48203Q29M90O1k7J40J80J30L34O55N22K0J25J238K321K265J524J395K066
61369C62471K440J882J095J010J605K144K085J439O51L38Q37J827K623K875K772
61354C88094K630K646L019L842M824N520N900O357P026P484P232O265N016L973
61340D59828L329K890K371J900K015K837L664L798L513L532L794L555K651J747
61326E01424J153L06j118k398k643j940j026k94K20L25j46p69q36k11O74J557
61310D94278K582L732M670N286O016P244Q752R960J0548J0614J0318R615Q349
61297E91964O495M242J882l77k422m077n115n537n743o157o765p195p269p209
61283E46717p222p118o610n811n215n070n010m420l086j370J72J266J998K558
$$ plain form
61269 501779 504763 507929 510989 513876 516872 520386 524574 529263 534276 539761 546060 553272 561087 569013
61255 569013 576674 583796 590078 595217 599143 602114 604532 606683 608687 610669 612810 615092 617083 618179
61241 618179 618167 617398 616307 614887 612773 609758 606060 602104 598190 594399 590721 587253 584287 582159 580968
61226 580968 580532 580687 581483 582992 585073 587486 590141 593070 596289 599913 604219 609286 614612 619458 623604
61211 623604 627520 631728 636210 640464 643896 646122 647105 647135 646605 645878 645464 646079 648210 651699 656140 661580
61195 661580 668417 676716 686149 696586 708102 720270 732090 742892 752685 761297 767848 771683 773385
61182 773385 774257 775072 775849 776447 776663 775891 773468 769433 764513 759386 754423 749965 746186 742572 738230 733010
61166 733010 727821 723469 719538 714828 708756 701956 695444 689370 682763 674596 664987 655099 645849 637177
$$ packed form
61269E01779K984L166L060K887K996L514M188M689N013N485O299P212P815P926
61255E69013P661P122O282N139L926K971K418K151K004J982K141K282J991J096
61241F18179j2p69j091j420k114l015l698l956l914l791l678l468k966k128j191
61226E80968m36J55P96J509K081K413K655K929L219L624M306N067N326M846M146
61211F23604L916M208M482M254L432K226R83L0n30p27m14O15K131L489M441N440
61195F61580O837Q299R433J0437J1516J2168J1820J0802R793Q612O551L835J702
61182G73385Q72Q15P77N98K16p72k423m035m920n127m963m458l779l614m342n220
61166G33010n189m352l931m710o072o800o512o074o607q167r609r888r250q672
$$ plain form
61152 637177 628868 621548 616136 612597 610023 607997 607006 607251 607751 607126 604747 600637 594774 587170 578423
61137 578423 569493 560888 552564 544640 537779 532685 529532 527981 527477 527446 527538 527946 529308 532115 536305 541586
61121 541586 547986 555803 565097 575603 587194 600129 614644 630601 647801 666391 686483 707439
61109 707439 728197 748504 769337 791634 814937 837774 859165 879159 897966 915199 930203
61098 930203 942567 951971 957902 960057 958909 955426 950169 942884 933031 920437 905376 888301 869813
61085 869813 850822 832409 815221 798993 782810 765966 748571 731305 714711 698871 683744
61074 683744 669609 657015 646285 637179 629115 621685 614839 608631 603002 597978 593972 591584 591081 592205
61060 592205 594461 597398 600730 604497 609125 614968 621639 628176 634071 639887 646655 654959 664815 676105
$$ packed form
61152F37177q309p320n412l539k574k026r91K45N00o25k379m110n863p604q747
61137E78423q930q605q324p924o861n094l153j551n04l1R2M08J362K807M190N281
61121E41586O400P817R294J0506J1591J2935J4515J5957J7200J8590K0092K0956
61109G07439K0758K0307K0833K2297K3303K2837K1391J9994J8807J7233J5004
61098I30203J2364R404N931K155j148l483n257p285r853j2594j5061j7075j8488
61085H69813j8991j8413j7188j6228j6183j6844j7395j7266j6594j5840j5127
61074F83744j4135j2594j0730r106q064p430o846o208n629n024m006k388n03J124
61060E92205K256K937L332L767M628N843O671O537N895N816O768Q304R856J1290
$$ plain form
61046 676105 688777 702744 717956 734515 752552 772078 793036 815299 838647 863061 889106
61035 889106 917485 948061 979926 1012793 1047672 1085645 1126610 1169862 1215284 1263084 1312786
61024 1312786 1363431 1414549 1466183 1518407 1571844 1628402 1690383 1759066 1835167 1920285 2016411
61013 2016411 2124164 2243286 2375357 2524855 2697674 2900794 3144128 3440704 3803893
61004 3803893 4246323 4782996 5434096 6223980 7180183 8335002 9722425 11363130 13244365
60995 13244365 15307965 17447446 19506858 21290391 22607637 23355048 23582915 23484884 23305316
60986 23305316 23231187 23338486 23598162 23897107 24052123 23844719 23100526 21776912 19988442
60977 19988442 17945626 15858093 13872460 12066308 10469836 9084998 7897297 6885931
$$ packed form
61046F76105J2672J3967J5212J6559J8037J9526K0958K2263K3348K4414K6045
61035H89106K8379L0576L1865L2867L4879L7973M0965M3252M5422M7800M9702
61024A312786N0645N1118N1634N2224N3437N6558O1981O8683P6101Q5118R6126
61013B016411J07753J19122J32071J49498J72819K03120K43334K96576L63189
61004C803893M42430N36673O51100P89884R56203J154819J387423J640705J881235
60995A3244365K063600K139481K059412J783533J317246P47411K27867r8031j79568
60986B3305316p4129J07299K59676K98945J55016k07404p44193j323614j788470
60977A9988442k042816k087533j985633j806152j596472j384838j187701j011366
$$ plain form
60969 6885931 6030851 5313543 4715285 4217954 3805814 3464929 3181805 2944253 2742878
60960 2742878 2570371 2420084 2286699 2167600 2061978 1968715 1886129 1813206 1749551 1694172
60950 1694172 1645418 1602035 1563069 1526814 1491084 1454844 1418645 1383255 1348749 1315162 1282989
60939 1282989 1252504 1223216 1194423 1165835 1137334 1108698 1079975 1051716 1024407 997938 971889
60928 971889 946080 920622 895682 871400 847853 825013 803002 782354 763571 746333 729653
60917 729653 713049 697173 682954 670506 659162 648315 637863 628029 619101 611317 604829 599778
60905 599778 596308 594233 592738 590823 588236 585614 583628 582395 581832 581989 582646 583154 583214 583430 584429 585737
60889 585737 586166 585188 583262 580878 577965 574283 569760 564277 557782 550878 544752 540079 536349 532580 528301
$$ packed form
60969F885931q55080p17308n98258m97331m12140l40885k83124k37552k01375
60960B742878j72507j50287j33385j19099j05622r3263q2586p2923o3655n5379
60950A694172m8754m3383l8966l6255l5730l6240l6199l5390l4506l3587l2173
60939A282989l0485k9288k8793k8588k8501k8636k8723k8259k7309k6469k6049
60928I71889k5809k5458k4940k4282k3547k2840k2011k0648j8783j7238j6680
60917G29653j6604j5876j4219j2448j1344j0847j0452r834q928p784o488n051
60905E99778l470k075j495j915k587k622j986j233n63J57O57N08O0K16R99J308
60889E85737M29r78j926k384k913l682m523n483o495o904o126m673l730l769m279
$$ plain form
60874 528301 523521 518148 512104 505857 500234 495565 491363 487004 482462 478246 474838 472368 470725 469788
60860 469788 469485 469701 470243 470995 472012 473244 474154 473929 472348 470247 468839 468644 469298 470261 471293 472201 472522
60843 472522 471776 469901 467297 464538 462127 460272 458649 456395 452639 447179 440698 434318 428918 424721
60829 424721 421390 418494 415952 414046 413057 412965 413501 414354 415239 415888 416089 415758 414909 413629 412149 410896 410307
60812 410307 410502 411163 411758 411893 411442 410400 408760 406627 404363 402383 400702 398894 396649 394214 392018
60797 392018 390019 387754 385034 382215 379702 377545 375666 374140 373003 372034 370981 369784 368339 366289
60783 366289 363394 359971 356657 353851 351630 350003 348833 347643 346032 344320 343311 343292 343675 343737 343289 342475
60767 342475 341436 340562 340624 342133 344682 347393 349895 352486 355442 358646 361893 365068 367849 369686 370402
$$ packed form
60874E28301m780n373o044o247n623m669m202m359m542m216l408k470j643r37
60860D69788l03K16N42P52J017J232R10k25j581k101j408j95O54R63J032R08L21
60843D72522p46j875k604k759k411j855j623k254l756n460o481o380n400m197
60829D24721l331k896k542j906r89r2N36Q53Q85O49K01l31q49j280j480j253n89
60812D10307J95O61N95J35m51j042j640k133k264j980j681j808k245k435k196
60797C92018j999k265k720k819k513k157j879j526j137r69j053j197j445k050
60783C66289k895l423l314k806k221j627j170j190j611j712j009j9L83O2m48q14
60767C42475j039q74O2J509K549K711K502K591K956L204L247L175K781J837P16
$$ plain form
60752 370402 370622 371285 372795 374837 376852 378486 379730 380908 382486 384617 386829 388388 388960 388706 387703
60737 387703 385655 382376 378280 374052 369944 365673 360981 356033 351262 347038 343541 340750 338447 336391
60723 336391 334542 332942 331374 329375 326720 323781 321294 319805 319328 319371 319297 318824 318205 317753 317278 316348 315069
60706 315069 314130 313855 313686 312967 311880 311162 311167 311700 312609 314013 315849 317696 319212 320517 322033 324030 326279
60689 326279 328124 329092 329579 330571 332406 334258 335335 336181 338015 341073 344529 348021 352127 357015 361652
60674 361652 365029 367488 370087 373158 376239 379070 381836 384560 386911 388616 389438 388822 386211 381931 377259
60659 377259 373351 370350 367675 364937 362361 360474 359521 359168 358791 358111 357468 357380 357968 358985 360278 361944
60643 361944 364029 366218 367869 368344 367422 365451 362947 360050 356668 353154 350347 348599 347210 345304 342965
$$ packed form
60752C70402K20O63J510K042K015J634J244J178J578K131K212J559N72k54j003
60737C87703k048l279m096m228m108m271m692m948m771m224l497k791k303k056
60723C36391j849j600j568j999k655k939k487j489m77M3p4m73o19m52m75r30j279
60706C15069r39k75j69p19j087p18NN33R09J404J836J847J516J305J516J997K249
60689C26279J845R68M87R92J835J852J077Q46J834L058L456L492M106M888M637
60674C61652L377K459K599L071L081K831K766K724K351J705Q22o16k611m280m672
60659C77259l908l001k675k738k576j887r53l53l77o80o43q8N88J017J293J666
60643C61944K085K189J651M75r22j971k504k897l382l514k807j748j389j906k339
$$ plain form
60628 342965 340999 339755 338798 337658 336335 335014 333811 332916 332503 332345 331939 331255 331025 332082 334561 337820
60612 337820 340920 343156 344454 345380 346531 347890 349002 349702 350274 350868 351263 351405 351790 353023 355127 357391
60596 357391 358811 358780 357747 357098 357927 359863 361651 362866 364372 366821 369527 371325 371955 371970 371780 371486
60580 371486 371294 371293 371010 369988 368770 368579 369941 372255 374837 377763 381459 386068 391616 398365 406617 416342
60564 416342 427298 439243 451760 464005 474968 483962 490776 495467 498075 498395 496026 490909 484003
60551 484003 477081 471524 467407 464032 461217 459699 460243 462768 466617 471522 478006 486773 497915 510845
60537 510845 524956 540162 556736 574711 593496 611950 628704 642474 652354 657961 659394 657083
60525 657083 651680 644023 635033 625602 616475 608111 600523 593405 586526 579976 573952 568508 563693 559774
$$ packed form
60628C42965j966j244r57j140j323j321j203q95m13j58m06o84k30J057K479L259
60612C37820L100K236J298R26J151J359J112P00N72N94L95J42L85J233K104K264
60596C57391J420l1j033o49Q29J936J788J215J506K449K706J798O30J5j90k94
60580C71486j92jk83j022j218j91J362K314K582K926L696M609N548O749Q252R725
60564D16342J0956J1945J2517J2245J0963Q994O814M691K608L20k369n117o906
60551D84003o922n557m117l375k815j518N44K525L849M905O484Q767J1142J2930
60537E10845J4111J5206J6574J7975J8785J8454J6754J3770R880N607J433k311
60525F57083n403p657q990r431r127q364p588p118o879o550o024n444m815l919
$$ plain form
60511 559774 557023 555358 554504 554480 555632 558168 562017 567302 574609 584648 597827 614331 634327 657922
60497 657922 685147 716225 751626 791488 835041 880877 927704 974633 1020809 1065064 1105970
60486 1105970 1142012 1171661 1193424 1205911 1207818 1198044 1176182 1143056 1100698 1051795 999137 945288
60474 945288 892228 841077 792354 746661 704963 668082 636063 608207 583681 562016 543125
60463 543125 526990 513285 501253 490046 479387 469811 462031 456013 450779 445258 439238 433377 428354
60450 428354 424157 420301 416542 413163 410485 408313 406074 403449 400699 398303 396419 394782 393137 391647
60436 391647 390761 390668 390974 391109 390949 390829 390843 390497 389307 387564 386087 385295 384831 384126 382948 381347 379473
60419 379473 377670 376457 376140 376596 377583 379048 380952 383041 385111 387255 389520 391474 392503 392516 392031 391673
$$ packed form
60511E59774k751j665q54k4J152K536L849N285P307J0039J3179J6504J9996K3595
60497F57922K7225L1078L5401L9862M3553M5836M6827M6929M6176M4255M0906
60486A105970L6042K9649K1763J2487J907r774k1862l3126m2358m8903n2658n3849
60474I45288n3060n1151m8723m5693m1698l6881l2019k7856k4526k1665j8891
60463E43125j6135j3705j2032j1207j0659r576p780o018n234n521o020n861n023
60450D28354m197l856l759l379k678k172k239k625k750k396j884j637j645j490
60436C91647q86r3L06J35j60j20J4l46j190j743j477p92m64p05j178j601j874
60419C79473j803j213l17M56R87J465J904K089K070K144K265J954J029J3m85l58
$$ plain form
60403 391673 391923 393211 395705 398835 401465 402860 403327 403726 404613 406028 407857 410083 412730 415823 419340
60388 419340 423119 426845 430241 433206 435707 437662 439070 440166 441325 442847 444886 447455 450369 453274
60374 453274 455923 458377 460805 463123 465036 466422 467567 468909 470577 472254 473556 474535 475695 477424
60360 477424 479467 481206 482452 483762 485837 488794 492272 496154 500940 507283 515289 524423 534167 544601
60346 544601 556080 568288 579883 589342 595982 599920 601248 599764 595561 589369 582068 574132 565713
60333 565713 556992 548234 539683 531527 523809 516419 509454 503497 499056 495734 492567 489219 486129 483318
60319 483318 480101 476486 473817 473066 473374 473416 473513 474974 477771 480651 483616 488624 497205 508810 522291
60304 522291 537784 556016 576594 598097 619392 639871 658638 674318 685542 691161 690344 683147
$$ packed form
60403C91673K50J288K494L130K630J395M67L99Q87J415J829K226K647L093L517
60388D19340L779L726L396K965K501J955J408J096J159J522K039K569K914K905
60374D53274K649K454K428K318J913J386J145J342J668J677J302R79J160J729
60360D77424K043J739J246J310K075K957L478L882M786O343Q006R134R744J0434
60346E44601J1479J2208J1595R459O640L938J328j484m203o192p301p936q419
60333E65713q721q758q551q156p718p390o965n957m441l322l167l348l090k811
60319D83318l217l615k669p51L08M2R7J461K797K880K965N008Q581J1605J3481
60304E22291J5493J8232K0578K1503K1295K0479J8767J5680J1224N619q17p197
$$ plain form
60292 683147 670699 654291 634659 612748 590601 570419 552890 537313 523280 511322 501851 494386
60280 494386 488193 483075 479184 476504 474684 473012 470538 466738 462219 458255 455500 453486 451406 448874
60266 448874 445968 443149 441265 440893 441335 440906 438640 435249 432081 429691 427903 426673 426129 425975 425564 424628
60250 424628 423515 422701 422364 422437 422796 423351 424084 424923 425573 425741 425655 425962 426893 427838 428168 428104 428297 428812 429172
60231 429172 429331 429943 431486 433654 435858 437939 440089 442382 444668 446807 448770 450619 452605 455129 458351
60216 458351 461901 465241 468392 472050 476823 482495 488232 493439 498218 502999 508050 513504 519568 526289
60202 526289 533241 539814 545899 551980 558486 565338 572221 578944 585334 591112 596161 600646 604537 607255
60188 607255 608281 608039 607698 607988 608526 608459 607458 605807 603728 600975 597207 592537 587510 582563 577700 572829
$$ packed form
60292F83147j2448j6408j9632k1911k2147k0182j7529j5577j4033j1958r471p465
60280D94386o193n118l891k680j820j672k474l800m519l964k755k014k080k532
60266D48874k906k819j884l72M42m29k266l391l168k390j788j230n44j54m11r36
60250D24628j113q14l37P3L59N55P33Q39O50J68q6L07R31R45L30o4J93N15L60
60231D29172J59O12J543K168K204K081K150K293K286K139J963J849J986K524L222
60216D58351L550L340L151L658M773N672N737N207M779M781N051N454O064O721
60202E26289O952O573O085O081O506O852O883O723O390N778N049M485L891K718
60188F07255J026k42l41K90N38o7j001j651k079k753l768m670n027m947m863m871
$$ plain form
60172 572829 568195 564176 560670 557012 552743 548221 544289 541432 539448 537801 536076 534091 531841 529383
60158 529383 526741 523972 521386 519622 519270 520289 521827 522695 522237 520853 519664 519487 520159 520971 521568 522086
60142 522086 522580 522883 523156 523990 525679 527914 530536 534101 539146 545341 551975 558923 566394 573963 580682
60127 580682 586207 591046 595550 599381 602206 604304 606087 607557 608651 609695 611035 612437 613357 613721 614102
60112 614102 615127 616936 619245 621787 624633 627985 631586 634502 635856 635753 635143 634695 634197 633143 631485
60097 631485 629469 627137 624428 621670 619579 618735 619153 620330 621603 622573 623305 624065 624955 625987 627346 629173
60081 629173 631039 632124 632106 631417 630419 628793 626127 622658 618931 614980 610438 605236 599655 593721 587095
60066 587095 579638 571661 563517 555349 547415 540256 534172 528679 522838 516229 509450 503510 498757 494548
$$ packed form
60172E72829m634m019l506l658m269m522l932k857j984j647j725j985k250k458
60158E29383k642k769k586j764l52J019J538Q68m58j384j189j77O72Q12N97N18
60142E22086M94L03K73Q34J689K235K622L565N045O195O634O948P471P569O719
60127E80682N525M839M504L831K825K098J783J470J094J044J340J402R20L64L81
60112F14102J025J809K309K542K846L352L601K916J354j03o10m48m98j054j658
60097F31485k016k332k709k758k091q44M18J177J273R70P32P60Q90J032J359J827
60081F29173J866J085j8o89r98j626k666l469l727l951m542n202n581n934o626
60066E87095p457p977q144q168p934p159o084n493n841o609o779n940m753m209
$$ plain form
60052 494548 490051 485176 480589 477026 474884 474331 475284 477242 479591 482259 485665 489897 494388 498654 502830
60037 502830 507177 511570 515849 520164 524488 528275 531244 534081 537559 541208 543627 544060 542928 540913
60023 540913 538284 535194 531841 528110 523630 518444 513110 507991 502932 497697 492216 486317 479892 473448
60009 473448 467778 462808 457535 451549 445902 441866 439370 437349 435207 433162 431385 429605 427620 425624
59995 425624 423918 422674 422071 422301 423322 424803 426395 427989 429750 432041 435155 439003 443176 447402 451706
59980 451706 456015 459913 463089 465729 468122 470074 471117 471173 470604 469637 468123 465957 463387 460783 458241
59965 458241 455563 452638 449844 448042 447983 449602 452037 454349 456079 457180 457910 458931 460928 463671 465823
59950 465823 466231 465181 463910 463089 462419 461602 460985 461026 461606 462179 462312 461934 461245 460506 459786 458925 457877 456974
$$ packed form
60052D94548m497m875m587l563k142n53R53J958K349K668L406M232M491M266M176
60037E02830M347M393M279M315M324L787K969K837L478L649K419M33j132k015
60023E40913k629l090l353l731m480n186n334n119n059n235n481n899o425o444
60009D73448n670m970n273n986n647m036k496k021k142k045j777j780j985j996
59995D25624j706j244o03K30J021J481J592J594J761K291L114L848M173M226M304
59980D51706M309L898L176K640K393J952J043N6n69r67j514k166k570k604k542
59965D58241k678k925k794j802n9J619K435K312J730J101P30J021J997K743K152
59950D65823M08j050j271q21o70q17o17M1N80N73J33l78o89p39p20q61j048r03
$$ plain form
59932 456974 456527 456285 455691 454658 453705 453335 453691 454854 456971 459917 463296 467029 471547 477139 483485 490149
59916 490149 497174 504749 512526 519812 526361 532478 538228 542990 546145 548020 549766 552246 555270 558086
59902 558086 560390 562485 564509 566001 566539 566407 566107 565409 563495 560188 556541 553919 552766 552465 552182 551626
59886 551626 551165 551454 552861 555185 557979 561169 565097 569924 575274 580636 585845 590977 595968 600617 604815
59871 604815 608586 611883 614514 616200 616700 616026 614590 612890 610956 608332 604813 600960 597657 595348 593954
59856 593954 593302 593249 593489 593702 594071 595402 598521 603578 610027 617213 624864 632914 640883 647641 652001 653490
59840 653490 652377 649164 644487 639464 635439 632970 631379 629645 627355 624434 620360 614436 606774 598401
59826 598401 590273 582673 575669 569591 564736 560926 557691 554673 551681 548594 545546 543010 541398 540580
$$ packed form
59932D56974m47k42n94j033r53l70L56J163K117K946L379L733M518N592O346O664
59916D90149P025P575P777P286O549O117N750M762L155J875J746K480L024K816
59902E58086K304K095K024J492N38j32l00o98j914l307l647k622j153l01k83n56
59886E51626m61K89J407K324K794L190L928M827N350N362N209N132M991M649M198
59871F04815L771L297K631J686N00o74j436j700j934k624l519l853l303k309j394
59856E93954o52n3K40K13L69J331L119N057O449P186P651Q050P969O758M360J489
59840F53490j113l213m677n023m025k469j591j734k290k921m074n924p662q373
59826E98401q128p600p004o078m855l810l235l018k992l087l048k536j612q18
$$ plain form
59812 540580 540045 539484 538999 538722 538487 538027 537367 536798 536409 535835 534687 533133 531776 530903 530144 529074 527794
59795 527794 526577 525163 522919 519700 516069 512584 509277 506014 502988 500530 498649 497021 495364 493685
59781 493685 492305 491656 491800 492095 491709 490610 489649 489366 489192 488288 486855 485991 486404 487859 489849 492232 495092
59764 495092 498426 502101 505761 508843 511187 513697 517788 523936 531235 538566 545564 552231 558373 564095
59750 564095 570290 577815 586446 595251 603696 611656 618704 624418 629368 634715 640497 645235 647695 648359
59736 648359 648600 648993 649081 648364 646837 644800 642656 640746 638968 636749 633782 630538 627648 625132 622787
59721 622787 620932 619969 619322 617690 614554 610824 607778 605883 604845 604205 603544 602548 601330 600478 600491 601310
59705 601310 602551 603919 605233 606366 607472 609107 611830 615700 620277 624974 629377 633468 637656 642394
$$ packed form
59812E40580n35n61m85k77k35m60o60n69l89n74j148j554j357q73p59j070j280
59795E27794j217j414k244l219l631l485l307l263l026k458j881j628j657j679
59781D93685j380o49J44K95l86j099r61k83j74r04j433q64M13J455J990K383K860
59764D95092L334L675L660L082K344K510M091O148P299P331O998O667O142N722
59750E64095O195P525Q631Q805Q445P960P048N714M950N347N782M738K460O64
59736F48359K41L93Q8p17j527k037k144j910j778k219k967l244k890k516k345
59721F22787j855r63o47j632l136l730l046j895j038o40o61r96j218q52J3Q19
59705F01310J241J368J314J133J106J635K723L870M577M697M403M091M188M738
$$ plain form
59691 642394 647656 652969 658009 662826 667298 670717 672244 671657 669538 666862 664530 662948 661821 660544
59677 660544 658921 657272 655723 653809 651008 647252 642560 636632 629411 621779 615005 609482 604533 599487
59663 599487 594498 590207 587031 584930 583564 582518 581650 581334 582135 584162 586919 589858 592820 595945 599377
59648 599377 603190 607349 611635 615744 619465 622557 624431 624337 622033 618085 613261 607811 601550 594549 587440
59633 587440 580971 575370 570308 565417 560696 556316 552175 547950 543635 539724 536674 534350 532109 529315
59619 529315 525665 521345 517104 513823 511558 509181 505472 500481 495374 491048 487407 484029 480890 478236
59605 478236 476257 475214 475422 476730 478374 479677 480663 481652 482553 483034 483196 483562 484401 485491 486641 488031
59589 488031 489840 491764 493230 493986 494274 494389 494277 493703 492692 491490 490108 488232 485773 483228 481128
$$ packed form
59691F42394N262N313N040M817M472L419J527n87k119k676k332j582j127j277
59677F60544j623j649j549j914k801l756m692n928p221p632o774n523m949n046
59663E99487m989m291l176k101j366j046q68l16Q01K027K757K939K962L125L432
59648E99377L813M159M286M109L721L092J874r4k304l948m824n450o261p001p109
59633E87440o469n601n062m891m721m380m141m225m315l911l050k324k241k794
59619E29315l650m320m241l281k265k377l709m991n107m326l641l378l139k654
59605D78236j979j043K08J308J644J303R86R89R01M81J62L66Q39J090J150J390
59589D88031J809J924J466P56K88J15j12n74j011j202j382j876k459k545k100
$$ plain form
59574 481128 479328 477198 474391 471014 467128 462719 458216 454430 451691 449531 447569 446232 446115 447026 448177
59559 448177 449073 449736 450281 450807 451565 452718 453933 454673 454876 454962 455315 456171 457840 460408 463307 465942 468867
59542 468867 473484 480213 487684 494403 500716 508472 519047 532415 547965 565307 583849 601948 616822
59529 616822 625538 626553 620846 611504 601713 592962 585242 578659 574143 572470 573287 575515 578300 581143
59515 581143 583440 584524 584157 582579 580037 576534 572081 566824 560779 553655 545251 536042 527218 519944
59501 519944 514475 510024 505577 500813 496142 491987 488381 485274 482773 480813 478984 477129 475886 476128
59487 476128 477913 480400 482744 484722 486555 488653 491587 495700 500489 504827 508148 511103 514735 519357
59473 519357 524587 530122 535907 541653 546695 550478 552915 554213 554536 553931 552431 550220 547744 545613 544325
$$ packed form
59574D81128j800k130k807l377l886m409m503l786k739k160j962j337j17R11J151
59559D48177Q96O63N45N26P58J153J215P40K03Q6L53Q56J669K568K899K635K925
59542D68867M617O729P471O719O313P756J0575J3368J5550J7342J8542J8099J4874
59529F16822Q716J015n707r342r791q751p720o583m516j673Q17K228K785K843
59515E81143K297J084l67j578k542l503m453n257o045p124q404r209q824p274
59501E19944n469m451m447m764m671m155l606l107k501j960j829j855j243K42
59487D76128J785K487K344J978J833K098K934M113M789M338L321K955L632M622
59473E19357N230N535N785N746N042L783K437J298L23o05j500k211k476k131j288
$$ plain form
59458 544325 544119 545030 546882 549210 551539 553936 557086 561629 567703 575236 584251 594469 604900 614368
59444 614368 622375 629147 634944 639651 642861 643930 642117 637173 629865 621608 613561 606254 599735 593619
59430 593619 587223 580319 573686 568359 564438 561273 558751 557526 557839 559021 560623 563321 568157 575449
59416 575449 584991 596850 611290 628233 647374 668647 692073 717234 743278 769046 792634 810964
59404 810964 820653 819865 809547 793172 775419 760462 750565 745896 745729 749562 756670 764784 769947 768146
59390 768146 757247 737819 712714 685866 660671 638786 620199 604395 591320 581307 574452 570303
59378 570303 568130 567367 567719 568781 569744 569882 569518 570077 572717 577064 581721 585856 589803 594139 598791 603294
59362 603294 607457 611502 615821 620829 626792 633537 640474 647139 653653 660555 668335 677192 687037 697581
$$ packed form
59458E44325k06R11J852K328K329K397L150M543O074P533R015J0218J0431R468
59444F14368Q007O772N797M707L210J069j813m944p308q257q047p307o519o116
59430E93619o396o904o633n327l921l165k522j225L13J182J602K698M836P292
59416E75449R542J1859J4440J6943J9141K1273K3426K5161K6044K5768K3588J8330
59404H10964R689p88j0318j6375j7753j4957r897m669j67L833P108Q114N163j801
59390G68146j0899j9428k5105k6848k5195k1885j8587j5804j3075j0013o855m149
59378E70303k173p63L52J062R63J38l64N59K640M347M657M135L947M336M652M503
59362F03294M163M045M319N008N963O745O937O665O514O902P780Q857R845J0544
$$ plain form
59348 697581 708595 720178 732602 745751 758967 771660 783905 796203 808852 821790 834887
59337 834887 847896 860094 870400 878187 883741 887635 889742 889244 885675 879672 872426 864532 855620 845097
59323 845097 832952 819804 806386 793279 780959 769802 759889 750917 742433 734209 726395 719342 713321
59310 713321 708485 705042 703206 702760 702865 702691 702371 703011 705680 710696 717954 727462 739099 752218 765931
59295 765931 779471 791607 799916 801622 795663 783507 767666 749870 731027 712291 695178 680551
59283 680551 668090 657038 647180 638878 632500 628086 625375 623876 622995 622445 622598 624221 627719 632798
59269 632798 638959 646172 654817 664986 676104 687326 698140 708409 717894 725948 731760 734900 735579
59256 735579 734348 731506 726862 720172 711752 702430 692864 683171 673444 664368 656879 651173 646445 641884
$$ packed form
59348F97581J1014J1583J2424J3149J3216J2693J2245J2298J2649J2938J3097
59337H34887J3009J2198J0306P787N554L894K107m98l569o003p246p894q912j0523
59323H45097j2145j3148j3418j3107j2320j1157r913q972q484q224p814p053o021
59310G13321m836l443j836m46J05j74l20O40K669N016P258R508J1637J3119J3713
59295G65931J3540J2136Q309J706n959j2156j5841j7796j8843j8736j7113j4627
59283F80551j2461j1052r858q302o378m414k711j499q81n50J53J623L498N079
59269F32798O161P213Q645J0169J1118J1222J0814J0269R485Q054N812L140O79
59256G35579j231k842m644o690q420r322r566r693r727r076p489n706m728m561
$$ plain form
59242 641884 637678 634701 633302 632799 632328 631921 632397 634302 637295 640620 643792 646589 648717 649950 650555
59227 650555 651153 652029 652834 653041 652453 651147 649193 646666 643770 640722 637563 634161 630392 626277 622053
59212 622053 618094 614654 611675 608985 606664 604926 603713 602725 601975 601907 602820 604514 606691 609294 612122
59197 612122 614526 615991 616780 617557 618478 619192 619618 620226 621435 623151 624988 626630 627906 628868 629898 631455
59181 631455 633560 635744 637616 639238 640846 642454 643938 645345 646923 648885 651316 654316 658045 662494
59167 662494 667238 671658 675559 679468 684045 689334 694917 700725 707117 713950 720166 724792 727947 730330
59153 730330 732079 732702 731927 729917 726701 722081 716215 709719 703072 696328 689524 682824 676196 669391 662433
59138 662433 655582 648674 641038 632433 623545 615190 607462 600122 593445 588080 584202 581327 578977 577078
$$ packed form
59242F41884m206k977j399n03m71m07M76J905K993L325L172K797K128J233O05
59227F50555N98Q76Q05K07n88j306j954k527k896l048l159l402l769m115m224
59212F22053l959l440k979k690k321j738j213r88p50o8R13J694K177K603K828
59197F12122K404J465P89P77R21P14M26O08J209J716J837J642J276R62J030J557
59181F31455K105K184J872J622J608J608J484J407J578J962K431L000L729M449
59167F62494M744M420L901L909M577N289N583N808O392O833O216M626L155K383
59153G30330J749O23p75k010l216m620n866o496o647o744o804o700o628o805o958
59138F62433o851o908p636q605q888q355p728p340o677n365l878k875k350j899
$$ plain form
59124 577078 575696 574837 574711 575928 579075 584014 589763 595263 600373 605994 613077 621548 630398 638766 646636
59109 646636 654445 662348 670109 677549 684825 692197 699615 706597 712538 717178 720671 723226 724940 726112
59095 726112 727313 728700 729465 728573 726043 722992 720345 718099 715969 714097 712728 711675 710607 709540 708567
59080 708567 707351 705348 702375 698494 693442 686694 678234 668920 659887 651746 644367 637281 630187 623151
59066 623151 616435 610176 604290 598697 593505 588984 585406 582887 581191 579656 577548 574604 571166 567782
59052 567782 564842 562539 560773 559003 556540 553262 549800 546842 544529 542732 541617 541468 542052 542622 542636
59037 542636 542228 541852 541720 541798 542218 543337 545195 547138 548427 549348 551336 555625 562034 569470 577362 586036
59021 586036 595813 606460 617743 629853 642969 656787 670799 684588 697546 708726 717408 723555
$$ packed form
59124E77078j382q59j26J217L147M939N749N500N110N621P083Q471Q850Q368P870
59109F46636P809P903P761P440P276P372P418O982N941M640L493K555J714J172
59095G26112J201J387P65q92k530l051k647k246k130j872j369j053j068j067r73
59080G08567j216k003k973l881n052o748q460r314r033q141p379p086p094p036
59066F23151o716o259n886n593n192m521l578k519j696j535k108k944l438l384
59052E67782k940k303j766j770k463l278l462k958k313j797j115j49N84N70J4
59037E42636m08l76j32P8M20J119J858J943J289R21J988M289O409P436P892Q674
59021E86036R777J0647J1283J2110J3116J3818J4012J3789J2958J1180Q682O147
$$ plain form
59009 723555 727381 728799 727689 724474 720005 715033 710106 705794 702615 700813 700477 701674 704220 707533
58995 707533 711033 714502 717804 720545 722364 723329 723639 723193 721866 719962 717822 715170 711427 706618 701371
58980 701371 696039 690485 684886 680123 676998 675505 675300 676566 679905 685433 692429 700075 708329 717802
58966 717802 728757 740499 752006 763015 774095 785577 796880 807151 816170 824119 830707 835141
58954 835141 836991 836601 834445 830436 824113 815303 804397 792073 778917 765291 751464 737776 724615
58941 724615 712250 700840 690597 681761 674338 668124 663098 659499 657249 655542 653434 650760 648189
58928 648189 646383 645348 644614 643768 642785 641979 641635 641682 641821 641941 642165 642291 641612 639669 637018 634809 633635
58911 633635 633109 632548 631824 631507 632326 634471 637340 640208 643266 647701 654487 663370 673374 683962 695212
$$ packed form
59009G23555L826J418j110l215m469m972m927m312l179j802l36J197K546L313
58995G07533L500L469L302K741J819R65L10m46j327j904k140k652l743m809n247
58980G01371n332n554n599m763l125j493k05J266L339N528O996P646Q254R473
58966G17802J0955J1742J1507J1009J1080J1482J1303J0271R019P949O588M434
58954H35141J850l90k156m009o323q810j0906j2324j3156j3626j3827j3688j3161
58941G24615j2365j1410j0243q836p423o214n026l599k250j707k108k674k571
58928F48189j806j035p34q46r83q06l44M7J39J20K24J26o79j943k651k209j174
58911F33635n26n61p24l17Q19K145K869K868L058M435O786Q883J0004J0588J1250
$$ plain form
58896 695212 707114 719294 731398 743242 754615 765422 776008 786828 797785 808486 819253
58885 819253 831277 845424 861267 877562 893317 908106 921637 933523 943490 951539 957758 962018
58873 962018 963937 963203 959986 954927 948651 941417 933321 924588 915486 906188 897020 888620 881455 875268
58859 875268 869305 862931 855755 847408 837773 827373 817021 807016 797082 787009 776891 766776 756679
58846 756679 747056 738672 731710 725478 719248 713016 707147 701611 695875 689377 681855 673446 664635 655933
58832 655933 647503 639258 631382 624435 618787 614259 610440 607108 604243 601924 600386 599899 600398 601455 602753
58817 602753 604374 606517 609199 612366 615975 619769 623270 626234 628927 631721 634573 637063 638838 639885
58803 639885 640545 641315 642367 643167 642823 640993 638185 635032 631583 627536 622849 617766 612492 607173 602129
$$ packed form
58896F95212J1902J2180J2104J1844J1373J0807J0586J0820J0957J0701J0767
58885H19253J2024J4147J5843J6295J5755J4789J3531J1886R967Q049O219M260
58873I62018J919p34l217n059o276p234q096q733r102r298r168q400p165o187
58859H75268n963o374p176q347r635j0400j0352j0005r934j0073j0118j0115j0097
58846G56679r623q384o962o232o230o232n869n536n736o498p522q409q811q702
58832F55933q430q245p876o947n648m528l819l332k865k319j538m87M99J057J298
58817F02753J621K143K682L167L609L794L501K964K693K794K852K490J775J047
58803F39885O60P70J052Q00l44j830k808l153l449m047m687n083n274n319n044
$$ plain form
58788 602129 597757 594273 591765 590369 590104 590627 591523 592843 595071 598499 602894 607903 613477 619688 626220
58773 626220 632375 637659 642122 645982 649048 650746 650723 649234 646886 644150 641144 637687 633485 628439 622865
58758 622865 617238 611651 605837 599833 594315 590007 587004 584909 583326 581997 580810 580101 580575 582417 584711
58743 584711 586377 587487 589062 591617 594619 597445 600208 603378 607108 611245 615636 620201 624955 630036
58729 630036 635406 640506 644660 647948 651239 655152 659378 663272 666741 670273 674260 678605 682927 687065
58715 687065 691416 696688 703157 710341 717615 724921 732415 739683 745936 750889 754773 757432 758107 756284
58701 756284 752120 745798 737108 726002 713033 698882 683875 668249 652438 636740 621104 605615
58689 605615 590837 577338 565197 554272 544676 536670 530338 525567 522103 519436 516916 514141 511048
$$ packed form
58788F02129m372l484k508j396k65N23Q96J320K228L428M395N009N574O211O532
58773F26220O155N284M463L860L066J698k3j489k348k736l006l457m202n046n574
58758F22865n627n587n814o004n518m308l003k095j583j329j187p09M74J842K294
58743E84711J666J110J575K555L002K826K763L170L730M137M391M565M754N081
58729F30036N370N100M154L288L291L913M226L894L469L532L987M345M322M138
58715F87065M351N272O469P184P274P306P494P268O253M953L884K659O75j823
58701G56284m164o322q690j1106j2969j4151j5007j5626j5811j5698j5636j5489
58689F05615j4778j3499j2141j0925r596q006o332m771l464k667k520k775l093
$$ plain form
58676 511048 507663 504212 501379 499822 499263 498726 497905 497600 498535 500448 502848 505968 510376 516203 523354
58661 523354 531928 541636 551217 559213 565198 569623 572663 573901 573080 570559 566959 562734 558076 552957
58647 552957 547363 541690 536660 532537 528765 524801 520957 517913 515603 513207 510182 506796 503698 501411
58633 501411 500263 500394 501680 503805 506402 509010 511169 512806 514365 516278 518518 520887 523431 526274
58619 526274 529243 532036 534539 536684 538295 539480 540931 543350 546664 550127 553069 555242 556696 557688
58605 557688 558581 559526 560440 561514 563372 566345 569907 573288 576265 578820 580400 580385 579212 578253 578396 579247
58589 579247 579884 579939 579757 579944 581009 583269 586833 591709 597897 605343 613878 623234 632983 642393 650671
58574 650671 657657 664082 670873 678301 685922 693198 700031 707028 715392 726250 739792 755363 772547
$$ packed form
58676E11048l385l451k833j557n59n37q21l05R35J913K400L120M408N827P151
58661E23354Q574R708R581P996N985M425L040J238q21k521l600m225m658n119
58647E52957n594n673n030m123l772l964l844l044k310k396l025l386l098k287
58633E01411j148J31J286K125K597K608K159J637J559J913K240K369K544K843
58619E26274K969K793K503K145J611J185J451K419L314L463K942K173J454R92
58605E57688Q93R45R14J074J858K973L562L381K977K555J580j5j173r59J43Q51
58589E79247O37N5j82J87J065K260L564M876O188P446Q535R356R749R410Q278
58574F50671O986O425O791P428P621P276O833O997Q364J0858J3542J5571J7184
$$ plain form
58561 772547 791668 812954 835692 858805 881945 905426 929249 952640 974395 993298 1008393
58550 1008393 1019302 1026226 1029469 1029234 1026061 1020955 1014637 1007143 998684 990313 982900 975709 966858 955170
58536 955170 940909 924755 906878 887192 865977 843982 822281 802027 783935 767873 753298
58525 753298 740117 728839 719878 713068 707867 703775 700449 697678 695315 693202 691230 689462 687963 686471
58511 686471 684556 682195 679759 677326 674580 671639 669356 668340 668201 668264 668557 669473 670881 672220 673229
58496 673229 674005 674585 674954 675280 675736 676379 677500 679565 682359 684819 686355 687872 690746 695305 700993 707549
58480 707549 715178 723962 733987 745702 759258 773799 788249 802544 817198 831943 845727 857770
58468 857770 867629 874399 877032 875494 870759 863673 854759 845054 836088 828787 823162 819154 817028 816908
$$ packed form
58561G72547J9121K1286K2738K3113K3140K3481K3823K3391K1755J8903J5095
58550A008393J0909O924L243k35l173n106o318p494q459q371p413p191q851j1688
58536I55170j4261j6154j7877j9686k1215k1995k1701k0254j8092j6062j4575
58525G53298j3181j1278q961o810n201m092l326k771k363k113j972j768j499j492
58511F86471j915k361k436k433k746k941k283j016j39O3K93R16J408J339J009
58496F73229P76N80L69L26M56O43J121K065K794K460J536J517K874M559N688O556
58480G07549P629Q784J0025J1715J3556J4541J4450J4295J4654J4745J3784J2043
58468H57770R859O770K633j538m735p086q914r705q966p301n625m008k126j20
$$ plain form
58454 816908 818758 822855 829476 838102 847763 858174 869608 881523 892255 900307 905099 906325 903582
58441 903582 897073 887971 877627 866892 856403 846812 838407 831042 824768 820104 817433 816531 816900 818293
58427 818293 820828 824873 830784 838547 847800 858409 870553 883842 896870 908263 917680 925121 929901
58414 929901 931334 930007 927249 923566 918641 912604 906128 899337 891791 883605 875553 868035 860902 854285
58400 854285 848617 843945 840219 838134 838467 840633 843106 845352 848113 851756 855662 859430 863322 867184
58386 867184 870179 872101 873801 875838 877665 878566 878434 877305 875143 872527 870640 870135 870774 872388 875264
58371 875264 879483 884822 891502 900031 910120 920821 931850 943641 955922 967600 978434 989628
58359 989628 1002263 1016208 1030892 1046030 1061153 1075569 1089220 1102584 1115409 1126663 1135959 1143808
$$ packed form
58454H16908J850M097O621Q626R661J0411J1434J1915J0732Q052M792J226k743
58441I03582o509r102j0344j0735j0489r591q405p365o274m664k671r02L69J393
58427H18293K535M045N911P763R253J0609J2144J3289J3028J1393R417P441M780
58414I29901J433j327k758l683m925o037o476o791p546q186q052p518p133o617
58400H54285n668m672l726k085L33K166K473K246K761L643L906L768L892L862
58386H67184K995J922J700K037J827R01j32j129k162k616j887n05O39J614K876
58371H75264M219N339O680Q529J0089J0701J1029J1791J2281J1678J0834J1194
58359I89628J2635J3945J4684J5138J5123J4416J3651J3364J2825J1254R296P849
$$ plain form
58347 1143808 1150214 1154460 1156759 1158716 1161495 1164852 1168641 1173921 1181656 1191412 1202174 1213535 1225424
58334 1225424 1237633 1250341 1264262 1279584 1295448 1310937 1325897 1340603 1355487 1371218 1387885
58323 1387885 1403962 1417418 1428056 1437420 1446251 1453695 1459454 1464932 1471402 1478498 1485357 1491999 1498855
58310 1498855 1506101 1514138 1523598 1534433 1546127 1559076 1574279 1591406 1608734 1625441 1642325 1659909
58298 1659909 1677701 1695843 1715475 1736708 1758103 1778908 1799923 1821436 1842437 1862832 1884369
58287 1884369 1908175 1933280 1958744 1985257 2013384 2042083 2070456 2099309 2129732 2161691 2195130
58276 2195130 2230785 2268779 2308041 2348124 2389903 2433627 2478291 2523807 2571647 2622284 2674223
58265 2674223 2726595 2780467 2836534 2894044 2953116 3015417 3081240 3148714 3217329 3289235 3365377
$$ packed form
58347A143808O406M246K299J957K779L357L789N280P735R756J0762J1361J1889
58334A225424J2209J2708J3921J5322J5864J5489J4960J4706J4884J5731J6667
58323A387885J6077J3456J0638R364Q831P444N759N478O470P096O859O642O856
58310A498855P246Q037R460J0835J1694J2949J5203J7127J7328J6707J6884J7584
58298A659909J7792J8142J9632K1233K1395K0805K1015K1513K1001K0395K1537
58287A884369K3806K5105K5464K6513K8127K8699K8373K8853L0423L1959L3439
58276B195130L5655L7994L9262M0083M1779M3724M4664M5516M7840N0637N1939
58265B674223N2372N3872N6067N7510N9072O2301O5823O7474O8615P1906P6142
$$ plain form
58254 3365377 3443464 3521711 3601527 3684262 3768401 3852498 3938077 4027123 4119426 4214882 4315606
58243 4315606 4423049 4535757 4652639 4775803 4907634 5047809 5195794 5353285 5521469
58234 5521469 5698978 5885433 6083855 6296663 6522640 6760949 7014665 7286970 7577463
58225 7577463 7885814 8215563 8570715 8952218 9361572 9804137 10285075 10806017 11369651
58216 11369651 11983415 12654841 13388179 14190018 15073269 16051219 17133562 18333662 19674282
58207 19674282 21181531 22880802 24805631 27004525 29534230 32456422 35850828 39825899
58199 39825899 44512837 50064000 56670047 64569326 74032873 85359323 98903606 115096569
58191 115096569 134412230 157306532 184144253 215050112 249650455 286824685 324610551
$$ packed form
58254C365377P8087P8247P9816Q2735Q4139Q4097Q5579Q9046R2303R5456J00724
58243D315606J07443J12708J16882J23164J31831J40175J47985J57491J68184
58234E521469J77509J86455J98422K12808K25977K38309K53716K72305K90493
58225G577463L08351L29749L55152L81503M09354M42565M80938N20942N63634
58216A1369651O13764O71426P33338Q01839Q83251R77950J082343J200100J340620
58207A9674282J507249J699271J924829K198894K529705K922192L394406L975071
58199C9825899M686938N551163O606047P899279R463547J1326450J3544283J6192963
58191A15096569J9315661K2894302K6837721L0905859L4600343L7174230L7785866
$$ plain form
58184 324610551 360246417 390306784 411121559 419710698 414951912 398147973 372424033
58177 372424033 341365642 307912082 274084189 241268830 210488072 182444915 157500133
58170 157500133 135717623 116954314 100941862 87356964 75876218 66197468 58039085
58163 58039085 51146970 45307460 40344429 36105909 32462146 29311470 26575080 24184805
58155 24184805 22081443 20220150 18567300 17092345 15768381 14577070 13505121 12537417
58147 12537417 11659432 10863506 10145906 9499316 8913852 8383120 7903249 7467691 7068702
58138 7068702 6702497 6367615 6059360 5770691 5497457 5238409 4991607 4755353 4531362
58129 4531362 4322513 4128197 3945496 3773583 3613239 3463397 3322007 3189094 3065353
$$ packed form
58184C24610551L5635866L0060367K0814775Q589139m758786j6803939k5723940
58177C72424033l1058391l3453560l3827893l2815359l0780758k8043157k4944782
58170A57500133k1782510j8763309j6012452j3584898j1480746r678750q158383
58163E8039085o892115n839510m963031m238520l643763l150676k736390k390275
58155B4184805k103362j861293j652850j474955j323964j191311j071949r67704
58147A2537417q77985p95926p17600o46590n85464n30732m79871m35558l98989
58138G068702l66205l34882l08255k88669k73234k59048k46802k36254k23991
58129D531362k08849j94316j82701j71913j60344j49842j41390j32913j23741
$$ plain form
58120 3065353 2949000 2837550 2731482 2632648 2540349 2452419 2368862 2290807 2217069 2145432 2076445
58109 2076445 2012367 1953086 1896406 1841647 1789670 1740005 1691140 1643164 1597147 1552603 1508481
58098 1508481 1465955 1427133 1391554 1356926 1322860 1290846 1261025 1232043 1203897 1177886 1153798
58087 1153798 1129937 1106103 1083933 1064162 1045891 1028624 1012657 997359 981313 964318 947279
58076 947279 930172 912129 893424 875263 857631 839376 820486 802368 785824 770531 756425
58065 756425 743786 732042 720321 709121 699629 691468 682934 673460 664004 654994 645677 635646 625336
58052 625336 614780 603435 591460 579845 569109 559032 549593 541022 533109 525648 519241 514387 510245
58039 510245 505640 500846 496919 493732 490173 485914 481371 476308 470136 463300 456719 450112 442454 433775
$$ packed form
58120C065353j16353j11450j06068r8834r2299q7930q3557p8055p3738p1637o8987
58109B076445o4078n9281n6680n4759n1977m9665m8865m7976m6017m4544m4122
58098A508481m2526l8822l5579l4628l4066l2014k9821k8982k8146k6011k4088
58087A153798k3861k3834k2170j9771j8271j7267j5967j5298j6046j6995j7039
58076I47279j7107j8043j8705j8161j7632j8255j8890j8118j6544j5293j4106
58065G56425j2639j1744j1721j1200r492q161q534r474r456r010r317j0031j0310
58052F25336j0556j1345j1975j1615j0736j0077r439q571p913p461o407m854m142
58039E10245m605m794l927l187l559m259m543n063o172o836o581o607p658q679
$$ plain form
58025 433775 424874 415635 405445 395066 386159 378977 372290 365616 359779 355187 351276 347856 345393 343720
58011 343720 341978 340064 338723 338114 337631 337220 337435 338153 338658 338972 339671 340432 340377 339906 340574 342891 345727
57994 345727 348031 349642 350277 349341 347095 344491 341584 337531 332431 327603 323705 320071 316296 312907 309984
57979 309984 306668 302711 299145 296643 294437 291586 288267 285150 282420 280029 278106 276667 275618 275216
57965 275216 275716 276483 276478 275672 274935 274483 273708 272611 272032 272213 272474 272623 273291 274425 274808 273613 271266 268348
57947 268348 265009 261908 260294 260380 260851 260769 260840 262139 264723 268298 273141 279387 286354 293440 300934 309163
57931 309163 317664 325971 334382 343065 351082 357137 360828 362483 362302 360272 356490 351035 343979 335941
57917 335941 328049 320944 314358 308015 302261 297442 293367 289865 287222 285663 285033 285331 286797 289086 291115
$$ packed form
58025D33775q901r239j0190j0379q907p182o687o674n837m592l911l420k463j673
58011C43720j742j914j341o09m83m11K15P18N05L14O99P61n5m71O68K317K836
57994C45727K304J611O35r36k246k604k907m053n100m828l898l634l775l389k923
57979C09984l316l957l566k502k206k851l319l117k730k391j923j439j049m02
57965B75216N00P67nq06p37m52p75j097n79J81K61J49O68J134L83j195k347k918
57947B68348l339l101j614Q6M71q2P1J299K584L575M843O246O967P086P494Q229
57931C09163Q501Q307Q411Q683Q017O055L691J655j81k030l782n455p056q038
57917C35941p892p105o586o343n754m819m075l502k643j559o30K98J466K289K029
$$ plain form
57902 291115 292235 292837 293312 293166 291817 289632 287484 285733 284230 282917 281921 281287 280923 280605 280001 279123
57886 279123 278703 279428 280808 281590 281362 280834 280417 279620 278202 276815 275905 274907 273122 270673 267976 265013
57870 265013 261774 258749 256429 254808 253807 253544 253780 253837 253532 253590 254694 256796 259772 263935 269381 275551
57854 275551 281967 288731 295785 302418 308057 312923 317381 321253 324220 326170 326690 325076 321440 317026
57840 317026 312759 308237 302814 296865 291186 285849 280546 275547 271402 268123 265381 263154 261521 260237
57826 260237 259062 258100 257333 256453 255772 256541 259507 263670 267336 269967 272162 274278 276103 277683 279445
57811 279445 281293 282228 281054 277243 271243 264203 257167 250306 243176 235789 228850 222780 217264 212129
57797 212129 207917 205018 202990 201382 200570 201013 202283 203605 204966 206933 209754 213295 217468 222104 226806
$$ packed form
57902B91115J120O02M75j46j349k185k148j751j503j313r96o34l64l18o04q78
57886B79123m20P25J380P82k28n28m17p97j418j387r10r98j785k449k697k963
57870B65013l239l025k320j621j001k63K36N7l05N8J104K102K976M163N446O170
57854B75551O416O764P054O633N639M866M458L872K967J950N20j614l636m414
57840C17026m267m522n423n949n679n337n303m999m145l279k742k227j633j284
57826B60237j175r62p67q80o81P69K966M163L666K631K195K116J825J580J762
57811B79445J848R35j174l811o000p040p036o861p130p387o939o070n516n135
57797B12129m212k899k028j608q12M43J270J322J361J967K821L541M173M636M702
$$ plain form
57782 226806 231504 236696 242588 248534 253979 259327 265119 270951 276049 280417 284537 288341 291449 294020
57768 294020 296343 297862 297580 295351 291896 287654 282439 276133 268944 261021 252584 244381 237312 231599
57754 231599 226861 222911 219892 217828 216690 216759 218267 220742 223341 225777 228462 231862 236145 241187 246444
57739 246444 251127 255005 258597 262071 264561 265394 265365 265719 266267 265727 263833 261897 261136 261425 261913 262033 261699
57722 261699 261201 261113 261692 262327 262140 261009 259348 257070 253720 249594 245755 242788 240370 238173 236209 234103
57706 234103 231026 226791 222093 217245 211556 204589 197280 191065 186450 183123 180943 179936 179529 178719 177190
57691 177190 175687 175014 175042 174969 174355 173546 173094 173105 173400 174062 175387 177319 179500 182082 186001 192077 200285
57674 200285 210334 222638 238173 257688 281634 310776 346188 388534 437469 491445 547547
$$ packed form
57782B26806M698N192N892N946N445N348N792N832N098M368M120L804L108K571
57768B94020K323J519k82k229l455m242n215o306p189p923q437q203p069n713
57754B31599m738l950l019k064j138O9J508K475K599K436K685L400M283N042N257
57739B46444M683L878L592L474K490Q33k9L54N48n40j894j936p61K89M88J20l34
57722B61699m98q8N79O35j87j131j661k278l350m126l839k967k418k197j964k106
57706B34103l077m235m698m848n689o967p309o215m615l327k180j007m07q10j529
57691A77190j503o73K8p3o14q09m52J1K95O62J325J932K181K582L919O076Q208
57674B00285J0049J2304J5535J9515K3946K9142L5412M2346M8935N3976N6102
$$ plain form
57663 547547 601468 647974 681591 697412 692661 668566 630407 584851 537028 490067 446277 407375
57651 407375 373811 345078 320860 301141 285328 272309 261477 252870 246253 240952 236665 233515
57639 233515 231106 228552 225748 223702 223106 223324 223261 222573 221560 220534 219782 219590 219780 219631 218681 217201 215562
57622 215562 213704 211592 209672 208312 207176 205610 203336 200415 196953 193261 189904 187137 184548 181719
57608 181719 178883 176495 174464 172350 170092 168050 166478 165442 165090 165446 165986 165957 165197 164238 163457 162540
57592 162540 161007 158971 157022 155455 153947 152117 150195 148817 148196 147744 146722 145007 143074 141447 140446
57577 140446 140235 140665 141082 140760 139642 138342 137332 136421 135157 133439 131527 129671 127918 126167 124339
57562 124339 122565 121187 120432 120181 120232 120663 121620 122809 123688 124234 125098 126759 128851 130688 132263 134327
$$ packed form
57663E47547N3921M6506L3617J5821m751k4095l8159m5556m7823m6961m3790l8902
57651D07375l3564k8733k4218j9719j5813j3019j0832q607o617n301m287l150
57639B33515k409k554k804k046n96K18o3o88j013j026p52j92J90j49r50j480j639
57622B15562j858k112j920j360j136j566k274k921l462l692l357k767k589k829
57608A81719k836k388k031k114k258k042j572j036l52L56N40k9p60r59p81r17
57592A62540j533k036j949j567j508j830j922j378o21m52j022j715j933j627j001
57577A40446k11M30M17l22j118j300j010r11j264j718j912j856j753j751j828
57562A24339j774j378p55k51N1M31R57J189Q79N46Q64J661K092J837J575K064
$$ plain form
57546 134327 137339 140519 142214 141364 138608 135782 134269 134016 134220 134542 135310 136723 138388 139749 140680 141488
57530 141488 142451 143402 143826 143471 142822 142739 143540 144748 145821 146700 147447 147904 148099 148546 149577 150726 151319 151382
57512 151382 151395 151381 150916 149857 148435 146715 144535 141929 139056 135833 132211 128673 125794 123397 120825
57497 120825 118025 115634 113951 112571 111163 109900 108897 107864 106631 105536 104995 105025 105296 105332 104713 103512
57481 103512 102521 102475 103088 103442 103299 103342 104015 104896 105433 105593 105429 104648 103055 100984 98899 96880 94797 92696
57463 92696 90794 89288 88267 87592 86909 86109 85628 85933 86937 88358 90295 92725 94806 95703 95912 96715
57447 96715 98323 99700 100295 100631 100926 100533 99374 98608 99009 99736 99724 99358 99700 100763 101736 102439 103388 104637
57429 104637 105561 105791 105638 105570 105842 106496 107244 107556 107283 106970 107102 107348 107054 106171 105158 104291 103579 103097 102897
$$ packed form
57546A34327L012L180J695q50k756k826j513k53K04L22P68J413J665J361R31Q08
57530A41488R63R51M24l55o49q3Q01J208J073Q79P47M57J95M47J031J149N93O3
57512A51382J3j4m65j059j422j720k180k606k873l223l622l538k879k397k572
57497A20825k800k391j683j380j408j263j003j033j233j095n41L0K71L6o19j201
57481A03512r91m6O13L54j43M3O73Q81N37J60j64p81j593k071k085k019k083k101
57463I2696j902j506j021o75o83q00m81L05J004J421J937K430K081Q97K09Q03
57447I6715J608J377N95L36K95l93j159p66M01P27j2l66L42J063R73P03R49J249
57429A04637R24K30j53o8K72O54P48L12k73l13J32K46k94q83j013q67p12m82k00
$$ plain form
57410 102897 102819 102864 103455 104829 106505 107899 109104 110470 111736 112305 112190 111941 111653 110758 108878 106477 104548
57393 104548 103922 104711 106132 106989 106709 105841 105319 105555 106517 108286 110987 114348 117848 121193 124301 127016
57377 127016 129249 131213 133113 134720 135584 135519 134611 133046 131221 129641 128343 126733 124430 121882 119711
57362 119711 117889 116114 114594 113798 113692 113912 114504 115824 117791 119845 121565 122800 123359 123154 122643 122569
57346 122569 123268 124637 126645 129317 132263 134729 136172 136445 135629 134103 132670 132069 132369 133159 134117 135044
57330 135044 135634 135765 135808 136107 136348 135999 135109 134096 133009 131733 130736 130802 131966 133437 134572 135266 135393
57313 135393 134677 133284 131901 131010 130633 130823 131731 133005 133884 134182 134583 135553 136579 137002 137147 137975 139775
57296 139775 141807 143263 144181 145139 146259 146896 146513 145635 145480 146590 148251 149479 150044 150159 149668 148185
$$ packed form
57410A02897p8M5N91J374J676J394J205J366J266N69j15k49k88q95j880k401j929
57393A04548o26P89J421Q57k80q68n22K36R62J769K701L361L500L345L108K715
57377A27016K233J964J900J607Q64o5r08j565j825j580j298j610k303k548k171
57362A19711j822j775j520p96j06K20N92J320J967K054J720J235N59k05n11p4
57346A22569O99J369K008K672K946K466J443K73q16j526j433o01L00P90R58R27
57330A35044N90J31M3K99K41l49q90j013j087j276r97O6J164J471J135O94J27
57313A35393p16j393j383q91l77J90R08J274Q79K98M01R70J026M23J45Q28J800
57296A39775K032J456R18R58J120O37l83q78j55J110J661J228N65J15m91j483
$$ plain form
57280 148185 145831 143223 140820 138751 137092 135840 134776 133856 133596 134528 136450 138747 141315 144541 148463
57265 148463 152591 156542 160270 163739 166926 170119 173652 177431 181216 185150 189341 193182 195966 198048
57251 198048 200469 203416 206101 208278 210805 214324 218293 221841 224754 227159 229054 230801 233330 237102
57237 237102 241335 244923 247768 250624 253982 257709 261529 265318 269076 273037 277681 283294 289656 296334
57223 296334 303010 309294 314701 319260 323816 329274 335653 342232 348432 354157 359451 364231 368416 372106
57209 372106 375646 379524 384070 389212 394737 400780 407724 415605 424097 433183 443268 454368 465725
57196 465725 476680 487461 498568 509696 519921 528924 537487 546590 556292 565665 573783 580713 587443
57183 587443 594778 602444 609627 616303 623553 632414 642811 653767 664241 673558 681492 688336 694680
$$ packed form
57280A48185k354k608k403k069j659j252j064r20k60R32J922K297K568L226L922
57265A48463M128L951L728L469L187L193L533L779L785L934M191L841K784K082
57251A98048K421K947K685K177K527L519L969L548K913K405J895J747K529L772
57237B37102M233L588K845K856L358L727L820L789L758L961M644N613O362O678
57223B96334O676O284N407M559M556N458O379O579O200N725N294M780M185L690
57209C72106L540L878M546N142N525O043O944P881Q492R086J0085J1100J1357
57196D65725J0955J0781J1107J1128J0225R003Q563R103R702R373Q118O930O730
57183E87443P335P666P183O676P250Q861J0397J0956J0474R317P934O844O344
$$ plain form
57170 694680 700771 706334 711233 716094 722023 729943 740330 753150 767610 782274 795939 808442 820401
57157 820401 832319 844243 856128 868162 880677 893976 908170 923086 938356 953744 969204
57146 969204 984544 999289 1013140 1026436 1039967 1054345 1069624 1085331 1100674 1114944 1128020
57135 1128020 1140524 1153413 1167485 1183296 1201319 1221925 1245158 1270516 1296917 1323093 1348402
57124 1348402 1373358 1399171 1426721 1456156 1487388 1520520 1555710 1593034 1632729 1675357 1721621
57113 1721621 1772399 1829126 1893865 1968757 2055549 2155687 2270583 2401759 2551326 2722789
57103 2722789 2921276 3152931 3424599 3744661 4124183 4577204 5120298 5772273 6554037
57094 6554037 7488100 8597600 9904884 11429235 13183661 15171960 17387564 19814129
$$ packed form
57170F94680O091N563M899M861N929P920J0387J2820J4460J4664J3665J2503J1959
57157H20401J1918J1924J1885J2034J2515J3299J4194J4916J5270J5388J5460
57146I69204J5340J4745J3851J3296J3531J4378J5279J5707J5343J4270J3076
57135A128020J2504J2889J4072J5811J8023K0606K3233K5358K6401K6176K5309
57124A348402K4956K5813K7550K9435L1232L3132L5190L7324L9695M2628M6264
57113A721621N0778N6727O4739P4892Q6792J00138J14896J31176J49567J71463
57103B722789J98487K31655K71668L20062L79522M53021N43094O51975P81764
57094F554037R34063J109500J307284J524351J754426J988299K215604K426565
$$ plain form
57086 19814129 22426224 25189095 28058595 30982736 33903802 36757608 39468913 41947933
57078 41947933 44094627 45810550 47010270 47626625 47613847 46955655 45676199 43843050 41556207
57069 41556207 38929411 36074779 33095351 30082984 27117932 24268385 21589285 19120592
57061 19120592 16886451 14896407 13147984 11629438 10322492 9205070 8253206 7441990
57053 7441990 6746713 6144773 5617020 5147759 4724638 4339344 3987724 3668080 3378981
57044 3378981 3118555 2884884 2675984 2489474 2322974 2174690 2043138 1926481 1822681
57035 1822681 1730135 1647732 1574642 1510600 1456133 1411962 1378372 1355727 1345200 1348197 1364984
57024 1364984 1394011 1431600 1470929 1501542 1511831 1493955 1447280 1377739 1294336 1205583 1117494
$$ packed form
57086A9814129K612095K762871K869500K924141K921066K853806K711305K479020
57078D1947933K146694J715923J199720O16355j2778o58192j279456j833149k286843
57069D1556207k626796k854632k979428l012367k965052k849547k679100k468693
57061A9120592k234141j990044j748423j518546j306946j117422r51864q11216
57053G441990o95277o01940n27753m69261m23121l85294l51620l19644k89099
57044C378981k60426k33671k08900j86510j66500j48284j31552j16657j03800
57035A822681r2546q2403p3090o4042n4467m4171l3590k2645j0527K997J6787
57024A364984K9027L7589L9329L0613J0289j7876m6675o9541q3403q8753q8089
$$ plain form
57013 1117494 1033352 954800 883056 819119 763189 714498 671845 634140 600580 570772 544761
57002 544761 522644 504105 488499 475251 463885 453830 444556 435835 427589 419619 411808 404435 397979
56989 397979 392808 389352 388278 389987 394118 400026 407513 416545 426303 435033 440807 442133 438217 429420
56975 429420 417379 404027 390361 376583 363192 351155 340946 332220 324646 318473 314105 311712
56963 311712 311521 313913 318947 326287 335897 348321 363861 381682 399941 416455 429102 436119 436574
56950 436574 430619 419247 404033 387020 370230 354784 340652 327513 315654 305795 298409 293668
56938 293668 291951 293848 299433 307873 318269 330859 346913 367015 389730 412365 432767 449604
56926 449604 461033 464450 458492 444586 425595 403397 378687 352690 327598 305029 285070 267176
$$ packed form
57013A117494q4142p8552p1744o3937n5930m8691m2653l7705l3560k9808k6011
57002E44761k2117j8539j5606j3248j1366j0055r274q721q246p970p811p373o456
56989C97979n171l456j074J709M131N908P487R032R758Q730N774J326l916q797
56975D29420j2041j3352j3666j3778j3391j2037j0209q726p574o173m368k393
56963C11712j91K392N034P340R610J2424J5540J7821J8259J6514J2647P017M55
56950D36574n955j1372j5214j7013j6790j5446j4132j3139j1859r859p386m741
56938B93668j717J897N585Q440J0396J2590J6054K0102K2715K2635K0402J6837
56926D49604J1429L417n958j3906j8991k2198k4710k5997k5092k2569j9959j7894
$$ plain form
56914 267176 251187 237082 224562 213504 204282 197050 191117 185559 180269 175951 173183 171830 171253
56901 171253 170952 171004 171944 174118 177263 180963 185350 190994 198235 207124 217918 230944 245897 261943
56887 261943 278668 296323 314904 333610 351401 367299 379774 386754 387122 381862 373120 362565
56875 362565 351224 340267 330836 323135 316632 311343 308295 308586 312633 320554 332728 349668 371778
56862 371778 399492 433154 472285 515139 559274 602214 641115 672128 691065 695327 685227 663521
56850 663521 634013 600610 566903 535647 508452 486244 469978 460533 457975 461624 471159 487292
56838 487292 511149 543495 584893 635972 696644 765017 837400 909091 974543 1027072 1059766
56827 1059766 1067863 1050787 1012223 958531 896717 832806 771016 713869 662807 618677 582028
$$ packed form
56914B67176j5989j4105j2520j1058r222p232n933n558n290m318k768j353n77
56901A71253l01N2R40K174L145L700M387N644P241Q889J0794J3026J4953J6046
56887B61943J6725J7655J8581J8706J7791J5898J2475O980L68n260q742j0555
56875C62565j1341j0957r431p701o503n289l048K91M047P921J2174J6940K2110
56862C71778K7714L3662L9131M2854M4135M2940L8901L1013J8937M262j0100k1706
56850F63521k9508l3403l3707l1256k7195k2208j6266r445k558L649R535J6133
56838D87292K3857L2346M1398N1079O0672O8373P2383P1691O5452N2529L2694
56827A059766Q097j7076l8564n3692o1814o3911o1790n7147n1062m4130l6649
$$ plain form
56816 582028 553421 533487 522512 520184 526111 540392 563216 594028 631568 674613 721890 770915
56804 770915 817242 855124 878998 884945 871854 841829 799236 748962 695323 642012 592074 547474
56792 547474 508941 476450 449666 428098 411426 399927 394202 394436 400347 411824 428959 451156
56780 451156 476686 503204 528133 548373 560592 562641 554460 537289 512490 481737 447784 413998
56768 413998 382755 354609 329019 305509 284100 265010 248253 233574 220688 209502 199995 191972
56756 191972 185144 179400 174699 170715 166928 163147 159670 156852 154758 153207 151814 150025 147589 145039
56742 145039 143210 142157 141064 139354 137263 135110 132744 130214 128381 128161 129421 131211 132794 133921
56728 133921 134365 133986 133284 133228 134281 135940 137484 138822 140375 142289 144156 145556 146613 147722 148828
$$ packed form
56816E82028k8607j9934j0975k328N927J4281K2824L0812L7540M3045M7277M9025
56804G70915M6327L7882K3874N947j3091l0025m2593n0274n3639n3311m9938m4600
56792E47474l8533l2491k6784k1568j6672j1499n725K34N911J1477J7135K2197
56780D51156K5530K6518K4929K0240J2219K049q181j7171k4799l0753l3953l3786
56768D13998l1243k8146k5590k3510k1409j9090j6757j4679j2886j1186r507q023
56756A91972o828n744m701l984l787l781l477k818k094j551j393j789k436k550
56742A45039j829j053j093j710k091k153k366k530j833k20J260J790J583J127
56728A33921M44l79p02n6J053J659J544J338J553J914J867J400J057J109J106
$$ plain form
56713 148828 149377 149114 148549 148288 148206 147801 147086 146528 146230 145856 145442 145611 146802 148778 151041 153194 154820
56696 154820 155648 156065 156809 157918 158586 158305 157536 156930 156571 156310 156157 155880 154911 153206 151555 150526 149811
56679 149811 149168 149139 149967 150597 149955 148711 148538 149829 151366 152186 152573 153062 153626 154244 155267 156663 157630
56662 157630 157513 156567 155298 153550 150852 147369 143862 140780 137837 134570 131070 128010 126022 125143 124924
56647 124924 125038 125604 126774 128233 129414 130148 130794 131720 132925 134216 135588 137307 139711 142903 146516
56632 146516 149808 152171 153591 154632 156022 158217 161130 164116 166395 167632 168037 167871 167131 165847 164404
56617 164404 163263 162509 161892 161215 160528 160072 160146 160857 161844 162400 162014 160727 158996 157446 156690 156942 157680 158080
56599 158080 157938 157759 157819 157677 156935 155983 155568 155930 156755 157716 158671 159550 160306 160885 161133 161062 161287 162667 165300
$$ packed form
56713A48828N49k63n65k61q2m05p15n58k98l74m14J69J191J976K263K153J626
56696A54820Q28M17P44J109O68k81p69o06l59k61j53k77r69j705j651j029p15
56679A49811o43k9Q28O30o42j244j73J291J537Q20L87M89N64O18J023J396R67
56662A57630j17r46j269j748k698l483l507l082k943l267l500l060j988q79k19
56647A24924J14N66J170J459J181P34O46R26J205J291J372J719K404L192L613
56632A46516L292K363J420J041J390K195K913K986K279J237M05j66p40j284j443
56617A64404j141p54o17o77o87m56P4P11R87N56l86j287j731j550p56K52P38M00
56599A58080j42j79O0j42p42r52m15L62Q25R61R55Q79P56N79K48p1K25J380K633
$$ plain form
56580 165300 168327 170870 172669 173663 173795 173652 174428 176589 179185 181176 182824 185052 188070 191470 195132
56565 195132 199085 202878 206209 209992 215831 224486 235537 248336 262384 276901 290944 303931 315361
56552 315361 324271 329928 332954 334788 336030 336269 335574 334939 334960 335082 334663 333926 333295 332550 331253 329413 327139
56535 327139 324036 319640 314195 308520 303158 297997 292691 287257 282201 278041 274652 271239 267204 262874
56521 262874 259072 256104 253576 251053 248384 245459 242172 238719 235544 232951 231023 229814 229287 229170 229291
56506 229291 229878 231123 232641 233804 234396 234408 233506 231382 228445 225500 222837 220271 217854 215760 213631
56491 213631 210942 207961 205457 203428 201063 198126 195425 193659 192601 191696 190745 189701 188584 187847 188101
56476 188101 189149 190017 190241 190416 191098 191925 192287 192196 192001 191805 191628 191713 192192 192834 193409 193942 194456 194967 195842
$$ packed form
56580A65300L027K543J799R94J32j43P76K161K596J991J648K228L018L400L662
56565A95132L953L793L331L783N839Q655J1051J2799J4048J4517J4043J2987J1430
56552C15361Q910N657L026J834J242K39o95o35K1J22m19p37o31p45j297j840k274
56535C27139l103m396n445n675n362n161n306n434n056m160l389l413m035m330
56521B62874l802k968k528k523k669k925l287l453l175k593j928j209n27j17J21
56506B29291N87J245J518J163N92J2r02k124k937k945k663k566k417k094k129
56491B13631k689k981k504k029k365k937k701j766j058r05r51j044j117p37K54
56476A88101J048Q68K24J75O82Q27L62r1j95j96j77Q5M79O42N75N33N14N11Q75
$$ plain form
56457 195842 197485 199395 200324 199779 198762 198513 199073 199501 199004 197465 195424 193977 194165 195954 198203 200013
56441 200013 201587 203377 205015 205702 205263 204250 203292 202725 202536 202282 201460 200359 200072 201192 202854 203640
56425 203640 203164 202296 202023 202562 203439 204051 204161 204047 204087 204239 204212 204128 204495 205426 206405 207043 207560 208345 209482
56406 209482 210909 212471 213675 214014 213750 213741 214229 214549 214287 213920 213892 213895 213632 213472 213705 213871 213624 213621 214737 216869
56386 216869 219305 221772 224331 226712 228713 230971 234370 238784 243131 246633 249356 251659 253799 255955
56372 255955 257975 259115 258605 256501 253536 250310 247115 244382 242555 241519 240752 240196 240475 242087 244710
56357 244710 247467 249652 251147 252303 253443 254520 255357 256147 257295 258678 259568 259589 259335 259654 260689 261997
56341 261997 263252 264374 265311 266142 267224 268832 270808 272838 274802 276632 278203 279693 281655 284371 287438
$$ packed form
56457A95842J643J910R29n45j017k49N60M28m97j539k041j447J88J789K249J810
56441B00013J574J790J638O87m39j013r58n67j89k54q22j101k87J120J662P86
56425B03640m76q68k73N39Q77O12J10j14M0J52k7q4L67R31R79O38N17P85J137
56406B09482J427J562J204L39k64rM88L20k62l67k8Lk63j60K33J66k47lJ116K132
56386B16869K436K467K559K381K001K258L399M414M347L502K723K303K140K156
56372B55955K020J140n10k104k965l226l195k733j827j036p67n56K79J612K623
56357B44710K757K185J495J156J140J077Q37P90J148J383Q90K1k54L19J035J308
56341B61997J255J122R37Q31J082J608J976K030J964J830J571J490J962K716L067
$$ plain form
56326 287438 290368 293248 296453 300033 303710 307119 309743 311083 311321 311415 312112 313230 314242 315058 315746 316035
56310 316035 315725 315198 314904 314667 314106 313499 313647 315054 317684 321233 325221 329129 332964 337400 342867 348778
56294 348778 354112 358447 362027 365191 368252 371570 375186 378626 381533 384216 387206 390633 394490 399101
56280 399101 404809 411511 418949 427069 435707 444346 452615 460680 468837 477315 486737 497945 510827 524101
56266 524101 536975 550280 565296 582226 600660 620736 642875 667081 693554 723309 757131
56255 757131 794597 835327 880559 932115 990312 1054385 1124697 1202953 1290222 1386131 1490080
56244 1490080 1601863 1720850 1845645 1974787 2106667 2238559 2366777 2488133 2600412
56235 2600412 2701357 2788190 2858357 2909805 2940446 2948572 2934338 2899980 2848180 2780875 2699929
$$ packed form
56326B87438K930K880L205L580L677L409K624J340K38R4O97J118J012Q16O88K89
56310C16035l10n27k94k37n61o07J48J407K630L549L988L908L835M436N467N911
56294C48778N334M335L580L164L061L318L616L440K907K683K990L427L857M611
56280C99101N708O702P438Q120Q638Q639Q269Q065Q157Q478R422J1208J2882J3274
56266E24101J2874J3305J5016J6930J8434K0076K2139K4206K6473K9755L3822
56255G57131L7466M0730M5232N1556N8197O4073P0312P8256Q7269R5909J03949
56244A490080J11783J18987J24795J29142J31880J31892J28218J21356J12279
56235B600412J00945Q6833P0167N1448L0641Q126j4234l4358n1800o7305q0946
$$ plain form
56224 2699929 2607907 2507613 2401418 2291540 2180333 2069776 1961030 1854834 1752052 1653636
56214 1653636 1560419 1473069 1391900 1316664 1246932 1182656 1123917 1070107 1019997 972790 928750
56203 928750 888652 852893 821118 792398 765784 740902 717988 697272 678691 662309 648441
56192 648441 636934 626928 617791 609737 602956 596817 590682 584908 580215 576611 573820 572185 572094 572829
56178 572829 573017 572000 570023 567538 565245 564281 565223 567188 568923 570481 572784 575962 579301 582524 586001
56163 586001 589920 594297 599509 605740 612384 619109 626912 636730 647605 657888 667930 679754 694219
56150 694219 710374 727783 747678 771385 799195 831288 868446 911335 960244 1015948 1079773
56139 1079773 1152504 1233981 1323453 1418912 1516115 1609846 1696636 1775307 1845273 1906111 1959064
$$ packed form
56224B699929r2022j00294j06195j09878j11207j10557j08746j06196j02782r8416
56214A653636r3217q7350q1169p5236o9732o4276n8739n3810n0110m7207m4040
56203I28750m0098l5759l1775k8720k6614k4882k2914k0716j8581j6382j3868
56192F48441j1507j0006r137q054o781o139o135n774m693l604k791j635r1P35
56178E72829J88j017j977k485k293r64R42J965J735J558K303L178L339L223L477
56163E86001L919M377N212O231O644O725P803R818J0875J0283J0042J1824J4465
56150F94219J6155J7409J9895K3707K7810L2093L7158M2889M8909N5704O3825
56139A079773P2731Q1477Q9472R5459R7203R3731Q6790P8671O9966O0838N2953
$$ plain form
56128 1959064 2007095 2052491 2095220 2133752 2166213 2190569 2205243 2210324 2207437 2198307 2184142 2165765
56116 2165765 2142637 2111784 2069410 2013916 1946247 1867872 1780469 1687620 1594513 1505230 1421725
56105 1421725 1345470 1278100 1220030 1170378 1128670 1094834 1067368 1043771 1023362 1007462 996168
56094 996168 987313 979467 973619 970642 969302 968200 967790 969002 971528 974869 979454 985317 991182 996189
56080 996189 1001205 1007195 1013730 1020283 1027574 1036365 1046193 1056436 1067325 1078864 1090194 1101118 1112838
56067 1112838 1126055 1139757 1153002 1166444 1180982 1196297 1211877 1228079 1245089 1262172 1278977
56056 1278977 1296203 1314101 1331918 1349724 1368956 1390052 1411293 1431188 1450337 1469810 1489512
56045 1489512 1509400 1530468 1553145 1576415 1599790 1624354 1650622 1677290 1703461 1730198 1758559
$$ packed form
56128A959064M8031M5396M2729L8532L2461K4356J4674N081k887r130j4165j8377
56116B165765k3128l0853m2374n5494o7669p8375q7403r2849r3107q9283q3505
56105A421725p6255o7370n8070m9652m1708l3836k7466k3597k0409j5900j1294
56094I96168q855p846n848k977j340j102m10J212K526L341M585N863N865N007
56080I96189N016N990O535O553P291Q791R828J0243J0889J1539J1330J0924J1720
56067A112838J3217J3702J3245J3442J4538J5315J5580J6202J7010J7083J6805
56056A278977J7226J7898J7817J7806J9232K1096K1241J9895J9149J9473J9702
56045A489512J9888K1068K2677K3270K3375K4564K6268K6668K6171K6737K8361
$$ plain form
56034 1758559 1788125 1818911 1852512 1889664 1928660 1967908 2008096 2050190 2093425 2137035 2181875
56023 2181875 2228399 2275102 2320964 2367458 2416228 2466787 2518506 2572806 2631275 2693467 2758521
56012 2758521 2826968 2899111 2973730 3050255 3130122 3214187 3301185 3390534 3484039 3582901 3685836
56001 3685836 3792273 3904470 4024187 4150298 4282029 4421455 4570330 4727735 4893409
55992 4893409 5069839 5258348 5456997 5665436 5887806 6127464 6383131 6654018 6944342
55983 6944342 7258436 7595905 7956494 8345550 8769506 9230007 9727889 10269082 10861194
55974 10861194 11508292 12214728 12990330 13846589 14792425 15839734 17008756 18322721 19803377
55965 19803377 21479028 23392166 25594128 28141426 31107432 34592540 38717458 43619076
$$ packed form
56034A758559K9566L0786L3601L7152L8996L9248M0188M2094M3235M3610M4840
56023B181875M6524M6703M5862M6494M8770N0559N1719N4300N8469O2192O5054
56012B758521O8447P2143P4619P6525P9867Q4065Q6998Q9349R3505R8862J02935
56001C685836J06437J12197J19717J26111J31731J39426J48875J57405J65674
55992D893409J76430J88509J98649K08439K22370K39658K55667K70887K90324
55983F944342L14094L37469L60589L89056M23956M60501M97882N41193N92112
55974A0861194O47098P06436P75602Q56259R45836J047309J169022J313965J480656
55965A9803377J675651J913138K201962K547298K966006L485108M124918M901618
$$ plain form
55957 43619076 49466019 56469976 64871948 74933081 86959055 101323789 118446625
55950 118446625 138738927 162542150 190004559 220850899 254134186 288112758 320272509
55943 320272509 347459326 366254090 373783293 368775432 352193215 326892428 296504405
55936 296504405 264309249 232677821 203063291 176213887 152394554 131578729 113593004
55929 113593004 98190583 85081105 73963538 64558466 56613462 49894319 44191160
55922 44191160 39331051 35173250 31595635 28494734 25792186 23428178 21349238 19508962
55914 19508962 17874867 16423783 15131810 13975521 12939320 12013130 11184282 10438134
55906 10438134 9764517 9157046 8607518 8106524 7647911 7227527 6839350 6477697 6141363
$$ packed form
55957D3619076N846943P003957Q401972J0061133J2025974J4364734J7122836
55950A18446625K0292302K3803223K7462409L0846340L3283287L3978572L2159751
55943C20272509K7186817J8794764P529203n007861j6582217k5300787l0388023
55936B96504405l2195156l1631428k9614530k6849404k3819333k0815825j7985725
55929A13593004j5402421j3109478j1117567r405072p945004o719143n703159
55922D4191160m860109m157801l577615l100901k702548k364008k078940j840276
55914A9508962j634095j451084j291973j156289j036201r26190q28848p46148
55906A0438134o73617o07471n49528n00994m58613m20384l88177l61653l36334
$$ plain form
55897 6141363 5830899 5543553 5275179 5024978 4793750 4579247 4377662 4188081 4011408
55888 4011408 3846596 3691999 3548692 3418284 3298876 3187032 3082362 2986332 2897916 2814014
55878 2814014 2732851 2653479 2573443 2490745 2407083 2325732 2247315 2170806 2097082 2027748 1961582
55867 1961582 1895947 1831016 1769227 1711333 1656324 1604476 1557076 1513631 1472527 1433978 1399270
55856 1399270 1367623 1336872 1306818 1278849 1252608 1226102 1198919 1172459 1147021 1121451 1095671
55845 1095671 1070895 1047274 1023683 999860 976467 953283 929727 906981 887081 869887 853362
55834 853362 836842 821573 807860 794258 780077 766443 754193 742630 731023 719747 709356
55823 709356 699885 691271 683238 674670 664454 652926 641259 629651 617501 605080 593479 583070
$$ packed form
55897F141363l10464k87346k68374k50201k31228k14503k01585j89581j76673
55888D011408j64812j54597j43307j30408j19408j11844j04670r6030q8416q3902
55878B814014q1163p9372q0036q2698q3662q1351p8417p6509p3724o9334o6166
55867A961582o5635o4931o1789n7894n5009n1848m7400m3445m1104l8549l4708
55856A399270l1647l0751l0054k7969k6241k6506k7183k6460k5438k5570k5780
55845A095671k4776k3621k3591k3823k3393k3184k3556k2746j9900j7194j6525
55834H53362j6520j5269j3713j3602j4181j3634j2250j1563j1607j1276j0391
55823G09356r471q614q033q568j0216j1528j1667j1608j2150j2421j1601j0409
$$ plain form
55811 583070 573486 564865 557622 551247 544872 538739 533636 529349 525360 522614 522646 525151 528346 531561 535529
55796 535529 540169 544176 547078 549710 552255 553700 553733 553471 553638 553544 552556 551200 550120 549030 547344 544936
55780 544936 541741 537317 531135 522777 511971 499278 486607 476150 468911 464999 464799 468599 475472
55767 475472 483853 492960 502230 509595 512053 508254 499382 487515 474362 461443 449938 439906 430630
55754 430630 421704 412843 403112 391796 379820 368678 358176 346928 335070 324511 316183 308859
55742 308859 301266 293775 287335 282167 278237 275716 274289 273035 271555 270194 268848 266756 263898 261350
55728 261350 259687 258153 255889 252829 248927 243761 237527 231343 225918 220937 216325 212968 211483 211311
55714 211311 211735 212895 215074 217920 221137 225084 229931 235009 239765 244546 249605 253887 255773 254742
$$ packed form
55811E83070r584q621p243o375o375o133n103m287l989k746L2K505L195L215L968
55796E35529M640M007K902K632K545J445L3k62J67r4r88j356j080j090j686k408
55780E44936l195m424o182q358j0806j2693j2671j0457p239l912k00L800O873
55767D75472Q381R107R270P365K458l799q872j1867j3153j2919j1505j0032r276
55754D30630q926q861r731j1316j1976j1142j0502j1248j1858j0559q328p324
55742C08859p593p491o440n168l930k521j427j254j480j361j346k092k858k548
55728B61350j663j534k264l060l902n166o234o184n425m981m612l357j485j72
55714B11311M24J160K179K846L217L947M847N078M756M781N059M282J886j031
$$ plain form
55700 254742 251660 247733 243612 239176 233771 226988 219492 212683 207328 203024 199116 195504 192294 189344
55686 189344 186623 184488 183220 182686 182740 183511 185102 187420 190385 193846 197305 200318 203158 206292 209208
55671 209208 210641 210153 208724 207519 206790 206127 205029 203041 200178 197443 196111 196297 197032 197833 199178 201113
55655 201113 202638 203121 203368 204506 206497 208482 209997 211165 212110 212795 213178 213155 212631 211832 211112 210309 208835
55638 208835 206566 204025 201490 198599 195040 190932 186313 180981 175188 169786 165284 161360 157609 154145
55624 154145 151187 148703 146762 145597 145042 144541 143891 143326 142726 141625 140220 139405 139386 139115 137587 134918
55608 134918 131777 128558 125551 123105 121110 119026 116826 115128 114014 112700 110804 109019 107921 107105
55594 107105 106162 105583 105921 106855 107815 108749 109506 109335 107892 105964 104344 102765 100872 99374 99014 99101 98450
$$ packed form
55700B54742l082l927m121m436n405o783p496o809n355m304l908l612l210k950
55686A89344k721k135j268n34N4P71J591K318K965L461L459L013K840L134K916
55671B09208J433m88j429j205p29o63j098j988k863k735j332J86P35Q01J345J935
55655B01113J525M83K47J138J991J985J515J168R45O85L83k3n24p99p20q03j474
55638B08835k269k541k535k891l559m108m619n332n793n402m502l924l751l464
55624A54145k958k484j941j165n55n01o50n65o00j101j405q15j9k71j528k669
55608A34918l141l219l007k446j995k084k200j698j114j314j896j785j098q16
55594A07105r43n79L38R34R60R34P57j71j443j928j620j579j893j498l60Q7o51
$$ plain form
55577 98450 97395 97525 99464 102098 104122 105407 106693 108697 111687 115323 118805 121543 123676 125605 127275
55562 127275 128334 128730 128669 128219 127481 126908 126898 127200 127100 126035 123782 120479 116839 113944 112388 111916 112112
55545 112112 112807 113495 113182 111590 109856 109175 109305 109275 109062 109513 110904 112610 114142 115564 116901 117991
55529 117991 118962 120097 121136 121421 120871 120186 119906 119734 119004 117495 115644 114103 113031 111764 109442 106087
55513 106087 102627 99615 96588 93114 89781 87407 85835 84448 83500 83891 85726 88044 90008 91548 92813
55498 92813 93763 94517 95391 96320 96744 96205 94679 92364 89613 87040 85054 83296 81131 78815 77494 77789
55482 77789 78950 79729 79696 79299 79004 78863 78859 79190 79970 80832 81176 80916 80658 80830 80946 80300 79197 78699 79066
55463 79066 79346 78842 78067 77693 77413 76684 75864 75638 75789 75628 75344 75800 77114 78438 79267 79984 80938 81817
$$ packed form
55577I8450j055J30J939K634K024J285J286K004K990L636L482K738K133J929J670
55562A27275J059L96o1m50p38n73j0L02j00j065k253l303l640k895j556m72J96
55545A12112O95O88l13j592j734o81J30l0k13M51J391J706J532J422J337J090
55529A17991R71J135J039K85n50o85k80j72p30j509j851j541j072j267k322l355
55513A06087l460l012l027l474l333k374j572j387r48L91J835K318J964J540J265
55498I2813R50P54Q74R29M24n39j526k315k751k573j986j758k165k316j321K95
55482G7789J161P79l3l97k95j41mL31P80Q62L44k60k58J72J16o46j103m98L67
55463G9066K80n04p75l74k80p29q20k26J51j61k84M56J314J324Q29P17R54Q79
$$ plain form
55445 81817 82259 82362 82203 81440 79822 77768 76060 75103 74653 74216 73662 73480 74194 75498 76349 76208 75675 75485
55427 75485 75477 75248 75288 76398 78232 79505 79746 79831 80546 81541 82086 82070 81749 81146 80272 79527 79327 79563 79799 79841
55407 79841 79788 79710 79515 79072 78290 77180 75958 74967 74411 74168 73876 73211 72208 71355 71157 71503 71745 71564 71350
55388 71350 71387 71175 70135 68671 67803 67830 68031 67787 67351 67281 67593 67735 67094 65375 62725 59643 56658 54005
55370 54005 51635 49406 47123 44614 41987 39711 38245 37754 38277 39826 42098 44498 46760 49175 51905
55355 51905 54521 56587 58181 59414 60067 60319 61203 63421 66176 68091 68947 69605 70551 71549 72489 73441 73944
55338 73944 73436 72428 72128 72775 73485 73938 74947 76848 78578 79152 79126 79689 80969 82136 82724 82995 83212
55321 83212 83304 83244 83218 83388 83709 83997 84035 83758 83356 83019 82636 82035 81511 81640 82489 83412 83735 83282 82266 81103
$$ packed form
55445H1817M42J03j59p63j618k054j708r57m50m37n54j82P14J304Q51j41n33j90
55427G5485qk29M0J110J834J273K41Q5P15R95N45j6l21o03q74p45k00K36K36M2
55407G9841n3p8j95m43p82j110j222r91n56k43k92o65j003q53j98L46K42j81k14
55388G1350L7k12j040j464q68K7K01k44m36p0L12J42o41j719k650l082k985k653
55370E4005k370k229k283k509k627k276j466m91N23J549K272K400K262K415K730
55355E1905K616K066J594J233O53K52Q84K218K755J915Q56O58R46R98R40R52N03
55338G3944n08j008l00O47P10M53J009J901J730N74k6N63J280J167N88K71K17
55321H3212R2o0k6J70L21K88L8k77m02l37l83o01n24J29Q49R23L23m53j016j163
$$ plain form
55301 81103 80303 80036 79769 78927 77846 77389 77567 77406 76433 75401 75098 75245 75192 75042 75305 75897 76211 75998 75539
55282 75539 75051 74495 73955 73758 74081 74683 75093 75023 74640 74464 74874 75749 76677 77414 77865 77819 77158 76277 75772 75673
55262 75673 75499 75125 75048 75546 76129 76118 75395 74330 73290 72470 71963 71797 72005 72608 73345 73634 73261 72944 73614
55243 73614 75220 76822 77798 78267 78349 77840 76740 75390 73924 72340 71181 71293 72624 74128 75159 76083
55227 76083 77147 77743 77374 76485 75651 74745 73606 72784 72760 73044 72908 72508 72470 72789 73074 73457 74315 75271 75450
55208 75450 74784 74277 74754 75887 76613 76180 74750 73226 72484 72652 73237 73910 74741 75592 76034 76215 77132 79370
55190 79370 82097 83936 84448 84106 83304 82192 81209 80915 81319 81968 82584 83062 83085 82448 81676 81650 82555 83749
55172 83749 84622 85074 85188 84989 84606 84245 83966 83803 83987 84651 85396 85617 85225 84656 84250 84080 84287 85050 86088
$$ packed form
55301H1103q00k67k67q42j081m57J78j61r73j032l03J47n3j50K63N92L14k13m59
55282G5539m88n56n40j97L23O02M10p0l83j76M10Q75R28P37M51m6o61q81n05r9
55262G5673j74l74p7M98N83j1p23j065j040q20n07j66K08O03P37K89l73l17O70
55243G3614J606J602R76M69Q2n09j100j350j466j584j159J12J331J504J031R24
55227G6083J064N96l69q89q34r06j139q22k4K84j36m00l8L19K85L83Q58R56J79
55208G5450o66n07M77J133P26m33j430j524p42J68N85O73Q31Q51M42J81R17K238
55190G9370K727J839N12l42q02j112r83k94M04O49O16M78K3o37p72k6R05J194
55172H3749Q73M52J14j99l83l61k79j63J84O64P45K21l92n69m06j70K07P63J038
$$ plain form
55153 86088 86593 85895 84130 82229 81289 81736 82966 83976 84407 84593 84591 83890 82486 81504 81985 83448 84484
55136 84484 84550 84363 84610 85065 85106 84474 83330 81993 80823 80073 79750 79709 79831 79933 79796 79501 79434 79651 79643 79164
55116 79164 78897 79696 81403 82985 83705 83658 83374 83405 84138 85445 86722 87696 88874 90621 92194 92477 91492
55099 91492 90389 90017 90252 90676 91134 91571 91994 92683 93885 95359 96701 97951 99217 99951 99502 98300 97505
55082 97505 97434 97285 96585 95898 95739 95753 95489 95185 95218 95399 95412 95453 95835 96344 96526 96365 96285 96635 97469 98573 99479
55061 99479 99722 99300 98678 98244 98053 98139 98598 99228 99490 99068 98111 96865 95491 94315 93724 93593 93337 92709
55043 92709 92051 91589 91129 90714 90918 91983 93210 93804 93849 93878 93846 93255 92177 91402 91441 91808 91546 90291 88664
55024 88664 87657 87655 88117 88269 87977 87687 87640 87648 87645 87967 88797 89748 90284 90327 90195 90178 90387 90818 91330 91733 92026 92402
$$ packed form
55153H6088N05o98j765j901r40M47J230J010M31J86kp01j404r82M81J463J036
55136H4484O6j87K47M55M1o32j144j337j170p50l23m1J22J02j37k95o7K17qm79
55116G9164k67P99J707J582P20m7k84L1P33J307J277R74J178J747J573K83r85
55099I1492j103l72K35M24M58M37M23O89J202J474J342J250J266P34m49j202p95
55082I7505p1j49p00o87j59J4k64l04L3J81J3M1L82N09J82j61q0L50Q34J104R06
55061I9479K43m22o22m34j91Q6M59O30K62m22r57j246j374j176n91j31k56o28
55043I2709o58m62m60m15K04J065J227N94M5K9l2n91j078p75L9L67k62j255j627
55024H8664j007kM62J52k92k90m7QlL22Q30R51N36M3j32j7K09M31N12M03K93L76
$$ plain form
55002 92402 92956 93650 94581 95983 97839 99765 101396 102654 103644 104585 105827 107489 109062 109837 109764 109375 108812
54985 108812 107669 106004 104746 104585 105014 104999 104191 102937 101577 100309 99500 99420 99753 99858 99538 99137 98970
54968 98970 98998 99122 99517 100518 102196 103977 104851 104270 102861 101860 101812 102307 102976 104001 105331 106242 106327 106276
54950 106276 106843 107499 107033 105312 103508 102527 102060 101450 100778 100597 101065 101815 102544 103287 104063 104522 104185 103064
54932 103064 101850 101266 101333 101544 101690 102042 102683 103213 103446 103912 105213 107209 109313 111356 113681 116610 120245
54915 120245 124626 129615 134757 139734 144800 150259 155570 159476 161150 160811 159240 157059 154507 151555
54901 151555 148119 144377 140830 137756 134795 131452 127884 124703 122092 119734 117603 116117 115256 114213
54887 114213 112454 110657 110016 110747 111811 112107 111540 110825 110608 111038 112043 113693 116160 119441 123315 127646
$$ packed form
55002I2402N54O94R31J402J856J926J631J258R90R41J242J662J573P75p3l89n63
54985A08812j143j665j258j61M29j5q08j254j360j268q09q0L33J05l20m01j67
54968I8970K8J24L95J001J678J781Q74n81j409j001m8M95O69J025J330R11Q5n1
54950A06276N67O56m66j721j804r81m67o10o72j81M68P50P29P43P76M59l37j121
54932A03064j214n84O7K11J46L52O41N30K33M66J301J996K104K043K325K929L635
54915A20245M381M989N142M977N066N459N311L906J674l39j571k181k552k952
54901A51555l436l742l547l074k961l343l568l181k611k358k131j486q61j043
54887A14213j759j797o41P31J064K96n67p15k17M30J005J650K467L281L874M331
$$ plain form
54871 127646 132502 137871 143391 148615 153462 158136 162550 166042 167775 167437 165511 162883 160071 156735
54857 156735 152084 145934 139220 133231 128450 124436 120801 117836 116001 115153 114568 113619 112156 110374 108582
54842 108582 107116 106178 105593 104900 103853 102739 102045 101862 101837 101744 101803 102294 103115 103932 104605 105147 105384 105015 104058
54823 104058 102882 101777 100788 100015 99711 99925 100313 100499 100393 100048 99506 98898 98398 97914 97182 96412 96466 97954
54805 97954 100438 102893 104781 106277 107624 108732 109360 109324 108521 107144 105845 105315 105593 106044 106125 105902 105754
54788 105754 105840 106097 106578 107564 109216 111152 112523 112692 111881 110993 110763 111292 112352 113755 115143 115841 115380
54771 115380 114114 112979 112724 113568 115435 118127 121347 124840 128513 132251 135895 139706 144538 150913 157992
54756 157992 164100 168402 171494 174108 175855 175705 173324 169406 164827 160015 155190 150671 146618 142744
$$ packed form
54871A27646M856N369N520N224M847M674M414L492J733l38j926k628k812l336
54857A56735m651o150o714n989m781m014l635k965j835q48n85r49j463j782j792
54842A08582j466r38n85o93j047j114o94j83k5r3N9M91Q21Q17O73N42K37l69r57
54823A04058j176j105r89p73l04K14L88J86j06l45n42o08n00m84p32p70N4J488
54805I7954K484K455J888J496J347J108O28l6q03j377j299n30K78M51Q1k23j48
54788A05754Q6K57M81R86J652J936J371J69q11q88k30N29J060J403J388O98m61
54771A15380j266j135k55Q44J867K692L220L493L673L738L644L811M832O375P079
54756A57992O108M302L092K614J747j50k381l918m579m812m825m519m053l874
$$ plain form
54742 142744 138669 134559 131087 128619 126674 124478 121892 119503 117808 116722 115970 115574 115687 116178 116659
54727 116659 116837 116721 116655 117262 119080 122000 125280 128329 131285 134659 138691 143281 148208 153092 157473
54712 157473 161322 165118 168914 171642 172066 170267 167489 164537 161138 156965 152505 148437 144783 141194
54698 141194 137733 134851 132770 131289 130123 129053 127786 125962 123414 120330 117162 114398 112325 110918
54684 110918 109978 109434 109409 109926 110571 110583 109431 107449 105841 105765 107200 108856 109375 108537 107223 106448 106648 107616
54666 107616 108755 109470 109638 109649 109846 110113 110202 110206 110336 110506 110509 110413 110325 110083 109684 109706 110617 111863 112445 112274 112095
54645 112095 112068 111466 110018 108569 107992 108252 109012 110315 111990 113138 113077 112325 111917 112137 112610 113220 114090 114958
54627 114958 115437 115757 116400 117104 117030 116005 114781 113914 113121 112005 110719 109592 108668 108029 108024 108739 109611 110053
$$ packed form
54742A42744m075m110l472k468j945k196k586k389j695j086p52l96J13M91M81
54727A16659J78j16o6O07J818K920L280L049K956L374M032M590M927M884M381
54712A57473L849L796L796K728M24j799k778k952l399m173m460m068l654l589
54698A41194l461k882k081j481j166j070j267j824k548l084l168k764k073j407
54684A10918r40n44k5N17O45J2j152j982j608p6J435J656N19q38j314p75K00R68
54666A07616J139P15J68J1J97K67Q9MJ30J70Lr6q8k42l99K2R11J246N82j71j79
54645A12095k7o02j448j449n77K60P60J303J675J148o1p52m08K20M73O10Q70Q68
54627A14958M79L20O43P04p4j025j224q67p93j116j286j127r24o39nP15Q72M42
$$ plain form
54609 110053 110184 110512 111132 111690 111998 112224 112503 112762 112958 113185 113475 113711 113785 113656 113219 112374 111308 110517 110418
54590 110418 110991 111862 112570 112788 112520 112251 112678 113981 115448 116094 115684 114918 114614 114906 115341 115490 115312 115100
54572 115100 115196 115687 116244 116406 116108 115748 115600 115376 114634 113439 112296 111517 110980 110531 110290 110503 111281 112556
54554 112556 114043 115251 115766 115654 115434 115614 116351 117530 118851 119844 120147 119986 120101 120998 122422 123750 124708
54537 124708 125460 126149 126677 126960 127196 127704 128544 129371 129732 129498 128989 128638 128637 128905 129202 129146 128328 126707 124835
54518 124835 123436 122816 122877 123506 124517 125309 125185 124178 123153 122875 123354 124203 125142 125806 125573 124149 122131
54501 122131 120514 119673 119224 118806 118615 119059 120179 121566 122735 123520 124087 124526 124543 123769 122395 121168 120632
54484 120632 120690 121069 121759 122660 123193 122857 121997 121452 121480 121616 121653 122187 123881 126608 129600 132199 134128 135242
$$ packed form
54609A10053J31L28O20N58L08K26K79K59J96K27K90K36P4j29m37q45j066p91r9
54590A10418N73Q71P08K18k68k69M27J303J467O46m10p66l04K92M35J49j78k12
54572A15100R6M91N57J62k98l60j48k24p42j195j143p79n37m49k41K13P78J275
54554A12556J487J208N15j12k20J80P37J179J321R93L03j61J15Q97J424J328R58
54537A24708P52O89N28K83K36N08Q40Q27L61k34n09l51jK68K97n6q18j621j872
54518A24835j399o20O1O29J011P92j24j007j025k78M79Q49R39O64k33j424k018
54501A22131j617q41m49m18j91M44J120J387J169P85N67M39J7p74j374j227n36
54484A20632N8L79O90R01N33l36q60n45K8J36L7N34J694K727K992K599J929J114
$$ plain form
54466 135242 135368 134492 132964 131505 130974 131929 134187 136855 138970 140181 140796 141229 141508 141288 140244 138350
54450 138350 135960 133728 132449 132638 134027 135571 136215 135740 134723 133777 133085 132606 132275 131826 130858 129452
54434 129452 128461 128712 129978 131135 131362 130798 130021 129293 128597 128081 128122 128917 130218 131548 132639 133604 134700
54417 134700 135930 136976 137595 138011 138740 139991 141332 142077 141978 141495 141313 141612 141910 141711 141174 140942 141300 141878
54399 141878 142304 142851 144072 145948 147802 149049 149711 150097 150304 150246 149976 149740 149772 150162 150869 151683 152249 152295
54381 152295 151853 151187 150531 150000 149705 149739 149966 150010 149658 149162 148888 148752 148295 147366 146453 146149 146552 147391 148546
54362 148546 150122 152130 154362 156514 158204 159043 159090 159158 160170 162185 164415 166298 168018 169754 170983
54347 170983 171023 169949 168508 167248 166132 164854 163128 160751 157782 154754 152403 151103 150686 150733 150813 150533
$$ packed form
54466A35242J26q76j528j459n31R55K258K668K115J211O15M33K79k20j044j894
54450A38350k390k232j279J89J389J544O44m75j017r46o92m79l31m49r68j406
54434A29452r91K51J266J157K27n64p77p28o96n16M1P95J301J330J091R65J096
54417A34700J230J046O19M16P29J251J341P45r9m83j82K99K98j99n37k32L58N78
54399A41878M26N47J221J876J854J247O62L86K07n8k70k36L2L90P07Q14N66M6
54381A52295m42o66o56n31k95L4K27M4l52m96k74j36m57r29r13l04M03Q39J155
54362A48546J576K008K232K152J690Q39M7O8J012K015K230J883J720J736J229
54347A70983M0j074j441j260j116j278j726k377k969l028k351j300m17M7Q0k80
$$ plain form
54331 150533 149722 148618 147650 146943 146238 145340 144485 144170 144704 145939 147324 148240 148420 148074 147532 146822 145672
54314 145672 143891 141631 139289 137279 135821 134849 134168 133770 133871 134569 135600 136538 137066 136947 136035 134613
54298 134613 133444 133097 133321 133526 133737 134507 135855 136913 136961 136407 136297 137060 138188 139078 139727 140462 141353 142233
54280 142233 143188 144585 146435 148000 148391 147503 145981 144344 142638 141107 140564 141509 143285 144740 145531 146093
54264 146093 146447 145924 144385 142922 142751 143814 145033 145672 145936 146435 147603 149581 152116 154446 155752 155935
54248 155935 155674 155553 155411 154741 153452 151928 150495 149195 148020 147015 146078 144969 143707 142714 142341 142396
54232 142396 142389 142147 141907 141885 142099 142667 143900 145838 147900 149277 149608 149143 148346 147554 146951 146630 146622 146912 147458
54213 147458 148119 148617 148685 148251 147460 146596 145908 145433 144888 143891 142344 140531 138892 137881 137929 139100 140689
$$ packed form
54331A50533q11j104r68p07p05q98q55l15N34J235J385R16J80l46n42p10j150
54314A45672j781k260k342k010j458r72o81l98J01O98J031R38N28j19r12j422
54298A34613j169l47K24K05K11P70J348J058M8n54j10P63J128Q90O49P35Q91Q80
54280A42233R55J397J850J565L91q88j522j637j706j531n43R45J776J455P91N62
54264A46093L54n23j539j463j71J063J219O39K64M99J168J978K535K330J306J83
54248A55935k61j21j42o70j289j524j433j300j175j005r37j109j262r93l73N5
54232A42396pk42k40k2K14N68J233J938K062J377L31m65p97p92o03l21qK90N46
54213A47458O61M98O8m34p91q64o88m75n45r97j547j813j639j011M8J171J589
$$ plain form
54196 140689 141591 141367 140698 140545 141211 142429 143899 145235 145829 145425 144664 144436 144770 144973 144738 144404 144109 143493
54178 143493 142495 141662 141311 141043 140575 140442 141223 142503 143351 143560 143718 144144 144517 144657 144977 145822 146824 147327
54160 147327 147217 146954 146899 146918 146642 145921 144917 143897 143080 142664 142870 143745 144859 145408 144899 143745 142908 142834
54142 142834 142960 142522 141662 141346 142166 143600 144648 144873 144518 143883 143084 142397 142297 142920 143829 144565 145178 145987
54124 145987 147026 147954 148357 148003 147022 146024 145708 146133 146656 146924 147508 149049 151123 152630 153202 153468 153881
54107 153881 154058 153583 152839 152553 152907 153539 154142 154648 154984 154996 154609 153843 152809 151814 151248 151182 151260 151218 151310 151967
54087 151967 153210 154644 155890 156840 157655 158783 160766 163714 167072 170214 173205 176649 180847 185510 190310
54072 190310 195297 200484 205295 208753 210248 209959 208540 206542 204216 201717 199234 196817 194215 191173
$$ packed form
54196A40689R02k24o69j53O66J218J470J336N94m04p61k28L34K03k35l34k95o16
54178A43493r98q33l51k68m68j33P81J280Q48K09J58M26L73J40L20Q45J002N03
54160A47327j10k63n5J9k76p21j004j020q17m16K06Q75J114N49n09j154q37p4
54142A42834J26m38q60l16Q20J434J048K25l55o35p99o87j00O23R09P36O13Q09
54124A45987J039R28M03l54r81r98l16M25N23K68N84J541K074J507N72K66M13
54107A53881J77m75p44k86L54O32O03N06L36J2l87p66j034r95n66o6P8m2R2O57
54087A51967J243J434J246R50Q15J128J983K948L358L142K991L444M198M663M800
54072A90310M987N187M811L458J495k89j419j998k326k499k483k417k602l042
$$ plain form
54058 191173 187940 185235 183570 182751 182160 181428 180649 180055 179727 179681 180060 181058 182643 184461 186139 187745 189893
54041 189893 193207 197624 202376 206754 210801 215124 220097 225458 230731 235920 241567 248134 255488 263071
54027 263071 270384 277067 282644 286681 289375 291570 293895 296108 297622 298428 299030 299651 300008 299853 299218 298075
54011 298075 296258 293873 291287 288515 285137 281095 277068 273597 270243 266156 261262 256292 251786 247625
53997 247625 243579 239757 236307 233087 229937 226969 224270 221510 218260 214760 211992 210704 210494 210187 209141
53982 209141 207865 207236 207385 207617 207209 205946 204041 201907 199980 198389 196805 194949 193221 192391 192641 193377
53966 193377 194058 194728 195532 196253 196668 196925 197176 197246 197034 196923 197348 198205 199097 199945 200953 202188 203598 205275
53948 205275 207260 209307 211281 213598 216772 220654 224679 228865 233976 240625 248653 257543 267022 277097
$$ packed form
54058A91173l233k705j665q19n91p32p79n94l28m6L79R98J585J818J678J606K148
54041A89893L314M417M752M378M047M323M973N361N273N189N647O567P354P583
54027B63071P313O683N577M037K694K195K325K213J514Q06O02O21L57j55o35j143
54011B98075j817k385k586k772l378m042m027l471l354m087m894m970m506m161
53997B47625m046l822l450l220l150k968k699k760l250l500k768j288k10l07j046
53982B09141j276o29J49K32m08j263j905k134j927j591j584j856j728q30K50P36
53966A93377O81O70Q04P21M15K57K51P0k12j11M25Q57Q92Q48J008J235J410J677
53948B05275J985K047J974K317L174L882M025M186N111O649Q028Q890R479J0075
$$ plain form
53934 277097 287835 299304 311467 323952 336042 346888 355556 361062 362813 361199 357432 352735 347840
53921 347840 343230 339380 336634 335217 335518 338019 342675 348584 354532 359844 364707 369849 375873 382553
53907 382553 388732 393342 396650 400049 404322 408541 411065 411260 409685 406961 403288 399098 395280 392236
53893 392236 389195 385019 379457 373116 366437 359346 351893 344479 337183 329475 321135 313020 306248 300866
53879 300866 296001 291277 287242 284182 281296 277615 273236 269042 265458 262058 258303 254164 249977 246072
53865 246072 242576 239360 236170 233017 230311 228344 226724 224652 221774 218536 215749 214004 213333 213127 212501
53850 212501 211070 209365 208144 207415 206510 205048 203382 202053 201245 200839 200633 200343 199724 198852 198070 197530 197024
53833 197024 196332 195560 195059 195173 195995 197133 197869 197903 197829 198435 199592 200375 200275 199720 199335 199342 199927 201478 203981
$$ packed form
53934B77097J0738J1469J2163J2485J2090J0846Q668N506J751j614l767m697m895
53921C47840m610l850k746j417L01K501M656N909N948N312M863N142O024O680
53907C82553O179M610L308L399M273M219K524J95j575k724l673m190l818l044
53893C92236l041m176n562o341o679p091p453p414p296p708q340q115o772n382
53879C00866m865m724m035l060k886l681m379m194l584l400l755m139m187l905
53865B46072l496l216l190l153k706j967j620k072k878l238k787j745o71k06o26
53850B12501j431j705j221p29r05j462j666j329q08m06k06k90o19q72p82n40n06
53833A97024o92p72n01J14Q22J138P36L4p4O06J157P83j00n55l85PN85J551K503
$$ plain form
53814 203981 206697 209022 211248 214007 217278 220514 223463 226268 228936 231297 233467 235838 238631 241894
53800 241894 245927 251142 257387 263834 269747 275033 279924 284521 288835 292922 296619 299394 300850 301346
53786 301346 301757 302581 303555 304268 304792 305387 305798 305332 303730 301444 298762 295153 290065 284110 278705 274445
53770 274445 270561 266192 261516 257188 253322 249654 246244 243186 239874 235482 230252 225594 222588 220952
53756 220952 219732 218512 217512 216893 216468 215986 215328 214425 213191 211608 209791 208048 206878 206701 207456 208611
53740 208611 209655 210456 211051 211334 211161 210605 209873 209105 208464 208251 208637 209362 210025 210668 211744 213439 215341
53723 215341 216944 218200 219396 220667 221910 223007 223925 224722 225708 227441 230172 233274 235619 236715 237228
53708 237228 238241 240302 243310 246949 250769 254064 256276 257636 258971 260719 262499 263873 265151 267055
$$ packed form
53814B03981K716K325K226K759L271L236K949K805K668K361K170K371K793L263
53800B41894M033N215O245O447N913N286M891M597M314M087L697K775J456M96
53786C01346M11Q24R74P13N24N95M11m66j602k286k682l609n088n955n405m260
53770B74445l884m369m676m328l866l668l410l058l312m392n230m658l006j636
53756B20952j220j220j000o19m25m82o58r03j234j583j817j743j170j77P55J155
53740B08611J044Q01N95K83j73n56p32p68o41k13L86P25O63O43J076J695J902
53723B15341J603J256J196J271J243J097R18P97R86J733K731L102K345J096N13
53708B37228J013K061L008L639L820L295K212J360J335J748J780J374J278J904
$$ plain form
53694 267055 269815 273046 276458 280199 284361 288470 291746 293748 294625 294870 294921 294903 294576 293651 292277 291162
53678 291162 290992 291721 292543 292556 291404 289426 287404 286187 286225 287278 288614 289567 289835 289321 288009 286185 284470
53661 284470 283332 282651 282026 281365 280829 280302 279427 278295 277655 278102 279340 280516 281109 281173 280873 280244 279512 279286
53643 279286 280153 282101 284493 286636 288284 289628 290917 292234 293567 294856 295874 296332 296364 296716 298099
53628 298099 300472 303291 306346 309787 313422 316686 319579 322943 327368 332328 336957 341162 345401 349752
53614 349752 354023 358505 363712 369373 374511 378665 382335 386000 389451 392416 395247 398460 401997 405385
53600 405385 408306 410643 412267 413121 413349 413023 412025 410484 409030 408237 407950 407512 406506 404910 402759 400147
53584 400147 397529 395514 394173 392863 390998 388787 386947 385725 384485 382478 379844 377488 375887 374476
$$ packed form
53694B67055K760L231L412L741M162M109L276K002Q77K45N1j8l27r25j374j115
53678B91162j70P29Q22J3j152j978k022j217L8J053J336R53K68n14j312j824j715
53661B84470j138o81o25o61n36n27q75j132o40M47J238J176N93O4l00o29p32k26
53643B79286Q67J948K392K143J648J344J289J317J333J289J018M58L2L52J383
53628B98099K373K819L055L441L635L264K893L364M425M960M629M205M239M351
53614C49752M271M482N207N661N138M154L670L665L451K965K831L213L537L388
53600D05385K921K337J624Q54K28l26r98j541j454p93k87m38j006j596k151k612
53584D00147k618k015j341j310j865k211j840j222j240k007k634k356j601j411
$$ plain form
53570 374476 372524 370246 368449 367268 365995 364262 362666 361892 361826 361954 362115 362359 362507 362433 362534 363286 364547
53553 364547 365837 367138 368819 370867 372828 374575 376583 379294 382619 386160 389539 392430 394750 396969
53539 396969 399900 404009 409219 415375 422423 429989 437379 444429 451977 461031 471591 482680 493468
53526 493468 504084 515418 528388 543272 559401 575552 590945 605909 621391 637880 655118
53515 655118 672887 691677 712357 735415 760752 788033 816866 846661 876653 906293 935509
53504 935509 964476 993302 1022036 1050760 1079351 1107193 1133484 1157990 1181263 1203943 1226034
53493 1226034 1247140 1267305 1287301 1307963 1329409 1351023 1372136 1392619 1412839 1433144 1453503
53482 1453503 1473634 1493332 1512533 1531119 1548901 1565783 1581628 1595797 1607177 1615103 1620113 1623315
$$ packed form
53570C74476j952k278j797j181j273j733j596p74o6J28J61K44J48p4J01P52J261
53553C64547J290J301J681K048J961J747K008K711L325L541L379K891K320K219
53539C96969K931M109N210O156P048P566P390P050P548R054J0560J1089J0788
53526D93468J0616J1334J2970J4884J6129J6151J5393J4964J5482J6489J7238
53515F55118J7769J8790K0680K3058K5337K7281K8833K9795K9992K9640K9216
53504I35509K8967K8826K8734K8724K8591K7842K6291K4506K3273K2680K2091
53493A226034K1106K0165J9996K0662K1446K1614K1113K0483K0220K0305K0359
53482A453503K0131J9698J9201J8586J7782J6882J5845J4169J1380P926N010L202
$$ plain form
53470 1623315 1624913 1623782 1618684 1609633 1597783 1584232 1569364 1553202 1535909 1517729 1498760 1479106
53458 1479106 1459091 1438970 1418419 1396638 1373168 1348498 1323685 1299365 1275277 1250770 1225717
53447 1225717 1200867 1177315 1155682 1135849 1117451 1100490 1085378 1072529 1062126 1054182 1048478 1044364
53435 1044364 1041003 1038111 1036213 1035914 1037094 1039168 1041981 1046012 1051724 1059121 1067997 1078228 1089684 1102181
53421 1102181 1115797 1131040 1148482 1168269 1190014 1213025 1236650 1260692 1285660 1312474 1341834
53410 1341834 1373906 1408545 1445523 1484509 1525177 1567506 1611804 1658340 1707136 1758130 1811284
53399 1811284 1866497 1923672 1982893 2044110 2106571 2169073 2231093 2293260 2356366 2420315 2484450
53388 2484450 2548451 2612277 2675310 2736259 2794068 2848539 2899927 2948241 2993164 3034446 3072067
$$ packed form
53470A623315J598j131n098r051j1850j3551j4868j6162j7293j8180j8969j9654
53458A479106k0015k0121k0551k1781k3470k4670k4813k4320k4088k4507k5053
53447A225717k4850k3552k1633j9833j8398j6961j5112j2849j0403p944n704m114
53435A044364l361k892j898k99J180K074K813M031N712P397Q876J0231J1456J2497
53421A102181J3616J5243J7442J9787K1745K3011K3625K4042K4968K6814K9360
53410A341834L2072L4639L6978L8986M0668M2329M4298M6536M8796N0994N3154
53399A811284N5213N7175N9221O1217O2461O2502O2020O2167O3106O3949O4135
53388B484450O4001O3826O3033O0949N7809N4471N1388M8314M4923M1282L7621
$$ plain form
53377 3072067 3105901 3135262 3158977 3176139 3186781 3191603 3191050 3184942 3172922 3154666 3129477 3096262
53365 3096262 3054572 3005456 2950884 2892495 2831224 2767874 2703436 2638827 2574668 2511321 2448880
53354 2448880 2387285 2326799 2268272 2212560 2159714 2109033 2059785 2011524 1963913 1916788 1870430
53343 1870430 1825372 1781880 1739943 1699752 1661798 1626371 1593288 1562160 1532722 1504974 1479323
53332 1479323 1456505 1436997 1420440 1405895 1392588 1380053 1367678 1354608 1340253 1324653 1308376
53321 1308376 1292327 1277476 1264269 1252301 1241009 1230603 1221832 1214958 1209606 1205689 1203698 1203787 1205290
53308 1205290 1207526 1210582 1214888 1220587 1227823 1237218 1249376 1264142 1280917 1299549 1320325 1343119
53296 1343119 1367162 1391834 1417338 1444316 1473030 1503150 1534205 1565989 1598366 1630771 1662134
$$ packed form
53377C072067L3834K9361K3715J7162J0642M822n53o108j2020j8256k5189l3215
53365C096262m1690m9116n4572n8389o1271o3350o4438o4609o4159o3347o2441
53354B448880o1595o0486n8527n5712n2846n0681m9248m8261m7611m7125m6358
53343A870430m5058m3492m1937m0191l7954l5427l3083l1128k9438k7748k5651
53332A479323k2818j9508j6557j4545j3307j2535j2375j3070j4355j5600j6277
53321A308376j6049j4851j3207j1968j1292j0406q771o874n352l917j991Q9J503
53308A205290K236L056M306N699P236R395J2158J4766J6775J8632K0776K2794
53296A343119K4043K4672K5504K6978K8714L0120L1055L1784L2377L2405L1363
$$ plain form
53285 1662134 1691426 1718167 1742221 1763262 1780870 1795195 1807044 1816891 1823954 1826604 1823819 1816100
53273 1816100 1804915 1791399 1775718 1757635 1737304 1715154 1691109 1664562 1635422 1604783 1574052
53262 1574052 1543580 1512589 1480265 1446521 1411823 1376890 1342528 1309176 1276487 1243820 1211250
53251 1211250 1179564 1149173 1119563 1090081 1060713 1031825 1003602 976108 949519 923873 898878
53240 898878 874310 850386 827488 805749 785178 765936 748195 731974 717311 704361 693028
53229 693028 682812 673340 664769 657281 650332 642833 634021 623839 612505 600003 586143 570988 555135
53216 555135 539505 524675 510555 496887 483943 472314 461985 452210 442513 433317 425224 418077
53204 418077 411150 403966 396512 388849 380990 373019 364970 356657 347922 338974 330220 321881 314062 307073
$$ packed form
53285A662134K9292K6741K4054K1041J7608J4325J1849R847P063K650k785p719
53273A816100j1185j3516j5681j8083k0331k2150k4045k6547k9140l0639l0731
53262A574052l0472l0991l2324l3744l4698l4933l4362l3352l2689l2667l2570
53251A211250l1686l0391k9610k9482k9368k8888k8223k7494k6589k5646k4995
53240H98878k4568k3924k2898k1739k0571j9242j7741j6221j4663j2950j1333
53229F93028j0216r472q571p488o949p499q812j0182j1334j2502j3860j5155j5853
53216E55135j5630j4830j4120j3668j2944j1629j0329r775r697r196q093p147
53204D18077o927p184p454p663p859p971q049q313q735q948q754q339p819o989
$$ plain form
53190 307073 301284 296647 292580 288420 283888 279149 274540 270325 266714 264057 262682 262341 262082 261109 259575
53175 259575 258034 256339 253871 250834 248401 247312 247081 246944 246765 246528 245768 244285 242840 242354 242775 243332
53159 243332 243473 242970 241641 239786 238448 238370 238948 239037 238474 237957 237691 237156 236124 234949 233810 232582 231481
53142 231481 230971 230874 230454 229607 229142 229629 230756 232131 233916 236214 238498 240195 241399 242527 243577 244122
53126 244122 243803 242661 241250 240452 240719 241334 241014 239482 237959 237832 239293 241500 243480 244504 244148 242673
53110 242673 241100 240413 240756 241612 242516 243283 243813 244058 244029 243595 242456 240570 238390 236450 234873 233472 232133
53093 232133 230896 229823 228968 228318 227674 226788 225795 225253 225624 226819 228274 229238 229068 227745 226223 225771 226753
53076 226753 228329 229488 229950 229895 229412 228608 227835 227366 227128 227034 227202 227516 227405 226528 225292 224189 222985 221156
$$ packed form
53190C07073n789m637m067m160m532m739m609m215l611k657j375l41k59r73j534
53175B59575j541j695k468l037k433j089k31j37j79k37p60j483j445m86M21N57
53159B43332J41n03j329j855j338p8N78Q9n63n17k66n35j032j175j139j228j101
53142B31481n10r7m20q47m65M87J127J375J785K298K284J697J204J128J050N45
53126B44122l19j142j411p98K67O15l20j532j523j27J461K207J980J024l56j475
53110B42673j573o87L43Q56R04P67N30K45k9m34j139j886k180j940j577j401j339
53093B32133j237j073q55o50o44q86r93n42L71J195J455R64j70j323j522m52R82
53076B26753J576J159M62n5m83q04p73m69k38r4J68L14j11q77j236j103j204j829
$$ plain form
53058 221156 218897 216995 215817 215022 214365 214226 215151 217247 220107 223026 225228 226180 225899 224904 223904 223583
53042 223583 224360 225979 227442 227822 227205 226494 226242 226086 225462 224419 223366 222242 220469 217890 215365 214060
53026 214060 214211 214977 215596 216300 217725 219771 221612 222816 223817 225106 226472 227326 227461 227166 226899 227085
53010 227085 227904 229029 229822 230072 230230 230704 231293 231624 231717 231729 231523 230997 230588 230856 231742 232727 233557 234310 234891
52991 234891 235099 235153 235518 236095 236111 235107 233640 232788 233149 234486 236175 237863 239656 241639 243278 243707 242851
52974 242851 241875 242066 243544 245484 247287 248905 250283 251365 252622 254738 257517 259874 261200 262056 263110
52959 263110 263999 263886 262737 261409 260595 260217 259826 259199 258453 257716 256800 255204 252626 249505 246829 245259
52943 245259 244576 244021 243002 241473 239926 239117 239479 240643 241733 242163 241908 241114 239967 238987 238720 238854 238248
$$ packed form
53058B21156k259j902j178p95o57j39R25K096K860K919K202R52k81r95j000l21
53042B23583P77J619J463L80o17p11k52j56o24j043j053j124j773k579k525j305
53026B14060J51P66O19P04J425K046J841J204J001J289J366Q54J35k95k67J86
53010B27085Q19J125P93K50J58M74N89L31R3J2k06n26m09K68Q86R85Q30P53N81
52991B34891K08N4L65N77J6j004j467q52L61J337J689J688J793J983J639M29q56
52974B42851r76J91J478J940J803J618J378J082J257K116K779K357J326Q56J054
52959B63110Q89j13j149j328q14l78l91o27p46p37r16j596k578l121k676j570
52943B45259o83n55j019j529j547q09L62J164J090M30k55p94j147r80k67J34o06
$$ plain form
52926 238248 236312 233865 232151 231497 231442 231716 232334 233091 233740 234464 235417 236029 235661 234859 234898 235931 236578 235775
52908 235775 234099 232674 231645 230549 229534 229174 229345 229271 228719 228321 228605 229363 230202 231097 232095 232931 233303
52891 233303 233281 233167 233202 233513 234064 234461 234224 233430 232789 232767 232960 232663 231751 230600 229473 228550 228322 229266 231050
52872 231050 232706 233817 235056 237285 240490 243806 246290 247466 247456 246904 246575 246734 247079 247345 247667 248178
52856 248178 248700 249152 249880 251076 252234 252694 252494 252049 251116 248866 245040 240442 236041 232197 228927 226328
52840 226328 224272 222163 219576 216911 214947 213872 213180 212448 211804 211607 211965 212646 213283 213618 213737 214009 214709
52823 214709 215725 216696 217322 217404 216799 215555 213919 212066 210039 208198 207378 208063 209549 210567 210804 211210
52807 211210 212626 214700 216504 217679 218465 218977 219104 218961 218842 218633 217826 216267 214494 213120 212151 211122
$$ packed form
52926B38248j936k447j714o54n5K74O18P57O49P24R53O12l68q02L9J033O47q03
52908B35775j676j425j029j096j015l60J71p4n52l98K84P58Q39Q95R98Q36L72
52891B33303k2j14L5L11N51L97k37p94o41k2J93k97r12j151j127r23k28R44J784
52872B31050J656J111J239K229L205L316K484J176j0n52l29J59L45K66L22N11
52856B48178N22M52P28J196J158M60k00m45r33k250l826m598m401l844l270k599
52840B26328k056k109k587k665j964j075o92p32o44j97L58O81O37L35J19K72P00
52823B14709J016R71O26Q2o05j244j636j853k027j841q20O85J486J018K37M06
52807B11210J416K074J804J175P86N12J27j43j19k09q07j559j773j374r69j029
$$ plain form
52791 211122 209651 207687 205465 203519 202540 202885 204144 205401 205959 205827 205520 205497 205754 205922 205841 205966 206956
52774 206956 208786 210558 211427 211469 211328 211259 211001 210467 209939 209482 208748 207602 206470 205656 204788 203485 202267
52757 202267 202110 203185 204672 205920 207091 208380 209263 209177 208594 208651 209676 210693 210686 209894 209462 210029 211182
52740 211182 212307 213545 215560 218597 222123 225422 228284 230946 233579 236063 238214 239955 241168 241585
52726 241585 241072 239997 239120 238999 239524 240127 240398 240380 240279 240077 239556 238626 237426 236111 234732 233415 232471
52709 232471 232134 232188 232018 231091 229399 227507 226206 226053 227055 228746 230575 232146 233118 233117 232094 230712 230028
52692 230028 230509 231542 232113 231873 231319 231016 230967 230861 230646 230578 230805 231167 231436 231575 231666 231746 231822 231925 231973 231687
52672 231687 230830 229581 228485 227969 227964 228046 227891 227577 227492 227972 228945 229904 230349 230322 230445 231323 232959 234793 236283
$$ packed form
52791B11122j471j964k222j946r79L45J259J257N58j32l07k3K57J68q1J25R90
52774B06956J830J772Q69M2j41o9k58n34n28m57p34j146j132q14q68j303j218
52757B02267j57J075J487J248J171J289Q83q6n83N7J025J017pp92m32N67J153
52740B11182J125J238K015L037L526L299K862K662K633K484K151J741J213M17
52726B41585n13j075q77j21N25O03K71j8j01k02n21r30j200j315j379j317r44
52709B32471l37N4j70r27j692j892j301j53J002J691J829J571R72jj023j382o84
52692B30028M81J033N71k40n54l03m9j06k15o8K27L62K69J39R1Q0P6J03M8k86
52672B31687q57j249j096n16nQ2j55l14q5M80R73R59M45k7J23Q78J636J834J490
$$ plain form
52653 236283 237400 238634 240581 243452 246846 250010 252362 253760 254275 253883 252584 250741 249039 247942 247297
52638 247297 246600 245583 244370 243100 241635 239793 237733 235856 234368 233207 232414 232292 233029 234394 236046
52623 236046 237868 239702 240967 241099 240350 239637 239391 239060 237993 236447 235252 234792 234802 235051 235664 236699 237845
52606 237845 238736 239313 239700 239943 240073 240273 240791 241718 242976 244350 245430 245695 244974 243831 243159 243238 243455 243192
52588 243192 242743 242916 243807 244515 244357 243883 244232 245751 247753 249459 250624 251280 251458 251376 251381 251464 251217 250466 249620
52569 249620 249218 249529 250665 252492 254173 254445 252917 250617 248735 247272 245591 243812 242781 242850 243568 244502
52553 244502 245480 245960 245121 242949 240532 238864 237916 237240 236860 237071 237765 238552 239320 240235 241295 242228 242773
52536 242773 242838 242531 242159 242015 242041 241951 241813 242111 243018 243963 244334 244301 244572 245464 246613 247462 247688 247232 246262 245159
$$ packed form
52653B36283J117J234J947K871L394L164K352J398N15l92j299j843j702j097o45
52638B47297o97j017j213j270j465j842k060j877j488j161p93j22P37J365J652
52623B36046J822J834J265J32p49p13k46l31j067j546j195m60J0K49O13J035J146
52606B37845Q91N77L87K43J30K00N18R27J258J374J080K65p21j143o72P9K17k63
52588B43192m49J73Q91P08j58m74L49J519K002J706J165O56J78q2NQ3k47p51q46
52569B49620m02L11J136J827J681K72j528k300j882j463j681j779j031O9P18R34
52553B44502R78M80q39k172k417j668r48o76l80K11O94P87P68R15J060R33N45
52536B42773O5l07l72j44K6r0j38K98R07R45L71l3K71Q92J149Q49K26m56r70j103
$$ plain form
52516 245159 244289 243768 243557 243721 244425 245737 247568 249773 252190 254715 257433 260530 263932 267137 269552
52501 269552 270924 271382 271229 270768 270079 268877 266805 264023 261207 258848 256825 254876 253078 251557 250070
52486 250070 248323 246481 244957 243849 243007 242505 242651 243564 245114 247149 249445 251536 253007 253886 254413 254553
52470 254553 254188 253730 254016 255495 257864 260513 262948 264802 265998 267021 268602 270912 273430 275712 277812
52455 277812 279733 280990 281075 279997 277964 274912 270892 266683 263354 261116 259126 256570 253590 250917 248989
52440 248989 247795 247323 247611 248283 248567 248086 247313 246879 246686 246205 245474 245153 245496 245982 246243 246696 247704 248660
52422 248660 248671 247836 247062 246777 246658 246592 247077 248437 250323 252309 254404 256684 259011 261425 264267 267557
52406 267557 270855 274241 278846 285681 294252 303033 311055 318217 324126 327568 327532 324243 318860 312509 305975
$$ packed form
52516B45159q70n21k11J64P04J312J831K205K417K525K718L097L402L205K415
52501B69552J372M58j53m61o89j202k072k782k816k359k023j949j798j521j487
52486B50070j747j842j524j108q42n02J46R13J550K035K296K091J471Q79N27J40
52470B54553l65m58K86J479K369K649K435J854J196J023J581K310K518K282K100
52455B77812J921J257Q5j078k033l052m020m209l329k238j990k556k980k673j928
52440B48989j194m72K88O72K84m81p73m34j93m81p31l21L43M86K61M53J008R56
52422B48660J1q35p74k85j19o6M85J360J886J986K095K280K327K414K842L290
52406B67557L298L386M605O835Q571Q781Q022P162N909L442l6l289n383o351o534
$$ plain form
52391 305975 299945 294965 291090 287929 285208 283131 282061 281940 282257 282641 283253 284418 286032 287641 289029
52376 289029 290325 291521 292353 292897 293926 296276 300033 304630 309559 314689 320039 325551 331024 335964 339625
52361 339625 341548 342056 341930 341653 341210 340542 339861 339488 339675 340537 341878 343111 343744 344006 344663 346145 348169
52344 348169 350289 352437 354802 357514 360690 364454 368708 373119 377659 382896 389463 397403 406346 416167
52330 416167 427072 439098 451946 465396 479613 494904 511361 528882 547428 567156 588319
52319 588319 611013 634919 659290 683436 707227 730972 754703 777779 799372 819255 837929
52308 837929 856067 874000 891646 908655 924558 939015 952141 964507 976671 988659 999991
52297 999991 1010078 1018530 1025190 1030070 1033224 1034616 1034093 1031633 1027463 1021758 1014310 1004860 993769 982042
$$ packed form
52391C05975o030m980l875l161k721k077j070j21L17L84O12J165J614J609J388
52376B89029J296J196Q32N44J029K350L757M597M929N130N350N512N473M940L661
52361C39625J923N08j26k77m43o68o81l73J87Q62J341J233O33K62O57J482K024
52344C48169K120K148K365K712L176L764M254M411M540N237O567P940Q943R821
52330D16167J0905J2026J2848J3450J4217J5291J6457J7521J8546J9728K1163
52319E88319K2694K3906K4371K4146K3791K3745K3731K3076K1593J9883J8674
52308H37929J8138J7933J7646J7009J5903J4457J3126J2366J2164J1988J1332
52297I99991J0087Q452O660M880L154J392n23k460m170n705p448r450j1091j1727
$$ plain form
52283 982042 970526 959453 948942 939558 932011 926565 923182 922082 923627 927675 933544 940790 949596
52270 949596 960198 972291 985312 999077 1013820 1029709 1046541 1063793 1080780 1096862 1111790
52259 1111790 1125880 1139670 1153332 1166539 1178898 1190447 1201633 1212774 1223516 1232878 1239987 1244778
52247 1244778 1247895 1249896 1250751 1250024 1247221 1241841 1233490 1222333 1209274 1195375 1181106 1166365 1151081
52234 1151081 1135538 1120190 1105478 1091764 1079162 1067405 1056176 1045589 1036115 1028114 1021637 1016576
52222 1016576 1012591 1008950 1005023 1001140 998439 997561 997885 998431 999140 1000814 1003990 1008384 1013358 1018459 1023481
52207 1023481 1028437 1033602 1039315 1045624 1052251 1058830 1064982 1070227 1074245 1077207 1079618 1081795 1083820 1085940
52193 1085940 1088548 1091709 1095113 1098594 1102227 1105787 1108670 1110703 1112534 1114788 1117244 1119267 1120625 1121256
$$ packed form
52283I82042j1516j1073j0511r384p547n446l383j100J545M048N869P246Q806
52270I49596J0602J2093J3021J3765J4743J5889J6832J7252J6987J6082J4928
52259A111790J4090J3790J3662J3207J2359J1549J1186J1141J0742R362P109M791
52247A244778L117K001Q55p27k803n380q351j1157j3059j3899j4269j4741j5284
52234A151081j5543j5348j4712j3714j2602j1757j1229j0587r474q001o477n061
52222A016576l985l641l927l883k701q78L24N46P09J674L176M394M974N101N022
52207A023481M956N165N713O309O627O579O152N245M018K962K411K177K025K120
52193A085940K608L161L404L481L633L560K883K033J831K254K456K023J358O31
$$ plain form
52179 1121256 1120560 1117724 1112737 1106431 1099488 1092008 1084084 1076103 1068289 1060495 1052716 1045284 1038361 1031855
52165 1031855 1026116 1022055 1020053 1019296 1018777 1018575 1019476 1021688 1024671 1028015 1031676 1035373 1038548 1041086 1043360
52150 1043360 1045368 1046468 1046312 1045495 1044847 1044556 1044430 1044682 1045840 1047977 1050481 1052640 1054173 1055257 1056311
52135 1056311 1057763 1059882 1062783 1066627 1071669 1078047 1085769 1095076 1106569 1120679 1137187 1155642 1176193
52122 1176193 1199625 1226499 1256454 1288397 1321194 1354246 1387604 1421550 1455906 1489779 1522146
52111 1522146 1552491 1580527 1605425 1625991 1641877 1654184 1664405 1672887 1678702 1680969 1679937 1676735
52099 1676735 1672362 1667132 1661012 1654220 1647325 1640734 1634199 1626998 1618553 1608699 1597351 1584247 1569288
52086 1569288 1552934 1535968 1518883 1501777 1484831 1468579 1453661 1440603 1430010 1422626 1418830 1418221
$$ packed form
52179A121256o96k836m987o306o943p480p924p981p814p794p779p432o923o506
52165A031855n739m061k002p57n19k02R01K212K983L344L661L697L175K538K274
52150A043360K008J100j56q17o48k91j26K52J158K137K504K159J533J084J054
52135A056311J452K119K901L844N042O378P722R307J1493J4110J6508J8455K0551
52122A176193K3432K6874K9955L1943L2797L3052L3358L3946L4356L3873L2367
52111A522146L0345K8036K4898K0566J5886J2307J0221Q482N815K267j032l202
52099A676735m373n230o120o792o895o591o535p201q445r854j1348j3104j4959
52086A569288j6354j6966j7085j7106j6946j6252j4918j3058j0593p384l796o09
$$ plain form
52074 1418221 1420053 1424036 1430396 1439154 1449811 1461895 1475412 1490455 1506663 1523472 1540749 1558655
52062 1558655 1576896 1594564 1610893 1625865 1639881 1652990 1664590 1673732 1679694 1682546 1683296 1683179 1682553
52049 1682553 1680651 1676601 1670384 1662558 1653296 1642105 1628369 1611780 1592321 1570256 1546211 1520987
$$ packed form
52074A418221J832L983O360Q758J0657J2084J3517J5043J6208J6809J7277J7906
52062A558655J8241J7668J6329J4972J4016J3109J1600R142N962K852P50j17o26
52049A682553j902m050o217p826r262j1191j3736j6589j9459k2065k4045k5224
$$ [...]
##END NTUPLES=NMR SPECTRUM
##END=
