
##TITLE=AC1414_VIERS12223_7653325_TJb4ygoicq
##JCAMPDX= 6.0         $$ Bruker NMR JCAMP-DX V2.0
##DATA TYPE= nD NMR SPECTRUM
##DATA CLASS= NTUPLES
##NUM DIM= 2
##ORIGIN= BRUKER
##OWNER= Administrator
$$ 1.72 TOPSPIN		Version 2.1
$$ 2013-03-20 00:55:55.920 -0500  Administrator@X
$$ Compression mode = diff/dup
##.OBSERVE FREQUENCY= 400.02188249412
##.OBSERVE NUCLEUS= ^1H
##.ACQUISITION MODE= SIMULTANEOUS (DQD)
##.ACQUISITION SCHEME= NOT PHASE SENSITIVE
##.AVERAGES= 4
##.DIGITISER RES= 22
##SPECTROMETER/DATA SYSTEM= spect
##.PULSE SEQUENCE= jresgppsqf.2
##.SOLVENT NAME= COFFEE_meoh
##.SHIFT REFERENCE= INTERNAL, COFFEE_meoh, 1, 14.96082
##AUDIT TRAIL= $$ (NUMBER, WHEN, WHO, WHERE, PROCESS, VERSION, WHAT)
$$ ##TITLE= Audit trail, TOPSPIN		Version 2.1
$$ ##JCAMPDX= 5.01
$$ ##ORIGIN= Bruker BioSpin GmbH
$$ ##OWNER= Administrator
$$ $$ E:\/data/COFFEE/nmr/AC1414_VIERS12223_7653325_TJb4ygoicq/13/pdata/1/auditp.txt
$$ ##AUDIT TRAIL=  $$ (NUMBER, WHEN, WHO, WHERE, PROCESS, VERSION, WHAT)
(   1,<2013-03-20 00:55:45.920 -0500>,<Administrator>,<X>,<go>,<TOPSPIN 2.1>,
      <created by zg
	started at 2013-03-20 00:41:22.841 -0500,
	POWCHK enabled, PULCHK disabled,
       configuration hash MD5:
       86 BA 57 50 F2 9D 5C 9B 26 00 A9 28 5F 66 2E 89
       data hash MD5: 8K * 40
       F9 C1 F1 74 B5 3E 14 E2 B2 EC 78 2A 09 68 F1 B2>)
(   2,<2013-03-20 00:55:51.091 -0500>,<Administrator>,<X>,<proc2d>,<TOPSPIN 2.1>,
      <Start of raw data processing
       xfb same F2: SI = 16K WDW = 3 SSB = 0 FT_mod = 6 PKNL = 1 F1: SI = 512 WDW = 3 SSB = 0 FT_mod = 6 PH_mod = 2
       data hash MD5: 16K * 512
       85 75 25 1B 53 07 F9 10 3D 18 F7 1B D2 F7 22 36>)
(   3,<2013-03-20 00:55:52.076 -0500>,<Administrator>,<X>,<proc2d>,<TOPSPIN 2.1>,
      <abs2 F2: ABSG = 5 ABSF1 = 10.00071 ABSF2 = 0.0001753375
       data hash MD5: 16K * 512
       B9 F9 12 70 A0 0A 01 11 01 5F 4C 7D 19 89 43 70>)
(   4,<2013-03-20 00:55:52.779 -0500>,<Administrator>,<X>,<proc2d>,<TOPSPIN 2.1>,
      <tilt
       data hash MD5: 16K * 512
       8E 41 95 72 5A 81 1C B1 DA 4C 04 2B 52 1D 02 5D>)
(   5,<2013-03-20 00:55:54.201 -0500>,<Administrator>,<X>,<proc2d>,<TOPSPIN 2.1>,
      <abs1 F1: ABSG = 5 ABSF1 = 0.06497851 ABSF2 = -0.06497862
       data hash MD5: 16K * 512
       C1 32 1E 1E 08 19 E1 3F F3 AE E5 A0 6C CE 7B A5>)
(   6,<2013-03-20 00:55:55.498 -0500>,<Administrator>,<X>,<proc2d>,<TOPSPIN 2.1>,
      <symj
       data hash MD5: 16K * 512
       AE 17 A0 6B D1 65 68 44 DC E0 2F 8C 93 F1 B3 F1>)
$$ ##END=
$$ 
$$ $$ hash MD5
$$ $$ EC 7E 62 86 54 54 D2 73 E6 89 5E E2 98 F7 80 29
##$RELAX= 
##$RELAX= 
##$RELAX= 
##$RELAX= 
##$RELAX= 
##$RELAX= 
##$RELAX= 
$$ Bruker specific parameters
$$ --------------------------
##$DU= <E:\>
##$EXPNO= 13
##$NAME= <AC1414_VIERS12223_7653325_TJb4ygoicq>
##$PROCNO= 1
##$TYPE= <nmr>
##$USER= <COFFEE>
##$ACQT0= 1000000
##$AMP= (0..31)
100 100 100 100 100 100 100 100 100 100 100 100 100 100 100 100 100 100
$$ [...]
##$TD0= 1
##$TE= 300
##$TE2= 300
##$TE3= 300
##$TEG= 300
##$TL= (0..7)
0 120 120 120 120 120 120 120
##$TP= (0..7)
150 150 150 150 150 150 150 150
##$TP07= 0
##$TPNAME0= <>
##$TPNAME1= <>
##$TPNAME2= <>
##$TPNAME3= <>
##$TPNAME4= <>
##$TPNAME5= <>
##$TPNAME6= <>
##$TPNAME7= <>
##$TPOAL= (0..7)
0.5 0.5 0.5 0.5 0.5 0.5 0.5 0.5
##$TPOFFS= (0..7)
0 0 0 0 0 0 0 0
##$TUNHIN= 0
##$TUNHOUT= 0
##$TUNXOUT= 0
##$USERA1= <user>
##$USERA2= <user>
##$USERA3= <user>
##$USERA4= <user>
##$USERA5= <user>
##$V9= 5
##$VALIST= <valist>
##$VCLIST= <CCCCCCCCCCCCCCC>
##$VD= 0
##$VDLIST= <DDDDDDDDDDDDDDD>
##$VPLIST= <PPPPPPPPPPPPPPP>
##$VTLIST= <TTTTTTTTTTTTTTT>
##$WBST= 2048
##$WBSW= 25
##$XGAIN= (0..3)
0 0 0 0
##$XL= 0
##$YL= 0
##$YMAX_a= 63589
##$YMIN_a= -127428
##$ZGOPTNS= <>
##$ZL1= 120
##$ZL2= 120
##$ZL3= 120
##$ZL4= 120
##$ABSF1= 0.06497851
##$ABSF2= -0.06497862
##$ABSG= 5
##$ABSL= 0
##$ALPHA= 0
##$AQORDER= 0
##$ASSFAC= 0
##$ASSFACI= 0
##$ASSFACX= 0
##$ASSWID= 0
##$AUNMP= <>
##$AXLEFT= 0
##$AXNAME= <F1>
##$AXNUC= <1H>
##$AXRIGHT= 0
##$AXTYPE= 0
##$AXUNIT= <>
##$AZFE= 0.1
##$AZFW= 0.5
##$BCFW= 0
##$BC_mod= 0
##$BYTORDP= 0
##$COROFFS= 0
##$CY= 15
##$DATMOD= 1
##$DC= 0
##$DFILT= <>
##$DTYPP= 0
##$F1P= 0
##$F2P= 0
##$FCOR= 0.5
##$FTSIZE= 512
##$FT_mod= 6
##$GAMMA= 0
##$GB= 0
##$INTBC= 1
##$INTSCL= 1
##$ISEN= 128
##$LB= 0
##$LEV0= 0
##$LPBIN= 0
##$MAXI= 10000
##$MC2= 0
##$MEAN= 0
##$ME_mod= 0
##$MI= 1
##$NCOEF= 0
##$NC_proc= -5
##$NLEV= 6
##$NOISF1= 0
##$NOISF2= 0
##$NSP= 0
##$NTH_PI= 0
##$NZP= 0
##$OFFSET= 0.06497851
##$PC= 4
##$PHC0= 0
##$PHC1= 0
##$PH_mod= 2
##$PKNL= no
##$PPARMOD= 1
##$PPDIAG= 0
##$PPIPTYP= 0
##$PPMPNUM= 2147483647
##$PPRESOL= 1
##$PSCAL= 1
##$PSIGN= 0
##$PYNMP= <proc.py>
##$REVERSE= no
##$SF= 400.021882494141
##$SI= 512
##$SIGF1= 0.06497851
##$SIGF2= -0.06497862
##$SINO= 16
##$SIOLD= 512
##$SPECTYP= <>
##$SREGLST= <1H.MeOD>
##$SSB= 0
##$STSI= 512
##$STSR= 0
##$SW_p= 51.9856959427865
##$SYMM= 3
##$S_DEV= 2694
##$TDeff= 40
##$TDoff= 0
##$TI= <>
##$TILT= yes
##$TM1= 0
##$TM2= 0
##$TOPLEV= 0
##$USERP1= <user>
##$USERP2= <user>
##$USERP3= <user>
##$USERP4= <user>
##$USERP5= <user>
##$WDW= 3
##$XDIM= 16
##$YMAX_p= 316653988
##$YMIN_p= 0
$$ End of Bruker specific parameters
$$ ---------------------------------
##NTUPLES= nD NMR SPECTRUM
##VAR_NAME=  FREQUENCY1,    FREQUENCY2,      SPECTRUM
##SYMBOL=    F1,            F2,              Y
##.NUCLEUS=  1H,            1H
##VAR_TYPE=  INDEPENDENT,   INDEPENDENT,     DEPENDENT
##VAR_FORM=  AFFN,          AFFN,            ASDF
##VAR_DIM=   512,           16384,           16384
##UNITS=     HZ,            HZ,              ARBITRARY UNITS
##FACTOR=    0.101534562388255, 0.501933850740131, 1
##FIRST=     25.9928259484165, 8223.18227667557, 1759
##LAST=      -25.8913354319817, 0,           771
##MIN=       -25.8913354319817, 0,           0
##MAX=       25.9928259484165, 8223.18227667557, 316653988
##PAGE= F1=25.99282594842
##FIRST=     25.9928259484165, 8223.18227667557, 1759
##DATA TABLE= (F2++(Y..Y)), PROFILE
$$ [...]
15537B189J075M20J20j04J74o52j526b68k087K96g96c45A93J15A05d59n33K7B71
15517H94l67f16j268q45J74n2K80J063H23j22a190o86b68B202R54l23n23J26P35
15498C171J222J519L41j960q22r51j32O59M21l33p1K28R0l89j099p87a46q65j497
15479b508j258k103j265K070K374J127A390L490K698N5j279k434j901A92R94c62
15462b829l66E103a167K00K47j3n88n77p9M43d23A132K066O60N79j22N52q35j227
15443B805j100o05J89N91Q86O18j91j066I12C16a33o98o08q39m49N1N62K73L80
15424a461j21k33Q39H38J268O23k54k54G80g84I9J407R49M87n0m53H42a385k380
15405c765m54O87a029D07P93D36a107j322j477k103k444J08K506K571Q88R7J00
$$ plain form
15537 2189 3264 3684 3804 3700 3874 3222 1696 -268 -2355 -2059 -796 -345 193 308 105 -459 -992 -965 271
15517 894 527 -616 -1884 -2729 -2555 -2607 -2327 -1264 823 701 -1190 -1876 -268 2202 3156 2833 2310 2436 3171
15498 3171 4393 5912 6253 4293 3471 2520 2388 3047 3468 3135 3064 3292 3382 2993 1894 1107 -146 -1011 -2508
15479 -2508 -3766 -5869 -7134 -5064 -2690 -1563 1390 4880 7578 7633 6354 3920 2019 192 1186 -362
15462 -2829 -3195 5103 -1167 -967 -720 -733 -1321 -1898 -1977 -1534 -423 1132 3198 3858 4437 4315 4867 4032 2805
15443 2805 1705 1100 1289 1880 2766 3384 3193 2127 912 316 -133 -831 -1439 -2278 -2727 -2676 -2114 -1841 -1461
15424 -1461 -1582 -1815 -976 838 2106 2729 2475 2221 780 -784 99 1506 2455 2942 2892 2439 842 -1385 -3765
15405 -3765 -4219 -3532 -1029 407 1200 436 -1107 -2429 -3906 -6009 -8453 -8345 -5839 -3268 -2380 -2283 -2183
15388b183N28i7A045N99L06M87L67k77j257b04j502K6E62L119K690J844j397l003
15370C815B06g12q27n51o50m30o5J19N89a225A679J620P51l5q63j384B65a888
15351c488j310l769c65A050C69b116l709j466J090a246A759J320j23G12a550j433
15335b983o69R12A298J831R0j409c2j583k59P10D17J552Q72n96D41b069k229j88
15317d486K166G30K459J108o96L73l72A663E37h21M8m39K92P2l60k33L34c36a55
15297B63L72J264J332J147J249n93j674q33J00N00O59p6j517B04a636j132q90
15280c658Q34b39B411J762P17j193j335A126A89e01l1k71m19o45q22k58n8J61
15262b844K33N64M33j73n26q42r08O10Q76J146a40A174O19j51l44k04j50j11l40
$$ plain form
15388 -2183 -1655 -97 1045 1644 1950 2437 2804 2527 1270 -204 -1706 -1680 562 3681 6371 8215 6818 3815
15370 3815 206 -712 -1539 -2090 -2740 -3170 -3235 -3116 -2527 -1225 1679 3299 4050 4015 3152 1768 265 -1888
15351 -3488 -4798 -8567 -365 1050 369 -2116 -5825 -7291 -6201 -1246 1759 3079 2956 712 -1550 -2983
15335 -2983 -3652 -2740 1298 3129 3219 1810 -32 -1615 -1874 -1164 417 1969 2841 2245 441 -2069 -4298 -4486
15317 -4486 -2320 730 3189 4297 3601 3974 3602 1663 537 -821 -773 -1212 -920 -848 -1208 -1441 -1107 -336 -155
15297 263 635 1899 3231 4378 5627 5034 3360 2527 2627 3127 3786 3710 2193 204 -1636 -2768 -3658
15280 -3658 -2824 -239 2411 4173 4890 3697 2362 1126 189 -501 -532 -803 -1222 -1867 -2689 -2947 -3005 -2844
15262 -2844 -2611 -2047 -1614 -1787 -2313 -3155 -4063 -3453 -2577 -1431 -140 1174 1793 1642 1298 1094 944 833 493
15243D93a17o49c11A669J570l2q39o42m08j88L05N24m29m70D66f9C10Q11P62K14
15223B097J5l34k9M43N34k7j03A051g92n22L55B48O56K68n6m19A67p7f91j247
15203a938j029m2Q89O36f85B8R19K40J34L1n55a02q76M10m88o69j471r87j23J136
15183c170J008P35k65p95q34n97n00o39l42J967A10J037l29d15j652j154j191
15166d412j074j856K867N14R33j38a530C38J753J467R81O17M72k95K154J530o68
15149H349m92j535a989P85A62L57f4B60F4e47e2C00Q26J080L15p12C29a052o73
15130a725J01N14c12I92R49L75K36L44R4M3J51j39k6p4k85k85p8P46R28N24q12
15109C683j012j285C48b15m61l21o81l41M11N80c98k10o07j045l25j565a203B47
$$ plain form
15243 493 -117 -766 -311 1669 3239 3207 2368 1726 1318 1130 1435 1959 1530 1060 466 -69 310 1121 1883 2097
15223 2097 2112 1778 1749 2192 2726 2699 2596 1051 -792 -1314 -959 248 904 1172 1116 697 167 90 -691 -1938
15203 -1938 -2967 -3009 -2120 -1484 -685 28 947 1187 1321 1352 797 -102 -978 -568 -1056 -1725 -3196 -4183 -4306 -3170
15183 -3170 -2162 -1427 -1692 -2487 -3321 -3918 -4418 -5057 -5399 -3432 110 1147 818 -415 -2067 -3221 -4412
15166 -4412 -5486 -7342 -4475 -3961 -3028 -3166 -1530 338 2091 3558 4539 5156 5628 5333 7487 9017 8349
15149 8349 7857 6322 -1989 -1204 162 519 -64 260 64 -547 -52 300 1126 2206 2521 1809 329 -1052 -1725
15130 -1725 -1624 -1110 -312 992 1941 2316 2552 2896 2990 3033 3184 3045 3019 2945 2660 2375 2297 3043 3971 4495 3683
15109 3683 2671 1386 348 -215 -676 -997 -1678 -2019 -1608 -1028 -398 -608 -1215 -2260 -2585 -4150 -1203 247
15090C62F2b10D45J326K297J605m68j610A560a669j814k077h61p800j159M4K993
15073f783L176a234H47J879M53m25A376c58k040r95m4O91P05N04M42a48q0G24
15054A555N55L21J1j96kM14J42I36g32p80O08B44J027O87J44k02F48f40p04e83
15033G05R63K14P7l58n70A32h94j136q89p32Q02A672K08n07M63P3m02m30B24i95
15012b151r18L05Q77K16K12l79J55M71c76A76b65m44J10k25m07p48j018j786j463
14993f246j95K101i25I15P27J25N31J530n19A339a303k297j086Q34R22M0J79J334
14975a377B155L615J428j242A700c86j212g97I16P62k9l31k37C15a773j864j767
14958e404j60O65J231M8p57j518j210j131l63M211b148C12J829P84K63J61N18
$$ plain form
15090 362 62 -210 445 1771 4068 5673 5205 3595 1560 -1669 -3483 -5560 -861 -8661 -9820 -9776 -6783
15073 -6783 -3607 -1234 847 2726 3179 2754 1376 -358 -2398 -3393 -3437 -2746 -2041 -1537 -1095 -148 -228 724
15054 1555 2110 2431 2442 2246 2244 2658 2800 936 -732 -1512 -904 244 1271 1958 2102 1900 648 -640 -1344 -583
15033 705 1668 1882 1959 1601 1031 132 -894 -2030 -2919 -3651 -2849 1672 1880 1373 1836 1909 1507 1077 224 -995
15012 -2151 -3069 -2764 -1887 -1671 -1459 -1838 -1683 -1212 -376 176 -265 -709 -599 -824 -1231 -1979 -2997 -4783 -6246
14993 -6246 -6441 -4340 -925 915 1642 1767 2298 3828 3309 1339 -1303 -3600 -4686 -3852 -2930 -2890 -2711 -1377
14975 -1377 2155 5770 7198 5956 1700 -386 -1598 -797 916 1678 1649 1318 1081 315 -1773 -3637 -5404
14958 -5404 -5564 -4899 -3668 -3620 -4377 -5895 -7105 -8236 -8599 -4388 -2148 312 2141 2925 3188 3349 3867
14941C867j25m61r50o24n88m71k31E8i69j650i02b34B15c44o03n92j40N09B02
14921B597R90m8j69k74K12L49p11A343i91j95A306J863J436l03j353A150j32K61
14903A279J082o0q23E88A03d88j96j536j236q32r14j360j946c843a755H6J328
14886A414N77J42J9J77K88L24J4m16J21N1l73o42o45B91d37J75B4R94R95n94B88
14864a401j701r71O4J173f10A560J409j241c66k462p24J408b72H10P29N39J116
14847C194N99K50k04o77j124D41h61j377j151o25J26O80J226i42b53D34N75J068
14829B077M88n68o58B64A32N96J511Q35R3l97l06m61n57m39K98M08j31p47a71
14809a609j283o466M070J686h69D67K21A05f02j005M47N53K81P3K6m11o22n92
$$ plain form
14941 3867 3742 3281 2331 1707 1119 648 417 58 -969 -2619 -902 -234 215 -344 -947 -1539 -1679 -1170 202
14921 2597 3587 3539 3370 3096 3308 3657 2946 1343 -991 -1186 1306 3169 4605 4302 2949 1150 1018 1279
14903 1279 2361 2301 1478 588 103 -488 -684 -2220 -3456 -4288 -5202 -6562 -8508 -3843 -1755 86 1414
14886 1414 1991 2133 2152 2329 2617 2941 2955 2539 2660 2711 2338 1696 1051 291 -437 -262 24 1018 2013 1419 288
14864 -1401 -3102 -4073 -4009 -2836 -610 1560 2969 1728 -366 -2828 -3552 -2144 -272 810 1539 2078 3194
14847 3194 3793 4043 3839 3162 2038 441 -861 -2238 -3389 -4014 -3888 -3208 -1982 -942 -253 434 1009 2077
14829 2077 2565 1997 1339 264 132 728 2239 3074 3167 2770 2464 2003 1446 1007 1305 1713 1582 835 -171
14809 -1609 -2892 -9358 -5288 -3602 -869 467 688 105 -602 -1607 -1160 -607 -326 -253 -227 -638 -1260 -1852
14791a852n1K7L41d91I80J484J21r48H04l27K60P57J695J366N18jj689A672C8
14771a558j299j545j561J927J481J250j66K74l358Q12P64n3q3M59J257a99E37
14753A905N54L44L64J51r32I64B35J17J88N4l9A87e37n70q52q98p71J082F16K020
14733B636J271j71j011j235n65K9m46b54o49l57l18P14A4N31N28M18J54N0k5H18
14712d16r73m22O04e39F19J173O04m09F71a013j026j41O78L69m5o24a35B132J056
14693C188J50j78j99l24p32F04f64j261o43R40d72A025K26n89g54k26P7B82J465
14674A747J275k01j170p00N5K94m34B17f26j243n97i1A137P99n48n53A29a97h7
14654C08L82K67K90m63g1k63a22D93P20m5B37h48B43O28d14Q5j841j285LJ380
$$ plain form
14791 -1852 -1903 -1876 -1535 -491 980 2464 2585 1637 804 477 737 1494 3189 4555 5073 5072 3383 1672 38
14771 -1558 -2857 -4402 -5963 -4036 -2555 -1305 -1471 -1197 -4555 -3743 -2979 -3032 -3115 -2656 -1399 -199 537
14753 1905 2459 2803 3167 3318 2386 964 235 352 540 594 555 187 -537 -1107 -1959 -2857 -3628 -2546 616 2636
14733 2636 3907 3736 2725 1490 925 954 508 -254 -903 -1260 -1578 -864 14 545 1073 1491 1645 1695 1670 818
14712 -416 -1389 -1811 -1207 -539 619 1792 2396 1987 671 -1013 -2039 -2180 -1502 -1133 -1178 -1802 -135 2132 3188
14693 3188 3338 3160 2961 2637 1905 604 -664 -1925 -2568 -1628 -472 1025 1251 662 -754 -980 -903 282 1747
14674 1747 3022 2821 1651 951 1006 1300 866 217 -626 -1869 -2466 -91 1137 1936 1388 835 129 -197 -87
14654 308 690 957 1247 784 -71 -334 -122 493 1213 1168 237 -848 243 871 -414 -329 -2170 -3455 -3452 -2072
14634b072c07A119N94o16m43g36k063j535O92J632i08R3p09j001k33b47B059J335
14616C394K24r44j182D59B10c75p61j082O37k859j05N58R41J222h31E24N35l12
14598G47A90d66o44j90e24A279J089k06p5q5B4c37p70p11O00F48J568Q10m5p53
14578B228p21n6J47K60O16K72p4k2l67I84a219r84l88J69L74Q74c05G15L03A92
14557a099j147j229p56P86a651H1J694J114P25J62k37o45j107F37b17j25I48R02
14539A850N83O2L00m61l94K2J03k82q70F4h72o39m39M60M03K47c40D35K40P19
14519A394k71a35j735j817j237K195J198d75a33k5k17a07D57P29j53J228K34O448
14501H943n25j377l004l29J22m23p68A288i2j070L95a49l19j050o00M4L9l76p37
$$ plain form
14634 -2072 -307 1119 1713 1097 654 -736 -2799 -4334 -3642 -2010 -908 -815 -1524 -2525 -2758 -247 2059 3394
14616 3394 3618 2674 1492 459 210 -375 -1136 -2218 -1581 -4440 -4545 -3987 -3046 -1824 -831 524 1059 747
14598 747 190 -466 -1110 -1300 -524 1279 2368 2162 2087 2002 24 -337 -1107 -1818 -1218 648 2216 3026 2981 2228
14578 2228 1507 1451 1598 1858 2474 2746 2672 2650 2283 984 -1219 -2203 -2591 -2422 -2048 -1174 -305 715 1018 192
14557 -1099 -2246 -3475 -4231 -3445 -1651 81 1775 2889 3614 3776 3539 2894 1787 637 -217 -342 948 1850
14539 1850 2433 2495 2795 2334 1940 1962 2065 1783 913 64 -872 -1511 -1950 -1490 -1087 -840 -340 435 675 1394
14519 1394 1123 -135 -1870 -3687 -4924 -2729 -1531 -475 -133 -158 -375 -107 457 1186 1033 2261 2495 8943
14501 8943 8418 7041 4037 3708 3830 3407 2639 1288 -92 -1162 -767 -149 -468 -1518 -2118 -2074 -2035 -2411 -3148
14482c148q02j583n01K2a339d09j303j325n8p54p92m245J655b805D08K543O95
14465C646J378j048j954e48k006j014P46R0j560l34k270J115J813a408A240K306
14449C546J301M006m110B022E1i53A148K238Q33p64j607C04i33L41A460J056O3
14432B579o91H03e5j42m24o64p63P88A077J608J247L97n34A796e77l474k566j417
14414h034L192K051R13M77K26H82J190L63k6j048n88Q0r3R88J674K193L296K389
14396A1300J417j538n561H44a242o20B10J426n48g3j820k537a961E52J802K33
14380B587q25a23j161k646k393j06L070i04A88M25J68K34r3C32d97j39b77B95
14361A249J621J074L90n49j692F25i06k90A027J954m89j082m06o5P33r1k37A88
$$ plain form
14482 -3148 -3950 -5533 -6034 -6012 -1339 -409 -1712 -3037 -3095 -3849 -4641 -8886 -7231 -2805 408 2951 3646
14465 3646 5024 3976 2022 -548 -2554 -3568 -2822 -2732 -4292 -4626 -6896 -5781 -3968 -1408 1240 3546
14449 3546 4847 8853 4743 2022 51 -953 1148 3386 4219 3455 1848 304 -933 -592 1460 2516 2579
14432 2579 1888 803 -55 -197 -621 -1285 -2048 -1260 1077 2685 3932 4329 3795 1796 -577 -4051 -6617 -8034
14414 -8034 -4842 -2791 -1878 -1401 -1175 882 2072 2435 2409 1361 773 853 760 1748 3422 5615 8911 11300
14396 11300 12717 11179 5618 844 -1242 -1862 210 1636 1088 -73 -1893 -4430 -1961 552 2354 2587
14380 2587 1762 -123 -1284 -3930 -6323 -6429 -3359 -904 188 613 781 1015 922 332 -497 -636 -277 295
14361 1249 2870 3944 4334 3785 2093 625 -906 -1196 1027 2981 2492 1410 1004 939 1672 1581 1344 188
14342i13r94r05N04P41g00A65N47L19Q87N10M61m95o33H26a71o42n07L22K21a49
14321A124J345J094L73k85r13j101p79A09K93J011Q08K23j146D18f69j038m74
14304b181g35B047J773lj0k09j70l98m94j003c53k113j432J461IJ669r0o49d16
14284a314j050n43K77j160r7J66Q00O94j03O24q72o04j132r72J29Q64Q97J147
14266b249R74e95f1J7j002j429q18m1M80a123a25l95J42o53J84k27n4o29o70l64
14246b791r17a616A218O61k55F82g14j291r07M67G19L26C1b492k73O68L60k72
14228b009N87O24j58j840K53a47B001K091K020J076L21r22k115j604A265m81J566
14211B350R70P83K45m31k18j46l76L84p3P5J54j152p70o62D07d67o51p50K68d55
$$ plain form
14342 -913 -1907 -2812 -2308 -1567 -700 165 712 1031 1918 2428 2889 2394 1761 826 -171 -813 -1320 -998 -777 -149
14321 1124 2469 3563 3936 3651 2738 1637 858 109 402 1413 2221 2444 1298 418 -669 -1707 -2181
14304 -2181 -735 2047 3820 3817 3807 3598 3428 3030 2536 1533 -353 -2466 -3898 -2437 9 1678 1588 939 -416
14284 -1314 -2364 -2907 -2630 -3790 -3887 -3721 -2921 -2227 -2330 -1706 -2578 -3182 -4314 -5286 -5157 -4293 -3396 -2249
14266 -2249 -1275 -595 -61 -44 -1046 -2475 -3293 -3334 -2854 -1123 -125 -520 -378 -1031 -847 -1074 -1128 -1757 -2427 -2791
14246 -2791 -3708 -1616 1218 1879 1624 682 -714 -2005 -2912 -2445 719 1045 31 -2492 -2765 -2097 -1737 -2009
14228 -2009 -1422 -798 -956 -2796 -2543 -147 2001 4092 6112 7188 7509 6587 4472 2868 1265 784 2350
14211 2350 3320 4103 4348 3917 3699 3553 3177 3561 3488 3563 3717 2565 1795 1133 407 -467 -1118 -1868 -1600 -455
14190A352K119L381K585m12m171q44l56J2l25j385d81k433k994r67K554a907A022
14172C357J228n90j394A149A76nL51O83M6L13L17M52k09m67E87a19q91k584L8
14153c556P57a348A63J312Q61K57l47O3N89P42o09A276e80k350j269l4N72J151
14135b510J137N22l65m03j98k61j66J78k04p39j434k195m17c508a754h48C74O59
14117A033C51d91N3j50l19l75m11j484j090j831j55K46J758J809b52A228K15n24
14099I19a54j777j107Q90J14m74p45m26J556c38G43p9b79F31J282J004n5o85I02
14079f81j481j389a190B552K302m37o67j383E27a229j393p24M21J100h06k19L50
14062f75A86J470K92p75I8a334j233J099l116j45Q38a130e26A21g80o51K4A57
$$ plain form
14190 1352 3471 6852 9437 9025 4854 4010 3654 3666 3341 1956 -481 -2914 -5908 -6875 -4321 -1907 1022
14172 3357 4585 3995 2601 1149 176 171 522 1205 1251 1564 1881 2333 2124 1657 587 -119 -1010 -3594 -3556
14153 -3556 -2799 -1348 163 1475 2336 2593 2246 2309 2898 3640 3031 1276 -580 -2930 -4199 -4233 -3661 -2510
14135 -2510 -1373 -851 -1216 -1619 -1817 -2078 -2244 -2066 -2270 -3009 -4443 -6638 -7055 -3508 -1754 -848 374 1033
14117 1033 351 -491 -438 -588 -907 -1282 -1693 -3177 -4267 -6098 -6253 -6007 -4249 -2440 -252 1228 1443 919
14099 919 -154 -1931 -3038 -2148 -2034 -2508 -3253 -3679 -2123 -338 743 664 -279 631 1913 2917 2862 2177 902
14079 -681 -2162 -3551 -1190 2552 4854 4417 3750 2367 527 -1229 -2622 -3346 -2925 -1825 -806 -1025 -675
14062 -675 186 1656 1948 1173 98 -1334 -2567 -1468 -4584 -4729 -3891 -1130 -526 121 -780 -1431 -1407 157
14043A175L61E63a024j254P93a35D83L5L9J92N34M34l33d43k512k545j644j26
14025g270K415P80J009N36N19i23d11j3J10a8D81rN23k34c1p19J55l83j368j704
14005d050N04a318H96K206J240j04r73j236I45f9n06r25l25L75oj001L76B99L60
13986F59A99P26k19b94j426r01n50k85m9a636eB99b64j171j286o91Q49i36b91
13966c93o13k60j41r8J51K22M85f6C65b57j455j050j479J392a157B75Q88k6C26
13946a396j871J013H53J891L66A301a3p17j037j499j480N91a876f90E96M29O6
13929A091k54l92d56j987j741N84J692j199j866J29R96J170P74j082j178a069
13912A627P94k83I60h80k039j307j32b082B64K029J638K428R99J90k94j540A771
$$ plain form
14043 1175 1536 563 -1024 -2278 -1485 -135 483 518 557 749 1283 1717 1384 -443 -2955 -5500 -7144 -7270
14025 -7270 -4855 -4075 -3066 -2530 -2011 -923 -411 -424 -314 -18 481 472 995 761 -31 -750 -595 -978 -2346 -4050
14005 -4050 -3546 -1318 896 3102 4342 4238 3265 2029 945 -69 -575 -1500 -1825 -1450 -1456 -2457 -2081 299 659
13986 659 199 925 706 -294 -1720 -2621 -3171 -3456 -3505 -1636 -5 299 -264 -1435 -2721 -3412 -2563 -936 -291
13966 -393 -1006 -1266 -1407 -1505 -1354 -1132 -647 -66 365 -257 -1712 -2762 -4241 -2849 -1157 275 1163 1137 326
13946 -1396 -3267 -2254 853 2744 3110 1301 -13 -730 -1767 -3266 -4746 -4155 -1876 -690 596 1025 1091
13929 1091 837 445 -456 -2443 -4184 -3600 -1908 -3107 -4973 -4844 -3848 -2678 -1904 -2986 -4164 -1069
13912 1627 2421 2138 960 -880 -2919 -4226 -4358 -2082 264 2293 3931 6359 7358 7548 7254 5714 1771
13894a51j490m34b63A741J137l39n39o38C91d09m61Q2J66l0P6R8j0J27j00l43
13874h04q22k38A568O97l22k22D82a499j300a184A371J898J066N13o81p15q07
13857B645j009C22h20j14c27A46a82j310j743J220B608L979L210J984N44p72k138
13840I415l919j674j046l97k43q31N6l52C16f18j078q82O42F3J334N73L3o80b61
13820i95r38k37c95B06c04k367d74k724j212j74J435g46A497P30K54l94n35G29
13801C07L59P90L90L32n33G95b82p71j386n46m31L58M84M82J72o1m37l45p28a059
13780a300j005j57Jj27J8a118e34J49m45n76j00O12c13R4p58r8G0J628J308O31
13760C637m01j036D93a257j240k30M17J051e46g3m6k42q94j168j175N01g42A341
$$ plain form
13894 -151 -1641 -2075 -263 1741 2878 2539 2000 1362 391 -409 -870 -788 -622 -652 -576 -478 -488 -361 -461 -804
13874 -804 -1626 -1864 1568 2265 1943 1721 482 -1499 -2799 -1184 1371 3269 4335 4848 4167 3452 2645
13857 2645 1636 322 -820 -934 -327 146 -182 -1492 -3235 -2015 2608 6587 9797 11781 12325 11553 9415
13840 9415 5496 3822 2776 2379 2136 1305 1361 1009 316 -618 -1696 -2578 -1936 63 1397 1970 2003 1323 -261
13820 -995 -1933 -2170 -395 206 -304 -2671 -474 -3198 -4410 -4584 -3149 -746 1497 2227 2481 2087 1552 729
13801 307 666 1456 1846 2178 1645 795 -282 -1053 -2439 -2985 -3416 -3058 -2574 -2092 -1920 -1981 -2418 -2763 -3491 -1059
13780 -1300 -2305 -2462 -2461 -2588 -2570 -1118 -534 -385 -830 -1406 -1506 -894 -313 -219 -977 -1075 70 1698 3006 3637
13760 3637 3236 2200 493 -1257 -2497 -2727 -2310 -1259 -546 -73 -119 -361 -1255 -2423 -3598 -3097 -742 1341
13741C037R63O61n77j244r66n11k72l13l45b17q05Q6j04M0L59l04r69P07k96j90
13721a693m44l55Q68L28J30L85K81E37J471J382J089L94J02o14n86j192j132A46
13702a442j447f59m70n82K25o93r47q32J78N37a213I41K275J275k24j194A420
13684A66b95C9O41M82m48g21j247i50B068K339P10J269J113P12k325k078j873
13667A935G82j53K20k8B27h29n71j15J84f12%o46r76O50c76D78R31L11K3L86l49
13646A780k90o17C69K1J06PNN75J718J466J607J371k725n00k2J21p5m74k60n09
13626B801r91H45a00j059o74e85A458L9C2a055o40K1j18q89j426j739K572a253
13607G20J259L31p52b74r29j205q36k62l9j872r10K2J964K071d74C15B5g63r98
$$ plain form
13741 3037 4000 4661 4084 2840 1874 1363 1091 778 433 -217 -1022 -936 -1040 -1000 -641 -945 -1914 -1207 -1503 -1693
13721 -1693 -2137 -2492 -1624 -1296 -1166 -781 -500 537 2008 3390 4479 4873 4975 4361 3775 2583 1451 146
13702 -1442 -2889 -659 -1129 -1711 -1486 -2179 -3126 -3958 -3780 -3243 -1213 941 3216 4491 4267 3073 1420
13684 166 -295 39 680 1162 714 -721 -1968 -950 2068 4407 5117 6386 7499 8211 5886 3808 1935
13667 1935 782 629 849 821 227 -829 -1400 -1515 -1331 -612 -612 -1258 -2234 -1584 -376 478 1409 1720 1743 2129 1780
13646 1780 1490 873 369 390 496 503 508 1083 2801 4267 5874 7245 4520 4020 3998 4119 4044 3570 3310 2801
13626 2801 1810 845 -100 -1159 -1833 -585 1458 1497 32 -1055 -1695 -1674 -1792 -2681 -4107 -5846 -3274 -1253
13607 720 1979 2310 1558 -274 -1203 -2408 -3244 -3506 -3545 -5417 -6327 -6305 -4341 -2270 -474 315 25 -763 -1761
13588a761p78mJ067A07J012J07k85N7J073J656J903K86k117A593a009o31A570
13570C885K070J75j273j413j545r15P0O28L84n77G7a644j496k481p80Q17J139
13553d445L51o434K032K121L151g62I90J94k24M81O92L67r07A53a767j103J285
13536a585d34B04M4P76C8a616j178r29j20O01J087e70K80p58j027r36p55k36N33
13517c469J69J203g55E68J226J100R55L16l05j070A208D56I3M95N89E23b07n29
13499g36p18k752l22b238i36k60m11l62j90k22M2O27i6A476J474P17m57l28p84
13480B098j23k67L92P01R76Q14m9j255A537g07j376b50E85K50l92e86r72j036
13462b594R68g79J68p01k21N89H2J090P08n1E38a352k294J9A2K064R44k74M21
$$ plain form
13588 -1761 -2539 -2543 -1476 107 1119 1226 941 998 2071 3727 5630 5916 3799 1593 -1009 -1640 1570
13570 3885 5955 6130 4857 3444 1899 984 1054 1682 2066 1489 77 -1644 -3140 -5621 -6401 -5584 -4445
13553 -4445 -4094 -10528 -8496 -6375 -3224 -762 990 1184 960 1441 2133 2500 1593 153 -1767 -2870 -1585
13536 -1585 -434 204 248 1024 38 -1616 -2794 -3723 -3843 -3242 -2155 -570 -290 -1048 -2075 -3011 -3766 -4002 -3469
13517 -3469 -3300 -2097 -755 568 1794 2894 3849 4165 3860 2790 1208 456 93 588 1177 523 -207 -736
13499 -736 -1454 -4206 -4528 -2238 -936 -1196 -1607 -1969 -2159 -2381 -2339 -1712 -96 1476 2950 3667 3210 2882 2098
13480 2098 1975 1708 2100 2801 3777 4591 4542 3287 1537 -707 -2083 -250 585 835 443 -586 -1558 -2594
13462 -2594 -1626 -779 -611 -1312 -1533 -944 82 1172 1880 1829 538 -1352 -3646 -3627 12 2076 3020 2746 3167
13443C167J63n4J790m18a248k250h31B45J265F36a177j025i01G36Q13G50c24p69
13425a093N33G12J495M68l40A053C7b04A415K055K193Q82K16k043r03A729G36
13407I7d30p75q64j141m48J8J435f92A48n5i41j308j496j424p3M57P45l31j48
13388d519J179j9N28J122h53a27cB35h6dD34j32d06j012j951j750J34J608O74
13369b703J47J61R69M76Kl33J9D38J159k55D19a414j471m76J74J248i3A682J654
13350C336K75r81r43H39a31j289j146n64R6O73J063K75l15p45l55R38f89E9J069
13331A128J058J070N56m7m21n04n01j16Q6J76j069D74c52j150j360j034j730J10
13313e516b028R06k33n20o46q13m26J781i47D00J064Q85L76j157b40j566I89K474
$$ plain form
13443 3167 3330 3276 5066 4648 -1248 -3498 -831 245 1510 636 -1177 -2202 -901 736 1549 750 -324 -1093
13425 -1093 -560 712 2207 2675 2335 1053 37 -204 1415 3470 5663 6545 6761 4718 3815 1729 736
13407 97 -430 -1205 -2069 -3210 -3658 -3640 -2205 -692 148 93 -941 -2249 -3745 -5169 -5242 -4785 -4040 -4371 -4519
13388 -4519 -3340 -3359 -2831 -1709 -853 -127 -3 235 -86 -4 434 302 -406 -1418 -3369 -5119 -4985 -3377 -2703
13369 -2703 -2556 -2395 -1426 -950 -948 -1281 -1262 438 1597 1342 419 -1414 -2885 -3361 -3187 -1939 -93 1682 3336
13350 3336 3611 2630 1687 839 -131 -1420 -2566 -3130 -3034 -2361 -1298 -1023 -1338 -2083 -2438 -1500 -689 59 1128
13331 1128 2186 3256 3812 3765 3344 2840 2339 2223 2309 2485 1416 474 -352 -1502 -2862 -3896 -5626 -5516
13313 -5516 -2028 -1122 -1355 -1875 -2521 -3334 -3760 -1979 -947 400 1464 2349 2725 1568 -240 -1806 989 3463
13295C463M22l96j269A58a182E13Q46L53J78o84A72f42n46r12P40a72F72A29a331
13275b470l79L70d24A279O85J40L9J145M66o43p15I90f13a46A486J246l52p84
13257A596n70h23m74k17j54p38m20r86J238a097B18Q37k5k46l16e12j231n93J50
13238b186Q88C10J436L26K22r00D3a609j630k218K697D02K146J005k73A235a848
13220c606o42R54a461F6J319J032K69r58C77a081j136r6J071H1K020N96q17D85
13201g55l11q1M15j040r82L63M1o92j03j64O36i06I84J082N38j042a83I18K076
13182B994K479L56j061q59j629J166k29H54B06i43k344p80K05M92M13P76K4N0
13164b107O81O99c1G35k51g11j967n92R68h85d6G4a09k39j5f5B29d60j730j928
$$ plain form
13295 3463 3885 3489 2220 158 -1182 513 1359 1712 1890 1206 172 -642 -1188 -2100 -1360 -172 672 129 -1331
13275 -2470 -2849 -2479 -424 1279 1964 2104 2143 3288 3754 3111 2396 990 -613 -146 1486 2732 2380 1596
13257 1596 1026 -823 -1297 -1514 -1668 -2406 -2826 -3812 -2574 -1097 218 1055 1030 784 468 -512 -1743 -2336 -2186
13238 -2186 -1298 310 1746 2072 2294 1394 43 -1609 -3239 -5457 -2760 402 2548 3553 3280 1235 -1848
13220 -3606 -4248 -3294 -1461 66 1385 2417 2686 1728 377 -1081 -2217 -2313 -1242 81 2101 2697 1880 485
13201 -755 -1066 -1147 -732 -1772 -2754 -2391 -2350 -3042 -3145 -3309 -2673 -906 984 2066 2604 1562 -183 918 2994
13182 2994 5473 5829 4768 3909 2280 3446 3217 854 206 -943 -3287 -4067 -3862 -3370 -2957 -2181 -2157 -2107
13164 -2107 -1426 -727 -31 735 484 -711 -2678 -3270 -2302 -885 -46 74 -109 -348 -363 -65 229 -460 -2190 -4118
13144d118N46f12A366K106K151K086m27K60j27k318B375h19k069P37A694K317
13128D011j86A716e11l30B15O68P51R48P22L0p86j013J71P94q4j156m36J075Q22
13109B721J159N84p52j424A039e00j985k077j908j076J575K973B44K283rq22p39
13092I57J28L15K55J38k98j14K45L84N38Q93M75K21j95o91j323e07k306l360j044
13073g217J053n94K972a403A662J730O21n85j121r05F82O7J273J823r0A406e26
13055a796j17i01A213J202Jn08M0M55L51K04j07l90I01i05k158j814N66k560p43
13036g614K373J894f56A889K029P52n02A527c3@F95j66B44iq77p36P93D42O72
13017A114L79j5J55M65k52M24A036d13j397o07K82P45K15m38j374k116k028q51
$$ plain form
13144 -4118 -3572 -612 1366 3472 5623 7709 7282 7542 7415 5097 2375 -819 -2888 -2151 1694 4011
13128 4011 3825 1716 -511 -841 215 883 1634 2582 3304 3334 2548 1535 1706 2500 2416 1260 824 1899 2721
13109 2721 3880 4464 3712 2288 1039 -500 -2485 -4562 -6470 -7546 -5971 -2998 244 2527 2518 1696 957
13092 957 1085 1400 1655 1793 1495 1381 1626 2010 2548 3441 3916 4137 3942 3251 1928 -507 -2813 -6173 -7217
13073 -7217 -6164 -6758 -3786 -1403 1662 3392 4013 3428 2307 1402 682 749 2022 3845 3755 1406 -526
13055 -1796 -1913 -901 1213 2415 2416 1908 1948 2403 2754 2958 2851 2461 901 -905 -3063 -4877 -4311 -6871 -7614
13036 -7614 -5241 -3347 -656 1889 3918 4670 4168 1527 -33 0 695 529 244 -9 -886 -1622 -829 442 1114
13017 1114 1493 1478 1633 2098 1846 2270 1036 -413 -1810 -2417 -2135 -1390 -1175 -1613 -2987 -5103 -7131 -7982
12999g982J174K580K80J55k37j280k94M12J829a412b16m80r20o91j22L47a01A085
12980a35n65K8J23k20kj445o54J155c25A209J834N84k55j182i5n97j78A69O79
12961H48C0e37J67J21R0A76P48J059O61r5n11q48A37e69j179j272m92L21a435
12941c14J05p87j116j373q39M07a766P38n77j122j293o69a539J62k50N29E55J564
12923B119R32K44j060D78a635j816Q39c89A123J571P13k12n52n23l87E52a278
12905c358n54a119A924J399L72j123G74L744Q22a222m88j138a401N39j250a81
12888A106E05a024j341O6h05C96L42a75j301q27k58J78n1R22E46K439J333K63
12870D581m46r97q68p63B03g08q69L61g9A051J080J350J010n2j006A633H5h90
$$ plain form
12999 -7982 -6808 -4228 -3948 -3793 -4030 -5310 -5604 -5192 -3363 -1412 -216 -696 -1616 -2307 -2429 -2082 -101 1085
12980 -135 -700 -672 -549 -769 -771 -2216 -2870 -1715 -325 1209 3043 3627 3372 2190 -95 -692 -870 169 848
12961 848 30 -537 -370 -249 -159 176 924 1983 2644 2549 2038 1190 137 -569 -1748 -3020 -3512 -3191 -1435
12941 -314 -209 -996 -2112 -3485 -4324 -3917 -1766 -1028 -1605 -2727 -4020 -4689 -1539 -1377 -1627 -1098 555 2119
12923 2119 3051 3295 2235 478 -1635 -3451 -2612 -389 1123 2694 3407 3195 2643 2120 1733 552 -1278
12905 -3358 -3912 -1119 1924 3323 3695 2572 774 4518 5340 -1222 -1710 -2848 -1401 -862 -2112 -181
12888 1106 505 -1024 -2365 -2299 -805 396 738 -175 -1476 -2303 -2561 -2383 -2434 -1512 546 2985 4318 4581
12870 4581 4135 3138 2270 1507 203 -708 -1577 -1216 -79 1051 2131 3481 4491 4439 3433 1633 85 -890
12851b168r68o58j60O74J118h77b22a08D11L99Q78J182J226P41k64j253j478l55
12833A487J057J809J945L663J71k357b9j089c52A442J868Q85K7n1l86q25j19l58
12815B483m66o57K55j79n01A34a123K02C17J081Q11j29I97b48j200c56B582J2
12797B594I59i45r71J75P62A49J077K60l24a43j525j744j283J197M91N62Q73g69
12778c9j14p23j040c07C39n0c85r54L38F07J509N97j1j79m52n35O15P66J187K38
12758D342P55K131Q47Q08j259p03k846k91j80O58R31N4j528A630A78a331l91P36
12740i86G1h18j851j980j533J654O39a548a61A545J553J298Q98J571k3l156E80
12722b125j749l3J262c74A821J170P19l9p54A078f45k71m6L14k75J25f7A241R09
$$ plain form
12851 -2168 -3136 -3794 -3954 -3280 -2162 -877 -222 -108 411 810 1688 2870 4096 4837 4573 3320 1842 1487
12833 1487 2544 4353 6298 9961 10132 7775 -29 -1118 -352 1442 3310 4195 4222 4171 3785 2960 2841 2483
12815 2483 2017 1360 1615 1436 935 134 -1123 -921 317 1398 2209 2080 997 -248 -1448 -356 2582 2594
12797 2594 959 -945 -1916 -1741 -979 149 1226 1486 1162 -143 -1668 -3412 -4695 -3498 -3007 -2445 -1572 -769
12778 -39 -153 -876 -1916 -307 339 289 -385 -1339 -1001 607 2116 2713 2702 2523 2071 1536 2151 2917 4104 4342
12758 4342 5097 7228 8075 8883 7624 6921 4075 3784 3604 4262 5193 5247 3719 1630 178 -1331 -1722 -986
12740 -986 71 -818 -2669 -4649 -6182 -4528 -3889 -1548 -161 1545 3098 4396 5294 6865 6842 3686 580
12722 -2125 -3874 -3907 -2645 -374 1821 2991 3710 3671 2917 1078 -645 -916 -962 -648 -923 -798 -67 1241 2150
12703B150r41d40b5j173D64J581Q94R10j190j033L16C76a022j271j002L34j17
12686c078k78n54j82N85J118h96D37J124R61Q26N07j14j059G77a056j385J155
12669a286A230K077J673J287j72k92r63A103f14k92q2l92c61A095L58D34@F7K65
12650C32N16O0l8K21n29i35j787k144q72J3K344a520K98j5p78j430j146a572F82
12630B280N37j289h83k126m48J229b04I69M61o64b58n0D3b16l66k00J04a24G92
12610A665Q09O23K10j25m81n42p11o41c8j271j057m19Q97g59c57j28k97c41A111
12590B697K626J603J192J118P27k08n44k438C132A069G1d87q39n77k48J062I1
12572A315J015l90D37a517j112K33K28K00i75C79J212Q9n98a90q17K23A29N82
$$ plain form
12703 2150 1209 -440 -25 -1198 464 2045 2939 3849 2659 1626 1942 376 -1022 -2293 -3295 -2961 -3078
12686 -3078 -3356 -3910 -4092 -3507 -2389 -896 437 1561 2522 3348 3855 3741 2682 777 -1056 -2441 -1286
12669 -1286 1230 3307 4980 6267 6095 5803 4840 1103 -614 -906 -988 -1380 -361 1095 1453 434 0 67 332
12650 332 848 908 870 1091 562 -935 -2722 -4866 -5738 -5725 -3381 -1520 -1222 -1237 -2015 -3445 -4591 -1572 682
12630 2280 2817 1528 -883 -3009 -3457 -2228 -204 969 1430 766 -258 -308 43 -216 -582 -782 -678 -124 792
12610 1665 2474 3097 3307 3182 2701 2159 1448 807 -38 -1309 -2366 -2785 -1888 -759 -357 -485 -782 -341 1111
12590 2697 5323 6926 8118 9236 9963 9755 9211 6773 3132 1069 71 -487 -1326 -1903 -2151 -1089 91
12572 1315 2330 1940 437 -1517 -2629 -2396 -2168 -1968 -975 379 1591 1680 1082 -190 -1007 -784 129 711
12554G11O26j73k4O45J299J238J196j89q02o45n18M1l06q47p81n28a44j26m14
12535f84o15k09O61D67P33j71k39k40J40L51C21e55j051k13F22J119m05n01K64
12516A099l05C79c98j086j354RL77J64O73P09k76K49J76o45j678k020M6K099A497
12496D339K104j634q47j467I93f2m86J2o65n39j13A19K302b23B565O64n63A249
12477d35A42K105N94j48l76N68K224K723K091J42j423k149B146B66g41A865Q8
12460A953A71b033k174k262j114L403a518l78j412j076b085B058L491J548j31
12445F966l123A066h02k23I40Q56G76a809k167r42O54J186J115f27a80A174P5
12428A249b76k405k799j495n19R85K794a324H76J568P02o96j184d60j561j396
$$ plain form
12554 711 1337 1164 1140 1785 3084 4322 5518 5329 4527 3882 3364 3405 3099 2252 1471 943 -144 -270 -684
12535 -684 -1299 -1508 -847 467 1200 1029 790 550 690 1041 321 -555 -1606 -1819 622 1741 1336 835 1099
12516 1099 794 379 -398 -1484 -2838 -2829 -2452 -2288 -1615 -906 -1182 -933 -757 -1402 -3080 -5100 -5054 -2955 1497
12496 4339 6443 4809 3962 2495 993 -62 -548 -536 -1201 -1740 -1853 119 2421 -223 2565 3229 2666 1249
12477 -435 142 2247 2841 2693 2317 2885 5109 7832 9923 10065 8642 6493 2146 266 -741 1865 1953
12460 1953 171 -2033 -4207 -6469 -7583 -4180 -1518 -1896 -3308 -4384 -2085 2058 5549 7097 6966
12445 6966 3843 1066 -802 -1025 940 1796 776 -1809 -3976 -4918 -4264 -3078 -1963 -627 -180 1174 1249
12428 1249 -276 -2681 -5480 -6975 -7494 -6509 -3715 -1324 876 2444 3146 2450 1266 -460 -2021 -3417
12412c417o06M41a717e60e8A6a18k70r70k54j247r06O81P75a149M46g1A88f42
12392b348j642o01J862D37O82M72l13l65C64K62J570M71l72l88j23m81n72a162
12373c200j100J612a57A564Q51j22A120f17j809j786J684A49J281N66m38B10a640
12355a244a07A828N44q7j72m16N30O23J23J47j064q05Oj97m11D3a122B93K669
12336B962K479R68J872j282B754c72j566m07J94d63G11M12l6m75E4a622n15j41
12318b278Q6P08c42A327J269N5p05l50D83h89j186e76l15o14g19H97J662L08n77
12299B290k08k49m13o48G2a60o3M9DN9a76j69l27p71j444D21L422K906K51K14
12279G214j739A696G54A7f3r34r29k01M64N28B475k65j071J07N46N95p29O153
$$ plain form
12412 -3417 -4023 -3582 -1717 -560 -58 16 -118 -388 -1358 -1612 -2859 -3765 -3084 -2309 -1149 -703 -71 188 -642
12392 -2348 -3990 -4591 -2729 437 1119 1591 1278 913 364 626 2196 2667 2295 1907 1784 1303 731 -1162
12373 -3200 -4300 -2688 -157 1564 2415 2293 1120 -617 -2426 -4212 -2528 149 1430 1996 1558 210 -1640
12355 -1244 -107 1828 2372 2285 2113 1697 2227 2850 2973 3120 2056 1251 1257 1060 649 43 -1122 293 2962
12336 2962 5441 6409 8281 6999 2754 -372 -1938 -2345 -2151 -463 711 1123 1087 612 54 -1622 -2137 -2278
12318 -2278 -2192 -1484 -342 1327 2596 2651 1946 1596 483 -889 -2075 -576 -891 -1505 -719 897 2559 2867 2290
12299 2290 2082 1833 1420 772 72 -160 -223 -174 4 63 -176 -345 -672 -1443 -2887 421 3843 6749 7000 7214
12279 7214 5475 1696 754 17 -63 -997 -1926 -2127 -1663 -1135 2475 2210 1139 1246 1792 2387 1658 7811
12261G811g3j025q73J23N56d73F2L23b7m48p47q4j94p14r14j725j550J531K285
12242b587f03H16R26J00N01J44j118e51j738J84N83L80n35r82j237m549J08c321
12223a352j62m41k79K37Q00H00J073j84J70J7R3N68Q04L66M56j753m10p71D49
12203b68F37KK46O14J92L66M7l29m73E41h18j274j410j939b647Q23O1F64J937
12184B601L60k13q13q33B34i52r55q58K59J205b10B97f5p48o38Rq8m19n81m16
12164b946K97h55A148K437J315j07B232a184j553A32K021M32l30m76l82k44n71
12147E82L59N70l7k74m3l52k52J83Q6K53k08C57c65q20n06K89b38A161J739M81
12127C381l00j088D03a355K54G96O39J40j05J40O02J146m88n91q80C22h38r26
$$ plain form
12261 7811 -73 -1098 -1971 -1848 -1292 -473 62 385 -27 -475 -1222 -1306 -1500 -2214 -3128 -4853 -6403 -4872 -2587
12242 -2587 -603 816 1742 1842 2343 2487 1369 -551 -2289 -2105 -1522 -1142 -1677 -2659 -3896 -8445 -8337 -3321
12223 -1352 -1514 -1955 -2234 -1997 -1197 800 1873 1689 1859 1876 1969 2537 3341 3707 4163 2410 2000 1229 449
12203 -268 637 639 885 1499 1691 2057 2104 1775 1302 541 -818 -2092 -3502 -5441 -2647 -1824 -1763 664 2601
12184 2601 2961 2748 1935 1102 234 -952 -1907 -2765 -2506 -1301 -210 297 -65 -813 -1451 -1442 -1530 -1949 -2530 -2946
12164 -2946 -2649 -855 1148 3585 4900 4793 2232 -1184 -2737 132 2153 2585 2255 1779 1397 1153 582
12147 582 941 1511 1474 1200 1157 805 553 736 822 1075 867 357 -365 -1185 -1691 -1402 -238 1161 2900 3381
12127 3381 3081 1993 403 -1355 -1101 796 1435 1575 1470 1610 2212 3358 2870 2279 1399 322 -838 -1764
12109a764j077j61a425H62J709O41n37j168B87a066l93d47A591K415P16n63j575
12092B584C60a416A27K411J082J05K36k16n97r49I91b42A74J380N33l35d12k503
12074b915q34j8M9J88K45K52J70P46a14A158N30J44o44c4j736j172a385c78F95
12054A424m41l65B15a75D74L22Q22O40J99K61J19k07l47A127c45o97B74H6K04
12035B90K59f51l80j267l65d52B814J186j372C97b242M71C008L705M67o96j898
12018D586l51o4j013A076d05j008J99j61K96A89J68L71a23j340k038J2a149B16
11999G43B54a153m15A578J932K460J09q10H24c53n47N2L85p67j218o82k701N21
11981e310b019g89B59O45k79A52b10A52L461J650k10n89p50j045I00b19m35o36
$$ plain form
12109 -1764 -2841 -3002 -1425 862 2571 3212 2675 1507 287 -1066 -1459 -447 1591 4006 4722 4159 2584
12092 2584 360 -1416 127 2538 3620 3725 3961 3745 3148 2199 991 -242 174 1554 2087 1752 -412 -2915
12074 -2915 -3749 -3767 -3718 -3530 -3285 -3033 -2863 -2117 -114 1158 1688 1832 1188 -34 -1770 -2942 -1385 -378 695
12054 1424 983 618 215 -175 474 796 1618 2258 2457 2718 2837 2630 2283 1127 -345 -1042 274 86 290
12035 290 549 -651 -1031 -2298 -2663 -452 2814 4000 2628 397 -2242 -1771 3008 6713 7180 6484 4586
12018 4586 4235 4171 3158 1076 -405 -1413 -1214 -1375 -1079 189 357 728 -123 -1463 -3501 -3489 -1149 216
11999 743 254 -1153 -1568 1578 3510 5970 6079 5269 824 -353 -900 -848 -463 -1230 -2448 -3130 -5831 -5310
11981 -5310 -2019 -789 259 904 625 152 -210 152 3613 5263 5053 4464 3714 2669 900 -219 -654 -1290
11963a290j280j874k644q83J96K726Q13O41J09J08L74L82l8k48k56N09J169o54
11945b140J77M79o09L59n10P31N40K21L34F44O39J378R40k6p93j284E27g08o43
11926a351Q1M22D15J010K84k74A36f35b92A152K242J538K44j700A284b66m6D96
11907D06J14J21K79J235J127M29n26j220H50a15l62D35J126M72n76C92d74C82
11888H21A92h64j329o84mR93h56l42n32l43j21m00K7n90j87a057M11j28r36L96
11868a314N61K04j35n89o68j5R66A84K33b96n78j7J64D5R58J88o4a079j778j314
11848d171k61J590J89J023d21B328K182J602q08j750B81a646D96K051K179J329
11832F055j381k036E53a525k080N33k80K87m645m59L04K566J920b72B019N42n56
$$ plain form
11963 -1290 -2570 -4444 -7088 -7971 -7775 -5049 -4236 -3595 -3486 -3378 -3004 -2622 -2660 -2908 -3164 -2655 -1486 -2140
11945 -2140 -1963 -1484 -2093 -1734 -2244 -1513 -973 -752 -418 644 1283 2661 3601 3575 2782 1498 527 -708 -1351
11926 -1351 -1270 -848 415 1425 1709 1435 136 -635 -292 1152 3394 4932 5176 3476 1284 -266 -312 496
11907 406 520 641 920 2155 3282 3711 3185 1965 850 -115 -477 435 1561 2033 1457 392 -474 382
11888 821 192 -864 -2193 -2877 -2881 -1888 -856 -1198 -1730 -2073 -2194 -2594 -2567 -3157 -3344 -1057 -646 -774 -1710 -1314
11868 -1314 -753 -549 -684 -1273 -1941 -1956 -990 184 417 -296 -874 -891 -727 45 1003 1191 1127 -1079 -2857 -4171
11848 -4171 -4432 -2842 -2653 -1630 -421 2328 4510 6112 5304 3554 281 -1646 496 2547 4726 6055
11832 6055 4674 2638 553 -1525 -3605 -3072 -3352 -3065 -7710 -8169 -7865 -5299 -3379 -272 2019 2561 2005
11815B005p18F16B58J12P64O40M1m23C50c04j58K25l59j331j052j023n92R39a691
11795i83b99D1J915K230J343L90j702j552A234b56q91l01r57p52k60O09J195E56
11776A959J295P15J81j0m40K635K569k777k261a700k898j348l5J917J492Q71P57
11759i44m7m08n28h15A128Q64M53O6j18m89p17B92A32L59j99h47j70L68b42hl93
11738d01j357j780j820j353L60K565J771K19j027p35m21K15K42P72P40N34K44
11721a232k96J35N94c01C11I2a042j355p97k03N66P16O40L67J59m71j23a07A132
11701A130D38e78q33m94r30r62n84L72J475i93A89L30R90R51P97K96n01k35j214
11682A603A40GJ942K329J599n76j792j575B26a255j254j842K31J018a291A034
$$ plain form
11815 2005 1287 616 258 370 1134 1774 1815 1392 350 -304 -462 -237 -596 -1927 -2979 -4002 -4594 -3655 -1691
11795 -983 -299 41 1956 4186 5529 5919 4217 2665 1234 -256 -1147 -1448 -2405 -3157 -3417 -2808 -1613 556
11776 1959 3254 3969 4150 4140 3700 6335 8904 6127 3866 -1700 -4598 -5946 -5981 -4064 -2572 -1701 -944
11759 -944 -991 -1399 -1927 -815 1128 1992 2445 2511 2393 1904 1187 292 132 491 292 -847 -1017 -649 -242 -8 -401
11738 -401 -1758 -3538 -5358 -6711 -6351 -3786 -2015 -1796 -2823 -3558 -3979 -3764 -3522 -2750 -2010 -1476 -1232
11721 -1232 -1528 -1393 -799 -301 311 92 -1042 -2397 -3194 -3397 -2831 -2115 -1475 -1108 -949 -1420 -1543 -107 1132
11701 1130 438 -578 -1411 -1905 -2835 -3797 -4381 -4009 -2534 -993 189 519 1509 2460 3257 3553 3052 2817 1603
11682 1603 140 7 1949 4278 5877 5301 3509 1934 226 -1255 -2509 -4351 -4120 -3102 -1291 1034
11665B682J284O82l15r92A589e48k121o63O28f81D30M10k8C07c40q42Qe10H58
11645B225J272O12Q26j748A186io55M2o5j84m50r09P02a43A104R29L41L57k66
11626B465p66C34d27q12q00p35r19K7N41i84c69B23N79B36h79l37J62l13r9l87
11606a853o99k99J051A86K042K34q23j79F04A15b56a13I27J935K133l9j676m46
11588B834j037H27b63j311J04C87J805J257L25p53r00E56g70r11K43j13e36C82
11569A078j17b3j474j324L97h24B35J174J631J347J845p11j726l00A682E58A70
11551H51P4P1A38a443k604a555E13J627J081L80j63j164I87M4R51O81N17k62o53
11532B265A097B14e36n27l46J60L87l74j35m31L97n9K75b35A561J256J045L54
$$ plain form
11665 2682 3966 4648 4333 3341 1589 -548 -2669 -3332 -2704 -681 430 840 812 307 -340 -1182 -1174 -510 858
11645 2225 3497 4109 4935 3187 1186 -9 -664 -622 -687 -871 -1321 -2230 -1528 -143 1104 2033 2374 2731 2465
11626 2465 1699 334 -427 -1239 -2039 -2774 -3693 -3666 -3125 -984 -369 223 802 236 -879 -1216 -1054 -1367 -1466 -1853
11606 -1853 -2552 -2851 -1800 186 2228 2462 1639 1460 604 115 -256 -113 927 2862 4995 4956 3280 2834
11588 2834 1797 827 -263 -1574 -1470 387 2192 3449 3774 3021 2121 556 -770 -1681 -1438 -1551 -536 382
11569 1078 961 -23 -1497 -2821 -2424 -824 235 1409 3040 4387 6232 5521 3795 3495 1682 558 170
11551 851 925 996 138 -1443 -4047 -1555 513 2140 3221 3601 3438 2274 987 1031 1982 2663 3180 2918 2265
11532 2265 1097 214 -536 -1063 -1409 -1249 -862 -1236 -1371 -1802 -1405 -1464 -1189 -235 1561 2817 3862 4216
11514D216j97n12j631A2a516j023J83e15B249J917L50J015r40A758C59a012n73
11497a585M9N80b18A11a76p6l23j19P0A428K35E11a613k802j874m65J937J612
11479c205J376R03a06E35j91n2N88Q45M07k33I37A93d22k33O5m12p96m48M3L9
11459b164L49f77G34J640J854K441J462R74L465m461l544A552n79m62N34E02K99
11442H01k93P28M87k33D29c04j530j402p74K66J059K98K76J053D87L43c52k051
11424b403j272J545c95B04e99p57b67A007P31N5q57a670j62h43a38j22C87d77
11405a061j456J16L75m9N1l6N83M78J52O2M6a86B48Oc69m03K64A93l0J19J11K77
11383F70N94N33M24K7j33n91n99b25j940j252j296L3Q50J681d13F01j3B09h27
$$ plain form
11514 4216 4019 3507 1876 12 -1516 -2539 -2356 -515 2249 4166 4516 5531 4591 1758 359 -1012 -1585
11497 -1585 -1536 -956 -218 111 -176 -252 -575 -694 -624 1428 1663 511 -1613 -4415 -6289 -6754 -4817 -3205
11479 -3205 -1829 -926 -106 535 344 292 880 1725 2132 1899 937 193 -422 -655 -590 -1002 -1798 -2246 -2203 -2164
11459 -2164 -1815 -677 734 2374 4228 6669 8131 9105 12570 8109 4565 1552 973 511 1045 502 801
11442 801 508 1236 1723 1490 429 -304 -1834 -3236 -4010 -3744 -2685 -2387 -2111 -1058 487 830 -352 -2403
11424 -2403 -3675 -2130 -395 204 -599 -1356 -267 1007 1738 1793 936 -1670 -1832 -843 -138 -260 387 -477
11405 -1061 -2517 -2401 -2026 -2075 -2024 -2060 -1477 -999 -847 -785 -739 -186 248 254 -369 -772 -508 193 163 282 393 670
11383 670 1264 1797 2221 2248 2115 1524 925 -225 -2165 -3417 -4713 -4680 -3830 -2149 -413 601 588 209 -827
11363a484H19K087J412K78p98A413a697o58L85b65A796R93l51j124a3m32q4A86
11344gp16o58q47l90N02L87J17m68n84n44K02l85J041a29F52d66j095q21O4R67
11324a351B27J425J084P51J57O4q18r15D31A23J68J553J443J302R70Q02j132j021
11306D208j929A63a858j501l37J62j95j109j996j88K796a505C43L64b35j377M17
11289a195b7C16M92D01g82o0o90o14h88E9J163O40M01m08o97l56R09P66N68q39
11269B206r94a743j757j337b096E0R28J20A97f59K00A34C2i87j531p30J212dA739
11249C028Q20L73l23j461A72a543j314k19O89M93L80j66q41q66J266A180K660
11232C840J246m41j228j037I80a453k249k365j556j494p097d671Q16N79J298R26
$$ plain form
11363 -1484 819 2906 4318 4596 3798 1413 -1697 -2355 -1970 -265 1796 2789 2438 1314 -13 -445 -529 186
11344 -7 -723 -1381 -2228 -2618 -2116 -1729 -1612 -2080 -2664 -3208 -3006 -3391 -2350 -129 652 -466 -1561 -2382 -2318 -1351
11324 -1351 227 1652 2736 3487 3644 3708 2890 1975 431 123 291 1844 3287 4589 5559 6361 5229 4208
11306 4208 2279 163 -1858 -3359 -3696 -3534 -3729 -4838 -6834 -7022 -4226 -1505 343 707 -235 -1612 -1195
11289 -1195 -27 316 808 401 -782 -842 -1532 -2146 -888 59 1222 1862 2263 1855 1158 802 1711 2477 3045 2206
11269 2206 1212 -1743 -3500 -4837 -2096 50 978 1098 197 -659 -459 134 32 -987 -2518 -3248 -2036 -4 1739
11249 3028 3848 4221 3898 2437 172 -1543 -2857 -3076 -2387 -1894 -1514 -1680 -2521 -3387 -2121 1180 3840
11232 3840 5086 4645 3417 2380 980 -1453 -3702 -6067 -7623 -9117 -16214 -4671 -3855 -3276 -1978 -1052
11216a052r8J01K77b55O4n0n77o89n61h35C03P95m53a526n96j87M85j19q63o31
11196c437K90K61e82A101J013K27O24J11m34q93p22m13K58R8l01k81K54R01K83
11177A826l96d2j277j137m57G30K630J112j173k70j375G00b21k39n07A01P87N91
11159A479K22o8j46F41a0m21m38j351k875l430k019j347K999c407e21H90Q63J92
11141A945I26d61p72f4D81J023n57j7b97p79j256J69n34Q99e59r02L97M09a34
11121B88I4a040j729j759j438j48N5J937b025h97a28A047J482J512R42o98j823
11104B462A117P5j01B83f43m65g5A220k86k52N03J414J100J547j330j625F04f39
11085e97n17n00m36J10k50r83m84P72a027B11J136J52F91e45j128n82R78p51k90
$$ plain form
11216 -1052 -1150 -1049 -772 -255 -191 -241 -818 -1507 -2068 -835 303 1098 645 -1526 -2122 -2309 -1824 -1943 -2806 -3437
11196 -3437 -3147 -2886 -582 1101 2114 2341 2965 3076 2642 1749 1027 614 872 970 669 388 642 1543 1826
11177 1826 1430 -42 -1319 -2456 -2913 730 3360 4472 3299 3029 1654 700 -221 -460 -967 101 888 1479
11159 1479 1701 1633 1487 641 -10 -431 -869 -2220 -5095 -8525 -10544 -11891 -8892 -3407 -521 890 1753 1945
11141 1945 926 -461 -1233 -64 481 1504 947 930 -297 -1076 -2332 -2163 -2697 -1798 -559 -1461 -1064 -655 -134
11121 288 94 -1040 -2769 -4528 -5966 -6114 -6059 -4122 -2025 -897 -128 1047 2529 4041 4983 4285 2462
11104 2462 1117 1192 1091 283 -643 -1108 -75 1220 934 682 1185 2599 3699 5246 3916 2291 604 -639
11085 -597 -1114 -1614 -2050 -1940 -2190 -3173 -3657 -2885 -1027 211 1347 1499 691 -545 -1673 -2255 -1277 -2028 -2318
11066b318K37P08a28A243R74K71j35j106B06a153j085i36A930K020J783L65l75
11049E723o3O22k512j680G83d87o21j14K51D88J728J109Nk85Q81K645K723K19
11031I513k374C106F21a284m17C40M39A50a126j489j447k370k835m17M624C88
11014C208L486J559K443O6M46r48k768A070gj117b14I16J489J156N18j248A072
10996a377j691o85J681A284K145J504l6j212j002q77G37j08O93O98J91k23q84
10979A104D14J67N94L4D53g12j024j24A04J188m37e90k163j671j094R47P08M37
10961c426L47L61P54b84D39Q0A49f18j021q66n3J131g10j338O06L45J01J88M01
10942d07F57J340R65M42m36q73q78D83k34b29j82L5A07P38J557Q61k61j190g9
$$ plain form
11066 -2318 -2081 -1373 -128 1243 2217 2488 2353 1247 206 -1153 -2238 -936 1930 3950 5733 6098 5723
11049 5723 5660 6282 3770 2090 783 -487 -1108 -1222 -971 488 2216 3325 3330 3045 3926 6571 9294 9513
11031 9513 7139 3106 621 -1284 -1701 340 779 150 -1126 -2615 -4062 -6432 -9267 -9684 -5060 388
11014 3208 6694 8253 10696 10762 11208 10260 7492 1070 -7 -1124 -214 916 2405 3561 4079 2831 1072
10996 -1377 -3068 -3753 -2072 1284 3429 4933 4897 3685 2683 1806 737 629 1322 2020 2211 1988 1104
10979 1104 414 581 1175 1209 453 -712 -1736 -1860 104 1292 855 -590 -2753 -4424 -5518 -4571 -3863 -3426
10961 -3426 -3079 -2718 -1964 -284 439 519 149 -618 -1639 -2505 -2558 -1427 -710 -2048 -1442 -1097 -996 -808 -407
10942 -407 657 1997 2962 3404 2968 2095 1217 483 249 -229 -411 -376 107 845 2402 3263 3002 1812 -79
10922b534m66a23A959O17o46G24b51C18L88i7M7A746K064K225K732n65B487f70
10903c526m41i53A798K385J053m16j426A662F04P88K176R40n22j038j096o41P74
10886A985R47O83j484G95i60j502k839R98R71J2l11p49o4o09j46PJ089J333g45
10866A154J075P30m4q73H26e09B51K954J913M18j803j532j022K98J216p85r12
10849I96j50c6j773J44f96j05m77a24A279J058L80k20j158a05k060j249R41e93
10830G10p1k87r3J40j00O31L98l28a25j897j279j65O43R35L39k79o50L62c37B344
10809E275K362L49j173j557b48q03k94J19d18B67O5j5c81o14K86D26K11j20a00
10789c82E91J316J150j73j407b39n83a1A823J448R23J38J04o52n64n78o18p32
$$ plain form
10922 -2534 -3000 -123 1959 2576 1930 724 -251 318 706 -97 -50 1746 3810 6035 8767 8202 2487 -670
10903 -3526 -3967 -953 1798 4183 5236 4820 3394 1662 604 1392 3568 4508 3986 2948 1852 1211 1985
10886 1985 2932 3615 2131 795 -960 -2462 -5301 -4303 -3332 -3320 -3631 -4380 -4444 -5053 -5199 -5192 -4103 -2770 -745
10866 1154 2229 2959 2915 2042 826 -509 251 3205 5118 5536 3733 2201 1179 1477 2693 1908 996
10849 996 846 -36 -1809 -1665 -696 -801 -1278 -124 1279 2337 2717 2497 1339 -105 -2165 -3414 -2473 -593
10830 710 639 352 259 399 299 930 1328 1000 -125 -2022 -3301 -3466 -2823 -1888 -1549 -1828 -2478 -2116 -337 2344
10809 5275 7637 7986 6813 5256 -248 -1051 -1345 -1226 -418 267 332 317 -381 -995 -709 426 637 517 -100
10789 -382 591 1907 3057 2884 1477 -239 -822 -11 1823 3271 4194 4332 4436 3784 3220 2642 2024 1292
10771A292A08g61o23p84K05E86J637N84J93A277jJ83O53Q1G48a340q99a52A662
10751B848O16M57j37j59p9J50j40j70k27r36L014A483d20q70k67O25c45E46J380
10732A926K62q32a6j261q32M0i74B11J012K52l31D45d22q79j367j449P34J352
10714b031o5o24J033K13k43N76j6J70m56j195k1k86O51Q10k9m48n48n88m03q21
10694d321l22j89J25a929A043J303l6j117a51q75k1M78D2b7l11r46o44p0N96f51
10673H05J485J151R23k74j044j516d4n61n09l69J14f58f7A299K214K077K345J627
10655I562L12j103q28A662QJ021Q10qm26j049I43d37p06j129N18O42K82a37D9
10635c83j78l83LJ77l00n26k47L20K27J43M90j26R2k49o59k02o54a222e62A54
$$ plain form
10771 1292 108 -761 -1384 -2168 -1963 586 2223 2807 3000 1277 1276 1459 2112 2193 748 -1340 -2239 -152 1662
10751 2848 3464 3921 3784 3625 3546 3696 3556 3386 3159 2223 5237 1483 -420 -1290 -1557 -932 -345 546 1926
10732 1926 2188 1356 -16 -1277 -2109 -2069 -974 211 1223 1475 1144 445 -422 -1301 -2668 -4117 -3383 -2031
10714 -2031 -2096 -2720 -1687 -1474 -1717 -1141 -1157 -987 -1443 -2638 -2659 -2945 -2294 -1484 -1513 -1961 -2509 -3097 -3500 -4321
10694 -4321 -4643 -4832 -4707 -1929 1043 2346 2310 1193 -151 -1026 -1047 -569 42 -27 -338 -1284 -1928 -1998 -1402 -651
10673 805 2290 3441 4364 4090 3046 1530 -44 -605 -1114 -1483 -1369 -658 -67 1299 3513 5590 7935 9562
10655 9562 9874 8771 7943 1662 1670 2691 3501 3493 3067 2018 943 -437 -1143 -2272 -1754 -1112 -830 -137 49
10635 -383 -561 -944 -941 -764 -1064 -1590 -1837 -1517 -1290 -1147 -657 -783 -691 -940 -1599 -1801 -2455 -1222 -562 154
10614E96J592J188L044K386r7j694l448A349c98J68D78O03Q71N98j74A183f14
10596a984o19j55L23j15R64G20J573Q35O53J248l65p17j108j088q71d16j011o70
10578b097j253q07J894e21J35c3F02f23b51I07R07M30K20n67F83a324j706h18
10559A154J24n41a223j125b38A784L62o27E24e70j715f23A073M82K67N7p31E40
10540D77j56A4b71P9C10R0c60n70R2k15j03q23o18J146B77R22K46J87K72N11K99
10519B714j39l67p36B87a153n56J43O32h8B39o1N1b1D1J093J15j5j36D86a04o80
10498g84m13p90o51p0J150D28K142J798K024J68j215j862F67b508j862J231c07
10480A594J186O69l78p87o58D44a036j175j249q21J71a635I8Q72K63O02J339K862
$$ plain form
10614 596 2188 3376 6420 8806 8709 7015 3567 1349 -398 -230 478 1081 1952 2550 2376 1183 -614
10596 -1984 -2603 -2758 -2435 -2550 -1586 720 2293 3128 3781 5029 4664 3947 2839 1751 880 -416 -1427 -2097
10578 -2097 -3350 -4157 -2263 -521 -386 -33 602 -623 -251 907 1814 2244 2464 1897 683 -1324 -3030 -818
10559 1154 1278 737 -1223 -2348 -238 1784 2146 1519 524 -570 -2285 -623 1073 1555 1822 1879 1148 540
10540 477 321 14 -271 -192 310 400 -360 -930 -838 -1053 -1156 -1979 -2597 -1451 277 1199 1445 1632 1904 2415 2714
10519 2714 2575 2208 1472 287 -1153 -1709 -1566 -934 -88 239 178 229 -21 41 1134 1249 1234 1098 486 -104 -784
10498 -784 -1197 -1987 -2638 -2708 -1558 428 2570 4368 6392 6560 5345 3483 667 -2508 -4370 -3139 -307
10480 1594 2780 3449 3071 2284 1626 444 -1036 -2211 -3460 -4281 -4110 -1635 98 970 1233 1835 3174 6036
10462F036M543q1m179k926A647F45A63J130Q28J520K52L2J94J46K02J54n95j137
10444B889o87m25n58cj079k26n53p70j26j54J77M62L53o79l73n43j185l70P33
10425d336J793f74A365K500K603K97k485j753A073a22N3C49A50a67r29j102j091
10408c289p17J841f20J07j48c22A086J026n1r66g60k363K14g50A201J019m97K675
10390D398p41q23c36j204P61@I1Q31J045J182J049K029r1B940k13j19L306k47
10372E667P70b477q34j8J108d83I51A83e75p47m05k52o21n66j086J508K5m78J578
10353a619A00J84h41n34q05r3g7A255K62J09g56j794j00k1J229c96j99EJ070M55
10333A530N30J65J94K65K10nq1m54k24K14L6J197J7j10j292H43f17m96j05d63
$$ plain form
10462 6036 10579 10498 6319 3393 1647 645 163 1293 2121 3641 3893 3925 4119 4265 4467 4621 4026 2889
10444 2889 2202 1777 1219 -3 -1082 -1308 -1861 -2631 -2757 -2911 -2734 -2272 -1919 -2598 -2971 -3514 -4699 -5069 -4336
10425 -4336 -2543 -674 1365 3865 6468 6765 4280 2527 1073 -122 -69 349 150 -167 -1096 -2198 -3289
10408 -3289 -4006 -2165 -620 -513 -661 -322 1086 2112 2061 1095 -760 -3123 -2909 -750 1201 2220 1723 4398
10390 4398 3657 2834 -336 -1540 -779 0 91 922 1967 3149 4198 6227 6136 2940 2727 2608 5914 5667
10372 5667 6437 -2477 -3311 -3329 -2221 -483 951 183 -575 -1322 -1727 -1979 -2600 -3166 -4252 -2744 -2719 -3197 -1619
10353 -1619 100 284 -841 -1375 -2180 -2273 -77 1255 1517 1626 -756 -2550 -2650 -2671 -1442 -396 -595 5 1075 1530
10333 1530 2060 2225 2419 2684 2894 2889 2808 2354 2130 2344 2380 3577 3594 3484 2192 843 -617 -1113 -1218 -463
10312E35A87a51n85j099j222q23k50j47p66m26J253a771A40J486M57J01K08l47
10294B045p5N30O13O41Q97R48k071j69j245E75a841k046j19J389a281F66J776
10277B442J357K19j134A177g03j981j344p72M02K81K70q5O40J517c46A106J252
10260B358P20q1k74j68r46F06g21j053j010j125N15J210f54D56J287Q49R64N64
10242D120j372j241a190k788k337c013J382e90D64N87N95Q31m60H56a453j594
10226c047M65M66K23o34J19M45k76N58f46E88L05j56m5l37j59J57P3L58p1N8M89
10205A260M10O21P83K73P9k42n35p67q65E06O68J063P69m73A141a398k744j884
10187f026j777N27b411e28k79o17j71J92L84M70P2r28j180r69P28Q20M22p07L48
$$ plain form
10312 535 187 -151 -736 -1835 -3057 -3880 -4130 -4277 -5043 -5469 -4216 -1771 140 1626 2083 2184 2392 2045
10294 2045 1970 2500 3113 3754 4651 5599 3528 3359 2114 575 -1841 -3887 -4006 -2617 -1281 666 2442
10277 2442 3799 4018 2884 1177 -703 -2684 -4028 -4800 -4398 -4117 -3847 -3932 -3292 -1775 -346 1106 2358
10260 2358 3078 2997 2723 2555 1609 606 -721 -1774 -2784 -3909 -3394 -2184 -654 456 1743 2592 3556 4120
10242 4120 2748 1507 -1190 -3978 -6315 -3013 -1631 -590 464 1051 1646 2477 2017 856 -1453 -3047
10226 -3047 -2582 -2116 -1893 -2527 -2408 -1963 -2239 -1681 -646 588 893 737 692 355 196 353 426 784 713 771 1260
10205 1260 1670 2291 3074 3347 3426 3184 2649 1882 1017 506 1174 2237 3006 2533 1141 -1398 -4142 -6026
10187 -6026 -7803 -7276 -2411 -528 -807 -1424 -1595 -1403 -1019 -549 -477 -1405 -2585 -3554 -2826 -2006 -1584 -2291 -1943
10168a943Q47K28r63l98J94k39O68b25A439R78k59p72D90b18M7A08O25O36p5E96
10147a520j612j419j285N68J434Q75O73i81A399J905J91r01A283n30k23k12M42
10130G60R7N15l53A13h47k62e30j16q89m89h32A095J309J78j169c68j583n35l73
10111b859M02l8q33j056M75a859d4A101J74E89a70m43C1P43N25m01e09j705m78
10092b692M02e56A089Q25k02E69rP89N70L83l87A14a815j175K22f90I09k83g93
10072b499m31a190c59A7a109j485j184k311K531J041d40o41p95c05n17n14p97
10055b133Q91k26c18A453K05p15h10k366o01i94C51B1K61j7Q5K63J69k19C0c64
10034i58q01j033j045l77J07n13M83Q26j38L94k91p50l18J537J320K84r0q45j307
$$ plain form
10168 -1943 -1096 -868 -1831 -2229 -2035 -2274 -1606 -225 1439 2417 2158 1386 490 -218 -171 108 733 1369 1294 596
10147 -1520 -3132 -4551 -5836 -5268 -3834 -2959 -2286 -981 1399 3304 3495 2594 1283 753 530 318 760
10130 760 857 1372 1019 113 -847 -1109 -530 -646 -1535 -2024 -832 1095 2404 2582 1413 -368 -1951 -2486 -2859
10111 -2859 -2457 -2495 -3328 -4384 -3909 -1859 -44 1101 1275 589 -170 -613 31 774 1299 898 -509 -2214 -2692
10092 -2692 -2290 -556 1089 1914 1712 569 560 1349 1919 2302 1915 114 -1815 -2990 -2768 -690 909 626 -793
10072 -2499 -2930 -1190 -359 17 -1109 -2594 -3778 -6089 -3558 -2517 -440 -1081 -1876 -305 -822 -1336 -2133
10055 -2133 -1242 -1468 -318 1453 1658 943 -810 -3176 -3777 -994 351 21 282 265 350 613 782 563 30 -364
10034 -958 -1759 -2792 -3837 -4214 -4107 -4620 -4137 -3311 -3449 -3055 -3346 -4096 -4414 -2877 -1557 -1273 -1363 -2208 -3515
10015c515j179M2L39r1o84j051m333k636L523b305j505a496A079J295J148o28
9999B894j73O32o82K26L94j04m28em561l552k129j53L90J936b201J020L50c84
9980G37J150Q77K65n99F40a598k456l904K689R23J586R07Q35b1k33Q6l55J47q04
9961a180j163j743j45J329a428c7G76L55O53l60A50a613l24B95K350J045Q5j100
9943B675A064b65D43J919J662L50j180A328A93O19J911J517Q23M71m07j708A104
9925a136j892j113l30N40a753N43b61E60O09l57k76M59K66l19k94j85A24K69J07
9906E00K24K15M37L33L61M91N53P86P89O04N42r5p66j598A262d11n99D28R81P96
9886B205K96m36o61k46R4K89j87n27G7a125r02B00J461M24j86E11i0k409m03J389
$$ plain form
10015 -3515 -4694 -4652 -4313 -4404 -5088 -6139 -10472 -13108 -9585 -2305 -3810 -1496 1079 2374 3522 2894
9999 2894 2721 3353 2671 2897 3291 3187 2759 -5 -4566 -8118 -10247 -10400 -10010 -8074 -2201 -1181 -831 -384
9980 737 1887 2764 3029 2430 640 -1598 -4054 -7958 -5269 -4346 -2760 -1853 -1018 -21 -254 -168 -523 -376 -1180
9961 -1180 -2343 -4086 -4231 -2902 -1428 -37 776 1131 1784 1424 150 -1613 -1937 295 2645 3690 3775 2675
9943 2675 1064 -265 443 2362 4024 4374 3194 1328 193 812 2723 4240 5063 5534 5127 3419 1104
9925 -1136 -3028 -4141 -4471 -3931 -1753 -1210 -261 560 1169 812 536 995 1261 942 648 463 124 393 500
9906 500 724 939 1376 1709 2070 2561 3114 3900 4689 5293 5835 5740 4974 3376 1262 -411 -1010 428 1409 2205
9886 2205 2501 2065 1404 1158 1252 1541 1354 827 77 -1125 -2027 200 1661 2085 1899 511 -90 -2499 -2902 -1513
9866a513H78R25m85l86a411k607j429j117K014a666F80J430o68d76j430k29P28
9849a407n28n76K95N10K84k62L96e94h3j439k195l96o94j371K179a089A438P80
9831B218R1j52J13o96c11j891c48G66J272Q70N01P18L36j148j238m4L53J019O26
9812D031m10r31A092a010j721J359N43r11o58i50f1p46l23p42k8M71N40B36J727
9793A963K139l21A688B90g77P0a81c1k02m80pB15J107O35J24m12G95d91j919j88
9773b598P52g41B48J23k2A38d94o95j235K82A3K16J020k39B30d31j70m25j035
9754b061j36e7B919Q85M3m77p48o67k04P79Q15R43j171j547D26c30n35p37P90
9735h12c56B7K15M0K41j68J11L08N95M7N95j27j71j3J23k07D72a22F31J074J95
$$ plain form
9866 -1513 878 1803 1318 932 -1411 -4018 -5447 -6564 -4550 -1666 680 2110 1442 -476 -1906 -2135 -1407
9849 -1407 -1935 -2511 -2216 -1706 -1422 -1684 -1288 -594 -83 -1522 -3717 -4113 -4807 -6178 -3999 -1089 1438 2218
9831 2218 2309 2157 2270 1574 -311 -2202 -348 766 2038 2908 3409 4127 4463 3315 2077 2033 2386 3405 4031
9812 4031 3621 2690 1092 -1010 -2731 -1372 -829 -1740 -2398 -950 -61 -807 -1130 -1872 -1900 -1429 -889 236 1963
9793 1963 4102 3781 1688 290 -777 -707 -181 -31 -233 -713 -720 215 1322 1957 2081 1669 795 -491 -2410 -2598
9773 -2598 -1846 -741 248 371 349 138 -494 -1189 -2424 -2142 13 229 1249 1010 230 -431 -601 -1026 -2061
9754 -2061 -2197 -57 2919 3804 3847 3370 2622 1955 1751 2530 3345 4288 3117 1570 426 -330 -865 -1602 -812
9735 -812 -356 27 242 282 523 355 466 774 1369 1416 2011 1884 1713 1700 1823 1616 472 -122 631 1705 1900
9714A900k49H7b428k150J147P70l41K65m52q28j76k0m73j292J986a487H31J786
9696B617R04o9o09p46o83Q0B1a717k045j052J141J405e98C47L75L77M24L55J24
9677B002l3L05l78K09J52r1o55E3a112r2d86h8A029P69M13Q27J251J559P83K479
9657I110L17K387j765k869k443A423N80Q12n5l73k55K13O80L63l98p09p97k03
9639A281K22R29M37l03n69r91h4A05J65c09o50r47p46J106J89o21j121j333j178
9620e610n52K832i71G22N47J32h16k138r27m20R71a188M23j015h25L8b50j78m82
9601i10m91k40L5M9l07j039o54j47J649g23G16J129J969K429K549l0j368j15j972
9582E307L13k621a72j288j030p4N04f7A648Q98M85M06K72J38O711K898M084L218
$$ plain form
9714 1900 1651 87 -2428 -4578 -3431 -2661 -3002 -2737 -3189 -4017 -4193 -4213 -4686 -5978 -3992 -1487 831 2617
9696 2617 3521 3452 2843 2097 1414 1494 21 -1717 -3762 -4814 -3673 -2268 -598 347 722 1099 1523 1878 2002
9677 2002 1969 2274 1896 2105 2257 2166 1511 53 -1112 -1204 -486 -88 1029 1798 2211 3038 4289 5848 6631 9110
9657 9110 9427 11814 10049 7180 4737 1423 2003 2815 2760 2387 2132 2345 3025 3388 2990 2281 1484 1281
9639 1281 1503 2432 2869 2566 1997 1006 -84 105 270 -309 -959 -1906 -2652 -1546 -1357 -1978 -3099 -4432 -5610
9620 -5610 -6162 -3330 -971 722 1269 1401 -816 -2954 -3881 -4301 -3330 -1188 -765 -1780 -825 -787 -250 -428 -910
9601 -910 -1401 -1641 -1606 -1557 -1864 -2903 -3557 -3704 -2055 -723 716 1845 3814 6243 8792 8762 7394 7279 5307
9582 5307 5620 2999 -172 -1460 -2490 -2564 -2060 -67 1648 2546 3031 3437 3709 3847 10558 13456 17540 20758
9564B0758J617L89q38l092m630o334h985K250b343C89a174j260m81Q92Q64A4K73
9547B87L5K93O07O4K04k32l82l7J17L4K39J63K95K32p3M14r2l30q24b81j247o43
9525b171j35c93A477K47j89J77o57B3d82j47i3B49b42F4a300l09J62M11J62c32
9504b42I1b17j047j597j208J68L05J599N78d32F62J348J280J215P27m39r77A681
9485a033k352L23J184D36J382J394L42n54p50p10o23a11j854j940k276k929q21
9468i931M894J672l02a496Q9j778J486D680O169P021K266L15j789o919D859G54
9451a616J11A56J797R45m28j196D2h42J84C61jh8j1D06R37R14L38L73K32O06j356
9430B450b21k913j969j236p92o30J791J503D84Q44M86K04n17J663E93a049j861
$$ plain form
9564 20758 22375 22764 21926 18834 14204 7870 -8985 -6735 -2343 389 -1174 -2434 -2915 -2023 -1159 14 287
9547 287 322 615 1222 1286 1490 1258 876 839 956 990 1229 1392 1687 1919 1846 2260 2168 1838 1014 -281 -1528 -2171
9525 -2171 -2306 -393 1477 1724 1535 1712 1055 23 -482 -629 -93 249 -242 64 -1300 -1609 -1447 -1036 -874 -332
9504 -242 91 -217 -1264 -2861 -4069 -3901 -3596 -1997 -1419 -432 662 2010 3290 4505 5232 4793 3816 1681
9485 -1033 -3385 -3062 -1878 436 1818 3212 3554 3000 2250 1540 917 -111 -1965 -3905 -6181 -9110 -9931
9468 -9931 -5037 -3365 -3667 -1496 -1407 -3185 -1699 4680 10849 17870 20136 20451 18662 11743 4859 754
9451 -1616 -1505 156 1953 2898 2470 1274 42 -842 -658 361 360 -88 -99 406 1343 2257 2595 2968 3200 3806 2450
9430 2450 -221 -3134 -5103 -6339 -7131 -7761 -5970 -4467 484 1328 1814 2018 1501 3164 593 -1049 -2910
9413b910a24q72E331N62r81j369o54q03p95F22B04O9J07b16h6E47M65B35e79j288
9393a867l24n02J013Q32c42a64B46O84b16o45H51J166P03K25k72o57p04n17a10
9373a065a31j58j113k037p45Q18J187Q94b59G18k22a70p86p94k87F1J921r7H03
9353g69j911q99L10P07L49O83J17j423j763k933N62K096J332N83k1L2J156O85
9335a107k03p44j206p74N16a116M36k05m14o31l17K81f40H14k50Q34n48e64k568
9316c132l117r00a923g29a15l97j081j761c06B712K161J448n4k521A640G6J181
9299A257a522M22d24j531M29M09c15A129A35a698j483n75j441J682f98A290J22
9282A412K1o00C89f0j103j477j163m7M24J392d57i9l68j468J32n93k07j30M83
$$ plain form
9413 -2910 -124 -996 5331 5893 4912 3543 2889 2086 1291 622 204 273 380 -216 -86 547 1012 235 -579 -1867
9393 -1867 -2191 -2693 -1680 -848 -342 -164 246 930 -216 -861 851 2017 2720 2945 2673 2016 1312 795 -110
9373 -1065 -131 -289 -1402 -3439 -4184 -3366 -2179 -1285 -259 718 496 -170 -956 -1750 -2037 61 1982 1885 803
9353 -769 -2680 -3579 -3269 -2562 -2213 -1530 -1413 -2836 -4599 -7532 -6970 -4874 -3542 -2959 -2980 -2948 -1792 -1107
9335 -1107 -1310 -2054 -3260 -4034 -3518 -1116 -680 -885 -1299 -1930 -2247 -1966 -640 814 564 1398 850 -564 -3132
9316 -3132 -6249 -7149 -1923 -729 -115 -512 -1593 -3354 -306 2712 4873 6321 6267 3746 1640 76 1257
9299 1257 -1522 -1100 -424 -1955 -1526 -1117 -315 1129 135 -1698 -3181 -3756 -5197 -3515 -698 1290 1412
9282 1412 1433 833 389 -60 -1163 -2640 -3803 -3850 -3426 -2034 -457 -99 -467 -1935 -1803 -2396 -2603 -2733 -2250
9263b250J53J011k2P3n46j036h34B86J284J242J063N03m3m98j165A203A16a127
9244a928N48e41B2R05J110N23j106e18j930kE95K307N07J20l70L82K52n11j070
9225B212q36Q9J154J882J788K187p09K73A686D77J069J274r48d32j937j725N24
9208c570J502R48o36j229k58J80J434J18j084m512K042h71B299O24M51J43M09
9191C926k9p54o53n53k19j5q0E78a544j040r09J575A871P87j062A00b63E77J526
9172B103J064P96n73q63j7j2m85n75G19B23L3Q36J482J461O08q30A484d66o46
9153a112p36j66j47J05N17j34k71n7l96k46M17M09L7l32n26o82j045k80J837f97
9132E59B13b9l95j127j173L93N04k80k40m36n72P8K1O88J086O85k3n9J36a27B67
$$ plain form
9263 -2250 -2097 -1086 -1108 -1035 -1581 -2617 -834 286 1570 2812 3875 4378 4335 3837 2672 1203 116 -1127
9244 -1928 -1380 -541 22 927 2037 2560 1454 -518 -2448 -2450 595 2902 3409 3529 3159 3541 3793 3282 2212
9225 2212 1376 1465 2619 4501 6289 8476 7767 8040 1686 477 1546 2820 1872 -432 -2369 -4094 -3570
9208 -3570 -2068 -1120 -1756 -2985 -3243 -3063 -1629 -1511 -2595 -7107 -5065 -871 2299 2923 3374 3517 3926
9191 3926 3897 3143 2490 1937 1718 1703 1623 578 -1544 -2584 -3493 -1918 1871 2658 1596 100 -263 577 2103
9172 2103 3167 3963 3390 2527 2510 2498 2013 1438 719 223 256 1092 2574 4035 4643 3813 1484 -466 -1112
9153 -1112 -1848 -2014 -2161 -2056 -1539 -1673 -1944 -2001 -2397 -2643 -2226 -1817 -1780 -2112 -2638 -3320 -4365 -4645 -2808 -697
9132 559 213 -29 -424 -1551 -2724 -2331 -1827 -2107 -2347 -2783 -3355 -3277 -3256 -2568 -1482 -797 -820 -879 -743 -127 267
9110c10j815j51a007c90h7l43j356j31p4N44N73K52l12l54n97g78A070K316J279
9091D665k86q43A565g39k508k026j345J232a999E61J681N67l61k21M52K49n60
9074B368n32l08j09M94Q60K29k38N8j19k71q18D2a054p30k89l38l28g76J98N2
9054e26J07k54p56m06j87J26O86L81N4O8R5m1q28j487j918j33a195A128J731Q74
9034C733O59p90j442G8a805k53C75K204K587K347K221j955B839d5k641m46GL094
9016C101K947J933J48k167k728f56j758K3O89d91A7M36q3c48j530j539j773Q71
8998d319b158g87a90I4c68j71r56q57i48F37k00d84k788r55r67J520J216M84k68
8979b242k72L82J034b07D10K59n1B75b81q94j243j182j833K682A21J607N30j8
$$ plain form
9110 -310 -2125 -2276 -1007 -390 -87 -430 -1786 -1917 -1991 -1447 -874 -622 -934 -1288 -1885 -778 1070 3386 4665
9091 4665 4379 3536 1565 -739 -3247 -5273 -6618 -5386 -1999 561 2242 2809 2448 2227 2679 2928 2368
9074 2368 1836 1528 1419 1913 2773 3002 2764 2822 2703 2432 1614 42 -1054 -1784 -2073 -2411 -2739 -776 -578 -526
9054 -526 -419 -673 -1429 -1835 -2022 -1896 -1210 -829 -775 -707 -612 -653 -1481 -2968 -4886 -5019 -1195 1128 2859 3733
9034 3733 4392 3602 2160 78 -1805 -2058 375 2579 5166 7513 9734 7779 2839 -45 -2686 -3132 7 3101
9016 3101 6048 7981 8129 5962 3234 -656 -2414 -2391 -1702 -491 17 453 370 -348 -1878 -3417 -5190 -4319
8998 -4319 -2158 -787 -190 94 -368 -539 -1495 -2352 -948 637 437 -484 -3272 -4227 -5194 -3674 -2458 -1974 -2242
8979 -2242 -2514 -2132 -1098 -207 410 669 618 275 -281 -1175 -2418 -3600 -5433 -2751 121 1728 2258 2240
8961B240j42M49M03j167b62j612M90a84I66J508J026M9q95j183m50h38j29fE74
8941a97j58C444L667K876M05L62m969A049a490j677P48c59G87B38a075j756m05
8924c236J427a15I90Q11k10n87a67r36n18J02o0q39j595j042o85J108O38J598
8906b396h13E37J137l00J24o97i32j479j302n00L32N35J313R53M67R5C3J725J505
8887C263J045pn16j131A307k58J017J109K20j96j8k3n99n79q30C59j55R0g99j641
8867b440P89L46n17h61h2A01a330j362p5O74h13C8c72q93j583j117j07K59J191
8848b622J271M98B24J090J76k38j4P31J107L08j57A371B29d91m44J06J8o66r74
8829b451k50P6f19F76O31M99k02m37m03D7a193q56n94k88j043j535K94K528G55
$$ plain form
8961 2240 2098 2547 2950 1783 -262 -1874 -1384 -184 966 2474 3500 3549 2654 1471 1021 -838 -967 -6 574
8941 -197 -355 3444 7111 9987 10392 10754 5785 1049 -1490 -3167 -2419 -359 787 238 -1075 -2831 -3236
8924 -3236 -1809 -115 990 1801 1591 1004 -167 -1103 -1621 -1519 -1579 -2418 -4013 -5055 -5740 -4632 -3994 -2396
8906 -2396 -813 537 1674 1374 1498 801 -932 -2411 -3713 -4213 -3881 -3346 -2033 -1080 -613 -518 33 1758 3263
8887 3263 4308 4301 3785 2654 1307 1049 2066 3175 3395 3199 3181 3158 2559 1980 1150 359 204 294 -799 -2440
8867 -2440 -1651 -1305 -1822 -861 -82 101 -1330 -2692 -2767 -2093 -813 38 -372 -1265 -2848 -3965 -4072 -3813 -2622
8848 -2622 -1351 -853 224 1314 1490 1252 1238 1969 3076 3384 3227 1371 229 -491 -935 -829 -811 -1477 -2451
8829 -2451 -2701 -2625 -619 676 1307 1806 1604 1167 764 47 -1193 -2049 -2643 -2931 -3974 -5509 -5215 -2687 755
8809B216k08I35H9K45J700Q45l88j045C31b06j00j33q5n69n7J62j29m0J12H9J849
8788A938J988R72M24l08j328q45K2J444k12o17j376j024A1K60O06N75J283J329
8770D064J481j39k049D68b299j04b29B399J478K8j173j084o32e83k383n08J434
8753b040b1I64Q47L12l43n90J319L54n29E07E6K830M898J28K33k202A916g26l68
8734a094E16J756o60a401j647J242F6e959m934m003O395I54i912o447c424E883
8717G723k037o42k02j430b187j8690o197J706J0687O703b645K93j034j782K16
8702d952k481n62r33n54K111b496j030e46j826k451J391c78J26D24o2m9h00j215
8684b015E94K166J216p08A280a098k847L97P92h19C35j30d58j552m54l94k41M78
$$ plain form
8809 2216 2008 935 89 334 2034 2879 2491 1446 331 -206 -306 -439 -524 -1093 -1150 -988 -1117 -1157 -1045 89 1938
8788 1938 3926 4898 5322 5014 3686 2841 2863 4307 4095 3478 2102 1078 11 271 877 1452 2735 4064
8770 4064 5545 5406 3357 468 -2299 -2403 -229 2399 3877 3905 2732 1648 1016 -583 -2966 -3474 -2040
8753 -2040 -21 964 1811 2123 1780 1190 2509 2863 2334 507 56 2886 7784 7912 8145 5943 1916 -726 -1094
8734 -1094 516 2272 1612 -1401 -3048 -1806 66 -5959 -10893 -14896 -8501 954 -9912 -16359 -3424 5883
8717 7723 5686 5044 4842 3412 -2187 -20877 -27074 -25368 -14681 -7978 -2645 -2352 -3386 -5168 -4952
8702 -4952 -7433 -7995 -8928 -9482 -7371 -2496 -3526 -546 -2372 -4823 -3432 -378 -252 424 362 313 -800 -2015
8684 -2015 594 2760 3976 3268 1280 -1098 -3945 -3548 -2756 -819 335 205 -458 -2010 -2464 -2858 -3099 -2621
8666b621J244f54m89n41k898l300k280j040p498K615M150N6K686M549f09I34P8
8649A012j44M57K34G48A40P34J272j91k7o37a00j725q57M20f13D54L59C44a333
8629c564K25h66A100N27j24D83f12m42k83l31m97m20O46N97o05j484l54a397H69
8609B530P39l98A104d30j187b70A824J233N60K54k83n22j178A38a362m00O1K23
8591a478j38n08J24q56k17P87h57b08q62j706j494j836b761A0J482J003j73A038
8572d91j547j116m41m42m03o55n83j327j187j402M82J785a542A523J865K55j531
8555B112F99Q0q7O54Q44N55L91o31j209e03j466k14j20l29M6a084G67J660J195
8536C622N43k67j05j109o11k34I06i68j259N15d82A388J122Q52O16j414j090l28
$$ plain form
8666 -2621 -1377 -654 -1143 -1684 -4582 -7882 -10162 -11202 -18700 -16085 -11935 -11879 -9193 -4644 -609 934 1012
8649 1012 868 1325 1559 748 140 874 2146 1955 1928 1291 -100 -1825 -2682 -2262 -613 454 813 344 -1333
8629 -3564 -3339 -866 1100 1627 1503 483 -612 -1054 -1337 -1668 -2165 -2585 -1939 -1342 -1947 -3431 -3785 -1397 869
8609 2530 3269 2871 1104 -430 -1617 -270 1824 3057 3617 3871 3588 3066 1888 138 -1362 -1762 -1701 -1478
8591 -1478 -1616 -2124 -2000 -2856 -3073 -2286 -857 -208 -1070 -2776 -4270 -6106 -2761 10 1492 2495 2322 1038
8572 -491 -2038 -3154 -3595 -4037 -4440 -5095 -5678 -7005 -8192 -9594 -9112 -7327 -1542 1523 3388 3643 2112
8555 2112 699 779 692 1346 2190 2745 3136 2505 1296 -503 -1969 -2183 -2303 -2632 -2586 -1084 767 2427 3622
8536 3622 4165 3898 3793 2684 2073 1839 906 -968 -2227 -1712 -482 1388 2510 3362 3978 2564 1474 1146
8518A146L66j83N18J653K95n29j178H03a205j027M3L58n65o37j13K78O36R85F18
8498A763r3k48c6k284h40B362J894M41j010j480I4i36j426p51JO98J036A551J442
8479B993r17n21k15J319J741K119j93j104n88K004J220n50B386I82D45a57B62
8461a0F06K21B89i04o63B55a860q87L38K61K49k67m15k79r30J264P99e31j39J69
8441e01G26J362N21r95b138J57B629L744J382n63B866h58l32D227M56A934L9d98
8422b386r07m48a555A0658N054N194j333J6784L248J7544P740K797M07j621n016
8407F1456o609p364r440r522r393p474m013f925k999o80M049K72K409A554n88
8392I66D49J37K740J158J1j248A575c08k587l417K725a581C93J030o54a72r08
$$ plain form
8518 1146 1512 1329 1847 3500 3795 3266 2088 803 -1205 -2232 -2189 -1831 -2396 -3033 -3146 -2868 -2232 -1247 618
8498 1763 1670 1422 -36 -2320 -840 2362 4256 4697 3687 2207 94 -936 -2362 -3113 -3112 -2414 -1378 1551 2993
8479 2993 2076 1555 1340 2659 4400 6519 6326 5222 4634 6638 7858 7308 2386 982 445 -157 262
8461 -10 606 827 289 -904 -1567 255 -1860 -2747 -2409 -2148 -1899 -2166 -2581 -2860 -3790 -2526 -1727 -531 -670 -501
8441 -501 726 2088 2609 1614 -2138 -1981 2629 6373 7755 7192 2866 -858 -1190 4227 4683 1934 1973 -498
8422 -2386 -3293 -3741 -1555 10658 15712 20906 19573 36357 39605 57149 64889 67686 68093 66472 61456
8407 61456 54847 47483 38043 28521 19128 11654 7641 -6925 -9924 -10604 -6555 -6283 -3874 1554 966
8392 966 449 586 3326 4484 4495 3247 1575 -308 -2895 -6312 -3587 -1581 393 1423 769 -172 -1080
8375a080j003j498G94R01l84f1j032a55k29g1A146J108m68B17a005j685l87c76
8356A418J424J37N0q24K2m27k52O66J294L72l9M38M3j450A009k13C30b28k8j272
8336a528j408j094N62a100C11Q47J039J379J080M21r19j142j358m45p9J204N54
8319B892n30q28A91i84o69m66K58M54M19q9j36j111%L39P02E24P38J690J000P0
8299D022J016K798L386M70p47k793C086D89a003j025n18L51e84A454J299M98r68
8282B283j058A45b80l0M1i2C72J160J287Q00j198Q73Q96J613O90R2n46j651j519
8263B869H33a661j982j264J343k005J426J962E96K303P61j581A10a414j045m07
8247b866m96oP65q2j45l97p00j042p79N70J621a584c26A000n8k38b8j039n09M43
$$ plain form
8375 -1080 -2083 -3581 794 1695 1311 -61 -1093 -155 -384 -71 1146 2254 1786 217 -1005 -2690 -3077 -376
8356 1418 2842 2979 3029 2205 2227 1800 1548 2214 3508 3880 3841 4279 4322 2872 1009 796 330 -228 -256 -1528
8336 -1528 -2936 -4030 -3468 -1100 311 1158 2197 3576 4656 5077 4158 3016 1658 1213 1134 2338 2892
8319 2892 2362 1534 191 -984 -1653 -2119 -1861 -1407 -988 -1077 -1213 -2324 -2324 -1985 -1283 524 1262 2952 3952 4022
8299 4022 5038 7836 11222 11692 10945 8152 3086 489 -1003 -2028 -2546 -2195 -584 1454 2753 3251 2283
8282 2283 1225 145 -280 -310 -269 -92 372 1532 2819 3619 2421 3294 4190 5803 6493 6585 6039 4388 2869
8263 2869 833 -1661 -3643 -4907 -3564 -5569 -4143 -2181 596 2899 3660 2079 110 -1414 -2459 -2866
8247 -2866 -3362 -3368 -2603 -2685 -2830 -3227 -3927 -4969 -5748 -5178 -3557 -1584 -326 1000 942 704 -28 -1067 -1576 -1133
8227a133b27A118N72l1m99r6A78h68l90p71p82k79P53B70K535J027j020D96a715
8207a243E66J194P07l20H69e71j230k52P97A064K261J088r37A543a42k139j973
8190d254j576K297f28F25N08C20h64r04j23A3J631J237O39p07o58H2b143k117
8172d260k365c209C40J964K93I19a454k037J13O21m5j20J9J205A800L232K389
8155G421o39j748k056G54g48A565l52C2a630k089l78N34R18Q70J47J98f42F1O19
8136F80P37M54k32F69B80c33o14l24a68A191O98m3l30G38a18j25n97p33m64J06
8116a931R25M70k23p08k6c4A528j21A46i34o3a59I59k21i83j411m27J045f92F75
8095A395J4m73l82L53L99Q1k84m26c12j123q6A94K204J630J166n25j651A203f30
$$ plain form
8227 -1133 -227 1118 1690 1659 1160 1064 178 -868 -1258 -2029 -2811 -3090 -2337 270 2805 3832 2812 496 -1715
8207 -1243 566 1760 2467 2147 869 -571 -1801 -2053 -1256 1064 3325 4413 3476 1543 -142 -2281 -4254
8190 -4254 -5830 -3533 -628 625 1133 320 -864 -1768 -1891 13 1644 2881 3520 2813 2155 82 -2143 -4260
8172 -4260 -6625 -3209 340 2304 2597 919 -1454 -3491 -3378 -2757 -2802 -2922 -2903 -1698 1800 5032 7421
8155 7421 6782 5034 2978 754 -748 1565 1213 32 -1630 -3719 -4097 -3563 -2645 -1775 -1628 -1430 -642 61 680
8136 680 1417 1871 1639 669 280 -333 -947 -1271 -168 1191 1889 1846 1516 738 -118 -243 -840 -1573 -2037 -1931
8116 -1931 -1006 -536 -759 -1467 -1493 -34 1528 1407 146 -934 -997 -159 959 738 -983 -2394 -2821 -1776 -692 675
8095 1395 1409 936 554 907 1306 1387 1103 677 -312 -1435 -1521 194 2398 4028 5194 4669 3018 1203 -630
8075b151j602j342j486m8L179G6K838J550J036J595N93A434B13i34j512m08h87
8057e10k073j362k48K14L74J82j43n64L47J574c10A544J529K60o08A65b445k664
8039e109l097j316n464g025K243j66J077a818J10J78m10M27K55c64C58L76K6d84
8020a254k07b21A111R45o34e12k178j776r18L47J316a412A68J462K79J77o1E38
8001C55J282J608j27A082b112l688m099L972j585L253K08k50j21J5Q70R0r7M7
7983c497K89M00n185L101J429J488o68a176iKq52A342K026J193p1k27j106j503
7965A654e3o64b98E1J311J456P73o05j106c70j022r29j636k261L85J589J983h40
7946d74j834j963J786f83a33k38j408A184l60P94N22F07O08b02j584j296k89L00
$$ plain form
8075 -2151 -3753 -5095 -6581 -6629 -3450 76 2914 4464 5500 7095 7688 1434 213 -934 -2446 -2854 -887
8057 -510 -2583 -3945 -4193 -3979 -3605 -3423 -3566 -4130 -3783 -2209 -310 1544 3073 3333 2725 165 -2445 -5109
8039 -5109 -8206 -9522 -14986 -7025 -4782 -4948 -3871 -1818 -1708 -1530 -1940 -1513 -1258 -364 358 734 760 -484
8020 -1254 -1461 -221 1111 2056 1422 -512 -2690 -4466 -5384 -5037 -3721 -1412 168 1630 1909 2086 2025 538
8001 355 1637 3245 3118 1082 -2112 -5800 -9899 -5927 -7512 -4259 -4051 -4301 -4422 -4407 -3537 -3447 -3544 -3497
7983 -3497 -3208 -2808 -7993 -4892 -3463 -1975 -2643 -1176 -9 -7 -859 1342 3368 4561 4490 4263 3157 1654
7965 1654 -53 -717 -298 51 1362 2818 3591 2986 1880 -370 -1392 -2321 -3957 -6218 -5833 -4244 -2261 -840
7946 -474 -2308 -4271 -2485 -683 -133 -371 -1779 1184 824 1618 2140 607 1215 -202 -1786 -3082 -3371 -3071
7928c071L39m72n232Q53K784n37J105J51r89J89J259a349G75R31J2p97A86a239
7909b587j067J22k0J556j22K39r01q19j57J264J232A030J817J253N85J46J78P0
7891E079K28J040N07j725k098M9p25A016D07a85m61R8J48A42O60O74J34m0O35
7872B205M41R91j451c61l420J280A361M081j7j850C4b192k608j603l160L409h34
7854C856P89m05j026J080N06j625q01r62C7b143R66a96j377a11A947J069L42k84
7836C074o18j052k63k74k39L015n47C88b710j545R24Q44Q10p58M97K85N16q8J28
7817a097M63l13q94j420k25K17L39O85i64G02J133M6J12F60d48n07n6m30p45J29
7797b057a008A88Q52O67q51C44iG45l04a538j841M61n06N25j409P72N48c4C164
$$ plain form
7928 -3071 -2732 -3204 -8436 -7583 -4799 -5336 -4231 -4080 -5069 -4880 -3621 -1349 775 1706 1718 921 186 -1239
7909 -2587 -3654 -3532 -3552 -1996 -2118 -1879 -2780 -3599 -3756 -2492 -1260 1030 2847 4100 4685 4831 5009 5079
7891 5079 5307 6347 6854 5129 3031 3080 2355 1016 407 -185 -646 -548 -400 142 802 1476 1610 1570 2205
7872 2205 2646 3637 2186 -361 -3781 -2501 1361 5442 5425 3575 34 -2192 -4800 -6403 -9563 -6154 -834
7854 3856 4645 4240 3214 4294 4800 3175 2374 1412 37 -2143 -1177 -196 -1573 -111 1947 3016 3358 3074
7836 3074 2456 1404 1141 867 628 3643 3096 388 -2710 -4255 -3331 -2487 -1677 -2435 -1938 -1653 -1137 -1225 -1097
7817 -1097 -634 -947 -1841 -3261 -3486 -3269 -2930 -2245 -964 702 1835 1881 1993 660 -448 -955 -1011 -1441 -2186 -2057
7797 -2057 -1008 188 1040 1707 856 344 -9 745 441 -1538 -3379 -2918 -3424 -2899 -4308 -3536 -2988 -34 3164
7777B302j017a50l843f45k50L08b4G01N2c942l603Q57J951l57M34a340A383J328
7759B711k09m67m20E75a842J83e07Q7j887j026a161Q2p39p54O43k70B24J243n02
7740I65a16j198j134j602q68J014J729IN62J471M64Q54J2m63n90n75B43a229j337
7721b566d07C685K035P98k047j444m74M40l03n25k91J94l36F77a07q16j495M68
7703a950o39o95j05O21a087b87M0B21J515J281j8r73B77g23j624j115O50a80A686
7683C275J18A262b228l27B466J2579J8409Q527P499L200n615j3691q910r738n793
7668H933j182B4M17J64Q59k7g3j775q52k036b202g38r39N15E75J463E50M12R1
7649A053J999A065a434l089q7J385e20F44l3I8A6Q11J693J725J178j166j091A384
$$ plain form
7777 2302 1285 -150 -3993 -645 -895 -587 -24 701 753 -3942 -7545 -6688 -4737 -5094 -4660 -1340 1383 2711
7759 2711 2502 2035 1615 575 -1842 -1659 -507 -420 -2307 -3333 -1161 -1079 -1818 -2572 -1929 -2199 224 1467 965
7740 965 -116 -1314 -2448 -4050 -4918 -3904 -2175 9 571 2042 2506 3360 3372 2909 2319 1744 243 -1229 -2566
7721 -2566 -407 3685 5720 6518 4471 3027 2553 2993 2690 2165 1874 2068 1732 677 -107 -923 -2418 -1950
7703 -1950 -2589 -3284 -3389 -2768 -1087 -287 -247 221 1736 3017 2999 2026 277 -723 -2347 -3462 -2812 -180 1686
7683 3275 3393 1262 -2228 -2555 2466 15045 33454 41981 49480 52680 47065 33374 24464 14726 8933
7668 8933 7751 24 441 605 1464 1437 -73 -1848 -2700 -4736 -2202 -738 -1677 -1162 575 2038 550 962 1053
7649 1053 3052 1065 -1434 -4523 -4610 -3225 -520 644 611 98 16 827 2520 4245 5423 4257 3166 1384
7630i44a7A371K47J39o14D16b56J1G13N50M51L81R59R11J062j140A581i24l736
7611d660m50R88J151M43N47q3k65j370p98q16l91j53M29K315a135A096K132R59
7593D187M2p62j553B90g49j309j26d21A144k74d61j383j672j293n12K13J555a402
7574A334K074k49j410a95k067j432J259C08K270R64J148o55j255A77b738k305
7558e043k003q72k11N26O67M29K041J132K73J017L07M5f47H97J442Nq53F78k10
7539D68oM88j08f98k229J442O14L23K11J68A869J524j20A306a120j395k59J005
7521a769P20L8l31l04l66N49f6B089J489Q13J88J9L94J4p15j309A019a469r55
7502b424N83a74A056J210p3K48M07A264h43k198j339J312e43C7M96L12K8M10P24
$$ plain form
7630 -944 -17 1371 1618 1757 1143 416 -256 -245 713 1263 1714 2095 3054 3965 5027 3887 1581 -924 -4660
7611 -4660 -5110 -4122 -2971 -2528 -1981 -2064 -2329 -3699 -4497 -5313 -5704 -5857 -5428 -3113 -1135 1096 3228 4187
7593 4187 4229 3467 1914 290 -749 -2058 -2184 -421 1144 870 -461 -1844 -3516 -4809 -5321 -5108 -3553 -1402
7574 1334 3408 3159 1749 -195 -2262 -3694 -2435 308 2578 3542 4690 4035 2780 177 -2738 -5043
7558 -5043 -7046 -7918 -8129 -7603 -6936 -6507 -4466 -3334 -3061 -2044 -1737 -1692 -647 897 2339 2344 1491 678 468
7539 468 462 950 842 -698 -2927 -1485 -871 -548 -337 -169 1869 3393 3273 1306 -1120 -2515 -2774 -1769
7521 -1769 -1049 -1011 -1342 -1646 -2012 -1463 -66 2089 3578 4391 4579 4598 4992 5006 4291 2982 1019 -1469 -2424
7502 -2424 -1841 -174 1056 2266 2193 2441 2848 1264 -843 -3041 -4380 -3068 -543 37 533 845 873 1283 2007
7483B007J87o21F26d63p40m51o13p27j99d25A667J887J986J364j569L697l967
7466E065j465l24K61Q54J912M19N014J06j370k099A260a246k117Q8J080i12l48
7449a260m40h39B95Q87J34Q11J81M82j147E73d30j449j819j544K332B67J807P19
7431B793o96H89a241e67F59n9B43i22j647J085C67b465j873p86n83l055k34J833
7413g163J637b511D00K994O0j665F73R29K007J310j255A614d362a830C899L646
7397G545q93A883c259m437d07F156N515N036K246n915E166B578f74j042C70L863
7381D233K848N748K043k369a882l853j6925Q845N876a982G82A21b549j649K51
7366c947m08j002M68K71b077B69J620r14K79j98a755l797j924L427a41C405O798
$$ plain form
7483 2007 2194 1573 626 -463 -1203 -1654 -2267 -2994 -3193 -425 1667 3554 5540 6904 5335 9032 5065
7466 5065 3600 3276 3537 4391 6303 6722 11736 11842 10472 8373 1260 -1246 -3363 -3275 -2195 -912 -1260
7449 -1260 -1700 -839 295 1182 1316 2127 2308 2790 1643 573 -430 -1879 -3698 -5242 -2910 267 2074 2793
7431 2793 2097 889 -1241 -567 659 600 243 -922 -2569 -1484 367 -2465 -4338 -5124 -5707 -8762 -8996 -7163
7413 -7163 -5526 -2511 400 3394 3454 1789 673 1602 3609 4919 3664 1614 -4362 -1830 3899 7545
7397 7545 6652 1883 -3259 -7696 -407 6156 11671 16707 18953 13038 5166 2578 -674 -1716 370 4233
7381 4233 7081 12829 14872 12503 -1882 -5735 -22660 -13815 -7939 -1982 782 121 -2549 -4198 -3947
7366 -3947 -4355 -5357 -4889 -4618 -2077 269 1889 975 1254 1056 -1755 -5552 -7476 -4049 -141 3405 10203
7349A0203R094O308A2393A069h680A394J0700J006m621g28j3567A3897M3860j0481
7335D7276j2927b15A7394Q9868P5949P2521O7671J01471J33937J45375J11309
7324H15495M6057m4039j07004j65137j70318j28018n9826k5507l6562F2079c769
7312g6q820l642A9597r84l71J29p559a2186K077J780k47n249l219k2161J2798
7297b6407Q481N951N27M721A048f37B913D64c081j771k422K532R69l578p20L237
7281d834R32j59j810m50J471l10a9E938L441n73k324B625a267l093n004k788j967
7264a4119M07f233B549O255K377j905G45g766j1936j6983j1708L783a4757K018
7250a2739d282F89N148N291J639P72K83K079L023N089m389m255k823l772N85B106
$$ plain form
7349 10203 19297 25605 12393 1069 -8680 1394 12094 13100 8479 -728 -14295 13897 57757 47276
7335 47276 34349 -215 17394 107262 183211 255732 323403 424874 558811 704186 815495
7324 815495 861552 817513 710509 545372 375054 247036 187210 161703 125141 62079 -3769
7312 -76 -8896 -12538 19597 18613 18242 18371 10812 -12186 -10109 -8329 -8576 -13825 -17044 -39205 -26407
7297 -26407 -17926 -11975 -11448 -6727 1048 -637 2913 464 -3081 -4852 -7274 -4742 -3773 -7351 -8071 -4834
7281 -4834 -3902 -4061 -5871 -6321 -4850 -5160 -19 5938 9379 8806 6482 2625 -1267 -4360 -9364 -12152 -14119
7264 -14119 -13712 -6233 2549 8804 11181 9276 745 -7766 -19702 -36685 -48393 -44610 -14757 -12739
7250 -12739 -4282 689 5837 11128 12767 13539 13822 15901 18924 24013 19624 15369 12546 8774 9359 2106
7233d716r783o988P282M547K076L038a771G12K174L543M985M29D821b47G527J3719
7217B1246c924l347D327J2101L527n571B609g269j167H91J765L3793j7326c7209
7202c828o408D8351L2364N3969K8829O0231k6199R563M0562R5670J70056K16501
7190G29897K26043K04314J19830L2440l6074r1858p0201l8399m6689q6049j59091
7179G84163j97554k08589j62835p7115m2790L3526J0115k6129l59j1422D0757
7167e2616j4097n66K2105J8448C475N861g243q904j9365R218R375c258A4442l400
7153A1042k910b474n332j183l162m91N268m414p5M598l681A846P281J0724J2229
7138C2080R800K184q098j3205m486B605a9763k0583j1790p769q680j2864b6520
$$ plain form
7233 -4716 -14499 -21487 -14205 -9658 -7582 -4544 -1771 712 2886 6429 11414 11843 4821 -247 7527 21246
7217 21246 -3924 -7271 4327 16428 19955 14384 2609 -7269 -8436 891 2656 36449 19123 -37209
7202 -3828 -10236 48351 80715 134684 163513 223744 197545 207108 247670 343340 513396 729897
7190 729897 955940 1160254 1280084 1312524 1276450 1184592 1114391 1075992 1029303 943254 784163
7179 784163 586609 378020 215185 138070 95280 128806 138921 112792 112433 101011 40757
7167 -52616 -66713 -67279 -45174 -26726 3475 9336 -7243 -16147 -35512 -26294 -16919 -3258 14442 11042
7153 11042 8132 -2474 -7806 -8989 -12151 -12642 -7374 -11788 -11863 -7265 -10946 1846 9127 19851 32080
7138 32080 41880 44064 35966 22761 18275 2605 -19763 -40346 -52136 -59905 -68585 -81449 -26520
7124a5495L538L029l623n502O6J205L207n80K40p02e094F482N920P80m165F24
7107d137j681J03q17n28k635b541A111b618n323p212J501K604J00e461K381G023
7090F086C18a557L30B78J925K543K423l418N280L93C355b53n612k900J053L417
7074d295B763o65a3k936J9G84J070M76d49l205A554J2754J4520P544j1591G397
7057a3753O050G203P350o565b413p054A05868J29293J75568J73625J04239J05015
7045G93608l395p6156j18431j86702A89618F3454l760N6390J3718k0221l4495
7034G5086l4455b7859a1864D429H5h594B492P820a1031j1656N381d807l351L20
7020g838l420k125O416a996E505J611k542O39K378N556m83k154l473A799m33R47
$$ plain form
7124 -15495 -11957 -8928 -12551 -18053 -17987 -16782 -13575 -14155 -13915 -14617 -5094 6482 12402 13182 9017 624
7107 -4137 -5818 -5715 -6532 -7060 -9695 -2541 1111 -2618 -7941 -15153 -13652 -11048 -10948 -5461 -3080 7023
7090 6086 318 -1557 -1227 278 2203 4746 7169 3751 9031 9424 3355 -253 -5865 -8765 -7712 -4295
7074 -4295 2763 2098 -13 -2949 -2930 784 1854 2330 -449 -3654 1554 14308 28828 36372 24781 7397
7057 -13753 -7703 7203 14553 7988 -2413 -9467 105868 235161 410729 584354 688593 793608
7045 793608 790213 714057 595626 408924 189618 63454 59694 116084 129802 109581 75086
7034 75086 40631 -27859 -11864 4429 85 -8594 2492 10312 -11031 -22687 -17306 -4807 -8158 -7838
7020 -7838 -11258 -13383 -6967 -1996 5505 7116 4574 5213 7591 13147 12664 10510 7037 1799 1366 2313
7004B313d86j290r54E6J858m81J05J839R78k44K394j036C86a654K79m886j713
6987g974m323P87N626b605B452p46c083j492l59J216K35j75O5B61K009R5b303
6969e647k312k85L288b08A8a165j836a490A102O23Q89L67r12o39m39c476r55J55
6951d276a990O31H02p1k03J653J663R28r64j170A141d46NA914Q46j156c03l339
6933c642l507j549K14L399b234k84j606j464QL13J201O94J502B1J526J101l28
6916B320A115g61k4e1m35o33K36G90J231K52L91k45l22N19j059k00D93a223l07
6897a530o60j511o8J76L84N97P66R11H4J068J656J279J088L49n75j342j136j168
6879A303j69l06l60e41j709j879j411k62K403a025C15J543R45N81N94n04q66r80
$$ plain form
7004 2313 -486 -1776 -2730 56 1914 1433 1538 3377 4355 4111 6505 5469 386 -1654 -1375 -6261 -7974
6987 -7974 -12297 -11510 -5884 -2605 2452 1706 -3083 -4575 -4934 -3718 -3483 -3658 -3593 261 2270 2365 -2303
6969 -5647 -7959 -8244 -4956 -208 18 -1165 -3001 -1490 1102 1725 2614 2981 2069 1430 991 -3476 -4431 -4276
6951 -4276 -1990 -1359 802 731 528 2181 3844 4772 3808 2638 1141 -446 -441 1914 2760 1604 -303 -3642
6933 -3642 -7149 -8698 -8484 -5085 -2234 -2518 -4124 -5588 -5580 -5267 -4066 -3372 -1870 21 1547 2648 2320
6916 2320 1115 -761 -785 -51 -486 -1119 -883 790 2021 2273 2664 2419 2097 2616 1557 1357 493 -1223 -1530
6897 -1530 -2190 -3701 -3769 -3593 -3209 -2612 -1846 -935 84 1152 2808 4087 5175 5524 4949 3607 2471 1303
6879 1303 1134 828 468 -541 -2250 -4129 -5540 -5802 -3399 -1025 315 1858 2803 3384 3978 3474 2608 1628
6861A628G91A28Ro5M48Q96M73J7p29a046p51l75Q20j423P88K42C8K350J539N15
6841D442Qj79m46m93k61p93m16n99i82r48j26N31O52E44O98Q73O53J28l50n08
6821B038K66P90L24J0j26r01G97f45j640k67J007d54B96q2f79m71J03M97D36N73
6801A009C54f55j455j92i22D74K84K53K77L40J57K81l27K60k96K82K64j24m56
6782A669n03l88k65L09P66J1F05i8E47O36K18a69k067j971j172o70J215J670g55
6762G90Q18Rj2k66m68a78j144o17L50a47A561K28o49P67N80J145O35l16q07m35
6742B709n70r21m06C96d19p56o45n26K85N46e75a69D1M40L77K41E23e59j271o42
6722b472k11N52P79m1r04q31J11N57p0l32P64h82B95J296J522Q47r63r26B56a297
$$ plain form
6861 1628 791 128 137 72 520 1416 1889 1906 1177 -1046 -1797 -2172 -1352 -2775 -1987 -1745 38 2388 3927 4442
6841 4442 4450 4271 3825 3332 3071 2278 1862 1263 -982 -1930 -2056 -1525 -873 544 1242 2115 2768 2896 2546 2038
6821 2038 2304 3094 3418 3428 3302 2401 797 -645 -2285 -2552 -1545 -454 296 214 -679 -1150 -1047 -550 436 1009
6801 1009 354 -655 -2110 -2302 -922 474 758 1011 1288 1628 1785 2066 1739 1999 1703 1985 2249 2125 1669
6782 1669 1166 778 513 822 1588 1599 605 -98 547 1183 1401 -169 -2236 -4207 -5379 -6049 -4834 -3164 -755
6762 790 1608 1617 1605 1339 871 -178 -1322 -1939 -1589 -147 1561 1789 1140 1907 2487 3632 4267 3951 3144 2709
6742 2709 2139 1218 812 396 -419 -1175 -1820 -2346 -2061 -1515 -575 -169 41 481 858 1099 523 -559 -1830 -2472
6722 -2472 -2683 -2131 -1352 -1393 -2297 -3128 -3017 -2460 -2530 -2862 -2098 -882 295 1591 3113 3960 2997 2071 256 -1297
6701a721F29J318l00i5j808p50a158G48Q16K22l93k56Q1M81m69k97a44p04n32
6682a380k847j887l492k520p24K328R53M598k101j114K145n318e526J105m471
6667h892p32K638r60q12J110L02J518K056a94C749J507Q6p80j920f68k663Q72
6650b459Q97d47E05J063N08k18E89a003o21J84M06j20k42j035r72j072J356i81
6631A077J641K8q97L19p11E37k0oN0M12L6D60A7Q32k6g2j419r94o51l39O44J254
6609a577h3A762J316J7P06A626E99a372c24A466M31r5k47p13h6j429l10K47l39
6590a917j119j162o64K89J345J361P81a84F22L88R75O78j80n07q88K28J312k14
6572B414q77p58A33E6R24P2M03K086q6j018f85j726e51G69m3e87r22g22E49P94
$$ plain form
6701 -1721 629 1947 1647 -95 -1903 -2653 -1158 748 1564 1786 1393 1137 1218 1699 1230 933 -144 -848 -1380
6682 -1380 -4227 -6114 -9606 -12126 -12850 -10522 -9569 -4971 -7072 -8186 -6041 -11359 -5526 -4421 -8892
6667 -8892 -9624 -6986 -7946 -8758 -7648 -7346 -5828 -3772 -194 3749 5256 5342 4562 2642 -668 -3331 -2459
6650 -2459 -1562 -447 505 1568 2076 1858 589 -1003 -1624 -1440 -1034 -1154 -1396 -2431 -3403 -4475 -3119 -981
6631 1077 2718 2746 1849 2168 1457 537 517 511 561 973 1009 460 17 849 823 -72 -1491 -2485 -3136 -3475 -2831 -1577
6609 -1577 -83 1762 3078 3095 3801 1626 599 -1372 -324 1466 1897 1802 1555 842 -86 -1515 -1825 -1578 -1917
6590 -1917 -3036 -4198 -4862 -4573 -3228 -1867 -1086 -184 622 1010 1985 2663 2483 1976 1088 1316 2628 2414
6572 2414 1537 779 133 56 980 1052 1455 3541 3455 2437 -685 -2411 -551 769 726 -587 -1509 -722 549 1343
6552A343N01r5o12D21c99n24N6G21J148KJ23m04m64l83L75j63R42k87q2F74a36
6530D8R83D62a494k861f95k204j850k650j367K199K567M57m40K43r69o8O73a421
6511G78J552J251L2l75k41m63o78H28m03d2o32c17A795J109A279P35M72J21R04
6492C511O30n98r52A188g39k150j030K5a197A423K110J036J59k06q23j137F10
6474a773l163k967J139N39b422M31r33l12a225A51P15l39m9J528J363JA657G89
6455B623N33K82m30r73a1k027j746k54J29J057a361A046K001Q85m37q21A251c22
6436b915J66A887L338M67j095B186i21k17B75R42J97q5G5a324j104L61P30a8B02
6416A12f6k13a00E40jL19l28J02q2b54j067l0l61j617k444m088L719m989N326
$$ plain form
6552 1343 1844 1749 1137 421 -399 -923 -867 721 1869 1871 1994 1590 1126 743 1118 955 1897 1610 1528 674 -136
6530 48 1031 462 -1494 -4355 -695 -2899 -4749 -7399 -8766 -6567 -4000 -3543 -3983 -3740 -4709 -4777 -4104 -1421
6511 778 2330 3581 3613 3238 2997 2534 1856 828 425 -42 -674 -317 1795 2904 1279 2014 2486 2607 3511
6492 3511 4141 3543 2591 1188 -739 -2889 -3919 -3894 -1197 1423 3533 4569 4728 4522 3699 2562 610
6474 -1773 -4936 -7903 -6764 -6225 -2422 -1991 -2924 -3236 -1225 151 866 527 478 2006 3369 3370 1657 789
6455 2623 3156 3438 3008 2035 -11 -2038 -3784 -4038 -3909 -2852 -1361 1046 3047 3932 3495 2674 1251 -322
6436 -2915 -2749 1887 5225 5692 4597 2186 -921 -1138 275 1217 1414 1329 75 -1324 -2428 -2067 -1337 -18 202
6416 112 -66 -279 -100 540 539 858 530 632 550 -254 -1321 -1351 -1712 -3329 -5773 -9861 -6142 -11131 -5805
6397e805e22J52A237h13n54p6a02H59j53f03k143o7J053A62J004j01E03G2B1c07
6376f67j149r25K12M70D73K827J983p2l95j740j501i58j831k092m22K115J331
6359a857j056o31n70j051K208B10K114J90r0n54K0Q6j93h51m960m059q89K237
6341h522J81m92J781b878D93L407N22J78A285g38K08H21k50b468O79L02P20K44
6323e23r80l52e99q14K92k67j44o66j291k85J01J053h88A272J355M93j192k57
6305A671L64a915p263K708E163N255m26k051k376a406j511j629k83b009q15j262
6289d086N0m91O38P81K01O18K86m5m36p49R89i51dq69j740m69l81j297n37J091
6269d206A82h33k152a219o33j91M3j78j8i22F45K568F57g84m65j19c25A334J540
$$ plain form
6397 -5805 -522 -370 1237 -813 -1367 -1443 -102 859 706 -603 -2746 -2813 -1760 162 1166 1065 503 72 21 -307
6376 -667 -1816 -2741 -2529 -2059 473 3300 5283 5211 4816 3076 1575 -958 -2789 -4881 -5303 -3188 -1857
6359 -1857 -2913 -3544 -4114 -5165 -2957 210 2324 2514 2424 1870 1890 1976 1783 -851 -5811 -9870 -10759 -8522
6341 -8522 -8341 -8833 -7052 -2878 493 3900 4422 4600 1285 -738 -530 821 571 -2468 -1789 -1487 -767 -523
6323 -523 -1503 -1855 -599 -1413 -1121 -1388 -1532 -2198 -3489 -3774 -3673 -2620 -888 1272 2627 3120 1928 1671
6305 1671 2035 -1915 -9178 -6470 5163 10418 9992 7941 5565 -1406 -2917 -4546 -4829 -2009 -2824 -4086
6289 -4086 -4036 -4527 -3889 -3108 -2907 -2289 -2003 -2048 -2484 -3233 -2244 -951 -4 -873 -2613 -3082 -3463 -4760 -5297 -4206
6269 -4206 182 -833 -2985 -1219 -1852 -2043 -2000 -2178 -2196 -922 645 3213 657 -784 -1249 -1368 -325 1334 2874
6250B874Q35K11n10p19j318E29B7c44Q9Q5j14n51p69r46j551j662j750J421J833
6231d259r9j242j81M74l01k26J90P55J817a404a02E2J253M61J53K92o14A79e11
6211e22k48L83J09j344k308l106j722n74J22K958A98K852L06C40d77j484P60q41
6193b042j472K01J205N11e73D67L6L05k61M00M50J127P56K45j385d90k844k140
6175e474J68J420a107C10J018m61a687E0M526P82O80k330D84d061l095M05K241
6158d510a756d80J57o98r57k288P6i62A540J588o5A004a407M91C66J598k82B84
6139B145K59O8m8k34j75m31F91b37n299K584D88d2j022o65k5k1C51J976J134K73
6119C734N43O15j187j352a641O1a04m91j405k576k10k368l477J322J208R62j39
$$ plain form
6250 2874 3709 3920 3410 2691 1373 529 27 -344 -255 -170 -284 -835 -1604 -2550 -4101 -5763 -7513 -6092 -4259
6231 -4259 -4358 -5600 -5781 -5307 -5608 -5834 -5644 -4889 -3072 -1404 -102 52 1305 1766 1919 2211 1597 179 -511
6211 -522 -770 -387 -278 -1622 -3930 -7036 -8758 -9332 -9210 -6252 198 3050 3356 340 -477 -1961 -1201 -2042
6193 -2042 -3514 -3313 -2108 -1597 -573 467 503 808 547 947 1397 2524 3280 3525 2140 -490 -3334 -5474
6175 -5474 -5306 -3886 -1107 310 1328 867 -1687 50 4576 5358 6038 3708 484 -4061 -7156 -6751 -4510
6158 -4510 -1756 -480 -323 -1021 -1978 -4266 -4190 -962 1540 3128 3063 1004 -1407 -916 366 1964 1682 284
6139 2145 2404 2472 2424 2190 2015 1584 691 -237 -5536 -2952 488 -42 -1064 -1729 -1754 -1775 351 2327 3461 3734
6119 3734 4277 4892 3705 2353 -1641 -1580 -104 -595 -2000 -4576 -4786 -7154 -10631 -9309 -8101 -7139 -7278
6102g278K07n34k248J359J71P87L8J187Q05M42b346B281P258M754o690J0090A341
6084c962j248Q51k64j072K407J057m676j006K394b707Q89n87J82r2N08b68E11
6066C11a347j418j892j211N08o76J458b189e44b47k13lj129j757q00a853M31o56
6048b078m6O21o7o46p54j896o22b035c38A74d59j496r75j538a186k10J82o58O1
6029a811N86D93Q01M06L0E06c09R0o28m998j586k46J889R23J642J403d60f6D57
6009D11F5f12l07b57a01B24L32M07M36K49n46a101j939J016e22E63J62B08h9l81
5989d70K27I28J333R87L46O57J249J087j37o68B256b591n221L733a011G5f75j089
5971a764j127k452J383N23a430J9k064k217b209A432J239j250c64j002n30L91
$$ plain form
6102 -7278 -7071 -7605 -9853 -8494 -8323 -7536 -7498 -6311 -5506 -5064 -2346 2281 9539 14293 7603 17693 1341
6084 -3962 -5210 -4359 -4623 -5695 -3288 -2231 -6907 -7913 -5519 -2707 -1818 -2405 -2223 -2315 -1807 -268 511
6066 311 -1347 -2765 -4657 -5868 -5360 -6036 -4578 -2189 -544 -247 -460 -463 -1592 -3349 -4149 -1853 -1422 -2078
6048 -2078 -2124 -1503 -1570 -2216 -2970 -4866 -5488 -2035 -338 174 -459 -1955 -2930 -4468 -1186 -1396 -1214 -1872 -1811
6029 -1811 -1225 493 1294 1700 1730 506 -309 -219 -847 -5845 -7431 -7677 -5788 -4865 -3223 -1820 -460 -66 457
6009 411 65 -612 -919 -257 -101 224 556 963 1399 1648 1102 -1101 -3040 -2024 -522 563 725 208 -89 -470
5989 -470 -243 928 2261 3248 3594 4251 5500 6587 6450 5782 2256 -2591 -7812 -4079 -1011 75 -675 -1764
5971 -1764 -2891 -5343 -3960 -3437 -1430 -1411 -3475 -5692 -2209 1432 2671 1421 -364 -1366 -1896 -1505
5955a505M21m06r77m09l29r77r55j2M82Q73J002L86q21j182J67c23D512N066L262
5936A2840N83k621n088j562L279r63B206C24e11j414O22b66m3A65O12Q66D55g08
5917b878M88k450j85j029r92q29o93N17q35R24M39K217K099a595d78D60J510Q40
5899B810J305J381R50J002A368b740l831l330L588b689J063Lq43l55a323A444
5882C362K383J663R35j335k999C47b607l096K03K107i38m23j592j013j452M34
5866d984K66k888k309K473c568e06A153O21C95b104j677J488f92C57a100k595
5850c695l588k003Q5J122O33k59q75k49K810a548B924M006L549J529m95j642j981
5833G890k483k063A398J164L11K016K947r76k086A659A80g04a69k19j20j42C13
$$ plain form
5955 -1505 -1084 -1490 -2467 -2876 -3205 -4182 -5137 -5149 -4667 -3794 -2792 -2406 -3227 -4409 -4242 -323 4512 9578 12840
5936 12840 13423 10802 5714 4152 7431 6468 2206 324 -511 -1925 -1303 -266 -309 165 777 1643 455 -708
5917 -2878 -2390 -4840 -5025 -6054 -7046 -7875 -8568 -8051 -8886 -7962 -7523 -5306 -3207 -1595 -478 460 1970 2810
5899 2810 4115 5496 6446 7448 1368 -2740 -6571 -9901 -6313 -2689 -1626 -1623 -2466 -2821 -1323 1444
5882 3362 5745 7408 8343 7008 4009 347 -2607 -5703 -5500 -3393 -938 -1361 -2953 -3966 -5418 -4984
5866 -4984 -4718 -7606 -9915 -7442 -3568 -506 1153 1774 395 -2104 -3781 -2293 -692 357 -1100 -3695
5850 -3695 -7283 -9286 -9201 -8079 -7446 -7705 -8580 -8829 -6019 -1548 2924 6930 10479 12008 11513 9871 7890
5833 7890 5407 3344 1398 2562 2873 4889 7836 6860 4774 1659 180 -704 -169 -388 -508 -650 313
5815G64b58j59D15Q19P87N16j27I70a12A25b85A017m74b217l513o100n938n075
5797b2843k972p99M054M592J547J241j565Q7n25K062K057K898a734j276L81l39
5781b968J07A90K166J800J135n11n25k52j446A036b10n22A02K250J622J149J186
5764F309J09j231j815G63a138j02d65n15j527j833k174J124K341i13E97O40K8
5747A265C61e58n75n18j185j026k09J255i83C11A53b59G28J147P35J40o2A303
5728e40j593l19M92g03K64j3a8D48L16J16C85Q0A76K39j85N34J158N70m05o55
5708A432m93B82H9b49r7o2B5J454N76m7n17m20k2O6Q62P42n38H29A72J011J07
5687A290P03k6K68o18M77a80o33J44m2j328K50d85H69k4c17j550M7a25B076l57
$$ plain form
5815 764 -258 -417 415 1234 2021 2537 2410 970 -112 125 -285 1017 543 -2217 -5730 -11830 -17768 -22843
5797 -22843 -25815 -26614 -22560 -17968 -16421 -15180 -16745 -16658 -17183 -15121 -13064 -10166 -1734 -3010 -2629 -2968
5781 -2968 -2861 190 2356 4156 5291 4780 4255 4003 2557 1036 -210 -732 102 2352 3974 5123 6309
5764 6309 6418 5187 3372 763 -1138 -1240 -465 -980 -2507 -4340 -6514 -5390 -3049 -913 597 1237 1265
5747 1265 361 -558 -1133 -1651 -2836 -3862 -4071 -2816 -983 311 153 -259 728 1875 2610 2750 2688 1303
5728 -540 -2133 -2452 -1960 -703 -439 -452 -18 448 764 880 385 465 176 415 230 764 1922 2492 2087 1432
5708 1432 939 282 89 -249 -346 -408 25 1479 2055 2008 1491 1071 1049 1115 1977 2719 2181 829 172 1183 1290
5687 1290 1993 1967 2235 1617 2094 -180 -813 -669 -711 -2039 -1789 -485 869 845 -317 -1867 -1820 -125 2076 1719
5667A719J520J465O85p00r80j824h21k295K88a88A640N42p41D44b14C21a78q06
5649i84m54k55r8L9K54o1N1r4P20L73L1b07j08g0C35Q03J132J422J235Q03N27
5628F257n91j597A472f12J1B72n6g32j347k018J570A211K128O19l35m99m34j076
5610A614p45Eg91F69K638R94n5j072j565c59j444b36B798K310J624K13O54k161
5592E438j769p49o68n13l05F43e14p71B58K867K913J988k92j879j481j346E67
5574a125j269j043N98J113b75C85d4l93o92N29j52n50m46o30m27M09n87P9j376
5555d280A379K843J307j858I31A62f94p18N01I42L440K905K196J534J212j888
5539A0341J0607Q71G411A481a4184j2159O564N626N663E480N158j905B237c818
$$ plain form
5667 1719 3239 4704 5389 4689 3709 1885 -821 -3116 -2828 -188 1640 2182 1441 444 -214 321 -178 -984
5649 -984 -1438 -1693 -1791 -1752 -1498 -1559 -1508 -1602 -882 -509 -478 -207 -315 -70 335 1138 2270 3692 4927 5730 6257
5628 6257 5666 4069 1472 -612 -601 272 216 -732 -2079 -4097 -2527 1211 3339 3958 3623 3124 2690 1614
5610 1614 869 5 -791 669 3307 4301 4246 3174 1609 -359 -1803 -236 2798 5108 6732 6945 7599 5438
5592 5438 3669 2920 2252 1739 1434 643 -514 -1285 258 3125 6038 8026 7734 5855 4374 3028 567
5574 -1125 -2394 -3437 -2839 -1726 -275 385 -44 -437 -1129 -600 -752 -1302 -1748 -2378 -2805 -2396 -2983 -2904 -4280
5555 -4280 1379 4222 5529 3671 931 162 -694 -1412 -911 942 4382 7287 9483 11017 12229 10341
5539 10341 20948 21819 7411 1481 -14184 -26343 -19779 -14153 -8490 5480 10638 8733 2237 -3818
5524h428m16M284O80a684b53o083j522L731C91J939K632o94J945j650J365B229
5507a041d72l87m691a342e93j165r74q15r01L00M42J267B31Q42N92J475N36q73
5489B803m34J60K47J008J252O44M57m32r72j997G28a361j139n84n42j22J077a048
5470I90J327J013o5p28p02m02O6k52b33k180a188D869r31L038P33j711j874j462
5452B662a187l37r89K91m24J160k52j236a369I63K053J3J871j14p04j83l3j15
5434C751m79A155A75e58j246k241k001P97K139e74A298N31p40E33iG04P19J901
5416C324K113P5j974j308A021C34b67k44J89i6q44j227r34r22j254k239j856L282
5398f090k532J880J254Q70K259d81F50J53j02j16M24M83N87R05O22Q67p8j9l29
$$ plain form
5524 -8428 -8844 -4560 -3880 -1684 -253 -6336 -7858 -4127 391 2330 4962 4268 6213 4563 5928 2229
5507 -1041 -472 -859 -5550 -1342 -593 -1758 -2732 -3547 -4448 -4148 -3706 -2439 231 1073 1665 3140 3676 2803
5489 2803 2369 2529 2776 3784 5036 5680 6137 5705 4733 2736 728 -1361 -2500 -3084 -3626 -3748 -2671 -1048
5470 990 2317 3330 3265 2537 1835 1433 1499 1247 -233 -2413 -1188 4869 3938 6976 7709 5998 4124 2662
5452 2662 -1187 -1524 -2513 -2222 -2646 -1486 -1738 -2974 -1369 963 3016 3029 4900 4786 4082 3899 3866 3751
5434 3751 3272 1155 175 -558 -1804 -4045 -6046 -5249 -3110 -574 1298 1829 1089 533 -9 704 1423 3324
5416 3324 5437 5512 3538 2230 1021 334 -267 -511 -322 -96 -940 -2167 -3101 -4023 -5277 -7516 -9372 -6090
5398 -6090 -8622 -6742 -5488 -4618 -2359 -481 650 803 701 585 1009 1492 2079 2984 3606 4473 4395 4376 4047
5379D047A570B53H2k9e24j220j237j134M64a469G80P88l71F1h35p26q49m23l52
5360c185O96i52c45J45n32p11l28m21k74%j23m98L27R24R08K96J23l34l22J84
5340i81D72K537J832p7j079j322A115R34O09m24A062g61k229j337b056A168J450
5323B618P34r58C44a614j485j085n11M51J822a31D62j70d09l56g8A96F5h76j888
5304b764k42f22A670P05j6j35R41J452K874M955K836j975D463A263a044k073j208
5287d325b101e0r18j836k042Q67J973L54A618A51a60P7o10j263j028J097g41B07
5268a59m08K14o99l31f36K09q80j961m37P59J102Q14F52K832K806P47j878j585
5250C574b315n007a941A097J244J257j636a685k109O3n30J095a410A113J859O65
$$ plain form
5379 4047 1570 253 82 53 -524 -1744 -2981 -4115 -3651 -1469 780 1568 1197 61 -835 -1561 -2410 -2833 -3185
5360 -3185 -2489 -952 -345 -200 -732 -1443 -1771 -2192 -2466 -2466 -2589 -3087 -2760 -1836 -928 -632 -509 -843 -1165 -981
5340 -981 472 3009 4841 4764 3685 2363 1115 2049 2658 2234 1062 -761 -2990 -4327 -2056 1168 2618
5323 2618 3352 2394 344 -1614 -3099 -4184 -4695 -4244 -2422 -131 462 292 -409 -765 -78 196 65 -876 -2764
5304 -2764 -3006 -622 1670 2375 2359 2224 3165 4617 7491 12446 15282 13307 4463 1263 -1044 -3117 -4325
5287 -4325 -2101 -50 -968 -2804 -4846 -3979 -2006 -1652 1618 151 -160 -83 -693 -1956 -2984 -1887 -741 207
5268 -159 -567 -353 -1052 -1383 -636 -427 -1307 -3268 -3705 -2946 -1844 -1030 652 3484 6290 7037 5159 3574
5250 3574 -2315 -7322 -1941 1097 2341 3598 1962 -1685 -3794 -3731 -4261 -3166 -1410 1113 2972 3637
5234C637J907J763A072f515A969Q984b1F878J2435n962M728l432b4088o84J1723
5219a3049O387l32J383J452a800I04K140J431N13p77r59a80k240o24n13j134R38
5202c753O28R02A55L166j84F56b266l444j578b511O79h32c86E27a05a2E93L385
5184C978L149M308N002J273M182M56l226H874i15m069K148J178d09A46A1N13J224
5167A748P46p75a871k536a071L43j525P61C82J423G94a303j425k500R23g91L52
5150d39l280q82J318f04b53C22M94J255O26O56K98k50n94l1Jq23D42g03j642j711
5130d056J171J329C90J750M48p6j179D10g87K62j844f98m340l932k744K491b632
5112b749d7E19L41A61a585m48n51q33J06M34k40l19N3P11P82Q38L58q3k38r17
$$ plain form
5234 3637 5544 7307 1072 -6515 1969 10953 -21 6878 19313 13351 18079 14647 -24088 -24772 -13049
5219 -13049 -6662 -6994 -5611 -4159 -1800 904 3044 4475 4988 4211 3252 -180 -2420 -3044 -3557 -4691 -3753
5202 -3753 -3125 -2223 155 3321 3137 656 -2266 -5710 -7288 -2511 -1832 -832 -386 527 -105 -12 593 3978
5184 3978 7127 11435 16437 17710 21892 22348 19122 8874 -915 -4984 -2836 -1658 -409 146 11 524 1748
5167 1748 2494 1719 -1871 -4407 -1071 -728 -2253 -1492 382 1805 794 -1303 -2728 -5228 -4305 -791 -439
5150 -439 -3719 -4601 -3283 -604 -253 322 816 2071 2697 3353 3651 3401 2807 2776 2777 1954 442 -703 -2345 -4056
5130 -4056 -2885 -1556 390 2140 2588 2512 1333 410 -787 -525 -2369 -698 -5038 -8970 -11714 -9223 -2632
5112 -2749 -47 519 860 161 -1585 -2033 -2584 -3417 -3311 -2877 -3117 -3436 -3383 -2672 -1890 -1052 -694 -777 -1015 -1932
5092a932o38M6P79N76j74l62n01J60K12L50L65j04LL21C16J546J627R95M55j01
5072D838N27R27J43l62k215A873h93r44L39o16n55J198A476K903J649O85j15M96
5054G094l410A568a81p51k12o74r64lK43K99N22P37H07l47a863m203j141L191
5036d016a240E08J376N81n11o46n04a91I6J12b82q33n46j38m03p00j160j004j367
5017f433j519j121c668J612m78j107O97L40M30R71A167K290K264Q55M34j181B552
4999E26a093r5L63d9A43g83r76j239p21O92K25J135O75D39M20C53fC35L44l00
4979C79d01p19j077j250k83Q23a342I01J606L21k20q67E72g23j029m89n40n17
4961c298h22A513J794l34A287i34j743a328A098J169k32q46A30d52n55o05m61
$$ plain form
5092 -1932 -2570 -2524 -1745 -1169 -1343 -1705 -2206 -2046 -1834 -1484 -1119 -1223 -1220 -899 316 1862 3489 4484 4939 4838
5072 4838 5365 6292 6435 6073 3858 1873 -893 -1837 -1498 -2114 -2669 -1471 1476 4379 6028 6713 6598 7094
5054 7094 3684 1568 -181 -932 -1144 -1818 -2782 -2785 -2542 -2243 -1721 -984 807 460 -1863 -6066 -7207 -4016
5036 -4016 -1240 508 1884 2465 1954 1308 804 -191 96 208 -282 -1115 -1661 -1799 -2202 -2902 -4062 -5066 -6433
5017 -6433 -7952 -9073 -3668 -2056 -2534 -3641 -2944 -2604 -2174 -1203 1167 3457 5721 6576 7010 5829 2552
4999 526 -1093 -1188 -825 -49 143 -783 -1759 -2998 -3719 -3027 -2802 -1667 -992 439 859 353 -6 335 679 379
4979 379 -401 -1120 -2197 -3447 -3730 -2907 -1342 901 2507 2828 2608 1741 572 -723 -1752 -2241 -2781 -3298
4961 -3298 -822 1513 3307 2973 1287 -934 -2677 -1328 1098 2267 2035 1189 130 -452 -1007 -1612 -2073
4944b073a84B016K99n53F47a081j536j594j519J14J739P73a206I48J744Q17k48
4927C261q02r49m30K70k55m87a89j557m77I67J367J45n95k77pj48B74i88M17A526
4906C016j092G8a890n56K82a068C4P53L53B66h46l06L09j233r90q48M11J201J066
4887a236L00k5o33j02g22B30O06Q13L93K44J18l8l58o18E62b37j38j25i7C58L49
4866G07C24d59q1J78G05N86rm02k93J86P98J013P53N9j8q48r82E26a98p85l06
4845a289L7a28B168K123J989j748j083j6J82l75l21o01l44k22O91m33A004c32
4826a335L54c71A43b78j254j88P93M25C11J112M18o06D28a362J22F43J177M28
4808B248j21r39b07k522n88k3J33K45J033c55A438K642J521j91q86j376l15I79
$$ plain form
4944 -2073 -184 2016 2315 1762 647 -1081 -2617 -4211 -5730 -5616 -3877 -3104 -1206 948 2692 3509 3261
4927 3261 2459 1510 1080 1350 1095 608 -189 -1746 -2223 967 2334 2479 1884 1607 1600 1452 274 -988 -571 1526
4906 3016 1924 78 -1890 -2446 -2164 -1068 34 787 1140 266 -846 -1152 -843 -2076 -3066 -3914 -3503 -2302 -1236
4887 -1236 -936 -961 -1594 -1696 -722 230 836 1649 2042 2286 2404 2366 2008 1390 562 -237 -375 -500 -97 358 707
4866 707 324 -459 -540 -362 705 1291 1282 880 587 773 1571 2584 3337 3396 3378 2530 1548 526 -198 -983 -1289
4845 -1289 -1252 -128 2168 4291 6280 4532 3449 3433 3615 3240 2919 2318 1974 1752 2443 2010 1004 -332
4826 -1335 -981 -371 143 -278 -1532 -1720 -927 -502 311 1423 1841 1235 428 -1362 -1240 643 1820 2248
4808 2248 2127 1188 -207 -2729 -3317 -3340 -3207 -2962 -1929 -355 1438 4080 5601 5410 4524 3148 2833 979
4789C66d22j89k84Lp1K9K81K5M5J08E6g26j146l28o744b943i02A6R5J03B0f51
4766a512p24n2M80o5l61j12a013A350J387l01r22D81e2j39f9a7A25m7K94Rj23
4745B58b029j01P60b37E40J99J15J94J51M86Q72N78p7r70r01A25a018k52d1A149
4724F24g85j238J41e85E72M35B48a117j793l50J118i23d9C40d8p84j018p23m40
4705c013l72J605a08G92NH8e51m29j5o9j448a241A830L02L86M69K55j02l46m12
4685B382o60H22a141B720A011h93k401r91k93n65J360a764I7K464J549L37n97
4668C850r47A060a466j991J116J122n2j023o74J323a52I00K05D41i94j711q41
4651c546K64a520H34Q61m09o13bk75aA070O43p92d30j395j992j509q79p72P37
$$ plain form
4789 366 -422 -611 -895 -892 -963 -934 -653 -628 -583 -475 56 -726 -1872 -2200 -8944 -2943 -902 16 111 214 20 -651
4766 -1512 -2236 -2288 -1808 -1873 -2234 -2346 -1013 1350 2737 2436 1514 481 -52 -191 -69 -17 125 78 372 381 258
4745 258 -2029 -2130 -1370 -237 540 739 854 1048 1199 1685 2557 3135 3058 2088 1187 125 -1018 -1270 -41 1149
4724 624 -785 -2023 -1882 -585 572 1007 248 -1117 -2910 -3260 -2142 -923 -49 340 -48 -832 -1850 -2573 -3013
4705 -3013 -3385 -1780 -108 792 797 88 -551 -980 -995 -1064 -2512 -1241 1830 2132 2518 2987 3242 3140 2794 2382
4685 2382 1722 822 -1141 2720 1011 -893 -3294 -4285 -4578 -5143 -3783 -1764 97 2561 4110 4447 3850
4668 3850 2903 1060 -1466 -3457 -2341 -1219 -1271 -2294 -2968 -1645 -152 900 1105 441 -994 -2705 -3546
4651 -3546 -3282 -1520 834 1695 1286 673 -2 -277 -1 1070 1713 921 -430 -1825 -3817 -5326 -6205 -6977 -6240
4632f240J518Q37J323a049F3Q47j76a77j587j100j353j407j21K219a163A002J265
4615B267K2o01q23G2N33J176J274R17pq08G61a143K33B544K981K713L95Q95j156
4596H372C729R8k4P25R73q95j577A202f74j844r45j97J11j09p4N84J411c1H98
4576A385K95J54m4R8l73l67A51c11H36L90l56K17C96a123M36q03D14c04k461j059
4556c824J576a82A680Q71k95r30a86j532j637N75j247L68o52q6a797A256K881
4539D137R55l62k298j083a258k837f58A353M323L695P886J08q078b059l06F57
4522A0038J0020P351Q496J2965L4474O2271O3341N0088K8466O070l0069n2269
4510B11242n8697n7490m4106j8668Q81pr517D646M863N30J865N547p743Q045n061
$$ plain form
4632 -6240 -4722 -3885 -2562 -1049 63 910 734 -177 -1764 -2864 -4217 -5624 -5745 -3526 -1163 1002 2267
4615 2267 2289 1688 865 72 605 1781 3055 3972 3965 3157 761 -1143 -910 2544 5525 8238 8633 9528 8372
4596 8372 3729 3827 3803 4528 5501 4606 3029 1202 -674 -2518 -3463 -3660 -3549 -3658 -3732 -3148 -1737 -31 898
4576 1385 1680 1834 1790 1888 1515 1148 151 -311 836 1226 870 1087 396 -1123 -687 -1490 414 -304 -2765 -3824
4556 -3824 -2248 -182 1680 2551 2256 1326 -186 -1718 -3355 -2780 -4027 -3659 -4311 -4397 -1797 1256 4137
4539 4137 5092 4730 2432 1349 -1258 -4095 -658 1353 5676 9371 17257 17365 9287 -2059 -2365 657
4522 10038 20058 27409 35905 48870 83344 145615 208956 259044 287510 293580 263511 211242
4510 211242 152545 95055 50949 32281 33162 33155 23638 4646 9509 10039 11904 17451 9708 17753 12692
4495A2692c251J105b55k027m197jo74J826J133e30B348K573j16j455n10J380l97
4478C823o48j356d40J41A356o57O07K104K028r52k192D65R88j83J573K586j280
4461D149j111C92i4k292p91k03Q34j81p8N75E1K870N63o5l56p01q02B84a105J67
4441i38B64Q5b63c3A95Q5P53J784J233l52r26A381D52Cb30b9l94A51O19N74P6
4420A420J78F94K99R63J26n36p21C28c82A459N37n32f4j906m73L16f70H89J350
4401B239l90j22q33d33r20J83B08O51B11K45h33n49r51R45M40L81l7J77c6A31
4380d77n01j059j51K2L82N40r2o50q42r06n81m19k02o9N70J778d28A291J211K78
4360B780M83O84L80L8p48j097E13a003O9q21n27k0J076A274K640K520L05j747
$$ plain form
4495 12692 -3251 -2146 -255 -2282 -6479 -6480 -7154 -5328 -4195 -530 2348 4921 4805 3350 2840 4220 3823
4478 3823 3175 1819 -440 -299 1356 699 1306 3410 5438 4486 2294 465 1453 1270 2843 5429 4149
4461 4149 3038 392 -94 -2386 -3177 -3380 -2546 -2727 -2805 -2230 51 2921 3484 3419 3063 2362 1560 284 -1105 -938
4441 -938 264 349 -263 -33 195 280 1033 2817 4050 3698 2772 1381 452 3 -230 -29 -423 151 770 1344 1420
4420 1420 1598 694 993 1956 2082 1546 825 328 -382 1459 1996 1464 -64 -1970 -2443 -2127 -670 889 2239
4401 2239 1849 1727 894 -433 -1353 -1170 208 859 211 456 -833 -1382 -2333 -1388 -948 -567 -604 -427 -36 131
4380 -477 -978 -2037 -2188 -2166 -1784 -1244 -1336 -1986 -2828 -3734 -4315 -4734 -4936 -5005 -4435 -2657 -428 1291 2502 2780
4360 2780 3263 3947 4327 4365 3617 2520 513 -1003 -934 -1755 -2282 -2302 -1226 1274 3914 6434 6739 4992
4342D992j621A534e50j146f08D5i2m59j04b41k70p45k174q75J82J221i61g6L0
4323d6A42K79J309L40m02P19L53J43Q40Q55N54M57q32o90j283k63o70q10B86G9
4302A294J765J393J04q23j021o08o98n19B99j02c87A61J342J012P96J147R10j039
4284D329o13j506C30b14j930n00i03I16r4h4l75k76J69a67C91N9B03f18p28n65
4264a911k00f96I35J040R50j85m88r14l49K06k27C92a864j218O6a395E10J271
4246A781M51o53e80k369j419j894r10n32J397K496a154A145J317R21j68p47A053
4228c54n27n36L94K55K4j159o47L40J001A0J177R09p3J27R2m69o25m05k6L96O95
4207A808L31L95J12k67D44a504j406O6R91P94M99B19R33J300Q00L23k86j272E08
$$ plain form
4342 4992 3371 1534 -550 -1696 -608 45 -92 -551 -655 -241 -511 -1256 -3430 -4305 -4123 -2902 -961 -76 -46
4323 -46 142 421 1730 2070 1668 2387 2740 2883 3723 4578 5132 5589 4757 4067 2784 2521 1851 1041 286 79
4302 1294 3059 4452 4556 3733 2712 2104 1406 887 299 197 -387 161 1503 2515 3311 4458 5368 4329
4284 4329 3716 2210 330 -214 -2144 -2644 -903 916 822 -84 -459 -735 -566 -167 391 450 203 -618 -1346 -1911
4264 -1911 -2111 -696 935 1975 2925 2740 2252 1338 989 1195 968 392 -1864 -3082 -3016 -1395 510 1781
4246 1781 2232 1579 -580 -2949 -4368 -6262 -7172 -7704 -6307 -3811 -1154 1145 2462 3383 3215 2468 1053
4228 -354 -881 -1417 -1023 -768 -744 -1903 -2550 -2210 -1209 10 1187 2096 2023 2150 2242 1773 1148 743 717 1113 1808
4207 1808 2139 2534 2646 2379 444 -1504 -2910 -2844 -1853 -1059 -560 219 1152 2452 3252 3575 3289 2017 508
4187h83j249r75p94k44F53K645k73j249a6j243m45f32A237J391n85o47n03C21
4168c85p32J01E27J657n17g5j486o62q1K7J075A16R63P76P55J22k00q94G71F9
4147e51p25q81j176j453a768E47J037L56I10B56R05L84P55M66H88a80k198q35
4129c213J081J021N51j78k42j27K26Q1c36D15J217J259J027J295l9j068B004a041
4110d314a512G0K30a73r64q50Kh42G85R99l65C5a063r24j290m124K718J165J131
4091b387J06j03N40c57A464P89o14G05j57R83N06n74C52a737k024k740j939j583
4073a0023R44R7J985i80B31R52J9n19A40e2E40Q41K11n02c05o32P9K06K80I8N88
4052F86j30E7g85q11k20L55K01n11l23n43n36k91Q80a149E47J401O99N67L89n07
$$ plain form
4187 -883 -2132 -3107 -3901 -4145 653 3298 3025 1776 -16 -1259 -1704 -632 1237 2628 2043 1396 893 321
4168 -385 -1117 -1016 527 2184 1667 -75 -1561 -2223 -2304 -2277 -1202 116 1079 1855 2610 2732 2532 1638 771 69
4147 -551 -1276 -2157 -3333 -4786 -1768 547 1584 1940 910 256 1161 1545 2300 2766 888 -180 -2378 -3213
4129 -3213 -2132 -1111 -560 -738 -980 -1107 -881 -800 -336 415 1632 2891 3918 5213 5174 4106 2004 -1041
4110 -4314 -1512 70 300 -173 -1137 -1987 -1985 -842 785 1784 1419 35 -1063 -1987 -3277 -7401 -4683 -3518 -2387
4091 -2387 -2281 -2384 -1844 -357 1464 2253 1639 705 548 1531 2037 1463 352 -1737 -3761 -6501 -8440 -10023
4073 -10023 -9079 -8982 -6997 -980 231 1183 1202 683 140 -52 540 1381 1592 1090 -305 -937 -858 -652 -372 98 686
4052 686 556 57 -785 -1596 -1816 -1461 -1260 -1771 -2094 -2637 -3173 -3464 -2584 -1149 547 1948 2647 3214 3603 3096
4032C096o70j155g3o57p82n00P8J10m06r44P40b11A425P88J011o81M41b71k748
4013c019k860R47K006J040R3o38r9M23BJ326l11B19e97K95I49R85N3r17f90j596
3993b286j774J385d81J85n32j132p78l29K26P42M97g11b80l04o4B67J028O33J99
3974B127k8m64A87h00p95q99j48L12l5l11o92m88J65J413A55J284E19d95o52A101
3953C230J742P03K03K041o65k563r34j669Db080j772R85J256g36c63m70j061p91
3935b685N69J72b59A836J556J992J90j342j451A210l71K18J327k99j71E53b461
3917b421c57A635J534J361J95p40q98m43k08R0J58m17p91A39a689j619l46O8J61
3898c425L43Q20N03M98N47A94N31O3A1a193J72C33R23K14m21D28k09oL99O13L05
$$ plain form
4032 3096 2426 1271 -73 -730 -1512 -2012 -1934 -1824 -2230 -3174 -2434 -211 1425 2213 3224 2543 2984 -271 -3019
4013 -3019 -5879 -4932 -2926 -1886 -1793 -2431 -2530 -2107 2 1328 1017 219 -597 -302 949 1934 1987 1070 -690 -2286
3993 -2286 -4060 -2675 -481 -296 -828 -1960 -2738 -3067 -2841 -2099 -1602 -711 -280 -584 -648 267 1295 1928 2127
3974 2127 2099 1635 187 -800 -1595 -2494 -2642 -2330 -2365 -2676 -3368 -3856 -3691 -2278 155 1439 519 -495 -1147 1101
3953 3230 4972 5675 5878 7919 7254 4691 3757 2088 4 -2080 -3852 -2867 -1611 -736 -363 -833 -1894 -2685
3935 -2685 -2116 -1944 -259 1836 3392 5384 5574 4232 2781 1210 839 1057 2384 2085 1914 553 -2461
3917 -2421 -357 1635 3169 4530 4725 3985 3087 2644 2436 2526 2684 2267 1476 139 -1689 -3308 -3654 -3586 -3425
3898 -3425 -3082 -2262 -1759 -1261 -714 194 725 788 11 -1193 -1021 333 1256 1470 1049 428 219 213 612 1225 1530
3877A530n48C39q0O79M81n11g89k292j78a524H83Q43j56k75L50O6J039Q94J488
3858E132l99j462H45a797j893O49a406c46B59M90M26L48n82A22d7B68O23J50k58
3839G83b72j478q98l97m3M87J001e06D56M45j77k38A47c62A032J880J015M25m16
3820C936p67n97k93M19J78J306M65n70l45j531I30i5j378q28m12r7L75h08l94
3801a202j131j332o08P70i31F95K6e89j582j173m20n8J892h21b40N1k27L4C96
3781A420P90l83i8k514l38a321B37J357J472K612o55k168q28m27n25k31J172J06
3763B122O86o51j064d97j134p76k69K55g20E62Q9i17k313a535a58A512O98o69
3745A541E70r1J840J927j49j915f92k954n20P95a142D80F0a58o02j265j509k166
$$ plain form
3877 1530 982 339 259 938 1419 908 -789 -3081 -3259 -1524 883 1726 1570 1295 1645 1711 2750 3644 5132
3858 5132 4733 3271 845 -1797 -3690 -3041 -1406 -346 259 749 1175 1523 941 122 -47 268 891 1041 783
3839 783 -272 -1750 -2648 -3045 -3088 -2601 -1600 -506 456 901 724 486 147 -362 1032 2912 3927 4352 3936
3820 3936 3169 2572 2279 2698 2876 4182 4647 4077 3732 2201 930 -95 -1473 -2301 -2713 -2810 -2435 -808 -1202
3801 -1202 -2333 -3665 -4273 -3503 -931 695 721 -589 -2171 -3344 -3764 -3822 -1930 -821 -240 -189 -416 -382 396
3781 1420 2210 1827 -98 -2612 -2950 -1321 237 1594 3066 5678 5023 2855 2027 1600 1075 844 2016 2122
3763 2122 2808 2157 1093 -497 -1631 -2407 -2676 -2421 -720 562 651 -917 -3230 -1535 -158 1512 2210 1541
3745 1541 570 479 2319 4246 4097 2182 -692 -3646 -4166 -3371 -1142 480 60 -158 -760 -2025 -3534 -5700
3727e700o06K852a396A1L73l9M84N88J024R07L56p02A302a473j753b78A510O16
3709B126j42m08l90J73K7NmM92R36M32l72q62F44i55o87O62D47J449P68J18l54
3688B428j122B58@G69O07Q64J28m61I28f19j587O24A206K245L188K307r33G85
3669d24j348o51j28O19h08B62Q25K47J11k99m96a48p90m27N18B47R21NA07a631
3648b765m84L31J453B06J330k49m26e42r41n08J30N34b75A201J177R79R28N44
3630D829m42j079j024I84d62j212k87G19K497N06m98p21E86c13p8D92J139J183
3612B814M97K83k79j549c09j042E13J863M83r06F14a073j424M66J3Q0d46C84O19
3593A003Q31L66M21M72m3M718C398K478L212K174r35l024l435j850D12c50l82
$$ plain form
3727 -5700 -6306 -3454 -1396 11 384 345 829 1417 2441 3348 3704 3002 1302 -1473 -3226 -278 1510 2126
3709 2126 1984 1576 1186 1359 1386 1391 1387 1879 2815 3247 2875 2013 644 -955 -1642 -980 447 1896 2664 2782 2428
3688 2428 1306 258 0 769 1376 2240 2368 1907 928 -619 -2206 -1582 1206 3451 6639 8946 8013 785
3669 -424 -1772 -2423 -2551 -1932 -808 262 1087 1334 1445 1146 650 -148 -938 -1365 -847 247 1168 1173 107 -1631
3648 -2765 -3249 -2918 -1465 206 1536 1287 861 -542 -1483 -1991 -1861 -1327 -275 1201 2378 3357 4285 4829
3630 4829 4387 3308 2284 984 -462 -1674 -1961 719 3216 3722 3224 2503 586 -313 -391 492 1631 2814
3612 2814 3311 3594 3315 1766 -309 -1351 513 2376 2859 1953 614 -1073 -2497 -2031 -2018 -1938 -446 384 1003
3593 1003 1834 2200 2621 3093 3050 7768 3398 5876 9088 11262 10327 7303 3868 2018 412 -350 -732
3576g32p62r05p55K44o9J7J396k45Q82L49G45R87L61j32p90d41k368p92j030O10
3556d021k677n68L349b60B053N99A000a904l393j113J296J128J394O81B85J978
3540B263p1L605J386R9A159a403K86k351L33J383O98D94J191Q88K70p20I20e67
3521a383M73B52P4h59j319j46j92k49N41O64g37L18q62r16j182n60O47P09n74
3502c157Q26q7p63q69R16m32R38J139f80a74k71j381E781d438o55n922e181i51
3483C624L615L593L530n003k631l132b767K25J41J33J43p72A14L749L308L40J538
3466I049D087A882d37j678j245n65L74Q45K80J76L17P1q9l5J6O96M69K30r3q70
3446a538n55K48g50j91m12q45j074q70n79Q65P26L96K88L59J16h69E67O34r6m30
$$ plain form
3576 -732 -1494 -2399 -3154 -2910 -2979 -2962 -1566 -1811 -929 -580 745 1732 2093 1961 1171 -441 -2809 -3601 -4631 -4021
3556 -4021 -6698 -7266 -3917 -260 2053 2652 1000 -1904 -5297 -6410 -5114 -3986 -2592 -1911 285 2263
3540 2263 2192 5797 7183 7282 1159 -1403 -1117 -3468 -3135 -1752 -1054 494 1685 2573 2843 2123 920 -567
3521 -1383 -910 252 326 -859 -2178 -2324 -2516 -2765 -2224 -1560 -737 -419 -1281 -2197 -3379 -3939 -3292 -2583 -3157
3502 -3157 -2331 -2418 -3181 -4050 -3134 -3566 -2628 -1489 -680 -174 -445 -1826 5781 -4438 -5093 -11015 -5181 -951
3483 3624 7239 10832 14362 9359 6728 3596 -2767 -2542 -2401 -2268 -2125 -2897 114 3863 7171 7511 9049
3466 9049 4087 1882 -437 -2115 -3360 -3925 -3551 -2706 -2426 -2250 -1933 -1862 -1951 -1986 -1970 -1274 -805 -575 -668 -1538
3446 -1538 -2093 -1845 -750 -941 -1353 -2198 -3272 -4142 -4721 -3856 -3130 -2734 -2446 -2087 -1971 -869 567 1201 1105 675
3426F75c54j674o32g23A657K292J835K226k59C601C10b164M55C78O27B29L37K29
3408G95G0J26b86q37l14E19K151K453K422P8j859k321D93b484J71J046j05e82
3389b91n26j048A255L434J993m22j959B042H58l50L05J974J602O87P49p05k120
3372C000j024o97n75j31L76J06l71l41K22M74Q9N24F51e32m46l78l89l13j22K26
3352a954m9J25L81P44E38O18M71G44e11p20o22f23A290J388O70l22j089H63B88
3332D18K14k54b61q66j40L5M34b32A41F8g18j715k234k655q56l2L072K417e6A025
3311A406Q7O17J222J054M60J61q3l83j054j654C38h10n20l7M29a74j44I38K45
3292A183l65r9f0n50k98m5J3b2A547J433J461j76n25j03l28q50I86B05g65k45
$$ plain form
3426 675 -354 -2028 -2660 -723 1657 3949 5784 8010 7751 3601 310 -2164 -1709 378 1005 229 566 795
3408 795 70 196 -286 -1123 -1437 519 2670 5123 7545 7623 5764 3443 493 -2484 -2313 -1267 -1372 -582
3389 -291 -817 -1865 1255 4689 6682 6260 4301 2042 858 508 813 2787 4389 5076 5825 5120 3000
3372 3000 1976 1279 704 573 949 1055 684 343 565 1039 1128 1652 651 -532 -978 -1356 -1745 -2058 -2180 -1954
3352 -1954 -2003 -1878 -1497 -753 538 1156 1627 744 -511 -1231 -1853 -623 1290 2678 3348 3026 1937 863 288
3332 418 632 378 -261 -1127 -1267 -1232 -798 -232 141 68 -718 -2433 -4667 -7322 -8178 -8210 -5138 -2721 -56 1025
3311 1406 1493 2110 3332 4386 4846 5007 4924 4541 3487 1833 338 -810 -1330 -1367 -938 -174 -318 938 1183
3292 1183 818 719 -60 -610 -908 -953 -940 -22 1547 2980 4441 4265 3740 3637 3309 2459 986 205 -765 -1010
3272a010F9K172J461J31o36r65q78C29a85k2C49P88M87J98G19f95j754j086m39
3253c974P02J278d33C8d39j550j637j133K21O90Q47N37R09L00m6K24j58n40j192
3234b967J60A13K736J687J853j863r23j097n75k19m17Q56J73l37E72a259j882
3217c141j267K187A144J110G62a669k217j898K818a173N31p91j088q42n0j111
3201d524r41m85J328N87K28l04J978A714J668p6j034p33k54j70l20C17L16J075
3183A708G80c31o98G28J591L75m87H99i33k175k383P56h52B99I3%K99K06K60C50
3162h09r15N1d92A665J908K027J373N83l5j627j845A979B5a008n36J33L33J7L3
3143a028d77A03L74j09b55l94J9b77G9N90k07J486J254J49n0l44l07l89j9L38
$$ plain form
3272 -1010 69 2241 3702 3833 3197 2232 1354 329 -185 -207 349 1137 1624 1822 719 -695 -2449 -3535 -3974
3253 -3974 -3272 -1994 -433 38 -439 -1989 -3626 -4759 -4538 -3848 -3001 -2464 -1555 -1255 -1301 -1077 -1235 -1775 -2967
3234 -2967 -2807 113 2849 4536 6389 4526 3603 2506 1931 1712 1295 2151 2324 1987 572 -1259 -3141
3217 -3141 -4408 -2221 1144 2254 762 -1669 -3886 -5784 -2966 -1173 -642 -1433 -2521 -3363 -3413 -4524
3201 -4524 -5465 -5950 -4622 -4035 -3807 -4111 -2133 1714 3382 3306 2272 1539 1285 1115 795 317 633 1708
3183 1708 780 -331 -1029 728 2319 2694 2207 899 -933 -3108 -5491 -4735 -852 299 93 93 392 598 858 350
3162 -809 -1724 -1673 -492 1665 3573 5600 6973 7556 7521 5894 4049 1979 25 -1008 -1544 -1411 -1078 -1061 -1028
3143 -1028 -477 103 477 368 -255 -649 -630 -277 79 669 462 1948 3202 3351 3301 2957 2650 2261 2242 2580
3123B580L1J24m89r4n06n59b8q49o5k41o8J63d84I2f91p59K25k71p82j263O48
3102b893M11k83n82J67R81R40d95b09B71M30j68a63j01j13G51K70L01l97L71K35
3082A531L2m20a41j792j545n84P60J536b92H53L45k23D75B12D1e90j466k127k185
3063f368j911m80K080K969J754d99D32L68J21l96J06J186J422J316L10j257p50
3046B858n63I87m55M17R65K036J195P59L57j664j424n86m7L3p18mO64k34q63K8
3026A446K73J99l50R32J758P35O2o51j635A015f98j043o67J45M37L99j91j097
3008b715j156J326g83H85N97m94D9i24j61I34J224n20e82j650e97C22L51A75b44
2988C67J980K123P05r13m70k9J97j04j067A377b12r33r36k8k21M96N10d59C62
$$ plain form
3123 2580 2611 2735 2246 2152 1646 1087 -28 -877 -942 -1183 -1251 -1088 -484 92 -691 -1450 -1225 -1496 -2278 -3541 -2893
3102 -2893 -2482 -2765 -3347 -3180 -2199 -1259 -495 -209 271 701 533 -163 -264 -377 751 1021 1322 925 1296 1531
3082 1531 1563 1143 -141 -1933 -3478 -4062 -3302 -1766 -292 853 1198 975 475 212 41 -590 -2056 -4183 -6368
3063 -6368 -8279 -8759 -6679 -3710 -1956 -499 432 800 921 525 631 1817 3239 4555 4865 3608 2858
3046 2858 2295 987 532 949 1914 3950 5145 5904 6261 4597 3173 2587 2540 2573 1855 1851 2515 2281 1418 1446
3026 1446 1719 1918 1568 2500 4258 4993 5055 4404 2769 1015 -698 -1741 -2408 -2263 -1826 -1427 -1618 -2715
3008 -2715 -3871 -2545 -783 885 1482 988 49 -924 -1085 934 2158 1638 -582 -2232 -597 322 673 175 -244
2988 367 2347 4470 5175 4262 3792 3763 3960 3856 2789 1377 -212 -1145 -2081 -2109 -2330 -1834 -1324 -459 362
2968A113k38b26q24N15R8f3K0B24O88K84l58K35e82r81j395K81K45P94q4J95o13
2947b140qk52P46N39K37b19E64R97N90M33M52L71l61k41m41r60c56JE43R08Q67
2926B318O12L13k74j203B05e97k71n67k98j366O59C48K933J666H14a09j921j337
2908c367j696j534P77b244J081B36K70O76i3q85p56q31j230j56a549A834K394
2891D228J6A415a389l361Q98J113J39J231A45J984J299r52A051a21l33j72j47
2874g73l77j90A80l9c51l44r87p23l2J166f14k45j132j463Q55b61B118J950R17
2855D985j1l63m84j537A193d92q28K82A21J269K46p66l94o1L61J67m70d81q94
2836a375r7P29c18J33p77r12L8Q60A4g02r98o61j21M96P58e27h1iB33C6c99o1
$$ plain form
2968 1113 875 -226 -1050 -535 -437 -63 -43 224 912 1196 838 1073 -582 -1563 -2958 -2677 -2432 -1638 -1722 -1527 -2140
2947 -2140 -2148 -2400 -1654 -1115 -878 -219 564 1561 2151 2584 3036 3407 3046 2805 2364 1404 -356 -355 543 1451 2318
2926 2318 2930 3243 2969 1766 205 -597 -868 -1435 -1733 -3099 -2440 348 3281 4947 814 -109 -2030 -3367
2908 -3367 -5063 -6597 -5820 -2244 -1163 236 506 1182 -93 -978 -1734 -2565 -3795 -3951 -1549 1834 4228
2891 4228 4244 1415 -1389 -4750 -3852 -2739 -2600 -1369 145 2129 3428 2476 1051 -121 -454 -626 -773
2874 -773 -1150 -1340 180 141 -351 -695 -1682 -2405 -2437 -1271 -614 -859 -1991 -3454 -2599 -261 2118 4068 4985
2855 4985 4974 4611 4127 2590 1193 -492 -1320 -1038 121 1390 1636 870 476 415 776 943 473 -481 -1375
2836 -1375 -1472 -743 -318 -185 -962 -1874 -1836 -976 14 -702 -1700 -2361 -2482 -1986 -1228 -527 -81 -9 233 36 -399 -460
2814d60O7j81p6j0A31J256Q40K88m7l29o08c70k223L06J007a73D40G2a945j510
2794c455M02i91F44J234n0l12E84b59g6E95Q96J383J424J114m19m99q83r18j262
2775A431F07c54m23J10h5C00f6q18q82j72G03J995K82o47n63k60j61l91a60n23
2755f83b76C91Q27O49N61M56J04l06n96q98A98i48j628j406j572j208j93P44J554
2736d657a700B64J040N87K0m17n98N05J297J53L82k05o25o93q52d9m43p7pj230
2716a806k520a888c71E79L75b4j278l75J52J87b63G72K604L200J585M15j503j462
2698E611A570a72j17A023J802Q53l00j40j052G75Q75Qj17L04O70N67O22l13r87
2679B404G81a036n07N23a95E98J40k36e40l19J91B85b31j46A224K029J845P0j410
$$ plain form
2814 -460 -393 -574 -650 -660 131 1387 2227 2515 2468 2139 1531 -370 -2593 -2287 -1280 -173 440 72 -1945 -3455
2794 -3455 -3053 -991 644 1878 1828 1516 584 -259 -76 595 1491 2874 4298 5412 4993 4494 3611 2693 1431
2775 1431 607 -354 -777 -667 -85 300 -66 -884 -1766 -1938 703 2698 2980 2333 1770 1510 1349 958 -160 -683
2755 -683 -276 391 1218 1867 2428 2884 2988 2682 2086 1188 198 -948 -2576 -3982 -5554 -6762 -6955 -6211 -4657
2736 -4657 -1700 264 1304 1891 1911 1494 896 1401 2698 2851 3233 3028 2403 1710 858 -49 -492 -569 -576 -1806
2716 -1806 -4326 -1888 -371 579 954 -24 -1302 -1677 -1525 -1338 -263 772 3376 6576 8161 8576 7073 5611
2698 5611 1570 -172 -289 1023 2825 3678 3378 3238 2186 775 1650 1658 1541 1845 2515 3082 3704 3391 2404
2679 2404 781 -1036 -1543 -1020 -195 598 738 502 -540 -859 -668 285 -231 -377 1224 3253 5098 5168 3758
2660C758A826e07j907a195K04p25d45l14l33k42j5L37j00l32o31m23J03N9n1J066
2640a321e4G96N32K45o94K77q6R90r0n13m74m91A61b75p14n66l52J12J24P22b92
2618A68M21J06G9J06a82l16j193k135p46j932q31K971a901d9A319M56K76J68J20
2599B339O90J60q20j155A0J32J324J255L14R53A647B34a254j370K62r16m28J039
2581b667L82M35k17k40K35b52A414j07F8a239r51j015p41L18a299G77J305M3n84
2562A541F36b03F98J377R52J086P93Q16A941C42a852r16Q32c04A017O21M0l98
2544A280D47b83r6D72J640J677K598R68k07j487j184j612j423B72i28j251k49
2527b428J140H43J379P42Q6m61m71n3l43N41l1q51D42i21p86m48n10k61K60J308
$$ plain form
2660 3758 1826 -507 -2414 -1195 -991 -1716 -445 -759 -1092 -1334 -1349 -1012 -1112 -1444 -2075 -2498 -2395 -2336 -2387 -1321
2640 -1321 -54 796 1328 1573 879 1156 1070 2060 1970 1457 983 492 161 -275 -989 -1555 -1907 -1795 -1671 -949 -292
2618 168 589 695 79 185 -182 -498 -1691 -3826 -4572 -6504 -7335 -4364 -1901 -49 1319 1775 2051 2219 2339
2599 2339 3029 3189 2369 1214 10 142 1466 2721 3035 3988 1647 234 -1254 -2624 -2362 -3278 -3706 -2667
2581 -2667 -2285 -1850 -2067 -2307 -2072 -252 1414 1307 68 -1239 -2190 -3205 -3946 -3628 -1299 777 2082 2125 1541
2562 1541 636 -203 698 2075 3027 4113 4906 5722 1941 342 -1852 -2768 -1936 -304 1017 1638 1678 1280
2544 1280 447 -283 -379 472 2112 3789 6387 7355 7148 5661 4477 2865 1442 272 -928 -2179 -2428
2527 -2428 -1288 843 2222 2964 3050 2589 2118 2065 1722 2263 2232 1381 442 -921 -1707 -2155 -2665 -2926 -2666 -1358
2507a358f1A009J96l54b13j046m44k07q9M63B86J427l16D48a554j100k50j143
2489d047l497J69L446a496a81B47e95j574j284N62e00G07J387Q56l57r89D51d36
2470f10j94j219k580j183a042B105K622P61j280j010l57R1R8J353j239A141f55
2452d02A623O18L02n20p30C56d46q5q67j236q44l30j29J34J367E32K485J311j3
2433D315p00j596H66a98n26i4H54M83n96q3N52N18J08m31E40a56p85m33L84A97
2412e4j326j291J067F80N94l41b96r48j040L37e58B98b37j180o17k9r3m77p93
2393c426j079j564k306L914i94G92J31N85D73d95q67q49J075A591q9p32C68M64
2375H32J86k05e1j360j718j054j9P51J075R94N01L33mK59C77A36d0B0J65M95J302
$$ plain form
2507 -1358 -61 1009 1205 851 -213 -1259 -1703 -1910 -1999 -1536 286 1713 1397 448 -1554 -2654 -2904 -4047
2489 -4047 -7544 -7375 -3929 -1496 -181 247 -595 -2169 -3453 -2891 -500 707 2094 2950 2593 1604 451 -436
2470 -610 -804 -2023 -4603 -5786 -1042 2105 4727 5488 4208 3198 2841 2932 3030 4383 3144 1141 -655
2452 -402 1623 2241 2543 2023 1293 356 -446 -531 -1398 -2634 -3478 -3808 -3937 -3803 -2436 532 3017 4328 4315
2433 4315 3615 2019 866 -198 -724 -94 854 1337 741 658 1210 1728 1836 1405 540 -156 -941 -1374 -990 197
2412 -54 -1380 -2671 -1604 680 1274 933 -296 -1244 -2284 -1947 -558 298 -237 -1417 -2034 -2063 -2156 -2633 -3426
2393 -3426 -4505 -6069 -8375 -4461 -994 792 923 1508 473 -495 -1362 -2211 -1136 1591 1502 770 368 832
2375 832 1018 813 -51 -1411 -3129 -4183 -4202 -3451 -2376 -1382 -881 -548 -552 -293 377 136 -40 20 185 680 1982
2354A982J238O27J091J692R93m74k055D54a073j106Q49A53P99K19j09B24f70l40
2336a010B414K13q29c72k065j705n82J012a299B84M82k1R8j0l20b59p23n34j98
2317a714M20P6o8k57l77p02J205E97n3J02C20a22m78l69K19M4q7K48J47J83A282
2295B078Q15k31A278n37a651p54j153a748B5K16b91p15L42F38j54c28c7k39j95
2276d71D92J235J502R37o21j258G75A08b03N6n91A35K19O8K16K90n3B23c57j087
2256a444j352l90g42A470J021j92j043H7f88K58A45b83p38k050a323J37k53O72
2238g67k19r31k10j818j09J180A812K652l52m88m17m96o68E89a256j092K00R66
2220a182F04K031J501L68j322G48b097k133m29a796A810K794R25j323j068j194
$$ plain form
2354 1982 3220 3847 4938 6630 7623 7149 5094 454 -1073 -2179 -1330 153 952 1171 1062 224 -670 -1010
2336 -1010 2414 2627 1798 -372 -2437 -4142 -4724 -3712 -1299 284 766 745 843 833 513 -259 -982 -1516 -1714
2317 -1714 -1294 -1218 -1286 -1543 -1920 -2622 -1417 597 544 646 320 -122 -600 -969 -750 -706 -793 -545 -398 -215 1282
2295 2078 2893 2662 1278 741 -1651 -2405 -3558 -1748 25 241 -291 -1006 -664 638 484 -328 -37 -276 -471
2276 -471 492 1727 3229 4166 3545 2287 775 108 -203 -147 -738 135 354 422 638 928 875 223 -357 -1444
2256 -1444 -2796 -3186 -742 1470 2491 2299 1256 87 -688 -430 145 -283 -1021 -3071 -1323 -1186 -1439 -767
2238 -767 -986 -1917 -2127 -3945 -4054 -2874 1812 4464 4112 3624 3207 2711 2043 589 -1256 -2348 -2148 -1182
2220 -1182 604 2635 4136 4504 3182 748 -2097 -4230 -4659 -1796 1810 4604 5529 4206 3138 1944
2204A944m53J6K86p47k37A92q9N39J027N03k59k73j20m82Rl99C24c68j366j196
2184b930j172L24a105A335J876M97n45G20a338j264m20J436f0A8M91p0b08j625
2166a833k469n298c935O98j072J251o531K635r72j571b902J014d94F42k39N69
2150I72K093J257L10q05A744D70d82m34C31K233K759Q70B452j047n50C99l1Q63
2132A231l29e17j713j670L05a684A25Q60J5A99g95j199n34K18J49J7k23r36N44
2113b759a313b58B7b48j10q9j76n28k70A274K15M8n65C76h13j087n98L12e68A339
2092B718L2j080C72g61j125j03L45Q01E35M06B0a633j990o85K24J446a258C3O08
2073F41N59M19J087K35l20A273A46f61o5M5N3q9l22j072j787r94R71J602O15j66
$$ plain form
2204 1944 1491 1507 1793 1046 809 192 103 642 1669 2172 1913 1640 1520 1038 1047 648 324 -368 -1734 -2930
2184 -2930 -4102 -3778 -1105 1335 3211 3708 3163 720 -1338 -2602 -3022 -1586 -60 18 509 439 -208 -1833
2166 -1833 -4302 -9600 -3935 -3237 -4309 -3058 -9589 -6954 -7926 -9497 -2902 -1888 -494 642 403 972
2150 972 3065 4322 4632 3827 1744 470 -482 -916 331 2564 5323 6193 2452 1405 855 399 368 1231
2132 1231 902 -517 -2230 -3900 -3595 -1684 125 985 1000 199 -795 -1994 -2528 -2310 -2161 -2144 -2367 -3303 -2759
2113 -2759 -1313 -258 27 -248 -358 -447 -623 -1151 -1421 1274 1489 1537 972 376 -813 -1900 -2498 -2186 -568 1339
2092 2718 2750 1670 372 -761 -1886 -1989 -1644 -843 535 941 20 -1633 -3623 -4308 -4084 -2638 -1258 33 641
2073 641 1200 1619 2706 2941 2621 1273 146 -661 -726 -681 -628 -717 -1039 -2111 -3898 -4892 -3921 -2319 -1704 -1870
2053a870r2L58A2i9j462k303j424k49J311J745P74k23p08j798P9J527d53B985
2034E040J676m01j004j263j155o80N1m18m70m08N85J077J076O08Po41q93p71E84
2014a257j548n43J250a67H90l59h98j806k086j490K000P81R94J216a24A185J311
1997B496O92r1r68D82a622j245Q23g51g2j22q64j096P86A796J375o36A089d91
1978a753j53B05M515M393J489K431r63l600H96i41m21N89H61J132M8o39F84b33
1959f97J04k56a7C35b52q51q36p17m43o75M49a208C79J171J73F45a132j472j385
1940c989k356j056c414g35G72J92a19j858j472m15M4J46L70D18K684N92k21J5
1922C488N7K08j04r1N34N78K37n2j119j227G91f01r6c11F70J33b28m39P5A54J592
$$ plain form
2053 -1870 -1962 -1604 12 -99 -1561 -3864 -5288 -5537 -4226 -2481 -1707 -1930 -2638 -4436 -4357 -2830 -453 2985
2034 5040 6716 6315 5311 4048 2893 2213 2264 1846 1376 968 1553 2630 3706 4314 4321 3680 2787 2016 584
2014 -1257 -2805 -3348 -2098 -167 890 531 -898 -2704 -4790 -6280 -4280 -3499 -2505 -1289 -124 1185 2496
1997 2496 3188 3097 2129 482 -1622 -2867 -2044 -751 -72 -194 -1058 -2154 -1368 1796 3171 2535 1089 -491
1978 -1753 -1906 205 4720 9113 10602 13033 12070 8470 896 -941 -1362 -773 861 1993 2041 1402 684 -233
1959 -697 -593 -849 -17 335 -252 -1103 -1939 -2656 -3099 -3774 -3325 -1208 379 1550 1723 645 -1132 -2604 -3989
1940 -3989 -6345 -7401 -3414 -735 772 964 -119 -1977 -3449 -3864 -3820 -3674 -3304 418 3102 3694 3473 3488
1922 3488 3545 3753 3649 3558 4092 4670 4907 4855 3736 2509 791 -601 -697 -311 670 803 -228 -667 -592 154 1746
1901A746J355N72p6k94q17j060C98a119j727p82O31d70A591J292R9q78o29m42
1883A033C71d57m87l65P1k40k1c33F40B41B6i00B39J226J418J035m03j632b38
1863b514j911R60G05K068P40l90j141G55c69dB331J811K49j397a36l328j962N57
1845d869J920a363a98A457R77L58N5p95D05h17p06d12I34J518J159P54r1K53K22
1826D749k09j251A257a113j245P20c17F2h07j473o14J001g37F11K15k52D0P26
1808G66J300K01A019e43j257K0c09A441J201M95K73p80A146e56j585j200o59L60
1790c640J213h43C96P29K83k87B34h55p56n43K39d25I02P28n00f76j943j328n3
1771d000P80P14L22k02m04L25a141A327J043M59o18A092C32O08J411P96m40A098
$$ plain form
1901 1746 3101 3673 3597 3303 2486 1426 398 -1119 -2846 -3628 -2997 -470 1591 2883 2982 2104 1475 1033
1883 1033 371 -457 -944 -1309 -1238 -1478 -1499 -333 640 241 26 -900 239 1465 2883 3918 3515 1883 -238
1863 -2514 -4425 -3465 705 2773 3513 3123 1982 755 -369 -4 2331 4142 4391 2994 -136 -3464 -5426 -4869
1845 -4869 -2949 -1363 -198 1457 2434 2792 2847 2052 405 -817 -1523 -412 934 2452 3611 4365 4274 4527 4749
1826 4749 4540 3289 1257 -1113 -2358 -1638 -317 62 -807 -2280 -2894 -1893 -737 611 826 574 40 766
1808 766 2066 2267 1019 -543 -1800 -1780 -309 1441 2642 3137 3410 2630 1146 -556 -2141 -3341 -4000 -3640
1790 -3640 -2427 -843 396 1125 1408 1121 234 -855 -1611 -2154 -1915 -425 902 1630 1130 -676 -2619 -3947 -4000
1771 -4000 -3220 -2506 -2184 -2386 -2790 -2465 -1141 1327 2370 2829 2211 1092 332 940 2351 3147 2707 1098
1752a058k362m137k60J907b386B47J384J10l58B89g92j127K78f12o44q61g81A717
1733B904N16J19o18o78j41k41O98l72n2N1K71R4o97l13L28O29N23K97Q3j406a45
1711b745k357j904j626q81o69K32c068C70O5L9d09p76l91p0h11n51j83m25k2O35
1691a357e57d9C47kd96r64q84NN02f16a79p0m05m21j337A094J779j40A278g42
1670c141k351o44J346J678a266C25R87L70j58m55C89e53j133j063j468r15J300
1653c832a706E98J665q42a074p5N25d8B036R56K82M82A628k55A9c19m10j04Q1
1634g52a83B88N07N57L98M30J9j40q89b41m23b7G95k86h50j878J069a73A047K22
1614A269l7j80D27E1L61K71m5d49n75j591j767m510k525c273a584O93K24p99q05
$$ plain form
1752 -1058 -3420 -7557 -7817 -5910 -2386 247 1631 1741 1383 289 -792 -1919 -1641 -612 -1256 -2117 -781 1717
1733 2904 3420 3539 2921 2243 2102 1861 2559 2187 2135 2186 2457 2551 1854 1541 1869 2498 3021 3318 3401 1995 -145
1711 -2745 -5102 -7006 -8632 -9513 -10182 -9950 -3068 370 435 474 -409 -1185 -1576 -1646 -811 -1362 -1545 -1970 -1992 -1357
1691 -1357 -557 -49 347 345 -496 -1460 -2344 -2339 -1837 -616 -179 -249 -654 -1075 -2412 1094 2873 2733 1278 -742
1670 -3141 -5492 -6136 -4790 -3112 -1266 325 1312 1682 1524 1069 389 -553 -1686 -2749 -4217 -5132 -3832
1653 -3832 -1706 598 2263 1421 -1074 -1149 -624 -48 2036 2992 3274 3756 1628 1373 19 -319 -729 -833 -752
1634 -752 -183 288 795 1352 1750 2180 2199 2059 1170 -241 -664 -27 795 509 -850 -2728 -1659 -173 1047 1269
1614 1269 1232 1052 427 51 412 683 638 -449 -1024 -2615 -4382 -8892 -11417 -3273 -1584 -891 -667 -1466 -2271
1595b271n23j94l07m01N06J517a47G09C32b307m96K61m18n31j44P33J242M28b27
1575I86K159J639N67p19j268A026a576k040J44J331e19A381J373J066p84j426
1559A610b47j582j681Q34N12a05A67J410J629K089K628K040Q06o35j421l473k049
1542C191j76L62p49I15a388k308k848l371k396O4c550J212L24J15p72Q19e65H0
1523A284J230N0k17j006Ga151N57H56N53m23m57e62j478r19o79j53K09J241k79
1504b620a237I7J104P05K3p52e82k472j326j139J171a719B56J792J542K269K278
1487H137K710N52j846B456b68F84J679L10r74g46j698K42b60B128P64q74p14c52
1468b065j772k445j231p07d101J875a18A288L35M15M36l35r25c30j038q08g11
$$ plain form
1595 -2271 -2794 -2988 -3295 -3696 -3190 -1673 -147 709 332 -2307 -2803 -2542 -2960 -3491 -3635 -2902 -1660 -1232 -227
1575 986 3145 4784 5351 4632 3364 1026 -1576 -3616 -3472 -2141 -519 1381 2754 3820 3036 1610
1559 1610 -247 -1829 -3510 -2676 -2164 -105 167 1577 3206 5295 7923 9963 10769 10134 8713 5240 3191
1542 3191 3015 3377 2628 915 -1388 -3696 -6544 -9915 -12311 -12247 -3550 -2338 -2014 -1899 -2671 -1852 -565 80
1523 1284 2514 2564 2347 1341 7 -1151 -594 856 1409 986 529 -562 -2040 -2959 -3638 -3791 -3582 -2341 -2620
1504 -2620 -1237 97 1201 1906 1929 1177 -582 -3054 -4380 -5519 -4348 -1719 256 2048 3590 5859 8137
1487 8137 10847 11399 9553 2456 -268 684 2363 2673 1699 -746 -2444 -2202 -260 2128 2892 2018 1304 -352
1468 -2065 -3837 -6282 -7513 -8220 -4101 -2226 -118 1288 1623 2038 2474 2139 1214 -330 -1368 -2176 -711
1450A005N56m12b24j954r59j032J765C33K401J134RJ70M19M9j56j072j511C00
1431A13K41M31J30O88O17O31J44p04G31f51p29e51D18J060m69j7J39J78E96a013
1410b194l64M92Q96M34r69p48j160r10p61l89J412J254a266G90J775Q42j9r88
1392B400A190A68a31GK29L94J209J377L62m26j507F6a784j64B97K043J94l94r04
1373A236A08h79K42n03n55o56J60J049F27J321J091M62j19k50J32K87q82a35l726
1354c861n723d766a655A59G3b67J5G00J069P92Q3J15q6q18H97k61N92O86N02m98
1334A918p28J065J484K30j846C42c59a71B69J51I4a259j182j632j360j869j78
1317g480L645a516G91J247Q15K2k76p53a57k318p40a082A056J092R50jo40q87
$$ plain form
1450 1005 1561 1149 -224 -2178 -3137 -4169 -2404 333 2734 3868 3877 4047 4466 4515 4359 3287 1776 300
1431 113 354 785 915 1603 2220 2851 2995 2291 731 -651 -1380 -551 418 1478 1009 992 1131 1309 596 -1013
1410 -2194 -2558 -2066 -1170 -736 -1705 -2453 -3613 -4523 -5284 -5673 -4261 -3007 -1266 790 2565 3407 3388 2400
1392 2400 1190 168 -131 7 236 630 1839 3216 3578 3152 1645 66 -1784 -1948 297 2340 2534 2140 1236
1373 1236 108 -879 -637 -1140 -1695 -2351 -2191 -1142 627 1948 3039 3501 3382 3132 3264 3551 2669 -135 -3861
1354 -3861 -9584 -4766 -1655 159 73 -267 -252 700 1769 2561 2644 2759 2673 1855 897 636 1228 1914 2416 1918
1334 1918 1190 2255 3739 3969 2123 342 -359 -171 269 420 94 -1259 -2441 -4073 -5433 -7302 -7480
1317 -7480 -3835 -1516 791 2038 2853 2875 2599 1846 -157 -2475 -3215 -1082 1056 2148 3098 3097 2457 1570
1299A570G00o7K00J31N48Q06R97J65q68j065c02m02B54J616Q80j11A290d73o57
1280a130F46K166L24j342A9a571j673j204q54R70a479D64Q06R99J320J814L144
1263H547l558q72r27A345i21k114j55R37R09J71j86o30q88J144C84J680J147M28
1245C639J165k125q89m96l33P0J00M1k37K26M29Q21J338J218P41j153j272j350
1227A933c88j021l42q1O38N65D61K03J472M82n22I10a48N6A158J078N22p4p06
1208A978F74f65B93J457M62K05p4o82m04m78B04a10E06N21M69M96J313L9m78G38
1187A91d38KB03J008N55o52c19j839q99K43a78A847R15r31F00B19R10J260N82
1168B971p78F01e79n76e8A756J716J493J49J043j235H81d39o23o02j62J71K51
$$ plain form
1299 1570 700 633 833 964 1512 2318 3315 3480 2612 1547 -302 -704 254 1870 2750 2639 1290 -473 -1130
1280 -1130 646 2812 3136 1794 19 -1571 -3244 -4448 -5302 -4332 -1479 464 1270 2269 3589 5403 8547
1263 8547 4989 4117 3190 1345 -921 -3035 -3190 -2253 -1344 -1173 -1359 -1989 -2877 -1733 384 2064 3211 3639
1245 3639 4804 2679 1790 1294 961 1031 1131 1172 935 1161 1590 2411 3749 4967 5708 4555 3283 1933
1227 1933 -388 -1409 -1751 -1832 -1194 -629 461 664 2136 2618 2096 910 -148 -92 1158 2236 2758 2684 1978
1208 1978 674 -665 293 1750 2212 2417 2343 1661 1257 779 204 -110 506 1027 1496 1992 3305 3344 2866 738
1187 191 -438 -436 203 1211 1766 1114 -319 -2158 -3057 -2814 -178 1847 2762 1831 600 219 1129 2389 2971
1168 2971 2193 601 -579 -1155 -58 1756 3472 4965 5114 6157 4922 881 -439 -1062 -1664 -1826 -1655 -1404
1150a404N61a63G12L74J32k93Q72j20h5m69m89r2M44a00F51M08J71D00f15j190
1130a805m38R34A91K087P72p80H85e38D30A1d45G74J10l34j85i66j749n52p55
1111d022J867H27J470K24k25r22o07k1M07O19L86j34m45l90e7o37n99r38o4O40
1091a655d19A052J020K65k12p64j90J85M38N55N74P10m10m66k49k85o90A44g91
1071a677Ql02N03b69A033P92J69G92h52j765j526JK21n48p90J77b136B7J246l5
1051A238D04i13j488j001r8J072d31A754K299K644L779K181q23j415l968A324
1034B02K19P74N48K51O00N99K93o89r53F16f53r62m75j4Q46o47q34l44N12h30
1013I68J238N58L354k897q64n11o24E20J100J33J081R10j48r18j279B13g91n79
$$ plain form
1150 -1404 -843 -163 712 1086 1218 925 1797 1677 -85 -554 -1043 -1135 -691 -100 651 1059 1230 400 -615 -1805
1130 -1805 -2243 -1309 191 2278 3050 2270 885 -538 430 11 -445 774 884 550 365 -966 -2715 -3267 -4022
1111 -4022 -2155 827 2297 2521 2296 1374 767 746 1153 1772 2158 2024 1579 1189 -57 -694 -1293 -2231 -2295 -1655
1091 -1655 -419 1052 2072 2337 2125 1361 1171 1356 1794 2349 2923 3633 3223 2757 2508 2223 1533 144 -791
1071 -1677 -1669 -1971 -1468 -269 1033 1825 1994 792 -852 -2617 -4143 -4142 -3921 -4469 -5259 -5082 -2136 27 1273 1238
1051 1238 404 -913 -2401 -3402 -3500 -2428 -431 1754 4053 6697 10476 12657 11834 10419 6451 1324
1034 202 421 1195 1743 1994 2594 3193 3486 2797 1844 616 -653 -1615 -2090 -2104 -1258 -1905 -2739 -3083 -2571 -830
1013 968 2206 2764 6118 3221 2357 1846 1222 520 1620 1753 2834 3744 3596 2678 1399 213 -791 -1370
995a370o53q20j380r50j085J431K124G57J572O44l02n52o54n93g59q54P55b37
976C08B8K97a13%G04R23R72J160m27j144E94a736k742J656a10J2n80j33iA293
955B758N10o8K6j86j42o23r99l54B81H4J89c89j079j245n77K49Q79R8j222k3K44
934c065L75L97N85P67L80K68bC73B9a92l90n45K36O8F8J879K095N82o36k91rM73
912D161j349A310b16j367q96p40k39J72p1j17L2K76J544G40K413J020p3l14n14
893C272m84m7o89H2i94p13k27K3M24g15H5Q35J17A26i22r27k20K17J30j84J26
872a780K76K93c72A31J02N4m3e80j166o65R95d65A81N05N14O86J174J123k35o47
852C301j005p50A4a474j514j407J912i6B09f43j71A470J667N06q24G25a506r60
$$ plain form
995 -1370 -2023 -2843 -4223 -5173 -6258 -4827 -2703 757 2329 2973 2671 2119 1465 872 -759 -1613 -858 -237
976 308 28 325 -113 -113 704 1627 2599 3759 3332 2188 594 -1736 -4478 -2822 -110 -98 -678 -811 -9 1293
955 2758 3268 3200 3226 3040 2898 2275 1276 922 281 84 273 -389 -1468 -2713 -3290 -3041 -2162 -2064 -3286 -3309 -3065
934 -3065 -2690 -2293 -1708 -941 -561 -293 -2 373 29 -192 -582 -1127 -891 -823 68 1947 4042 4624 3988 3697 3688 4161
912 4161 2812 1310 -216 -1583 -2479 -3219 -3458 -3286 -3357 -3474 -3442 -3166 -1622 740 3153 4173 4100 3786 3272
893 3272 2788 2741 2052 82 -994 -1707 -1934 -1911 -1487 -715 85 920 1037 126 -922 -1849 -2069 -1852 -1722 -1906 -1780
872 -1780 -1504 -1211 -372 131 233 287 244 -580 -1746 -2411 -1416 -465 181 686 1200 1886 3060 4183 3948 3301
852 3301 2296 1546 14 -1474 -2988 -4395 -2483 -96 209 -643 -814 1470 3137 3643 2819 725 -1506 -2466
834b466n44L84a295O29K52m49j121k42I39K391J646j041j109q41G23d06o60r7
816a163b54A389J559J109Q66J78m55l16J541j889A296a30m70m58B36d93H73k80
798E93L07K47K2J92o57B58r6b39k72n83n02j19k61J64p01k551K397K98l1J85M39
777a776f17A009P96o99e36j043O80A060J801O91k22p49j173E14b86j80J31A723
758F69k42E1e74p19L98c66J23A40E1i89j2A91J339J442J56j288g02k748j254f19
737D982P85j736A242a256k46D90Q91n61P48J625J915J445j04r43j947j320A058
719E97d65j428J3Q87d28l60j051j034j675l32J985h3A670K70C52f43B18R93M46
700A657o66K36Q81j92m69A51b262k223j058b735F42J971k80F93a775k066k038
$$ plain form
834 -2466 -3010 -2626 -1295 -666 -414 -863 -1984 -2226 939 3330 4976 3935 2826 1985 723 -406 -1066 -1163
816 -1163 -254 1389 2948 4057 4923 5101 4646 4330 5871 3982 1296 -130 -600 -1058 236 -493 873 593
798 593 900 1147 1169 1361 704 258 162 -239 -511 -1094 -1596 -1715 -1976 -1812 -2513 -5064 -2667 -2369 -2400 -2215 -1776
777 -1776 -617 1009 1805 1106 -536 -1579 -899 1060 2861 3552 3330 2581 1408 514 -286 -466 -335 1723
758 669 427 51 -574 -1293 -895 -366 -243 140 51 -989 -1001 191 1530 2972 3128 1840 -702 -3450 -4704 -619
737 4982 5767 4031 1242 -1256 -1502 490 1381 820 1568 3193 5108 6553 6449 5506 3559 2239 1058
719 597 -465 -1893 -1880 -993 -428 -788 -1839 -2873 -4548 -4880 -2895 -83 1670 1940 352 -643 218 1211 1657
700 1657 991 1227 2108 1916 1447 151 -2262 -4485 -5543 -2735 642 2613 2333 693 -1775 -3841 -5879
683e879J342a599a41C31A40c55H91Q9c14j984k345j600R64J224J169j0n24O23
665b797i31a68n3j10m04L07K05B707J252K76j000q88r62jOn46l78I1d15p41c98
643B87N50k44c24j004j099p4J186F51J398O03r62c09k511j847a551C55N06e03
624h69j13M69J06q91j401j185j173b148a070l54j011j025o918M73J414K094J858
607d539J043R98R94O03j73o09m28l99J64Q04c80B83J59J37pJ0i1o65o48l95n75
586b374k96k21l4M33O13f00A091J623P24n79A293f0p49A28K116J260J04m77l72
567B759j019p95j86M72R66Q09M85K47L2%m39A170a398k054j123l29J236R81j86
548b873l45j611j622o33q22Q3K45K421R92b066b16A274O07J81n13A84p2Q48L34
$$ plain form
683 -5879 -4537 -1599 -141 331 140 -355 891 980 -314 -2298 -4643 -6243 -5279 -4055 -2886 -2896 -3420 -2797
665 -2797 -931 -168 -221 -331 -735 -428 -223 2707 3959 4235 3235 2347 1385 1384 1390 844 466 91 -415 -1156 -398
643 287 837 593 -324 -1328 -2427 -2501 -1315 651 2049 2652 1690 -309 -2820 -4667 -1551 355 861 -503
624 -869 -982 -513 -407 -1298 -2699 -3884 -5057 -2148 -1070 -1424 -2435 -3460 -10378 -9905 -8491 -6397 -4539
607 -4539 -3496 -2498 -1504 -901 -1074 -1683 -2111 -2510 -2346 -1542 -380 283 442 579 572 582 -91 -756 -1404 -1799 -2374
586 -2374 -2670 -2891 -2925 -2492 -1879 -600 1091 2714 3438 2859 1293 -60 -809 128 2244 3504 3608 3131 2759
567 2759 1740 945 759 1231 2197 3006 3491 3738 3770 3770 3331 1170 -1398 -3452 -4575 -4904 -3668 -2687 -2873
548 -2873 -3218 -4829 -6451 -7084 -7906 -7823 -7578 -5157 -4165 -2066 -216 1274 1881 2062 1549 184 112 960 1294
529A294l5L17O55O56L05j9m96j059F17b88k90m85l12l62l21N37P00a88D42B20
508B89A33hn76r28j638l66N02R63h8F54P08L08q3l13D61b19m36P0A97J101J018
487B316J213R11N88o52A941a65p69d16m1c5p4A84a16j233j237l15P58J031A17
467E39L39C63e36j685q82O17M48J77N08a71A093J373J529a719q95J259D09J421
449A830N88r95b04j607j783k529n181L145b531J057e50A215J277K49L8r95p79
432A005l55k85O21L93C67a259j882j852r22J113K025b34A656J42C85a681j534
415c215r32l68q1L25R62h59A312M16F80d39l52b63D40B12i21kM21A103N61m43
395A221g20l85A23J184M70F83f19r13j119h25B075J600J02j554f78k162J62d33
$$ plain form
529 1294 1259 1576 2231 2887 3192 3173 2677 1618 617 -288 -578 -1063 -1375 -1737 -2058 -1521 -821 -188 442 220
508 289 133 -8 -584 -1512 -3150 -3516 -3014 -2051 -88 654 1362 1670 1587 1274 461 -219 -655 -585 197 1298 2316
487 2316 3529 4440 5028 4376 1941 -165 -934 -416 -457 -35 -109 184 -116 -1349 -2586 -2901 -2143 -1112 117
467 539 878 363 -536 -2221 -3103 -2486 -2038 -1861 -1353 -171 1093 2466 3995 -1719 -2614 -1355 409 1830
449 1830 2418 1423 -204 -1811 -3594 -6123 -11304 -8159 -2531 -1474 -550 1215 2492 2741 2779 1784 1005
432 1005 650 365 986 1379 367 -1259 -3141 -4993 -5915 -4802 -2777 -234 1656 1798 385 -1681 -3215
415 -3215 -4147 -4515 -4596 -4271 -3309 -859 1312 1728 680 -439 -791 -263 440 212 -921 -923 -502 1103 1664 1221
395 1221 -720 -1105 123 1307 1777 683 -619 -1532 -2651 -825 2075 3675 3777 2223 -678 -2840 -2678 -433
376H58k01a93j946K70dD66j5B16J605p27c93k186o69q88J43a993f4H93L6A72h99
354i80M81g4G5f38j231n95l73l60J335D74J335K65p34F34J427J161N95j012p59
335B046k0J237J552L59j82r04q76p41r92R6l03F11b50o61J5K50a78A44b0j46k70
314d36m9L1n68l07o47M06B80R42n7c80j280l84K15N92N67G07j91c18a28A291J176
293B467K13q94F07f44m46E87R65k51B94a781k200J535a38B231R37J059J656k429
275C454j238D8a298j440l27a083A013l32g68j119q41k54k96l44M04j11Oj385Q48
256c860a064A312J828J773J155k97j863j199j173G38k42L00k1M21n2O94k29p31
238H78h57j608L17h28a72Jm17j58b80dj62j57k77m97q74p25j35K54Q75K49j50
$$ plain form
376 858 657 -193 -2139 -1869 -4 466 451 216 1821 1094 -393 -2579 -3248 -4136 -3993 -1993 -64 893 929 172 -899
354 -980 -499 -74 75 -638 -1869 -2464 -2837 -3197 -1862 474 1809 2074 1340 634 2061 3222 3817 2805 2046
335 2046 2026 3263 4815 5174 4992 4088 3212 2471 1479 1575 1272 611 -250 -911 -896 -646 -178 144 -20 -166 -436
314 -436 -485 -454 -1022 -1329 -1976 -1570 280 1222 1165 -380 -1660 -2044 -1829 -1237 -670 707 516 -318 -128 1291 2467
293 2467 2680 1786 607 -644 -1090 587 1552 1301 294 -1781 -3981 -2446 -138 2231 3168 4227 5883 3454
275 3454 2216 48 -1298 -2738 -3065 -1083 1013 681 -768 -1887 -2728 -2982 -3278 -3622 -3218 -3329 -3323 -4708 -3860
256 -3860 -1064 1312 3140 4913 6068 5771 3908 2709 1536 738 496 796 775 1196 1144 1838 1609 878
238 878 -857 -2465 -2148 -828 -172 -171 -588 -746 -280 -4 -166 -323 -600 -1097 -1971 -2696 -2831 -2577 -1702 -1453 -1603
217a603e51A358J813J378K37r34A326e92j293j070R37e93D31L92P3j0N1j35k62
198E40in56n77e64A384J922J89r16j167C25M84Q05l62r3l12j02j27k33C5e3C81
176H68n9a70j929r64J499F28J970J211O20j537A297A61d37J06G36j09l06f19j047
157a666Qc02I99p5J85n36J07J105J496O28J80J261r73k063b080k093Q42J651b47
137G73Q54N54J65k42j32K07M65M3Rq85C61a215j082o6N44c33a22E01k23a77q17
116i94l29k1b26D15j54e23q17A439L140K931J941j27j342k418k196j103o30l78
98A257m15A97d47o31j53jN62H0R23L98r4n18C55b36l40m87l77l51M33O30H3J138
76A221R11M89Lp47J322q64b942k211q56n87K314i73C51R15R9E00e68n25j75j87
$$ plain form
217 -1603 -551 1358 3171 4549 4786 3852 1326 -592 -1885 -2955 -2018 -593 431 823 896 886 937 802 540
198 540 -9 -565 -1142 -564 1384 3306 3495 2579 1412 325 809 1614 1252 1159 847 745 618 385 35 -53 381
176 868 809 -170 -2099 -3063 -1564 628 2598 3809 4429 2892 1297 161 -437 -331 736 627 321 -619 -1666
157 -1666 -1658 -302 999 924 1109 573 680 1785 3281 3909 4089 5350 4377 2314 -2080 -4173 -3331 -1680 -247
137 773 1627 2181 2346 2104 1972 2179 2644 2687 2696 1811 361 -1215 -2297 -2363 -1819 -333 -122 501 278 -177 -994
116 -994 -1323 -1344 -226 415 261 -523 -1340 1439 4579 7510 9451 9324 7982 5564 3368 2265 1635 1257
98 1257 842 197 -447 -1078 -1231 -1232 -670 80 1003 1401 1307 789 355 -236 -576 -1063 -1440 -1791 -1358 -728 83 1221
76 1221 2132 2621 2624 1877 3199 2335 -2942 -5153 -6009 -6596 -4282 -973 351 1266 1365 500 -568 -1093 -1268 -1455
56a455n78M47k00q59m49k78M69R68g37AM00L83P90J50j26k47m2P26L62l98p37
35A262n69l32QJ13L56k12B11d37n75p90o39j50M87R12b82C35J6d3q81q22K36f74
12c37J03A99J27K0K2J68m8k18g69q85k46G01
$$ plain form
56 -1455 -2033 -1586 -1786 -2645 -3094 -3372 -2903 -1935 -737 1 401 784 1574 1724 1598 1351 1309 2035 2397 1999 1262
35 1262 693 361 369 482 838 626 211 -437 -1012 -1802 -2441 -2591 -2104 -1192 -282 335 351 -43 -924 -1746 -1510 -674
12 -337 -234 199 326 346 368 536 488 270 -769 -1654 -1900 701
##PAGE= F1=25.89129138603
##FIRST=     25.9928259484165, 8223.18227667557, 1930
##DATA TABLE= (F2++(Y..Y)), PROFILE
16383A930P06j9p76F21d28A69o7J53a1p34p35q98j59h12M00n78j367j619a760
16363F33L85A26h69m00j016J90d22F28J708J473O55k88q31b736Q6l90K99a243
16344c99n18m51J97j343l562J7J276J249O14r60J228a220E76K06k94A97L67n7
16326E07L51C31M52k11a047m69K00b10G04B28a892j700p44a354f2F92l0l09D2
16306a007j59K69c81A06Q67k17j69D7d42n41m34P0d94m93a62m04b36F51J064R06
16286B621Q18j633e94j932k023O77a47G7c94m91M7j389p33J135e49b29j95o83
16268a107r44q14M37L87K21N1K57g15j027O75D49P84l05B54c70b3A082M55O34
16249B171j10k32p88A61f59o09m33l74l61M3L20K23o74O94L81c88j441F50g13
$$ plain form
16383 1930 2636 2617 1841 621 -428 169 102 255 -11 -745 -1480 -2378 -2537 -812 -412 -990 -2357 -3976 -1760
16363 633 1018 126 -869 -1269 -2285 -2095 -422 628 2336 3809 4464 4176 3345 -2736 -2650 -3040 -2741 -1243
16344 -399 -917 -1368 -1171 -2514 -6076 -6059 -4783 -3534 -2920 -3880 -2652 -1220 576 782 488 197 564 507
16326 507 858 331 783 572 -1047 -1516 -1316 -210 704 228 -1892 -3592 -4336 -1354 -62 692 662 353 42
16306 -1007 -1166 -897 -381 106 973 756 587 47 -442 -983 -1417 -1347 -494 -987 -162 -566 -236 651 1715 2621
16286 2621 3439 1806 -594 -2526 -4549 -3872 -147 77 -394 -885 -838 -2227 -2960 -1825 -549 -229 -424 -1107
16268 -1107 -2051 -2865 -2428 -2041 -1820 -1769 -1512 -715 -1742 -1067 449 1233 928 254 -370 -23 1082 1537 2171
16249 2171 2061 1829 1041 161 -659 -1268 -1701 -2075 -2436 -2393 -2073 -1850 -2524 -1830 -1449 -388 -1829 650 -713
16229b301o48k239j795b188c00o7k09j65j6l68n7d36F89L43J15C94f32j175j118
16210b925O03i29b80h2l67a38D06O6L10R65Q8n72I8a026j293K20g94A050J413
16191B463M3k80m36G84e38j432j776o33K03J546R56j97n76k425j109NK893a113
16172a59K2o61c58F36j23i65p62N32k70L13N8h7k60j54q86k084j922j223l35b979
16151a838J79g82K42J39j840L53Q0c41i3j96l73q54n52J63e46p85J98J51n39o79
16131b200m41h67l734j237J708J511P56m82j281J76J005P18K1k69h25j173j814
16114c812L20c30A065K01D18i63k017o47K97j29p752o362e015J175K52O39J051
16097a898N52d34A015P34Q9L53Q0q29o79L67M28p1n91F4e73l35p20n49l87L75
$$ plain form
16229 -2301 -2949 -5188 -6983 -2188 -300 -367 -576 -741 -757 -1125 -1182 -436 689 1032 1147 394 -632 -1807 -2925
16210 -2925 -2322 -929 -280 -82 -449 -138 406 472 782 1747 1835 1263 98 -1026 -2319 -2099 -794 1050 2463
16191 2463 2506 2226 1790 784 -538 -1970 -3746 -4379 -4176 -2630 -1674 -1871 -2447 -4872 -5981 -5976 -3083 -1113
16172 -159 -137 -798 -358 636 513 -965 -1727 -1195 -1465 -1152 -1094 -87 -347 -501 -1387 -3471 -5393 -6616 -6951 -2979
16151 -1838 -1659 -782 -540 -401 -2241 -1888 -1808 -341 -93 -289 -662 -1516 -2068 -1905 -546 -1331 -1133 -982 -1521 -2200
16131 -2200 -2641 -867 -4601 -5838 -4130 -2619 -1863 -2345 -3626 -3450 -2445 -1727 -1706 -1975 -825 -1998 -3812
16114 -3812 -3492 -330 1065 1266 418 -963 -2980 -3627 -3330 -3459 -11211 -17573 -5015 -3840 -3588 -2949 -1898
16097 -1898 -1346 -434 1015 1749 1838 2191 2271 1442 763 1130 1558 1487 896 64 -573 -908 -1628 -2177 -2564 -2189
16077b189M24k09r67r17O53J226h00G1L73K21J616M14q32C24b186j039d57A803
16058A342c95B69K604RI30a443m179k716J731P51N15l59o56L86J366b41j813q3
16040b137K77o45j210O11A557O51M85g94I71J938l96G94a467j819j15k021r56
16023f378r85c202a470n96j41L86L89f27k26J33dA309j11A23Q28m26f17p39j126
16004b482K71l08J216A14K96K80j43B07d11r47M1m33j758n89K29O95O84O63L29
15985a497K44q4k16J25p3j145j66L70h60m53O31G54L7a215j524n45O68J002M17
15966a197n22M5J46N63h2j416j624C11R25B57a804A940b457p62a524O26k053A986
15947C732j074j024L92k87B5a947j516J25a614H59K263A106d67j726J095D73J665
$$ plain form
16077 -2189 -1765 -1974 -2941 -3858 -3205 -1979 -800 71 444 665 2281 2695 1863 324 -2186 -3225 -457 1803
16058 1342 -395 269 2873 2882 930 -1443 -5622 -8338 -6607 -5856 -5341 -5700 -6356 -5970 -4604 -241 -2054 -2137
16040 -2137 -1860 -2505 -3715 -3104 1557 2208 2693 -794 971 2909 2513 794 -1467 -3286 -3401 -5422 -6378
16023 -6378 -7363 -3202 -1470 -2066 -2207 -1821 -1432 -627 -853 -720 -4 1309 1198 123 951 525 -617 -1356 -2482
16004 -2482 -2211 -2519 -1303 114 410 690 547 207 -411 -1358 -1317 -1750 -3508 -4097 -3868 -3173 -2489 -1826 -1497
15985 -1497 -1253 -1337 -1553 -1428 -1501 -2646 -2812 -2442 -860 -1313 -682 754 791 -1215 -2739 -3284 -2616 -1614 -1197
15966 -1197 -1719 -1674 -1528 -965 -82 -1498 -3122 311 1236 257 -1804 1940 -2457 -3219 -1524 -898 -2951 1986
15947 3732 2658 1634 2026 1739 25 -1947 -3463 -3338 -1614 859 3122 1106 -467 -2193 -1098 473 2138
15930B138a72l055l036q87K573C46Q17B71J493C79a551j786K47j872k613Q65L246
15913c464J653d45G80L76K12A78Q53b529j10j866j129k141J344b009h30K43i5
15895@e53q28j337j057l48l30J04k196R33J132J016P64L32n30o41r38n03j199
15877f179J791P83Q97J050P61j257j230j838k809m744L248a426K84m78j282J157
15861a745l382J470J428j02r94j413J375J437e14C82R08n18C29Cc46p64k32A80
15842B028k41n71D42c95o54J28K74A81Q85M56R9m51a255K83c32j183j386j374
15824d275q99J016a072A939p81C50D5M46b76n28m04j023p74N10O36N0N44A81P28
15805I09b529j762J759g38k96j04n19r02Q16g80D08L09B73M18D6c82n87k181j060
$$ plain form
15930 2138 -172 -3227 -6263 -7150 -4577 346 1163 271 1764 379 -1551 -3337 -3090 -4962 -7575 -6710 -3464
15913 -3464 -1811 -445 780 1156 1368 178 1031 -2529 -2639 -4505 -5634 -7775 -6431 -2009 -830 -587 -95
15895 0 -553 -1381 -2718 -3775 -4123 -4453 -4349 -6545 -5612 -4480 -3464 -2700 -2368 -2898 -3539 -4477 -4980 -6179
15877 -6179 -4388 -3605 -2708 -1658 -897 -2154 -3384 -5222 -8031 -12775 -9527 -1426 -1142 -1620 -2902 -1745
15861 -1745 -5127 -3657 -2229 -2331 -3325 -4738 -3363 -1926 -514 382 1290 772 329 3 -346 -1110 -1342 180
15842 2028 1787 1216 442 -395 -1049 -921 -647 181 1066 1522 1621 1170 -1255 -972 -332 -1515 -2901 -4275
15824 -4275 -5174 -4158 -1072 1939 1158 350 45 491 -276 -804 -1208 -2231 -3005 -2495 -1859 -1809 -1265 181 909
15805 909 -2529 -4291 -2532 -738 -1034 -1138 -1657 -2559 -1743 -780 408 717 273 691 46 -382 -969 -3150 -4210
15786d210J209O97c86D25J265J78A96a633j639G50J571n01l43n51D42p4M8e12
15767e18g3A75F6a48p49p18M53k00q07R34H72J860r1j64r79f5j207b6m64a11I7
15745a88k20j66p23l13K87b68I23P64J069n20C39e92n28M54I85J703J430j515
15727B603H36B6g01b58k571j972l01N27R28a552F59J570m66h1k028j136r969L536
15709i678M598M13a972n13j798P81e87A119b054o78f04I11Q45k24e73k001n31
15692c105R3k49j358O53n82M3J002p56k069j070J424J006J342b30G07O22K12A41
15673e127J417a138A174J321m38J745j713D11a666j098J80M51J85M58b70m87j199
15656a956j471j760j136l63K30K552e26f9o80m66P5b76D41N52B58h53j578j817
$$ plain form
15786 -4210 -3001 -2304 -386 425 1690 1868 196 -1633 -3272 750 2321 1820 1477 926 442 368 416 -512
15767 -518 -73 175 66 -148 -897 -1615 -1162 -1362 -2169 -1235 872 2732 2641 2477 1498 -65 -1272 -26 -490 -111 97
15745 -188 -408 -574 -1297 -1610 -1323 -268 923 1687 2756 2236 339 -592 -1120 -666 985 2688 4118 2603
15727 2603 836 26 -701 -258 -2829 -4801 -5102 -4575 -3647 -1552 659 2229 1763 -81 -2109 -3245 -13214 -9678
15709 -9678 -5080 -4667 -1972 -2485 -4283 -3502 -587 1119 -2054 -2732 -604 911 1756 1532 -573 -2574 -3105
15692 -3105 -3012 -3261 -4619 -3966 -4548 -4505 -3503 -4259 -6328 -7398 -5974 -4968 -3626 -230 707 1329 1541 141
15673 -5127 -3710 -1138 1174 2495 2057 3802 2089 411 -1666 -2764 -2584 -2133 -1948 -1490 -270 -757 -1956
15656 -1956 -3427 -5187 -6323 -6686 -6456 -3904 -526 -69 -749 -1215 -1140 -276 441 993 258 -853 -2431 -4248
15638d248j029L05J328J781d19B04K59b05j058q34m72j40M77Q9O00M56j031k175
15620d293r00J307J253M34K23j146j857K082H36J401lk63E54N0a29o67OQ1A0L1
15600D1a670M30L21p0j022n43N45i95K50H48N59O5J07L52O71r10k93R76P24j90
15580B909j33E21c322r63K053c31p77j359J165I11O72o41k07J81l96a710j887
15563c597q88M86q20l137j567c987N17a634R4m4j049j288n22J727j48o75K63J337
15545a939g02a60o36o62j174q83m85J06O76Q55R04k60l55q51n34L52J078M78c96
15525B1N09R2k52b84p13l67J60j103j250k65k83K50L44p8L47J191J07N21k70p22
15505b415g28A826L54k20n63f2j600n60e54A24O40A17a347Or43j614p52j512j187
$$ plain form
15638 -4248 -5277 -4972 -3644 -1863 -419 204 463 -205 -1263 -2097 -2569 -2709 -2232 -2143 -1543 -1087 -2118 -4293
15620 -4293 -5193 -3886 -2633 -2199 -1976 -3122 -4979 -2897 836 2237 2234 1971 554 604 -129 -796 -790 -709 10 41
15600 41 -1670 -1240 -919 -989 -2011 -2554 -2009 -995 -745 848 1407 1472 1579 1931 2602 1692 1399 2375 3099 2909
15580 2909 2776 521 -3322 -4285 -2232 -331 -1108 -2467 -1302 911 1583 942 735 916 520 -1710 -3597
15563 -3597 -4485 -3999 -4819 -7956 -9523 -3987 -3470 -1634 -1540 -1584 -2633 -3921 -4443 -2716 -2864 -3539 -3276 -1939
15545 -1939 -702 -160 -796 -1458 -2632 -3515 -4000 -3894 -3218 -2363 -1459 -1719 -2074 -2925 -3459 -3107 -2029 -1551 -396
15525 21 530 622 370 -284 -997 -1364 -1204 -2307 -3557 -3822 -4105 -3855 -3511 -3589 -3242 -2051 -1944 -1423 -1693 -2415
15505 -2415 -728 1826 2180 1960 1397 -62 -1662 -2222 -554 124 764 117 -1347 -1341 -2284 -3898 -4650 -6162 -7349
$$ [...]