
##TITLE=AC1415_BRAA12224_7652885_dGozNmR9BP
##JCAMPDX= 6.0         $$ Bruker NMR JCAMP-DX V2.0
##DATA TYPE= NMR SPECTRUM
##DATA CLASS= NTUPLES
##ORIGIN= BRUKER
##OWNER= Administrator
$$ 1.72 TOPSPIN		Version 2.1
$$ 2013-03-20 03:29:37.597 -0500  Administrator@X
$$ Compression mode = diff/dup
##.OBSERVE FREQUENCY= 400.02188249412
##.OBSERVE NUCLEUS= ^1H
##.ACQUISITION MODE= SIMULTANEOUS (DQD)
##.ACQUISITION SCHEME= undefined
##.AVERAGES= 8
##.DIGITISER RES= 22
##SPECTROMETER/DATA SYSTEM= spect
##.PULSE SEQUENCE= zg30
##.SOLVENT NAME= COFFEE_meoh
##.SHIFT REFERENCE= INTERNAL, COFFEE_meoh, 1, 14.98509
##AUDIT TRAIL= $$ (NUMBER, WHEN, WHO, WHERE, PROCESS, VERSION, WHAT)
$$ ##TITLE= Audit trail, TOPSPIN		Version 2.1
$$ ##JCAMPDX= 5.01
$$ ##ORIGIN= Bruker BioSpin GmbH
$$ ##OWNER= Administrator
$$ $$ E:\/data/COFFEE/nmr/AC1415_BRAA12224_7652885_dGozNmR9BP/10/pdata/1/auditp.txt
$$ ##AUDIT TRAIL=  $$ (NUMBER, WHEN, WHO, WHERE, PROCESS, VERSION, WHAT)
(   1,<2013-03-20 03:29:29.237 -0500>,<Administrator>,<X>,<go>,<TOPSPIN 2.1>,
      <created by zg
	started at 2013-03-20 03:28:23.097 -0500,
	POWCHK enabled, PULCHK disabled,
       configuration hash MD5:
       86 BA 57 50 F2 9D 5C 9B 26 00 A9 28 5F 66 2E 89
       data hash MD5: 64K
       F0 49 97 DB 49 82 1D A7 26 2C B4 A3 BB 32 6F E9>)
(   2,<2013-03-20 03:29:32.394 -0500>,<Administrator>,<X>,<proc1d>,<TOPSPIN 2.1>,
      <Start of raw data processing
       efp LB = 0 FT_mod = 6 PKNL = 1 PHC0 = 0 PHC1 = 0 SI = 32K 
       data hash MD5: 32K
       0F D4 45 2E DF C2 CC 71 A2 05 64 23 51 71 31 E3>)
(   3,<2013-03-20 03:29:32.878 -0500>,<Administrator>,<X>,<proc1d>,<TOPSPIN 2.1>,
      <pk PHC0 = 98.86047 PHC1 = 0 
       data hash MD5: 32K
       2A 79 50 51 95 C8 37 BD B4 54 31 1E 9C B8 93 0D>)
(   4,<2013-03-20 03:29:33.128 -0500>,<Administrator>,<X>,<proc1d>,<TOPSPIN 2.1>,
      <abs ABSG = 1 
       data hash MD5: 32K
       14 24 D7 56 29 ED 73 00 DF 9A 8C F5 8F 79 18 A2>)
(   5,<2013-03-20 03:29:33.269 -0500>,<Administrator>,<X>,<proc1d>,<TOPSPIN 2.1>,
      <abs ABSG = 2 
       data hash MD5: 32K
       C7 90 76 22 AC 31 1E A9 02 0A FC A9 61 8A 39 5F>)
(   6,<2013-03-20 03:29:33.409 -0500>,<Administrator>,<X>,<proc1d>,<TOPSPIN 2.1>,
      <abs ABSG = 3 
       data hash MD5: 32K
       7A AB F2 4D 59 0A 10 0C 5B 08 66 5B 35 BC 5C 9E>)
(   7,<2013-03-20 03:29:33.550 -0500>,<Administrator>,<X>,<proc1d>,<TOPSPIN 2.1>,
      <abs ABSG = 4 
       data hash MD5: 32K
       29 B2 1B F4 2E 25 F8 25 EA 89 CA 13 63 8B 98 C8>)
(   8,<2013-03-20 03:29:33.706 -0500>,<Administrator>,<X>,<proc1d>,<TOPSPIN 2.1>,
      <abs ABSG = 5 
       data hash MD5: 32K
       05 7B 90 B2 8C 51 6E FE 4A 95 7A 57 2E 32 73 F8>)
$$ ##END=
$$ 
$$ $$ hash MD5
$$ $$ 04 76 39 79 11 57 13 E1 38 A0 2E 0E 18 D0 B3 47
##$RELAX= 
##$RELAX= 
##$RELAX= 
##$RELAX= 
##$RELAX= 
##$RELAX= 
##$RELAX= 
$$ Bruker specific parameters
$$ --------------------------
##$DU= <E:\>
##$EXPNO= 10
##$NAME= <AC1415_BRAA12224_7652885_dGozNmR9BP>
$$ [...]
150 150 150 150 150 150 150 150
##$TP07= 0
##$TPNAME0= <>
##$TPNAME1= <>
##$TPNAME2= <>
##$TPNAME3= <>
##$TPNAME4= <>
##$TPNAME5= <>
##$TPNAME6= <>
##$TPNAME7= <>
##$TPOAL= (0..7)
0.5 0.5 0.5 0.5 0.5 0.5 0.5 0.5
##$TPOFFS= (0..7)
0 0 0 0 0 0 0 0
##$TUNHIN= 0
##$TUNHOUT= 0
##$TUNXOUT= 0
##$USERA1= <user>
##$USERA2= <user>
##$USERA3= <user>
##$USERA4= <user>
##$USERA5= <user>
##$V9= 5
##$VALIST= <valist>
##$VCLIST= <CCCCCCCCCCCCCCC>
##$VD= 0
##$VDLIST= <DDDDDDDDDDDDDDD>
##$VPLIST= <PPPPPPPPPPPPPPP>
##$VTLIST= <TTTTTTTTTTTTTTT>
##$WBST= 2048
##$WBSW= 25
##$XGAIN= (0..3)
0 0 0 0
##$XL= 0
##$YL= 0
##$YMAX_a= 671336
##$YMIN_a= -571983
##$ZGOPTNS= <>
##$ZL1= 120
##$ZL2= 120
##$ZL3= 120
##$ZL4= 120
##$ABSF1= 14.98509
##$ABSF2= -5.573092
##$ABSG= 5
##$ABSL= 3
##$ALPHA= 0
##$AQORDER= 0
##$ASSFAC= 0
##$ASSFACI= 0
##$ASSFACX= 0
##$ASSWID= 0
##$AUNMP= <proc_prof1d_extract_pilot.lims>
##$AXLEFT= 0
##$AXNAME= <>
##$AXNUC= <1H>
##$AXRIGHT= 0
##$AXTYPE= 0
##$AXUNIT= <>
##$AZFE= 0.1
##$AZFW= 0.1
##$BCFW= 0
##$BC_mod= 0
##$BYTORDP= 0
##$COROFFS= 0
##$CY= 15
##$DATMOD= 1
##$DC= 0
##$DFILT= <>
##$DTYPP= 0
##$F1P= 0
##$F2P= 0
##$FCOR= 0.5
##$FTSIZE= 32768
##$FT_mod= 6
##$GAMMA= 0
##$GB= 0
##$INTBC= 1
##$INTSCL= 1
##$ISEN= 128
##$LB= 0
##$LEV0= 0
##$LPBIN= 0
##$MAXI= 10000
##$MC2= 0
##$MEAN= 0
##$ME_mod= 0
##$MI= 0
##$NCOEF= 0
##$NC_proc= -8
##$NLEV= 6
##$NOISF1= 0
##$NOISF2= 0
##$NSP= 0
##$NTH_PI= 0
##$NZP= 0
##$OFFSET= 14.98509
##$PC= 1
##$PHC0= 98.86047
##$PHC1= 0
##$PH_mod= 1
##$PKNL= yes
##$PPARMOD= 0
##$PPDIAG= 0
##$PPIPTYP= 0
##$PPMPNUM= 2147483647
##$PPRESOL= 1
##$PSCAL= 4
##$PSIGN= 0
##$PYNMP= <proc.py>
##$REVERSE= no
##$SF= 400.02
##$SI= 32768
##$SIGF1= 0
##$SIGF2= 0
##$SINO= 400
##$SIOLD= 32768
##$SPECTYP= <>
##$SREGLST= <1H.CDCl3>
##$SSB= 0
##$STSI= 32768
##$STSR= 0
##$SW_p= 8223.68421052631
##$SYMM= 0
##$S_DEV= 0
##$TDeff= 65536
##$TDoff= 0
##$TI= <>
##$TILT= no
##$TM1= 0
##$TM2= 0
##$TOPLEV= 0
##$USERP1= <user>
##$USERP2= <user>
##$USERP3= <user>
##$USERP4= <user>
##$USERP5= <user>
##$WDW= 1
##$XDIM= 32768
##$YMAX_p= 469555593
##$YMIN_p= -723993
##$CURPLOT= <Network HP LaserJet P1505>
##$CURPRIN= <$Network HP LaserJet P1505>
##$DFORMAT= <normdp>
##$LAYOUT= <+/1D_H.xwp>
##$LFORMAT= <normlp>
##$PFORMAT= <normpl>
##$SURQMSG= 1
$$ End of Bruker specific parameters
$$ ---------------------------------
##NTUPLES= NMR SPECTRUM
##VAR_NAME=  FREQUENCY,     SPECTRUM/REAL,   SPECTRUM/IMAG
##SYMBOL=    X,             R,               I
##VAR_TYPE=  INDEPENDENT,   DEPENDENT,       DEPENDENT
##VAR_FORM=  AFFN,          ASDF,            ASDF
##VAR_DIM=   32768,         32768,           32768
##UNITS=     HZ,            ARBITRARY UNITS, ARBITRARY UNITS
##FACTOR=    0.250966925370066, 1,           1
##FIRST=     8223.43324360094, 5012,         -61392
##LAST=      0,             -107908,         -142747
##MIN=       0,             -723993,         0
##MAX=       8223.43324360094, 469555593,    0
$$ Real data points
##PAGE= N=1
##DATA TABLE= (X++(R..R)), XYDATA
$$ [...]
19562g4349C35484I7579J9883P7155M7632F3675a64800N119O2954A7317b7428
19550a60792J1249d6891E9964J3178N8957b96245a20335l7457d7012A67411n8026
19539A09385a80700M3441j1996P1857K1524a7342I5877a76479j97214D2579j4736
19528B7843J83168a1004E975h3144K0867j69491A33314h1644B07047D7968J31070
19517A79038h1915k21053a23538o5164i1800m6979B4081b35541P8719F0208M9997
19506A10205a96443P9821M7620F919K05973a13869k83316b1787j41450k9745H2733
19494B05877a19103j39444A40843E7911b82053b4313m5721m7480N4955G0630J70879
19483B41509b07031D2L5782g7504j03809A80940a87480F3821e44166C51575b65854
$$ plain form
19562 -74349 335484 97579 117462 194617 242249 63675 -164800 -159681 -96727 17317 -27428
19550 -160792 -149543 -46891 59964 73142 132099 -296245 -120335 -157792 -47012 167411 109385
19539 109385 -180700 -137259 -149255 -77398 -55874 -17342 95877 -176479 -373693 42579 27843
19528 27843 211011 -11004 5975 -83144 -62277 -231768 133314 -81644 207047 47968 179038
19517 179038 -81915 -302968 -123538 -188702 -91800 -138779 24081 -235541 -156822 60208 110205
19506 110205 -196443 -116622 -69002 6919 212892 -113869 -397185 -21787 -163237 -192982 82733
19494 205877 -119103 -258547 140843 57911 -282053 -24313 -70034 -117514 -62559 70630 241509
19483 241509 -207031 42 35824 -77504 -181313 180940 -187480 63821 -544166 351575 -265854
19471B3736g897j82310A44193d30448a68526e3984C5184c75370B82673d3774E117
19459F3509a68320I7777R7133a91899D22475i1149o8610j01978I5195N6021c6263
19447b57280e9575J7877M170A3279N9023a28453H2272I019N4329j8649P0492c9637
19434b51675d3307l15692A34842M6787a23326j77837A56742F4006c0813k47263
19424b78076M4897Q3913e6965J0946l4135D5456a67538n4377A11970n2297b35196
19412a31148k97048G1108b32998d6807o0204E4582b11692e0099A50986a71714
19401F2812b0194A02912b22229j39072P7647J09587q0191g3154k62183i4914l25025
19390d19939J58711A64164b40911h6997c8549A31800b09064j21113O3942e949
$$ plain form
19471 23736 -7897 -190207 144193 -430448 -168526 -53984 35184 -375370 282673 -43774 5117
19459 63509 -168320 97777 194910 -191899 422475 -91149 -159759 -261737 95195 151216 -36263
19447 -257280 -59575 -41698 -37528 13279 72302 -128453 82272 9019 63348 44699 115191 -39637
19434 -251675 -43307 -358999 134842 181629 -123326 -301163 156742 64006 -30813 -278076
19424 -278076 -233179 -149266 -56965 -46019 -80154 45456 -167538 -221915 111970 59673 -235196
19412 -131148 -428196 71108 -232998 -46807 -107011 54582 -211692 -50099 150986 -171714
19401 62812 -20194 102912 -222229 -361301 -283654 -174067 -254258 -73154 -335337 -94914 -419939
19390 -419939 -261228 164164 -240911 -86997 -38549 131800 -209064 -330177 -266235 -5949
19379A4080J05859c78925J51510N229B22892K5875c36815E6484f0476B52535h6252
19367B27377a48079p4285b5633B214a91367o2578J18941A55635B1635i2019F3357
19355d29091A4499g2788L2864A36540k2807J39959f060D9647f4149j62448k29188
19344d55785K01258i6322c3622k56874A10963j2426k8469k4960a49754A02886
19333C6841b3548B908J23210a80557B92591a9001A57f0334k23908B31063a0785
19321d4998q2465k20125f9258O266I9338B0750c28550J44538A21390b38593a05006
19309C5984d6134A71849b8757j75414A88531d0636A4533L07000H0971c73853J58051
19298b15802B50388b57189E6070Q6573a85613A24251R3844b60732a5404o1273
$$ plain form
19379 14080 119939 -378925 -227415 -222186 222892 248767 -336815 56484 -60476 252535 -86252
19367 227377 -148079 -222364 -25633 2214 -191367 -253945 -135004 155635 21635 -92019 63357
19355 -429091 14499 -72788 -39924 136540 113733 253692 -6060 49647 -64149 -226597 -455785
19344 -455785 -254527 -96322 -33622 -290496 110963 98537 70068 45108 -149754 102886
19333 36841 -23548 2908 126118 -180557 292591 -19001 157 -60334 -284242 231063 -10785
19321 -44998 -127463 -347588 -69258 -62992 99338 20750 -328550 -184012 121390 -238593 -105006
19309 35984 -46134 171849 -28757 -204171 188531 -40636 14533 321533 80971 -373853 -215802
19298 -215802 250388 -257189 56070 142643 -185613 124251 218095 -260732 -15404 -76677
19288g6677o6693E5182h85l26k21233L5667O2958A92277d39670c0634j29474M4983
19276a15125j25916a04183B72562e0675j19274A04783a14192h997j98745i1690
19265a32280B3575P2969J77260F8644J33682a75869P3439k19940L1752D6982f3300
19253a47976M9643A87985a7705j99400A1931J58289a56847l33291b01923j81108
19243c83031G0508a44452e2657j25769d8562b0233l65948J90864J1195f6303A25576
19231g7481j84055J3024L5187J3375A11973a05792A5232f4025G024a59914c7534
19219A62196D9326d5941C34655F133b4558j6769q3313p0961N4458j5709L8475
19208a18377A10400b30631A06467J18616h3037F6730b5988j66636P517R788Q474
$$ plain form
19288 -76677 -143370 55182 -885 -1211 -222444 -186777 -123819 192277 -439670 -30634 -160108 -115125
19276 -115125 -241041 -104183 272562 -50675 -169949 104783 -114192 -8997 -207742 -91690
19265 -132280 23575 96544 273804 68644 202326 -175869 -102430 -322370 -290618 46982 -63300
19253 -147976 -98333 187985 -17705 -217105 11931 170220 -156847 -490138 -201923 -383031
19243 -383031 70508 -144452 -52657 -178426 -48562 -20233 -386181 -195317 -184122 -66303 125576
19231 -77481 -261536 -248512 -213325 -199950 111973 -105792 15232 -64025 7024 -159914 -37534
19219 162196 49326 -45941 334655 6133 -24558 -41327 -124640 -195601 -141143 -156852 -118377
19208 -118377 110400 -230631 106467 225083 -83037 66730 -25988 -192624 -185107 -175319 -166845
19197a66845B6232f80H7007a30485b6197A9134b92187b3880A12786c4820L829
19186c0991m4699k91718a77286d9035k7041B39825a55967C5308J5746a18188A05778
19174a04353D7639i2477k65221f2544E4961j3074c37395B13021B0903b20574Q9166
19163a31408r334e7317j86850m6188J03343b1315k73868m1307K5486A49392c39689
19151a09741F3045b37028a4818p475B4104N4023J2479a83957E7011N9409i5043
19139a90585N6126N4803F093b29608K3460L8677j90182b5864H3340b84349P2807
19128b11542A5787a56291k2051j26273H7023e8678j59840D15073a15282J2749
19118a02533k8389I4801a65598N4237j01993b1934m33007B1847e02046A0566e0663
$$ plain form
19197 -166845 26232 -680 87007 -130485 -26197 19134 -292187 -23880 112786 -34820 -30991
19186 -30991 -75690 -367408 -177286 -49035 -76076 239825 -155967 35308 51054 -118188 105778
19174 -104353 47639 -92477 -357698 -62544 54961 41887 -337395 213021 20903 -220574 -131408
19163 -131408 -140742 -57317 -244167 -290355 -187012 -21315 -295183 -336490 -311004 149392 -339689
19151 -109741 63045 -237028 -14818 -22293 24104 78127 90606 -183957 57011 116420 -95043
19139 -190585 -134459 -79656 6093 -229608 -206148 -167471 -357653 -25864 83340 -284349 -211542
19128 -211542 15787 -156291 -178342 -304615 87023 -58678 -218518 415073 -115282 -102533
19118 -102533 -130922 94801 -165598 -111361 -213354 -21934 -454941 21847 -502046 10566 -50663
19106B38089q8318b03347K2396B37600g4633m21154A44755K20577b04077A38846
19095E8195b1012H9674K57498H3113a06345A55383C6765a22969c6810k0750A11495
19083e0291n2992F9699a17385j7140D6920h758j10697D80011a95076q8838j22981
19072d06895D0723K6060A8860P203a88890n6396g0375o8842N560A7718b91563
19060A7662M2148a01259A75521b37115a0394B8189b09770P2884k9623E6333K4449
19049H0782g6215k71574J70283k59758i6087L7505B84117G8663d9507F6464M7068
19038A13532L4808f1187j37226k5223a03987b7208I9624c42060a30091A6763c1279
19026A54968O1680K1856G4910d7702C2993J76491b56079D29313a9345j20576G0224
$$ plain form
19106 238089 149771 -203347 -180951 237600 -74633 -495787 144755 365332 -204077 138846
19095 58195 -21012 89674 347172 83113 -106345 155383 36765 -122969 -36810 -57560 111495
19083 -50291 -103283 69699 -117385 -134525 46920 -8758 -119455 480011 -195076 -283914 -406895
19072 -406895 40723 66783 18860 26063 -188890 -245286 -70375 -139217 -133657 17718 -291563
19060 17662 59810 -101259 175521 -237115 -10394 28189 -209770 -136886 -166509 56333 80782
19049 80782 -76215 -347789 -177506 -437264 -96087 -58582 284117 78663 -49507 66464 113532
19038 113532 148340 -61187 -198413 -223636 -103987 -27208 99624 -342060 -130091 16763 -31279
19026 154968 216648 238504 74910 -47702 32993 209484 -256079 429313 -19345 -139921 70224
19014E2220J40592I1597b82524H7774Q458a65914K4230e0996j69540f080B5629
19002a13926d1855l14870b3738A66860e3011E5559L13188j29327A12919B1707
18991C3524B588J08509m1732N2812h5562B30519a59201a7222A00680c34141i9856
18979A0008L64934f4724k04415i1105G7257b01326A40909b81331a749q3830A32950
18967D6538L1231c13278k3314a66709o4821k4045A16503a78610g6220G8381a42104
18955e3910A11893a74017G6213f5718k22345A10864a28608A01273C1477b22017
18944B29254j0803c19548E1610a71983A60918c0502k70615a48777A50948a5312
18933b16486B11417d3579a2930F7997O1573d0897I7783a88441C44248b7152B86317
$$ plain form
19014 52220 192812 91597 -282524 87774 96232 -165914 -141684 -50996 -220536 -6080 25629
19002 -113926 -41855 -356725 -23738 166860 -53011 55559 368747 239420 112919 21707
18991 33524 2588 111097 69365 122177 -85562 230519 -159201 -17222 100680 -334141 -99856
18979 10008 374942 -64724 -269139 -91105 77257 -201326 140909 -281331 -1749 -85579 132950
18967 46538 77769 -313278 -336592 -166709 -231530 -255575 116503 -178610 -76220 78381 -142104
18955 -53910 111893 -174017 76213 -65718 -288063 110864 -128608 101273 31477 -222017
18944 229254 218451 -319548 51610 -171983 160918 -30502 -301117 -148777 150948 -15312
18933 -216486 211417 -43579 -12930 67997 129570 -40897 97783 -188441 344248 -27152 286317
18921B78858b2014k71729K1912i5191a7796r4945K6327j45058A6585a8828j93076
18910b11904B15364b77026J4271B03192B9811N3917g3168p9056L3495A09462D0168
18898b34110j62143E0359K22614m0680A03083H86d2344p3150j96471B24288c0511
18886e53390B94743a48395A85921J81077b0268A13829M935b7553j44130j67381
18876c39064a44205A30289f4030C92278B0443a80490f1496q6961D1521J97489
18866B39010a38929k06145A0971d57478c9502j53366A14657m0913J9765a99540
18855A08258a49832j59259I3537Q540p860R9229d7253B13676n2745F4092h7843
18843e3663j13338j78321B02406I5877i8895K3268q6319g7775p2528r2942O5687
$$ plain form
18921 278858 -22014 -293743 -271831 -95191 -17796 -112741 -86414 -231472 16585 -18828 -211904
18910 -211904 215364 -277026 -262755 203192 29811 83728 -73168 -152224 -118729 109462 40168
18898 -234110 -396253 50359 272973 232293 103083 886 -42344 -115494 -311965 224288 -30511
18886 -553390 294743 -148395 185921 366998 -20268 113829 118764 -27553 -171683 -339064
18876 -339064 -144205 130289 -64030 392278 20443 -180490 -61496 -148457 41521 239010
18866 239010 -138929 -345074 10971 -457478 -39502 -192868 114657 73744 93509 -199540
18855 108258 -149832 -309091 93537 102077 94217 193446 -47253 213676 160931 64092 -87843
18843 -53663 -167001 -345322 202406 95877 -98895 -75627 -161946 -77775 -150303 -243245 -177558
18832a77558C5121b52649m1559A09818d1055F1765a27507j97449B12623A05253
18821A38662J09594b05174f7423i625n5347D9182J2355a0381A41937o6052M9475
18810A25360J18975c8716A96378b48023A39708J64255m5253c77999A94539b82495
18799A05790b53297i1421j09251A34995c02632h6760F0295d5007F4529d68374
18788a90698L6830m0785F3815M6960K17239c26794b7095k0584b0794k82891E5974
18776b12068r765C3708b79523a405A9014J35177R7218C6234b13077A67834E6421
18764A67028e7734A99401a22028k2185k20205C60088f5670C190a76928g4261A28441
18752a30988m0259N9522G6275e7205o0902B87482a82149c2567j0240r2202m7392
$$ plain form
18832 -177558 35121 -252649 -294208 109818 -41055 61765 -127507 -324956 212623 105253
18821 138662 248256 -205174 -67423 -9625 -64972 49182 61537 -10381 141937 75885 125360
18810 125360 244335 -38716 196378 -248023 139708 303963 258710 -377999 194539 -282495
18799 105790 -253297 -91421 -200672 134995 -302632 -86760 60295 -45007 64529 -468374
18788 -190698 -153868 -194653 63815 110775 328014 -326794 -27095 -47679 -20794 -303685 55974
18776 -212068 -221833 33708 -279523 -1405 19014 154191 251409 36234 -213077 167834 56421
18764 167028 -57734 199401 -122028 -144213 -364418 360088 -65670 3190 -176928 -74261 128441
18752 -130988 -171247 -111725 76275 -57205 -118107 287482 -182149 -32567 -42807 -135009 -182401
18741a82401A09927Q1638a26707L2186H223c6894A13897h6437n0542G5241a0603
18729b96546L1301A92749b92918Q6240n5945c9923n0373C9201J62214g9808B31530
18717a87688k17B34449D2943d12722a42591P716B7199d1552C04279B4376g0646
18705a61668d7308o2162A70478a70225B2211R005f4462A88a34940A29758b6356
18693h5273B41705a67498A69036a96960A26039a66194M7254k75898A69036g5761
18682a6188q3340j51004I9694b89851J41582k36526A62938g9314M946a5518K953
18671a2565m593B4398J61524C0070b10599K102j00559a1158q8420G0417b6955
18659a77672e0908j49961A09319J62552H4548g6906k94521i8398I8529b98786
$$ plain form
18741 -182401 109927 191565 -126707 -94521 8223 -36894 113897 -86437 -136979 75241 -10603
18729 -296546 -265245 192749 -292918 -206678 -262623 -39923 -90296 39201 201415 -79808 231530
18717 -187688 -187905 234449 42943 -412722 -142591 -134875 27199 -41552 304279 24376 -70646
18705 -161668 -47308 -109470 170478 -170225 22211 31216 -64462 188 -134940 129758 -26356
18693 -85273 241705 -167498 169036 -196960 126039 -166194 -118940 -394838 169036 -75761
18682 -16188 -99528 -250532 99694 -289851 -148269 -384795 162938 -79314 -74368 -15518 -12565
18671 -12565 -17158 24398 185922 30070 -210599 -208497 -309056 -11158 -99578 70417 -26955
18659 -177672 -50908 -200869 109319 271871 84548 -76906 -371427 -98398 98529 -298786
18648H7568P0124i9301m1858j3513C3348a10816I935a16494n2695G1482a87672
18636D1589a01758A62094b88681A33878f3846C3104D23c3666m9201k0900E6114
18624d2961H6467c63903K3351f0678j68742A1827L9108d8161A33225a04669l3441
18613a38110H7600k5299K27871b49234j1543K3123d6182n9156R990B67889F1455
18601b43538J08518j17113B10066D3810d26526a25714K4391j17877D2713C232
18590B22457a43705G1283c02895e7553A21022c29752i3110a2444A52623b52816
18579g0968j37182f1717b2638o8997j25498C26919j43871a19666D9964a42271
18568a46129a8321L931D88005a19405C57360a67442f9389q6939M6399d6364j31355
$$ plain form
18648 87568 157692 -99301 -141159 -154672 33348 -110816 9935 -116494 -169189 71482 -187672
18636 41589 -101758 162094 -288681 133878 -63846 33104 423 -33666 -82867 -103767 56114
18624 -42961 86467 -363903 -340552 -60678 -229420 11827 50935 -48161 133225 -104669 -138110
18613 -138110 87600 62301 290172 -249234 -260777 -237654 -46182 -105338 -95348 267889 61455
18601 -243538 -135020 -252133 210066 43810 -426526 -125714 -101323 -219200 42713 3232
18590 222457 -143705 71283 -302895 -57553 121022 -329752 -93110 -12444 152623 -252816
18579 -70968 -208150 -61717 -22638 -91635 -217133 326919 183048 -119666 49964 -142271
18568 -146129 -18321 -14390 488005 -119405 357360 -167442 -69389 -156328 -109929 -46364 -177719
18557a77719k29438J01797a03140F2641e5715H9330L92923a45903K6240H4303
18546B04280h7458p1808F3058N9906J21532p3339a06028b6612A68037e4990C6825
18534b72750a17704j11344J08401D6023b20316k10300i4305c5256A27972D9124
18523b13895o1312n4285h7524J5999n9181j1245B08959i7853A22425d90525h6554
18511a42188K7550o3413A56370p481n8423d2858C98293j69442B4934J2479K63852
18500C01265A31391j7791J3199J6567g0982m38838b3517k22766a22757p0840I9521
18488C3761b17489l6548g8548j38048J07178m4414B41416i8573c9045j8667D5899
18476h4872A59505a4407l09281f1236A74392D0312a06985a9651A20247m8772B7486
$$ plain form
18557 -177719 -407157 -305360 -103140 62641 -55715 89330 482253 -145903 -119663 84303
18546 204280 -87458 -159266 63058 122964 244496 171157 -106028 -26612 168037 -54990 36825
18534 -272750 -117704 -229048 -120647 46023 -220316 -430616 -94305 -35256 127972 49124
18523 -213895 -275207 -329492 -87524 -71525 -130706 -141951 208959 -97853 122425 -490525 -86554
18511 -142188 -114638 -178051 156370 148889 90466 -42858 398293 228851 24934 37413 301265
18500 301265 131391 113600 126799 143366 -70982 -509820 -23517 -246283 -122757 -193597 99521
18488 33761 -217489 -254037 -78548 -216596 -109418 -153832 241416 -98573 -39045 -57712 45899
18476 -84872 159505 -14407 -323688 -61236 174392 40312 -106985 -19651 120247 71475 27486
18464A34712D5731a2661m7903j10791G5065a06055r1330K291B44412G1543c4881
18452a22303e8947F0939d471n6459k01644Q6255O748I2887J7069d1218m726k95010
18440c40954a890B62047a74562f9327E9704c26808I9488M7548b7153A70037b386
18428a50450B14742g2821A57988k7987J39025c2300C2737a01598j7202G1453a95501
18416a25834G6118b08586A24020a47559A21914J65777A03391a24024n5647A50809
18405a55446A53450F6366J31381o9181k4223b22969Q0495a1112G8412B4667a4962
18393e6051F7264N6347l5440c6692j2832j06706l85967B20951E4296a34278O4608
18382f9670B8838a55503q1323e805b038A46186b1868k37518B02117D2232n640
$$ plain form
18464 134712 45731 -12661 -60564 -171355 75065 -106055 -197385 -195094 244412 71543 -34881
18452 -122303 -58947 60939 -4471 -60930 -262574 -176319 -169571 92887 109956 -41218 -45944 -340954
18440 -340954 -1890 262047 -174562 -69327 59704 -326808 99488 147036 -27153 170037 -2386
18428 -150450 214742 -72821 157988 130001 269026 -32300 32737 -101598 -118800 71453 -195501
18416 -125834 76118 -208586 124020 -147559 121914 287691 103391 -124024 -179671 150809
18405 -155446 153450 66366 197747 128566 104343 -222969 -142474 -11112 78412 24667 -14962
18393 -56051 67264 123611 88171 -36692 -49524 -156230 -542197 220951 54296 -134278 -69670
18382 -69670 28838 -155503 -236826 -5805 -2038 146186 -21868 -259386 202117 42232 36592
18371C6592a23993c7406k15578d8290l6616A07997O741Q087k1339J36520g7502
18359A3608a25893A38952b11699o9001M3878d6567J246n6137d1552J4655k79398
18348c06295J09938A10029D0415b53976n6481A83889a07485K3662o9374C4142
18337c2224l59157C62602A68940A3259c5088F8739a58566B51704b00053B44312
18326B6461P0220a28570j60721H9044e2208j64631H3728J1815b07172G7677O6748
18315A44425l827a79842c8495A30979B9754f8211q9413k3598d0307q6879e2388
18303b85053e165j860p049j95216A13708b00786O7519g043j14221M966b3226A25090
18290I5156d0268k56006a23959M9955j01921B56696A27212L9487a7120A41798
$$ plain form
18371 36592 -123993 -37406 -252984 -48290 -84906 107997 114738 122825 101486 238006 -77502
18359 13608 -125893 138952 -211699 -280700 -236822 -46567 -45321 -101458 -41552 -26897 -306295
18348 -306295 -196357 110029 40415 -253976 -310457 183889 -107485 -83823 -153197 34142
18337 -32224 -391381 362602 168940 13259 -35088 68739 -158566 251704 -200053 244312
18326 26461 96681 -128570 -289291 89044 -52208 -216839 83728 95543 -207172 77677 144425
18315 144425 140598 -179842 -38495 130979 29754 -68211 -157624 -181222 -40307 -127186 -52388
18303 -285053 -5165 -7025 -14074 -209290 113708 -200786 -133267 -7043 -121264 -116298 -23226 125090
18290 95156 -40268 -296274 -123959 -74004 -175925 256696 127212 166699 -17120 141798
18279A28225b67805J2525H5286e3086R567r7334n9162A62100K38310A09992e5702
18267H4444A8228a81811O0085B9212P8194J23767d2047k01840a8487k36811E8608
18255a48316B08291J0392C3548J47176a9722j15147A42923c50173R2514B15230
18244e4195l40659a17514G7497e6417o8304M5794c5988A54516B9653b83317f3585
18232g5574l7180e3389I6440n896b24048i9958p0916D1975A4909P5080c38180
18220B6494b56102C83176g5123p5816A87210J82255d4461B30420R7D9912d05726
18208b18329D2485Q3687c22232P5536E0325J2812d6909l9937c8522D3750d1135
18196B54145G7834K11489c0105l7979i61A62862f3402j70521C4331a2451j28833
$$ plain form
18279 128225 -267805 -255280 85286 -53086 -43519 -140853 -200015 162100 400410 109992 -55702
18267 84444 18228 -181811 -121726 29212 107406 231173 -42047 -243887 -18487 -255298 58608
18255 -148316 208291 218683 33548 180724 -19722 -134869 142923 -350173 -257659 215230
18244 -54195 -394854 -117514 77497 -56417 -124721 -78927 -35988 154516 29653 -283317 -63585
18232 -75574 -112754 -53389 96440 90544 -224048 -99958 -170874 41975 14909 89989 -338180
18220 26494 -256102 383176 -75123 -150939 187210 369465 -44461 230420 230517 49912 -405726
18208 -218329 42485 126172 -322232 -246696 50325 63137 -46909 -86846 -38522 43750 -41135
18196 254145 77834 289323 -30105 -68084 -961 162862 -63402 -233923 34331 -12451 -141284
18185a41284M5120B30887c33045N5793L2776B39025f7909J4778C00530c66122
18174b31627I9975M1628c30482a52435B59383J5121a72082K1140C6375a06805
18163a39386B18251f7044A47664b21689j5499J03941j40454A72384b23028d6823
18152a7144q0559d2181r7389E2363g4562m3143J7677C49992a79387m8079r245
18141b36711D39a50535A78273a36870m0955H2154c40112b7123j84384C18820A15304
18129B2375J30223Q0951K02992a02415B28332K0911d46457A20107M5737q2439
18119H3405B2318a97305A19202b9909n0464L3580j1520A08161J89820a4367D2335
18107a91343P6658j22697F673e7549k22841G3664j4563k5823M5267B2002b8202
$$ plain form
18185 -141284 -96164 230887 -333045 -277252 -244476 239025 -67909 -53131 300530 -366122
18174 -231627 99975 141603 -330482 -152435 259383 274504 -172082 -150942 36375 -106805
18163 -139386 218251 -67044 147664 -221689 -237188 -133247 -273701 172384 -223028 -46823
18152 -17144 -97703 -42181 -139570 52363 -74562 -117705 -100028 349992 -179387 -227466 -236711
18141 -236711 439 -150535 178273 -136870 -177825 82154 -340112 -27123 -211507 318820 115304
18129 22375 152598 233549 436541 -102415 228332 249243 -446457 120107 165844 83405
18119 83405 22318 -197305 119202 -29909 -80373 -46793 -58313 108161 297981 -14367 42335
18107 -191343 -114685 -237382 6673 -57549 -280390 73664 59101 33278 78545 22002 -28202
18095A98576a79501a9190j55820G4844b13782k98494F91a43624k70098B17923
18084d142l94809a93313k05655a50026A68828F2187J93888a75797B38445i0138
18073d6503A43987J95983A04808D4589a04814B34868m5006b8269q5226k1027d1579
18061A25683l2437l0500a22842C33944b4490A23117A8737J67112R4541b31935
18050d7482H8927a52063A4677c946F1129j7414c21202o6269c0357k9640A83592
18038C7624A8525h1362A47470c67867a42532O9520K6718c510n10988B09884a20436
18026C861J29108b33328A28606b06385r0550J41987d4971l7691A25593a50880
18015c000j75688b6331j41236H6484B7961Q2876J07226r0782L8063c25873D9314
$$ plain form
18095 198576 -179501 -19190 -175010 74844 -213782 -512276 691 -143624 -413722 217923
18084 -4142 -398951 -193313 -398968 -150026 168828 62187 256075 -175797 238445 -90138
18073 -46503 143987 339970 104808 44589 -104814 234868 189862 -28269 -113495 -134522 -41579
18061 125683 93246 62746 -122842 333944 -24490 123117 18737 185849 280390 -231935
18050 -47482 88927 -152063 14677 -3946 61129 43715 -321202 -387471 -30357 -59997 183592
18038 37624 18525 -81362 147470 -367867 -142532 -73012 -46294 -3510 -514498 209884 -120436
18026 3861 132969 -233328 128606 -206385 -296935 -154948 -44971 -82662 125593 -150880
18015 -3000 -178688 -26331 -167567 86484 27961 110837 218063 127281 165344 -325873 49314
18003A36611a2712A20332k5770g5017K5474l692J4561B1587M6251c5409j52942
17992a88351D4037a43184d5860B6455a81181E5936i3459m5368n6662D1362Q1763
17981A23125a65563B29972c98540a76931B53885c6243j34699i149q6422B04698
17970b12854g0856B73468a68871D0854L51389j35409r1678F5270b84721a14032
17959g8541m1232l6197B96573a7110I4728l0871b1127B96590D1932i4230j14678
17948b08908f9783F9813a60602O2435n4939B8828a8805C40061b09394J6143P4654
17937a18597j48696A12581B0255d2122E5035O6195a24899B56233p6231b98506
17926A43467a1958m45697a0564E9530a32786A85515F2743Q1524J61987A20551
$$ plain form
18003 136611 -12712 120332 94562 -75017 -49543 -53235 -38674 21587 67838 -35409 -188351
17992 -188351 44037 -143184 -45860 26455 -181181 55936 -93459 -138827 -195489 41362 123125
17981 123125 -165563 229972 -398540 -176931 253885 -36243 -170942 -9149 -95571 204698
17970 -212854 -70856 273468 -168871 40854 392243 256834 165156 65270 -284721 -114032
17959 -78541 -119773 -155970 296573 -17110 94728 63857 -21127 296590 41932 -94230 -208908
17948 -208908 -69783 69813 -160602 -98167 -153106 28828 -18805 340061 -209394 -193251 -118597
17937 -118597 -267293 112581 20255 -42122 55035 121230 -124899 256233 180002 -298506
17926 143467 -11958 -457655 -10564 59530 -132786 185515 62743 144267 306254 120551
17915F5134J615P5941a23459l1530p0154c4227D0413d613j1939j51772P3670E5254
17902b45080B54733i4385C63442j11595a42564B38756j10309c66095a04696F8680
17891a63059N6441l8203B4225P4126g3817A0600b28647p0722a04599c1305B54875
17879B06407C9940Q5439A4169J96872I8246a81684M9365A6563K2417f621G8667
17867b35369h2215A0956K1139a16133k26514B7786c28051H0146J99160a54278
17856b15232B7659b752o7781B20677n072a55366p197o2409j9158A45513a73090
17844A90146a49460b1885o2206C23206b05548A44694m3765b7356G5455a16811
17833c34956A3730K14507c05861A43409a462j54559F1807b14093A14977a63374
$$ plain form
17915 65134 66749 142690 -123459 -154989 -225143 -34227 40413 -4613 -16552 -168324 -94654 55254
17902 -245080 254733 -94385 363442 251847 -142564 238756 128447 -366095 -104696 68680
17891 -163059 -106618 -144821 24225 98351 -73817 10600 -228647 -299369 -104599 -31305 254875
17879 206407 39940 125379 14169 211041 98246 -181684 -132319 16563 38980 -6621 78667
17867 -235369 -82215 10956 32095 -116133 -342647 27786 -328051 80146 279306 -154278
17856 -215232 27659 -2752 -70533 220677 215605 -155366 -162563 -224972 -244130 145513 -173090
17844 190146 -149460 -21885 -84091 323206 -205548 144694 100929 -27356 75455 -116811
17833 -334956 13730 228237 -305861 143409 -1462 -156021 61807 -214093 114977 -163374
17822B02431O5091a97230R2065A68968h9256A26457d3738D775a4372D7649J62907
17811B10556I8993M5912O1869b9062l3234m5294D3218N1091j4008c1799q8440
17800a20239F4737b10310J3713G7867D378a61905J5527P1376B1286A0270a00731
17788C45950B0530L68019j17934g5484D2411P1869a0631j80230l3763c3993j2252
17777d6245q573q0728l71113D7823F730e4473C56559a01969A30175B6208K3735
17766D9943a00607E3691J16336O290C2258j0216K77J51084b19196L1128B33438
17754E2803K256K9489K2548e726C7363a17472f023C68155A81967E5868a5705G127
17741B14735J18129F9175l0950A1648b16630Q9798K8581E5649c1573A20300b4743
$$ plain form
17822 202431 267522 -197230 -105165 168968 -89256 126457 -43738 4775 -14372 47649 210556
17811 210556 98993 144905 206774 -29062 -62296 -107590 43218 94309 80301 -31799 -120239
17800 -120239 64737 -210310 -196597 77867 4378 -161905 -146378 -75002 21286 10270 -100731
17788 345950 20530 388549 270615 -75484 42411 114280 -10631 -190861 -224624 -33993 -46245
17777 -46245 -54818 -135546 -506659 47823 6730 -54473 356559 -101969 130175 26208 49943
17766 49943 -100607 53691 170027 176317 32258 22042 22319 173403 -219196 -188068 233438
17754 52803 55059 84548 107096 -5726 37363 -117472 -6023 368155 181967 55868 -15705 7127
17741 214735 332864 69175 38225 11648 -216630 -126832 -98251 55649 -31573 120300 -24743
17729A43641f6268c0955j97946L3729C0222g0182D8736N4219a09049i152k40473
17718b49625A57974O938c17668B30333H8002B4976Q1255a40800j16383R4706A21130
17706G5150a21023A27012e9907n6890A05362K515J61964e3244B53770A04729b25730
17694a55978r6064N2042G1887j5571L63074A93800C2511P5255m4823J44650D6697
17682e9153F5268J09564B950J68242M8839c10352I4622A2922J47258h9146m47
17671h9593j6812A58298p4868l9832K35108a35369A60747p1137B9071d9375A85811
17659A14106J08217b24920A94265k1369b09322B17032C5642L52758b3332m49026
17649d72358E2554J69273j3264b5323j50545I3700P6115p8704a41088e8548H0105
$$ plain form
17729 143641 -66268 -30955 -228901 -195172 30222 -70182 48736 102955 -109049 -9152 -249625
17718 -249625 157974 164912 -317668 230333 88002 24976 106231 -140800 -257183 -162477 121130
17706 75150 -121023 127012 -59907 -116797 105362 107877 269841 -53244 253770 104729 -225730
17694 -155978 -252042 -200000 71887 56316 419390 193800 32511 107766 62943 207593 46697
17682 -59153 65268 174832 2950 171192 220031 -310352 94622 12922 160180 -89146 -89593
17671 -89593 -106405 158298 83430 43598 278706 -135369 160747 89610 29071 -49375 185811
17659 114106 222323 -224920 194265 172896 -209322 217032 35642 388400 -23332 -472358
17649 -472358 52554 221827 208563 -25323 -175868 93700 169815 91111 -141088 -58548 80105
17637g4492A91753D2018J17822F2657L8551L20930k06542E8145c76730J67169
17627b09561D9550g7921A01955J8356c9348j09438B23379m7729E459P5987K24760
17616C06206p6915J8257F998O6964J40121r5286J22155o4053A4083K772a23142
17604B64305i1890A63887i2800j50678j47774B49640A1519M1898K02950D2413
17593G8494h8727A9612a37256E9685K96717G5208b48260A38447b10684B59M5056
17582D5315a98547M0609P7708m40047E2436J10029C9057j9088O6544f1071E3965
17570B01430k4654d7117A49701a07041F8901M87492H4883P9230E1272b24122H5015
17558C55572j5779a26772j28515h8646B7095b93646a7598B33873b40159B15275
$$ plain form
17637 -74492 191753 42018 159840 62657 101208 422138 215596 58145 -376730 -209561
17627 -209561 49550 -77921 101955 120311 -39348 -148786 223379 175650 5459 81446 306206
17616 306206 229291 247548 6998 73962 214083 118797 240952 176899 14083 16855 -123142
17604 264305 -91890 163887 -92800 -243478 -391252 249640 11519 53417 256367 42413
17593 78494 -88727 19612 -137256 59685 356402 75208 -248260 138447 -210684 259 45315
17582 45315 -198547 -157938 -80230 -520277 52436 162465 39057 19969 86513 -61071 53965
17570 201430 176776 -47117 149701 -107041 68901 556393 84883 164113 51272 -224122 85015
17558 355572 339793 -126772 -255287 -88646 27095 -293646 -17598 233873 -240159 215275
17547A9506N5297j8086j3993A0973b20241A32599a61302o199L6607B22754f0506
17535A95410A0077K492e6110E1954L4135I859J96923H9827C9762J45055C445e682
17522A7899J65096J41309j21650o9836b13235h2859E1352J55641A01846a75886
17511A16093a23542A09539i841A27138C5849Q575c77457C54071A8422a46221H4124
17499B34363d0686I9432d03259h7853b0028j15843B26760I4186J57771n9383a10488
17487C22868H795J42492E6977K28193C3144K51748q9890p4162a2197C49568A16996
17475A21968A9526M53329Q4553A22792O4743o8696J33182E9487i6080B72652A30795
17463b49243A40538F0905a81693C73249B2127H435K37681c07997D22323k3287
$$ plain form
17547 19506 74803 56717 42724 10973 -220241 132599 -161302 -167501 -130894 222754 -60506
17535 195410 10077 12569 -56110 51954 86089 9859 206782 89827 39762 184817 3445 -5682
17522 17899 182995 324304 202654 132818 -213235 -82859 51352 206993 101846 -175886
17511 116093 -123542 109539 -9841 127138 35849 44424 -377457 354071 18422 -146221 84124
17499 234363 -40686 99432 -403259 -87853 -20028 -135871 226760 94186 251957 192574 -110488
17487 322868 8795 151287 56977 285170 33144 284892 195002 120840 -12197 349568 116996
17475 121968 19526 472855 557408 122792 187535 118839 252021 59487 -96080 272652 130795
17463 -249243 140538 60905 -181693 373249 22127 8435 246116 -307997 422323 399036
17453C99036A54324J09175Q2939F2698K76054h4990D40776k03108p1450l9662
17443A26556K08346b3830C77892j88944K82098k8204p0189A03386J04065J05057
17433C12508q8697J68796j95849D2985K84901O9936L14270C5733O0536K85649
17423C81918j63609J12020J4250A55105J80269p8829P4181K18162B52445K84373
17413E36818B18832l3126k52K4362r5212L95927j71589q350J0832j49610A7126
17401I3962N6547o2977K83345E9845O4084K01172K9269L31415l14577J02646f5849
17389B07857L13657B3970J9406J32383R0747J28353D4338d9359B93901A40310
17378C20654A45986K12388a58957C45735j16173K37346A12688Q6529n0287m611
$$ plain form
17453 399036 154324 263499 346438 62698 338752 -84990 440776 237668 166218 126556
17443 126556 334902 -23830 377892 188948 471046 442842 372653 103386 207451 312508
17433 312508 223811 392607 196758 42985 327886 397822 712092 35733 96269 381918
17423 381918 218309 330329 344579 155105 335374 256545 330726 548888 252445 536818
17413 536818 218832 185706 185454 209816 114604 510531 338942 330592 341424 191814 17126
17401 93962 150509 87532 370877 59845 123929 325101 354370 685785 371208 473854 -65849
17389 207857 521514 23970 43376 175759 266506 394859 44338 -49359 293901 140310
17378 320654 145986 358374 -158957 345735 229562 466908 112688 199217 148930 144319
17368A44319K675M6474M1471J34283b0956C173L34200r7023J23185A81182a34805
17356A33507k931K49492b42925B76013b41944A16606J44216m5113H9501J67694
17346B57195L9404i9795C44791p7019J09967J92475F5502L5118A1312a6582D46513
17334B71527L8220j03852I3281b29963i07A86806L9906l0514f0189j91008h2683
17322C13931J04810j40131A23655J89648n9981D8244g5342E1357J68300N0917
17312B70574B48a9265B92968E1534J53305B0260L19225p4711A11855Q5236C697
17300C43393F7615K08608e6275j26789P8461C66723A75985I355d5755k6953C16202
17288C3714J5944K29367e8014D6521e2078A34607K771B6940J06139g3302j40611
$$ plain form
17368 144319 146994 193468 234939 369222 -20956 3173 337373 240350 363535 181182 -134805
17356 133507 130576 380068 -242925 276013 -241944 116606 260822 215709 89501 257195
17346 257195 296599 -99795 344791 267772 377739 570214 65502 100620 11312 -16582 446513
17334 271527 309747 205895 93281 -229963 -907 186806 226712 196198 -60189 -251197 -82683
17322 313931 418741 278610 123655 313303 253322 48244 -75342 51357 219657 270574
17312 270574 248 -19265 292968 51534 204839 20260 339485 264774 111855 197091 3697
17300 343393 67615 276223 -56275 -183064 -104603 366723 175985 9355 -45755 -72708 316202
17288 33714 49658 279025 -58014 46521 -52078 134607 137378 26940 133079 -73302 -213913
17277b13913C99005j25367J33909i0953G1662J4403j6537C3203L75138A68747
17266C35831m1254g4893C06155A32508K57233A93118R7806l7964M6117h626A3319
17254D05683A63405J74966K8563M7749I2895a6710B28880P7640j49036B6711I497
17242E057Q6162J76456b43855A62359J78151R0763A72607a72358A9733M0068J11832
17231A71633b29587D31497f4350B67429b0823B58615r5606a24564B58274K59196
17221E17470k26580n2204j04200M20733b39585B86511M2585J77589A39099o8515
17211G0584J22146K28758j72189J45834h251A23111Q4396M76415B44665o3220
17201A81445n1972n1338K16422D7953n298J62355E9505i0807K3932B92473A39206
$$ plain form
17277 -213913 399005 273638 407547 -90953 71662 86065 69528 33203 408341 168747
17266 335831 294577 -74893 306155 132508 389741 193118 290924 252960 299077 -8626 13319
17254 405683 163405 338371 366934 414683 92895 -16710 228880 306520 157484 26711 9497
17242 5057 91219 267675 -243855 162359 340510 431273 172607 -172358 19733 59801 171633
17231 171633 -229587 431497 -64350 267429 -20823 258615 163009 -124564 258274 517470
17221 517470 290890 238686 134486 555219 -239585 286511 329096 506685 139099 70584
17211 70584 192730 421488 249299 395133 -8251 123111 207507 683922 244665 181445
17201 181445 129473 78135 294557 47953 42655 205010 59505 -90807 -66875 292473 139206
17189H3404K67559i212C54281j72961K37802k2705j04965J43457A62045J65481
17179C27526K04878f6846E03943k43437l3775H1522K79371j64466m0500J63464
17169C19391l070H8857L9356K30102j4644n7698H458J33519K05996j32370K33854
17158D49457J32144j88622A6639R0274P0745J15271A30856L9312J19812Q77j16406
17147A74451O6579o1076R04L39267j46455F5463L04726m8779K76971B21854H6251
17135B38089K69638k50028Q3370J5550J14005m241A88834K47050j49750M30516
17125G16650k51951k18193K85385B45267J6604M5694p9585J10662N7728i251D06447
17113F01818F5431J80367J93407j98027J62464A30885K93382A53859L56631K2805
$$ plain form
17189 83404 350963 -9212 354281 181320 419122 396417 291452 434909 162045 327526
17179 327526 532404 -66846 503943 260506 226731 81522 360893 196427 155927 319391
17169 319391 316321 88857 128213 358315 343671 285973 8458 141977 347973 215603 449457
17158 449457 581601 392979 16639 106913 177658 292929 130856 170168 289980 290857 174451
17147 174451 241030 179954 180858 520125 373670 65463 370189 321410 598381 221854 86251
17135 238089 507727 257699 341069 356619 470624 466383 188834 435884 286134 716650
17125 716650 464699 246506 531891 245267 261871 307565 227980 338642 396370 -9251 406447
17113 601818 65431 245798 439205 241178 403642 130885 424267 153859 510490 533295
17103E33295j73729r0861R2928M59882l0797E9779K57171K9204J97459L4326J02689
17092F80628j39788j0503l1047p8416b1685D98494J83118j3692N517j16030A82780
17080C83054q7024n1705M12726C24941L2668K43606k44287L11209k62987N0483
17070D55633J84556J9828A09791J57896L72201k22725K63532p1080j69457k01746
17060B38412r113L95670B82354M52837l16003J26194B33592M67732j76235L28437
17050H53526D02496M9662j9777J27900J59492j21376N3286p4512J427J95905o6304
17039G08199p4580o1307R1124C05251J71746j29735K63612j39436L97240k85151
17029E83527B57390L24617M276B86941K64118n1403K16735j39466J90488j14552
$$ plain form
17103 533295 359566 268705 361633 821515 790718 59779 316950 346154 543613 577939 680628
17092 680628 540840 530337 499290 420874 -21685 498494 681612 667920 673437 557407 182780
17080 383054 296030 244325 657051 324941 357609 601215 356928 668137 405150 455633
17070 455633 640189 660017 109791 267687 639888 417163 680695 609615 440158 238412
17060 238412 229299 624969 282354 735191 419188 545382 233592 701324 525089 853526
17050 853526 402496 452158 432381 560281 719773 598397 651683 577171 578598 774503 708199
17039 708199 633619 572312 663436 305251 476997 347262 610874 471438 868678 583527
17029 583527 257390 582007 586283 286941 551059 499656 716391 576925 767413 652861
17019F52861N7688r0346K32434k31654q4546K04559M4519k93274J84818N7421
17009G34480j40047p4066L64163l58234Q7878M41663k80544J87623l62320K98212
16999H98808l53178J40856J39928n9794j93727O0006k23140K48517M41031k44867
16989H54440o3767m7021J97143l87118L38743P162L8354l25087K4952o8872M7313
16978F16242K84094D22061M07488K17371j98645k45968Q3725P79513n35868O8321
16968I97998J41676k06985O0573j08519J72586j47425K4907L2959k91675N55403
16958A231498j10084o0181L57444k19213P2125j62691O957p0278j41546k1852
16948H82179L68498l04393K58367J75169k55762q34K2390J30937j43699K64284
$$ plain form
17019 652861 710549 620203 852637 620983 536437 740996 785515 492241 677059 734480
17009 734480 594433 520367 884530 526296 614174 1055837 775293 962916 600596 898808
16999 898808 545630 686486 826414 766620 572893 632899 409759 658276 1099307 854440
16989 854440 790673 743652 940795 553677 892420 899582 937936 612849 637801 568929 616242
16978 616242 900336 422061 829549 1046920 848275 602307 686032 1465545 929677 997998
16968 997998 1139674 932689 993262 884743 1057329 909904 934811 967770 676095 1231498
16958 1231498 1121414 1061233 1418677 1199464 1271589 1108898 1115855 1045577 904031 882179
16948 882179 1250677 946284 1204651 1379820 1124058 1123224 1145614 1276551 1132852 1397136
16938A397136k42281O1177j37558J00312L97133p496k088l83426J39496j38405
16928A184000j73835K52549J38600l78832L87789L83297l24131j43259L51059
16919A677237j41269m7445J56248R6900l75792J35885l5493k95553M63407j36954
16909A497171J4950J50829j35814J22134k58721M04488k38123k1700j25381J06652
16899A516485M09752j20065O5489J5896n513n3294k51008N10810l83645K01630
16889A906537J36966L39684m42015J24929P5525k52949J87299K54399J8104O834
16879B355313k04896K30678j02837o5165N7373l015j49223L25105N7725j17778
16869B383280j23729K72456M7120j52985J32386M17395l31671K85163k77333N1951
$$ plain form
16938 1397136 1154855 1216032 1078474 1178786 1575919 1568423 1566335 1182909 1322405 1184000
16928 1184000 1010165 1262714 1401314 1022482 1410271 1793568 1469437 1326178 1677237
16919 1677237 1535968 1488523 1644771 1741671 1365879 1501764 1466271 1170718 1634125 1497171
16909 1497171 1512121 1662950 1527136 1649270 1390549 1795037 1556914 1535214 1409833 1516485
16899 1516485 1926237 1806172 1871661 1887557 1882044 1828750 1577742 2088552 1704907 1906537
16889 1906537 2043503 2383187 1941172 2066101 2141626 1888677 2075976 2330375 2348479 2355313
16879 2355313 2150417 2381095 2278258 2213093 2270466 2267451 2118228 2443333 2501058 2383280
16869 2383280 2259551 2532007 2579127 2426142 2558528 2975923 2644252 2929415 2652082 2704033
16859B704033K49920j10893j3958K12692n7566K16517J33371k43527J85111Q7349
16849C363049J50660r6404n9386J01397K48931j86003j69045Q94505o17745j2252
16839C617707P09001k11026j00817K69350J0902k5495R9300L86875J3308o4535
16829D704570m0267L18188k01352M75167M1473k01563M66503m768j67393J93104
16819E583662J22104J33496L30705k70542N01636j42601M97210j92169j20855
16810F442646J43369L0975K52523L07969K60105N0266K80745J51180L61723N04231
16800H785732j62749J77377K41107k08231O73950K32972m638K13220L29708L19873
16790A0598321L44481L95494k9424N74518k974O14144L97617N98779J60176N14708
$$ plain form
16859 2704033 2953953 2843060 2829102 3041794 2984228 3200745 3334116 3090589 3275700 3363049
16849 3363049 3513709 3417305 3357919 3459316 3708247 3522244 3353199 4247704 3629959 3617707
16839 3617707 4326708 4115682 4014865 4284215 4295117 4269622 4368922 4755797 4769105 4704570
16829 4704570 4664303 4982491 4781139 5256306 5297779 5096216 5562719 5557951 5390558 5583662
16819 5583662 5705766 5839262 6169967 5899425 6401061 6258460 6755670 6563501 6442646
16810 6442646 6586015 6616990 6869513 7177482 7437587 7487853 7768598 7919778 8281501 8785732
16800 8785732 8622983 8800360 9041467 8833236 9507186 9740158 9735520 9948740 10278448 10598321
16790 10598321 10942802 11338296 11308872 11883390 11880416 12494560 12892177 13490956 13651132 14165840
16780A4165840O05759K19865N07035O47433N62070N09099K38520R68220L68194
16771A8792035M50193R56333R69799Q45606K09806Q66936J139967J190624P76447
16762B6197746J708303P96667J317545J085417J433773J478160J462304J919000
16754C7398915J930168J390025K065273K213654K258200K724559K407856L116511
16746E5505161K689952L250872L614477L854976L930233L868665N072318M800014
16738H6586668N158650N578688O253343O128441O897365O778175P333605P582522
16730A38297457Q023903P584478P808878P748679O925475O738786O235763M751628
16722A94115047M330333K548947J454079j36056j479147k565816m042099n106947
$$ plain form
16780 14165840 14771599 14991464 15498499 16145932 16708002 17217101 17455621 18423841 18792035
16771 18792035 19242228 20198561 21168360 22013966 22223772 23090708 24230675 25421299 26197746
16762 26197746 27906049 28702716 30020261 31105678 32539451 34017611 35479915 37398915
16754 37398915 39329083 40719108 42784381 44998035 47256235 49980794 52388650 55505161
16746 55505161 58195113 61445985 65060462 68915438 72845671 76714336 81786654 86586668
16738 86586668 91745318 97324006 103577349 109705790 116603155 123381330 130714935 138297457
16730 138297457 146321360 153905838 161714716 169463395 176388870 183127656 189363419 194115047
16722 194115047 198445380 200994327 202448406 202312350 200833203 198267387 194225288 189118341
16714A89118341n911935o785215p362698p941506p888473q060460p560379p698390
16706A29909285p617965p073306o800964o464466o107345n361972n643354n027788
16698G9812125m525861m374287l648240m155676l703597l153146k747688l010588
16690E0493042k387648k751661j825169k187628k267095j679163j972953j357757
16682C4063968j871807j150189j382375j125630j374139r28137j349281j098422
16674B3783988m03381j136958p82009j049054m15653j000132l98852q33839m75642
16665A7288468n77215q58359n33802n78203k33160m86711r34479l97927j51154
16656A2537458l77410k44717k40107m50823j92074m79196j85664l70784j58090
$$ plain form
16714 189118341 183206406 176421191 169058493 161116987 153228514 145168054 137607675 129909285
16706 129909285 122291320 115218014 108417050 101952584 95845239 90483267 84839913 79812125
16698 79812125 75286264 70911977 67263737 63108061 59404464 56251318 53503630 50493042
16690 50493042 48105394 45353733 43528564 41340936 39073841 37394678 35421725 34063968
16682 34063968 32192161 31041972 29659597 28533967 27159828 26231691 24882410 23783988
16674 23783988 23380607 22243649 21461640 20412586 19996933 18996801 18597949 17764110 17288468
16665 17288468 16711253 15852894 15319092 14740889 14507729 14021018 13086539 12688612 12537458
16656 12537458 12160048 11915331 11675224 11224401 11032327 10553131 10367467 9996683 9838593
16647I838593m96145j86500k01220k43668L6122l26318o49172J62115k16125k40445
16637G477237m6022j04610k97691k50813k58728N2510o0585l00004l22096L68367
16627F257565m91715J25400j89264k33538k1112k12660j24670P8944k86085j76055
16617D726810J56854l49186l2702L0699k03069J27406k79402q8000M2304l24880
16607C806834K57155n544j6039m65213J37033o1807m99516L58117O131o5202K22275
16596C674224m67317P9465j47732j14588N2817l00443K90701L8515j85173K5377
16586B945846k46807K13876n20414n7875N00715k24112k84372J27024K48526j17607
16576B584800l29587J73365K50728m45897l6234N1098J07746k55059K07863j83427
$$ plain form
16647 9838593 9342448 9155948 8954728 8711060 8747182 8420864 7771692 7933807 7717682 7477237
16637 7477237 7431215 7326605 7028914 6778101 6519373 6571883 6511298 6211294 5889198 6257565
16627 6257565 5765850 5891250 5701986 5468448 5447336 5234676 5110006 5188950 4902865 4726810
16617 4726810 4883664 4534478 4501776 4532475 4329406 4456812 4177410 4089410 4131714 3806834
16607 3806834 4063989 4058445 4042406 3577193 3714226 3652419 3152903 3511020 3517151 3451949 3674224
16596 3674224 3206907 3286372 3138640 3024052 3076869 2776426 3067127 3105642 2920469 2945846
16586 2945846 2699039 2912915 2392501 2334626 2835341 2611229 2326857 2453881 2702407 2584800
16576 2584800 2255213 2428578 2679306 2233409 2197175 2248273 2356019 2100960 2308823 2125396
16566B125396l57252K13673r73N1884j52928k6236J09462m0241N331J27603k9311
16555B026408j57400m71060M08157k8461p2102j87410o9705k2562J55546l1872
16545A549539k23094L89120k63486l0291J33393P6746l9535k63546J91257o3552
16535A456551J14855O011m27124L01455j06624j62555M80035n94229J13428K21614
16525A403417m65973L37271j2360J22847m37144L65615j0202j31219j21196l1827
16515A019229K75959k57456m3102K9696j07076M6756R0408P8150L84544n68496
16505I48612k25427N4362J83515l7117k95704N65929j794k93436Q8972L36983
16495A324895m58068r1024n3532K26275l12542K99597n062k25207J22260j70144
$$ plain form
16566 2125396 1768144 1981817 1980844 2032728 1879800 1853564 1963026 1922785 1928116 2055719 2026408
16555 2026408 1869008 1397948 1806105 1777644 1705542 1518132 1448427 1425865 1581411 1549539
16545 1549539 1326445 1715565 1452079 1421788 1555181 1631927 1592392 1328846 1520103 1456551
16535 1456551 1571406 1577417 1150293 1451748 1345124 1182569 1662604 1068375 1181803 1403417
16525 1403417 937444 1274715 1262355 1385202 948058 1313673 1303471 1172252 1051056 1019229
16515 1019229 1295188 1037732 994630 1024326 917250 964006 1054414 1132564 1517108 948612
16505 948612 723185 777547 961062 923945 628241 1194170 1192376 898940 987912 1324895
16495 1324895 866827 775803 722271 948546 636004 935601 930539 705332 827592 657448
16485F57448R6051l5224k38565Q4955J75178J13184j0471N8015j64350q8871L88282
16474A035632J3664k61553O4184J0664j77681m2061K8595j73702N90171l34667
16464G53246m1898R7202l84213J41236p8609M02113j81277q1537j58763N4867
16454E22367R7511j410k8202K19268l13288L37244l42278J14922j88623J49496
16444E67007k13319L7178K88481j80019L97072l77153j4981K02851R780l41895
16434C75002J72062j67470M398J6979J8790j04573L43493k24651K7600p6602J13339
16423D98367j48414P3681A95512L42092m6993P4516j24670j65455R8360J90410
16413E63772k36506o0032p5695J89456J25798m0204J70068r625k69125J81259
$$ plain form
16485 657448 753499 718275 479710 564665 739843 853027 842556 900571 736221 647350 1035632
16474 1035632 1049296 787743 851927 862591 684910 642849 671444 497742 1087913 753246
16464 753246 711348 808550 424337 565573 486964 889077 707800 626263 467500 522367
16454 522367 619878 618468 590266 809534 496246 833490 491212 606134 417511 567007
16444 567007 353688 390866 679347 499328 896400 519247 504266 707117 716897 375002
16434 375002 547064 379594 383992 400971 419761 315188 658681 434030 461630 385028 498367
16423 498367 349953 423634 195512 537604 490611 565127 440457 275002 373362 563772
16413 563772 327266 267234 191539 380995 506793 466589 636657 627032 357907 539166
16403E39166j00549J6376A8801K41880J46306J25366A96339N40131k27070k29995
16393B79405N6527j39044K97525j36195j64936j8568M31888A78202J36263M6140
16383C60605k5752r8146j14623M74104k71333G0804g03B26030J77642D6131R3222
16372A39353J81097Q4178R2463n8472N3495L2211O106B23539J57796P5317k00178
16361B56474J94472n7553A77833h2921E4422K46103j600D1398L94853J22320A13406
16349C66945h9527E07666j66627R3480j02844l204F7238a1131B20602r7998K48000
16338C70604j58752h0819B27943L07292B6633L75580o2784l8333I5702J07996
16328B03698K82675o2921j71075I2598K09786i0516A3235J97949J80176a29907
$$ plain form
16403 539166 438617 454993 18801 260681 406987 532353 196339 736470 509400 279405
16393 279405 335932 196888 494413 358218 193282 174714 606602 178202 314465 360605
16383 360605 334853 236707 122084 596188 324855 70804 -703 226030 403672 46131 139353
16372 139353 320450 404628 497091 438619 492114 524325 530431 223539 381335 456652 256474
16361 256474 450946 393393 177833 -82921 54422 300525 298925 41398 436251 558571 113406
16349 366945 -89527 507666 341039 434519 331675 328471 67238 -11131 220602 122604 370604
16338 370604 211852 -80819 227943 535235 26633 402213 339429 301096 95702 203698
16328 203698 486373 423452 252377 92598 302384 -90516 13235 211184 391360 -129907
16317A38519J30864M7576j34963K12085A43937J99667A34113b92534H2093K28187
16307C10280L03380B6411K90207O744n207a3646D78312B00662K01796j98467E9949
16295g2557K290C87427j91314g4198H5520j0312M87527B24721K88351B49383k1902
16284B27481J28977b21537A75007I869a45948B90384n4375f3484C11212A19431
16273a30321B36840l7760K47414b01192C58291j68800J6135d895B43901m9286
16263A94615p9562J19792b54442A67439n3576B0055Q7214J32854m90p9418C3994
16251c6396A04502f1433C24494J26033j16273A24230d7485A83519J2527q3639
16241A12407J03285a00454B51727O0174E9249J9102R3306Q1299J55019j63071
$$ plain form
16317 138519 269383 316959 181996 394081 143937 343604 134113 -292534 82093 310280
16307 310280 613660 26411 316618 323362 318155 -13646 478312 200662 402458 203991 59949
16295 -72557 -70267 387427 196113 -74198 85520 75208 562735 224721 513072 249383 227481
16284 227481 356458 -221537 175007 9869 -145948 290384 236009 -63484 311212 119431
16273 -130321 236840 199080 446494 -201192 358291 189491 205626 -4895 243901 194615
16263 194615 115053 234845 -254442 167439 113863 20055 107269 240123 239633 160215 33994
16251 -36396 104502 -61433 324494 450527 334254 124230 -47485 183519 196046 112407
16241 112407 215692 -100454 251727 311901 59249 78351 171657 252956 407975 244904
16231B44904j20730m8131L59298B8553c5525I9021M7452A5937b83039I3600R2338
16220A85938c3956A68780A5195L64677A33264n8425L81143g2812E0266J87862
16210B38128D9797J03759a98666A15739P9575J6780I3581N2364K04378j04026
16200B46297E3248O9186A78O96834h981A81767P1956l143a11184J9026A40779
16188I3669r874J6595J31046b9485C47714j08989o0151M0677F5409g84m4400j47196
16176a92380C2012b47878c0790j07707C48374b3525j01249L5571k54414A5122
16165A68305E5789g7926D6819M5691o061l9930N4613R1193e639F5965L22939j38927
16153B49977o3108n6157d5212l82038C01565j48812h7159j59549M3930F187h9266
$$ plain form
16231 244904 124174 76043 435341 28553 -35525 99021 146473 15937 -283039 93600 185938
16220 185938 -33956 168780 15195 379872 133264 74839 455982 -72812 50266 238128
16210 238128 49797 153556 -198666 115739 195314 212094 93581 145945 350323 246297
16200 246297 53248 122434 178 697012 -8981 181767 253723 250580 -111184 -92158 140779
16188 93669 83795 100390 231436 -29485 347714 238725 178574 219251 65409 -784 -45184 -192380
16176 -192380 32012 -247878 -30790 -138497 348374 -23525 -124774 -89203 -343617 15122
16165 168305 55789 -77926 46819 92510 86449 46519 101132 192325 -5639 65965 388904 249977
16153 249977 186869 130712 -45212 -427250 301565 152753 -87159 -246708 -202778 6187 -89266
16141g5271a483k95586A22100E6976K0345P5162b02710B08046D3797c36259D0296
16129A00979h578H2145R5727a18960A79745a35746O7635B33080j0711a01605C37961
16117A19840L0722a26413c7591B35310p689b5066j9810A05009l0192C0166c35895
16105c1993n0708H703P889J90084l5954K5115L8639J84503D6200Q8559O9541b1028
16092I9383a06430K218l5624j1604d8416A99160e5593H9644P1357O7573A07860
16080B86637b45910a15152C53925F0048A4644L68467b66863A70506F7583a97627
16069d61668F0763K18708g0796E07741a41022b648k09653A28680h3705B83148
16058I1429f8819m1650B00628a79857c2787n6109l09472B08584b40810B2274a47484
$$ plain form
16141 -75271 -1483 -297069 122100 56976 77321 152483 -202710 208046 43797 -336259 40296
16129 100979 -8578 82145 177872 -118960 179745 -135746 -68111 233080 222369 -101605 337961
16117 119840 150562 -126413 -37591 235310 227621 -25066 -44876 105009 74817 30166 -335895
16105 -31993 -82701 8703 16592 206676 170722 195837 234476 418979 46200 134759 204300 -21028
16092 99383 -106430 -104212 -139836 -151440 -48416 199160 -55593 89644 161001 228574 107860
16080 286637 -245910 -115152 353925 60048 14644 383111 -266863 170506 67583 -197627
16069 -461668 60763 279471 -70796 507741 -141022 -2648 -212301 128680 -83705 283148
16058 91429 -68819 -110469 200628 -179857 -32787 -88896 -398368 208584 -240810 22274 -147484
16046D6523b1347B67771b56294E552M9102f6170A63034d9920K0825C36031a89155
16034B66755i2192k06270A62093L75681d7117A1334b2809B93608j2233Q4185g0593
16022c0777j30776k3669m39842a75075A0908b10754e8654K5980A69819A9523J1913
16011C1436L9458i3625d3113q8961F4179a4232j00811j27133E5100Q1416F2620
15999A01074c29016G2213f8100l8620A62413n1773b18206B5342K95662A35886
15988a35764e7054b8523l1494k62I0968L2426D4958P7990J69207j02581b04308
15976H3753b99072a10708D098R1853d6746B4301K19657L0750Q01g9864r2501A0184
15963A2580b13102B78268d4381n0248A79304a66449L9155j41348G6633J98771
$$ plain form
16046 46523 -21347 267771 -256294 5552 54654 -66170 163034 -49920 -29095 336031 -189155
16034 266755 -92192 -298462 162093 537774 -47117 11334 -22809 293608 281375 365560 -70593
16022 -30777 -161553 -185222 -625064 -175075 10908 -210754 -58654 -32674 169819 19523 31436
16011 31436 70894 -93625 -43113 -132074 64179 -14232 -115043 -242176 55100 136516 62620
15999 101074 -329016 72213 -68100 -106720 162413 110640 -218206 25342 321004 135886
15988 -135764 -57054 -28523 -60017 -60279 90968 123394 44958 122948 292155 189574 -204308
15976 83753 -299072 -110708 4098 95951 -46746 24301 243958 274708 275509 -79864 -172365 10184
15963 12580 -213102 278268 -44381 -94629 179304 -166449 -127294 -268642 76633 275404
15953B75404a25552B03305K163I9129h8489L697c7823k38371h3058A08026b98804
15941a16367I6322b74252A10013b42118N2382O5777B08108a07282H4221a20150
15930c5074D1063o383k86i334j24970B27894a49754b176k72863C4199J36573c0480
15917C47431c10641D6334b6151k46887d4991k92A9671J64914c05471b9672k5827
15906e5499K7519o0810H779i5080A14773D6M6946P8786b9825E2785J68889a29349
15893b75146c1195B44723r8709b57899A10420A5617J91752C2937b09881b5358
15882b5677C9116d3292k2506F8704b62290d8865A7687K70071a49156D4448J84049
15871B28497b54974g8927a2024j43408k75445d668E6602d43500G6326b17168E3600
$$ plain form
15953 275404 -125552 203305 205468 99129 -88489 -84792 -37823 -276194 -83058 108026 -298804
15941 -116367 96322 -274252 110013 -242118 -189736 -123959 208108 -107282 84221 -120150
15930 -35074 41063 34680 34394 -9334 -134304 227894 -149754 -2176 -275039 34199 170772 -30480
15917 347431 -310641 46334 -26151 -273038 -44991 -45283 19671 184585 -305471 -29672 -55499
15906 -55499 -27980 -88790 8779 -95080 114773 46 46992 125778 -29825 52785 221674 -129349
15893 -275146 -31195 244723 146014 -257899 110420 15617 207369 32937 -209881 -25358
15882 -25677 39116 -43292 -65798 68704 -262290 -48865 17687 287758 -149156 44448 228497
15871 228497 -254974 -78927 -12024 -155432 -430877 -4668 56602 -443500 76326 -217168 53600
15859D9458k1585i7038B46782d5609j74444A79555d4955A07284D9269e5857B9086
15847i9342A94428a13690B00718o0281o9009b29009c2860F2151b20071Q6530E1546
15835B02716c4007k3854m2309A89904E174f51420g7408A10078a11912B051e6083
15823B2769a37917o3174a4458B3059b91075A14277a04806i786n5249G1710a54208
15811F7434d7662p3976j21282O4001A39533i4999C16682A45473J94201h6573E708
15799a61455j1186A12925J21414G5381E070K82518C6230P0576P2427a22601e8375
15787A18543b16986B22712H1477a46444n0142a3407r5351b2702j39117K5026f4123
15775i8469a6761A91517B242K3576a30024A3559K53101b68497a28361d7054k81544
$$ plain form
15859 49458 27873 -97038 246782 -45609 -220053 179555 -44955 107284 49269 -55857 29086
15847 -99342 194428 -113690 200718 140437 71428 -229009 -32860 62151 -220071 -133541 51546
15835 202716 -34007 -57861 -100170 189904 5174 -651420 -77408 110078 -111912 2051 -56083
15823 22769 -137917 -201091 -14458 23059 -291075 114277 -104806 -9786 -65035 71710 -154208
15811 67434 -47662 -121638 -242920 -178919 139533 -94999 316682 145473 339674 -86573 5708
15799 -161455 -172641 112925 234339 75381 5070 287588 36230 106806 179233 -122601 -58375
15787 118543 -216986 222712 81477 -146444 -196586 -13407 -108758 -22702 -161819 -136793 -64123
15775 -98469 -16761 191517 2242 25818 -130024 13559 266660 -268497 -128361 -47054 -328598
15764c28598f4082D5775J42520l4666b63912a27455j03086I7414M3631g794m0214
15753d8008j0906E9690b34002d6386p5278A21866n3071A9796c4471j65264n5147
15742b54882c9930E219C09J45069i5957I5222a64294b0319C0288p61c8033a2120
15729B17893a75007m9862A95090a11283l2583D9902c58550j44928C04554c6192
15718i2458A82687a95761d4919E720a05703q7642M2334j14761a2946a276B48327
15706i1667l107F1728J09284g6213j37505F1255J76079l7753a79025N0071C72227
15694d1424J8819k50663k0661J24528A4181M3380K10978c04363a26990A48316
15683b52965j30365a71154N5144B1539J33914B0307J90238J38407j0667E0474
$$ plain form
15764 -328598 -64082 45775 188295 153629 -263912 -127455 -230541 97414 141045 -7794 -48008
15753 -48008 -58914 59690 -234002 -46386 -121664 121866 68795 19796 -34471 -199735 -254882
15742 -254882 -39930 5219 309 145378 -95957 95222 -164294 -20319 30288 29527 -38033 -12120
15729 217893 -175007 -224869 195090 -111283 -143866 49902 -358550 -503478 304554 -36192
15718 -92458 182687 -195761 -44919 5720 -105703 -193345 -151011 -265772 -12946 -1276 248327
15706 -91667 -94774 61728 171012 -76213 -213718 61255 237334 199581 -179025 -128954 372227
15694 -41424 -22605 -273268 -293929 -169401 14181 57561 268539 -304363 -126990 148316
15683 -252965 -383330 -171154 -116010 21539 155453 20307 210545 348952 338285 50474
15672D4321J11533R088a60007A43404a58718b1943C66753a2163K711A6637J84217
15661B00854A02K53982b96994A02709B3442b20978K5305k9653g2493A10170J59806
15650B69976b29598Q7550j67860i6051A9616k771d1915o1982j95684B37536B2814
15638C53692j22085A07393b8281A63141D9052J01224n3038c42273A60850o6081
15628I4769a63347k71635a95556A52373d62052A58903b20607F1909a23127A38398
15617A77836H4667J55182a92944N6440f076A52327c12430a7967k49829F2502a60277
15605a29662N5586n6598B65338b57474i1815B07896F9055h3261a981m3935C3636
15593A43791B7723J09480J11763f979B08997a89245D10484b67609F6824h1617
$$ plain form
15672 44321 155854 164942 -160007 143404 -158718 -21943 366753 -12163 -9452 16637 200854
15661 200854 102 254084 -296994 102709 23442 -220978 -195673 -225326 -72493 110170 269976
15650 269976 -229598 -142048 -309908 -96051 19616 16845 -41915 -103897 -299581 237536 22814
15638 353692 231607 107393 -28281 163141 49052 150276 97238 -342273 160850 94769
15628 94769 -163347 -434982 -195556 152373 -462052 158903 -220607 61909 -123127 138398
15617 177836 84667 239849 -192944 -136504 -6076 152327 -312430 -17967 -267796 62502 -160277
15605 -129662 -74076 -130674 265338 -257474 -91815 207896 69055 -83261 -1981 -45916 33636
15593 143791 27723 137203 248966 -6979 208997 -189245 410484 -267609 66824 -81617
15582B42187a11712Q18j07110n0374A36421a85179A33253A6229b49824I4064i7980
15570a62216A87321E3150a03900n3573B94673a47037O1047A7259K32063R2208
15560C41530k2728a66834B72251j26179B6873Q859c0834A11123g537B5580a83638
15548A37191B3329i6199d6272H7681L6561l5895a44032a9409D2262J891J36188
15537A80341b00944D78380B2867Q7523e1339b1083B1399M8263a29208B598J56775
15526A59373c7245m4217A22569b1329j38118M6760a7937A32256l6761g1538A86784
15514C1865a08725D8020J1381b59969B90414n2678B5297f3568F8660c07179i5612
15502a14183p0429A41568a53671h511l01304A72180D8024a09527C31744e0D2944
$$ plain form
15582 242187 -111712 -110894 -218004 -268378 136421 -185179 133253 16229 -249824 94064 -97980
15570 -162216 187321 53150 -103900 -157473 294673 -147037 -85990 17259 249322 341530
15560 341530 318802 -166834 272251 146072 26873 35732 -30834 111123 -7537 25580 -183638
15548 137191 23329 -96199 -46272 87681 124242 88347 -144032 -19409 42262 44153 180341
15537 180341 -200944 478380 22867 110390 -51339 -21083 21399 69662 -129208 2598 159373
15526 159373 -37245 -81462 122569 -21329 -159447 -112687 -17937 132256 95495 -71538 186784
15514 31865 -108725 48020 59401 -259969 290414 237736 25297 -63568 68660 -307179 -95612
15502 -114183 -184612 141568 -153671 -8511 -309815 172180 48024 -109527 331744 -50 42944
15490a8311l33750a47751A2886b80598A96219c1191A86830k8438a21324A05171
15479A56782P7596a56204F9406e8069A23857i4318a5449B105O6651J61126e2234
15467A15390Q8502I3514M5594m9546K4884a48287A39045E1536c8966A70528h9466
15455B90579d2384A69992a17825a3655B39517A09356a60792O6313g525D78292
15444F2003a52007m61F1977b21684g2415j0461b1815A46373a24240N0166a3027
15432H591J41725e8411l3223B82123c47702O4723C65a20384A33274l7913a78620
15420A67044B8712R9348m4090e0117C2434P7459l9985J40984b44601G4644d03603
15408A02618d7118r8914K831C75098b7996J336C1258O9392K10417a50287e8515
$$ plain form
15490 -18311 -352061 -147751 12886 -280598 196219 -31191 186830 158392 -121324 105171
15479 156782 234378 -156204 69406 -58069 123857 -94318 -15449 2105 68756 229882 -52234
15467 115390 203892 93514 139108 89562 114446 -148287 139045 51536 -38966 170528 -89466
15455 290579 -42384 169992 -117825 -13655 239517 109356 -160792 -94479 -7525 478292
15444 62003 -152007 -152468 61977 -221684 -72415 -82876 -21815 146373 -124240 -74074 -13027
15432 8591 150316 -58411 -91634 282123 -347702 -282979 365 -120384 133274 95361 -178620
15420 167044 28712 128060 83970 -50117 32434 109893 69908 210892 -244601 74644 -403603
15408 102618 -47118 -146032 -143201 375098 -27996 -26660 31258 100650 311067 -150287 -58515
15396A04385A224J42375c10055k4997a33507B38465B0763d8323o1734j58716r7047
15385c65820g6712M124K3156A67218m3748m7929A7612N0250a22145R06E7876J35882
15373A93758c8561H0600J22431a55998A19167f6009q3866B41376e7102J0440C6569
15361A1116c74225A8911b69547c5583G7473R4401n8421M946c58961G2469J81383
15350B53852c7315B15874E7720b81530H2704K59558D5838J65103I4115J42226
15340B36341j0149a29215E7781D333c9519j30216P7565B2411H463L04273N735
15329C18471H7704d7666E73575b511j1403e816A89560a62889B13707I3265a63433
15317f59837a29310F5584J62768D9173c1423n5608j27785A30363J07855a05988
$$ plain form
15396 104385 1224 143599 -310055 -335052 -133507 238465 20763 -48323 -110057 -268773 -365820
15385 -365820 -76712 -72588 -49432 167218 123470 75541 17612 67862 -122145 -121239 57876 193758
15373 193758 -38561 80600 203031 -155998 119167 -66009 -149875 241376 -57102 -46662 36569
15361 11116 -374225 18911 -269547 -35583 77473 171874 113453 118399 -358961 72469 253852
15350 253852 -37315 215874 57720 -281530 82704 342262 45838 210941 94115 236341
15340 236341 226192 -129215 57781 4333 -39519 -169735 -92170 22411 8463 312736 318471
15329 318471 87704 -47666 573575 -2511 -13914 -5816 189560 -162889 213707 93265 -163433
15317 -659837 -129310 65584 228352 49173 -31423 -87031 -214816 130363 238218 -105988
15306b10787n133j40255a74258C17048d6683j59404j20207i9946k10706f8788
15295b55597E463K6342O4178g5895m3897I8247g3560C21131a74951P2280j6209
15284a18880F1487J06849n7640a57241M9791l16039A10294M0308O4838b1469B3034
15272C6854J84088M9636N4976G6271a34671D4773M5777a28524A66438a27825B17539
15260a44367A68906k8468n4276Q4403E9075L14209l5062j39224i6881A80618O6802
15249B47420M07671J233442m25633j56250N71038B93706j33967l8595L2329Q5339
15239B38812K9129J40392A38475J57314H6516J29749A04210A8173J12622J17941
15229B48736F407J81898n9451J41628b32328A79418k7487a08305b5944j27838
$$ plain form
15306 -210787 -215920 -356175 -174258 317048 -46683 -206087 -326294 -99946 -310652 -68788
15295 -255597 5463 31805 95983 -75895 -119792 98247 -73560 321131 -174951 -102671 -118880
15284 -118880 61487 168336 110696 -157241 -107450 -423489 110294 150602 215440 -21469 23034
15272 36854 220942 270578 325554 76271 -134671 44773 90550 -128524 166438 -127825 217539
15260 -144367 168906 140438 86162 170565 59075 373284 338222 198998 -96881 180618 247420
15249 247420 655091 1888533 1462900 1306650 1877688 293706 159739 121144 153473 238812
15239 238812 267941 408333 138475 295789 86516 216265 104210 18173 130795 248736
15229 248736 6407 188305 128854 270482 -232328 179418 151931 -108305 -25944 -153782
15219a53782O7693B11895a49088b9237A07465A0573J28125R6700F5360K04859
15209B70219P0503A42276L05184c4297J6792A53341a49834A9781J5145J52025
15199A86951D9686b3686A28869D3499a42978B43786o7033J63316B2047a7816D18881
15187h7350O845C05851A351O6790L01288a61600b0390C21434c0461j5362A86393
15175a61288B27071O2779j33441g9928A71363p3083b25616k850B14152C061J15500
15164A18561J22233J2389a29314H4786K27292D5114a51658A09067p49K04234A35087
15152A78150J74716B4231J23614m2681M1028a03218A10001b28707e0877C98221
15141i8260A6201M6798K42796M4819A37848a26558N1528B84661A2600b83548B22266
$$ plain form
15219 -153782 -86089 211895 -149088 -29237 107465 10573 138698 235398 65360 270219
15209 270219 340722 142276 447460 -34297 -17505 153341 -149834 19781 34926 186951
15199 186951 49686 -23686 128869 43499 -142978 243786 176753 340069 22047 -17816 418881
15187 -87350 -80505 305851 1351 68141 369429 -161600 -20390 321434 -30461 -45823 186393
15175 -161288 227071 289850 156409 -79928 171363 98280 -225616 -228466 214152 3061 118561
15164 118561 240794 253183 -129314 84786 312078 45114 -151658 109067 108318 312552 135087
15152 178150 352866 24231 147845 105164 146192 -103218 110001 -228707 -50877 398221
15141 -98260 16201 62999 305795 350614 137848 -126558 -75030 284661 12600 -283548 222266
15129A27889D7398L4412B9462r217J90360N0948k028A13383L5986o7615Q3678
15118A65432Q7954j15231M3962D8884A5338J93779M74G4922b63604C93527H7155
15106A08303J2268Q0504F8488P4587n5296R5491H8820b846D27428A1591c9460
15094A558J51180G5501O0638c33172A65273a04611C87190A57507b01543D3051
15083A05268P2900m4203J33350n5427C836N5533a2806A78920e8023A97065J03616
15072C00681q3380N1727D2695K95636f4804B0908a7976G7833K14021p6415o5526
15061A49913D4811R1893J12698c1722F1929A6328J36906j4005K23947D5517m469
15050D1048L79833P1669B1489M50621k27530a55703D79869j17503a10186L5103
$$ plain form
15129 127889 47398 81810 29462 20245 210605 261553 259525 113383 149369 81754 165432
15118 165432 253386 138155 182117 48884 15338 209117 209591 74922 -263604 393527 87155
15106 108303 120571 201075 68488 143075 87779 183270 88820 -2846 427428 11591 -39460
15094 1558 152738 75501 136139 -333172 165273 -104611 387190 157507 -201543 43051
15083 105268 178168 133965 267315 211888 3836 59369 -12806 178920 -58023 197065 300681
15072 300681 217301 269028 42695 338331 -64804 20908 -17976 77833 291854 215439 149913
15061 149913 44811 136704 249402 -31722 61929 16328 153234 139229 363176 45517 41048
15050 41048 420881 492550 21489 472110 244580 -155703 479869 362366 -110186 -75083
15040g5083B46949G4019Q3124K51572i0435A03263G064J12443k0107K73795A33104
15028D11142a78111D66893b2183B32694q0462M0205m7948K44871n2541O3689l9907
15017C60601j21749c887A95926I7158L4795K39633a34953B06085K32646A7622
15006A68060P9102K85382G9429a01450B56613n2219H8479L8342L73957k44810
14996B55968A08185N22701d1726q1466B66019B7992O4776J55675D4940J63848
14986B08788B7019N4626K94107J90013b58088C26255j17361c2964A62762m0344
14976A22418J80147q5791J46199r1469J54026k00932L37427B79746J21549A14919
14965B23592l3115J94229A72397o9216K21915G0814A0072L33319o5252R6248j67241
$$ plain form
15040 -75083 246949 74019 157143 408715 -90435 103263 7064 119507 99400 373195 133104
15028 411142 -178111 466893 -22183 232694 152232 192437 144489 389360 336819 400508 360601
15017 360601 238852 -3887 195926 97158 131953 371586 -134953 206085 438731 17622
15006 168060 247162 532544 79429 -101450 256613 204394 88479 126821 500778 255968
14996 255968 108185 630886 -41726 -123192 266019 27992 92768 248443 44940 208788
14986 208788 27019 81645 375752 565765 -258088 326255 208894 -32964 162762 122418
14976 122418 302565 216774 362973 271504 425530 224598 562025 279746 401295 114919
14965 223592 190477 384706 172397 103181 325096 70814 10072 343391 278139 374387 207146
14954B07146o0316K42099a57781f6277D57873A13369m7329Q2975J67903A0237
14943A40039J78124D9322L4841K87537j5726M4892l0623Q7712G5959M59015r1481
14932D43493K301j24824J16088e2757B17402J12049j58519J50421A54684K9719
14922A84403K75949A25938J76209A43843B430P6762K99940k9487J363j28678K81559
14911E03889j16841N5512c9946C66491K557j632j15848K21990k29460Q6640J11775
14900D42513B19032N309L94610A34013P7281n038K72555M6122o962E9412N85602
14889F45014j24751I3470K97885n887m4910L0448K7633R48M2919j61626J94279
14878D75159M8129n0578E2845M27007m3263r1804j9263J2310p3455L01569k01296
$$ plain form
14954 207146 146830 388929 -157781 -66277 457873 113369 66040 149015 316918 10237
14943 140039 318163 49322 84163 371700 355974 400866 370243 457955 75959 534974 443493
14932 443493 445794 320970 437058 -52757 217402 329451 170932 321353 154684 184403
14922 184403 460352 125938 302147 143843 2430 79192 379132 349645 351008 222330 503889
14911 503889 387048 442560 -39946 366491 369048 367416 251568 473558 244098 330738 442513
14900 442513 219032 224341 618951 134013 211294 206256 478811 524933 517971 59412 645014
14889 645014 520263 93470 391355 385468 340558 371006 398639 399587 442506 280880 475159
14878 475159 523288 472710 52845 479852 436589 344785 325522 337832 264377 565946 364650
14867C64650J88956k28135j07383j0146N02218j84499B26915L71542j55573j67918
14857B74966R3663A78639J64005K95036N4373B42564K01092J79981j18750K82114
14847G87001C67867J37388p2285L4074L896q1513A2129L13452Q2995K32508q0543
14836E60541l0924N7213O464j17879p2895K95090m8337k09255J03738k6252M7341
14825E64845j51266J73744J80011l6718C06063L82407q7750k86057L67218l24135
14815C57746N6852q100L97027K23358C81132O0494j42235K16564j8145L76604
14805H74414B79489M79335K9732j9979k95727L12725k45486B05210K50573J62001
14795F17784j58382J91583k33881J75544J06395k17876J20880A46064K83772K5674
$$ plain form
14867 364650 553606 325471 218088 207942 710160 525661 226915 598457 442884 274966
14857 274966 368629 178639 342644 637680 692053 242564 443656 623637 504887 787001
14847 787001 367867 505255 432970 467044 470940 389427 12129 325581 408576 641084 560541
14836 560541 529617 586830 593294 475415 402520 697610 649273 440018 543756 517504 564845
14825 564845 413579 587323 767334 730616 306063 688470 600720 314663 681881 357746
14815 357746 414598 406498 803525 1026883 381132 441626 299391 515955 497810 874414
14805 874414 279489 758824 788556 768577 472850 785575 540089 205210 455783 617784
14795 617784 459402 650985 417104 592648 699043 481167 602047 146064 429836 455510
14785D55510J9020K45160M5412k80236L1135J58577o6088r574J14279j51687l0125
14774E31383j38310L55265j34173K20322M9180k21617N951n9061J01060k46746
14764D63254J37264j3352M73621k63496k09872N5295k02760L42531L1074K63412
14754A076971k66464j12075J28507j31155J33731l51414M45485D17989N32536
14745I50525k32956J48303K20021l11923k49514M45746l46066J88156C74223J22286
14735D96509L41614l82870K12398K65339j99751L1421O6750L1040j99661j27204
14725E35585K62823j86571N2636L10614Q0070l60250K13988N2226k05413K5318
14715G81026L24930n1528l56377K96060j35150m3819L64317l70304J79118D91160
$$ plain form
14785 455510 474530 719690 765102 484866 516001 674578 608490 598916 713195 561508 531383
14774 531383 393073 748338 614165 834487 883667 662050 668001 608940 710000 463254
14764 463254 600518 587166 1060787 797291 587419 642714 439954 782485 813559 1076971
14754 1076971 810507 698432 826939 695784 829515 478101 923586 417989 950525
14745 950525 717569 865872 1085893 773970 524456 970202 624136 812292 374223 496509
14735 496509 838123 455253 667651 932990 733239 764660 831410 862450 662789 535585
14725 535585 798408 611837 664473 975087 1055157 694907 908895 961121 755708 781026
14715 781026 1105956 1054428 698051 994111 858961 815142 1179459 809155 988273 491160
14704I02244M774P5359M2177r7905J08784m725N9777k65234Q471J45120j42141
14693H36701M01768m86843M81185k22378k9149N5044l55779K32813K59135j65078
14683A007419M26491k17619n34512K27935K66881o8624k34059M01439j52811J57146
14673A279686m92271K04612l7383O26722m84800r2048J65660l76642N81941o18833
14663G56644N31635L1086J66060k91729l63255M00492P2125k42411k40555L25644
14653A145736k29282K79397j71680O23996o07169J60843k06954K15634j44497
14644A066024J44825J10040R8262P3326r2334m20216L36522K27401k43971Q458
14634A308337J83336l65392N61383P1939m17893M09223j82177j20917L92932m90087
$$ plain form
14704 902244 907018 982377 1024554 926649 1035433 1030708 1090485 825251 833722 978842 836701
14693 836701 1238469 751626 1232811 1010433 981284 1036328 680549 913362 1172497 1007419
14683 1007419 1433910 1216291 681779 909714 1176595 1107971 873912 1275351 1122540 1279686
14673 1279686 787415 992027 954644 1581366 1096566 1004518 1170178 793536 1375477 756644
14663 756644 1288279 1319365 1485425 1193696 830441 1230933 1303058 1060647 820092 1145736
14653 1145736 916454 1195851 1024171 1648167 1040998 1201841 994887 1210521 1066024
14644 1066024 1210849 1320889 1419151 1492477 1400143 979927 1316449 1543850 1299879 1308337
14634 1308337 1491673 1126281 1687664 1759603 1341710 1750933 1568756 1447839 1840771 1350684
14624A350684K58312j78301k39733M39738j59519k40597L72024l91776K89611
14615A500443N6133J912k9272R3885K41756l92702N05796k74074K0903l2105q5499
14604A607176o5898j30313K32458K78469J19099o12182M92316k04049K81210k52138
14594A746148m3870j48046L66267J86331m35017J36400j00678L21104j18190N6472
14584A966921J04967J19924o8286m5569j3263n3530K6234K38619o1634j61662
14574B052721n9569J49255K1072L78536m41723L4441l911K13896O9750j34595
14564B279873Q25457J68886n59032l16966K49422M48761j56200k87242N37382
14555C190341M86086j21435L80086P62565N27254K32433K291874L825462Q475613
$$ plain form
14624 1350684 1608996 1430695 1190962 1630700 1471181 1230584 1602608 1210832 1500443
14615 1500443 1556576 1558488 1529216 1623101 1864857 1472155 1977951 1703877 1724780 1692675 1607176
14604 1607176 1541278 1410965 1643423 1921892 2040991 1428809 1921125 1717076 1998286 1746148
14594 1746148 1702278 1554232 1920499 2106830 1671813 1808213 1707535 2028639 1910449 1966921
14584 1966921 2071888 2191812 2123526 2077957 2064694 2011164 2037398 2276017 2214383 2052721
14574 2052721 1993152 2142407 2163479 2542015 2100292 2134733 2130822 2344718 2414468 2279873
14564 2279873 3105330 3274216 2715184 2398218 2647640 3096401 2940201 2652959 3190341
14555 3190341 3676427 3554992 3935078 4697643 5224897 5457330 7749204 11574666 20050279
14546B0050279K2446439O043563B3688789I443746D355776j164218o00919l41551
14538B249088r163k11469J69399n1437K69420l20252L78757n6624j62251q695
14528B246773J14811j01578K71184J9222K0803J9951J44893m79603K65748J62117
14518B684321L88817o26265M21098J84785N2470m84959P2328L34636K4491R4683
14508C146405j16980L7280L9530j25599M1292R0026R2516K3556J11119p4745j63695
14497C100705L06110J37699J13334L1149k74338K39970j73961R3423M1847Q5480
14487C701418j4899L20959j68420k90773M88849J93785m19413M0266L15530J09520
14477D276822j42176J06135n8812L67995j05163j8378l4829j74303O02103J20089
$$ plain form
14546 20050279 42496718 48540281 23688789 9443746 4355776 3191558 2590639 2249088
14538 2249088 2239925 2028456 2197855 2146418 2415838 2095586 2474343 2417719 2255468 2246773
14528 2246773 2361584 2260006 2531190 2550412 2571215 2591166 2736059 2256456 2522204 2684321
14518 2684321 3073138 2446873 2867971 3052756 3105226 2620267 2692595 3027231 3051722 3146405
14508 3146405 3029425 3066705 3106235 2980636 3021928 3111954 3204470 3228026 3339145 3264400 3100705
14497 3100705 3406815 3544514 3657848 3688997 3414659 3654629 3480668 3574091 3615938 3701418
14487 3701418 3686519 4007478 3839058 3548285 4037134 4230919 3811506 3851772 4167302 4276822
14477 4276822 4134646 4240781 4181969 4549964 4444801 4426423 4391594 4217291 4819394 4939483
14467D939483j67102k67009K84627L0539k41160L47445K60611j25613n81319N65194
14457E045696k6937K80733j69244L39528J6990j25509K27381k20220J19405L41852
14447E829675K06482o5040p258P5776K67357n31206M06586J38447K09203p5684
14437F454338K04795o3458L11302j67496J88470J2958L50967j99246J38882M16808
14427G648320l34132L60977R2879J85631J24861K12746J36871j85404M13135j14019
14417H541865K10970N2602J61311k6447J80466k12546N36283q9597L21772n6782
14407I619897M59518o8186L77032J5621J58855j23200R06615m36279K95233J90098
14397A1395204J25470L75548p8735K28558J28333O33323R32l7593K60889O32893
$$ plain form
14467 4939483 4772381 4505372 4789999 4820538 4579378 4926823 5187434 5061821 4480502 5045696
14457 5045696 5018759 5299492 5130248 5469776 5486766 5361257 5588638 5368418 5487823 5829675
14447 5829675 6036157 5971117 5963859 6039635 6306992 5775786 6182372 6320819 6530022 6454338
14437 6454338 6659133 6595675 6906977 6739481 6927951 6940909 7291876 7092630 7231512 7648320
14427 7648320 7314188 7675165 7768044 7953675 8078536 8291282 8428153 8242749 8655884 8541865
14417 8541865 8752835 8805437 8966748 8940301 9120767 8908221 9444504 9354907 9676679 9619897
14407 9619897 10079415 10011229 10388261 10403882 10562737 10439537 11346152 10909873 11205106 11395204
14397 11395204 11520674 11896222 11817487 12046045 12174378 12807701 12808633 12771040 13031929 13664822
14387A3664822K94069l31286K62880L09105N25334J03280K87687L89756L14832
14378A5820479J38706L67983P2745P54665Q1062M63796N06246K27059M63578M65120
14368A9361439j99359O93954N73499P01613K95704L60476j03547Q08095N33374
14359B3025248Q50537Q6988N75899J036662J24072P79673M78768R41004L20983
14350B8219834P70389Q97964Q15086L12601J035337P84525P64914Q59213R24014
14341C5383877R19721J282375R57728O90712J386409J103491J038365J088358
14333D3851036J937860P95646J585218J548339J218360K095658J359671J952432
14325E6344220J566128K154893K187896J972372K303518K464896K187507K407524
$$ plain form
14387 13664822 13958891 13627605 13890485 14199590 14724924 14828204 15115891 15505647 15820479
14378 15820479 15959185 16327168 16399913 17154578 17235640 17699436 18205682 18432741 18896319 19361439
14368 19361439 19162080 19856034 20429533 21131146 21426850 21787326 21683779 22491874 23025248
14359 23025248 23875785 23962773 24538672 25575334 25699406 26479079 26957847 27898851 28219834
14350 28219834 28990223 29888187 30703273 31015874 32051211 32835736 33600650 34459863 35383877
14341 35383877 36303598 37585973 38543701 39234413 40620822 41724313 42762678 43851036
14333 43851036 45788896 46584542 48169760 49718099 50936459 53032117 54391788 56344220
14325 56344220 57910348 60065241 62253137 64225509 66529027 68993923 71181430 73588954
14317G3588954K848530L020939K784352L368642L191244L871777L431719L794554
14309I9900711L858616M806873M494151M968174N334069N585674N528581O571806
14301A41048655O191324P065192P066273P989288Q235149Q762451R407765R176749
14293B04942846J0037653J1044621J1138398J2050092J2360954J3136996J3126037
14286B87837597J4437146J4108664J4955183J5057108J5371247J4690292J4771987
14279C91229224J4378669J3766194J2880782J1373839J0165342Q212047M972041
14272D66978138K033666N43789q96178j590264m202460m340858p167504r093224
14264D42265105j0565628j1341553j3216274j4090058j5023268j5065679j5498226
$$ plain form
14317 73588954 76437484 79458423 82242775 85611417 88802661 92674438 96106157 99900711
14309 99900711 103759327 108566200 113060351 118028525 123362594 128948268 134476849 141048655
14301 141048655 147239979 154305171 161371444 169360732 177595881 186358332 195766097 204942846
14293 204942846 214980499 226025120 237163518 249213610 261574564 274711560 287837597
14286 287837597 302274743 316383407 331338590 346395698 361766945 376457237 391229224
14279 391229224 405607893 419374087 432254869 443628708 453794050 462006097 466978138
14272 466978138 469011804 469555593 468659415 467069151 462866691 458525833 451358329 442265105
14264 442265105 431699477 420357924 407141650 393051592 378028324 362962645 347464419
14257C47464419j5324789j5385613j4523603j3023610j3801675j3444217j3126249
14250B48834663j1580764j1705406j0885483j0371413r789474r294834q091824
14243A77115465q410806p692747p680882o586883o979431n726677n425263n641103
14235A22971673n516734m932234m615621m285884l438202m070343l952850l556756
14227H8603049l375529l180850l231908k784810k441960k728789k456346k141408
14219F6261449k238184k121041k163921k225840j566861j537970j417786j947078
14211E1042768j542921j364217j672498q99880r63598j156927j561394j333743
14203D0547590j321566r55504r28492n00199j022960j242338q41885q13949q32422
$$ plain form
14257 347464419 332139630 316754017 302230414 289206804 275405129 261960912 248834663
14250 248834663 237253899 225548493 214663010 204291597 194502123 185207289 177115465
14243 177115465 168704659 161011912 153331030 146744147 139764716 134038039 128612776 122971673
14235 122971673 117454939 112522705 107907084 103621200 100182998 96112655 92159805 88603049
14227 88603049 85227520 82046670 78814762 76029952 73587992 70859203 68402857 66261449
14219 66261449 64023265 61902224 59738303 57512463 55945602 54407632 52989846 51042768
14211 51042768 49499847 48135630 46463132 45563252 44599654 43442727 41881333 40547590
14203 40547590 39226024 38270520 37342028 36841829 35818869 34576531 33734646 32920697 32088275
14194C2088275q74534p62572o85149n37161r24691m97397l16259j094213m47676
14185B5948623o52447q23849k46989o14526o62788l19928m94843p04248j09406
14176B1319599k58427q68440m51981k07752j67859o23952n33186j32006m46239
14167A7629757l85807M8976l56115n74876j16337j32422m52887l58802N36o96234
14157A4605789K24789k04864n20814j70985k94094O451l56356l37705j96103k34117
14147A2521991J58315o45955j4175K82210o55349k61023J09942m98366K64139
14138A1261729m77337K5160o9597q62988L58600o6028q074m17078P2856n03358
14128I313885J3929M7544k76756j65367J67243m06556m18641J46691j6582l93170
$$ plain form
14194 32088275 31213741 30451169 29766020 29228859 28304168 27806771 27490512 26396299 25948623
14185 25948623 25296176 24472327 24225338 23610812 22948024 22628096 22133253 21429005 21319599
14176 21319599 21061172 20192732 19740751 19532999 19365140 18741188 18208002 18075996 17629757
14167 17629757 17243950 17292926 16936811 16361935 16245598 16113176 15660289 15301487 15302023 14605789
14157 14605789 14830578 14625714 14104900 13933915 13639821 13646272 13289916 12952211 12756108 12521991
14147 12521991 12680306 12034351 12020176 12302386 11647037 11386014 11495956 10997590 11261729
14138 11261729 10784392 10809552 10739955 9876967 10235567 10169539 10161465 9744387 9817243 9313885
14128 9313885 9327814 9375358 9098602 8933235 9100478 8693922 8275281 8421972 8405390 8012220
14118H012220J29493k47711n4261J02764l02905r444m7124k42887k98077q1762
14108F960306K523Q1787K6359j07216j20740k66449K74979k15502J29724k39532
14098F526239k19687O7189j87707J33385j88956j54907J9852j45634K6418j70335
14088E705857j0043l49223J49563K76883l67853M0968m2327K4200m82563K68169
14078E213631j23333j52981l1711P7R6798j28197n8065k55651K98746k27604K73585
14067D905295l03958j41731K00852k7298n11784J43829Q5953k1149l734J40655
14057D466930l15860j04140K74824m05585j90893o1020N22096k97856Q9873l07155
14047C671214K0094k5832K80705n74452J73828L44953k44341k68699j13342L40698
$$ plain form
14118 8012220 8141713 7894002 7839741 7942505 7639600 7630156 7583032 7340145 7042068 6960306
14108 6960306 6962829 7044616 7070975 6963759 6843019 6576570 6851549 6636047 6765771 6526239
14098 6526239 6306552 6373741 6186034 6319419 6130463 5975556 5995408 5849774 5876192 5705857
14088 5705857 5695814 5346591 5496154 5773037 5405184 5446152 5403825 5428025 4945462 5213631
14078 5213631 5090298 4937317 4905606 4905683 5002481 4874284 4816219 4560568 4859314 4631710 4905295
14067 4905295 4601337 4459606 4660458 4633160 4121376 4265205 4351158 4330009 4326275 4466930
14057 4466930 4151070 4046930 4321754 3916169 3725276 3664256 4186352 3888496 3978369 3671214
14047 3671214 3691308 3665476 3946181 3371729 3545557 3890510 3646169 3377470 3264128 3604826
14037C604826k57493O0265J22911k08140l61292J56118M38618k68833J52392l29464
14027C109908K8134k6045j80318j2488J05839J30288k61580k80540M28735l60204
14017B681729K24758j7784j11768l0719k80750J25381P2168n0890q6660q6641
14007B438824j39680J2504l8577K86617j93055P8681j45102j43799K7798R7828
13997B282039J48851j54153k86468K4807J95743R8305J63783J79065J300617K321754
13987F274343O315918K1406550J6935987k3351370j3620646n481530k280344j175958
13979E022950p27351l40340l42441l33618j08235j91041M2134o6108L28j51818
13969B804460m3412j93558k79493J59411j94602Q1282j73440M54523k34686o4087
$$ plain form
14037 3604826 3347333 3407598 3530509 3322369 2961077 3117195 3555813 3286980 3439372 3109908
14027 3109908 3138042 3111997 2931679 2919191 3025030 3155318 2893738 2613198 3041933 2681729
14017 2681729 2906487 2888703 2776935 2746216 2465466 2590847 2663015 2612125 2525465 2438824
14007 2438824 2299144 2311648 2273071 2559688 2366633 2445314 2300212 2156413 2184211 2282039
13997 2282039 2430890 2276737 1990269 2015076 2210819 2309124 2472907 2651972 3952589 6274343
13987 6274343 12590261 33996811 50932798 27581428 13960782 8479252 6198908 5022950
13979 5022950 4295599 3955259 3612818 3279200 3170965 2979924 3022058 2955950 2956278 2804460
13969 2804460 2761048 2567490 2287997 2447408 2252806 2334088 2160648 2615171 2380485 2316398
13959B316398j61280K25892k47033j35408K5727k52987K50454K17055O3867j94952
13949B107733j87679k726K79316j10642k57236K75342k20511N03206p96400N69426
13939B159829k61458l4857O5701M2762j09232j17725j71577P23285o31022j0461
13929A655245J38510j88041J4033n9769J94025n3826O2585K5938l07623L53741
13919A834818o9498j12356l46255m3390L11847j60249J79001j54293o5546M83379
13909A857458m48115J78936j72819m1725J7879j833p6460J03213R2821j90298
13899A319057L36438j75914J19161j29449k23192L3250k3524q7848J76798J22416
13889A467193l67133J16364K53132l48736K79679l38701K14875o6384M14804l60388
$$ plain form
13959 2316398 2155118 2381010 2133977 1998569 2024296 1771309 2021763 2238818 2302685 2107733
13949 2107733 1920054 1917328 2196644 2086002 1828766 2104108 1883597 2386803 1590403 2159829
13939 2159829 1898371 1863514 1929215 1971977 1862745 1745020 1573443 2296728 1665706 1655245
13929 1655245 1793755 1605714 1619747 1559978 1754003 1700177 1762762 1788700 1481077 1834818
13919 1834818 1765320 1652964 1306709 1263319 1575166 1414917 1593918 1439625 1374079 1857458
13909 1857458 1409343 1588279 1415460 1373735 1391614 1389781 1313321 1416534 1509355 1319057
13899 1319057 1655495 1479581 1598742 1469293 1246101 1279351 1255827 1167979 1344777 1467193
13889 1467193 1100060 1216424 1469556 1120820 1400499 1061798 1276673 1210289 1625093 1264705
13879A264705J29402k55803j1146N61168o26596J6417J6511L72898l77117K9408
13869A119847l8581L93807j55937l11669J02764L51570n24730J21543j53837J78648
13859A083425J77877k89598l81562J89776M59600m96238N19403r856N1305k77588
13849A026544J22983k30622J46273K05226j71099k87730M26268k40669j6360L1592
13839A012406R7821m9973n7946L40355l32188j37440J21415L9764l35673Q0125
13829G78666L41942j53350k87963K70437J48937l58555k49624O41015l9724j22926
13819I68855j87961K28639l7763J82581n01773O14987m05039R5811k14194J28535
13809H72678j88880J87402R9186r2715K16159k29091k06589K56561P3958j86286
$$ plain form
13879 1264705 1394107 1138304 1127158 1688326 1061730 1078147 1094658 1467556 1090439 1119847
13869 1119847 1081266 1475073 1319136 1007467 1110231 1461801 937071 1058614 904777 1083425
13859 1083425 1261302 971704 590142 779918 1239518 743280 1262683 1252827 1304132 1026544
13849 1026544 1149527 918905 1065178 1270404 1099305 811575 1237843 997174 980814 1012406
13839 1012406 1110227 1060254 1002308 1342663 1010475 873035 994450 1034214 698541 778666
13829 778666 1120608 967258 679295 949732 1098669 740114 490490 1131505 1091781 968855
13819 968855 780894 1009533 971770 1154351 652578 1267565 862526 958337 744143 872678
13809 872678 683798 871200 970386 877671 1093830 864739 658150 914711 988669 802383
13799H02383L8422j26826N9085L17400j89470J2983l55930K59443j93369M00058
13789A024179j76702K22481j37537l8426j7319j32756k7350K49391k64025k13205
13779D88731J39977K27870R2405k81292K07524j61368J86628k96399J94809j73688
13769F25197J18160j64157K31708j67150J17677j72582L75967D32022N78871j41313
13759H69580k22057L01717k56673M10102m27588J53757l62198Q1850Q3762j7612
13749F14640K54738K53768l15234k67424J61580k3344N1321B64601O05250p4486
13739G95365j22550n0690j03840J28024K13577j30020K13803j22872J44587B65613
13728E39549O2768q4438J6482K51142k08314M11062m02416K52128o1071k13239
$$ plain form
13799 802383 840805 713979 773064 1090464 900994 913977 558047 817490 624121 1024179
13789 1024179 847477 1069958 932421 893995 876676 743920 716570 965961 701936 488731
13779 488731 628708 856578 948983 667691 875215 713847 900475 604076 798885 625197
13769 625197 743357 579200 810908 643758 761435 588853 964820 432022 1010893 869580
13759 869580 647523 949240 692567 1102669 675081 828838 466640 548490 632252 614640
13749 614640 869378 1123146 807912 540488 702068 678724 730045 264601 869851 795365
13739 795365 672815 622125 518285 646309 859886 729866 943669 820797 965384 265613
13728 539549 602317 517879 534361 785503 577189 988251 585835 837963 776892 563653
13718E63653P0753j62850O3286J37184k97125K63297k1801L6884m3779k98529
13708C10973L66207J47281C18490Q43488n15616J67315j37040q6954j18087R7048
13698E68644B70843L39818k28963J0296K36300k34657R6551j83590L8111J54468
13688D99177J5826K75935k84575P9381j14822j42233J40885A38225M6882K08410
13678C93517J03474j9918o779J01609j29273A61621P9697N85019l54549k1053
13668D50735l132n2228j56045L21710J23597L5472C16115Q4952j50717J47105
13658C97455O905K41163j40278k48353L36586B16618Q3625M552J90375j06778
13648C88392J26083I4139L72878l5315K17536k46529F5184L49848K85322B44609
$$ plain form
13718 563653 634406 471556 534842 672026 374901 638198 616397 653281 609502 310973
13708 310973 677180 824461 318490 1161978 646362 813677 676637 589683 471596 568644
13698 568644 270843 610661 381698 391994 628294 393637 490188 306598 344709 499177
13688 499177 515003 790938 506363 585744 470922 328689 469574 138225 185107 393517
13678 393517 496991 477073 470294 571903 442630 161621 241318 826337 471788 450735
13668 450735 447603 395375 239330 561040 684637 720109 316115 401067 250350 397455
13658 397455 404360 645523 505245 256892 593478 216618 300243 304795 495170 388392
13648 388392 514475 94139 467017 431702 649238 402709 65184 415032 700354 244609
13637E93058q5995o2659O2871r8416J07874K35353k15135B07234K50092O4642
13627E21968j44246K72054C03522K0693J85536P9457k77357K73690A90053K80090
13617D70143J07986q6799n8798O9758j25804J0893j39968j00445D3272M99372
13607E42644k56900r0406O9219K38413B17303K66561H0132L81372l5111O6045
13597D92438J05220k54257j30390K44533A42351M87231j84643j06693j62264K66793
13587D42775O6449j62415J49595j59926q5217P5434J37762B06476L88031j21012
13577D73495p6239b0748A88859m4101n5598P8825K07650n2908M07320l46463j55346
13566B28238r1996J61914O3849A20648J83487B3883J70187J40483J05437m8411
$$ plain form
13637 593058 507063 444404 507275 408859 516733 752086 536951 207234 457326 521968
13627 521968 377722 649776 303522 324215 509751 589208 311851 585541 190053 470143
13617 470143 578129 491330 432532 502290 376486 387379 247411 146966 43272 542644
13607 542644 285744 195338 264557 502970 217303 483864 80132 461504 426393 492438
13597 492438 597658 343401 213011 457544 142351 629582 444939 338246 175982 442775
13587 442775 509224 346809 496404 336478 251261 326695 464457 206476 594507 473495
13577 473495 397256 -20748 188859 144758 89160 167985 375635 322727 730047 383584 228238
13566 228238 136242 298156 362005 120648 304135 23883 194070 334553 439990 391579
13556C91579K06149B58339M63440G0920a481D77680A04535N23809B78823K15462
13546D94285a4907D58258k5113R8336p6973P9009A01767N13502j02360j15977
13536C96932d4931D99369A79917K59960A51992M76363j09151k55191J40841A24302
13525B14097J44799A77137J43963K46045j07895G2001J73004j1559a03854C05831
13514E1061L5704M23727j14279b3619B79478l8984L94034A79362L23059A69313
13503A79463K13238A61837K3932k4520M0180M1130J97606b66532B59807J09295
13493C69102K5245C3381d1572E54315B36755n1743E0304K33095B8179L15047K73909
13482F17135j38896K02471k38121A7020M71082q6572j78384J44727J51872k47514
$$ plain form
13556 391579 597728 258339 721779 70920 -1481 477680 104535 628344 278823 494285
13546 494285 -14907 458258 433145 531481 454508 533517 101767 615269 512909 396932
13536 396932 -44931 499369 179917 439877 151992 628355 519204 264013 404854 124302
13525 214097 358896 177137 321100 567145 459250 72001 245005 233446 -103854 305831
13514 51061 86765 510492 396213 -23619 279478 240494 634528 179362 502421 169313
13503 179463 392701 161837 185769 161249 201429 242559 440165 -266532 259807 369102
13493 369102 394347 33381 -41572 554315 236755 185012 50304 283399 28179 343226 617135
13482 617135 478239 680710 442589 17020 488102 401530 223146 367873 519745 272231
13472B72231j10661J57936E9121N5164K28702Q8751A90450M8047G6446L88073
13462D64519a77647B01689M24317A41641O6646I5071p222m361L09328b45902A29407
13450B55643K26014q7086K13433k08227q7160c2666A91204d377A02764M2233n9551
13439H5446K62699P1293F5056K54225b00806L4248D26663K2761j31428q2881j12644
13428A22471A9691O1090e4597l419B39149M8317m4976J09115A9552K56647k1987
13417B54212l6578J29700r5264a24989d9940A33780L45110j55889j25192j9626
13407A78183a16518A1268J246M9168L80072A42065K6250P4144j01576q824M1984
13396A74043M003K63748r3067N0443k2822A41280L3580M6868q4303g9569B82235
$$ plain form
13472 272231 161570 319506 59121 114285 342987 431738 190450 238497 76446 464519
13462 464519 -177647 201689 626006 141641 208287 95071 87849 83488 392816 -245902 129407
13450 255643 481657 394571 608004 399777 312617 -32666 191204 -4377 102764 144997 85446
13439 85446 348145 419438 65056 319281 -200806 -166558 426663 449424 317996 235115 122471
13428 122471 19691 80781 -54597 -58016 239149 287466 242490 351605 19552 276199 254212
13417 254212 217634 347334 252070 -124989 -49940 133780 478890 323001 197809 178183
13407 178183 -116518 11268 12514 61682 441754 142065 168315 242459 140883 132059 174043
13396 174043 178046 441794 348727 399170 376348 141280 174860 221728 137425 -79569 282235
13384A33372R0772n7530K10384A45432J57377m3890p5006N0814o6367O2320a44936
13372A90774a77989B05920b7056C43934j70979P5680J79813A50230o6874n239
13362G8117O4444b4486B70872o655j23085J13559r5557K51120a47510A29330L17363
13351D46693J56117A55524A689N2019K71355j37518J7550K65361B00786m5452
13341A55334L64901k04102j24171L01528J8663A41825h2087A65459O5180R6783
13331C27422k8826L7581b1971D41174j52713J05611A91698D7224R6808K17678
13321C61710J02189C5719J81016K83329A57982J90613P4387j0685a3682C04476
13310D9760R2948K05822B3006g4373A57167d5543C46128j09832K6291J08710J00578
$$ plain form
13384 133372 224144 166614 376998 145432 302809 258919 183913 234727 168360 230680 -144936
13372 190774 -177989 205920 -27056 343934 172955 248635 428448 150230 83356 78117
13362 78117 142561 -24486 270872 264217 141132 254691 159134 410254 -147510 129330 446693
13351 446693 602810 155524 1689 53708 325063 187545 205095 470456 200786 155334
13341 155334 520235 316133 191962 493490 512153 141825 -82087 165459 230639 327422
13331 327422 298596 336177 -21971 441174 288461 394072 191698 47224 144032 361710
13321 361710 463899 35719 216735 500064 157982 348595 422982 412297 -13682 304476
13310 49760 142708 348530 23006 -74373 157167 -45543 346128 236296 262587 371297 471875
13299D71875J22996j37492b16229C04407n078o5792M217H2091L3932J40896I0914
13287C04827A06760M9859L9842q8695N7542e6151B02504d819A83202i9275B54923
13275B47929N265q3665p9940L68232H4377b1215k1138A01663J370M0250K01599
13264C44882j27336J03849J1965j33272E397e3331A6168k408a55116A18054K20636
13253C38690A53083a15206A783b07292A06242b2457B03461a70281A16443J21866
13243B38309i1892B32067A11372K66299H8841K41791m910a16930A20100a70895
13232C7777J53865J41263C3582N7600C2835L12503A04359a26314A56660b1319
13221H9333N8780l0856k0089a98944B40215j8237q1106J13406G4905R7249M273
$$ plain form
13299 471875 594871 457379 -216229 304407 299329 233537 237754 82091 116023 256919 90914
13287 304827 106760 156619 196461 107766 165308 -56151 202504 -4819 183202 -99275 254923
13275 247929 253194 169529 89589 457821 84377 -21215 -42353 101663 103033 143283 344882
13264 344882 217546 321395 333360 200088 5397 -53331 16168 13760 -155116 118054 338690
13253 338690 153083 -115206 1783 -207292 106242 -22457 203461 -170281 116443 238309
13243 238309 -91892 232067 111372 377671 88841 330632 325722 -116930 120100 -170895
13232 37777 191642 332905 33582 91182 32835 345338 104359 -126314 156660 -21319
13221 89333 148113 117257 97168 -198944 240215 221978 140872 254278 74905 172154 176427
13210A76427Q7993a0762B0789K5524K77526r1317i167A02872e7591D5924b27340
13198e480C3968j5745J53371Q3336a2703j01325E3595a39363D0817K35160D3687
13186b7248B76116k7200F3270C0931f0908A72057o3606A9375O6002N1906K3048
13175A60331f2197D68385A60365K2572b39153h8552p0126b8659A01643a41722
13164C17859m3189b06389B87098a5998A42444N000e6860A50378C1419a67843A57129
13152a20046B31761d636A70572c43468a16428A13773B2199K80182a14625F582
13141f3705G993l312J56482b31794A83903a61050A86106a66063A60641k3420A5071
13129a5487A57690M3626D9536L6499a3933E3070N5503L74240H5503a8997H1372
$$ plain form
13210 176427 264420 -10762 20789 46313 323839 232522 -9167 102872 -57591 45924 -227340
13198 -5480 33968 18223 171594 254930 -12703 -114028 53595 -139363 40817 275977 43687
13186 -27248 276116 248916 63270 30931 -60908 172057 108451 19375 85377 137283 160331
13175 160331 -62197 468385 160365 182937 -239153 -88552 -158678 -28659 101643 -141722
13164 317859 274670 -206389 287098 -15998 142444 147444 -56860 150378 31419 -167843 157129
13152 -120046 231761 -4636 170572 -343468 -116428 113773 22199 302381 -114625 6582
13141 -63705 7993 4681 161163 -231794 183903 -161050 186106 -166063 160641 137221 15071
13129 -15487 157690 201316 49536 86035 -13933 53070 108573 482813 85503 -18997 81372
13117b6110B65413I0166q314d419j47211A68051F9167P0268F374O6585a15700
13105d3409o6798G3106b18097H9786j0057J22464J9312E6648K0429c385A05687
13093A00520r551h2727k1766r5236E5305J28571H588J2177n462M8415R8068F5835
13080C38552J72596A3354J04177b27243B37128L6446b15676C0406L52643D7803
13069B76719k4856b8627k9354a9562A44305f676D44826j53070j5602F2084K74719
13058C36803A25776J84523n0740A687f5821I0636J31255q4456c56366A28556a348
13046c63753H0622a8219l8623k07125E0836J7382k467J12158e6446B80237H6562
13034A71738d06188D58370F763L03985j6916j6153q6958M9306q8289m0496L3245
$$ plain form
13117 -26110 265413 90166 81852 -4419 -151630 168051 69167 139435 6374 72959 -115700
13105 -43409 -110207 73106 -218097 89786 79729 202193 221505 56648 77077 -3385 105687
13093 100520 90969 -82727 -104493 -199729 55305 183876 8588 20765 15303 63718 161786 65835
13080 338552 511148 13354 117531 -227243 237128 273574 -215676 30406 383049 47803
13069 276719 251863 -28627 -57981 -19562 144305 -6676 444826 291756 276154 62084 336803
13058 336803 125776 310299 259559 1687 -65821 90636 221891 137435 -356366 128556 -1348
13046 -363753 80622 -18219 -56842 -263967 50836 68218 65751 177909 -56446 280237 86562
13034 171738 -406188 458370 6763 310748 293832 277679 190721 240027 151738 111242 144487
13023A44487J47721j16011m0419L6337m0772K44933a66851d192A54035m1570L07469
13012D19934D2905P3051n2214Q1395K00153G4645i8188C48123k5169b4911A59498
13000D07026b87610D7585b98749b6811r0900G4365J769c1205i699E0137L32755
12989C82892c1116a892A27029h9092J6162B68676n4625h6564c3448k0515E2028
12977a52666A63994J3314b07445D0918N9500N3849a90923e7344A5083g4393G0986
12965E82443j58899B9117Q1908b01894d8799B35515g7611Q992B3609P2639D0854
12953a37374J4357k4363N3924C7035A4746C49a00029b9940B4847J99611E8918
12941A92984e3979k16237B63864h1775j95270E0569m886o51R8128e69015H6122
$$ plain form
13023 144487 292208 176197 135778 172115 131343 376276 -166851 -4192 154035 112465 419934
13012 419934 42905 115956 63742 145137 345290 74645 -98188 348123 322954 -24911 159498
13000 407026 -287610 47585 -298749 -26811 -117711 74365 76134 -31205 -9699 50137 382892
12989 382892 -31116 -1892 127029 -89092 -72930 268676 214051 -86564 -33448 -53963 52028
12977 -152666 163994 177308 -207445 40918 100418 154267 -190923 -57344 15083 -74393 70986
12965 582443 423544 29117 111025 -201894 -48799 235515 -77611 -68619 23609 96248 40854
12953 -137374 -123017 -147380 -93456 37035 14746 349 -100029 -29940 24847 224458 58918
12941 192984 -53979 -270216 263864 -81775 -277045 50569 45683 45032 143160 -569015 86122
12929A60014O7523j08512K5195a01357j21356A00473R4206J60449c5168o0163
12919i5331D15429k06072B9661b57088C0201L6109b75583d6636D18009D1402c3624
12907C8664J51723c04726A85440h9189K0461e584A35141o7220a25981N8971A20971
12895b8132P210F9688J56700B1686f4477F7898N5508E1695K42262b18575D5671
12883F9027a92459I2074l0573N2954h5542B96811g3271B34502a45801c8828p6991
12872a15819A67003O072a21738H7829P1291J36261b28051C52380c78732H8154
12861I3009J2912a22639A3561b3427m9413A8028L07843J12384j72870c24743C89511
12849c23895J08128g9959A33772D2562d8759G2212C2412J3812O631L6537l0678
$$ plain form
12929 160014 227537 119025 144220 -101357 -222713 100473 194679 355128 -35168 -95331
12919 -95331 415429 209357 29661 -257088 30201 66310 -275583 -46636 418009 41402 -33624
12907 38664 190387 -304726 185440 -89189 -68728 -5584 135141 67921 -125981 -67010 120971
12895 -28132 -20922 69688 226388 21686 -64477 67898 123406 51695 293957 -218575 45671
12883 69027 -192459 92074 61501 114455 -85542 296811 -73271 234502 -145801 -38828 -115819
12872 -115819 167003 173075 -121738 87829 159120 295381 -228051 352380 -378732 88154
12861 93009 105921 -122639 13561 -23427 -72840 18028 325871 438255 265385 -324743 389511
12849 -323895 -215767 -79959 133772 42562 -48759 72212 32412 46224 52855 89392 58714
12838E8714b65189B02282D9898J07390B7944Q5354C8084b43300f9159A4640K35852
12827B50492h7810A88841i9765B5515c39978J34474A65709e6001A50256b2521
12816B32252a23579q088B3837J66728a84944q229A22331g7736L4503o2265A17569
12804a11536L0041j01772a2430A47017N8979a53211C87931c60964q685B3588h9610
12792f5062M953A7968a07675A29413e4882a1860j04542B78231b26607L8330B14001
12780a14596A22029c07281A61990C5496e6318j5708L3781A25806g5827B83712
12769A63225A7925c85433D6793N0695f5738C24486A564h2131B62534d4731n998
12758e0729K0590r9078m4933j25133C32133A14854R7021o9921b21924e8103A93697
$$ plain form
12838 58714 -265189 202282 49898 157288 27944 113298 38084 -243300 -69159 14640 250492
12827 250492 -87810 188841 -99765 25515 -339978 -205504 165709 -56001 150256 -22521
12816 232252 -123579 -131667 23837 190565 -184944 -193173 122331 -77736 -43233 -105498 117569
12804 -111536 -81495 -183267 -12430 147017 205996 -153211 387931 -360964 -369649 23588 -89610
12792 -65062 -60109 17968 -107675 129413 -54882 -11860 -116402 278231 -226607 -188277 214001
12780 -114596 122029 -307281 161990 35496 -56318 -72026 -38245 125806 -75827 283712
12769 163225 17925 -385433 46793 97488 -65738 324486 1564 -82131 262534 -44731 -50729
12758 -50729 -30139 -129217 -174150 -299283 332133 114854 211875 141954 -221924 -58103 193697
12746C6988J69442j00846f3052l3398A88621b0054j4364J0590A08612K28652j65212
12735A72052B6526c7036k412C02e0915D98312k30435j07659F5683e6595D5263
12723A07016f8771B39456L5414B561b5879o3344j32366f3956a9463E1144j0499
12712D0645a24134D0196b14505A36089B1537K31772D7942L30493e59D9548P0616
12701A20164K5820L45338j72308A21024B3756K39525F9138L5710B1652P059J67293
12690A96004c69169d6378p8098M1432q3271B94989q6070L9062E7595K5149B1509
12678C59385B3355R4853M19121A77121a13764B1771J68941r3745j74i1045B55982
12666A51081K4150a90338C5596J6117K34388K18106B03891b80081d6879A20810
$$ plain form
12746 36988 206430 105584 -63052 -96450 188621 -20054 -34418 -23828 108612 337264 172052
12735 172052 26526 -37036 -39448 302 -50915 498312 267877 160218 65683 -56595 45263
12723 107016 -68771 239456 274870 2561 -25879 -89223 -221589 -63956 -19463 51144 40645
12712 40645 -124134 40196 -214505 136089 21537 253309 47942 378435 -559 49548 120164
12701 120164 145984 491322 319014 121024 23756 263281 69138 104848 21652 28711 196004
12690 196004 -369169 -46378 -124476 -83044 -166315 294989 208919 247981 57595 82744 21509
12678 359385 23355 118208 537329 177121 -113764 21771 190712 96967 96793 -91045 255982
12666 151081 175231 -190338 35596 51713 286101 504207 203891 -280081 -46879 120810
12655A94481f1005I9112q042K42146j45887o1256K18934j29410I1516B6741d6940
12643a2188H0288K1616hB63104e9352F4990a96129A38457J36307k8591I7302b22597
12630A43955a68392C82717J1600J31338k55974N0644o659A0773d6891m574A64700
12618F8237B9578B237N5808I220L4865a9369C4237K8169B5319J370a6398o0445
12606g6843C9089a56364c0877j91128B42844J55048E5110b52155A59864J33814
12596B93678h3229E3170j0651L64941a1399G0747K29156I9240e5336j35922B50022
12584I2937O7690c58022A85619a58344H9075a19664A06289J1057M9188c9013C6536
12572G9920n778c54089H5381J19159n7021n1296a57105D8559K06165C1675b86978
$$ plain form
12655 194481 -61005 99112 91070 333216 187329 126073 345007 215597 91516 26741 -46940
12643 -12188 80288 101904 -8 263104 -59352 64990 -196129 138457 274764 246173 97302 -222597
12630 143955 -168392 382717 394317 525655 269681 320325 313666 10773 -46891 -51465 164700
12618 68237 29578 2237 58045 9220 44085 -19369 34237 62406 25319 26689 -16398 -76843
12606 -76843 39089 -156364 -30877 -222005 242844 397892 55110 -252155 159864 293678
12596 293678 -83229 53170 42519 407460 -11399 70747 299903 99240 -55336 -191258 250022
12584 92937 160627 -358022 185619 -158344 89075 -119664 106289 117346 166534 -39013 36536
12572 79920 74142 -354089 85381 204540 147519 96223 -157105 48559 254724 31675 -286978
12560a12719L566K4891j53391B70080F3912J32885b4406e916p6572j21198B2361
12548c4319B73160b60163K632f7701C3017N8702l540J56664A4034a76309C24021
12536c2624r4394c6746B35380F5838A9126b34322b1736C6012L82961A76031b17267
12524a21206B3398L09156G2305L0353a61448h960D36164a13497B30666L0667O7664
12513C28997a6742F1923O8407m1125L63270g8678k9360L6456l9621A89614K7358
12502B16972C6246K61013d624m045j08159A49739b71025C8697k81c8937E6369
12490H2799b4400k95416A74876m1840B354K02379F5307l0197K9411a44018j09235
12479b53253b6393A04910b03670J4153i040l0158j19853E0127R4792N6454a09225
$$ plain form
12560 -112719 -109153 -84262 -237653 270080 63912 196797 -24406 -5916 -82488 -203686 22361
12548 -34319 273160 -260163 -257531 -67701 33017 91719 88179 244843 14034 -176309 324021
12536 -32624 -127018 -36746 235380 65838 19126 -234322 -21736 36012 418973 176031 -217267
12524 -121206 23398 332554 72305 102658 -161448 -8960 436164 -113497 230666 261333 328997
12513 328997 -16742 61923 130330 89205 452475 -78678 -108038 -71582 -111203 189614 216972
12502 216972 36246 297259 -4624 -8669 -116828 149739 -271025 38697 38416 -38937 56369
12490 82799 -24400 -319816 174876 133036 2354 204733 65307 35110 64521 -144018 -253253
12479 -253253 -26393 104910 -203670 -189517 -9040 -39198 -159051 50127 144919 201373 -109225
12467C03878b04234c6388j18472B39941H0035a09879A43741O9944g9873A84555
12456B84159D0749a02157B54472m4567o9473M0227a10664B4941J91658i6744k10473
12445c07217D6924K49853A22615E234R4288k2341N0926a72351C17506b02338Q6913
12434a15425B27651e002m3495a7892r0931E4272J65452h1585j87707j52279P8887
12423c42684k590a35426G3596C459b04176A06489b03617M8450d4791D9735R6936
12412A46671b21001g1646G3264a92108D658i9591l7221E9901i653A40232c04729
12400a59204P4232A53007j9683O8965a08253B44317a23653b4161k90211i5763
12389c46830B6922a81221d3621m4073j65278A31945a45238r0311A53691a8926
$$ plain form
12467 303878 -204234 -36388 -154860 239941 80035 -109879 143741 213685 -79873 184555
12456 284159 40749 -102157 254472 209905 140432 180659 -110664 24941 216599 -96744 -307217
12445 -307217 46924 296777 122615 5234 99522 77181 128107 -172351 317506 -202338 -115425
12434 -115425 227651 -5002 -48497 -17892 -108823 54272 219724 -81585 -269292 -421571 -342684
12423 -342684 -345274 -135426 73596 3459 -204176 106489 -203617 -155167 -44791 49735 146671
12412 146671 -221001 -71646 73264 -192108 4658 -99591 -136812 59901 -9653 140232 -304729
12400 -159204 -84972 153007 133324 202289 -108253 244317 -123653 -24161 -314372 -95763
12389 -346830 26922 -181221 -43621 -87694 -252972 131945 -145238 -235549 153691 -18926
12378f4919H8477a59308e5088K1586A11716a27248A50773c1329B83461b23393
12367B14552q3927J05815B7218L64150A16575d9460G7798P9236a33550K0356e531
12355b0257l33329i3292j58856g7156A19058A0031K88954A11266k2863J70965
12345B59368G4180C5544J60688a6187q5975A07063f8285a5737k61035E3589B2510
12333i6507L1838B3978a40520H6838j6767J68994a02030a1502A49559N3397J65357
12322C68313a63364A06167J21392D1049a8735B1594J1763f6804m2353A48550b95708
12310C1530N6433L06445j62408b16470i9922b9899k34443R6650B50782r1212E2559
12298E575d9511k38063A79044j4781c8782G9482C1842N6895k1405O5185b84055
$$ plain form
12378 -64919 88477 -159308 -55088 -33502 111716 -127248 150773 -31329 283461 -223393
12367 214552 130625 236440 27218 391368 116575 -49460 77798 157034 -133550 -113194 -5531
12355 -20257 -353586 -93292 -252148 -77156 119058 10031 298985 111266 88403 259368
12345 259368 74180 35544 196232 -16187 -102162 107063 -68285 -15737 -276772 53589 22510
12333 -96507 -64669 23978 -140520 86838 70071 239065 -102030 -11502 149559 202956 368313
12322 368313 -163364 106167 227559 41049 -18735 21594 33357 -66804 -109157 148550 -295708
12310 31530 87963 394408 232000 -216470 -99922 -29899 -264342 -167692 250782 159570 52559
12298 5575 -49511 -287574 179044 164263 -38782 79482 31842 88737 67332 132517 -284055
12286A92978b04081B18927E5163a3907o8278L7684A51884b95743C58033B9798
12275A77073b0051D96916A332J67832E9060L6924K27962j11187m0763b54E2812
12263c5380A31071a7043k00265i9542E6881J42801n325a02570C76956A0929e6926
12251A16820J02274p3869d9753B64310n4834g5207C32078a3653A64496D4743J15410
12240A60153i6887A84443p0009j6147J77624C6310J71184E5277d9376D21298A37013
12228D52712G3680K10566h1267C57927A09002K73219j84197N0751q0267B3237
12217B36757m137m3256J42238a19133F2808Q0364a11092E978L78023A72851b11762
12205C49801H0349C5292b5298L055a0735E8007P7414J00422m9654C0821J37595
$$ plain form
12286 192978 -204081 218927 55163 -13907 -82185 -44501 151884 -295743 358033 29798
12275 177073 -20051 496916 1332 169164 59060 95984 323946 212759 171996 -254 52812
12263 -35380 131071 -17043 -217308 -99542 56881 199682 194357 -102570 376956 10929 -56926
12251 116820 219094 145225 -49753 264310 209476 -75207 332078 -13653 164496 44743 160153
12240 160153 -96887 184443 114434 98287 275911 36310 207494 55277 -49376 421298 137013
12228 452712 73680 284246 -81267 357927 109002 382221 198024 248775 168508 23237
12217 236757 232620 189364 331602 -119133 62808 143172 -111092 5978 384001 172851 -211762
12205 349801 80349 35292 -25298 -22243 -10735 58007 135421 235843 186189 30821 168416
12194A68416O4669e1267D5807K94915J00585j54852D3356K05264i8213A26542
12183A40593C9354L81000c6652B19102q1990N1458o9460a27202K5570A46600n7487
12172H9113R4787b293H2052p708J35967P4413G3086L95081I0c113B30859b08895
12159A98066d3316B23071i2425I1124K98330E5809a71840F8063L5853J00049a86680
12147A76336J4730J47218A00662c08921A90961g5013j03966B89944E5383b94056
12136a34383e3992C81492A43390K3205J47458H1861f4734K6621k88025B68513
12125f5735A45277N59094e6325I0380K3376N6598p2316D0414c32888D3336O0873
12114A04209b79612J21063b2307j07160a8918B07708n2437n9541m4032P0531a56889
$$ plain form
12194 168416 233085 -51267 45807 340722 441307 286455 43356 248620 -98213 126542
12183 140593 39354 420354 -36652 219102 137112 188570 119110 -127202 -101632 146600 89113
12172 89113 183900 -2293 82052 74344 210311 284724 73086 468167 90 -3113 230859 -208895
12159 198066 -43316 223071 -92425 91124 389454 55809 -171840 68063 103916 203965 -186680
12147 176336 191066 338284 100662 -308921 190961 -75013 -178979 289944 55383 -294056
12136 -134383 -53992 381492 143390 166595 314053 81861 -64734 -38113 -326138 268513
12125 -65735 145277 704371 -56325 90380 113756 170354 98038 40414 -332888 43336 104209
12114 104209 -279612 -158549 -22307 -129467 -18918 207708 155271 95730 51698 122229 -156889
12102d7984I8559N9651d89675A66501a65305N4437l33992a37034E0796b95825
12091a43185c0387m8524p3710J1898j33374C0597a92525D79809i4408o0733A02429
12079a47040B193K45954A13126J27780J16645j17000c8325D0450b80141C2100
12068A42887N15806P95256j88355n53029A37633J8409a37080c9977A63034E541
12057G7921k4578c03836C72N8481G052a77036I699N3219K49064A53154b55239
12045b142A06281K68652p4827c64909H8661O881M4643g2049B61016J36949A42696
12033f1166j48617A67286g3736B093K40057a1511M040D0783a41667E6121a78294
12021a58963C88897a28792C6434g8342c7626D46440c08438A01993h2643l1964
$$ plain form
12102 -47984 98559 158210 -489675 166501 -165305 -110868 -444860 -137034 50796 -295825
12091 -143185 -30387 -78911 -152621 -140723 -274097 30597 -192525 479809 -94408 -155141 102429
12079 -147040 2193 248147 113126 240906 357551 240551 -38325 40450 -280141 32100
12068 142887 658693 1453949 1265594 712565 137633 156042 -137080 -39977 163034 5541
12057 77921 53343 -303836 372 58853 7052 -177036 9699 62918 311982 153154 -255239
12045 -2142 106281 374933 300106 -364909 88661 95542 140185 -72049 261016 397965 142696
12033 -61166 -209783 167286 -73736 2093 242150 -11511 -7471 40783 -141667 56121 -178294
12021 -158963 388897 -128792 36434 -78342 -37626 446440 -308438 101993 -82643 -114607
12011a14607B01134b73239Q5225j47989J35493D0827a95478c5336E8162b62252
12000A42348c45828a31902B56136d3311q9491n9805B04145b28938H1313L3272
11990A14585E0151m288b32639i4355A45851a50113a5107A18354b49990h0238A43216
11978H4697g5439j23538h7149j8582p6777f917l3797A92381L0741b31000A5120
11966a95380A55206i1992b5388j16155j52705d0549k14766L5047G3793g4279r7329
11955a71608A50148I958a46235n4125R9621A49931a21762l45545c3760A00620
11944I1753a2824A90469j8659h0573R562D42017b01545B31289A07257B7623J65852
11933A93475L30894b73093B0367L7252B6999a16397m07013a47605l8072q8094
$$ plain form
12011 -114607 201134 -273239 -188014 -336003 -200510 40827 -195478 -35336 58162 -262252
12000 142348 -345828 -131902 256136 -43311 -132802 -192607 204145 -228938 81313 114585
11990 114585 50151 45863 -232639 -94355 145851 -150113 -15107 118354 -249990 -80238 143216
11978 84697 -75439 -198977 -87149 -105731 -182508 -6917 -40714 192381 223122 -231000 15120
11966 -195380 155206 -91992 -25388 -141543 -294248 -40549 -255315 -220268 73793 -74279 -171608
11955 -171608 150148 9958 -146235 -200360 -100739 149931 -121762 -467307 -33760 100620
11944 91753 -12824 190469 171810 -80573 -71011 442017 -201545 231289 107257 27623 193475
11933 193475 524369 -273093 20367 57619 26999 -116397 -523410 -147605 -185677 -273771
11923b73771J5754j19263a88004A9714J07253K29451j49413k5158a38902R414
11913a29488I5411b11671C36367c07116i3789A46420b39728C21724c14891a40133
11902H937b3776C31152b17688C9842g9861l6971C4100L23266b17881I4209J82366
11891B76575H0230c36393J40425B72843E9686J84810C824K57833c2674e285k27536
11880b32821f5846j45281A19192g2000Q817A35364g3241B00131f4079m7038j04308
11869b15425F4972J00025a16370j04107A14121l1640e223j44825B09628g6153
11858c6341j27133g7792l21616C4445b62434I0117K20285a92161O4450E289a43174
11846a69500f3447I9811K48030E1087a47515B68080g5864J2173k09768A5977f8818
$$ plain form
11923 -273771 -258017 -377280 -188004 19714 126967 356418 207005 181847 -138902 -129488
11913 -129488 95411 -211671 336367 -307116 -93789 146420 -239728 321724 -314891 -140133
11902 8937 -23776 331152 -217688 39842 -79861 -116832 34100 357366 -217881 94209 276575
11891 276575 80230 -336393 -195968 272843 59686 244496 3824 261657 -32674 -5285 -232821
11880 -232821 -65846 -211127 119192 -72000 -63183 135364 -73241 200131 -64079 -111117 -215425
11869 -215425 64972 164997 -116370 -220477 114121 82481 -5223 -150048 209628 -76153
11858 -36341 -163474 -77792 -399408 34445 -262434 90117 310402 -192161 -127711 5289 -143174
11846 -169500 -63447 99811 347841 51087 -147515 268080 -75864 -63691 -273459 15977 -68818
11834d06910a60025l9720B7499g842B3103C552b90471B35760b8774A81423c8538
11822b77433j7474h6911H5710K1601B6945K1192b59901I3195b5535J971A32080
11810c9955e953A20618a410B0656J36047C7306d83739B1693L02669A56101J7479
11799A73580D3695K8308e2569j97674c7263D5718a04499A63634n2346n2776a02727
11787G5840a2718l95249B27822r3462a89082A66556e3548j20324Q729E6810a51453
11775A0802J80806A4567N0032P1047a05948C02089o2776a9036A37910a55317L9239
11764a16078l4021O1263A13621b19655i5335j8453D2285b4474A17409c6958F0115
11752B44630a55531j68861J56133q2717C1628J38771e7878k3496J3388q9993f9110
$$ plain form
11834 -406910 -160025 -199745 27499 -7842 23103 3552 -290471 235760 -28774 181423 -38538
11822 -277433 -294907 -86911 85710 107311 26945 48137 -259901 93195 -25535 -23564 132080
11810 -39955 -5953 120618 -1410 20656 156703 37306 -483739 21693 324362 156101 173580
11799 173580 43695 72003 -52569 -250243 -37263 45718 -104499 163634 111288 58512 -102727
11787 75840 -12718 -407967 227822 134360 -189082 166556 -53548 -173872 -165143 56810 -151453
11775 10802 191608 14567 64599 135646 -105948 302089 239313 -19036 137910 -155317 -116078
11764 -116078 -150099 -88836 113621 -219655 -95335 -113788 42285 -24474 117409 -36958 60115
11752 244630 -155531 -324392 -168259 -250976 31628 170399 -57878 -81374 -67986 -157979 -69110
11740a35670m2723j01636B49715n334B5797c6444L310j27308B64698N5458a93939
11728a21273A89544h7771F8726e5029A77988d6744I4467b5292B04113d2638p3252
11717a15890A58627h9483j91369m4041F0536b9657C9899i2635k3973j01440I1942
11705a79878A63613J8148A5739c42192A39749o3883J7520M815b09817G9661G558
11693c7262l7745A09977g052A65542b68396D3630j7587L54993b86655B41291H12
11681a53692B17563J98913A35668g2753K8763A7209Q0491K09276a11966B2398
11670a69972G4491B7467a6617j78430j34143A30173J1169N5780H5104L08662g3388
11658a15789A94733a6889B06673q3304J9226J2815A2758K49291f1533o8298L1464
$$ plain form
11740 -135670 -178393 -280029 249715 244381 25797 -36444 -33134 -160442 264698 320156 -193939
11728 -121273 189544 -87771 68726 -55029 177988 -46744 94467 -25292 204113 -42638 -115890
11717 -115890 158627 -89483 -280852 -324893 60536 -29657 39899 -92635 -116608 -218048 91942
11705 -179878 163613 181761 15739 -342192 139749 75866 93386 98201 -209817 79661 7558
11693 -37262 -75007 109977 -7052 165542 -268396 43630 26043 381036 -286655 241291 812
11681 -153692 217563 416476 135668 -72753 -43990 17209 97700 306976 -111966 22398
11670 -169972 74491 27467 -16617 -195047 -329190 130173 141342 197122 85104 393766 -73388
11658 -115789 194733 -16889 206673 123369 142595 155410 12758 262049 -61533 -129831 -98367
11647i8367B18733D0570a14975a8361A74159B4615a81684l8710c2425G1747e5857
11635i5084L032h6o5587p0537j4100A97647R9392A566R4112c9380p5709A16515
11622A48728a70893B8113K00766M4809D0291o275a95437D0798a17176D0665J06725
11611A47390O742a4545B21667B0456e517j52399J8496J7882B53605c9008B0908
11599a68011A71061N0149j03830A2213N9408h624A33463l2834L33957e2936o0806
11588a13742A92463F3914j7786J23540K2284N8792j5994G6787c14404O1716H7707
11576B25757r6992K59252D811g0033B0812M79132g3469G542J92618B7201O8054
11565I5255J07754c17380H2486i1738O936q825A11638a46664C4152K2002i1972
$$ plain form
11647 -98367 218733 40570 -114975 -18361 174159 24615 -181684 -220394 -32425 71747 -55857
11635 -95084 -92052 -86 -65673 -136210 -150310 197647 297039 1566 95678 -39380 -115089 116515
11622 148728 -170893 28113 228879 273688 40291 34016 -195437 40798 -117176 40665 147390
11611 147390 154132 -14545 221667 20456 -5517 -157916 -139420 -121538 253605 -39008 20908
11599 -168011 171061 221210 117380 12213 71621 -8624 133463 100629 434586 -52936 -113742
11588 -113742 192463 63914 46128 169668 191952 250744 234750 76787 -314404 -252688 87707
11576 225757 128765 388017 4811 -70033 20812 499944 -73469 7542 200160 27201 95255
11565 95255 203009 -317380 82486 -91738 -84802 -93627 111638 -146664 34152 56154 -91972
11553B68975H5070A8199b05184C884J36122P9589a71892c0587r7689j07703a05833
11541A28356h4984E4772O3588f9247E1218J94487G0741A280O0962a2851A98521
11529a14882N1373j30073B29949g8691E6005O8752a07033d9760B66298A13565
11518C43209j8687A34107g8190l76000H7810R0203a11752K7512H7333O9844b288
11506B26311G0284L09947j64727J13068F1934K01927N3725k5525F0457J11266
11496A71723Q757p9464J4577i8176B74331C3706L1089J39955a47581B68427q5462
11485A82965h5388G3228J19363Q4731R998a55672E0868J03870J5294J35587A25743
11473E9571a88340f2747D71359j47687A32837J84777a4804B19509b3997D28388
$$ plain form
11553 268975 85070 18199 -205184 3884 140006 219595 -171892 -30587 -128276 -235979 -105833
11541 128356 -84984 54772 118360 -69247 51218 245705 70741 1280 62242 -12851 198521
11529 -114882 -63509 -193582 229949 -78691 56005 124757 -107033 -49760 266298 113565
11518 343209 324522 134107 -78190 -454190 87810 178013 -111752 -84240 87333 157177 -2288
11506 226311 70284 380231 215504 328572 61934 263861 317586 292061 60457 171723
11496 171723 180480 101016 115593 -98176 274331 33706 64795 204750 -147581 268427 182965
11485 182965 -85388 73228 192591 277322 287320 -155672 50868 154738 170032 305619 125743
11473 59571 -188340 -62747 471359 323672 132837 317614 -14804 219509 -23997 428388
11462B00241A4427f5909A60069n5797l3307a15266D3276Q2758D4613b32330a6670
11450A7060J63660f3627Q403G1913K58789I7084b05984C4871b42183A14507M642
11439A19149R5128a33068a3448C3710M4368A4494J49704K09660q5715g7607C5153
11427A33408J06154J68827G3378J00254H5832B9392K4982a08276E9522J39682
11417A99204I4793a268r072I5014b46450I1853a71053H1950c45986A77121k6028
11406A51093o9651B2412b04748L4851k16602B34286I9834b7722n9723A12167N6215
11395A68382a28620f1782r264k7514j63153p6598A88151g3796E3643a11034A75788
11383c870k2504A34904A6757a01171A24618K02112a13231M3963K5042J9985j62562
$$ plain form
11462 200241 14427 -65909 160069 104272 70965 -115266 43276 126034 44613 -232330 -16670
11450 17060 180720 -63627 -55224 71913 330702 97084 -205984 34871 -242183 114507 119149
11439 119149 214277 -133068 -13448 33710 78078 14494 164198 373858 288143 -77607 35153
11427 133408 239562 408389 73378 173632 85832 29392 54374 -108276 59522 199204
11417 199204 94793 -1268 -10340 95014 -246450 91853 -171053 81950 -345986 177121 151093
11406 151093 81442 22412 -204748 -169897 -386499 234286 99834 -27722 -87445 112167 168382
11395 168382 -128620 -61782 -71046 -98560 -261713 -338311 188151 -73796 53643 -111034 175788
11383 -3870 -26374 134904 16757 -101171 124618 326730 -113231 -69268 -44226 -24241 -186803
11372a86803G7175L0512C2003b28845f1137G5397e7305b7227A16369n2094B8351
11360D271b59497g8049j42617F5781g4233j14104C73803j02337f5970D4347K41167
11349B85514O5632e6B41758j9932f2725j6530K9472a0896j76495I6157c61661
11337C32367a17672e5671C5652a39929A66205b06668M6103G3503f3764J3352C742
11325A44871k9409k4766N6471e59H336J6468a0221B60119a16795G0601a64614
11313c4322A07268K66107A50586J14114h3384A16173b10492G5590L6522n4587
11303E7525a52491J5313j4470I5167a23297j76417a37881A1963a41023N6223a6061
11291F8097J96970B4111e3507J250A39929b46023Q4649O2269H9674R8883H8973
$$ plain form
11372 -186803 77175 107687 32003 -228845 -61137 75397 -57305 -27227 116369 64275 28351
11360 4271 -259497 -78049 -220666 65781 -74233 -188337 373803 271466 -65970 44347 285514
11349 285514 351146 -56 241758 221826 -62725 -79255 -49783 -10896 -187391 96157 -361661
11337 332367 -117672 -55671 35652 -139929 166205 -206668 -160565 73503 -63764 -50412 3742
11325 144871 115462 90696 147167 -559 8336 24804 -10221 260119 -116795 70601 -164614
11313 -34322 107268 373375 150586 264700 -83384 116173 -210492 75590 112112 57525
11303 57525 -152491 -137178 -151648 95167 -123297 -299714 -137881 11963 -141023 -84800 -16061
11291 68097 265067 24111 -53507 -52257 139929 -246023 -161374 -99105 89674 188557 88973
11279D9014R1759J15625a89269G3183L8069h3995j31355A27185a52015P0873A55682
11267C112K3723b10456A26505c39759c1049A01726A3839f9615B40854g7635o3813
11256a41448E9532a9991j72822F1535b15551P8305j9481D6959M2869b00581A24436
11244d46113A36383C99a75645D6978K8383M78464A38013o0003k8139a0984o5142
11233g6126A59122d40480H9432c29586C9547L13983j04697G6439c70699a09395
11222b17312B21631B1676E373J38812e1085m3448j30775A48058E1990g8054j86623
11211b64677o4002i1840B58735p3258n4791c12926J32019A46552M0908a62190
11200f1237o360K3100O697l7427r5822k54643G7469f35k5352l1787j47181K8944
$$ plain form
11279 49014 140773 256398 -189269 73183 111252 -83995 -215350 127185 -152015 -81142 155682
11267 3112 26835 -210456 126505 -339759 -31049 101726 13839 -69615 240854 -77635 -141448
11256 -141448 59532 -19991 -192813 61535 -215551 -137246 -156727 46959 89828 -200581 124436
11244 -446113 136383 399 -175645 46978 75361 553825 138013 78010 49871 -10984 -76126
11233 -76126 159122 -440480 89432 -329586 39547 353530 248833 76439 -370699 -109395
11222 -217312 221631 21676 5373 144185 -51085 -94533 -225308 148058 51990 -78054 -264677
11211 -264677 -328679 -91840 258735 185477 130686 -312926 -180907 146552 187460 -162190
11200 -61237 -67597 -44497 -37800 -75227 -171049 -425692 77469 -635 -25987 -57774 -204955 -176011
11188a76011h7528B2036a94955C5287K45338f5928B82161c00445A24993D6194
11177b22784D1471b59303m05810a09521B37037a18684G2374K1784a78543N4279
11167a24264k01247A6400L23035I4890k6002a33706G0409g4558b004A56137A1440
11155b95517a36053B23722h8474B24255c28290A18461k00N798a0672A56679a28305
11143b13570M1522q3695e1332p2805C6058e3791A2130J3938c5865A19474l4133
11132H5341c45989G377c17763H7733K35362a06197C40525b47831a06542A60652
11121i4499A6087J54835b92031D84825b48839D8980g4317L6495O127o8194o12
11110a00501j06069B94322j21298E1100J00482m3639b25897B09318g0726C75689
$$ plain form
11188 -176011 -87528 22036 -194955 35287 280625 -65928 282161 -300445 124993 46194
11177 -222784 41471 -259303 -665113 -109521 237037 -118684 72374 94158 -178543 -124264
11167 -124264 -325511 16400 339435 94890 68888 -133706 70409 -74558 -2004 156137 11440
11155 -295517 -136053 223722 -88474 224255 -328290 118461 118261 124059 -10672 156679 -128305
11143 -213570 -172048 -255743 -51332 -124137 36058 -53791 12130 26068 -35865 119474 85341
11132 85341 -345989 7377 -317763 87733 323095 -106197 340525 -247831 -106542 160652
11121 -94499 16087 170922 -292031 484825 -248839 48980 -74317 -37822 -31695 -99889 -100501
11110 -100501 -206570 294322 173024 51100 151582 107943 -225897 209318 -70726 375689
11099B09237e5759C44373A44222J83661j25610e6422I2825K85975j71828m959
11089B02013C0418b2366B44975f6517C39611j465q0543c2649j99287C42687A64206
11077C70092G3136J50546P2332J24821p9043J1370e4504E02993E8732L06300K9630
11066C94662j37202H2085O22328k86355j4547r9443K07369L08834n5606j26716
11056F37949M8278q9378J66767J38553k76079J09776m2596p0282O2411J93578
11046H78977j56634J50924J05719K1565m53630Q6646L42092J34799l29548j06261
11036F74649j37710K97632K762j31497M67407r4947m54083o4639O13624l71858
11026H01340q7954N3491P5923q3757J01185J48180k00075L5635j71413j62254
$$ plain form
11099 209237 -55759 344373 144222 327883 202273 -56422 92825 378800 206972 202013
11089 202013 30418 -22366 244975 -66517 339611 338146 257603 -32649 -231936 342687 164206
11077 370092 73136 223682 296014 420835 341792 353162 -54504 502993 58732 365032 394662
11066 394662 257460 82085 704413 418058 403511 304068 511437 820271 764665 637949
11056 637949 686227 596849 763616 902169 626090 735866 693270 622988 685399 878977
11046 878977 722343 873267 978986 1000551 546921 633567 975659 1110458 780910 674649
11036 674649 536939 834571 837333 705836 1173243 1078296 624213 559574 1173198 801340
11026 801340 713386 766877 842800 759043 860228 1008408 808333 843968 672555 510301
11016E10301K7766L7564Q9792m6331R9718M2636K23572o8395k32073j596K27592
11005I10546N7201l36179K46252l70654L94029k43457L2791J67662j65047j497
10995F91647O8774j31824K39021k61363J93590j44819K5531N15259m48357L28914
10985A076373r6953J59291k5036J89207L22105m82083L04934K42642n0352K13905
10975A854033L93804L68784M9993K71069K28950q0950l7013j82956j99678j93881
10965B472155p12983K15910J57353o16408K04959J90663j4797N3096O4719k45698
10955A768969p3253k41809K5783o1515j70407k47256D28232K77160p6076j25407
10945E03909j03699K01279k16495p9620j34897N4363j7505j4874J15010a30173
$$ plain form
11016 510301 538067 575631 665423 619092 718810 761446 985018 916623 684550 682954 910546
11005 910546 967747 631568 877820 507166 901195 657738 690529 858191 693144 691647
10995 691647 760421 628597 867618 606255 799845 655026 680557 1195816 747459 1076373
10985 1076373 979420 1138711 1113675 1302882 1624987 1142904 1447838 1690480 1640128 1854033
10975 1854033 2247837 2616621 2666614 2937683 3166633 3085683 3048670 2865714 2666036 2472155
10965 2472155 1759172 1975082 2132435 1516027 1720986 1911649 1896852 1949948 2014667 1768969
10955 1768969 1695716 1453907 1479690 1418175 1247768 1000512 428232 705392 629316 503909
10945 503909 400210 601489 384994 305374 170477 224840 207335 192461 307471 -130173
10934A22545a5350A39809K02143i3133J8491A59352I585b02908D8924a87059H4734
10922A83208a52789A29039B3511c00566b6716C11039f4572A39972F6506K5183
10912I1689J74243e6249A08934a01671D3832G609b43440f9905j63188A86648c6997
10900G2790N9080m4388d39076I4531J22874a20373B03951a95788P2434b9735n5714
10889h5449G8353i4026j13925Q2243B5966a88095B04967e1351A82963i9038l96835
10878d95873h3840B9492a58433H7542b13426A14209K6650a74852A28641e5992
10867B7687J76888r6039A9150J49376E9388J33883b65646a25410C28686j23255
10857B05431I6016a23737H0257i9089C56886A62604b81973c9931j09804e9949
$$ plain form
10934 122545 -15350 139809 341952 -93133 -74642 159352 9585 -202908 48924 -187059 84734
10922 183208 -152789 129039 23511 -300566 -26716 311039 -64572 139972 66506 91689
10912 91689 265932 -56249 108934 -101671 43832 7609 -243440 -69905 -233093 186648 -36997
10900 72790 131870 87482 -439076 94531 217405 -120373 203951 -195788 -123354 -29735 -85449
10889 -85449 78353 -94026 -207951 -125708 25966 -188095 204967 -51351 182963 -99038 -495873
10878 -495873 -83840 29492 -158433 87542 -213426 114209 140859 -174852 128641 -55992
10867 27687 204575 108536 19150 168526 59388 193271 -265646 -125410 328686 205431
10857 205431 96016 -123737 80257 -99089 356886 162604 -281973 -39931 -149735 -59949
10846h096k38635B3251b6124A30711a38201j56349B23154i6924M429L1739l7012
10835i7768l72236B75646a80562A78568f2281E8793a09500r9612J00510A11461
10824I3908K392d4942k22651D7213b55498D2453J26644a7315k05403d7968H4629
10812A1229N9918k0257b40917h4768B0060c0820B33315m9187J25557o3454a01370
10800g3122B59563a63591A81434b87762a14958J7309A43225D8731a92272h0349
10789c99337J44217G0999A0339a55186g3417E7661J17038F3886a61559C12123
10778A38515c9591j13192n1217O3939m108N5942j1628G8820c6515l84669J31134
10767b90050b9647q0530B01932a85385d9809L822b2380o9740A60245D7046J27103
$$ plain form
10846 -8096 -246731 23251 -26124 130711 -138201 -294550 223154 -96924 -92495 -60756 -97768
10835 -97768 -470004 275646 -180562 178568 -62281 58793 -109500 -209112 -108602 111461
10824 93908 96300 -44942 -267593 47213 -255498 42453 169097 -17315 -222718 -47968 84629
10812 11229 71147 50890 -240917 -84768 20060 -30820 233315 184128 309685 246231 -101370
10800 -73122 259563 -163591 181434 -287762 -114958 -97649 143225 48731 -192272 -80349
10789 -399337 -255120 70999 10339 -155186 -73417 57661 174699 63886 -161559 312123
10778 138515 -39591 -152783 -204000 -140061 -144169 -88227 -99855 78820 -36515 -421184 -290050
10767 -290050 -29647 -110177 201932 -185385 -49809 -45987 -22380 -92120 160245 47046 174149
10756A74149c20426E7596K21389e6867B52938a04750A95872H9553K61497A8263
10745D04014a84437F5164P228b05772C47347a9316j66448r2631n1690B19001e3038
10733i8464C40562H1991d36495f9100q8885N3753k90263h1641g984k17620a07603
10721F7027e8503l4934A9509b12354m9409q3776b5793n9007o2181A07311E0698
10709C522a15787B78316a73477A1939L5753b11136l7542a18739M5511k02752J00277
10698a75703j11446A03919D6309c70527a48072N3384D7750f4706B72300E2149
10687C6600K16902A0959a14134j36924f3633A2843c16658Q9106A8783f3518A60535
10675I3569I081J36447a73390K3347J9745c7197A42359k4042G887b46339B8438
$$ plain form
10756 174149 -320426 57596 278985 -56867 252938 -104750 195872 89553 351050 18263
10745 404014 -184437 65164 72392 -205772 347347 -19316 -185764 -278395 -330085 219001 -53038
10733 -98464 340562 81991 -436495 -69100 -157985 -104232 -394495 -81641 -7984 -225604 -107603
10721 67027 -58503 -93437 19509 -212354 -261763 -345539 -25793 -84800 -146981 107311 50698
10709 3522 -115787 278316 -173477 11939 47692 -211136 -248678 -118739 -73228 -275980 -175703
10698 -175703 -287149 103919 46309 -370527 -148072 -94688 47750 -64706 272300 52149
10687 36600 253502 10959 -114134 -251058 -63633 12843 -316658 -227552 18783 -63518 160535
10675 93569 9081 145528 -173390 -150043 -130298 -37197 142359 118317 7887 -246339 28438
10663D5393C07J7104L86955h7582k91653A65365a91206F9100d14449C09721F024
10651d4383j12715G9809e4791B6778h4978I4430b98870n0427d3616Q015j66748
10640b02349Q0810m3108o5568b4754m98332D4544b20748R7870n43093a53586o3425
10629b17011a9432C75669h0080c5076A47045a22700F3559g7048j14316N7290j27141
10618b61215a7583o7486c6354k94580a8400k21653M2983M6310l42961a50231B3908
10606a90992F8166h0506L6917j1488B8933A4368d3096B33505c6728A21036a70074
10594d496A0934c9304A48350O0087c17367K5196C2564a05577B24393C6211d440
10582b07353m2679c6288j89435G7220a35616C4145O8283J64984b48794m4870P7789
$$ plain form
10663 45393 307 17411 404366 -87582 -379235 165365 -191206 69100 -414449 309721 6024
10651 -44383 -157098 79809 -54791 26778 -84978 94430 -298870 -349297 -43616 -35601 -202349
10640 -202349 -121539 -164647 -230215 -24754 -523086 44544 -220748 -122878 -665971 -153586 -217011
10629 -217011 -19432 375669 -80080 -35076 147045 -122700 63559 -77048 -191364 -134074 -261215
10618 -261215 -17583 -85069 -36354 -330934 -18400 -240053 -197070 -150760 -493721 -150231 23908
10606 -190992 68166 -80506 -43589 -55077 28933 14368 -43096 233505 -36728 121036 -170074
10594 -4496 10934 -39304 148350 208437 -317367 -292171 32564 -105577 224393 36211 -4440
10582 -207353 -250032 -36288 -225723 77220 -135616 34145 102428 267412 -248794 -293664 -215875
10571b15875H6766K45145A7367d2069B29564A02228c9345j61960b1692l9349P86
10560f0255H416P2960F693a97008A60805O1702a91459M9619a6616r9963L3822
10549h2757A70266i8457c5362G720b39090C31952K23971F4188J49621K4022C4591
10537b57862c1820n6871I3336N1190b8532a987I0206a68555e2607p3898j22054
10526b48559A99036g0363l57295a38883f1226J2762J1713q4951I9369e465C2430
10514a01863M3025q9945A39997E9311b04899B98131F3079J4929b27383c8705B98432
10502g6017A47374a46518g2780A096K09885e4324A98156H2812P5562a07534B35977
10490D3351J25175m7315b36877g5509A81629E7121K00905K47490j55294j47065
$$ plain form
10571 -215875 86766 331911 17367 -42069 229564 102228 -39345 -201305 -21692 -61041 -60255
10560 -60255 8416 81376 6693 -197008 160805 222507 -191459 -141840 -16616 -116579 -82757
10549 -82757 170266 -98457 -35362 7720 -239090 331952 555923 64188 213809 237831 34591
10537 -257862 -31820 -88691 93336 144526 -28532 -1987 90206 -168555 -52607 -126505 -248559
10526 -248559 199036 -70363 -427658 -138883 -61226 -48464 -36751 -121702 99369 -5465 32430
10514 -101863 -58838 -148783 139997 59311 -204899 298131 63079 78008 -227383 -38705 298432
10502 -76017 147374 -146518 -72780 1096 210981 -54324 198156 82812 158374 -107534 235977
10490 43351 168526 121211 -236877 -75509 181629 57121 258026 505516 350222 203157
10480B03157J20834L3868K27813B51094I4785j5548L97839A19707b16289M2138
10470a74151B25000l0018c54874B75554I6807j825a9193j57356p032O9214F7437
10458b06952A710e6559o3004A64755G14J83853f2508l13356G364h2816A85310
10446I6463Q2616J7443F6171c121j64833L4612q5478k2315a13056l7178O5456
10435h4778A31488a31477q42k0778B76708b1958B03550h453l55887R2845i4934
10423E6036b11263A02102a29319k87110a06445g370l40607b3576A84693a74846
10412C19045C4285J41747a90276A946K65048d73340C8783b47751H3167b75341
10401A18005K730a83688C9327a20349G36g87D5557J62365J02345a91551H4502
$$ plain form
10480 203157 323991 357859 585672 251094 94785 79237 477076 119707 -216289 -174151
10470 -174151 225000 194982 -354874 275554 96807 94982 -19193 -176549 -183581 -114367 67437
10458 -206952 1710 -56559 -119563 164755 714 184567 -62508 -375864 7364 -82816 185310
10446 96463 179079 196522 66171 -3121 -167954 -133342 -218820 -241135 -113056 -150234 -84778
10435 -84778 131488 -131477 -132319 -153097 276708 -21958 203550 -8453 -364340 -271495 -94934
10423 56036 -211263 102102 -129319 -416429 -106445 -7370 -347977 -23576 184693 -174846
10412 319045 34285 176032 -190276 1946 266994 -473340 38783 -247751 83167 -275341
10401 118005 120735 -183688 39327 -120349 736 -787 45557 207922 310267 -191551 84502
10389A29105J11836d1224A79384o4771N2285p2149J89147e3490k6591p3276H6826
10377B36118D0958K45305A33717K12736R5799A99733J71594b7637A44581K29969
10367C74550M14553k96339J21138j88746A47423L05476j05529j9934H8759L10909
10357C99668A48668J41751n5077M7342a01799B00600O09736j10951j9667k64950
10347D14768K2195A37470L41317K26447l51537J80150B61827K6218J53580A56987
10336g134j29932E85860B27415A03731J2426c1447H6665c15186C44029a79625
10325b78277h6571A46612Q7909E9860G78a0070A99638a87643A21939O3293J21727
10314C06959I1549b0930j48547k89546g6301l6420B89134a97311A09371K75006
$$ plain form
10389 129105 240941 -41224 179384 114613 166898 94749 283896 -53490 -80081 -153357 86826
10377 236118 40958 286263 133717 346453 442252 199733 371327 -27637 144581 374550
10367 374550 789103 492764 613902 425156 147423 452899 347370 327436 88759 399668
10357 399668 148668 290419 235342 282684 -101799 200600 810336 699385 679718 414768
10347 414768 436963 137470 478787 705234 353697 533847 261827 288045 441625 156987
10336 -7134 -137066 585860 227415 103731 116157 -31447 86665 -315186 344029 -179625
10325 -278277 -86571 146612 234521 59860 778 -10070 199638 -187643 121939 185232 306959
10314 306959 91549 -20930 -169477 -459023 -76301 -112721 289134 -197311 109371 384377
10304C84377o9317i6108D0481a19822B57291J30473D5272J98117j06160C1969
10293A94346d48958A9182J48784J32216a84449C616a65059j63806J60450d9484
10282b02349E8426a54103K1447N92G8376M958O7286a49699G2664L20137I560b17215
10269E0718a13750N810o3631K4064a4781B45882j14152l2693d7361A69382K11824
10258C81206l0523J86305k57094E8540N068e4781L775j3179K7988B10986b62j25534
10246a25796B24637i2629B35743b31780e1216p1774k2533C082i2702j91669Q5666
10235a98705B46645g7866b8974A11758k4856c92634A28607i3115q7632A68090
10224B95688b83100e8858B28198a33108j40243a3922D0936a38656e673A39798
$$ plain form
10304 384377 315060 -96108 40481 -119822 257291 387764 45272 243389 137229 31969
10293 194346 -448958 19182 167966 300182 -184449 3616 -165059 -328865 -168415 -49484
10282 -202349 58426 -154103 -132656 -132064 78376 83334 150620 -149699 72664 392801 9560 -217215
10269 50718 -113750 -107940 -171571 -147507 -14781 245882 131730 99037 -47361 169382 381206
10258 381206 350683 536988 279894 58540 63608 -54781 -51006 -64185 -36197 210986 -262 -125796
10246 -125796 224637 -92629 235743 -231780 -51216 -122990 -145523 3082 -92702 -284371 -198705
10235 -198705 246645 -77866 -28974 111758 86902 -392634 128607 -93115 -180747 168090
10224 295688 -283100 -58858 228198 -133108 -273351 -13922 40936 -138656 -5673 139798
10213a14350C56950j41987b00406i4991j92352A2102a17926H3429a02185l39177
10203d41362a3762k83154a30184j8903A02999B5795h0870k0218F3304J63134b79534
10191A10544c4419B85329a14417F5321a61148G5881a99914C09268A23717a46403
10180b00508D60839a82081q2547K7950R4718B29934b11063n169F2417P6791Q4360
10169B23568F9615e3485n0778E0523J1061A6967J1650a71921G5885H596Q300d4483
10156a37906L7692d3774j54207L3281A01342J0501D1215j1688g796A19678a62084
10144A26232k2486g7431G217J28404a84743f2757p9066K2611C62490b5323k51996
10133b77319a25781k46735C5434q405e5788n5847c2578j07779L9761A80561b58574
$$ plain form
10213 -114350 356950 214963 -200406 -94991 -287343 12102 -117926 83429 -102185 -441362
10203 -441362 -13762 -296916 -130184 -149087 102999 25795 -80870 -101088 63304 226438 -279534
10191 110544 -34419 285329 -114417 65321 -161148 75881 -199914 309268 123717 -146403
10180 -200508 460839 -182081 -264628 -236678 -141960 229934 -211063 -216232 62417 139208 223568
10169 223568 69615 -53485 -104263 50523 61584 16967 28617 -171921 75885 8596 16896 -44483
10156 -137906 -100214 -43774 -197981 -164700 101342 111843 41215 29527 -7796 119678 -162084
10144 126232 103746 -77431 7217 135621 -184743 -62757 -141823 -119212 362490 -25323 -277319
10133 -277319 -125781 -372516 35434 27029 -55788 -111635 -32578 -140357 -100596 180561 -258574
10121a80547I7976a12046D0984c67250f8886K7970p2393b4499k80359A04937a26735
10109D0681K715h9021j36761C2559h3166k7674c479F471L21346a6528j21124L6692
10097a00960j97161P3739k31789A60598J71050b37519A12681m0590J19694a28827
10086b80051M834G9597b70648H2072e0814F9254A4083N3553j7026a54745M8738
10075a06007p1336h1085A7457i878p2025R204l1854A7143f8316G8823C5271a47039
10062I3041C0302P2575k7336A6447K15878I0484e1744l6006I3975a15622C1149
10050e702j86011j0262R8216p4494f7230I1483b67828i4994K5027L2778q1905
10039a19094j76366e4076m317j05634N9473j39434F1550B5010b8036r6580M0067
$$ plain form
10121 -180547 97976 -112046 40984 -367250 -68886 -40916 -113309 -24499 -304858 104937 -126735
10109 40681 43396 -89021 -225782 32559 -83166 -110840 -3479 6471 327817 -16528 -137652 -100960
10097 -100960 -298121 -224382 -456171 160598 331648 -237519 112681 72091 191785 -128827
10086 -280051 -275217 79597 -270648 82072 -50814 69254 14083 67636 50610 -154745 -106007
10075 -106007 -177343 -81085 17457 -9878 -81903 -72699 -104553 17143 -68316 78823 35271 -147039
10062 93041 30302 102877 75541 16447 232325 90484 -51744 -87750 93975 -115622 31149
10050 -5702 -191713 -201975 -103759 -178253 -67230 91483 -267828 -94994 -69967 -37189 -119094
10039 -119094 -295460 -54076 -58393 -164027 -104554 -243988 61550 25010 -28036 -124616 -84549
10028h4549j95361C5928C270a11128I650g137A67688K7379b07744g2432c3968
10016a8968j56667O0357A96442o0520l5489b36566a07030C3404a07406j45403
10006b52809J26252A24424b24723N5705A18258J49279b386A07022b93603I6172
9995c20819Q9919a05170q2197r9728A72188o2479a47658J7205j93390B43735f3050
9983g2159C9913c299C02421C5489g5944b664m21456a61283n7624A52714f0718
9971a81318h1080k50383o1833C0066b40185A55023a71499h0395J0081o7533A54167
9959a71937B9946d5612l3220o5665f2128r8617A5753h4580A47659a46897k7315
9948a74212j30647J47781B2218h7945K2686b4941j62075C9356a91109f647r6955
$$ plain form
10028 -84549 -279910 35928 3270 -111128 9650 -7137 167688 195067 -207744 -72432 -33968
10016 -18968 -175635 -115278 196442 135922 100433 -236566 -107030 33404 -107406 -252809
10006 -252809 -126557 124424 -224723 -169018 118258 267537 -2386 107022 -293603 96172
9995 -320819 -230900 -105170 -187367 -287095 172188 109709 -147658 -130453 -323843 243735 -63050
9983 -72159 39913 -3299 302421 35489 -75944 -2664 -424120 -161283 -218907 152714 -60718
9971 -181318 -81080 -331463 -393296 30066 -240185 155023 -171499 -80395 -70314 -137847 154167
9959 -171937 29946 -45612 -78832 -144497 -62128 -160745 15753 -84580 147659 -146897 -174212
9948 -174212 -304859 -157078 22218 -87945 -65259 -24941 -187016 39356 -191109 -6647 -103602
9937a03602j53276h091C9394H168g9195F3879h423F2903J83788a87934d3359P510
9925c5849n5606l3641o3190A10613k7541J07068b8074C408M3790a63281C2798
9913I5560b08945d2671m9348o6385O608k26484A0821O8726e9806g738p9735E6516
9900b62945M9080f0792k60140i4958k91500J92920A83908g6735A23134b8877j1229
9889d0106A51355g2165A86126a93621J7745n5071F181M04K1585b4317j18755A41930
9876B50905b52682L8666G8011b39457B79980a93090L302H6493a3334r7905L8155
9865g3084D5978j2148J3838b24169k6169a11635B68561a5846A54388a17632p5701
9854a93333b8364m49890D6667N7758b8856j75213C7880R4050K1333J70314d6074
$$ plain form
9937 -103602 -256878 -8091 39394 8168 -79195 63879 -8423 62903 246691 -187934 -43359 -35849
9925 -35849 -91455 -125096 -188286 110613 83072 190140 -28074 3408 47198 -163281 32798
9913 95560 -208945 -42671 -92019 -158404 -151796 -378280 10821 79547 -59806 -7738 -87473 56516
9900 -262945 -213865 -60792 -320932 -94958 -386458 -193538 183908 -76735 123134 -28877 -40106
9889 -40106 151355 -72165 186126 -193621 -175876 -230947 6181 6585 28170 -24317 -143072 141930
9876 250905 -252682 -214016 78011 -239457 279980 -193090 -189788 86493 -13334 -111239 -73084
9865 -73084 45978 33830 47668 -224169 -250338 -111635 268561 -15846 154388 -117632 -193333
9854 -193333 -28364 -478254 46667 104425 -28856 -204069 37880 131930 153263 323577 -46074
9842i4332a4638A5598e933A79917b2072C417g9536A41144D3274c64999P923Q2108
9830b74968L5286A37928a72279f533j16207A65524f7213j35265j08647o5719F8920
9818B042K5538b71B6222a87207I1908B5434c53360B47164g7988m2955c0398B26592
9805b54660B4414a62458B23205E4371f8364A91471o5863a11108b7379B2021P9682
9794A01703b96589J14715K0614r8169A04884j251f1018A46396J3344b8883k28960
9783b57843e6640j60953O5352B4810b14482F114d4143H6620a06917k1252j5471
9772a43640q2920i9619B21997o6190p7011a09828B16489e29k97614J34814A43174
9760a5065A20917a52572g0411B706c0806B93255a06577n5884c4307j42175I2651
$$ plain form
9842 -94332 -14638 15598 -5933 179917 -22072 3417 -79536 141144 43274 -364999 -357076 -274968
9830 -274968 -239682 137928 -172279 -6533 -122740 165524 -67213 -202478 -311125 -376844 68920
9818 2042 27580 -271 26222 -187207 91908 25434 -353360 247164 -77988 -120943 -30398 226592
9805 -254660 24414 -162458 223205 54371 -68364 191471 125608 -111108 -27379 22021 101703
9794 101703 -296589 -181874 -161260 -259429 104884 103633 -61018 146396 159740 -28883 -257843
9783 -257843 -56640 -217593 -152241 24810 -214482 6114 -44143 86620 -106917 -128169 -143640
9772 -143640 -226560 -99619 221997 155807 78796 -109828 216489 -529 -298143 -163329 143174
9760 -15065 120917 -152572 -70411 2706 -30806 293255 -106577 -162461 -34307 -176482 92651
9748b97713J24715b9782l54460a69543o1080a6875A33152b03496B5799d51636
9737f34679a86513r4669d8842j53985O448e0508M256B756g6445A55342R4830D4171
9724B7742c62489A65217a7214p7662N085F2745c80517A12360b04598a01910M3043
9713e8867j95130F6091a12k02705j82580e4479k79004H5570M8936b36863P4915
9702a61948j22665M9575c1214O162q6798A75294B6416a78135L9750b9425B7372
9690G8774J48223b93080A68553m2815K2672o0170g7015k00601G2424g2999j16401
9679a89400r6200a13249A83206g579G8648Q6655k1897g7050C75937a54182j03220
9668b57402A32276J93822c28248A28528a21852A2490b07787M536c2178j31058
$$ plain form
9748 -297713 -172998 -29782 -384242 -169543 -230623 -16875 133152 -203496 25799 -451636
9737 -634679 -186513 -281182 -48842 -202827 -196379 -50508 -46252 2756 -76445 155342 250172 44171
9724 27742 -362489 165217 -17214 -94876 -89791 62745 -380517 112360 -204598 -101910 -58867
9713 -58867 -253997 66091 -112 -202817 -385397 -54479 -333483 85570 134506 -236863 -161948
9702 -161948 -284613 -235038 -31214 -25052 -111850 175294 26416 -178135 -138385 -29425 27372
9690 78774 226997 -293080 168553 125738 148410 88240 -77015 -277616 72424 -72999 -189400
9679 -189400 -285600 -113249 183206 -7579 78648 165303 143406 -77050 375937 -154182 -257402
9668 -257402 132276 326098 -328248 128528 -121852 12490 -207787 -203251 -32178 -163236
9658a63236A18285f1621H8904a29458b3045j72474a9916j65103k8810Q5778r535
9647a37586N627A82604b1954B51563c6768d876r5740A986J92032a41856O2128
9636g9728k05293A4182K1105C598d49141J89465i1735M2611k9749j39667O0102
9625a58438F7929L36832b66644C0548d7061k63699k5934J0070J17367A55293L9013
9614A94306d553j73279j24459c6788j39313F0641a00671K9420B17112b27579a07984
9602e858l90063B6193c30560a17280a6696k2600H7674i8446B05232d32462A89710
9590A70496f3093G7606b04946o2962L7429A85093O702d0806l3257k3791F8989
9578e0870l9245A18161a44443A83282M9098A07792m0609Q0560b23835J04686d1398
$$ plain form
9658 -163236 118285 -61621 88904 -129458 -23045 -195519 -19916 -185019 -213829 -128051 -137586
9647 -137586 -131959 182604 -21954 251563 -36768 -4876 -100616 1986 194018 -141856 -79728
9636 -79728 -285021 14182 35287 3598 -449141 -259676 -91735 -49124 -78873 -218540 -158438
9625 -158438 67929 404761 -266644 30548 -47061 -310760 -336694 -326624 -209257 155293 194306
9614 194306 -4553 -177832 -302291 -36788 -176101 60641 -100671 -71251 217112 -227579 -107984
9602 -5858 -395921 26193 -330560 -117280 -16696 -39296 87674 -98446 205232 -432462 189710
9590 170496 -63093 77606 -204946 -267908 -230479 185093 191795 -40806 -74063 -97854 68989
9578 -50870 -90115 118161 -144443 183282 232380 107792 67183 147743 -223835 -119149 -41398
9566a44257c1079D1272a22653C543e504j17658n3240a6005C9311a51043O1242
9555h9801A19874g4013n8152b7894A678d0892C5918d4023l55165a24111j00055
9544b24166B32617a99256B35794r5423b36692D39a55096f4316A84672J14125b94812
9532A66979b76642p5366A34898b05539a9991A01897C9668J26126A9710J8457c27506
9520a75323k00904a83836f224m03756b2460I7831a40586L0598d9556B10916K16829
9509D27745b4294j03570G7504h0465j25860A75823B4228c62856d9427j73623B43776
9497c64037J54370e1973A19915a50729H5822C0846h5983B49449a06085k94987
9487d01072P5082a131r515C810J01878d9023j46444f9657j83548D8334K0854a17995
$$ plain form
9566 -144257 -31079 41272 -122653 3543 -5504 -123162 -176402 -16005 39311 -151043 -89801
9555 -89801 119874 -74013 -132165 -27894 1678 -40892 35918 -44023 -399188 -124111 -224166
9544 -224166 232617 -199256 235794 140371 -236692 439 -155096 -64316 184672 298797 -294812
9532 166979 -276642 -352008 134898 -205539 -19991 101897 39668 165794 19710 38167 -327506
9520 -175323 -376227 -183836 -6224 -409980 -22460 97831 -140586 -109988 -49556 210916 427745
9509 427745 -24294 -127864 77504 -80465 -206325 175823 24228 -362856 -49427 -223050 243776
9497 -364037 -209667 -51973 119915 -150729 85822 30846 -85983 249449 -106085 -401072
9487 -401072 -325990 -1131 -10646 3810 105688 -49023 -195467 -69657 -253205 48334 69188 -117995
9474A63727a24929A27161b06465C2563a3114j4706c123q4717c7514A3197a24232
9462a38781N2675A63683M8348a67464L2079j12731c1122B7273a08093j05257B17998
9450a99781E2143b4534j60060O365A54099N7850G7788b03528c2944l87473A38565
9438d86816K03753B14410f1173k54822j53374f9638C6153j3894J69838f4584B5653
9426B751a19437l71448A34028C1156c25129g2820A29013b75122I7390Q0338g397
9414h970k41987k232E7907J63497E7589a13982A43839c9133a9048F3342a1526
9402A7828O2161i6111j24913j44328J74705c7130k16150P2014D9989a80389a9345
9390C0267b03356q7041h2293l2282C7387K2859k7123b74626f1245j99076I0953
$$ plain form
9474 163727 -124929 127161 -206465 32563 -13114 -27820 -3123 -87840 -37514 13197 -124232
9462 -138781 -86106 163683 212031 -167464 -135385 -248116 -31122 27273 -108093 -213350 217998
9450 -199781 52143 -24534 -184594 -178229 154099 211949 77788 -203528 -32944 -420417 138565
9438 -486816 -283063 214410 -61173 -315995 -469369 -69638 36153 22259 192097 -64584 25653
9426 2751 -119437 -490885 134028 31156 -325129 -72820 129013 -275122 97390 177728 -7397
9414 -8970 -250957 -253189 57907 221404 57589 -113982 143839 -39133 -19048 63342 -11526
9402 17828 79989 -96111 -221024 -365352 -190647 -37130 -253280 -181266 49989 -180389 -19345
9390 30267 -203356 -290397 -82293 -114575 37387 60246 33123 -274626 -61245 -260321 90953
9378a23704b6882j37757p3908j12461q5540H763c48763J01042A0789e3108A2833
9366a26567f2582l01563e7928E532i3745a0507G511N4249E337L5779d20678J65449
9354b55229c5327A35634c97886F9239k4860d2865F7383J47346a24754j43961j9593
9343b88308d3744n2257A31134J418d8533B08131C0791d7294b1148r3484j56386
9332b71018b5684J0767F3636O3329a45454j45215c5380j65290C73013b16057i5438
9320a61102B10264I8207d41475A78567b00799I0043a98967Q6895H9016a63857
9309A76381g6455E9007c68247A3187a76196a5549l08870a21881r431J7845E873
9297A47667c74771H5291l0437J40273a10506m3982A21355i2936k32665i1947j14149
$$ plain form
9378 -123704 -26882 -164639 -238547 -351008 -436548 8763 -348763 -247721 10789 -53108 12833
9366 -126567 -62582 -364145 -57928 5532 -93745 -10507 7511 61760 5337 41116 -420678 -255229
9354 -255229 -35327 135634 -397886 69239 44379 -42865 67383 214729 -124754 -268715 -288308
9343 -288308 -43744 -96001 131134 132552 -48533 208131 30791 -47294 -21148 -114632 -271018
9332 -271018 -25684 -14917 63636 126965 -145454 -290669 -35380 -200670 373013 -216057 -95438
9320 -161102 210264 98207 -441475 178567 -200799 90043 -198967 -112072 89016 -163857
9309 176381 -76455 59007 -368247 13187 -176196 -15549 -324419 -121881 -131312 -113467 5873
9297 147667 -374771 85291 54854 195127 -110506 -154488 121355 -92936 -325601 -91947 -206096
9286b06096j338k5345i2614j22189J04218n1875L1695G1252c3612p0326c9798
9274a25898k24162a44925A43655J41824A3b4104j12072F7643J45257a10234d0131
9262d2619n4697J0037r6203m7365B79110P2520E0558Q130h6535p4680n7588B60122
9249C2509K310f915j85707j2656A2881J39875a11450A62676h5311B84996c3040
9237c84759I0835C9724b75980L9486R6174l8883N9779B2974a53596e0786a1044
9225A69859c34738a16014E7799a0144m9739I4000c43166P7224d9542o2835E1255
9213a92163F7290J85560B3873a80731P0414F626e3487G117P9244c35724a17439
9201b72028B27463a71176k7439m1809C20229a15313H4297b9476A22888K1781b41704
$$ plain form
9286 -206096 -207434 -232779 -92614 -214803 -110585 -162460 -130765 71252 -33612 -103938 -39798
9274 -125898 -350060 -144925 143655 285479 13 -24104 -136176 67643 212900 -110234 -40131
9262 -42619 -97316 -87279 -183482 -230847 279110 351630 50558 58688 -86535 -161215 -218803 260122
9249 32509 34819 -6915 -192622 -205278 12881 152756 -111450 162676 -85311 284996 -33040
9237 -384759 90835 39724 -275980 -236494 -140320 -179203 -119424 22974 -153596 -50786 -11044
9225 169859 -334738 -116014 57799 -10144 -59883 94000 -343166 -265942 -49542 -112377 51255
9213 -192163 67290 252850 23873 -180731 -110317 6626 -53487 7117 86361 -335724 -117439
9201 -272028 227463 -171176 -198615 -240424 320229 -115313 84297 -29476 122888 144669 -241704
9189B43388r0988h745k55218L9033a4949k29197f1145e303r9167q5840F8524b40234
9176D5885b05164A3266N0733g0389A88290e1761A19656a13535n3346n7043R3496
9165a30428C3931a51217B04672a18605K4212G9890a05453A21645c06790D0582
9154A47208c8386B2861E382c4930F8797L0313b35525a06479J1050G9884b15767
9142A98678k2221a88735a8087A01939i6435A63017b19973q4298a35834A66197
9131b69488d097m9110D3286b21439k833A8585a23877c1992R642n7456j46393f6993
9118e42171E6276J408e4253A31401a5601j27325f3173k31426g9216E0115a56088
9106b29046A06488A5039g066F8093c8043A71860L6069L4949l6666a1309E2415
$$ plain form
9189 243388 152400 -8745 -263963 -224930 -14949 -244146 -61145 -5303 -104470 -190310 68524 -240234
9176 45885 -205164 13266 63999 -70389 188290 -51761 119656 -113535 -166881 -223924 -130428
9165 -130428 33931 -151217 204672 -118605 -94393 79890 -105453 121645 -306790 40582
9154 147208 -38386 22861 5382 -34930 68797 99110 -235525 -106479 -95429 79884 -215767
9142 198678 176457 -188735 -18087 101939 -96435 163017 -219973 -304271 -135834 166197
9131 -269488 -4097 -53207 43286 -221439 -224272 18585 -123877 -31992 -22350 -79806 -226199 -66993
9118 -542171 56276 57684 -54253 131401 -15601 -142926 -63173 -294599 -79216 50115 -156088
9106 -229046 106488 15039 -7066 68093 -38043 171860 207929 242878 206212 -11309 52415
9094a39206C9290e5579o9027A39433d2566D8171a86753g2724k6514p6669A37498
9082c7672h707j39394K2868K3744C0914J98078E8858J37912G0540a84365l6829
9071b21194B98365c03219a03925A34257a5143r0391K6310a5640A90596b41920
9060E4550c9725o7525A63409a95148A07427c53032G2543J33312b23585D205g7093
9048A52505f1759o8909F5349a13687d2648B92790A04905g7186n4937B41372d60955
9036b93641L176R2160f2620i056j72333A16068b59220H8190R2811i9415q4148
9025a83563d3356j24241E762b15452A3986b80902j1115J01516k0262e1686k54471
9014c06157C02301j20888a05977M3068J7450l56904a17152q1960b1141B2235a03053
$$ plain form
9094 -139206 39290 -55579 -124606 139433 -42566 48171 -186753 -72724 -99238 -175907 137498
9082 -37672 -8707 -148101 -125233 -101489 30914 228992 58858 196770 70540 -184365 -221194
9071 -221194 298365 -303219 -103925 134257 -15143 -105534 -79224 -15640 190596 -241920
9060 54550 -39725 -107250 163409 -195148 107427 -353032 72543 205855 -223585 4205 -77093
9048 152505 -61759 -130668 65349 -113687 -42648 292790 104905 -77186 -132123 241372 -460955
9036 -293641 -290465 -198305 -62620 -9056 -181389 116068 -259220 88190 181001 -99415 -183563
9025 -183563 -43356 -167597 5762 -215452 13986 -280902 -292017 -190501 -210763 -51686 -306157
9014 -306157 302301 181413 -105977 -62909 -45459 -402363 -117152 -199112 -21141 22235 -103053
9002A60942E4200b0678k40861h9557K6869B83304b05161i8775j161M185A86313
8990a06607A44146a15800M8237c0022j199B7314L11818b57748A89341b16973r506
8979b26479F9294J02952a91967F5365d00256a6608m13068H0962a73671E0614b97145
8967c69015a6507C14571a47302L3641n5036A55224D186b3446l38903f9481A6734
8955a02083M8472k18115A12582c53548C44688o3383b05285j67191D4002h8849
8944a03659B4461b24102P1497j38434A7572A163J62943J30059N2391h2956C41210
8932A43126o6597c46019J32770A06248N197b26546B1482J54855J37542J126186
8922A440065M158649M194315B471169A038127C99390A92254j1829a41426e2090
$$ plain form
9002 160942 54200 -20678 -261539 -89557 -62688 283304 -205161 -98775 -99936 -95751 186313
8990 -106607 144146 -115800 -67563 -30022 -31221 27314 339132 -257748 189341 -216973 -226479
8979 -226479 69294 172246 -191967 65365 -400256 -16608 -429676 80962 -173671 50614 -297145
8967 -369015 -16507 314571 -147302 -113661 -168697 155224 4186 -23446 -362349 -69481 16734
8955 -102083 -53611 -271726 112582 -353548 344688 281305 -205285 -372476 44002 -88849
8944 -103659 24461 -224102 -152605 -291039 17572 1163 164106 294165 346556 -82956 341210
8932 143126 76529 -346019 -213249 106248 111445 -226546 21482 176337 313879 1440065
8922 1440065 5598714 9793029 2471169 1038127 399390 192254 180425 -141426 -52090
8912B01932b86749e4771A01651b24069A59890K60268j34880K17803I9050k639
8902I6411B9139J83069g8429j53794L8459A70750m7865e052k11897j8860i1130
8890d13822I4175A2738J17447D2920d35193c7860k06561c6250A01599J40396a20781
8878d192A61729b1780k06242o0711A60619j236c47568I0218b03111i8159a6846
8866D4460O0579D6138K657b2905j16097c7140A99601i8236B31610j00921b50700
8854a01818B41934b6668B58656a93098A61132b60252J27939r6338d9277G087J37574
$$ plain form
8912 201932 -286749 -54771 101651 -224069 159890 420158 285278 503081 99050 96411
8902 96411 29139 212208 -78429 -232223 -193764 170750 122885 -5052 -216949 -235809 -91130
8890 -413822 94175 12738 130185 42920 -435193 -37860 -244421 -36250 101599 241995 -120781
8878 -4192 161729 -21780 -228022 -288733 160619 159383 -347568 90218 -203111 -98159 -16846
8866 44460 105039 46138 48795 -22905 -139002 -37140 199601 -98236 231610 130689 -250700
8854 -101818 241934 -26668 258656 -193098 161132 -260252 -132313 -228651 -49277 7087 144661
$$ [...]
##END NTUPLES=NMR SPECTRUM
##END=
