
##TITLE=AC1415_BRAA12224_7652885_dGozNmR9BP
##JCAMPDX= 6.0         $$ Bruker NMR JCAMP-DX V2.0
##DATA TYPE= NMR SPECTRUM
##DATA CLASS= NTUPLES
##ORIGIN= BRUKER
##OWNER= Administrator
$$ 1.72 TOPSPIN		Version 2.1
$$ 2013-03-20 03:42:40.645 -0500  Administrator@X
$$ Compression mode = diff/dup
##.OBSERVE FREQUENCY= 400.02188249412
##.OBSERVE NUCLEUS= ^1H
##.ACQUISITION MODE= SIMULTANEOUS (DQD)
##.ACQUISITION SCHEME= undefined
##.AVERAGES= 64
##.DIGITISER RES= 22
##SPECTROMETER/DATA SYSTEM= spect
##.PULSE SEQUENCE= noesygpps1d.comp
##.SOLVENT NAME= COFFEE_meoh
##.SHIFT REFERENCE= INTERNAL, COFFEE_meoh, 1, 14.961
##AUDIT TRAIL= $$ (NUMBER, WHEN, WHO, WHERE, PROCESS, VERSION, WHAT)
$$ ##TITLE= Audit trail, TOPSPIN		Version 2.1
$$ ##JCAMPDX= 5.01
$$ ##ORIGIN= Bruker BioSpin GmbH
$$ ##OWNER= Administrator
$$ $$ E:\/data/COFFEE/nmr/AC1415_BRAA12224_7652885_dGozNmR9BP/12/pdata/1/auditp.txt
$$ ##AUDIT TRAIL=  $$ (NUMBER, WHEN, WHO, WHERE, PROCESS, VERSION, WHAT)
(   1,<2013-03-20 03:42:34.708 -0500>,<Administrator>,<X>,<go>,<TOPSPIN 2.1>,
      <created by zg
	started at 2013-03-20 03:31:04.753 -0500,
	POWCHK enabled, PULCHK disabled,
       configuration hash MD5:
       86 BA 57 50 F2 9D 5C 9B 26 00 A9 28 5F 66 2E 89
       data hash MD5: 64K
       38 29 5B 78 70 A8 3E C0 FC 74 38 C4 0B 89 D6 D2>)
(   2,<2013-03-20 03:42:37.833 -0500>,<Administrator>,<X>,<proc1d>,<TOPSPIN 2.1>,
      <Start of raw data processing
       efp LB = 0.3 FT_mod = 6 PKNL = 1 PHC0 = 0 PHC1 = 0 SI = 128K 
       data hash MD5: 128K
       EA 9A AF 41 7A 63 B7 EF 9B E9 84 FA 32 73 B8 1F>)
(   3,<2013-03-20 03:42:38.895 -0500>,<Administrator>,<X>,<proc1d>,<TOPSPIN 2.1>,
      <pk PHC0 = -78.75549 PHC1 = 0 
       data hash MD5: 128K
       F0 30 D2 FF 39 8B 02 BE 54 D3 A6 DA 91 07 A6 DA>)
(   4,<2013-03-20 03:42:39.583 -0500>,<Administrator>,<X>,<proc1d>,<TOPSPIN 2.1>,
      <abs ABSG = 1 
       data hash MD5: 128K
       F4 95 02 0E 8A E4 50 61 22 54 09 F1 08 33 F5 B7>)
(   5,<2013-03-20 03:42:39.770 -0500>,<Administrator>,<X>,<proc1d>,<TOPSPIN 2.1>,
      <abs ABSG = 2 
       data hash MD5: 128K
       7E 42 11 47 99 0F 10 26 43 40 AC 61 01 15 51 62>)
(   6,<2013-03-20 03:42:39.958 -0500>,<Administrator>,<X>,<proc1d>,<TOPSPIN 2.1>,
      <abs ABSG = 3 
       data hash MD5: 128K
       84 4B B8 C9 38 02 CF 67 1F 2C 88 65 70 0A E4 B0>)
(   7,<2013-03-20 03:42:40.114 -0500>,<Administrator>,<X>,<proc1d>,<TOPSPIN 2.1>,
      <abs ABSG = 4 
       data hash MD5: 128K
       FB 5F 9A F1 C3 DD 56 B9 6E 20 1B F5 43 52 F3 6A>)
(   8,<2013-03-20 03:42:40.302 -0500>,<Administrator>,<X>,<proc1d>,<TOPSPIN 2.1>,
      <abs ABSG = 5 
       data hash MD5: 128K
       29 1A 03 94 5D 91 DC C6 2C 98 04 01 E7 91 A0 C4>)
$$ ##END=
$$ 
$$ $$ hash MD5
$$ $$ 23 15 84 23 48 48 30 68 48 64 EF AA 1A 1A 8A 85
##$RELAX= 
##$RELAX= 
##$RELAX= 
##$RELAX= 
##$RELAX= 
##$RELAX= 
##$RELAX= 
##$RELAX= 
$$ Bruker specific parameters
$$ --------------------------
##$DU= <E:\>
##$EXPNO= 12
$$ [...]
150 150 150 150 150 150 150 150
##$TP07= 0
##$TPNAME0= <>
##$TPNAME1= <>
##$TPNAME2= <>
##$TPNAME3= <>
##$TPNAME4= <>
##$TPNAME5= <>
##$TPNAME6= <>
##$TPNAME7= <>
##$TPOAL= (0..7)
0.5 0.5 0.5 0.5 0.5 0.5 0.5 0.5
##$TPOFFS= (0..7)
0 0 0 0 0 0 0 0
##$TUNHIN= 0
##$TUNHOUT= 0
##$TUNXOUT= 0
##$USERA1= <user>
##$USERA2= <user>
##$USERA3= <user>
##$USERA4= <user>
##$USERA5= <user>
##$V9= 5
##$VALIST= <valist>
##$VCLIST= <CCCCCCCCCCCCCCC>
##$VD= 0
##$VDLIST= <DDDDDDDDDDDDDDD>
##$VPLIST= <PPPPPPPPPPPPPPP>
##$VTLIST= <TTTTTTTTTTTTTTT>
##$WBST= 2048
##$WBSW= 25
##$XGAIN= (0..3)
0 0 0 0
##$XL= 0
##$YL= 0
##$YMAX_a= 6416142
##$YMIN_a= -13236592
##$ZGOPTNS= <>
##$ZL1= 120
##$ZL2= 120
##$ZL3= 120
##$ZL4= 120
##$ABSF1= 14.961
##$ABSF2= -5.597181
##$ABSG= 5
##$ABSL= 3
##$ALPHA= 0
##$AQORDER= 0
##$ASSFAC= 0
##$ASSFACI= 0
##$ASSFACX= 0
##$ASSWID= 0
##$AUNMP= <proc_prof1d_extract.lims>
##$AXLEFT= 0
##$AXNAME= <>
##$AXNUC= <1H>
##$AXRIGHT= 0
##$AXTYPE= 0
##$AXUNIT= <>
##$AZFE= 0.1
##$AZFW= 0.1
##$BCFW= 0
##$BC_mod= 0
##$BYTORDP= 0
##$COROFFS= 0
##$CY= 15
##$DATMOD= 1
##$DC= 0
##$DFILT= <>
##$DTYPP= 0
##$F1P= 0
##$F2P= 0
##$FCOR= 0.5
##$FTSIZE= 131072
##$FT_mod= 6
##$GAMMA= 0
##$GB= 0
##$INTBC= 1
##$INTSCL= 1
##$ISEN= 128
##$LB= 0.3
##$LEV0= 0
##$LPBIN= 0
##$MAXI= 10000
##$MC2= 0
##$MEAN= 0
##$ME_mod= 0
##$MI= 0
##$NCOEF= 0
##$NC_proc= -2
##$NLEV= 6
##$NOISF1= 0
##$NOISF2= 0
##$NSP= 0
##$NTH_PI= 0
##$NZP= 0
##$OFFSET= 14.961
##$PC= 1
##$PHC0= -78.75549
##$PHC1= 0
##$PH_mod= 1
##$PKNL= yes
##$PPARMOD= 0
##$PPDIAG= 0
##$PPIPTYP= 0
##$PPMPNUM= 2147483647
##$PPRESOL= 1
##$PSCAL= 4
##$PSIGN= 0
##$PYNMP= <proc.py>
##$REVERSE= no
##$SF= 400.020009636734
##$SI= 131072
##$SIGF1= 0
##$SIGF2= 0
##$SINO= 400
##$SIOLD= 131072
##$SPECTYP= <>
##$SREGLST= <1H.CDCl3>
##$SSB= 0
##$STSI= 131072
##$STSR= 0
##$SW_p= 8223.68421052631
##$SYMM= 0
##$S_DEV= 0
##$TDeff= 65536
##$TDoff= 0
##$TI= <>
##$TILT= no
##$TM1= 0
##$TM2= 0
##$TOPLEV= 0
##$USERP1= <user>
##$USERP2= <user>
##$USERP3= <user>
##$USERP4= <user>
##$USERP5= <user>
##$WDW= 1
##$XDIM= 131072
##$YMAX_p= 446157647
##$YMIN_p= -11247
##$CURPLOT= <Network HP LaserJet P1505>
##$CURPRIN= <$Network HP LaserJet P1505>
##$DFORMAT= <normdp>
##$LAYOUT= <+/1D_H.xwp>
##$LFORMAT= <normlp>
##$PFORMAT= <normpl>
##$SURQMSG= 1
$$ End of Bruker specific parameters
$$ ---------------------------------
##NTUPLES= NMR SPECTRUM
##VAR_NAME=  FREQUENCY,     SPECTRUM/REAL,   SPECTRUM/IMAG
##SYMBOL=    X,             R,               I
##VAR_TYPE=  INDEPENDENT,   DEPENDENT,       DEPENDENT
##VAR_FORM=  AFFN,          ASDF,            ASDF
##VAR_DIM=   131072,        131072,          131072
##UNITS=     HZ,            ARBITRARY UNITS, ARBITRARY UNITS
##FACTOR=    0.0627417313425164, 1,          1
##FIRST=     8223.62146879497, 2015,         -60633
##LAST=      0,             3974,            -61075
##MIN=       0,             -11247,          0
##MAX=       8223.62146879497, 446157647,    0
$$ Real data points
##PAGE= N=1
##DATA TABLE= (X++(R..R)), XYDATA
$$ [...]
63881F33615m637k001O42L299O313R752J3282J6550J9440K2079K4635K7034K8847
63868G98850K9663K9571K9002K8241K7438K6951K6947K6722K5158K2191J9039
63857A089773J6586J4235J0976O899K805j153n508j0310j4901j8788k2069k4919
63845A043626k7452l0031l2968l5698l7122l7023l6379l6000l5577l4572l3230
63834F67574l1960l0463k8284k5882k4107k2924k1549j9833j8443j7540j6331
63823D10258j4376j2425j1321j0749r845q574p653p363p233o860o305n670m996
63810B96888m617m941n615n554m242k455j360j175j250j095q68r44j427k081k532
63795B56732k567k415k516k907l063k675k179k160k458k399j807j208j031j150
$$ plain form
63881 633615 628978 626977 627619 630918 637231 646983 660265 676815 696255 718334 742969 770003 798850
63868 798850 828513 858084 887086 915327 942765 969716 996663 1023385 1048543 1070734 1089773
63857 1089773 1106359 1120594 1131570 1138469 1141274 1140121 1134613 1124303 1109402 1090614 1068545 1043626
63845 1043626 1016174 986143 953175 917477 880355 843332 806953 770953 735376 700804 667574
63834 667574 635614 605151 576867 550985 526878 503954 482405 462572 444129 426589 410258
63823 410258 395882 383457 372136 361387 351542 342968 335315 327952 320719 313859 307554 301884 296888
63810 296888 292271 287330 281715 276161 271919 269464 268104 266929 265679 264584 263716 262772 261345 259264 256732
63795 256732 254165 251750 249234 246327 243264 240589 238410 236250 233792 231393 229586 228378 227347 226197
63781B26197j315j564j991k391k442j994j121n7P40Q39L83J51P21J663J899R58
63765B20676m20j064o39R0K23k57o79o61n81r45j688k292k349j767p18L54Q84
63748B08167P47N14P81J405J755J598J257J003Q38Q74J360K158K730K831K806
63733B30824K964L075K806K340K176K499K968L097K708K181K189K986L987M444
63719B71244M476M862N815O598O616O138N538M558K994J454N94k0j295l051m131
63704C12390l993l284k601j801r11o90j448k062j243N83J740J576J147J447K038
63689C02888K094J923K461L535L822K636R32J08M27J089J342R69O1j013j534j001
63673C20739J81R79Q58K89J13P02J740K523K493J823J445K077L264L794L034J354
$$ plain form
63781 226197 224882 223318 221327 218936 216494 214500 213379 213322 214062 214901 215284 215435 216156 217819 219718 220676
63765 220676 220256 219192 218553 218643 218866 218609 217930 217269 216688 215743 214055 211763 209414 207647 206929 207283 208167
63748 208167 208914 209428 210209 211614 213369 214967 216224 217227 218065 218939 220299 222457 225187 228018 230824
63733 230824 233788 236863 239669 242009 244185 246684 249652 252749 255457 257638 259827 262813 266800 271244
63719 271244 275720 280582 286397 292995 299611 305749 311287 315845 318839 320293 320887 320867 319572 316521 312390
63704 312390 308397 305113 302512 300711 299800 299110 297662 295600 294357 294940 296680 298256 299403 300850 302888
63689 302888 304982 306905 309366 312901 316723 319359 320291 320399 320826 321915 323257 324226 324287 323274 321740 320739
63673 320739 320920 321899 322757 323046 323159 323861 325601 328124 330617 332440 333885 335962 339226 343020 346054 347408
63657C47408o25k577m131m813m706m565m866n258n257m927m429l570k385j635
63643B93664j833k249j745m57L55J09l36Q9J376K760L758M412M864N129N222N255
63627C20373N331N432N479N558O039P218Q790J0026J0726J1540J3020J4768J6064
63614D40364J7024J8407K0411K2402K3890K5164K6764K8860L1365L4150L6975
63603G25776L9481M1362M2189M1115L7295L0761K2506J3729N385j540o218q742
63591I83099j0134j1165j1607j1069j0107j0031j1812j5473k0279k5148k9094
63580H17180l1688l3014l3129l1893k9463k6507k3630k0904j8287j6032j4231
63569E38402j2360r840o803l819j129J314L265M381M991N993P766R678J0922J1430
$$ plain form
63657 347408 346783 344206 340075 335262 330556 325991 321125 315867 310610 305683 301254 297684 295299 293664
63643 293664 291831 289582 287837 287380 287735 287844 287508 287597 288973 291733 295491 299903 304767 309896 315118 320373
63627 320373 325704 331136 336615 342173 348212 355430 364220 374246 384972 396512 409532 424300 440364
63614 440364 457388 475795 496206 518608 542498 567662 594426 623286 654651 688801 725776
63603 725776 765257 806619 848808 889923 927218 957979 980485 994214 999599 998059 991841 983099
63591 983099 972965 961800 950193 939124 929017 918986 907174 891701 871422 846274 817180
63580 817180 785492 752478 719349 687456 657993 631486 607856 586952 568665 552633 538402
63569 538402 526042 516202 509399 505580 504451 505765 509030 513411 518402 524395 532161 541839 552761 564191
63555E64191J1745J2339J3325J4686J6377J8280K0279K2454K5195K8954L3897
63544G81722L9756M6052N2205N7082N8609N4598M4532L0402J5403J968q783j6252
63532A157294j9992k0228j8089j4900j1497q444o507o576r085j3689j9438k5337
63520I83512l0832l5794m0049m3058m4322m3894m2195l9483l5987l2445k9777
63509E65676k7962k5856k2613j8870j5991j4434j3432j2148j0517q899p499o312
63497C81143n333m511l788l268l148l276l112k334j268n08k86m39p59j007q10
63482C47296L7J148J893K179K575L491M663N546N882N676N040M296L881L714L010
63467D00327J261q43k129k500l074m623o500p447p060n980n019m464m130l655
$$ plain form
63555 564191 575936 588275 601600 616286 632663 650943 671222 693676 718871 747825 781722
63544 781722 821478 867530 919735 976817 1035426 1090024 1134556 1164958 1180361 1182329 1173546 1157294
63532 1157294 1137302 1117074 1098985 1084085 1072588 1064144 1057637 1051061 1041976 1028287 1008849 983512
63520 983512 952680 916886 876837 833779 789457 745563 703368 663885 627898 595453 565676
63509 565676 537714 511858 489245 470375 454384 439950 426518 414370 403853 394954 387455 381143
63497 381143 375810 371299 367511 364243 361095 357819 354707 352373 351105 350597 350311 349872 349113 348106 347296
63482 347296 347333 348481 350374 352553 355128 358619 363282 368828 374710 380386 385426 389722 393603 397317 400327
63467 400327 401588 400745 398616 396116 393042 388419 381919 374472 367412 361432 356413 351949 347819 344164
63453C44164k815j719p34q6L19O91J163J888L049M549N951P035Q103R510J1091
63438C92159J2462J3621J4971J6850J9484K3221K8237L3961L9135M2429M2697
63427F79227L8997L1214K0959J1179M287Q40J49J625N026R857J5406K1355K7820
63414H67941L4637M1092M6486N0488N2607N1792M7143L8961K8686J7809P259k156
63402A282745r380j3693j5453j5757j5372j4494j3582j3859j6518k1593k7943
63391A105101l4218l9542m3441m5634m6125m5200m3208m0386l6993l3380k9743
63380F67231k6046k2325j8957j6305j4164j1844q952n872l284j306O25L017N705
63367E47523Q139J0124J1991J4128J6498J8747K0632K2319K4310K7036L0389L3721
$$ plain form
63453 344164 341349 339630 338896 338810 339129 339820 340983 342871 345920 350469 356420 363455 371558 381068 392159
63438 392159 404621 418242 433213 450063 469547 492768 521005 554966 594101 636530 679227
63427 679227 718224 749438 770397 781576 785863 786703 786852 788477 793503 803360 818766 840121 867941
63414 867941 902578 943670 990156 1040644 1093251 1145043 1192186 1231147 1259833 1277642 1284901 1282745
63402 1282745 1273365 1259672 1244219 1228462 1213090 1198596 1185014 1171155 1154637 1133044 1105101
63391 1105101 1070883 1031341 987900 942266 896141 850941 807733 767347 730354 696974 667231
63380 667231 641185 618860 599903 583598 569434 557590 548638 542766 539482 538176 538801 541818 547523
63367 547523 555662 565786 577777 591905 608403 627150 647782 670101 694411 721447 751836 785557
63355G85557L6556L9204M2320M5852M8770N0094M9667M7557M3157L5618K5229
63344A249581J3809L487m653j0638j4749j6974j7260j6043j4391j3584j4475j7196
63332A126914k1387k6452l1611l6068l9512m2178m4129m4634m2795l8686l3435
63321G26027k8095k2896j7630j2231o811j772J648J511l261j1343j9488k4781
63309E80878k6438k5586k3754k1702j9426j6874j4364j2252j0452q663p024o123
63297C88220o168o481o197n262m353l927l763l487l162l137l480l831l780l314
63283C27878k797k494k300j989j639j534j637j535j027m61k45k64j10L33Q25J201
63267C12205J439J460J189Q48P94J013J114R18P29R01J403J989K552L071L389
$$ plain form
63355 785557 822113 861317 903637 949489 998259 1048353 1098020 1145577 1188734 1224352 1249581
63344 1249581 1263390 1266877 1262224 1251586 1236837 1219863 1202603 1186560 1172169 1158585 1144110 1126914
63332 1126914 1105527 1079075 1047464 1011396 971884 929706 885577 840943 798148 759462 726027
63321 726027 697932 675036 657406 645175 638364 636592 638240 639751 636490 625147 605659 580878
63309 580878 554440 528854 505100 483398 463972 447098 432734 420482 410030 401367 394343 388220
63297 388220 382052 375571 369374 364112 359759 355832 352069 348582 345420 342283 338803 334972 331192 327878
63283 327878 325081 322587 320287 318298 316659 315125 313488 311953 310926 310465 310220 309956 309846 310179 311004 312205
63267 312205 313644 315104 316293 317141 317935 318948 320062 320980 321709 322610 324013 326002 328554 331625 335014
63252C35014L334L030K876L167L803M462N022N670O568P478Q008Q227Q756J0059
63238D15474J1870J3661J5366J7243J9125K0436K1051K1595K2618K3864K4694
63227F26997K4932K4941K5025K5097K4855K4070K2856K1842K1823K2922K4286
63216H89646K5003K5194K5669K6525K6636K4759K0801J5715J0343M786j244p753
63204A086080j4265k0203k5342k9823l3673l6400l7314l6276l3948l1131k8115
63193G59590k4829k1347j7850j4239j0251o026k168J025M021P454J1264J4789
63181G01433J7562J9634K1164K2129K2566K2736K2813K2713K2422K2296K2603
63170I40071K2972K2693K1540J9973J8417J6677J4277J1068P257K872k385q693
$$ plain form
63252 335014 338348 341378 344254 347421 351224 355686 360708 366378 372946 380424 388432 396659 405415 415474
63238 415474 427344 441005 456371 473614 492739 513175 534226 555821 578439 602303 626997
63227 626997 651929 676870 701895 726992 751847 775917 798773 820615 842438 865360 889646
63216 889646 914649 939843 965512 992037 1018673 1043432 1064233 1079948 1090291 1095077 1093833 1086080
63204 1086080 1071815 1051612 1026270 996447 962774 926374 889060 852784 818836 787705 759590
63193 759590 734761 713414 695564 681325 671074 665048 662880 663905 667926 675380 686644 701433
63181 701433 718995 738629 759793 781922 804488 827224 850037 872750 895172 917468 940071
63170 940071 963043 985736 1007276 1027249 1045666 1062343 1076620 1087688 1094945 1097817 1095432 1086739
63158A086739j5614k2268k8017l2822l6869l9943m1478m1224l9698l7685l5499
63147G15622l2925k9826k6485k3351k0657j8339j6223j4188j2287j0714r569q668
63135D92390p740o720n698m735l910l370l031k371j064L02P92M89O00J844L378
63120D61156L937L474K998L114L547L932M261M406L990L044K297K382L102L742
63106E09382L872L568L075K546J988J295M24l86p39n44k16k50p18j243j361q45
63090E19848O1P50P41J65m61q60j106j114m90Q32K224K988L059K831K584K483
63074E34535K832L807N080O178P149Q293R399R830R569R524J0473J2186J3984
63061F42839J5694J7533J9385K0929K2437K4678K7816L1026L3617L6076L9376
$$ plain form
63158 1086739 1071125 1048857 1020840 988018 951149 911206 869728 828504 788806 751121 715622
63147 715622 682697 652871 626386 603035 582378 564039 547816 533628 521341 510627 501058 492390
63135 492390 484650 477930 472232 467497 463587 460217 457186 454815 453751 454053 454845 455334 455934 457778 461156
63120 461156 465093 468567 471565 474679 478226 482158 486419 490825 494815 497859 500156 502538 505640 509382
63106 509382 513254 516822 519897 522443 524431 525726 526150 525764 525025 524481 524265 524015 523297 522054 520693 519848
63090 519848 519909 520659 521400 521565 521104 520244 519138 518024 517534 518366 520590 523578 526637 529468 532052 534535
63074 534535 537367 541174 546254 552432 559581 567874 577273 587103 596672 606196 616669 628855 642839
63061 642839 658533 676066 695451 716380 738817 763495 791311 822337 855954 892030 931406
63050I31406M3553M7597N0748N3285N5806N8333O0410O1741O2252O1859O0644
63039A547634N9108N7863N7070N6541N6271N6505N7307N8351N9101N8880N6865
63028B181496N2506M5870L7227K6448J3405j090j5569k9238m2338n4864o5801
63017B148052p4119p9839q3427q4721q3264p9305p3641o6690n8483m9468m0502
63006A374593l1945k3518j5109p108K74P392J4560K1384K7055L1071L3619L5359
62994A467627L6912L8351L9373M0034M0896M2073M2656M1879M0416L9505L8925
62983A908647L7034L2938K7374K1036J3304L495p641j8838k9951m1488n2888o2541
62971A830481o9513p4173p7049p8026p7009p4524p1149o6956o1977n6797n2119
$$ plain form
63050 931406 974959 1022556 1073304 1126589 1182395 1240728 1301138 1362879 1425131 1486990 1547634
63039 1547634 1606742 1664605 1721675 1778216 1834487 1890992 1948299 2006650 2065751 2124631 2181496
63028 2181496 2234002 2279872 2317099 2343547 2356952 2355862 2340293 2311055 2268717 2213853 2148052
63017 2148052 2073933 1994094 1910667 1825946 1742682 1663377 1589736 1523046 1464563 1415095 1374593
63006 1374593 1342648 1319130 1304021 1296913 1297187 1304579 1319139 1340523 1367578 1398649 1432268 1467627
62994 1467627 1504539 1542890 1582263 1622297 1663193 1705266 1747922 1789801 1830217 1869722 1908647
62983 1908647 1945681 1978619 2005993 2027029 2040333 2043828 2036187 2017349 1987398 1945910 1893022 1830481
62971 1830481 1760968 1686795 1609746 1531720 1454711 1380187 1309038 1242082 1180105 1123308 1071189
62960A071189m8010m3962l9653l5294l1337k8190k6112k5002k4223k2981k1193
62949G25232j9729j9435j9957j9973j8782j7151j6184j5810j5031j3462j1817
62938E37901j0772j0152r519q815q016o811n186l866l535l967m465m768m957m866
62924D48206m325l685l343k973k032q91n14j039j513j248o05k08j76m29j085k013
62908D22127k648k693k616l000l760m332m293l554k333j229r39j468k051k053
62894C85158j592j004k90M63O98Q7p74j075q32n81l48L16J324J961J867J449J194
62877C88021J113J058J010R00N45L7k28j27o7l99q83j025p23l21j96m30q41j133
62859C86311j175j107j079r27l91L57P77O58M07M28N44L28j99m96l9J165K476
$$ plain form
62960 1071189 1023179 979217 939564 904270 872933 844743 818631 793629 769406 746425 725232
62949 725232 705503 686068 666111 646138 627356 610205 594021 578211 563180 549718 537901
62938 537901 527129 516977 507458 498643 490627 483816 478630 474764 471229 467262 462797 458029 453072 448206
62924 448206 443881 440196 436853 433880 431848 430957 430443 429404 427891 426643 426038 425830 425654 425225 424140 422127
62908 422127 419479 416786 414170 411170 407410 403078 398785 395231 392898 391669 390730 389262 387211 385158
62894 385158 383566 382562 382272 382735 383433 383520 382746 381671 380839 380258 379910 380226 381550 383511 385378 386827 388021
62877 388021 389134 390192 391202 392102 392647 392684 392456 392329 392262 391863 390980 389955 389232 388911 388715 388285 387444 386311
62859 386311 385136 384029 382950 382023 381632 381989 382766 383424 383831 384259 384803 385131 384932 384436 384397 385562 388038
62842C88038K970K195P33k67l74l40r77j940k162j322k53J64mj00K30P83J176
62825C88550J233J062R63J165J565J820J801J757J958K325K615K809L104L596
62811D16323M169M676N059N312N444N480N417N287N262N581O286P141Q003R016
62797D98456J0251J1345J1910J2173J2761J3835J4913J5694J6608J8280K0765
62786F56991K3686K6891L0658L5279M0692M6437N1859N6607O1197O6794P4023
62775A171114Q2138Q9694R5841J00540J03697J04777J03361R9432R2840Q2985
62765B126419O9514N3063L4984J6443j984k0062l7505n3710o7746p8818q6897
62754A953701r2625r6407r7982r7124r4401r0718q6438q1468p6017p0556o5116
$$ plain form
62842 388038 391008 393203 393936 393669 393295 392955 391978 390038 387876 386554 386301 386465 386461 386361 386591 387374 388550
62825 388550 389783 390845 391808 392973 394538 396358 398159 399916 401874 404199 406814 409623 412727 416323
62811 416323 420492 425168 430227 435539 440983 446463 451880 457167 462429 468010 474296 481437 489440 498456
62797 498456 508707 520052 531962 544135 556896 570731 585644 601338 617946 636226 656991
62786 656991 680677 707568 738226 773505 814197 860634 912493 969100 1030297 1097091 1171114
62775 1171114 1253252 1342946 1438787 1539327 1643024 1747801 1851162 1950594 2043434 2126419
62765 2126419 2195933 2248996 2283980 2300423 2298439 2278377 2240872 2187162 2119416 2040598 1953701
62754 1953701 1861076 1764669 1666687 1569563 1475162 1384444 1298006 1216538 1140521 1069965 1004849
62743A004849n9324n3314m7917m3637l9915l5857l1362k7085k3540k0661j8135
62732F04102j5777j3568j1567r837q368p071n998n341n048m644l653k115m87R39
62718E11567K173L243M059M680N420O562Q111R878J1675J3419J5201J7283J9890
62705F33161K2958K6247K9672L3401L7575M2151M7056N2298N7853O3596O9369
62694A115337P4978Q0072Q4271Q7442Q9628R0606Q9761Q6548Q0729P2045O0014
62683B011431M4561K6699Q132r832k6765m2529n6678o8592p7966q4969q9859r2586
62671A541047r2828r0580q6621q2107p7492p2232o5847n8998n2974m8262m4170
62660G68936l9907l5423l1105k7221k3966k1520j9710j7979j6053j4337j3225
$$ plain form
62743 1004849 945525 892211 844294 800657 760742 724885 693523 666438 642898 622237 604102
62732 604102 588325 574757 563190 553353 544985 537914 531916 526575 521527 516883 513230 511115 510628 511567
62718 511567 513740 516983 521042 525722 531142 537704 545815 555693 567368 580787 595988 613271 633161
62705 633161 656119 682366 712038 745439 783014 825165 872221 924519 982372 1045968 1115337
62694 1115337 1190315 1270387 1354658 1442100 1531728 1622334 1712095 1798643 1879372 1951417 2011431
62683 2011431 2055992 2082691 2090823 2080991 2054226 2011697 1955019 1886427 1808461 1723492 1633633 1541047
62671 1541047 1448219 1357639 1271018 1188911 1111419 1039187 973340 914342 861368 813106 768936
62660 768936 729029 693606 662501 635280 611314 589794 570084 552105 536052 521715 508490
62649E08490j2364j1105r504q259p718p483p097o711o682o808o352m916l086j909
62635D08496j696j631q34M09R73M04m94q48q05j003j460j694j622j613j712j533
62619C93337r28k23L53R65J722K450L073L771M579N183N361N304N343N666O403
62604D42359P607Q954R921J0529J1545J3557J6217J8772K1093K3715K7027L0892
62592F42188L5006L9186M3179M6522M8898N0442N1430N1533M9683M4944L7623
62581A140634K9167K0736J2173K711p572j7534k6095l2994l8385m2307m4812m6140
62569I49582m6460m5773m4251m2276l9948l7016l3562l0229k7409k4764k1938
62558E55956j9279j7277j5716j4017j2106j0304q669p040n618m766m393m162m111
$$ plain form
62649 508490 496126 485021 475517 467258 459540 452057 444960 438249 431567 424759 418407 413491 410405 408496
62635 408496 406800 405169 404335 404744 405717 406121 405627 404779 403974 402971 401511 399817 398195 396582 394870 393337
62619 393337 392409 392186 392539 393504 395226 397676 400749 404520 409099 414282 419643 424947 430290 435956 442359
62604 442359 449966 458920 468841 479370 490915 504472 520689 539461 560554 584269 611296 642188
62592 642188 677194 716380 759559 806081 854979 905421 956851 1008384 1058067 1103011 1140634
62581 1140634 1169801 1190537 1202710 1205421 1197849 1180315 1154220 1121226 1082841 1040534 995722 949582
62569 949582 903122 857349 813098 770822 730874 693858 660296 630067 602658 577894 555956
62558 555956 536677 519400 503684 489667 477561 467257 458588 451548 445930 441164 436771 432609 428498
62545D28498m389m524l772k275j019m39J18J221K345K609J981J216Q64Q68R63
62530D24265J041J173J514K199L224M538O178Q114J0010J1491J2747J4354J6431
62517E17279J8486K0308K2477K5608K9498L3499L7368M1248M5068M8481N1210
62506H90530N3024N3463N2106M9014M4532L8696L1303K2538J3093L614n526j3878
62494A232509k0849k6170l0043l2610l3621l2846l0472k6839k2064j6374j0514
62483I50107n320q64L561Q484J3599J8259K2258K5794K8681K9976K8540K4008
62471A147083J7223R827L331j792o397j1943j9206k7495l5190m1106m5203m8071
62459I41061m9956n0497m9363m6855m3771m0742l7773l4447l0493k6118k1816
$$ plain form
62545 428498 424109 419585 415813 413538 412519 412080 412198 413419 415764 418373 420354 421570 422434 423302 424265
62530 424265 425306 426479 427993 430192 433416 437954 444132 452246 462256 473747 486494 500848 517279
62517 517279 535765 556073 578550 604158 633656 667155 704523 745771 790839 839320 890530
62506 890530 943554 997017 1049123 1098137 1142669 1181365 1212668 1235206 1248299 1251913 1246387 1232509
62494 1232509 1211660 1185490 1155447 1122837 1089216 1056370 1025898 999059 976995 960621 950107
62483 950107 944787 943923 947484 955968 969567 987826 1010084 1035878 1064559 1094535 1123075 1147083
62471 1147083 1164306 1174133 1177464 1175672 1169275 1157332 1138126 1110631 1075441 1034335 989132 941061
62459 941061 891105 840608 791245 744390 700619 659877 622104 587657 557164 531046 509230
62448E09230j7987j4742j2001r636p578n869m616l754k955j933p93J59R27J819
62434D30271K823L403L158K406J714J090M4j510k980l849m331n000n935o594o477
62419D08233n686m805m321m211m067l627l113k932l086l096k664k084j821j809
62405C60911j574r74m61m84r05j188j024n42K9O16J256J889K325K473K553K972
62389C67872L780M416M228L260K259J817J892K324L353N154P107Q197Q156P737
62375D31552P747Q234Q818R319R750J0019J0140J0506J1543J3064J4389J5192
62363E60273J5957J7448J9903K2954K6291L0123L4859M0423M6192N1681N7075
62352I23179O2783O8580P3493P6548P7206P5082O9649O0759M9226L6515K3817
$$ plain form
62448 509230 491243 476501 464500 454864 447286 441417 436801 433047 430092 428159 427366 427525 428452 430271
62434 430271 433094 436497 439655 442061 443775 444865 444909 443399 440419 436570 432239 427239 421304 414710 408233
62419 408233 402547 397742 393421 389210 385143 381516 378403 375471 372385 369289 366625 364541 362720 360911
62405 360911 359337 358363 357902 357418 356513 355325 354301 353759 353788 354404 355660 357549 359874 362347 364900 367872
62389 367872 371652 376068 380296 383556 385815 387632 389524 391848 395201 400355 407462 415659 423815 431552
62375 431552 439299 447533 456351 465670 475420 485439 495579 506085 517628 530692 545081 560273
62363 560273 576230 593678 613581 636535 662826 692949 727808 768231 814423 866104 923179
62352 923179 985962 1054542 1128035 1204583 1281789 1356871 1426520 1487279 1536505 1573020 1596837
62341A596837J1650L08r760j8268k5639l2810m0269m7375n2891n6258n8034n8950
62329A208541n8898n7254n3957m9695m5134m0578l6381l2973l0282k7806k5528
62318G50055k4116k3757k3523k2459k0793j9337j8275j7273j6384j5890j5470
62307E32778j4480j3061j2017j1527j0824r367p520n814m288k905j936j492j167
62294D36380n32L86J396K414L166L180K440J647J445J823K540L611M829N352M525
62279D74602K902J796J898K767L573L915L936M060M601N412O026O364P012Q461
62265E37325J0313J1766J2794J4321J7181K1291K5889L0331L4550L9023M4337
62254G99121N0597N7226O3466O9016P3970P8180Q0885Q0914P7153O9102N7342
$$ plain form
62341 1596837 1608487 1608795 1599035 1580767 1555128 1522318 1482049 1434674 1381783 1325525 1267491 1208541
62329 1208541 1149643 1092389 1038432 988737 943603 903025 866644 833671 803389 775583 750055
62318 750055 725939 702182 678659 656200 635407 616070 597795 580522 564138 548248 532778
62307 532778 518298 505237 493220 481693 470869 461502 453982 448168 443880 440975 439039 437547 436380
62294 436380 435848 436234 437630 440044 443210 446390 448830 450477 451922 453745 456285 459896 464725 470077 474602
62279 474602 477504 479300 481198 483965 487538 491453 495389 499449 504050 509462 515488 521852 528864 537325
62265 537325 547638 559404 572198 586519 603700 624991 650880 681211 715761 754784 799121
62254 799121 849718 906944 970410 1039426 1113396 1191576 1272461 1353375 1430528 1499630 1556972
62243A556972M3477K9281J5816L409p818j7797k6842l5611m4477n3123o0832o7008
62231A335447p1342p3668p3868p1940o8146o3096n7553n2054m6729m1532l6578
62220F78941l2065k7992k4141k0353j6791j3868j1938j0955j0473j0058r654r309
62208D81344q737p521n870m650m373m469l946k566j020oM85J007J999L355M623
62193D49655N656O847Q491J0093J0900J1180J2116J4151J6201J7115J7260J7823
62181E97488J9059K0182K0732K0966K0846J9668J7071J3726J0672Q408O944O286
62169G82048O526P725R887J2893J6485K0561K5396L1212L7596M3722M9014N3108
62157A096173N5299N4706N1064M4784L6305K6045J5054M901l467j0230j5954k1056
$$ plain form
62243 1556972 1600449 1629730 1645546 1648955 1641137 1623340 1596498 1560887 1516410 1463287 1402455 1335447
62231 1335447 1264105 1190437 1116569 1044629 976483 913387 855834 803780 757051 715519 678941
62220 678941 646876 618884 594743 574390 557599 543731 531793 520838 510365 500307 490653 481344
62208 481344 472607 465086 459216 454566 450193 445724 441778 439212 438192 438186 438671 439678 441677 445032 449655
62193 449655 455311 462158 470649 480742 491642 502822 514938 529089 545290 562405 579665 597488
62181 597488 616547 636729 657461 678427 699273 718941 736012 749738 760410 768818 775762 782048
62169 782048 788574 796299 806186 819079 835564 856125 881521 912733 950329 994051 1043065 1096173
62157 1096173 1151472 1206178 1257242 1302026 1338331 1364376 1379430 1384331 1380864 1370634 1354680 1333624
62145A333624k6144l1979l8487m4488m8893n1605n2785n1996m8874m4145l9149
62134H55079l4538l0123k5713k1448j7503j4024j1266r135o884l914p39J585K866
62121F84243L918N331O935Q615J0793J3616J6139J6883J5002J0787N366K42l255
62108G94615m499l787k040l86J28j071l766p162j0438j2936j3919j2701r345m982
62094G07711j170J133K033K379L093M486O104P257P722P803P863Q059Q498R228
62080G82199J0125J1124J2542J4675J7061J8780J9687K0709K2570K4761K6304
62069I80537K7004K7308K7315K6755K5828K5350K5907K7425K9644L2562L6097
62058A291732L9714M2499M3492M1998L7932L1919K4822J7172R305J774m907j0865
$$ plain form
62145 1333624 1307480 1275501 1237014 1192526 1143633 1092028 1039243 987247 938373 894228 855079
62134 855079 820541 790418 764705 743257 725754 711730 700464 691329 684445 680531 679792 681377 684243
62121 684243 688161 693492 700427 709042 719835 733451 749590 766473 781475 792262 797628 797870 794615
62108 794615 790116 786329 784289 783903 784031 782960 779194 772032 761594 748658 734739 722038 712693 707711
62094 707711 706541 707674 709707 712086 715179 719665 725769 733026 740748 748551 756414 764473 772971 782199
62080 782199 792324 803448 815990 830665 847726 866506 886193 906902 929472 954233 980537
62069 980537 1007541 1034849 1062164 1088919 1114747 1140097 1166004 1193429 1223073 1255635 1291732
62058 1291732 1331446 1373945 1417437 1459435 1497367 1529286 1554108 1571280 1580585 1582359 1577452 1566587
62046A566587j6660k2480k8214l4215m1093m8320n3949n6411n6157n4898n3738
62035A100452n2588n0964m8464m4717l9699l4147k9084k4923k1490j8686j6473
62024G19217j4454j2256j0263r204r031q998q850r040r620r950r828r953j0731
62011E87039j1495j1406j0509r260p767o057m427k909j056J091K642L267M078
61998E33231N987P937Q169O767N355M567L430J396o73k054l239m742o086o796
61984E53249p386q433r505r990j0205j0714j1109j0613r460q616q289p759o712
61971D34458n729n290n089m689m181l780l280k392j382r13j184j568j278l36L85
61956C93752K52k43kJ297K912M119M953N635O022O147O688Q078R634J0445J0863
$$ plain form
62046 1566587 1549927 1527447 1499233 1465018 1423925 1375605 1321656 1265245 1209088 1154190 1100452
62035 1100452 1047864 996900 948436 903719 864020 829873 800789 775866 754376 735690 719217
62024 719217 704763 692507 682244 673040 664009 655011 646161 637121 627501 617551 607723 597770 587039
62011 587039 575544 564138 553629 544369 536602 530545 526118 523209 522153 523244 525886 529153 533231
61998 533231 539218 547155 555324 562091 567446 572013 575443 576839 576166 574112 570873 566131 560045 553249
61984 553249 545863 537430 527925 517935 507730 497016 485907 475294 465834 457218 448929 441170 434458
61971 434458 428729 423439 418350 413661 409480 405700 402420 400028 398646 397733 396549 394981 393703 393367 393752
61956 393752 394004 393761 393759 395056 397968 402087 407040 412675 418697 424844 431532 439610 449244 459689 470552
61941D70552J2104J4403J6626J7996J9138K0869K2794K3956K4312K4680K5329
61930F92759K5556K4775K3324K1785K0018J7407J3921J0386P577N376L037O3l468
61917H62516p247j0952j4048j5816j5885j4555j2364r473n749j246L681Q646J3310
61904G80818J7301K0334K2450K3802K4199K3141K0401J6289J1334N964N74m414
61892I62193q810j2717j6155j8757k0125k0400k0232k0108j9894j9103j7589j5883
61880G52420j4753j4516j4790j4985j4951j5052j5641j6528j7066j6735j5594
61869E81809j4103j2551j0768q584o349m649l469k133k65J638K942L907N387P668
61855E40480J0134J2212J4089J6316J9145K2533K6446L0705L4661L7465L8791
$$ plain form
61941 470552 482656 497059 513685 531681 550819 571688 594482 618438 642750 667430 692759
61930 692759 718315 743090 766414 788199 808217 825624 839545 849931 857508 862884 865921 865984 862516
61917 862516 855269 844317 830269 814453 798568 784013 771649 762176 756427 755181 758862 767508 780818
61904 780818 798119 818453 840903 864705 888904 912045 932446 948735 960069 966033 966607 962193
61892 962193 953383 940666 924511 905754 885629 865229 844997 824889 804995 785892 768303 752420
61880 752420 737667 723151 708361 693376 678425 663373 647732 631204 614138 597403 581809
61869 581809 567706 555155 544387 535803 529454 524805 521336 519203 518938 520576 523518 527425 532812 540480
61855 540480 550614 562826 576915 593231 612376 634909 661355 692060 726721 764186 802977
61844H02977L9139L9296L9567L9498L8229L5154L0288K4036J6784Q803N53p162
61832A107162j3561j8260k1226k2435k1819j9463j5653j0639m555K312R266J5371
61820I86500J9893K2508K3193K2060J9313J5142R541K435n890j4602k2725k9629
61808A047739l4972l8425l9858l9749l8894l7646l5761l3126l0230k7601k5206
61797F66271k2775k0378j8219j6079j3578j0984r124q382q213p888p338o958o882
61784E09473o849o643o284n843n290m655m089l677l299k767k100j477j013o81
61770D54806n21p19j285j781j594o01O46J441J581J394J331J599K076K489K734
61755D63596L064L714M426M607M111L471L111K699J695K64q40j285j549k201l197
$$ plain form
61844 802977 842116 881412 920979 960477 998706 1033860 1064148 1088184 1104968 1113771 1114324 1107162
61832 1107162 1093601 1075341 1054115 1031680 1009861 990398 974745 964106 959551 961863 971129 986500
61820 986500 1006393 1028901 1052094 1074154 1093467 1108609 1118150 1120585 1114695 1100093 1077368 1047739
61808 1047739 1012767 974342 934484 894735 855841 818195 782434 749308 719078 691477 666271
61797 666271 643496 623118 604899 588820 575242 564258 555134 546752 538539 530651 523313 516355 509473
61784 509473 502624 495981 489697 483854 478564 473909 469820 466143 462844 460077 457977 456500 455487 454806
61770 454806 454285 453566 452281 450500 448906 448305 448951 450392 451973 453367 454698 456297 458373 460862 463596
61755 463596 466660 470374 474800 479407 483518 486989 490100 492799 494494 494758 493918 492633 491084 488883 485686
61740D85686l961m033l469k844k769l296l785l611k879k203j872j592j091n17
61726D47764j06K20O83J298J895K383K815L265L670L775L353K645K404L212M665
61711D83941N657N508M546L426K242O45j422l429m774n361n610n963o350o287
61697D66769n550m589m058m000l810l088k209j849k169k661k751k428k211k525
61683D22871l057k986j993q37n13j009j370r86k73P5k6k28l42l49j20L82Q27Q26
61665D10892M87L00M68O85O08K91J04L29R15J506J774J714J589J580J637J677
61649D26556J716J728J567J213Q94Q33J012J373K020L015M087M755M675L825K453
61634D61722R80k45j186j957k438k382k055k261l348m642n262n173m904m532l674
$$ plain form
61740 485686 481725 477692 474223 471379 468610 465314 461529 457918 455039 452836 450964 449372 448281 447764
61726 447764 447658 447878 448561 449859 451754 454137 456952 460217 463887 467662 471015 473660 476064 479276 483941
61711 483941 489598 495106 499652 503078 505320 505965 504543 501114 496340 490979 485369 479406 473056 466769
61697 466769 461219 456630 452572 448572 444762 441674 439465 437616 435447 432786 430035 427607 425396 422871
61683 422871 419814 416828 414835 413998 413485 412476 411106 410120 409847 409922 409896 409668 409326 408977 408857 409239 410066 410892
61665 410892 411379 411679 412147 412832 413440 413731 413835 414164 415079 416585 418359 420073 421662 423242 424879 426556
61649 426556 428272 430000 431567 432780 433674 434507 435519 436892 438912 441927 446014 450769 455444 459269 461722
61634 461722 462702 462457 461271 459314 456876 454494 452439 450178 446830 442188 436926 431753 426849 422317 418643
61619D18643k363j139k26O67J519J748J152M94N51J036J008J16j231k640m071
61604D15264n368o128o294o392o806p190o917n910m679l700l043k613k401k407
61590C45416k565k848l318l941m470m591m155l267k268j599j558j996k424k463
61576C03953k180j884j834k122k661l094k893j930p70j23m4n0J6k76j153k010
61560B80945j975q99N12J425J457O67n57j512j466k97J300K382K587K215J683
61545B88467J144O97N34P06R56J117J438K133K701K340J151L39Q34K151L040K925
61529C12673K181J332O02Q9k43p59j706k614k772k337k185k555k637j962j338
61514B95769j670k530k735k047j380j303j292o96K40P85P40N39N08M51N9n67r67
$$ plain form
61619 418643 416280 415141 414915 415582 417101 418849 420001 420495 421046 422082 423090 423206 421975 419335 415264
61604 415264 409896 403768 397474 391082 384276 377086 370169 364259 359580 355880 352837 350224 347823 345416
61590 345416 342851 340003 336685 332744 328274 323683 319528 316261 313993 312394 310836 308840 306416 303953
61576 303953 301773 299889 298055 295933 293272 290178 287285 285355 284585 284462 284418 284368 284384 284108 282955 280945
61560 280945 278970 278071 278583 280008 281465 282132 281575 280063 278597 278300 279600 281982 284569 286784 288467
61545 288467 289611 290308 290842 291548 292504 293621 295059 297192 299893 302233 303384 303723 304557 306708 309748 312673
61529 312673 314854 316186 316788 316877 316634 315875 314169 311555 308783 306446 304261 301706 299069 297107 295769
61514 295769 294099 291569 288834 286787 285407 284104 282812 282116 282356 283141 283881 284420 284928 285379 285438 284871 283904
61497B83904q31l37N3M3k58m93l74O7M42L12l06r01j023p44l59J05O67R46O08
61478B81521J33M08J444K171J888J184R64J231J405J347J266J036L96l82p27o12
61462B94673m63l33J65R93J480J152L24l63n37j93L98P49N53Q1j49j07j48k49
61444B98026K6O03P53K13j30P02K397L636L641K912K509K936L869M619M769M420
61428C35901L897L322K615J847J239P57J17n99o97L76K219L759M286L926L247
61413C66212K664K219J697R40J27l57m79p11j441k382k948l078l243l625l732
61398C51863l086j975j181j086j333j383j117q18p09p59q31q27o06k0Q15J439
61382C38386J540J426J641K076J943Q61l31l97Q89K535L526L734L518L039K297
$$ plain form
61497 283904 283073 282736 282789 282832 282574 282081 281707 281774 282216 282528 282222 281321 280298 279554 279195 279300 279967 280913 281521
61478 281521 281654 282062 283506 285677 287565 288749 289713 290944 292349 293696 294962 295998 296394 296012 295285 294673
61462 294673 294210 293877 294042 295035 296515 297667 297991 297628 297091 296898 297296 298045 298598 298679 298530 298423 298275 298026
61444 298026 298052 298655 299408 299621 299491 300193 302590 306226 309867 312779 315288 318224 322093 326712 331481 335901
61428 335901 339798 343120 345735 347582 348821 349578 349695 349096 348399 348775 350994 354753 359039 362965 366212
61413 366212 368876 371095 372792 373732 373859 373502 373023 372312 370871 368489 365541 362463 359220 355595 351863
61398 351863 348777 346802 345621 344535 343202 341819 340702 339884 339175 338416 337585 336758 336152 336132 336947 338386
61382 338386 339926 341352 342993 345069 347012 347873 347542 347145 348034 350569 354095 357829 361347 364386 366683
61367C66683J583J328J534J695J390P67L64O57J707L034L831L597K765K384L046
61352C96365M284N317O081P086Q391R262R054P987O787N814M953M128L526L301
61338D82336L369L625M094M696N094M946M317L567K882K109J067j98j562k962
61324E17380m211m912m934m784n014n283m632k845r09J78N00P02J039J585K797
61309D86657M836O734P338P070P584R487J1472J2029J1028R165O875M447K310
61296E87032M10j919m682o598o704n851n572n985o000n200m265l672l272l062
61282E24660l223l343k676j423n98m40r5Q74J825K317K860L766M322L948L276
61267E36050L201L587L792L855M205M728N133N785P168Q792R599R372Q756Q049
$$ plain form
61367 366683 368266 369594 371128 372823 374213 374980 375344 376001 377708 380742 384573 388170 390935 393319 396365
61352 396365 400649 405966 412047 419133 427524 436786 445840 453827 460614 466428 471381 475509 479035 482336
61338 482336 485705 489330 493424 498120 503214 508160 512477 516044 518926 521035 522102 521904 520342 517380
61324 517380 513169 508257 503323 498539 493525 488242 483610 480765 479856 480034 480534 481236 482275 483860 486657
61309 486657 491493 498227 505565 512635 520219 529706 541178 553207 564235 573400 580275 584722 587032
61296 587032 587442 585523 580841 574243 567539 561688 556116 550131 544131 538931 534666 530994 527722 524660
61282 524660 521437 518094 515418 513995 513397 512957 512862 513736 515561 517878 520738 524504 528826 532774 536050
61267 536050 539251 542838 546630 550485 554690 559418 564551 570336 577504 586296 595895 605267 614023 622072
61253F22072O900N326M002L273K691J898J299J378J806J732P76o59j902k656l246
61238F44690m219n591o627o689o178o151o925p656p429o231m589k823j104J67
61224E72645O72O68O96Q56Q75P42P83J058J301J604K581M391O028O191M761K920
61208F08772J789J400J149P97O37Q71J239J330J119J046J656L146N335P985J1007
61193F49278J4181J6851J8277J8305J7329J5621J3078R874O816M743L734L308
61181G91395L096K963K774K393J815R56m13k193l745m614n161n922o668o789o322
61166G63565n894n810n993o644p975r361r880r812j0414j1864j2670j1739r901
61153F45608q529p592o129l901j455Q52K839L836L157J009j924n512r705j3386
$$ plain form
61253 622072 628972 634298 638300 641573 644264 646162 647461 648839 650645 652377 653153 652494 650592 647936 644690
61238 644690 640471 634880 628253 621564 615386 609235 602310 594654 587225 580994 576405 573582 572478 572645
61224 572645 573317 573985 574681 575537 576412 577154 577937 578995 580296 581900 584481 588872 594900 601091 605852 608772
61208 608772 610561 611961 613110 613907 614544 615415 616654 617984 619103 620149 621805 624951 630286 638271 649278
61193 649278 663459 680310 698587 716892 734221 749842 762920 772794 779610 784353 788087 791395
61181 791395 794491 797454 800228 802621 804436 805392 804979 802786 799041 794427 789266 783344 776676 769887 763565
61166 763565 757671 751861 745868 739224 731249 721888 712008 702196 691782 679918 667248 655509 645608
61153 645608 637079 629487 623358 619457 618002 618854 621693 625529 628686 629695 627771 622259 612554 599168
61139E99168j5002j4454j3107j1822j0149p819n745m744m271l326j957q55K7J436
61125E07380L518N464O634P316Q168R377J0661J1783J2851J4184J5984J8051J9822
61112F51193K0926K1633K2581K3922K5071K5437K5165K4904K4860K4471K3042
61101I13205K0427J6979J3066Q946M849R02k936o551r437j1253j2523j4229j6583
61088I04862j8744j9986k0566k1070k1446k1247k0457j9438j8285j6916j5666
61077F91041j5043j4847j4191j2664j0900r709r051q246o914n333l977l062k520
61064E74584k148j767j257n60L35J353K343L245M174N212O179O826P208P668Q404
61049F21799R282J0152J1126J2379J3830J5273J6792J8754K1242K3653K5241K6046
$$ plain form
61139 599168 584166 569712 556605 544783 534634 526815 521070 516326 512055 508729 506772 505917 505944 507380
61125 507380 510898 516362 522996 530312 538480 547857 558518 570301 583152 597336 613320 631371 651193
61112 651193 672119 693752 716333 740255 765326 790763 815928 840832 865692 890163 913205
61101 913205 933632 950611 963677 972623 977472 978374 975438 968887 959450 948197 935674 921445 904862
61088 904862 886118 866132 845566 824496 803050 781803 761346 741908 723623 706707 691041
61077 691041 675998 661151 646960 634296 623396 613687 604636 596390 589476 584143 580166 577104 574584
61064 574584 572436 570669 569412 568852 569187 570540 572883 576128 580302 585514 591693 598519 605727 613395 621799
61049 621799 631081 641233 652359 664738 678568 693841 710633 729387 750629 774282 799523 825569
61037H25569K6933K8544L0483L1981L3009L4249L6110L8444M1222M4663M8392
61026A219599N1185N2071N1294M9874M8684M8438N0058N4315O1225P0169Q0391
61015A837303R1100J01510J11298J20977J31845J46102J67014J97880K40183K93641
61005C438853L58617M37601N34169O52948Q02649R97373J251798J573524J955150
60996A2002682K359125K695104K818622K588334J968492J094836K28160l82196
60988B5373159o15205m93760j27647L31049O94573P65041M20461k93553j165157
60979B4888961j931593k417762k591999k522924k304846k014945j707422j417862
60971G979608j164515r51434p75624o32372n16282m21917l45651k85791k40411
$$ plain form
61037 825569 852502 881046 911529 943510 976519 1010768 1046878 1085322 1126544 1171207 1219599
61026 1219599 1270784 1322855 1374149 1424023 1472707 1521145 1571203 1625518 1686743 1756912 1837303
61015 1837303 1928403 2029913 2141211 2262188 2394033 2540135 2707149 2905029 3145212 3438853
61005 3438853 3797470 4235071 4769240 5422188 6224837 7222210 8474008 10047532 12002682
60996 12002682 14361807 17056911 19875533 22463867 24432359 25527195 25755355 25373159
60988 25373159 24757954 24264194 24136547 24467596 25162169 25927210 26347671 26054118 24888961
60979 24888961 22957368 20539606 17947607 15424683 13119837 11104892 9397470 7979608
60971 7979608 6815093 5863659 5088035 4455663 3939381 3517464 3171813 2886022 2645611
60962B645611k06239j79969j59412j42879j28707j15956j04620r4514q4575p3861
60952A354879o2718n2474m4369l9020l6406l5851l6241l6559l6191l4819l2387
60941I07844k9303k6263k3699k1592j9828j8413j7301j6395j5764j5498j5311
60930F88477j4716j3761j3077j3007j3061j2491j1130r457q036p085o442n813
60918E60401n212n062n614o336o389n737n228n313n368m617l325k453k445k913
60904D94389l281l283k890k211j571j165p19J88J420K341K613K488K239J741R66
60889D93265L51L96J076K044L037L715L455K013K69m76j00K32k24o77qJ559K864
60872E12791L510M199N384O558P200P662Q539R695J0474J0665J0748J1271J2382
$$ plain form
60962 2645611 2439372 2259403 2099991 1957112 1828405 1712449 1607829 1513315 1428740 1354879
60952 1354879 1292161 1239687 1195318 1156298 1119892 1084041 1047800 1011241 975050 940231 907844
60941 907844 878541 852278 828579 806987 787159 768746 751445 735050 719286 703788 688477
60930 688477 673761 660000 646923 633916 620855 608364 597234 587777 579741 572656 566214 560401
60918 560401 555189 550127 544513 538177 531788 526051 520823 515510 510142 505525 502200 499747 497302 494389
60904 494389 491108 487825 484935 482724 481153 479988 479269 479457 480877 483218 485831 488319 490558 492299 493265
60889 493265 493616 494012 495088 497132 500169 503884 507339 509352 509621 509145 509045 509277 509053 508376 508368 509927 512791
60872 512791 516301 520500 525884 532442 539642 547304 555843 565538 576012 586677 597425 608696 621078
60859F21078J3904J5502J6765J7378J7328J6842J6200J5655J5430J5652J6319
60848G98053J7363J8591J9539J9634J8570J6468J3729J0973Q927P767O558M065
60836I60237L53l171n671p978j1038j4156j5937j6522j7476j9489k1497k2395
60824H05260k2392k2095k1357j9887j8257j7309j7004j6735j6409j6320j6179
60813F01316j5282j3685j2333j1765j1442j0635r331p849o211m441l082k689k977
60800D89594l103k738k302k142k062j807j440r87k15P15R36k14k117l422l586
60785D65110l297l281l420l269k860k510k295k160k288k851l618m235m701n083
60771D19242n000m028k570j648j720k204k405k325k310k382k386k407k551k540
$$ plain form
60859 621078 634982 650484 667249 684627 701955 718797 734997 750652 766082 781734 798053
60848 798053 815416 834007 853546 873180 891750 908218 921947 932920 941847 949614 956172 960237
60836 960237 960590 957419 951748 943770 932732 918576 902639 886117 868641 849152 827655 805260
60824 805260 782868 760773 739416 719529 701272 683963 666959 650224 633815 617495 601316
60813 601316 586034 572349 560016 548251 536809 526174 516843 508994 502783 498342 495260 492571 489594
60800 489594 486491 483753 481451 479309 477247 475440 474000 473013 472798 473513 474449 474235 472118 468696 465110
60785 465110 461813 458532 455112 451843 448983 446473 444178 442018 439730 436879 433261 429026 424325 419242
60771 419242 414242 410214 407644 405996 404276 402072 399667 397342 395032 392650 390264 387857 385306 382766
60757C82766k019j197p08q04j106j212j255j545j969j980j219L5J107J577J637
60742C72108J759K054K110J499K98j006j987k510k615k464k322k317k201j640
60728C60766q05l01l32l45J16N60J37j037j843j608r65r69j790k801l556m063
60712C41164m253l877l050k386k319k653k981l208l395l369k834j815p65j79j68
60697C03912l56k82L4J9o94j573j690q94jL14K40K32K52J04J5K75N87M76J81M49
60677C01600J448K494K988L035K940K733K482K630L483M612N194M893M074L234
60663C47840K545J982J554J283J133J140J470K189K939L146K644J988J861K299
60649C76013K765K969L194L687M100L842K764J169n94k198l233l505l434l719
$$ plain form
60757 382766 380747 379550 378842 378038 376932 375720 374465 372920 370951 368971 367752 367787 368894 370471 372108
60742 372108 373867 375921 378031 379530 379828 378822 376835 374325 371710 369246 366924 364607 362406 360766
60728 360766 359961 359660 359328 358983 359099 359659 359796 358759 356916 355308 354343 353374 351584 348783 345227 341164
60712 341164 336911 333034 329984 327598 325279 322626 319645 316437 313042 309673 306839 305024 304259 304080 303912
60697 303912 303556 303274 303308 303327 302633 301060 299370 298476 298475 298789 299029 299261 299513 299617 299632 299907 300494 300970 301151 301600
60677 301600 303048 305542 308530 311565 314505 317238 319720 322350 325833 330445 335639 340532 344606 347840
60663 347840 350385 352367 353921 355204 356337 357477 358947 361136 364075 367221 369865 371853 373714 376013
60649 376013 378778 381747 384941 388628 392728 396570 399334 400503 399909 397711 394478 390973 387539 383820
60635C83820m579n570o162o120n473m514l878m024m521m276k816j003n4j84n42
60620C30104l95Q8K52j71q00j140j174j293j662j849j310j23J003J476J390J245
60604C25641J316J432J221N53k26m91j2O49O87J02k26L80J524K276K301J999J719
60587C40845J327P00J97K85Q30J119O95j39p30q23n82p6Q38K008K897L267L629
60570C56287M503N538N960N849O279P933J0112J1558J1853J1593J1338J0970J0090
60557D69863Q556O406L560N5l513o161p350p418o963o086m535k507o52P94K312
60542D46361M256O278Q046R961J2478J5059J6720J7360J7663J7652J6385J3400
60530F01619R513N699J922k203o180q899r916r802r291q652p865o926n838m667
$$ plain form
60635 383820 379241 373671 367509 361389 355916 351402 347524 343500 338979 334703 331887 330884 330830 330646 330104
60620 330104 329709 329797 330049 329878 329078 327938 326764 325471 323809 321960 320650 320527 321530 323006 324396 325641
60604 325641 326957 328389 329610 330163 329937 329446 329434 330083 330770 330872 330646 331026 332550 334826 337127 339126 340845
60587 340845 342172 342872 343069 343354 344184 345303 345998 345859 345129 344306 343724 343648 344486 346494 349391 352658 356287
60570 356287 360790 366328 372288 378137 384416 392349 402461 414019 425872 437465 448803 459773 469863
60557 469863 478419 484825 488385 488440 484927 478766 471416 463998 457035 450949 446414 443907 443255 444049 446361
60542 446361 450617 456895 464941 474902 487380 502439 519159 536519 554182 571834 588219 601619
60530 601619 611132 616831 618753 616550 610370 601471 591555 581753 572462 563810 555945 549019 543181 538514
60516E38514l619k922k543k251j837j204l53N56J299J868K507L401M541O022Q097
60501E52076J0710J3469J6346J9957K4701K9979L4864L9224M3586M8082N2173
60490H85167N5293N7101N7054N4387M8645L9797K7831J2870m125k1350l7056n0107
60478A125507n9630o4887o5872o3554n9104n3260m6727m0616l5794l2054k8528
60467E75481k4797k1146j7877j4923j2233j0032q556p802p609p683p524o711n400
60454D23188m246l675l482l307l143l125l091k824k569k880l740m330l925k793
60440C76058j861j591j569j227n73l2J68Q3k84r99j788k028j388k76N63Q21P47
60423C64824N97K94k49q13j070r37n41O5Q65J653K094K121J996J850J408M59o01
$$ plain form
60516 538514 534895 531973 529430 527179 525342 524138 523785 524341 525640 527508 530015 533416 537957 543979 552076
60501 552076 562786 576255 592601 612558 637259 667238 702102 741326 784912 832994 885167
60490 885167 940460 997561 1054615 1109002 1157647 1197444 1225275 1238145 1234020 1212670 1175614 1125507
60478 1125507 1065877 1000990 935118 871564 812460 759200 712473 671857 636063 604009 575481
60467 575481 550684 529538 511661 496738 484505 474473 465917 458115 450506 442823 435299 428588 423188
60454 423188 418942 415267 411785 408478 405335 402210 399119 396295 393726 390846 387106 382776 378851 376058
60440 376058 374197 372606 371037 369810 369237 369205 369373 369456 369172 368173 366385 364357 362969 362693 363256 364077 364824
60423 364824 365421 365715 365466 364653 363583 362646 362105 362170 363035 364688 366782 368903 370899 372749 374157 374616 374015
60406C74015j016n20L80R70J039R06R51J226J465J344Q62M14L92O71P39M39L50
60389C84627J130K577L723L887L342K823K609K434K140K033K414K999L175K714
60375D22627J994J481J275J257J362J435J165M67j27K9Q41J454J222L39n38j019
60359D35264j081p68j48O06J241J537J325O94K90R69K764M484M913M343M249N420
60343D66102O989P598O971N773M360K444J0k188l426l857m179m760n431n908n980
60328D64518n391m116k730k018k056k193k049j924j980j688p00K55J78p77j496
60313D35833j444j173j141r10J32J846L568M900N937P033Q628J0998J3937J6886
60299E05030J9476K1539K2570K1780J8981J4765R513K942m793j2190j7399j9823
$$ plain form
60406 374015 372999 372479 372859 373829 374868 375774 376725 377951 379416 380760 381622 382036 382428 383099 383838 384277 384627
60389 384627 385757 388334 392057 395944 399286 402109 404718 407152 409292 411325 413739 416738 419913 422627
60375 422627 424621 426102 427377 428634 429996 431431 432596 433063 432936 432965 433806 435260 436482 436821 436283 435264
60359 435264 434183 433415 433267 433873 435114 436651 437976 438670 438960 439929 442693 447177 452090 456433 460682 466102
60343 466102 473091 480689 487660 493433 497793 500237 500247 498059 494633 490776 486597 481837 476406 470498 464518
60328 464518 459127 455011 452281 450263 448207 446014 443965 442041 440061 438373 437673 437928 438106 437329 435833
60313 435833 434389 433216 432075 431165 431297 433143 436711 441611 447548 454581 463209 474207 488144 505030
60299 505030 524506 546045 568615 590395 609376 624141 633654 636596 631803 619613 602214 582391
60287E82391k0097j8937j6791j4299j2100j0183q150o153m808m206l773l245l032
60274D56617l421m073m592m941n074m779m153l693l558l354k842k313j942j484
60260D06398r64r61j626k114j736j089j138j633j480m37N58P79N19L15K34J95
60244C95820K69L05o5p22r62m36K82N26L82L09L60L78N47J071J617J756J828K589
60226D05854M006N072N019M219L629L679M018M041L481K664K282K687L380L505
60212D57536K943K508K928M009N069N858O615P407P903P830P379P029P000P003
60198E39017O564N640M723M195L795L070K174J612J356Q31p7p93j070j415k069
60183E67553k442k222k260l343m698m974m264l899m307m501l914l347l497l737
$$ plain form
60287 582391 562294 543357 526566 512267 500167 489984 481834 475681 470873 466667 462894 459649 456617
60274 456617 453196 449123 444531 439590 434516 429737 425584 421891 418333 414979 412137 409824 407882 406398
60260 406398 405434 404473 402847 400733 398997 397908 396770 395137 393657 393220 393778 394557 395076 395391 395625 395820
60244 395820 396089 396394 396329 395607 394645 394209 394491 395017 395399 395708 396068 396446 396993 398064 399681 401437 403265 405854
60226 405854 409860 414932 419951 424170 427799 431478 435496 439537 443018 445682 447964 450651 454031 457536
60212 457536 460479 462987 465915 469924 474993 480851 487466 494873 502776 510606 517985 525014 532014 539017
60198 539017 545581 551221 555944 560139 563934 567004 569178 570790 572146 572977 572900 572107 571037 569622 567553
60183 567553 565111 562889 560629 557286 552588 547614 543350 539451 535144 530643 526729 523382 519885 516148
60169E16148l134j958j187j129j323j501j779k070k056j796j802k342k934k754
60155D88383j474L12J562J794J481J350J487J528J467J620J924J985J851J931
60141E07201K103J834J387J825L347M677M792M355M546N261N530N123M588M041
60127E60610L075J783Q58O08O07M43J95J11L08P49J147J065N68M21J148K208K689
60110E78593K420J826J112M06J61N33O95k48j929l279m070m780n206m639l416
60095E58179k913l643m618m869m484l726k348m25J157J779J830J881J923K001
60081E41724K584L652M173L383J867O93J9o59j515k355l200m069m609m600m466
60066E32622m695n128n422n741o308o672o252n284m502m103l720l297l160l347
$$ plain form
60169 516148 513014 511056 509869 508740 507417 505916 504137 502067 500011 498215 496413 494071 491137 488383
60155 488383 486909 487221 488783 490577 492058 493408 494895 496423 497890 499510 501434 503419 505270 507201
60141 507201 509304 511138 512525 514350 517697 522374 527166 531521 536067 541328 546858 551981 556569 560610
60127 560610 563685 565468 566326 566934 567541 567984 568179 568290 568598 569347 570494 571559 572127 572548 573696 575904 578593
60110 578593 581013 582839 583951 584357 584518 585051 585746 585498 583569 580290 576220 571440 566234 561595 558179
60095 558179 555266 551623 547005 542136 537652 533926 531578 531153 532310 534089 535919 537800 539723 541724
60081 541724 544308 547960 552133 555516 557383 558076 558095 557436 555921 553566 550366 546297 541688 537088 532622
60066 532622 527927 522799 517377 511636 505328 498656 492404 487120 482618 478515 474795 471498 468338 464991
60052D64991l463l230k652j719m82O68J347J732K343L241L993M365M598M955N335
60037D86022N530N519N477N527N449M699L011R85l12o25q89k055l954n665o605
60022E02114o803o608o533p034p866q091p276o240n919o013n536m415l424k736
60008D17620j655m1J073Q03l59j225j344j229j402j744j785j309n62P1M90Q97
59992D08299J383J753J866J894K024K177K292K594L266M009M372M325M137L880
59978D48271L449K885K265J410J76j080j783j826j590j407j332j382j543j676
59964D44837j694j695j644j198k58O45J077J455K363L402L544K594J453R12Q79
59949D56672R39R72J019J179J748K870L888L748K288N53m53p09o50m08m3L3n50
$$ plain form
60052 464991 461528 458298 455646 453927 453445 454113 455460 457192 459535 462776 466769 471134 475732 480687 486022
60037 486022 491552 497071 502548 508075 513524 518223 521234 522219 521907 521282 520393 518338 514384 508719 502114
60022 502114 495311 488703 482170 475136 467270 459179 451903 445663 439744 433731 428195 423780 420356 417620
60008 417620 415965 415924 416997 417800 417441 416216 414872 413643 412241 410497 408712 407403 406841 406912 407402 408299
59992 408299 409682 411435 413301 415195 417219 419396 421688 424282 427548 431557 435929 440254 444391 448271
59978 448271 451720 454605 456870 458280 458456 457376 455593 453767 452177 450770 449438 448056 446513 444837
59964 444837 443143 441448 439804 438606 438348 438993 440070 441525 443888 447290 450834 453428 454881 455793 456672
59949 456672 457611 458583 459602 460781 462529 465399 469287 473035 475323 475876 475423 474714 474064 473656 473613 473646 473096
59932D73096j558k465l034l336l398l200k803k234j469o71j89n9J26O63J304J666
59916D52439J845K228K934L717M430N258O442P812Q748Q660P623O326N333M513
59902E28308L413J959M42r43k121k924l282l481l736l652k773j452n23p2O30J897
59886E11690L135L801M081M282M256L860L388L068K726K355K422L114L755L571
59872E59504K588J318m1j471k586k969k840k861l325l979m510m806m836m631m255
59857E20300l607k463j000J05M75O02J232K532M308O646R641J2641J4405J4124
59843E79941J1900Q402M450R28j409k247j679p6J850L123L084J769n18l647p271
59828E98600j0376j1909j1770j0648r042p091n251m337m628n498o123o157n617
$$ plain form
59932 473096 471538 469073 466039 462703 459305 456105 453302 451068 449599 448928 448739 448680 448806 449469 450773 452439
59916 452439 454284 456512 459446 463163 467593 472851 479293 487105 495853 504513 512136 518462 523795 528308
59902 528308 531721 533680 534122 533179 531058 528134 524852 521371 517635 513983 511210 509758 509235 509163 509793 511690
59886 511690 514825 518626 522707 526989 531245 535105 538493 541561 544287 546642 549064 552178 555933 559504
59872 559504 562092 563410 563369 561898 559312 556343 553503 550642 547317 543338 538828 534022 529186 524555 520300
59857 520300 516693 514230 513230 513335 513810 514412 515644 518176 522484 529130 538771 551412 565817 579941
59843 579941 591841 600243 604693 605621 604212 601965 600286 600210 602060 605183 608267 610036 609518 605871 598600
59828 598600 588224 576315 564545 553897 544855 537764 532513 528176 523548 518050 511927 505770 500153
59815E00153m612l456k592k124j644q20J43Q12J059J117J266J628K012J942J038
59800D95922m25j637k071k004k055k472l058l566l879l874l386k413j248l79j26
59785D63329l72o09m52o6K3m33j190j935k594l078l010k155r43j97k02l84r4O37
59767D46275J351J914K496K952K841K177J686J883K400K642K690K943L183K830
59753D80263K078J912K748L855M478M820N459O269O587O169N439M932M794M694
59739E44497M007K444O78j59J34M94J14l82L4J110J601R64j56r95j376j380j126
59722E50503r37j045j048m01N51Q38K82j83J28P57R80Q56R32J444K229L025L496
59705E62407L373K922K796L149L388L119K755K842L348M002M743N378N393M812
$$ plain form
59815 500153 495541 492085 489493 487369 485725 484905 485048 485860 486919 488036 489302 490930 492942 494884 495922
59800 495922 495497 493860 491789 489785 487730 485258 482200 478634 474755 470881 467495 465082 463834 463455 463329
59785 463329 462957 462348 461896 461830 461853 461420 460230 458295 455701 452623 449613 447458 446515 446318 446116 445732 445638 446275
59767 446275 447626 449540 452036 454988 457829 460006 461692 463575 465975 468617 471307 474250 477433 480263
59753 480263 482341 484253 487001 490856 495334 500154 505613 511882 518469 524638 530077 535009 539803 544497
59739 544497 548504 550948 551626 551467 551601 552095 552209 551827 551861 552971 554572 555536 555380 554385 553009 551629 550503
59722 550503 549566 548521 547473 547072 547623 548461 548743 548560 548688 549445 550425 551281 552213 553657 555886 558911 562407
59705 562407 565780 568702 571498 574647 578035 581154 583909 586751 590099 594101 598844 604222 609615 614427
59691F14427M566N232N922N316L420J339l66j953l286l594k765j823j633j926
59677F22876k128k370l053l977m642n047n598o377p055p381p270o567n219l663
59663E52529k612k302k346k293k029j555o84P07K292L352L390K617J838J762K491
59648E57157L592M507M712L777J748n53k103k738l244m201n278n946o360o909
59634E38161p321o977n933m939m392l986l438k923k611k392k299k534k869k638
59620D82909j750j062j276j970k376k551l109m086m878n118m876m098k611p81
59606D42367N45R51Q76R50J326J734J791J171n7j177j409q09j88k3n8mm2k93l70
59587D47281P6Q20J399J667J667J323O04k77j146k058k934l478l704m120m899
$$ plain form
59691 614427 618993 624225 630147 635463 638883 640222 639856 637903 634617 631023 628258 626435 624802 622876
59677 622876 620748 618378 615325 611348 606706 601659 596061 589684 582629 575248 567978 561411 556192 552529
59663 552529 549917 547615 545269 542976 540947 539392 538708 539415 541707 545059 548449 551066 552904 554666 557157
59648 557157 560749 565256 569968 573745 575493 574940 572837 570099 566855 562654 557376 551430 545070 538161
59634 538161 530840 523863 517930 512991 508599 504613 501175 498252 495641 493249 490950 488416 485547 482909
59620 482909 481159 480097 478821 476851 474475 471924 468815 464729 459851 454733 449857 445759 443148 442367
59606 442367 442912 443863 444739 445689 447015 448749 450540 451711 451654 450477 449068 448259 448071 448048 447990 447986 447944 447651 447281
59587 447281 447357 448177 449576 451243 452910 454233 454837 454560 453414 451356 448422 444944 441240 437120 432221
59572D32221n333m651l138j860j496j877k491k888k739k032j180n70j03M38Q68
59557D03169Q74O44N46M21j37q17o99N16J988K767K844K866L243L845M320M456
59541D30846M397M693N920Q089J0643J3170J5909J9324K3114K5693K4849J9394
59529F06041J0509J287n471r015j0184r796q105n538k889o19J386L070L866L390
59515E77932K015M32j000k232l381m863p139r867j1763j1864j0630r334q587p995
59501D91724p142o245n744n657n565n087m217l233k346j512o11K69R52J482K050
59486D49118K604K917L026L215L457L339K764K272K344K806L317M094N602P690
59472D98565R547J0430J0146Q830O718M088J260j423l521m591m605m019l214k108
$$ plain form
59572 432221 426888 422237 419099 417239 415743 413866 411375 408487 405748 403716 402536 401966 401863 402301 403169
59557 403169 404043 404687 405233 405654 405517 404700 404001 404517 406505 409272 412116 414982 418225 422070 426390 430846
59541 430846 435243 439936 445856 453945 464588 477758 493667 512991 536105 561798 586647 606041
59529 606041 616550 617837 612366 603351 593167 583371 575266 569728 566839 566220 567606 570676 574542 577932
59515 577932 579947 580379 579379 577147 573766 568903 561764 551897 540134 528270 517640 508306 499719 491724
59501 491724 484582 478337 472593 466936 461371 456284 452067 448834 446488 444976 444365 444634 445586 447068 449118
59486 449118 451722 454639 457665 460880 464337 467676 470440 472712 475056 477862 481179 485273 490875 498565
59472 498565 508112 518542 528688 537518 544236 548324 549584 548161 544640 540049 535444 531425 528211 526103
59458E26103n67J133K680M247O085P813Q730Q845Q971R684J0714J1485J1756J1477
59444F29156J0515Q902P050N268L253M60l086o652r409j0976j1335j0594r060
59431F03492p391o346o240o724p197p393p389p166o382m734k354K72K684M744
59417E41876O653Q764J1225J3768J6020J8084K0541K3780K7451L0471L1112K7273
59405G77018J7700L788j0322k0348k4646k4269k0798j5047p555P56Q629J4356
59393F99262J5494R955j632j5159k5598l0465l0647k8374k5147k1461j7608j4087
59381E14533j1290r095o992m699k546j085m08j47kJ81P81K194M005N021M607L504
59365D98562K843K791K779K600K567K796L104L553M383N394O119O651P619R135
$$ plain form
59458 526103 525536 526669 529349 533596 539681 547494 556224 565069 574040 583724 594438 605923 617679 629156
59444 629156 639671 648573 655623 660891 664144 664604 661518 654866 645457 634481 623146 612552 603492
59431 603492 596101 589755 583515 576791 569594 562201 554812 547646 541264 536530 534176 534448 537132 541876
59417 541876 548529 557293 568518 582286 598306 616390 636931 660711 688162 718633 749745 777018
59405 777018 794718 798506 788184 767836 743190 718921 698123 683076 675521 676277 684906 699262
59393 699262 714756 724711 723079 707920 682322 651857 621210 592836 567689 546228 528620 514533
59381 514533 503243 494148 487156 482457 479911 478826 478418 478271 478269 478450 479231 481425 485430 490451 495058 498562
59365 498562 501405 504196 506975 509575 512142 514938 518042 521595 525978 531372 537491 544142 551761 560896
59351E60896J0480J1117J1465J2254J3603J5105J6428J7455J8148J8599J8992
59340G24542J9255J9069J8386J7497J6365J4412J1401P975M848J869j407m662
59328H49550p093q573r712j0870j1831j2466j2995j3409j3360j2785j2100j1583
59316G12773j1130j0772j0714j0710j0044q594p196o535o234n573m466l136j399
59303F16270R38L364N266P031R724J3666J7917K1097K1932J9295J2794L758n142
59290G47910j1766j5694j7456j7400j5729j3104j0421q103n988l787j422Q58K545
59277F30443L272L349L600M441N491O320P136Q334R694J0633J1017J1222J1406
59264G26358J1218J0247Q392N845L003L56j925m219o943r768j1857j2874j3355
$$ plain form
59351 560896 571376 582493 593958 606212 619815 634920 651348 668803 686951 705550 724542
59340 724542 743797 762866 781252 798749 815114 829526 840927 848902 853750 855619 854212 849550
59328 849550 842457 833884 824172 813302 801471 789005 776010 762601 749241 736456 724356 712773
59316 712773 701643 690871 680157 669447 659403 650809 643613 637078 630844 625271 620805 617669 616270
59303 616270 617208 620572 625838 632869 642593 656259 674176 695273 717205 736500 749294 753052 747910
59290 747910 736144 720450 702994 685594 669865 656761 646340 638237 632249 628462 627040 627898 630443
59277 630443 633715 637064 640664 645105 650596 656916 664052 672386 682080 692713 703730 714952 726358
59264 726358 737576 747823 756215 762060 765063 765419 763494 759275 752332 742564 730707 717833 704478
59251G04478j3898j4405j4352j3489j2030j0355q727p241n869m655l809l392k961
59238E89295j918l54Q78J280J464K362L831M682M160K828J715J006N7j492l167
59223F06627m408n366o552p925q825q910q575q244p671o472n018m100l764l195
59209E17602j969p58k85j91M32J671K760L227L407L612L609L167K607K284J968
59194E43143J291N31M46J279K522L636M634N664O477O655O315O135O608P401P729
59179F10466P282O567O216O159N784M816L673K864K374J941J589J509J584J546
59165F64370J591K317L868N476O214N949N324M880M582M128L338K060O9k607n256
59150G06303o850p105o914p414q643r512r137p774o299n232m604m380m498m594
$$ plain form
59251 704478 690580 676175 661823 648334 636304 625949 617222 609981 604112 599457 595648 592256 589295
59238 589295 587377 587023 587901 589181 590645 593007 596838 601520 605680 608508 610223 611229 611286 609794 606627
59223 606627 602219 596853 590301 582376 573551 564641 556066 547822 540151 533679 528661 524561 520797 517602
59209 517602 515633 514875 514590 514399 514831 516502 519262 522489 525896 529508 533117 536284 538891 541175 543143
59194 543143 544434 544965 545411 546690 549212 552848 557482 563146 569623 576278 582593 588728 595336 602737 610466
59179 610466 617748 624315 630531 636690 642474 647290 650963 653827 656201 658142 659731 661240 662824 664370
59165 664370 665961 668278 672146 677622 683836 689785 695109 699989 704571 708699 712037 714097 714166 711559 706303
59150 706303 699453 692348 685434 678020 669377 659865 650728 642954 636655 631423 626819 622439 617941 613347
59136F13347m268l597k981k469j704n78M98J188J666K308L182M014M522M719N017
59121F24864N902P231Q094P850P131P087P780Q219Q061Q241R354J0436J0210Q887
59107G39347P738P236O667N439L893K666J957J573J227O19l86j552k528l222l660
59092G67014l774l682l839m369m557l698k274j494j750k355k841l592m938o385
59078G17466p291p701q098q677r239r527r406q987q662q672q610p871o608n670
59064F02447n396n214m718m421m831n417n273m475m018m441n196n473n130m639
59050E33805m404m357m110l375k299j340p80n12k74J1K68M51O26R27J441J998
59034E18076K207J878J389J320J786K408K889L252L641M300N683P999J0586J2378
$$ plain form
59136 613347 609079 605482 602501 600032 598328 597750 598248 599436 601102 603410 606592 610606 615128 619847 624864
59121 624864 630766 637997 646091 653941 661072 668159 675939 684158 692219 700460 709814 720250 730460 739347
59107 739347 747085 754321 760988 766427 770320 772986 774943 776516 777743 778362 777976 776424 773896 770674 767014
59092 767014 763240 759558 755719 751350 746793 743095 740821 739327 737577 735222 732381 728789 723851 717466
59078 717466 710175 702474 694376 685699 676460 666933 657527 648540 639878 631206 622596 614725 608117 602447
59064 602447 597051 591837 587119 582698 577867 572450 567177 562702 558684 554243 549047 543574 538444 533805
59050 533805 529401 525044 520934 517559 515260 513920 513140 512628 512354 512365 512633 513084 513710 514637 516078 518076
59034 518076 520283 522161 523550 524870 526656 529064 531953 535205 538846 543146 548829 556828 567414 579792
59020E79792J3094J3493J4197J4955J5283J5150J4587J3237J0872P937N019K153
59008G19769q03l403m891n114m636m021l339k351q67J052K966M298M824M741M161
58993G12386K943J189n85k111l666n314o397o399n908n947o589p032o935o875
58979F52760p280p633p058n304k842k79K037L956N388O314O870P352P985Q734
58965F71000R439J0086J0709J1108J1018J0521R878Q910P190M865K684R01j131
58952G67178l877o796r101j0780j2177j3127j3273j2875j2464j1916j0651q632
58940F41509o546m980m002l424k971k317j443q63r94j539j861j860j941k393l261
58925F01114m461n474n398m019k499k140k811l442l663l876l914l013j262J34
$$ plain form
59020 579792 592886 606379 620576 635531 650814 665964 680551 693788 704660 712597 717616 719769
59008 719769 718966 715563 710672 705558 700922 696901 693562 691211 690344 691396 694362 698660 703484 708225 712386
58993 712386 715329 716518 715933 713822 710156 704842 698445 692046 686138 680191 673602 666570 659635 652760
58979 652760 645480 637847 630789 625485 622643 622364 624401 628357 633745 640059 646929 654281 662266 671000
58965 671000 680439 690525 701234 712342 723360 733881 743759 752669 759859 764724 767408 768309 767178
58952 767178 763301 756505 747404 736624 724447 711320 698047 685172 672708 660792 650141 641509
58940 641509 634963 629983 625981 622557 619586 617269 615826 614963 613969 612430 610569 608709 606768 604375 601114
58925 601114 596653 591179 585781 581762 579263 577123 574312 570870 567207 563331 559417 556404 555142 555276
58911E55276L86rk04P0Q12K014L194L631L530M125O081Q633J0773J2500J4143
58896F24955J5315J5411J4616J3490J2035J0085Q275P717Q698J0498J2467J4474
58884G68036J6288J7249J6959J5780J4305J2617J0361P395M076R10j934m704p683
58871H69655j0738j3302j4797j5028j4224j2857j1423j0236r323q521p753p101
58859G34352o696o577o645o723o698o727p099p790q369q496q329q115p688o773
58845F31627n632m942n002n428n656n500n197n166n626o264o437n935n355n341
58831E54146n722n800n284m404l415k485j934j898j854j102K73J495K085K193
58817E26294K062J807J760K224K812K684J652M82q2N3O77J632K596L150L255L160
$$ plain form
58911 555276 555662 555653 555449 555519 556331 558345 561539 565170 568700 572825 578906 587539 598312 610812 624955
58896 624955 640270 655681 670297 683787 695822 705907 714182 721899 730597 741095 753562 768036
58884 768036 784324 801573 818532 834312 848617 861234 871595 878990 883066 883976 882042 877338 869655
58871 869655 858917 845615 830818 815790 801566 788709 777286 767050 757727 749206 741453 734352
58859 734352 727656 721079 714434 707711 701013 694286 687187 679397 671028 662532 654203 646088 638400 631627
58845 631627 625995 621053 616051 610623 604967 599467 594270 589104 583478 577214 570777 564842 559487 554146
58831 554146 548424 542624 537340 532936 529521 527036 525102 523204 521350 520248 520521 522016 524101 526294
58817 526294 528356 530163 531923 534147 536959 539643 541295 541777 541695 541748 542425 544057 546653 549803 553058 556218
58801E56218K743J611r3j638k564k975k895k228j544j909l454m922n085l998k473
58786E24794j017J55Q59J243J860K920L984M776N650O783P577P472O724N776M479
58771E84035K658Q21n25j775l556n536o787p133p273p606p722p205o216n154m137
58756E16889l029j759m90M16P24O71Q33J476K326L023L472L598L224K499K081
58741E35954K585M061O061P897Q809Q521P741P541Q029Q365Q227Q356R176R869
58727F41192R481Q197O736N182L334J559L26p08k223m052n315n499m733l247j302
58712F48928N74J969L053M051M597M220L116J787K81j467l026m125n521q091j1238
58697F39108j3283j3582j3238j3519j4431j5045j4536j2657r895p389o105n863
$$ plain form
58801 556218 558961 560572 560479 558841 556277 553302 550407 548179 546635 544726 541272 536350 531265 527267 524794
58786 524794 523777 523932 524791 526034 527894 530814 534798 539574 545224 552007 559584 567056 573780 579556 584035
58771 584035 586693 587514 586989 585214 581658 576122 569335 562202 554929 547323 539601 532396 526180 521026 516889
58756 516889 513860 512101 511611 512027 512751 513422 514255 515731 518057 521080 524552 528150 531374 533873 535954
58741 535954 538539 542600 548661 556558 565367 573888 581629 589170 597199 605564 613791 622147 631323 641192
58727 641192 650673 658870 665606 670788 674122 675681 676007 675299 673076 669024 663709 658210 653477 650230 648928
58712 648928 649502 651471 654524 658575 663172 667392 670508 672295 672576 671109 668083 663958 658437 650346 639108
58697 639108 625825 612243 599005 585486 571055 556010 541474 528817 518922 511533 505428 499565
58685D99565n667n006m293l936l778l604l540l581l333k611j889j688j807j548
58671D53284n96O49J647K405L429M935O370P139P634Q934J1211J3119J3192J1308
58657E44660Q260M502K99l438n564o079o142o531o845o435n489m740m558m677
58643D97223m581m009l224k891l396m266m477l467j707j85N94J034J814K848L208
58628D74518K387J226Q88J163Q14l60j043m47N04P89R36J878L096L416L044L408
58612D96217N012O767P488P037N894M564L533K995K565J857J163R39R22N75R7
58597E47625m9k33j172k466k910k265j508j199p78J91J306K265L491N293P197
58582E54788Q660R717J0516J0869J0707J0305R739Q694P154N699M806M438M524
$$ plain form
58685 499565 493898 488892 484599 480663 476885 473281 469741 466160 462827 460216 458327 456639 454832 453284
58671 453284 452688 453337 454984 457389 460818 465753 472123 479262 486896 495830 507041 520160 533352 544660
58657 544660 552920 557422 557721 554283 548719 542640 536498 529967 523122 516687 511198 506458 501900 497223
58643 497223 492642 488633 485409 482518 479122 474856 470379 466912 465205 465020 465614 466648 468462 471310 474518
58628 474518 476905 478131 479019 480182 480996 480636 479593 479146 479650 480439 481375 483253 486349 489765 492809 496217
58612 496217 501229 507996 515484 522521 528415 532979 536512 539507 542072 543929 545092 546031 546953 547528 547625
58597 547625 547576 547343 546171 543705 540795 538530 537022 535823 535045 535236 536542 538807 542298 547591 554788
58582 554788 563448 573165 583681 594550 605257 615562 625301 633995 641149 646848 651654 656092 660616
58569F60616N222O425P634Q702J0171J2538J5603J8783K1638K3946K5762K7469
58557H44509K9223L0293K9570K6918K3312J9562J5584J1178O785K968k33l036
58545A036633n386p087q187q953r722j0862j2638j5044j7911k1033k3883k5612
58533H70315k5846k5204k4432k3349k1405j8863j6509j4382j1893r102o774n189
58521F67367l911k850k331k056j127M71J550J295K42p34j425j842j730j077l95
58506F51447rJ76l3j113k719l583l122k289k177k566k571j989j216l90N82J522
58490F29950K097K272K275K385K993M338O002P204P884Q886J0788J3128J5212
58477G15414J7031J8927K0748K1809K1452J9471J6264J2564Q692M220j075o198
$$ plain form
58569 660616 665838 672263 679897 688599 698770 711308 726911 745694 767332 791278 817040 844509
58557 844509 873732 904025 933595 960513 983825 1003387 1018971 1030149 1036934 1039902 1039669 1036633
58545 1036633 1031247 1024160 1015973 1007020 997298 986436 973798 958754 940843 919810 895927 870315
58533 870315 844469 819265 794833 771484 750079 731216 714707 700325 688432 679330 672556 667367
58521 667367 663456 660606 658275 656219 655092 655563 657113 658408 658650 657916 656491 654649 652919 651842 651447
58506 651447 651438 651614 651581 650468 647749 644166 641044 638755 636578 634012 631441 629452 628236 627846 628428 629950
58490 629950 632047 634319 636594 638979 641972 646310 652312 659516 667400 676286 687074 700202 715414
58477 715414 732445 751372 772120 793929 815381 834852 851116 863680 872372 876592 875517 869319
58465H69319r681j1230j1796j2122j2153j1783j1046r458o424k460J054L578N761
58452G81559P973R735J0879J1816J2217J0797P194K717j390n254r089j2012j3187
58439H13955j3124j2719j1846j0000p539n276l342j450K97J659K835M062N105
58426G62617N806O597P882R460J1088J2935J4837J5779J4800J1999Q156L949j6
58413H85889l090n122o619p991r116r840j0195r977r041q093q063q488p816n684
58399G76754l504k278j264L98K200L397M304N399O162N969N159M300L288K069
58385H12353J276J217J129L88m84q32q21n29P03K971N004N766N922O562P472P822
58369H55919P625P417P302P344P995R214J0059J0149J0416J1553J2868J3677J4445
$$ plain form
58465 869319 859638 848408 836612 824490 812337 800554 789508 780050 773626 771166 772220 775798 781559
58452 781559 789532 799267 810146 821962 834179 844976 852170 854887 853497 848243 839154 827142 813955
58439 813955 800831 788112 776266 766266 758727 753451 750109 748659 748956 750615 753450 757512 762617
58426 762617 768423 775020 782902 792362 803450 816385 831222 847001 861801 873800 881956 885905 885889
58413 885889 882799 877677 871058 863067 853951 844111 833916 823939 814898 806805 798742 790254 782438 776754
58399 776754 773250 770972 769708 770106 772306 775703 780007 785406 791568 797537 802696 806996 810284 812353
58385 812353 813629 814846 815975 816363 815879 815047 814226 813697 814400 817371 822375 828141 834063 840625 848097 855919
58369 855919 863544 870961 878263 885607 893602 902816 912875 923024 933440 944993 957861 971538 985983
58356I85983J5391J5396J3740J1601J0241Q947O453L305J090J82l9M05J763L346
58342A077804M350N150O490Q015R158J0472J2574J4592J5387J5488J6058J6765
58330A212303J6499J5607J5426J5927J5680J4025J1670R283O872M554K755J690
58318A342291J425K008K923L227K961L382M971O553P427Q707J1179J3441J3970
58305A424465J3600J4033J5161J5901J6509J7824J9217J9436J8828J8688J9087
58294A612749J9175J8924J8874J8850J8582J8753J9828K0900K1205K1630K3119
58283A832589K4884K5873K6535K7432K7781K7304K7697L0058L2737L4027L5053
58272B151970L7459M0258M1874M3306M6125M9137N0540N1670N5040O0006O4037
$$ plain form
58356 985983 1001374 1016770 1030510 1042111 1052352 1061299 1067752 1071057 1072147 1072329 1072290 1072695 1074458 1077804
58342 1077804 1082154 1087304 1093794 1101809 1110967 1121439 1134013 1148605 1163992 1179480 1195538 1212303
58330 1212303 1228802 1244409 1259835 1275762 1291442 1305467 1317137 1326420 1333292 1337846 1340601 1342291
58318 1342291 1343716 1345724 1348647 1351874 1354835 1358217 1363188 1369741 1377168 1385875 1397054 1410495 1424465
58305 1424465 1438065 1452098 1467259 1483160 1499669 1517493 1536710 1556146 1574974 1593662 1612749
58294 1612749 1631924 1650848 1669722 1688572 1707154 1725907 1745735 1766635 1787840 1809470 1832589
58283 1832589 1857473 1883346 1909881 1937313 1965094 1992398 2020095 2050153 2082890 2116917 2151970
58272 2151970 2189429 2229687 2271561 2314867 2360992 2410129 2460669 2512339 2567379 2627385 2691422
58261B691422O7030P0726P4948P8067Q0133Q2027Q2545Q0065P6038P3293P1858
58250C528152P0161O9032P0614P4387P8268Q2628Q9177R7021J03905J10290J18067
58239D491702J26499J33774J41241J51505J63560J74487J84620J96242K08701
58230E972331K20042K31960K47588K65741K83059L00545L21962L47194L73438
58221H563860M01619M35080M73093N12562N54846O03999O59767P19715P86608
58212A3711149Q65744R56936J057771J172927J310850J473329J658909J874951
58204B4082566K135190K447312K815752L255971L793328M450168N249763O232437
58196E4462487P451769Q957992J0808996J3103189J5979392J9570990K3958006
$$ plain form
58261 2691422 2758452 2829178 2904126 2982193 3062326 3144353 3226898 3306963 3383001 3456294 3528152
58250 3528152 3598313 3667345 3737959 3812346 3890614 3973242 4062419 4159440 4263345 4373635 4491702
58239 4491702 4618201 4751975 4893216 5044721 5208281 5382768 5567388 5763630 5972331
58230 5972331 6192373 6424333 6671921 6937662 7220721 7521266 7843228 8190422 8563860
58221 8563860 8965479 9400559 9873652 10386214 10941060 11545059 12204826 12924541 13711149
58212 13711149 14576893 15533829 16591600 17764527 19075377 20548706 22207615 24082566
58204 24082566 26217756 28665068 31480820 34736791 38530119 42980287 48230050 54462487
58196 54462487 61914256 70872248 81681244 94784433 110763825 130334815 154292821
58189A54292821K9118586L4813103M0387486M4623837M5834053M2326364L3197141
58182D24593391J9108004K456252j3460823k5923198l3868525l7806867l8863472
58175B96234762l7936242l5552863l2149121k8220817k4223517k0458837j7087132
58168A00606233j4182419j1750912r746635q109356o786178n721858m856211m142278
58160C5310386l552837l065294k654930k305850k013778j772969j570906j398041
58152A6975781j251916j129180j022908r29370q48600p77148p08772o43014n84644
58143I080229n33958m85803m38763l96860l61239l28360k97971k74995k61345
58134E700935k52451k43914k35511k27045k16326k03239j90600j79277j67223
$$ plain form
58189 154292821 183411407 218224510 258611996 303235833 349069886 391396250 424593391
58182 424593391 443701395 446157647 432696824 406773626 372905101 335098234 296234762
58175 296234762 258298520 222745657 190596536 162375719 138152202 117693365 100606233
58168 100606233 86423814 74672902 64926267 56816911 50030733 44308875 39452664 35310386
58160 35310386 31757549 28692255 26037325 23731475 21717697 19944728 18373822 16975781
58152 16975781 15723865 14594685 13571777 12642407 11793807 11016659 10307887 9664873 9080229
58143 9080229 8546271 8060468 7621705 7224845 6863606 6535246 6237275 5962280 5700935
58134 5700935 5448484 5204570 4969059 4742014 4525688 4322449 4131849 3952572 3785349
58125C785349j54413j43798j36117j28574j19873j12085j06301j00837r4907q9992
58115B598452q6341q2042p6569p1714o8053o4059n9343n5383n2440m9112m5486
58104A887910m3307m2646m1708m0178l9469l9497l8729l7490l7623l8652l8009
58093A450602l5413l3360l2814l2033l0191k8533k7238k4757k1130j8549j7727
58082A148857j6941j5484j4786j5309j5566j5222j6050j8627k1021k1813k1764
58071I56274k1569k0675j9221j8482j8483j7758j6150j5232j5220j4334j2067
58060G67083j0244r877r683q780q207q685r346r753j0784j2402j2959j1786j0277
58047F34300r440q548p117n935n281m454l735m443o250o973n961n094n431n582
$$ plain form
58125 3785349 3630936 3487138 3351021 3222447 3102574 2990489 2884188 2783351 2688444 2598452
58115 2598452 2512111 2430069 2353500 2281786 2213733 2149674 2090331 2034948 1982508 1933396 1887910
58104 1887910 1844603 1801957 1760249 1720071 1680602 1641105 1602376 1564886 1527263 1488611 1450602
58093 1450602 1415189 1381829 1349015 1316982 1286791 1258258 1231020 1206263 1185133 1166584 1148857
58082 1148857 1131916 1116432 1101646 1086337 1070771 1055549 1039499 1020872 999851 978038 956274
58071 956274 934705 914030 894809 876327 857844 840086 823936 808704 793484 779150 767083
58060 767083 756839 746962 737279 728499 720292 711607 702261 692508 681724 669322 656363 644577 634300
58047 634300 624860 616312 609195 603260 597979 593525 589790 585347 579097 572124 566163 561069 555638 550056
58033E50056m652m093n035o265o539o782q178r963j0837j0904j0766j0296r503
58020D46243r049q787p549n406m140m403m508l336k228k459k936k344j577k026
58006C85495k997l014k388k442l113l292k858k648k877k963k558j692l26J415
57992C53742L180M961O947Q474Q373O773N242M533L695K052M27m88j289k452l334
57977D00836l660m381n868o818o255n177m842m776l982k801k109j777j350j249
57963C45791j754j873o92R86J788J719J665J667J157K95l00o86j328k053k259
57948C44123j781q52K99J223J355R95J324K848M714O161P580R365J0900J1542
57934C99796J1648J1777J1820J1688J1697J1548J0188P505M838K882N34l070o839
$$ plain form
58033 550056 545404 541311 536276 530011 523472 516690 508512 498549 487712 476808 466042 455746 446243
58020 446243 437194 428407 420858 415452 411312 406909 402401 399065 396837 394378 391442 389098 387521 385495
58006 385495 382498 379484 377096 374654 371541 368249 365391 362743 359866 356903 354345 352653 352327 353742
57992 353742 356922 361883 368830 377304 385677 392450 397692 402225 405920 407972 408399 407911 406622 404170 400836
57977 400836 397176 392795 386927 380109 373854 368677 363835 359059 355077 352276 350167 348390 347040 345791
57963 345791 344037 342164 341472 342458 344246 345965 347630 349297 350454 350749 350449 349763 348435 346382 344123
57948 344123 342342 341490 341789 343012 344367 345362 346686 349534 354248 360409 367989 377354 388254 399796
57934 399796 411444 423221 435041 446729 458426 469974 480162 487667 492505 495387 495921 492851 486012
57921D86012r404j1068j2662j3767j3707j3129j2931j2629j1450j0087r579r336
57909C46263q124o252m965m218k996j486r74j698k512k745k824k978k806k316
57895B99369k000j692n28J635L743M827M949M767M773N107N500N417M651L633
57881C44151K807K022J068K17l52j158k721m624n994o560o710o812o980p080o611
57866B94663n186l419k502k532k322j343n91o92n47R63L062M304M737N335O060
57851B99990O088N482N091N065M767L962K917J581k37k114l443m340n169n624
57837C14016n223m324l642l201k707k380k429k250j284r4N79J220K616M112M348
57822B99357L446K923L429L986L693K962K750L407M498N189M808L464J859J80
$$ plain form
57921 486012 476608 465540 452878 439111 425404 412275 399344 386715 375265 365178 355599 346263
57909 346263 338139 331887 326922 322704 319708 318222 317248 315550 313038 310293 307469 304491 301685 299369
57895 299369 297369 295677 295149 296784 300527 305354 310303 315070 319843 324950 330450 335867 340518 344151
57881 344151 346958 348980 350048 350265 349913 348755 346034 341410 335416 328856 322146 315334 308354 301274 294663
57866 294663 289477 286058 283556 281024 278702 277359 276768 276076 275529 276492 279554 283858 288595 293930 299990
57851 299990 306078 311560 316651 321716 326483 330445 333362 334943 334706 332592 329149 324809 319640 314016
57837 314016 308793 304469 300827 297626 294919 292539 290110 287860 286576 286482 287061 288281 290897 295009 299357
57822 299357 302803 305726 309155 313141 316834 319796 322546 325953 330451 335640 340448 343912 345771 345951
57808C45951k115m988p235q112q433r032r187p993o242n352n138m450l333k778
57794B61563k726k205j235p94j005j166j310j986k541j601N86K195K475K573L333
57779B56156M163M595N241O371P128P023O800P028O996N936M340L150K466J746
57765C29139O84p03k230l454m054m469n395o537o818n929m689l759l070k696k980
57750B73040l537l356k396j826k209k631k242j484j069q33m59l41q23j403j539
57735B46892j595k126k805k892k332j696j379j347j328q94J73J256J283J32r44
57720B30398q36N0N03P3o87j156j243j191j249j512j831k012k080k164k206k129
57704B10728k158k490k782k534j925j605j736j923j962j961j749r86N5O59O37
$$ plain form
57808 345951 343836 338848 331613 323501 315068 306036 296849 288856 282614 277262 272124 267674 264341 261563
57794 261563 258837 256632 255397 254603 253598 252432 251122 249136 246595 244994 245580 247775 250250 252823 256156
57779 256156 260319 264914 270155 276526 283654 290677 297477 304505 311501 317437 321777 324927 327393 329139
57765 329139 329823 329120 326890 323436 319382 314913 309518 302981 296163 290234 285545 281786 278716 276020 273040
57750 273040 269503 266147 263751 261925 259716 257085 254843 253359 252290 251457 250998 250657 249834 248431 246892
57735 246892 245297 243171 240366 237474 235142 233446 232067 230720 229392 228498 228671 229927 231210 231342 230398
57720 230398 229562 229612 230115 230188 229501 228345 227102 225911 224662 223150 221319 219307 217227 215063 212857 210728
57704 210728 208570 206080 203298 200764 198839 197234 195498 193575 191613 189652 187903 186917 186972 187631 188268
57689A88268L99N1o27j300j262n94j72j99J18J154K250K985L956N662P604R322
57673B17615J1458J4904J9559K4841L0980L8885M8947O0591P2568Q2759Q7562
57662G10669Q2480O4452L4509j526l5363o0269p3756p7167p3437o5537n5973m6404
57650D02678l7505k9637k3413j9037j5684j2478r717q080p086n683m078l412l657
57637B23211l419k156r70p35r23q95r50j321j393q13k86m26p55o80m92o51r38
57620B05408j175j805k923l569k939j619p25m66l75l14m16n71p02j068j678j956
57604A83107j561r33m72N3P60J129R12O81O99K09j269k751l037k470k260k622
57588A70175k730k222j622j354j329j417j624j803j779j652j502j156o27m39r65
$$ plain form
57689 188268 188667 188718 188091 186791 185529 184935 184763 184564 184682 185836 188086 191071 195027 200689 208293 217615
57673 217615 229073 243977 263536 288377 319357 358242 407189 467780 540348 623107 710669
57662 710669 793149 857601 892110 890584 855221 794952 721196 644029 570592 505055 449082 402678
57650 402678 365173 335536 312123 293086 277402 264924 255207 247127 240041 234358 230280 226868 223211
57637 223211 219792 217636 216666 215931 215008 214113 213163 211842 210449 209636 209350 208924 208169 207489 206997 206346 205408
57620 205408 204233 202428 199505 195936 192997 191378 190653 190187 189812 189498 189082 188511 187809 186741 185063 183107
57604 183107 181546 180613 180141 180194 180954 182083 182995 183676 184375 184584 183315 180564 177527 175057 172797 170175
57588 170175 167445 165223 163601 162247 160918 159501 157877 156074 154295 152643 151141 149985 149358 148919 147954
57573A47954j828k433k654k605k235j713j574j955k227j980j685j818k006j761
57559A19480j333j093p40K3O93P23M88N55O45L57K66J140K449K909K270J382P12
57542A30926o8j024j605j467q24Q7J147J960K112J782J434R95N9j117j676j296
57526A31425n92k31k94m92n50k80L08Q93J234J548K221L205M026M155L263J533
57510A51372k2j87J100K486K773K176J517R80L82k7J9O9m42j232j729k105k864
57493A54266l721l916l361k611j917j216p54q02r62o59j64j60n90q06p14p40q69
57476A30304p04l64l68o50o46k88n4j23l30q20j731k410k023r85n92j157j621
57459A15438j204l71J18J43j81q57j524j469n83L21N60L55K80M73P50R97J167
$$ plain form
57573 147954 146126 143693 141039 138434 136199 134486 132912 130957 128730 126750 125065 123247 121241 119480
57559 119480 118147 117054 116314 116337 117030 117753 118241 118796 119441 119798 120064 121204 123653 126562 128832 130214 130926
57542 130926 130858 129834 128229 126762 125938 126025 127172 129132 131244 133026 134460 135455 135514 134397 132721 131425
57526 131425 130833 130602 130308 129816 129266 128986 129294 130187 131421 132969 135190 138395 142421 146576 149839 151372
57510 151372 151350 151163 152263 154749 157522 159698 161215 162195 162577 162550 162569 162638 162196 160964 159235 157130 154266
57493 154266 150545 146629 143268 140657 138740 137524 136770 135968 135006 134347 134183 134023 133433 132627 131913 131173 130304
57476 130304 129600 129236 128868 128218 127572 127284 127230 127107 126777 125957 124226 121816 119793 118808 118216 117059 115438
57459 115438 114234 113863 113981 114124 113943 113086 111562 110093 109510 109831 110391 110746 111026 111499 112249 113246 114413
57442A14413J206J160J010M96m13j055p09K90Q11L78l18m16J36P44Q21K62l56
57425A18460k27O92J407J135L44j15l56r61j644j563p49k1L39O68Q96O29K28L36
57407A19498N06k34j379j198N88K068J784N72n4mj6k26m00o89j076q87J57J163
57389A20173J229P67O21O68L57NL85J312J802J491R47O45M53J53j81l86l07J39
57371A30273O06L45q85k173k385j534o55m62p41r29p61k94J79K50j58m52N7J239
57353A21520K166K170J541J074J121J323J147N66N3q5j14m06p75o82j8P45J188
57336A32534J274J023L95l52o86m73j71j10k3L87P60M89l75j030p88J79J016J059
57318A35108M57j41m48p42j101j032k64N85P63M60M03O30N78K29J96O36R97R80
$$ plain form
57442 114413 115619 116779 117789 118285 117872 116817 116108 116398 117209 117587 117269 116853 116989 117733 118554 118816 118460
57425 118460 118233 118925 120332 121467 121811 121696 121340 120379 118735 117172 116423 116402 116741 117409 118305 118934 119162 119498
57407 119498 120004 119770 118391 117193 117781 119849 121633 122205 122151 122147 122131 121905 121505 120816 119740 118853 119010 120173
57389 120173 121402 122169 122790 123458 123815 123820 124205 125517 127319 128810 129757 130402 130855 131008 130827 130441 130134 130273
57371 130273 130879 131224 130339 128166 125781 124247 123592 123130 122389 121460 120699 120405 120584 120834 120676 120224 120281 121520
57353 121520 123686 125856 127397 128471 129592 130915 132062 132628 132681 132596 132482 132076 131301 130619 130601 131346 132534
57336 132534 133808 134831 135226 134874 134188 133715 133544 133434 133411 133798 134558 135047 134672 133642 132854 133033 134049 135108
57318 135108 135565 135424 134976 134234 133133 132101 131837 132422 133185 133645 134048 134678 135256 135485 135681 136317 137314 138294
57300A38294R30J035J031Q25O50L99k33q23m82O44J247P69K74O93J309R95Q9j48
57282A47498N09J042P71J14k09j7M15P89J013J309J978K892L475L402K974K590
57266A70545K265J930J771J851J871J631J381J352J375J270J151J046O91J34p4
57251A90190L74J070J596K053K481K418J724J193J572K426K777K489K265K529
57237B17157L014L314L212K624J812J440J887K654K949K709K556L020M179N816
57223B58343P362Q017P519O602O196O381O634O794P155P780Q372Q756Q989R057
57209C63957Q887Q603Q452Q548Q936R690J0554J0914J0512R899R739J0011J0341
57196D89043J0760J1511J2391J2879J2834J2479J1916J1164J0633J0889J1935
$$ plain form
57300 138294 139224 140259 141290 142115 142765 143164 142931 142108 141626 142270 143517 144286 144560 145253 146562 147557 147646 147498
57282 147498 148007 149049 149820 149934 149725 149708 150123 150912 151925 153234 155212 158104 161579 164981 167955 170545
57266 170545 172810 174740 176511 178362 180233 181864 183245 184597 185972 187242 188393 189439 190130 190264 190190
57251 190190 190564 191634 193230 195283 197764 200182 201906 203099 204671 207097 209874 212363 214628 217157
57237 217157 220171 223485 226697 229321 231133 232573 234460 237114 240063 242772 245328 248348 252527 258343
57223 258343 265705 273722 281241 287843 294039 300420 307054 313848 321003 328783 337155 345911 354900 363957
57209 363957 372844 381447 389899 398447 407383 417073 427627 438541 449053 458952 468691 478702 489043
57196 489043 499803 511314 523705 536584 549418 561897 573813 584977 595610 606499 618434
57185F18434J3007J3198J2136J0262Q619Q019Q268Q535Q645R345J1049J3002J4284
57172G56803J4964J5551J5862J5368J4277J3395J3132J3339J3968J5014J6013
57161I17686J6270J5621J4435J3072J1923J1663J2632J4153J5199J5628J6074
57150A074356J6784J7340J7485J7484J7581J7814J8367J9537K1244K3014K4465
57139A285471K5408K5715K5623K5962K7395K9607L1817L3887L6173L8567M0546
57128A626171M2102M3786M5776M7725M9575N1694N4068N6125N7676N9480O2584
57117B196762O7494P4070Q1879R0649J00638J12431J25950J40205J54694J70668
57107C315440J90195K14334K43251K77842L20058L71795M34908N12475O08703
$$ plain form
57185 618434 631441 644639 656775 667037 675656 683675 691943 700478 709123 718468 729517 742519 756803
57172 756803 771767 787318 803180 818548 832825 846220 859352 872691 886659 901673 917686
57161 917686 933956 949577 964012 977084 989007 1000670 1013302 1027455 1042654 1058282 1074356
57150 1074356 1091140 1108480 1125965 1143449 1161030 1178844 1197211 1216748 1237992 1261006 1285471
57139 1285471 1310879 1336594 1362217 1388179 1415574 1445181 1476998 1510885 1547058 1585625 1626171
57128 1626171 1668273 1712059 1757835 1805560 1855135 1906829 1960897 2017022 2074698 2134178 2196762
57117 2196762 2264256 2338326 2420205 2510854 2611492 2723923 2849873 2990078 3144772 3315440
57107 3315440 3505635 3719969 3963220 4241062 4561120 4932915 5367823 5880298 6489001
57098F489001P27220Q70696J042427J246769J486830J762309K069694K403008
57090A8097954K753101L106862L447909L757240M013082M192463M275466M247223
57082D7891300M093733L797212L340934K723387J968622J121560K32060o58078
57074F4510730j516565k314132l019276l599327m026577m285363m376437m316517
57066C7056536m133394l859416l526461l163350k794466k438626k108607j811680
57058A3220536j550594j324688j131271r67038q28613p12303o14357n31937m63321
57049E096414m06805l59991l20531k86921k57949k32052k08050j85969j66345
57040B671801j48992j33343j19433j07491r6846q6402p6151o7055n9316n1828
$$ plain form
57098 6489001 7216221 8086917 9129344 10376113 11862943 13625252 15694946 18097954
57090 18097954 20851055 23957917 27405826 31163066 35176148 39368611 43644077 47891300
57082 47891300 51985033 55782245 59123179 61846566 63815188 64936748 65168808 64510730
57074 64510730 62994165 60680033 57660757 54061430 50034853 45749490 41373053 37056536
57066 37056536 32923142 29063726 25537265 22373915 19579449 17140823 15032216 13220536
57058 13220536 11669942 10345254 9213983 8246945 7418332 6706029 6091672 5559735 5096414
57049 5096414 4689609 4329618 4009087 3722166 3464217 3232165 3024115 2838146 2671801
57040 2671801 2522809 2389466 2270033 2162542 2065696 1979294 1903143 1836088 1776772 1724944
57030A724944m3438l3744k2400q602Q388K8663N1001P1090Q0476P0025L7028j0929
57018A952502n9992r8125j19984j26373j21394j10046r6500q3189p1070o0524
57008A005305n1711m4453l8501l3872l0607k8268k6190k4120k2229k0546j8834
56997F65974j7063j5561j4560j3813j2837j1401r698q085o703n334l626j396J280
56984E47177M172O834Q535Q387N788P91n705j2145j7045j9837k0948k0941j9980
56971D65083j8258j6394j4801j3033j0392p061l982j725l5J593L562O266R873
56958D00696J3835J7187J9254J9575J7353J1871L673n350j3230j8863k1893k2599
56946D21509k1936k0870j9379j6767j3039r121n608k314P14K946M619P174J1521
$$ plain form
57030 1724944 1681506 1647762 1625362 1616760 1625148 1653811 1704812 1775902 1856378 1926403 1963431 1952502
57018 1952502 1892510 1794385 1674401 1548028 1426634 1316588 1220088 1136899 1065829 1005305
57008 1005305 953594 909141 870640 836768 806161 777893 751703 727583 705354 684808 665974
56997 665974 648911 633350 618790 604977 592140 580739 571041 562956 556253 550919 547293 545897 547177
56984 547177 551349 558183 566718 575105 580893 581684 575979 563834 546789 526952 506004 485063 465083
56971 465083 446825 430431 415630 402597 392205 385144 381162 379437 379402 380995 384557 390823 400696
56958 400696 414531 431718 450972 470547 487900 499771 503444 498094 484864 466001 444108 421509
56946 421509 399573 378703 359324 342557 329518 320397 314789 312475 313189 316135 320754 327928 339449
56933C39449J6731K1292K4885K7838K9317K7361K0788J0397j639j2999k1900k7568
56921D53952l0319l0986l0150k8035k4942k1379j7820j4571j1830r659q046p070
56909B19145o814o950o704n588l991k767k345k387k226j528n86m3j18k55K46J342
56893A78431K490L603N163P381R861J2309J4938J7861K0511K1940K1350J8249
56881C34087J2680N596j372o890j0446j2066j2035j0998r636q071o010l519r77
56868B70343J768N354R770J4120J7948K1957K7047L3319M0283M6998N1415N0623
56856E90945M2873K9153J2285m860j9900l0821l6593l7712l5437l0807k4828j8754
56844D35544j3274p905j990M232J0368J7045K5209L4666M4485N4486O4947P4725
$$ plain form
56933 339449 356180 377472 402357 430195 459512 486873 507661 518058 516419 503420 481520 453952
56921 453952 423633 392647 362497 334462 309520 288141 270321 255750 243920 234261 226215 219145
56909 219145 212331 205381 198677 193089 189098 186331 183986 181599 179373 177845 177259 177216 177098 176843 177089 178431
56893 178431 180921 184524 189687 197068 206929 219238 234176 252037 272548 294488 315838 334087
56881 334087 346767 352363 350991 344101 333655 321589 309554 298556 288920 280849 274839 271320 270343
56868 270343 272111 277465 287235 301355 319303 341260 368307 401626 441909 488907 540322 590945
56856 590945 633818 662971 675256 670396 650496 619675 583082 545370 509933 479126 454298 435544
56844 435544 422270 414365 412375 416607 426975 444020 469229 503895 548380 602866 667813 742538
56832G42538Q0800P9942P0235N1280K4473o226l4910n6394o8606p2508p0306o4079
56820F76239n5571m6328l7504k9460k1794j4026o320P99P445J4581K2974L2349
56808E43384M1835N0624N7453N9854N4953M1427K0744l309k6077m3701n4403n8679
56796F84105n8213n4715m9507m3525l7082l0033k2595j5695j0084n459r82L761
56784C59976Q786J4228K0051K5471K9232L0381K8312K2445J2635p1j3509k5284
56772E12653l3453l7028l6473l3601l0275k7249k4370k1472j8559j5614j2821
56761B21738j0674r334q226o861n579m871m461l839l220l113l324l246k842k469
56747A49679k069j448j069j504k253k240j394o59m71l10Q1J89k25n67l42J51M77
$$ plain form
56832 742538 823338 903280 973515 1024795 1049268 1043042 1008132 951738 883132 810624 740318 676239
56820 676239 620668 574340 536836 507376 485582 471556 465236 466035 473480 488061 511035 543384
56808 543384 585219 635843 693296 753150 808103 849530 870274 866965 840888 797187 742784 684105
56796 684105 625892 571177 521670 478145 441063 411030 388435 372740 362656 357197 356215 359976
56784 359976 368762 382990 403041 428512 457744 488125 516437 538882 551517 551446 537937 512653
56772 512653 479200 442172 405699 372098 341823 314574 290204 268732 250173 234559 221738
56761 221738 211064 201730 193504 186643 181064 176193 171732 167893 164673 161560 158236 154990 152148 149679
56747 149679 147610 146162 145093 143589 141336 139096 137702 137043 136572 136262 136343 136532 136307 135740 135398 135549 136026
56730A36026P11J021J176R52N66L70M02M43K80j25m37m2J192K422K651J893R59
56713A50460K99j52j89O20J910K490J699K14p51o23L29J395J947J919J762J570
56697A64899O49j313l096l113j568k74j84m29j50Q0m80j214r31L82J618K031J801
56680A58708J280M73n80j375j292l38O03O05j64n85j04M84L24p1K93J132J304
56663A60697Q06P87J502J826J303J072J888K707K366J626K002L356M120L640K849
56648A92547K609K647K371J825J316Q20J36p01j431j774j505o12N21J284J400
56633B01453J117Q38O50L56q1k99L8O05N52n14j937k759k790k523k258j951j793
56616A88704k188l025l593l482l004k544j989j062K09J509K319K005M56j286j717
$$ plain form
56730 136026 136737 137758 138934 139886 140452 140822 141224 141667 141947 141822 141385 141343 142535 144957 147608 149501 150460
56713 150460 150759 150607 150418 151038 152948 155438 157137 157351 156600 155977 156306 157701 159648 161567 163329 164899
56697 164899 165548 164235 161139 158026 156458 156184 156000 155571 155421 155501 155021 153807 152876 153258 154876 156907 158708
56680 158708 159988 160461 159881 158506 157214 156876 157479 158084 157920 157335 157231 157715 158039 157968 158261 159393 160697
56663 160697 161503 162290 163792 165618 166921 167993 169881 172588 174954 176580 178582 181938 186058 189698 192547
56648 192547 195156 197803 200174 201999 203315 204135 204271 203570 202139 200365 198860 198248 198769 200053 201453
56633 201453 202570 203408 204058 204414 204333 204034 204072 204677 205229 204715 202778 200019 197229 194706 192448 190497 188704
56616 188704 186516 183491 179898 176416 173412 170868 168879 167817 168026 169535 171854 173859 174315 173029 171312
56601A71312n96O56O30m93j433j365n43K39M23J23PN28J214J206N43K22P48J396
56583A74817J400J086J210J645J635R93L30R4J02O0P6M18J065J658J855J651J338
56566A91433J149J045R69J139J769K702L657M802O545Q751J0605J1298J0547Q496
56552B64907N641K785N85r33j999k402j896j070r90j878k948l649m152m488m223
56537B43290l351k607k343k023j350j004j589k541k892k524j982j582j357j436
56523B14709j784j954j653j217r92p44k82p0n77j398j743j517j226j121j000o97
56507A96734k67J17J03o20j669k018j189N2O96O69M80L16J94M73J274J847J398
56490A98590L66o0M36J008R74N49J49k30o50q35m65L78J219J498R35r4p16l68
$$ plain form
56601 171312 170716 171372 172002 171509 170076 168711 168168 168407 168830 168953 168960 169488 170702 171908 172451 172673 173421 174817
56583 174817 176217 177303 178513 180158 181793 182786 183116 183210 183312 183372 183448 183866 184931 186589 188444 190095 191433
56566 191433 192582 193627 194596 195735 197504 200206 203863 208665 215210 223961 234566 245864 256411 264907
56552 264907 270548 273333 273918 272985 270986 268584 266688 265618 264628 262750 259802 256153 252001 247513 243290
56537 243290 239939 237332 234989 232966 231616 230612 229023 226482 223590 221066 219084 217502 216145 214709
56523 214709 212925 210971 209318 208101 207109 206365 206083 206013 205436 204038 202295 200778 199552 198431 197431 196734
56507 196734 196467 196584 196687 196067 194398 192380 191191 191243 191939 192608 193088 193404 193598 194071 195345 197192 198590
56490 198590 198956 198896 199332 200340 201314 201863 202012 201782 201132 200297 199832 200210 201429 202927 203862 203768 203052 202684
56472B02684O05J344J333O44k86q29m64O42J595J711J218P36M13J03n4J72N48
56455B12115O78O89R61J322J169L93m21p43n87j47M84J114J397J190P71N94Q52
56438B21831J304J386P45k85q93o96r4L75O99J037J092L68r91k073k008p34R18
56421B21981J853J637Q51M15M94M29j89q97j028n19K21Q83J341J480J244P08j8
56404B30886o93q38k66L55J40o77r49l06K62Ql71J52J409K443K875K980K841K327
56386B42578J660J267J129Q28J43p46j415j353l79Q26J164M26l94m97k47k66l39
56369B44385Q3R16J697K250K469K034J086N24Q63J396J271Q03Q21J303J607J592
56353B65100J508J184L22p08j251j237r10j26J095J874J404L02n9O10J356J517
$$ plain form
56472 202684 203289 204633 205966 206610 206324 205495 205031 205673 207268 208979 210197 210933 211346 211449 211395 211567 212115
56455 212115 212793 213482 214443 215765 216934 217327 216906 216163 215576 215429 215913 217027 218424 219614 220385 220979 221831
56438 221831 223135 224521 225266 224981 224088 223392 223298 223673 224372 225409 226501 226869 225878 223805 221797 221063 221981
56421 221981 223834 225471 226322 226737 227231 227660 227471 226574 225546 225027 225248 226131 227472 228952 230196 230904 230886
56404 230886 230193 229355 229089 229444 229584 228907 227958 227652 227914 227922 227551 227703 229112 231555 234430 237410 240251 242578
56386 242578 244238 245505 246634 247462 247605 246859 245444 244091 243712 244538 245702 246128 245734 245237 244990 244724 244385
56369 244385 244468 245384 247081 249331 251800 253834 254920 255444 256307 257703 258974 259777 260598 261901 263508 265100
56353 265100 266608 267792 268114 267406 266155 264918 264008 263882 264977 266851 268255 268557 268498 269108 270464 271981
56337B71981J371J319J344J390J519J680J860K288K894L044K435J818K021K751
56323B99715L184L202L097K604J494O16J010K158K487J572N13J46J15j11m55p44
56307C20603r57p83J83J562K426K555K649L206L966M580N004N121M756M118L582
56292C62571L044K233J464J284J502J482J304J609K378K845K770K845L625M806
56278C95762N735N997N519M713M402M979N807O080N929N980O254O491O995Q076
56264D78719R067R193R088J0089J2188J4119J5376J6743J8769K1141K3767K7112
56252F65371L1169L5269L9228M3584M8498N3520N8526O3755O8826P2946P6194
56241A256886P9273Q1812Q2281P9975P5720P0180O2775N2894M1061K8273J5083
$$ plain form
56337 271981 273352 274671 276015 277405 278924 280604 282464 284752 287646 290690 293125 294943 296964 299715
56323 299715 302899 306101 309198 311802 313296 313912 314922 317080 319567 321139 321652 321798 321913 321802 321347 320603
56307 320603 319646 318863 319046 320608 323034 325589 328238 331444 335410 339990 344994 350115 354871 358989 362571
56292 362571 365615 367848 369312 370596 372098 373580 374884 376493 378871 381716 384486 387331 390956 395762
56278 395762 401497 407494 413013 417726 422128 427107 432914 438994 444923 450903 457157 463648 470643 478719
56264 478719 487786 496979 506067 516156 528344 542463 557839 574582 593351 614492 638259 665371
56252 665371 696540 731809 771037 814621 863119 916639 975165 1038920 1107746 1180692 1256886
56241 1256886 1336159 1417971 1500252 1580227 1655947 1726127 1788902 1841796 1882857 1911130 1926213
56230A926213J927j0534k1877l2150m1339m9194n5569o0236o2524o2272o0915
56219A471530o0354o0660o0186n8043n5100n2316m9526m6361m3061l9903l6894
56208I09126l4361l2795l1740k9973k7138k4125k1558j9122j6624j4568j3178
56197F43944j2002j0853j0073r530q506o892n453m574l812k905k108j375l62N98
56183E66097O89j1n34m83k65M1O69J155Q46M02J105K699L712L911M426N374N581
56166E95414N057N352O790P686P212O822P657Q738Q984R128J0144J1478J2302
56153G02764J3054J4352J5828J7216J9297K2541K6197K9759L4100M0117M7672
56142I82897N6895O8949Q4256J01225J17754J32622J44372J50404J48561J38740
$$ plain form
56230 1926213 1928140 1917606 1895729 1863579 1822240 1773046 1717477 1657241 1594717 1532445 1471530
56219 1471530 1411176 1350516 1290330 1232287 1177187 1124871 1075345 1028984 985923 946020 909126
56208 909126 874765 841970 810230 780257 753119 728994 707436 688314 671690 657122 643944
56197 643944 631942 621089 611016 601486 592980 586088 580635 576061 572249 569344 567236 565861 565499 566097
56183 566097 566786 566775 566241 565758 565493 565534 566203 567358 568204 568606 569711 572410 576122 580033 584459 589833 595414
56166 595414 600471 605823 612613 620299 627511 634333 641990 650728 659712 668840 678984 690462 702764
56153 702764 715818 730170 745998 763214 782511 805052 831249 861008 895108 935225 982897
56142 982897 1039792 1108741 1192997 1294222 1411976 1544598 1688970 1839374 1987935 2126675
56132B126675J22345J01749Q1009O4947N5789N1709M9325M6098L9798K8371J2357
56121B780172m164j6870k4431k7803k8488k9196l4162m6383o5121q7157j09083
56110B307314j27353j38269j40172j34746j24735j11553r6132q0334o5782n2693
56100A235545m1211l2320k6105k0847j5371j0616p502n148k825j589k094k691
56088A067226j739o6Q45J310K106K544K087K139L891N919O290N613N787P018Q249
56073A119219R170R865R882R503J0323J2627J4161J3518J2692J3938J6245J7485
56061A268628J7992J9188K0531K0835K0912K1976K2951K2292K0854K0160J9496
56050A495815J7736J6298J7067J8894J9418J8972J9423K0595K1114K1500K3034
$$ plain form
56132 2126675 2249020 2350769 2431778 2496725 2552514 2604223 2653548 2699646 2739444 2767815 2780172
56121 2780172 2776008 2759138 2734707 2706904 2678416 2649220 2615058 2568675 2503554 2416397 2307314
56110 2307314 2179961 2041692 1901520 1766774 1642039 1530486 1434354 1354020 1288238 1235545
56100 1235545 1194334 1162014 1135909 1115062 1099691 1089075 1081573 1076425 1073600 1072011 1069917 1067226
56088 1067226 1065487 1065421 1066266 1067576 1069682 1072226 1074313 1076452 1080343 1086262 1092552 1098165 1103952 1110970 1119219
56073 1119219 1128389 1138254 1148136 1157639 1167962 1180589 1194750 1208268 1220960 1234898 1251143 1268628
56061 1268628 1286620 1305808 1326339 1347174 1368086 1390062 1413013 1435305 1456159 1476319 1495815
56050 1495815 1513551 1529849 1546916 1565810 1585228 1604200 1623623 1644218 1665332 1686832 1709866
56039A709866K4785K5070K4719K5743K7892K9592L0964L2901L4610L5233L6264
56028B037639L9184M2404M3953M5207M8382N2277N4402N5415N7367N9500O0047
56017B595777O0342O2631O5577O6531O6574O8562P1872P4025P5910Q0223Q6172
56006C374196R0865R4637R9784J05509J09447J12849J18730J26332J32992J39788
55996D505129J49467J60424J69129J76925J87754K00682K11766K21974K35775
55987F219025K52913K69280K85231L05149L29364L54415L80846M12550M48823
55978I257596M85489N23670N68825O21483O77948P39791Q13145Q98902R93603
55969A5580452J100013J226269J374965J544324J740486J976929K262150K601223
$$ plain form
56039 1709866 1734651 1759721 1784440 1810183 1838075 1867667 1898631 1931532 1966142 2001375 2037639
56028 2037639 2076823 2119227 2163180 2208387 2256769 2309046 2363448 2418863 2476230 2535730 2595777
56017 2595777 2656119 2718750 2784327 2850858 2917432 2985994 3057866 3131891 3207801 3288024 3374196
56006 3374196 3465061 3559698 3659482 3764991 3874438 3987287 4106017 4232349 4365341 4505129
55996 4505129 4654596 4815020 4984149 5161074 5348828 5549510 5761276 5983250 6219025
55987 6219025 6471938 6741218 7026449 7331598 7660962 8015377 8396223 8808773 9257596
55978 9257596 9743085 10266755 10835580 11457063 12135011 12874802 13687947 14586849 15580452
55969 15580452 16680465 17906734 19281699 20826023 22566509 24543438 26805588 29406811
55961B9406811L010289L516028M140855M904273N839820O994323Q411499J0140601
55953G6364499J2269445J4928423J8248852K2320086K7153340L2584250L8082117
55946B41951012M2568519M4432125M1895521L3751229K0207499L281869j3753157
55939D14334617k7717192l6788651m0854191m0929730l8347240l4287787k9667609
55932A65742217k5121300k0996413j7419042j4405527j1925323r909334q269546
55925E7695732o935064n856584m983888m264683l664667l167512k754932k403982
55917B3664420k102345j848440j635621j450668j287498j148128j029682r23229
55909A2238809q25834p41805o71250o08348n51402n04058m65746m30693l97264
$$ plain form
55961 29406811 32417100 35933128 40073983 44978256 50818076 57812399 66223898 76364499
55953 76364499 88633944 103562367 121811219 144131305 171284645 203868895 241951012
55946 241951012 284519531 328951656 370847177 404598406 424805905 428087774 414334617
55939 414334617 386617425 349828774 308974583 268044853 229697613 195409826 165742217
55932 165742217 140620917 119624504 102205462 87799935 75874612 65965278 57695732
55925 57695732 50760668 44904084 39920196 35655513 31990846 28823334 26068402 23664420
55917 23664420 21562075 19713635 18078014 16627346 15339848 14191720 13162038 12238809
55909 12238809 11412975 10671170 9999920 9391572 8840170 8336112 7870366 7439673 7042409
55900G042409l69121l46260l23715l00164k79449k62363k44834k25569k08130
55891D482804j94024j80604j67054j55884j47235j37902j27248j18101j10688
55882C144064j01584r0148q0550p5849p4958p6528q0771q6122q8822q7490q4204
55871B217038q0235p4775o8485o3989o1747n9320n5638n2261m9812m6915m3355
55860A560506m0627l8792l6338l3603l2635l3228l2800l0722k9106k8757k8050
55849A195848k6535k6009k7086k8065k7986k7777k7666k6574k4599k3144k2153
55838I08254k0276j7960j7156j7720j7447j5952j5101j5227j4563j2867j1919
55827G32066j1814j0492p855o603p775r084r026r155j0676j2122j2144j1724j1848
$$ plain form
55900 7042409 6673288 6327028 6003313 5703149 5423700 5161337 4916503 4690934 4482804
55891 4482804 4288780 4108176 3941122 3785238 3638003 3500101 3372853 3254752 3144064
55882 3144064 3042480 2952332 2871782 2795933 2720975 2644447 2563676 2477554 2388732 2301242 2217038
55871 2217038 2136803 2062028 1993543 1929554 1867807 1808487 1752849 1700588 1650776 1603861 1560506
55860 1560506 1519879 1481087 1444749 1411146 1378511 1345283 1312483 1281761 1252655 1223898 1195848
55849 1195848 1169313 1143304 1116218 1088153 1060167 1032390 1004724 978150 953551 930407 908254
55838 908254 887978 870018 852862 835142 817695 801743 786642 771415 756852 743985 732066
55827 732066 720252 709760 701905 695302 687527 678443 669417 660262 649586 637464 625320 613596 601748
55814F01748j1695j0729j0073j0269j0052q767p596p125o169m312l108l229k895
55801E05729p06K143L998M988N695N643M598L422K364M53k225l824l553l152m091
55786E21482n370n541m860m023k694r08j95j628m329p129j0032j2746j3682j1985
55772D36360q897n592j402M317J0151J4146J5822J5164J1230L728n218j2708j7610
55759D59491k0222k0624j8964j6345j3884j1487q724o033m007k464j264j047k044
55746C32382l246l768m045m726n468n808n999n992m854k337J51J254J212O85n91
55731B88850k717m513m951m643m664m911m877m974n634o144n692m713m000l344
55717B23073k295j293q05l06O95J605J973K677M501O538P454P366P006N992L641
$$ plain form
55814 601748 590053 579324 569251 558982 548930 540163 532567 525442 519273 514961 511853 508624 505729
55801 505729 505023 507166 511164 516152 521847 527490 532088 535510 537874 538327 536102 532278 528725 525573 521482
55786 521482 516112 510571 505711 501688 498994 498086 497891 496263 491934 484805 474773 462027 448345 436360
55772 436360 427463 421871 420469 424786 434937 449083 464905 480069 491299 495027 489809 477101 459491
55759 459491 439269 418645 399681 383336 369452 357965 349241 343208 339201 336737 335473 334426 332382
55746 332382 329136 325368 321323 316597 311129 305321 299322 293330 288476 286139 286290 287544 288756 289441 288850
55731 288850 286133 281620 276669 272026 267362 262451 257574 252600 246966 240822 235130 230417 226417 223073
55717 223073 220778 219485 218680 218374 219069 220674 222647 225324 229825 236363 243817 251183 258189 264181 267822
55702B67822P26j368k674m238o185p708q559q996q692p239n399m373m050l386
55688A95681k305j716j761j557p08J75P13J291K230L307M250M904M880L909K514
55673B15807J581J232Q21k3r81j618j791j626j436j512j647j320o38l93p10n45
55657B05201P70K283K719K205J760J650J401Q81K77n48j594k085j385k51J4o88
55641B12610j421j785k156k610k836l106m075n541o423o194n478n002m738m265
55627A56980l376k213j247j063j704k392k357j755j224r30o81n45p12r69j062
55612A34750j287k016k926l371l240k806k123j305r40j372j934j774j106p72q41
55597A06937o50k2N49Q20R85R75N00k08n30l97l57o41q70o69p1O93J289J338R08
$$ plain form
55702 267822 268548 267180 264506 260268 254083 246375 237816 228820 220128 212889 207490 203117 199067 195681
55688 195681 193376 191660 189899 188342 187634 187809 188522 189813 192043 195350 199600 204504 209384 213293 215807
55673 215807 217388 218620 219441 219418 218437 216819 215028 213402 211966 210454 208807 207487 206849 206456 205746 205201
55657 205201 205971 208254 210973 213178 214938 216588 217989 218870 219147 218599 217005 214920 213535 213284 213298 212610
55641 212610 211189 209404 207248 204638 201802 198696 194621 189080 182657 176463 170985 165983 161245 156980
55627 156980 153604 151391 150144 149081 147377 144985 142628 140873 139649 138719 138038 137493 136781 135812 134750
55612 134750 133463 131447 128521 125150 121910 119104 116981 115676 114736 113364 111430 109656 108550 107778 106937
55597 106937 106287 106265 106814 107634 108619 109594 110094 109886 109356 108959 108602 107961 107091 106422 106351 107044 108333 109671 110579
55578A10579O36Q36R06K68n03l56P79K035K775K874K293J347J085K199L778M243
55562A35774L416K477J947J079n39k022k453k116j941k310k863k986k246q46K84
55547A24655L52l45r10j129j466j870j588m63N68O69J59q0K41O90P83N16L65P93
55529A21940J607J945J251l7j118j745k026j799j045n12r74k023k545k243j714
55514A08962j203m57K30R6p19j092n95j10l32o62l15L81N68Q4n87j114j420j370
55496A00345r49m87l12l65m91p34j082j269j099p04k58J65L38j10j071j781j573
55479H8563o07L35O40L12j22j12L02M78K5n35m57J09L06j74p30p90m31P3O23R87
55459H8795P70M8n29o03o26j146j982k418k014r55J65P80Q00O81Q40J075Q96L02
$$ plain form
55578 110579 111215 112051 112957 113225 112722 112366 113145 115180 117955 120829 123122 124469 125554 127753 131531 135774
55562 135774 139190 141667 143614 144693 144154 142132 139679 137563 135622 133312 130449 127463 125217 124371 124655
55547 124655 125007 124662 123752 122623 121157 119287 117699 117236 117804 118473 118632 118552 118793 119483 120266 120782 121147 121940
55529 121940 123547 125492 126743 126706 125588 123843 121817 120018 118973 118461 117487 115464 112919 110676 108962
55514 108962 107759 107302 107532 107628 106909 105817 105222 105112 104780 104118 103803 104184 104752 104836 104249 103135 101715 100345
55496 100345 99396 98909 98597 98232 97741 97007 95925 94656 93557 92853 92595 92760 93098 92988 91917 90136 88563
55479 88563 87956 88291 88931 89243 89121 89009 89311 89789 89814 89279 88822 88931 89237 89063 88333 87543 87112 87185 87808 88795
55459 88795 89565 89613 89084 88481 87855 86709 84727 82309 80295 79340 79505 80285 81085 81766 82606 83681 84577 84879
55441H4879k30m74o78j035j399j543j328p08L2K98l7j54P09J966K277J317P4n76
55423H3390n86p8R11J722J314k22j387j148k16K44L34Q28J543J436K46r92j270
55406H6069p71m00n36p10n05k89o80j401j422m42M45K74k82J18J373K038J391
55389H4270J83p75j517k087k008j202m46k45p6O03J397J719J760J910J912J356
55373H6754O36N10J047J622J796J598J151N15k02q70j330j340q54m00n87j114
55357H8932r94k6P42M63l95q87q17m99l0M68M91j82r29j089q98r72j282j405j302
55338G9389j163q47j83M67O94P37J032J395J367J038P79M60k43j022j177o32J8
55321H2109L47L88K52O7J21M91O88K50n02q67p05l31J59P10P93o5j268j613q03
$$ plain form
55441 84879 84649 84175 83497 82462 81063 79520 78192 77484 77516 77814 77777 77623 78332 80298 82575 83892 83966 83390
55423 83390 82804 82726 83637 85359 86673 86451 85064 83916 83700 83944 84278 85106 86649 88085 88331 87339 86069
55406 86069 85298 84898 84362 83652 83147 82858 82178 80777 79355 78913 79358 79632 79350 79468 80841 82879 84270
55389 84270 84453 83678 82161 80074 78066 76864 76418 76173 76097 76700 78097 79816 81576 83486 85398 86754
55373 86754 87390 87900 88947 90569 92365 93963 95114 95629 95427 94557 93227 91887 91033 90633 90046 88932
55357 88932 87938 87912 88654 89117 88722 87835 87018 86519 86489 86957 87448 87266 86337 85248 84350 83378 82096 80691 79389
55338 79389 78226 77379 77196 77663 78357 79094 80126 81521 82888 83926 84705 85165 84922 83900 82723 82091 82109
55321 82109 82456 82844 83096 83163 83284 83775 84463 84713 84211 83344 82639 82308 82467 83177 83970 83905 82637 81024 80221
55302H0221K79P90P17M13J15N0L27N71L41n5J13P66R41J99o61p22j45L34M86O74
55282H5754J049J279J042N07J69L45P59P93K50k81j84L36N47K36j30k47l59o68
55264I1197r15r22r83j376j744j494o34J11J20m91j024r01j24P89J239R84L46
55247H4178L8O36J885K688K107M66r80j440j285j212j366j514j581j486r33R0
55231H0291R48J038N52J32L2J14L45P08Q54N21P9Q3M26N72M08K21L7l67q44j033
55211H5117j016j114j138o22K05N44K38j8J97M42K84J3R8M98Q62J002Q66M55K3
55192H6936j33j20k61m17j28N01P58M46K38N65Q83N73p9m11l79l66l76j29K84
55173H8385M42K73K34P10J501J918J395J36r21j100q31r54j333r52M37J665J657
$$ plain form
55302 80221 80500 81290 82007 82420 82535 82585 82912 83483 83824 83769 83882 84648 85589 85788 85127 84405 84260 84594 85080 85754
55282 85754 86803 88082 89124 89631 89800 90145 90904 91697 91947 91666 91482 91818 92365 92601 92471 92224 91865 91197
55264 91197 90282 89360 88377 87001 85257 83763 83129 83240 83360 82869 81845 80944 80820 81609 82848 83832 84178
55247 84178 84216 84852 86737 89425 91532 91998 91018 89578 88293 87081 85715 84201 82620 81134 80201 80291
55231 80291 81239 82277 82829 82961 82993 83107 83452 84160 85014 85535 85614 85697 86123 86695 87103 87324 87361 86994 86150 85117
55211 85117 84101 82987 81849 81227 81432 81976 82214 82196 82393 82835 83119 83132 83230 83728 84590 85592 86458 86913 86936
55192 86936 86803 86683 86422 86005 85877 86378 87136 87582 87820 88385 89268 89841 89762 89351 88972 88606 88230 88101 88385
55173 88385 88827 89100 89334 90044 91545 93463 94858 94994 94073 92973 92142 91188 89855 88903 89340 91005 92662
55156I2662Q15K35J89K10J71L39N92M30k40r16j152q93k79M41Q92R47R83J329
55138I6755J559R36n30j970k555k088q10P36J719J582P43K41N12R47P95M9p29
55121I7892j071q84m04m6n6j48K15J040J647J390L40r13j776j888j194q1P71R64
55103I5798O96M44N24R69J514J573O48r38k026j751m96N70Q00N51M53O39Q22P77
55085A01567N50K84N1j56l23l81k96j51q2r9j53k89n30o57m27j02l08j060j465
55066I5973q47J78M78O0O7J016J963J819Q03o1l24l21l18l09m56r82j557j523
55048I5659q41k18j13j86rK41K07RL9L73P95J187J441J228K81j114k220k530k088
55029I2141j222k07P80J583K031J963J373N60k4j48L2J89R6l18q35r46l82L11
$$ plain form
55156 92662 93477 93712 93901 94111 94282 94621 95213 95643 95403 94487 93335 92442 92163 92604 93496 94443 95426 96755
55138 96755 98314 99250 98720 96750 94195 92107 91297 92033 93752 95334 96077 96318 96830 97777 98572 98621 97892
55121 97892 96821 95937 95533 95487 95431 95283 95498 96538 98185 99575 99915 99002 97226 95338 94144 94063 94834 95798
55103 95798 96494 96938 97462 98431 99945 101518 102166 101228 99202 97451 96955 97525 98325 98876 99329 99968 100790 101567
55085 101567 102117 102401 102452 102296 101973 101592 101296 101145 101063 100964 100811 100522 99992 99335 98908 98806 98498 97438 95973
55066 95973 95126 95304 95782 95842 95909 96925 98888 100707 101510 101449 101125 100804 100486 100177 99721 98739 97182 95659
55048 95659 94818 94600 94487 94301 94292 94533 94740 94749 94788 95161 95956 97143 98584 99812 100093 98979 96759 94229 92141
55029 92141 90919 90712 91492 93075 95106 97069 98442 99002 98978 98830 98862 99051 99147 98829 97994 97048 96666 96977
55011I6977K83l79o35L5Q52J016R44J399K012J857J117Q61J234J171K00p47q63
54994A07334o18o85p14j13O60P17J61j34R0L21L60N19P36N06o0k8J029K220K414
54975A14715J614P07K19K2j00j52k37m91p21n11J73Q98J332J493J343O11n91j427
54957A18897j163j32O06N35J02j19j45k41l87m32m75o92r57j000q14o20m59j57
54939A12347L12O95O95K21n01r93p94P0R90J391J306J186J244J346J358J328J314
54922A23515J394J788K650L739M601N092N473N955O424O710O809O776O495N637
54908A93058L786Q38k576n305o673p080p314p519p343o770o143n461m405l108
54894A27985k165j713j253o22l31o46r55o28J10P33J271J968K474K172J210M84
$$ plain form
55011 96977 97260 96881 96246 96281 97133 98149 99093 100492 102504 104361 105478 106339 107573 108744 108944 108197 107334
54994 107334 106716 106031 105317 105204 105864 106581 106742 106608 106698 107019 107379 107898 108634 109140 109080 109052 110081 112301 114715
54975 114715 116329 117036 117255 117277 117177 117025 116788 116297 115576 115065 115238 116136 117468 118961 120304 120915 120324 118897
54957 118897 117734 117602 118208 118743 118845 118726 118581 118340 117953 117521 117046 116354 115397 114397 113583 112963 112504 112347
54939 112347 112659 113354 114049 114270 113769 112776 111982 112052 113042 114433 115739 116925 118169 119515 120873 122201 123515
54922 123515 124909 126697 129347 133086 137687 142779 148252 154207 160631 167341 174150 180926 187421 193058
54908 193058 196844 197682 195106 189801 183128 176048 168734 161215 153872 147102 140959 135498 131093 127985
54894 127985 125820 124107 122854 122232 121901 121255 120300 119672 119782 120515 121786 123754 126228 128400 129610 130094
54878A30094O16J437K499L577M606N467O073O477O783P015P041O583N410L566
54864A97244J256j386m123o269p058o625o102o371p065p180o306m864l411k270
54850A29470j627j496j644j767j699j305n52Q0j82j294k013j334Q9P82L91j00
54834A15799m6P8j99m84k82O5j31q62j496j666j564j403j045l00O39J222J059
54817A09384L91p7N4L86K89k55o02k99L64P68O58K99J27K77M48K21l93q70q09
54798A10361m05p2J72N14Q00O87L01J25K59L25J83J15K23K14K7M5M21P29O38M37
54778A16099M71N75M85M25O79J029J111J082J348J896K478L207M290N310N522
54763A46007M947M564N139O425P666Q377Q401P646O175M245K004o15l449n859
$$ plain form
54878 130094 130710 132147 134646 138223 142829 148296 154369 160846 167629 174644 181685 188268 193678 197244
54864 197244 198500 197114 192991 186722 179664 173039 166937 160566 153501 146321 140015 135151 131740 129470
54850 129470 127843 126347 124703 122936 121237 119932 119380 119460 119278 117984 115971 114637 114726 115508 115899 115799
54834 115799 115753 115831 115632 115148 114866 114931 114800 113938 112442 110776 109212 107809 106764 106464 107103 108325 109384
54817 109384 109775 109698 109752 110138 110427 110172 109570 109271 109635 110403 111061 111360 111487 111764 112212 112433 112040 111170 110361
54798 110361 109956 109884 110056 110570 111370 112057 112358 112483 112742 113067 113250 113365 113588 113802 113829 113874 114295 115024 115662 116099
54778 116099 116570 117145 117630 118055 118734 119763 120874 121956 123304 125200 127678 130885 135175 140485 146007
54763 146007 150954 155518 160657 167082 174748 183125 191526 199172 205347 209592 211596 210981 207532 201673
54749B01673p269p796p985q092p849o942n368l472j786q00n59o45o82q40j427
54734A40161k156k284j570o91m12o80q33m49L88J429K475L231L425L211L157L671
54718A52073M599N512O166O518O461N839M684L217J588k58k350m380n785o235
54704A77649o056n942o135o071n137l655k613k392k249j415k75J06n52j361j396
54689A32506p55k46l70r31j473j775j891j910j783j340n36L76R08P19m2q20j154
54672A19483j032p58m54J25J064J787J519K90q43r08q5O46P05L13j45o11j021
54655A20075j014l98L72O15K52j41j54m6k39o02o26k00J72J45J09O15J437J726
54637A22098J196N83O78J218J262N10k94l76J06L61j7o37r54r45r47j014p69o5
$$ plain form
54749 201673 194404 186608 178623 170531 162682 155740 150372 146900 145114 144314 143755 143110 142428 141588 140161
54734 140161 138005 135721 134151 133460 133048 132368 131535 131086 131474 132903 135378 138609 142034 145245 148402 152073
54718 152073 156672 162184 168350 174868 181329 187168 191852 195069 196657 196399 194049 189669 183884 177649
54704 177649 171593 165651 159516 153445 148308 144653 142040 139648 137399 135984 135709 135815 135263 133902 132506
54689 132506 131751 131505 131135 130204 128731 126956 125065 123155 121372 120032 119496 119872 120780 121499 121457 120637 119483
54672 119483 118451 117693 117239 117364 118428 120215 121734 122024 121181 120273 120188 120834 121539 121852 121707 121096 120075
54655 120075 119061 118663 119035 119650 119902 119761 119607 119561 119322 118720 118094 117894 118066 118211 118320 118935 120372 122098
54637 122098 123294 123877 124555 125773 127035 127545 127251 126875 126981 127342 127325 126688 125734 124789 123842 122828 122059 121994
54619A21994N82N74Q8j34J40K75k94j213j621j105L2J197J835J615P58L9PL70
54601A25139M69J98l5q8k09m17l57RK07m7l44j29O25J469J985J945J324L98l44
54582A31798o49p63j063j565j972j981j475n42M72J158J376J319J125P24J70j57
54566A27975K2M13M16j55q26r78m92J53L65M6l56l84n2L78Q03J202J282P29j48
54547A30393n02O6R88J397J114O89P07J253J956K395K477K385K154J528N53k9
54531A49524M30J422J757J133M46K89P8q57k126k902l076k944k364j102K08N02
54515A40418l60j418j812j541j048o75n84n92k01O95J277P27m72r73l53M52O48
54498A34188N26N85O27K98j73m00m25l38Q5P73R71J93q63j107m47L87R91J441
$$ plain form
54619 121994 122576 123150 123238 123104 123244 123519 123225 122012 120391 119286 119318 120515 122350 123965 124723 124762 124769 125139
54601 125139 125608 125806 125771 125683 125474 125057 124700 124709 124916 124869 124525 124396 125021 126490 128475 130420 131744 132142 131798
54582 131798 131149 130386 129323 127758 125786 123805 122330 121788 122260 123418 124794 126113 127238 127962 128132 127975
54566 127975 127997 128410 128826 128671 127845 126867 126375 126528 126893 126939 126583 126199 126147 126525 127328 128530 129812 130541 130393
54547 130393 129891 129957 130945 132342 133456 134145 134852 136105 138061 140456 142933 145318 147472 149000 149553 149524
54531 149524 149954 151376 153133 154266 154712 155001 155079 154222 152096 149194 146118 143174 140810 139708 139916 140418
54515 140418 140058 138640 136828 135287 134239 133564 132980 132388 132187 132882 134159 134886 134414 133441 133088 133540 134188
54498 134188 134714 135299 135926 136224 136051 135651 135226 134888 134973 135746 136717 136910 136047 134940 134493 134880 135871 137312
54480A37312J474O45o26j148m30O86J231J278J427J695J617J108O28N19O58Q05
54464A48879R21J080J267J393J365J133P50L96J87O5r0k47k53n7J96L20K62J24
54446A57691J0j01k79m97o37o81p33p31l49M81J088N58j090k609k746j586l52
54429A47437%l96q00p79m85k77k87k94J0O46J197J201P21L59N97J198J381O40
54411A52069o42j478j206j71O13N44K4j83L8Q9m08j023j044l13P45J655K207K327
54393A53843K021J445Q79N26M34N73P86Q34O25L91L31J22p68k127k781j831J18
54376A55421J439J260L40o5K96O45M76K11M50J051J380J214R59R16Q20L19m06
54359A66726p38l36N24J291J626J510J013J86q16j601j748j159k12N58Q39O32
$$ plain form
54480 137312 138786 139431 138805 137657 137227 137913 139144 140422 141849 143544 145161 146269 146897 147416 148074 148879
54464 148879 149800 150880 152147 153540 154905 156038 156788 157184 157371 157436 157346 157099 156846 156789 156985 157305 157567 157691
54446 157691 157701 157600 157321 156824 156187 155506 154773 154042 153693 154174 155262 155820 154730 152121 149375 147789 147437
54429 147437 147437 147041 146241 145462 144977 144700 144413 144119 144129 144775 145972 147173 147894 148253 148850 150048 151429 152069
54411 152069 151427 149949 148743 148572 149185 149729 149753 149570 149608 149697 149289 148266 147222 146909 147654 149309 151516 153843
54393 153843 155864 157309 158188 158714 159148 159721 160507 161341 161966 162357 162688 162810 162042 159915 157134 155303 155421
54376 155421 156860 158120 158460 158395 158691 159336 159812 160023 160473 161524 162904 164118 165077 165993 166813 167132 166726
54359 166726 165988 165652 166176 167467 169093 170603 171616 171802 170986 169385 167637 166478 166266 166824 167663 168295
54343A68295J09m49o85m16J40N47O60P21R27J095R16L49l74r86j297j226r25p46
54325A66655q85j104j018n82j01J55J50j05o57j420k028k065j461n61J35L93K70
54308A55771j24p39j373j594j195n79k95k56J48J009J592J321O12K59L66M07J07
54291A55437k83m86m63k32J27L20J34j80k56k46n40r46p72J16R71J141Q65O93
54273A55400O53L94r1m31m20k30j01j03j75k48k83l02l48l94l83l30k08J84R89
54254A53573J914K309J796O43n14j122r30r5P96J078N95j66o02n03q8K72L39K13
54236A59508J82K27j24j064j894j717o81K06M14L77M28J82o51j540j787j396p36
54219A49934P1Q76J111M42m44n44J56O78M03k45m69k0P10J106Q14Q2l76p9O56
$$ plain form
54343 168295 168404 167955 167270 166854 166994 167541 168201 168922 169849 170944 171860 172209 171835 170849 169552 168326 167401 166655
54325 166655 165770 164666 163648 163066 162965 163120 163270 163165 162508 161088 159060 156995 155534 154973 155108 155501 155771
54308 155771 155647 154908 153535 151941 150746 150167 149872 149616 149764 150773 152365 153686 154298 154557 154923 155330 155437
54291 155437 155154 154668 154205 153973 154100 154420 154554 154374 154118 153872 153332 152386 151614 151730 152701 153842 154707 155400
54273 155400 156053 156447 156356 155925 155505 155275 155174 155071 154896 154648 154365 154063 153715 153321 152938 152608 152400 152584 153573
54254 153573 155487 157796 159592 160235 159721 158599 157669 157574 158370 159448 160043 159877 159275 158772 158684 158956 159295 159508
54236 159508 159690 159917 159793 158729 156835 155118 154437 154643 155057 155434 155862 156044 155393 153853 152066 150670 149934
54219 149934 150005 150881 151992 152434 151990 151446 151602 152280 152683 152438 151969 151949 152659 153765 154579 154661 154285 154206 154862
54200A54862J072P40k18j394k284k371j488j26Q91J094N98j58o77o39j53L51N97
54183A50697O17L75k96j145j411p84k4Nm74n76o8M66O29O25P03Q46J034J219J029
54164A53467J68q61j115m21L35L84o6l72l89m47p61j162j295r35k06M43O31M44
54146A47842K61K96M53N41M28J05j16J54P39Q84K89l03j22M68O15L08J79K19j12
54127A53128o56n31L96J122R27K52k00k82K8R09J997K267J265j71j004j091p24
54110A57632J53J425K237J836O29l18n58l60J4L92L40m39j477j940j605r44m08
54093A56609j53k13m26l44K04O83N19pj20K43L75n3m26J2J184K323K787K564K106
54074A67867J770J513J123O51L37J40k03o11o79m28m15p47o86K38J317J586J113
$$ plain form
54200 154862 155934 156674 156456 155062 152778 150407 148919 148793 149684 150778 151376 151218 150541 149902 149749 150100 150697
54183 150697 151314 151689 151393 150248 148837 148053 148029 148034 147560 146984 146916 147382 148011 148636 149339 150185 151219 152438 153467
54164 153467 153635 152774 151659 151238 151573 151957 151891 151519 151130 150683 149922 148760 147465 146530 146324 146767 147398 147842
54146 147842 148103 148399 148852 149393 149821 149926 149810 149964 150703 151587 151876 151573 151451 151919 152534 152842 153021 153240 153128
54127 153128 152472 151941 152337 153459 154386 154638 154438 154156 154184 155093 157090 159357 160622 160451 159447 158356 157632
54110 157632 157785 159210 161447 163283 163912 163594 163036 162676 162690 163082 163422 162983 161506 159566 157961 157017 156609
54093 156609 156456 156243 155817 155473 155677 156360 156879 156872 156752 156995 157370 157317 156891 156903 158087 160410 163197 165761 167867
54074 167867 169637 171150 172273 172924 173261 173401 173198 172587 171908 171480 171065 170318 169632 169870 171187 172773 173886
54057A73886O87O05N90O20R31J390J659J906K533L319L623L486L673M590N893
54042B09391P255Q760J0277J1196J1087J0069Q319N866L062O96p34j387j518j104
54028B81235k92L64N16M71O63J015J134Q17J24p43j402j433q73k94k62q85j931
54011B78224k998l581l482l230l578m438m924m656m275m318m268l461k288j743
53997B26984k034k462k534k427k355k108j529r56q82j385k008k162j650q49l70
53982B01273m44p55r46j052j277j558j629j368q50k25K52K23l75j060j215p56
53966A88238j20L11M94N40N28N86Q61J286J534J297O14p1j84M35J241J463R88
53949B00041N35P33J381J891K188K649L324L769L727L475L386L571M068M940N918
$$ plain form
54057 173886 174573 175178 175768 176388 177319 178709 180368 182274 184807 188126 191749 195235 198908 203498 209391
54042 209391 216646 225406 235683 246879 257966 268035 276354 282220 285282 285978 285244 283857 282339 281235
54028 281235 280943 281307 281823 282294 282957 283972 285106 285923 286047 285304 283902 282469 281596 281302 281040 280155 278224
54011 278224 275226 271645 268163 264933 261355 256917 251993 247337 243062 238744 234476 231015 228727 226984
53997 226984 224950 222488 219954 217527 215172 213064 211535 210579 209697 208312 206304 204142 202492 201643 201273
53982 201273 200829 200074 199128 198076 196799 195241 193612 192244 191394 191169 191421 191644 191269 190209 188994 188238
53966 188238 188118 188429 188923 189463 189991 190577 191438 192724 194258 195555 196169 196098 195914 196349 197590 199053 200041
53949 200041 200576 201309 202690 204581 206769 209418 212742 216511 220238 223713 227099 230670 234738 239678 245596
53934B45596O319N758M754M196M294M448M103L421K951K942L252L685M180M702
53920C04601N208N740O374P031P545P912Q208Q186P315N577L865L162L375L518
53906C87617L028K323J917J577Q05k19q68j044j332k081k807k749j760l90P63
53891C84780J556K216L002M003N154O192O512N186J503m293j0802j6174j9107
53878C69728j9294j7310j4252j1363r504q715q400p907p008n868m811m111l826
53865B47359l699l378k833k438k545l025l385l284k775k125j518j060q75j030
53851B13389j385j647j617j283p64k47Nk11p62j225j275r78n97k73k2P1j23n98
53833B00458j183j650j759j341n24K69P49J015J206J074L64n10p02M7J062J607
$$ plain form
53934 245596 251915 257673 262427 266623 270917 275365 279468 282889 285840 288782 292034 295719 299899 304601
53920 304601 309809 315549 321923 328954 336499 344411 352619 360805 368120 373697 377562 380724 384099 387617
53906 387617 390645 392968 394885 396462 397267 397048 396180 395136 393804 391723 388916 386167 384407 384017 384780
53891 384780 386336 388552 391554 395557 400711 406903 413415 418601 420104 415811 405009 388835 369728
53878 369728 350434 333124 318872 307509 298005 289290 280890 272983 265975 260107 255296 251185 247359
53865 247359 243660 240282 237449 235011 232466 229441 226056 222772 219997 217872 216354 215294 214419 213389
53851 213389 212004 210357 208740 207457 206693 206446 206451 206240 205478 204253 202978 202000 201403 201130 201108 201179 201056 200458
53833 200458 199275 197625 195866 194525 194001 194270 195019 196034 197240 198314 198678 198168 197466 197513 198575 200182
53817B00182J667J610J503J159O16K03K16P44J652K539K881K573K188K380L116
53802B25229L791M030M072M320M828N314N510N361N035M736M519M225L707L019
53788B87696K350J903J855K208K581K423J664Q84N33K80m88j715k778l441m112
53773B91843n031n807o017n811n542n197m550l734l180l055l038k703j940j001
53759B35237k96q8k93n86q14j148j721k301k554k526k553k711k675k168j340n42
53743B10921P5N37P50N19j04o41n93JN80P18O13P08Q98N48n46j560j443j80J181
53724B12982J768J698J574J615J689J784J992K116J800J110O22Q20J620K514K993
53709B38697K810K202J877K392L383L778L076K004J600J924K214K065J904K231
$$ plain form
53817 200182 201849 203459 204962 206121 206737 206940 207156 207900 209552 212091 214972 217545 219733 222113 225229
53802 225229 229020 233050 237122 241442 246270 251584 257094 262455 267490 272226 276745 280970 284677 287696
53788 287696 290046 291949 293804 296012 298593 301016 302680 303564 304097 304377 303889 302174 299396 295955 291843
53773 291843 286812 281005 274988 269177 263635 258438 253888 250154 246974 243919 240881 238178 236238 235237
53759 235237 234941 234853 234560 233974 233160 232012 230291 227990 225436 222910 220357 217646 214971 212803 211463 210921
53743 210921 210996 211533 212283 212802 212698 212057 211464 211465 212045 212763 213376 214084 214982 215530 214984 213424 211981 211801 212982
53724 212982 214750 216448 218022 219637 221326 223110 225102 227218 229018 230128 230750 231570 233190 235704 238697
53709 238697 241507 243709 245586 247978 251361 255139 258215 260219 261819 263743 265957 268022 269926 272157
53695B72157K991L806M420M656M290L325K182J373J036R82J019J058R59N48k09
53680C04593j111j803j943j456o61q2j8l79r19j451j766j666j231q56p98q22o04
53663B87027k50j36l05m30l85m52p63r33n29K47P64P27L99M5l87q89j074p15k86
53644B81675m19q91q19L5P60N73J2K63J518K750L030K452J720J385J622K248K736
53627C00650K683K380K465K851K716J818J176J817L338M401M320L546K858K687
53613C39706L158M028M618M385L676L385L785M270M349M297M552M938M986M628
53599C98761M217L914L480K698J760J165J176J466J452J005O20O94R33Q61O50
53584D24852Q83J521J791J214J77q10j804l054m359n275n688n723n335m442l321
$$ plain form
53695 272157 275148 278954 283374 288030 292320 295645 297827 299200 300236 301218 302237 303295 304254 304802 304593
53680 304593 303482 301679 299736 298280 297619 297537 297519 297140 296221 294770 293004 291338 290107 289251 288453 287631 287027
53663 287027 286777 286641 286336 285906 285521 285069 284306 283373 282844 283091 283855 284582 284981 285026 284639 283750 282676 281961 281675
53644 281675 281256 280365 279546 279581 280341 280914 280926 281189 282707 285457 288487 290939 292659 294044 295666 297914 300650
53627 300650 303333 305713 308178 311029 313745 315563 316739 318556 321894 326295 330615 334161 337019 339706
53613 339706 342864 346892 351510 355895 359571 362956 366741 371011 375360 379657 384209 389147 394133 398761
53599 398761 402978 406892 410372 413070 414830 415995 417171 418637 420089 421094 421714 422408 423341 424202 424852
53584 424852 425735 427256 429047 430261 430438 429628 427824 424770 420411 415136 409448 403725 398390 393948 390627
53569C90627k418j893j643j662j960k202j837p21O33J417J074k32j522j634l77
53554C75650J087J486Q74L36M75Q65J075J308J766K126K134K182K646L127L037
53539D00174K665K951M210N765O815P127O845O249N883O382P802R528J0966J2062
53525D95424J2958J3623J4086J4608J5273J5810J6109J6521J7256J7924J8202
53514F67794J8532J9563K1085K2318K3122K4194K5899K7627K8575K8701K8602
53503I36012K8786K9254K9578K9281K8367K7477K7099K6818K5863K4419K3558
53492A236512K3708K3965K3396K2317K1649K1545K1419K0978K0512K0249K0067
53481A476317J9832J9509J9037J8474J8217J8534J8925J8391J6412J3354R929
$$ plain form
53569 390627 388209 386316 384673 383011 381051 378849 377012 376291 376924 378341 379415 379183 377661 376027 375650
53554 375650 376737 378223 379097 379433 379908 380773 381848 383156 384922 387048 389182 391364 394010 397137 400174
53539 400174 402839 405790 410000 415765 422580 429707 436552 442801 448684 455066 462868 472396 483362 495424
53525 495424 508382 522005 536091 550699 565972 581782 597891 614412 631668 649592 667794
53514 667794 686326 705889 726974 749292 772414 796608 822507 850134 878709 907410 936012
53503 936012 964798 994052 1023630 1052911 1081278 1108755 1135854 1162672 1188535 1212954 1236512
53492 1236512 1260220 1284185 1307581 1329898 1351547 1373092 1394511 1415489 1436001 1456250 1476317
53481 1476317 1496149 1515658 1534695 1553169 1571386 1589920 1608845 1627236 1643648 1657002 1666931
53470A666931O582L447N12k261m849p256r766j2805j6268j9259k0891k1159k0699
53457A542259k0019j9426j9408k0381k2146k4101k5901k7380k8057k7424k5795
53446A282221k4165k3162k2626k2212k1751k0943j9507j7659j5878j4053j1628
53435A068637q760o449n217m406l180j488L73K367M304N592O113O755Q294J0217
53421A083152J1478J2066J2983J4884J7472K0138K2507K4394K5829K7089K8352
53410A300344K9392L0076L0868L2401L4736L7528M0551M3438M5404M6140M6731
53399A717609M8697N2089N5540N8235O0724O3482O5794O6789O6775O6789O7272
53388B389795O7901O8353O8524O8130O6727O4202O0887N7222N3485M9751M5908
$$ plain form
53470 1666931 1673513 1676960 1677472 1675211 1670362 1663106 1653340 1640535 1624267 1605008 1584117 1562958 1542259
53457 1542259 1522240 1502814 1483406 1463025 1440879 1416778 1390877 1363497 1335440 1308016 1282221
53446 1282221 1258056 1234894 1212268 1190056 1168305 1147362 1127855 1110196 1094318 1080265 1068637
53435 1068637 1059877 1053428 1048211 1043805 1040625 1039137 1039510 1041877 1046181 1051773 1057886 1064641 1072935 1083152
53421 1083152 1094630 1106696 1119679 1134563 1152035 1172173 1194680 1219074 1244903 1271992 1300344
53410 1300344 1329736 1359812 1390680 1423081 1457817 1495345 1535896 1579334 1624738 1670878 1717609
53399 1717609 1766306 1818395 1873935 1932170 1992894 2056376 2122170 2188959 2255734 2322523 2389795
53388 2389795 2457696 2526049 2594573 2662703 2729430 2793632 2854519 2911741 2965226 3014977 3060885
53377C060885M1812L7568L3453K9415K5068K0305J5640J1505P513K729l505j1334
53365C271054k0625l0922m1245n0440n7773o3051o6393o8252o9483p0765p1847
53354B660258p1851p0341o7772o4788o1576n8121n4671n1708m9669m8939m9663
53343B011159n1306n2682n2820n1703m9846m7413m4250m0606l7218l4508l2176
53332A516631k9720k6993k3946k0403j6527j3260j1674j1877j3008j4218j5155
53321A319850j5538j5017j3803j2823j2610j2466j1366r465p892p035n959l829
53309A192047j177R12K294L700N378O762P536Q304R776J1881J4074J6155J8321
53296A295963K0642K2946K5146K7258K9149L0618L1734L2738L3627L4158L4216
$$ plain form
53377 3060885 3102697 3140265 3173718 3203133 3228201 3248506 3264146 3275651 3283164 3285893 3282388 3271054
53365 3271054 3250429 3219507 3178262 3127822 3070049 3006998 2940605 2872353 2802870 2732105 2660258
53354 2660258 2588407 2518066 2450294 2385506 2323930 2265809 2211138 2159430 2109761 2060822 2011159
53343 2011159 1959853 1907171 1854351 1802648 1752802 1705389 1661139 1620533 1583315 1548807 1516631
53332 1516631 1486911 1459918 1435972 1415569 1399042 1385782 1374108 1362231 1349223 1335005 1319850
53321 1319850 1304312 1289295 1275492 1262669 1250059 1237593 1226227 1216762 1208870 1201835 1195876 1192047
53309 1192047 1190870 1191782 1194076 1197776 1203154 1209916 1217452 1225756 1235532 1247413 1261487 1277642 1295963
53296 1295963 1316605 1339551 1364697 1391955 1421104 1451722 1483456 1516194 1549821 1583979 1618195
53285A618195L3868L2978L1257K8770K6062K3520K0981J8160J5133J2070Q787
53274A869781N002Q44l195o793r952j2733j5199j7581k0129k2806k5295k7322
53262A714622k8858l0029l1046l2097l3156l4078l4978l6214l7692l8591l8240
53251A339643l6977l5561l4065l2152l0231k9334k9610k9903k9245k8081k7433
53240I97051k7478k7594k7367k6890k6240k5265k3845k2015j9871j7632j5615
53229G37239j3949j2514j1294j0472r961r309q407p826q113r106j0407j2008j3905
53216E99968j5516j6216j6163j5958j5687j5042j4087j3126j1961j0183q229p192
53204D40608p381p885p802p257o854o790o967p382p918q202q076p872p878p785
$$ plain form
53285 1618195 1652063 1685041 1716298 1745068 1771130 1794650 1815631 1833791 1848924 1860994 1869781
53274 1869781 1874783 1875627 1872432 1865639 1855687 1842954 1827755 1810174 1790045 1767239 1741944 1714622
53262 1714622 1685764 1655735 1624689 1592592 1559436 1525358 1490380 1454166 1416474 1377883 1339643
53251 1339643 1302666 1267105 1233040 1200888 1170657 1141323 1111713 1081810 1052565 1024484 997051
53240 997051 969573 941979 914612 887722 861482 836217 812372 790357 770486 752854 737239
53229 737239 723290 710776 699482 689010 679049 669740 661333 653507 645394 636288 625881 613873 599968
53216 599968 584452 568236 552073 536115 520428 505386 491299 478173 466212 456029 447800 440608
53204 440608 433227 425342 417540 410283 403429 396639 389672 382290 374372 366170 358094 350222 342344 334559
53190C34559p099n842m492l507l134l457m162m552m165l299k678k627k834k849
53176B79862k513j979j445r86n76k49j95m75q16r01p92p61p39l95K25N95L97j29
53158B68128o71j246j869k264k226j942j634j273r22r24j384j797j668j244j126
53143B45938j398j613j455r35j06Q82J579J629J330J281J493J336N41l35o42m65
53127B49060m14q32j414j531q27M29J508J884J682J386J180Q78L46k83q50j276
53111B50926j411j142p25o57j014j277j060p06p65j165j271q05k29j10l74m64
53095B37751j28K99L88K14J51K14q1r69j839j752n82O88J035M84n5N7N78R69J134
53076B38556J325J563J564J220Q05N43L50J32L1J31J88L7o2J07J59m09j286j616
$$ plain form
53190 334559 327460 321618 317126 313619 310485 307028 302866 298314 294149 290850 288172 285545 282711 279862
53176 279862 277349 275370 273925 272939 272363 272114 271919 271444 270628 269727 268935 268174 267435 267040 267265 267860 268257 268128
53158 268128 267457 266211 264342 262078 259852 257910 256276 255003 254081 253157 251773 249976 248308 247064 245938
53143 245938 244540 242927 241472 240537 240431 241313 242892 244521 245851 247132 248625 249961 250502 250167 249525 249060
53127 249060 248646 247814 246400 244869 244042 244471 245979 247863 249545 250931 252111 252989 253335 253052 252202 250926
53111 250926 249515 248373 247648 246991 245977 244700 243640 242934 242169 241004 239733 238928 238699 238589 238215 237751
53095 237751 237623 237922 238310 238524 238675 238889 238808 237839 236000 234248 233666 234354 235389 235873 235818 235875 236453 237422 238556
53076 238556 239881 241444 243008 244228 245033 245576 245926 246058 246089 246220 246408 246445 246383 246490 246649 246240 244954 243338
53058B43338j247r95j377j764j300j73O05M52k98q91p73J30J252J707J151K13
53042B40030k79l16m85r43j258j157q93p64p77q50r26p70j28P67J300J227R19
53025B34697P40N79K70k0r8j00j79j68J37N59P65P50O99N82K11l66q77j197j342
53006B35642j204o05L05R96J090O96J97j67l29k98j44LJ42M75J123J793J968J478
52988B43161P44L14L07L93K78J9r4J60O77J032Q95M96N20J217J916J839J189Q71
52970B55934J165J443J370J488K166K757K535J913J789K110K108J654J294R90
52956B80716L5j470k262j658p51j000k327l359l233k294j317p58p46j108j353
52941B57115j071m17P5J41o0l47o59r04r19o47k33N5r7p82j563j814j500j217
$$ plain form
53058 243338 242091 241096 239719 237955 236655 236482 237087 237539 237241 236350 235577 235707 236959 238666 239817 240030
53042 240030 239751 239435 238950 238007 236749 235592 234699 233935 233158 232308 231382 230612 230484 231251 232551 233778 234697
53025 234697 235437 236016 236286 236266 236168 236068 235889 235721 235858 236417 237182 237932 238631 239213 239424 239058 238181 236984 235642
53006 235642 234438 233833 234138 235134 236224 236920 237117 236950 236621 236323 236179 236182 236324 236799 237922 239715 241683 243161
52988 243161 243905 244219 244526 244919 245197 245216 245122 245282 245959 246991 247886 248382 248902 250119 252035 253874 255063 255934
52970 255934 257099 258542 259912 261400 263566 266323 268858 270771 272560 274670 276778 278432 279726 280716
52956 280716 280751 279281 277019 275361 274610 273610 271283 267924 264691 262397 261080 260322 259576 258468 257115
52941 257115 256044 255627 255702 255843 255783 255436 254777 253873 252954 252307 252074 252129 252032 251250 249687 247873 246373 245156
52923B45156j246j097m44J45M7k92j9P25R96N44R9J01J09k49o34o69n38m89m03
52904B41842k64l68o78o00M3M75N6o50o48P6O51O10K90J18J63L56N39L64k92r10
52884B41173q52k44K35K82J49n6m86r83j070o78k40P6N60J204J501J310J224J707
52866B44812K417K841K975K852K077M95j117j783j506j060q65p78q23j224j751
52851B47562j776j142l60K20P57J222R99l09k085l228l307k820k447k388k423
52836B28475k269j859j337q83n58l42k50l00l94l85k51j5L97J012J555J600J015
52819B25211R0p82j313j349r71n90n41n52k0J100K077K272J876J555J618J851
52803B31532J958J855J549R74L2j223k425l094l116k897k782k525j794r57p53
$$ plain form
52923 245156 243910 242813 242369 242514 242561 242269 242250 242975 243971 244515 244614 244715 244824 244575 243941 243272 242734 242245 241842
52904 241842 241578 241210 240532 239932 239975 240450 240506 239856 239208 239284 239935 240545 240835 240953 241116 241472 242011 242375 242083 241173
52884 241173 240321 240077 240312 240594 240743 240687 240201 239218 238148 237470 237230 237306 237866 239070 240571 241881 243105 244812
52866 244812 247229 250070 253045 255897 257974 258469 257352 255569 254063 253003 252138 251360 250537 249313 247562
52851 247562 245786 244644 244284 244504 245261 246483 247482 247173 245088 241860 238553 235733 233286 230898 228475
52836 228475 226206 224347 223010 222127 221569 221227 220977 220677 220283 219898 219647 219632 220029 221041 222596 224196 225211
52819 225211 225301 224519 223206 221857 220886 220296 219755 219203 219183 220283 222360 224632 226508 228063 229681 231532
52803 231532 233490 235345 236894 237868 237900 236677 234252 231158 228042 225145 222363 219838 218044 217087 216334
52788B16334j164j339q57k97k57m66l77m7J82L95Q76J482J892K190K534K550J706
52771B25337K41r57j369j165o49J7N27M99o5p60j269j515j379q09j57J10L9J09
52753B16785M64P61P25L80j99q86j196o71L96J139J204R88Q18N58K48L45J001
52736B22860J691K019K229K584K760K408J780J307R80P31Q81J579K159J846Q97
52721B48711K96L57L52l04j230j693j578j335j198r73o11n44j148j983k083j138
52705B33898j9K53k69p31o90l98l7M96R49P48jl76R6P56R00Q20J110J501J262
52686B40268L45n73r67p25J35J261J810J239J56l00J93R70J341J068J09j294k366
52669B42670k453j891j522j425r42KN81L01k64l60j0L29N52Q34J201J533J792
$$ plain form
52788 216334 215170 213831 212974 212677 212420 211954 211577 211530 211712 212107 212983 214465 216357 218547 221081 223631 225337
52771 225337 225578 224621 223252 222087 221438 221455 221982 222481 222416 221656 220387 218872 217493 216684 216527 216637 216676 216785
52753 216785 217249 218010 218735 219115 218916 218030 216834 216163 216559 217698 218902 219890 220708 221266 221514 221859 222860
52736 222860 224551 226570 228799 231383 234143 236551 238331 239638 240618 241349 242230 243809 245968 247814 248711
52721 248711 249007 249364 249716 249412 248182 246489 244911 243576 242378 241405 240794 240250 239102 237119 235036 233898
52705 233898 233879 234132 233863 233132 232442 232044 232007 232503 233452 234200 234199 233823 233919 234675 235575 236395 237505 239006 240268
52686 240268 240613 240040 239073 238348 238483 239744 241554 242793 242949 242649 242842 243812 245153 246221 246330 245036 242670
52669 242670 240217 238326 236804 235379 234437 234439 235020 235321 235057 234697 234687 235016 235568 236402 237603 239136 240928
52652B40928K002K274K829L649M061L235J213r62k305k635k300j772j571j931
52638B46715k340j976q07L20Q04Q24O12J00m77m56K22P22O46P67J677K574K389
52621B52316J487J068J292J178K46q99j706k284k664k402j386l74j52n75q15m29
52605B43901K51O31N99O91J382K292K493J810J204J374J616R32j60j22J295K458
52589B62647J970L68q38j048p70n26l37r1K21N39P44P19O24P72J024P17l62j402
52571B64971j448o51lp4n41q58q66o69m90o72j320j908j650m95O17P76P6o55q58
52552B53282o54m80n59p74q46o01j89M3j12m88p78r06j062j381j697j613q84L01
52534B40602J362J753J423Q21M52M18M87M96N45P59J028J082P58J67l91n91k89
$$ plain form
52652 240928 242930 245204 248033 251682 255743 258978 260191 259229 256924 254289 251989 250217 248646 246715
52638 246715 244375 242399 241592 241912 242716 243540 244152 244252 243775 243319 243541 244263 244909 245676 247353 249927 252316
52621 252316 253803 254871 256163 257341 257587 256688 254982 252698 250034 247632 246246 245872 245720 245145 244330 243901
52605 243901 244152 244783 245382 246073 247455 249747 252240 254050 255254 256628 258244 259176 259016 258894 260189 262647
52589 262647 264617 264985 264147 263099 262329 261803 261466 261375 261596 262135 262879 263598 264222 264994 266018 266735 266373 264971
52571 264971 263523 262872 262869 262795 262254 261396 260530 259861 259371 258699 257379 255471 253821 253326 253943 254719 254795 254140 253282
52552 253282 252628 252148 251589 250815 249969 249368 249179 249222 249110 248622 247844 246938 245876 244495 242798 241185 240301 240602
52534 240602 241964 243717 245140 245961 246413 246831 247318 247814 248359 249118 250146 251228 251986 252153 251762 251171 250882
52517B50882K64N52L56J27N26J506K196J917J060O37J142K193L204L914M193L756
52501B78425K415M30j542k878l271k854k149j759j840k030k004j907k054k307
52487B54675k140j314k63M09N93O82R50J199J064O20L77O74J227J471J229Q51
52471B62304P19Q20R29R95J209J671K148K193J685J181J473K564L426L143K078
52456B88538J310J068N22o80j710j873j833k598l812m161l346k503k516k885k684
52441B60837j902j185q25o10m57n43q95j250j333j024l94K83O23M95J52q6r8J60
52423B51948P72J536J851J334L76k69l64k98l49l21P2P63J439J876K048K105K329
52406B66848L042M395O216Q080R514J0247J0263R564P896M971J084k810n772p510
$$ plain form
52517 250882 251146 251698 252054 252181 252707 254213 256409 258326 259386 260023 261165 263358 266562 270476 274669 278425
52501 278425 280840 281270 279728 276850 273579 270725 268576 266817 264977 262947 260943 259036 256982 254675
52487 254675 252535 251221 250958 251367 251960 252642 253592 254791 255855 256475 256852 257526 258753 260224 261453 262304
52471 262304 263023 263843 264772 265767 266976 268647 270795 272988 274673 275854 277327 279891 283317 286460 288538
52456 288538 289848 290916 291438 290758 289048 287175 285342 282744 278932 274771 271425 268922 266406 263521 260837
52441 260837 258935 257750 256925 256315 255858 255315 254420 253170 251837 250813 250419 250702 251325 251820 251972 251886 251788 251948
52423 251948 252720 254256 256107 257441 257817 257548 257184 256886 256537 256216 256288 257051 258490 260366 262414 264519 266848
52406 266848 269890 274285 280501 288581 298095 308342 318605 328169 336065 341036 342120 339310 333538 326028
52392C26028q193p934o789n051l227j699o21J1L45N44N30N7p13j131q20j91K47
52375B91393P08J666K921L821M207M449M659M639M569M893N452N497M727L561
52361C47162K257O42j100k228k442k226j830q52O53J703J671J211J021O64l78
52346C45928j249o97J042K569L253L580L828L780L655M024M667M794M619N384
52332C89177P343R036R254Q673Q761R922J1587J3354J5153J6783J8107J9369K0705
52319E57224K1734K2151K2259K2314K1908K0747J9538J9201J9536J9565J9072
52308G85249J8779J9054J9258J8652J7303J5877J5012J4922J5205J4981J3687
52297I67979J1873J0608J0090R345P482M656J599j299l979o216p631q191q384
$$ plain form
52392 326028 317835 309901 303112 298061 294834 293135 292514 292525 292870 293414 293944 294001 293288 292157 291337 291146 291393
52375 291393 292101 293767 296688 300509 304716 309165 313824 318463 323032 327925 333377 338874 343601 347162
52361 347162 349419 350061 348961 346733 344291 342065 340235 339383 340036 341739 343410 344621 345642 346306 345928
52346 345928 344679 343982 345024 347593 350846 354426 358254 362034 365689 369713 374380 379174 383793 389177
52332 389177 396520 405556 414810 423483 432244 442166 453753 467107 482260 499043 517150 536519 557224
52319 557224 578958 601109 623368 645682 667590 688337 707875 727076 746612 766177 785249
52308 785249 804028 823082 842340 860992 878295 894172 909184 924106 939311 954292 967979
52297 967979 979852 990460 1000550 1009895 1017377 1022033 1023632 1022333 1018354 1012138 1004507 996316 987932
52284I87932q817r651j0383j0248q991p207n708m630l438j748K67K305M304O208
52270I30195P733Q711R430J0338J1586J3019J4420J5553J6064J5699J4639J3471
52258A080858J2751J2618J2785J2869J2786J2786J3033J3220J2891J2041J1120
52247A219758J0283Q988O654L429M9l019n869q658j1137j2900j3777j3884j3381
52234A166536j2499j1672j1329j1444j1481j1018j0233r616r294q913q214p362
52222A043461o600n861m968m016l256k684k027j130p9J004K100L140L963M532
52208A027579N020N603O201O575O590O339N965N483M844M214M014M508N394O067
52194A104396O259O174O021N718N279N008N038N020M614M059L731L418K553J029
$$ plain form
52284 987932 979115 969464 959081 948833 939842 932635 926927 922297 918859 917111 917378 919683 923987 930195
52270 930195 937928 946639 956069 966407 977993 991012 1005432 1020985 1037049 1052748 1067387 1080858
52258 1080858 1093609 1106227 1119012 1131881 1144667 1157453 1170486 1183706 1196597 1208638 1219758
52247 1219758 1230041 1239029 1245683 1249112 1249161 1246142 1240273 1231615 1220478 1207578 1193801 1179917 1166536
52234 1166536 1154037 1142365 1131036 1119592 1108111 1097093 1086860 1077244 1067950 1059037 1050823 1043461
52222 1043461 1036861 1031000 1026032 1022016 1018760 1016076 1014049 1012919 1012840 1013844 1015944 1019084 1023047 1027579
52208 1027579 1032599 1038202 1044403 1050978 1057568 1063907 1069872 1075355 1080199 1084413 1088427 1092935 1098329 1104396
52194 1104396 1110655 1116829 1122850 1128568 1133847 1138855 1143893 1148913 1153527 1157586 1161317 1164735 1167288 1168317
52180A168317p16k442m301o252p885q972r755j0374j0590j0303r874r579r078
52167A068196p945o340m772l395k064q59m0N09J279K459L658M441M745M604L823
52152A068299K318O36l26k82N7k28j111j586q48O50J653J514P69K68R1k89j049
52135A070536j682j705j245o28K56J822M063O400Q459J0517J2995J5730J8257
52122A143775K0595K3226K6175K8745L0403L1438L2327L2870L2500L1225K9719
52111A462998K8446K7191K5455K3007K0030J6992J4328J2016R619P051M966L946
52099A656045L564K898J793Q36J66q74k684m885p071r320j1645j3726j5612j7867
52085A581618k0454k2238k2311k1114j9471j7191j3744r856p073n780m769k936
$$ plain form
52180 1168317 1167601 1165159 1160858 1154606 1146721 1137749 1127994 1117620 1107030 1096727 1086853 1077274 1068196
52167 1068196 1060251 1053911 1049139 1045744 1043680 1042821 1042781 1043290 1044569 1047028 1050686 1055127 1059872 1064476 1068299
52152 1068299 1070617 1071253 1070927 1070645 1070702 1070474 1069363 1067777 1066929 1067579 1069232 1070746 1071515 1071783 1071874 1071585 1070536
52135 1070536 1068854 1067149 1065904 1065276 1065532 1067354 1071417 1077817 1086276 1096793 1109788 1125518 1143775
52122 1143775 1164370 1187596 1213771 1242516 1272919 1304357 1336684 1369554 1402054 1433279 1462998
52111 1462998 1491444 1518635 1544090 1567097 1587127 1604119 1618447 1630463 1640082 1647133 1652099 1656045
52099 1656045 1659609 1662507 1664300 1665136 1665302 1664428 1661744 1656859 1649788 1640468 1628823 1615097 1599485 1581618
52085 1581618 1561164 1538926 1516615 1495501 1476030 1458839 1445095 1435239 1428166 1422386 1417617 1414681
52073A414681m68J968M295O794R420J1860J3899J5446J6470J7179J7846J8315
52061A547705J8113J7281J6602J6601J6710J5874J3789J1190Q963P394O233N139
52049A701594L902K332J47k855o465j0048j3086j5629j8032k0362k2382k3975
52037A575141k5182k5799k5450k4246k2905k1932k1007j9513j7471j5551j4227
$$ plain form
52073 1414681 1414213 1416181 1420476 1427270 1436690 1448550 1462449 1477895 1494365 1511544 1529390 1547705
52061 1547705 1565818 1583099 1599701 1616302 1633012 1648886 1662675 1673865 1682828 1690222 1696455 1701594
52049 1701594 1705496 1707828 1707975 1705120 1698655 1688607 1675521 1659892 1641860 1621498 1599116 1575141
52037 1575141 1549959 1524160 1498710 1474464 1451559 1429627 1408620 1389107 1371636 1356085 1341858
$$ [...]
##END NTUPLES=NMR SPECTRUM
##END=
