
##TITLE=AC1415_BRAA12224_7652885_dGozNmR9BP
##JCAMPDX= 6.0         $$ Bruker NMR JCAMP-DX V2.0
##DATA TYPE= nD NMR SPECTRUM
##DATA CLASS= NTUPLES
##NUM DIM= 2
##ORIGIN= BRUKER
##OWNER= Administrator
$$ 1.72 TOPSPIN		Version 2.1
$$ 2013-03-20 03:57:20.914 -0500  Administrator@X
$$ Compression mode = diff/dup
##.OBSERVE FREQUENCY= 400.02188249412
##.OBSERVE NUCLEUS= ^1H
##.ACQUISITION MODE= SIMULTANEOUS (DQD)
##.ACQUISITION SCHEME= NOT PHASE SENSITIVE
##.AVERAGES= 4
##.DIGITISER RES= 22
##SPECTROMETER/DATA SYSTEM= spect
##.PULSE SEQUENCE= jresgppsqf.2
##.SOLVENT NAME= COFFEE_meoh
##.SHIFT REFERENCE= INTERNAL, COFFEE_meoh, 1, 14.961
##AUDIT TRAIL= $$ (NUMBER, WHEN, WHO, WHERE, PROCESS, VERSION, WHAT)
$$ ##TITLE= Audit trail, TOPSPIN		Version 2.1
$$ ##JCAMPDX= 5.01
$$ ##ORIGIN= Bruker BioSpin GmbH
$$ ##OWNER= Administrator
$$ $$ E:\/data/COFFEE/nmr/AC1415_BRAA12224_7652885_dGozNmR9BP/13/pdata/1/auditp.txt
$$ ##AUDIT TRAIL=  $$ (NUMBER, WHEN, WHO, WHERE, PROCESS, VERSION, WHAT)
(   1,<2013-03-20 03:57:11.602 -0500>,<Administrator>,<X>,<go>,<TOPSPIN 2.1>,
      <created by zg
	started at 2013-03-20 03:42:48.473 -0500,
	POWCHK enabled, PULCHK disabled,
       configuration hash MD5:
       86 BA 57 50 F2 9D 5C 9B 26 00 A9 28 5F 66 2E 89
       data hash MD5: 8K * 40
       1D 15 AF CF 4B 8E 53 C2 DF E8 C0 28 0C B3 4B AC>)
(   2,<2013-03-20 03:57:16.024 -0500>,<Administrator>,<X>,<proc2d>,<TOPSPIN 2.1>,
      <Start of raw data processing
       xfb same F2: SI = 16K WDW = 3 SSB = 0 FT_mod = 6 PKNL = 1 F1: SI = 512 WDW = 3 SSB = 0 FT_mod = 6 PH_mod = 2
       data hash MD5: 16K * 512
       99 E2 19 8D CC 0E 40 B9 1D 41 7A 5A 82 90 CE FB>)
(   3,<2013-03-20 03:57:16.899 -0500>,<Administrator>,<X>,<proc2d>,<TOPSPIN 2.1>,
      <abs2 F2: ABSG = 5 ABSF1 = 10.00089 ABSF2 = 0.0003555793
       data hash MD5: 16K * 512
       19 D9 43 26 7A C9 29 2A EE 23 2A AD 27 C4 40 4D>)
(   4,<2013-03-20 03:57:17.836 -0500>,<Administrator>,<X>,<proc2d>,<TOPSPIN 2.1>,
      <tilt
       data hash MD5: 16K * 512
       C6 0D CA DF 3D 04 D9 74 72 C7 8F 12 24 12 1D AB>)
(   5,<2013-03-20 03:57:19.289 -0500>,<Administrator>,<X>,<proc2d>,<TOPSPIN 2.1>,
      <abs1 F1: ABSG = 5 ABSF1 = 0.06497851 ABSF2 = -0.06497862
       data hash MD5: 16K * 512
       82 5F D1 CA 95 74 9A F0 5E 53 5F 7E 6F 2C 94 11>)
(   6,<2013-03-20 03:57:20.539 -0500>,<Administrator>,<X>,<proc2d>,<TOPSPIN 2.1>,
      <symj
       data hash MD5: 16K * 512
       F3 FB FB 60 40 AD CF 08 2E 21 D8 3B 57 A9 26 77>)
$$ ##END=
$$ 
$$ $$ hash MD5
$$ $$ 46 26 A6 FD 6A 3D 51 5F E3 21 A5 7D AF B5 B3 82
##$RELAX= 
##$RELAX= 
##$RELAX= 
##$RELAX= 
##$RELAX= 
##$RELAX= 
##$RELAX= 
$$ Bruker specific parameters
$$ --------------------------
##$DU= <E:\>
##$EXPNO= 13
##$NAME= <AC1415_BRAA12224_7652885_dGozNmR9BP>
##$PROCNO= 1
##$TYPE= <nmr>
##$USER= <COFFEE>
##$ACQT0= 1000000
##$AMP= (0..31)
100 100 100 100 100 100 100 100 100 100 100 100 100 100 100 100 100 100
100 100 100 100 100 100 100 100 100 100 100 100 100 100
$$ [...]
##$TD0= 1
##$TE= 300
##$TE2= 300
##$TE3= 300
##$TEG= 300
##$TL= (0..7)
0 120 120 120 120 120 120 120
##$TP= (0..7)
150 150 150 150 150 150 150 150
##$TP07= 0
##$TPNAME0= <>
##$TPNAME1= <>
##$TPNAME2= <>
##$TPNAME3= <>
##$TPNAME4= <>
##$TPNAME5= <>
##$TPNAME6= <>
##$TPNAME7= <>
##$TPOAL= (0..7)
0.5 0.5 0.5 0.5 0.5 0.5 0.5 0.5
##$TPOFFS= (0..7)
0 0 0 0 0 0 0 0
##$TUNHIN= 0
##$TUNHOUT= 0
##$TUNXOUT= 0
##$USERA1= <user>
##$USERA2= <user>
##$USERA3= <user>
##$USERA4= <user>
##$USERA5= <user>
##$V9= 5
##$VALIST= <valist>
##$VCLIST= <CCCCCCCCCCCCCCC>
##$VD= 0
##$VDLIST= <DDDDDDDDDDDDDDD>
##$VPLIST= <PPPPPPPPPPPPPPP>
##$VTLIST= <TTTTTTTTTTTTTTT>
##$WBST= 2048
##$WBSW= 25
##$XGAIN= (0..3)
0 0 0 0
##$XL= 0
##$YL= 0
##$YMAX_a= 66083
##$YMIN_a= -127964
##$ZGOPTNS= <>
##$ZL1= 120
##$ZL2= 120
##$ZL3= 120
##$ZL4= 120
##$ABSF1= 0.06497851
##$ABSF2= -0.06497862
##$ABSG= 5
##$ABSL= 0
##$ALPHA= 0
##$AQORDER= 0
##$ASSFAC= 0
##$ASSFACI= 0
##$ASSFACX= 0
##$ASSWID= 0
##$AUNMP= <>
##$AXLEFT= 0
##$AXNAME= <F1>
##$AXNUC= <1H>
##$AXRIGHT= 0
##$AXTYPE= 0
##$AXUNIT= <>
##$AZFE= 0.1
##$AZFW= 0.5
##$BCFW= 0
##$BC_mod= 0
##$BYTORDP= 0
##$COROFFS= 0
##$CY= 15
##$DATMOD= 1
##$DC= 0
##$DFILT= <>
##$DTYPP= 0
##$F1P= 0
##$F2P= 0
##$FCOR= 0.5
##$FTSIZE= 512
##$FT_mod= 6
##$GAMMA= 0
##$GB= 0
##$INTBC= 1
##$INTSCL= 1
##$ISEN= 128
##$LB= 0
##$LEV0= 0
##$LPBIN= 0
##$MAXI= 10000
##$MC2= 0
##$MEAN= 0
##$ME_mod= 0
##$MI= 1
##$NCOEF= 0
##$NC_proc= -4
##$NLEV= 6
##$NOISF1= 0
##$NOISF2= 0
##$NSP= 0
##$NTH_PI= 0
##$NZP= 0
##$OFFSET= 0.06497851
##$PC= 4
##$PHC0= 0
##$PHC1= 0
##$PH_mod= 2
##$PKNL= no
##$PPARMOD= 1
##$PPDIAG= 0
##$PPIPTYP= 0
##$PPMPNUM= 2147483647
##$PPRESOL= 1
##$PSCAL= 1
##$PSIGN= 0
##$PYNMP= <proc.py>
##$REVERSE= no
##$SF= 400.021882494141
##$SI= 512
##$SIGF1= 0.06497851
##$SIGF2= -0.06497862
##$SINO= 16
##$SIOLD= 512
##$SPECTYP= <>
##$SREGLST= <1H.MeOD>
##$SSB= 0
##$STSI= 512
##$STSR= 0
##$SW_p= 51.9856959427865
##$SYMM= 3
##$S_DEV= 1363
##$TDeff= 40
##$TDoff= 0
##$TI= <>
##$TILT= yes
##$TM1= 0
##$TM2= 0
##$TOPLEV= 0
##$USERP1= <user>
##$USERP2= <user>
##$USERP3= <user>
##$USERP4= <user>
##$USERP5= <user>
##$WDW= 3
##$XDIM= 16
##$YMAX_p= 158565092
##$YMIN_p= 0
$$ End of Bruker specific parameters
$$ ---------------------------------
##NTUPLES= nD NMR SPECTRUM
##VAR_NAME=  FREQUENCY1,    FREQUENCY2,      SPECTRUM
##SYMBOL=    F1,            F2,              Y
##.NUCLEUS=  1H,            1H
##VAR_TYPE=  INDEPENDENT,   INDEPENDENT,     DEPENDENT
##VAR_FORM=  AFFN,          AFFN,            ASDF
##VAR_DIM=   512,           16384,           16384
##UNITS=     HZ,            HZ,              ARBITRARY UNITS
##FACTOR=    0.101534562388255, 0.501933850740131, 1
##FIRST=     25.9928259484165, 8223.18227667557, 829
##LAST=      -25.8913354319817, 0,           -450
##MIN=       -25.8913354319817, 0,           0
##MAX=       25.9928259484165, 8223.18227667557, 158565092
##PAGE= F1=25.99282594842
##FIRST=     25.9928259484165, 8223.18227667557, 829
##DATA TABLE= (F2++(Y..Y)), PROFILE
$$ [...]
##PAGE= F1=0.1015125394115
##FIRST=     25.9928259484165, 8223.18227667557, 1184
##DATA TABLE= (F2++(Y..Y)), PROFILE
4918 -1934 -950 -339 181 1330 3043 4384 4834 4278 3671 3352 3457 3734 3663 2752 1443 -74 155 1831 2663
4899 2663 2145 811 -1017 -2987 -1991 -983 -479 205 1301 1912 1537 254 -1633 -2062 -1144 -1135 -2184 -3002 -1883
4880 -1883 -1907 -2586 -1125 -80 236 -235 -577 -821 -1092 -1792 -1478 -751 -1415 -2727 -3675 -2512 -1721 -1857 -2472
4861 -2472 -1749 -1010 -1088 -1177 -254 682 938 490 -108 -550 -1213 -2044 -2434 -1290 -499 223 784 693 -138 -637
4841 -637 -222 470 249 -978 -1763 -649 -4 -415 -1389 -2957 -2845 -1677 -786 -125 -774 -2048 -2953 -1549 -956
4822 -956 -1674 -2289 -1936 -1382 -862 498 1579 1711 440 -1855 -3214 -1647 -1029 -1210 -1393 -1101 -475 -202 -387
4803 -387 -1324 -2048 -715 1269 2573 2773 2143 876 -315 -854 -634 -395 -459 -710 -702 -824 -1868 -2572 919 3745
4783 3745 5181 4622 2066 -1048 -3540 -1733 -1151 -1781 -2728 -3417 -2926 -2905 -3490 -3352 -2163 -1023 -574 -1063
4765 -1063 -2118 -1469 1 -55 -574 -418 361 370 -893 -2020 -183 630 -107 -1205 -363 776 704 -363 -1758 -2262
4745 -2262 -3370 -3190 -1547 -306 -169 -1175 -2661 -1819 -332 780 1601 1843 1509 827 156 -54 -603 -1552 -1614
4726 -1614 -956 -1073 -966 60 377 151 -516 -490 -231 -587 -407 1301 2595 2330 1121 1155 2036 1717 -391 -2811
4706 -2811 -73 1032 -27 -3013 -368 1937 2144 666 -1438 -2738 -3135 -2722 -1029 300 490 -212 -739 -855
4688 -855 -1677 -2109 -85 1775 2286 1753 996 608 -517 -2137 -1672 -870 -983 -468 1228 1660 636 -1142 70
4668 1749 938 -1877 -1216 1487 2246 679 -2389 -248 1640 1858 1618 1546 866 -921 -3270 -859 -52 -1579
4650 -1579 -1558 1051 2098 1034 -1174 -253 872 -2 -2180 -1215 -491 -1678 -1499 1650 3223 1787 -1040
4632 950 2664 1563 -1267 808 3252 3471 2477 2862 3981 2659 -1271 -787 2303 1960 -1120 629 4862
4615 4862 6806 5287 2378 624 -304 -1490 1477 4347 4789 3298 3457 5144 4292 7 -545 4391 5659
4598 5659 3480 2620 5588 6523 2762 -674 5227 7801 5540 2486 6213 10165 9582 6563 9658 17525
4582 17525 26804 39287 55275 71533 83968 89396 86368 74623 56891 38472 25148 18492 11838
4569 11838 4379 6350 11904 11266 4996 5283 10926 10825 5861 7219 13525 13783 6379 3253 11369 12995
4553 12995 6145 1072 9213 11533 5821 4413 13398 15267 6834 1695 15008 19455 12396 4919
4538 15929 21650 15657 6042 16314 22227 15245 4874 19656 28643 22657 9185 19193 30037 23930
4524 23930 2259 17088 32924 29441 14763 24821 40097 35654 12547 18366 39528 36698 12865
4510 26448 52748 52037 23067 27846 59994 61100 27924 32554 75064 81501 43946 34363 87702
4497 87702 102223 61622 33251 101459 125566 79017 38836 128447 166570 115035 58496 170984
4485 170984 229578 167195 71502 236842 342472 270316 103705 339012 531723 459154 199151
4473 563601 969751 970438 633743 1146506 2002661 1994753 282249 3695313 9791914 17233007
4463 17233007 24671601 30545600 33519914 32898549 28833562 22273815 14677865 7583142
4455 7583142 2172015 1014696 2087988 1712860 839704 759850 1034154 860706 382720
4445 273043 521818 491097 242210 147327 315187 317994 166763 82741 209882 228171 131846
4434 131846 45771 140742 164197 102652 39920 105114 127292 83235 21712 73132 97202 66509
4422 66509 23338 65382 87794 65558 20601 40104 61034 45752 11100 38558 58379 47180
4410 47180 17513 30007 49007 41244 13569 20663 39926 35909 12985 14593 32303 31425 14931
4396 13473 27326 27404 12126 7496 21988 23382 11939 8353 20165 20686 8640 6911 20377 23128
4382 23128 14393 3509 13286 17647 11349 1194 9620 12504 6190 4886 15487 19109 12524 2931
4367 10642 15994 12388 3455 6647 12355 10209 3457 6602 11641 9737 2947 8031 14226 13331 5988
4351 5629 13086 14645 9447 7140 19917 36007 50962 64321 75245 82790 84586 78827 64915
4338 64915 44957 24034 10747 11210 11268 6689 4878 9033 9790 5642 1974 5485 6907 4159 2681
4323 2681 5769 7073 4484 -1098 -1388 945 14 -321 2551 3188 838 -1049 2422 4188 1847 -2755 1596
4305 4741 3889 -263 74 3006 2593 -871 425 3173 3178 1880 3857 6207 6043 3207 -854 -975 -426 -1201 709
4285 2849 2981 785 -1361 -253 238 -455 1235 3488 4360 3689 2667 2348 1331 -1278 173 3150 3893
4268 3893 2124 -121 1401 2299 811 -2076 752 2103 1047 -1743 -925 1419 2161 1396 206 -678 -8 2178
4249 4662 5835 5127 2677 -637 -451 904 1472 1319 405 -1196 -944 1844 3814 4089 2867 948 -658 2
4230 1964 3947 4624 3541 1004 -1621 807 1814 815 -1242 -1357 -263 -490 -1474 -2224 -2459 -2976 -1674
4213 -1674 -684 -670 -353 1222 2126 1642 -255 -1192 1033 2585 2362 642 -1779 -1062 -199 -346 -549 -725 -1280
4194 -1280 -1758 -629 164 -27 -961 -721 153 299 -473 -1702 -1256 -565 -566 -1059 -1316 -315 1412 3282 3871 3206
4174 3206 1473 -82 -1175 -1208 -294 939 1819 1909 912 -749 -2066 -1848 -1181 -503 -58 -68 -883 -2066 -1150 -503
4153 -591 -979 -1144 -1431 -1240 -1006 -851 -1479 -915 783 2849 3994 3756 2701 1080 354 733 1445 2364 2621
4134 2621 2277 1386 1240 1190 763 -246 -1292 159 1109 1530 1561 1313 1022 969 1121 1407 1426 1094 923 976 956
4113 956 959 1405 1742 1851 1493 1444 1887 2457 2615 2020 1023 -119 -1341 -1264 -308 190 80 -342 -593 -1183 -2126
4092 -2126 -1992 -973 -498 -653 -96 1127 1868 1561 522 65 928 1587 1348 139 -1331 -1551 -730 93 700 1242
4072 1242 1444 1251 560 -640 -1673 -1102 -177 83 -324 -699 -882 -1084 -1158 -862 -125 869 2016 2994 3336 2804
4052 2804 1280 -625 -1433 -855 -1185 -2103 -1714 -950 -477 -422 -391 -154 367 927 1282 1275 548 -689 -1894 -2449
4032 -2449 -2927 -2682 -1396 -43 1252 1798 2208 2207 1972 1681 1702 1580 942 -713 -1832 -797 282 824 824 543 381
4011 381 287 143 -99 -161 -6 191 314 206 -571 -1793 -2925 -3810 -3772 -3451 -3013 -2430 -1091 22 1009 1772 2545
3990 2545 3018 3157 2706 1878 423 -1300 -483 275 520 355 -347 -910 -1386 -1402 -861 -110 748 1777 2806
3971 2806 3733 4716 5443 5651 5546 5096 4475 3600 2525 1812 1281 501 -765 -2141 -1821 -1086 -1443 -2556 -1300
3952 -1300 -223 205 -212 -1202 -2262 -1874 -957 -973 -1554 -2022 -2280 -2155 -1688 -953 -307 251 230 -181 -651 -1167
3932 -1167 -1335 -1632 -2081 -1996 -913 -264 -483 -662 -1038 -1290 -1297 -1127 -1331 -1701 -1541 -1109 -640 -433 -145 22 -39
3910 -362 -1009 -1083 -1077 -880 -1307 -2149 -324 1274 2106 2127 1530 962 686 609 447 657 747 637 1 -633 -909 -216
3887 785 1442 1878 1929 1687 1365 1082 841 633 375 209 289 511 649 354 -351 -732 -631 -642 -1358 -1908 -498
3865 771 1521 1466 1139 1033 1112 1178 963 492 -328 -1151 -1449 -1778 -2296 -2297 -2177 -1869 -1469 -1126 -1113 -1129 -834 -340
3842 405 1419 2198 2309 1915 1436 790 85 -734 -1406 -1951 -2291 -2232 -1681 -1285 -1331 -1662 -1882 -1957 -2135 -2351 -1998
3821 -1998 -1826 -1757 -1779 -1936 -1582 -1299 -1217 -1153 -900 -636 94 601 819 349 -305 -819 -993 -1008 -740 -707 -691 -666 -941
3798 -941 -1309 -1551 -1625 -1515 -1551 -1342 -958 -471 83 531 750 698 452 280 132 18 -328 -858 -1351 -1239 -525 271
3775 618 100 -393 -103 -23 -410 -1717 -1960 -369 903 1298 847 169 -345 -590 -969 -1410 -1373 -1230 -1520 -2306
3755 -2306 -1684 -364 1048 1961 2162 1721 1632 1693 1626 1283 685 161 -113 -92 -42 -208 -1013 -1700 -1219 -114 554
3733 570 211 -306 -624 -747 -1054 -1680 -2097 -1734 -898 -248 397 581 -100 -1205 -2400 -2888 -2915 -2455 -1992 -1226
3713 -1226 -389 448 1369 2220 2828 3336 3402 3023 2592 2184 2029 1613 1141 705 564 837 1268 1873 2547 3339
3693 3339 4155 4362 3302 1763 139 -1197 -1526 -1432 -1638 -1293 -821 -569 -866 -946 -359 473 980 1013 307 -882
3672 -462 632 1356 1628 1319 598 -215 -883 -1060 -360 -197 233 520 647 388 -161 -857 -1491 -1793 -1987 -1892
3652 -1892 -1504 -807 -102 366 484 377 -22 -210 -342 -523 -811 -1421 -1962 -1843 -1516 -601 438 1289 1480 1139
3632 1139 387 -3 474 1165 1220 871 389 230 545 942 1314 1434 1381 1180 955 785 685 759 763 744 810 714 557
3609 557 204 -246 -727 -1312 -1982 -1365 -279 772 1879 3146 3892 4108 3550 2172 1050 -66 -752 -1146 -1138 -831
3589 -831 -565 -635 -664 -845 -1117 -1161 -870 -401 -57 170 286 261 84 19 200 309 682 1200 1864 2613 3245 3656
3567 3656 3429 2709 1724 706 -228 -656 -732 -514 -18 645 615 195 -602 -1441 -1964 -2138 -2174 -2014 -1875 -1538 -1162
3546 -1162 -777 -698 -959 -1484 -1922 -2649 -3146 -2519 -1915 -1536 -988 -666 -508 -557 -747 -900 -1151 -926 -688 -607 -554
3525 -554 -543 -477 -337 -103 -112 -573 -1500 -573 534 1600 2439 2578 1962 863 56 -1018 -1539 -1291 -818 -505 -587
3504 -587 -1130 -1920 -2311 -1697 -1728 -2187 -2391 -1162 139 1396 1908 1772 1321 120 -1356 -1816 -595 251 783
3485 783 949 731 300 179 705 1725 2434 2283 1792 1195 346 -727 -1778 -1532 -731 -106 -46 -362 -605 -788
3465 -788 -1173 -1720 -2095 -2083 -2069 -2310 -1933 -1020 -213 365 692 630 421 251 221 218 113 -115 -436 -460 -431 -611 -1020
3442 -1020 -1370 -1195 -900 -612 -462 -415 -393 -317 -170 -39 37 -145 -311 -399 -656 -947 -1167 -1181 -1303 -1506 -1710 -1756
3420 -1756 -1754 -1533 -1460 -1413 -1189 -605 -238 -220 -209 -549 -712 -240 556 1070 1290 1089 606 -119 -966 -1626 -2044 -2010
3398 -2010 -1556 -1113 -785 -405 -273 -338 -474 -635 -554 -369 -99 153 449 275 -344 -1155 -1858 -1993 -1890 -1742 -1936
3377 -1936 -2124 -2136 -1904 -1743 -1604 -895 -327 -301 -458 -850 -1291 -1318 -818 -697 -760 -850 -870 -906 -1087 -1416 -1841 -2333
3355 -2333 -2040 -1389 -676 -517 -641 -754 -330 193 405 69 -756 -1483 -1025 159 1259 2178 2833 2611 2033 1957
3335 1957 1965 1610 996 409 -133 -325 -3 603 978 1063 887 651 202 -188 -687 -1180 -1203 -1159 -771 -348 -33 -206
3313 -206 -1088 -1653 -487 494 926 722 83 -540 -34 1312 2641 3456 3706 3470 2852 2050 1394 945 601 434
3293 434 368 199 -341 -538 -388 552 1562 2465 2931 3155 3027 2780 2330 1794 1379 902 334 18 -529 -1505
3273 -1505 -2325 -2658 -2587 -2550 -1866 -1248 -957 -495 30 598 932 801 414 -222 -995 -1826 -2018 -1178 -153 569 1119
3252 1119 1698 2269 2804 3219 3271 2920 2140 1114 139 -835 -1007 -691 -372 -404 -664 -1166 -1502 -1300 -801 169
3231 1156 1879 2051 1775 1278 766 324 -73 -426 -1072 -1771 -1327 -74 439 730 777 738 370 -282 -943 -1178 -1039
3210 -1039 -605 -339 -196 67 223 305 251 393 312 458 229 -137 -337 -602 -779 -768 -518 -128 260 422 368 133
3187 -123 -298 -775 -1351 -1527 -1369 -1330 -957 -389 141 490 682 572 657 717 829 840 687 220 -375 -1039 -1818
3166 -1818 -833 256 778 735 94 -558 -216 400 1218 1445 1453 1759 2340 2806 2883 2345 1362 262 -819 -1373 -1395 -1210
3144 -1210 -1418 -2008 -1265 -320 62 377 11 -919 -2148 -2478 -1486 -126 793 1058 547 -480 -1605 -1054 -621 -824
3124 -824 -1765 -2985 -2799 -1371 -30 981 1332 1068 315 37 670 1406 1594 1100 -143 -1891 -2581 -1175 11 439
3104 439 694 478 157 -27 6 327 337 -67 -733 -1486 -1272 -412 609 1336 1823 2191 2411 2650 2423 1531 -4 -1496
3082 -1496 -2337 -1732 -867 -488 -499 -722 -557 -377 -625 -598 -652 -569 -355 -173 98 424 746 800 551 657 792 664
3060 664 287 -216 -873 -1401 -1305 -1072 -883 -672 -442 -377 -214 259 947 1458 1750 1507 811 -198 -917 -1642 -1602
3039 -1602 -1548 -1005 -560 -331 -419 -544 -265 246 789 1004 1018 756 366 93 -334 -690 -980 -1063 -1008 -872 -670 -240
3016 317 1021 1705 2107 2045 1439 317 -864 -1842 -2020 -1814 -1416 -1511 -2006 -1331 -516 -22 150 -23 -249 -805 -1862
2995 -1862 -3053 -2006 -448 399 713 469 -365 -1840 -2513 -1039 -80 292 103 -515 -1453 -2310 -1296 -490
2976 -147 -231 -807 -1525 -1530 -535 707 1764 2591 2844 2613 1983 1091 -65 -954 -1240 -913 -514 -45 637 1369 2203
2955 2203 2875 2728 1958 474 -1000 -667 -115 414 882 515 -602 -1640 -1030 -49 286 345 208 -36 38 677
2935 677 1605 1988 1908 1196 298 -732 -1444 -1837 -1830 -1498 -1157 -788 -614 -645 -601 -495 -539 -764 -1002 -1229 -1153 -1054 -607
2912 -607 -177 31 18 -374 -1186 -2135 -2407 -1002 357 1185 1364 347 -1441 -2178 -285 1972 3763 4896 5239
2893 5239 4860 3788 2582 1262 313 -431 -1384 -1534 -966 379 1948 3332 4175 4024 3347 2282 1027
2875 107 -358 -397 -196 193 519 512 134 -704 -1582 -2096 -1975 -1323 -973 -806 -790 -843 -780 -323 160 710 1236 1478
2853 1478 1527 1404 1437 1446 1682 1673 1402 1074 1287 1994 2721 3255 2821 1954 1271 1347 1566 1597 1494 1368 1064 430
2830 -352 -1131 -2005 -2256 -2024 -1925 -1901 -2119 -1721 -1184 -583 -183 -87 -102 -115 31 256 505 926 1489 2005 2164 1570
2808 1570 523 -895 -2479 -2328 -961 101 628 572 111 -158 -46 420 1024 1332 1220 899 392 -193 -1022 -1763
2788 -1763 -1504 -993 -724 -729 -1007 -1362 -1705 -1285 -1068 -1262 -1831 -2089 -1105 -67 1008 1895 2289 2361 1931 1592 1496
2767 1496 2107 3039 3875 4240 3851 2828 1717 703 -165 -652 -599 -7 762 1531 2087 2353 2206 1680 817 -60
2746 -283 253 1183 1988 2776 3204 3768 4246 4414 3866 2584 995 -477 -1955 -2742 -2362 -2110 -2294 -2023 -976
2726 206 981 1253 1228 795 331 -81 -311 -512 -867 -1288 -1545 -2022 -2642 -2405 -2037 -1866 -1849 -1447 -1000 -78 800
2704 1277 1325 1297 1118 852 548 92 -584 -992 -1032 -926 -748 -584 -652 -836 -1044 -742 -284 149 348 322 76 -427
2681 -1034 -1562 -1804 -1960 -2098 -2397 -3262 -3361 -3147 -2407 -1662 -1122 -815 -511 -73 466 1281 1927 2321 2291 1733 891
2660 891 186 227 630 863 467 -428 -1039 -597 -50 40 -264 -808 -1162 -1318 -1482 -1744 -1395 -1041 -1000 -906 -842 -643
2638 -643 -269 165 882 1709 2263 2384 1695 244 -1562 -1811 -414 641 709 170 -678 -1126 -528 603 2226 3423
2618 3423 3413 2892 1528 72 -977 -934 -155 557 731 486 29 -423 -713 -955 -1081 -1270 -1458 -1607 -1312 -1222 -742
2597 -742 82 1033 1431 1459 952 558 364 123 18 179 571 964 1106 835 191 -734 -515 421 797 504 -142
2575 -700 -581 408 1366 1890 1974 1670 790 -141 -612 -298 -104 -38 -339 -790 -1218 -1427 -1560 -1395 -1447 -1526 -1525 -1822
2553 -1822 -1509 -1113 -861 -995 -1128 -1165 -972 -1005 -1118 -509 567 1507 1929 1810 1088 220 -1082 -2289 -712 404
2532 1030 1172 1023 610 162 -229 -731 -943 -605 -87 546 1021 1462 1910 2283 2571 2544 2233 1965 1623 1350
2512 1350 1042 787 601 877 833 351 -522 -1833 -1799 -784 -62 444 663 455 49 -615 -1359 -2296 -1378 -360 393
2490 947 1247 1436 1429 1134 722 232 -280 -868 -1559 -1159 -406 243 582 877 1295 1928 2207 1992 1431 831 332
2468 374 579 782 811 763 796 974 725 39 -1142 -1410 -168 660 1001 780 123 -647 -1180 -711 308 1322 2128
2447 2128 2634 2635 2230 1697 1418 1224 752 -13 -456 -746 -845 -1046 -1102 -430 454 1351 2188 2929 3199 2960 2766
2426 2766 2530 1890 1361 930 178 -852 -1941 -1551 -475 374 846 947 1183 1686 2242 2773 2884 2675 2181
2407 2181 1471 524 -356 -1193 -1655 -1782 -2006 -1956 -1193 -580 -44 167 2 -469 -1401 -1347 -97 1101 1930 2387 2193
2386 2193 1820 1185 724 454 325 156 33 -257 -308 -411 -341 70 480 750 992 1139 1379 1612 1721 1588 1423
2365 1423 1419 1520 1684 1673 1466 763 -244 -1220 -738 -274 -33 394 844 1177 937 331 -431 -872 -817 -353 -208
2344 -208 -244 -730 -1342 -1733 -1307 -799 -250 335 924 1156 1106 566 -290 -1204 -1449 -1721 -1991 -1404 -657 4 124
2323 124 -108 -812 -1218 -1069 -465 -76 2 -306 -875 -1641 -1753 -1055 -532 -383 -598 -1022 -1720 -2581 -2647 -2523 -1913
2302 -1913 -1003 -376 -147 -61 18 29 132 90 -383 -1060 -1583 -551 455 920 804 568 227 76 -189 -511 -782
2281 -782 -1145 -1554 -2020 -1569 -443 387 792 892 987 709 49 -738 -757 -76 279 273 -502 -1387 -2342 -1273 -290 141
2258 186 -310 -995 -1940 -2440 -2249 -1900 -1511 -1075 -690 -557 -748 -1113 -690 185 777 1042 1009 947 899 891 831 603
2236 603 191 -496 -1278 -1752 -1533 -1562 -1558 -1602 -1481 -995 -689 -536 -439 -337 -292 -334 -464 -687 -967 -1182 -1342 -1550
2214 -1550 -1749 -1985 -1480 -1371 -1126 -1210 -1303 -1525 -1898 -1749 -1601 -1406 -860 -110 492 519 172 -429 -1239 -1874 -1068
2193 -1068 -590 -441 -670 -926 -1090 -1358 -1539 -1472 -1283 -1067 -686 -409 -337 -515 -950 -1606 -2297 -2049 -1799 -1342
2173 -1342 -1072 -681 -396 -197 37 85 270 323 30 -357 -991 -1378 -944 -129 520 665 545 245 -39 -272 -466
2152 -466 -652 -685 -440 49 554 860 617 210 -121 162 557 791 848 819 867 1011 934 372 -731 -1379 -363 589
2129 1192 1050 593 -149 -870 -1640 -1491 -1655 -2255 -2532 -2486 -2361 -2122 -1896 -1507 -1381 -1240 -1089 -920 -952 -1496
2109 -1496 -2576 -2408 -971 764 2301 2814 2545 1371 175 -82 568 985 893 384 -518 -1275 -435 330 957
2090 957 1299 1361 1163 896 716 521 251 50 11 -53 14 275 458 499 339 94 119 204 286 315 176 -80 -420 -576
2066 -576 -825 -1023 -909 114 569 696 347 -158 -700 -1370 -1823 -1824 -1798 -1147 -310 542 1608 2399 2480 1915 946
2044 367 39 -184 64 483 524 45 -905 -1731 -1563 -802 15 556 585 271 -121 -400 -648 -955 -1074 -846 -415 -151
2021 -239 -722 -1109 -982 -310 250 380 126 -672 -1924 -1355 -26 872 950 417 -498 -1583 -2638 -3109 -2966 -2679
2001 -2679 -2353 -1774 -1100 -603 -265 -52 149 66 -167 -675 -1102 -236 866 1458 1388 668 -528 -1351 -1160 -1382 -2250
1980 -2250 -2228 -1216 -188 430 541 426 629 1268 2110 2555 2319 1987 1681 1195 831 631 571 563 531 640 635 547
1958 547 621 774 582 -118 -1103 -1171 -740 -569 -630 -712 -30 544 724 486 -279 -1117 -1752 -1868 -1305 -389 328 899
1936 899 1239 1169 964 863 1127 1729 2658 3658 4271 4764 4247 3366 2066 508 -575 -698 43 279 -74 -575
1916 -575 -1234 -1667 -1897 -1654 -1265 -753 -3 694 1116 1213 661 332 88 -84 -330 -960 -1581 -2145 -1886 -1574 -1021 -681
1894 -681 -604 -886 -1453 -2019 -1435 -578 470 1289 1737 1760 1355 869 575 405 323 469 527 631 749 618 340
1873 340 260 262 78 -392 -1025 -1519 -701 476 1546 2300 2746 2563 2052 1502 962 343 -416 -1061 -1164 -480 52
1851 352 383 385 391 538 597 531 191 -389 -961 -1635 -1518 -1038 -733 -549 -487 -370 -188 -251 -688 -1102 -743 -123 491
1827 850 760 243 -349 -689 -760 -647 -538 -652 -1108 -1595 -1956 -1683 -1746 -1966 -1966 -2076 -2136 -1788 -1512 -1146 -949 -795
1805 -795 -787 -1137 -1736 -2144 -2416 -1994 -1365 -1060 -1094 -1038 -1094 -1077 -1011 -1014 -1081 -934 -589 -177 99 152 -161 -564 -914 -976
1781 -976 -679 -46 689 1332 1334 893 109 -833 -1377 -1248 -940 -419 236 383 436 508 356 -39 -686 -873 -338 318
1758 790 792 339 -27 -83 318 485 132 -331 -304 291 897 1048 736 94 -521 -761 -822 -770 -972 -1394 -1767 -1508 -1171
1735 -1171 -662 -379 -462 -784 -1284 -1734 -1957 -1782 -1210 -417 306 919 902 619 205 -53 -94 110 214 -65 -244
1714 -244 -910 -1648 -1554 -1034 -317 672 1297 1556 1370 1056 887 1070 1437 1644 1825 1649 1311 746 -207 -1153
1694 -1153 -1812 -1625 -1635 -1798 -1288 -125 680 1082 1002 590 118 -753 -1592 -1757 -1369 -997 -859 -973 -1016 -1041 -1054
1673 -1054 -1108 -1346 -1591 -1615 -1656 -1781 -1553 -1256 -1165 -1164 -1175 -1097 -1161 -1415 -1608 -1276 -1213 -899 -521 -533 -383 -91 157 380
1649 380 347 342 301 648 1039 1225 1039 979 626 424 570 714 961 962 815 600 101 -646 -1379 -810 -23 780 1088
1626 1088 1188 970 559 94 -472 -756 -1160 -1491 -1198 -817 -786 -1117 -1720 -2154 -1365 -671 -465 -577 -709 -695 -605
1605 -605 -426 -343 -353 -183 131 369 791 1509 1986 2340 2304 1825 1182 158 -576 -901 -1030 -660 -433 92 449
1584 449 647 566 297 444 960 1359 1383 1079 942 628 111 -606 -1543 -1694 -858 -143 394 510 493 182 -345
1562 -917 -1130 -1192 -1521 -2162 -2822 -2194 -1435 -708 -397 -252 -505 -317 80 84 16 74 -354 -878 -798 342 1324 2030
1540 2030 2307 2148 1479 369 -1027 -1432 252 1424 1979 1867 1774 1771 1976 2410 2460 2110 1367 376 -649 -990
1520 -990 -580 9 293 297 110 -270 -639 -1230 -1717 -1810 -1622 -1260 -820 -520 -509 -698 -1274 -1919 -2039 -1929 -1814 -1787
1498 -1787 -1386 -651 -256 -321 -1236 -1886 -345 1166 2078 2632 3039 3651 3916 4086 3753 2943 1869 989 497
1479 497 273 320 191 -290 -790 -1233 -1585 -1850 -1953 -1971 -1900 -1883 -1653 -1051 -375 299 651 555 172 -176 236 948
1457 948 1514 1555 1098 303 -607 -1241 -1399 -1076 -806 -714 -887 -1258 -1704 -1636 -1328 -1219 -1549 -1716 -1843 -1706 -1444
1436 -1444 -862 142 992 1437 1547 1162 546 -220 -684 -883 -564 101 914 1174 1334 1150 1057 689 286 -398
1415 -877 -1050 -806 -566 -630 -1045 -1449 -1600 -1709 -1069 -326 419 822 795 228 -819 -1941 -1910 -1315 -858 -681 -672
1394 -672 -651 -919 -1388 -2101 -2364 -2270 -2211 -2056 -1806 -1564 -977 -682 10 911 2017 2876 3350 3262 2720 1878 1046
1373 1046 53 -375 -176 594 1550 2212 2497 2335 1729 1176 676 450 416 320 69 -483 -1108 -1325 -1206 -1132 -1309
1352 -1309 -1300 -1048 -857 -813 -894 -525 -91 285 528 447 95 -555 -1096 -1100 -557 -34 560 987 1015 565 -140 -717 -1115
1329 -1115 -1399 -1786 -2332 -2402 -2320 -1466 -895 -560 -424 -543 -411 -302 -474 -1210 -1956 -1429 -476 316 627 377
1309 377 -172 -860 -1777 -1676 -76 1257 2731 3568 3962 3763 2944 1546 167 -645 -391 168 522 658 669 363
1289 363 37 -262 -568 -904 -1137 -1183 -1251 -1423 -1717 -1475 -945 -583 -171 96 257 404 191 -148 -691 -1021 -1244
1268 -1244 -1342 -1124 -735 -298 -99 -101 -185 -122 56 -57 -249 -341 -366 -289 -402 -342 -315 -362 -363 -357 -551 -614 -616 -572 -308 101 207
1241 207 -124 -580 -837 -1157 -1276 -1587 -2067 -1887 -1451 34 1433 2479 2593 1869 386 -1131 -261 1531 3372
1222 3372 4241 3980 2898 1249 -637 -2275 -1234 -623 -388 -271 -275 68 930 1988 2907 3498 3797 3466 2745
1203 2745 1919 1026 284 -243 -520 -519 -520 -448 -502 -661 -718 -387 124 611 694 234 -750 -1800 -687 490 1363 1605
1181 1605 1349 908 389 53 -280 -671 -1335 -1923 -2423 -2691 -2745 -2551 -2179 -1818 -1370 -990 -654 -511 -667 -934
1161 -934 -1163 -1320 -1389 -1108 -938 -1015 -1203 -1593 -1966 -1838 -1303 -802 -136 336 520 711 461 103 -680 -1524 -2224
1140 -2224 -2322 -1900 -1168 -523 -258 -411 -854 -968 -1023 -802 -187 325 694 1132 1309 1385 1609 1897 2017 1840 1602
1119 1602 1063 135 -781 -498 -12 356 458 187 -337 -822 -1286 -1531 -1730 -2063 -2489 -2312 -1437 -468 348 888
1099 888 836 367 -219 -341 -142 10 -70 -329 -574 -698 -411 -46 104 -353 -825 -1190 -1047 -414 377 1236 1871
1078 1871 1922 1325 340 -1014 -2437 -1929 -522 492 1091 1502 1450 951 134 -773 -1520 -1402 -851 -732 -841 -1090
1058 -1090 -1419 -1195 -1469 -1488 -1473 -1596 -1698 -1882 -2210 -2029 -1947 -1547 -1375 -1112 -1180 -1578 -2009 -2680 -2867 -2940 -1979
1037 -1979 -717 397 420 30 -637 -788 -1194 -1320 -1661 -1831 -1713 -1553 -1182 -171 599 1248 1575 1706 1654 1343 1005
1016 1005 774 724 526 288 -55 -334 -71 338 627 515 51 -537 -676 -144 253 336 153 41 235 336 68 -535
993 -1085 -1018 -740 -558 -670 -1242 -2253 -1873 -1117 -659 -307 153 168 417 489 702 895 741 92 -970 -1644 -1803
972 -1803 -1475 -423 531 1488 2132 2499 2558 2543 2293 1912 1138 -47 -841 -1010 -857 -815 -817 -1097 -1204 -1013 -612 -136
949 308 315 -133 -922 -1587 -1977 -2076 -1648 -1379 -1430 -1622 -1497 -1179 -887 -501 -507 -970 -1838 -2211 -2172 -2334 -2650 -1865 -1055
926 -1055 -778 -1151 -1379 -574 809 1903 2798 3390 3093 2380 1323 453 5 -454 -1023 -1674 -2067 -2062 -1703 -1442 -1309
905 -1309 -1375 -1624 -1451 -1076 -880 -980 -1368 -1923 -1839 -1416 -984 -938 -915 -897 -92 619 1224 1646 1713 1643 1328 824 192
881 -354 -817 -1206 -1274 -859 -355 323 782 907 704 166 -505 -1130 -1351 -544 697 1921 3234 4179 4998 5291
861 5291 4838 3553 1881 458 326 899 1340 1303 932 298 -298 -407 -221 190 652 686 370 63 94 485 635
840 635 689 721 756 690 487 179 -513 -905 -762 -272 54 225 219 -26 -543 -873 -1176 -1473 -1138 -573 55 468 551 503
816 503 86 -411 -812 -1127 -1544 -1900 -2210 -2151 -1807 -1908 -2382 -3038 -3181 -2980 -2780 -2809 -2719 -2344 -1807 -873 179 1188
794 1188 2339 2967 2619 1687 551 -475 -1022 -1489 -1637 -1640 -1650 -1629 -1189 -707 -401 -320 69 878 1786 2610 3138 3203
772 3203 2868 2192 1478 657 -205 -915 -1390 -1636 -1681 -1773 -1809 -1869 -1697 -1439 -1442 -1773 -1881 -1423 -304 563 1104 1317
750 1317 1206 1053 850 336 -192 -544 -625 -641 -300 186 769 1046 1118 955 360 -630 -1846 -1340 -411 320 597
729 597 292 -465 -917 -237 667 1246 1498 1243 597 -366 -1336 -1852 -1099 -94 879 1821 2378 2715 2780 2458 1796
708 1796 1258 472 -633 -1130 -640 8 299 157 -271 -924 -1015 -290 257 774 492 -461 -1570 -1733 -1509 -1190 -1170
687 -1170 -1135 -332 205 63 -635 -1591 -1891 -926 321 1242 1796 1925 1194 113 -1029 -1278 -525 -221 0 -89 -400
666 -400 -904 -1568 -1414 -803 -357 -452 -1035 -2040 -1182 -66 1210 2506 2796 2219 1346 180 -879 -1592 -1807 -1019
646 -1019 -60 594 648 447 105 58 536 1327 2258 2863 3212 2954 2427 1422 237 -1001 -2076 -2587 -2355 -2042
626 -2042 -1694 -1235 -1065 -1196 -1727 -1890 -1426 -991 -825 -816 -920 -1186 -1336 -1026 -554 -239 -224 -620 -1024 -723 63
604 473 246 -486 -981 -224 1088 2191 2808 2875 2473 2144 1695 1245 1131 718 614 402 -282 -933 -1287 -945
584 -945 -108 605 730 825 688 350 -403 -978 -1176 -1081 -907 -744 -652 -616 -495 -127 173 192 258 274 77 -262 -314
561 -314 -618 -1039 -1317 -1388 -1164 -1038 -1107 -1247 -1515 -1773 -1988 -2120 -2261 -2471 -2276 -1813 -1641 -1639 -1720 -1740 -1909 -2176
539 -2176 -2577 -3261 -3576 -3528 -2931 -2366 -2637 -2281 -2005 -2008 -2083 -2018 -1854 -1556 -1581 -1836 -2100 -1326 -576 -181 -224 -677
517 -677 -1208 -1047 -1028 -984 -430 362 1218 1875 1748 1109 458 -22 -279 -744 -1454 -2068 -2425 -2356 -1627 -1217 -963 -759
495 -759 -141 702 1382 1841 1940 1611 652 -513 -1539 -1900 -1791 -1327 -1252 -1545 -2049 -1853 -1311 -664 -153 321 971
474 971 1126 852 425 -212 -478 -220 -195 -581 -716 135 1086 1380 997 -88 -1544 -1910 -1204 -683 -615 -680 -501
453 -501 -93 361 765 792 414 221 -10 -125 -117 164 430 680 645 268 -242 -623 -968 -1231 -1239 -1140 -935 -892 -1143 -1558
429 -1558 -2024 -1164 -291 452 989 934 797 198 -916 -2054 -2059 -2192 -2527 -1969 -1044 -185 450 876 967 1169 1071
408 1071 1134 937 956 515 -152 -480 -584 -292 -65 45 -91 -420 -666 270 1040 1470 1480 1236 704 255 -63 -279
386 -279 -729 -1533 -729 1236 3529 5565 7007 7465 7044 5909 4322 2723 1693 563 -509 -1667 -1636 -1576
368 -1576 -1623 -1806 -1326 -153 1125 1855 2065 1451 577 838 2077 3196 3462 2705 1163 -238 -410 196 623
349 623 732 733 865 1139 1175 1095 858 294 -82 -415 -608 -191 519 1507 2264 2752 2588 2184 1554 531 -327 -213
327 -213 666 1662 2120 2084 1579 814 -52 -439 -106 206 32 -648 -1764 -2196 -805 218 944 1579 2167 2525 2507
306 2507 1946 1218 337 -237 5 779 1557 1812 1580 1215 1001 868 674 339 -49 -418 -958 -1752 -1498 -775 -537
285 -537 -759 -1324 -1701 -1894 -2141 -2384 -2409 -1428 -461 36 -44 -538 -831 -682 -259 192 363 352 -74 -998 -1327 -517
262 474 1399 1913 2445 2384 1686 656 -538 -887 -238 394 598 451 -258 -1513 -1823 -868 -73 393 710 802 589
241 589 179 -376 -750 -602 -311 -308 -252 -4 260 -44 -661 -746 -714 -720 -743 -644 -383 -179 -77 -74 -440 -719 -1321 -2218 -2217 -916
214 145 1015 1692 1717 1398 1119 1011 1061 1252 1560 2223 2784 3168 2856 1856 815 -393 -518 594 1747 2501
194 2501 2441 1498 237 -745 -700 -581 -773 -1181 -1371 -1095 -471 476 1353 1740 1850 1396 833 383 438 446 909 1279
172 1279 1663 1784 1635 1577 1745 2093 2007 1920 1934 2024 2092 1886 1371 586 -358 -1236 -1829 -2180 -2400 -2166 -1186 161
149 1596 2584 2942 2660 1801 1219 976 1135 1320 1180 673 81 -260 -302 -255 -617 -885 -599 -266 -364 -720 -998
128 -998 -542 -63 215 62 -160 -612 -703 -672 -823 -763 -529 -149 142 223 5 -289 -523 -607 -700 -756 -795 -970 -912 -1089 -864
103 -864 -10 904 1500 1377 626 -290 -651 -816 -1131 -1407 -914 -322 282 588 580 305 -61 -620 -523 217 711 671
81 671 -136 -1382 -585 475 1101 1148 642 -154 -968 -1188 -941 -856 -173 738 1512 1485 719 97 246 276 101 -534
58 -1404 -1903 -1802 -1426 -183 966 1803 1868 1189 303 -124 141 435 927 1761 2578 3138 3062 2383 1496 837 944
37 944 1390 1738 1773 1260 455 -542 -1259 -1499 -1196 -1280 -1687 -1655 -1189 -520 179 612 802 950 743 433 -235 -797
15 -797 -712 -20 309 14 -540 -1606 -523 645 916 256 -1102 -98 1276 1992 1904
0 1904
##PAGE= F1=-2.202297678447e-005
##FIRST=     25.9928259484165, 8223.18227667557, 1207
##DATA TABLE= (F2++(Y..Y)), PROFILE
16383 1207 291 -213 -267 300 866 1013 675 63 -772 -650 80 484 418 131 45 634 1462 2117 2231 1851 1141
16362 1141 559 174 -248 -510 -476 -161 213 676 1270 1763 1903 1388 507 74 379 286 -405 -836 252 1684
16342 1684 2502 2643 1887 823 295 681 1021 882 156 -874 -294 402 521 71 -583 -586 116 717 831 522
16322 522 -22 -683 -1018 -858 -792 -1145 -337 849 1661 1663 848 -329 125 1079 1341 823 -217 122 1239 1735 1298
16301 1298 172 728 2774 4253 4597 3733 2300 973 258 99 403 779 837 640 588 892 1237 1162 521 -410
16280 -1056 -796 -708 -896 -1153 -1093 -380 467 980 1134 1018 587 265 99 -341 -1011 -536 179 526 351 -108
16259 -820 -1366 -1380 -896 -378 91 441 697 1282 1621 1873 1730 1337 850 335 330 693 887 465 -335 -592 138
16237 680 337 -529 -496 791 1540 1374 824 -81 -815 -1595 -2128 -1082 143 904 1043 563 -49 -696 -1030 -1180
16217 -1180 -981 -624 -431 -499 -982 -1234 -1257 -1058 -889 -1034 -1267 -1430 -1348 -982 -227 624 1398 1902 2013 1526
16197 1526 321 -349 -603 -611 -595 -370 -159 -394 -958 -1351 -541 272 734 798 997 1313 1985 2535 2650 2138 1022
16175 47 -619 -1063 -1081 -952 -820 -640 -451 -291 -95 311 658 625 180 -526 -1122 -1385 -1285 -857 -221 374 505
16154 505 196 -215 -392 -348 -331 -374 -473 -686 -830 -904 -764 -270 96 395 714 861 658 409 258 385 356 64
16131 -407 -414 -301 -150 -326 -640 -865 -492 64 469 570 208 -399 -957 -1147 -1424 -1707 -1165 -377 344 1022 1669
16110 1669 2155 2129 1706 868 -269 -1191 -1555 -1178 -773 -844 -1067 -916 -354 154 411 336 -216 -1206 -542 465
16089 1492 2212 2926 3330 3363 2938 1969 608 -296 -92 951 1386 1436 1060 661 1041 1420 1780 2017 1743 1398
16069 1398 991 551 72 -389 -748 -440 325 903 1034 796 112 -550 -666 -452 -337 -338 -16 580 907 1099 942
16048 942 580 274 -291 -941 -667 698 2152 3161 3372 2809 1575 94 -1291 -2257 -1224 -534 -111 138
16029 287 389 430 204 -589 -1582 -2002 -1578 -878 -602 -450 -235 -44 216 482 795 1095 1017 864 632 321 -72
16007 -285 -77 403 1395 2354 2795 2714 2398 1632 1116 700 542 530 557 493 94 -531 -713 -254 118 219 13 -189
15984 -194 29 462 1022 1566 2024 2271 1861 988 -262 -1199 -1914 -1580 -706 44 462 397 -58 -421 -461 -471 -521 -662
15962 -662 -790 -798 -567 -298 -2 269 402 419 24 -537 -1004 -1047 -681 -12 564 694 397 166 145 240 533 784 724
15939 724 612 417 545 664 516 -82 -805 -867 -519 70 352 553 705 916 1108 1226 928 238 -761 -1788
15919 -1788 -2595 -2733 -2211 -1865 -1258 -727 -498 -654 -664 -594 -495 -533 -722 -942 -1342 -1457 -652 579 1336 1381 1003
15898 1003 310 -427 -1129 -1414 -1263 -893 -757 -697 -692 -240 221 314 153 196 417 730 869 671 71 -718 -1584
15877 -1584 -2088 -1886 -1674 -1458 -1207 -792 -229 209 397 -106 -871 -1436 -1517 -1045 -383 199 504 531 511 618
15857 618 732 860 474 -180 -682 -888 -685 -290 -124 -348 -859 -950 -615 -139 88 323 773 1283 1762 1884
15837 1884 1559 915 414 449 757 754 203 -780 -1235 -103 1514 2907 4194 4693 4335 3252 1888 1098 882
15818 882 951 1031 797 516 -43 -503 -935 -1117 -1066 -648 -80 426 940 1003 687 198 -492 -760 -677 -283 -119 -334
15796 -334 -1124 -2206 -1591 -961 -1018 -1304 -844 455 2142 3881 4845 4960 4109 2965 1719 865 626 703 784
15777 784 581 188 -533 -1017 -907 -469 -186 -433 -1075 -1050 -400 178 431 503 577 495 204 57 27 -41 -186 -467
15755 -467 -885 -1363 -1486 -1112 -467 383 1355 2380 2784 2428 1397 82 -855 -164 1174 2279 3249 3490 2917
15736 2917 1829 710 68 -429 -991 -1624 -1263 -448 -25 -187 -735 -1068 -523 130 623 842 1108 1424 1927 2812
15716 2812 3622 4018 4059 3728 3010 2214 1266 243 -624 -1336 -1366 -897 -466 -142 -75 82 318 465 196 -365 -696
15695 -696 -336 -187 -462 -972 -1016 -382 555 1414 1997 2558 2537 2090 1324 787 632 888 1215 1274 1149 591 -375
15673 -1255 -57 944 1544 1623 1150 444 -441 -1119 -1682 -2034 -2061 -1410 -1036 -846 -584 -354 -136 -8 -97 -518 -875
15652 -875 -1236 -1289 -711 250 1254 1909 2123 1881 1165 393 -194 -544 -503 -306 -277 -470 -701 -1271 -1417 -1022
15632 -1022 -481 -183 -29 -224 -457 -592 -716 -767 -715 -304 360 832 864 553 -31 -767 -1744 -2364 -2761 -3101 -2355
15611 -2355 -1392 -412 595 1376 1752 1619 1013 533 59 -110 -107 -53 1 550 1815 2996 3384 3032 2070 1350 313
15589 -836 -1811 -2379 -1825 -1088 -730 -860 -1286 -1817 -2272 -2181 -1680 -1178 -594 -58 229 206 16 -255 -222 435 1186
15568 1186 1552 1324 558 -493 -1199 -942 -361 151 374 538 841 1202 1438 1397 1096 534 9 108 827 1523 1725
15547 1725 1656 1304 380 -647 -1846 -1042 -475 -109 -318 -851 -573 494 1836 2642 2866 2881 2149 1145 231
15527 490 1434 2154 2197 1575 573 -489 -1066 -937 -681 -469 -73 436 1168 1684 1609 1161 464 320 601 1294 2416
15506 2416 3569 3998 3713 3107 2471 1662 1303 918 668 514 322 -470 -1329 -1503 -1423 -1316 -1343 -1344 -867 -43 622
15484 935 1043 1210 1223 931 667 880 1184 1479 1438 933 156 -411 -385 -111 -302 -1123 -1669 -1056 -333 -28 -216
15463 -216 -804 -1536 -2220 -1840 -1176 -394 364 890 1054 721 182 -517 -973 -1243 -1153 -823 -348 71 258 -136
15442 -1140 -2011 -1435 -1182 -1383 -1395 -1657 -1386 -770 -18 438 614 673 776 1154 1492 1683 1325 300 -1353 -2621
15422 -2621 -1220 394 1442 1880 1808 1132 282 -413 -848 -1061 -1163 -1176 -958 -362 595 1624 2584 3333 3755
15403 3755 3730 3323 2576 1690 943 289 -221 -499 -774 -969 -1353 -1603 -1115 -572 -48 308 267 420 361 144 -336
15381 -971 -1233 -600 -221 -37 23 245 346 554 1305 1775 1817 1269 559 -196 -701 -656 -33 702 1263 1546 1362
15360 1362 795 -100 -922 -1325 -1342 -1074 -632 -154 332 451 524 674 530 72 -261 -224 333 1141 1619 1757 1525
15339 1525 939 368 -185 -1023 -1806 -1325 -629 35 619 1046 823 1351 1356 1288 911 647 240 -260 -1031 -1613 -1682
15318 -1682 -1579 -1456 -1275 -900 -488 -113 159 332 485 707 1042 1284 1007 204 -1004 -1587 -1497 -659 59 396
15298 396 179 -419 -879 102 795 1301 1544 1386 837 1 -962 -1310 -1116 -1048 -1435 -1644 -1845 -2215 -1903 -1489 -855
15277 -855 -190 487 1160 1698 1754 1346 899 -117 -802 -1126 -539 224 910 1392 1540 1424 1141 770 483 302
15257 302 381 302 33 -287 -350 -315 -173 54 281 406 265 62 -357 -575 -878 -1066 -980 -909 -797 -680 -629 -672 -344
15234 -344 -196 -210 -154 -330 -549 -1050 -1337 -1861 -2186 -1819 -1236 -1265 -1223 -971 -862 -1009 -1237 -1595 -1835 -2034 -1584
15213 -1584 -802 84 822 1343 1532 1356 688 -337 -847 -781 -25 531 564 -129 -1196 -1622 -1152 -509 -83 -416 -1285
15192 -1285 -841 291 1047 1233 879 52 -828 -1480 -1535 -1144 -634 -42 27 -273 -963 -1749 -1601 -821 95 837 1322
15171 1322 1570 1544 934 96 -342 -165 197 533 747 743 624 583 550 539 322 190 195 546 1101 1518 1794 1833 1642
15148 1642 1425 1141 696 -86 -982 -1186 -574 310 1086 1509 1767 2147 2517 2506 2123 1401 156 -1488 -1404 123
15127 1099 1299 863 88 -448 -169 369 488 234 -517 -1417 -2234 -777 85 160 -170 -617 -616 199 1135 1575 1407
15106 1407 390 -1043 -2736 -2142 -380 1130 2183 2606 2477 1905 1366 678 388 725 1467 2315 3153 3463
15088 3463 3352 2809 1930 1202 580 189 -16 -371 -805 -964 22 1259 1990 2013 1526 566 -665 -1260 -331 227
15067 368 394 505 862 1127 1024 588 -253 -974 -866 -327 140 280 84 -401 -523 22 1204 2343 3004 2759
15047 2759 1431 -407 -1211 261 1731 2748 3298 3271 2571 1619 465 -609 -1384 -1600 -1215 -687 -93 357 792
15028 792 870 746 642 697 853 1124 1214 1400 1299 716 -283 -1514 -2670 -2892 -2918 -2968 -2268 -924 580 1533 1719
15007 1719 1280 677 38 -536 -914 -855 -387 283 951 1348 1181 640 -180 -866 -1252 -1060 -687 -314 66 285
14987 285 272 60 -454 -715 -658 -694 -1224 -1330 -640 138 732 1079 1273 1210 1345 1346 1197 1023 919 840 432 173
14964 -289 -709 -1216 -1563 -1571 -1407 -1105 -1059 -1350 -1393 -838 -20 875 1596 2092 2337 2595 2645 2676 2399 1919 850 -657
14941 -1919 -1796 -698 -11 147 -169 -833 -1369 -648 -57 297 357 245 39 -2 -146 -125 -176 -359 -249 -42 422 1021
14919 1021 1809 2861 3799 4335 4289 3686 2519 1491 489 -14 -475 -983 -1608 -2155 -2153 -1756 -1026 -330 10 -105
14898 -592 -1403 -2163 -2510 -2327 -1925 -1708 -1687 -1767 -1786 -1775 -1887 -1762 -1182 -904 -562 -357 23 589 773 523 -98 -888
14876 -888 -1798 -1918 -1591 -1219 -764 -522 -275 76 560 1064 1284 1143 790 143 -407 -821 -979 -898 -705 -558
14856 -558 -619 -889 -872 -282 533 1184 1571 1621 1262 793 334 -9 -451 -771 -1011 -1043 -878 -231 486 1024 1434 1213
14834 1213 947 540 160 -62 -227 25 200 262 309 423 430 318 114 -4 -241 -716 -1323 -1374 -778 -56 397 944 1495
14811 1495 1947 2149 2028 1552 856 16 -725 -633 -342 417 1084 1630 2069 2493 2542 2215 1676 1605 1264 898 909
14790 909 887 892 815 578 418 171 66 -35 45 101 454 788 687 540 357 495 869 1002 1229 1261 1042 522 21
14766 -442 -774 -974 -907 -822 -300 233 464 335 109 12 123 327 473 542 257 -241 -1086 -939 -30 898 1491
14745 1491 1657 1283 605 -144 -435 -109 331 511 531 578 824 1021 1168 979 475 -73 -651 -1014 -843 -470
14725 -470 102 545 918 1059 940 716 -86 -628 -446 401 1228 1840 1901 1458 696 25 -602 -751 -632 -616 -947
14704 -947 -1541 -887 -75 260 29 -576 -1104 -1174 -934 -868 -1133 -1515 -2091 -2067 -1392 -800 -427 -310 -585 -1260 -1839
14683 -1839 -1126 -481 -160 -135 -464 -375 298 1054 1539 1513 1174 501 -457 -1223 -1537 -1264 -1007 -805 -497 93 527
14662 527 802 692 211 -450 -1045 -1271 -397 370 911 1094 1058 624 49 -392 -735 -1058 -1276 -1563 -760 578
14641 1687 2112 1773 962 -124 -272 360 876 775 69 -910 -1845 -2785 -2836 -1717 -540 302 747 523 -184 -774
14621 -774 -633 -159 121 106 -168 -712 -1436 -2376 -1947 -521 625 1179 1099 626 -60 -732 -1186 -1247 -1406 -1638 -1348
14600 -1348 -702 -181 100 76 -33 205 304 -358 -1762 -1100 964 2934 4304 4886 4752 4115 2934 1633 916
14581 916 620 418 -41 -1076 -1927 -1269 169 1716 3363 4549 5234 5270 4628 3065 990 -1184 -1882 -261
14562 846 1332 1146 716 407 272 184 -127 -660 -1562 -1831 -1211 -667 -307 97 557 1042 1242 1340 1151 631 -114
14540 -1181 -2290 -2602 -2120 -1723 -1241 -797 -313 -238 -571 -994 -1189 -1509 -2016 -1906 -1399 -745 -93 96 -128 -675
14520 -675 -1361 -2232 -1967 -1032 -163 406 708 593 269 0 -289 -553 -1096 -1578 -1885 -1536 -1224 -944 -619 -96 298
14498 446 336 163 124 556 1254 1759 1931 1357 590 -513 -1605 -1292 -259 370 680 806 1006 932 584 -66
14477 -886 -1712 -2077 -1968 -2141 -2355 -1598 -1201 -942 -1010 -1487 -1531 -815 -102 340 422 72 -577 -1093 -235 1314 2560
14456 2560 3333 3133 2285 1140 -96 -274 565 1271 1492 1229 560 -473 -1467 -2001 -1734 -1041 -139 558 1206
14437 1206 1481 1464 817 -56 -1006 -1734 -1768 -1381 -739 156 877 1322 1492 1269 675 -109 -1072 -1338 -652 -96 281
14415 433 427 383 402 496 526 518 593 861 785 133 -684 -1259 -889 126 921 1007 351 -693 -761 608 1579 1880 1741 1324
14391 1324 608 -19 -469 -550 -306 80 568 955 1080 921 634 77 -512 -1247 -1518 -1224 -1084 -1253 -1632 -1634 -847
14370 -847 -91 -23 -472 -1366 -1968 -1552 -1273 -994 -756 -538 -340 -60 71 -39 -167 -60 41 -279 -707 -1088 -1185 -1089 -950
14347 -950 -731 -453 -122 -196 -680 -1401 -1844 -1768 -1527 -1549 -1798 -1618 -945 -362 -257 -511 -725 -459 213 495 662
14326 662 613 411 -42 -689 -1164 -1117 -533 202 604 708 293 -374 -1147 -1824 -1570 -1286 -1222 -972 -617 -422 -249
14305 -249 351 1097 1979 2740 3026 2921 2709 2192 1531 1025 729 592 658 637 492 256 -254 -846 -1109 -973
14285 -973 -548 -398 -356 -211 105 377 389 54 -511 -902 -1430 -1907 -2012 -1575 -1048 -660 -484 -17 363 964 1450
14264 1450 1557 1010 -242 -1306 -163 1127 2122 2694 2661 1965 982 -81 -1120 -1461 -1141 -722 -548 -717 -935
14245 -935 -780 -565 -725 -1205 -1157 -362 521 1209 1483 1494 1523 1540 1657 1575 1194 407 -246 -624 -562 -73 625 943
14223 943 784 428 27 -484 -1197 -1576 -770 224 1071 1504 1475 1071 122 -778 -506 515 1395 1670 1494 1290
14203 1290 1238 1459 1570 1444 1203 1367 2028 2990 3903 4301 3929 3033 1960 1238 603 172 -188 -578 -1081
14184 -1081 -1650 -2117 -1987 -1832 -1721 -1328 -1016 -641 -340 -203 -323 -613 -1017 -1684 -2119 -2411 -2358 -2180 -1516 -1066
14164 -1066 -547 -531 -691 -1137 -1720 -1493 -880 -346 67 349 528 651 774 912 882 617 346 129 -65 -66 8 -56
14141 -488 -932 -1052 -979 -998 -1319 -1581 -1565 -1117 -567 -45 398 517 448 160 189 440 926 1324 1274 808 151 -734
14118 -1193 -1324 -909 -350 283 594 230 -713 -1821 -1808 -527 641 1271 1219 434 -364 -968 -1174 -1201 -1356 -1486
14098 -1486 -1376 -942 -222 575 876 1533 1971 1990 1431 876 215 -595 -1323 -1350 -888 -867 -784 -393 272 918 1262
14077 1262 945 -44 -947 -1398 -975 -271 55 16 -189 -375 -275 -130 -118 -23 230 499 720 1224 1852 2592 3068
14056 3068 2929 2393 1171 -194 -740 221 1401 2137 2268 1915 1021 78 -622 -353 475 1119 1239 778 -144
14036 -827 -378 395 765 611 319 613 1832 3252 4172 4153 3527 2552 1364 540 222 -100 -320 -285 114
14016 514 626 415 -41 -483 135 1427 2701 3446 3590 3128 2334 1677 1313 1273 1359 1272 768 6 -662 -648 -644 -1046
13994 -1046 -1742 -1874 -668 586 1528 2063 2052 1334 233 -879 -1364 -1468 -1313 -1052 -769 -902 -1261 -1448 -1003 -120
13973 585 1063 1237 1179 754 486 538 575 660 855 1016 1180 1213 1198 1092 885 373 -274 -939 -1040 -742 -244 92
13950 44 -193 -454 -694 -649 -285 302 765 1362 1618 1364 834 -13 -560 90 1225 1902 2322 2616 2170 1147
13930 1147 -49 -1034 -1151 -744 -317 106 524 920 1064 901 442 -136 -624 -1008 -1267 -1432 -1224 -548 312 997
13910 997 1297 1395 1012 379 -378 -750 -540 -369 -373 -445 -636 -941 -1225 -1629 -2120 -2319 -2111 -1724 -1101 -624 -278
13888 -139 -269 -504 -825 -1140 -1288 -1119 -996 -907 -878 -798 -589 -297 -64 286 357 237 -154 -519 -408 391 1604
13867 1604 2724 3224 2929 1967 754 -529 -1273 -1228 -1009 -928 -1200 -1840 -1498 -704 -107 60 166 -111 -424 -795
13847 -795 -1119 -1205 -926 -740 -508 -473 -727 -1081 -1106 -817 -326 -211 -92 -288 -336 -253 205 651 971 1064 1212 1190
13825 1190 884 480 22 -435 -881 -1714 -1392 -680 -242 -50 -130 -87 33 -236 -714 -1333 -1477 -794 15 590 791
13804 791 736 572 319 -53 -471 -851 -628 -69 361 528 477 347 134 -148 -338 -510 -954 -1716 -1207 -49 1102
13782 2038 2623 2919 2643 1996 1585 1590 1880 2278 2375 2150 1228 456 -37 -472 -747 -1175 -1171 -333 229 251 0 -983
13759 -1962 -194 1060 1457 1317 1069 631 284 408 378 0 -341 -945 -1586 -2413 -2609 -1957 -1329 -581 -383 -314
13739 -314 -515 -542 73 970 2018 2976 3388 3342 2832 1671 448 -1147 -2333 -1907 -696 -193 -278 -307 288 1467
13719 1467 2518 3540 4012 3774 3212 2214 1312 637 157 -153 -170 -64 -18 89 70 240 597 804 664 268
13698 -112 -447 -666 -692 -227 231 633 991 1024 729 192 -785 -1681 -1651 -1344 -1418 -1821 -1295 -346 380 657 324
13676 -383 -1294 -1869 -1345 -507 106 482 541 537 160 -558 -1718 -2211 -819 737 1999 2637 2818 2549 1917 1112
13656 1112 158 -362 -184 496 1163 1693 1955 1989 1620 1073 392 -117 -212 -60 -147 -366 30 623 1191 1600 1684
13635 1684 1706 1600 1640 1730 1708 1615 1530 1275 720 -228 -1302 -2682 -2479 -1423 -905 -660 -745 -1092 -1841 -1736 165
13613 2100 3540 4165 3994 3185 1831 348 -333 246 1058 1380 1094 249 -507 -677 -30 896 1527 1774 1514
13594 1514 1094 733 753 1031 1183 1186 1104 1229 1446 1543 1535 1525 1816 1883 1558 1049 35 -566 -1255 -2024 -2347 -2209 -2127
13571 -2127 -2008 -1615 -1249 -908 -563 -312 283 839 1122 1209 999 653 354 124 -34 61 432 940 1339 1499
13551 1499 1171 492 -482 -1426 -1206 -878 -822 -1116 -861 -208 314 598 486 90 -450 -789 -954 -1011 -845 -10 1047
13529 1780 1904 1455 511 -689 -1042 118 1517 2202 2192 1605 334 -1209 -738 648 1755 2517 2606 2369 1909
13510 1909 1405 1401 1560 1573 1515 1560 1610 1778 1921 1787 1121 227 -481 -716 -490 -257 -95 -91 -462 -609 -231 241
13487 556 547 128 -481 -1009 -897 -566 -391 -210 -76 16 -21 -142 -61 -17 -72 -166 -708 -1169 -1419 -1674 -1845 -1788 -1972
13464 -1972 -1665 -897 -465 -1 290 460 337 86 -53 -209 -528 -752 -421 194 836 1903 2522 3081 3055 2617 1799
13443 1799 967 37 -863 -1344 -1128 -613 141 680 951 846 495 70 -549 -1120 -1587 -1729 -1487 -963 -440 -60
13422 -29 -87 -546 -1256 -1781 -1338 -753 -85 214 118 -346 -740 -832 -768 -780 -907 -926 -957 -903 -517 -35 305 579 739
13399 739 900 1078 1313 1418 1555 1451 939 462 187 363 739 1061 1121 921 560 149 -221 -420 -631 -953
13379 -953 -1648 -2169 -2528 -2135 -1547 -976 -678 -558 -510 -795 -888 -1107 -1239 -1018 -821 -598 -986 -1226 -728 211
13358 1411 2353 3029 3161 2335 1126 14 -342 375 1050 1321 1306 851 176 -611 -1278 -1288 -824 -331 79 500
13338 500 860 1015 815 380 -333 -1089 -1737 -1987 -2109 -2106 -2011 -1426 -683 205 784 1124 1184 861 685 657 619 372
13316 372 16 -209 -385 -522 -570 -524 -116 342 471 354 3 -343 -942 -1615 -1809 -793 -200 98 -204 -684 -1145 -1201
13294 -1201 -1025 -932 -929 -926 -987 -848 -957 -1199 -1251 -1035 -911 -875 -785 -653 -294 211 857 1738 2330 2768 2670 2131 1292
13271 1292 269 -625 -563 136 693 47 -640 -1152 -1496 -1636 -1844 -2223 -2911 -2833 -2456 -2328 -2156 -2186 -1790 -1179 -609
13250 -609 201 808 1178 1368 1307 1037 786 563 -106 -861 -1244 -1195 -827 -551 -381 -432 -769 -1215 -1556 -1605 -1338
13229 -1338 -1150 -1151 -1323 -1633 -2128 -2088 -954 450 1477 2161 2349 1968 1178 285 -487 -1228 -1284 -878 -763 -604
13209 -604 -698 -779 -729 -973 -1526 -1647 -929 35 643 605 77 -678 -1115 -627 147 558 391 -123 -441 -712 -1006 -1223
13187 -1223 -517 194 433 409 260 240 60 7 238 403 498 211 -191 -346 -31 452 893 963 676 140 -322 -684
13165 -684 -1040 -1623 -1782 -1090 -491 -174 -248 -627 -777 -754 -572 -221 90 190 -102 -580 -745 -572 -335 -490 -961
13144 -961 -1605 -2022 -2038 -1924 -1458 -748 93 729 1013 768 -254 -1446 -2160 -2284 -1932 -1361 -348 711 1483 1648
13124 1648 1261 603 272 451 688 598 218 -348 -676 -1111 -1527 -1964 -2030 -1968 -2055 -2121 -2067 -1493 -802 -40 982 1786
13102 1786 2551 2907 2696 2212 1632 965 483 100 -212 -365 -413 -539 -717 -859 -1127 -1298 -1306 -889 -300 429
13081 1198 1480 1225 495 -598 -1335 -929 -651 -515 -549 -344 66 431 519 397 282 282 326 261 122 -3 -39 -27 30
13057 7 -299 -741 -1243 -1569 -1422 -972 -675 -273 -98 28 -85 -259 -508 -186 425 996 1256 1318 1272 1026 743 395
13035 395 -33 -474 -1059 -1536 -1537 -340 1237 2710 3603 3637 2921 1617 131 -1091 -1120 -544 370 1296 1842 2135
13015 2135 1713 990 409 -114 -539 -944 -1016 -805 -599 -461 -375 -302 -153 62 422 738 899 892 967 608 8 -322
12992 -409 -549 -833 -1109 -1245 -1336 -1445 -1679 -1916 -2174 -1932 -1264 -1105 -1099 -1321 -1774 -1920 -1606 -1290 -1258 -1356 -1456
12971 -1456 -1428 -1194 -909 -572 -133 336 772 1232 1677 1972 2008 1945 1554 849 -188 -1454 -1726 -968 -445 -438 -814
12950 -814 -561 485 1226 1320 1147 1004 1023 927 694 490 553 906 1254 1283 874 431 299 783 1817 2448 2497
12929 2497 2075 1404 381 -481 -897 -1322 -1433 -1184 -535 259 1161 1753 2036 1998 1519 991 662 133 -115 -202
12909 -202 -373 -602 -1099 -1831 -1593 -650 -60 528 941 1158 1128 997 465 -279 -1194 -1706 -1011 -278 161 259 100
12887 -337 -846 -963 -816 -503 -181 83 208 -23 -545 -1406 -2230 -1315 -152 600 725 512 134 -94 -420 -737 -780
12866 -780 -525 -315 -179 -148 40 556 1304 1942 1838 1460 793 83 -851 -1618 -661 87 293 118 -89 49 531 798
12844 798 757 188 -873 -1908 -931 -162 -94 -492 -1110 -1421 -1179 -708 -115 700 1402 2053 2334 2260 1776 946
12824 946 -1 -744 -989 -781 -130 126 149 -265 -1105 -2186 -2030 -670 307 730 301 -754 -1526 -1180 -748 -652 -1075
12803 -1075 -1356 -362 659 1176 1227 733 10 -640 -1191 -1356 -1452 -1693 -1777 -1613 -1157 -700 -271 145 417 603 623
12782 623 351 -79 -700 -1357 -1901 -2301 -2255 -2428 -1993 -1288 -747 -610 -890 -1705 -2506 -1710 -1032 -611 -633 -914 -1668
12761 -1668 -2220 -1276 -647 -790 -1487 -2151 -895 398 1316 1607 1595 1391 1204 1051 983 805 708 1011 1474 1703
12741 1703 1602 1146 74 -572 -1255 -1585 -1317 -876 -210 287 669 910 1092 989 815 672 857 1228 1464 1319
12721 1319 855 -64 -1156 -1032 67 941 1444 1507 1011 484 178 50 203 504 778 1044 1143 1163 951 441 -138
12699 -539 -810 -758 -523 -255 -215 -89 471 1476 2464 3239 3581 3363 2666 1703 807 -98 -954 -1544 -1247 -690 140
12677 1185 2390 3404 4155 4347 3886 3017 2027 1327 1110 1209 1289 1417 1615 1754 1746 1584 1102 659 384 476
12657 476 1051 1648 2118 2269 1666 1141 536 116 305 552 771 888 864 800 518 -56 -799 -1207 -536 584 1485
12636 1485 2078 2487 2444 2114 1401 676 224 185 596 958 928 501 -365 -1439 -2260 -2649 -2378 -2582 -2494 -1799
12616 -1799 -955 -197 172 218 -201 -786 -1191 -1122 -958 -749 -536 -224 210 973 1862 2245 2205 1965 1420 811
12596 811 478 637 982 1281 1193 923 594 268 9 -226 -142 123 631 1211 1757 2210 2370 2131 1604 1206 749
12575 749 330 -212 -724 -1019 -870 51 1177 1791 1880 1481 952 501 619 808 889 861 225 -716 -1591 -2270 -2517
12554 -2517 -2529 -2490 -2188 -1559 -779 -84 508 1041 1391 1028 578 110 222 478 627 653 444 171 -99 -345 -414
12533 -414 -233 119 628 893 829 376 -443 -1326 -943 -124 474 662 606 349 50 -266 -694 -949 -984 -931 -1075
12512 -1075 -1517 -2059 -1204 -478 -187 -254 -467 -337 50 381 544 633 151 -731 -1422 -1674 -1678 -1662 -1831 -2131 -1904
12491 -1904 -1980 -2161 -2385 -2408 -1974 -1476 -1049 -647 -512 -195 97 -254 -679 -1585 -1796 -1075 -360 -380 -384 -642 -710 -782
12469 -782 -746 -263 622 1393 1769 1974 1579 1009 597 1031 2210 2943 4352 4607 4148 2787 882 -930 -1438
12450 -1438 -1021 -1018 -1083 -1188 -1355 -1428 -1511 -1285 -608 125 509 260 13 280 1043 1906 2819 3519 4009 1448 1402
12429 1402 1538 1350 834 758 891 446 6 -469 -898 -1036 -555 348 1103 1493 1460 823 242 -45 -200 -71 496
12407 1359 2058 2515 2908 3112 3082 2858 2608 2362 2108 1952 1857 2012 2243 2470 2400 2145 1562 437 -1134 -2115
12387 -2115 -820 227 1063 1583 1919 1932 1767 1597 1449 1368 1384 1313 943 260 -393 -739 -665 -476 -238 95 390
12366 390 822 1189 1604 2172 2421 2393 2206 2272 2263 2235 1916 1598 889 -439 -1521 -1700 -1485 -1025 -660 -656 -817 -1253
12344 -1253 -2056 -2319 -1060 163 1083 1359 950 -23 -999 -1562 -1491 -764 108 1162 2304 3378 4156 4616 4527
12325 4527 3925 2645 1173 -458 -2021 -1889 -1357 -1426 -2013 -2064 -1056 -135 499 958 1397 2170 2991 3563 3379
12306 3379 2369 517 -1264 -1590 -695 -107 101 -136 -241 -343 -618 -679 -830 -1003 -1153 -1152 -1038 -943 -1012 -1296
12286 -1296 -1451 -1542 -1644 -1681 -1924 -2107 -1886 -1569 -1431 -1442 -1174 -534 62 569 876 852 743 378 148 159 79 -62
12263 -204 -339 -171 30 88 -135 -340 -585 -818 -1042 -978 -635 -405 -329 -307 -555 -1190 -1909 -1893 -1262 -696 -204 -868
12241 -868 -1048 -1218 -1066 -709 -312 -582 -1368 -2230 -1856 -1245 -768 -604 -800 -1103 -1516 -1917 -2083 -1275 -426 287
12220 880 1139 1017 757 615 869 1320 1972 2237 2026 1509 812 -66 -938 -1394 -1414 -1085 -424 154 838 1517
12200 1517 1806 1538 983 523 245 683 1527 2561 3542 4138 4236 3781 2698 1411 316 146 370 206 -626
12180 -1834 -828 935 2246 2964 2834 1756 498 -619 -1527 -1496 -961 -549 -564 -702 -574 -641 -514 -452 -357 -72 290
12158 539 382 -248 -1266 -2225 -1678 -741 -282 115 133 -339 -677 -290 193 134 -100 -426 -653 -602 -532 -630 -910
12137 -910 -1613 -2451 -1029 268 1206 1689 1785 1373 1231 778 250 -441 -1178 -1737 -1491 -294 747 1521 1695 1349
12117 1349 573 13 -251 -349 -798 -1643 -1033 726 2365 3518 3915 3453 2514 1619 1096 671 440 453 656 739
12097 739 646 42 -737 -1718 -2414 -2639 -2140 -1659 -1783 -1808 -1215 -418 313 899 1392 1345 1071 283 -586 -1147 -522
12075 310 846 1090 1356 1617 1689 1576 1466 2041 3250 4956 6361 7020 5484 1046 1365 12304 25231
12058 25231 37875 47858 52840 51644 44658 33701 21042 9313 1330 2231 4106 3500 1719 160
12043 -1104 -1457 -871 -86 305 -144 -952 -2108 -2372 -1967 -1576 -1461 -1496 -1750 -1706 -1186 -485 -308 -420 -788 -881
12023 -881 -1019 -1159 -1317 -1319 -1264 -1157 -876 -550 -268 3 32 63 134 197 471 573 538 162 -594 -1349 -1168 -316 102
11999 141 -136 -856 -1699 -1349 -608 -78 -74 -693 -1646 -1637 -721 -95 54 -446 -1067 -972 -437 -696 -2396 -552 4258 9234
11977 9234 13442 16058 16628 14546 10412 5520 954 -2143 -2497 -959 102 813 1211 730 -640 -1860 -1310
11960 -1310 91 506 -151 -859 -601 57 165 -216 -877 -1591 -1162 -583 -35 401 722 723 573 261 -148 -666 -1217
11939 -1217 -1623 -1761 -1442 -952 -426 -134 -68 -33 70 335 780 1157 1600 1654 1516 1316 982 840 910 1230 1755
11918 1755 2343 2646 2489 1560 477 -998 -1448 -692 63 623 556 283 -217 -676 -1250 -1494 -1682 -1841 -1581 -1189
11898 -1189 -894 -812 -1122 -1502 -1523 -898 -485 -181 -25 -345 -799 -798 -198 419 543 168 -191 -479 -682 -723 -564
11877 -564 -142 522 1176 1342 981 193 -560 -537 -7 400 548 297 -289 -869 -1303 -1460 -983 -420 -75 42 92 8
11854 45 -272 -185 -159 -67 -49 -143 -205 -599 -1021 -1460 -976 89 963 1457 1379 1147 803 392 -28 -395 -872 -1245 -1605
11831 -1605 -1801 -2023 -2195 -2475 -2959 -2125 -537 759 1668 1759 944 -292 -1401 -1866 -1732 -1085 -18 1045 1363
11812 1363 704 -765 -1333 -790 -850 -665 1164 3491 4930 5602 5224 5559 5094 4658 5154 8095 15042 22124
11794 22124 28218 31206 30846 26851 20483 13310 7463 5526 5839 6241 5739 4372 2589 916 -118 266
11777 713 476 -414 -942 -185 578 844 521 46 -352 -676 -1244 -1787 -1741 -1035 -518 -285 -875 -1402 -1324 -760 -357
11755 -345 -440 -515 -373 -199 17 232 127 -326 -807 -647 -179 167 148 64 36 89 372 532 358 -149 -818 -1750
11733 -1750 -2622 -2189 -1976 -1801 -1671 -1141 -637 -437 -569 -857 -1466 -1776 -1397 -1161 -1113 -1433 -1739 -1356 -440 476
11712 1164 1436 1189 515 -398 -1218 -1127 -684 -182 -68 -223 -708 -1327 -1933 -1460 -760 157 813 1206 1403 1682
11692 1682 2008 2434 2591 2451 1748 472 -959 -393 665 1370 1825 2135 2382 2448 2251 1848 1396 1367 1859 2323
11672 2323 2350 1787 350 -1693 -1387 81 1121 1184 1072 705 16 -1001 -1891 -2594 -2830 -2763 -2506 -2087 -1497 -1042
11652 -1042 -739 -466 -5 610 1327 1811 2277 2614 2853 2732 2558 2317 1603 578 -547 -1538 -1682 -945 -220 119
11631 -302 -673 -1254 -1549 -1751 -1924 -2016 -1705 -1391 -1223 -1114 -867 -464 76 90 -332 -1059 -1571 -1526 -1190 -1143 -1450
11610 -1450 -1408 -1016 -605 -704 -864 -1055 -1275 -1267 -1148 -968 -1172 -1510 -1885 -1736 -1118 -577 -242 -50 166 380 615
11589 615 740 704 407 213 -175 -520 -944 -1052 -956 -761 -560 -440 -566 -1010 -1505 -1733 -2360 -2819 -1835 -380
11568 1120 2410 3440 3449 2988 2376 2634 3254 2882 2214 1188 -330 -5578 -4591 -4845 -853 -1008 -2244 -3388
11550 -3388 -3203 -2121 -1476 -1613 -2695 -3753 -2261 -693 247 407 -136 -1357 -2533 -2307 -1656 -1053 -1193
11533 -1193 -1952 -1981 -495 598 1060 996 703 310 724 1870 4049 6257 7708 7403 5264 2494 1200 2929
11515 2929 5290 5834 4484 1737 945 904 876 330 -1224 -2447 -763 878 1539 1024 133 -287 480 1718
11497 1718 2912 3936 4395 4557 4531 4189 3337 2019 586 -596 -1484 -1527 -1089 -642 -111 59 115 179 191 -107
11476 -414 -693 -1127 -1296 -1175 -973 -482 112 462 577 347 -85 -501 -1010 -1529 -1884 -1243 -482 183 733 1097
11456 1097 1273 1415 1553 2318 3694 4564 5144 4708 3564 2008 480 -1060 -1889 -687 224 1099 1722 2029
11438 2029 2074 1567 934 502 489 560 400 -314 -1473 -2585 -2493 -1967 -1380 -635 -88 647 1132 1281 875 52 -1157
11416 -2239 -2496 -2377 -1576 -931 -544 -38 244 451 471 307 62 -178 -399 -900 -1412 -1295 -675 96 275 -35 -1004
11395 -1004 -1941 -1321 -697 -584 -1069 -1871 -1824 -786 -39 503 1060 1498 1545 931 -345 -1596 -3207 -2764 -1227
11375 -164 224 -50 -1021 -2015 -3094 -2716 -2868 -3374 -2677 -1553 -344 440 862 840 471 -150 -885 -1039 -479 -161
11354 -53 -402 -433 -188 644 1817 3003 3380 3354 2369 1408 545 -151 -315 -242 26 827 2638 4803 6519 7851
11334 7851 8327 7819 6485 4616 2901 1853 1485 1266 667 -19 -373 264 841 1096 701 -311 -1551 -951
11316 -951 568 1534 2082 2094 1534 755 17 -606 -763 -487 41 601 393 581 1196 1809 2599 3445 4245 4768 4655
11295 4655 4030 3076 1555 222 -632 -475 -534 -867 -1835 -2780 -1578 -576 281 440 92 -703 -1758 -2090 -1967
11276 -1967 -1909 -2082 -2250 -2012 -1594 -1034 -255 544 1316 1825 2013 2058 2054 2193 2174 1867 1549 996 442 -223 -693
11255 -693 -1183 -1450 -1394 -1214 -983 -669 -539 -640 -568 -581 -735 -1124 -2002 -1598 -133 962 1355 1183 732 750 1106
11234 1106 1161 964 668 323 433 925 1361 1488 1246 606 -204 -1261 -1785 -1379 -716 -1270 -2249 -1251 -36 220
11213 -514 -1833 -896 -40 27 743 1669 1713 1289 2085 3725 3972 910 -1418 4325 7377 6878 6107 10471 14822
11194 14822 12720 12306 24777 36981 36894 39801 95261 191383 304355 410258 485634 513150 485903
11181 485903 410899 305576 193158 97210 40171 35042 34963 23520 10355 9771 10965 7365 4484
11168 4484 7119 8925 6959 3366 1908 2843 1599 -1204 -1732 -456 294 -37 -487 -398 136 988 1699 1417
11150 1417 130 -1657 -2977 -1235 -467 -514 -708 -379 269 587 633 600 46 -1040 -1416 -45 704 841 464 113
11129 137 531 929 1106 1251 1060 794 443 77 -241 -282 -25 -12 -546 -1636 -2424 -2041 -1804 -1610 -913 64 578
11108 578 997 1124 1029 655 -82 -786 -1045 -753 14 703 987 983 817 381 -462 -1523 -1603 -965 -650 -878 -1333
11087 -1333 -1392 -1070 -807 -1246 -1998 -1595 -5 1331 2130 2294 1956 1209 494 295 710 1132 1536 1466 1066 444
11066 46 -48 4 155 170 256 -136 -1141 -2211 -1066 129 1081 1577 1559 1221 498 91 392 1176 2030 2896 2803 1686
11044 1686 172 -1000 -1228 -1088 -1202 -1741 -1654 -755 -208 172 390 486 316 -72 -714 -1730 -2183 -1107 -343
11024 -29 -158 -437 -676 -626 -376 -35 189 190 21 -70 -312 -483 -317 -121 238 116 -261 -542 -472 -327 -450 -803
11002 -803 -1515 -2337 -3013 -2385 -1808 -1765 -1875 -1796 -1630 -1389 -1134 -822 -236 313 691 921 902 460 -127 -958 -895
10981 -895 625 2128 3169 3504 3264 2582 1949 1404 924 513 330 546 914 1313 1366 1510 1977 2410 2736
10962 2736 2382 1286 -484 -2133 -3299 -2815 -2166 -1486 -665 103 164 -708 -1792 -827 177 675 942 878 601
10943 601 147 -500 -747 -810 -513 -409 -430 -131 627 1211 1178 512 -877 -2097 -1492 -612 -381 -694 -1266 -1843
10923 -1843 -1612 -1059 -643 -374 -237 -291 -639 -1060 -964 -623 -691 -774 -195 968 2179 2928 2841 2026 786 -857 -2323
10902 -2323 -1648 393 2701 4906 6033 5684 4738 3024 2703 3636 4246 3610 1788 -258 -1987 -1911 -1521 -580
10883 1370 3902 6912 9456 10740 10089 8690 6974 5244 2966 1166 -353 -1127 -1477 -1218 -834 -839 -1244
10866 -1244 -824 191 1378 2196 2535 2100 1001 -123 -854 -1005 -419 297 567 340 -233 -462 713 1910
10848 1910 2578 2429 1246 -594 -2169 -648 783 1191 378 -906 -1184 -743 297 1409 2021 1895 1357 1225
10830 1225 1997 3228 4222 4298 3268 1250 -867 -1011 370 1488 1697 1147 233 -205 105 115 -151 -821 -1693
10811 -1693 -2004 -872 398 1347 1830 1871 1289 660 407 241 31 18 154 237 -100 -351 327 1377 1930 1668
10791 1668 815 -112 -361 174 598 851 973 1132 1504 2117 2333 1876 1456 921 640 666 748 1850 3693
10772 3693 5121 5469 4296 1539 -455 1275 3345 3849 2499 -234 -1617 649 1426 827 -140 93 362
10755 362 -234 -1640 -817 1208 2670 3367 3517 3926 5074 6118 6048 3863 92 -18 4382 7268 8198 8587
10737 8587 10173 12624 13687 13730 14925 17890 21070 25535 34347 46201 57448 71334 99521 149353
10723 149353 215365 285905 349315 396697 422844 425983 406077 365092 306686 237855 168492 110956
10711 110956 76964 63515 53871 40618 27531 21612 20816 18665 14366 11030 10381 10264 9121 8374
10697 8374 8234 6383 2808 711 3064 4768 3842 661 501 4396 6869 6659 4543 1361 -546 924 2173
10680 2173 2465 2038 1352 391 -1030 -1918 -200 1653 2703 2254 409 -2520 -346 2404 4457 5002 4124
10663 4124 2080 -291 -2294 -953 -142 58 44 305 586 822 941 1174 1326 1478 1395 1442 1282 835 546 464
10643 464 1048 1540 1505 947 280 104 71 -195 -782 -1148 -1101 -909 -794 -771 -754 -352 -151 127 313 115 -63 234
10620 630 940 675 -134 -843 -683 -549 -890 -1678 -1159 -239 368 338 -199 -545 -74 622 973 1223 1347 1529
10600 1529 1696 1931 2219 2195 1862 1200 165 -236 464 1556 2536 3155 3195 2673 2106 1804 1505 1345 1193 1023
10580 1023 942 837 546 -305 -1113 -1269 -1074 -1002 -1516 -2375 -1326 191 1147 1392 1044 411 -371 -613 -311 482
10559 1539 2666 3440 3538 3059 1922 959 505 128 -149 -693 -1331 -2134 -2213 -1903 -1059 123 126 -987 -2714 -2017
10539 -2017 246 2266 3616 3634 2486 1039 -485 -1259 -1537 -1406 -944 -445 -19 303 486 669 528 -55 -1025
10520 -1025 -1694 -730 266 1150 1650 1389 1061 937 818 975 1290 1554 1464 711 -527 -2165 -2483 -685 990
10500 1836 1880 1196 -53 -1203 -2330 -2526 -2725 -2938 -2320 -1246 -473 -327 -547 -663 -491 -478 -564 -367 -351 -270
10480 -270 -677 -894 -1083 -1011 -1331 -698 83 974 1886 2622 2962 3240 2991 2508 1532 522 -809 -2031 -2756 -2284
10460 -2284 -1910 -1893 -2000 -1517 -902 -486 191 242 -176 -985 -1754 -909 -313 3 -174 -448 -1038 -1338 -1464 -1899 -2578
10439 -2578 -1918 -466 1340 2779 3492 3811 3731 3536 2669 1305 -614 -2123 -2516 -1218 -345 -155 -900 -2137
10421 -2137 -1799 -631 363 901 1150 633 -141 -652 -402 199 952 1444 1345 1407 800 -358 -1886 -2630 -1749 -1351
10401 -1351 -1532 -1622 -1268 2 1361 4295 5497 5075 2128 2963 12700 24797 36453 46315 51553 50575 43766
10384 43766 33155 20717 8954 479 -2223 -1164 -2005 -2214 21 681 475 -564 -2669 -2256 -744 483 1233
10367 1233 1499 1124 546 318 370 508 772 718 432 247 226 485 877 1156 1274 1571 1646 1682 1656 1546 1474 1601
10345 1601 1840 2121 2655 2961 2659 2374 1912 1256 899 712 612 130 -210 85 655 1214 1449 1275 528 -209
10324 -34 351 546 234 -266 -1074 -2305 -2104 183 2044 2774 2083 1111 235 -142 -15 878 2038 1618 -323
10304 -1652 283 1729 3550 9385 15629 17385 23179 58786 124672 212931 311395 404055 473436
10291 473436 505788 494464 441878 359006 261699 166909 89865 38305 18194 16220 12902 9731
10279 9731 8484 6628 2308 -390 120 1256 1549 2052 3282 3339 2081 325 -1626 -2801 -2221 -2192 -2388
10262 -2388 -2410 -896 526 1385 1696 1682 1086 152 -857 -1537 -2443 -2971 -3915 -3622 -3116 -1753 -385 245 -442 -1818
10242 -1818 1286 7809 14511 19217 21009 21650 24363 32570 44570 56645 65810 70607 70666 68626 67046
10227 67046 68294 70014 69275 63210 51602 34300 18558 4880 -1316 -341 350 -1766 -2801 -1620
10213 -1620 -1399 -2162 -2218 -1127 -532 287 1385 2253 2299 2126 2341 3256 3971 3957 3251 2089 926 -360 -1458
10194 -1458 -1275 412 2098 3370 3559 3033 3661 6612 10739 14539 17282 17765 16150 13109 9704 6362
10178 6362 3535 1344 109 -832 -714 83 709 824 273 -775 -1655 -1396 -521 858 2354 3241 3064 2278 1874
10159 1874 1810 1652 964 325 -311 -884 -943 -844 -315 82 283 -8 -841 -1992 -1444 536 2439 3830 4408 4254
10139 4254 3746 2879 1939 1384 1452 1493 1480 1234 742 340 86 -178 -414 -630 -1040 -1648 -2180 -2181 -1826 -1320 -1066
10118 -1066 -939 -815 -537 -171 -223 -474 -1393 -2201 -1669 -1058 -774 -1519 -1891 -1336 -1022 -1614 -1258 -168 757 930
10098 930 2159 6041 10510 15131 20391 21405 20268 19089 20530 25747 32100 37507 40437 39957 36472
10083 36472 31148 24435 19429 20645 27977 36812 42691 41637 30651 10061 16188 51566 87522
10070 87522 117949 137259 143519 135383 115086 87849 58619 32654 13128 5586 6594 6377 4861
10057 4861 2707 429 -515 1004 2996 5023 6232 6833 6578 5679 4091 2777 1803 1266 1715 3103 4764
10040 4764 5859 6152 5629 4537 3501 2875 3154 3683 3616 3017 2083 1097 940 1518 1992 1832 818 -640 -1746
10021 -1746 246 1227 1523 1682 1342 466 -449 -936 -1591 -2031 -1463 -1544 -1269 -2110 -5305 -2497 -712 1207 3826
10002 3826 3741 2857 1730 -156 -1785 -2249 567 100 -5076 -5466 -7746 -7020 -5534 -4345 -4713 -3584 8212
9984 7888 6253 5910 8257 14510 21997 28786 33325 34967 34017 29519 23050 16092 9811 5154 2417
9968 522 -981 -1830 -1035 -830 -1397 -2178 -1868 -1030 -296 219 156 -165 -870 -1434 -1834 -1997 -1792 -1558 -1569 -1879 -2316
9947 -2316 -2744 -2665 -1936 -1456 -1110 -1138 -1348 -1620 -1389 -901 -562 -572 -714 -686 -905 -760 -238 201 407 275 -134
9925 -973 -1761 -2841 -2895 -1858 -850 -288 -36 -224 -348 -653 -1268 -1840 -1933 -1445 -792 -78 524 511 33 -671 -1504
9904 -1504 -2191 -2451 -1959 -1079 -307 270 79 -411 -1444 -1549 -1220 -624 -193 283 796 1380 1661 1353 529 -524
9883 -1530 -1849 -1699 -1360 -403 354 1441 2010 2112 1764 828 -1020 -1325 2171 5662 8303 10502 10761 8881
9865 8881 6281 4844 6497 8765 9665 9106 7028 4221 1452 343 -177 -698 -1228 -238 1640 2983 2884
9848 2884 1213 -326 -2510 -2936 -1847 -1130 -1287 -2091 -1638 -941 -677 -978 -1734 -1753 -297 868 1035 -100 -1770
9829 -1770 -1734 -340 848 2063 2808 3270 3190 2845 1686 101 -1402 -1305 16 880 853 56 -996 -1562 -1196 -728 -612
9808 -612 -826 -1636 -2769 -3981 -2709 -1446 -486 118 -322 -1674 -741 1186 2639 3949 5828 9753 14843
9791 14843 19600 23058 24393 23450 20302 15734 10665 5879 2018 -319 -1314 -1596 -1340 -991 -753 -842 -1195
9774 -1195 -1724 -1185 -878 -1036 -1614 -2316 -2048 -1088 387 1779 2537 1933 1070 -297 -1045 -431 840 1599 1724
9755 1724 1730 1736 1887 1413 357 126 1432 2701 3311 2900 2241 1310 396 -808 -1497 -683 122 223 -405 -1322
9735 -1322 -2038 -1443 409 3457 7244 10655 12736 13064 12033 9521 6144 3176 2519 3773 4599 4331 3140
9718 3140 1408 -143 19 1123 1970 2180 1823 1019 111 77 945 1665 1955 1997 1473 502 -359 -775 -975 -1239
9698 -1239 -1606 -2275 -2491 -2142 -1746 -1445 -1202 -1345 -1608 -1470 -880 -414 -228 -445 -750 -727 -409 -237 -1106 -1780
9678 -1780 -827 258 799 587 -315 -1457 -1772 -634 274 669 589 378 217 192 265 193 89 -164 -399 -250 95
9656 451 674 1012 1425 2096 2840 3081 2926 2175 1277 82 -1105 -1471 -407 748 1207 972 211 -773 -1421 -1783
9636 -1783 -1927 -1615 -730 -146 -37 -198 967 2707 4744 5934 5661 4240 1920 -686 -3122 -2987 -999 959
9617 2607 3321 3135 2116 813 -300 -1530 -2571 -1470 124 1335 2296 3065 3255 2319 1411 580 181 1021
9599 1021 2192 3039 3182 2380 1085 -441 -1851 -1852 -936 -290 345 1018 1362 1533 1367 1284 1203 1090 702 -66
9578 -1338 -2019 -914 -48 348 40 -415 -412 -82 238 146 199 625 797 1047 1724 1982 2079 1551 653 -223 -945 -994 -930
9555 -930 -794 -846 -1988 -3135 -3019 -1005 1180 2672 3291 2742 957 -1183 -1817 -1302 -859 -481 620 2196
9537 2196 3424 3549 2993 2285 1458 602 -372 -2103 -2709 -1144 -1148 -3399 -4997 2647 14251 22979 28473
9520 28473 28108 19876 5886 15645 42215 69684 94275 112558 122427 122227 114267 98888 78748 57349
9506 57349 36846 20579 9243 3953 2836 1623 -986 -2062 -727 620 326 -118 247 1315 1424 921
9490 921 -313 -1157 -1723 -1944 -1003 -255 410 2282 5390 7407 8213 7570 5459 2445 -1536 -1573 1755 3908
9472 3908 6198 7649 7645 7980 7857 5182 10507 14058 14547 14638 12460 8413 3903 580 159 575 -104 -1049
9454 -1049 -83 1169 2546 5436 10955 16822 21976 25945 26729 24132 18337 11455 4751 -230 -865 -114
9437 -790 -2533 -2449 -1019 -412 -1667 -3688 -2744 1893 7257 9893 11066 9180 3582 -2438 -2477 -5917 -634
9419 -536 -1725 1798 7714 14718 20037 34101 70881 83626 210028 296708 377403 438169 466570
9406 466570 456920 411228 338923 253151 168348 96713 46222 21839 14555 9805 4573 780 -242
9392 -1811 -1983 -809 -380 -510 -1820 -2913 -2306 -1538 -1225 -1110 -1071 -810 -659 -621 -647 -869 -868 -999 -933 -892 -420
9370 -22 37 -94 92 439 639 604 418 227 153 279 447 642 550 38 -772 -1301 -1441 -1292 -1219 -1126 -695 -213 28 -241
9345 -950 -1596 -599 1121 2821 4165 4849 4895 4216 3060 1817 702 -66 -998 -1732 -2350 -1538 -608 172 627
9326 627 980 1129 1575 1944 2509 3348 3744 3594 2669 1264 -343 -1567 -2751 -1552 -90 1113 2037 2455 2526
9307 2526 2118 1569 1326 1615 1929 2004 1907 1682 1265 364 -668 -1740 -820 -130 349 672 383 -203 -612 -962
9287 -962 -1176 -1187 -953 -552 -96 497 1095 1462 1267 768 33 -668 -1032 -956 -583 -142 -75 -219 -580 -1025 -1435 -1618
9265 -1618 -1741 -1283 -679 -26 91 -222 -858 -1640 -1871 -843 211 779 625 -199 -1055 -774 -14 366 370 -97 -602 -980
9243 -980 -966 -560 -215 -243 -756 -1252 -1214 -363 298 629 301 -378 -928 -1225 -1032 -751 -485 -234 -88 -249 -807
9222 -807 -1557 -2251 -1926 -1133 -404 -231 -664 -1168 -2189 -1836 -401 855 1812 2243 2059 1074 -442 -1211 -1409 -1240
9202 -1240 -482 1055 -444 -4759 -8393 -2273 -1598 -1354 -581 430 474 -6 -946 -2073 -2790 -2842 -1837 -875 -674
9183 -674 -1879 -854 -1313 -1258 -1566 -1478 -1080 -639 -302 -245 -443 -1266 -2207 -2664 -2282 -1806 -1261 -1013 -1423 -1638 -784
9161 47 331 367 547 437 419 117 -337 -603 -871 -1442 -1725 -1180 -413 155 307 187 -426 -1286 -2210 -1548 -802
9140 -802 -388 -283 -757 -1296 -1035 -478 -100 130 213 529 860 945 944 1066 1081 916 388 -344 -991 -843 -692 -821
9118 -821 -1111 -1355 -1401 -1559 -1746 -2005 -1971 -1805 -1767 -2019 -2308 -1927 -1532 -859 103 829 1188 785 28 -873 -1782
9097 -1782 -1629 -1030 -607 -88 795 1918 2895 3209 2554 1182 -91 -1217 -1996 -2390 -2496 -2451 -1740 -1207 -1027 -1256
9077 -1256 -1691 -2109 -1930 -1706 -1653 -1538 -1348 -1214 -997 -646 -254 -195 -377 -636 -679 -156 492 931 950 508 -348
9055 -1292 -1162 -163 853 1407 1382 447 -680 -1298 -371 400 643 525 571 987 1225 1219 830 559 -88 -826 -1681
9034 -1681 -2658 -3284 -2957 -2121 -1503 -775 159 834 1099 961 735 172 -782 -2043 -1690 -964 -413 -141 -133 -412
9014 -412 -583 -539 -672 -849 -1154 -1049 -336 168 308 92 -776 -1656 -1305 -913 -929 -1063 -1144 -836 -444 67 701 1116
8992 1116 1136 682 -38 -769 -1449 -2272 -1942 -630 -40 -100 -518 -850 -509 307 970 1517 1754 1997 2076 2062 2085 1990
8970 1990 1786 1269 161 -1100 -2072 -1451 -332 509 977 1086 722 112 -552 -719 -382 148 119 -416 -919 -733
8950 -733 -323 -252 -959 -1646 -1105 -333 186 537 670 645 1420 2078 2526 2597 1962 1346 755 93 -588 -1338 -2229
8929 -2229 -1580 -965 -480 -79 356 694 1011 960 551 -268 -1667 -1303 225 1153 1114 115 -1290 -430 1269 2025
8909 2025 1861 862 -280 -1279 -1889 -2328 -2493 -2771 -2748 -2725 -2319 -1641 -977 -257 523 1444 2340 3034 3577 3707
8889 3707 3436 2563 1024 -836 -1818 -988 -345 -200 -566 -1205 -1275 -899 -604 -333 -244 -118 -51 442 1020 1229
8869 1229 839 270 123 468 669 431 -401 -1538 -1914 -1593 -1474 -2609 -2907 -1547 -313 395 753 737 817
8850 817 1070 1697 1928 1454 358 -1143 -2499 -2532 -2288 -2891 -2274 -1071 -119 301 484 918 1259 1352 1132 763
8830 763 442 -14 -143 110 388 158 -377 -1233 -1991 -2090 -2103 -2159 -1955 -1386 -1323 -1691 -1569 -644 126 361 21 -867
8807 -1789 -2661 -2425 -1705 -990 -41 911 1416 1425 972 102 -1311 -2212 -1438 -1206 -1583 -2096 -824 185 704 928
8787 928 1107 1346 1492 1137 584 -66 -280 144 532 812 1267 1823 2315 2490 2075 1748 1888 2213 2715 3069
8767 3069 3170 3902 4508 4183 2870 1061 -392 -1222 -648 -255 -497 -2043 -2984 -2196 -1620 -1531 -1720 -1271 -2747
8748 -2747 -4711 -2065 -506 -617 -1441 -4257 -6540 -4522 -963 4947 830 -1270 -5440 9517 23607 31733
8732 31733 32605 24044 9590 3875 20526 36056 53039 63283 69449 68574 56343 32171 56481
8719 56481 87384 99104 94038 101116 106247 111932 114106 113669 82890 85223 58920 41626 28977
8706 28977 6562 -1899 10084 18878 21910 23554 18901 16693 12754 10848 871 6209 1341 10111 410
8690 -2647 -6417 -8021 -4885 -2469 -732 -307 595 223 545 -121 -1474 -1769 -2329 -1307 30 705 893 480
8672 480 106 117 101 -740 -141 3780 6511 6876 8154 21187 46663 75509 103025 125082 119302 116057
8656 116057 111504 84658 56345 28689 12498 6871 8598 6694 2614 840 375 -1098 -712 2453
8641 4547 4581 2526 -485 -3308 -3334 -2221 -2153 -2463 -2147 -1298 -485 -466 -818 -979 -993 -1294 -2074 -1559 28 948 1114
8620 1114 153 -1294 -2529 -2444 -2322 -2465 -1899 -1136 -646 -476 -625 -570 -808 -1250 -1776 -2286 -2152 -1442 -666 74
8599 574 647 415 139 497 1011 854 153 -1333 -2713 -1179 793 2143 2882 2481 1397 151 -617 -309 552
8579 1136 1151 894 363 -497 -1438 -1951 -1852 -1551 -1007 -240 365 639 587 258 -301 -575 75 1045 1499 1388 702
8558 702 -123 -548 -504 -426 -678 -1277 -1886 -2450 -2377 -2518 -2731 -2325 -1569 -1059 -770 -1034 -1733 -2275 -1449 -961 -809
8537 -809 -1036 -1371 -1524 -1485 -1315 -1380 -1685 -1958 -2255 -2211 -1604 -1359 -1245 -736 387 1810 2781 2717 1790 245 -1247
8515 -1473 -419 490 1070 562 149 -909 -1218 -2026 -2813 -3336 -2785 -2270 -1802 -1334 -613 -149 42 233 512 1303
8495 1303 1976 2180 1643 399 -739 -445 475 635 644 -38 -302 -241 -207 55 1302 3199 4755 5216 4735 3591
8475 3591 2115 898 615 531 357 -258 -1115 -1591 -697 98 261 -396 -1440 -1723 -758 -359 -938 -2150 -2626
8456 -2626 -1301 -313 24 -341 -1186 -2478 -1668 -40 954 968 490 124 79 217 297 289 176 -31 -625 -1210 -1062 -1110
8434 -1110 -1772 -2974 -1868 223 1162 1103 228 -781 -1178 -226 1145 1559 658 -1466 -2597 -1030 742 1301
8416 1301 403 -1176 -1723 -1217 -349 -941 -2053 -3281 -3695 -3436 -3128 -2278 -1517 -1267 -1568 -1927 -1186 65 1051
8397 1051 1244 574 -348 -750 -299 278 130 -791 -1276 -762 -3 247 162 -665 -1146 -1177 -1291 -415 1744 2702 2339
8376 2339 2426 2870 4206 5687 5468 3253 989 2950 8834 13071 16601 17818 18882 20937 24962 29583
8360 29583 33047 33652 31469 26883 22353 18033 15726 14116 12050 8652 4829 1569 1288 2339 1890
8345 1890 1321 -166 -786 -774 -706 -1160 -1557 -380 608 730 697 1077 1645 1226 -597 -2438 -656 1692 2819 2386
8325 2386 1113 180 977 2315 2821 2062 440 -683 -631 357 1762 3518 4667 5109 4374 2783 1059 -383
8306 -1172 -1546 -1223 -757 -110 555 1318 1641 1326 688 87 118 714 1808 2992 3842 3980 3279 2335 1097
8286 -1 -635 -893 -878 -664 -186 274 238 -722 -2318 -1279 903 2114 2340 1366 -411 -2208 -2225 -2111 -2018 -954 -149
8264 141 -574 -1973 -1113 -7 254 -551 -2679 -2792 -657 908 1056 -453 -2197 -1297 -216 -774 -2305 -2134 -102
8244 1605 2906 3503 2945 2040 715 -1090 -2957 -3408 -993 1978 4912 7119 8451 9383 9503 8253 5621
8227 5621 1083 -1635 6783 16682 26128 33485 37600 37624 33647 26567 17810 9138 1949 -28 2967 7526
8211 7526 11866 14632 15014 13777 11467 9589 10350 12286 14448 15887 15087 11949 6569 432 -4074 1604
8194 6289 9009 9926 8672 6331 3856 3080 2929 1699 -296 -1857 -1178 -1284 -2782 -678 2128 5282 7096
8177 7096 5486 2527 -57 -318 4906 8832 13674 17262 18949 19483 18599 16579 13315 9524 5943 3021
8161 3021 860 -65 218 1101 2108 2169 1122 -1060 -3241 -1791 -12 921 1540 2852 6206 10628 15331 19553
8143 19553 22722 25148 27033 28243 27928 25518 21143 15251 9037 3496 120 201 819 373 -647 -2005
8127 -2005 -962 1718 3792 4339 3392 1527 171 190 117 554 1539 3166 4034 3965 3088 2509 3192 4042 4432
8108 4432 4363 4269 4710 5070 5270 4908 4520 3779 3241 4347 7562 11805 15669 18997 21423 22501 22145 20174
8090 20174 17625 15397 12864 8933 4576 4908 11822 18217 22873 24034 22951 20315 16930 13483 10028
8075 10028 6584 3915 2555 1764 1977 4050 6537 7427 5905 4170 7961 14453 17380 14535 8132
8060 8132 12466 26107 39162 51064 69859 104931 153966 206685 252725 282030 287391 267563
8048 267563 227554 176101 124353 81538 53759 38314 26773 14293 2581 5079 11892 15733
8036 15733 15713 13363 10056 8852 10725 12772 13152 10622 7785 10974 18270 25223 29835 31744 31849 32099
8020 32099 32470 29823 24277 18285 16284 16842 15204 10853 7550 9245 12544 15814 21022 26140 28063
8005 28063 28534 32127 40081 47510 55806 71389 93446 119561 162486 247302 382199 547332 710228
7992 710228 835198 895565 877161 785503 641438 474385 314300 182281 85003 17534 28858
7981 28858 64713 85358 88868 79024 63616 50491 42212 36126 30038 23367 18808 15385 13129 14261
7967 14261 17030 18148 15451 9943 4360 874 962 3346 5235 5207 2371 318 767 2911 3006 1315 -901
7949 -3765 -4406 -1831 1304 4982 7132 6382 4264 1253 -851 320 1402 -1115 1714 2769 924 3393
7933 3393 14592 29583 44752 57481 65448 68325 52092 43143 32970 21579 4861 -3329 -1890
7920 -1890 -882 -2981 -3850 -7 1347 130 1334 3547 4553 3436 1132 -221 -480 -1089 -2142 -2518 -2114 -1865
7902 -1865 -1078 553 1382 815 -476 -905 -1376 -3054 -1882 1354 4227 6129 7838 7945 5728 5201 5932
7885 5932 5910 8776 12654 17716 22953 26788 28352 26976 21966 14699 3854 -3907 -1757 3042 7851
7870 7851 9334 10257 9545 7382 5196 3209 1699 1184 2235 3110 2520 -1232 -3523 -7139 -4660 1883
7853 1952 337 -780 1383 6060 11083 16330 20739 23163 22550 20329 16386 10100 12978 10978 9052 11701
7837 11701 9700 10659 9836 10463 9208 9135 9970 8663 8935 8034 5239 1792 2468 3836 5877 4396 3531
7820 3531 2199 1847 5533 12511 19210 24716 30184 42765 61686 86966 107235 119165 120580 109883
7806 109883 90310 65552 41914 23188 14674 13846 12765 10215 6899 5212 6599 10804 13863 14352
7792 14352 13892 13730 13833 12775 11305 8184 1230 -5615 -6110 -822 819 5668 11152 14939 14762 8595
7776 8595 6050 248 12763 15035 16078 18375 22007 26002 12205 9575 14393 13652 10231 4496 -1842
7760 -4109 8129 22015 32332 34960 34073 21359 11861 5802 1644 -5073 -6575 -3257 -119 -270 -1918
7745 -1918 -4956 -6732 -3725 242 2837 4872 8059 10032 8930 5580 1582 -1939 -2962 -318 4449
7729 9087 12373 13372 11648 7615 2415 -1809 -850 515 1994 2434 3121 2098 1613 1407 2728 4701 5234
7712 5234 3500 1156 506 1962 3174 3925 4730 5036 4202 2953 3272 4486 5001 4522 3340 2743 3435
7695 3435 4250 4188 2341 2653 6520 10372 11014 8941 6878 7797 10129 11478 11202 10478 9958 9899 9488 8856
7677 8856 7763 8926 13234 17801 18652 16008 11572 9514 11105 14674 18425 21191 23073 26397 31253
7662 31253 35375 35925 32307 28960 24757 15370 3798 -1822 11957 27083 38215 52482 63260 60383
7648 60383 45937 43045 62982 85663 91489 93666 104906 116738 117866 108215 130537 165203 176476
7635 176476 190472 283709 415433 495331 527184 759335 1388598 2304508 3345815 4349228
7625 4349228 5163558 5668745 5792682 5517267 4879930 3973001 2929745 1909246 1075747
7616 1075747 594506 498607 477046 378689 257778 203155 201163 181537 140466 106306 84269
7605 84269 53336 25192 50593 79529 87886 79587 72326 72796 69331 56560 40555 31794 30907 32716
7591 32716 37692 42962 42405 36044 30460 31028 30874 25338 19793 23081 29745 32815 33758 35487 35863 33001
7575 33001 31782 39592 50125 54039 47812 38833 39916 45910 39593 10703 35018 109152 190422
7562 190422 264249 316785 337661 322728 275019 205329 129976 67889 40678 41570 39573 32302
7550 32302 27485 24838 20001 17313 23312 29062 26395 13693 200 21053 40310 53203 60495 64566
7536 64566 67937 69513 64819 51936 33558 18518 16380 17130 11664 4327 8801 14385 13997 10406
7522 10406 9397 8874 7635 6918 7116 4507 -698 520 10656 16383 15568 9489 4133 5827 9680 14682
7506 14682 19995 21456 17932 11526 8540 10705 11107 9451 12272 10422 6736 -851 3970 14159 18203
7491 18203 15913 13152 9862 3126 -2918 11232 22383 26323 22859 15689 10622 7543 5928 10780
7477 10780 16829 17937 13701 11354 14441 15483 12011 11330 16136 17633 11604 3965 10134 13388 9077
7462 9077 -550 1239 8576 10403 14536 23022 27084 22516 12258 8899 12045 9745 7332 13923 18342
7447 18342 15437 19451 36529 50444 51593 40390 28242 30259 39300 44336 46221 45724 39196 24888
7433 24888 9203 11839 17876 17155 16474 21774 27055 29951 31815 29340 17845 6056 24796 42500
7419 42500 42946 26522 2961 12 17084 23886 21298 23666 33968 49199 62687 69085 60472 37960
7405 37960 16919 27785 37356 27471 10541 23218 37034 33541 24919 35441 46278 39261 23027
7392 23027 33282 49282 44430 18671 6168 29451 33356 26606 40342 54963 49929 26334 28470
7379 28470 51743 52109 27977 25837 54350 61018 38452 24218 51018 58546 39311 21417 45989
7366 45989 57271 40411 35222 59365 63139 31597 15070 61320 77698 52668 33672 75630
7354 75630 95285 69617 41173 84559 113200 88836 39525 76425 118223 105108 60702 83134
7342 83134 119862 99118 26145 59062 112884 101577 56044 110474 166294 144578 59641 106724
7330 106724 188507 182324 100333 121707 212856 213172 118049 124196 238212 250656 142508 140129
7318 140129 284766 314755 193086 147168 318687 364903 232594 181187 408236 482264 323274
7307 323274 211008 481284 606298 427551 236088 594222 791065 601135 346239 789379
7297 789379 1081456 846062 474818 1116862 1618589 1361595 705268 1582422 2479232 2238668
7287 2238668 1214050 2640104 4419362 4302085 2389078 5258479 9973182 11119044
7279 11119044 7345535 17898446 45040363 79630258 114896233 143362164 158565092
7272 158565092 156924872 138841470 108560768 72880261 39230617 14164067 7810981
7265 7810981 11201715 9182088 4375044 2712144 4471860 4134074 2180388 1291280 2361349
7256 2361349 2374768 1374490 762123 1422136 1504185 906741 458362 947094 1072524 688152
7246 688152 309043 648445 789485 555039 260463 462485 585094 425527 179065 341826
7236 341826 466304 362954 152490 237096 344470 277039 114990 189602 293795 249872
7226 249872 104712 135378 236426 218337 113568 119368 199398 189284 93693 86188 178382
7215 178382 192659 119277 93802 214676 314735 362075 367545 344963 306747 262249 232506
7204 232506 215158 175834 103982 46750 92194 122555 100412 64472 88306 114818 106368 77438
7192 77438 84092 101129 81035 54768 89623 124547 116293 87273 112887 144270 132053 110346
7180 110346 150831 194766 178194 135668 168767 229805 233930 209799 256245 308508 274958 190918
7168 190918 236119 336964 343304 273303 346034 471188 472297 339416 431309 655779 698738
7157 698738 588095 681475 955348 995078 757341 795670 1244991 1363061 1059036 1435855
7147 1435855 2490518 2997603 2757060 3571671 6002618 7794078 8003874 11483965 23865931
7138 23865931 42425045 63179016 81781675 94127584 97379499 90766410 75863311
7131 75863311 56097843 35696259 18719342 8747626 7039087 6743743 5177912 3930510
7123 3930510 3758975 3379809 2383580 1632399 1820958 1905737 1437468 868201 932282 1128979
7113 1128979 1004534 841048 918351 1000465 856949 636289 626494 700013 614213 389830 168461
7101 170779 141402 28116 140766 217147 168609 141462 285018 382700 359290 276941 269661
7090 269661 303873 268971 180671 163409 216047 207005 142768 151162 202722 183444 102986 121834
7078 121834 201682 203342 137878 128688 188050 191724 139221 122545 155917 136906 40381 67376
7066 67376 154454 157264 93221 107658 183800 185451 111396 106309 182651 184294 98794 98284 195277
7053 195277 205543 119780 111798 215406 230104 139799 130950 246037 267049 165824 145584
7042 145584 282602 314800 200747 164154 338114 398039 281547 241209 487455 657201
7032 657201 631405 463148 306743 234956 272079 536866 811979 871564 638926 460506
7022 460506 808698 1090889 1034713 868902 1025084 1201476 997383 769439 1289872 1715686
7012 1715686 1483443 1102950 1913588 2672046 2314582 1260292 2751807 4496973 4280070
7003 4280070 2293781 5346098 10042920 11026874 7026447 18029506 45279272 79668814
6995 79668814 114474877 142271273 156748095 154487959 136039100 105730311 70364647
6988 70364647 37269952 12897935 7747857 11069434 8838215 3979379 2728603 4538587
6980 4538587 4101420 2084155 1314899 2411352 2383574 1344905 741358 1411473 1463175
6971 1463175 816900 427332 983199 1098289 695058 332577 680115 799136 530620 233538
6960 494811 622507 446745 193914 363068 477043 350858 138724 288497 403502 318814
6950 318814 139156 222077 326760 270208 111046 158870 259688 228461 111826 145604 231326
6939 231326 208262 99024 105340 189067 180270 91054 91923 170363 169773 96032 73724 137414 142485
6926 142485 78003 56322 123284 134619 82110 46095 101742 118957 78822 46405 89718 105033
6914 105033 68247 33146 79105 99224 68588 24263 63287 88055 67615 33344 60259 81637
6902 81637 62744 26961 51595 75427 61660 25382 43307 69155 60154 27440 34430 59796
6890 59796 55523 28422 31420 53414 50265 25504 28738 51542 50497 26512 21877 44355 46364
6877 46364 26520 21773 41264 42665 22898 16788 39920 45188 28476 13461 31420 38194 25399
6864 25399 15177 31196 37787 25332 10850 27474 35539 26095 14417 27520 36756 28475 11335
6850 17296 27098 21505 8977 19477 28923 22981 8808 14002 24430 21029 8701 15411 26481 24771
6836 24771 12041 11402 21499 20457 9887 12568 23368 22718 11134 7452 18037 20112 12535 10737
6822 10737 19622 21060 12346 8461 16808 17473 7628 5718 18861 23454 16437 6787 12361 17281 12200
6807 12200 4979 11938 16670 11471 1000 6758 13606 11421 7688 13381 18494 15851 8797 8439 11023
6792 11023 6715 -1740 8455 15023 12650 4861 7235 14000 14193 8567 8485 13265 12604 6834 5385 8831
6776 8831 6825 -1714 4919 14309 16168 10692 5012 8563 10448 7014 5993 10333 11804 7991 7576
6761 7576 13270 15555 14093 16196 21921 24502 21500 16802 17831 20054 17625 11835 10880 13959 13901 12995
6745 12995 18704 27436 31762 29347 21922 12870 7478 9725 17187 25555 34662 40453 41738 36084 23625
6730 23625 8133 1482 9060 10871 7923 7548 10317 9772 5785 4332 6929 6884 2279 -221 4743 6604
6714 6604 5316 4825 6186 4917 2065 5838 11119 11913 7687 3540 6726 9788 7894 4450 6170
6699 6170 8663 6866 3012 4221 7036 7918 8492 11358 11769 7365 -337 4808 13948 18764 20123 21328
6683 21328 22620 22232 19162 23071 27733 31867 35716 47315 67076 87322 104660 115644 118282 113140
6669 113140 92010 74459 51226 27049 25835 28592 27521 24491 19379 20691 24923 24761 19883 12423
6655 12423 6249 3873 1603 -213 -454 -246 537 3806 6482 6114 2125 1933 7368 10168 8538 3249
6638 -3033 -2110 354 1222 1525 1048 -557 93 2866 4506 3846 3040 4002 4084 1616 140 3604 6053 4850
6620 4850 380 -279 3504 4636 4108 5206 7251 7406 5200 3497 5133 6564 4697 397 -1429 1900
6603 4299 4161 2742 1072 1998 5225 7802 8003 5716 2858 1969 1513 -1032 -4141 308 3557 4269 3769
6586 3769 4406 5665 5991 5325 3840 2420 96 -2773 -2785 -2129 -3301 -1282 1860 3387 1987 -824 -1523
6569 -1523 233 41 -68 3498 6595 7956 6902 5453 3663 613 -4015 -1080 1800 1575 -15 5591 13892
6552 13892 20884 24728 25411 24266 22265 19345 15248 10274 4782 -1226 -3717 -508 3948 9427 14545
6537 14545 18573 18993 16562 10636 4584 2620 3976 4100 2242 -2260 -7953 -10589 -11439 -10243 -8867
6522 -8867 -7188 -3766 -1311 -1546 -1455 -1133 996 2967 4827 6478 6313 4614 470 -2107 1152 4254 6310
6505 6310 7117 9427 12436 15284 16553 14274 13811 18100 23157 27722 30007 29149 26544 18847 7638 -5001
6488 7314 20908 30816 35704 37346 33509 28376 20916 13269 6626 3139 937 -772 -2367 -3542 -1840
6473 -1840 2178 6234 9302 10360 9190 7253 4922 2354 1 1636 8661 17445 26003 33707 39309 41902
6457 41902 41602 39303 35627 31703 28403 26848 26752 27451 27151 25194 21390 16620 10991 5800 909 -2745
6440 355 6619 12734 13865 10541 4085 1157 7889 13919 15163 12435 6252 -1553 -645 6329 12740
6425 12740 18807 20394 23643 24742 23975 23988 24754 24101 20153 13654 7326 3499 2409 705 -2163 -3694
6409 -3694 -2727 -1205 1659 5193 7519 8467 7680 5523 2883 2116 5016 8816 10785 10057 7272 4972
6393 4972 6144 8859 9904 8902 10439 15724 19957 19872 17269 17763 24004 29629 29370 23235 17188 21414
6377 21414 34348 47301 54356 52048 40817 27756 30195 45562 50309 39011 8587 8017 44854
6364 44854 74258 91964 104637 114079 157273 234296 358509 508954 658196 780673 856941
6353 856941 883721 860827 800288 711168 601366 477326 344630 227226 147450 116535 122762
6342 122762 117864 102844 89598 84913 95611 129104 180165 237819 276675 284150 256840 199449
6330 199449 127729 55563 22672 62779 108549 142207 165914 188431 202111 207808 231467 327928
6318 327928 497695 692702 858080 944419 931858 835077 717066 656522 672113 693559 655342
6307 655342 535360 377458 215715 85068 21377 20629 41110 70629 98246 102598 86731 57786
6295 57786 34631 30783 33443 38688 39493 39306 43041 54156 63289 65475 61591 60009 61713 63235 56397
6280 56397 41124 24486 19232 21441 20583 24520 27915 29635 34436 42961 48648 54091 81391 152715
6266 152715 263096 383638 493675 569747 596078 567679 490058 378509 258908 154246
6256 154246 82505 56785 43911 32819 8337 -3471 14793 21722 19907 13253 9524 11632 12612
6243 12612 9285 2370 -434 10500 19812 24243 22998 17989 9446 -105 -6370 -4481 -1701 -1327 545
6227 2355 5002 6637 7929 4392 110 -2402 1680 2497 -1249 -1145 3480 5351 3420 -974 -1915 3122
6210 7376 11957 17220 21487 23246 22771 21979 22790 24356 23777 19499 13452 10686 12867 15407 15032 15057 21834
6193 21834 34802 49129 61725 70926 75484 75699 71713 63811 52201 36760 18054 276 13965
6180 13965 33707 49551 60239 64912 63079 55369 41897 26064 10743 3101 7333 9405 8802
6167 8802 1439 -1502 7121 18472 24978 24604 15403 -1338 -10279 20422 46796 65349 73419 73515 67274
6152 67274 55047 44625 47635 65117 82981 90007 88704 81337 77958 87803 112388 154277 211506
6139 211506 274329 328010 358644 357522 324913 267438 196346 125372 63693 18675 -9941 1708
6126 12834 18906 17881 13900 7226 2320 -6016 -9496 1653 10457 17770 21522 21840 18750 17239 7866
6110 -2012 -1319 9309 15875 16648 11583 7709 8753 14753 13289 9475 3578 827 -1585 -5636 -6674 -3282
6093 -2137 -4170 -5996 328 1901 -1540 -1056 10047 20274 25563 27090 30107 35631 42958 50708 54729
6078 54729 51967 42865 34614 29894 28441 19787 4853 -2564 3542 4647 9736 24583 40154 59342
6064 59342 86455 111748 119108 98318 52843 16621 41249 45264 22223 42885 79446 78737 35793
6050 55906 117919 126904 65032 83256 196391 228464 134520 183223 446798 577169 368697
6039 368697 480299 1771680 3516217 5402518 7046279 8082985 8272599 7571996 6147131
6030 6147131 4325140 2491220 987468 185629 480711 474760 251375 113048 224426 232541
6020 232541 131479 32230 102723 124368 79087 18212 59161 80945 58682 21766 41945
6009 41945 60005 48524 16012 6124 21544 16277 12297 29572 37959 29654 11887 14233 24518
5996 24518 21199 8084 7650 16156 13734 2548 3087 10536 9222 -76 5754 15033 15659 8720 429 -39 -4114
5979 -4114 -10361 -3710 2325 3472 -1198 -4421 -2357 -1214 -2569 -4108 -431 815 -374 -3831 3176 7177
5963 7177 5281 165 4076 11099 14227 14445 17717 28620 46445 66985 87676 104789 114888 114923
5949 114923 103639 83114 57558 32847 17019 12445 11245 8368 5356 3783 2136 146 67 1196
5935 1196 341 -2277 -790 2440 4040 2414 -495 -1166 -601 -881 -1260 -286 1569 3953 5948 5418 1476
5917 -4402 -7926 -6438 -6331 -7565 -10780 -11063 -10410 -7725 -315 10120 22295 32177 36912 38027 33810
5902 33810 27082 19044 10555 3763 -912 -1881 -1805 -1902 -1169 388 1634 2211 1421 -182 -2024 -3459 -4500
5885 -4500 -1423 1380 3290 4253 4216 3740 2756 1617 1315 2461 3663 4279 2267 -849 -6088 -3119 3564
5867 11466 21438 29463 35192 37591 34338 27366 17402 6932 154 316 2187 3747 4809 3833 1948
5852 1948 -1543 -5248 -5642 -3646 -1933 -285 -2655 -3056 -5242 -6867 -8105 -9346 -8181 -7211 -6326 -4356
5836 -4356 -6014 -6929 -8874 -8998 -11710 -12431 -8730 -4921 -2128 -403 -4178 -5429 -6572 -3790 -591 -4500
5820 -4500 -6907 -4966 -3068 -2279 -3377 -3768 -2430 -1760 -1904 -2142 -2481 -2347 -1411 -48 1480 1423 -287 -3018
5802 -3018 -4054 1965 -10818 -11246 -9991 -10314 -8178 -1109 5252 9872 8886 3094 -5342 -13587 -12201
5787 -12201 -6934 5758 2811 2203 -1617 -3615 89 2761 2289 1304 -962 -1484 1531 7757 11940 18146
5771 18146 23625 28408 30817 30868 29299 25724 21215 16396 12194 6956 2665 906 2079 6415 10057
5756 10057 11702 11393 10122 9642 10643 12915 14460 14956 12105 6529 -1316 -8032 -3408 1243 3401
5741 3401 3283 1643 36 -1114 -1293 -2264 -4522 -7452 -4101 -359 6478 11002 13057 13477 12797 11687 10295
5724 10295 9474 8209 7502 5955 4058 1703 -162 -345 733 2021 1744 581 -529 -274 95 -434 -2026 -2681
5706 -2681 -1629 -1271 -2020 -2958 -3497 -2607 -1949 -2242 -1369 355 1459 1746 2376 2429 2698 2285 252 -1252 -1576
5687 -1576 -2022 -3983 -3974 -921 2522 3976 2326 657 3924 11661 19528 24691 27200 26190 24349 20268
5671 20268 13043 5541 -1143 -2717 -126 1470 1586 686 1413 3064 5742 7923 7831 5878 2066 -1663
5654 -1335 1524 3587 4244 3067 1942 1586 2484 2941 2590 658 -2206 -1506 3306 8200 10940 9889 6487
5637 6487 3219 4506 7386 9066 9012 8621 8112 6757 3600 -490 -165 1993 2034 683 772 3040 5630 7278
5619 7278 7310 5546 1198 -2513 3596 9522 13321 14055 11897 8603 7336 8626 9432 6971 1971 -2457
5602 3616 9218 11558 11350 9557 8435 9899 12486 13966 11989 7116 188 -357 5441 9844 12647 13792
5586 13792 13065 10229 6296 6123 9431 13334 16418 19557 21798 20263 14545 7341 6827 12274 15171
5571 15171 15480 16301 18799 18767 12567 729 4212 17427 25598 29070 27408 24138 20961 18846 16792 14674
5555 14674 14123 13112 9736 9469 14978 22784 26381 25184 19021 11390 13406 26236 38681 46179 44428
5540 44428 48238 47468 49958 57020 62443 69121 77484 93000 106895 114315 113921 111152 114179 121276 119208
5525 119208 102590 73024 39371 18624 34171 67464 90743 116762 138215 154583 165134 168217
5513 168217 154171 129953 114359 128054 169451 205856 223368 217697 226959 252291 294902 339863
5501 339863 333699 347389 389010 484875 591693 703037 837712 1010120 1234560 1588035 2171208
5490 2171208 3036894 4118655 5248179 6214208 6803582 6858371 6310620 5201193 3665913
5481 3665913 1918085 211902 1257862 2311080 2886395 3007705 2783818 2365660 1901183
5472 1901183 1493190 1178018 940844 759132 624876 531756 463107 407151 360753 314812
5462 314812 278466 250003 225071 199765 177561 160207 147225 137486 128602 119087 113309 110578 105479
5449 105479 96361 82857 72306 70015 70910 70873 68872 66705 65663 64833 62302 56750 49266 42820 42377
5434 42377 48901 53329 53834 52112 55022 60781 64086 60238 55230 56911 67544 75758 74042 62535
5420 62535 47569 36887 31519 30016 28645 28049 28075 29013 30002 29985 28201 25540 23103 20284 15251 13267
5404 13267 22158 34853 42080 41899 33740 22844 13147 6605 1996 10031 23397 33089 35893 32058
5390 32058 25114 22859 24725 24146 18529 9763 4768 6812 6761 914 -774 10061 19088 23588 23142 19062
5374 19062 10463 204 1468 9165 13769 14549 12552 8804 4647 1947 3426 5782 5700 3292 1661 4627
5358 4627 7496 9096 9211 9288 10393 10945 9084 5819 5757 9617 12009 10769 9273 11423 14001 12439
5342 12439 6675 15896 37790 60666 79040 90950 96055 94116 84132 66255 42753 20634 9412
5328 11482 11278 6488 4064 7145 9121 8262 7673 9467 11044 11294 9350 6206 4113 5428 7611 8151
5312 8151 8856 13381 18686 20329 15623 5518 912 9935 15855 14830 8427 -667 -1248 1043 -506 -1582
5296 -1582 4636 11959 17027 17825 14467 8217 6915 14165 23059 30542 34903 36198 33702 31042 31954
5281 31954 35285 34185 27858 23395 23932 31016 39459 46805 54263 61356 67970 71957 69852 58886 46360
5266 46360 40736 42534 36869 17732 22912 64189 100621 119999 121984 117049 121181 137815 156202
5253 156202 162617 147919 118301 126095 195511 262592 289907 352787 615064 1064390 1592379
5242 1592379 2083690 2424234 2534460 2387500 2017223 1509667 981752 559625 352574 319390
5232 319390 286959 213169 150990 137418 132354 105882 74365 67456 71169 63044 49912 50247 55477
5219 55477 50643 32899 17386 13254 14205 26531 48758 64417 62661 44348 21989 16217 24797
5206 24797 35732 51665 63059 58913 40352 35889 59305 72831 62902 51886 71401 89503
5194 89503 90121 109794 166853 223518 225446 226694 398727 715238 1064445 1357320 1530175 1554024
5182 1554024 1438165 1241759 1103262 1203062 1530367 1895705 2138703 2177556 2009447 1727852
5172 1727852 1475031 1346703 1288284 1173408 944808 639349 358678 239543 262804 249701
5162 249701 179680 123650 122900 131245 100698 66882 83867 112938 114705 89994 65577 48698
5150 48698 51141 58771 60665 56371 50151 59986 80180 95214 96839 92563 97141 113645 132433 153386
5136 153386 196003 275027 384699 508561 628566 729402 798824 826984 809313 747143 648768
5125 648768 527945 401189 286599 201147 155221 132260 106254 67297 7512 7552 48625 59626
5113 59626 59228 50626 39167 36909 34218 30829 25597 15166 670 2473 17513 26839 29170 26358
5099 26358 23439 22096 21619 20018 18642 16334 12000 4979 -4249 3528 10464 14205 14483 12225 8503
5084 8503 5005 3859 5247 7348 8452 8560 7897 6534 4234 1318 1293 4696 8207 10585 10431 7684
5068 7684 4705 3784 5096 5216 3784 4436 7571 9473 8377 4453 176 2205 7384 12827 18199 23382
5052 23382 28267 32953 38801 46156 54036 60687 63713 62423 56702 47185 36022 25907 21452 23753
5038 23753 28177 34972 47417 66866 90418 113003 129421 136128 130709 114281 89676 62863 39839
5025 39839 25722 20116 16242 12202 8255 6256 4604 2655 2300 4164 5378 5356 4738 4425 4019 3415
5009 3415 3303 3584 3450 1856 -463 -2036 -510 1403 2338 1964 306 -1159 738 3411 4201 2607 -1127
4991 -1858 1790 4111 3835 1336 -2180 -2389 -326 562 -44 -2168 -5176 -3148 -761 741 902 -314 -1960
4974 -1960 -3076 -764 1215 2100 1942 927 -30 -887 -1790 -2819 -2397 -1641 -1654 -2331 -1893 -841 -307 -1035 -2636
4955 -2636 -2055 -73 1222 1736 911 -859 -3085 -2374 -711 152 -31 -270 -320 -574 -1302 -829 426 721 106 -1299
4934 -1857 -1900 -2666 -1567 885 2995 4094 3359 1575 -771 -2896 -1922 -1099 -704 -1175 -2264 -1871 -881 -319
4915 191 1378 3111 4428 4903 4389 3813 3530 3688 4035 4021 3110 1663 46 518 1984 2842 2516 1220 -734
4895 -3060 -1959 -892 -354 278 1352 1980 1623 337 -1580 -1978 -1046 -1035 -2097 -2900 -1823 -1909 -2469 -1076
4876 92 467 -58 -583 -701 -953 -1709 -1452 -664 -1245 -2486 -3484 -2198 -1478 -1729 -2475 -1743 -1003 -1083 -1122 -140 762
4854 973 607 -15 -475 -1035 -1818 -2341 -1262 -370 444 1048 940 30 -634 -56 675 459 -764 -1632 -601 56 -340
4832 -1339 -2959 -2754 -1537 -697 -72 -664 -2074 -2596 -1417 -914 -1303 -1726 -1636 -1356 -573 775 1745 1770 488
4812 -1705 -2956 -1671 -968 -1148 -1398 -1053 -422 -164 -364 -1301 -1957 -572 1422 2728 2928 2302 1045 -114
4793 -580 -330 -95 -134 -298 -245 -439 -1645 -2494 921 3836 5333 4814 2301 -746 -3414 -1370 -699 -1336 -2494
4774 -2494 -3139 -2701 -2890 -3379 -3326 -2015 -859 -432 -956 -2064 -1408 108 78 -535 -269 605 625 -665 -1941 -151
4753 695 -5 -1096 -349 845 770 -354 -1652 -2122 -3334 -2947 -1317 -123 -62 -1149 -2612 -1669 -258 865 1789
4734 1789 2053 1655 829 321 190 -385 -1525 -1483 -900 -740 -522 204 673 719 27 -276 -205 -507 -285 1338
4713 2708 2444 1202 1238 2143 1815 -366 -2585 -24 1061 2 -2988 -181 2187 2443 988 -1195 -2691 -3304 -2385
4694 -2385 -703 528 592 -167 -599 -705 -1556 -1959 35 1835 2348 1909 1223 871 -222 -1812 -1384 -544 -1024 -77
4673 1605 1987 894 -1036 125 1760 1030 -1759 -1014 1754 2495 865 -2269 -232 1664 1942 1847 1896 1244
4655 1244 -588 -3363 -665 82 -1465 -1455 1126 2144 1069 -1148 -153 984 62 -1988 -1025 -393 -1632 -1223
4637 -1223 1771 3279 1952 -914 1219 2899 1651 -1100 890 3478 3699 2539 3053 4162 2757 -1265
4620 -753 2394 2069 -953 749 4944 6862 5419 2633 938 -79 -1397 1557 4535 5105 3767 3932 5490
4603 5490 4548 140 -351 4504 5707 3519 2771 5737 6570 2911 -641 5439 7997 5658 2602 6416
4587 6416 10385 9764 6691 9801 17977 27496 39966 55748 72050 84714 90191 87097 75280 57534
4573 57534 39130 25675 18678 12125 4676 6400 11998 11353 5141 5395 11102 11062 5913 7613 13872
4558 13872 13987 6492 3504 11598 13275 6428 1212 9506 11765 5901 4463 13607 15540 7081 1902
4542 15309 19811 12721 4998 16249 21964 15837 6220 16455 22500 15595 4995 20064 29184 23194
4528 23194 9498 19562 30539 24431 2689 17596 33563 30063 15105 25201 40595 36099 12799
4514 18751 40071 37204 12991 26890 53202 52401 23203 28221 60653 61853 28513 32904 75647
4501 75647 82000 44376 34657 88257 102850 62056 33647 102245 126527 79706 39089 129303
4489 129303 167811 116094 59234 172280 231455 168999 72899 238393 344757 272423 105026
4477 341170 535282 462636 200724 567395 975490 977141 639869 1154892 2016428 2009978 290942
4465 3723176 9856107 17339829 24819514 30725602 33721069 33099041 29011719 22413245
4457 22413245 14770934 7631829 2186202 1022696 2103358 1726419 847613 764698 1040336
4448 1040336 865994 385310 275113 525476 494714 244356 148227 317071 320056 168159
4438 168159 83892 211455 229837 132918 46461 141964 165714 103830 40595 106380 128482
4427 128482 83889 22466 73780 97804 66995 23555 66008 88547 66136 20816 40413 61461
4415 61461 46118 11190 38870 58795 47561 17758 30342 49567 41789 13942 20869 40391
4403 40391 36557 13724 14994 33016 32150 15493 13550 27530 27596 12315 7824 22447 23779 12052
4389 12052 8589 20358 21053 9044 7051 20628 23306 14549 3627 13546 17900 11494 1502 9891
4375 9891 12753 6327 5076 15665 19239 12615 2976 10821 16170 12512 3661 6765 12439 10309 3608
4359 6977 12051 10108 2998 8344 14439 13410 6063 5846 13364 14924 9727 7268 20256 36514 51494
4344 51494 64731 75816 83577 85464 79680 65677 45620 24641 11303 11480 11411 6760 5067 9252
4330 9252 9985 5742 2168 5697 7123 4356 2770 6115 7515 4940 -671 -980 1353 338 10 3057
4314 3057 3683 1177 -910 2575 4278 2090 -2488 1954 5085 4138 -152 133 3076 2714 -731 587 3390
4297 3390 3450 2183 4048 6324 6091 3311 -533 -925 -172 -579 1068 3112 3239 1020 -1337 103 578
4280 578 -252 1236 3533 4491 3913 2951 2604 1521 -1148 232 3202 3942 2187 25 1466 2347 909 -1978
4261 903 2265 1190 -1604 -912 1435 2169 1436 280 -555 207 2442 4928 6044 5224 2744 -443 -287
4244 -287 1122 1576 1396 584 -889 -625 2052 3995 4228 2943 939 -529 164 2051 3977 4698 3604 1008
4225 -1329 855 1916 939 -1132 -1243 -55 -154 -1019 -1800 -2288 -2791 -1479 -526 -518 -180 1400 2320 1838 -36 -944
4205 -944 1200 2764 2545 803 -1673 -1013 -185 -228 -335 -468 -1002 -1532 -589 195 -9 -854 -506 371 525 -235
4184 -1475 -1014 -350 -432 -1009 -1182 -106 1586 3377 3886 3316 1648 132 -919 -942 -100 1054 1872 1957 987
4165 987 -672 -2094 -1685 -1102 -428 69 39 -836 -1914 -963 -262 -322 -736 -1203 -1161 -1362 -1099 -925 -1161 -226 1492
4143 3435 4408 3990 2780 1138 455 886 1684 2688 3007 2676 1705 1378 1250 870 -181 -1287 197 1156
4125 1156 1543 1635 1429 1145 1070 1190 1443 1465 1239 1248 1392 1321 1169 1484 1793 1923 1550 1513 2066 2665 2777 2092
4103 2092 1072 -12 -1179 -1169 -273 197 126 -287 -537 -1075 -2040 -1927 -888 -440 -594 5 1253 2018 1750 778
4082 332 1066 1631 1379 173 -1175 -1351 -598 203 810 1331 1471 1299 652 -564 -1591 -835 76 305 -140 -582
4062 -582 -881 -942 -917 -610 135 1166 2365 3388 3754 3219 1660 -311 -1366 -810 -1020 -1866 -1600 -722 -264
4042 -276 -323 -133 431 1045 1439 1419 601 -533 -1532 -2116 -2642 -2443 -1264 23 1252 1891 2374 2418 2201 1891 1859
4021 1859 1699 1078 -490 -1591 -746 598 1317 1415 1130 864 633 365 16 -116 16 213 324 222 -540 -1774
4001 -1774 -2946 -3852 -3608 -3286 -3298 -2227 -877 220 1194 1962 2768 3287 3453 2988 2092 525 -1295 -360 428
3981 617 394 -165 -619 -1048 -1121 -656 37 833 1798 2869 3834 4835 5560 5739 5606 5258 4752 3975 2960 2257
3961 2257 1693 847 -509 -2064 -1731 -1077 -1365 -2450 -1301 -194 262 -152 -1174 -2373 -1907 -908 -894 -1491
3943 -1491 -1997 -2097 -2192 -1523 -744 -90 433 335 -107 -465 -938 -1110 -1417 -1966 -1749 -618 -39 -378 -680 -910 -1045
3922 -1045 -975 -769 -967 -1370 -1417 -932 -492 -327 -131 167 231 -26 -818 -1085 -946 -803 -1302 -1927 -293 1428 2308
3901 2308 2333 1712 1106 779 638 515 775 894 805 202 -375 -610 12 929 1535 1941 1975 1728 1410 1130 876
3880 876 632 409 307 438 678 782 376 -223 -387 -191 -214 -988 -1658 -284 909 1573 1553 1292 1178 1190 1212
3859 1212 1007 596 -140 -968 -1444 -1526 -1947 -2336 -1933 -1571 -1203 -895 -899 -904 -593 -115 587 1543 2263 2340 1957 1479
3837 1479 827 115 -724 -1373 -1892 -2289 -2375 -1646 -1222 -1276 -1791 -1929 -1796 -1886 -2050 -1961 -1841 -1778 -1786 -1891 -1447 -1108
3815 -1108 -1020 -1035 -948 -502 264 714 844 403 -192 -692 -888 -942 -709 -538 -383 -303 -603 -1077 -1734 -1545 -1487 -1486
3793 -1486 -1339 -908 -352 249 721 944 864 542 347 339 338 56 -469 -1038 -1100 -469 332 663 183 -180 146 184
3771 184 -282 -1722 -1920 -277 1107 1601 1227 576 -45 -544 -869 -1237 -1323 -1206 -1405 -2022 -1697 -74 1446 2371
3751 2371 2525 2003 1829 1820 1696 1298 756 307 97 154 212 38 -794 -1604 -1140 -35 614 634 318 -116 -341 -425 -767
3728 -767 -1463 -1925 -1537 -654 -6 555 587 77 -878 -2024 -2626 -2845 -2441 -1902 -1120 -254 634 1597 2442 2998 3434
3707 3434 3451 3061 2641 2234 2058 1621 1157 714 578 900 1373 1996 2659 3428 4215 4416 3406 1927 359
3687 -947 -1524 -1445 -1750 -1196 -763 -549 -777 -801 -233 555 1030 1037 348 -789 -412 665 1412 1731 1485 827 61 -590
3664 -801 -154 -2 395 620 683 417 -119 -817 -1435 -1698 -1854 -1694 -1245 -513 166 524 471 568 334 205 19 -266
3641 -630 -1252 -1781 -1885 -1280 -284 785 1628 1782 1373 536 77 549 1260 1314 942 423 254 584 1001 1377 1473
3620 1473 1462 1308 1073 828 776 917 948 921 963 842 661 291 -177 -681 -1314 -1927 -1188 -160 873 1966 3210
3599 3210 3928 4160 3633 2273 1152 22 -675 -1091 -1132 -762 -479 -562 -620 -841 -1124 -1101 -738 -253 74 265 328
3578 328 302 219 248 482 600 960 1457 2102 2825 3419 3780 3495 2712 1767 758 -196 -642 -708 -470 40 728 735
3556 735 363 -393 -1208 -1741 -2175 -2117 -1983 -1720 -1282 -849 -447 -394 -722 -1355 -1933 -2565 -2844 -2396 -1853 -1403 -923
3535 -923 -633 -387 -384 -564 -758 -1096 -928 -645 -558 -510 -513 -469 -311 -86 -98 -487 -1186 -520 604 1732 2601 2742 2107
3512 2107 958 42 -917 -1202 -816 -331 -71 -257 -957 -2009 -2228 -1702 -1726 -2169 -2229 -962 382 1656 2150 1967
3492 1967 1454 193 -1339 -1790 -542 320 861 1029 802 357 237 793 1859 2605 2465 1953 1299 373 -675
3472 -1694 -1395 -612 -64 14 -237 -477 -704 -1123 -1629 -1923 -1964 -2064 -2220 -1800 -893 -48 577 948 924 748 584
3451 584 512 425 218 -91 -431 -419 -330 -442 -764 -1032 -835 -561 -288 -138 -84 -72 -48 -11 11 35 -141 -278 -328 -569
3427 -569 -859 -1097 -1178 -1186 -1294 -1480 -1705 -1663 -1296 -1304 -1394 -1089 -489 -80 -53 -160 -392 -297 128 766 1173 1361 1173
3404 1173 706 -25 -927 -1609 -2079 -1851 -1470 -1113 -725 -279 -97 -120 -219 -345 -227 -4 294 561 842 621 -75 -983
3382 -983 -1760 -1877 -1697 -1496 -1683 -1936 -2096 -1875 -1551 -1333 -712 -211 -241 -446 -755 -1097 -1213 -829 -636 -725 -843
3361 -843 -846 -859 -965 -1257 -1770 -2157 -1669 -1028 -332 -197 -364 -548 -226 209 478 158 -677 -1421 -958 266 1398
3340 1398 2334 2984 2736 2116 1985 2052 1790 1280 774 242 -69 71 620 1057 1237 1129 908 441 13 -542 -1110
3319 -1110 -1158 -1057 -640 -199 126 -35 -901 -1681 -307 698 1126 889 187 -501 25 1427 2781 3580 3789 3519
3299 3519 2894 2123 1538 1172 885 704 568 345 -231 -513 -245 759 1797 2709 3173 3393 3268 3026 2572
3280 2572 1999 1479 939 573 420 -48 -1019 -1907 -2511 -2668 -2122 -1556 -1010 -763 -342 141 693 1047 959 613
3260 613 -4 -782 -1608 -1876 -1140 -127 609 1192 1824 2455 3039 3474 3510 3117 2284 1210 181 -790 -805 -474 -198
3238 -310 -630 -1015 -1241 -962 -438 522 1475 2143 2248 1904 1343 777 368 1 -341 -996 -1761 -1146 102 622 900
3217 900 900 762 413 -73 -547 -632 -440 -39 118 78 151 264 445 436 598 508 596 246 3 -67 -276 -519 -667 -512 -116
3191 268 422 395 259 99 -5 -447 -1012 -1178 -992 -920 -571 -108 307 579 746 658 795 920 1099 1171 1057 580
3169 580 -105 -1031 -1431 -465 529 970 832 153 -294 162 836 1720 2011 2034 2268 2716 3065 3067 2493 1498 397
3147 -673 -1240 -1320 -1174 -1393 -1988 -1178 -152 330 747 457 -446 -1741 -2444 -1204 65 886 1073 594 -448 -1506
3127 -1506 -1006 -584 -728 -1627 -2795 -2748 -1216 161 1206 1574 1309 521 107 768 1568 1800 1348 126 -1652
3107 -2334 -974 139 494 724 530 197 -6 63 404 420 9 -681 -1464 -1259 -364 698 1442 1911 2228 2498 2823 2676
3085 2676 1836 302 -1297 -2162 -1400 -649 -408 -561 -638 -392 -216 -532 -589 -647 -548 -374 -119 210 530 787 837
3064 837 672 838 997 856 431 -144 -846 -1358 -1262 -1023 -867 -649 -436 -338 -152 294 966 1539 1860 1600 863
3043 863 -38 -625 -1238 -1919 -1367 -838 -501 -316 -312 -455 -248 307 821 1057 1165 993 673 445 40 -314 -614
3022 -614 -718 -686 -578 -416 -52 421 1058 1743 2232 2321 1878 873 -290 -1411 -1910 -1888 -1460 -1515 -1878 -1209 -495
3000 127 405 279 28 -617 -1803 -3011 -1825 -211 631 894 572 -334 -1816 -2494 -1026 -11 403 220 -436
2980 -1431 -2095 -1016 -168 162 2 -686 -1443 -1266 -231 947 1904 2645 2895 2669 2036 1180 33 -873 -1158 -752
2960 -752 -263 237 877 1523 2279 2905 2759 2037 629 -824 -639 85 665 1110 665 -562 -1566 -919 162 554
2940 554 629 478 168 103 768 1787 2204 2122 1386 454 -607 -1335 -1724 -1706 -1382 -1071 -753 -558 -489 -355 -199
2919 -199 -237 -483 -770 -1097 -1211 -942 -447 -8 217 237 -114 -913 -2047 -2006 -618 662 1381 1435 385 -1453 -1802
2898 -1802 88 2302 4029 5093 5381 4978 3908 2716 1394 402 -421 -1325 -1533 -818 598 2162 3484
2881 3484 4232 4123 3512 2474 1210 263 -228 -293 -110 280 624 638 275 -569 -1490 -2119 -1904 -1290 -886 -720
2861 -720 -755 -767 -646 -259 294 949 1498 1710 1714 1559 1581 1586 1823 1829 1604 1351 1616 2307 2980 3455 2972 2070 1366
2838 1366 1433 1665 1731 1679 1614 1373 794 53 -708 -1585 -2153 -2042 -1861 -1845 -2067 -1721 -1192 -587 -180 -84 -102 -109 60
2814 314 566 959 1491 2050 2226 1621 559 -857 -2336 -2134 -844 179 669 575 131 -145 -2 502 1100 1366 1196
2793 1196 862 350 -228 -994 -1569 -1408 -950 -577 -539 -840 -1311 -1508 -1186 -1016 -1235 -1794 -1943 -926 169 1292
2773 1292 2189 2546 2542 2015 1631 1589 2217 3152 3995 4364 3973 2933 1795 753 -138 -640 -595 15 801 1576 2121
2752 2121 2399 2312 1871 1109 347 161 527 1328 2072 2808 3287 3954 4526 4754 4215 2879 1189 -406 -1966
2733 -1966 -2516 -2101 -1874 -2078 -1989 -932 270 1042 1291 1248 831 348 -80 -235 -394 -767 -1239 -1542 -2029 -2620 -2271
2712 -2271 -1829 -1622 -1680 -1484 -835 205 1109 1576 1603 1541 1303 948 574 219 -390 -835 -1037 -725 -416 -214 -308
2691 -308 -567 -893 -671 -250 209 488 558 402 -32 -605 -1146 -1433 -1638 -1804 -2113 -2971 -3442 -2810 -2000 -1216 -669
2670 -669 -397 -168 165 618 1376 1980 2339 2315 1771 916 221 309 720 940 533 -349 -926 -524 -16 177 7 -390
2647 -670 -843 -1027 -1326 -1298 -949 -786 -609 -490 -297 28 419 1082 1844 2334 2411 1706 271 -1502 -1768 -288 776
2625 815 224 -640 -1076 -519 654 2347 3632 3712 3258 1897 308 -927 -626 109 734 826 516 38 -393 -706
2605 -706 -943 -905 -929 -1047 -1347 -1402 -1007 -418 401 1295 1612 1554 973 626 459 244 183 378 764 1122 1220 911
2583 911 245 -678 -432 535 933 632 -64 -640 -447 543 1497 2024 2117 1825 958 48 -392 -43 184 281 11 -400
2560 -791 -994 -1158 -1029 -1127 -1346 -1689 -1612 -1269 -945 -765 -958 -1125 -1063 -884 -971 -941 -325 694 1562 1960 1909 1229
2538 1229 371 -952 -2250 -697 434 1097 1257 1103 672 197 -229 -687 -860 -525 -45 559 1083 1555 2011 2366
2518 2366 2621 2565 2263 1994 1672 1415 1122 891 743 1065 1049 564 -347 -1750 -1754 -745 66 647 909 700 248
2496 -494 -1318 -2164 -1243 -185 596 1164 1465 1643 1613 1289 844 316 -247 -859 -1400 -969 -234 442 839 1184
2476 1184 1609 2209 2439 2173 1550 848 431 587 829 1020 1016 932 942 1113 860 165 -1018 -1340 -123 727 1089
2455 1089 880 233 -517 -1010 -558 481 1571 2464 3033 3047 2595 1964 1571 1280 772 35 -398 -689 -783 -952
2435 -952 -948 -328 456 1470 2405 3206 3486 3202 2913 2562 1979 1481 1010 228 -710 -1710 -1350 -165 721 1202
2415 1202 1292 1527 2048 2637 3187 3290 3041 2488 1720 725 -177 -1003 -1450 -1639 -2003 -1872 -1171 -565 -30 217
2394 121 -281 -1182 -1240 120 1293 2052 2420 2281 1975 1383 943 677 537 340 173 -176 -302 -311 -175 269 689
2373 689 957 1187 1326 1561 1785 1857 1649 1464 1531 1654 1793 1734 1489 813 -175 -1081 -673 -220 -3 405 856 1222
2351 1222 1043 494 -257 -848 -653 -156 -50 -173 -721 -1183 -1511 -1119 -673 -171 395 979 1213 1164 630 -206
2330 -1055 -1384 -1672 -1878 -1333 -613 23 131 -106 -809 -1203 -1039 -414 14 151 -108 -665 -1473 -1861 -1062 -523
2309 -319 -488 -869 -1516 -2332 -2735 -2371 -1761 -874 -266 -50 35 125 155 271 219 -293 -1032 -1528 -518 502 951 848
2287 848 627 281 121 -145 -448 -703 -1082 -1553 -1790 -1135 1 827 1213 1278 1310 943 163 -739 -752 31 492 546
2265 546 -213 -1114 -2004 -1268 -196 348 497 92 -514 -1402 -1900 -1784 -1513 -1184 -827 -548 -529 -705 -1083 -465 481
2243 1079 1317 1240 1131 1034 977 868 641 249 -442 -1269 -1706 -1481 -1477 -1570 -1470 -1086 -568 -271 -124 -11 127 217
2221 217 220 121 -103 -428 -712 -936 -1188 -1393 -1696 -1512 -1243 -982 -1094 -1237 -1508 -1882 -1710 -1562 -1389 -814 -70
2199 512 547 182 -403 -1175 -1773 -1013 -502 -346 -585 -874 -1058 -1224 -1368 -1400 -1311 -1028 -629 -374 -288 -385 -737 -1314
2177 -1314 -1938 -2304 -1484 -1008 -872 -683 -243 18 256 245 308 413 254 -25 -574 -978 -765 -86 520 700 590
2156 590 273 0 -157 -271 -428 -509 -359 71 589 966 816 468 76 212 600 866 913 885 980 1172 1110 541 -540
2132 -1103 -188 697 1236 1131 714 -30 -842 -1462 -1377 -1671 -2247 -2518 -2435 -2177 -1757 -1382 -922 -787 -680 -603 -531
2111 -531 -651 -1249 -2349 -2229 -710 1033 2535 2972 2618 1390 238 87 703 1032 965 494 -417 -1254 -400
2091 447 1144 1525 1596 1385 1108 936 784 593 478 471 356 352 560 720 758 612 373 364 384 375 344 325 185 -77 -213
2066 -213 -524 -991 -562 361 741 818 428 -134 -588 -1082 -1361 -1300 -1290 -704 27 757 1714 2422 2570 2052 1113
2045 1113 559 267 74 283 634 608 77 -851 -1733 -1535 -812 79 700 789 505 111 -172 -393 -649 -764 -627
2024 -627 -248 37 6 -417 -813 -848 -268 279 407 134 -646 -1843 -1238 145 1047 1077 472 -491 -1592 -2662 -3036
2003 -3036 -3132 -2681 -2058 -1380 -733 -324 -108 -17 178 171 -25 -531 -997 -183 918 1522 1462 756 -382 -1051 -967 -1256
1981 -1256 -2065 -1987 -1000 42 663 744 553 636 1341 2204 2649 2401 2028 1721 1366 1145 1029 965 903 795 791 609
1959 609 697 946 1171 943 132 -987 -1151 -666 -502 -606 -642 -14 653 905 708 -43 -890 -1544 -1678 -1264 -389
1937 385 1008 1388 1338 1134 1031 1307 1931 2867 3840 4395 4821 4319 3484 2202 621 -558 -465 314 557 199
1916 -314 -998 -1459 -1702 -1459 -1082 -623 34 773 1304 1482 967 625 322 51 -313 -856 -1382 -1945 -2000 -1527 -930
1895 -930 -608 -568 -853 -1367 -1911 -1380 -471 583 1379 1784 1853 1525 1127 906 775 682 772 751 774 817 660 424
1873 424 362 366 184 -270 -866 -1385 -651 597 1667 2381 2769 2634 2157 1608 1037 356 -367 -931 -1009 -404 107
1851 421 478 506 537 705 782 719 348 -316 -957 -1423 -1346 -989 -641 -371 -268 -154 -3 -106 -576 -1093 -708 -97 510
1827 903 814 290 -185 -425 -477 -402 -356 -532 -1049 -1578 -1834 -1454 -1459 -1713 -1999 -2046 -2058 -1716 -1308 -822 -514 -271 -214
1804 -214 -571 -1227 -1732 -2488 -1704 -1112 -816 -846 -793 -885 -966 -1022 -1030 -1094 -935 -517 -31 309 413 133 -250 -606 -701
1781 -701 -464 105 777 1347 1435 1091 400 -479 -1270 -1221 -841 -370 221 431 519 614 490 141 -453 -650 -208
1759 374 797 814 437 149 93 419 504 206 -214 -210 318 939 1123 827 193 -448 -739 -640 -442 -523 -881 -1487
1737 -1487 -1506 -896 -353 -126 -296 -709 -1203 -1595 -1752 -1615 -1029 -277 370 969 1071 904 575 329 228 356
1717 356 395 52 -211 -854 -1525 -1442 -945 -231 760 1381 1629 1439 1139 1004 1209 1565 1745 1898 1699 1343 829
1696 829 -57 -940 -1658 -1540 -1448 -1715 -1207 -102 755 1198 1122 680 153 -744 -1466 -1543 -1161 -826 -714 -859 -1004
1675 -1004 -941 -897 -917 -1131 -1357 -1367 -1412 -1560 -1371 -1114 -1069 -1128 -1144 -1091 -1040 -1154 -1360 -1315 -962 -743 -495 -412 -199 89
1650 279 419 398 430 394 730 1104 1282 1097 1048 713 536 705 872 1137 1142 980 724 159 -610 -1249 -806 85
1627 952 1308 1451 1279 916 479 -146 -679 -1085 -1063 -755 -485 -578 -1009 -1672 -2005 -1287 -614 -421 -533 -641 -586
1606 -586 -458 -259 -186 -244 -144 134 439 905 1667 2179 2539 2471 1924 1199 203 -552 -849 -922 -652 -186 428
1584 695 726 637 516 683 1111 1413 1390 1106 939 688 245 -412 -1357 -1475 -560 159 692 795 748 370 -275
1562 -790 -923 -1102 -1436 -1930 -2471 -2318 -1468 -766 -347 -21 -177 -120 104 235 220 274 -212 -862 -706 391 1355
1541 1355 2075 2384 2265 1625 521 -905 -1331 314 1460 2017 1934 1886 1907 2089 2452 2579 2343 1713 793 -256
1520 -764 -504 102 506 654 586 275 -82 -713 -1269 -1448 -1351 -1084 -745 -461 -357 -460 -965 -1577 -2115 -2165 -2055
1499 -2055 -1645 -1059 -331 28 -85 -1058 -1897 -313 1319 2358 3008 3450 4017 4192 4274 3889 3076 2039 1215 755
1479 755 501 438 273 -52 -424 -788 -1115 -1424 -1626 -1747 -1738 -1730 -1536 -974 -325 322 672 604 253 -74 305 987 1528
1456 1528 1570 1138 381 -474 -1020 -1114 -839 -616 -571 -800 -1207 -1524 -1243 -881 -782 -1167 -1422 -1651 -1648 -1373 -708 288
1433 1094 1474 1603 1304 766 55 -382 -593 -322 262 966 1288 1572 1484 1442 1055 564 -241 -818 -1029 -787 -551
1412 -551 -588 -989 -1419 -1579 -1569 -871 -124 597 950 864 226 -769 -1647 -1528 -997 -603 -520 -628 -645 -841 -1275 -2148
1390 -2148 -2116 -1907 -1710 -1423 -1076 -805 -286 -169 338 1134 2203 3065 3563 3505 2984 2146 1284 200 -376 15
1369 864 1844 2517 2809 2646 2034 1463 940 695 661 584 347 -200 -840 -1112 -1081 -1049 -1208 -1158 -872 -646 -542 -557
1347 -557 -149 292 650 851 707 282 -441 -1045 -1086 -546 10 660 1150 1226 793 53 -662 -975 -1090 -1415 -1955
1326 -1955 -2558 -1906 -1057 -565 -396 -383 -241 -86 -114 -439 -1101 -1849 -1203 -299 415 640 459 -54 -763 -1729 -1581
1305 -1581 32 1357 2808 3638 4061 3929 3193 1861 497 -442 -394 191 542 675 682 366 65 -199 -478 -810
1285 -810 -1066 -1154 -1265 -1423 -1718 -1404 -844 -449 -7 278 442 571 338 -19 -577 -933 -1209 -1286 -994 -539 -38 202
1262 195 49 4 64 37 -107 -217 -313 -292 -366 -304 -291 -338 -309 -269 -453 -546 -616 -540 -244 138 215 -84 -563 -736 -893 -859
1236 -859 -1075 -1529 -2295 -1055 310 1566 2534 2760 2108 668 -885 -227 1701 3590 4471 4191 3060 1339
1217 -637 -2205 -1090 -441 -214 -155 -252 129 946 2056 2998 3567 3832 3587 2959 2218 1385 673 133 -190 -269
1197 -269 -357 -368 -486 -642 -684 -349 183 709 839 429 -503 -1471 -675 601 1489 1710 1403 931 496 215 -124
1175 -542 -1220 -1797 -2264 -2507 -2543 -2384 -2125 -1809 -1375 -984 -614 -421 -541 -852 -1121 -1099 -1103 -872 -803 -983 -1218 -1659
1153 -1659 -2166 -1872 -1142 -640 -78 387 727 1044 871 533 -272 -1164 -1920 -2079 -1714 -1030 -433 -227 -340 -787
1133 -787 -936 -836 -439 337 983 1441 1909 2049 2036 2150 2325 2342 2071 1744 1114 202 -687 -424 196 624 725
1112 725 392 -248 -837 -1205 -1445 -1763 -2008 -2126 -1771 -1017 -235 469 990 986 592 57 -89 24 101 -21 -278 -480
1090 -480 -554 -280 -6 192 -171 -598 -966 -859 -276 450 1225 1939 2098 1588 654 -693 -2219 -1658 -305 662 1226
1069 1226 1610 1540 1032 232 -596 -1207 -1181 -822 -647 -599 -732 -1169 -1339 -1318 -1203 -1192 -1436 -1745 -1955 -1943 -1792 -1698
1047 -1698 -1260 -1057 -786 -908 -1479 -2278 -3037 -2930 -2648 -1689 -556 412 542 225 -458 -803 -1013 -952 -1199 -1333
1027 -1333 -1229 -1126 -842 56 714 1276 1680 1859 1828 1531 1219 1041 1059 925 741 433 129 276 559 760 587
1006 587 81 -508 -637 -133 276 388 263 236 511 670 433 -172 -838 -1031 -626 -472 -646 -1135 -2135 -1695
986 -1695 -877 -385 -14 459 484 726 772 937 1066 845 133 -924 -1584 -1767 -1466 -406 569 1557 2238 2636 2721
965 2721 2720 2481 2103 1335 154 -663 -928 -813 -696 -636 -894 -1156 -873 -380 103 530 507 29 -784 -1469 -1874 -1986
943 -1986 -1572 -1346 -1387 -1420 -1245 -929 -655 -305 -378 -991 -1612 -1910 -2080 -2433 -2398 -1563 -878 -638 -952 -1108 -421
921 829 2000 2963 3581 3267 2509 1396 478 8 -432 -921 -1466 -1913 -2016 -1712 -1357 -1157 -1205 -1503 -1429 -1042 -780
900 -780 -853 -1244 -1817 -1740 -1275 -771 -714 -1039 -555 228 873 1399 1737 1758 1738 1447 948 311 -225 -628 -892 -896 -586
877 -586 -227 311 885 1132 1008 498 -199 -904 -1306 -527 777 2060 3402 4346 5134 5378 4867 3635 2019
858 2019 648 486 976 1379 1429 1136 542 -140 -382 -46 344 713 757 544 285 266 521 774 968 1117 1247
837 1247 1228 991 568 -292 -806 -638 -60 321 497 456 142 -472 -890 -1068 -1200 -751 -238 274 590 613 539 126
814 -347 -714 -1001 -1400 -1756 -2155 -2006 -1663 -1757 -2204 -2781 -3035 -2962 -2772 -2772 -2661 -2320 -1793 -813 261 1262 2374
793 2374 3023 2752 1884 766 -331 -1082 -1354 -1289 -1281 -1593 -1577 -1151 -704 -360 -249 169 1021 1992 2899 3512 3643
772 3643 3345 2665 1902 993 19 -805 -1372 -1666 -1688 -1696 -1652 -1672 -1490 -1246 -1277 -1636 -1768 -1367 -264 713 1341 1592
750 1592 1457 1216 891 429 -43 -430 -624 -510 -117 328 836 1063 1211 1128 613 -308 -1517 -1215 -216 476
729 681 315 -354 -779 -245 786 1461 1789 1595 994 54 -917 -1549 -1079 -81 932 1888 2448 2769 2796 2533 1943
708 1943 1475 753 -282 -857 -547 27 328 215 -211 -905 -861 -97 426 889 525 -413 -1427 -1730 -1361 -1039 -1103
687 -1103 -1041 -284 245 177 -474 -1447 -1790 -726 539 1467 2016 2126 1375 262 -944 -1145 -388 -104 83 -45 -388
666 -388 -901 -1540 -1414 -774 -332 -451 -984 -2154 -1003 144 1399 2626 2833 2355 1563 443 -627 -1467 -1701
647 -1701 -857 24 630 788 681 395 324 730 1473 2390 2995 3333 3049 2489 1456 261 -959 -1983 -2423 -2195
627 -2195 -1866 -1564 -1216 -954 -983 -1510 -1671 -967 -483 -299 -303 -444 -767 -1045 -908 -539 -191 -200 -573 -833 -489 270
604 656 408 -387 -906 21 1356 2429 2986 2985 2527 2162 1695 1238 1132 752 713 588 -5 -587 -939 -744 -92 646
581 841 961 812 442 -350 -958 -1163 -1077 -887 -711 -636 -544 -307 77 336 299 309 279 104 -220 -257 -544 -945 -1175
558 -1175 -1169 -926 -808 -923 -1179 -1457 -1566 -1749 -2005 -2260 -2310 -2097 -1736 -1658 -1669 -1745 -1759 -1873 -2089 -2452 -3116 -3433
536 -3433 -3405 -2834 -2279 -2543 -2207 -2048 -1905 -1829 -1755 -1628 -1380 -1464 -1805 -1982 -1259 -533 -128 -130 -519 -1021 -911 -1003
514 -1003 -899 -316 447 1262 1900 1799 1169 530 79 -121 -520 -1173 -1763 -2608 -2061 -1357 -965 -708 -514 50 848
493 848 1509 1985 2135 1871 971 -147 -1144 -1496 -1435 -1063 -1092 -1528 -1888 -1592 -1050 -381 146 608 1226 1358 1085
472 1085 686 91 -179 -9 -55 -440 -566 190 1139 1520 1190 126 -1319 -1958 -1171 -684 -581 -613 -426 -31 409 813
450 813 852 496 334 142 68 97 362 571 745 639 311 -176 -571 -937 -1138 -1097 -963 -729 -663 -893 -1276 -1741
428 -1741 -1126 -262 548 1147 1152 1054 471 -656 -1811 -2053 -2212 -2402 -1869 -955 -104 520 908 1024 1313 1279 1358
407 1358 1118 1056 539 -162 -476 -581 -269 22 170 26 -408 -454 458 1164 1527 1532 1360 894 498 188 -65 -579
385 -579 -1420 -616 1374 3673 5687 7083 7545 7171 6055 4450 2797 1782 729 -274 -1374 -1694 -1291
368 -1291 -1258 -1660 -969 228 1471 2130 2248 1541 630 948 2226 3338 3572 2780 1224 -148 -302 273 692
349 692 830 882 1064 1366 1405 1310 1038 426 -21 -395 -525 -92 596 1540 2328 2852 2692 2263 1588 557 -289 -167
327 -167 778 1794 2235 2165 1624 830 -38 -328 96 445 273 -430 -1576 -2107 -756 322 1099 1770 2363 2699 2652
306 2652 2065 1312 387 -155 143 889 1586 1875 1745 1449 1245 1059 788 394 -18 -387 -922 -1745 -1476 -779
286 -779 -556 -778 -1327 -1665 -1802 -2012 -2309 -2272 -1308 -412 92 48 -495 -759 -514 -75 351 476 402 -38 -824 -1002
264 -1002 -243 693 1592 2095 2614 2538 1830 800 -389 -821 -132 608 865 728 -8 -1303 -1728 -749 88 527 759
243 759 865 696 300 -270 -695 -562 -239 -257 -214 115 482 280 -297 -623 -679 -475 -369 -227 -32 83 138 136 -211
219 -454 -1023 -1930 -1859 -585 412 1183 1749 1782 1550 1316 1194 1185 1294 1607 2337 2945 3363 3071 2091 1074 -123
197 -388 652 1926 2742 2700 1738 414 -700 -685 -539 -652 -1002 -1332 -968 -316 614 1469 1823 1894 1429 862 433
176 433 584 684 1204 1584 1928 1970 1737 1627 1800 2190 2147 2092 2116 2187 2221 1978 1441 653 -286 -1167 -1784 -2164
154 -2164 -2372 -2069 -1049 323 1762 2730 3045 2718 1826 1242 1018 1190 1375 1240 759 204 -127 -220 -225 -531
134 -531 -581 -304 -94 -318 -666 -893 -436 54 340 155 -172 -462 -398 -351 -484 -420 -241 43 221 247 116 -126 -345
111 -345 -434 -519 -547 -587 -855 -866 -856 -582 160 999 1574 1456 710 -232 -615 -729 -1059 -1402 -875 -293 294 600
89 600 632 440 175 -274 -179 495 962 893 33 -1312 -566 534 1206 1269 752 -76 -882 -1002 -904 -770 7 889 1580
66 1580 1514 840 186 333 461 291 -409 -1369 -1894 -1698 -1374 -108 1116 2040 2173 1515 568 -7 141 460 944
45 944 1770 2591 3154 3080 2414 1574 1010 1180 1625 1969 2023 1544 763 -258 -1190 -1291 -1150 -1267 -1600 -1473 -959
24 -959 -301 373 768 920 1034 798 474 -194 -736 -625 74 402 83 -554 -1371 -347 757 1016 372 -917 -7 1425
1 2128 1981
0 1981
##PAGE= F1=-0.101556585365
##FIRST=     25.9928259484165, 8223.18227667557, 1184
##DATA TABLE= (F2++(Y..Y)), PROFILE
16383 1184 194 -393 -560 -33 568 798 552 26 -808 -769 1 434 397 114 13 607 1373 1974 2058 1673 966 382
16360 7 -364 -543 -490 -211 185 588 1078 1550 1753 1374 363 -176 377 123 -613 -882 232 1659 2481 2600
16340 2600 1782 584 -102 350 780 714 71 -878 -376 238 311 -130 -678 -701 -142 392 470 159 -340 -908 -1079
16319 -1079 -936 -904 -1221 -384 785 1604 1622 824 -342 79 1014 1273 776 -226 84 1214 1665 1185 79 536 2478
16298 2478 3904 4231 3382 1987 706 47 -53 298 717 818 542 415 717 1129 1122 509 -486 -1285 -942 -651
16278 -651 -1034 -1632 -1154 -501 71 551 772 782 507 197 -29 -443 -1051 -771 -34 315 135 -315 -960 -1372 -1470
16257 -1470 -895 -457 -15 386 644 1096 1328 1526 1387 1042 624 170 236 681 789 334 -375 -738 -39 600
16236 269 -608 -664 453 1156 1004 520 -264 -845 -1636 -2232 -1153 135 810 854 286 -392 -1043 -1310 -1416 -1145
16216 -1145 -662 -460 -579 -1102 -1536 -1814 -1599 -1447 -1563 -1696 -1709 -1539 -1164 -435 396 1165 1692 1856 1447 268
16195 -482 -749 -711 -664 -453 -279 -537 -1075 -1471 -668 176 668 744 921 1188 1797 2289 2353 1801 655 -330 -949
16174 -949 -1234 -1165 -1085 -1039 -869 -623 -392 -124 281 567 497 45 -654 -1245 -1496 -1361 -892 -234 365 502 161
16152 -299 -522 -493 -479 -537 -665 -899 -1030 -1057 -864 -365 -22 257 581 765 625 332 133 247 236 -8 -433 -512 -433
16129 -433 -261 -380 -611 -959 -676 -120 310 455 147 -413 -972 -1202 -1520 -1754 -1184 -410 254 889 1511 1989
16109 1989 1973 1563 743 -377 -1292 -1634 -1217 -795 -860 -1107 -1062 -583 -133 96 32 -469 -1355 -614 434 1383 2036
16088 2036 2690 3058 3092 2720 1843 583 -311 -292 590 978 1042 724 393 795 1144 1466 1684 1422 1113 760
16068 760 377 -39 -434 -750 -494 302 853 919 636 -61 -697 -757 -559 -529 -617 -310 299 608 760 604 347 196
16046 196 -348 -1046 -681 577 1993 2987 3192 2624 1390 -82 -1428 -2043 -1201 -595 -267 -19 203 332 265 -39
16025 -854 -1736 -2140 -1725 -935 -646 -599 -464 -315 -36 308 704 1046 965 785 519 195 -143 -340 -164 382 1250
16004 1250 2084 2432 2305 2001 1287 834 469 330 311 329 285 -41 -563 -804 -256 75 149 -21 -230 -346 -180 228
15981 761 1270 1702 1952 1580 774 -394 -1250 -1920 -1640 -784 -28 406 356 -91 -445 -487 -549 -650 -811 -934 -942 -725
15959 -725 -452 -124 195 355 367 -57 -662 -1180 -1278 -921 -227 385 571 344 121 61 150 472 776 663 511
15938 511 322 517 571 332 -334 -1102 -1166 -764 -105 243 531 608 733 888 1030 801 191 -753 -1832 -2689
15918 -2689 -2691 -2168 -1971 -1612 -1075 -815 -871 -706 -669 -721 -798 -935 -1049 -1396 -1644 -740 535 1264 1325 989 257 -506
15895 -1205 -1442 -1304 -952 -820 -760 -757 -312 144 242 99 152 334 627 769 593 22 -741 -1598 -2115 -1920 -1797 -1667
15873 -1667 -1440 -996 -382 107 335 -144 -909 -1489 -1568 -1090 -431 154 490 477 289 222 243 348 -23 -621 -979
15852 -979 -962 -816 -501 -308 -414 -905 -948 -757 -381 -184 72 582 1170 1729 1823 1467 814 314 350 672 707 156
15829 -878 -1274 -339 1214 2590 3891 4424 4116 3100 1831 982 639 642 757 643 521 -169 -752 -1270 -1466
15810 -1466 -1276 -750 -200 242 700 746 467 78 -534 -892 -773 -297 -155 -374 -1128 -2256 -1675 -1123 -1249 -1548
15790 -1548 -985 379 2079 3813 4766 4871 4012 2860 1596 717 469 547 625 393 -51 -827 -1196 -938 -646
15771 -646 -431 -677 -1144 -1337 -709 -82 234 380 535 477 119 -71 -100 -132 -213 -502 -979 -1492 -1597 -1229 -666 87
15748 986 1983 2405 2099 1132 -127 -1034 -280 1062 2151 3097 3314 2730 1647 553 -69 -572 -1155 -1696 -1432
15729 -1432 -680 -245 -376 -902 -1207 -544 107 544 736 1018 1390 1837 2626 3340 3652 3638 3286 2584 1830 924
15709 924 -72 -914 -1431 -1554 -1232 -823 -458 -307 -68 202 345 64 -502 -815 -413 -278 -546 -939 -1170 -488 495
15687 1373 1938 2443 2343 1815 984 430 321 649 1027 1116 1013 476 -463 -1319 -181 825 1434 1530 1081 398
15666 -472 -1147 -1707 -2027 -1963 -1430 -1079 -972 -774 -572 -340 -160 -183 -566 -942 -1342 -1400 -792 183 1190 1849
15646 1849 2074 1844 1138 369 -208 -548 -535 -406 -446 -676 -893 -1363 -1467 -1195 -685 -404 -264 -471 -705 -815
15626 -815 -889 -877 -770 -324 315 780 824 543 -69 -842 -1857 -2501 -2905 -2962 -2608 -1694 -742 267 1085 1520 1454
15605 1454 895 444 -18 -161 -119 -122 -111 426 1701 2884 3262 2892 1912 1170 115 -1051 -2034 -2486 -1874 -1168
15585 -1168 -775 -828 -1320 -1942 -2522 -2221 -1737 -1263 -829 -357 -54 -30 -180 -434 -345 409 1106 1399 1120 324 -740
15563 -1431 -1145 -615 -177 15 226 631 1102 1426 1336 1003 441 -63 33 713 1364 1531 1444 1089 185 -794 -1705
15542 -1705 -1123 -551 -196 -433 -969 -593 359 1636 2423 2670 2736 2086 1090 59 359 1396 2066 2095 1484 511
15521 -511 -1076 -1000 -823 -687 -312 235 1025 1583 1516 1031 264 82 421 1201 2374 3528 3933 3621 3004 2389
15501 2389 1622 1188 715 399 216 24 -736 -1534 -1625 -1519 -1489 -1610 -1541 -855 -207 425 800 1017 1098 1033 707
15480 707 446 708 1104 1415 1287 735 -35 -503 -451 -291 -511 -1306 -1668 -1217 -487 -140 -280 -842 -1586 -2243
15460 -2243 -1892 -1342 -536 279 858 1054 708 180 -546 -1073 -1428 -1359 -924 -411 -175 -115 -558 -1445 -2103 -1701
15440 -1701 -1372 -1478 -1387 -1749 -1521 -851 -56 406 574 638 722 1064 1355 1482 1050 -49 -1761 -2497 -1636 -45 1039
15418 1562 1603 1038 247 -489 -1042 -1363 -1476 -1410 -1188 -655 250 1249 2193 2935 3370 3384 3044 2387 1598 943
15398 943 234 -330 -647 -950 -1171 -1573 -1646 -1291 -718 -110 250 66 116 35 -132 -522 -994 -1419 -846 -483 -313
15377 -313 -251 -6 127 342 1065 1503 1549 1066 480 -269 -850 -786 -103 681 1223 1495 1316 768 -106 -949 -1357
15356 -1357 -1365 -1115 -755 -406 12 211 454 563 282 -238 -519 -322 307 1110 1583 1746 1498 844 218 -369
15335 -1222 -1837 -1602 -1001 -400 167 640 514 1190 1349 1144 673 360 -51 -517 -1231 -1739 -1673 -1580 -1487 -1321 -931
15314 -931 -517 -176 55 178 276 453 765 1009 751 -19 -1162 -1574 -1671 -940 -201 212 114 -500 -959 -297 308
15292 797 1087 1021 588 -124 -973 -1361 -1124 -1029 -1429 -1661 -1941 -2429 -2094 -1640 -981 -309 361 1024 1556 1616 1225
15271 1225 801 -198 -902 -1280 -660 132 826 1310 1466 1378 1095 658 325 152 288 289 -34 -407 -499 -474 -330
15250 -330 -83 180 363 217 -35 -474 -668 -927 -1076 -981 -920 -852 -804 -830 -947 -671 -537 -518 -386 -459 -580 -1069 -1396
15227 -1396 -1908 -2171 -1866 -1387 -1497 -1504 -1265 -1142 -1260 -1453 -1767 -1949 -2145 -1692 -973 -115 637 1206 1458 1341
15207 1341 647 -424 -1012 -992 -187 427 508 -144 -1242 -1739 -1327 -724 -340 -703 -1487 -1087 -11 755 979 683
15187 683 -50 -860 -1684 -1883 -1499 -936 -272 -113 -321 -965 -1880 -1874 -1076 -127 646 1162 1441 1447 863 24 -478 -398
15165 -398 -113 184 394 414 337 347 366 408 241 134 115 408 913 1309 1588 1646 1459 1220 907 451 -321 -1224
15143 -1224 -1404 -763 109 888 1335 1633 2049 2445 2438 2040 1281 -6 -1649 -1619 -104 925 1221 824 -67 -621 -175
15121 202 249 7 -680 -1492 -2375 -891 -57 35 -227 -655 -728 146 1097 1482 1286 257 -1177 -2846 -2254 -473 1054
15099 2126 2565 2445 1875 1327 612 300 635 1375 2215 3038 3335 3213 2670 1817 1154 481 -42 -311 -654 -1109
15079 -1109 -1406 -359 922 1698 1787 1385 516 -737 -1306 -386 135 251 240 317 645 898 804 402 -366 -973 -944
15058 -944 -363 33 53 -229 -719 -689 12 1084 2199 2888 2693 1409 -426 -1317 190 1699 2689 3212 3179 2486
15038 2486 1544 401 -654 -1391 -1807 -1551 -1013 -350 184 693 823 721 604 609 699 915 1001 1237 1226 708 -372
15016 -1698 -2992 -2949 -2898 -2941 -2419 -1145 338 1292 1500 1104 558 -25 -567 -965 -978 -580 38 666 1049 905 434
14994 -273 -933 -1395 -1070 -810 -535 -205 -8 -18 -208 -707 -1034 -1086 -1178 -1714 -1482 -706 34 569 885 1085 1056 1236
14972 1236 1276 1148 948 764 570 66 -238 -668 -996 -1383 -1616 -1564 -1468 -1241 -1269 -1631 -1563 -890 -64 826 1555 2056
14950 2056 2253 2457 2445 2416 2082 1554 453 -1055 -2157 -2198 -1028 -266 -49 -337 -990 -1532 -874 -255 186 306
14930 306 42 -262 -237 -163 -256 -381 -551 -387 -128 376 996 1773 2819 3717 4199 4092 3427 2216 1188 272
14909 -76 -568 -1188 -1861 -2409 -2370 -1897 -1084 -325 39 -103 -665 -1587 -2480 -2787 -2159 -1970 -1882 -1898 -1946 -1931 -1840 -1770 -1656
14886 -1656 -1208 -1056 -797 -587 -125 530 762 488 -134 -912 -1810 -1924 -1602 -1241 -803 -580 -346 17 542 1034
14866 1034 1209 1038 678 44 -481 -870 -1014 -930 -743 -602 -655 -892 -938 -393 399 1038 1427 1502 1189 767 264
14844 -102 -548 -850 -1049 -1069 -912 -242 454 984 1401 1200 900 458 47 -197 -370 -109 90 179 248 380 406 312
14822 312 49 -123 -381 -820 -1297 -1544 -911 -124 359 893 1387 1767 1906 1744 1256 578 -177 -790 -909 -576
14802 -576 354 982 1319 1602 1951 2005 1753 1355 1481 1212 686 668 693 755 722 516 381 163 44 -76 0 77 405
14779 405 661 494 310 147 351 798 989 1132 1048 697 66 -490 -927 -1163 -1206 -951 -868 -410 127 394 315
14758 315 85 -55 -4 132 226 280 20 -428 -1196 -987 -75 854 1438 1594 1239 580 -329 -820 -544 -61 180 259 361
14735 361 643 852 983 770 261 -248 -713 -1068 -923 -490 61 464 840 1037 841 502 -361 -742 -537 183
14714 1005 1676 1831 1387 537 -188 -808 -895 -714 -673 -1002 -1570 -931 -90 280 -13 -733 -1391 -1431 -1125 -1017 -1255
14693 -1255 -1614 -2124 -2184 -1451 -837 -544 -487 -788 -1457 -1917 -1127 -536 -255 -229 -492 -460 109 846 1361 1390 1118
14672 1118 453 -602 -1503 -1937 -1661 -1360 -1160 -874 -283 165 460 375 -90 -754 -1377 -1401 -431 282 838 1061
14652 1061 990 522 -59 -470 -768 -1067 -1291 -1673 -887 492 1659 2060 1633 718 -453 -419 346 801 718 83 -975
14630 -1966 -2871 -2872 -1759 -554 297 727 495 -211 -768 -656 -194 83 46 -279 -890 -1673 -2649 -2080 -754 390
14609 957 904 490 -87 -900 -1531 -1537 -1587 -1796 -1541 -911 -383 -97 -124 -216 77 251 -342 -1950 -1151 916 2825 4160
14587 4160 4729 4605 3994 2847 1564 841 535 361 -42 -1161 -1972 -1417 -20 1563 3296 4478 5033 4954
14569 4954 4231 2634 581 -1495 -2192 -438 796 1222 983 559 304 246 112 -261 -839 -1743 -2007 -1401 -837
14550 -837 -460 -60 357 773 891 906 648 90 -635 -1584 -2321 -2940 -2238 -1790 -1408 -945 -427 -336 -679 -1125 -1343
14529 -1343 -1697 -2274 -2211 -1651 -930 -213 45 -168 -791 -1544 -2442 -2235 -1293 -369 289 700 493 89 -199 -442
14509 -442 -616 -1134 -1660 -1911 -1591 -1247 -959 -682 -252 32 71 -140 -414 -526 -62 726 1297 1514 981 263 -758
14487 -1620 -1313 -257 319 627 751 848 726 406 -147 -867 -1823 -2201 -1898 -2042 -2587 -1744 -1297 -986 -1059 -1561
14467 -1561 -1600 -878 -129 334 394 60 -610 -1118 -427 1003 2186 2938 2757 1962 902 -206 -331 451 1166 1418
14447 1418 1202 530 -539 -1551 -2084 -1813 -1093 -140 458 1008 1213 1169 539 -279 -1144 -1767 -1742 -1379 -786 96
14426 864 1278 1375 1134 601 -148 -1192 -1422 -870 -251 262 317 186 85 121 283 392 429 499 741 654 27 -715
14403 -1375 -1071 24 884 1000 341 -770 -978 492 1481 1771 1614 1186 487 -88 -485 -575 -356 -5 447 814 942
14382 942 811 576 49 -595 -1274 -1671 -1604 -1543 -1736 -2156 -2018 -969 -185 -107 -532 -1383 -2056 -1636 -1432 -1239 -1040
14361 -1040 -766 -458 -68 -19 -208 -384 -280 -112 -266 -841 -1499 -1527 -1091 -1060 -923 -599 -192 -216 -748 -1522 -2009
14340 -2009 -1849 -1571 -1588 -1919 -1842 -1121 -526 -397 -603 -730 -525 125 406 580 546 358 -85 -734 -1212 -1131 -547
14318 184 534 570 100 -578 -1275 -1791 -1714 -1367 -1294 -1061 -685 -408 -303 230 956 1798 2480 2667 2464 2183 1649
14297 1649 1037 621 427 398 568 632 405 111 -435 -1021 -1201 -961 -606 -433 -318 -342 -167 24 -6 -361 -920
14276 -920 -1275 -1734 -2104 -2072 -1681 -1246 -918 -732 -180 311 948 1381 1501 979 -374 -1280 -431 796 1778 2357
14256 2357 2335 1634 629 -464 -1487 -1679 -1148 -735 -605 -767 -965 -813 -587 -710 -1360 -1418 -529 422 1154 1458
14236 1458 1487 1506 1503 1605 1506 1117 325 -323 -700 -654 -198 459 733 529 143 -253 -705 -1280 -1431 -743 217
14214 1032 1427 1365 942 -5 -878 -546 470 1308 1543 1364 1213 1223 1390 1509 1411 1060 1104 1705 2687 3672 4161
14193 4161 3883 2964 1872 1179 579 88 -306 -694 -1155 -1640 -1955 -1873 -1813 -1754 -1384 -1075 -680 -384 -302 -477 -797
14172 -797 -1133 -1599 -2376 -2805 -2716 -2491 -1743 -1190 -576 -598 -789 -1225 -1758 -1515 -935 -437 -32 262 469 624 746
14151 746 880 858 606 333 118 -76 -86 -4 -85 -529 -962 -1076 -1087 -1157 -1503 -1719 -1561 -1202 -713 -217 223 337
14129 337 243 -90 -89 223 813 1293 1226 747 102 -761 -1201 -1397 -1113 -624 -37 254 -88 -954 -1847 -2044 -729 546
14106 1174 992 96 -738 -1177 -1185 -1376 -1533 -1580 -1382 -1037 -420 291 548 1216 1706 1803 1335 861 141 -699 -1367
14085 -1367 -1518 -1155 -1096 -931 -454 274 882 1216 914 -46 -965 -1439 -1156 -515 -153 -100 -200 -463 -436 -339 -358
14064 -358 -264 34 394 692 1081 1619 2309 2778 2669 2181 1009 -301 -786 112 1277 2008 2146 1800 931 59
14043 -744 -597 278 1026 1199 639 -348 -939 -434 216 534 367 95 461 1739 3191 4149 4099 3398 2327
14024 2327 1045 243 115 -214 -615 -724 -413 -52 54 -112 -444 -616 64 1324 2618 3360 3469 2954 2108
14005 2108 1412 1040 1027 1152 1114 653 -111 -884 -979 -948 -1273 -1876 -1887 -665 588 1521 2035 2014 1315 166 -1039
13983 -1595 -1575 -1347 -1269 -1064 -1147 -1392 -1652 -1411 -630 20 491 694 689 325 121 267 427 600 840 984 1153
13962 1153 1156 1090 919 634 44 -657 -1248 -1147 -754 -255 40 -69 -379 -723 -1010 -751 -434 -84 334 1002 1393 1309
13940 1309 716 -289 -781 63 1064 1708 2152 2488 2077 1071 -117 -1076 -1174 -799 -372 54 470 871 1050 823
13920 823 274 -402 -979 -1418 -1711 -1862 -1476 -618 304 966 1202 1225 777 94 -685 -964 -614 -396 -404 -507 -750
13899 -750 -1110 -1424 -1841 -2322 -2405 -2131 -1824 -1246 -784 -423 -245 -319 -508 -822 -1215 -1530 -1431 -1228 -1019 -904 -939
13878 -939 -786 -500 -261 98 195 125 -190 -556 -505 276 1477 2580 3066 2765 1802 588 -686 -1358 -1260 -1087 -1016
13857 -1016 -1275 -1875 -1608 -828 -265 -144 -90 -416 -761 -1159 -1514 -1311 -868 -809 -637 -623 -858 -1168 -1179 -935 -509
13836 -509 -425 -261 -327 -467 -523 -36 576 928 951 1108 1140 875 408 -97 -574 -997 -1696 -1441 -755 -396 -238 -288
13814 -288 -185 -26 -285 -773 -1399 -1533 -869 -108 427 636 641 546 235 -161 -565 -886 -654 -159 224 348 242
13793 242 40 -242 -549 -686 -741 -1031 -1630 -1283 -86 1070 1980 2510 2732 2370 1651 1200 1207 1532 1974 2105 1901
13772 1901 998 266 -134 -552 -949 -1429 -1163 -405 166 252 -76 -1106 -2096 -425 822 1217 1071 809 367 60
13751 255 293 -15 -417 -1088 -1779 -2629 -2679 -2063 -1379 -573 -473 -502 -778 -760 -17 922 1963 2909 3332 3309 2758 1563
13729 1563 327 -1287 -2575 -2124 -746 -219 -480 -651 13 1345 2483 3436 3888 3665 3137 2181 1280 597
13710 127 -160 -182 -94 -58 29 -22 114 461 695 613 214 -250 -669 -937 -938 -412 78 498 878 942 682 145 -836
13686 -1708 -1732 -1393 -1444 -1896 -1412 -459 279 589 304 -434 -1387 -1952 -1366 -521 76 426 462 439 47 -678 -1799
13665 -1799 -2416 -973 625 1949 2578 2676 2341 1669 846 -117 -629 -324 488 1049 1468 1662 1682 1359 893 292
13644 -194 -322 -174 -159 -502 -48 550 992 1327 1398 1455 1412 1521 1670 1684 1606 1511 1225 629 -360 -1456 -2810 -2638
13622 -2638 -1520 -925 -682 -804 -1155 -1849 -1792 82 2020 3455 4064 3870 3037 1677 207 -440 136 891 1156
13603 1156 836 -13 -731 -802 -83 863 1498 1754 1502 1053 651 614 834 928 877 759 877 1119 1261 1300 1322 1624
13581 1624 1689 1367 875 -112 -693 -1374 -2146 -2474 -2328 -2240 -2142 -1798 -1451 -1069 -639 -355 114 553 747 783 563
13560 563 244 3 -149 -213 -9 406 852 1229 1404 1114 484 -543 -1531 -1278 -999 -971 -1292 -958 -274 268 582 448
13538 448 42 -459 -849 -1059 -1103 -934 -140 883 1626 1817 1401 314 -1064 -1257 68 1341 1975 1938 1327 34 -1472
13516 -923 452 1625 2487 2471 2148 1630 1096 1087 1257 1293 1276 1385 1500 1720 1880 1723 997 4 -818 -1108 -866 -605
13494 -605 -424 -384 -583 -739 -471 18 391 448 91 -490 -1042 -1055 -785 -665 -534 -439 -370 -431 -589 -551 -519 -528 -523 -943
13470 -943 -1291 -1466 -1701 -1939 -1831 -2045 -1806 -1161 -792 -369 -101 77 8 -136 -134 -247 -706 -1013 -720 -124 505
13448 1556 2154 2688 2635 2183 1384 608 -260 -1163 -1721 -1457 -837 32 613 803 658 325 -26 -531 -1218 -1798
13428 -1798 -2006 -1772 -1223 -654 -215 -105 -57 -641 -1498 -1899 -1496 -1004 -334 -8 -73 -507 -844 -868 -900 -971 -1101 -1042
13406 -1042 -946 -1055 -766 -299 79 410 628 829 1025 1280 1383 1462 1285 726 277 125 296 579 884 974 818
13385 818 496 119 -235 -504 -812 -1212 -1944 -2449 -2698 -2201 -1696 -1170 -857 -688 -586 -831 -898 -1098 -1234 -1035
13365 -1035 -881 -722 -1191 -1464 -851 203 1301 2219 2920 3105 2262 1005 -128 -380 307 940 1168 1103 599
13346 599 -122 -955 -1637 -1470 -821 -377 5 453 807 896 651 200 -492 -1162 -1662 -2041 -2184 -2128 -1961 -1427 -707
13324 209 723 1014 1068 811 584 414 323 114 -175 -336 -451 -515 -613 -628 -181 328 348 182 -140 -397 -965 -1751
13302 -1751 -1853 -1022 -429 -91 -345 -785 -1236 -1266 -1024 -976 -1000 -961 -1038 -946 -1031 -1243 -1472 -1099 -879 -1031 -1183 -1006
13280 -1006 -455 176 797 1637 2244 2739 2588 2007 1186 274 -798 -803 121 447 -370 -1077 -1438 -1567 -1565 -1808 -2205
13259 -2205 -3043 -3000 -2553 -2349 -2212 -2298 -1774 -1178 -650 128 713 1080 1293 1272 988 716 498 -138 -880 -1282
13239 -1282 -1254 -937 -731 -631 -733 -1043 -1267 -1641 -2185 -1655 -1210 -1058 -1397 -1764 -2197 -2155 -1004 451 1422 2059
13219 2059 2209 1793 969 61 -678 -1273 -1421 -921 -825 -705 -796 -842 -760 -1003 -1603 -1705 -966 -4 588 521 -61 -926
13197 -926 -1458 -778 53 420 138 -530 -979 -1311 -1599 -1687 -825 -98 106 56 -75 -8 -30 -24 101 232 344 92 -280
13173 -428 -121 360 815 921 655 53 -481 -880 -1197 -1701 -1823 -1098 -490 -192 -318 -766 -980 -998 -825 -468
13153 -468 -150 -39 -305 -715 -755 -626 -368 -502 -1025 -1648 -1839 -2063 -1958 -1501 -864 -120 422 641 380 -612
13132 -1726 -2333 -2334 -2024 -1542 -574 478 1282 1518 1245 463 0 140 427 439 184 -426 -685 -1216 -1818 -2226 -2034
13111 -2034 -2019 -2170 -2419 -1870 -1852 -1085 -158 911 1551 2192 2470 2221 1734 1193 620 283 66 -307 -351 -624 -951
13090 -951 -1172 -1239 -1370 -1406 -1320 -925 -368 330 1065 1306 1011 250 -845 -1360 -970 -652 -583 -634 -336 -88 167 204
13068 204 82 22 129 309 138 -118 -330 -419 -444 -428 -503 -863 -1362 -1892 -2029 -1635 -1092 -771 -362 -174 -29 -120
13046 -120 -274 -534 -253 292 800 1012 1049 996 762 511 225 -121 -514 -1121 -1674 -1542 -557 866 2238 3071
13026 3071 3083 2388 1146 -262 -1437 -1370 -658 282 1031 1445 1697 1334 724 240 -234 -653 -1068 -1159 -981 -817
13006 -817 -714 -638 -554 -377 -120 287 653 864 842 874 492 -89 -372 -402 -520 -849 -1247 -1499 -1519 -1506 -1727 -2013
12984 -2013 -2285 -1970 -1304 -1171 -1192 -1422 -1845 -1930 -1657 -1336 -1299 -1393 -1471 -1412 -1188 -916 -613 -240 141 490 915
12963 915 1399 1782 1915 1885 1410 647 -406 -1552 -1987 -1191 -596 -536 -952 -890 203 972 1101 992 945 986 815
12942 815 567 424 543 838 1207 1260 826 417 229 642 1646 2262 2301 1873 1211 227 -549 -937 -1441 -1513
12922 -1513 -1215 -659 101 1013 1652 2004 1964 1431 877 561 75 -128 -227 -385 -654 -1180 -1824 -1572 -623 -134
12901 344 721 987 1048 1000 419 -329 -1178 -1855 -1093 -296 100 185 36 -385 -886 -997 -824 -536 -236 23 155
12880 155 -69 -589 -1450 -2313 -1415 -304 382 447 194 -186 -372 -588 -742 -958 -826 -670 -510 -395 -143 344
12859 995 1537 1385 1029 448 -142 -960 -1620 -675 44 223 6 -241 -97 432 753 724 140 -914 -1879 -995 -236
12837 -185 -600 -1214 -1471 -1306 -841 -254 548 1235 1876 2158 2088 1611 795 -124 -813 -999 -769 -123 131 145
12817 145 -309 -1198 -2367 -2134 -709 244 629 162 -919 -1601 -1167 -761 -661 -1099 -1622 -559 477 1010 1084 626
12797 626 -48 -658 -1352 -1652 -1806 -1870 -1765 -1832 -1439 -979 -526 -79 225 445 498 265 -120 -707 -1413 -2007 -2396
12776 -2396 -2317 -2389 -2174 -1573 -1122 -1068 -1416 -2287 -2100 -2366 -1688 -1229 -1181 -1368 -2022 -2127 -1458 -813 -938 -1608 -2303
12755 -2303 -1057 224 1122 1388 1348 1112 885 695 613 488 539 1016 1371 1523 1392 951 -72 -644 -1293 -1621
12735 -1621 -1426 -1077 -457 23 411 672 877 783 590 404 550 898 1123 973 503 -427 -1544 -1122 63 932
12715 932 1421 1490 987 414 74 -32 188 403 616 860 980 1060 926 417 -226 -672 -977 -943 -711 -422 -338 -172
12693 -172 364 1295 2206 2922 3230 2996 2291 1321 420 -480 -1302 -1669 -1254 -715 26 1003 2185 3216 4014
12674 4014 4255 3824 2951 1925 1172 916 986 1031 1108 1279 1436 1474 1355 905 510 359 305 732 1246 1690 1854
12653 1854 1296 857 417 14 30 242 540 793 829 723 462 -58 -833 -1280 -575 565 1458 2018 2375 2272 1884
12632 1884 1120 336 -187 -263 189 625 652 261 -582 -1620 -2281 -2869 -2778 -2844 -2358 -2019 -1231 -441 2 147 -248
12610 -874 -1213 -1224 -1110 -923 -702 -351 142 948 1837 2187 2106 1832 1284 726 417 501 814 1099 1012 765 483
12589 483 219 -12 -393 -520 -321 191 823 1451 1995 2243 2075 1544 1131 707 242 -344 -873 -1174 -1044 -150
12568 957 1569 1674 1306 828 446 580 681 694 628 -22 -954 -1804 -2366 -2638 -2787 -2763 -2439 -1820 -1094 -452 116
12546 668 1082 823 496 64 111 337 468 481 264 -7 -262 -477 -470 -310 -25 451 711 664 240 -543 -1392 -985 -198
12522 351 484 377 85 -217 -488 -815 -978 -1126 -1080 -1137 -1558 -1988 -1420 -783 -526 -578 -680 -342 -65 183 298
12501 298 356 -136 -1000 -1601 -1703 -1773 -1860 -2080 -1918 -2246 -2405 -2555 -2620 -2287 -2003 -1701 -1216 -711 -592 -365 -119
12479 -476 -882 -1777 -1983 -1230 -538 -603 -669 -988 -1055 -1043 -887 -308 619 1388 1756 1955 1554 963 528 972 2195
12458 2195 2840 4190 4441 4033 2769 776 -1114 -1586 -1118 -1101 -1144 -1211 -1360 -1466 -1628 -1440 -619 -14 287 19
12437 -190 150 909 1726 2597 3273 3758 1170 1117 1238 1051 581 606 879 298 -220 -621 -945 -1323 -858 146
12416 1014 1494 1419 730 107 -216 -391 -248 361 1271 2002 2466 2840 2999 2908 2612 2296 2003 1719 1553 1473
12396 1473 1676 1970 2244 2193 1934 1334 195 -1359 -2378 -1045 57 957 1537 1897 1883 1726 1557 1356 1240
12377 1240 1254 1216 897 239 -494 -918 -859 -652 -400 -57 248 703 1110 1524 2008 2167 2049 1800 1859 1902 1956 1706
12355 1706 1412 679 -710 -1859 -1709 -1402 -1077 -788 -761 -865 -1271 -2084 -2461 -1193 34 963 1260 895 -32 -1094
12335 -1094 -1745 -1705 -960 -108 904 2017 3086 3880 4361 4289 3700 2431 972 -644 -2246 -1849 -1368 -1418 -2027
12316 -2027 -2316 -1243 -310 317 766 1219 2049 2942 3540 3299 2261 396 -1433 -1808 -855 -232 30 -164 -367
12297 -367 -564 -896 -956 -1050 -1137 -1168 -1209 -1136 -1009 -1030 -1471 -1768 -1839 -1735 -1678 -2094 -2374 -2192 -1899 -1763 -1721 -1352 -661
12273 -81 381 642 575 410 -21 -323 -344 -364 -326 -216 -477 -298 20 11 -234 -412 -601 -856 -1115 -993 -754 -608 -525
12250 -525 -429 -566 -1190 -1848 -2147 -1608 -1000 -446 -1060 -1207 -1370 -1192 -776 -317 -618 -1399 -2259 -2042 -1394 -848
12230 -848 -598 -877 -1192 -1533 -2017 -2244 -1335 -457 241 797 1025 886 628 502 776 1246 1901 2158 1930 1395
12210 1395 689 -172 -1007 -1438 -1447 -1075 -483 31 676 1351 1653 1399 857 417 208 604 1323 2280 3225 3829
12190 3829 3968 3579 2574 1380 238 15 273 172 -651 -2055 -1036 709 1940 2576 2407 1373 275 -659
12171 -1918 -2006 -1153 -516 -768 -1082 -1041 -1092 -882 -729 -561 -241 133 392 263 -309 -1254 -2370 -1715 -857 -424
12150 -24 11 -433 -747 -356 108 15 -250 -582 -780 -696 -629 -777 -1140 -1929 -2312 -1490 -241 688 1198 1359 1048
12129 1048 1035 738 193 -586 -1327 -1712 -1820 -631 451 1248 1445 1139 440 -13 -276 -347 -844 -1704 -1319 341
12108 1867 2923 3270 2852 2088 1494 965 299 103 343 546 503 349 -268 -1021 -1934 -2476 -2782 -2400 -1881
12089 -1881 -2033 -1959 -1296 -509 193 736 1183 1087 785 0 -803 -1164 -755 80 604 850 1164 1509 1669 1505 1349
12068 1349 1900 3114 4855 6314 6940 5363 928 1166 12012 24818 37328 47186 52085 50876 43959
12053 43959 33141 20661 9104 1193 2119 4040 3430 1574 -28 -1297 -1616 -909 -169 113 -350 -1037
12037 -1037 -2193 -2676 -2065 -1589 -1483 -1541 -1795 -1708 -1219 -599 -478 -591 -903 -915 -1077 -1292 -1513 -1557 -1503 -1342 -969
12016 -969 -572 -313 -58 -14 18 73 130 406 518 513 96 -739 -1586 -1134 -476 -135 -83 -274 -858 -1637 -1666 -958 -397
11992 -303 -800 -1668 -1687 -818 -157 -35 -672 -1381 -1156 -510 -744 -2492 -567 4197 9158 13296 15844 16383 14321
11973 14321 10261 5438 807 -2348 -2461 -950 52 774 1186 632 -785 -2054 -1345 56 424 -263 -941 -637
11955 -637 14 33 -461 -1263 -1946 -1114 -693 -218 223 592 664 540 163 -293 -835 -1394 -1808 -1957 -1616 -1072 -479
11933 -162 -149 -108 89 256 661 1069 1592 1584 1375 1137 792 648 724 1067 1619 2230 2557 2427 1535 424 -1059
11911 -1534 -924 -243 268 170 -117 -621 -1058 -1589 -1797 -2001 -2125 -1759 -1295 -928 -781 -1221 -1800 -1741 -963 -570
11891 -570 -412 -382 -776 -1146 -790 -365 134 242 -90 -376 -576 -746 -834 -694 -273 394 1047 1214 873 153 -679
11869 -682 -59 284 341 31 -574 -1139 -1563 -1724 -1219 -636 -277 -143 -72 -124 -38 -287 -259 -293 -247 -262 -380 -454 -830
11846 -830 -1144 -1574 -1410 -209 773 1342 1294 1041 636 161 -285 -615 -984 -1246 -1623 -1788 -2108 -2375 -2674 -3046
11826 -3046 -2286 -681 609 1494 1540 680 -571 -1579 -1844 -1736 -1131 -47 948 1211 500 -1086 -1714 -937 -998 -985
11806 -985 841 3263 4829 5561 5174 5310 4660 4241 5002 7966 14883 21714 27623 30546 30257 26454 20291
11789 20291 12777 6580 4722 5500 6177 5696 4169 2200 529 -136 34 586 375 -530 -1084 -403 473 770
11771 770 432 27 -409 -733 -1270 -1891 -1740 -1069 -564 -293 -918 -1514 -1381 -956 -610 -604 -680 -741 -619 -494 -325
11750 -325 -122 -174 -467 -901 -872 -350 91 96 -81 -145 -38 325 488 293 -231 -921 -1877 -2734 -2358 -2142 -1929 -1726
11728 -1726 -1153 -661 -486 -652 -973 -1607 -1882 -1560 -1367 -1360 -1672 -1798 -1530 -685 316 1106 1226 875 192 -611
11707 -1266 -1269 -722 -315 -286 -475 -946 -1501 -1899 -1747 -1093 -227 374 717 882 1160 1538 2045 2286 2219 1569 324
11685 -1066 -505 498 1182 1652 2019 2344 2355 2118 1739 1353 1193 1656 2193 2319 1656 142 -2036 -1442 7 956
11665 956 924 752 369 -270 -1178 -1932 -2619 -2900 -2826 -2525 -2178 -1515 -1194 -1017 -830 -395 256 1045 1630 2205
11645 2205 2521 2674 2498 2307 2087 1423 467 -565 -1626 -1922 -1144 -351 57 -321 -711 -1267 -1578 -1791 -1955
11626 -1955 -2055 -1797 -1552 -1413 -1286 -1014 -591 -29 29 -404 -1195 -1716 -1574 -1236 -1219 -1520 -1420 -1067 -673 -772 -916
11605 -916 -1065 -1295 -1311 -1207 -1134 -1432 -1828 -2180 -1816 -1181 -695 -390 -230 -44 158 414 604 662 309 31 -384
11583 -702 -1083 -1155 -1019 -781 -629 -530 -658 -1129 -1830 -1771 -2338 -2962 -1930 -600 866 2194 3334 3233 2559 1779
11563 1779 1976 2641 2382 1865 1013 -333 -5758 -4973 -5421 -1604 -1849 -2583 -2700 -3641 -2526 -1616 -1752 -2957
11545 -2957 -3769 -2943 -1245 -87 330 -284 -1703 -2950 -2511 -1798 -1250 -1455 -2204 -2105 -634 564 963 856 524
11526 524 104 617 1748 3887 6160 7240 6461 3883 1056 1217 2398 4556 5299 4243 1650 647
11509 449 274 -397 -2024 -2460 -1065 671 1431 768 -113 -339 405 1664 2845 3812 4267 4466 4493 4122 3274
11490 3274 1976 521 -640 -1592 -1709 -1221 -748 -185 47 51 -3 -94 -444 -718 -876 -1158 -1499 -1414 -1145 -585 28 351
11468 351 424 181 -232 -631 -1156 -1688 -1996 -1587 -704 136 621 880 1095 1360 1305 1973 3367 4317 4995 4649
11448 4649 3446 1857 325 -1205 -1884 -722 160 982 1532 1765 1757 1242 661 322 390 486 318 -405 -1579
11429 -1579 -2799 -2584 -2022 -1540 -886 -396 326 831 1021 670 -88 -1230 -2296 -2628 -2521 -1731 -1101 -731 -241
11409 32 242 282 147 -81 -340 -605 -1134 -1560 -1406 -944 -163 92 -110 -1055 -2144 -1381 -826 -736 -1223 -1949 -2055
11388 -2055 -962 -129 413 839 1251 1400 860 -596 -1978 -3352 -3298 -1641 -428 100 -75 -1020 -2014 -3245 -2786
11369 -2786 -3015 -3368 -2889 -1793 -612 138 520 462 82 -489 -1042 -1116 -544 -192 -157 -528 -512 -239 585 1772
11349 1772 2910 3253 3217 2240 1295 450 -228 -377 -291 -5 735 2493 4633 6360 7742 8189 7585 6179 4281
11330 4281 2616 1721 1391 1066 422 -255 -512 213 800 1052 663 -383 -1627 -1123 337 1295 1884 1985 1465
11311 1465 577 -251 -931 -1136 -880 -317 320 181 365 908 1473 2294 3231 4121 4681 4554 3879 2871 1312
11291 -15 -783 -512 -578 -880 -1841 -3122 -1704 -637 258 412 6 -902 -2123 -2084 -2035 -2098 -2306 -2245 -2192 -1838 -1307 -536
11268 288 1116 1708 1942 1915 1865 1992 1985 1700 1407 878 336 -331 -814 -1318 -1592 -1544 -1402 -1191 -803 -588 -707
11247 -707 -781 -938 -1083 -1344 -2040 -1624 -208 900 1159 832 298 372 824 945 800 565 275 372 861 1309 1442
11226 1442 1185 516 -316 -1349 -1838 -1506 -949 -1504 -2415 -1737 -394 0 -593 -1894 -917 -106 -172 471 1466 1651
11206 1651 1133 1912 3627 3931 891 -1492 4241 7247 6723 5530 9649 14043 12200 12114 24358 36622
11190 36622 36643 39385 94243 189645 301857 407091 482031 509448 482475 408066 303541 191957
11178 191957 96588 39931 34557 34413 23073 10122 9558 10736 7183 4425 6961 8764 6877 3142
11163 1518 2575 1448 -1248 -1878 -585 166 -180 -655 -534 96 891 1529 1196 -110 -1837 -3365 -1559 -730
11144 -705 -830 -457 212 533 570 535 -79 -1230 -1492 -191 609 783 412 -15 -145 279 806 1037 1079 833 557
11123 557 233 -85 -379 -494 -341 -367 -856 -1771 -2338 -2128 -1870 -1636 -959 -56 414 856 1065 937 514 -193 -839
11102 -839 -1214 -930 -91 650 943 908 695 218 -666 -1794 -1690 -964 -730 -1032 -1533 -1551 -1157 -866 -1287 -2078
11082 -2078 -1937 -337 1006 1835 2038 1721 944 151 -25 541 1048 1362 1273 917 385 -85 -218 -131 101 101 135
11061 135 -281 -1285 -2348 -1198 37 1023 1487 1457 1118 408 48 221 903 1738 2659 2665 1651 39 -1252 -1518
11041 -1518 -1331 -1427 -1844 -1818 -942 -318 143 285 337 159 -229 -875 -1900 -2338 -1294 -535 -214 -316 -531 -750
11021 -750 -879 -798 -558 -368 -343 -451 -460 -595 -620 -360 -244 120 106 -402 -1041 -1206 -1048 -1085 -1315 -1866 -2402 -3111
10999 -3111 -2718 -2073 -1941 -1943 -1830 -1656 -1417 -1205 -884 -272 263 642 832 812 423 -231 -1162 -1052 555 2046
10979 2046 3028 3293 3007 2321 1727 1254 858 451 170 298 609 994 1105 1396 1873 2192 2518 2260 1188
10960 1188 -694 -2412 -3582 -3010 -2240 -1516 -716 29 38 -923 -1798 -1113 -204 273 578 588 389 -18 -664 -932
10940 -932 -1033 -780 -703 -669 -174 368 810 731 88 -1228 -2303 -1522 -748 -617 -988 -1528 -1819 -1824 -1344 -879 -536
10919 -536 -336 -342 -698 -1106 -1121 -875 -977 -978 -293 885 2094 2864 2660 1664 183 -1722 -3209 -1399 401 2604
10899 2604 4813 5966 5443 4251 2239 1963 3240 4143 3530 1539 -563 -2202 -2116 -1903 -799 1097 3255
10882 3255 6057 8586 10038 9686 8611 6561 4588 2180 350 -1133 -1773 -1829 -1366 -931 -1006 -1638 -1241
10865 -1241 -5 1303 1937 2152 1670 598 -444 -1066 -1124 -480 231 394 40 -612 -474 312 1439 2146 2095 1049
10845 1049 -631 -2359 -761 552 882 11 -1319 -1613 -1164 -132 998 1686 1676 1214 991 1480 2438 3311 3411
10826 3411 2499 625 -1399 -1323 263 1431 1635 1064 167 -253 61 84 -233 -953 -1841 -2141 -1091 153 1041
10807 1041 1454 1461 933 470 337 49 -254 -346 -210 -60 -329 -516 240 1335 1847 1584 746 -237 -707 -291 202
10785 605 920 981 1184 1694 1865 1413 1057 646 516 626 645 1567 3296 4725 5166 4137 1488 -603 1031
10765 3236 3676 2121 -719 -1953 329 1342 624 -258 -81 193 -311 -1867 -1016 883 2343 3145 3379 3578
10747 3578 4682 5769 5691 3459 -208 -396 4125 7214 8131 8356 9837 12408 13104 13170 14687 17697 20665
10730 20665 25031 33707 45083 55862 69898 98296 146952 210339 278017 339921 388361 418239
10718 418239 424629 399905 356084 297620 230918 164360 108680 74933 61468 52611 40269 27371
10706 27371 20980 20258 18415 13951 10983 9976 9886 8849 8088 7992 6305 2655 567 2848 4703 3745
10690 3745 532 -127 4073 6727 6320 4155 1079 -639 708 1984 2290 1902 1272 163 -1350 -1937 -568
10672 1263 2382 2045 328 -2593 -543 2143 4171 4741 3924 1952 -376 -2636 -983 -219 -44 -19 231 425
10654 425 590 663 905 1108 1304 1238 1304 1207 766 370 253 863 1374 1353 835 229 12 33 -298 -888 -1155 -1127
10632 -1127 -985 -960 -981 -952 -502 -240 79 253 -2 -225 108 546 881 645 -202 -1042 -925 -726 -1095 -2090 -1592
10611 -1592 -527 260 192 -495 -882 -271 490 850 1105 1237 1412 1553 1761 2060 2093 1789 1031 -54 -393 412
10590 1513 2431 2959 2918 2360 1828 1641 1461 1176 979 841 823 777 517 -386 -1307 -1568 -1368 -1240 -1690 -2648
10570 -2648 -1503 16 983 1258 945 337 -453 -759 -526 240 1324 2526 3380 3442 2951 1870 879 395 47
10550 -182 -735 -1411 -2237 -2204 -1978 -1175 -17 -18 -1099 -2665 -2084 213 2224 3544 3547 2394 941 -590 -1350 -1611
10530 -1611 -1621 -1262 -816 -378 7 254 472 343 -231 -1145 -1881 -965 73 999 1535 1299 996 890 732 841 1104
10509 1104 1296 1111 247 -1089 -2785 -2490 -967 755 1739 1709 893 -434 -1558 -2320 -2775 -3058 -2952 -2309 -1296
10490 -1296 -504 -431 -769 -993 -874 -833 -823 -506 -429 -455 -937 -1190 -1363 -1210 -1408 -773 -91 735 1623 2367 2741
10469 2741 3070 2876 2445 1462 434 -910 -2169 -2991 -2495 -2029 -1957 -2089 -1693 -1199 -760 15 182 -186 -1034 -1813
10449 -1813 -940 -400 -149 -376 -664 -1158 -1354 -1725 -2146 -2514 -2505 -964 988 2578 3420 3698 3559 3316 2404 993
10428 -951 -2339 -3045 -1676 -721 -449 -1130 -2256 -2033 -865 167 771 1097 553 -226 -694 -463 101 727 1118
10409 1118 989 1081 514 -613 -1997 -3018 -2179 -1585 -1551 -1873 -1877 -735 901 3987 4519 3670 1594 494 9426
10390 9426 21956 34332 45072 50862 48998 41446 30318 17670 6052 -1806 -2020 -1698 -2130 -2589
10376 -2589 -1161 -670 -654 -1182 -2621 -2473 -1187 95 1012 1411 1045 351 -62 -176 -107 174 187 -24 -165 -196 16
10354 380 695 926 1380 1599 1674 1668 1491 1393 1605 1620 1642 1990 2256 2090 2081 1871 967 647 690 249 -439 -647 -82
10330 565 1030 1153 971 338 -271 -126 153 284 -63 -571 -1290 -2342 -2309 -76 1900 2587 1649 690 181 -736
10309 -957 -181 1147 1199 -301 -2529 -1709 -262 1164 6502 12637 14438 16860 47131 107986 192554 290155
10293 290155 385650 461433 502620 485850 425593 338201 240114 147833 75295 28631 13245
10281 12884 9798 7487 6807 4993 1098 -551 -646 1246 1448 1960 2988 2726 1296 -351 -1965 -3053
10265 -3053 -2718 -2667 -2515 -2332 -1103 387 952 1192 1401 1025 -155 -1149 -1563 -2718 -3207 -3491 -3742 -3060 -2278
10246 -2278 -1202 -49 -645 -1967 1304 6970 12115 15833 18262 21029 23598 30461 37499 44873 51284
10231 51284 55917 58644 62167 67989 61979 58795 56536 51710 43005 29189 16522 4663 -2527 -1925
10217 -1925 -384 -1740 -3114 -2508 -1733 -2373 -2234 -1155 -892 -289 1103 2214 2263 2010 2082 2898 3682 3872
$$ [...]