##TITLE=AC1415_BRAA12224_7652885_dGozNmR9BP
##JCAMPDX= 6.0         $$ Bruker NMR JCAMP-DX V2.0
##DATA TYPE= NMR SPECTRUM
##DATA CLASS= NTUPLES
##ORIGIN= BRUKER
##OWNER= Administrator
$$ 1.72 TOPSPIN		Version 2.1
$$ 2013-04-11 17:16:35.629 -0700  Administrator@X
$$ Compression mode = diff/dup
##.OBSERVE FREQUENCY= 400.02188249412
##.OBSERVE NUCLEUS= ^1H
##.ACQUISITION MODE= SIMULTANEOUS (DQD)
##.ACQUISITION SCHEME= undefined
##.AVERAGES= 8
##.DIGITISER RES= 22
##SPECTROMETER/DATA SYSTEM= spect
##.PULSE SEQUENCE= zg30
##.SOLVENT NAME= COFFEE_meoh
##.SHIFT REFERENCE= INTERNAL, COFFEE_meoh, 1, 14.98509
##AUDIT TRAIL= $$ (NUMBER, WHEN, WHO, WHERE, PROCESS, VERSION, WHAT)
$$ ##TITLE= Audit trail, TOPSPIN		Version 2.1
$$ ##JCAMPDX= 5.01
$$ ##ORIGIN= Bruker BioSpin GmbH
$$ ##OWNER= Administrator
$$ $$ E:\/data/COFFEE/nmr/AC1415_BRAA12224_7652885_dGozNmR9BP/20/pdata/1/auditp.txt
$$ ##AUDIT TRAIL=  $$ (NUMBER, WHEN, WHO, WHERE, PROCESS, VERSION, WHAT)
(   1,<2013-04-11 17:16:27.520 -0700>,<Administrator>,<X>,<go>,<TOPSPIN 2.1>,
      <created by zg
	started at 2013-04-11 17:15:21.363 -0700,
	POWCHK enabled, PULCHK disabled,
       configuration hash MD5:
       33 CF 6A 21 5C D3 B9 40 6C 15 AA 8D 27 A2 4F 13
       data hash MD5: 64K
       E9 88 F3 CE 3A 6B 52 1C CC 8B 75 95 EF 91 0B 8A>)
(   2,<2013-04-11 17:16:30.598 -0700>,<Administrator>,<X>,<proc1d>,<TOPSPIN 2.1>,
      <Start of raw data processing
       efp LB = 0 FT_mod = 6 PKNL = 1 PHC0 = 0 PHC1 = 0 SI = 32K 
       data hash MD5: 32K
       C9 AB 9D 25 BA 3E A8 EB D9 65 58 DF 7A 5A 27 38>)
(   3,<2013-04-11 17:16:31.098 -0700>,<Administrator>,<X>,<proc1d>,<TOPSPIN 2.1>,
      <pk PHC0 = 99.33289 PHC1 = 0 
       data hash MD5: 32K
       48 3A 58 6E B8 CF D4 69 6A F8 43 D5 DC D1 0E 7E>)
(   4,<2013-04-11 17:16:31.317 -0700>,<Administrator>,<X>,<proc1d>,<TOPSPIN 2.1>,
      <abs ABSG = 1 
       data hash MD5: 32K
       9D 1A E3 60 CB 60 2D 86 6D C3 27 0A 64 30 06 E1>)
(   5,<2013-04-11 17:16:31.457 -0700>,<Administrator>,<X>,<proc1d>,<TOPSPIN 2.1>,
      <abs ABSG = 2 
       data hash MD5: 32K
       44 36 4B AB F5 C8 55 44 D4 7A 8A 77 4B 9D 50 AA>)
(   6,<2013-04-11 17:16:31.613 -0700>,<Administrator>,<X>,<proc1d>,<TOPSPIN 2.1>,
      <abs ABSG = 3 
       data hash MD5: 32K
       EB 23 6C B0 C6 5F DC 1D 71 31 BD E0 8B 83 1F A9>)
(   7,<2013-04-11 17:16:31.754 -0700>,<Administrator>,<X>,<proc1d>,<TOPSPIN 2.1>,
      <abs ABSG = 4 
       data hash MD5: 32K
       81 68 2C 92 F1 EF B7 21 72 B2 47 AE D5 8B 2B C1>)
(   8,<2013-04-11 17:16:31.895 -0700>,<Administrator>,<X>,<proc1d>,<TOPSPIN 2.1>,
      <abs ABSG = 5 
       data hash MD5: 32K
       FB 4D 03 6B FB AB C8 27 90 C6 8E 24 EB B3 8E F1>)
$$ ##END=
$$ 
$$ $$ hash MD5
$$ $$ 28 91 27 7C 59 70 11 36 2D BC A4 5F 91 AF E4 EA
##$RELAX= 
##$RELAX= 
##$RELAX= 
##$RELAX= 
##$RELAX= 
##$RELAX= 
##$RELAX= 
$$ Bruker specific parameters
$$ --------------------------
##$DU= <E:\>
##$EXPNO= 20
##$NAME= <AC1415_BRAA12224_7652885_dGozNmR9BP>
$$ [...]
150 150 150 150 150 150 150 150
##$TP07= 0
##$TPNAME0= <>
##$TPNAME1= <>
##$TPNAME2= <>
##$TPNAME3= <>
##$TPNAME4= <>
##$TPNAME5= <>
##$TPNAME6= <>
##$TPNAME7= <>
##$TPOAL= (0..7)
0.5 0.5 0.5 0.5 0.5 0.5 0.5 0.5
##$TPOFFS= (0..7)
0 0 0 0 0 0 0 0
##$TUNHIN= 0
##$TUNHOUT= 0
##$TUNXOUT= 0
##$USERA1= <user>
##$USERA2= <user>
##$USERA3= <user>
##$USERA4= <user>
##$USERA5= <user>
##$V9= 5
##$VALIST= <valist>
##$VCLIST= <CCCCCCCCCCCCCCC>
##$VD= 0
##$VDLIST= <DDDDDDDDDDDDDDD>
##$VPLIST= <PPPPPPPPPPPPPPP>
##$VTLIST= <TTTTTTTTTTTTTTT>
##$WBST= 2048
##$WBSW= 25
##$XGAIN= (0..3)
0 0 0 0
##$XL= 0
##$YL= 0
##$YMAX_a= 651735
##$YMIN_a= -554582
##$ZGOPTNS= <>
##$ZL1= 120
##$ZL2= 120
##$ZL3= 120
##$ZL4= 120
##$ABSF1= 14.98509
##$ABSF2= -5.573092
##$ABSG= 5
##$ABSL= 3
##$ALPHA= 0
##$AQORDER= 0
##$ASSFAC= 0
##$ASSFACI= 0
##$ASSFACX= 0
##$ASSWID= 0
##$AUNMP= <proc_prof1d_extract_pilot.lims>
##$AXLEFT= 0
##$AXNAME= <>
##$AXNUC= <1H>
##$AXRIGHT= 0
##$AXTYPE= 0
##$AXUNIT= <>
##$AZFE= 0.1
##$AZFW= 0.1
##$BCFW= 0
##$BC_mod= 0
##$BYTORDP= 0
##$COROFFS= 0
##$CY= 15
##$DATMOD= 1
##$DC= 0
##$DFILT= <>
##$DTYPP= 0
##$F1P= 0
##$F2P= 0
##$FCOR= 0.5
##$FTSIZE= 32768
##$FT_mod= 6
##$GAMMA= 0
##$GB= 0
##$INTBC= 1
##$INTSCL= 1
##$ISEN= 128
##$LB= 0
##$LEV0= 0
##$LPBIN= 0
##$MAXI= 10000
##$MC2= 0
##$MEAN= 0
##$ME_mod= 0
##$MI= 0
##$NCOEF= 0
##$NC_proc= -8
##$NLEV= 6
##$NOISF1= 0
##$NOISF2= 0
##$NSP= 0
##$NTH_PI= 0
##$NZP= 0
##$OFFSET= 14.98509
##$PC= 1
##$PHC0= 99.33289
##$PHC1= 0
##$PH_mod= 1
##$PKNL= yes
##$PPARMOD= 0
##$PPDIAG= 0
##$PPIPTYP= 0
##$PPMPNUM= 2147483647
##$PPRESOL= 1
##$PSCAL= 4
##$PSIGN= 0
##$PYNMP= <proc.py>
##$REVERSE= no
##$SF= 400.02
##$SI= 32768
##$SIGF1= 0
##$SIGF2= 0
##$SINO= 400
##$SIOLD= 32768
##$SPECTYP= <>
##$SREGLST= <1H.CDCl3>
##$SSB= 0
##$STSI= 32768
##$STSR= 0
##$SW_p= 8223.68421052631
##$SYMM= 0
##$S_DEV= 0
##$TDeff= 65536
##$TDoff= 0
##$TI= <>
##$TILT= no
##$TM1= 0
##$TM2= 0
##$TOPLEV= 0
##$USERP1= <user>
##$USERP2= <user>
##$USERP3= <user>
##$USERP4= <user>
##$USERP5= <user>
##$WDW= 1
##$XDIM= 32768
##$YMAX_p= 457433373
##$YMIN_p= -822093
##$CURPLOT= <Network HP LaserJet P1505>
##$CURPRIN= <$Network HP LaserJet P1505>
##$DFORMAT= <normdp>
##$LAYOUT= <+/1D_H.xwp>
##$LFORMAT= <normlp>
##$PFORMAT= <normpl>
##$SURQMSG= 1
$$ End of Bruker specific parameters
$$ ---------------------------------
##NTUPLES= NMR SPECTRUM
##VAR_NAME=  FREQUENCY,     SPECTRUM/REAL,   SPECTRUM/IMAG
##SYMBOL=    X,             R,               I
##VAR_TYPE=  INDEPENDENT,   DEPENDENT,       DEPENDENT
##VAR_FORM=  AFFN,          ASDF,            ASDF
##VAR_DIM=   32768,         32768,           32768
##UNITS=     HZ,            ARBITRARY UNITS, ARBITRARY UNITS
##FACTOR=    0.250966925370066, 1,           1
##FIRST=     8223.43324360094, 27549,        -172108
##LAST=      0,             23028,           -191497
##MIN=       0,             -822093,         0
##MAX=       8223.43324360094, 457433373,    0
$$ Real data points
##PAGE= N=1
##DATA TABLE= (X++(R..R)), XYDATA
$$ [...]
19560I4119e8144G1316b14026c9894J209j37106F5309J86603a74777g3565j68952
$$ 94119 -58144 71316 -214026 -39894 -38685 -175791 65309 251912 -174777 -73565 -242517
19549b42517b5790q7551m0522j89780d7013F1594c6025j66090H3842d43038J01751
$$ -242517 -25790 -113341 -153863 -343643 -47013 61594 -36025 -202115 83842 -443038 -341287
19538c41287a02794j05609A97857d7087B96707b51438j2249B79707A24394k029
$$ -341287 -102794 -208403 197857 -47087 296707 -251438 -263687 279707 124394 122365
19528A22365b44954k0763h7077L8417j49857j37215A98361b76500F67b37238g7628
$$ 122365 -244954 -265717 -87077 -48660 -198517 -335732 198361 -276500 667 -237238 -77628
19516A5519J98831A9141L86837F3947K35323c34770e0519k0821C05659a05717
$$ 15519 214350 19141 405978 63947 299270 -334770 -50519 -71340 305659 -105717
19505A53626o5978P0916K4786a27381A10146d544k1844A36092j4663g6915k26189
$$ 153626 87648 158564 183350 -127381 110146 -4544 -26388 136092 121429 -76915 -303104
19494c03104D4668a02801j7015o4275b3611j86578A82187m3711E9445L3645L066
$$ -303104 44668 -102801 -119816 -184091 -23611 -210189 182187 138476 59445 93090 96156
19483I6156a39973a9833k3085j24333b0628p6007F6574J56234A6454a2619r7941
$$ 96156 -139973 -19833 -42918 -167251 -20628 -96635 66574 222808 16454 -12619 -110560
19472a10560D6886a9242p2890j87356B15629a97381b1942j62796K6490l9055i2796
$$ -110560 46886 -19242 -92132 -279488 215629 -197381 -21942 -184738 -158248 -197303 -92796
19460D2823a41975d5308n8027a8590j52819k38339a2038j35066A65365f5618a1486
$$ 42823 -141975 -45308 -103335 -18590 -171409 -409748 -12038 -147104 165365 -65618 -11486
19448C6524p598b55387M1980H1681a68099m4220C8992J39512g9962q5032l3824
$$ 36524 28926 -255387 -213407 81681 -168099 -212319 38992 178504 -79962 -164994 -198818
19437a98818o5690h2000A02363J19290m2240a07633L385n4756j27313J23935m8623
$$ -198818 -264508 -82000 102363 221653 179413 -107633 -104248 -159004 -286317 -162382 -211005
19426b11005b7854j25461G3413a64424A37513C1428L7833b02357o4995a08975
$$ -211005 -27854 -153315 73413 -164424 137513 31428 69261 -202357 -267352 -108975
19415a50162A87625n1892a77137d7964j18105E2608c16237J43150M2051A95315
$$ -150162 187625 135733 -177137 -47964 -166069 52608 -316237 -173087 -131036 195315
19404E6032d3635n7978k33326c064D38499C2230J7027k1227a02013q9958k0493
$$ 56032 -43635 -101613 -334939 -3064 438499 32230 49257 28030 -102013 -191971 -212464
19393b12464A70782a50490k13811c5891j23283j2372N3181F6962b51685g1712
$$ -212464 170782 -150490 -364301 -35891 -159174 -171546 -118365 66962 -251685 -71712
19382A83515b41754Q1642D0363b29797J4814q2193C48874a80822B4170P3590b04356
$$ 183515 -241754 -160112 40363 -229797 -214983 -297176 348874 -180822 24170 97760 -204356
19370a08314B9287a16073A22126e3025j07231j314j66233j24013A9632J26559
$$ -108314 29287 -116073 122126 -53025 -160256 -161570 -327803 -451816 19632 146191
19360A46191b00119k7784J6680R9444A7672a51561n1202i0183j21787b5383E6197
$$ 146191 -200119 -227903 -211223 -111779 17672 -151561 -202763 -90183 -211970 -25383 56197
19348D9307a07526A73949b96224M6002j09626J33136P0430E2401L5196a39632
$$ 49307 -107526 173949 -296224 -250222 -359848 -226712 -156282 52401 87597 -139632
19337A7414a82925N2596o7659R5400A9027b69228J1370J19537f8139I8279M9047
$$ 17414 -182925 -130329 -197988 -102588 19027 -269228 -257858 -138321 -68139 98279 147326
19326A47326A8827h028r2057d6907j64742o3298D8655a64857G2740G641a67011
$$ 147326 18827 -8028 -100085 -46907 -211649 -274947 48655 -164857 72740 7641 -167011
19314B71785H4184j1551d8886K9A76130b2448A07101b00112B4209i4822G2899
$$ 271785 84184 72633 -48886 -48857 176130 -22448 107101 -200112 24209 -94822 72899
19302B28066j00642b7759p9485A56221N1190h9157j7790b6494k26219R8653a4616
$$ 228066 127424 -27759 -107244 156221 207411 -89157 -106947 -26494 -252713 -154060 -14616
19290a3453q8036A0381M8870a85900j3953O4647e1842H2767e7617B1583a58524
$$ -13453 -101489 10381 59251 -185900 -199853 -135206 -51842 82767 -57617 21583 -158524
19278B6332a65994l5919b9517k6701F1312a96712B14992B8331L0452b21969b6118
$$ 26332 -165994 -201913 -29517 -56218 61312 -196712 214992 28331 58783 -221969 -26118
19266a09287B55158d42743a1891q5558I8730c13883b5238l07768G1296a63979
$$ -109287 255158 -442743 -11891 -97449 98730 -313883 -25238 -333006 71296 -163979
19255c24666I0288a49876K3454k54457i5115H5227P4092a45115c6867a4252C00662
$$ -324666 90288 -149876 -126422 -380879 -95115 85227 159319 -145115 -36867 -14252 300662
19243H4725N8318A4676a94435f7109B70684g8538I6555a92609c6885J6460l06650
$$ 84725 143043 14676 -194435 -67109 270684 -78538 96555 -192609 -36885 -20425 -327075
19232c27075D7385g7549c8011k51355J358e8366o2988B35135a58716H765d60267
$$ -327075 47385 -77549 -38011 -289366 -288008 -58366 -121354 235135 -158716 8765 -460267
19220c55199a31470A96180F8006J72406I3731C2401J19201a21647c7486k68638
$$ -355199 -131470 196180 68006 240412 93731 32401 151602 -121647 -37486 -306124
19210c06124G3029L43479i3508L1498j78243a05641B5475a85076C52193b40095
$$ -306124 73029 416508 -93508 -62010 -240253 -105641 25475 -185076 352193 -240095
19199g6528F2282J96256a68882o16O4434j01876H7127L5267f9381a8373A07023
$$ -76528 62282 258538 -168882 -169498 -105064 -206940 87127 122394 -69381 -18373 107023
19187a69703n3326A29884h9859q2652b7306H8526K54270F0759j6042a71960A85663
$$ -169703 -223029 129884 -89859 -172511 -27306 88526 342796 60759 44717 -171960 185663
19175d60134d3604A09496p780a2430k1571q252l61511a81043A27004K7425a02595
$$ -460134 -43604 109496 101716 -12430 -34001 -42253 -403764 -181043 127004 154429 -102595
19163C2441c05918Q545C397a37454j9995k1607n9331d023k25831Q2538H1262J07186
$$ 32441 -305918 -297373 3397 -137454 -157449 -179056 -238387 -4023 -229854 -147316 81262 188448
19151A88448o6793E489c8449j84500I5964q429i0250j6655M2504G9726N7832b49
$$ 188448 121655 5489 -38449 -222949 95964 87535 -90250 -106905 -64401 79726 137558 -249
19138b14464l5460R9532j28827A32567b19977B53770a60942k3492A53799c25298
$$ -214464 -249924 -150392 -279219 132567 -219977 253770 -160942 -184434 153799 -325298
19127g7671K8328j4974r9522l23800A0028f8631A66016B1447c90212R3568B17296
$$ -77671 -49343 -64317 -163839 -487639 10028 -68631 166016 21447 -390212 -296644 217296
19115G2054f3849E6435j8470J00236a67153A11651b94767D325L514a14205p07888
$$ 72054 -63849 56435 37965 138201 -167153 111651 -294767 4325 7839 -114205 -822093
19104h22093f6029a6096C2307K61924a27322j09920a14844B63283H6116c6282
$$ -822093 -66029 -16096 32307 294231 -127322 -237242 -114844 263283 86116 -36282
19093I658a2900k90011A5958c6898C4979d00370a58044g0100A16521K76987A35793
$$ 9658 -12900 -302911 15958 -36898 34979 -400370 -158044 -70100 116521 393508 135793
19081c3893B71934a01228p8802f7132P049A17622D4143J77852l0968a64958A90182
$$ -33893 271934 -101228 -180030 -67132 -60083 117622 44143 221995 191027 -164958 190182
19069g9841D05550A43486a51037D346J16154h162o7704j26848b6014A12618g6127
$$ -79841 405550 143486 -151037 4346 120500 -8162 -75866 -202714 -26014 112618 -76127
19057i7553m5414N9256L1869j44635Q7503r942k49100J21484A0565c3352J4850
$$ -97553 -142967 -83711 -51842 -196477 -108974 -118916 -368016 -246532 10565 -33352 -18502
19046a8502k39153B02342M17906c8423p6745L7886I1480b80046J31200b8549j2560
$$ -18502 -257655 202342 620248 -38423 -115168 -77282 91480 -280046 -148846 -28549 -41109
19035d1109C03807c36245a6506G9450K38082d67816d1444F9652M9105a87217d475
$$ -41109 303807 -336245 -16506 79450 317532 -467816 -41444 69652 118757 -187217 -4475
19023g1719B35968I4045b4602H9341L2225e8466b8097q0973C06157a03853E0343
$$ -71719 235968 94045 -24602 89341 121566 -58466 -28097 -109070 306157 -103853 50343
19011B1283a55803j4537d9992j37329a6368I4503c1305G8112d31944D1019c182
$$ 21283 -155803 -170340 -49992 -187321 -16368 94503 -31305 78112 -431944 41019 -3182
18999b42780e9454K6756A5791g6865j7817J5089L8541A7591a87919K5293l3688
$$ -242780 -59454 -32698 15791 -76865 -94682 -79593 -41052 17591 -187919 -162626 -196314
18988a96314A34158f28506A40331R9790a92426M5086j5141A9540c4445j06057
$$ -196314 134158 -628506 140331 240121 -192426 -147340 -162481 19540 -34445 -140502
18978a40502j59342a27136A28864a63576R149k00998a29095k12517J36467h9604
$$ -140502 -299844 -127136 128864 -163576 -154427 -355425 -129095 -341612 -205145 -89604
18967C5306b7135j5265K0001j98303a9920j0481K213D06698b35053a08953r001
$$ 35306 -27135 -42400 -22399 -220702 -19920 -30401 -28188 406698 -235053 -108953 -117954
18956a17954k40512a5638k42963R0829A32358C6256c17458P7869J16135A63973
$$ -117954 -358466 -15638 -258601 -167772 132358 36256 -317458 -239589 -123454 163973
18945A19470k7470a25566B6628O1188J73700n3911h2353J3547C5147J70625d9436
$$ 119470 92000 -125566 26628 87816 261516 207605 -82353 -68806 35147 205772 -49436
18933c72894g4524B57627a41707A62384f5796D1647a44542L9291j99923A21800
$$ -372894 -74524 257627 -141707 162384 -65796 41647 -144542 -105251 -305174 121800
18922I9060c31566H7700J47696A3459a63499a0646A27129a22098H9645K50945
$$ 99060 -331566 87700 235396 13459 -163499 -10646 127129 -122098 89645 340590
18912C40590A09f9848l0245a0904j15069j39678I2048a11012A0269b14911H2231
$$ 340590 109 -69848 -100093 -10904 -125973 -265651 92048 -111012 10269 -214911 82231
18900a83178k88724a14875E8793K46205j30884b36176g2787K2929D2405a24511
$$ -183178 -471902 -114875 58793 304998 174114 -236176 -72787 -49858 42405 -124511
18889A35526a54174B1527J70847B7911J00134a04630j35102a9899k40557e3066
$$ 135526 -154174 21527 192374 27911 128045 -104630 -239732 -19899 -260456 -53066
18878b21670B7460c6304o8739F4211b2230q5950H9179f2525o7135A60266F9364
$$ -221670 27460 -36304 -105043 64211 -22230 -108180 89179 -62525 -129660 160266 69364
18866a34960c3743k24791A30689D3431a4685j27667A76238e3476a1466o8757A1827
$$ -134960 -33743 -258534 130689 43431 -14685 -142352 176238 -53476 -11466 -80223 11827
18854H082a18312k77537I752f623j0738B12914b79958A65477a03700D3016a04422
$$ 8082 -118312 -395849 9752 -6623 -17361 212914 -279958 165477 -103700 43016 -104422
18842i19k35046B78387B9721j570c25811c3163E6306a83780B34507a23212p193
$$ -919 -235965 278387 29721 28151 -325811 -33163 56306 -183780 234507 -123212 -130405
18831a30405g741C4059a74140A58868c75048a19890c05A17147A1733c48052J07544
$$ -130405 -7741 34059 -174140 158868 -375048 -119890 -305 117147 11733 -348052 -240508
18820b40508b135j69384g3181f552j93510p4567G5244Q9233n9692M6481Q3153
$$ -240508 -2135 -171519 -73181 -6552 -200062 -274629 75244 164477 104785 151266 234419
18809B34419J91485a93691g459n3224F0974b4637C28297C0505K09628B4266b08056
$$ 234419 425904 -193691 -7459 -60683 60974 -24637 328297 30505 240133 24266 -208056
18797c41l72365C2130b11207B44606a02345B23592A02481K4315D3256d50941a47309
$$ -341 -372706 32130 -211207 244606 -102345 223592 102481 126796 43256 -450941 -147309
18785d8487q7808a9217D4639a36116k6693k82105F1060d1465j56085C19720a52894
$$ -48487 -136295 -19217 44639 -136116 -162809 -444914 61060 -41465 -197550 319720 -152894
18773a59704o4568L4181B78486h5804A48853c00202a05594A83139a53431C3769
$$ -159704 -224272 -190091 278486 -85804 148853 -300202 -105594 183139 -153431 33769
18762d53992C29540b28197C97802c3837a0046j74769C34317j64707F0639C244
$$ -453992 329540 -228197 397802 -33837 -10046 -184815 334317 169610 60639 3244
18751a0304k8846l6795m01524e0472p6359A66911h2759j87488j42496d9860C3020
$$ -10304 -39150 -75945 -477469 -50472 -126831 166911 -82759 -270247 -412743 -49860 33020
18739B7713e294A68575a8210k58486A95778c16991h5194j88083a22510B11477
$$ 27713 -5294 168575 -18210 -276696 195778 -316991 -85194 -273277 -122510 211477
18728a60775m1496f6388O992j36608o8035J24171B1076M4396b33787M6348j4234
$$ -160775 -202271 -66388 -59396 -196004 -264039 -139868 21076 65472 -233787 -187439 -201673
18717b01673N4567d413A85380a62588A35820b14879E8872P2516a91309M9112A53982
$$ -201673 -147106 -4413 185380 -162588 135820 -214879 58872 131388 -191309 -142197 153982
18705b82185E5898k7181b35126C17758a27284a2641A14028I62b69388Q6955A81927
$$ -282185 55898 28717 -235126 317758 -127284 -12641 114028 962 -269388 -182433 181927
18693a14669o5977B08383b413D462c00202a33196C2807K03882a3321D9547L6558
$$ -114669 -180646 208383 -2413 4462 -300202 -133196 32807 236689 -13321 49547 86105
18682H6105l9721J2248b62023a0896r0703C0853O614J59298b38845B3872g6578
$$ 86105 46384 58632 -262023 -10896 -101599 30853 37467 196765 -238845 23872 -76578
18670h2409p9046C2922g239l9442k95165d328o0851A05819n2388b47198P1540
$$ -82409 -161455 32922 -7239 -46681 -341846 -4328 -65179 105819 53431 -247198 -175658
18659a75658e6993l3945c4841B51463H288b67184B4048c94852a14776M7745a5680
$$ -175658 -56993 -90938 -34841 251463 8288 -267184 24048 -394852 -114776 -67031 -15680
18647b36051j29944O4547M8793c5132A24160l1421J63520e3166k67854a40431
$$ -236051 -365995 -301448 -252655 -35132 124160 92739 256259 -53166 -321020 -140431
18636f6300F7252j1742M923a9863j56344D8844k3016a50023j97661Q0633K8783
$$ -66300 67252 55510 60433 -19863 -176207 48844 25828 -150023 -347684 -267051 -238268
18625b38268B3488K9945P3037B946K18102b06160R0196j1486A09591c46635a23918
$$ -238268 23488 53433 126470 2946 221048 -206160 -115964 -127450 109591 -346635 -123918
18613A94936e2631j04481a8995j05621E7730b94694C8331e8483a3445j38655e8069
$$ 194936 -52631 -157112 -18995 -124616 57730 -294694 38331 -58483 -13445 -152100 -58069
18601B38726d1668P597A10081A3435K5352a71145C7088b38654N7107c7056k02996
$$ 238726 -41668 -34071 110081 13435 38787 -171145 37088 -238654 -181547 -37056 -240052
18590b40052a2148j53013j85320A66569d7276B2023b45342k3869O9463A30679
$$ -240052 -12148 -165161 -350481 166569 -47276 22023 -245342 -269211 -199748 130679
18579b18485h1933j75677a461j75938f5598B68095I199K2811e9613n9883r3885
$$ -218485 -81933 -257610 -1461 -177399 -65598 268095 9199 32010 -59613 -119496 -213381
18568b13381A26450D9977a85748K9745k35995g5229o5584d7772F5182B6037a2324
$$ -213381 126450 49977 -185748 -156003 -391998 -75229 -140813 -47772 65182 26037 -12324
18556A61345B3859K08150b2419F4076l0733a42816A9156a122k52409F06874G9247
$$ 161345 23859 232009 -22419 64076 33343 -142816 19156 -1122 -253531 606874 79247
18544A35040b12180B07008h1805C4837c37305F9570e1960f301l29393n2366J01826
$$ 135040 -212180 207008 -81805 34837 -337305 69570 -51960 -6301 -335694 -388060 -286234
18533b86234a38678O5229r0607K2681I3898a64192F5243a51777g1734c3191j85094
$$ -286234 -138678 -73449 -164056 -141375 93898 -164192 65243 -151777 -71734 -33191 -218285
18522b18285b6586A23946c1408p2817m1079k3809c5873J281j39478j14970F9462
$$ -218285 -26586 123946 -31408 -104225 -145304 -169113 -35873 -34592 -174070 -289040 69462
18510A80729d38761A36978a03174A08757h9504c9163j09305A46045f7561A8547
$$ 180729 -438761 136978 -103174 108757 -89504 -39163 -148468 146045 -67561 18547
18499d9669j62813C47204j2918b75726k36839F3356c04198K0133A12249B6296
$$ -49669 -212482 347204 334286 -275726 -512565 63356 -304198 -284065 112249 26296
18488b07963d0911B4822m750a62885A0435c94143a19216B88336g662B07754C1473
$$ -207963 -40911 24822 20072 -162885 10435 -394143 -119216 288336 -7662 207754 31473
18476a73350d9426j70203B87839g4537D016K47321k5391f7904L0807F803f5120
$$ -173350 -49426 -219629 287839 -74537 4016 251337 225946 -67904 -37097 6803 -65120
18464a3513j45424H2981a71170A9212a09026b0368k17059A50895e394j73593h9225
$$ -13513 -158937 82981 -171170 19212 -109026 -20368 -237427 150895 -5394 -178987 -89225
18452a2447C2773K83290A52136m0230a02147q7467Q8293d7954k993q0295b2758
$$ -12447 32773 316063 152136 111906 -102147 -189614 -101321 -47954 -50947 -131242 -22758
18440A99013a42278e2704G9587B5232J1415b76076j7558A34322l073g2116B8078
$$ 199013 -142278 -52704 79587 25232 36647 -276076 -293634 134322 131249 -72116 28078
18428a88081f4644B12753i042l01765J09714n6606C7569K99934b80068e1609A32970
$$ -188081 -64644 212753 -9042 -310807 -201093 -257699 37569 337503 -280068 -51609 132970
18416B40475H8467P7836a52784A64886l6665b7761A74455a76036F6736M8315f0520
$$ 240475 88467 166303 -152784 164886 128221 -27761 174455 -176036 66736 115051 -60520
18404a3048b544B4945i1322D1651J53439p2968a21244k00360J52338B10437a65442
$$ -13048 -2544 24945 -91322 41651 195090 122122 -121244 -321604 -169266 210437 -165442
18392h7197o4285G1502a51960A0217L9208L4953g1864m9437e6122l46840A44458
$$ -87197 -151482 71502 -151960 10217 49425 84378 -71864 -121301 -56122 -402962 144458
18380B6669b10807F5203O0072b58692A13333J21402f3033k1261n3573F5546a33491
$$ 26669 -210807 65203 125275 -258692 113333 234735 -63033 -84294 -137867 65546 -133491
18368I2444c74976c3811A7967K35749A03670b48799A54882a34692c6966a8105
$$ 92444 -374976 -33811 17967 253716 103670 -248799 154882 -134692 -36966 -18105
18357a04863E3283Q5938a09765B06446b13894j89584e6094r7931E1476a62642
$$ -104863 53283 139221 -109765 206446 -213894 -403478 -56094 -154025 51476 -162642
18346B996g4744A23229J77776j40479E286J60136e2299A34188c28828g9184A45063
$$ 2996 -74744 123229 301005 160526 5286 165422 -52299 134188 -328828 -79184 145063
18334G5591b3691k54929B36087b12588Q4098D59364i6571A10757b95193f3327
$$ 75591 -23691 -278620 236087 -212588 -128490 459364 -96571 110757 -295193 -63327
18323a60799j09577p223G2374C2743J04121k2428b62356f4687j28814e7058j77248
$$ -160799 -270376 -277599 72374 32743 136864 114436 -262356 -64687 -193501 -57058 -234306
18312b34306c4266k35995P9899P4269A34491B6881h4593p899k97489g0969I293
$$ -234306 -34266 -270261 -190362 -116093 134491 26881 -84593 -92492 -389981 -70969 9293
18300A51613A1864c64067C4718L98596h2229K4450j49534B9767d33876a51311
$$ 151613 11864 -364067 34718 433314 -82229 -57779 -207313 29767 -433876 -151311
18289A16772c43751d3744A41142a12979A35642a78528p8432F5636A987J18744
$$ 116772 -343751 -43744 141142 -112979 135642 -178528 -256960 65636 1987 120731
18279A20731J6951J3461A5243g7863l3108k08791H0378a29431b4616m2049c1903
$$ 120731 137682 151143 15243 -77863 -110971 -319762 80378 -129431 -24616 -66665 -31903
18267A79578H0049h4123P103b3493r1745l2160A7683b21094Q1853r1206m1831
$$ 179578 80049 -84123 -77020 -23493 -115238 -147398 17683 -221094 -139241 -230447 -272278
18256b72278A13626l2672A2459g2371l91107A53508a77550C590c8342M023j72700
$$ -272278 113626 80954 12459 -72371 -463478 153508 -177550 3590 -38342 -34319 -207019
18245b07019q0034C3491a58498B23004r8581K02231a73098G0639b8413n8009N426
$$ -207019 -287053 33491 -158498 223004 124423 326654 -173098 70639 -28413 -86422 -80996
18234h0996j1778E3963a69460H2501a26124A33548b21040A53048a75796k12509
$$ -80996 -92774 53963 -169460 82501 -126124 133548 -221040 153048 -175796 -388305
18224c88305A81751a15067G7785M6433b06487G272M7645a65271C8171l096M6343
$$ -388305 181751 -115067 77785 124218 -206487 7272 54917 -165271 38171 35075 81418
18213H1418N4856d21947F5983a25724N1637o3931J0220A53351J36987H095a41541
$$ 81418 136274 -421947 65983 -125724 -74087 -138018 -127798 153351 290338 8095 -141541
18201b90696B9670A0538Q090a10399j93238B54701a11382A38655M646d6922B2014
$$ -290696 29670 10538 18628 -110399 -303637 254701 -111382 138655 143301 -46922 22014
18189a91465b0543F6840b24105g9519q7649N2214l8680P0969B62228D3687c23032
$$ -191465 -20543 66840 -224105 -79519 -167168 -114954 -153634 -82665 262228 43687 -323032
18177c24496c4813B30084a69861B63669a52632j90148a63023j1119f368r4273
$$ -324496 -34813 230084 -169861 263669 -152632 -342780 -163023 -174142 -6368 -100641
18167a00641B34019l0631d9583A5725R8633A0982a09972F3050P415c57660K8602
$$ -100641 234019 203388 -49583 15725 114358 10982 -109972 63050 70465 -357660 -329058
18156c29058j13194A5844a17244J2939B0696d1065B16618r4854D532J58561b56391
$$ -329058 -442252 15844 -117244 -104305 20696 -41065 216618 121764 4532 163093 -256391
18144h7067j87167B76358a6275r4730E1369K70550a91713a0065D260O8313g613
$$ -87067 -274234 276358 -16275 -111005 51369 321919 -191713 -10065 4260 72573 -7613
18132b53455b3339j51830A73092a46963K7669A96629h9235D0009a89465I0931
$$ -253455 -23339 -175169 173092 -146963 -119294 196629 -89235 40009 -189465 90931
18121I58N4980f3663A75938b4651A91539b15350k2053C83550I1650k4469c54564
$$ 958 55938 -63663 175938 -24651 191539 -215350 -237403 383550 91650 67181 -354564
18109a37515a0568k4054I0369J5161c70505c5312h914B73416a08985A28677J2399
$$ -137515 -10568 -34622 90369 105530 -370505 -35312 -8914 273416 -108985 128677 141076
18098A41076b730k4322E5610K68150a41227a7531A33040d2949l5333C01088a7354
$$ 141076 -2730 -27052 55610 323760 -141227 -17531 133040 -42949 -78282 301088 -17354
18086A20401b61533E6658c13890B90812a87254L4780A6014a68598J7474m8192
$$ 120401 -261533 56658 -313890 290812 -187254 -152474 16014 -168598 -151124 -199316
18076a99316m5993B5453b84070A10054e4084j77903A56090a51123K3898C1236
$$ -199316 -245309 25453 -284070 110054 -54084 -231987 156090 -151123 -127225 31236
18065h099A4931e3224a1616A10627P078b8555k14357e4786H1528b61662J06481
$$ -8099 14931 -53224 -11616 110627 117705 -28555 -242912 -54786 81528 -261662 -155181
18054a55181D55589i6369l7932A85802a48953H4329G483L3603b06226F4078d27829
$$ -155181 455589 -96369 -134301 185802 -148953 84329 7483 41086 -206226 64078 -427829
18042a70739k897A30680a93434O0919H9189a23920k6625G3453h2854b0884b588
$$ -170739 -173636 130680 -193434 -132515 89189 -123920 -150545 73453 -82854 -20884 -2588
18030c0990J4401k14281F705b640B33948O8055a03682A34907C1041Q7905a30575
$$ -30990 -16589 -230870 6705 -2640 233948 302003 -103682 134907 31041 118946 -130575
18018c50513a08946j30577M9421C38561C4233L2673M1760a2916o2718A32242h0772
$$ -350513 -108946 -239523 -190102 338561 34233 66906 108666 -12916 -75634 132242 -80772
18006c80418H3587J69221b04263f3722J9769O159C50178j38530c25096E9244M4882
$$ -380418 83587 252808 -204263 -63722 -43953 -37794 350178 211648 -325096 59244 104126
17995A04126c14398I2047b17568A03891K3138L8467i7804F9827E362J47473b01390
$$ 104126 -314398 92047 -217568 103891 127029 165496 -97804 69827 5362 152835 -201390
17983A58629c4490k49942b7314j99762b4133B08277a59851A52231L4420b29872
$$ 158629 -34490 -284432 -27314 -227076 -24133 208277 -159851 152231 186651 -229872
17972h3505A76954a52119G0458c5676k54504a30271j8584B27496A651a39507N0238
$$ -83505 176954 -152119 70458 -35676 -290180 -130271 -148855 227496 1651 -139507 -89269
17961h9269L2671K0079B0586J49625K5768b58049A0268J92308a0778H4146a2036
$$ -89269 -56598 -36519 20586 170211 195979 -258049 10268 202576 -10778 84146 -12036
17949c6980m08030a5481A18153j9040g4736j97913e7181G1200e0829D29833i8217
$$ -36980 -445010 -15481 118153 99113 -74736 -272649 -57181 71200 -50829 429833 -98217
17937c1657l25993J00829j35058B58874C9994c1265C4009a21477j31991L1786
$$ -31657 -357650 -256821 -391879 258874 39994 -31265 34009 -121477 -253468 -221682
17927b21682H4894b1373C99614A10290d3106A92166q4124D485J03536b31675f6544
$$ -221682 84894 -21373 399614 110290 -43106 192166 108042 4485 108021 -231675 -66544
17915I0540H730a52672A02482C1453c08104A37065E4122N694J61690H0758L6450
$$ 90540 8730 -152672 102482 31453 -308104 137065 54122 59816 221506 80758 117208
17904A17208i0640q1227d8786J9578A55378J37008h4077j40579K5979F3921i3363
$$ 117208 -90640 -171867 -48786 -29208 155378 292386 -84077 -224656 -198677 63921 -93363
17892E6749c7460A94902c2776A30175f6980j09892Q2037F3494b70945A28431b17105
$$ 56749 -37460 194902 -32776 130175 -66980 -176872 -94835 63494 -270945 128431 -217105
17880a16833M0000a7765A14708b10757A92263b21192I8167b4283j32857q3181
$$ -116833 -76833 -17765 114708 -210757 192263 -221192 98167 -24283 -157140 -240321
17870b40321R0131e4014k27888B75304A15463a04444B51282a39781l1910a86A15069
$$ -240321 -150190 -54014 -281902 275304 115463 -104444 251282 -139781 -171691 -186 115069
17858c21866f4561n0183A02526a43255F7798d0351k3155k7245A94783a87830Q9640
$$ -321866 -64561 -114744 102526 -143255 67798 -40351 -63506 -90751 194783 -187830 -98190
17847i8190B48504B6230a38313K4577B89846I5368b77483B2551b13135A3247P6858
$$ -98190 248504 26230 -138313 -113736 289846 95368 -277483 22551 -213135 13247 90105
17836I0105N1028L1143a94538B11612a6263A8499K46362a31007f3625j48482G5850
$$ 90105 141133 172276 -194538 211612 -16263 18499 264861 -131007 -63625 -212107 75850
17824c1702r7093C5857a91307J4460Q1727a38n6908o3393N0197F6441d17627e3005
$$ -31702 -128795 35857 -191307 -176847 -95120 -138 -57046 -120439 -70242 66441 -417627 -53005
17811i3332B59396p8181a59827E6404M0404b01004B02937C1143a32536l040C20159
$$ -93332 259396 181215 -159827 56404 96808 -201004 202937 31143 -132536 -135576 320159
17799A44981l7071j8592c21290D5932K90810b00466b6783n04426a47658f4928
$$ 144981 107910 89318 -321290 45932 336742 -200466 -26783 -531209 -147658 -64928
17788a23597I8317O2179D9872R7867e7799M850B4491L79092A0792J44756A210
$$ -123597 98317 160496 49872 147739 -57799 -52949 24491 403583 10792 155548 1210
17776b1281j3378B32495c38625D1165a38902j24260c5131A16255g9974j24625
$$ -21281 -34659 232495 -338625 41165 -138902 -263162 -35131 116255 -79974 -204599
17766b04599m8073A03114E0741M7246m3319b34896n5990A44586b3254l25803B14599
$$ -204599 -252672 103114 50741 97987 54668 -234896 -290886 144586 -23254 -349057 214599
17754b6205B6909b57466A15556K610M5468A9285J5883a2064j23119b054k03410
$$ -26205 26909 -257466 115556 118166 163634 19285 35168 -12064 -135183 -2054 -205464
17743b05464C26262K0278b66320g7091A23382l7005j8203b87556a18209e4283
$$ -205464 326262 346540 -266320 -77091 123382 86377 68174 -287556 -118209 -54283
17732i7377E5222k4108b78070K7574D8662b0160B09446f944q6458D6070b805l43754
$$ -97377 55222 31114 -278070 -250496 48662 -20160 209446 -6944 -93402 46070 -2805 -346559
17720c46559a8631E8276c7432k34778a6563k606j85419a00548L8044F7125j6501
$$ -346559 -18631 58276 -37432 -272210 -16563 -19169 -204588 -100548 -62504 67125 50624
17709E0624J16826G3445K6721O5847G527c960k5618n295A20435a68176n307o421
$$ 50624 167450 73445 100166 166013 7527 -3960 -29578 -34873 120435 -168176 -173483 -179904
17697a79904n3269A53112a10920B05155m7759C7609h6455P46j14896B88182A11723
$$ -179904 -233173 153112 -110920 205155 157396 37609 -86455 -85709 -200605 288182 111723
17685f9462l07880A72617j3884e4913B05814E5665N6617b08483Q1408j59568J8507
$$ -69462 -377342 172617 158733 -54913 205814 55665 112282 -208483 -127075 -286643 -268136
17674b68136C12419P0886b32268A97648G6524K62029A729a66141A58972D796e153
$$ -268136 312419 383305 -232268 197648 76524 338553 1729 -166141 158972 4796 -5153
17662E6609K33697e9576B11529e4646G1618O2594N2280a77003B03767c1079a780
$$ 56609 290306 -59576 211529 -54646 71618 134212 186492 -177003 203767 -31079 -1780
17650a76834A40888Q220a53974c0533k19973B8457L3432n195a8680G1064b8719
$$ -176834 140888 149108 -153974 -30533 -250506 28457 61889 56694 -18680 71064 -28719
17638g214B8333a19368A60865o7446b2551k39898B44358N1186r2586H2412a9939
$$ -7214 28333 -119368 160865 93419 -22551 -262449 244358 295544 202958 82412 -19939
17626B55293p9145b5493p6992B46077B2186c94740i4758F7661a22190I4966b148
$$ 255293 176148 -25493 -102485 246077 22186 -394740 -94758 67661 -122190 94966 -2148
17614I1300e7274A14362J94764a38236A79724J47399b41236D9902P2733a66505
$$ 91300 -57274 114362 309126 -138236 179724 327123 -241236 49902 122635 -166505
17603D39791c58033B74815A29145h1658k1638e1312l7734b7725j31797K0880A0998
$$ 439791 -358033 274815 129145 -81658 -103296 -51312 -89046 -27725 -159522 -138642 10998
17591A26817g5979F6210A953i8757d5265B61938A10137f2675k703A88765D5064
$$ 126817 -75979 66210 1953 -98757 -45265 261938 110137 -62675 -65378 188765 45064
17579a7769B63767A23267f9750j80543e5639j5120I6547a92139L5296c8173B8742
$$ -17769 263767 123267 -69750 -250293 -55639 -70759 96547 -192139 -156843 -38173 28742
17567b56613A2998g2117C1984a34753k3723A2960K99927p3448c44246B77537P7791
$$ -256613 12998 -72117 31984 -134753 -158476 12960 312887 239439 -344246 277537 355328
17556C55328A04035b5825C05971j25149G3380g9856J4845m03210I3296J6205f428
$$ 355328 104035 -25825 305971 180822 73380 -79856 -65011 -468221 93296 109501 -6428
17544a89120c0042m291k30326a08802M5478k350h384A29408a36753e6994A4627
$$ -189120 -30042 -34333 -264659 -108802 -63324 -65674 -8384 129408 -136753 -56994 14627
17532B53262M0527q4456o1302I676K4027b40032A00316D0350K27232b32766E5762
$$ 253262 293789 209333 148031 9676 33703 -240032 100316 40350 267582 -232766 55762
17520A21865c57949d2831A67005b2291n08363B38392h2199m5564A8696J18685
$$ 121865 -357949 -42831 167005 -22291 -530654 238392 -82199 -127763 18696 137381
17510A37381c59617a56349A65954M0048d06414D17185C7927a46134B04381r8109
$$ 137381 -359617 -156349 165954 206002 -406414 417185 37927 -146134 204381 106272
17500A06272J89667d674D6222K22039a35892L8054B48793j0972h9844C88748A87598
$$ 106272 295939 -4674 46222 268261 -135892 -97838 248793 237821 -89844 388748 187598
17488A17136a56964A08554c2667A81910o5998l3782a40800k9035C5904P8507c67346
$$ 117136 -156964 108554 -32667 181910 115912 82130 -140800 -169835 35904 114411 -367346
17476B89677J20296A28957M7192H2717M7057M3477k3606n8240h7452A79673J23935
$$ 289677 409973 128957 176149 82717 129774 173251 149645 91405 -87452 179673 303608
17465C03608c18885D80954J89857k49611A36702J17882Q1111q5970B9224L60909
$$ 303608 -318885 480954 670811 421200 136702 254584 335695 249725 29224 390133
17455C90133j32436q5764Q7923k7773L5873H1544K45981A48928J26452K29741
$$ 390133 257697 171933 259856 232083 267956 81544 327525 148928 275380 505121
17445E05121A14806L1523K09793j61088k1660L29389B51187P523K88185A85348
$$ 505121 114806 146329 356122 195034 173374 502763 251187 258710 546895 185348
17434A30716k6729J38084I7401D0481N2520e0242l5266A58009a6075C56343Q993
$$ 130716 103987 242071 97401 40481 93001 -50242 -85508 158009 -16075 356343 365336
17423C65336a04468D14611A93976K32085D9536J44469j0510F606L08017l0598
$$ 365336 -104468 414611 193976 426061 49536 194005 183495 6606 314623 284025
17413B84025J35703j67862F8325C2006g9536E573J14342J37811L8109j46273K90869
$$ 284025 419728 251866 68325 32006 -79536 5573 119915 257726 295835 149562 440431
17402D40431a1986A60102J78279b8978g926E46999A08565a69231C23987H3012
$$ 440431 -11986 160102 338381 -28978 -7926 546999 108565 -169231 323987 83012
17391c03586B27102a41153F2456J04153i0865a8392L310C46536k2622l8645G7958
$$ -303586 227102 -141153 62456 166609 -90865 -18392 -15082 346536 323914 285269 77958
17379C09649B6884d6471A45764L89005k24355c1039G5649L97656j09521A25148
$$ 309649 26884 -46471 145764 534769 310414 -31039 75649 473305 363784 125148
17368B11122h3169p2073F1899d1444B88416d4459A34642N1788a08339k68450F1886
$$ 211122 -83169 -155242 61899 -41444 288416 -44459 134642 186430 -108339 -376789 61886
17356A33314l0489k3939K53471j34531F9329R2397J20854j37337e3856j69377
$$ 133314 102825 78886 332357 197826 69329 161726 282580 145243 -53856 -223233
17346b23233A31059O4955r5669i4946B4366A1278a33559A33858J79721a74231
$$ -223233 131059 196014 100345 -94946 24366 11278 -133559 133858 313579 -174231
17335D577J71950A1148J52901R6125R8913O0411E0875J1803c9510C06154A47431
$$ 4577 176527 11148 164049 260174 359087 419498 50875 62678 -39510 306154 147431
17323B11606q7987L5509a16756A37900K6639o4889K07759A2620M62527C6958a21890
$$ 211606 123619 159128 -116756 137900 164539 99650 307409 12620 475147 36958 -121890
17311a20702H3715N9226D2399i4163D84396A39577c4751A08599a1150A81986J2561
$$ -120702 83715 142941 42399 -94163 484396 139577 -34751 108599 -11150 181986 194547
17300A94547g1049B42625J3521J67306H0883J08046l8175F2268R2499a62776C1334
$$ 194547 -71049 242625 256146 423452 80883 188929 150754 62268 154767 -162776 31334
17288B74413o7683i4005A83529k6681F9425e0378B03269n2079P7085l4299j015
$$ 274413 206730 -94005 183529 156848 69425 -50378 203269 151190 228275 193976 192961
17277A92961a70098d2982B6441J59837d0302j04218J2878C7073K71548A28391
$$ 192961 -170098 -42982 26441 186278 -40302 -144520 -131642 37073 308621 128391
17266B67526G2207J70930o6816G1006J65068J1918K07570F6406N36132G6277J79641
$$ 267526 72207 243137 176321 71006 236074 247992 455562 66406 602538 76277 255918
17255B55918m7083O1322K68522A74370l2375M47111B20040O8539A42222N7283
$$ 255918 208835 270157 538679 174370 141995 589106 220040 288579 142222 199505
17245A99505k8826J2692Q0415J42089O6658a10989A20977K62136d6467J7134A93365
$$ 199505 170679 183371 263786 405875 472533 -110989 120977 383113 -46467 -29333 193365
17233B94401R1054a8278j17915A94602J2603n5406L7366m1652f3944n0154C04095
$$ 294401 385455 -18278 -136193 194602 207205 151799 189165 147513 -63944 -114098 304095
17221C45592f2190m4621D86771A18519M34345A32762a15088B79953J24899G8059
$$ 345592 -62190 -106811 486771 118519 552864 132762 -115088 279953 404852 78059
17210C38848A22321a36207A69263K07101o8403K67252A08172K04515j23822J82352
$$ 338848 122321 -136207 169263 376364 307961 575213 108172 312687 188865 371217
17200C71217B1967a77660J0105C86330I6449N0737K47017j13570m7934p6967L03578
$$ 371217 21967 -177660 -167555 386330 96449 147186 394203 280633 232699 155732 459310
17189D59310j34608J11734f4406C8097J85849E8672a67595E15296A75836m155
$$ 459310 324702 436436 -64406 38097 223946 58672 -167595 515296 175836 171681
17179A71681l8376o4207K5088K8738J45909n183K7632L68157B04234R974o7921
$$ 171681 133305 69098 94186 122924 268833 263650 291282 659439 204234 214208 146287
17168A46287L9587p7387L69354A55379J71102k5938j08362P7690E761M58960j82825
$$ 146287 185874 108487 477841 155379 326481 300543 192181 269871 5761 464721 281896
17157B81896A21421K61448j03892J05210m3338k1489j19676J08644J04195m9523
$$ 281896 121421 382869 278977 384187 340849 319360 199684 308328 412523 363000
17147C63000D3720M44879A28244c41D47444l5645j77002M0973K84288k44396L0578
$$ 363000 43720 488599 128244 -341 447444 411799 234797 275770 560058 315662 346240
17136C46240a82394D21107n9856j45122N4617K5001p6138L87804B17946j07939
$$ 346240 -182394 421107 361251 216129 270746 295747 219609 607413 217946 110007
17126A10007L15486j19937e8143D73693A1295M44249A03970K20187K33983n4282
$$ 110007 425493 305556 -58143 473693 11295 455544 103970 324157 558140 503858
17116E03858j33133j02617J61236j54598J0676K66699J8530B56368J58753M6664
$$ 503858 370725 268108 429344 274746 285422 552121 570651 256368 415121 461785
17106D61785B12345K59958m8230J05779k2068k07786Q1290P9934j94755c128E79366
$$ 461785 212345 472303 424073 529852 507784 299998 381288 461222 266467 -3128 579366
17094F84302k21668J51775l04727j05150J94568K39753E8805N34293k75554n518
$$ 684302 462634 614409 309682 204532 399100 638853 58805 593098 317544 312026
17084C12026K29158A19826N04583R7k35293N3074j65227J79738L9239j39531A25424
$$ 312026 541184 119826 624409 624506 389213 442287 277060 456798 496037 356506 125424
17072F4592L08561L2738E6636L94810n426L68988B78343J74260Q1181l3275k41374
$$ 64592 373153 405891 56636 451446 446020 815008 278343 452603 533784 500509 259135
17061B59135M28100l00094R2473P3891R7602j81643j21246J45622k09492J22984
$$ 259135 687235 387141 479614 553505 651107 469464 348218 493840 284348 407332
17051D07332K43550J41164j24154q2812n6003Q992M0112H7168M97644L96721D75617
$$ 407332 650882 792046 667892 585080 529077 538069 578181 87168 584812 981533 475617
17039G59255C56205J72515J3901K87676k43691O4723r2743J11072P1815k34112
$$ 759255 356205 528720 542621 830297 586606 651329 558586 669658 741473 507361
17029E07361R1523P7535R6305j69953P1640j76129M46444C40707L57292l32307
$$ 507361 598884 676419 772724 602771 674411 498282 944726 340707 697999 365692
17019C65692L87026C67000J02714m7531Q1325L31971o4574M2755k90613J58072
$$ 365692 752718 367000 469714 422183 503508 835479 770905 813660 523047 681119
17009F81119l20477L28154p841L41423C32851L60291J24804J72772k09026r6100
$$ 681119 360642 688796 680955 1022378 332851 693142 817946 990718 781692 685592
16999F85592K11284j6329J52059k02884l52m53M1175p1319k76591N42021m72326
$$ 685592 896876 880547 1032606 829722 829370 828917 870092 798773 522182 1064203 591877
16988E91877K59885L8525P9634k39978j34718N4423O8846J26897l01177K64328
$$ 591877 851762 890287 969921 729943 595225 649648 718494 845391 544214 808542
16978H08542K07369Q2532l20999J70894l17121L77004k86426J83383k0632j85864
$$ 808542 1015911 1098443 777444 948338 631217 1008221 721795 905178 884546 698682
16968F98682J07613m5929M03164j38769l43017M03030q4694l75800J14125K95483
$$ 698682 806295 760366 1163530 1024761 681744 1084774 1000080 624280 738405 1033888
16958A033888j17265J04466J42425k94249Q6944o9200K06953K83392k43159L498
$$ 1033888 916623 1021089 1163514 869265 956209 887009 1093962 1377354 1134195 1137693
16948A137693J9985n0831Q4370J89035n42365K28769k4856n3770J37638l21948
$$ 1137693 1157678 1106847 1191217 1380252 837887 1066656 1041800 988030 1125668 803720
16938H03720L39658K75278j7279j95985l2329j63502j85294J96981N90255k00670
$$ 803720 1143378 1418656 1401377 1205392 1173063 1009561 824267 1021248 1611503 1410833
16928A410833j06829J94230j85055j23312L6725K8865K62467o9359J45323m4380
$$ 1410833 1304004 1498234 1313179 1189867 1226592 1255457 1517924 1448565 1593888 1549508
16918A549508k64338J39318K8305K57039j53488k74856M5801K84416R4400l28788
$$ 1549508 1285170 1424488 1452793 1709832 1556344 1281488 1327289 1611705 1706105 1377317
16908A377317L55128k369n32679K51414L81103m52101J89045j66651J21471L54185
$$ 1377317 1732445 1730076 1197397 1448811 1829914 1377813 1566858 1400207 1521678 1875863
16898A875863n62450M20459N71038m59425J78645k32806j8009j48491L4943K52463
$$ 1875863 1313413 1733872 2304910 1845485 2024130 1791324 1773315 1624824 1659767 1912230
16888A912230k28811L64590J8126o8559L79085n27457L69555k76144L37328J12194
$$ 1912230 1683419 2048009 2066135 1997576 2376661 1849204 2218759 1942615 2279943 2392137
16878B392137k08626q1236j33304M31012J74572j37235L61389n1867j08845j5179
$$ 2392137 2183511 2102275 1968971 2399983 2574555 2437320 2798709 2746842 2637997 2622818
16868B622818k28770K22260J11664l89395Q40299m30351J10404K30023N1288l26437
$$ 2622818 2394048 2616308 2727972 2338577 3178876 2748525 2858929 3088952 3140240 2813803
16858B813803K27939J01364L06479l67025J85023m62707L57154K50082j1281l21410
$$ 2813803 3041742 3143106 3449585 3082560 3267583 2804876 3162030 3412112 3400831 3079421
16848C079421K15198K06202J74774j65014k1567K48472N0536k5987M40748o9580
$$ 3079421 3294619 3500821 3675595 3510581 3489014 3737486 3788022 3762035 4202783 4133203
16838D133203K06731j47658j26351L55903j86709R2507j88440L12885K1005j4141
$$ 4133203 4339934 4192276 4065925 4421828 4235119 4327626 4139186 4452071 4473076 4458935
16828D458935J74427K35576R5526J59522l21645K93360j10308L29547R6528l00712
$$ 4458935 4633362 4868938 4964464 5123986 4802341 5095701 4985393 5314940 5411468 5110756
16818E110756O26800j82235J48678L06014j19495N81516j30886p580K54299o5708
$$ 5110756 5737556 5555321 5703999 6010013 5890518 6472034 6341148 6333568 6587867 6522159
16808F522159K53296N6812K92336k3019L76507K71825k9497r278L17433K92039
$$ 6522159 6775455 6832267 7124603 7101584 7478091 7749916 7720419 7711141 8028574 8320613
16798H320613K89083R5683K68735o4616K01296M85274o2336K61593L46649M44661
$$ 8320613 8609696 8705379 8974114 8909498 9110794 9596068 9533732 9795325 10141974 10586635
16788A0586635M95068L93213p5314N26588J30391K61852J113348k15482Q71899
$$ 10586635 11081703 11474916 11399602 11926190 12056581 12318433 13431781 13216299 14088198
16779A4088198j44154M67589O38371K17526M69442K76494P28661P01462P24465
$$ 14088198 13944044 14411633 15050004 15267530 15736972 16013466 16742127 17443589 18168054
16770A8168054M72579L91243O87965P01053J104077M23468J172981N49632R32856
$$ 18168054 18640633 19031876 19719841 20420894 21524971 21948439 23121420 23671052 24603908
16761B4603908J096691J085906Q75081J282781J113087J210650J642860J239044
$$ 24603908 25700599 26786505 27661586 28944367 30057454 31268104 32910964 34150008
16753C4150008J861199J486671J208032K220401K228627J970643J958572K429696
$$ 34150008 36011207 37497878 38705910 40926311 43154938 45125581 47084153 49513849
16745D9513849K542453K732563K845900L043258L108056L720941L646694M595150
$$ 49513849 52056302 54788865 57634765 60678023 63786079 67507020 71153714 75748864
16737G5748864L735846N071837M390561M998225N632848N083959O481267O291815
$$ 75748864 79484710 84556547 88947108 93945333 99578181 104662140 111143407 117435222
16729A17435222O001172O586641O466188O844621O685981O057591O275003N275266
$$ 117435222 123436394 130023035 136489223 143333844 150019825 156077416 162352419 167627685
16721A67627685N217206M442856L272405K297153J322660K97459q22365k091700
$$ 167627685 172844891 177287747 180560152 182857305 184179965 184477424 183655059 181563359
16713A81563359l067062l920235m517474n864356n998661o197274o384233o528290
$$ 181563359 178496297 174576062 170058588 164194232 158195571 151998297 145614064 139085774
16705A39085774p172735o415910o772019o756706n633861n954701n499209n383695
$$ 139085774 131913039 125497129 118725110 111968404 106334543 100379842 94880633 89496938
16697H9496938m960986m551812m639718m106518l784764l589165l463356l216253
$$ 89496938 84535952 79984140 75344422 71237904 67453140 63863975 60400619 57184366
16689E7184366k958875k538843k607270k739722j795122k120683k357021j337428
$$ 57184366 54225491 51686648 49079378 46339656 44544534 42423851 40066830 38729402
16681C8729402j893548j877837j631446j398411j471225j003561j478559r85495
$$ 38729402 36835854 34958017 33326571 31928160 30456935 29453374 27974815 26989320
16673B6989320j096697j103382p50469j156630o04312j009004q48413n25403r04981
$$ 26989320 25892623 24789241 24038772 22882142 22277830 21268826 20420413 19895010 18990029
16664A8990029l63882p48520p94580l07220n90460k73650q44097k84805n11714
$$ 18990029 18626147 17877627 17083047 16775827 16185367 15911717 15067620 14782815 14271101
16655A4271101j63353p89523l84706n62180p2555n35334l01079k94192j28668
$$ 14271101 14107748 13318225 12933519 12371339 12298784 11763450 11462371 11168179 11039511
16646A1039511m97568m76820k49738q2916k69090n10601P072m8545j92928j73591
$$ 11039511 10541943 10065123 9815385 9732469 9463379 8952778 8959850 8911305 8718377 8544786
16636H544786n01812l52592K62084l07875k09677o3449j26730o18817j90314J42102
$$ 8544786 8042974 7690382 7952466 7644591 7434914 7371465 7244735 6625918 6435604 6577706
16626F577706l73314P1058j11528k3476j94059j44329m01347o1345P0227j58063
$$ 6577706 6204392 6275450 6163922 6140446 5946387 5802058 5400711 5339366 5409593 5251530
16616E251530k72582j14423J52986J01865p6011n15624p5035J20276k97517K88179
$$ 5251530 4978948 4864525 5017511 5119376 5043365 4527741 4452706 4572982 4275465 4563644
16606D563644j29039j99974l17756l5679J75645l72255J63477j2710j45140M63091
$$ 4563644 4434605 4234631 3916875 3881196 4056841 3684586 3848063 3835353 3690213 4153304
16596D153304m47041P5317l88204J85053P4852k76454k56418j46168R1058k34126
$$ 4153304 3706263 3781580 3393376 3578429 3653281 3376827 3120409 2974241 3065299 2831173
16586B831173K62204k75008J81690L1944l4268n1978j06981L20200m07579j23017
$$ 2831173 3093377 2818369 3000059 3032003 2997735 2945757 2838776 3158976 2751397 2628380
16576B628380m7041j24319J18028j88835J96296k91462j08057M84739j50085j56768
$$ 2628380 2581339 2457020 2575048 2386213 2582509 2291047 2182990 2667729 2517644 2360876
16566B360876k30992o5154R767p5851J31787J08757k13538m1810j75285K91716
$$ 2360876 2129884 2064730 2074497 1998646 2130433 2239190 2025652 1983842 1808557 2100273
16556B100273k64630J37850j72074r1002k4339J76412N9372l24701k0863M8965
$$ 2100273 1835643 1973493 1801419 1710417 1686078 1862490 1921862 1597161 1576298 1625263
16546A625263Q9890Q2991j54369K84218n47588J38766p7901J40597j36971J14020
$$ 1625263 1715153 1798144 1643775 1927993 1380405 1519171 1441270 1581867 1444896 1558916
16536A558916Q1459M485q574j36511l02095N96733j53517k56403m5294m02347
$$ 1558916 1640375 1644860 1636286 1499775 1197680 1794413 1640896 1384493 1339199 936852
16526I36852L26377P3133k17111O77211m37357j20266L42553j35890k1677j74033
$$ 936852 1263229 1336362 1119251 1796462 1359105 1238839 1581392 1445502 1423825 1249792
16516A249792j7313J88786j73734K07812m55814N28161k70905q94Q5313k17364
$$ 1249792 1232479 1421265 1247531 1455343 999529 1527690 1256785 1255891 1341204 1123840
16506A123840p5948Q3525j30722l31128K46899J59193R0125j5789k23157K24922
$$ 1123840 1047892 1131417 1000695 669567 916466 1075659 1165784 1149995 926838 1151760
16496A151760k96036j4055J94846R057O635n0880M7340L294l98209L19857k34949
$$ 1151760 855724 841669 1036515 1045572 1052207 1001327 1048667 1051961 653752 973609 738660
16485G38660N0167J61303q5713q5811J5184N9900n7884N6818M63375o14219J29748
$$ 738660 788827 950130 864417 778606 793790 853690 795806 852624 1315999 701780 831528
16474H31528O8153L5005j48494J99715l34358J85667p0023L1745l10063M60391
$$ 831528 899681 934686 786192 985907 651549 837216 767193 798938 488875 949266
16464I49266k37250j2656J86907k61145J29752J8679K10406D78615M42011k47648
$$ 949266 712016 699360 886267 625122 754874 773553 983959 478615 920626 672978
16454F72978K87400n4620k66427l2678K67188j14205j17666j72068J61698n7713
$$ 672978 960378 905758 639331 606653 873841 759636 641970 469902 631600 573887
16444E73887A60453K51252M52803C14861K33148J89663j58273j18011J72453J3931
$$ 573887 160453 411705 864508 314861 548009 737672 579399 461388 633841 647772
16434F47772k37390Q5453K03787B24610K44468k10093K67131j22160A45795J04086
$$ 647772 410382 495835 699622 224610 469078 258985 526116 403956 145795 249881
16424B49881J77341J68543j65158K53113B78956M84040l18765A49081L57036n7871
$$ 249881 427222 595765 430607 683720 278956 762996 444231 149081 506117 448246
16414D48246K59272j45820L19764l78669M9644k21593K44552j26844N6046J78519
$$ 448246 707518 561698 881462 502793 552437 330844 575396 448552 504598 683117
16404F83117K4069B63469K42383o1953M4182p0492L2496j03052J17603A87809
$$ 683117 707186 263469 505852 443899 488081 417589 450085 347033 464636 187809
16393C56931K08479k14488L14081E0523P30017C68162A78081O7229n9477N6446
$$ 356931 565410 350922 665003 50523 780540 368162 178081 245310 185833 242279
16383B42279r4886K39234J34308O8626k47712K3646J30452j82208J60473k3092
$$ 242279 147393 386627 520935 589561 341849 365495 495947 313739 474212 451120
16373D51120j57524L25862B40049j12338M15309k39711K53099r1511F446N56613
$$ 451120 293596 619458 240049 127711 543020 303309 556408 464897 6446 563059
16363E63059K1184k26125K71753B45819J48003N4811j97433J8216j7390K59590
$$ 563059 584243 358118 629871 245819 393822 448633 251200 269416 252026 511616
16353E11616q5589A42980A8539J07487J63382J79467j16516I7357N6368M2105
$$ 511616 426027 142980 18539 126026 289408 468875 352359 97357 153725 195830
16343A95830K64780a6907E33121J25849k97110j2576j8680M3894F1962J92013
$$ 195830 460610 -16907 533121 658970 361860 349284 330604 374498 61962 253975
16333B53975a8538B31416r8389m1754K26717J22055k15808Q7765A46972K68052
$$ 253975 -18538 231416 133027 91273 317990 440045 224237 312002 146972 415024
16323D15024H5037L81084j23482f4642a6073E3821M13068m1507A71937L06698
$$ 415024 85037 466121 342639 -64642 -16073 53821 466889 425382 171937 478635
16313D78635B18674k366j4161K65442I9079M8761J81316N021E4062L74554A49112
$$ 478635 218674 216308 202147 467589 99079 147840 329156 334177 54062 428616 149112
16301A87813j9126N2667Q4698A20189L89626d2289r2780D05675o3030j50805M3534
$$ 187813 168687 221354 306052 120189 509815 -42289 -135069 405675 342645 191840 235374
16290B35374a54511D95108D2569L79675A99730K88871f3968B25857D0245d1930
$$ 235374 -154511 495108 42569 422244 199730 488601 -63968 225857 40245 -41930
16279B73724D6419M82257A69918N0378J7091B6575O0111k5191b13545B74975B3849
$$ 273724 46419 528676 169918 220296 237387 26575 86686 61495 -213545 274975 23849
16267I9178b95201D96441C3686J87629J2395l3687E8173d2276A68272a16767A61619
$$ 99178 -295201 496441 33686 221315 233710 200023 58173 -42276 168272 -116767 161619
16255A76857K4575J81069A31199K00518G0011K39236M4957E4041Q2062J90884
$$ 176857 201432 382501 131199 331717 70011 309247 354204 54041 136103 326987
16245C26987D1964J33156m9542E6312a68634A55311j8364N9714p9862m0153a17083
$$ 326987 41964 175120 125578 56312 -168634 155311 136947 196661 116799 76646 -117083
16233C8822Q7762c9430A92777b64519A66381j2494a31332f3500B20536a78225
$$ 38822 126584 -39430 192777 -264519 166381 153887 -131332 -63500 220536 -178225
16222G9663P9825n5425a58458l976D8685K2275Q6241h3739C06804a97245B40284
$$ 79663 159488 104063 -158458 -162434 48685 70960 157201 -83739 306804 -197245 240284
16210B20112o5173g5864e160C05861b65610C97619e7328B36137q1069k5711N3974
$$ 220112 154939 -75864 -5160 305861 -265610 397619 -57328 236137 155068 129357 183331
16199A83331q8127a8914A20689B2280K22179A14864K88619b9112B8148f5572I6973
$$ 183331 95204 -18914 120689 22280 244459 114864 403483 -29112 28148 -65572 96973
16187B8737J6163K42317D2920a69998B7183J24037J39194q7264c574k3151l64976
$$ 28737 44900 287217 42920 -169998 27183 151220 290414 203150 -3574 -26725 -391701
16176c91701D9710K17837G6959J02939R4754c7188A54944p2011f5966r7201A11444
$$ -391701 49710 267547 76959 179898 274652 -37188 154944 82933 -65966 -163167 111444
16164A31559C9015e2483j31823A57735l9017a75246n9951C10720g816m3425B44271
$$ 131559 39015 -52483 -184306 157735 118718 -175246 -235197 310720 -7816 -51241 244271
16152B06494d207H9264g2002A48414a70036b9678j26669A21658J32547a9797B64030
$$ 206494 -4207 89264 -72002 148414 -170036 -29678 -156347 121658 254205 -19797 264030
16140c02377I6170c85566a55474f6758J9575E19919a16518p071G4777J86879m5019
$$ -302377 96170 -385566 -155474 -66758 -47183 519919 -116518 -123589 74777 261656 216637
16129B16637D0595L5562a2243B03077G672K50840a17170c4654j57333C31181A6164
$$ 216637 40595 76157 -12243 203077 7672 258512 -117170 -34654 -191987 331181 16164
16117B41153C5078K81249A06347J78925j33732J3990G2796h1103o1222a6284A87978
$$ 241153 35078 316327 106347 285272 151540 165530 72796 -81103 -142325 -16284 187978
16105a85078e1993D3535J0004a01548r081C86626A75136E8725h233B04237b19995
$$ -185078 -51993 43535 53539 -101548 -110629 386626 175136 58725 -8233 204237 -219995
16093B5691K79374c8792a0095A17951J51692c46337C7937L4045J64017a8235A64592
$$ 25691 305065 -38792 -10095 117951 269643 -346337 37937 71982 235999 -18235 164592
16081A34122a81426G4036C2576J88168c06249f5857A05783j2023C0439P3235a75143
$$ 134122 -181426 74036 32576 220744 -306249 -65857 105783 93760 30439 103674 -175143
16069d0860F5993j688f0177j4002E7918k301e3138C59036C9356b24722G1789J81598
$$ -40860 65993 64305 -60177 -74179 57918 55617 -53138 359036 39356 -224722 71789 253387
16057B53387a73200B95342g6886n0648k5740A12303b95994h4711n7995j09455
$$ 253387 -173200 295342 -76886 -127534 -153274 112303 -295994 -84711 -142706 -252161
16047b52161G0421b08691j15024J40728A01931j9589a50642p9111Q031f3907o611
$$ -252161 70421 -208691 -323715 -182987 101931 82342 -150642 -229753 -221722 -63907 -70518
16036g0518l3450m0015j01798A17584B675a21619B8288A1804b88247H8957J40825
$$ -70518 -103968 -143983 -245781 117584 2675 -121619 28288 11804 -288247 88957 229782
16025B29782m6307a12655c4454k20866A10833e7779A15938a05830f187k15357
$$ 229782 183475 -112655 -34454 -255320 110833 -57779 115938 -105830 -6187 -221544
16015b21544i551k25055b7041j35438I254i990A8735L0054M4120h8770C3372K35345
$$ -221544 -9551 -234606 -27041 -162479 9254 -9990 18735 48789 92909 -88770 33372 268717
16003B68717f1653B31984a21533D52531d97759b29656A28160a02593L9032r3285
$$ 268717 -61653 231984 -121533 452531 -497759 -229656 128160 -102593 -63561 -156846
15993a56846F3777a10260G9999b13551i417G6614J03458q4050e5894A07844M00083
$$ -156846 63777 -110260 79999 -213551 -9417 76614 180072 96022 -55894 107844 507927
15982E07927a40988C90065P294b53329A52505d721D154M296K03599c4974j24105
$$ 507927 -140988 390065 397359 -253329 152505 -4721 4154 8450 212049 -34974 -159079
15971a59079I7636C4661a53571n7380Q6437A07961E401c6962G3269g0212k92599
$$ -159079 97636 34661 -153571 -210951 -124514 107961 5401 -36962 73269 -70212 -362811
15960c62811A16915d6148j07133d6934m4372A52521b23880d508C497J5634c44513
$$ -362811 116915 -46148 -153281 -46934 -91306 152521 -223880 -4508 3497 19131 -344513
15948B66713b73704a22930B6122a376l6088l0548b2954j78442A14528a73223i35
$$ 266713 -273704 -122930 26122 -1376 -37464 -68012 -22954 -201396 114528 -173223 -935
15936b50067J800q6752e796A6161g0285A66790a4768B58172D245J42943b16680
$$ -250067 -248267 -335019 -5796 16161 -70285 166790 -14768 258172 4245 147188 -216680
15924b08113E155b66126E9954L4240d3022r1410n0387F9721f8261j04762E561
$$ -208113 5155 -266126 59954 94194 -43022 -134432 -184819 69721 -68261 -173023 5561
15912b52630j2590A40435o8744d5057m0916j84915J4061a21169e0758G8244l225
$$ -252630 -265220 140435 71691 -45057 -85973 -270888 -256827 -121169 -50758 78244 75019
15901G5019Q054b8050k33168B70997e3859F5931K11210c53323f8120a7221B4556
$$ 75019 83073 -28050 -261218 270997 -53859 65931 277141 -353323 -68120 -17221 24556
15889E2804a02423j26346d1250F1221R3059b68346d537E9708f1694B7454b02538
$$ 52804 -102423 -228769 -41250 61221 154280 -268346 -4537 59708 -61694 27454 -202538
15877A40979h1330G7442c1989G624a15407j04702i5527k032L1228K5574A16178
$$ 140979 -81330 77442 -31989 7624 -115407 -220109 -95527 -97559 -66331 -40757 116178
15865G3669R2799a93749A00261J58460i0203A86118b67873N4633A12351c51411
$$ 73669 166468 -193749 100261 258721 -90203 186118 -267873 -213240 112351 -351411
15854A29058i5584j0168j94380e1773G8344G557a27362A97025d88k08516c522
$$ 129058 -95584 -105752 -300132 -51773 78344 7557 -127362 197025 -488 -209004 -3522
15842a58450J772A3576L6438L5479J21456f0672o7149e2849C3866c6287A01676
$$ -158450 -156678 13576 50014 85493 206949 -60672 -127821 -52849 33866 -36287 101676
15830a39104j23838A01726a11596B36449G0669c03996A8984a61765k51715J40551
$$ -139104 -262942 101726 -111596 236449 70669 -303996 18984 -161765 -413480 -272929
15820b72929C04022a78490P0582C53380B2433K14066N877a72363j44218d424i65
$$ -272929 304022 -178490 -107908 353380 22433 236499 242376 -172363 -316581 -4424 -965
15808b64635L5037A00114e5125D2356N0404e5444J4694k27362A3110R7702f820
$$ -264635 -229598 100114 -55125 42356 92760 -55444 -40750 -268112 13110 110812 -6820
15796B37039o4728c1155j10644A53801k3857a04312B6012K374J23679a04411A63926
$$ 237039 172311 -31155 -141799 153801 129944 -104312 26012 28386 152065 -104411 163926
15784C8122K30180k4140a00020k90939H1162a35223A97822c17023i253A32151
$$ 38122 268302 244162 -100020 -390959 81162 -135223 197822 -317023 -9253 132151
15773e922n6114I5540J74d2637l2710l49993A14105e995n831B01301a79499e9601
$$ -5922 -62036 95540 95714 -42637 -75347 -425340 114105 -5995 -11826 201301 -179499 -59601
15760e96361b18614a04867F6303M9595b27408B85933h9494A38346B3654b48819
$$ -596361 -218614 -104867 66303 115898 -227408 285933 -89494 138346 23654 -248819
15749e7112j82721B15161e6810n679C13293B798J0877Q5061M5502p1798b3468
$$ -57112 -239833 215161 -56810 -62489 313293 2798 13675 98736 144238 72440 -23468
15737d7407D68383a46978e8525o7724k10959C0611J60535i8759p0160E2159h3283
$$ -47407 468383 -146978 -58525 -126249 -337208 30611 191146 -98759 -168919 52159 -83283
15725C0232g2362B9346J72671H3042g8600o9914A33867h4429C7934O235d01670
$$ 30232 -72362 29346 202017 83042 -78600 -148514 133867 -84429 37934 44169 -401670
15713a10268j35932l5599E193a54155O8957D5339K13129d05638A44905m5510f8761
$$ -110268 -246200 -281799 5193 -154155 -85198 45339 258468 -405638 144905 99395 -68761
15701b89120a14635B0904b76534d1475l0274D9080b2845j52812O4339B44815A16815
$$ -289120 -114635 20904 -276534 -41475 -71749 49080 -22845 -175657 -111318 244815 116815
15689A47794o168c08696N1411C5561A6976a00960a7220C20097b10528B06264a19885
$$ 147794 141626 -308696 -257285 35561 16976 -100960 -17220 320097 -210528 206264 -119885
15677A79521b70044D8250a34764C7452R983J1901M4417b70302A12919J52756l1978
$$ 179521 -270044 48250 -134764 37452 47435 59336 103753 -270302 112919 265675 233697
15666B33697q3290a41900A18578O9360C6774d5354q2151B40660b24073O7457A8364
$$ 233697 150407 -141900 118578 187938 36774 -45354 -127505 240660 -224073 -156616 18364
15654i5216a8531B53839C9254a97108A50960B4693a96341L7495D0844a65198B9763
$$ -95216 -18531 253839 39254 -197108 150960 24693 -196341 -158846 40844 -165198 29763
15642A09220R7888r4991D043a80634g4914l05159C3482Q82J14535D7501a83443
$$ 109220 207108 112117 4043 -180634 -74914 -380073 33482 34364 148899 47501 -183443
15630a95294F4431L90002P6955B41502I0888b52706l2748I9815a19544e6923I8476
$$ -195294 64431 454433 531388 241502 90888 -252706 -285454 99815 -119544 -56923 98476
15618A21135J38044D7271c50169B46444c0628m7939j69838o5959i8525o8458j77580
$$ 121135 259179 47271 -350169 246444 -30628 -78567 -248405 -314364 -98525 -166983 -344563
15607c44563a03272j93324C82b31512d3011j36837D6998J2337d323j62096e766
$$ -344563 -103272 -296596 382 -231512 -43011 -179848 46998 59335 -4323 -166419 -5766
15595b82262D6965B0578b06767J3039K4814C57322b55552j56357B48975a44369
$$ -282262 46965 20578 -206767 -193728 -168914 357322 -255552 -411909 248975 -144369
15584B49474r9522e4052G2993f1177C1110J39203k0226c14250a06086B67076A8940
$$ 249474 149952 -54052 72993 -61177 31110 170313 150087 -314250 -106086 267076 18940
15572B35249b00023j74209J48087h5354a0260A76792F6886l1607N9763C1502b92788
$$ 235249 -200023 -374232 -226145 -85354 -10260 176792 66886 35279 95042 31502 -292788
15560B82626b05894D13962D7329h3542C9659N4084a25819B51214b70710b3808
$$ 282626 -205894 413962 47329 -83542 39659 93743 -125819 251214 -270710 -23808
15549B5262a58686A89240a38471B75842j30737o0638b67806a10723j8757r8394
$$ 25262 -158686 189240 -138471 275842 145105 84467 -267806 -110723 -129480 -227874
15539b27874J06060r3373k46042H5197O5829b09736D42421h3310G9926f3329D9614
$$ -227874 -121814 -215187 -461229 85197 151026 -209736 442421 -83310 79926 -63329 49614
15527I3806K4728b20910C00082b13798m1458A51664d10194g5668j40404A39366
$$ 93806 118534 -220910 300082 -213798 -255256 151664 -410194 -75668 -216072 139366
15516B61368H9995a13837e3885k35405h4640B66673G8645a65678k12263a13969
$$ 261368 89995 -113837 -53885 -289290 -84640 266673 78645 -165678 -377941 -113969
15505E4005c01779g5493c0069j76002M9430B41928a24864k11161B9984g3285l4402
$$ 54005 -301779 -75493 -30069 -206071 -156641 241928 -124864 -336025 29984 -73285 -107687
15494a07687B6871O2269a10861q7174A92544a43923d966A49599i2574c6933A8190
$$ -107687 26871 89140 -110861 -198035 192544 -143923 -4966 149599 -92574 -36933 18190
15482a35489d7745B13106n5793C5680a61287O3226E8262j8761K25314A11527L9363
$$ -135489 -47745 213106 157313 35680 -161287 -98061 58262 39501 264815 111527 150890
15471A50890a01831B78823q885N7225A04349a21755k25618i5738j91807a07014
$$ 150890 -101831 278823 269938 327163 104349 -121755 -347373 -95738 -287545 -107014
15460I558a11578A60847a5803G2218J72617g1770A45896R6477q9997D9732J27220
$$ 9558 -111578 160847 -15803 72218 244835 -71770 145896 242373 152376 49732 176952
15449A76952q7214a54108a8063L974k2334D4290b27244e736l82499P0517h1922
$$ 176952 89738 -154108 -18063 -14089 -36423 44290 -227244 -5736 -388235 -317718 -81922
15437c1374A76126n7577c55874G8502g560L49H7825J23540C6194m797b19200d3692
$$ -31374 176126 118549 -355874 78502 -7560 -7211 87825 211365 36194 31397 -219200 -43692
15424b16324B37610D9713a18616c7722A39103D241c95558a37219B13813c8910
$$ -216324 237610 49713 -118616 -37722 139103 4241 -395558 -137219 213813 -38910
15413b7417m02538g7007K7072l40871h9394A00122l6312K20336A1414i2014E2082
$$ -27417 -429955 -77007 -49935 -390806 -89394 100122 63810 284146 11414 -92014 52082
15401B68848b32725L222B57655c16189E576J12982a62454g6432l7377M7335D6347
$$ 268848 -232725 -229503 257655 -316189 5576 118558 -162454 -76432 -113809 -66474 46347
15389a13408A78030P3497j14219J58914c3545m1433C2216J56412l9187A6618b79830
$$ -113408 178030 251527 137308 296222 -33545 -74978 32216 188628 149441 16618 -279830
15377F2221h6023B3775N3640a59926A23446h7362j9012A73560n8110d3644A48341
$$ 62221 -86023 23775 77415 -159926 123446 -87362 -106374 173560 115450 -43644 148341
15365h2464d0069B3734a95974E5956N5017k5962M3435b32738P7240c1646o8185
$$ -82464 -40069 23734 -195974 55956 110973 85011 128446 -232738 -155498 -31646 -99831
15354i9831K5842B45463A16698E3470E813J39831G933a92508Q1174l270A55293
$$ -99831 -73989 245463 116698 53470 5813 145644 7933 -192508 -111334 -114604 155293
15342B6046c41109B19354b32471e3405B890M07627J2616D1287a47039A50453d11093
$$ 26046 -341109 219354 -232471 -53405 2890 410517 423133 41287 -147039 150453 -411093
15330a27375k5413r9223j15746g7152H4542a19182A9447J0556J10372J86473c9550
$$ -127375 -152788 -252011 -367757 -77152 84542 -119182 19447 30003 140375 326848 -39550
15318a66599d5945D15840A09922e941A36315A8515b48967C88221a56395C4982
$$ -166599 -45945 415840 109922 -5941 136315 18515 -248967 388221 -156395 34982
15307a48841B8989a72015d4134B26683d3872A49675Q6016g0746H3099b36378k0253
$$ -148841 28989 -172015 -44134 226683 -43872 149675 235691 -70746 83099 -236378 -256631
15296b56631A85974c2516I6998K7090E5001f9776C9582h5457C1963c543A26959
$$ -256631 185974 -32516 96998 124088 55001 -69776 39582 -85457 31963 -3543 126959
15284C8491a4081C5737a13243k69661d1331F4627g9287A97894M0083j08623A972
$$ 38491 -14081 35737 -113243 -382904 -41331 64627 -79287 197894 237977 129354 1972
15272B03319l1378c9825j7468B74038j35366d2448r2883e2264A47324J29629H2991
$$ 203319 171941 -39825 -57293 274038 138672 -42448 -135331 -52264 147324 276953 82991
15260c05830A54061n9115a92116A62676j8584D3286a40050e8115A38855K3595
$$ -305830 154061 94946 -192116 162676 144092 43286 -140050 -58115 138855 162450
15250A62450M8799N33229P79333j53601q3555N92321E87781k53756H2542d1050
$$ 162450 211249 744478 1523811 1370210 1286655 1878976 587781 334025 82542 -41050
15239d9964j79225b5669j71166A50703M593i7423B88132r3130a68325j37643c2665
$$ -49964 -229189 -25669 -196835 150703 155296 -97423 288132 195002 -168325 -305968 -32665
15227a40676A58946p2036J85921j27513j5445J75453d30065C31509b27304B42528
$$ -140676 158946 86910 272831 145318 129873 305326 -430065 331509 -227304 242528
15216A61456J50557j03993H1871f6114I2217Q608c2362C876J74152p9432K57816
$$ 161456 312013 208020 81871 -66114 92217 100825 -32362 3876 178028 98596 356412
15205C56412f983B2305a03264b5676j43593B49475o8488e9904B56926A24239j4536
$$ 356412 -6983 22305 -103264 -25676 -169269 249475 180987 -59904 256926 124239 109703
15194A09703a26734G2996K02457m5142r7271B15J51676a29253A16882O7570o7976
$$ 109703 -126734 72996 275453 230311 133040 215 151891 -129253 116882 184452 116476
15183A16476a30641P654e5591B75401j12604o7129c1942l796B45938c9600H6091
$$ 116476 -130641 -122987 -55591 275401 162797 95668 -31942 -35738 245938 -39600 86091
15171C1119K424J46715a02824A18435D4779a51061C07349A7005J03466R7929B5119
$$ 31119 33543 180258 -102824 118435 44779 -151061 307349 17005 120471 218400 25119
15159a42516D8145A5758K35922j12788a2394d70j58153a259A44084J50592C9965
$$ -142516 48145 15758 251680 138892 -12394 -470 -158623 -1259 144084 294676 39965
15147h3894C0281e6665a6655A41696c00615B43061l242a73458O8105p618A85553
$$ -83894 30281 -56665 -16655 141696 -300615 243061 239819 -173458 -105353 -112971 185553
15135A44937p1150M32749E6391g1761A04156b39684A28013m8078a07259j8773
$$ 144937 73787 506536 56391 -71761 104156 -239684 128013 79935 -107259 -126032
15125a26032B45698b70836N3500E51093A99719d0740I9637C0965a4002H6228b31041
$$ -126032 245698 -270836 -217336 551093 199719 -40740 99637 30965 -14002 86228 -231041
15113B74048l3639A9768K43031A20026l7490B6842J74942B5706L07814g6725C54690
$$ 274048 240409 19768 262799 120026 82536 26842 201784 25706 333520 -76725 354690
15101e390B31847n8480K20141R6017K4946B45653a26518O2063A44358g9315B11360
$$ -5390 231847 173367 393508 489525 514471 245653 -126518 -64455 144358 -79315 211360
15089a38897A49780J60118a34338B43023P9512d18299B1074K34101j17164J53372
$$ -138897 149780 309898 -134338 243023 322535 -418299 21074 255175 138011 291383
15079B91383A23307J57385G8124C4652J55454c23076C63104j27250j3293k4734
$$ 291383 123307 280692 78124 34652 190106 -323076 363104 235854 222561 197827
15069A97827b55024D5146d5921A07902l9621e6993G6815a30376B03701J80340
$$ 197827 -255024 45146 -45921 107902 68281 -56993 76815 -130376 203701 384041
15059C84041A77598l4978D0331o812J11476o7372L31908A41284J34661K2585K5707
$$ 384041 177598 142620 40331 33519 144995 77623 409531 141284 275945 298530 324237
15048C24237m9043j36147J30483l9172b0786B04067M3920A0893C60R8374P0965
$$ 324237 275194 139047 269530 230358 -20786 204067 247987 10893 360 98734 169699
15037A69699o9430j7820J1165m0526k0204J46908Q6180j24235h4072A1314K69693
$$ 169699 100269 82449 93614 53088 32884 179792 265972 141737 -84072 11314 281007
15026B81007a98245A04375C484M7500N2358a35133A42464m7213g3706E34294f3900
$$ 281007 -198245 104375 3484 50984 103342 -135133 142464 95251 -73706 534294 -63900
15014a8472B20836J4895J66610p6607A52322J03699H7451k5353K09093A31298
$$ -18472 220836 235731 402341 325734 152322 256021 87451 62098 271191 131298
15003C99759b00282D69177A28757R2992m9662A5999L20535L40106a68223E3255
$$ 399759 -200282 469177 128757 221749 172087 15999 336534 676640 -168223 53255
14992C39078R4608r1642A07901M11176A67346P6570F9495J5536m0243J19350k4230
$$ 339078 433686 342044 107901 519077 167346 243916 69495 85031 44788 164138 139908
14981A39908m9781a15358b2997E34336k19992N3680k45e9823C60329J12684b6783
$$ 139908 90127 -115358 -22997 534336 314344 368024 367779 -59823 360329 473013 -26783
14969D7949P6466N8469E1694L5526L89258o0313j67775j20915J37631A14112J79642
$$ 47949 124415 182884 51694 87220 476478 416165 248390 127475 265106 114112 293754
14958B93754M89165A8277J21086r327Q0059K64738k10461Q4849A21409O1802K41647
$$ 293754 782919 18277 139363 130036 210095 474833 264372 349221 121409 183211 424858
14947D24858A57659J70886o0874G0842K80114k6317N4157l055o6041q9517K43050
$$ 424858 157659 328545 267671 70842 350956 324639 378796 375741 309700 220183 463233
14936D63233N9242B00858N6869J91258l8340A35143K49538j44461K18578A38019
$$ 463233 522475 200858 257727 448985 410645 135143 384681 240220 458798 138019
14925C12027J74317I6648j5483l17L25107A39253Q2148o0299L07271q9074C9828
$$ 312027 486344 96648 81165 80848 405955 139253 221401 161102 468373 379299 39828
14913C24265j39509J5021b7064A85580n3413l761L6618Q0857K1245J77525K5428
$$ 324265 184756 199777 -27064 185580 132167 128406 165024 245881 267126 444651 470079
14902D70079n5440q3535j32138J9688J86442J16053k33589r8989K27865k4860
$$ 470079 414639 331104 198966 218654 405096 521149 287560 188571 416436 391576
14892C91576L6410H8775Q2698F1432Q2115J01513J59J73102C4026a67686D8487
$$ 391576 427986 88775 171473 61432 143547 245060 245219 418321 34026 -167686 48487
14880B59548K43596r2043L1338j69400N1408K43358k37477N846L16538D9889M80996
$$ 259548 503144 411101 442439 273039 324447 567805 330328 336174 652712 49889 530885
14869E30885k05487N36086B20367Q0426J42909A96836J23457M10758l17307n4844
$$ 530885 325398 861484 220367 300793 443702 196836 320293 731051 413744 358900
14859C58900M5214j10667m9803K64553j62885K8385A20781K59209p37j28074L3647
$$ 358900 404114 293447 243644 508197 345312 373697 120781 379990 379253 251179 284826
14848B84826J39490A95253a6318D85413P600n9620j96083J80055l6808j11654
$$ 284826 424316 195253 -16318 485413 493013 433393 237310 417365 380557 268903
14838B68903A23747J20101G5820N30510m7658J88510B16430M32949l17309j23408
$$ 268903 123747 243848 75820 606330 558672 747182 216430 649379 332070 208662
14828B08662K99333J59445k1655k31584J08091B15627J68993n3545K32667o8827
$$ 208662 507995 667440 645785 414201 522292 215627 384620 331075 563742 494915
14818D94915J21095k77767J6203j69479K99403j3756n0455J71976B73281n9844
$$ 494915 616010 338243 354446 184967 484370 470614 420159 592135 273281 213437
14808B13437J00479L6637J37960K67102k97151J15695B58849L84430j51579L19174
$$ 213437 313916 350553 488513 755615 458464 574159 258849 643279 491700 810874
14798H10874C52562j0056J45699j67007j39299J21520L10348J40808l67994J12108
$$ 810874 352562 342506 488205 321198 181899 303419 613767 754575 386581 498689
14788D98689p5190K29049n396L9191R1879k341k73127K5890j01274B10259M66374
$$ 498689 423499 652548 647152 686343 778222 775881 502754 528644 427370 210259 676633
14777F76633l35506N4800J76845Q2003q5090j32357j66274L07976k36114J81544
$$ 676633 341127 395927 572772 654775 569685 437328 271054 579030 342916 524460
14767E24460q872J89302j07455N8694L1242k49860o8362N9992M90442j94226N129
$$ 524460 515588 704890 597435 656129 687371 437511 369149 429141 919583 725357 730486
14756G30486C62083L79188P8272j51854B88685N55832j63954j36967L356k29885
$$ 730486 362083 741271 819543 667689 288685 844517 680563 543596 546952 317067
14746C17067J19529L1453K5291J46967J47256L12358n11216K97093k59302r546
$$ 317067 436596 468049 493340 640307 787563 1099921 588705 885798 626496 616950
14736F16950J72571j04786P8643N9338m08284K78279p7195Q069L37793l57807
$$ 616950 789521 684735 763378 822716 414432 692711 615516 623585 961378 603571
14726F03571l1876m6433M13355k72817K68470l42410J24019O3107q5558L21660
$$ 603571 571695 525262 938617 665800 934270 591860 715879 778986 693428 1015088
14716A015088k41961l9008j19944J33514k76553Q9861J48393k72348Q9348J83914
$$ 1015088 773127 734119 614175 747689 471136 560997 709390 437042 526390 710304
14706G10304M86477n27580L05547k97697L91241k51002k32285K73401j14176o5256
$$ 710304 1196781 669201 974748 677051 1068292 817290 585005 858406 744230 678974
14696F78974J22741O9825q2376l5077L43726j89585k940M455m8043j03877O7775
$$ 678974 801715 871540 789164 754087 1097813 908228 905288 909743 861700 757823 825598
14685H25598J28944P6343j58139k08321L77346k45548K98051k89642K76296j90347
$$ 825598 954542 1030885 872746 664425 1041771 796223 1094274 804632 1080928 890581
14675H90581J34896L36670k00037k68745J70920j42021Q6294j7927J72604k98572
$$ 890581 1025477 1362147 1162110 893365 1064285 922264 1008558 990631 1163235 864663
14665H64663R7328J96248k62993P8514m0448J57460K83718p5150j98636k44383
$$ 864663 961991 1158239 895246 973760 933312 1090772 1374490 1299340 1100704 856321
14655H56321J34981j85742K75287m3449K84107k86342J39463j93091J10328K44703
$$ 856321 991302 805560 1080847 1037398 1321505 1035163 1174626 981535 1091863 1336566
14645A336566j10280k94009M76096n9512j52759p3661Q8978k8473P1856M8505
$$ 1336566 1226286 932277 1408373 1348861 1196102 1122441 1211419 1182946 1254802 1303307
14635A303307p8952L50306l27555j90242R651J97644l6277J14705j05620K45409
$$ 1303307 1224355 1574661 1247106 1056864 1066515 1264159 1227882 1342587 1236967 1482376
14625A482376n6741K44681n6853k07493P6182J14676m10411K89646k06808l2620
$$ 1482376 1425635 1670316 1613463 1405970 1482152 1596828 1186417 1476063 1269255 1236635
14615A236635K88229k2396R9555l37198J18528K17045m16213K34758K43302k38628
$$ 1236635 1524864 1502468 1602023 1264825 1383353 1600398 1184185 1418943 1662245 1423617
14605A423617L3515n2901J70543L50k06910L14822Q3568k15996K46493j80235
$$ 1423617 1457132 1404231 1574774 1575124 1368214 1683036 1766604 1550608 1797101 1616866
14595A616866q5937K81330k3843j43575j34338L74242n6382q1635J61770j95304
$$ 1616866 1530929 1812259 1788416 1644841 1510503 1884745 1828363 1746728 1908498 1713194
14585A713194M17046k35423J67527j63281J99746q5609l1817k9119p0354p2183
$$ 1713194 2130240 1894817 2062344 1899063 2098809 2013200 1981383 1952264 1881910 1809727
14575A809727K94086k98193K10851J13015m217L10584l75467M08108k07399j30227
$$ 1809727 2103813 1805620 2016471 2129486 2125269 2435853 2060386 2468494 2261095 2130868
14565B130868N63962j78511M3076k37412J28901O0229K10591m072j69551O78990
$$ 2130868 2694830 2516319 2559395 2321983 2450884 2511113 2721704 2717632 2548081 3227071
14555C227071K846m513N25508L65454Q10638R36695J330126M142965Q345578J7580256
$$ 3227071 3229917 3225404 3750912 4116366 4927004 5863699 7193825 11336790 19682368 37262624
14545C7262624J1232826B3773432A0585549E052828k115382n76865l51680R4286
$$ 37262624 48495450 23773432 10585549 5052828 2937446 2360581 2008901 2103187
14537B103187l6l68680R6540l4718M5164J06253J28884K08206k91361o6082M35010
$$ 2103187 2103151 1734471 1831011 1796293 1841457 1947710 2076594 2284800 1993439 1927357 2362367
14526B362367l66297M1526N52788l35158M2346L32694l34857K38716m43100J34792
$$ 2362367 1996070 2037596 2590384 2255226 2297572 2630266 2295409 2534125 2091025 2225817
14516B225817L99307j0246K8592j31986M53046k24710k26197J35098J91708J54203
$$ 2225817 2625124 2614878 2643470 2511484 2964530 2739820 2513623 2648721 2840429 2994632
14506B994632L82871k81539l63764R3641L64755j84484j31971K30940O6373l57939
$$ 2994632 3377503 3095964 2732200 2825841 3190596 3006112 2874141 3105081 3171454 2813515
14496B813515K26165L6126J76249O4445j71130J77399j42805J82858K63372l33937
$$ 2813515 3039680 3075806 3252055 3316500 3145370 3322769 3179964 3362822 3626194 3292257
14486C292257K80176O8789j46970Q2712o101J46846Q210J62368q6202J79725Q8176
$$ 3292257 3572433 3641222 3494252 3576964 3570863 3717709 3725919 3888287 3802085 3981810 4069986
14475D069986l2049j99139K72896J87479o0236l2478m3190J34362j54705J88198
$$ 4069986 4037937 3838798 4111694 4299173 4238937 4206459 4163269 4297631 4142926 4331124
14465D331124j35289L67663k33047L22087N100K82921J943n42388M96555J23699
$$ 4331124 4195835 4563498 4330451 4652538 4657638 4940559 4942502 4400114 4896669 5020368
14455E020368J91729l04780K15460J7703L74529m44290L34379J12343j82961L31955
$$ 5020368 5212097 4907317 5122777 5140480 5515009 5070719 5405098 5517441 5334480 5666435
14445E666435j27217M0707N19801j44613k2640L222L77071j33505Q3201j94302
$$ 5666435 5539218 5579925 6099726 5955113 5932473 5935695 6312766 6179261 6262462 6068160
14435F068160L63831N7765p9685K00379L74781k23537L86230J00442P109l4414
$$ 6068160 6431991 6489756 6410071 6610450 6985231 6761694 7147924 7248366 7255475 7221061
14425G221061J81911J67353q0236J57608q9198N39481J78642k4740J55855P0383
$$ 7221061 7402972 7570325 7490089 7647697 7558499 8097980 8276622 8251882 8407737 8478120
14415H478120p340L47397k74721J91560J33959L47022j51030K20937R7425J42799
$$ 8478120 8470780 8818177 8543456 8735016 8868975 9215997 9064967 9285904 9383329 9526128
14405I526128K81878l1033m2180L89897J34267J59016J78081L04447J74782Q8888
$$ 9526128 9808006 9776973 9734793 10124690 10258957 10417973 10596054 10900501 11075283 11164171
14395A1164171L01047j17485P6416N90056j31628J69583N21036J85437k55546
$$ 11164171 11465218 11347733 11424149 12014205 11882577 12052160 12573196 12758633 12503087
14386A2503087N57495M81026o3538M48232L40762J27522K11096J88519K15600
$$ 12503087 13060582 13541608 13478070 13926302 14267064 14394586 14605682 14794201 15009801
14377A5009801M24076J07164M95244O42906J27158K54609K10519R8144O73241
$$ 15009801 15433877 15541041 16036285 16679191 16806349 17060958 17271477 17369621 18042862
14368A8042862L26749L32078L20716M81639L0585N22367Q24606J69022J028986
$$ 18042862 18369611 18701689 19022405 19504044 19534629 20056996 20881602 21050624 22079610
14359B2079610J01741N06134N3282Q75087N41651L26280N11454R59176P54400
$$ 22079610 22181351 22687485 22740767 23615854 24157505 24483785 24995239 25954415 26708815
14350B6708815L97897Q10584N89357N97733M98147Q57320P03237J100409P53367
$$ 26708815 27106712 27917296 28506653 29104386 29602533 30459853 31163090 32263499 33016866
14341C3016866R42997O49244J210710J159070O55576J527285P13722J445303Q49284
$$ 33016866 33959863 34609107 35819817 36978887 37634463 39161748 39875470 41320773 42170057
14332D2170057J796000J125719J307352J509210J492802J716005J557796J766465
$$ 42170057 43966057 45091776 46399128 47908338 49401140 51117145 52674941 54441406
14324E4441406J805108J857988K105223K150684K195405K239486K558617K302528
$$ 54441406 56246514 58104502 60209725 62360409 64555814 66795300 69353917 71656445
14316G1656445K745691K474040L024196L180901L046251L511361L847366L616928
$$ 71656445 74402136 76876176 79900372 83081273 86127524 89638885 93486251 97103179
14308I7103179M631022M175571M685550M789916M864873N602009N987334N897545
$$ 97103179 101734201 105909772 110595322 115385238 120250111 125852120 131839454 137736999
14300A37736999O568965O977960P080981P820835Q249107Q438713R191744R681186
$$ 137736999 144305964 151283924 158364905 166185740 174434847 182873560 192065304 201746490
14292B01746490J0202373J0918729J1335317J1815147J3172317J2686416J3452100
$$ 201746490 211948863 222867592 234202909 246018056 259190373 271876789 285328889
14285B85328889J4075903J4395427J5112751J4674102J5079217J4634676J4425375
$$ 285328889 299404792 313800219 328912970 343587072 358666289 373300965 387726340
14278C87726340J3866085J2774351J1576904J0341852Q652475O643451L560288
$$ 387726340 401592425 414366776 425943680 436285532 444938007 451581458 455141746
14271D55141746J064643L6732J190252j647046k957500m569401p662651r508329
$$ 455141746 456206389 456243121 457433373 455786327 452828827 448259426 440596775 431088446
14263D31088446j1336836j2862795j4010077j4403832j5133693j5428100j5229245
$$ 431088446 419751610 406888815 392878738 378474906 363341213 347913113 332683868
14256C32683868j5316956j4645752j3456365j3608594j3449762j2908217j2472571
$$ 332683868 317366912 302721160 289264795 275656201 262206439 249298222 236825651
14249B36825651j1616426j1202376j0069677r796710r564908q581223q294992
$$ 236825651 225209225 214006849 203937172 194140462 184575554 175994331 167699339
14242A67699339p672052p530183p272463o570324o004691n449222n797140n132190
$$ 167699339 160027287 152497104 145224641 138654317 132649626 127200404 121403264 116271074
14234A16271074m693417m764009m235403l529704m456377l656318l616544l458686
$$ 116271074 111577657 106813648 102578245 99048541 94592164 90935846 87319302 83860616
14226H3860616k793176l479932k733251k512118k546873k689887k096358j800311
$$ 83860616 81067440 77587508 74854257 72342139 69795266 67105379 65009021 63208710
14218F3208710k584035k020208j826335j776434j470391j469523j472782k050577
$$ 63208710 60624675 58604467 56778132 55001698 53531307 52061784 50589002 48538425
14210D8538425j568378j078644j347471p42394j102323j559672q92584j881810
$$ 48538425 46970047 45891403 44543932 43801538 42699215 41139543 40246959 38365149
14202C8365149q66701m22470p45541j000942j351538q83373p05650j100465n77492
$$ 38365149 37498448 37075978 36330437 35329495 33977957 33094584 32388934 31288469 30710977
14193C0710977n54112j012593n02743j016394p26148o08837o12216k80785o40118
$$ 30710977 30156865 29144272 28641529 27625135 26898987 26290150 25677934 25397149 24757031
14184B4757031n35630n22633m43729n88151k51528j112465j50798k99310p28240
$$ 24757031 24221401 23698768 23255039 22666888 22415360 21302895 21152097 20852787 20124547
14175B0124547l35330k50867m11669m20748l55057k09332l75808m79076j98978
$$ 20124547 19789217 19538350 19126681 18705933 18350876 18141544 17765736 17286660 17087682
14166A7087682l67790p90920J83134k39206k62739l20648n52227R9236l58251
$$ 17087682 16719892 15928972 16112106 15872900 15610161 15289513 14737286 14836522 14478271
14157A4478271m1014m06567l87268j42416j3679p70015J67778j24369k46344k89472
$$ 14478271 14437257 14030690 13643422 13501006 13487327 12717312 12885090 12760721 12514377 12224905
14147A2224905k92798N1606k42381l37598q1624j08307k65943J06864m66338K00157
$$ 12224905 11932107 11983713 11741332 11403734 11322110 11213803 10947860 11054724 10588386 10788543
14137A0788543l07867k10333m01065j40466m95248N31527m56023M8715k72680
$$ 10788543 10480676 10270343 9869278 9728812 9233564 9765091 9309068 9357783 9085103
14128I085103K1257m15864L8661k57175K48184l52294k0750N6388m23223K98471
$$ 9085103 9106360 8690496 8729157 8471982 8720166 8367872 8347122 8403510 7980287 8278758
14118H278758m45890m1872j32724n19406L88754j82211r5863K1655k15807p876
$$ 8278758 7832868 7790996 7658272 7138866 7527620 7345409 7249546 7271201 7055394 7047518
14108G047518k64187r144j45107N9205j89936l49954L67125k39164k89604K47604
$$ 7047518 6783331 6774187 6629080 6688285 6498349 6148395 6515520 6276356 5986752 6234356
14098F234356l83113K70705k43865j18000L23078k43950m29685N32530n03113
$$ 6234356 5851243 6121948 5878083 5760083 6083161 5839211 5409526 5942056 5438943
14089E438943n2285K50880j03859k8272k14031j85664J81836r7196k82781R7554
$$ 5438943 5386658 5637538 5533679 5505407 5291376 5105712 5287548 5190352 4907571 5005125
14079E005125K41888o15834J63071o0483J9012N44j50679Q551J95672k96459o4790
$$ 5005125 5247013 4631179 4794250 4733767 4752779 4753323 4602644 4611195 4806867 4510408 4445618
14068D445618J87466O2755j40591p6898o7689j25959q5188k3873J4303N9530K44462
$$ 4445618 4633084 4695839 4555248 4478350 4410661 4284702 4199514 4175641 4189944 4249474 4493936
14057D493936n44222L96796j51828k57360m9870K45479l91844o5481O8429L10067
$$ 4493936 3949714 4346510 4194682 3937322 3887452 4132931 3741087 3675606 3744035 4054102
14047D054102m62383k11415L1795L3696K37493l10145K31079k00693l93311K57807
$$ 4054102 3591719 3380304 3412099 3445795 3683288 3373143 3604222 3403529 3010218 3268025
14037C268025J51342r5352j27570j22391K30970K39060m59366L12620q9361k79248
$$ 3268025 3419367 3324015 3196445 3074054 3305024 3544084 3084718 3397338 3307977 3028729
14027C028729M25664m71176K5350J68948k80404r2503R6740j22112K95141l69083
$$ 3028729 3454393 2983217 3008567 3177515 2897111 2804608 2901348 2779236 3074377 2705294
14017B705294o923L52193k41092j50390J50153l62370k90045K03321L76029j95111
$$ 2705294 2698371 3050564 2809472 2659082 2809235 2446865 2156820 2360141 2736170 2541059
14007B541059K0243l47879K3834M8627J00300l36398N34172k90688l41697M22987
$$ 2541059 2561302 2213423 2237257 2285884 2386184 2049786 2583958 2293270 1951573 2374560
13997B374560k34281J59794j08712r9424K22942o8062K8612P84843M44313K757917
$$ 2374560 2140279 2300073 2191361 2091937 2314879 2246817 2275429 3060272 3504585 6262502
13987F262502O496489J7220226J9555392k1072517j4155654n707426k447044j157220
$$ 6262502 12758991 29979217 49534609 28462092 14306438 8599012 6151968 4994748
13979D994748o85641o37417j28328k65149p5960n19811J59519j3989j40516J93187
$$ 4994748 4309107 3671690 3543362 3278213 3202253 2682442 2841961 2827972 2687456 2880643
13969B880643n58802L11189l57515J13496J60965Q6361l47886K55691n55791K22981
$$ 2880643 2321841 2633030 2275515 2389011 2549976 2636337 2288451 2544142 1988351 2211332
13959B211332p9849m3612j43444L10090j49486Q6849r0103K91470j16206j29124
$$ 2211332 2131483 2087871 1944427 2254517 2105031 2191880 2101777 2393247 2277041 2147917
13949B147917p0967q6836j0772L52505o19233L04437j31926J99875k44776J57050
$$ 2147917 2076950 1990114 1979342 2331847 1712614 2017051 1885125 2085000 1840224 1997274
13939A997274p2823j99409K36036j27879k42805Q3274J96717J12342m88050L82069
$$ 1997274 1924451 1725042 1961078 1833199 1590394 1673668 1870385 1982727 1494677 1876746
13929A876746r2576k66518K61705n8322J31157q2874j0950J50615m51211k42139
$$ 1876746 1784170 1517652 1779357 1721035 1852192 1769318 1758368 1908983 1457772 1215633
13919A215633K56689K00764q1378N3642K92650k02771j5683l52280J38414j9605
$$ 1215633 1472322 1673086 1591708 1645350 1938000 1735229 1719546 1367266 1505680 1486075
13909A486075m07966M94561n5552n3173K46538k78311j85316L7176L05387l458
$$ 1486075 1078109 1572670 1517118 1463945 1710483 1432172 1246856 1284032 1589419 1585961
13899A585961q3921j52706K12818n5190j35243M1733K700l26325M74564j13658
$$ 1585961 1502040 1349334 1562152 1506962 1371719 1413452 1416152 1089827 1564391 1450733
13889A450733k94985L0670p503J79279R978j59006p8066J47392L5652J89135l06238
$$ 1450733 1155748 1186418 1178915 1358194 1368172 1209166 1131100 1278492 1314144 1503279 1197041
13878A197041j97080M56827m52517K30254j21393J22008J99940m33862P2362J58433
$$ 1197041 999961 1456788 1004271 1234525 1113132 1235140 1435080 1001218 1073580 1232013
13868A232013J32837N7780j41553l93623M27613j76220J53751k95616L4124J32769
$$ 1232013 1364850 1422630 1281077 887454 1315067 1138847 1292598 996982 1031106 1163875
13858A163875K24171m32062N5979K77125M4869l0298J76211k69784M4980j19643
$$ 1163875 1388046 955984 1011963 1289088 1333957 1303659 1479870 1210086 1255066 1135423
13848A135423J44720j54662j6218M0110k05326n511N07201k40143l32054J45736
$$ 1135423 1280143 1125481 1109263 1149373 944047 938536 1445737 1205594 873540 1019276
13838A019276j03066k6013K44400n0463k56181M73405l34101O3009P6085j11638
$$ 1019276 916210 890197 1134597 1084134 827953 1301358 967257 1030266 1106351 994713
13828I94713l26010K70275K01880l60162K44021j98488L3787m6059J00007J12824
$$ 994713 668703 938978 1140858 780696 1024717 826229 860016 813957 913964 1026788
13818A026788J22532k20807K85799l63496L47756l65276R0694K4750j18872k57687
$$ 1026788 1149320 928513 1214312 850816 1198572 833296 923990 948740 829868 572181
13808E72181N46785p22m43018J64194J19204l93519N59721m03878K41732M5591
$$ 572181 1118966 1118244 675226 839420 958624 565105 1124826 720948 962680 1008271
13798A008271j88336K00110N7517j92080j44534k16947M66814m12855J37855J1596
$$ 1008271 819935 1020045 1077562 885482 740948 524001 990815 577960 715815 727411
13788G27411J08921j10846L60058j68469P8583k83448K42766m4855l58724M10856
$$ 727411 836332 725486 1085544 917075 995658 712210 954976 910121 551397 962253
13778I62253j18751j67766j16994J22853j21955L57506J01401j72934j80025p250
$$ 962253 843502 675736 558742 681595 559640 917146 1018547 845613 665588 658338
13768F58338m0877K0800K31348J49693j82238J22336D21389M28971J0942l19914
$$ 658338 617461 638261 869609 1019302 837064 959400 421389 850360 861302 541388
13758E41388P4864J73115L45603C93936K49316J97062k01650n0576K43674k68829
$$ 541388 616252 789367 1134970 393936 643252 840314 638664 588088 831762 562933
13748E62933K14363k24633R1492K23413j71560j41263N0447p414J14348l03871
$$ 562933 777296 552663 644155 867568 696008 554745 605192 597778 712126 408255
13738D08255K05900M9058K5196j64750L18667K06459l0600l95558K04260l95933
$$ 408255 614155 663213 688409 523659 842326 1048785 1018185 622627 826887 430954
13728D30954L36947M564l07110L3632J82042Q4480m5852k11222r9006M03933l86736
$$ 430954 767901 772465 465355 498987 681029 765509 719657 508435 409429 813362 426626
13717D26626L22562k75303J09334J06442j38957j93458O6766L3035l9323P9379
$$ 426626 749188 473885 583219 689661 550704 357246 424012 457047 417724 497103
13707D97103j87679M05114r7378m8403j08419K3603l9545J37270O9313j41385
$$ 497103 309424 714538 617160 568757 460338 483941 444396 581666 650979 509594
13697E09594n0459Q0626P6577k32184K43973j46651Q2697Q6109J11749k14597
$$ 509594 459135 539761 616338 384154 628127 481476 564173 650282 762031 547434
13687E47434P0303B41968L80605K41127j68310K8655k13847k24097J85468J45838
$$ 547434 617737 241968 622573 863700 695390 724045 510198 286101 471569 617407
13677F17407j9942B25652L86930j53499K78840k12641N1247P4854p7181q0637
$$ 617407 597465 225652 612582 459083 737923 525282 576529 651383 574202 493565
13667D93565q8082j71768L23187p56K7982A41780L85775J3480k62222L84550j36081
$$ 493565 405483 233715 556902 556146 584128 141780 527555 541035 278813 663363 527282
13656E27282J09738j33682j14760J18469M64363C80160K78617j74777J96786o5400
$$ 527282 637020 503338 388578 507047 971410 380160 658777 484000 680786 615386
13646F15386K05730k44643J79000l27180J01488J93026j81240k33896P4847F1783
$$ 615386 821116 576473 755473 428293 529781 722807 541567 307671 382518 61783
13635D97308k27480K52608M8191m9438B38541L55906k76458K13254n1823O341
$$ 497308 269828 522436 570627 521189 238541 594447 317989 531243 479420 485761
13625D85761A73723K23664n7315A02833K88932k9210R6449L92992A73382K76849
$$ 485761 173723 397387 340072 102833 391765 362555 459004 851996 173382 450231
13615D50231J3673j9519K1195j39051Q6899l4471J85119B71190L18862B69713
$$ 450231 463904 444385 465580 326529 413428 378957 564076 271190 590052 269713
13604C68677k2511p7579r7781K25426m5099P8513K3800q3599E5772J09081K48175
$$ 368677 346166 268587 170806 396232 351133 429646 453446 369847 55772 164853 413028
13593D13028H2882L37577R1019J19017B71241K88096l084A75981Q120K86700q3811
$$ 413028 82882 420459 511478 630495 271241 559337 556253 175981 184101 470801 386990
13582C86990q4397J18277k02379N3870J90988k05136M42882B19923K42344J63011
$$ 386990 302593 420870 218491 272361 463349 258213 701095 219923 462267 625278
13572F25278m5150B28093o5579K18372o826J11679j8223k12451L8320K629n5431
$$ 625278 580128 228093 162514 380886 374060 485739 467516 255065 293385 296014 240583
13561B40583J94015p3115o5789e9894E80505B44510L24624B01259N0601K69102
$$ 240583 434598 361483 295694 -59894 580505 244510 569134 201259 251860 520962
13551E20962k23852l564P6641k3304J51576Q4778j27149k04831O3354R1736l5413
$$ 520962 297110 293546 370187 346883 498459 583237 456088 251257 314611 406347 370934
13540C70934A59113K80867A85488J47953J07146j07921j34726P6950M4910a24681
$$ 370934 159113 439980 185488 333441 440587 332666 197940 274890 319800 -124681
13529C29226A30059C1181K2318K42208p2999l7690J18348O7119I9662g7965B44554
$$ 329226 130059 31181 53499 295707 222708 185018 303366 370485 99662 -77965 244554
13517C41435q5247N15456B37641K31651m1589P7121k563k34996q9818M34199j35071
$$ 341435 256188 771644 237641 469292 427703 504824 502261 267265 177447 611646 476575
13506D76575j13057j03616G5330L95231K07281A88871O6625k3999Q0581J60138
$$ 476575 363518 259902 75330 470561 677842 188871 255496 231497 312078 472216
13496D72216B28208K80150j45291j43481O0628K32186A62843J3545n1296M88459
$$ 472216 228208 508358 363067 219586 280214 512400 162843 176388 125092 613551
13486F13551I3183N5005k4226L35888j02218l662J49629j59783M156H6851k1470
$$ 613551 93183 148188 123962 459850 357632 353970 503599 343816 347972 86851 65381
13475F5381J47741J61028A27233K48516A70358k0923J71540H8057K06556j8005
$$ 65381 213122 374150 127233 375749 170358 149435 320975 88057 294613 276608
13465B76608N1118j20963M024E8454J17254J96412h2883C16418J94619B37817
$$ 276608 327726 206763 210787 58454 175708 372120 -82883 316418 511037 237817
13454D48147j22080K21134C2830J56049J14033F5487J07205M04034J62462A72343
$$ 448147 326067 547201 32830 188879 302912 65487 172692 576726 739188 172343
13443I1395e3865B93849p8049E8397K84240O5745A56221J70608m8917K03217j89921
$$ 91395 -53865 293849 215800 58397 342637 408382 156221 326829 277912 481129 291208
13432B91208r5140j9646R3145P7663a73201B73899l1299a36172A83188q5036L02505
$$ 291208 196068 176422 269567 347230 -173201 273899 242600 -136172 183188 98152 400657
13421D00657j87219n2348o1163K46871G6133K41676l7552a56180A67810a83271
$$ 400657 213438 161090 99927 346798 76133 317809 280257 -156180 167810 -183271
13410G6236J52764o5779J95896J98859B09029j4975C223e3506E52511a38267A51262
$$ 76236 229000 163221 359117 557976 209029 194054 3223 -53506 552511 -138267 151262
13398a36442A53360M6495M6218j15563L90543A91532K29379n0583a9637B56044
$$ -136442 153360 199855 246073 130510 521053 191532 420911 370328 -19637 256044
13387a83654A15890J81387e3870B53934J49303A03841J06001n9804k6087L3723
$$ -183654 115890 297277 -53870 253934 403237 103841 209842 150038 123951 157674
13377A57674K04201j16495i008B83622b66126G8195M73042B06472J36407k2543
$$ 157674 361875 245380 -9008 283622 -266126 78195 551237 206472 342879 320336
13367C20336k7267C8838K25961J23622A65619Q1844A02260R1323J17244A04491
$$ 320336 293069 38838 264799 388421 165619 247463 102260 193583 310827 104491
13356D54035A65303a4197B34087M3788k1186g5555L3770A98935J70680K2019H8633
$$ 454035 165303 -14197 234087 277875 256689 -75555 -41785 198935 369615 391634 88633
13344B67700j26929L66838N1096l4038j75434H9689J94068L4151A20179o702g0600
$$ 267700 140771 507609 558705 524667 349233 89689 283757 317908 120179 113477 -70600
13332E30612B21006l433K8618N1233k6489j17124D0675N40983B4476K98440J20850
$$ 530612 221006 217573 246191 297424 270935 153811 40675 581658 24476 322916 443766
13321D43766A14837j7176a08335B30084h2501A31266P7440A00990a01466C37739
$$ 443766 114837 97661 -108335 230084 -82501 131266 208706 100990 -101466 337739
13310f2058A59275a55135A65925q2592K20837C3191K34716J64972A96062K65173
$$ -62058 159275 -155135 165925 83333 304170 33191 267907 432879 196062 461235
13300D61235A88286J13357r4943m5311h428D3113L33684a36167F1993B6180L54041
$$ 461235 188286 301643 206700 161389 -8428 43113 376797 -136167 61993 26180 380221
13289C80221b34123f1409A75364E6452J36316Q3093K76557G5798L3446Q6768a00388
$$ 380221 -234123 -61409 175364 56452 192768 275861 552418 75798 109244 196012 -100388
13277A50169p5046a32871C64696B4887P4598Q2034j9116H0090J92031J54709B0346
$$ 150169 75123 -132871 364696 24887 99485 181519 162403 80090 272121 426830 20346
13265B36171k0557m8647l1490M64263B38475I3469j146N04691D0399P9900K27302
$$ 236171 215614 166967 135477 599740 238475 93469 92323 597014 40399 120299 347601
13254C47601m9820p0423j233J04041H2599J62107j07173J85495j45210n9691L9149
$$ 347601 297781 227358 226125 330166 82599 244706 137533 323028 177818 118127 157276
13243A57276E0930J46585a7156A27698M2143f233j20708B71059J1787J09609f7211
$$ 157276 50930 197515 -17156 127698 169841 -6233 -126941 271059 282846 392455 -67211
13231c83A99068H5090d8660D12316A39819M9993J71619j65145b38722B39808E6137
$$ -383 199068 85090 -48660 412316 139819 189812 361431 196286 -238722 239808 56137
13219A40110P5947J38443J5832j40560b6216o1609A31594e6954B16806e0386H9198
$$ 140110 216057 354500 370332 229772 -26216 -87825 131594 -56954 216806 -50386 89198
13207a18345C98415A48368K82539B7589J69104M5545J73545B9284j2373J29254
$$ -118345 398415 148368 430907 27589 196693 242238 415783 29284 16911 146165
13197A46165M2726M15964I6370i7260B2435K39047j18025o3857e6833k049j3294
$$ 146165 188891 604855 96370 -97260 22435 261482 143457 79600 -56833 -58882 -72176
13186g2176I2072h307B14220L5229P9985A55344J20837b27531G3781J55351n0159
$$ -72176 92072 -8307 214220 249449 329434 155344 276181 -227531 73781 229132 178973
13175A78973B3903a39448A37010K02089f3742G9823P6735J30196A05810K40348
$$ 178973 23903 -139448 137010 339099 -63742 79823 156558 286754 105810 346158
13165C46158a67416k7332a6732B88582J20776A05877P3476K39606A30263K95570
$$ 346158 -167416 -194748 -16732 288582 409358 105877 179353 418959 130263 425833
13155D25833F071N1623K71652j22569h5723B25013N6001E7150O1134M9699a67063
$$ 425833 6071 57694 329346 206777 -85723 225013 281014 57150 118284 167983 -167063
13143C14209a50882a4778D14605G0902b8363g07G2636f8828I288K3422g479B76485
$$ 314209 -150882 -14778 414605 70902 -28363 -707 72636 -68828 9288 32710 -7479 276485
13130b09847P2099G0932A0959K30842a34949a434j01752H1247J11b5998B01917
$$ -209847 -137748 70932 10959 241801 -134949 -1434 -103186 81247 81358 -25998 201917
13118C3598R2389K21674f0347E4665K14199a15283A72349h1568j10450A01980
$$ 33598 125987 347661 -60347 54665 268864 -115283 172349 -81568 -192018 101980
13107B17970m7521l0597B6999R3510b4007A91644D1231J0758J33269I1789c2313
$$ 217970 170449 139852 26999 120509 -24007 191644 41231 51989 185258 91789 -32313
13095C81248D5784e6036A10374a3583j7553l97705B11984a19784A80410F7957
$$ 381248 45784 -56036 110374 -13583 -31136 -428841 211984 -119784 180410 67957
13084A53978d62094B42992j8160M6427j35425P6137q4377J68048a1057A42872
$$ 153978 -462094 242992 224832 271259 135834 211971 127594 295642 -11057 142872
13073g0170B4672K33585r8183M7631o6488J48971b41441e0812J2797C54473q9129
$$ -70170 24672 258257 160074 207705 141217 290188 -241441 -50812 -38015 354473 265344
13062B65344J8929D2360O0179R7622r7628K86325J4123c0479j69579B82021C0828
$$ 265344 284273 42360 102539 200161 102533 388858 402981 -30479 -200058 282021 30828
13050B73752K2155a60173A43417a48449o2023C2141M9281K71972H0716L03505
$$ 273752 295907 -160173 143417 -148449 -210472 32141 81422 353394 80716 384221
13040C84221D6353J51805P2191c0410G2938a88602A84873a55347A89280j9425
$$ 384221 46353 198158 270349 -30410 72938 -188602 184873 -155347 189280 169855
13030A69855J26416b58905B02808r0021a23554G3247C1590b40596B8825J9223
$$ 169855 296271 -258905 202808 112787 -123554 73247 31590 -240596 28825 48048
13020D8048R6684m1721J9191O4787j4297e435B09950a03552B39070C5040K2740
$$ 48048 144732 103011 122202 186989 172692 -5435 209950 -103552 239070 35040 57780
13009E7780I211K47959G6500M5589n2710K1459d4146A53286a32533E620Q5036
$$ 57780 9211 257170 76500 122089 69379 90838 -44146 153286 -132533 5620 90656
12998I0656J76063j25895l1125M5786l2738a52152C42466c18608a13499B15569
$$ 90656 266719 140824 109699 155485 122747 -152152 342466 -318608 -113499 215569
12987B68441p6758D855i4160c5728j09138G7486k7371a67825a2656q4439j23825
$$ 268441 191683 4855 -94160 -35728 -144866 77486 50115 -167825 -12656 -97095 -220920
12976b20920C04356D1035L17679j48049a49466A28015a45965E0326h9787M4815
$$ -220920 304356 41035 358714 210665 -149466 128015 -145965 50326 -89787 -44972
12966d4972J4721A21109O6041Q6538d9188A44806k0271k1331J58070G6572a5654
$$ -44972 -30251 121109 187150 273688 -49188 144806 124535 103204 261274 76572 -15654
12954i700A85331B9512d1523k64838h5991A6710a61181A48526d0637l741a5165
$$ -9700 185331 29512 -41523 -306361 -85991 16710 -161181 148526 -40637 -44378 -15165
12942A78715b55610M5335A64161b08071B61277j4193q0523J41233F557J92834
$$ 178715 -255610 -210275 164161 -208071 261277 247084 166561 307794 6557 199391
12932A99391a7771A61394a72265E40231B1313a86923P2665C13695A20899n2134
$$ 199391 -17771 161394 -172265 540231 21313 -186923 -114258 313695 120899 68765
12922F8765b5476E6088d831H9025a39608d4291B50877m425a17474b9834A59786
$$ 68765 -25476 56088 -4831 89025 -139608 -44291 250877 246452 -117474 -29834 159786
12910A00679i7866B22420a00328b5190n334A9926R6653a20985q4769B3975O737
$$ 100679 -97866 222420 -100328 -25190 -30524 19926 116579 -120985 -205754 23975 30712
12899C0712a21606A24415J76946A44106J15909a13658e98A56274d772j26516H5809
$$ 30712 -121606 124415 301361 144106 260015 -113658 -598 156274 -4772 -131288 85809
12887a0785n9239b2424B26143n4074C8066K7432K7200C1801q48n185A1758f9865
$$ -10785 -70024 -22424 226143 172069 38066 65498 92698 31801 30953 25768 11758 -69865
12874b9837H8133K8664l3037c20896G0990b26050A68817j3355I761K31966p5002
$$ -29837 88133 116797 83760 -320896 70990 -226050 168817 155462 9761 241727 166725
12863A66725a62611B821L1740Q1922M2302b02998B3726K12674g7432A37723c3886
$$ 166725 -162611 2821 34561 116483 158785 -202998 23726 236400 -77432 137723 -33886
12851B24160e857A70121F7941k2959i9370A66594l9980c6330B49161F1536d9688
$$ 224160 -5857 170121 67941 44982 -99370 166594 126614 -36330 249161 61536 -49688
12839A00361k7799J97239a70265d7423B9713A067P2497K75366b86438c8636D17627
$$ 100361 72562 269801 -170265 -47423 29713 1067 73564 348930 -286438 -38636 417627
12827G2053J02800i9873d3343j79931B86722b48573A12394J84154A24167C8323
$$ 72053 174853 -99873 -43343 -223274 286722 -248573 112394 296548 124167 38323
12816b13423C35904A19239K24842J02758a8953m6349B78766j08579D0950J44789
$$ -213423 335904 119239 344081 446839 -18953 -65302 278766 170187 40950 185739
12806A85739K0936N8674a21154E1431b0508H3072i2624C6631j1139d68485A02816
$$ 185739 206675 265349 -121154 51431 -20508 83072 -92624 36631 25492 -468485 102816
12794C28558i7112A72894a5537A26787g9637k6186G262R7085k7085e9371k70714
$$ 328558 -97112 172894 -15537 126787 -79637 -105823 7262 104347 77262 -59371 -330085
12783c30085A85951L3722a10812D4671L0670N8545a52483A97390F6394J86598
$$ -330085 185951 219673 -110812 44671 75341 133886 -152483 197390 66394 252992
12773B52992P2995b28945d7925j04902B99568f096B64934A6834a9613A55543K2560
$$ 252992 325987 -228945 -47925 -152827 299568 -6096 264934 16834 -19613 155543 178103
12762A78103i6020j5874n5905L2606I3953a77983G6540J30860H0966K69888A59491
$$ 178103 -96020 -111894 -167799 -135193 93953 -177983 76540 207400 80966 350854 159491
12750D9347h8340l7259j05779A42182L0521b63763R2865B21319G7318K51049a18056
$$ 49347 -88340 -125599 -231378 142182 172703 -263763 -170898 221319 77318 328367 -118056
12738G3384K061d0408n5690D63725k24588O7104o0606a95043B2053M0864a66786
$$ 73384 75445 -40408 -96098 463725 239137 306241 245635 -195043 22053 62917 -166786
12726A1744a39079k75691A62301c23079B78000F606b58281F2880b9864j00539
$$ 11744 -139079 -414770 162301 -323079 278000 6606 -258281 62880 -29864 -130403
12716a30403B4874d4540A67778f4565B54787k4176H2368O4232K56488A18867J1949
$$ -130403 24874 -44540 167778 -64565 254787 230611 82368 146600 403088 118867 130816
12705A30816J60J66770j27798L6915L71121B19498b7162A76116p9083k2699l0723
$$ 130816 130976 297746 169948 206863 577984 219498 -27162 176116 97033 74334 43611
12694D3611A0431J15765F0693a97232E0408J10243I435g1914B09940E2350J28748
$$ 43611 10431 126196 60693 -197232 50408 160651 9435 -71914 209940 52350 181098
12683A81098K87255n5350j67459F0475a48393J9294e295H6249I516Q8417J97679
$$ 181098 468353 413003 245544 60475 -148393 -129099 -5295 86249 9516 97933 295612
12672B95612A46797K3708b95018A9339J96336a29925r1446A43727J10507A26509
$$ 295612 146797 170505 -295018 19339 215675 -129925 -221371 143727 254234 126509
12661A37131R7061K55734h5340B7784M2510i236m7235o347C67901A19919a31142
$$ 137131 234192 489926 -85340 27784 70294 -9236 -56471 -62818 367901 119919 -131142
12649A49260M5171M9911h5793B8934a47169C09335M452A30029a87082b2871j41773
$$ 149260 194431 244342 -85793 28934 -147169 309335 313787 130029 -187082 -22871 -164644
12638a64644C58955r2199k1583o4871B1097a52788N4453G9454L14245j41109E8884
$$ -164644 358955 266756 245173 180302 21097 -152788 -98335 79454 393699 252590 58884
12626B18587K17316D2417L83137A14701C156J74271O4865F2435Q7958f8089C47089
$$ 218587 435903 42417 425554 114701 3156 177427 242292 62435 150393 -68089 347089
12614C05802r2866b07484D5914C447J24886L7287J41832A29550M98906H4765c7942
$$ 305802 212936 -207484 45914 3447 128333 165620 307452 129550 628456 84765 -37942
12602E568K19457g8754E8064A9309J31940L4593l9510o7136b18703A24662a02808
$$ 5568 225025 -78754 58064 19309 151249 185842 146332 79196 -218703 124662 -102808
12590G1673l5270b5256B37556E6926g6800a7547l6330r4320e400j21084C22927
$$ 71673 36403 -25256 237556 56926 -76800 -17547 -53877 -148197 -5400 -126484 322927
12578H3748J29686Q8427A26522J78633n1263H1205K52249a15555B04327a31573
$$ 83748 213434 301861 126522 305155 253892 81205 333454 -115555 204327 -131573
12567h5135b5812B02976b29221B25871J02870g6942n5122B15851I7713F336J41221
$$ -85135 -25812 202976 -229221 225871 328741 -76942 -132064 215851 97713 6336 147557
12556A47557a52368D70980A97788F3901C1429b28674A94085B0386K55487c4536
$$ 147557 -152368 470980 197788 63901 31429 -228674 194085 20386 275873 -34536
12545a53224E0875F591b1573E3035B0687J17878J40370f6253g756j08514B28820
$$ -153224 50875 6591 -21573 53035 20687 138565 278935 -66253 -7756 -116270 228820
12533A25187E1858a08744B11249J14803a79789C86766d15739A01844J02816K7702
$$ 125187 51858 -108744 211249 326052 -179789 386766 -415739 101844 204660 232362
12523B32362E5718R592i3308B55616a43246B59176j19583F5547e5670A51649a53832
$$ 232362 55718 65310 -93308 255616 -143246 259176 139593 65547 -55670 151649 -153832
12511A67682b39548b6280n3535A99569m7235b5741o6482A1418L60126b6960k10263
$$ 167682 -239548 -26280 -79815 199569 152334 -25741 -92223 11418 371544 -26960 -237223
12500b37223A8406J69346C1541h3345q3282a9362A957g1365A38120h1960B21339
$$ -237223 18406 187752 31541 -83345 -166627 -19362 1957 -71365 138120 -81960 221339
12488a13448B1194J126c65999d707E3838Q9845a3118j79370l4726A42771j7759
$$ -113448 21194 22320 -365999 -4707 53838 143683 -13118 -192488 -227214 142771 125012
12477A25012d4930j40318q4140r715d6151m5928A49193g4963m1114d0284j63685
$$ 125012 -44930 -185248 -269388 -279103 -46151 -92079 149193 -74963 -116077 -40284 -203969
12466b03969c1163A91570b68200j9630C52446I8687c66544i8845b3375q9142B19832
$$ -203969 -31163 191570 -268200 -287830 352446 98687 -366544 -98845 -23375 -112517 219832
12454F2214a96452F3383J48439a48462A28691J038c3770D16c94984A21865g3797
$$ 62214 -196452 63383 211822 -148462 128691 129729 -33770 416 -394984 121865 -73797
12442a47579A19815f314A43206D2384N1372A537K55154e1163A94353h6481A12110
$$ -147579 119815 -6314 143206 42384 93756 1537 256691 -51163 194353 -86481 112110
12430b2348k19285a01235k4583A05630f8930A80834a8885k5212A84273d2876D1498
$$ -22348 -241633 -101235 -125818 105630 -68930 180834 -18885 -44097 184273 -42876 41498
12418c7553p6385B56997R3138E9561k4563J59449n3628E4517d6644J8112A19217
$$ -37553 -113938 256997 350135 59561 34998 194447 140819 54517 -46644 -28532 119217
12406A2589K91337j19751G5656b13625B18528m4508o2317a02963O946A05480g1459
$$ 12589 303926 184175 75656 -213625 218528 174020 111703 -102963 -96017 105480 -71459
12394B75689E7462g5186j8148C41929h4075B57571L9843c01814J45861O7633C35872
$$ 275689 57462 -75186 -93334 341929 -84075 257571 297414 -301814 -155953 -88320 335872
12382b23465e85E5622a07657F5763c8584A08577D4923O0871b75400B36287o1643
$$ -223465 -585 55622 -107657 65763 -38584 108577 44923 105794 -275400 236287 174644
12371A74644i3241j72678A24596a84963d9993G8004L1157A9582a56949A3199a20442
$$ 174644 -93241 -265919 124596 -184963 -49993 78004 109161 19582 -156949 13199 -120442
12359E664c9653A9782J97934j08145f6864r1573B92837m8884B6083b64821H5175
$$ 5664 -39653 19782 217716 109571 -66864 -158437 292837 243953 26083 -264821 85175
12347b85016J32127O7744J330F9342J602c87497G8543b30822E2877a94417B6732
$$ -285016 -152889 -85145 -83815 69342 70944 -387497 78543 -230822 52877 -194417 26732
12335B33937E1198J85039a04966A48305b4072G8201F202L5830c39012g5452n2742
$$ 233937 51198 236237 -104966 148305 -24072 78201 6202 42032 -339012 -75452 -128194
12324a28194F2348a082l708B19675E1574A6214d9106k67705B04318f706m8222
$$ -128194 62348 -1082 -4790 219675 51574 16214 -49106 -316811 204318 -6706 -54928
12313e4928l98776A63743a14033a7826F2334L8665P3216M6790c2982D13247D4344
$$ -54928 -453704 163743 -114033 -17826 62334 100999 174215 221005 -32982 413247 44344
12301A52825J10489A24820l7395j1882c501o8871A9868b46490B21556e150B73406
$$ 152825 263314 124820 87425 75543 -3501 -72372 19868 -246490 221556 -5150 273406
12289a5735a881A65719j1236O5197a64467a3496B65363B3P7280J59149a67621
$$ -15735 -1881 165719 154483 219680 -164467 -13496 265363 23 77303 236452 -167621
12277d1083J8320n553M310B82503J75098a1929B53551F8328O7981J7665B8377
$$ -41083 -22763 -28316 -24006 282503 457601 -11929 253551 68328 136309 153974 28377
12265a1694A1056R0677J54055E3478g9096A1586a83272B3840K600J28266b83848
$$ -11694 11056 101733 255788 53478 -79096 11586 -183272 23840 26440 154706 -283848
12253A17230J64139r4371a17397B39492N0892c9231r7891B63129M2300b38210
$$ 117230 281369 186998 -117397 239492 290384 -39231 -137122 263129 305429 -238210
12242D5304A423J43330B509K17473J9131c8118C554a0315B99400I3016O0574L704
$$ 45304 1423 144753 2509 219982 239113 -38118 3554 -10315 299400 93016 153590 157294
12230A57294h281I9507N9212N5751b2670A21026K47268J83572k72366C2159M73522
$$ 157294 -8281 99507 158719 214470 -22670 121026 368294 551866 279500 32159 505681
12219E05681j39521A48827e1604B84398k4688D4973g0947a8703B04400d0442B04679
$$ 505681 366160 148827 -51604 284398 259710 44973 -70947 -18703 204400 -40442 204679
12207A97857C6272O7984L6937J76236R0924C0112K19374o8209B5115J04980M2151
$$ 197857 36272 104256 141193 317429 408353 30112 249486 181277 25115 130095 172246
12196A72246K37265j31432r0933K4378b08811A75060a53686l74470a9517l1191
$$ 172246 409511 278079 187146 211524 -208811 175060 -153686 -528156 -19517 -50708
12186e0708A25517J10265L2512b5402A44027a19320A8906a55698H2790B0005P4483
$$ -50708 125517 235782 268294 -25402 144027 -119320 18906 -155698 82790 20005 94488
12175I4488M4373d5272A1032d846j80065G6097b4073H3109J82120a4514B70715
$$ 94488 138861 -45272 11032 -4846 -184911 76097 -24073 83109 265229 -14514 270715
12163b83941A8789J16164K2426K43841F0432f2884A25725H879N6414N8001A55
$$ -283941 18789 134953 157379 401220 60432 -62884 125725 8879 65293 123294 155
12151c51158O3037C9955J62614Q5166j14189E3948a26269C51529C3158l838a08626
$$ -351158 -288121 39955 202569 287735 173546 53948 -126269 351529 33158 29320 -108626
12139A33256c0840j25841A02457l194J66722b93330A6825a72047h148k66999B05571
$$ 133256 -30840 -156681 102457 99263 265985 -293330 16825 -172047 -8148 -275147 205571
12127B47592a00568A96083H4822L08531A77941b156q4605j92075G4247c30608
$$ 247592 -100568 196083 84822 393353 177941 -2156 -86761 -278836 74247 -330608
12116D49600e1822A34363L84584I3762P4759m3819f1903F9704a1169o1477A05194
$$ 449600 -51822 134363 518947 93762 168521 124702 -61903 69704 -11169 -72646 105194
12104a18979A30092a63968G2622b5280p0702B92701b17263B45783B7623d8000
$$ -118979 130092 -163968 72622 -25280 -95982 292701 -217263 245783 27623 -48000
12093A16861l8687N6431K573J39406F8981b7464F0617g4106A25777a9144A34518
$$ 116861 78174 134605 137178 276584 68981 -27464 60617 -74106 125777 -19144 134518
12081e1143A87253d02214K2902B06615K4486B6371K3536b46516a04466A8992d2406
$$ -51143 187253 -402214 -379312 206615 231101 26371 49907 -246516 -104466 18992 -42406
12069B48967N07167J318815j008809D67517j38183D4456b58127O1345A7942K0520
$$ 248967 756134 2074949 1066140 467517 329334 44456 -258127 -196782 17942 38462
12059C8462J18078O7690C7549a54819P6243j42389O3080A46874l8970L26761j95373
$$ 38462 156540 224230 37549 -154819 -78576 -220965 -157885 146874 107904 434665 239292
12048B39292B6514f794A11628n2126J8946a29641c3587D5685J88745c3801j43713
$$ 239292 26514 -6794 111628 59502 78448 -129641 -33587 45685 234430 -33801 -177514
12037a77514B23841E2537a06535A26560J8761c5896d59r9876m8355r2917j3082
$$ -177514 223841 52537 -106535 126560 145321 -35896 -459 -100335 -148690 -241607 -254689
12026b54689j0787P2117A22151j3691m3830K2057a89187H9910d39802B9009J84192
$$ -254689 -265476 -193359 122151 108460 64630 86687 -189187 89910 -439802 29009 213201
12015B13201o4378K34086e8958g264E776a42650l8686e7578J4580j09566A8301
$$ 213201 148823 382909 -58958 -7264 5776 -142650 -181336 -57578 -42998 -152564 18301
12003E8496a46170B0603a79211D4697g9253B728b49680A72116i1175g214k66837
$$ 58496 -146170 20603 -179211 44697 -79253 2728 -249680 172116 -91175 -7214 -274051
11992b74051C9670j6458R4390a47538L3107B58208K9818J4718a03045k19278J1195
$$ -274051 39670 23212 117602 -147538 -114431 258208 288026 302744 -103045 -322323 -311128
11981c11128C61619E9930k6697b61173A29685a11955q3590A49344g3255a5988
$$ -311128 361619 59930 33233 -261173 129685 -111955 -195545 149344 -73255 -15988
11970d1218A6752K07947a08322j0928H1183c67781a44021E3174K03405e761D1639
$$ -41218 16752 224699 -108322 -119250 81183 -367781 -144021 53174 256579 -5761 41639
11958A45242b33482B09383J22209j18227a04799b5806M749k24362j01233E8154
$$ 145242 -233482 209383 331592 213365 -104799 -25806 -21057 -245419 -346652 58154
11947A85775q2185b07082f4901j12037B48171a15924j800B12077p9800A7867a25164
$$ 185775 103590 -207082 -64901 -176938 248171 -115924 -117724 212077 132277 17867 -125164
11935c39770A66829C940K23788F6792K9221d47051I7883a87405n9688E4786c5585
$$ -339770 166829 3940 227728 66792 96013 -447051 97883 -187405 -247093 54786 -35585
11923A1257b49064C13465M3815A62a75473e7381j7801B4322Q2823a66136j94134
$$ 11257 -249064 313465 357280 162 -175473 -57381 -75182 24322 107145 -166136 -360270
11912c60270a73737C44040I1690m5047L40374A18492l0878B6250g4582A6205J31034
$$ -360270 -173737 344040 91690 46643 387017 118492 87614 26250 -74582 16205 147239
11901A47239d1697o968k69281C8779K28532j155A24803b09353K0721L1707B14303
$$ 147239 -41697 -48665 -317946 38779 267311 266156 124803 -209353 -188632 -156925 214303
11889a84426j37086a22643c0372j6255m3252B14674A5243J78169a30867B56772
$$ -184426 -321512 -122643 -30372 -46627 -89879 214674 15243 193412 -130867 256772
11878h6064A69091b73665i4856A47735C6769K3373i7897A21675b42522O5719G1734
$$ -86064 169091 -273665 -94856 147735 36769 60142 -97897 121675 -242522 -176803 71734
11866C84533A65141B0767c9865A56819g5941B71157A01349J87823A00589f6435
$$ 384533 165141 20767 -39865 156819 -75941 271157 101349 289172 100589 -66435
11855I932a39113A05751a39260B3223J76768b99456A1372i4845f190k63682B3057
$$ 9932 -139113 105751 -139260 23223 199991 -299456 11372 -94845 -6190 -269872 23057
11843D06990a3733A38833F3709a06201f617r272l35145a24351k13477c4605j33694
$$ 406990 -13733 138833 63709 -106201 -6617 -15889 -351034 -124351 -337828 -34605 -168299
11832a68299P8121B78511j15559p0751b6991k06836M5926G6730M4001f5138p9529
$$ -168299 -90178 278511 162952 92201 -26991 -233827 -187901 76730 120731 -65138 -144667
11821a44667k1203D7002a12179o8176N0797D8748a92696f0021G2770k4672j7594
$$ -144667 -165870 47002 -112179 -180355 -129558 48748 -192696 -60021 72770 48098 30504
11810C0504a99912P7073C1327J09196a01212B47149e3552r3691K5675A48992h9286
$$ 30504 -199912 -122839 31327 140523 -101212 247149 -53552 -147243 -121568 148992 -89286
11798d7775j45550O1542B93609b6664j84063I0185a93211B6726b33851e0035b1654
$$ -47775 -193325 -131783 293609 -26664 -210727 90185 -193211 26726 -233851 -50035 -21654
11786b43742A11150a67144c6205B01385m3445B0923N1156P6265h7400C1334b11290
$$ -243742 111150 -167144 -36205 201385 157940 20923 72079 148344 -87400 31334 -211290
11774a95346A15801a49495a024B96317m4278a21956A76224q3516m506a20834p2032
$$ -195346 115801 -149495 -1024 296317 252039 -121956 176224 92708 88202 -120834 -192866
11763a92866A20526i765B38706j2621E7228B3069b48140Q3621J8280k0562A35394
$$ -192866 120526 -9765 238706 226085 57228 23069 -248140 -164519 -146239 -166801 135394
11751B27808a12075b3514C87751c59396A36593J423n6829N9996g2052D1627i7474
$$ 227808 -112075 -23514 387751 -359396 136593 138016 81187 141183 -72052 41627 -97474
11739I7777b83597H7382a55760C18154e0246B192Q8579a30640j72660A12957m1182
$$ 97777 -283597 87382 -155760 318154 -50246 2192 90771 -130640 -303300 112957 71775
11728G1775J35900a92930J3058D4211e2564A44363c289k32256K0311B52880a52815
$$ 71775 207675 -192930 -179872 44211 -52564 144363 -3289 -235545 -215234 252880 -152815
11716b90915B83897D9347L74025g7696A33008K8594p9922R7266I16K92166E841
$$ -290915 283897 49347 423372 -77696 133008 161602 81680 178946 916 293082 5841
11704b7628m000A80520a29224p635C51341I0430A8308K44615j2853a02301j31
$$ -27628 -31628 180520 -129224 -136859 351341 90430 18308 262923 250070 -102301 -102432
11693a02432r2231P0897I5738c19013c2976p8520J7732E8053K2052a10671A4115
$$ -102432 -194663 -123766 95738 -319013 -32976 -111496 -93764 58053 80105 -110671 14115
11681A48781N5007o9393h5881p1224A28484a34819c0644l0007A377a00122k21067
$$ 148781 203788 134395 -85881 -157105 128484 -134819 -30644 -60651 1377 -100122 -321189
11670c21189A14104L0669n7185P3046g7737g978B83965E5254O0343C0028i3872
$$ -321189 114104 144773 87588 160634 -77737 -7978 283965 55254 115597 30028 -93872
11658C62053G8310K9268L2188k6430J4229b02745A36275n0727b4546I6657J16581
$$ 362053 78310 107578 139766 113336 127565 -202745 136275 85548 -24546 96657 213238
11647B13238M9579a41766M7759j06181A46701b28535E0502b81686a3058D6114
$$ 213238 262817 -141766 -94007 -200188 146701 -228535 50502 -281686 -13058 46114
11636c6855A23805b00952A69097a09128q9859K1615B25551l8451D4917G933J44238
$$ -36855 123805 -200952 169097 -109128 -198987 -177372 225551 187100 44917 7933 152171
11625A52171h716C1246a96900A30119a1315B8756a11891A33628a16545J5801f206
$$ 152171 -8716 31246 -196900 130119 -11315 28756 -111891 133628 -116545 -100744 -6206
11613c62544A27736c6377I7610a2710l311k28450A58181n3846a15667E5349e3955
$$ -362544 127736 -36377 97610 -12710 -16021 -244471 158181 104335 -115667 55349 -53955
11601C71616k9645a63829B64894k9276j14248L52149a87174B7917J45035F3117
$$ 371616 341971 -163829 264894 235618 121370 473519 -187174 27917 172952 63117
11590C4853e398j20845B39210a92880D31004A08939J43725a40787A57045a42449
$$ 34853 -5398 -126243 239210 -192880 431004 108939 252664 -140787 157045 -142449
11579e8244H1084K19114m7474a59984C6137L42851c1243m1682C43873b70095A45984
$$ -58244 81084 300198 252724 -159984 36137 378988 -31243 -72925 343873 -270095 145984
11567i8589B43216G9208M9035a6701r3807H285L70690A77378g7256B80947j15926
$$ -98589 243216 79208 128243 -16701 -110508 8285 378975 177378 -77256 280947 165021
11556A65021J2723D9573f374A9256f4640r8144D90825k05471j13762o2057N7500
$$ 165021 177744 49573 -6374 19256 -64640 -162784 490825 285354 171592 109535 167035
11545A67035a54204A55522J17582a8106A89581b47076j2799J10804j5185A36925
$$ 167035 -154204 155522 273104 -18106 189581 -247076 -259875 -149071 -164256 136925
11534B31459R1452a55029G6672a64368B18003F8009J64650o5456a275B39480J85061
$$ 231459 322911 -155029 76672 -164368 218003 68009 232659 167203 -1275 239480 424541
11523D24541A18604C8471P2689D4088J20454E1924d954j9286B95436n0170j7534
$$ 424541 118604 38471 111160 44088 164542 51924 -4954 -24240 295436 245266 227732
11512B27732o5484k2478Q9964M4536I231J52939l1888N2669R2753I9209J68256
$$ 227732 162248 139770 229734 274270 9231 162170 130282 182951 275704 99209 267465
11501B67465g8354B38527c1868g673B27826K18996a29515C57210j25619H8468
$$ 267465 -78354 238527 -31868 -7673 227826 446822 -129515 357210 231591 88468
11490a2497A32029A4729J62355f8096K5383A89555j4300O4303M678d03579A1674
$$ -12497 132029 14729 177084 -68096 -42713 189555 175255 239558 244236 -403579 11674
11478C2589L40296j80759a03048A63662h7030E00500j31019G6370J5926J14610
$$ 32589 372885 192126 -103048 163662 -87030 500500 369481 76370 92296 206906
11468B06906J81896A06612O298K54138j36583o1079J94597a0765j32626E4403
$$ 206906 388802 106612 112910 367048 230465 169386 363983 -10765 -143391 54403
11457D9417I303K63397E9488P6662J48475l6447k3243q5250D4933a61616B2239
$$ 49417 9303 272700 59488 136150 284625 248178 224935 139685 44933 -161616 22239
11445a24054A20274l6083N1695a07387A63133h2153J5035D957a84841C1215h7897
$$ -124054 120274 84191 135886 -107387 163133 -82153 -67118 4957 -184841 31215 -87897
11433h9603J6409H4547N516B8948J44099B4049J69768J99174j40105i3234l9194
$$ -89603 -73194 84547 90063 28948 173047 24049 193817 392991 252886 -93234 -132428
11422a32428j27382B29709a54779I9836a90688H0690a19930A14453a0852B17579
$$ -132428 -259810 229709 -154779 99836 -190688 80690 -119930 114453 -10852 217579
11411B68805m1896h7001A13453j8263c0191r1480d0041j60178k08394B13221i9428
$$ 268805 226909 -87001 113453 95190 -30191 -121671 -40041 -200219 -408613 213221 -99428
11399A54356a82770C09244a73353B67403a03763B5324a62480A24405l1644a42721
$$ 154356 -182770 309244 -173353 267403 -103763 25324 -162480 124405 92761 -142721
11388C07079c964j21240p2115A16594J90829h0854B35352d6320C7187b41735e4170
$$ 307079 -3964 -125204 -197319 116594 307423 -80854 235352 -46320 37187 -241735 -54170
11376A52669m0437D6962J06795N5176E1960J51198a2637B01549r0774J76799d08876
$$ 152669 112232 46962 153757 208933 51960 203158 -12637 201549 110775 287574 -408876
11364h4347j64221K765E71281i1454A13988c7689j31479H4102a58627c8359A78001
$$ -84347 -248568 -245803 571281 -91454 113988 -37689 -169168 84102 -158627 -38359 178001
11352a06802B38212B4156J64456b09931j0512J05652B73750a76060q3423I0611
$$ -106802 238212 24156 188612 -209931 -220443 -114791 273750 -176060 -259483 90611
11341A73329b08008b5135D9546a40553K9517c3610E2989a50400l2809I5917a01897
$$ 173329 -208008 -25135 49546 -140553 -111036 -33610 52989 -150400 -183209 95917 -101897
11329c02105f3309K3010F5284A7319J79824E0194g2375I9147k5013f6294J7510
$$ -302105 -63309 -40299 65284 17319 197143 50194 -72375 99147 74134 -66294 -48784
11318d8784F6850b20177A23944B8411a08955F3948L2054a68279C2107k736K9344
$$ -48784 66850 -220177 123944 28411 -108955 63948 96002 -168279 32107 29371 58715
11307E8715b6641k2883A71904c5958B7224d7095A93156a04303m7021b8651D1255
$$ 58715 -26641 -49524 171904 -35958 27224 -47095 193156 -104303 -151324 -28651 41255
11295I4150l6463R6611f7867l372l3877j87973h8734k23012a45319A15218l0343
$$ 94150 57687 154298 -67867 -71239 -105116 -293089 -88734 -311746 -145319 115218 84875
11284H4875D784R2970b2585B42790c0956q077C1653M2271d5805k14278B81656
$$ 84875 4784 97754 -22585 242790 -30956 -39033 31653 73924 -45805 -260083 281656
11272C81553a71048F5847e5929A23315A0270M0128k4196a18137k4780M5797A51961
$$ 381553 -171048 65847 -55929 123315 10270 50398 26202 -118137 -142917 -97120 151961
11260d65577a25812n405I2058O5488g6375D8291K91669A08889b3735D6999b68656
$$ -465577 -125812 -131217 92058 157546 -76375 48291 339960 108889 -23735 46999 -268656
11248h0699A38462b0163D0095K9375K9680C6171b88724c5549J0851j85748M5375
$$ -80699 138462 -20163 40095 69470 99150 36171 -288724 -35549 -24698 -210446 -165071
11237a65071o1600B46533f4572A08867a05286b4871j57697B5662J32975l5185
$$ -165071 -226671 246533 -64572 108867 -105286 -24871 -182568 25662 158637 123452
11227A23452b1696B03746a26921A80963i3191j23489b0717O37J33o0216a637j3363
$$ 123452 -21696 203746 -126921 180963 -93191 -216680 -20717 -20080 -19947 -80163 -1637 -15000
11215a5000F5866b59060Q4189b6511j16331q9335b3413j03904A8723J32652k5527
$$ -15000 65866 -259060 -174871 -26511 -142842 -232177 -23413 -127317 18723 151375 125848
11204A25848b68731C3084N0805J14943d40043b5550e067m2047A46657c48544d8466
$$ 125848 -268731 33084 83889 198832 -440043 -25550 -5067 -47114 146657 -348544 -48466
11192a80113A19916a31115I608a38695a9158B44991G0841B3641L8470k3609a76854
$$ -180113 119916 -131115 9608 -138695 -19158 244991 70841 23641 62111 38502 -176854
11180h4852B00654K6859j12200b68301I0534d8242F4702J59317a35138A40621
$$ -84852 200654 227513 115313 -268301 90534 -48242 64702 224019 -135138 140621
11169g2989A86802C9038J04299N0895a30082A20222a55230g1531D769a27273l1322
$$ -72989 186802 39038 143337 194232 -130082 120222 -155230 -71531 4769 -127273 -158595
11158a58595k48N4840f010j69318A75742K5141Q6252I1523l5120b4528A0856J08467
$$ -158595 -158843 -104003 -6010 -175328 175742 200883 287135 91523 56403 -24528 10856 119323
11146A19323K2327a06609C1495a43019e06A64504a64115A04617N7864G4207b25743
$$ 119323 141650 -106609 31495 -143019 -506 164504 -164115 104617 162481 74207 -225743
11134B42327H3120a77549h5141E2105N3513K24245H3115m876N8255J07668p7120
$$ 242327 83120 -177549 -85141 52105 105618 329863 83115 78239 136494 244162 167042
11123A67042J78322A08805m3238Q9652m9975b23912a630A4971a27972A58743F9129
$$ 167042 345364 108805 65567 155219 105244 -223912 -1630 14971 -127972 158743 69129
11111a6443C879J26655A5522i798A9444K47637F7030a60043C28745A18780a59236
$$ -16443 3879 130534 15522 -9798 19444 267081 67030 -160043 328745 118780 -159236
11099A85311B4263K86417r8249a16055B99698I1935K75986i1058A76570J87484
$$ 185311 24263 310680 212431 -116055 299698 91935 367921 -91058 176570 364054
11089C64054a03971A99111R0674d9380j27608C01792M7845b7617C49193a8316
$$ 364054 -103971 199111 289785 -49380 -176988 301792 349637 -27617 349193 -18316
11078c7079H00190C89889B6045L09178A03369K64496O1971R3639j80845J8772
$$ -37079 800190 389889 26045 335223 103369 367865 429836 523475 342630 361402
11068C61402j57057J22228O4583K3150J07699K8559j72028J71210L1606O6236
$$ 361402 204345 326573 391156 414306 522005 550564 378536 549746 581352 647588
11058F47588L4884k71847K54808j56474L23687J0481j25613j15890m2847K29723
$$ 647588 682472 410625 665433 508959 832646 843127 717514 601624 558777 788500
11048G88500q0609P4439q4701L8663q9893K62686k2462D11687K02534O0099K16096
$$ 788500 707891 782330 697629 736292 646399 909085 886623 411687 614221 674320 890416
11037H90416j36189O7509J21148l37321L39041k26213J57121k63948m5806J63767
$$ 890416 754227 821736 942884 605563 944604 718391 875512 611564 565758 729525
11027G29525j56349K67736k31858K69143j26200J84275k05346j46155J98762o8590
$$ 729525 573176 840912 609054 878197 751997 936272 730926 584771 783533 714943
11017G14943L3006o2255Q631k18536K25762k34265L80197q4615p197j86041O2738
$$ 714943 747949 685694 694325 475789 701551 467286 847483 762868 755671 569630 632368
11006F32368L1065J81608l44476K68311R7165n0022M1945k04811K00569k94723
$$ 632368 663433 845041 500565 768876 866041 816019 857964 653153 853722 558999
10996E58999P3063J53717O4811j7076j32044q6016l7921M0722J85498J19058j51428
$$ 558999 632062 785779 850590 833514 701470 615454 577533 618255 803753 922811 771383
10985G71383L29768l07201L46576M5598J54628j0692k0661K42449J49646m5456
$$ 771383 1101151 793950 1140526 1186124 1340752 1330060 1309399 1551848 1701494 1656038
10975A656038N12861N52586j84908O21291J55806k13065k66539p5623l88401R5792
$$ 1656038 2168899 2721485 2536577 3157868 3313674 3100609 2834070 2758447 2370046 2465838
10965B465838n23058j76588l1597N2142O3881j09081l57053M56570o7855m899
$$ 2465838 1942780 1766192 1734595 1786737 1850618 1741537 1384484 1841054 1773199 1768300
10955A768300l51493O7792l03751K76657o57257R3344j02782j01301l10799K40778
$$ 1768300 1416807 1484599 1180848 1457505 800248 893592 790810 689509 378710 619488
10945F19488B56545K86074B38550R5439H1240K03475E1626N21496B48203H3714
$$ 619488 256545 542619 238550 333989 81240 284715 51626 573122 248203 83714
10934B25035a24961a2365o3501B65592m3883H2574l2537G536L29768f2453B44578
$$ 225035 -124961 -12365 -75866 265592 221709 82574 50037 7536 337304 -62453 244578
10922b9461G9653f7252k3501j636A02305g3762l8958p0453q1745c8394G0170J86556
$$ -29461 79653 -67252 -90753 -92389 102305 -73762 -112720 -183173 -264918 -38394 70170 256726
10910B56726A10893J56015a41622j1908D6433L5129g2027j27950i7520B5366a99481
$$ 256726 110893 266908 -141622 -153530 46433 81562 -72027 -199977 -97520 25366 -199481
10898d56426a57610c2132n803P093C7181A54a68909h1191I9079J63059a16200
$$ -456426 -157610 -32132 -37935 -30842 37181 154 -168909 -81191 99079 262138 -116200
10886a86182R0993A01984J18636a4682j39964B02822n3793j5777i3236j25748
$$ -186182 -95189 101984 220620 -14682 -154646 202822 149029 133252 -93236 -218984
10876b18984l6874O7221e9476p2750J8367L0404F9523J9245D0946b67919b6153
$$ -218984 -255858 -188637 -59476 -132226 -113859 -83455 69523 88768 40946 -267919 -26153
10864C3024b21662C3877b61937J19055l1481B89669C4283a48150k7143A21606
$$ 33024 -221662 33877 -261937 -142882 -174363 289669 34283 -148150 -175293 121606
10853a0890q0045b7472B44521a59381b2362r9709J3001C17759d0775k99015g9705
$$ -10890 -90935 -27472 244521 -159381 -22362 -122071 -109070 317759 -40775 -339790 -79705
10841g9812C6329a19030b2401j2879l1269A94861J25858A52035p819F9918p417
$$ -79812 36329 -119030 -22401 -35280 -66549 194861 320719 152035 144216 69918 62501
10830F2501J40606m9761d9725q8703F7500J909a9065r7478j04259B89783A00826
$$ 62501 203107 153346 -49725 -138428 67500 69409 -19065 -116543 -220802 289783 100826
10818b61328A7202a8185G6246g2601k49519e3996A50439H377c54466J14387C4643
$$ -261328 17202 -18185 76246 -72601 -322120 -53996 150439 8377 -354466 -240079 34643
10806e7781G9257J56170I3069a93042A63043B6758a53213r8508J11093A34220
$$ -57781 79257 235427 93069 -193042 163043 26758 -153213 -251721 -140628 134220
10795F4205i9197p9201f1047j34919B30662A5682e1997l9679I074O3078g3379
$$ 64205 -99197 -178398 -61047 -195966 230662 15682 -51997 -91676 9074 72152 -73379
10783a15565K6373n9515M2828E8015c5540k90604h1329n0023A32826c6995A85750
$$ -115565 -89192 -148707 -105879 58015 -35540 -326144 -81329 -131352 132826 -36995 185750
10771I3139g4083j60017Q6870P0809b3656j09317E2356i7438H1788l5744a37658
$$ 93139 -74083 -234100 -147230 -76421 -23656 -132973 52356 -97438 81788 46044 -137658
10759c8600l96189a12202k9832A64605b41314f2012B30073H0091P3338N2350H5536
$$ -38600 -434789 -112202 -142034 164605 -241314 -62012 230073 80091 153429 205779 85536
10747A3888c27002B42582I8116b4384k04299d548j95582b5793R883m06674I1993
$$ 13888 -327002 242582 98116 -24384 -228683 -4548 -200130 -25793 -15910 -422584 91993
10735a75719A19235C9657a43901A37034a400C73631A25027P2767b10437E4967
$$ -175719 119235 39657 -143901 137034 -1400 373631 125027 197794 -210437 54967
10724d6314F6113J26154a10246j70107K6334J20322k00938f6119A57144a31433
$$ -46314 66113 192267 -110246 -280353 -254019 -133697 -334635 -66119 157144 -131433
10713A35979J58015F6385A6366a38573j7550j28545A54488c41898B28385i9093
$$ 135979 293994 66385 16366 -138573 -156123 -284668 154488 -341898 228385 -99093
10702h8065B66222b53730h0092E6967K87870i1726p216A59095a25574A88670O061
$$ -88065 266222 -253730 -80092 56967 344837 -91726 -98942 159095 -125574 188670 194731
10691A94731K11019A16902Q124d603A87099a68017j75280A83789h1454A23559
$$ 194731 405750 116902 125026 -4603 187099 -168017 -343297 183789 -81454 123559
10680F5174f369F3451b7874A57568b6787o8454d148k88740L4650o180J12796b7117
$$ 65174 -6369 63451 -27874 157568 -26787 -95241 -4148 -292888 -258238 -264418 -151622 -27117
10667d2360A50330d3308k05555d8453A2396K61020g3146A4041a1885l16291b3125
$$ -42360 150330 -43308 -248863 -48453 12396 273416 -73146 14041 -11885 -328176 -23125
10655b1662j1372a0864B98956b6013r0325F1045b21659C6523a99963C00632B2137
$$ -21662 -33034 -10864 298956 -26013 -116338 61045 -221659 36523 -199963 300632 22137
10643i2590A43002d7566B06629B4966M0551O5503l7624a00778J3364J9148j9413
$$ -92590 143002 -47566 206629 24966 65517 131020 93396 -100778 -87414 -68266 -87679
10632h7679B57603a08749A85533h1784A01729a49263J7862A11397H802i6695B7322
$$ -87679 257603 -108749 185533 -81784 101729 -149263 -131401 111397 8802 -96695 27322
10620A32440b28079K9742C60041e4172n1921A34439a76784j37382g3485j15632
$$ 132440 -228079 -198337 360041 -54172 -106093 134439 -176784 -314166 -73485 -189117
10610a89117e9767H8235b67641j05396A21384J26751e9529F1715a11347d0550
$$ -189117 -59767 88235 -267641 -373037 121384 248135 -59529 61715 -111347 -40550
10599c333j36900j50620B7742a7515A22561n2664J07597a3155B41952F3430g5624
$$ -3333 -140233 -290853 27742 -17515 122561 69897 177494 -13155 241952 63430 -75624
10587a59390B12031b11844a5159H4656Q0820g6A37117a9792I4389K63085a05311
$$ -159390 212031 -211844 -15159 84656 165476 -76 137117 -19792 94389 357474 -105311
10575C07396c28497J16942O3003B02537a34425k44565f076C34122j41302o1752
$$ 307396 -328497 -211555 -148552 202537 -134425 -378990 -6076 334122 192820 131068
10565A31068b6007F3835a83876m3264E7278e91777A57881J8375b54230A4327J39147
$$ 131068 -26007 63835 -183876 -227140 57278 -591777 157881 176256 -254230 14327 153474
10554A53474h2525j03945A01160i5263B06039C7590j5375e9133r0168a8129o5700
$$ 153474 -82525 -186470 101160 -95263 206039 37590 22215 -59133 -149301 -18129 -83829
10543h3829j33889a05142A50748A9088a15173k1192A47983b44397q6081R2873
$$ -83829 -217718 -105142 150748 19088 -115173 -136365 147983 -244397 -330478 -237605
10533b37605j67354a19294d9327C75531C6834g2811k52H5492b48514b1768A22920
$$ -237605 -404959 -119294 -49327 375531 36834 -72811 -73063 85492 -248514 -21768 122920
10521a33132A68095i6961k92778b8498j76747e0327C5049P3159c68868i1818A22063
$$ -133132 168095 -96961 -389739 -28498 -205245 -50327 35049 108208 -368868 -91818 122063
10509a34155o3878r6225g9884B6679c00414g096A01746J91149A1121c01317J18232
$$ -134155 -198033 -294258 -79884 26679 -300414 -7096 101746 292895 11121 -301317 -183085
10498a83085K5439j2246a5897j64080a0738j79692A15605K151b25435A8675K20922
$$ -183085 -157646 -169892 -15897 -179977 -10738 -190430 115605 117756 -225435 18675 239597
10487B39597f0638m7188H2384H078K21577A08149m3002L82599o6752A69083i6534
$$ 239597 -60638 -107826 82384 8078 229655 108149 65147 447746 380994 169083 -96534
10475B00798l0061E2125J46120a21734C40709E0022J1235J56374q9949K2248F5845
$$ 200798 170737 52125 198245 -121734 340709 50022 61257 217631 127682 149930 65845
10463a08911A17337a68327O2940A76178J82693b5717B65713d19117J73787B1856
$$ -108911 117337 -168327 -105387 176178 358871 -25717 265713 -419117 -245330 21856
10452c14423I6850B7731K08652b37388B4938a70420P6924B3989q477e383k44797
$$ -314423 96850 27731 236383 -237388 24938 -170420 -93496 23989 15512 -5383 -250180
10441b50180j34634D2326k125a71274G51K12741b85874D8166J87241b1147B81048
$$ -250180 -384814 42326 40201 -171274 751 213492 -285874 48166 235407 -21147 281048
10429a95624B22739H7967C8312J08311b97610A25025M8106C077J32233B0977J28849
$$ -195624 222739 87967 38312 146623 -297610 125025 173131 3077 135310 20977 149826
10418A49826n2752l9919d82760F470J76794b09429h8364j93262e9793B66001D6651
$$ 149826 97074 57155 -482760 6470 183264 -209429 -88364 -281626 -59793 266001 46651
10406a3728I3520a48155B3505M9917K77198a19285n530A85184o676a2152C4437
$$ -13728 93520 -148155 23505 73422 350620 -119285 -124815 185184 178508 -12152 34437
10394B0337J56652P9726A11760J1775J40662a26703c5485D91775A78463a63896
$$ 20337 176989 256715 111760 123535 264197 -126703 -35485 491775 178463 -163896
10383C94334b30961A67692E7028L31856j46412k2917K74937a44170C21653R987
$$ 394334 -230961 167692 57028 388884 242472 219555 494492 -144170 321653 331640
10373C31640q8794Q1438j61803K77298r9606l6431L22371K64968m15713l3275
$$ 331640 242846 324284 162481 439779 340173 303742 626113 891081 475368 442093
10363D42093B20246C0050K16259Q528L01110B8949L40741J01975D1552K81141
$$ 442093 220246 30050 246309 254837 555947 28949 369690 471665 41552 322693
10353C22693C3655M20734P0532J87756B48213N1099l5422K31660B07651J12799
$$ 322693 33655 454389 524921 712677 248213 299312 263890 495550 207651 320450
10343C20450a5133E23998A17912L33169j55545n1261o5838n2878J36943N3572
$$ 320450 -15133 523998 117912 451081 295536 244275 178437 125559 262502 316074
10333C16074B6458R422M0020L51167E5721a4816A79054J36508G9425L5519K93930
$$ 316074 26458 35880 75900 427067 55721 -14816 179054 315562 79425 114944 408874
10322D08874C1890A284L40800H7766c86401a29041a2739B57068f8617A2361b94249
$$ 408874 31890 1284 342084 87766 -386401 -129041 -12739 257068 -68617 12361 -294249
10310B619b70062k1468A03835G316N9766i2668l85991A9404a68926P4902j48191
$$ 2619 -270062 -291530 103835 7316 67082 -92668 -478659 19404 -168926 -94024 -242215
10299b42215J08570B25719a95121m7724A7601g0669B9913J33366a03319B218Q0126
$$ -242215 -133645 225719 -195121 -242845 17601 -70669 29913 163279 -103319 2218 82344
10288H2344R9513c1830j2318b0149j35380B59786b5504l14155I5647M422P641
$$ 82344 181857 -31830 -44148 -20149 -155529 259786 -25504 -339659 95647 100069 107710
10277A07710k503J23202c07842c1224B06134r2832b06622C83765j79563E0595
$$ 107710 105207 228409 -307842 -31224 206134 113302 -206622 383765 204202 50595
10266A62433a22542q5129I9413d0512A50645l1423K62756j33913J16508L04430
$$ 162433 -122542 -207671 99413 -40512 150645 119222 381978 248065 364573 669003
10256F69003C25999j55542A5486K1185J73902b66688D2793j2971N0607a76244
$$ 669003 325999 170457 15486 36671 210573 -266688 42793 29822 80429 -176244
10245b4822q3264r9467R1424q442L6514n3170k17533A20191h3099A50761D0023
$$ -24822 -108086 -207553 -116129 -124571 -88057 -141227 -358760 120191 -83099 150761 40023
10233d55691C70631j62211c61753q5241J78294H2888a63177m6941j46430c0005
$$ -455691 370631 208420 -361753 -446994 -268700 82888 -163177 -210118 -356548 -30005
10222a1015l37491A47168F8064P8399G2268J703b4656D62318l6538b38697h021
$$ -11015 -348506 147168 68064 146463 72268 73971 -24656 462318 425780 -238697 -8021
10210a02289M6245F0553K87671a84412B18600q7986a93228g6170k30121D0674
$$ -102289 -56044 60553 348224 -184412 218600 130614 -193228 -76170 -306291 40674
10199a56146g5491a9576j97473A13971J29256d38948K07944B38379b335A23098
$$ -156146 -75491 -19576 -217049 113971 243227 -438948 -231004 238379 -2335 123098
10188h9666d1306p0589c4248J5626j28742B3633a51142O0460H5842J08652B0063
$$ -89666 -41306 -111895 -34248 -18622 -147364 23633 -151142 -90682 85842 194494 20063
10176a18197k00670c8369l59181d6552o8650m02358g6580j26347h9209j5460A72978
$$ -118197 -318867 -38369 -397550 -46552 -115202 -517560 -76580 -202927 -89209 -104669 172978
10164A62539a65752e0806E1642i5851J558A51622C2866g423n7303I1584L55543
$$ 162539 -165752 -50806 51642 -95851 -94293 151622 32866 -7423 -64726 91584 447127
10153D47127k04500h3430j82354J32092B829b74130n428C821d1127A27386b70764
$$ 447127 242627 -83430 -265784 -133692 2829 -274130 -279558 3821 -41127 127386 -270764
10141b08169n2549A71445l7746b07372D0536c4727H3829a71539c993k82015B02148
$$ -208169 -260718 171445 133699 -207372 40536 -34727 83829 -171539 -3993 -286008 202148
10129B3817b29029c5914A28250a70089A05076a0731A56238h1371j63237A24245
$$ 23817 -229029 -35914 128250 -170089 105076 -10731 156238 -81371 -244608 124245
10118a87546E0258c97663a41154j42763j66283F1334b97485k7997A29722D3827
$$ -187546 50258 -397663 -141154 -283917 -450200 61334 -297485 -325482 129722 43827
10107a98282R5882Q283A41623C9900d04472B5554L1265h4663E226Q2465c37955
$$ -198282 -102400 -94117 141623 39900 -404472 25554 56819 -84663 5226 87691 -337955
10095B11285c13039E7912J43689f0710o3811F3499b19545E2831i70j46040n09433
$$ 211285 -313039 57912 201601 -60710 -124521 63499 -219545 52831 -970 -147010 -656443
10084f56443L04312f3121b4274j11084k61619J45271M9891B20106d9641D9913
$$ -656443 -352131 -63121 -24274 -135358 -396977 -251706 -201815 220106 -49641 49913
10073A96665F2074f7781q4604c0698j14752c8283j05888J6632A62215a3132c901
$$ 196665 62074 -67781 -152385 -30698 -145450 -38283 -144171 -127539 162215 -13132 -3901
10061g6680K8447j47196A16912a25936j16412e5158F4310a34421C4647K44646
$$ -76680 -48233 -195429 116912 -125936 -242348 -55158 64310 -134421 34647 279293
10051B79293c46644H0635i8460C563J35138c07234K7503a37107b3464J417A04753
$$ 279293 -346644 80635 -98460 3563 138701 -307234 -279731 -137107 -23464 -22047 104753
10039A26321b16955j67614a85733k2025L6556I6460b50532m3675J31238B06325
$$ 126321 -216955 -384569 -185733 -207758 -171202 96460 -250532 -294207 -162969 206325
10028b71087j7907M9330j07053E5499a82088m302A49215b05451J9240A55078c67171
$$ -271087 -288994 -239664 -346717 55499 -182088 -186390 149215 -205451 -186211 155078 -367171
10016a06378n2695H2620i8987e602E3350J86216H0788L7631d40896A12258C0425
$$ -106378 -159073 82620 -98987 -5602 53350 239566 80788 118419 -440896 112258 30425
10004i5411k8517a1653C1518a17878B21099A02634Q6971b48069A1333e6798A43552
$$ -95411 -123928 -11653 31518 -117878 221099 102634 189605 -248069 11333 -56798 143552
9992e4454r3053A39536b33948K4040a8213r4498k6609A81986C9719c5343A26016
$$ -54454 -147507 139536 -233948 -209908 -18213 -112711 -139320 181986 39719 -35343 126016
9980E8534l722a89155G3716P8057d72191J5983C43555b22879B95060A13563b56448
$$ 58534 54812 -189155 73716 151773 -472191 -456208 343555 -222879 295060 113563 -256448
9968b75307A51343F3483b87569I4434m1472f8773k70039P1520A45839c66057k212
$$ -275307 151343 63483 -287569 94434 52962 -68773 -338812 -267292 145839 -366057 -368269
9957c68269F9242k7570a27626D3179b78571a0384j6314k49797b8667k40474P2302
$$ -368269 69242 41672 -127626 43179 -278571 -10384 -26698 -276495 -28667 -269141 -196839
9946a96839D4364b07771e2803m0404l4720q523N5275H1261a99249j44529I1529
$$ -196839 44364 -207771 -52803 -93207 -127927 -136450 -81175 81261 -199249 -343778 91529
9934c00086D03098b25560k96948G7461O0068a7328o2299A7891K50333g5089r9250
$$ -300086 403098 -225560 -522508 77461 137529 -17328 -79627 17891 268224 -75089 -174339
9923a74339Q0507E2478g5190p3628i031q4053p9359n1751e4833I4846b14655C0374
$$ -174339 -93832 52478 -75190 -148818 -9031 -93084 -172443 -224194 -54833 94846 -214655 30374
9910a50838r0483f1791A13961D0440c21014h057p4850j9940A16162c01089f529
$$ -150838 -241321 -61791 113961 40440 -321014 -8057 -82907 -102847 116162 -301089 -6529
9898c0505a3187A02490b02455B01440E6107b08029A53345a25188j67439a11662
$$ -30505 -13187 102490 -202455 201440 56107 -208029 153345 -125188 -292627 -111662
9887a17149B3073K7226b4788p5858o2386N6184H9226l7976b21275g6617j04829
$$ -117149 23073 50299 -24788 -100646 -163032 -106848 89226 51250 -221275 -76617 -181446
9876a81446d9910j27908j40397h871j83637B83169b35861j33215N3161Q2221D2554
$$ -181446 -49910 -177818 -318215 -8871 -192508 283169 -235861 -369076 -315915 -233694 42554
9864H7760i689l979B0423a60923d5986A23088a86083l2938E3086g2409B54938
$$ 87760 -9689 -13668 20423 -160923 -45986 123088 -186083 -219021 53086 -72409 254938
9852a30347N7218i347j03336a1677r6285B19037b69887A75511E325e8591l65785
$$ -130347 -73129 -9347 -112683 -11677 -107962 219037 -269887 175511 5325 -58591 -424376
9841d24376c9627C9492J05466D8190b08178j56180a01523G5308A6715b93940a18764
$$ -424376 -39627 39492 144958 48190 -208178 -364358 -101523 75308 16715 -293940 -118764
9829E8822h0818F1576L2708e9410l2458K5611b6890H0531a41192c3285m7839l99
$$ 58822 -80818 61576 94284 -59410 -91868 -66257 -26890 80531 -141192 -33285 -81124 -81523
9817h1523r275M2783B0206D916c04418l9383J22790b9522j33788F1519m435o864
$$ -81523 -90798 -48015 20206 4916 -304418 -343801 -221011 -29522 -163310 61519 57084 50220
9805E0220a70643m0217C3207K7817a6511A04139P9480h8926A44663a90236A82912
$$ 50220 -170643 -210860 33207 61024 -16511 104139 183619 -88926 144663 -190236 182912
9793a27355H835b15282H0367a37727A42845b54547I644J54352p4644a71572B709
$$ -127355 8835 -215282 80367 -137727 142845 -254547 9644 163996 89352 -171572 2709
9781e1213F35R0985k9282a68723K6737A35401h1137A12961a16009I4716e4913
$$ -51213 635 91620 62338 -168723 -141986 135401 -81137 112961 -116009 94716 -54913
9769c7696E942g4483A52704a21499B01087d94608c5552l07301a45291m6077M7560
$$ -37696 5942 -74483 152704 -121499 201087 -494608 -35552 -342853 -145291 -191368 -143808
9758a43808I8871a02243j90414J3125a21701j58921A18638a04898j87081g5206
$$ -143808 98871 -102243 -292657 -279532 -121701 -280622 118638 -104898 -291979 -75206
9747a97945j5798b0390B18283a08375B76283h4187I8105a57185C9839R7829c3639
$$ -197945 -213743 -20390 218283 -108375 276283 -84187 98105 -157185 39839 137668 -33639
9735a59182C4802b419A04891b8614A28779m8458g8884B05026b05574F635b14065
$$ -159182 34802 -2419 104891 -28614 128779 80321 -78884 205026 -205574 6635 -214065
9723B7575c84195d5759A43429a43969J0504r0627p3127c5613k05562d7936P185
$$ 27575 -384195 -45759 143429 -143969 -133465 -224092 -297219 -35613 -241175 -47936 -40751
9712d0751D75073G8206N3030b61979o8427B06656a9341l17413a05187b8326j60606
$$ -40751 475073 78206 131236 -261979 -330406 206656 -19341 -336754 -105187 -28326 -188932
9701a88932h5582F1263A8070a07292A88199g9148c7870A34278a98269A05144E205
$$ -188932 -85582 61263 18070 -107292 188199 -79148 -37870 134278 -198269 105144 5205
9689a32344H1824l8472g6702j13883D1902a98916j2150A42708a73979A40448a29213
$$ -132344 81824 43352 -76702 -190585 41902 -198916 -211066 142708 -173979 140448 -129213
9677i232A09386k1490P966J50803c06803g7600A01323e80116B47783b4436o0955
$$ -9232 109386 87896 95862 246665 -306803 -77600 101323 -580116 247783 -24436 -85391
9666h5391j27701M0199l0820F0716e6725p5792r1228A73630a97897B64331a62381
$$ -85391 -213092 -172893 -203713 60716 -56725 -132517 -223745 173630 -197897 264331 -162381
9654b28979b286j23454O070c7163q5049B04176P7354b00936O5526C89886a93827
$$ -228979 -2286 -125740 -119670 -37163 -122212 204176 281530 -200936 -135410 389886 -193827
9642h18o0775A22471F1052b9998j35446B90730c3991P120j85124L9422C08243
$$ -818 -61593 122471 61052 -29998 -165444 290730 -33991 -26871 -211995 -172573 308243
9630c77038A84556e0697k57692R7518M1870A70245b42558J03702B0708e1662A4552
$$ -377038 184556 -50697 -308389 -210871 -169001 170245 -242558 -138856 20708 -51662 14552
9618b0508K670A75548e3134a0450j75274e0919k20177C37142A7552a99426A33356
$$ -20508 -17838 175548 -53134 -10450 -185724 -50919 -271096 337142 17552 -199426 133356
9606a67596A89583c39811A94028c6772A41672b22509A23650f8523b3836A46367
$$ -167596 189583 -339811 194028 -36772 141672 -222509 123650 -68523 -23836 146367
9595B6816a09206e1033B841M5292a18251c5410l0014k98776H7707d50260e4108
$$ 26816 -109206 -51033 2841 48133 -118251 -35410 -65424 -364200 87707 -450260 -54108
9583a5017A1576K6438f1421p6235A03478d50700B4715k201b12324B85690i0937
$$ -15017 11576 38014 -61421 -137656 103478 -450700 24715 22514 -212324 285690 -90937
9571C01976a27495E2058P551c48238A39978M941b60550J26996A14294b12665B9363
$$ 301976 -127495 52058 59609 -348238 139978 144919 -260550 -133554 114294 -212665 29363
9559a93278j47508J29260B20186b53815A2939a18900l0676c213k45917a6902A69436
$$ -193278 -340786 -211526 220186 -253815 12939 -118900 -149576 -3213 -249130 -16902 169436
9547a09601l5136k1476A9300e221C3763c141B95750E8640J12866N8929d77747
$$ -109601 -144737 -166213 19300 -5221 33763 -3141 295750 58640 171506 230435 -477747
9535a92149M4120j62984b3702n715j45702k17879A63731b07527k9106A36549c13900
$$ -192149 -148029 -311013 -23702 -29417 -175119 -392998 163731 -207527 -236633 136549 -313900
9523i8067N494L1653j94202c5943k57473b6338q6031p4872D04032D2582a63809
$$ -98067 -92573 -60920 -255122 -35943 -293416 -26338 -112369 -187241 404032 42582 -163809
9511a71171a0805q6902j60652J02720n741l2597B6022i9851G000Q8161c98991
$$ -171171 -10805 -97707 -258359 -155639 -161380 -193977 26022 -99851 7000 95161 -398991
9499B095L7189r225b63139A52220c46981B48726a92556m4874j27184J74605n6815
$$ 2095 39284 30059 -263139 152220 -346981 248726 -192556 -237430 -364614 -190009 -246824
9488b46824j00108d5910G9045a98124C6612K41084b20023A52956a98714k48E0676
$$ -246824 -346932 -45910 79045 -198124 36612 277696 -220023 152956 -198714 -198962 50676
9476f0946e699k3602l29011g1823j24202A80773e597j58775m292D6352A7522J49574
$$ -60946 -5699 -29301 -358312 -71823 -196025 180773 -5597 -164372 -168664 46352 17522 167096
9464A67096L3502A1306b34413f0020K3845o0870j29474B09260b31765e6851o1304
$$ 167096 200598 11306 -234413 -60020 -36175 -97045 -226519 209260 -231765 -56851 -118155
9453a18155D9468d5024A43205a288o4675A61906o9066b00149P8788A4385J08947
$$ -118155 49468 -45024 143205 -1288 -65963 161906 92840 -200149 -121361 14385 123332
9442A23332M0510a05363j9359E9145f3769k4456j41974q279h9364B7621m050b71266
$$ 123332 163842 -105363 -124722 59145 -63769 -88225 -230199 -238478 -89364 27621 23571 -271266
9429a06184k81513a88684A24684F0643a20355A26554c35286A62871a48493C06028
$$ -106184 -387697 -188684 124684 60643 -120355 126554 -335286 162871 -148493 306028
9418A09917f7538K0873F81a04522A20001a82635O0361L5520A15506e2327M95e217
$$ 109917 -67538 -46665 681 -104522 120001 -182635 -122274 -86754 115506 -52327 -51832 -5217
9405D6897j9411J46745b5914k8489j67769b3276B0147b71979H3078p664K39562
$$ 46897 27486 174231 -25914 -54403 -222172 -23276 20147 -271979 83078 75414 314976
9394C14976b81614a03880K1331C25984H7700k9659b02901k8140O2533B23864b40299
$$ 314976 -281614 -103880 -82549 325984 87700 58041 -202901 -231041 -168508 223864 -240299
9382A14571g9445K7564a884p6845A40281C7555G261c337j47211q528p028A20099
$$ 114571 -79445 -51881 -1884 -78729 140281 37555 7261 -3337 -150548 -159076 -166104 120099
9369A87358M8636A15550a71252j35341C06002a4535j20429K7764j30469I8856
$$ 187358 235994 115550 -171252 -306593 306002 -14535 -134964 -107200 -237669 98856
9358a05209J3798q7816f5130G5187L1961h2877k18006f9219A54851Q241A8628
$$ -105209 -91411 -179227 -65130 75187 107148 -82877 -300883 -69219 154851 163092 18628
9346A01077A5386a315n5578B7076i8930a0796B8077a70952Q3123B1695L2905K3983
$$ 101077 15386 -1315 -56893 27076 -98930 -10796 28077 -170952 -87829 21695 54600 78583
9334G8583c53388A59220a55510j16563C06016a69611c0113A59857b50525A8482
$$ 78583 -353388 159220 -155510 -272073 306016 -169611 -30113 159857 -250525 18482
9323F698a35353k15280a68694A82100O342G7336a39927c2492C2826K19808b03608
$$ 6698 -135353 -350633 -168694 182100 188442 77336 -139927 -32492 32826 252634 -203608
9311A25483O6237a2678E6536J8163R8541b22793O695E4845K3956k891J7562J5582
$$ 125483 191720 -12678 56536 74699 173240 -222793 -216098 54845 78801 75910 93472 109054
9299A09054c10202A43802g0950l71039a45474M2798b8838B68433q0138F5400a94404
$$ 109054 -310202 143802 -70950 -441989 -145474 -102676 -28838 268433 188295 65400 -194404
9287C8484c89865A0760J48152k6103b76118A04181a6959A0700b75655A3943c58928
$$ 38484 -389865 10760 158912 132809 -276118 104181 -16959 10700 -275655 13943 -358928
9275c39298K8594a33988j36811C2804c37166Q0793a17104A3194E28a31597k3443
$$ -339298 -310704 -133988 -270799 32804 -337166 -256373 -117104 13194 528 -131597 -155040
9264a55040j9659A31399k8859d09596H4166C1712O915a11239k61497J77827M7014
$$ -155040 -174699 131399 102540 -409596 84166 31712 38627 -111239 -372736 -194909 -147895
9253a47895F9691J79888D1971a44992o6740H404c9499A79505c11704a01749c0034
$$ -147895 69691 249579 41971 -144992 -211732 8404 -39499 179505 -311704 -101749 -30034
9241f6864j24656I2614f0360q8397O1624l70540a26534J4923A2703e0096I1579
$$ -66864 -191520 92614 -60360 -148757 -87133 -457673 -126534 -111611 12703 -50096 91579
9229B6767a54999o1227K9856M2355C98221a17913o0274H2710d2674l7832A85337
$$ 26767 -154999 -216226 -186370 -144015 398221 -117913 -178187 82710 -42674 -80506 185337
9217h5517m2419B39341i3799H786a8442j82415A51512a44741d5912l64819B75071
$$ -85517 -127936 239341 -93799 8786 -18442 -200857 151512 -144741 -45912 -410731 275071
9205A8551a38355A3530a82994k31105A6724b91373L6066A03104c55874h7126o2834
$$ 18551 -138355 13530 -182994 -414099 16724 -291373 -255307 103104 -355874 -87126 -149960
9194a49960B3682g877k70557a00225j80701C2079c06501E6006a15355A16628a85641
$$ -149960 23682 -7877 -278434 -100225 -280926 32079 -306501 56006 -115355 116628 -185641
9182A69970F3785c83590g6335K8404j04249O4730r4185j55138J51398i0412k04834
$$ 169970 63785 -383590 -76335 -47931 -152180 -87450 -181635 -336773 -185375 -90412 -295246
9171b95246J47314F4051g6680H9413b57724h5954A11084a23842L2207n7279A31580
$$ -295246 -147932 64051 -76680 89413 -257724 -85954 111084 -123842 -91635 -148914 131580
9159A00885B7319Q294a09915b2348A29557L6085b1196l6543j71538J09454b2238
$$ 100885 27319 35613 -109915 -22348 129557 165642 -21196 -57739 -229277 -119823 -22238
9147B27301b97148g3145B306e50744b46553A94548D1832a09848M3042E6984a9728
$$ 227301 -297148 -73145 2306 -550744 -246553 194548 41832 -109848 -66806 56984 -19728
9135f130I7751e707B7032N5492b86987J34969B48446a37231c8579F8612a63813
$$ -6130 97751 -5707 27032 82524 -286987 -152018 248446 -137231 -38579 68612 -163813
9123A31908h4996L5130D0906M5387a22534G4742M2125d1941B71630h9344k3890
$$ 131908 -84996 -49866 40906 86293 -122534 74742 116867 -41941 271630 -89344 -113234
9112a13234c1639k02945m1907j10196A22201a06152a6226j05465j21781A32617
$$ -113234 -31639 -234584 -276491 -386687 122201 -106152 -16226 -121691 -243472 132617
9101C2295K56332a79211H2164J1143b4912I9232e6908A47692J74540a05302G6287
$$ 32295 288627 -179211 82164 93307 -24912 99232 -56908 147692 322232 -105302 76287
9089B46250b51535A18788O6932G1510a92372A88304q3274a82175h6816A20515
$$ 246250 -251535 118788 185720 71510 -192372 188304 105030 -182175 -86816 120515
9078D735K05698b72241a6264l46451e1954A7611J78381a74200A30376j4062e5939
$$ 4735 210433 -272241 -16264 -362715 -51954 17611 195992 -174200 130376 116314 -55939
9066B8914A3117b67053c1730m8009j62665a01130A28830o2110a93136R0548E4631
$$ 28914 13117 -267053 -31730 -79739 -242404 -101130 128830 66720 -193136 -102588 54631
9054c17156A71395b15609J06052N0685i048k44755B250O4223f206k81267e4185
$$ -317156 171395 -215609 -109557 -58872 -9048 -253803 2250 66473 -6206 -287473 -54185
9042a07693d2049B9050g2382k29746D9793b82671B4090a39040O1145b5464k4517
$$ -107693 -42049 29050 -72382 -302128 49793 -282671 24090 -139040 -77895 -25464 -49981
9031d9981j88372e1334l1656A00415a34329o175A13702j8107b54919A4643B644
$$ -49981 -238353 -51334 -82990 100415 -134329 -140504 113702 95595 -254919 14643 2644
9019a47589A2244f3115A70042d4247l5138G0318b19832b8503r3A16923a4382A17881
$$ -147589 12244 -63115 170042 -44247 -79385 70318 -219832 -28503 -28596 116923 -14382 117881
9006A19771b82758K7880f9698n5908H8791P0075a71310K124h2273J7125A51950
$$ 119771 -282758 -254878 -69698 -125606 88791 158866 -171310 -169186 -82273 -65148 151950
8994D26021a52510K9431l66820B08387b15382i1045l7976j4580e4087j75598A36053
$$ 426021 -152510 -123079 -489899 208387 -215382 -91045 -129021 -143601 -54087 -229685 136053
8982e2476j10310h844l71673B72234p5469a52292k4971j41252b2862n6462A33099
$$ -52476 -162786 -8844 -380517 272234 196765 -152292 -177263 -318515 -22862 -79324 133099
8970a96054K9166e5529b6618j37126B0461J98620d7134a5287A70090a6263n5692
$$ -196054 -166888 -55529 -26618 -163744 20461 219081 -47134 -15287 170090 -16263 -71955
8959g1955m2473L0081j70519q8326A85981a37666C5316a25571c9737n9459M4694
$$ -71955 -114428 -84347 -254866 -343192 185981 -137666 35316 -125571 -39737 -99196 -54502
8948e4502E4051d6074A33019c4075H3020a0382E0190b81121j23917L3423a67383
$$ -54502 54051 -46074 133019 -34075 83020 -10382 50190 -281121 -405038 -371615 -167383
8936F0065N6171k1540J17069h1341F00L104g021k21944A88695D8131J80213j0121
$$ 60065 116236 94696 211765 -81341 600 3704 -7021 -228965 188695 48131 228344 218223
8924B18223L02667R42456M082089L456170B348282D52428p6570H0994J41226j08149
$$ 218223 520890 1463346 5545435 9001605 2348282 452428 375858 80994 222220 114071
8914A14071J52853d309j47705N5177C00267A28110O0785J22933e2720E2503a67655
$$ 114071 266924 -4309 -152014 -96837 300267 128110 188895 311828 -52720 52503 -167655
8902C07880c15591B94495a26469A8038J0297b66731P0968A29891k0855c7255a6542
$$ 307880 -315591 294495 -126469 18038 28335 -266731 -195763 129891 109036 -37255 -16542
8890a60218B5523N120d380j11914B0448f2141K7222I3551a30554B54527a9668
$$ -160218 25523 30643 -4380 -116294 20448 -62141 -34919 93551 -130554 254527 -19668
8878A35885c57942i1429H022h4718A65456m1127c90546a3697k09267A34470a58483
$$ 135885 -357942 -91429 8022 -84718 165456 124329 -390546 -13697 -222964 134470 -158483
8866c2700j24923d0243j30979H4293a9737k35939c0763F0939c36899I6493d4793
$$ -32700 -157623 -40243 -171222 84293 -19737 -255676 -30763 60939 -336899 96493 -44793
8854c21308f4288J3208m0603m8798A55470P9000J03605F4286f4802j40312A08998
$$ -321308 -64288 -51080 -91683 -140481 155470 234470 338075 64286 -64802 -205114 108998
$$ [...]
##END NTUPLES=NMR SPECTRUM
##END=
