##TITLE=AC1415_BRAA12224_7652885_dGozNmR9BP
##JCAMPDX= 6.0         $$ Bruker NMR JCAMP-DX V2.0
##DATA TYPE= NMR SPECTRUM
##DATA CLASS= NTUPLES
##ORIGIN= BRUKER
##OWNER= Administrator
$$ 1.72 TOPSPIN		Version 2.1
$$ 2013-04-11 17:29:37.150 -0700  Administrator@X
$$ Compression mode = diff/dup
##.OBSERVE FREQUENCY= 400.02188249412
##.OBSERVE NUCLEUS= ^1H
##.ACQUISITION MODE= SIMULTANEOUS (DQD)
##.ACQUISITION SCHEME= undefined
##.AVERAGES= 64
##.DIGITISER RES= 22
##SPECTROMETER/DATA SYSTEM= spect
##.PULSE SEQUENCE= noesygpps1d.comp
##.SOLVENT NAME= COFFEE_meoh
##.SHIFT REFERENCE= INTERNAL, COFFEE_meoh, 1, 14.96098
##AUDIT TRAIL= $$ (NUMBER, WHEN, WHO, WHERE, PROCESS, VERSION, WHAT)
$$ ##TITLE= Audit trail, TOPSPIN		Version 2.1
$$ ##JCAMPDX= 5.01
$$ ##ORIGIN= Bruker BioSpin GmbH
$$ ##OWNER= Administrator
$$ $$ E:\/data/COFFEE/nmr/AC1415_BRAA12224_7652885_dGozNmR9BP/22/pdata/1/auditp.txt
$$ ##AUDIT TRAIL=  $$ (NUMBER, WHEN, WHO, WHERE, PROCESS, VERSION, WHAT)
(   1,<2013-04-11 17:29:31.259 -0700>,<Administrator>,<X>,<go>,<TOPSPIN 2.1>,
      <created by zg
	started at 2013-04-11 17:18:01.879 -0700,
	POWCHK enabled, PULCHK disabled,
       configuration hash MD5:
       33 CF 6A 21 5C D3 B9 40 6C 15 AA 8D 27 A2 4F 13
       data hash MD5: 64K
       97 B8 60 0A E7 5F 46 2B BC DD 3A D9 92 7B 34 C5>)
(   2,<2013-04-11 17:29:34.306 -0700>,<Administrator>,<X>,<proc1d>,<TOPSPIN 2.1>,
      <Start of raw data processing
       efp LB = 0.3 FT_mod = 6 PKNL = 1 PHC0 = 0 PHC1 = 0 SI = 128K 
       data hash MD5: 128K
       C8 CA 0E 17 5E 63 79 F7 1F 93 B9 F7 7E 9B 20 B7>)
(   3,<2013-04-11 17:29:35.337 -0700>,<Administrator>,<X>,<proc1d>,<TOPSPIN 2.1>,
      <pk PHC0 = -78.58521 PHC1 = 0 
       data hash MD5: 128K
       C6 F9 70 99 00 E1 81 E2 36 46 AB 6C 53 3A 0D 2E>)
(   4,<2013-04-11 17:29:36.072 -0700>,<Administrator>,<X>,<proc1d>,<TOPSPIN 2.1>,
      <abs ABSG = 1 
       data hash MD5: 128K
       91 AF DB 09 92 62 DF 56 8C 98 CD 9D F3 ED 31 B9>)
(   5,<2013-04-11 17:29:36.275 -0700>,<Administrator>,<X>,<proc1d>,<TOPSPIN 2.1>,
      <abs ABSG = 2 
       data hash MD5: 128K
       78 BC A8 EF 94 5A B5 F4 A8 5E 80 D2 D3 49 B8 82>)
(   6,<2013-04-11 17:29:36.447 -0700>,<Administrator>,<X>,<proc1d>,<TOPSPIN 2.1>,
      <abs ABSG = 3 
       data hash MD5: 128K
       DC 4A 26 45 47 E5 7E E7 CA 26 F2 09 57 08 BC EF>)
(   7,<2013-04-11 17:29:36.634 -0700>,<Administrator>,<X>,<proc1d>,<TOPSPIN 2.1>,
      <abs ABSG = 4 
       data hash MD5: 128K
       E0 95 CF 25 49 51 29 58 46 4F 61 0E 57 04 77 FA>)
(   8,<2013-04-11 17:29:36.822 -0700>,<Administrator>,<X>,<proc1d>,<TOPSPIN 2.1>,
      <abs ABSG = 5 
       data hash MD5: 128K
       B6 94 7B 13 02 D9 8F 28 7E E1 62 A7 0D BC 7C 89>)
$$ ##END=
$$ 
$$ $$ hash MD5
$$ $$ AD 1E 50 92 7D 2D DB 89 01 3F B0 93 BE D3 22 AB
##$RELAX= 
##$RELAX= 
##$RELAX= 
##$RELAX= 
##$RELAX= 
##$RELAX= 
##$RELAX= 
##$RELAX= 
$$ Bruker specific parameters
$$ --------------------------
##$DU= <E:\>
##$EXPNO= 22
$$ [...]
##$TP07= 0
##$TPNAME0= <>
##$TPNAME1= <>
##$TPNAME2= <>
##$TPNAME3= <>
##$TPNAME4= <>
##$TPNAME5= <>
##$TPNAME6= <>
##$TPNAME7= <>
##$TPOAL= (0..7)
0.5 0.5 0.5 0.5 0.5 0.5 0.5 0.5
##$TPOFFS= (0..7)
0 0 0 0 0 0 0 0
##$TUNHIN= 0
##$TUNHOUT= 0
##$TUNXOUT= 0
##$USERA1= <user>
##$USERA2= <user>
##$USERA3= <user>
##$USERA4= <user>
##$USERA5= <user>
##$V9= 5
##$VALIST= <valist>
##$VCLIST= <CCCCCCCCCCCCCCC>
##$VD= 0
##$VDLIST= <DDDDDDDDDDDDDDD>
##$VPLIST= <PPPPPPPPPPPPPPP>
##$VTLIST= <TTTTTTTTTTTTTTT>
##$WBST= 2048
##$WBSW= 25
##$XGAIN= (0..3)
0 0 0 0
##$XL= 0
##$YL= 0
##$YMAX_a= 6140488
##$YMIN_a= -13060902
##$ZGOPTNS= <>
##$ZL1= 120
##$ZL2= 120
##$ZL3= 120
##$ZL4= 120
##$ABSF1= 14.96098
##$ABSF2= -5.597201
##$ABSG= 5
##$ABSL= 3
##$ALPHA= 0
##$AQORDER= 0
##$ASSFAC= 0
##$ASSFACI= 0
##$ASSFACX= 0
##$ASSWID= 0
##$AUNMP= <proc_prof1d_extract.lims>
##$AXLEFT= 0
##$AXNAME= <>
##$AXNUC= <1H>
##$AXRIGHT= 0
##$AXTYPE= 0
##$AXUNIT= <>
##$AZFE= 0.1
##$AZFW= 0.1
##$BCFW= 0
##$BC_mod= 0
##$BYTORDP= 0
##$COROFFS= 0
##$CY= 15
##$DATMOD= 1
##$DC= 0
##$DFILT= <>
##$DTYPP= 0
##$F1P= 0
##$F2P= 0
##$FCOR= 0.5
##$FTSIZE= 131072
##$FT_mod= 6
##$GAMMA= 0
##$GB= 0
##$INTBC= 1
##$INTSCL= 1
##$ISEN= 128
##$LB= 0.3
##$LEV0= 0
##$LPBIN= 0
##$MAXI= 10000
##$MC2= 0
##$MEAN= 0
##$ME_mod= 0
##$MI= 0
##$NCOEF= 0
##$NC_proc= -2
##$NLEV= 6
##$NOISF1= 0
##$NOISF2= 0
##$NSP= 0
##$NTH_PI= 0
##$NZP= 0
##$OFFSET= 14.96098
##$PC= 1
##$PHC0= -78.58521
##$PHC1= 0
##$PH_mod= 1
##$PKNL= yes
##$PPARMOD= 0
##$PPDIAG= 0
##$PPIPTYP= 0
##$PPMPNUM= 2147483647
##$PPRESOL= 1
##$PSCAL= 4
##$PSIGN= 0
##$PYNMP= <proc.py>
##$REVERSE= no
##$SF= 400.020009646047
##$SI= 131072
##$SIGF1= 0
##$SIGF2= 0
##$SINO= 400
##$SIOLD= 131072
##$SPECTYP= <>
##$SREGLST= <1H.CDCl3>
##$SSB= 0
##$STSI= 131072
##$STSR= 0
##$SW_p= 8223.68421052631
##$SYMM= 0
##$S_DEV= 0
##$TDeff= 65536
##$TDoff= 0
##$TI= <>
##$TILT= no
##$TM1= 0
##$TM2= 0
##$TOPLEV= 0
##$USERP1= <user>
##$USERP2= <user>
##$USERP3= <user>
##$USERP4= <user>
##$USERP5= <user>
##$WDW= 1
##$XDIM= 131072
##$YMAX_p= 448005190
##$YMIN_p= -15960
##$CURPLOT= <Network HP LaserJet P1505>
##$CURPRIN= <$Network HP LaserJet P1505>
##$DFORMAT= <normdp>
##$LAYOUT= <+/1D_H.xwp>
##$LFORMAT= <normlp>
##$PFORMAT= <normpl>
##$SURQMSG= 1
$$ End of Bruker specific parameters
$$ ---------------------------------
##NTUPLES= NMR SPECTRUM
##VAR_NAME=  FREQUENCY,     SPECTRUM/REAL,   SPECTRUM/IMAG
##SYMBOL=    X,             R,               I
##VAR_TYPE=  INDEPENDENT,   DEPENDENT,       DEPENDENT
##VAR_FORM=  AFFN,          ASDF,            ASDF
##VAR_DIM=   131072,        131072,          131072
##UNITS=     HZ,            ARBITRARY UNITS, ARBITRARY UNITS
##FACTOR=    0.0627417313425164, 1,          1
##FIRST=     8223.62146879497, -1237,        -60820
##LAST=      0,             1221,            -61893
##MIN=       0,             -15960,          0
##MAX=       8223.62146879497, 448005190,    0
$$ Real data points
##PAGE= N=1
##DATA TABLE= (X++(R..R)), XYDATA
$$ [...]
63860A076593L1052K9013K5740K1487J7248J3482R619N119K76m499r341j4327
$$ 1076593 1107645 1136658 1162398 1183885 1201133 1214615 1224234 1229353 1229629 1225130 1215789 1201462
63848A201462j8999k3046k6776l0336l3114l4699l5804l7380l9234m0391m0441
$$ 1201462 1182463 1159417 1132641 1102305 1069191 1034492 998688 961308 922074 881683 841242
63837H41242l9784l8781l7506l6140l4804l3081l0542k7618k5298k3853k2572
$$ 841242 801458 762677 725171 689031 654227 621146 590604 562986 537688 513835 491263
63826D91263k0860j8897j7069j5380j3690j2097j0714r456q265p311o774o569
$$ 491263 470403 451506 434437 419057 405367 393270 382556 373100 364835 357524 350750 344181
63814C44181o473o298n888n136m093k968k023j517j661k417l329l754l400k589
$$ 344181 337708 331410 325522 320386 316293 313325 311302 309785 308124 305707 302378 298624 295224 292635
63800B92635k049k310l153l654l116k018j588k344l418l679l080k431k234k305
$$ 292635 290586 288276 285123 281469 278353 276335 274747 272403 268985 265306 262226 259795 257561 255256
63786B55256k302k080j585r31n47p08r85o60K44Q48M85n49j462j822j694j224
$$ 255256 252954 250874 249289 248358 247811 247103 246118 245458 245702 246550 247035 246486 245024 243202 241508 240284
63770B40284m73L58Q24N85r5m42LO91O74j79r58r41m62k38l88n75p07q45q11m61
$$ 240284 239811 240169 240993 241578 241483 241041 241044 241735 242409 242230 241272 240331 239869 239631 239243 238668 237961 237116 236305 235844
63750B35844j27j24j10M03J150J462J328J330J606J795J952K541L368L523K745
$$ 235844 235717 235593 235483 235886 237036 238498 239826 241156 242762 244557 246509 249050 252418 255941 258686
63735B58686J927J830K094K086J936K111K472K505K130J722J672K299L778N663
$$ 258686 260613 262443 264537 266623 268559 270670 273142 275647 277777 279499 281171 283470 287248 292911
63721B92911O930P029O585O431O438N934M911L950L129J882M2j790l038l733m093
$$ 292911 299841 306870 313455 319886 326324 332258 337169 341119 344248 346130 346172 344382 341344 337611 333518
63706C33518m070l613k958k412k087j954j823j229J72J967L173L330K973K840
$$ 333518 329448 325835 322877 320465 318378 316424 314601 313372 313544 315511 318684 322014 324987 327827
63692C27827L007L148L215L370L471L208K637K128J808J432Q14J9q44j624j948
$$ 327827 330834 333982 337197 340567 344038 347246 349883 352011 353819 355251 356065 356084 355240 353616 351668
63677C51668j521p00l08o37j060q59m6R30J845K570K739K137J263Q25P77N00j67
$$ 351668 350147 349447 349139 348502 347442 346583 346537 347467 349312 351882 354621 356758 358021 358846 359623 360123 359956
63660C59956p37j063j671k803l842m133l863l592l426l183l006l151l334l037
$$ 359956 359219 358156 356485 353682 349840 345707 341844 338252 334826 331643 328637 325486 322152 319115
63646C19115k321j767j580j348p66j01L41P81J698L121M398M797M273L587L532
$$ 319115 316794 315027 313447 312099 311333 311232 311573 312354 314052 317173 321571 326368 330641 334228 337760
63631C37760M109M821N586O762Q181Q959Q781Q620R482J0982J2038J2552J3358
$$ 337760 341869 346690 352276 359038 367219 376178 384959 393579 403061 414043 426081 438633 451991
63618D51991J4729J6110J7280J8703K0524K2228K3587K5093K7009K8852L0214
$$ 451991 466720 482830 500110 518813 539337 561565 585152 610245 637254 666106 696320
63607F96320L1338L2376L2768L1911K9825K6620K1984J5788Q759K042l520p340
$$ 696320 727658 760034 792802 824713 854538 881158 903142 918930 927689 929731 926211 918871
63595I18871r076r229r118r583j0191j0416j0855j2476j5165j8100k1052k4229
$$ 918871 909795 900566 891448 881865 871674 861258 850403 837927 822762 804662 783610 759381
63583G59381k7050k8338k7766k6130k4091k1644j8957j6645j4826j2797j0101
$$ 759381 732331 703993 676227 650097 626006 604362 585405 568760 553934 541137 531036
63572E31036p222m750k555l27J693L136M169N159O010O449O713P362Q515R718
$$ 531036 523814 519064 516509 516182 517875 521011 525180 530339 536349 542798 549511 556873 565388 575106
63558E75106J0487J0735J0772J1219J2743J5432J8601K1541K4346K7617L1530
$$ 575106 585593 596328 607100 618319 631062 646494 665095 686636 710982 738599 770129
63547G70129L5648L9647M3534M6836M7934M4741L6231K3450R143l558j2602j7635
$$ 770129 805777 845424 888958 935794 983728 1028469 1064700 1088150 1097293 1093735 1081133 1063498
63535A063498j9504j9163j7107j3758j0072p361o471p356r514j2634j6596k1079
$$ 1063498 1043994 1024831 1007724 993966 983894 976533 970062 962706 953192 940558 923962 902883
63523I02883k5553k9624l3092l5605l6667l6154l4556l2451l0042k7473k5215
$$ 902883 877330 847706 814614 779009 742342 706188 671632 639181 609139 581666 556451
63512E56451k3624k2247k0192j7260j4319j2291j1173j0229q896p249n725m650
$$ 556451 532827 510580 490388 473128 458809 446518 435345 425116 416220 408971 403246 398596
63500C98596l967l357k647k084j972k135k040j525j076j125j466j583j338r76
$$ 398596 394629 391272 388625 386541 384569 382434 380394 378869 377793 376668 375202 373619 372281 371305
63486C71305o11p6P38J688K533L132L421L463L493L782M365M938N072M548L512
$$ 371305 370694 370618 371356 373044 375577 378709 382130 385593 389086 392868 397233 402171 407243 411791 415303
63471D15303K311J117k28j831l299m055m119m190m710n300n417n144m847m378
$$ 415303 417614 418731 418503 416672 413373 409318 405199 401009 396299 390999 385582 380438 375591 371213
63457C71213l249j540J1Q66J162J332J699K490L671M736N249N630O736Q554J0067
$$ 371213 367964 366424 366435 367301 368463 369795 371494 373984 377655 382391 387640 393270 400006 408560 418627
63442D18627J0725J1225J2378J4034J5807J8101K1452K5491K9531L3610L7654
$$ 418627 429352 440577 452955 466989 482796 500897 522349 547840 577371 610981 648635
63431F48635L9928L7963L1383K2596J4340P656K700Q8L53K891O602J1151J6655
$$ 648635 688563 726526 757909 780505 794845 802501 805201 805289 805642 808533 815135 826286 842941
63418H42941K2639K8204L3010L7109L9977M0599L8562L4200K7756J9288R643O33
$$ 842941 865580 893784 926794 963903 1003880 1044479 1083041 1117241 1144997 1164285 1173928 1174561
63406A174561o207j0604j3083j4040j3681j2454j1140j0598j1540j4306j8645
$$ 1174561 1168354 1157750 1144667 1130627 1116946 1104492 1093352 1082754 1071214 1056908 1038263
63395A038263k3861k9218l4028l7524l9116l8894l7491l5439l2883k9989k7144
$$ 1038263 1014402 985184 951156 913632 874516 835622 798131 762692 729809 699820 672676
63384F72676k4562k2087j9539j6944j4291j1434q390n451k863o65J112K504L925
$$ 672676 648114 626027 606488 589544 575253 563819 555429 549978 547115 546450 547562 550066 553991
63371E53991N857Q098R844J0813J1780J3579J6044J8375K0215K1849K3602K5572
$$ 553991 559848 567946 577790 588603 600383 613962 630006 648381 668596 690445 714047 739619
63359G39619K7826L0426L3253L6019L8359L9749L9621L7909L5088L1380K6183
$$ 739619 767445 797871 831124 867143 905502 945251 984872 1022781 1057869 1089249 1115432
63348A115432J8884J0107J579n202r814j2491j3514j3226j2278j1518j1635j3006
$$ 1115432 1134316 1144423 1146002 1140800 1130986 1118495 1104981 1091755 1079477 1067959 1056324 1043318
63336A043318j5714j9606k4284k9032l2879l5120l5864l5768l5034l3014k9247
$$ 1043318 1027604 1007998 983714 954682 921803 886683 850819 815051 780017 747003 717756
63325G17756k4494k0180j6862j3747r773m804K03L657L928J65o838j4706k0836
$$ 717756 693262 673082 656220 642473 632700 627896 628099 631756 635684 635849 629011 614305 593469
63312E93469k3940k4372k3214k1257j8828j6208j3872j2090j0606q957p179n874
$$ 593469 569529 545157 521943 500686 481858 465650 451778 439688 429082 420125 412946 407072
63300D07072n465n648n719n209m098k706j588j271j779k522k912k898k782k749
$$ 407072 401607 395959 390240 385031 380933 378227 376639 375368 373589 371067 368155 365257 362475 359726
63286C59726k776k793k653k200j594j309j483j633j379j076j177j377r89o5O12
$$ 359726 356950 354157 351504 349304 347710 346401 344918 343285 341906 340830 339653 338276 337287 337222 337834
63271C37834N90J59l13p82j123r62k10P02J351J699J805J624J320J367J999K852
$$ 337834 338424 338583 338270 337488 336365 335403 335193 335895 337246 338945 340750 342374 343694 345061 347060 349912
63255C49912L452L759M024M295M434M436M484M698M928M913M675M773N851P752
$$ 349912 353364 357123 361147 365442 369876 374312 378796 383494 388422 393335 398010 402783 408634 416386
63241D16386R377R898R805J0272J1638J3238J4628J6082J7702J8968J9641K0325
$$ 416386 425763 435661 445466 455738 467376 480614 495242 511324 529026 547994 567635 587960
63229E87960K1491K2549K2594K1686K0647J9894J9222J8575J8271J8425J8812
$$ 587960 609451 632000 654594 676280 696927 716821 736043 754618 772889 791314 810126
63218H10126J9391K0369K1561K2201K1703K0300J8573J6597J3850R925N089Jm940
$$ 810126 829517 849886 871447 893648 915351 935651 954224 970821 984671 994596 999685 999686 994746
63205I94746r824j4774j9475k3375k6262k8311k9525k9570k8300k6119k3446k0238
$$ 994746 984922 970148 950673 927298 901036 872725 843200 813630 785330 759211 735765 715527
63193G15527j6460j2715r840p859n893l228j5L145N897Q190J0087J1801J3676
$$ 715527 699067 686352 676512 668653 662760 659532 659517 662662 668559 676749 686836 698637 712313
63180G12313J5746J7499J8417J8654J8843J9231J9402J8973J8279J7973J8152
$$ 712313 728059 745558 763975 782629 801472 820703 840105 859078 877357 895330 913482
63169I13482J8158J7391J5965J4310J2410R786O226K057k404p257j2525j7615
$$ 913482 931640 949031 964996 979306 991716 1001502 1007728 1009785 1007381 1000124 987599 969984
63157I69984k1762k4943k7788l0492l2354l2596l1330k9361k7324k5410k3666
$$ 969984 948222 923279 895491 864999 832645 800049 768719 739358 712034 686624 662958
63146F62958k2055k0274j7999j5424j3175j1561j0323r163q094p027n592l825
$$ 662958 640903 620629 602630 587206 574031 562470 552147 542984 534890 527863 522271 518446
63134E18446k551k385k680k249j031j16j8J45J249K803L673L673L603L947M355
$$ 518446 515895 513510 510830 508581 507550 507434 507416 507561 508810 511613 515286 518959 522562 526509 530864
63119E30864M424M275M143L913L394K736K288K164K145J995J827K005K616L123
$$ 530864 535288 539563 543706 547619 551013 553749 556037 558201 560346 562341 564168 566173 568789 571912
63105E71912K895K027J235Q26L48m78j081r36n93r94k023k622k245j402o56L4
$$ 571912 574807 576834 578069 578895 579243 578765 577684 576748 576155 575161 573138 570516 568271 566869 566213 566247
63089E66247P75J258J233R10N46J20k62r2J017K739M283M984M650L684L003L344
$$ 566247 567022 568280 569513 570423 570969 571089 570827 570735 571752 574491 578774 583758 588408 592092 595095 598439
63073E98439M488N499N869N999O441P258Q268R427J0668J1890J3237J4903J6544
$$ 598439 602927 608426 614295 620294 626735 633993 642261 651688 662356 674246 687483 702386 718930
63060G18930J7672J8752K0925K4189K6983K8424K9810L2796L6888M0256M2560
$$ 718930 736602 755354 776279 800468 827451 855875 885685 918481 955369 995625 1038185
63049A038185M5221M8895N2308N4086N4460N4436N4278N3635N2544N1442N0581
$$ 1038185 1083406 1132301 1184609 1238695 1293155 1347591 1401869 1455504 1508048 1559490 1610071
63038A610071M9951M9560M9262M8703M7856M7266M7294M7266M5876M2230L6240
$$ 1610071 1660022 1709582 1758844 1807547 1855403 1902669 1949963 1997229 2043105 2085335 2121575
63027B121575K8235J8700Q241k687j4026k5679l6967m6897n4999o1415o6146o8804
$$ 2121575 2149810 2168510 2176751 2174064 2160038 2134359 2097392 2050495 1995496 1934081 1867935 1799131
63015A799131o9237o7929o5323o1204n5316m8377m1723l5847k9917k2982j5209
$$ 1799131 1729894 1661965 1596642 1535438 1480122 1431745 1390022 1354175 1324258 1301276 1286067
63004A286067p549o25N477J0658J4762J8079K1231K4401K7141K9128L0591L1795
$$ 1286067 1278518 1277893 1283370 1294028 1308790 1326869 1348100 1372501 1399642 1428770 1459361 1491156
62992A491156L2620L2954L3030L2968L2448L1324L0118K9269K8164K5622K1255
$$ 1491156 1523776 1556730 1589760 1622728 1655176 1686500 1716618 1745887 1774051 1799673 1820928
62981A820928J5673R352K016o624j6071k5369l3850m1349m7924n3619n8256o1348
$$ 1820928 1836601 1845953 1847969 1841345 1825274 1799905 1766055 1724706 1676782 1623163 1564907 1503559
62969A503559o2429o1690n9906n7660n4879n1419m7666m4167m0927l7547l4046
$$ 1503559 1441130 1379440 1319534 1261874 1206995 1155576 1107910 1063743 1022816 985269 951223
62958I51223l1005k8851k7397k6189k4961k3545k1805j9949j8588j7957j7360
$$ 951223 920218 891367 863970 837781 812820 789275 767470 747521 728933 710976 693616
62947F93616j5997j4284j3508j4036j4641j4092j2673j1401j0393r059p549o710
$$ 693616 677619 663335 649827 635791 621150 607058 594385 582984 572591 563532 555983 549273
62935E49273o630o365n488m727m568m356l543k852l143l802l486k121r65q55j438
$$ 549273 542643 536278 530790 526063 521495 517139 513596 510744 507601 503799 500313 498192 497227 496372 494934
62920D94934k140k820l245k915j870r71q71j257j475j491j795k623l578l941l285
$$ 494934 492794 489974 486729 483814 481944 480973 480102 478845 477370 475879 474084 471461 467883 463942 460657
62905D60657k006j132j275j837j706o51M48Q22O11L42J82lk47m39m62k33J00R8
$$ 460657 458651 457519 456244 454407 452701 452050 452498 453320 453931 454273 454455 454452 454205 453766 453304 453071 453171 453269
62887D53269l67o54m5J090J652J370J168J705K462K724K577K305J634M35m91k80
$$ 453269 452902 452248 452203 453293 454945 456315 457483 459188 461650 464374 466951 469256 470890 471325 470834 470554
62871D70554P02J322J188Q12N10P1m82p20n35l57l81k36L55J119J699K135K629
$$ 470554 471256 472578 473766 474578 475088 475159 474677 473957 473422 473065 472684 472448 472803 473922 475621 477756 480385
62854D80385L097L263K971K354J781J648K005K463K690K800K925K726J920J038
$$ 480385 483482 486745 489716 492070 493851 495499 497504 499967 502657 505457 508382 511108 513028 514066
62840E14066Q87J303J247L65m33l03L75P99R43J249J550J251L63l98n60k16N94
$$ 514066 514953 516256 517503 517868 517435 517132 517507 518306 519249 520498 522048 523299 523662 523264 522704 522488 523082
62823E23082J982L466L909K804J141L92Q66J660K045K212K480K479J686M97N4
$$ 523082 525064 528530 532439 535243 536384 536776 537642 539302 541347 543559 546039 548518 550204 550701 550755
62808E50755Q73K110K614K370K447L491M871N585N568N563N913O139N892N719
$$ 550755 551628 553738 556352 558722 561169 564660 569531 575116 580684 586247 592160 598299 604191 609910
62794F09910O451Q107R933J1449J2948J4960J7631K0841K4535K8611L2704L6488
$$ 609910 616361 624468 634401 645850 658798 673758 691389 712230 736765 765376 798080 834568
62782H34568M0104M4098M8883N4410O0264O5920P0994P5421P9356Q2644Q4541
$$ 834568 874672 918770 967653 1022063 1082327 1148247 1219241 1294662 1374018 1456662 1541203
62771A541203Q4219Q1482P6673O9887O0750M9123L5614K1091O030r200k3729l6383
$$ 1541203 1625422 1706904 1783577 1853464 1914214 1963337 1998951 2020042 2026072 2016872 1993143 1956760
62759A956760m6751n5556o3694p1005p6380p9068p9554p8951p7704p5328p1487
$$ 1956760 1910009 1854453 1790759 1719754 1643374 1564306 1484752 1405801 1328097 1252769 1181282
62748A181282o6795o2230n8009n3619m8812m3996l9588l5524l1669k8182k5166
$$ 1181282 1114487 1052257 994248 940629 891817 847821 808233 772709 741040 712858 687692
62737F87692k2387j9711j7418j5606j3741j1366r028p706p452p292o533n372m113
$$ 687692 665305 645594 628176 612570 598829 587463 578435 570729 563277 555985 549452 544080 539967
62724E39967k571p04R00J731K182L004M233N243N691N893O347P320Q880J0849
$$ 539967 537396 536692 537592 539323 541505 544509 548742 553985 559676 565569 571916 579236 588116 598965
62710E98965J2796J4431J6066J8311K1320K4746K8312L1985L5608L8929M2092
$$ 598965 611761 626192 642258 660569 681889 706635 734947 766932 802540 841469 883561
62699H83561M5555M9368N3068N6460N9910O3573O6902O9347P0892P1380O9896
$$ 883561 929116 978484 1031552 1088012 1147922 1211495 1278397 1347744 1418636 1490016 1559912
62688A559912O5597N8828N0554M0916K9315J5854J762j1820k4687l6867m7850
$$ 1559912 1625509 1684337 1734891 1775807 1805122 1820976 1822738 1810918 1786231 1749364 1701514
62677A701514n6977o4032o9075p2119p3366p3259p1858o8742o3979n8715n4156
$$ 1701514 1644537 1580505 1511430 1439311 1365945 1292686 1220828 1152086 1088107 1029392 975236
62666I75236n0348m6652m2967l9658l6518l2851k8655k4828k1895j9352j6648
$$ 975236 924888 878236 835269 795611 759093 726242 697587 672759 650864 631512 614864
62655F14864j4150j2524j1659j0868r863q961q358p850p279o801o510o138n423
$$ 614864 600714 588190 576531 565663 555800 546839 538481 530631 523352 516551 510041 503903 498480
62642D98480m466l513k566j506n16N1K92Q34J922K764K292N89r88j286n37K01
$$ 498480 494014 490501 487935 486429 485913 485964 486256 487090 489012 491776 494068 494657 493669 492383 491846 492047
62626D92047L62K09J37J77K10K69M93R44J548K124K601L164M007M823M937M299
$$ 492047 492409 492618 492755 492932 493142 493411 493904 494848 496396 498520 501121 504285 508292 513115 518052 522351
62610E22351L899M692O334P631Q063Q253Q866R820J0806J1946J3498J5356J7308
$$ 522351 526250 530942 537276 544907 552970 561223 570089 579909 590715 602661 616159 631515 648823
62597F48823J9448K1978K4787K7641L0557L3635L6573L8714L9679L9685L9156
$$ 648823 668271 690249 715036 742677 773234 806869 843442 882156 921835 961520 1000676
62586A000676L8135L6143L2623K7406K0763J3114M906l258j0736j7296k3209k8585
$$ 1000676 1038811 1074954 1107577 1134983 1155746 1168860 1173766 1170508 1159772 1142476 1119267 1090682
62574A090682l2951l5829l7483l8566l9213l9038l7971l6346l4249l1453k8277
$$ 1090682 1057731 1021902 984419 945853 906640 867602 829631 793285 759036 727583 699306
62563F99306k5634k3900k2352k0187j7602j5293j3458j1851j0470r525q932q382
$$ 699306 673672 649772 627420 607233 589631 574338 560880 549029 538559 529034 520102 511720
62551E11720p824p354o765n741m465l468k934k513j889j132m14K36Q44J387J855
$$ 511720 503896 496542 489777 484036 479571 476103 473169 470656 468767 467635 467221 467457 468301 469688 471543
62536D71543K163K008J108l18j524j791r14Q20K899M788O108O798P175P730Q839
$$ 471543 473706 475714 476822 476504 474980 473189 472275 473095 475994 480782 486890 493688 500863 508593 517432
62521E17432J0525J2509J4523J6581J8844K1357K4068K7051L0314L3509L6183
$$ 517432 527957 540466 554989 571570 590414 611771 635839 662890 693204 726713 762896
62510G62896L8338M0287M1927M2691M2401M1428L9706L6337L0856K4295J8131
$$ 762896 801234 841521 883448 926139 968540 1009968 1049674 1086011 1116867 1141162 1159293
62499A159293J2463O183j113q276j3821j7277j8995j9228j7891j5089j1495q011
$$ 1159293 1171756 1177939 1176826 1168550 1154729 1137452 1118457 1099229 1081338 1066249 1054754 1046743
62487A046743m975j690K880Q751J4588J9134K2585K6046K9809L2829L3671L1385
$$ 1046743 1041768 1040078 1042958 1051709 1066297 1085431 1108016 1134062 1163871 1196700 1230371 1261756
62475A261756K5691J7334Q377J081m077q794j5021k3102l2031m0635m7930n2953
$$ 1261756 1287447 1304781 1313158 1314239 1310162 1301368 1286347 1263245 1231214 1190579 1142649 1089696
62463A089696n5167n5007n3525n1521m9324m7017m4386m0832l5990l0440k5397
$$ 1089696 1034529 979522 925997 874476 825152 778135 733749 692917 656927 626487 601090
62452F01090k1630j8943j6642j4203j1493q787o565n100m184l352k351j162J86
$$ 601090 579460 560517 543875 529672 518179 509392 502827 497727 493543 490191 487840 486678 486864
62439D86864J538K514K817K617K301J915J315P52P12J043Q27m98k297l500l870
$$ 486864 488402 490916 493733 496350 498651 500566 501881 502633 503345 504388 505215 504717 502420 498920 495050
62424D95050m042m453m824m767m391m025l686l185k631k419k676k988k837k228
$$ 495050 491008 486555 481731 476964 472573 468548 464862 461677 459046 456627 453951 450963 448126 445898
62410D45898j644j447j516j598j727k001k073j406k16L77k97j295r56J019L107
$$ 445898 444254 442807 441291 439693 437966 435965 433892 432486 432270 432647 432350 431055 430099 431118 434225
62395D34225L848L492L272L642L975L747L145K532K030J807K158L000L798M317
$$ 434225 438073 441565 444837 448479 452454 456201 459346 461878 463908 465715 467873 470873 474671 478988
62381D78988M929N856O611O706O564P073Q319R424R702R515R712J0560J1558J2185
$$ 478988 483917 489773 496384 503090 509654 516727 525046 534470 544172 553687 563399 573959 585517 597702
62367E97702J2571J3300J4774J6940J9643K2927K6795L0922L4941L8931M3236
$$ 597702 610273 623573 638347 655287 674930 697857 724652 755574 790515 829446 872682
62356H72682M7850N2393N6596O0270O2689O2708N9870N4823M8264M0031K9877
$$ 872682 920532 972925 1029521 1089791 1152480 1215188 1275058 1329881 1378145 1418176 1448053
62345A448053J8703Q260l16p157j3005j8562k4325l0391l6219m1018m4475m6738
$$ 1448053 1466756 1475016 1474700 1467543 1454538 1435976 1411651 1381260 1345041 1304023 1259548 1212810
62333A212810m7769m7269m5366m2760l9955l6804l3145k9527k6902k5650k5225
$$ 1212810 1165041 1117772 1072406 1029646 989691 952887 919742 890215 863313 837663 812438
62322H12438k4739k3768k2562k1529k0653j9633j8586j8166j8634j9093j8271
$$ 812438 787699 763931 741369 719840 699187 679554 660968 642802 624168 605075 586804
62311E86804j5984j3314j1317j0011q840p576o465n713n183m536l607k602j872
$$ 586804 570820 557506 546189 536178 527338 519762 513297 507584 502401 497865 494258 491656 489784
62298D89784j461j012k79M81R86J419K041K616K807K914L465M149M074L182K518
$$ 489784 488323 487311 487032 487513 488499 489918 491959 494575 497382 500296 503761 507910 511984 515166 517684
62283E17684K775L373L505L271L178L178K928K599K643L076L699M690O231P756
$$ 517684 520459 523832 527337 530608 533786 536964 539892 542491 545134 548210 551909 556599 562830 570586
62269E70586Q459Q536R140J0951J3546J6340J9415K2941K6536K9793L3131L7395
$$ 570586 579045 587581 596721 607672 621218 637558 656973 679914 706450 736243 769374 806769
62257H06769M2723M8296N3304N7660O1566O4733O6347O5649O2260N5991M6869
$$ 806769 849492 897788 951092 1008752 1070318 1135051 1201398 1267047 1329307 1385298 1432167
62246A432167L5569K3575J2426K736n855j3871k1430k8581l5672m2981n0070n5945
$$ 1432167 1467736 1491311 1503737 1506473 1500618 1486747 1465317 1436736 1401064 1358083 1308013 1252068
62234A252068n9886o1881o2217o0952n8006n3619m8485m3404l8900l5111l1878
$$ 1252068 1192182 1130301 1068084 1007132 949126 895507 847022 803618 764718 729607 697729
62223F97729k8857k5669k2174j8651j5605j3308j1553r925q287o890o040n666
$$ 697729 668872 643203 621029 602378 586773 573465 561912 551987 543700 536810 530770 525104
62211E25104n295m489l313k259j598r29M01K416M355N536O122O825Q038R474J0601
$$ 525104 519809 515320 512007 509748 508150 507221 507622 510038 514393 519929 526051 532876 540914 550388 560989
62196E60989J1225J1640J2275J3155J3831J3964J3900J4177J4542J4067J2580
$$ 560989 572214 583854 596129 609284 623115 637079 650979 665156 679698 693765 706345
62185G06345J1175J0796J0837R991Q120O366N499N047M143K585Q27m14m62Q82
$$ 706345 717520 728316 739153 749144 757264 763630 769129 774176 778319 780904 781731 781317 780855 781737
62171G81737L016N243P845J1769J7143K2851K7963L2772L7860M2822M6544M8300
$$ 781737 784753 789996 797841 809610 826753 849604 877567 910339 948199 991021 1037565 1085865
62159A085865M7836M4796L8903L0713K1622J2960N354j097o529j1262j5779k0490
$$ 1085865 1133701 1178497 1217400 1248113 1269735 1282695 1288049 1286952 1280423 1269161 1253382 1232892
62147A232892k5520l0572l5065l8544m0990m2466m2563m0675l6980l2656k8784
$$ 1232892 1207372 1176800 1141735 1103191 1062201 1019735 977172 936497 899517 866861 838077
62136H38077k5448k2181j8863j5686j2623r594o985n385m782m455l790k791j666
$$ 838077 812629 790448 771585 755899 743276 733682 726697 721312 716530 712075 708285 705494 703828
62123G03828k59J831M656P635R995J1535J2833J4500J6212J6759J5123J1391O674
$$ 703828 703569 705400 710056 717691 727686 739221 752054 766554 782766 799525 814648 826039 832713
62110H32713K355n59j811j858j344o59j88o62k661n682q392j0005j0750j0797
$$ 832713 835068 834509 832698 830840 829496 828837 828649 827987 825326 819644 811252 801247 790497 779700
62096G79700r608o877l481p01J122K537L974N397O677P700Q266Q429Q696R371
$$ 779700 770092 763215 759734 759033 760155 762692 766666 772063 778740 786440 794706 803135 811831 821202
62082H21202J0023J0194J0355J1416J3466J5703J7603J9388K1296K3086K4441
$$ 821202 831225 841419 851774 863190 876656 892359 909962 929350 950646 973732 998173
62071I98173K5344K5880K6125K6405K7175K8454K9681L0340L0468L0527L0881
$$ 998173 1023517 1049397 1075522 1101927 1129102 1157556 1187237 1217577 1248045 1278572 1309453
62060A309453L1420L1400K9821K6207K1019J5031Q646K160l675q116j1343j4310
$$ 1309453 1340873 1372273 1402094 1428301 1449320 1464351 1472997 1475157 1471482 1463366 1452023 1437713
62048A437713j7671k1383k5415k9960l4822l9148m2191m3848m4342m3838m2624
$$ 1437713 1420042 1398659 1373244 1343284 1308462 1269314 1227123 1183275 1138933 1095095 1052471
62037A052471m1114l9345l6904l3692l0374k7628k5333k2909k0276j7944j6253
$$ 1052471 1011357 972012 935108 901416 871042 843414 818081 795172 774896 756952 740699
62026G40699j4939j3509j1861j0403r635r672j0094j0343j0195r803r417r197
$$ 740699 725760 712251 700390 689987 680352 670680 660586 650243 640048 630245 620828 611631
62014F11631r174r117q548p225n614m461l882l304k330j237l22O91K164L799M948
$$ 611631 602457 593340 584792 577567 571953 567492 563610 560306 557976 556739 556417 557108 559272 563071 568019
61999E68019N467N761N936N525M232K555J157n7j733l955n945p071p659q398r306
$$ 568019 573486 579247 585183 590708 594940 597495 598652 598595 596862 592907 586962 579891 572232 563834 554528
61984E54528r881j0053j0227j0419j0072q989p786p041o467n488m238l436l405
$$ 554528 544647 534594 524367 513948 503876 494887 487101 480060 473593 468105 463867 460431 457026
61971D57026l656l447k536j471j132j765k452k036o39M44N63O05J547K943L664
$$ 457026 453370 449923 447387 445916 444784 443019 440567 438531 437892 438336 438899 439504 441051 443994 447658
61956D47658L535L297L404L757M357N261O084O459O799P728R016J0037J1057J2857
$$ 447658 451193 454490 457894 461651 466008 471269 477353 483812 490611 498339 507355 517392 528449 541306
61942E41306J5167J6788J7499J8522K0619K2844K3846K3469K2402K1104J9811
$$ 541306 556473 573261 590760 609282 629901 652745 676591 700060 722462 743566 763377
61931G63377J8989J8877J8967J8542J7433J5750J3324R957N957J920j832n227
$$ 763377 782366 801243 820210 838752 856185 871935 885259 895216 901173 903093 901261 896034
61919H96034q107j0262j1522j1645j0469q343o005l718r69K663O818J0828J4440
$$ 896034 887927 877665 866143 854498 844029 835686 829681 825963 824994 827657 834475 845303 859743
61906H59743J7677K0350K2058K2437K1174J8196J4034R574N169N15m440r028j2703
$$ 859743 877420 897770 919828 942265 963439 981635 995669 1005243 1010412 1010927 1006487 997459 984756
61893I84756j5634j8094j9817k0532k0649k0767k0917k0771k0177j9096j7456
$$ 984756 969122 951028 931211 910679 890030 869263 848346 827575 807398 788302 770846
61882G70846j5645j4591j4744j5405j5640j5454j5398j5434j5001j3910j2451
$$ 770846 755201 740610 725866 710461 694821 679367 663969 648535 633534 619624 607173
61871F07173j0819r091p597o626n896m918l658k258m24K146M926P007Q296R546
$$ 607173 596354 587263 579666 573040 567144 562226 558568 556310 555886 558032 562958 569965 578261 587807
61857E87807J1217J3084J4993J7204J9809K2494K5114K7960L1232L4630L7637
$$ 587807 599024 612108 627101 644305 664114 686608 711722 739682 770914 805544 843181
61846H43181L9745M0476L9656L7709L5157L1768K6815K0249J3045O164k43o308
$$ 843181 882926 923402 963058 1000767 1035924 1067692 1094507 1114756 1127801 1133965 1133722 1127414
61834A127414j1668j5560j7429j7221j5270j2152q364m038Q34N935J0693J4835
$$ 1127414 1115746 1100186 1082757 1065536 1050266 1038114 1029750 1025712 1026546 1032481 1043174 1058009
61822A058009J8412K1102K2013K0456J6624J1275M972k051r514j6805k3193k8213
$$ 1058009 1076421 1097523 1119536 1139992 1156616 1167891 1172863 1170812 1161298 1144493 1121300 1093087
61810A093087l1864l4474l6277l7228l7204l6243l4439l1847k8661k5357k2421
$$ 1093087 1061223 1026749 990472 953244 916040 879797 845358 813511 784850 759493 737072
61799G37072k0117j8536j7545j6521j4719j2297j0417r822r796r263q360p967
$$ 737072 716955 698419 680874 664353 649634 637337 626920 617098 607302 598039 589679 581712
61787E81712q060p724o673n633n027m429l601l069l180l535l771m059m295l757
$$ 581712 573652 565928 559255 553622 548595 544166 540565 537496 534316 530781 527010 522951 518656 514899
61773E14899k234p14j37r7L32J085J324Q28K95L73J133K304L428L926L719L590
$$ 514899 512665 511951 511814 511717 512049 513134 514458 515286 515581 515954 517087 519391 522819 526745 530464 534054
61757E34054M335N688O695O920O579N786M437K772J220l02k168m072n144n229
$$ 534054 538389 544077 550772 557692 564271 570057 574494 577266 578486 578184 576016 571944 566800 561571
61743E61571n157n510n897n861n707n829n899n389m443l571k807j793n28N69J209
$$ 561571 556414 550904 545007 539146 533439 527610 521711 516322 511879 508308 505501 503708 503180 503749 504958
61728E04958J392J201R23J134K103L210L595L314L238L736M165L884L164K755
$$ 504958 506350 507551 508474 509608 511711 514921 518516 521830 525068 528804 532969 536853 540017 542772
61714E42772K990L696M510M869M088K024n10k478l694m676n537n679m796l656
$$ 542772 545762 549458 553968 558837 562925 564949 564439 561961 558267 553591 548054 542375 537579 533923
61700E33923l378m206n297n691n138m028k887k098j831j957k083j936j709j798
$$ 533923 530545 526339 521042 515351 510213 506185 503298 501200 499369 497412 495329 493393 491684 489886
61686D89886k148k199j632q79n16m49j78K18M5r47k041k465k320k181k143j884
$$ 489886 487738 485539 483907 483028 482512 482063 481885 482103 482148 481201 479160 476695 474375 472194 470051 468167
61670D68167j450j290j513j614j136k34N69R29Q95P20N99M68J47k97n34n02n76
$$ 468167 466717 465427 463914 462300 461164 460930 461499 462428 463323 464043 464642 465110 465257 464960 464426 463924 463348
61653D63348q88q87j15Q35R57K94qP28J890K591K762K871L089L293L414L352K842
$$ 463348 462460 461573 461458 462293 463250 463544 463536 464264 466154 468745 471507 474378 477467 480760 484174 487526 490368
61636D90368J811O29l48j197k096k878l248l237l166l272l568l800l533k612j586
$$ 490368 492179 492808 492460 491263 489167 486289 483041 479804 476638 473366 469798 465998 462465 459853 458267
61621D58267j148j088n20O60J409J077M29M57Q86P81jr86k203l989n961p244p708
$$ 458267 457119 456031 455511 456171 457580 458657 459086 459543 460429 461210 461209 460223 458020 454031 448070 440826 433118
61604D33118p952q144p843p057o408o051n467m649m485n360o261n951m512l051
$$ 433118 425166 417022 409179 402122 395714 389663 384196 379547 375062 369702 363441 357490 352978 349927
61590C49927k310k182k304k500k721k959l226l355k997k016p25L27P16K47r26
$$ 349927 347617 345435 343131 340631 337910 334951 331725 328370 325373 323357 322632 322959 323675 323922 322996
61575C22996k154k644k243j591j371j582j744j461p01J63M61k35j424j906j024
$$ 322996 320842 318198 315955 314364 312993 311411 309667 308206 307505 307668 308129 307894 306470 304564 303540
61560C03540N45J567J551J006O11N56O54Q08J148J750K252K067J146L14L81J058
$$ 303540 304085 305652 307203 308209 308820 309376 310030 310838 311986 313736 315988 318055 319201 319515 319896 320954
61544C20954J358J025Q20J194J555J353J135J668K598K926K626K679L411L783
$$ 320954 322312 323337 324157 325351 326906 328259 329394 331062 333660 336586 339212 341891 345302 349085
61530C49085K853J210K21K30K27o84k143l071k978k387k136k575l391l897l474
$$ 349085 351938 353148 353369 353599 353826 353142 350999 347928 344950 342563 340427 337852 334461 330564 327090
61515C27090k050l00Q21R36N02J16j68n77r91j062q73q90j211j330r18l60k27
$$ 327090 325040 324740 325561 326497 326999 327115 326947 326370 325379 324317 323444 322554 321343 320013 319095 318735 318508
61498C18508m70n49k08K74N56O79Q73J170J320J138P92O45Q09R43O34q1p00p50
$$ 318508 318038 317489 317281 317555 318111 318790 319663 320833 322153 323291 324083 324728 325537 326480 327114 327033 326333 325583
61480C25583k04N22R72J064J152J577K153K318J851J178P89O15L11j33m00l22
$$ 325583 325379 325901 326873 327937 329089 330666 332819 335137 336988 338166 338955 339570 339881 339748 339348 339026
61464C39026l2K65L61O5n34r66r30p52q91j162r52n7J136K153K623K153P85m67
$$ 339026 338994 339259 339620 339685 339151 338185 337255 336503 335612 334450 333498 333441 334577 336730 339353 341506 342291 341824
61446C41824l97R18K074K059J370J148J782K755L429L538L254L121L673M777N593
$$ 341824 341427 342345 344419 346478 347848 348996 350778 353533 356962 360500 363754 366875 370548 375325 380918
61431C80918N351M068K420J195Q54J225J548J215N19K80P23J271J432J328J212
$$ 380918 386269 390337 392757 393952 394806 396031 397579 398794 399313 399593 400316 401587 403019 404347 405559
61416D05559J111J154J550K046K033J399O55mr49k190l020l112l105l523l880
$$ 405559 406670 407824 409374 411420 413453 414852 415507 415503 414554 412364 409344 406232 403127 399604 395724
61401C95724l493k543j590p73j65k27r51j273l32J157J827J535J248J345J313
$$ 395724 392231 389688 388098 387325 387160 386933 385982 384709 384377 385534 387361 388896 390144 391489 392802
61386C92802R26O28O21O62P67J177J539J204M64L92J173J772J653J705K683L734
$$ 392802 393728 394356 394977 395639 396406 397583 399122 400326 400790 401182 402355 404127 405780 407485 410168 413902
61370D13902L561K373J541J626J845J572J220J308J468J053L38L13J256K281K579
$$ 413902 417463 419836 421377 423003 424848 426420 427640 428948 430416 431469 431807 432120 433376 435657 438236
61355D38236K652L574N395P041P929Q791J0400J2202J2922J2107J0309Q074N669
$$ 438236 440888 444462 449857 456898 464827 473618 484018 496220 509142 521249 531558 539632 545301
61342E45301L649K712K730K734K168J541J564K170K801L113K953K025J73k138
$$ 545301 548950 551662 554392 557126 559294 560835 562399 564569 567370 570483 573436 575461 575634 573496
61328E73496m118n375o032o163n558m234k852k251k507k771k274j255n75l98R4
$$ 573496 569378 564003 557971 551808 546250 542016 539164 536913 534406 531635 529361 528106 527531 527133 527227
61313E27227J538L446M824N431N845O560P536Q633R911J1410J2914J3958J3880
$$ 527227 528765 532211 537035 542466 548311 554871 562407 571040 580951 592361 605275 619233 633113
61300F33113J2066Q567M361O32k173m310n987p184p971q482q533p916o997o457
$$ 633113 645179 653746 658107 658739 656566 652256 646269 639085 631114 622632 614099 606183 599186 592729
61286E92729o336n951m878l531k507j899j470j043m49N01J678K625L131L566M362
$$ 592729 586393 580442 575564 572033 569526 567627 566157 565114 564665 565166 566844 569469 572600 576166 580528
61271E80528N409O160O155N349M168L331L297L806M263M630N535P408R854J2081
$$ 580528 585937 592097 598252 603601 607769 611100 614397 618203 622466 627096 632631 640039 649893 661974
61257F61974J3500J3779J2742J0573P867N162K663N01j039j874k385l056m003
$$ 661974 675474 689253 701995 712568 720435 725597 728260 728761 727722 725848 723463 720407 716404
61244G16404n073o105o925p283p090o553n913n274m792m700m922n011m715m316
$$ 716404 711331 705226 698301 691018 683928 677375 671462 666188 661396 656696 651774 646763 642048 637732
61230F37732m026l388j783N63K618L674M016M292M535M210L165K114J920K543
$$ 637732 633706 630318 628535 629098 631716 635390 639406 643698 648233 652443 655608 657722 659642 662185
61216F62185L109L011K605K577K987L349L364L094K456J214m53j817k258j753
$$ 662185 665294 668305 670910 673487 676474 679823 683187 686281 688737 689951 689498 687681 685423 683670
61202F83670o58O73J947L070M383O491R625J3376J7112K0353K2666K3634K3141
$$ 683670 683012 683685 685632 688702 693085 699576 709201 722577 739689 760042 782708 806342 829483
61189H29483K1411J8618J4831J0463O403L446J791J176J087Q55J9j130j912k316
$$ 829483 850894 869512 884343 894806 901209 904655 906446 907622 908709 909564 909583 908453 906541 904225
61175I04225l171m909o828q111q977j0105j1345j1891j1678j1646j2457j3602
$$ 904225 901054 896145 889317 881206 872229 862124 850779 838888 827210 815564 803107 789505
61163G89505j4154j3925j3445j3132j2861j2349j1613j0924j0416r844q779o997
$$ 789505 775351 761426 747981 734849 721988 709639 698026 687102 676686 666842 658063 651066
61151F51066m550j608J578M466O298O552N221K560j167n446r277j1643j2325j1977
$$ 651066 646516 644908 646486 650952 657250 663802 669023 671583 670416 664970 655693 644050 631725 619748
61137F19748j1279j0228q434n974l576j905q83j1R12J761K721M311O645R145J1356
$$ 619748 608469 598241 589807 583833 580257 578352 577469 577458 578370 580131 582852 587163 593808 602953 614309
61122F14309J3501J5761J7572J8325J8516J9371K1333K3619K5236K5829K5640
$$ 614309 627810 643571 661143 679468 697984 717355 738688 762307 787543 813372 839012
61111H39012K5234K5283K5888K6163K5209K3400K1850K0638J8635J5355J1742
$$ 839012 864246 889529 915417 941580 966789 990189 1012039 1032677 1051312 1066667 1078409
61100A078409Q625N480J470l220p874j2315j6600k0201k2502k3685k4383k4765
$$ 1078409 1087034 1092514 1093984 1090764 1082890 1070575 1053975 1033774 1011272 987587 963204 938439
61088I38439k4716k4530k4588k4634k4127k3088k1933k0722j9233j7555j5949
$$ 938439 913723 889193 864605 839971 815844 792756 770823 750101 730868 713313 697364
61077F97364j4350j2643j1163j0208r360q010o378n201m623m044l043j774m87
$$ 697364 683014 670371 659208 649000 639640 631630 625252 620051 615428 611384 608341 606567 606080
61064F06080O90J596K167K629L174L632L930M438N384O425P389Q781J0781J2474
$$ 606080 606770 608366 610533 613162 616336 619968 623898 628336 633720 640145 647534 656315 667096 679570
61050F79570J3096J3398J4509J6112J7252J8359K0655K3734K5749K6231K6798
$$ 679570 692666 706064 720573 736685 753937 772296 792951 816685 842434 868665 895463
61039H95463K8551L0576L1833L2758L3955L4869L5036L5451L7269M0057M2592
$$ 895463 924014 954590 986423 1019181 1053136 1088005 1123041 1158492 1195761 1235818 1278410
61028A278410M4684M6994M9579N1706N2824N2878N2254N2113N4069N8798O5506
$$ 1278410 1323094 1370088 1419667 1471373 1524197 1577075 1629329 1681442 1735511 1794309 1859815
61017A859815P3418Q2851R4120J06495J19238J32748J47822J65281J87547K19058
$$ 1859815 1933233 2016084 2110204 2216699 2335937 2468685 2616507 2781788 2969335 3188393
61007C188393K63242L20401L90280M74979N77086O97553Q39351J011051J221533
$$ 3188393 3451635 3772036 4162316 4637295 5214381 5911934 6751285 7762336 8983869
60998H983869J473069J765255K097194K439758K690319K679031K271598J501445
$$ 8983869 10456938 12222193 14319387 16759145 19449464 22128495 24400093 25901538
60990B5901538N96262j50133n49933n85401l44161N7470M74339P08789N68436
$$ 25901538 26497800 26347667 25797734 25212333 24868172 24925642 25399981 26108770 26677206
60981B6677206k843q52434j698639k299694k566293k548519k352462k074033j778396
$$ 26677206 26674363 25821929 24123290 21823596 19257303 16708784 14356322 12282289 10503893
60972A0503893j502234j259425j049943q70669p20017n95416m92023m05810l35560
$$ 10503893 9001659 7742234 6692291 5821622 5101605 4506189 4014166 3608356 3272796
60963C272796k80597k38541k06186j80912j60488j42944j27447j14154j02591
$$ 3272796 2992199 2753658 2547472 2366560 2206072 2063128 1935681 1821527 1718936
60954A718936r1390p9927o8991n9324n0799m3620l8947l7389l7853l8720l9227
$$ 1718936 1627546 1547619 1478628 1419304 1368505 1324885 1285938 1248549 1210696 1171976 1132749
60943A132749l8973l7240l3882l0161k7483k5827k4319k2844k1929k1472k0731
$$ 1132749 1093776 1056536 1022654 992493 965010 939183 914864 892020 870091 848619 827888
60932H27888j9484j8247j7291j6313j5089j3779j2513j1239j0056r118q327p558
$$ 827888 808404 790157 772866 756553 741464 727685 715172 703933 693877 684759 676432 668874
60920F68874p096p282p813q004p705p322o972o315n240m089l063k024j068o50
$$ 668874 661778 654496 646683 638679 630974 623652 616680 610365 605125 601036 597973 595949 594881 594231
60906E94231q67j083o43M18J614K607L251L393K962K264J838K044K774L519L815
$$ 594231 593364 592281 591638 592056 593670 596277 599528 602921 605883 608147 609985 612029 614803 618322 622137
60891F22137L782M102N221O703P690P876P711P735Q106Q734R410R818R760R482
$$ 622137 625919 630021 635242 641945 649635 657511 665222 672957 681063 689797 699207 709025 718785 728267
60877G28267R465J0007J1218J3160J5430J6906J6781J5780J5600J6897J8614J9561
$$ 728267 737732 747739 758957 772117 787547 804453 821234 837014 852614 869511 888125 907686
60865I07686J9824K0139K0636K0784K0246J9210J8098J7211J6372J4721J1356
$$ 907686 927510 947649 968285 989069 1009315 1028525 1046623 1063834 1080206 1094927 1106283
60854A106283O502J504k623o033r114j1524j2872j3714j5015j6930j8961k0955
$$ 1106283 1112785 1114289 1111666 1105633 1096519 1084995 1072123 1058409 1043394 1026464 1007503 986548
60842I86548k3020k4733k5392k5149k4991k5416k5888k5777k5123k4190k2913
$$ 986548 963528 938795 913403 888254 863263 837847 811959 786182 761059 736869 713956
60831G13956k1240j9460j7813j6115j4227j2541j1562j1184j0776r957q956q178
$$ 713956 692716 673256 655443 639328 625101 612560 600998 589814 579038 569081 560125 551947
60819E51947p685p158o281n086l970l365l345l565l580l256k846k635k543k233
$$ 551947 544262 537104 530823 525737 521767 518402 515057 511492 507912 504656 501810 499175 496632 494399
60805D94399j632j100q31m31M82J377J275J26r22r94n20l49m65l10M6q1q94j783
$$ 494399 492767 491667 490836 490405 490887 492264 493539 493665 492743 491749 491229 490880 490415 490105 490151 490070 489176 487393
60787D87393k133j966j662j524j668k003k277k494l026m034m981n270n171n415
$$ 487393 485260 483294 481632 480108 478440 476437 474160 471666 468640 464606 459625 454355 449184 443769
60773D43769o010o193n561m540l575k600j602r55q39q54o05k48q7j03k36o90j413
$$ 443769 437759 431566 426005 421465 417890 415290 413688 412733 411894 411040 410435 410187 410100 409997 409761 409071 407658
60756D07658j752j132P2R17R70N98L12K59M12Q13J507K376L127L407L027K164
$$ 407658 405906 404774 404846 405763 406733 407331 407643 407902 408314 409127 410634 413010 416137 419544 422571 424735
60740D24735J274O70K83p7m73r25j532k261k793k818k417j949j692j726k039k551
$$ 424735 426009 426679 426962 426885 426412 425487 423955 421694 418901 416083 413666 411717 410025 408299 406260 403709
60724D03709l103l554l804l727l210k430j884j903k295k610k665k571k442k331
$$ 403709 400606 397052 393248 389521 386311 383881 381997 380094 377799 375189 372524 369953 367511 365180
60710C65180k372k642k886k693k087j643j795k157j874o95N64Q51Q3p86r13m70
$$ 365180 362808 360166 357280 354587 352500 350857 349062 346905 345031 344336 344900 345751 345834 345048 344135 343665
60694C43665k04l73n34k58L38Q74J166J273J263J104P28K02n8O22K450M538N484
$$ 343665 343461 343088 342554 342296 342634 343508 344674 345947 347210 348314 349042 349244 349186 349808 352258 356796 362280
60677C62280M822L572L062L550M317M777M908M784M324L684L365L591L884L583
$$ 362280 367102 370674 373736 377286 381603 386380 391288 396072 400396 404080 407445 411036 414920 418503
60663D18503K621J568R89J074J723K651L365L471L194L259M082N293O338P241
$$ 418503 421124 422692 423681 424755 426478 429129 432494 435965 439159 442418 446500 451793 458131 465372
60649D65372Q377R633J0354J0141R225P910O005L070j042n963j0808j4309j5537
$$ 465372 473749 483382 493736 503877 513102 521012 527017 530087 529045 523082 512274 497965 482428
60636D82428j4783j3388j2337j1396r923q021o374n297m569m014l579l012k080
$$ 482428 467645 454257 441920 430524 420601 412580 406206 400909 396340 392326 388747 385735 383655
60623C83655j059m83m13m54m24n10p59r66j053j055q27k73K21J77j64j58J95K59
$$ 383655 382596 382113 381700 381246 380822 380312 379553 378587 377534 376479 375652 375379 375600 375777 375613 375455 375650 375909
60605C75909q0j82J48K03m47j128j001k34N00J079J730K229K122J570J277J594
$$ 375909 375829 375647 375795 375998 375551 374423 373422 373188 373688 374767 376497 378726 380848 382418 383695 385289
60589C85289K225K710K803K455J865J449J355J162M78l47o04j75L91P54J100J578
$$ 385289 387514 390224 393027 395482 397347 398796 400151 401313 401791 401444 400840 400665 401056 401810 402910 404488
60573D04488J945K077K435L617N559P447Q526Q889R334J0439J1870J2808J2834
$$ 404488 406433 408510 410945 414562 420121 427568 436094 444983 454317 464756 476626 489434 502268
60560E02268J2113J0688Q261M902J537q56k319l721n533p220p870p089n229k983
$$ 502268 514381 525069 533330 538232 539769 538913 536594 532873 527340 520120 512250 505161 499932 496949
60546D96949q69J018K879M858O870Q787J0582J2319J4113J6116J8219J9812K0228
$$ 496949 496080 497098 499977 504835 511705 520492 531074 543393 557506 573622 591841 611653 631881
60533F31881J9452J7948J5682J2044P039J862k371n844r210j1941j2625j0993
$$ 631881 651333 669281 684963 697007 704046 705908 703537 697693 688483 676542 663917 652924
60521F52924q559o892o048n232m348m008m278m260l232j636n18j91N3R58K471
$$ 652924 644365 637473 631425 626193 621845 617837 613559 609299 606067 604431 603913 603722 603775 604733 607204
60506F07204M082N598P217R066J1137J3546J6447J9731K3291K7479L2683L8434
$$ 607204 611286 616884 624101 633167 644304 657850 674297 694028 717319 744798 777481 815915
60494H15915M3586M7576N0794N3435N4761N3978N1192M6860M0811L2500K1853
$$ 815915 859501 907077 957871 1011306 1066067 1120045 1171237 1218097 1258908 1291408 1313261
60483A313261R253m838j9509l3108m4115n2224n7853o1001o1372n9377n5964n1518
$$ 1313261 1322514 1317676 1298167 1265059 1220944 1168720 1110867 1049866 988494 929117 873153 821635
60471H21635m5937l9833l4562l0755k7694k4514k1288j8491j6175j4209j2675
$$ 821635 775698 735865 701303 670548 642854 618340 597052 578561 562386 548177 535502
60460E35502j1464j0061q307o902o481o579o175n033l866l251l020k770k463k290
$$ 535502 524038 513977 505670 498768 492287 485708 479533 474500 470634 467383 464363 461593 459130 456840
60446D56840k290k362k483k645k637k074q64M21R35N08o6j6L26l0j269k450k747
$$ 456840 454550 452188 449705 447060 444423 442349 441485 441906 442841 443349 443283 443267 443593 443563 442294 439844 437097
60429D37097k425k174k037j536n56M94J239J583J456Q16l7n41m71j81j44l96n34
$$ 437097 434672 432498 430461 428925 428369 428863 430102 431685 433141 433957 433920 433379 432908 432727 432583 432187 431653
60412D31653j62O80J454J541Q39q9n57l81J65Q15J461J901J873J473J230J511
$$ 431653 431491 432171 433625 435166 436005 435916 435359 434978 435143 435958 437419 439320 441193 442666 443896 445407
60396D45407K011K179K001K035K593L236L321K810K320K360K831L226L194K794
$$ 445407 447418 449597 451598 453633 456226 459462 462783 465593 467913 470273 473104 476330 479524 482318
60382D82318K373K250K421K611K590K417K254K079J781J429J230J251J441J869
$$ 482318 484691 486941 489362 491973 494563 496980 499234 501313 503094 504523 505753 507004 508445 510314
60368E10314K537L066K995K421J897J580J042J37n52n40k10k38n96p00k35O11
$$ 510314 512851 515917 518912 521333 523230 524810 525852 525989 525437 524897 524687 524449 523853 523153 522918 523529
60352E23529J603K607L498M271N129O069O686O793O858P216P219N929L469R18
$$ 523529 525132 527739 531237 535508 540637 546706 553392 560185 567043 574259 581478 587407 590876 591794
60338E91794j044k523l572l888l601l450l838m313m305l819l142k556k537l517
$$ 591794 590750 588227 584655 580767 577166 573716 569878 565565 561260 557441 554299 551743 549206 545689
60324E45689n029n815n279m238l678l471k971k295k026k090j816j068l63J31R35
$$ 545689 540660 534845 529566 525328 521650 518179 515208 512913 510887 508797 506981 505913 505550 505681 506616
60309E06616K364L952N116N931O961Q704J1408J5074J9197K2713K4603K4571K2938
$$ 506616 508980 512932 518048 523979 530940 539644 551052 566126 585323 608036 632639 657210 680148
60296F80148J9955J5489R382J941o031j3383j8839k1412k1138j9251j7218j5447
$$ 680148 700103 715592 724974 726915 720884 707501 688662 667250 646112 626861 609643 594196
60284E94196j3317j0547p973o575o225o026n601n373n657o167o537o645o269n084
$$ 594196 580879 570332 562359 555784 549559 543533 537932 532559 526902 520735 514198 507553 501284 496200
60270D96200l307j858j412j722k111k317k434k432k187j784j374r25m13j25l70
$$ 496200 492893 491035 489623 487901 485790 483473 481039 478607 476420 474636 473262 472337 471924 471799 471429
60255D71429j036j693k016j956j593j125q10o55l43K96Q84R19M41n7k88m37o89
$$ 471429 470393 468700 466684 464728 463135 462010 461200 460545 460202 460498 461382 462301 462742 462685 462397 461960 461271
60238D61271q03l42P29J857K365K213K038K359K893L000K677K584L106L951M741
$$ 461271 460468 460126 460855 462712 465077 467290 469328 471687 474580 477580 480257 482841 485947 489898 494639
60223D94639N323N359M321K464J148J502L078M522N222N660O347P194P935Q473
$$ 494639 499962 505321 509642 512106 513254 514756 517834 522356 527578 533238 539585 546779 554714 563187
60209E63187Q649Q229P363O630O437O648O886O958O843O535N954N004L699K377
$$ 563187 571836 580065 587428 594058 600495 607143 614029 620987 627830 634365 640319 645323 649022 651399
60195F51399J542J310J198P37O0m91r71j622k293k740l256m281n419n702m996
$$ 651399 652941 654251 655449 656186 656246 655755 654784 653162 650869 648129 644873 640592 635173 629471 624475
60180F24475m353m565n109n024m291l653l433l189k486j516q68r79j798k803l377
$$ 624475 620122 615557 610448 605424 601133 597480 594047 590858 588372 586856 585988 585009 583211 580408 577031
60165E77031l297k827k262j684j218j149j424j408o30N02J207J420J733K308K561
$$ 577031 573734 570907 568645 566961 565743 564594 563170 561762 561132 561634 562841 564261 565994 568302 570863
60150E70863K175J749J948K466K458J812J328J581K178K415K301K543L668N443
$$ 570863 573038 574787 576735 579201 581659 583471 584799 586380 588558 590973 593274 595817 599485 604928
60136F04928P122Q014P907P093O164N661N769O235O445N748L974J787K28k86l24
$$ 604928 612050 620064 627971 635064 641228 646889 652658 658893 665338 671086 675060 676847 677075 676789 676465
60121F76465n85r30p08J51R14J025P39N60N03L21Q6M4Q8j31o30j104j558k398
$$ 676465 675880 674950 674242 674393 675307 676332 677071 677631 678134 678455 678541 678585 678673 678542 677912 676808 675250 672852
60103F72852l724m922n367n278n411n945o099n130l412k102j763j717j000M00
$$ 672852 669128 664206 658839 653561 648150 642205 636106 630976 627564 625462 623699 621982 620982 621382
60089F21382J635K131K128K076K015J847J809K225K941L387L204K546J767J035
$$ 621382 623017 625148 627276 629352 631367 633214 635023 637248 640189 643576 646780 649326 651093 652128
60075F52128K59p72k196l854n300o140o446o661p090p573p721p388o892o754p178
$$ 652128 652387 651615 649419 645565 640265 634125 627679 621018 613928 606355 598634 591246 584354 577600 570422
60060E70422p767p799o901n430m150l536l438l314k742j738o49K37R19J574K318
$$ 570422 562655 554856 547955 542525 538375 534839 531401 528087 525345 523607 522958 523195 524114 525688 528006
60045E28006L232M377N578O301O219N835O038O872P257O319M543L129K481J944
$$ 528006 531238 535615 541193 547494 553713 559548 565586 572458 579715 586034 590577 593706 596187 598131
60031E98131Q75o43k206l638m932o056p026p864q302p987p173o810p462q426q444
$$ 598131 599006 598363 596157 592519 587587 581531 574505 566641 558339 550352 543179 536369 528907 520481 512037
60016E12037p289n978n362n052m189k823j849j662j543o68P56J768J798J099J69
$$ 512037 504748 498770 493408 488356 484167 481344 479495 477833 476290 475622 476378 478146 479944 481043 481212
60001D81212p75j648k141j829o28R17J924J985J666J890K859L989N014O393Q138
$$ 481212 480437 478789 476648 474819 474191 475108 477032 479017 480683 482573 485432 489421 494435 500828 508966
59986E08966R097Q420P197P356R063J0528J0476R260P231L656j555o452q892r033
$$ 508966 518063 526483 533680 541036 550099 560627 571103 580363 587594 591250 589695 583243 574351 565318
59972E65318q581q217p386o261n936o436o224m435k230j048n89L95K061L370L716
$$ 565318 556737 548520 541134 534873 528937 522501 516277 511842 509612 508564 507975 508370 510431 513801 517517
59957E17517L577L581L713L630L172K425J651J267J567K337K969L010K489J706
$$ 517517 521094 524675 528388 532018 535190 537615 539266 540533 542100 544437 547406 550416 552905 554611
59943E54611R59M61K96K71j9q13j883k718l064l179l513m121m535m228l101j542
$$ 554611 555570 556031 556327 556598 556579 555766 553883 551165 548101 544922 541409 537288 532753 528525 525424 523882
59927E23882j58N53N10J66J34N76J159J678K307L027L322K992K822L717N344O491
$$ 523882 523724 524277 524787 524953 525087 525663 526822 528500 530807 533834 537156 540148 542970 546687 552031 558522
59911E58522O746O996P974R171R641R217Q300P006N194L108J238l72k028l612
$$ 558522 565268 572264 580238 589409 599050 608267 616567 623573 628767 631875 633113 632741 630713 627101
59897F27101m482m253l306k368j863j745j656j184k37P69J354J664K274L250L858
$$ 627101 622619 618366 615060 612692 610829 609084 607428 606244 606007 606776 608130 609794 612068 615318 619176
59882F19176L529K705K288K496K899L352M174N180N284L694J096r59j758j976
$$ 619176 622705 625410 627698 630194 633093 636445 640619 645799 651083 654777 655873 654914 653156 651180
59868F51180k527l504m455n122n489n496n142m724m474m044k862j084K73M48j34
$$ 651180 648653 645149 640694 635572 630083 624587 619445 614721 610247 606203 603341 602257 602530 602978 602844
59853F02844l74L25J727L512N731Q313J0584J1787J1945J1623J0816Q777N261
$$ 602844 602470 602795 604522 608034 613765 622078 632662 644449 656394 668017 678833 687610 692871
59840F92871J436j078j752j182L3J649L053L216J718p71l422n991q329r783r851
$$ 692871 694307 693229 691477 690295 690328 691977 695030 698246 699964 699193 695771 689780 681451 671668 661817
59825F61817r013q266p998p882p630p323p040o682o194n556m666l541k477j663
$$ 661817 652804 644538 636540 628658 621028 613705 606665 599983 593789 588233 583567 580026 577549 575886
59811E75886q35K31J143J371J084R07Q51K56j091k423k884k483j930j830k264
$$ 575886 575051 575282 576425 577796 578880 579787 580638 580894 579803 577380 574496 572013 570083 568253 565989
59796E65989k897l291l276l074k897k556j811r48n49p12j019j252j547j776j502
$$ 565989 563092 559801 556525 553451 550554 547998 546187 545239 544690 543978 542959 541707 540160 538384 536882
59781E36882q40o18j228j864j567o31k39q27j504j217kJ169J496J029M49M44J205
$$ 536882 536042 535424 534196 532332 530765 530134 529895 529068 527564 526347 526345 527514 529010 530039 530488 530932 532137
59764E32137K282K864K436J426J029K061L977N332N327M583M204M552N204N737
$$ 532137 534419 537283 539719 541145 542174 544235 548212 553544 558871 563454 567658 572210 577414 583151
59750E83151O045O154O175O354O687O674N845M464L209K381J876J746K124K631
$$ 583151 589196 595350 601525 607879 614566 621240 627085 631549 634758 637139 639015 640761 642885 645516
59736F45516K555J719O40k08p21p90l02M07P36O00M23K95o9m16N2J388K415K158
$$ 645516 648071 649790 650430 650222 649501 648711 648409 648816 649552 650152 650575 650870 650801 650385 650437 651825 654240 656398
59718F56398J030P6l03k19L76J389K094J878J195R86J350J606J505J533J986K590
$$ 656398 657428 657504 657201 656982 657358 658747 660841 662719 663914 664900 666250 667856 669361 670894 672880 675470
59702F75470L103L657M292M840N400O359P649Q599Q914R227J0111J0853R898O668
$$ 675470 678573 682230 686522 691362 696762 703121 710770 719369 728283 737510 747621 758474 768372 775040
59688G75040K394r84k579k952l004k901k263j153m52j107l175n675p395p799p355
$$ 775040 777434 776450 773871 770919 767915 765014 762751 761598 761146 760039 756864 751189 743794 735995 728640
59673G28640p028p366q050q407q271q067q056p891p131n934m867m154l393k127
$$ 728640 721612 714246 706196 697789 689518 681451 673395 665504 658373 652439 647572 643418 640025 637898
59659F37898n07P90J314J406J807K744L670M054M100M320M646M492L586K223O30
$$ 637898 637391 638181 639495 640901 642708 645452 649122 653176 657276 661596 666242 670734 674320 676543 677173
59644F77173j344l694n903p415q169q440q387p958p036n556l726k177j476j455
$$ 677173 675829 672135 666232 658817 650648 642208 633821 625863 618827 613271 609545 607368 605892 604437
59630F04437j349p88k63m29j356k659l950m917n248m915m325m028m372n400o700
$$ 604437 603088 602300 602037 601608 600252 597593 593643 588726 583478 578563 574238 570210 565838 560438 553738
59615E53738p458p124o096n180m441l303j832q93o96l09P01J262M22q34p69O54
$$ 553738 546280 539156 533060 527880 523439 520136 518304 517411 516715 516406 517107 518369 518791 517957 517188 517842
59599E17842J836J905J594J663J785J511J269J629K250K343J836J457J763K466
$$ 517842 519678 521583 523177 524840 526625 528136 529405 531034 533284 535627 537463 538920 540683 543149
59585E43149K771K104N90j154k672m031n379o389o522n835n114n052n600o184
$$ 543149 545920 548024 548614 547460 544788 540757 535378 528989 522467 516632 511518 506466 500866 494682
59571D94682o248n553m262k916k104j924j864j390n37J77L61J87J83O05J136J338
$$ 494682 488434 482881 478619 475703 473599 471675 469811 468421 467884 468061 468422 468609 468792 469397 470533 471871
59555D71871J332J615K209K447J969J436J743K771L594L794L911M473N273N937
$$ 471871 473203 474818 477027 479474 481443 482879 484622 487393 490987 494781 498692 503165 508438 514375
59541E14375O745Q315J0668J3163J5440J8002K1282K4167K3957J8516Q705j694
$$ 514375 521120 529435 540103 553266 568706 586708 607990 632157 656114 674630 683335 681641
59529F81641q751j1090j0009p517m758j987P03L005M523N098M967M492L639J966
$$ 681641 672890 661800 651791 644274 639516 637529 638232 641237 645760 650858 655825 660317 663956 665922
59515F65922o60l487n520o611p538q841j0052j0342r685q910q634q535p946o837
$$ 665922 665262 661775 656255 649644 642106 633265 623213 612871 603186 594276 585642 577107 569161 562324
59501E62324n795n106m431l559k896k706k377j127P74K269K911L208L523L566
$$ 562324 556529 551423 546992 543433 540537 537831 535454 534327 535101 537370 540281 543489 547012 550578
59487E50578L242L102L461L768L519L213L744N206P004Q807J0697J2571J3985
$$ 550578 553820 556922 560383 564151 567670 570883 574627 579833 586837 595644 606341 618912 632897
59474F32897J4636J4537J3744J2163R594N849J114l646p119q706q829p989o197
$$ 632897 647533 662070 675814 687977 697571 703420 704534 700888 693769 685063 676234 668245 662048
59461F62048l611j002J079L014N346P797R805J1463J3082J4289J4514J4120J4074
$$ 662048 658437 657435 658514 661528 666874 674671 684476 695939 709021 723310 737824 751944 766018
59448G66018J4571J4949J4802J4246J3008J0270N766L61m728q781j1568j3093
$$ 766018 780589 795538 810340 824586 837594 847864 853630 853991 849263 840482 828914 815821
59436H15821j3544j3127j1866r990q389q122r376j1397j3347j4729j5047j3826
$$ 815821 802277 789150 777284 767294 758905 750783 741407 730010 716663 701934 686887 673061
59424F73061j1164p776m264o31L401P829J2146J5572J7759J9319K1307K4055K7195
$$ 673061 661897 654121 649857 649226 652627 660456 672602 688174 705933 725252 746559 770614 797809
59411G97809L0866L5364L8649L5827K3418M016j5008k7536l2264l0915k5432j7486
$$ 797809 828675 864039 902688 938515 961933 965949 950941 923405 891141 860226 834794 817308
59399H17308q509J048J1088J9244K0555J1713m738k1790l3413l7902l6880l2815
$$ 817308 808799 809847 820935 840179 860734 872447 867709 845919 812506 774604 737724 704909
59387G04909k7742k2922j8728j4990j1613q739o441m622l208k091j015K10J434
$$ 704909 677167 654245 635517 620527 608914 600175 593734 589112 585904 583813 582798 583008 584442
59374E84442K330K783K927K940K975L122L295L274L057L005L462M358N280N920
$$ 584442 586772 589555 592482 595422 598397 601519 604814 608088 611145 614150 617612 621970 627250 633170
59360F33170O341O896P810Q848R534R816J0278J1447J3222J5214J7241J9117K0425
$$ 633170 639511 646407 654217 663065 672599 682415 692693 704140 717362 732576 749817 768934 789359
59347G89359K1061K1695K2957K4495K5446K5568K5126K3954K1626J8304J4508
$$ 789359 810420 832115 855072 879567 905013 930581 955707 979661 1001287 1019591 1034099
59336A034099J0158M891p60n658r506j2935j6113j8483k0037k1444k2668k2766
$$ 1034099 1044257 1049148 1048388 1042730 1033224 1020289 1004176 985693 965656 944212 921544 898778
59324H98778k1568k0189j9251j7948j5671j3334j2045j1507j0758r622q432p145
$$ 898778 877210 857021 837770 819822 804151 790817 778772 767265 756507 746885 738453 731308
59312G31308n751m848m746m634l622k008n79O59K055L333M231N540Q191J1697
$$ 731308 725557 720709 715963 711329 707707 705699 705120 705779 707834 711167 715398 720938 729129 740826
59298G40826J4826J7455K0316K2867K2848J8425R974l52r956j6681j9546j9235
$$ 740826 755652 773107 793423 816290 839138 857563 867537 867185 857229 840548 821002 801767
59286H01767j7430j5324j3105j0772q658p009n609m130k402l39J979M049N301
$$ 801767 784337 769013 755908 745136 736478 729469 723860 719730 717328 716989 718968 723017 728318
59273G28318N841O483P818R633J1294J2411J2998J3173J2818J1520Q970N566K305
$$ 728318 734159 740642 748460 758093 769387 781798 794796 807969 820787 832307 841277 846843 849148
59260H49148j50k124m400p245j0255j2824j4469j4948j4458j3604j2896j2362
$$ 849148 848998 846874 842474 835229 824974 812150 797681 782733 768275 754671 741775 729413
59248G29413j1799j1057r914q131n929m005k760j916j147n14P9J203L100N030
$$ 729413 717614 706557 696643 688512 682583 678578 675818 673902 672755 672241 672320 673523 676623 681653
59234F81653O068O080N492M464L042J603N01m78j734l235m756o289p679q398q318
$$ 681653 687721 693801 699293 703757 706799 708402 708903 708425 706691 703456 698700 692411 684732 676334 668016
59219F68016q135q274q025o596m557l130k527j991j140j99Q82K304L562L872L469
$$ 668016 659881 651607 643582 636986 632429 629299 626772 624781 623641 623442 624324 626628 630190 634062 637531
59204F37531L373L788L847L099K222J941K182K619L171L659L757L621L813M377
$$ 637531 640904 644692 648539 651638 653860 655801 657983 660602 663773 667432 671189 674810 678623 683000
59190F83000M699M559M509M955N496N641N435N035M319L312K396J703Q81j45p95
$$ 683000 687699 692258 696767 701722 707218 712859 718294 723329 727648 730960 733356 735059 735940 735795 735000
59175G35000p11m63p61j338j277k55J126K191K949L845N080O375P347P925Q239
$$ 735000 734289 733826 733065 731727 730450 730195 731321 733512 736461 740306 745386 751761 759108 767033 775272
59160G75272Q195P543O384N093L640J494j318l724m853n247o019p176p744p408
$$ 775272 783467 791010 797394 802487 806127 807621 806303 802579 797726 792479 786460 779284 771540 764132
59146G64132o871o577o144n357m755m746m951m855m567m410m339m186m080m153
$$ 764132 757261 750684 744540 739183 734428 729682 724731 719876 715309 710899 706560 702374 698294 694141
59132F94141m180l844l135k270j439p66k81J80P91J449J977K551L514M805O034
$$ 694141 689961 686117 682982 680712 679273 678507 678226 678406 679197 680646 682623 685174 688688 693493 699527
59117F99527P070Q106R147J0098J1152J2472J3450J3088J1365R464Q396Q041P802
$$ 699527 706597 714703 723850 733948 745100 757572 771022 784110 795475 804939 813335 821376 829178
59104H29178P535P339O989O048M301J798j103l619m934n099n049n501o198o524
$$ 829178 836713 844052 851041 857089 861390 863188 862085 858466 853532 848433 843384 837883 831685 825161
59090H25161o397o119n717m945l797k705k239k723l993n464o600p355q044q813
$$ 825161 818764 812645 806928 801983 798186 795481 793242 790519 786526 781062 774462 767107 759063 750250
59076G50250r526r982j0046r645q937q267p660o715n459m797n320o114n824m672
$$ 750250 740724 730742 720696 711051 702114 693847 686187 679472 674013 669216 663896 657782 651958 647286
59062F47286m228n061n931n741n062n014n550n746n228m425l737l153k510j696
$$ 647286 643058 637997 632066 626325 621263 616249 610699 604953 599725 595300 591563 588410 585900 584204
59048E84204p29J25N27O36R96J683J986J369K60m35l37K62R10J247J104O59M54
$$ 584204 583475 583600 584127 584763 585759 587442 589428 590797 591057 590622 590285 590547 591457 592704 593808 594467 594921
59031E94921R52K156L688N065N946O511P488R407J1816J3776J5001J5997J7097
$$ 594921 595873 598029 601717 606782 612728 619239 626727 636134 647950 661726 676727 692724 709821
59018G09821J8006J8330J7874J6362J3658J0317P157M183P45l101o358q439r678
$$ 709821 727827 746157 764031 780393 794051 804368 811525 815708 816453 813352 806994 798555 788877
59005G88877j0195r334o969m273k363q78J156L725N833O734O275M582K107k64
$$ 788877 778682 769348 762379 758106 755743 754865 756021 759746 765579 772313 778588 783170 785277 785013
58991G85013j836k683l187l450l578m028m978n875o127n936n805n713n299m456
$$ 785013 783177 780494 777307 773857 770279 766251 761273 755398 749271 743335 737530 731817 726518 722062
58977G22062l185j361P93K534L631M897O992R165J0239J0295J0364J0775J0971
$$ 722062 718877 717516 718309 720843 724474 729371 736363 745528 755767 766062 776426 787201 798172
58964G98172J0832J0962J1419J1337J0188Q566P161N657L303J70k858n243p401
$$ 798172 809004 819966 831385 842722 852910 861476 868637 874294 877597 877767 874909 869666 862265
58951H62265r954j2708j4743j5484j5331j4963j4394j3223j1611j0190r003p354
$$ 862265 852311 839603 824860 809376 794045 779082 764688 751465 739854 729664 720661 713307
58939G13307m997k739j382p57l60k40n93j039j117j178j925l264m317m497m059
$$ 713307 708310 705571 704189 703432 703072 702832 702239 701200 700083 698905 696980 693716 689399 684902 680843
58924F80843l667l850m724n753o025n234m101l399k933k102j122q26j302j523
$$ 680843 677176 673326 668602 662849 656824 651590 647489 644090 641157 639055 637933 637107 635805 634282
58910F34282n76J283L022M022M691N976Q255J0791J2578J3592J4650J5910J6422
$$ 634282 633706 634989 638011 642033 646724 652700 660955 671746 684324 697916 712566 728476 744898
58897G44898J5526J3887J2394J0884Q846O929O489P896J0215J2532J4672J6597
$$ 744898 760424 774311 786705 797589 806435 813364 819853 827749 837964 850496 865168 881765
58885H81765J7986J8620J8489J7415J5081J1591P613L884Q43j475l604o354r741
$$ 881765 899751 918371 936860 954275 969356 980947 988560 992444 993287 991812 988208 981854 972113
58872I72113j2623j4026j4495j5223j6143j6034j4504j2581j1167j0010q738p888
$$ 972113 959490 945464 930969 915746 899603 883569 869065 856484 845317 835307 826569 818681
58860H18681q076q866r312r226r184r471r698r424q628p559o497n705n305n053
$$ 818681 810605 801739 792427 783201 774017 764546 754848 745424 736796 729237 722740 717035 711730 706677
58846G06677m515l671l251m097o080p898q382p853p717q587r458r098p677o407
$$ 706677 702162 698491 695240 691143 685063 677165 668783 660930 653213 644626 635168 626070 618393 611986
58832F11986n887n611n003m155l387k657j788r40m53l20j25M67J242J673J653
$$ 611986 606099 600488 595485 591330 587943 585286 583498 582558 582105 581785 581660 582127 583369 585042 586695
58817E86695J776K572L572L680K602J322Q96J254J586J486J139P05J64m03q08
$$ 586695 588471 591043 594615 598295 600897 602219 603115 604369 605955 607441 608580 609285 609449 609046 608238
58802F08238j077j360j670j980k372k720k572j786j069j326k519l653l850k979
$$ 608238 607161 605801 604131 602151 599779 597059 594487 592701 591632 590306 587787 584134 580284 577305
58788E77305j404L71J810K560K834L240M162N396O487P166P460P553P608P667
$$ 577305 575901 576272 578082 580642 583476 586716 590878 596274 602761 609927 617387 624940 632548 640215
58774F40215P661P419O634M921K225r11l771o032p638q293p751o541n658n400
$$ 640215 647876 655295 661929 666850 669075 668164 664393 658361 650723 642430 634679 628138 622480 617080
58760F17080n123m358l403k631j902j080m05OL88P09N39p6l17L17J314K055K690
$$ 617080 611957 607599 604196 601565 599663 598583 598178 598184 598572 599281 599820 599744 599427 599744 601058 603113 605803
58743F05803L587M610N543O522P528Q182Q510R099R913J0077R477R404J0618J1908
$$ 605803 609390 614000 619543 626065 633593 641775 650285 659384 669297 679374 688851 698255 708873 720781
58729G20781J1831J0907J0510J0452R224O312K700o48l389n114n501n116m819
$$ 720781 732612 743519 754029 764481 773705 780017 782717 782069 778680 773566 768065 762949 758130
58716G58130m470l308j469R0J080J995K793K720J589P1j435l167n165p052q787
$$ 758130 753660 750352 748883 748973 750053 752048 754841 757561 759150 759221 757786 754619 749454 742402 733615
58701G33615j0704j2683j4233j5362j6460j7331j7345j6550j5643j4823j3650
$$ 733615 722911 710228 695995 680633 664173 646842 629497 612947 597304 582481 568831
58690E68831j2016j0298q471o210l947k776k986l665l939l790l512l202l001l021
$$ 568831 556815 546517 538046 531836 527889 525113 522127 518462 514523 510733 507221 504019 501018 497997
58676D97997k929k240j069L4R35J916L045M227N613P192Q402R057J0099J2326
$$ 497997 495068 492828 491759 491793 492728 494644 497689 501916 507529 514721 523123 532180 542279 554605
58662E54605J4852J6070J5711J4510J2377Q623L850j97k851m941o966q400r091
$$ 554605 569457 585527 601238 615748 628125 636748 640598 640401 637550 632609 625643 617243 608152
58649F08152r664j0230j0184r587r236r059q091o367n178m889m252k582r54k87
$$ 608152 598488 588258 578074 568487 559251 550192 542101 535734 530556 525667 521415 518833 517879 517592
58635E17592J98J547L355M539M769M207K807Q37p45j268j092q64p98j028j661
$$ 517592 517790 519337 522692 527231 532000 536207 539014 539851 539106 537838 536746 535882 535084 534056 532395
58620E32395k113j448K52J850K812L681M629N003M758M904N886O839P028O660
$$ 532395 530282 528834 529086 530936 533748 537429 542058 547061 551819 556723 562609 569448 576476 583136
58606E83136N766L913J659N82J020J412Q03J92K81k06k265m409m591l125j798
$$ 583136 588902 592815 594474 595056 596076 597488 598291 598483 598764 598558 596293 591884 587293 584168 582370
58591E82370j075q5J348K549L505M905O923R144J1374J3424J4584J4443J3767
$$ 582370 581295 581210 582558 585107 588612 593517 600440 609584 620958 634382 648966 663409 677176
58578F77176J3464J3241J2301J0763R290P919O537N900O795Q564R755J0113J0752
$$ 677176 690640 703881 716182 726945 736235 744154 750691 756591 763386 771950 781705 791818 802570
58565H02570J2522J5264J8538K2065K5433K8196L0281L1723L2155L1071K8434
$$ 802570 815092 830356 848894 870959 896392 924588 954869 986592 1018747 1049818 1078252
58554A078252K4557J9752J4472R437N112J477j557m027o369r058j1569j2815j2969
$$ 1078252 1102809 1122561 1137033 1146470 1151582 1153059 1151502 1147475 1141106 1132048 1120479 1107664 1094695
58541A094695j3737j6197j9561k2677k5442k7942k9507k9724k9274k8647k7195
$$ 1094695 1080958 1064761 1045200 1022523 997081 969139 939632 909908 880634 851987 824792
58530H24792k4499k1518j9101j6554j3052r469p221o089m795l032j477l07Q13
$$ 824792 800293 778775 759674 743120 730068 720599 713378 707289 702494 699462 697985 697678 698491
58517F98491J717J979J804J524Q08n88j809j921j351j105j192j035q58j331k241
$$ 698491 700208 702187 703991 705515 706323 705735 703926 702005 700654 699549 698357 697322 696464 695133 692892
58502F92892k778k792k680k442j913j430j292j100o22m89r96j018N20K849M379
$$ 692892 690114 687322 684642 682200 680287 678857 677565 676465 675843 675354 674358 673340 673860 676709 681088
58487F81088M942N624O965Q693J0721J3038J5100J6550J8134K0601K3224K4662
$$ 681088 686030 691654 698619 707312 718033 731071 746171 762721 780855 801456 824680 849342
58475H49342K4765K4208K2811J9669J4594Q314J597m751r637j2570j4290j5499
$$ 849342 874107 898315 921126 940795 955389 963703 965300 960549 950912 938342 924052 908553
58463I08553j5748j4585j2819j1352r714p151m139j316J979O292J0233J2023J2075
$$ 908553 892805 878220 865401 854049 844335 837184 833045 831729 833708 840000 850233 862256 874331
58450H74331J1945J1497R270N195P00l581q025j2098j4393j4711j4266j3708j2569
$$ 874331 886276 897773 907043 912238 912938 909357 901332 889234 874841 860130 845864 832156 819587
58437H19587j0715q662o470l804j036J111K776M437N634N778N783P090R459J1451
$$ 819587 808872 800210 793740 789936 788900 790011 792787 797224 802858 808636 814419 821509 830968 842419
58423H42419J2750J4077J5180J4850J2790R668N667Q03l617o063p093q566j0677
$$ 842419 855169 869246 884426 899276 912066 921734 927401 928204 924587 918524 911431 902865 892188
58410H92188j1871j1615j0999j0494r381p723o804p026p199o449n185l852k225
$$ 892188 880317 868702 857703 847209 837828 830105 823301 816275 809076 802627 797442 793590 791365
58397G91365k85J625L572N710P234P217O182N347M697L448J963J240R71J70o41
$$ 791365 791080 792705 796277 801987 809221 816438 822620 827967 832664 836112 838075 839315 840286 840456 839815
58382H39815j82R84J036K6j45R90J778J430J266K291L704M582N245O238P458Q754
$$ 839815 839633 840617 841653 841679 841534 842524 844302 845732 846998 849289 852993 857575 862820 869058 876516 885270
58366H85270J0051J0793J0631J0471J1322J2592J3127J3370J4385J5432J4824
$$ 885270 895321 906114 916745 927216 938538 951130 964257 977627 992012 1007444 1022268
58355A022268J2658J0429Q396N840L370K271J989R86l06j78J196K198K864M418
$$ 1022268 1034926 1045355 1053751 1059591 1062961 1065232 1067221 1068207 1067901 1067723 1068919 1071117 1073981 1078399
58341A078399O237O714O772Q779J2188J4144J4445J5704J8343J9670J8705J7690
$$ 1078399 1084636 1091350 1098122 1106901 1119089 1133233 1147678 1163382 1181725 1201395 1220100 1237790
58329A237790J7713J6975J4620J2296J0572P715L623R94Q57P20r27j949n24J665
$$ 1237790 1255503 1272478 1287098 1299394 1309966 1317681 1321304 1322298 1323155 1323875 1322948 1320999 1320475 1322140
58315A322140K487K582L316M365N305P024R693J1857J2935J4099J5580J6067J5713
$$ 1322140 1324627 1327209 1330525 1334890 1340195 1347219 1356912 1368769 1381704 1395803 1411383 1427450 1443163
58302A443163J6466J8328J8847J7499J6771J7522J7316J5088J3343J3762J4603
$$ 1443163 1459629 1477957 1496804 1514303 1531074 1548596 1565912 1581000 1594343 1608105 1622708
58291A622708J4626J5619J8564K1202K1851K2095K3288K4080K3791K4472K7060
$$ 1622708 1637334 1652953 1671517 1692719 1714570 1736665 1759953 1784033 1807824 1832296 1859356
58280A859356K9141K9101K8822K9884L0874L0960L2236L5818L9466M1653M4128
$$ 1859356 1888497 1917598 1946420 1976304 2007178 2038138 2070374 2106192 2145658 2187311 2231439
58269B231439M7894N0772N1688N3118N6553N9796O1539O4055O8365P1507P1746
$$ 2231439 2279333 2330105 2381793 2434911 2491464 2551260 2612799 2676854 2745219 2816726 2888472
58258B888472P1789P3417P3875P1169O7999O6645O5030O1780O0119O2449O6094
$$ 2888472 2960261 3033678 3107553 3178722 3246721 3313366 3378396 3440176 3500295 3562744 3628838
58247C628838O8675P2619P9924Q7668R3329R9427J08192J16991J23776J31516
$$ 3628838 3697513 3770132 3850056 3937724 4031053 4130480 4238672 4355663 4479439 4610955
58237D610955J42400J53291J61910J71581J84739J97980K08985K21722K39128
$$ 4610955 4753355 4906646 5068556 5240137 5424876 5622856 5831841 6053563 6292691
58228F292691K57384K73496K91376L14194L38169L60530L85827M17451M51278
$$ 6292691 6550075 6823571 7114947 7429141 7767310 8127840 8513667 8931118 9382396
58219I382396M84923N24292N73147O25933O79338P40616Q15205Q97503R84233
$$ 9382396 9867319 10391611 10964758 11590691 12270029 13010645 13825850 14723353 15707586
58210A5707586J084997J208113J348801J504195J686687J908706K168990K469588
$$ 15707586 16792583 18000696 19349497 20853692 22540379 24449085 26618075 29087663
58202B9087663K830888L273392L803192M436333N219261O202828P415675Q886252
$$ 29087663 31918551 35191943 38995135 43431468 48650729 54853557 62269232 71155484
58194G1155484J0667270J2814685J5376763J8432775K2090224K6389712L1249263
$$ 71155484 81822754 94637439 110014202 128446977 150537201 176926913 208176176
58187B08176176L6487096M1631290M5371376M5293726L8836045K5261033O948448
$$ 208176176 244663272 286294562 331665938 376959664 415795709 441056742 448005190
58180D48005190j1510124k5889998l4429818l7915270l8221143l6880527l4629590
$$ 448005190 436495066 410605068 376175250 338259980 300038837 263158310 228528720
58173B28528720l1713618k8300670k4649480k1059783j7763383j4872465j2407088
$$ 228528720 196815102 168514432 143864952 122805169 105041786 90169321 77762233
58166G7762233j0345593q645773p248867o096703n148708m374191l737735l205626
$$ 77762233 67416640 58770867 51522000 45425297 40276589 35902398 32164663 28959037
58158B8959037k759114k388339k079320j817867j598878j419708j269973j138566
$$ 28959037 26199923 23811584 21732264 19914397 18315519 16895811 15625838 14487272
58150A4487272j024650r31024q52089p78640p09424o47885n92012n37181m85012
$$ 14487272 13462622 12531598 11679509 10900869 10191445 9543560 8951548 8414367 7929355
58141G929355m40082m01105l63683l28567k99461k75963k55880k40911k32721
$$ 7929355 7489273 7088168 6724485 6395918 6096457 5820494 5564614 5323703 5090982
58132E090982k26873k17729k06154j95854j85850j73405j60701j51434j43885
$$ 5090982 4864109 4646380 4440226 4244372 4058522 3885117 3724416 3572982 3429097
58123C429097j34339j24300j17551j12872j06555r9420r4631r1003q5290p8794
$$ 3429097 3294758 3170458 3052907 2940035 2833480 2734060 2639429 2548426 2463136 2384342
58113B384342p5008p2682o7973o1785n8279n7390n5357n1776m9741m9553m8269
$$ 2384342 2309334 2236652 2168679 2106894 2048615 1991225 1935868 1884092 1834351 1784798 1736529
58102A736529m5379m3432m2952m1730l9158l6812l4860l2136k9388k8404k8386
$$ 1736529 1691150 1647718 1604766 1563036 1523878 1487066 1452206 1420070 1390682 1362278 1333892
58091A333892k7070k4828k3753k3536k2155j9827j8347j7381j5375j3372j3811
$$ 1333892 1306822 1281994 1258241 1234705 1212550 1192723 1174376 1156995 1141620 1128248 1114437
58080A114437j6217j7942j8641k0118k2312k3339k3170k3553k4586k4774k4054
$$ 1114437 1098220 1080278 1061637 1041519 1019207 995868 972698 949145 924559 899785 875731
58069H75731k3441k2342j9564j6331j4819j4402j2817j0305q982q792p837o232
$$ 875731 852290 829948 810384 794053 779234 764832 752015 741710 732728 723936 716099 709867
58057G09867n920o979p729q185r739j1685j1734r965q706q487p612n801m782m972
$$ 709867 703947 696968 689239 681054 671315 659630 647896 637931 629225 620738 613126 607325 602543 597571
58043E97571m922m416m875o340p103o779o838p686p983p249o500o084n447n076
$$ 597571 592649 588233 583358 577018 569915 563136 556298 548612 540629 533380 526880 520796 515349 510273
58029E10273o038p604p990p430p742q952r253q373p939q286p833o084m447l658
$$ 510273 504235 496631 488641 481211 473469 464517 455264 446891 438952 430666 422833 416749 412302 408644
58015D08644l004k381k561l111k699j681j714k668k659j419p26j159j260m52L5
$$ 408644 405640 403259 400698 397587 394888 393207 391493 388825 386166 384747 384021 382862 381602 381150 381185
58000C81185k52j64O24J061J053J771L053L232K238K066L411M472M068L289L047
$$ 381185 380933 380769 381393 382454 383507 385278 388331 391563 393801 395867 399278 403750 407818 411107 414154
57985D14154K548J257L7p32j909l590m582m750n532p219q083p264o148n790n298
$$ 414154 416702 417959 417996 417264 415355 411765 407183 402433 396901 389682 381599 374335 368187 362397 357099
57970C57099l950k654k060j353j31N35J29l04k35o65j850k206p82J101K014K229
$$ 357099 353149 350495 348435 347082 346951 347486 347615 347311 347076 346411 344561 342355 341573 342674 344688 346917
57954C46917K162J196n52j365m60N24J98l27M81K053L169M230O116Q146R146R525
$$ 346917 349079 350275 349723 348358 347898 348422 348620 348293 348774 350827 353996 358226 364342 372488 381634 391159
57938C91159J0449J1990J3526J4980J6251J6455J5270J3920J3347J2499R884N869
$$ 391159 401608 413598 427124 442104 458355 474810 490080 504000 517347 529846 539730 545599
57926E45599J866j772n496r024j1670j3569j5245j6492j6862j6647j6227j5238
$$ 545599 547465 545693 540197 531173 519503 505934 490689 474197 457335 440688 424461 409223
57914D09223j3418j1571j0513r875q985q115p588o538m061r94Q18P62j66r13j238
$$ 409223 395805 384234 373721 363846 354861 346746 339158 332620 328559 327565 328383 329145 328979 328066 326828
57899C26828j328j478j953k505k336j114M81J715K698L796M845N558O050O397
$$ 326828 325500 324022 322069 319564 317228 316114 316595 318310 321008 324804 329649 335207 341257 347654
57885C47654O345N953N700N541M722L051J339P6j268l023m578n524o378p384p825
$$ 347654 353999 359952 365652 371193 375915 378966 380305 380381 379113 376090 371512 365988 359610 352226 344401
57870C44401p362o846o791o311m783l290l030l236k290j58J769K813L536M436
$$ 344401 337039 330193 323402 317091 312308 309018 305988 302752 300462 300304 302073 304886 308422 312858
57856C12858N343N998O358O391O218O146O078N393L827J870j61k505m877o116
$$ 312858 318201 324199 330557 336948 343166 349312 355390 360783 364610 366480 366319 363814 358937 352821
57842C52821n778n067n214n828n860n326m910m621m019l259k796k523j981j080
$$ 352821 347043 341976 336762 330934 325074 319748 314838 310217 306198 302939 300143 297620 295639 294559
57828B94559J53J848L687M788M881M814N172N364M820M053L603L060K184J835
$$ 294559 294712 296560 300247 305035 309916 314730 319902 325266 330086 334139 337742 340802 342986 344821
57814C44821K563L273K682J204m7j245l312o060q417r949j0770j0465q671o313
$$ 344821 347384 350657 353339 354543 354496 353251 349939 343879 335462 325513 314743 304278 295607 289294
57800B89294m757m032l225k296k085k656l047k638j678n31N70J196J126Q57R46
$$ 289294 284537 280505 277280 274984 272899 270243 267196 264558 262880 262349 262919 264115 265241 266098 267044
57785B67044J214J460K232L882N544O250O415O929P423O962N912N464N592N115
$$ 267044 268258 269718 271950 275832 281376 287626 294041 300970 308393 315355 321267 326731 332323 337438
57771C37438L648J947L84j421l387m844n733o612p416p511p010o761o893o605
$$ 337438 341086 343033 343417 341996 338609 333765 328032 321420 314004 306493 299483 292722 285829 279224
57757B79224n567m316l105j629p6P72P19L63r5j119k632l707l859l638l593l551
$$ 279224 273657 269341 266236 264607 264531 265303 266022 266385 266290 265171 262539 258832 254973 251335 247742 244191
57741B44191l189k546j639l86Q65J497J524J603K013K361K345K095J655R34K16
$$ 244191 241002 238456 236817 236431 237296 238793 240317 241920 243933 246294 248639 250734 252389 253323 253539
57726B53539m9L4Jj40j13k14r55j893j968j096l83n23r37q46k42O09J655K608
$$ 253539 253490 253524 253525 253385 253272 253058 252103 250210 248242 247146 246763 246240 245303 244457 244215 244824 246479 249087
57708B49087K656J314p95k343k349q95R84K279L114M513O750Q630R092Q722Q626
$$ 249087 251743 253057 252262 249919 247570 246675 247659 249938 253052 257565 264315 272945 282037 290759 299385
57693B99385Q435O780L413n12m083p265r883j1337j1467j0616q827o033k988p29
$$ 299385 307820 314600 318013 317501 313418 306153 296270 284933 273466 262850 254023 247990 245002 244273
57679B44273R22L036N770Q286J0592J3946J8998K5003L1399L8849M8011N8508
$$ 244273 245195 248231 254001 262287 272879 286825 305823 330826 362225 401074 449085 507593
57667E07593O9766Q1483R1933R6461Q9091O6368L0294j1624m9392p5336q7494
$$ 507593 577359 658842 750775 847236 936327 1002695 1032989 1021365 971973 896637 809143
57656H09143q8728q3054p3430o2278n1908m3444l6401l0063k4579k0238j6703
$$ 809143 720415 637361 563931 501653 449745 406301 369900 339837 315258 295020 278317
57645B78317j3646j1299r757q452o906n447m597m265m007l570k931k260j999k302
$$ 278317 264671 253372 243615 235163 228257 222810 218213 213948 209941 206371 203440 201180 199181 196879
57631A96879k459j650l24J82m60j169j245j335k090k966l092k564k189k495l425
$$ 196879 194420 192770 192446 192628 192168 190999 189754 188419 186329 183363 180271 177707 175518 173023 169598
57616A69598m427m585l354j447j79J30K39N01M52O1J3L45K36l58l14P19J425Q05
$$ 169598 165171 160586 157232 155785 155606 155736 155975 156476 156928 156989 157002 157347 157583 157225 156911 157630 159055 159860
57598A59860k85o21m66p43j399j809k012k350k613k559k617l063l282k833k380
$$ 159860 159575 158954 158488 157745 156346 154537 152525 150175 147562 145003 142386 139323 136041 133208 130828
57583A30828k564k801k397j966k376l002k607j383o05o10p22r32j990l713m654
$$ 130828 128264 125463 123066 121100 118724 115722 113115 111732 111127 110517 109795 108863 106873 103160 98506
57568I8506l928k266q74j92n8k23l31j10J87O9l22k92L73J074J281J133J014J044
$$ 98506 94578 92312 91438 91246 91188 90965 90634 90524 90711 90780 90458 90166 90539 91613 92894 94027 95041 96085
57550I6085J169J359J512J543J560J663J669J400J136J242J482J364J115J586
$$ 96085 97254 98613 100125 101668 103228 104891 106560 107960 109096 110338 111820 113184 114299 115885
57536A15885K934L995L474J432p75j925j938j580j529j887k344k485j983q49L85
$$ 115885 118819 122814 126288 127720 126945 125020 123082 121502 119973 118086 115742 113257 111274 110425 110810
57521A10810J037J027R59J225J434J148P09P13R97Q94K43n62j296j903j985j302
$$ 110810 111847 112874 113833 115058 116492 117640 118349 119062 120059 120953 121196 120634 119338 117435 115450 114148
57505A14148n53p02j561k071j876j472r72j42L38o43k537l330k367j296j324j368
$$ 114148 113595 112893 111332 109261 107385 105913 104941 104799 105137 104494 101957 98627 96260 94964 93640 92272
57489I2272k53R48N46r88j706r81P4N61O23N42L73L09M23K71l86q40m23L22M66
$$ 92272 92019 92967 93513 92525 90819 89838 89912 90473 91096 91638 92011 92320 92743 93014 92628 91788 91365 91687 92153
57470I2153K24M11Q14M92n22j131q68m76o27j057j184q39k30K59K38k14m54j62
$$ 92153 92377 92788 93602 94094 93572 92441 91573 91097 90470 89413 88229 87390 87160 87419 87657 87443 86989 86827
57452H6827np05j802k124j290l6P69Q31L60r8l0L85M12r9m06j71j64q60j362p77
$$ 86827 86822 86117 84315 82191 80901 80865 81634 82465 82825 82727 82697 83082 83494 83395 82989 82818 82654 81794 80432 79655
57432G9655K92Q07J003J576J998J304mn46k60k32o06m42L15O03J78K7M64M47n63
$$ 79655 79947 80754 81757 83333 85331 86635 86631 86085 85825 85593 84987 84545 84860 85463 85641 85668 86132 86579 86016
57413H6016j557j514q12l49k91l66m96n30j40N04P03K06m31p85j041j278j203
$$ 86016 84459 82945 82133 81784 81493 81127 80631 80101 79961 80465 81168 81374 80943 80158 79117 77839 76636
57396G6636q99r23j296j270n49J54K95L25Q03J387J431R83N97N41O88Q52Q59N88
$$ 76636 75737 74814 73518 72248 71699 71853 72148 72473 73276 74663 76094 77077 77674 78215 78903 79755 80614 81202
57378H1202J99J1K9o0l42n51n25l66j52nl52j447k642k814j650L8J282J784J760
$$ 81202 81401 81412 81441 81381 81039 80488 79963 79597 79445 79440 79088 77641 74999 72185 70535 70573 71855 73639 75399
57359G5399J588J600J745J602J093Q22J140J453J201R03J174J380O35l67k23P83
$$ 75399 76987 78587 80332 81934 83027 83849 84989 86442 87643 88546 89720 91100 91735 91368 91145 91928
57343I1928R29j64r37m63K08l2p15r84r88j021n29Q81K297K592J949J377J229
$$ 91928 92857 92693 91756 91293 91501 91469 90754 89770 88782 87761 87232 88113 90410 93002 94951 96328 97557
57326I7557J118Q37N52M12M97Q80J328J335Q20K77J6j95m80n66l70k38l36n09
$$ 97557 98675 99512 100064 100476 100973 101853 103181 104516 105336 105613 105629 105434 104954 104388 104018 103780 103444 102935
57308A02935q52j610k274j868m34P60R63Q88J351J990K062J616J171Q33M40N4
$$ 102935 102083 100473 98199 96331 95897 96657 97620 98508 99859 101849 103911 105527 106698 107531 107971 108025
57292A08025j59p6N63J791K756K453J326J019K021K874K296Q66j92p57j316j791
$$ 108025 107866 107790 108353 110144 112900 115353 116679 117698 119719 122593 124889 125755 125563 124806 123490 121699
57276A21699j902j938k137k064j456r69j176j619j687j610j666j292r1J047J065
$$ 121699 119797 117859 115722 113658 112202 111233 110057 108438 106751 105141 103475 102183 102092 103139 104204
57261A04204L55J26O52J319J831K277K367J894J546K085K961K866J589K66j76
$$ 104204 104559 104685 105337 106656 108487 110764 113131 115025 116571 118656 121617 124483 126072 126338 126162
57246A26162J60Q37J695K597L331L853M187M146L650L162L279L981M698M979M779
$$ 126162 126322 127159 128854 131451 134782 138635 142822 146968 150618 153780 157059 161040 165738 170717 175496
57231A75496M359M142M388M735M553L899L510L642L772L708M029M961N934O748
$$ 175496 179855 183997 188385 193120 197673 201572 205082 208724 212496 216204 220233 225194 231128 237876
57217B37876Q010R710J0612J0076R256R327R634R027P974P713Q133Q126P523P036
$$ 237876 245886 255596 266208 276284 285540 294867 304501 313528 321502 329215 337348 345474 352997 360033
57203C60033O746O292O170P148Q611R144Q691Q531R092R425R007Q520Q473Q448
$$ 360033 366779 373071 379241 386389 395000 404144 412835 421366 430458 439883 448890 457410 465883 474331
57189D74331Q169Q086Q466Q949R362J0028J0921J1501J1686J2090J3011J4011
$$ 474331 482500 490586 499052 508001 517363 527391 538312 549813 561499 573589 586600 600611
57177F00611J4752J5401J5955J6014J5428J4542J3579J2567J1894J2094J2857
$$ 600611 615363 630764 646719 662733 678161 692703 706282 718849 730743 742837 755694
57166G55694J3139J2473J1495J1000J1136J1666J2318J2783J2904J2973J3281
$$ 755694 768833 781306 792801 803801 814937 826603 838921 851704 864608 877581 890862
57155H90862J3526J3351J3155J3550J4251J4444J4056J3624J3043J1659R698Q432
$$ 890862 904388 917739 930894 944444 958695 973139 987195 1000819 1013862 1025521 1035219 1043651
57143A043651Q597R684J1008J2555J4463J6511J8477K0401K2293K4219K6563K9557
$$ 1043651 1052248 1061932 1072940 1085495 1099958 1116469 1134946 1155347 1177640 1201859 1228422 1257979
57131A257979L2731L5567L8403M1732M4962M7064M8175M9281N0533N1335N1944
$$ 1257979 1290710 1326277 1364680 1406412 1451374 1498438 1546613 1595894 1646427 1697762 1749706
57120A749706N3361N5622N7800N9915O3155O7894P3401Q0030Q9784J03719J20378
$$ 1749706 1803067 1858689 1916489 1976404 2039559 2107453 2180854 2260884 2350668 2454387 2574765
57109B574765J37728J55308J73595J92864K13923K38751K69303L06706L52543
$$ 2574765 2712493 2867801 3041396 3234260 3448183 3686934 3956237 4262943 4615486
57100D615486M09690M81060N68935O76628Q09400R72543J169746J403961J677491
$$ 4615486 5025176 5506236 6075171 6751799 7561199 8533742 9703488 11107449 12784940
57091A2784940J989247K333367K701775L085624L471940L841033M168560M423445
$$ 12784940 14774187 17107554 19809329 22894953 26366893 30207926 34376486 38799931
57083C8799931M555480M489484M150896L515871K642211J647746O53450k60675
$$ 38799931 43355411 47844895 51995791 55511662 58153873 59801619 60455069 60194394
57075F0194394j060728j739569k299619k746937l089884l337144l496244l573581
$$ 60194394 59133666 57394097 55094478 52347541 49257657 45920513 42424269 38850688
57067C8850688l574529l503624l366295l171624k933226k667229k389442k113655
$$ 38850688 35276159 31772535 28406240 25234616 22301390 19634161 17244719 15131064
57059A5131064j850690j607531j387396j191189j018942q69869p41980o32755
$$ 15131064 13280374 11672843 10285447 9094258 8075316 7205447 6463467 5830712
57051E830712n40288m63163l99430l46492l02128k64989k33916k07495j84610
$$ 5830712 5290424 4827261 4427831 4081339 3779211 3514222 3280306 3072811 2888201
57042B888201j64864j48039j33553j20738j09268r8968q9531q0736p2569o4831
$$ 2888201 2723337 2575298 2441745 2321007 2211739 2112771 2023240 1942504 1869935 1805104
57032A805104n7056m9096m1262l3448k4618j3864j339J2780K9493M8945O6248
$$ 1805104 1748048 1698952 1657690 1624242 1599624 1585760 1584421 1597201 1626694 1675639 1741887
57021A741887P1120N4495J6815l0624p2963j00665j12455j12138j04418r3214
$$ 1741887 1813007 1867502 1884317 1853693 1780730 1680065 1567610 1455472 1351054 1257840
57011A257840q1491p0992o2098n4435m7594m1308l5504l0523k6860k4396k2324
$$ 1257840 1176349 1105357 1043259 988824 941230 899922 864418 833895 807035 782639 760315
57000G60315k0149j8253j7076j6306j5400j4399j3613j2912j2058j1294j0894
$$ 760315 740166 721913 704837 688531 673131 658732 645119 632207 620149 608855 597961
56989E97961j0415r151p094m640j698K053O141R344J0642R463N338j486r211j5363
$$ 597961 587546 578395 571301 566661 564963 567016 573157 582501 593143 602606 607944 606458 597247 581884
56975E81884j8797k0117k0163j9120j7157j4768j2110q890n314k267j78J483L234
$$ 581884 563087 542970 522807 503687 486530 471762 459652 450762 445448 443181 443003 444486 447720
56962D47720M927O448Q296J0995J4607J8972K3502K6381K5050J8418Q111k964
$$ 447720 452647 459095 467391 478386 492993 511965 535467 561848 586898 605316 613427 610463
56950F10463j2691k0146k4935k7051k6928k4976k1397j6770j2238q531n406k464
$$ 610463 597772 577626 552691 525640 498712 473736 452339 435569 423331 414800 409394 406930
56938D06930J29K293M754Q345J2967J7861K2533K6832L0429L2564L1983K6948
$$ 406930 407059 409352 414106 422451 435418 453279 475812 502644 533073 565637 597620 624568
56926F24568J6299J361j3807k5049l0972l2865l2463l0672k8003k5008k2028j9105
$$ 624568 640867 642228 628421 603372 572400 539535 507072 476400 448397 423389 401361 382256
56914C82256j6319j3841j1645r555p653o291n633n363m846l708k285j437j560
$$ 382256 365937 352096 340451 330896 323243 316952 311319 305956 301110 297402 295117 293680 292120
56901B92120j936j528k70J083K220L455M650N107M998N774Q354J1787J4534J6478
$$ 292120 290184 288656 288386 289469 291689 295144 299794 304901 309899 315673 324027 335814 350348 366826
56887C66826J8694K1737K4990K7279K7222K3428J5483M941n366j3238j8077k0348
$$ 366826 385520 407257 432247 459526 486748 510176 525659 530600 525234 511996 493919 473571
56875D73571k0660j9412j6795j3024q570m022L57M573Q361J1390J4234J8350K4514
$$ 473571 452911 433499 416704 403680 395110 391088 391445 396018 404379 415769 430003 448353 472867
56862D72867L1870L9138M6107N3007N8715O0383N4988M1133K0053m292k6466m2043
$$ 472867 504737 543875 589982 642989 701704 762087 817075 858208 878261 873969 847503 805460
56850H05460m9527n0110m6036l9409l1850k4244j6735r238j856N435J3059K1447
$$ 805460 755933 705823 659787 620378 588528 564284 547549 538311 536455 541890 554949 576396
56838E76396L0623M0495N1174O2722P4926Q7324R8415J04231R8846P8013M2993
$$ 576396 607019 647514 698688 761410 836336 923660 1022075 1126306 1225152 1303165 1346158
56827A346158P45l9503p0225q7936r3488r0406q2356p1705o0069m8929l8963k9512
$$ 1346158 1346903 1307400 1237175 1149239 1055751 965345 882989 811284 751215 702286 663323 633811
56815F33811j9744r941r64P226J5601K4883L5076M5911N6884O6670P2720P1471
$$ 633811 614067 604126 603162 610388 625989 650872 685948 731859 788743 855413 928133 999604
56803I99604N9407L5493L541k8647n3838o9201p5710p5187o9292o0331n0875m2259
$$ 999604 1059011 1094504 1098045 1069398 1015560 946359 870649 795462 726170 665839 614964 572705
56791E72705l4448k7330k0990j4904q254j248M981J0077J5118K1186K8080L4531
$$ 572705 538257 510927 489937 475033 466779 465531 470512 480589 495707 516893 544973 579504
56779E79504L8817L8926L3082K0979M404j3440k9071l9811m4773m5100m2763l9039
$$ 579504 618321 657247 690329 711308 715712 702272 673201 633390 588617 543517 500754 461715
56767D61715l4492k9936k6313k3646k1072j8169j5498j3602j2183j0615q727o793
$$ 461715 427223 397287 370974 347328 326256 308087 292589 278987 266804 256189 247462 240669
56755B40669n236m471m565m900m647l708k762k347k334k399k450k471k336k026
$$ 240669 235433 230962 226397 221497 216850 213142 210380 208033 205699 203300 200850 198379 196043 194017
56741A94017j707j484j295j058p51m42l77p85j321j154lJ238J521Q77J43k13l33
$$ 194017 192310 190826 189531 188473 187722 187280 186903 186118 184797 183643 183640 184878 186399 187276 187419 187206 186873
56724A86873l00j0M15P44J040J424J607J292P40L80J33j88k58K40P88P21M26P78
$$ 186873 186573 186563 186978 187722 188762 190186 191793 193085 193825 194205 194338 194150 193892 194132 194920 195641 196067 196845
56706A96845J572J730J105Q05J415K028J621M86l41m77l35l64n96p99o72r7O75
$$ 196845 198417 200147 201252 202057 203472 205500 207121 207607 207266 206789 206454 206090 205494 204695 204023 203926 204601
56689B04601J247J494J513J286P87K50m0k22o02j064j193r61q47j230k046k925
$$ 204601 205848 207342 208855 210141 210928 211178 211138 210916 210314 209250 208057 207096 206249 205019 202973 200048
56673B00048l351k910j806r37r83j594j880j463n94L73J097J201P12K80L93P71
$$ 200048 196697 193787 191981 191044 190061 188467 186587 185124 184530 184903 186000 187201 187913 188193 188586 189357
56657A89357J094J765L119M420M742M507N000O496P829P928O831N239L838L069
$$ 189357 190451 192216 195335 199755 204497 209004 214004 220500 228329 236257 243088 248327 252165 255234
56643B55234K831K429J507P19P71J166Q65j34r29j245j610k155k411k373k549
$$ 255234 258065 260494 262001 262720 263491 264657 265522 265388 264459 263214 261604 259449 257038 254665 252116
56628B52116k889k801k370k407k998l179k412j453j241j766k385k630k318j504
$$ 252116 249227 246426 244056 241649 238651 235472 233060 231607 230366 228600 226215 223585 221267 219763
56614B19763n51J48O18R77R54L92q1K44R65J100N79J85J37j7j91K26R93R25m20
$$ 219763 219212 219360 219978 220955 221909 222301 222220 222464 223429 224529 225108 225293 225430 225413 225222 225448 226441 227366 226946
56595B26946k065k961l002k423j273P6P85M66l55r47r74m23L29N47km10K39J366
$$ 226946 224881 221920 218918 216495 215222 215298 216083 216549 216194 215247 214273 213850 214179 214726 214724 214314 214553 215919
56577B15919J735J372J299J562J204K22j99K92O46L18J26O48J265J601K349L904
$$ 215919 217654 219026 220325 221887 223091 223313 223114 223406 224052 224370 224496 225144 226409 228010 230359 234263
56561B34263N476O402P139Q118Q736Q373P352O081M326K094K77m83o39p80p24
$$ 234263 239739 246141 253280 261398 270134 278507 285859 291940 296266 298360 298637 298154 297515 296735 296011
56546B96011k87J1k13n67p80j289k330l284l693l950m362m466l998l579l618l521
$$ 296011 295724 295735 295522 294955 294175 292886 290556 287272 283579 279629 275267 270801 266803 263224 259606 256085
56530B56085k767j957j933k583l224l451l043j904o32k29o53o74J83P55N8j159
$$ 256085 253318 251361 249428 246845 243621 240170 237127 235223 234591 234362 233709 233035 233218 233973 234031 232872
56514B32872j660j468j354j452j495j647k002j906p85Q10J826J979J704J411J370
$$ 232872 231212 229744 228390 226938 225443 223796 221794 219888 219103 219913 221739 223718 225422 226833 228203
56499B28203J763K311K457K309K591L246L156J835L86l6K81L80J06n7J77Q38J741
$$ 228203 229966 232277 234734 237043 239634 242880 246036 247871 248257 248221 248502 248882 248988 248931 249108 249946 251687
56482B51687K113J130o20j400o41K43K8o64q12p73j305k010j980j212l00N05R81
$$ 251687 253800 254930 254310 252910 252269 252512 252540 251876 251064 250291 248986 246976 244996 243784 243484 243989 244970
56465B44970N85n61j212n89M01N15j36o14n50n1Q04J559J404M50j07J58J90n22
$$ 244970 245555 244994 243782 243193 243594 244109 243973 243359 242809 242758 243562 245121 246525 246975 246868 247026 247216 246694
56447B46694q12L9P50J14q19m98N22O85Q2p5J85j88j123j516j168q66q53p08m93
$$ 246694 245882 245921 246671 246785 245966 245468 245990 246675 246757 246682 246867 246679 245556 244040 242872 242006 241153 240445 239952
56428B39952n44m37L86J367J593J355J519J864J562R22J000J734K062J694J284
$$ 239952 239408 238971 239357 240724 242317 243672 245191 247055 248617 249539 250539 252273 254335 256029 257313
56413B57313R97L66m55p38m84m92j054j634j786j462o61L69Q96N88J77L30O05
$$ 257313 258310 258676 258221 257483 256999 256507 255453 253819 252033 250571 249910 250279 251175 251763 251940 252270 252875
56396B52875M71N59J616K981L497L286L187L123K546J839J644J397J94j322j745
$$ 252875 253346 253905 255521 258502 261999 265285 268472 271595 274141 275980 277624 279021 279215 277893 276148
56381B76148j203j053j626j980j785j638j525p09P51J859K274K606L058L133K806
$$ 276148 274945 273892 272266 270286 268501 266863 265338 264629 265380 267239 269513 272119 275177 278310 281116
56366B81116K642K664K279J486J000J098J386J612J731J338J57j108j505j186
$$ 281116 283758 286422 288701 290187 291187 292285 293671 295283 297014 298352 298509 297401 295896 294710
56352B94710j007j135j104r04p94m65M01J116Q45L3k18K30Q19J545K525K913J935
$$ 294710 293703 292568 291464 290560 289766 289301 289702 290818 291663 291696 291478 291708 292527 294072 296597 299510 301445
56335C01445N86O46K256L936M727M724L929K257N65k7K84M30K90N32J036J097
$$ 301445 302031 302677 304933 308869 313596 318320 322249 324506 325071 325044 325328 325758 326048 326580 327616 328713
56319C28713Q67J004J163N67j98K12J636K502K174J547J314J282J438K109K984
$$ 328713 329580 330584 331747 332314 332116 332328 333964 336466 338640 340187 341501 342783 344221 346330 349314
56304C49314L377L392L613L980M299N276P336R003Q318N536K545J68j953l302
$$ 349314 352691 356083 359696 363676 367975 373251 380587 389590 397908 403444 405989 406157 404204 400902
56290D00902k817j148k28l87o6J377K768L320L652M226M608M694M963N280N044
$$ 400902 398085 396937 396709 396322 396256 397633 400401 403721 407373 411599 416207 420901 425864 431144 436188
56275D36188M662N159O310O965P162P955R193R560Q957Q833R828J1068J2059J3366
$$ 436188 440850 446009 452319 459284 466446 474401 483594 493154 502111 510944 520772 531840 543899 557265
56261E57265J5103J6612J7952J9958K2648K5290K8098L1986L6695M1080M5229
$$ 557265 572368 588980 606932 626890 649538 674828 702926 734912 771607 812687 857916
56250H57916N0274N6045O1069O4954O8654P2336P5082P6819P8298P9029P7372
$$ 857916 908190 964235 1025304 1090258 1158912 1231248 1306330 1383149 1461447 1540476 1617848
56239A617848P2838O6274N7864M7239L5351K3765J2204o25j3818k4757l2846l9911
$$ 1617848 1690686 1756960 1814824 1862063 1897414 1921179 1933383 1932758 1918940 1894183 1861337 1821426
56227A821426m6660n1807n5074n7896o0509o1381o0300n9091n8442n6965n4235
$$ 1821426 1774766 1722959 1667885 1609989 1549480 1488099 1427799 1368708 1310266 1253301 1199066
56216A199066n1843n0376m8341m5111m2096l9858l6998l3055k9714k7799k5889
$$ 1199066 1147223 1096847 1048506 1003395 961299 921441 884443 851388 821674 793875 767986
56205G67986k3219k1126k0270j9130j6820j4712j3751j2743j0836r134q365p408
$$ 767986 744767 723641 703371 684241 667421 652709 638958 626215 615379 606245 597880 590472
56193E90472n641m264l853l131j608q49j585k216j659j096j248p44J099K500K163
$$ 590472 584831 580567 576714 573583 571975 571126 569541 567325 565666 564570 563322 562578 563677 566177 568340
56178E68340J438J689K069J757J904L283M389L991L310L723M527M848N464O859
$$ 568340 569778 571467 573536 575293 577197 580480 584869 588860 592170 595893 600420 605268 610732 617591
56164F17591P724P352P198Q256R225R202R714J1964J4446J5534J6150J7786K0015
$$ 617591 625315 632667 639865 648121 657346 666548 676262 688226 702672 718206 734356 752142 772157
56151G72157K2073K4759K8597L2226L4802L7992M3698N1706O1278P2886Q6586
$$ 772157 794230 818989 847586 879812 914614 952606 996304 1048010 1109288 1182174 1268760
56140A268760J00984J15452J30866J46312J57683J61452J57372J46115J27687
$$ 1268760 1369744 1485196 1616062 1762374 1920057 2081509 2238881 2384996 2512683
56131B512683J04605Q3315O9267O2674O0951O2127O3333N9576M7857L0704J2880
$$ 2512683 2617288 2700603 2769870 2832544 2893495 2955622 3018955 3078531 3126388 3157092 3169972
56120C169972l227j6853k6906l4231m3214n7725p7199r9090j22233j44697j61356
$$ 3169972 3166745 3149892 3122986 3088755 3045541 2987816 2910617 2811527 2689294 2544597 2383241
56109B383241j67760j64720j55884j42843j25924j07553r0945p6737o3943n2799
$$ 2383241 2215481 2050761 1894877 1752034 1626110 1518557 1427612 1350875 1286932 1234133
56099A234133m3880l6202k8943k3306k0104j7474j3668r951q012o755m471k007
$$ 1234133 1190253 1154051 1125108 1101802 1081698 1064224 1050556 1040605 1032593 1025838 1021367 1019360
56087A019360q43j32J478L095L373L020L090L043K702L517N628O648N704N461
$$ 1019360 1018517 1018385 1019863 1022958 1026331 1029351 1032441 1035484 1038186 1041703 1047331 1053979 1059683 1065144
56073A065144P585R753R956J0050J1848J3597J3685J4091J6421J8426J8191J7926
$$ 1065144 1072729 1082482 1092438 1102488 1114336 1127933 1141618 1155709 1172130 1190556 1208747 1226673
56061A226673J9614K0859J9323J7237J7063J6698J3776J0736J0622J1618J0874
$$ 1226673 1246287 1267146 1286469 1303706 1320769 1337467 1351243 1361979 1372601 1384219 1395093
56050A395093R956J1304J3039J2730J2568J5249J8367J8572J7717J9141K1485
$$ 1395093 1405049 1416353 1429392 1442122 1454690 1469939 1488306 1506878 1524595 1543736 1565221
56039A565221K2043K2460K5070K7388K6543K5410K7883L1829L3392L4336L8120
$$ 1565221 1587264 1609724 1634794 1662182 1688725 1714135 1742018 1773847 1807239 1841575 1879695
56028A879695M2505M3420M2613M4028M6107M5234M3346M4336M6396M5793M4793
$$ 1879695 1922200 1965620 2008233 2052261 2098368 2143602 2186948 2231284 2277680 2323473 2368266
56017B368266M7793N2956N5879N8017O3087O8788P0805P1459P5417Q0466Q1869
$$ 2368266 2416059 2469015 2524894 2582911 2645998 2714786 2785591 2857050 2932467 3012933 3094802
56006C094802Q2088Q6513R3134R6585R8868J05637J15181J21791J26860J35773
$$ 3094802 3176890 3263403 3356537 3453122 3551990 3657627 3772808 3894599 4021459 4157232
55996D157232J46978J55051J61432J71105J82140J89867J97588K11395K28412
$$ 4157232 4304210 4459261 4620693 4791798 4973938 5163805 5361393 5572788 5801200
55987E801200K42378K56357K77082L01509L22681L43892L72632M05848M36485
$$ 5801200 6043578 6299935 6577017 6878526 7201207 7545099 7917731 8323579 8760064
55978H760064M69069N12343N62333O10241O61124P26036Q01981Q79866R65850
$$ 8760064 9229133 9741476 10303809 10914050 11575174 12301210 13103191 13983057 14948907
55969A4948907J073126J199300J335473J490982J684100J915632K179467K491955
$$ 14948907 16022033 17221333 18556806 20047788 21731888 23647520 25826987 28318942
55961B8318942K881646L359195L931034M633952N519168O611591P924610R503452
$$ 28318942 31200588 34559783 38490817 43124769 48643937 55255528 63180138 72683590
55953G2683590J1411511J3695023J6414487J9676680K3552343K7979798L2792780
$$ 72683590 84095101 97790124 114204611 133881291 157433634 185413432 218206212
55946B18206212L7648248M1552441M2410475L7615548K5855819Q685227r840730
$$ 218206212 255854460 297406901 339817376 377432924 403288743 411973970 402133240
55939D02133240k5361836l5359166l9680863l9641811l6905445l2875047k8511950
$$ 402133240 376771404 341412238 301731375 262089564 225184119 192309072 163797122
55932A63797122k4336959k0554629j7231876j4392581j2012925j0028024q379429
$$ 163797122 139460163 118905534 101673658 87281077 75268152 65240128 56860699
55925E6860699p029043n929438n021255m265304l645632l139265k712480k347719
$$ 56860699 49831656 43902218 38880963 34615659 30970027 27830762 25118282 22770563
55917B2770563k045592j797995j584302j395218j236200j105146r88627q81996
$$ 22770563 20724971 18926976 17342674 15947456 14711256 13606110 12617483 11735487
55909A1735487p92612p20769o56137n94988n43496n02034m62388m22298l87648
$$ 11735487 10942875 10222106 9565969 8970981 8427485 7925451 7463063 7040765 6653117
55900F653117l58907l29722k99932k76191k58741k40579k20480k04261j92576
$$ 6653117 6294210 5964488 5664556 5388365 5129624 4889045 4668565 4464304 4271728
55891D271728j79789j65490j55121j48625j40044j28810j20158j14020j04829
$$ 4271728 4091939 3926449 3771328 3622703 3482659 3353849 3233691 3119671 3014842
55882C014842r2820q4390q0502p5725o9730o8745p3974p8854p9734p9662p9932
$$ 3014842 2922022 2837632 2757130 2681405 2611675 2542930 2468956 2390102 2310368 2230706 2150774
55871B150774p7284p1649o7686o6535o4040n8921n4756n2392m8241m1838l7395
$$ 2150774 2073490 2001841 1934155 1867620 1803580 1744659 1689903 1637511 1589270 1547432 1510037
55860A510037l6190l4701l1807l0655l1786l1506k8752k6877k7020k6249k3777
$$ 1510037 1473847 1439146 1407339 1376684 1344898 1313392 1284640 1257763 1230743 1204494 1180717
55849A180717k2687k3987k4946k4726k5628k7563k7238k4161k1726k1263k0528
$$ 1180717 1158030 1134043 1109097 1084371 1058743 1031180 1003942 979781 958055 936792 916264
55838I16264j8968j8745j9698j9047j7006j6861j8581j8274j5004j2255j1537
$$ 916264 897296 878551 858853 839806 822800 805939 787358 769084 754080 741825 730288
55827G30288j0366p872o580p116o814n198n358q212j0676j1109j1428j2287j1433
$$ 730288 719922 712050 705470 698354 691540 686342 680984 672772 662096 650987 639559 627272 615839
55814F15839q594o878p440p626o112n072n458m968k615o41n2J267M047N789N410
$$ 615839 607245 600367 592927 585301 579189 574117 568659 563691 561076 560435 560383 561650 565697 571486 576896
55799E76896N341O974Q114O966M798K697l56m380p174q083r208j1171j1511r048
$$ 576896 582237 589211 597325 604291 609089 611786 611430 607050 599876 591793 582585 571414 559903 550855
55785E50855o122m655l595k113j731l303n159n979o409o368m089O81N865J0665
$$ 550855 544733 540078 536483 534370 532639 529336 524177 518198 511789 505421 501332 502013 507878 518543
55771E18543J6637K3882K9620L1654K9670K2398Q147j0121k4812l1307l2001l1007
$$ 518543 535180 559062 588682 620336 650006 672404 680551 670430 645618 614311 582310 551303
55759E51303k8906k5136k1306j8950j7026j4522j2731j2497j2084j0227q514q347
$$ 551303 522397 497261 475955 457005 439979 425457 412726 400229 388145 377918 369404 361057
55747C61057q296o886n339n087n064l917k507j889j112O49J985J512J90p27j861
$$ 361057 352761 345875 340536 335449 330385 326468 323961 322072 320960 321609 323594 325106 325296 324569 322708
55732C22708l779n073m571l515l434l729l329k929l552m547m857m720m517l645
$$ 322708 318929 313856 309285 305770 302336 298607 295278 292349 288797 284250 279393 274673 270156 266511
55718B66511j952o33j98N87K544M707O278P886R593R961Q446O555N212L229j23
$$ 266511 264559 263926 263728 264315 266859 271566 277844 285730 295323 305284 313730 320285 325497 328726 328603
55703C28603l306m886n530o210o642o840p887r579r786p787n772n346n129l707
$$ 328603 325297 320411 314881 308671 302029 295189 287302 277723 267937 260150 254378 249032 243903 240196
55689B40196k313k350k713j925p88n01k33J051K330K475K631M225O222O724N834
$$ 240196 237883 235533 232820 230895 230107 229606 229373 230424 232754 235229 237860 242085 248307 255031 260865
55674B60865M771L561J754M3q23j408k185k316j545j403k682l587k508p13l8J23
$$ 260865 265636 269197 270951 270994 270171 268763 266578 264262 262717 261314 258632 255045 252537 251824 251786 251909
55658B51909J118K170J935J357K093L362L191J800J056J291J286P57M50K00q58
$$ 251909 253027 255197 257132 258489 260582 263944 267135 268935 269991 271282 272568 273325 273775 273975 273117
55643B73117k494l675m307m951n430n358n284n774o127n679n283n792o158n012
$$ 273117 270623 266948 262641 257690 252260 246902 241618 235844 229717 224038 218755 212963 206805 201793
55629B01793l192k593l188l282k208r02r9K91L32P1M2N29Q90O24L29M39J68j072
$$ 201793 198601 196008 192820 189538 187330 186428 186329 186620 186952 187023 187065 187594 188484 189108 189437 189876 190044 188972
55611A88972k328k583k349k370k122j196p64j786k998k704j425p83p99n05j56
$$ 188972 186644 184061 181712 179342 177220 176024 175260 173474 170476 167772 166347 165564 164765 164260 164104
55596A64104o37j435j388q10p59q81j15J079J361Q77Q61J265J034L77O70K162
$$ 164104 163467 162032 160644 159834 159075 158194 158079 159158 160519 161396 162257 163522 164556 164933 165603 167765
55580A67765L715M793N859O919P432P672Q582J0287J2173J4164J6538J8777K0035
$$ 167765 171480 176273 182132 189051 196483 204155 212737 223024 235197 249361 265899 284676 304711
55567C04711K0353K0010J8251J4246Q828L594j183o155j0915j4313j6325j7780
$$ 304711 325064 345074 363325 377571 386399 389993 388810 382655 371740 357427 341102 323322
55555C23322j8584j8014j6536j5348j4387j2605j0096q076o818n482m058l506
$$ 323322 304738 286724 270188 254840 240453 227848 217752 209676 202858 197376 193318 189812
55543A89812l753l479k251j180j018j090o82j07J71L16N22N40K04k87p93j309
$$ 189812 186059 182580 180329 179149 178131 177041 176359 176252 176423 176739 177261 177801 178005 177718 176925 175616
55527A75616j674j836k109k556k567j834j133j195j553j532j553k191k781k445
$$ 175616 173942 172106 169997 167441 164874 163040 161907 160712 159159 157627 156074 153883 151102 148657
55513A48657j800j967k594k574k179k570l592l961l554l501m071m247l591k803
$$ 148657 146857 144890 142296 139722 137543 134973 131381 127420 123866 120365 116294 112047 108456 105653
55499A05653k210j301j8R42J376J828K416K734K877L283L551K835J419M49J12
$$ 105653 103443 102142 102124 103066 104442 106270 108686 111420 114297 117580 121131 123966 125385 125834 125946
55484A25946n12j640k347k132j592j294j187j293j798k336k298j840j571j393
$$ 125946 125434 123794 121447 119315 117723 116429 115242 113949 112151 109815 107517 105677 104106 102713
55470A02713q53l48n36q73k76R29J406J069J164K011K486K086J721J985K242J942
$$ 102713 101860 101512 100976 100103 99827 100756 102162 103231 104395 106406 108892 110978 112699 114684 116926 118868
55454A18868J472J140O65J23N2K70j46j238j853j399o30k83j67n8k22n61m48J23
$$ 118868 120340 121480 122145 122268 122320 122590 122444 121206 119353 117954 117324 117041 116874 116816 116594 116033 115585 115708
55436A15708L29n0j95L51R75J119R87P49J96l74r7J044J906J770J199Q72O46L06
$$ 115708 116037 115987 115792 116143 117118 118237 119224 119973 120169 119795 119698 120742 122648 124418 125617 126489 127135 127441
55418A27441K18O41J266J940K918M021M440L822K728J675O38l28r83j629k805
$$ 127441 127659 128300 129566 131506 134424 138445 142885 146707 149435 151110 151748 151420 150437 148808 146003
55403A46003m059m194l089j991j581j161l43q7j079k282k255j098o5J58j18l98
$$ 146003 141944 137750 134661 132670 131089 129928 129585 129498 128419 126137 123882 122784 122719 122877 122759 122361
55387A22361m64k54J02L57M87O78Q79Q35N66K35l32j283k017j776r31n96r38r99
$$ 122361 121897 121643 121745 122102 122589 123267 124146 124981 125547 125782 125450 124167 122150 120374 119443 118847 117909 116910
55369A16910l79J83J93J82N40P91N20J30Oj44n59q34n99r9L02N09L38m29j367
$$ 116910 116531 116714 116907 117089 117629 118420 118940 119070 119076 118932 118373 117539 116940 116841 117143 117652 117990 117561 116194
55350A16194j579q84k7M86Q44J144J083P29N65N16k9j028j653j649j582j544q99
$$ 116194 114615 113731 113704 114190 115034 116178 117261 117990 118555 119071 119042 118014 116361 114712 113130 111586 110687
55333A10687K51P64K61j70K78R28R92Q90J219J512J104L35j76o20j350j862j503
$$ 110687 110938 111702 111963 111793 112071 112999 113991 114881 116100 117612 118716 119051 118875 118255 116905 115043 113540
55316A13540o62k45l39k99J90Q14J155R97M15j47j98J72N15Q68J543K052J399
$$ 113540 112878 112633 112294 111995 112185 112999 114154 115151 115566 115419 115221 115393 115908 116776 118319 120371 121770
55299A21770k18j249q57k6J03j79r5J42q0m99m12J74P26J047J191J009M35j61
$$ 121770 121552 120303 119446 119420 119523 119344 119249 119391 119311 118812 118400 118574 119300 120347 121538 122547 122982 122821
55281A22821n08p73r14m83M25Q53K83m91n81k85l32o46p14n79n03k05O33J537
$$ 122821 122313 121540 120626 120143 120568 121421 121704 121213 120632 120347 120015 119369 118655 118076 117573 117368 118001 119538
55263A19538J783J390Q39K78k78m60m8M41L96m3m41q53j383j539q89l2J9p93j576
$$ 119538 121321 122711 123550 123828 123550 123090 123042 123483 123879 123836 123395 122542 121159 119620 118731 118699 118718 117925 116349
55244A16349j687j283p65l57j04J16M24N71J01q19j289p55K50R22J093R59N70
$$ 116349 114662 113379 112614 112257 112153 112269 112693 113264 113365 112546 111257 110502 110752 111674 112767 113726 114296
55227A14296J50K76R86J362P06l50p34m37k75n34p56o56m72l99l30j57Q2K93L09
$$ 114296 114446 114722 115708 117070 117776 117426 116692 116255 115980 115446 114690 114034 113562 113163 112833 112676 112758 113051 113360
55208A13360J6k91l1Q32J537J440P94K92K27M39P15Q06N45J58O0J34j84q99j274
$$ 113360 113376 113085 113054 113886 115423 116863 117657 117949 118176 118615 119330 120136 120681 120839 120899 121033 120849 119950 118676
55189A18676j012p84j131j607j574j157q21n65j59L93J026J704K021J443K86l29
$$ 118676 117664 116880 115749 114142 112568 111411 110590 110025 109866 110259 111285 112989 115010 116453 116739 116410
55173A16410KM67M50M09O35M24o62j645j402k89N68Q49Q89O61P3l02P1P10Q74
$$ 116410 116412 116879 117329 117738 118373 118797 118135 116490 115088 114799 115367 116216 117105 117766 117839 117537 117608 118318 119192
55154A19192P58Q89R30K60p11j037p29n65o49l79K30L78k36r15r20k71N09Q83
$$ 119192 119950 120839 121769 122029 121318 120281 119552 118987 118338 117959 118189 118567 118331 117416 116496 116225 116734 117617
55136A17617O19P9oN08Q67N16l7p0K91N55P58J020Q39q8r49q14j47r3o80r51o53
$$ 117617 118236 118315 118309 118817 119684 120200 120163 120093 120384 120939 121697 122717 123556 123468 122519 121705 121558 121465 120785 119834 119181
55115A19181m80o92p59m34r7J40O39J364J665J184K67n79j021p80J40J084J366
$$ 119181 118701 118009 117250 116816 116719 116859 117498 118862 120527 121711 121978 121399 120378 119598 119738 120822 122188
55098A22188J127R92J015P76L32J54K50K16J24M19R32R26K30m64o07l98j87NK28
$$ 122188 123315 124307 125322 126098 126430 126584 126834 127050 127174 127593 128525 129451 129681 129217 128610 128212 128025 128030 128258
55079A28258M40O58Q51O71r6r68j205q19l98j07M58J286J631R24m31j398j251
$$ 128258 128698 129356 130207 130878 130782 129814 128609 127790 127392 127285 127743 129029 130660 131584 131153 129755 128504
55062A28504j60Q59Q06k52j158j002r4O30P48L98j88p02p51m17l25o29o39q3J22
$$ 128504 128344 129203 130009 129757 128599 127597 127503 128133 128881 129279 129091 128389 127638 127221 126896 126267 125628 125545 125667
55043A25667p38j780j744r46p04j186j281m32O92J382J567J300O13l3j45j7l00
$$ 125667 124929 123149 121405 120459 119755 118569 117288 116856 117548 118930 120497 121797 122410 122377 122232 122215 121915
55026A21915p82o85l8L80M00O44J161J143L06m97m93NK11j20o58r21o32k0K30
$$ 121915 121133 120448 120410 120790 121190 121834 122995 124138 124444 123947 123454 123459 123670 123550 122892 121971 121339 121319 121549
55007A21549k04p09n52P7N05O48Q11Q57N96N61J300K134J947R03J96K55N05P68
$$ 121549 121345 120636 120084 120161 120666 121314 122125 122982 123578 124139 125439 127573 129520 130423 130619 130874 131379 132147
54989A32147J356J848J370K94J2O62P63l34j280q52J92M48n7k75J88Q84J453J870
$$ 132147 133503 135351 136721 137015 137027 137689 138452 138118 136838 135986 136178 136626 136569 136294 136482 137366 138819 140689
54971A40689K103K129K048J770J085K48q9J67L46K9l66l89j76K3L17P13Q51N18
$$ 140689 142792 144921 146969 148739 149824 150072 149983 150150 150496 150525 150159 149770 149594 149617 149934 150647 151498 152016
54953A52016n9o57j208j441j040l49j16m00n29k84k61p62j277j295q21O3J255
$$ 152016 151957 151300 150092 148651 147611 147262 147146 146746 146217 145933 145672 144910 143633 142338 141517 141580 142835
54936A42835K033J515M6q76m20P58J790K518K840K504K053K724M567O000O008
$$ 142835 144868 146383 146429 145553 145133 145891 147681 150199 153039 155543 157596 160320 164887 170887 176895
54921A76895N653O343P734Q546Q502Q084P130N073K295j28j897l711n971q064
$$ 176895 182548 188891 196625 205171 213673 221757 228887 233960 236255 236127 234230 230519 224548 216484
54907B16484r066q622p208n815n167m980m360l158k270k258k459k055j319j044
$$ 216484 207418 198796 191588 185773 180606 175626 171266 168108 165838 163580 161121 159066 157747 156703
54893A56703j222j140m17O89J666K017J536P86P36J508K139K151K474L989N955
$$ 156703 155481 154341 153924 154613 156279 158296 159832 160618 161354 162862 165001 167152 169626 173615 179570
54878A79570P006P150P517Q377Q740P953O597N340L804J236k138n026o375o511
$$ 179570 186576 193726 201243 209620 218360 226313 232910 238250 242054 243290 241152 236126 229751 223240
54864B23240o692p537q243p686n994m389l520k881k023j366j396j779j900j743
$$ 223240 216548 209011 200768 193082 187088 182699 179179 176298 174275 172909 171513 169734 167834 166091
54850A66091j648j739k021k547l074l052k397j692j258p40m1J66m78j261j399
$$ 166091 164443 162704 160683 158136 155062 152010 149613 147921 146663 145923 145882 146048 145570 144309 142910
54835A42910j149j047q43j15N86M20l06m63K38Q97P16j32r84j359j163o70l44
$$ 142910 141761 140714 139871 139756 140342 140762 140456 139993 140231 141128 141844 141712 140728 139369 138206 137536 137192
54818A37192l00j77K26N57N16L64L82L43J10J55P64J306J063L81J22L67N35M73
$$ 137192 136892 136715 136941 137498 138014 138378 138760 139103 139213 139368 140132 141438 142501 142882 143004 143371 143906 144379
54800A44379M99O44O93P89J060R83K8j194j502p89q4Q7K91R76J692J919J791J587
$$ 144379 144878 145522 146215 147004 148064 149047 149075 147881 146379 145590 145506 145593 145884 146860 148552 150471 152262 153849
54782A53849J183N66K25N86J385K001K137J892J543J456J937K906L968M962O101
$$ 153849 155032 155598 155823 156409 157794 159795 161932 163824 165367 166823 168760 171666 175634 180596 186697
54767A86697P471Q743R605J0125J0461J0473R923Q819P261N133K298q84l709n869
$$ 186697 194168 202911 212516 222641 233102 243575 253498 262317 269578 274711 277009 276125 272416 266547
54753B66547p709r430j0400r916q434p330p173p010n937m531l891l850l354k332
$$ 266547 258838 249408 239008 229092 220658 213328 206155 199145 193208 188677 184786 180936 177582 175250
54739A75250j831k165k230j205K41J025J049Q72P15N98P63J281J767K127K974
$$ 175250 173419 171254 169024 167819 168060 169085 170134 171006 171721 172319 173082 174363 176130 178257 181231
54724A81231M606O129O470N897N682O422P278O923M811J641j231k981m022n195
$$ 181231 185837 191966 198436 204333 210015 216437 223715 230638 235449 237090 235859 232878 228856 223661
54710B23661o457p098p152p438p951p520n727l798k800k132r18K59L95j03j71
$$ 223661 217204 210106 202954 195516 187565 180045 174318 170520 167720 165588 164670 164929 165324 165221 165050
54695A65050l8p46k157l027k929k627k481j941q29J54N60P18Q46N76j86q00p08
$$ 165050 165012 164266 162109 159082 156153 153526 151045 149104 148275 148429 148989 149707 150553 151129 150943 150143 149435
54678A49435j12M38O17L72j56n67n49k77j34j71k24l03m35l82j09o0m19n43M5
$$ 149435 149323 149761 150378 150750 150594 150027 149478 149201 149067 148896 148672 148369 147934 147552 147443 147383 146964 146421 146466
54659A46466O75M16m30q57p51p93j003o69K50Q38N81m4m74o44n46j25K46R7k78
$$ 146466 147141 147557 147127 146270 145519 144726 143723 143054 143304 144142 144723 144679 144205 143561 143015 142890 143136 143233 142955
54640A42955j84K55K67j75k36L30P41N74M50Q50J251J036M43K0j95l97m91l37
$$ 142955 142771 143026 143293 143118 142882 143212 143953 144527 144977 145827 147078 148114 148557 148577 148382 147985 147494 147157
54622A47157n4K58O30Q57N61j64p20p84o24m51j32L44O81P35O11K19n34j183j052
$$ 147157 147103 147361 147991 148848 149409 149245 148525 147741 147117 146666 146534 146878 147559 148294 148905 149124 148590 147407 146355
54603A46355k88K53K45J65K76K16j07j83J18K08j41k38M67J426J699J051j5q59
$$ 146355 146067 146320 146565 146730 147006 147222 147115 146932 147050 147258 147117 146879 147346 148772 150471 151522 151507 150648
54585A50648r74k75N72O81R7k52J13O15O87N26M67L58R0%K49M37L29L02N70O81
$$ 150648 149674 149399 149971 150652 150749 150497 150610 151225 151912 152438 152905 153263 153353 153353 153602 154039 154368 154670 155240 155921
54565A55921L35j9K7P9k71n10J31J369K048J521K93p23j117j142j156j052l99
$$ 155921 156256 156237 156264 156343 156072 155562 155693 157062 159110 160631 160924 160201 159084 157942 156786 155734 155335
54548A55335P13J392J119O92J194K234K448J697J291J794K067J219J76K26J100
$$ 155335 156048 157440 158559 159251 160445 162679 165127 166824 168115 169909 171976 173195 173371 173597 174697
54533A74697J613J412R18K42p01j405j240n00k9n5k12m24r11j526j918k128k316
$$ 174697 176310 177722 178640 178882 178181 176776 175536 175036 175007 174952 174740 174316 173405 171879 169961 167833 165517
54516A65517k156j280j46L58O8m04o08n91l62J74P92J067R90Q81P27J80p74j629
$$ 165517 163361 162081 161935 162293 162361 161957 161349 160758 160396 160570 161362 162429 163419 164300 165027 165207 164433 162804
54498A62804j886j461o12J50L28j5k09J16L94Pn73l25P68J581J353N95K35M66
$$ 162804 160918 159457 158845 158995 159323 159308 159099 159215 159609 159616 159043 158718 159486 161067 162420 163015 163250 163716
54480A63716P46O14J84nM68J370J911J590P96L25M70R59J497J899J847J132J69
$$ 163716 164462 165076 165260 165255 165723 167093 169004 170594 171390 171715 172185 173144 174641 176540 178387 179519 179688
54463A79688k80k3L39K85j0p5K02N41O09J68q19j956k498j983p51L72R16J084
$$ 179688 179408 179385 179724 180009 179999 179924 180126 180667 181276 181444 180625 178669 176171 174188 173437 173809 174725 175809
54445A75809J244J350J112M98k01p67j177j334j098p30p92j309j513r23j47oj99
$$ 175809 177053 178403 179515 180013 179812 179045 177868 176534 175436 174706 173914 172605 171092 170169 170022 170016 169817
54428A69817K55J449K324K056Q92m57j448j624q05L93J001R11Q77J086P78l13
$$ 169817 170072 171521 173845 175901 176793 176336 174888 173264 172459 172852 173853 174764 175641 176727 177505 177192
54412A77192j205j035l09N1J07M76J073J346J259J186J063N57j11l54j09J70K73
$$ 177192 175987 174952 174643 174694 174801 175277 176350 177696 178955 180141 181204 181761 181650 181296 181187 181357 181630
54395A81630L73M96N14N55Q37J177J171P99L71Jl96p08p48o34n88n28k86o7j81
$$ 181630 182003 182499 183013 183568 184405 185582 186753 187552 187923 187924 187528 186820 186072 185438 184850 184322 184036 183969 183788
54376A83788m75n73m50k82M4O91J284J245O98M37R06J697K183K187J886J414P57
$$ 183788 183313 182740 182290 182008 182052 182743 184027 185272 185970 186407 187313 189010 191193 193380 195266 196680 197437
54359A97437k2o38o65lP51P99J22l87m8P99J317J147N09k01n20j19P02J112P43
$$ 197437 197415 196777 196112 196109 196860 197659 197781 197394 197346 198145 199462 200609 201118 200917 200397 200278 200980 202092 202835
54340B02835J09k93p24j475k121k126j721j409j106n47l1J2j77k59n80j452k101
$$ 202835 202944 202651 201927 200452 198331 196205 194484 193075 191969 191422 191391 191403 191226 190967 190387 188935 186834
54323A86834j571l82O9l80n00K17P07L0j226j855j522p57j21R3j10l38j73J67
$$ 186834 185263 184881 184950 184570 184070 184287 184994 185024 183798 181943 180421 179664 179543 179636 179526 179188 179015 179182
54305A79182J13k21o2P51J334J001K00l57p07j187j482j044j58K11l16j037j052
$$ 179182 179295 179074 179012 179763 181097 182098 182298 181941 181234 180047 178565 177521 177363 177574 177258 176221 175169
54288A75169l86J39jl03J38J354K310K221J572J274J224N70p16j561j316o66n20
$$ 175169 174783 174922 174921 174618 174756 176110 178420 180641 182213 183487 184711 185281 184565 183004 181688 181022 180502
54271A80502p44o31j32J20j79n97o12j71M49J031J455J594J363R16O39P55J020
$$ 180502 179758 179127 178995 179115 178936 178339 177727 177556 178005 179036 180491 182085 183448 184364 185003 185758 186778
54254A86778J020P28M63K68j56o72n62M18J270Q93m07j310j214p67o32o30l48
$$ 186778 187798 188526 188989 189257 189101 188429 187867 188285 189555 190448 190041 188731 187517 186750 186118 185488 185140
54237A85140P5J26m48j467k380k505j595k49O15P65O94P55P37M11q1m71o06l87
$$ 185140 185215 185341 184893 183426 181046 178541 176946 176697 177312 178077 178771 179526 180263 180674 180593 180122 179516 179129
54219A79129Q1L37K5n10o27k97j1J27M34P95O46M4k15J44L58j49q01p37r4L71
$$ 179129 179210 179547 179572 179062 178435 178138 178127 178254 178688 179483 180129 180173 179958 180102 180460 180311 179510 178773 178679 179050
54199A79050M01L65M94N93M22j04q99j589j657j049l76j96k99r0N28J047J004
$$ 179050 179451 179816 180310 180903 181325 181221 180322 178733 177076 176027 175651 175455 175156 175066 175594 176641 177645
54182A77645M43j95m45k08R7Ql63m53j29M5l31q12p18j11L56L63J67M0j27m69
$$ 177645 178088 177893 177448 177240 177337 177345 176982 176529 176400 176445 176114 175302 174584 174473 174829 175192 175359 175399 175272 174803
54162A74803q13q42n02k4L88O86P62L13p35j697j618m74N47M68j89k32M57Q61
$$ 174803 173990 173148 172646 172622 173010 173696 174458 174771 174036 172339 170721 170247 170794 171262 171073 170841 171298 172159
54144A72159M77rR7M87N37L18L40O94J026J126J054Q56N33K13Q3J55K24N2m45
$$ 172159 172636 172627 172724 173211 173748 174066 174406 175100 176126 177252 178306 179162 179695 179908 179991 180146 180370 180422 179977
54125A79977j009j085l90O54J317J392J220J011O33J61pK61O11P72Q81R97Q69
$$ 179977 178968 177883 177493 178147 179464 180856 182076 183087 183720 183881 183874 184135 184746 185518 186399 187396 188265
54108A88265M16J5n1K3K9J41N07Q06N79k05j181j867j850j038K5N20K55j45o8
$$ 188265 188681 188696 188645 188668 188697 188838 189345 190151 190730 190525 189344 187477 185627 184589 184614 185134 185389 185244 185176
54089A85176M03Q15Q89N99K03K88J178K124J891M19q29p05J96N87K66J4K12N11
$$ 185176 185579 186394 187283 187882 188085 188373 189551 191675 193566 193985 193156 192451 192647 193234 193500 193514 193726 194237
54071A94237O47P59R24R89Q77O78M83M77R20J725K307K339K336K975M125N110
$$ 194237 194884 195643 196567 197556 198433 199111 199594 200071 200991 202716 205023 207362 209698 212673 216798 221908
54055B21908N642O020O557P363Q426R267Q760O075J844k172m663n568n443m710
$$ 221908 227550 233570 240127 247490 255916 265183 273943 280018 281862 279690 275027 269459 264016 259306
54041B59306l633k521j554o92K01J287K680M129M928M636L776L340L566L779L473
$$ 259306 255673 253152 251598 250906 251107 252394 255074 259203 264131 268767 272543 275883 279449 283228 286701
54026B86701L035L085L467L336K140L37q67n59R85K386K387R64q24k020k556k901
$$ 286701 289736 292821 296288 299624 301764 302101 301234 300675 301660 304046 306433 307397 306573 304553 301997 299096
54010B99096l285l577l727m016m658n324n350m544l552l125l239l275k944k509
$$ 299096 295811 292234 288507 284491 279833 274509 269159 264615 261063 257938 254699 251424 248480 245971
53996B45971k148j672j129j004j483j981j898j460j278j360j216p52m82o88r78
$$ 245971 243823 242151 241022 240018 238535 236554 234656 233196 231918 230558 229342 228590 228108 227420 226442
53981B26442q47l33J25K96L36M10L63k1n38o44j81L36M28L65O54J114J114O69
$$ 226442 225595 225262 225387 225683 226019 226429 226792 226771 226233 225589 225408 225744 226172 226537 227191 228305 229419 230088
53963B30088M76P93J177J529K447L983M998M548L343K907L689M818N430N442N076
$$ 230088 230564 231357 232534 234063 236510 240493 245491 250039 253382 256289 259978 264796 270226 275668 280744
53948B80744M459L770L197K695K084J361O60N1l41k75J96O12P89J161J975K613
$$ 280744 285203 288973 292170 294865 296949 298310 298970 299021 298680 298405 298601 299213 300002 301163 303138 305751
53932C05751K449J911J848K126J814P09l01m68M2Q19J777K746L235L121L001L437
$$ 305751 308200 310111 311959 314085 315899 316608 316307 315839 315881 316700 318477 321223 324458 327579 330580 334017
53916C34017M218M783N017N207N519N922O453P135P691P680P109O552O571P076
$$ 334017 338235 343018 348035 353242 358761 364683 371136 378271 385962 393642 400751 407303 413874 420950
53902D20950P480P484P478Q061R262J0377J0380Q303L622l093r925j4682j6555
$$ 420950 428430 435914 443392 451453 460715 471092 481472 489775 493397 490304 480379 465697 449142
53889D49142j6444j5664j4831j4013j3233j2425j1430j0326r333q250o731n210
$$ 449142 432698 417034 402203 388190 374957 362532 351102 340776 331443 323193 316462 311252
53877C11252m698n251n612m990m131l853l606k656j734k050l197l618k916k207
$$ 311252 306554 301303 295691 290701 286570 282717 279111 276455 274721 272671 269474 265856 262940 260733
53863B60733k190k350k225k137k292k254j787j279j012q41q29j264j827j681p77
$$ 260733 258543 256193 253968 251831 249539 247285 245498 244219 243207 242366 241537 240273 238446 236765 235988
53848B35988j37m08j033j259j116q93m58K55P67O98L63K02Q4l77j186k069k697
$$ 235988 235851 235443 234410 233151 232035 231142 230684 230939 231706 232404 232767 232969 233053 232676 231490 229421 226724
53831B26724k572j332M32J356Q54j22m00l9J45m0j05J86O33J092J535J681J230
$$ 226724 224152 222820 223252 224608 225462 225340 224940 224901 225046 225006 224901 225087 225720 226812 228347 230028 231258
53814B31258M24j42j91J42P35J578K433K876K731K276J977K144K756L496M070
$$ 231258 231682 231540 231349 231491 232226 233804 236237 239113 241844 244120 246097 248241 250997 254493 258563
53799B58563M550N140N605N404M589M042M380N017M893L910K979K753K925K920
$$ 258563 263113 268253 273858 279262 283851 287893 292273 297290 302183 306093 309072 311825 314750 317670
53785C17670K663K398K058J330J70j084k149k949l276k763j617j007j984m031
$$ 317670 320333 322731 324789 326119 326289 325205 323056 320107 316831 314068 312451 311444 309460 305429
53771C05429n448n405m810m732m873m323l169k276j898j662j652k370l545m116
$$ 305429 299981 294576 289766 285034 280161 275838 272669 270393 268495 266833 265181 262811 259266 255150
53757B55150l624k680j877j194o87p08j085j104p37r10k003l020k893j795n40
$$ 255150 251526 248846 246969 245775 245088 244380 243295 242191 241454 240544 238541 235521 232628 230833 230293
53742B30293M85J123R83J22n53m26r5l55q55p39o3M52O57Q93R95N64kJ85J116
$$ 230293 230778 231901 232884 233006 232453 232027 231932 231577 230722 229983 229920 230372 231029 231922 232917 233481 233479 233664 234780
53723B34780J909K172K383K771K862K462K102K125K122J663J003M81n6p36j045
$$ 234780 236689 238861 241244 244015 246877 249339 251441 253566 255688 257351 258354 258835 258779 258043 256998
53708B56998l99R89K330L235L893M404M489L960L123K448K070J867J901K410L303
$$ 256998 256599 257588 259918 263153 267046 271450 275939 279899 283022 285470 287540 289407 291308 293718 297021
53693B97021L974L890L245K657K353K003J335N11j74o20q05p34o30p54q96n91
$$ 297021 300995 304885 308130 310787 313140 315143 316478 316989 316815 316195 315390 314656 314026 313272 312376 311785
53677C11785O1L38k3l56j35J66j53q37j104q23n29m79m90n47p69q61l36N82J088
$$ 311785 311846 312184 312161 311805 311670 311836 311683 310846 309742 308919 308390 307911 307421 306874 306105 305244 304908 305490 306578
53658C06578Q74M44K14o6p22j569k205k458k262j563o06O2J76O2J07J96qm72o99
$$ 306578 307452 307896 308110 308044 307322 305753 303548 301090 298828 297265 296659 296721 296897 296959 297066 297262 297254 296782 296083
53639B96083k46Q36K016K685K662K286J953J694J333R07N97M13L00M70J184K200
$$ 296083 295837 296673 298689 301374 304036 306322 308275 309969 311302 312209 312806 313219 313519 313989 315173 317373
53623C17373K917L156L293L522L503L042K687L134M209M940M704L955L624L970
$$ 317373 320290 323446 326739 330261 333764 336806 339493 342627 346836 351776 356480 360435 364059 368029
53609C68029M331M068L457L323L913M638M969N026M941M253K696J151R24K034
$$ 368029 372360 376428 379885 383208 387121 391759 396728 401754 406695 410948 413644 414795 415719 417753
53595D17753L105L123K500K050J740J137M86M82J188J955K381K632K699K093O34
$$ 417753 420858 423981 426481 428531 430271 431408 431894 432376 433564 435519 437900 440532 443231 445324 445958
53580D45958j007k023k512l246m517n733o198n824m951l861k829k262k291k380
$$ 445958 444951 442928 440416 437170 432653 426920 420722 414898 409947 406086 403257 400995 398704 396324
53566C96324j873q64j36j55o62j301k035k658k481j112P35J835J801J375J365
$$ 396324 394451 393587 393451 393296 392634 391333 389298 386640 384159 383047 383782 385617 387418 388793 390158
53551C90158J775K064J972J777J899K398K874K890K416J851J643K028L027M363
$$ 390158 391933 393997 395969 397746 399645 402043 404917 407807 410223 412074 413717 415745 418772 423135
53537D23135N389N568N141M981N519O291O770P158P904Q888R694J0371J1278J2302
$$ 423135 428524 434092 439233 444214 449733 456024 462794 469952 477856 486744 496438 506809 518087 530389
53523E30389J2957J3155J3342J3770J4225J4533J4867J5429J6260J7395J8814
$$ 530389 543346 556501 569843 583613 597838 612371 627238 642667 658927 676322 695136
53512F95136K0223K1330K2303K3470K4577K4988K4705K4551K5091K5914K6296
$$ 695136 715359 736689 758992 782462 807039 832027 856732 881283 906374 932288 958584
53501I58584K6069K5445K4532K3473K2711K2594K2888K3041K2777K2167K1383
$$ 958584 984653 1010098 1034630 1058103 1080814 1103408 1126296 1149337 1172114 1194281 1215664
53490A215664K0690K0407K0494K0413J9829J9224J9285J9845K0002J9352J8512
$$ 1215664 1236354 1256761 1277255 1297668 1317497 1336721 1356006 1375851 1395853 1415205 1433717
53479A433717J8209J8321J8127J7257J5907J4380J2741J0929Q886O522L783Q60
$$ 1433717 1451926 1470247 1488374 1505631 1521538 1535918 1548659 1559588 1568474 1574996 1578779 1579639
53467A579639j894m363o844r606j2485j5044j7069j8588j9484j9454j8518j7328
$$ 1579639 1577745 1573382 1566538 1556932 1544447 1529403 1512334 1493746 1474262 1454808 1436290 1418962
53455A418962j6703j6977j7986j9519k1435k3302k4342k4075k2961k2065k1943
$$ 1418962 1402259 1385282 1367296 1347777 1326342 1303040 1278698 1254623 1231662 1209597 1187654
53444A187654k2084k1711k0857k0197j9784j8677j6205j3070j0508q715o866m576
$$ 1187654 1165570 1143859 1123002 1102805 1083021 1064344 1048139 1035069 1024561 1015846 1008980 1004404
53432A004404k433r45J64J262K169K714L291M311N607O977Q727J1069J3367J4833
$$ 1004404 1001971 1001026 1001190 1002452 1004621 1007335 1010626 1014937 1020544 1027521 1036248 1047317 1060684 1075517
53418A075517J5705J7007J9141K1459K3151K3973K4202K4414K5350K7301K9600
$$ 1075517 1091222 1108229 1127370 1148829 1171980 1195953 1220155 1244569 1269919 1297220 1326820
53407A326820L1251L2156L3215L5125L7630M0064M2202M4290M6619M9229N1849
$$ 1326820 1358071 1390227 1423442 1458567 1496197 1536261 1578463 1622753 1669372 1718601 1770450
53396A770450N4047N5713N7225N8850O0183O0681O0602O0721O1162O1166O0246
$$ 1770450 1824497 1880210 1937435 1996285 2056468 2117149 2177751 2238472 2299634 2360800 2421046
53385B421046N8824N7429N5850N3488N0232M6534M2906L9629L6753L4061L1127
$$ 2421046 2479870 2537299 2593149 2646637 2696869 2743403 2786309 2825938 2862691 2896752 2927879
53374B927879K7595K3351J8508J3441Q739M738R72l625r842j7682k6593l5756
$$ 2927879 2955474 2978825 2997333 3010774 3019513 3024251 3025223 3021598 3011756 2994074 2967481 2931725
53362B931725m4164n0888n5531n8241n9406n9617n9744o0389o1200o1254o0217
$$ 2931725 2887561 2836673 2781142 2722901 2663495 2603878 2544134 2483745 2422545 2361291 2301074
53351B301074n8630n6992n5201n3067n0782m8575m6553m5156m5090m6355m7722
$$ 2301074 2242444 2185452 2130251 2077184 2026402 1977827 1931274 1886118 1841028 1794673 1746951
53340A746951m7769m6097m3306m0171l7237l4797l2739l0562k7944k5087k2329
$$ 1746951 1699182 1653085 1609779 1569608 1532371 1497574 1464835 1434273 1406329 1381242 1358913
53329A358913j9693j7134j4855j3094j1911j1429j1950j3379j4889j5505j4864
$$ 1358913 1339220 1322086 1307231 1294137 1282226 1270797 1258847 1245468 1230579 1215074 1200210
53318A200210j3219j1079r124p951p452o766n298l407j764m46P84J810K573L679
$$ 1200210 1186991 1175912 1166788 1158837 1151385 1144619 1139321 1135914 1134150 1133704 1134488 1136298 1138871 1142550
53304A142550N746Q290J0107J0834J1361J2649J4780J7313J9851K2005K3416K4216
$$ 1142550 1148296 1156586 1166693 1177527 1188888 1201537 1216317 1233630 1253481 1275486 1298902 1323118
53292A323118K5076K6476K8244K9927L1238L1899L1498K9899K7576K5165K2909
$$ 1323118 1348194 1374670 1402914 1432841 1464079 1495978 1527476 1557375 1584951 1610116 1633025
53281A633025K0748J8792J7263J6086J4761J2710R619N580J126k946o037q152
$$ 1633025 1653773 1672565 1689828 1705914 1720675 1733385 1743004 1748584 1749710 1746764 1740727 1732575
53269A732575r789j1507j3618j6233j9212k2103k4358k5801k6785k7804k9049
$$ 1732575 1722786 1711279 1697661 1681428 1662216 1640113 1615755 1589954 1563169 1535365 1506316
53258A506316l0437l1835l3036l3692l3602l3071l2679l2631l2584l2199l1509
$$ 1506316 1475879 1444044 1411008 1377316 1343714 1310643 1277964 1245333 1212749 1180550 1149041
53247A149041l0647k9543k8185k6887k6028k5688k5753k6124k6555k6568k5873
$$ 1149041 1118394 1088851 1060666 1033779 1007751 982063 956310 930186 903631 877063 851190
53236H51190k4723k3458k2041k0401j8890j7801j6620j4533j1698r325q335q482
$$ 851190 826467 803009 780968 760567 741677 723876 707256 692723 681025 671700 663365 654883
53224F54883q963r319r523r661r803r946r997j0038j0546j1775j3060j3391j2753
$$ 654883 645920 636601 627078 617417 607614 597668 587671 577633 567087 555312 542252 528861 516108
53211E16108j2182j2233j2219j1302r665q102p012o354o125o307o619o835p075
$$ 516108 503926 491693 479474 468172 458507 450405 443393 437039 430914 424607 417988 411153 404078
53198D04078p439p685p640p556p592p374o514n340m526m288m307m322m314m264
$$ 404078 396639 388954 381314 373758 366166 358792 352278 346938 342412 338124 333817 329495 325181 320917
53184C20917m138l954l589k770j562o22n61j296k250k948l107k558j510o07l04
$$ 320917 316779 312825 309236 306466 304904 304282 303721 302425 300175 297227 294120 291562 290052 289445 289141
53169B89141m34o53r46j279j279p66k89m79j110j422j195q88q76j086j373j684
$$ 289141 288707 288054 287108 285829 284550 283784 283495 283016 281906 280484 279289 278401 277525 276439 275066 273382
53153B73382j872j769j471j250j240j427j715j791j243j69O64O73J56k22k60j32
$$ 273382 271510 269741 268270 267020 265780 264353 262638 260847 259604 259435 260099 260772 260928 260706 260446 260314
53137B60314J28M77O01M09L78Q20J213R77N29O87J339J630J287Q36N52J36m58
$$ 260314 260442 260919 261520 261929 262307 263127 264340 265317 265846 266533 267872 269502 270789 271625 272177 272313 271855
53120B71855p72n62j66M6kl05p43q91m80L7L2l33m58l84o34j126j261j081j173
$$ 271855 271083 270521 270355 270401 270399 270094 269351 268460 267980 268017 268049 267716 267258 266874 266240 265114 263853 262772 261599
53101B61599j324n76R89J836J071j79l68K93L71o38j742j860r72J82R54J182J076
$$ 261599 260275 259699 260688 262524 263595 263416 263048 263341 263712 263074 261332 259472 258500 258682 259636 260818 261894
53084B61894Q20L59k93p39o10k57l66q69r00n9J013J615J835J990J889J279M78
$$ 261894 262714 263073 262780 262041 261431 261174 260808 259939 259039 258980 259993 261608 263443 265433 267322 268601 269079
53067B69079J3p6r0j30j90l99q12j167j249j141r06m32R3P3o73j453j526r69k92
$$ 269079 269092 269016 268926 268796 268606 268207 267395 266228 264979 263838 262932 262500 262593 262666 261993 260540 259014 258045 257753
53048B57753L30R03J144Q30L11P2Rk72o94q92q99r87r90m56N15J210J197P74M53
$$ 257753 258083 258986 260130 260960 261271 261343 261352 261080 260386 259494 258595 257608 256618 256162 256677 257887 259084 259858 260311
53029B60311L50J87l50j259j989j770m88R16J355P76Q3m9K64O46R54J087P89K7
$$ 260311 260661 260848 260498 259239 257250 255480 254992 255908 257263 258039 258122 258073 258337 258983 259937 261024 261813 261840
53011B61840p07q02j86N86R30Q12O66P71Q41N07O2L08J487K736K955J990O63j63
$$ 261840 261133 260331 260145 260731 261661 262473 263139 263910 264751 265258 265320 265628 267115 269851 272806 274796 275459 275296
52993B75296k64P4M18M77K98K38N51J012J146Q64O46R84J748K213J788P12j18
$$ 275296 275032 275106 275524 276001 276299 276537 277088 278100 279246 280110 280756 281740 283488 285701 287489 288201 288083
52976B88083q2N61J090J162R61P59P39J071J705K145J930J382J259J662J872J408
$$ 288083 288001 288562 289652 290814 291775 292534 293273 294344 296049 298194 300124 301506 302765 304427 306299 307707
52960C07707O26P3k03m69q72j469k161k445j861q04k64n25q76q48q07r83q69k63
$$ 307707 308333 308406 308203 307734 306862 305393 303232 300787 298926 298122 297858 297333 296457 295609 294802 293819 292950 292687
52942B92687L1o47j693k157k096k054j914j327p58r01j399j310o55l48o93j076
$$ 292687 292718 292071 290378 288221 286125 284071 282157 280830 280072 279171 277772 276462 275807 275459 274766 273690
52926B73690j104r88p77k28M08N46L13M50R84R74k3j151j404p74J14Q46J218J042
$$ 273690 272586 271598 270821 270593 271001 271547 271860 272310 273294 274268 274245 273094 271690 270916 271030 271876 273094 274136
52908B74136M43j10m00o50r17q44k44N38J146J504J418N55q33j745j477m22N19
$$ 274136 274579 274469 274069 273419 272502 271658 271414 271952 273098 274602 276020 276575 275742 273997 272520 272098 272617
52891B72617Q93Q01N43N25J017J658J565M05j031j680j367p80n76q24j118r98
$$ 272617 273510 274311 274854 275379 276396 278054 279619 280024 278993 277313 275946 275166 274590 273766 272648 271650
52875B71650l98J90K38j29l27j17K25N30R22J311J405J376J770K491K649J837
$$ 271650 271252 271442 271680 271551 271224 271107 271332 271862 272784 274095 275500 276876 278646 281137 283786 285623
52859B85623P30K2m88j108j389q74j75k72j101j766j908k024k467k966l209l256
$$ 285623 286353 286375 285887 284779 283390 282516 282341 282069 280968 279202 277294 275270 272803 269837 266628 263372
52843B63372l230l158l136l168k853j761k63O03L14m97q00l20L37N13K02p2J08
$$ 263372 260142 256984 253848 250680 247827 246066 245803 246406 246720 246223 245423 245103 245440 245953 246155 246083 246191
52826B46191O28J085J228R74K12r92j999j995r94K3K72N0J03O11J189J614J973
$$ 246191 246819 247904 249132 250106 250318 249326 247327 245332 244338 244361 244633 244683 244786 245397 246586 248200 250173
52809B50173K337K656K845K686J879M90r43k005k684k865k166p76J40l11j578
$$ 250173 252510 255166 258011 260697 262576 263066 262123 260118 257434 254569 252403 251627 251767 251456 249878
52794B49878k438k573k475k209j402l04K81K69M74J198J698J412Q39O28N85K77
$$ 249878 247440 244867 242392 240183 238781 238477 238758 239027 239501 240699 242397 243809 244648 245276 245861 246138
52778B46138mL48J203J754J526Q15K02K5K30M25J61n76j249j366j063q62r94j200
$$ 246138 246134 246482 247685 249439 250965 251780 251982 252007 252237 252662 252823 252247 250998 249632 248569 247707 246713 245513
52760B45513j158q18l69kK36M05N29N53M76M40N28O44P66J094J658J992J725J306
$$ 245513 244355 243537 243168 243166 243402 243807 244336 244889 245365 245805 246333 246977 247743 248837 250495 252487 254212 255518
52742B55518J499K144K200J318N39Q92J834J900O70o55p06N75K133L023L154K966
$$ 255518 257017 259161 261361 262679 263218 264110 265944 267844 268514 267859 267153 267728 269861 272884 276038 279004
52726B79004K743K397J846J277Q07J45r99k243k765k347j667j419j567j782k042
$$ 279004 281747 284144 285990 287267 288074 288219 287220 284977 282212 279865 278198 276779 275212 273430 271388
52711B71388k339k206j204K70J250J249O52P0k67m21m83n31o11o28m30l6L77O91
$$ 271388 269049 266843 265639 265909 267159 268408 269060 269130 268863 268442 267959 267428 266817 266189 265759 265723 266100 266791
52693B66791R14J045J076J132J385J836K246K338K005J439J053J066J116N83n03
$$ 266791 267705 268750 269826 270958 272343 274179 276425 278763 280768 282207 283260 284326 285442 286025 285522
52678B85522j302j179n34j46j00PP7m01j296j719j240n23k95l37qO52R38M07o73
$$ 285522 284220 283041 282507 282361 282261 282268 282345 281944 280648 278929 277689 277166 276871 276534 276526 277178 278116 278523 277850
52659B77850j633j814q97P33K086K474K197K033K220K398K346K156J678N21j166
$$ 277850 276217 274403 273506 274239 276325 278799 280996 283029 285249 287647 289993 292149 293827 294348 293182
52644B93182k493k771k261j621j028l10L74N86K82o2q9J32M35P88J003P03m6m86
$$ 293182 290689 287918 285657 284036 283008 282698 283072 283658 283940 283878 283789 283921 284356 285144 286147 286850 286804 286318
52626B86318P1J239J832J181j40j053j166r78j042j313j367j035o19m72o60r70
$$ 286318 286389 287628 289460 290641 290501 289448 288282 287304 286262 284949 283582 282547 281928 281456 280796 279826
52610B79826j204j214q53j07O95J060Q67N49O20J068J405J236O36J6k56j12J85
$$ 279826 278622 277408 276555 276448 277143 278203 279070 279619 280239 281307 282712 283948 284584 284600 284344 284232 284417
52593B84417K82P2j75j19L01Q84J370J487J006K0q66j004m29J97M33N12P74J033
$$ 284417 284699 284771 284596 284477 284778 285662 287032 288519 289525 289545 288679 287675 287246 287443 287876 288388 289162 290195
52575B90195Q45K40k23k20j02m15j110j496j049j31K57m37j671k332j917r90m69
$$ 290195 291040 291280 291057 290837 290735 290320 289210 287714 286665 286534 286791 286354 284683 282351 280434 279444 278975
52558B78975o37r83r00l92l2k74r05j302j146o96l04J1L52O29P74R44J112Q24
$$ 278975 278338 277355 276455 276063 276031 275757 274852 273550 272404 271708 271404 271415 271767 272396 273170 274114 275226 276050
52540B76050j07r46q97m03o65j761k364j608k59N66Q56J094J093N11p1J83R33
$$ 276050 275943 274997 274100 273697 273032 271271 268907 267299 267040 267606 268462 269556 270649 271160 271089 271272 272205
52523B72205J113O51N67J264J884J664J004P57J241K269L492M293M083L120K492
$$ 272205 273318 273969 274536 275800 277684 279348 280352 281109 282350 284619 288111 292404 296487 299607 302099
52508C02099K819L515L709L343K799K020O50j228l040m256m640m228l414k814
$$ 302099 304918 308433 312142 315485 318284 320304 320954 319726 316686 312430 307790 303562 300148 297334
52494B97334k702k749k519j955j219m48J26K78K44N78J183J184J96q57r22k23
$$ 297334 294632 291883 289364 287409 286190 285742 285868 286146 286390 286968 288151 289335 289531 288674 287752 287529
52478B87529K82L92O88J323J725J551J083O47K96J86N87J385K116K611L080L536
$$ 287529 287811 288203 288891 290214 291939 293490 294573 295220 295516 295702 296289 297674 299790 302401 305481 309017
52462C09017L617L189K597K183J930J668J222L51j012k415l303l726m115m457
$$ 309017 312634 315823 318420 320603 322533 324201 325423 325774 324762 322347 319044 315318 311203 306746
52448C06746m306l689l201l048k735j987j246r34q18o38n75o66l87M38Q98R8j346
$$ 306746 302440 298751 295550 292502 289767 287780 286534 285600 284782 284144 283569 282903 282516 282954 283852 283950 282604
52431B82604j879j071j68l11j039j083j80O84P10L48N81J540K348K295J609R60
$$ 282604 280725 279654 279486 279175 278136 277053 276873 277557 278267 278615 279196 280736 283084 285379 286988 287948
52415B87948O17N54Q54J413J628J159Q26J840M093O127P021P396Q127R010R283
$$ 287948 288565 289119 289973 291386 293014 294173 294999 296839 300932 307059 314080 321476 329603 338613 347896
52400C47896Q555O615L166j253m779n946n516n464o313o762n906m502l609l123
$$ 347896 356451 363066 366232 364979 360200 354254 348738 343274 336961 330199 324293 319791 316182 313059
52386C13059k335j174j66L75M66J79k13j62N82J522K036K195K499L037L419L496
$$ 313059 310724 309550 309384 309759 310225 310404 310191 310029 310611 312133 314169 316364 318863 321900 325319 328815
52370C28815L587L926M288M384M232L945L404K436J179N4o23q15o52l23n8m1j87
$$ 328815 332402 336328 340616 345000 349232 353177 356581 359017 360196 360250 359627 358812 358160 357837 357779 357738 357551
52353C57551k21qL02N94R89J519J825J531Q52M16N05Q68J306J978K933L774M112
$$ 357551 357330 357322 357624 358218 359207 360726 362551 364082 364934 365350 365855 366723 368029 370007 372940 376714 380826
52336C80826M053L944L988M416N615P580R481J0348J0137R692R721J0284J1226
$$ 380826 384879 388823 392811 397227 402842 410422 419903 430251 440388 450080 459801 470085 481311
52323D81311J2549J4144J5546J6175J5776J4643J3542J3277J3941J4718J4775
$$ 481311 493860 508004 523550 539725 555501 570144 583686 596963 610904 625622 640397
52312F40397J4291J4147J4654J5192J5245J5191J5688J6681J7496J7706J7508
$$ 640397 654688 668835 683489 698681 713926 729117 744805 761486 778982 796688 814196
52301H14196J7246J7026J6752J6302J5562J4376J2700J0687Q528O169L399L59
$$ 814196 831442 848468 865220 881522 897084 911460 924160 934847 943375 949544 952943 953302
52289I53302k219l689m327n085o355p449p636p141o707o516o253n854n495m955
$$ 953302 951083 947394 943067 937982 931627 924178 916542 909401 902694 896178 889925 884071 878576 873621
52275H73621l765k039m35P55J836K917L711M330N421P174Q811R675J0068J0501
$$ 873621 869856 867817 867382 868137 869973 872890 876601 880931 886352 893526 902337 912012 922080 932581
52261I32581J0731J0357R883J0262J1563J2923J3768J4373J5089J5702J5815J5378
$$ 932581 943312 953669 963552 973814 985377 998300 1012068 1026441 1041530 1057232 1073047 1088425
52249A088425J4498J3088J0961Q146N016K145oj512k993m929o952q190q317p982
$$ 1088425 1102923 1116011 1126972 1135118 1140134 1142279 1142273 1140761 1137768 1132839 1125887 1117697 1109380 1101398
52235A101398q037q701r568j0212j0457j0288r785r203q854q800q746q388p783
$$ 1101398 1093361 1084660 1075092 1064880 1054423 1044135 1034350 1025147 1016293 1007493 998747 990359 982576
52222I82576p242o858o355n474m344l264k276j245k39N23J039J523K025K495L154
$$ 982576 975334 968476 962121 956647 952303 949039 946763 945518 945279 945802 946841 948364 950389 952884 956038
52207I56038M310N652O330O012N295M790M318L578K999L182L843M201M268M897
$$ 956038 960348 966000 972330 978342 983637 988427 992745 996323 999322 1002504 1006347 1010548 1014816 1019713
52193A019713O371P785Q139P472O492N576M612L538K563J817J064j88k297n103
$$ 1019713 1026084 1033869 1042008 1049480 1055972 1061548 1066160 1069698 1072261 1074078 1075142 1074954 1072657 1067554
52179A067554p914r974j1022j1245j0849r904q593p232n945m665l508k769k486
$$ 1067554 1059640 1049666 1038644 1027399 1016550 1006646 998053 990821 984876 980211 976703 973934 971448
52166I71448k238j621o14O20J977L275M195M614M718M575L890K518R41j83p32
$$ 971448 969210 967589 966975 967595 969572 972847 977042 981656 986374 990949 994839 997357 998298 998115 997383
52151I97383j036j229j128o50L0P20J228J256P09J52L00R94J190L37p99j151p65
$$ 997383 996347 995118 993990 993340 993370 994090 995318 996574 997283 997435 997735 998729 999919 1000256 999457 998306 997541
52134I97541n63p96n81R02L282N527P241Q929J1100J3535J5647J7286J8908K0891
$$ 997541 996978 996182 995601 996503 999785 1005312 1012553 1021482 1032582 1046117 1061764 1079050 1097958 1118849
52120A118849K2882K4064K4120K3725K3767K4250K4328K3465K2087K0817J9561
$$ 1118849 1141731 1165795 1189915 1213640 1237407 1261657 1285985 1309450 1331537 1352354 1371915
52109A371915J7875J5934J4466J3639J2754J1283R741R055R370R934R991R374
$$ 1371915 1389790 1405724 1420190 1433829 1446583 1457866 1467607 1476662 1486032 1495966 1505957 1515331
52097A515331Q278O849N098K925J03l533p735j1851j5262j7680j9021j9244j8543
$$ 1515331 1523609 1530458 1535556 1538481 1538584 1535051 1527316 1515465 1500203 1482523 1463502 1444258 1425715
52084A425715j7534j6833j6401j5527j3670j1163q858p210o022n017m168l301
$$ 1425715 1408181 1391348 1374947 1359420 1345750 1334587 1325729 1318519 1312497 1307480 1303312 1300011
52072A300011j874L59K748M451N620P145R207J0858J1417J1555J2315J3526J4039
$$ 1300011 1298137 1298496 1301244 1305695 1311315 1318460 1327667 1338525 1349942 1361497 1373812 1387338 1401377
52059A401377J3354J2279J1866J2304J3050J3551J3457J2522J0617P876M684J631
$$ 1401377 1414731 1427010 1438876 1451180 1464230 1477781 1491238 1503760 1514377 1522253 1526937 1528568
52047A528568p04k264l816o276r586j2610j4382j5062j5413j5755j5891j5727
$$ 1528568 1527864 1525600 1521784 1515508 1505922 1493312 1478930 1463868 1448455 1432700 1416809 1401082
$$ [...]
##END NTUPLES=NMR SPECTRUM
##END=
