##TITLE=AC1415_BRAA12224_7652885_dGozNmR9BP
##JCAMPDX= 6.0         $$ Bruker NMR JCAMP-DX V2.0
##DATA TYPE= NMR SPECTRUM
##DATA CLASS= NTUPLES
##ORIGIN= BRUKER
##OWNER= Administrator
$$ 1.72 TOPSPIN		Version 2.1
$$ 2013-04-15 09:34:02.709 -0700  Administrator@X
$$ Compression mode = diff/dup
##.OBSERVE FREQUENCY= 400.02188249412
##.OBSERVE NUCLEUS= ^1H
##.ACQUISITION MODE= SIMULTANEOUS (DQD)
##.ACQUISITION SCHEME= undefined
##.AVERAGES= 64
##.DIGITISER RES= 22
##SPECTROMETER/DATA SYSTEM= spect
##.PULSE SEQUENCE= noesygpps1d.comp
##.SOLVENT NAME= COFFEE_meoh
##.SHIFT REFERENCE= INTERNAL, COFFEE_meoh, 1, 14.96117
##AUDIT TRAIL= $$ (NUMBER, WHEN, WHO, WHERE, PROCESS, VERSION, WHAT)
$$ ##TITLE= Audit trail, TOPSPIN		Version 2.1
$$ ##JCAMPDX= 5.01
$$ ##ORIGIN= Bruker BioSpin GmbH
$$ ##OWNER= Administrator
$$ $$ E:\/data/COFFEE/nmr/AC1415_BRAA12224_7652885_dGozNmR9BP/12/pdata/1/auditp.txt
$$ ##AUDIT TRAIL=  $$ (NUMBER, WHEN, WHO, WHERE, PROCESS, VERSION, WHAT)
(   1,<2013-04-15 09:33:57.178 -0700>,<Administrator>,<X>,<go>,<TOPSPIN 2.1>,
      <created by zg
	started at 2013-04-15 09:22:27.850 -0700,
	POWCHK enabled, PULCHK disabled,
       configuration hash MD5:
       33 CF 6A 21 5C D3 B9 40 6C 15 AA 8D 27 A2 4F 13
       data hash MD5: 64K
       18 FD DF FC C1 7E 8A CE F7 78 9D 28 87 5D C7 86>)
(   2,<2013-04-15 09:34:00.412 -0700>,<Administrator>,<X>,<proc1d>,<TOPSPIN 2.1>,
      <Start of raw data processing
       efp LB = 0.3 FT_mod = 6 PKNL = 1 PHC0 = 0 PHC1 = 0 SI = 128K 
       data hash MD5: 128K
       FC 97 66 AC E8 68 96 B1 7F 5B 70 1F 8A 8B 60 E3>)
(   3,<2013-04-15 09:34:01.397 -0700>,<Administrator>,<X>,<proc1d>,<TOPSPIN 2.1>,
      <pk PHC0 = -55.82153 PHC1 = 0 
       data hash MD5: 128K
       2D 06 86 73 ED F7 5F C7 86 9C F1 6B 02 6A 3A 00>)
(   4,<2013-04-15 09:34:01.912 -0700>,<Administrator>,<X>,<proc1d>,<TOPSPIN 2.1>,
      <abs ABSG = 1 
       data hash MD5: 128K
       80 05 2D 86 6D F0 F8 BD 54 27 4D DC AA C6 9B 74>)
(   5,<2013-04-15 09:34:02.022 -0700>,<Administrator>,<X>,<proc1d>,<TOPSPIN 2.1>,
      <abs ABSG = 2 
       data hash MD5: 128K
       34 C4 A1 B7 8C 9F 33 C1 1C 5F EC 5C D8 A2 9B 7D>)
(   6,<2013-04-15 09:34:02.162 -0700>,<Administrator>,<X>,<proc1d>,<TOPSPIN 2.1>,
      <abs ABSG = 3 
       data hash MD5: 128K
       C6 F8 05 32 DF 4E 45 C4 2D 46 ED 74 4E 4D 6E 95>)
(   7,<2013-04-15 09:34:02.272 -0700>,<Administrator>,<X>,<proc1d>,<TOPSPIN 2.1>,
      <abs ABSG = 4 
       data hash MD5: 128K
       72 12 59 CC 5E 4E 47 4C E8 48 3E 02 75 E9 D3 3F>)
(   8,<2013-04-15 09:34:02.444 -0700>,<Administrator>,<X>,<proc1d>,<TOPSPIN 2.1>,
      <abs ABSG = 5 
       data hash MD5: 128K
       BE 70 25 90 53 82 E8 5C AA C7 52 75 5B 25 05 4C>)
$$ ##END=
$$ 
$$ $$ hash MD5
$$ $$ 78 6C ED 24 4E C4 85 84 7C F7 BC 59 52 64 A8 4F
##$RELAX= 
##$RELAX= 
##$RELAX= 
##$RELAX= 
##$RELAX= 
##$RELAX= 
##$RELAX= 
##$RELAX= 
$$ Bruker specific parameters
$$ --------------------------
##$DU= <E:\>
##$EXPNO= 12
$$ [...]
##$TP07= 0
##$TPNAME0= <>
##$TPNAME1= <>
##$TPNAME2= <>
##$TPNAME3= <>
##$TPNAME4= <>
##$TPNAME5= <>
##$TPNAME6= <>
##$TPNAME7= <>
##$TPOAL= (0..7)
0.5 0.5 0.5 0.5 0.5 0.5 0.5 0.5
##$TPOFFS= (0..7)
0 0 0 0 0 0 0 0
##$TUNHIN= 0
##$TUNHOUT= 0
##$TUNXOUT= 0
##$USERA1= <user>
##$USERA2= <user>
##$USERA3= <user>
##$USERA4= <user>
##$USERA5= <user>
##$V9= 5
##$VALIST= <valist>
##$VCLIST= <CCCCCCCCCCCCCCC>
##$VD= 0
##$VDLIST= <DDDDDDDDDDDDDDD>
##$VPLIST= <PPPPPPPPPPPPPPP>
##$VTLIST= <TTTTTTTTTTTTTTT>
##$WBST= 2048
##$WBSW= 25
##$XGAIN= (0..3)
0 0 0 0
##$XL= 0
##$YL= 0
##$YMAX_a= 6706065
##$YMIN_a= -13080744
##$ZGOPTNS= <>
##$ZL1= 120
##$ZL2= 120
##$ZL3= 120
##$ZL4= 120
##$ABSF1= 14.96117
##$ABSF2= -5.597012
##$ABSG= 5
##$ABSL= 3
##$ALPHA= 0
##$AQORDER= 0
##$ASSFAC= 0
##$ASSFACI= 0
##$ASSFACX= 0
##$ASSWID= 0
##$AUNMP= <proc_prof1d_extract.lims>
##$AXLEFT= 0
##$AXNAME= <>
##$AXNUC= <1H>
##$AXRIGHT= 0
##$AXTYPE= 0
##$AXUNIT= <>
##$AZFE= 0.1
##$AZFW= 0.1
##$BCFW= 0
##$BC_mod= 0
##$BYTORDP= 0
##$COROFFS= 0
##$CY= 15
##$DATMOD= 1
##$DC= 0
##$DFILT= <>
##$DTYPP= 0
##$F1P= 0
##$F2P= 0
##$FCOR= 0.5
##$FTSIZE= 131072
##$FT_mod= 6
##$GAMMA= 0
##$GB= 0
##$INTBC= 1
##$INTSCL= 1
##$ISEN= 128
##$LB= 0.3
##$LEV0= 0
##$LPBIN= 0
##$MAXI= 10000
##$MC2= 0
##$MEAN= 0
##$ME_mod= 0
##$MI= 0
##$NCOEF= 0
##$NC_proc= -2
##$NLEV= 6
##$NOISF1= 0
##$NOISF2= 0
##$NSP= 0
##$NTH_PI= 0
##$NZP= 0
##$OFFSET= 14.96117
##$PC= 1
##$PHC0= -55.82153
##$PHC1= 0
##$PH_mod= 1
##$PKNL= yes
##$PPARMOD= 0
##$PPDIAG= 0
##$PPIPTYP= 0
##$PPMPNUM= 2147483647
##$PPRESOL= 1
##$PSCAL= 4
##$PSIGN= 0
##$PYNMP= <proc.py>
##$REVERSE= no
##$SF= 400.02000956811
##$SI= 131072
##$SIGF1= 0
##$SIGF2= 0
##$SINO= 400
##$SIOLD= 131072
##$SPECTYP= <>
##$SREGLST= <1H.CDCl3>
##$SSB= 0
##$STSI= 131072
##$STSR= 0
##$SW_p= 8223.68421052631
##$SYMM= 0
##$S_DEV= 0
##$TDeff= 65536
##$TDoff= 0
##$TI= <>
##$TILT= no
##$TM1= 0
##$TM2= 0
##$TOPLEV= 0
##$USERP1= <user>
##$USERP2= <user>
##$USERP3= <user>
##$USERP4= <user>
##$USERP5= <user>
##$WDW= 1
##$XDIM= 131072
##$YMAX_p= 387887768
##$YMIN_p= -81269716
##$CURPLOT= <Network HP LaserJet P1505>
##$CURPRIN= <$Network HP LaserJet P1505>
##$DFORMAT= <normdp>
##$LAYOUT= <+/1D_H.xwp>
##$LFORMAT= <normlp>
##$PFORMAT= <normpl>
##$SURQMSG= 1
$$ End of Bruker specific parameters
$$ ---------------------------------
##NTUPLES= NMR SPECTRUM
##VAR_NAME=  FREQUENCY,     SPECTRUM/REAL,   SPECTRUM/IMAG
##SYMBOL=    X,             R,               I
##VAR_TYPE=  INDEPENDENT,   DEPENDENT,       DEPENDENT
##VAR_FORM=  AFFN,          ASDF,            ASDF
##VAR_DIM=   131072,        131072,          131072
##UNITS=     HZ,            ARBITRARY UNITS, ARBITRARY UNITS
##FACTOR=    0.0627417313425164, 1,          1
##FIRST=     8223.62146879497, -1778,        -62392
##LAST=      0,             1676,            -63651
##MIN=       0,             -81269716,       0
##MAX=       8223.62146879497, 387887768,    0
$$ Real data points
##PAGE= N=1
##DATA TABLE= (X++(R..R)), XYDATA
$$ [...]
$$ plain form
61666 480541 479826 478719 477209 476094 475722 475557 475089 474433 473890 473557 473518 473856 474286 474340 474064 473963 474105 473959
61648 473959 473432 473432 474867 477489 480240 482494 484454 486521 488724 490788 492420 493500 494151 494603 494831 494392
61632 494392 492765 489868 486201 482556 479516 477025 474424 471158 467507 464425 462569 461743 461337 461013 460804
61617 460804 460842 461217 461914 462647 462934 462493 461480 460150 458400 455709 451486 445500 438243 430860 424358 418806
61601 418806 413527 408060 402513 396981 391296 385630 380705 376866 373453 369665 365687 362229 359287 356136
61587 356136 352479 348798 345484 342384 339504 337467 336780 336918 336578 334816 331743 328301 325529 323927 323324
61572 323324 323241 323272 323101 322456 321365 320315 319800 319724 319592 319164 318546 317764 316835 316239 316656 317986 319229 319662
61554 319662 319687 320176 321386 322949 324498 325787 326503 326530 326295 326364 326746 327038 327195 327719 329004 330861 332780
$$ packed form
61666D80541p15j107j510j115l72j65m68o56n43l33l9L38M30N4k76j01J42j46
61648D73959n27%J435K622K751K254J960K067K203K064J632J080O51M52K28m39
61632D94392j627k897l667l645l040k491k601l266l651l082j856q26m06l24k09
61617D60804L8L75O97P33K87m41j013j330j750k691m223n986p257p383o502n552
61601D18806n279n467n547n532n685n666m925l839l413l788l978l458k942l151
61587C56136l657l681l314l100k880k037o87J38l40j762l073l442k772j602o03
61572C23324q3L1j71o45j091j050n15p6j32m28o18p82r29n96M17J330J243M33
61554C19662K5M89J210J563J549J289P16K7k35O9L82K92J57N24J285J857J919
$$ plain form
61537 332780 334389 335664 337015 339225 342909 347805 352781 356696 359180 360489 360854 360223 358601 356376 354127
61522 354127 351992 349421 345798 341384 337366 334736 333354 332380 331413 330708 330367 329899 328907 327758 327185 327384
61506 327384 327896 328330 328812 329588 330458 330852 330378 329124 327396 325431 323521 322288 322479 324278 326929 329237
61490 329237 330484 330762 330519 330016 329337 328765 328814 329754 331159 332133 332091 331266 330410 330126 330628 331935 333977 336401
61472 336401 338550 339812 340017 339468 338713 338217 338055 337930 337666 337576 338002 338601 338633 338039 337619 337900 338400 338469 338281
61453 338281 338418 338908 339409 339984 340923 342004 342800 343578 344939 346533 347128 346392 345686 346584 349242 352744 356356
61436 356356 359759 362669 365136 367990 372124 377355 382576 386969 390511 393352 395443 396987 398611 400663
61422 400663 402640 403686 403578 403053 403204 404662 407253 410276 413062 415226 416479 416469 415027 412486 409544
$$ packed form
61537C32780J609J275J351K210L684M896M976L915K484J309L65o31j622k225k249
61522C54127k135k571l623m414m018k630j382r74r67p05l41m68r92j149n73J99
61506C27384N12M34M82P76Q70L94m74j254j728j965j910j233J91J799K651K308
61490C29237J247K78k43n03o79n72M9R40J405R74m2q25q56k84N02J307K042K424
61472C36401K149J262K05n49p55m96j62j25k64r0M26N99L2n94m20K81N00O9j88
61453C38281J37M90N01N75R39J081P96P78J361J594N95p36p06Q98K658L502L612
61436C56356L403K910K467K854M134N231N221M393L542K841K091J544J624K052
61422D00663J977J046j08n25J51J458K591L023K786K164J253j0j442k541k942
$$ plain form
61407 409544 406802 404535 402800 401578 400816 400454 400369 400254 399703 398585 397132 395492 393409 390641 387553 384935
61391 384935 383326 382826 383436 385044 387007 388358 388785 389129 390472 392836 395206 396806 398042 399969 403042
61376 403042 406613 409633 411595 412725 413497 414258 415335 417151 419961 423440 426710 428920 429920 430392 431206
61361 431206 432607 434167 435631 437499 440440 444420 448931 453966 460045 467225 474807 482322 490122 498549
61347 498549 507187 515516 523670 531794 539159 544898 549368 553773 558489 562679 565679 567829 569721 571476
61333 571476 573047 574404 574989 573821 570742 566941 563616 560645 557273 553581 550378 547862 545324 542281
61319 542281 539192 536763 535122 534022 533521 534087 536065 539322 543423 548083 553389 559587 566769 574873 583899
61304 583899 593819 604253 614513 624099 632868 640603 646762 650855 652733 652261 649142 643589 636881 630559
$$ packed form
61407D09544k742k267j735j222p62l62q5j15n51j118j453j640k083k768l088k618
61391C84935j609n00O10J608J963J351M27L44J343K364K370J600J236J927L073
61376D03042L571L020J962J130P72P61J077J816K810L479L270K210J000M72Q14
61361D31206J401J560J464J868K941L980M511N035O079P180P582P515P800Q427
61347D98549Q638Q329Q154Q124P365N739M470M405M716M190L000K150J892J755
61333E71476J571J357N85j168l079l801l325k971l372l692l203k516k538l043
61319E42281l089k429j641j100n01N66J978L257M101M660N306O198P182Q104R026
61304E83899R920J0434J0260R586Q769P735O159M093J878m72l119n553o708o322
$$ plain form
61290 630559 625018 619393 612952 606093 599733 594128 588766 583338 578413 574971 573357 572826 572188 570856 569280
61275 569280 568530 569612 572999 578323 584380 589846 594326 598514 603110 607933 612394 616491 620842 625923
61261 625923 631858 638876 647339 657210 667954 679137 690586 701769 711478 718606 723037 725531 726838
61248 726838 727146 726186 723627 719447 714085 708160 701976 695453 688584 681666 675001 668711 663099 658746 655833
61233 655833 653600 650973 647683 644366 641675 639771 638676 638581 639563 641376 643736 646543 649679 652905 656153
61218 656153 659596 663188 666485 669282 672107 675644 679769 683603 686414 688092 688759 688499 687600 686711 686470
61203 686470 687178 688922 691710 695439 700072 706046 714153 724736 737291 751200 766624 784231 804058
61190 804058 824944 845108 863074 878108 890125 899307 905790 909691 911459 911971 912039 911870 911104 909298
$$ packed form
61290F30559n541n625o441o859o360n605n362n428m925l442j614n31o38j332j576
61275E69280p50J082L387N324O057N466M480M188M596M823M461M097M351N081
61261F25923N935P018Q463R871J0744J1183J1449J1183R709P128M431K494J307
61248G26838L08r60k559m180n362n925o184o523o869o918o665o290n612m353k913
61233F55833k233k627l290l317k691j904j095r5R82J813K360K807L136L226L248
61218F56153L443L592L297K797K825L537M125L834K811J678O67k60q99q89k41
61203F86470P08J744K788L729M633N974Q107J0583J2555J3909J5424J7607J9827
61190H04058K0886K0164J7966J5034J2017R182O483L901J768N12O8j69p66j806
$$ plain form
61176 909298 906188 901664 895789 888877 881325 873319 864744 855304 844692 832846 820178 807335 794522
61163 794522 781333 767459 753255 739254 725491 711824 698670 686805 676542 667743 660561 655486
61151 655486 652510 650976 650529 651634 654756 659378 664084 667321 667880 665141 659277 651056 641323 630806
61137 630806 620365 610865 602684 595798 590440 587071 585574 585263 586035 588715 593715 600172 607203 615342
61123 615342 625690 638085 651328 665126 680608 698658 718764 740011 762388 786383 811737
61112 811737 837370 862510 887347 912361 937326 961230 983173 1003089 1021379 1037999 1052250
61101 1052250 1063561 1072013 1077820 1080531 1079119 1072762 1061419 1045919 1027740 1008336 988238 966976
61089 966976 944129 920212 896168 872338 848510 824800 801887 780407 760547 742221 725220
$$ packed form
61176I09298l110m524n875o912p552q006q575r440j0612j1846j2668j2843j2813
61163G94522j3189j3874j4204j4001j3763j3667j3154j1865j0263q799p182n075
61151F55486k976j534m47J105L122M622M706L237N59k739n864q221r733j0517
61137F30806j0441r500q181o886n358l369j497l11P72K680N000O457P031Q139
61123F15342J0348J2395J3243J3798J5482J8050K0106K1247K2377K3995K5354
61112H11737K5633K5140K4837K5014K4965K3904K1943J9916J8290J6620J4251
61101A052250J1311Q452N807K711j412o357j1343j5500j8179j9404k0098k1262
61089I66976k2847k3917k4044k3830k3828k3710k2913k1480j9860j8326j7001
$$ plain form
61078 725220 709184 693823 679223 665752 653746 643454 635024 628231 622592 618065 615185 614026 613620
61065 613620 613163 613314 615334 619200 623659 627973 632489 637458 642560 647900 654348 662402 671668 681958
61051 681958 693902 707823 722883 738175 754015 771377 790586 811328 833503 857236 882328
61040 882328 908340 935147 962948 992002 1022653 1055192 1089301 1124167 1159619 1196621 1236044
61029 1236044 1277582 1320586 1365415 1413038 1463618 1516395 1570727 1626457 1683546 1742379 1804443
61018 1804443 1871916 1946629 2030160 2124701 2232759 2355832 2494427 2649823 2825534 3027447
61008 3027447 3263872 3545920 3887236 4303308 4811771 5432886 6187482 7092831 8160552
60999 8160552 9398190 10811324 12403738 14175963 16118394 18190740 20292028 22249813
$$ packed form
61078G25220j6036j5361j4600j3471j2006j0292q430o793n639m527k880j159m06
61065F13620m57J51K020L866M459M314M516M969N102N340O448Q054R266J0290
61051F81958J1944J3921J5060J5292J5840J7362J9209K0742K2175K3733K5092
61040H82328K6012K6807K7801K9054L0651L2539L4109L4866L5452L7002L9423
61029A236044M1538M3004M4829M7623N0580N2777N4332N5730N7089N8833O2064
61018A804443O7473P4713Q3531R4541J08058J23073J38595J55396J75711K01913
61008C027447K36425K82048L41316M16072N08463O21115P54596R05349J067721
60999H160552J237638J413134J592414J772225J942431K072346K101288J957785
$$ plain form
60991 22249813 23859606 24966826 25537662 25667005 25524793 25288468 25099026 25034782 25083061
60982 25083061 25121659 24946987 24357770 23248202 21648712 19696033 17567900 15428376 13401539
60973 13401539 11565433 9955851 8576462 7411968 6438555 5629268 4957105 4397979 3932149
60964 3932149 3543148 3216320 2938998 2701213 2495275 2314926 2155420 2013854 1888491
60955 1888491 1777659 1679705 1593574 1518517 1453127 1395333 1343462 1296662 1254105 1214415 1176272
60944 1176272 1139093 1102701 1066867 1031759 998459 968242 941265 916519 893108 871027 850577
60933 850577 831508 813062 794662 776416 759115 743704 730413 718332 706215 693772 681850
60922 681850 671314 662258 654423 647722 641934 636408 630639 624849 619453 614309 609095 604182 600424 598040
$$ packed form
60991B2249813J609793J107220N70836J29343j42212k36325j89442o4244M8279
60982B5083061L8598j74672n89217j109568j599490j952679k128133k139524k026837
60973A3401539j836106j609582j379389j164494r73413q09287o72163n59126m65830
60964C932149l89001l26828k77322k37785k05938j80349j59506j41566j25363
60955A888491j10832r7954q6131p5057o5390n7794n1871m6800m2557l9690l8143
60944A176272l7179l6392l5834l5108l3300l0217k6977k4746k3411k2081k0450
60933H50577j9069j8446j8400j8246j7301j5411j3291j2081j2117j2443j1922
60922F81850j0536r056p835o701n788n526n769n790n396n144n214m913l758k384
$$ plain form
60908 598040 596375 594858 593690 593395 594120 595536 597115 598397 599353 600511 602385 604779 607199 609927 613898
60893 613898 619190 624393 628173 631044 634881 640869 648614 657135 665982 675251 685166 695945 707662 719850
60879 719850 731631 742600 753411 765099 777966 791459 805064 818920 833515 849181 866065
60868 866065 884238 903483 923121 942474 961553 981015 1001239 1021597 1040822 1058041 1073301
60857 1073301 1087071 1099325 1109238 1115792 1118549 1117684 1113323 1105279 1093708 1079673 1064494 1048439 1030576
60844 1030576 1010165 987786 964807 942040 919323 896129 872053 846797 820296 793125 766452
60833 766452 741323 718091 696572 676533 657873 640569 624666 610297 597530 586250 576252 567430
60821 567430 559745 552979 546633 540220 533730 527702 522645 518455 514557 510624 506829 503393 500306 497733
$$ packed form
60908E98040j665j517j168k95P25J416J579J282R56J158J874K394K420K728L971
60893F13898N292N203L780K871L837N988P745Q521Q847R269R915J0779J1717J2188
60879G19850J1781J0969J0811J1688J2867J3493J3605J3856J4595J5666J6884
60868H66065J8173J9245J9638J9353J9079J9462K0224K0358J9225J7219J5260
60857A073301J3770J2254R913O554K757q65m361q044j1571j4035j5179j6055j7863
60844A030576k0411k2379k2979k2767k2717k3194k4076k5256k6501k7171k6673
60833G66452k5129k3232k1519k0039j8660j7304j5903j4369j2767j1280r998q822
60821E67430p685o766o346o413o490o028n057m190l898l933l795l436l087k573
$$ plain form
60807 497733 496225 495977 496207 495828 494727 493777 493583 493830 494022 494222 494684 495176 495170 494498 493441 492258 490962 489525
60789 489525 488065 486787 485836 485171 484512 483523 482045 479995 477105 473139 468480 464071 460443 457143 453481
60774 453481 449558 445991 442770 439020 434072 428304 422630 417455 412516 407680 403561 401146 400832 401929
60760 401929 403207 403935 404249 404548 404761 404455 403480 402211 401152 400552 400427 400766 401650 403248 405661 408593 411296
60743 411296 413196 414614 416514 419340 422407 424653 425702 425893 425528 424574 423036 421082 418660 415460 411534
60728 411534 407583 404232 401177 397567 393196 388883 385519 383119 381067 378959 376845 374753 372480 369949
60714 369949 367460 365382 363689 361982 359840 357099 353944 350881 348532 347215 346612 345937 344542 342430 340250
60699 340250 338791 338359 338574 338746 338522 338130 338025 338409 339161 340109 341155 342166 342958 343526 344084 344800 345627 346603
$$ packed form
60807D97733j508k48K30l79j101r50j94K47J92K00M62M92oo72j057j183j296j437
60789D89525j460j278r51o65o59r89j478k050k890l966m659m409l628l300l662
60774D53481l923l567l221l750m948n768n674n175m939m836m119k415l14J097
60760D01929J278P28L14K99K13l06r75j269j059o00j25L39Q84J598K413K932K703
60743D11296J900J418J900K826L067K246J049J91l65r54j538j954k422l200l926
60728D11534l951l351l055l610m371m313l364k400k052k108k114k092k273k531
60714C69949k489k078j693j707k142k741l155l063k349j317o03o75j395k112k180
60699C40250j459m32K15J72k24l92j05L84P52R48J046J011P92N68N58P16Q27R76
$$ plain form
60681 346603 348119 350555 353627 356498 358769 361143 364746 369859 375622 380997 385757 390415 395438 400768
60667 400768 406006 410806 414988 418394 420824 422299 423367 424936 427546 430863 434187 437444 441398 446761
60653 446761 453328 460240 466913 473478 480423 488045 496248 504680 512950 520642 527056 531038 531357 527473
60639 527473 519774 509046 496029 481670 467321 454116 442251 431338 421390 412972 406305 400740
60627 400740 395371 389939 384934 381094 378927 378479 379223 380272 380802 380323 378710 376347 374213 373337 373761 374390
60611 374390 374216 373541 373549 374769 376424 377409 377556 377616 378179 378940 379084 378255 376978 376124 376069 376489 376961 377522 378492
60592 378492 379828 380992 381560 381826 382539 384108 386260 388515 390710 392870 394821 396264 397177 397797 398221 398348
60576 398348 398279 398375 398850 399765 401619 405395 411477 418876 426142 432882 439878 447857 456794 466378 476418
$$ packed form
60681C46603J516K436L072K871K271K374L603N113N763N375M760M658N023N330
60667D00768N238M800M182L406K430J475J068J569K610L317L324L257L954N363
60653D46761O567O912O673O565O945P622Q203Q432Q270P692O414L982L19l884
60639E27473p699j0728j3017j4359j4349j3205j1865j0913r948q418o667n565
60627D00740n369n432n005l840k167m48P44J049N30m79j613k363k134q76M24O29
60611C74390j74o75QJ220J655R85J47O0N63P61J44q29j277q54n5M20M72N61R70
60592C78492J336J164N68K66P13J569K152K255K195K160J951J443R13O20M24J27
60576C98348o9R6M75R15J854L776O082P399P266O740O996P979Q937R584J0040
$$ plain form
60561 476418 486569 496212 504939 512724 519358 524169 526662 527050 525830 523166 519166 514573 510635 508209
60547 508209 507271 507354 508275 510452 514626 521268 530131 540456 551699 563970 577741 593216 610004 627214
60533 627214 643769 658844 672132 683593 692876 699149 701566 699819 694359 686359 677417 668780 660736
60520 660736 653056 646028 640464 636557 633402 630123 626869 624174 621882 619500 617320 616335 617100 619407 623110
60505 623110 628551 636001 645322 656489 669982 686407 706115 729432 756866 788759 824966 865046
60493 865046 908515 954754 1002942 1052211 1101509 1149183 1193134 1231666 1263775 1288175 1302533
60482 1302533 1304438 1293157 1269940 1236609 1194478 1144838 1089871 1032495 975371 920347 868630
60471 868630 821018 777855 739059 704410 673712 646679 622905 602115 584248 569072 555888
$$ packed form
60561D76418J0151R643Q727P785O634M811K493L88j220k664m000m593l938k426
60547E08209r38Q3R21K177M174O642Q863J0325J1243J2271J3771J5475J6788J7210
60533F27214J6555J5075J3288J1461R283O273K417j747n460q000q942q637q044
60520F60736p680p028n564l907l155l279l254k695k292k382k180r85P65K307L703
60505F23110N441P450R321J1167J3493J6425J9708K3317K7434L1893L6207M0080
60493H65046M3469M6239M8188M9269M9298M7674M3951L8532L2109K4400J4358
60482A302533J905j1281k3217l3331m2131m9640n4967n7376n7124n5024n1717
60471H68630m7612m3163l8796l4649l0698k7033k3774k0790j7867j5176j3184
$$ plain form
60460 555888 543911 532915 523199 514868 507502 500721 494714 489852 485900 482038 477759 473444 469850 467174
60446 467174 464915 462605 460360 458546 457066 455298 452806 449853 447110 445071 443874 443380 443075 442130 440058
60431 440058 437351 435024 433514 432431 431461 430920 431129 431755 432220 432424 432616 432829 432928 433059 433500 434124 434540 434813
60413 434813 435549 437157 439366 441630 443674 445436 446811 447778 448640 449815 451280 452400 452495 451659 450821 450847
60397 450847 451645 452442 452911 453584 454991 456896 458798 460858 463747 467665 472053 476297 480286 484204 488074
60382 488074 491681 494709 496958 498585 500068 501723 503422 505052 507017 509781 513088 516197 518866 521458
60368 521458 524027 526000 527039 527603 528222 528758 528859 528726 528862 529292 529577 529535 529507 529923 530943 532510 534509
60351 534509 536851 539629 543166 547769 553467 560047 567204 574514 581464 587700 593120 597548 600512 601597
$$ packed form
60460E55888j1977j0996r716q331p366o781o007m862l952l862m279m315l594k676
60446D67174k259k310k245j814j480j768k492k953k743k039j197m94l05r45k072
60431D40058k707k327j510j083r70n41K09O26M65K04J92K13R9J31M41O24M16K73
60413D34813P36J608K209K264K044J762J375R67Q62J175J465J120R5q36q38K6
60397D50847P98P97M69O73J407J905J902K060K889L918M388M244L989L918L870
60382D88074L607L028K249J627J483J655J699J630J965K764L307L109K669K592
60368E21458K569J973J039N64O19N36J01j33J36M30K85m2k8M16J020J567J999
60351E34509K342K778L537M603N698O580P157P310O950O236N420M428K964J085
$$ plain form
60337 601597 600867 598723 595491 591416 586859 582166 577418 572621 568040 563997 560361 556636 552554 548295
60323 548295 544072 539886 535804 532113 528991 526251 523654 521285 519408 518085 517152 516551 516487 517346 519623
60308 519623 523847 530345 538923 548937 559852 571801 585581 602020 621242 642480 664504 686132
60296 686132 706252 723456 735929 741986 740838 732936 719614 702455 682862 662079 641448 622478
60284 622478 606427 593611 583156 573637 564153 554845 546426 539324 533350 528053 523162 518625 514379
60271 514379 510240 506071 501955 498084 494487 490954 487401 484202 481960 480885 480611 480708 481064 481558 481644 480745
60255 480745 478959 476988 475408 474406 474165 474855 476041 476666 476028 474475 472848 471629 470947 470940 471554 472261 472553
60238 472553 472542 472606 472677 472497 472416 473243 475216 477760 480407 483381 487032 491131 495036 498259 500817 503304 506632
$$ packed form
60337F01597p30k144l232m075m557m693m748m797m581m043l636l725m082m259
60323E48295m223m186m082l691l122k740k597k369j877j323r33o01o4Q59K277
60308E19623M224O498Q578J0014J0915J1949J3780J6439J9222K1238K2024K1628
60296F86132K0120J7204J2473O057j148p902j3322j7159j9593k0783k0631j8970
60284F22478j6051j2816j0455r519r484r308q419p102n974n297m891m537m246
60271E14379m139m169m116l871l597l533l553l199k242j075k74R7L56M94Q6q99
60255D80745j786j971j580j002k41O90J186O25o38j553j627j219o82pO14P07K92
60238D72553j1O4P1j80q1Q27J973K544K647K974L651M099L905L223K558K487L328
$$ plain form
60221 506632 511200 516200 520310 523269 526258 530444 535692 541058 546085 551056 556384 562278 568851 576022
60207 576022 583373 590469 597226 603695 609701 615072 620031 624952 629818 634333 638415 642189 645575 648347
60193 648347 650562 652436 653747 653859 652531 650264 647598 644396 640198 635116 629997 625669 622243 619213
60179 619213 616004 612262 607811 602706 597464 592988 589922 588075 586746 585559 584646 584016 583235 581964 580438
60164 580438 579090 577939 576720 575352 573900 572270 570425 568865 568436 569544 571782 574314 576414 577737
60150 577737 578468 579257 580688 582762 585114 587711 590948 595066 599758 604468 608734 612257 615085 617902 621729
60135 621729 627032 633348 639996 646813 653935 661107 667650 673016 677074 679883 681444 681677 680524 678146
60121 678146 675170 672605 671237 671159 672025 673564 675569 677531 678759 678968 678457 677581 676361 674702 672670 670319
$$ packed form
60221E06632M568N000M110K959K989M186N248N366N027M971N328N894O573P171
60207E76022P351P096O757O469O006N371M959M921M866M515M082L774L386K772
60193F48347K215J874J311J12j328k267k666l202m198n082n119m328l426l030
60179F19213l209l742m451n105n242m476l066j847j329j187r13o30p81j271j526
60164E80438j348j151j219j368j452j630j845j560m29J108K238K532K100J323
60150E77737P31P89J431K074K352K597L237M118M692M710M266L523K828K817L827
60135F21729N303O316O648O817P122P172O543N366M058K809J561K33j153k378
60121F78146k976k565j368p8Q66J539K005J962J228K09n11q76j220j659k032k351
$$ plain form
60105 670319 667492 664030 660012 655549 650568 645114 639730 635164 631677 628954 626655 624744 623231 622039
60091 622039 621325 621602 623198 625772 628571 631101 633358 635596 638040 640656 642967 644266 644247 643302 641970
60076 641970 640344 638338 636279 634646 633235 631115 627571 622644 616677 609838 602359 594846 587928 581788
60062 581788 576328 571516 567246 563047 558355 553062 547557 542229 537233 532764 529276 527252 526756 527298 528198
60047 528198 529138 530287 531879 533813 535960 538715 542786 548324 554597 560720 566339 571380 575524 578373
60033 578373 579940 580577 580478 579542 577596 574479 570009 564255 557758 551220 544942 538797 532570 526071 519120
60018 519120 511851 505017 499497 495427 492191 489286 486778 484776 482996 481218 479815 479402 480024 481017 481610
60003 481610 481427 480503 479146 477866 477131 477021 477166 477226 477342 478012 479502 481574 483878 486476 489841 494409
$$ packed form
60105F70319k827l462m018m463m981n454n384m566l487k723k299j911j513j192
60091F22039p14K77J596K574K799K530K257K238K444K616K311J299j9r45j332
60076F41970j626k006k059j633j411k120l544m927n967o839p479p513o918o140
60062E81788n460m812m270m199m692n293n505n328m996m469l488k024m96N42R00
60047E28198R40J149J592J934K147K755M071N538O273O123N619N041M144K849
60033E78373J567O37r9r36j946l117m470n754o497o538o278o145o227o499o951
60018E19120p269o834n520m070l236k905k508k002j780j778j403m13O22R93N93
60003D81610j83r24j357j280p35j10J45O0J16O70J490K072K304K598L365M568
$$ plain form
59987 494409 500316 507506 515788 524668 533390 541436 548878 556065 562951 568935 573266 575410 575048 572059
59973 572059 566743 559936 552651 545555 538893 532907 528064 524647 522227 519932 517359 515001 513607 513394
59959 513394 514193 516047 519130 523118 527217 530986 534655 538377 541582 543526 544297 544855 546070 547970 549938
59944 549938 551467 552623 553770 554914 555512 555123 554065 553061 552285 551220 549535 547621 546033 544818 543685
59929 543685 542476 541152 539580 537670 535536 533406 531609 530707 531202 532905 535059 537356 540330 544422 549274
59914 549274 554428 560111 566653 573640 580488 587534 595587 604482 612927 619853 625235 629505 632808 635017
59900 635017 635928 635294 633164 630301 627761 625898 624165 622008 619625 617724 616877 617191 618349 619960 622084
59885 622084 625243 629621 634521 639000 642733 645754 647755 648432 648315 648417 649033 649659 650051 650525 651116 651235
$$ packed form
59987D94409N907P190Q282Q880Q722Q046P442P187O886N984M331K144l62k989
59973E72059n316o807p285p096o662n986m843l417k420k295k573k358j394k13
59959E13394P99J854L083L988M099L769L669L722L205J944P71N58J215J900J968
59944E49938J529J156J147J144N98l89j058j004p76j065j685j914j588j215j133
59929E43685j209j324j572j910k134k130j797r02M95J703K154K297K974M092M852
59914E49274N154N683O542O987O848P046Q053Q895Q445O926N382M270L303K209
59900F35017R11o34k130k863k540j863j733k157k383j901q47L14J158J611K124
59885F22084L159M378M900M479L733L021K001O77j17J02O16O26L92M74N91J19
$$ plain form
59869 651235 650348 648312 644987 640376 635239 630678 626868 623056 619046 615708 613625 612202 610696 609305
59855 609305 608641 608891 610115 612627 616448 621031 626127 632242 639627 647651 655876 664868 674947 684840
59841 684840 692723 698108 701658 703656 703946 703126 702495 702694 703332 703860 703858 702557 699212 694051 687838 680501
59825 680501 671343 660846 650951 642961 636198 629374 622401 616023 610449 605362 600955 598031 597107 597955
59811 597955 599917 602189 603929 604551 603977 602409 600075 597390 594979 593107 591292 588941 586198 583762 581964
59796 581964 580490 578911 577015 574657 571773 568695 566008 563903 562021 560105 558463 557499 557118 556911 556679
59781 556679 556407 555915 554989 553775 552567 551292 549746 548370 548099 549083 550190 550324 549770 549649 550380 551450
59765 551450 552468 553614 555009 556444 557957 559990 562660 565516 568340 571596 575642 580036 584151 588116
$$ packed form
59869F51235q87k036l325m611n137m561l810l812m010l338k083j423j506j391
59855F09305o64K50J224K512L821M583N096O115P385Q024Q225Q992J0079R893
59841F84840P883N385L550J998K90q20o31J99O38N28kj301l345n161o213p337
59825F80501r158j0497r895p990o763o824o973o378n574n087m407k924r24Q48
59811E97955J962K272J740O22n74j568k334k685k411j872j815k351k743k436j798
59796E81964j474j579j896k358k884l078k687k105j882j916j642r64l81k07k32
59781E56679k72m92r26j214j208j275j546j376k71R84J107J34n54j21P31J070
59765E51450J018J146J395J435J513K033K670K856K824L256M046M394M115L965
$$ plain form
59751 588116 592619 597987 603947 610097 616238 622374 628672 635197 641451 646506 649970 652517 655094 657902
59737 657902 660518 662609 664059 664743 664786 664832 665461 666554 667752 669290 671647 674507 676839 678105 678793 679673
59721 679673 681087 683004 685157 686888 687432 686667 685307 684163 683508 683282 683553 684558 686455 689078 691870
59706 691870 694161 695839 697620 700421 704576 709931 716395 723898 732078 740672 750043 760672 772160 783507
59692 783507 794383 805235 815858 824681 830001 831476 830037 826816 822571 817804 812895 808137 803719
59679 803719 799474 794742 788934 782306 775678 769255 762336 754372 745718 737083 728822 721125 714284 708294
59665 708294 702657 697082 691979 687819 684458 681618 679570 678708 678760 679135 679820 681315 683746 686648 689588
59650 689588 692438 694995 696850 697763 697818 697126 695619 693181 689727 685164 679473 672842 665586 658104 651034
$$ packed form
59751E88116M503N368N960O150O141O136O298O525O254N055L464K547K577K808
59737F57902K616K091J450O84M3M6O29J093J198J538K357K860K332J266O88Q80
59721F79673J414J917K153J731N44p65j360j144o55k26K71J005J897K623K792
59706F91870K291J678J781K801M155N355O464P503Q180Q594R371J0629J1488J1347
59692G83507J0876J0852J0623Q823N320J475j439l221m245m767m909m758m418
59679H03719m245m732n808o628o628o423o919p964q654q635q261p697o841n990
59665G08294n637n575n103m160l361k840k048q62N2L75O85J495K431K902K940
59650F89588K850K557J855R13N5o92j507k438l454m563n691o631p256p482p070
$$ plain form
59635 651034 645208 641071 638281 636125 634225 632613 631345 630377 629660 628937 627548 624815 620664 615680 610652
59620 610652 606177 602402 598861 594823 590129 585371 580893 576070 570216 563826 558124 553543 549570 546106
59606 546106 544001 543862 545134 546802 548423 549990 551389 552572 553927 555941 558754 562402 567023 572292
59592 572292 577091 580583 583486 587459 593068 599032 603709 606673 608395 608957 607818 604673 599853 593725
59578 593725 586239 577396 567811 558372 549426 540759 532387 524968 519126 514605 510467 506140 502018 498955
59564 498955 497363 496904 496933 497038 497143 497246 497210 496904 496512 496525 497285 498664 500335 502295 504874 508225 512073
59547 512073 516109 520465 525549 531504 538057 544986 552547 561309 571580 583183 595848 609723 625343
59534 625343 642951 661740 679664 694027 702607 704712 701451 694986 687418 680319 674997 672551 673298
$$ packed form
59635F51034n826m137k790k156j900j612j268r68p17p23j389k733m151m984n028
59620F10652m475l775l541m038m694m758m478m823n854o390n702m581l973l464
59606E46106k105j39J272J668J621J567J399J183J355K014K813L648M621N269
59592E72292M799L492K903L973N609N964M677K964J722N62j139l145m820o128
59578E93725p486q843r585r439q946q667q372p419n842m521m138m327m122l063
59564D98955j592m59K9J05J05J03l6l06l92J3P60J379J671J960K579L351L848
59547E12073M036M356N084N955O553O929P561Q762J0271J1603J2665J3875J5620
59534F25343J7608J8789J7924J4363Q580K105l261o465p568p099n322k446P47
$$ plain form
59521 673298 676410 680570 684940 689232 692962 695220 695343 693453 690071 685476 679668 672699 664687 655692
59507 655692 645996 636450 628090 621277 615510 610285 605883 602985 601689 601303 601174 601452 602864 605975 610866
59492 610866 617320 624921 632974 640728 647959 655057 662323 669471 676263 683466 692564 704400 718644 734940
59478 734940 754022 777095 804344 834600 866362 898494 929813 958588 982773 1000440 1009900 1010060
59466 1010060 1001259 985558 965798 944495 923757 905712 892224 884223 881861 885287 894647 909282
59454 909282 927611 948113 969984 992677 1015400 1037596 1059561 1081997 1105028 1127908 1149473
59443 1149473 1168441 1183409 1192964 1195959 1191677 1180092 1162369 1140892 1118324 1096472 1076064 1057144
59431 1057144 1039041 1020102 998265 972443 943348 913016 883700 857045 833830 814235 798538
$$ packed form
59521F73298L112M160M370M292L730K258J23j890l382m595n808o969q012q995
59507F55692r696r546q360o813n767n225m402k898j296l86j29K78J412L111M891
59492F10866O454P601Q053P754P231P098P266P148O792P203R098J1836J4244J6296
59478G34940J9082K3073K7249L0256L1762L2132L1319K8775K4185J7667R460J60
59466A010060q801j5701j9760k1303k0738j8045j3488q001k362L426R360J4635
59454I09282J8329K0502K1871K2693K2723K2196K1965K2436K3031K2880K1565
59443A149473J8968J4968R555K995m282j1585j7723k1477k2568k1852k0408j8920
59431A057144j8103j8939k1837k5822k9095l0332k9316k6655k3215j9595j5697
$$ plain form
59420 798538 787551 782258 783095 789831 801967 818860 839527 862850 888131 915138 943526 972348
59408 972348 999799 1022820 1037280 1039813 1030297 1012247 990490 968789 949663 935282 927409 926574
59396 926574 931804 940678 949013 951194 942444 921566 891320 856163 820043 785899 755791 730537
59384 730537 709634 692189 677907 666896 658823 652774 647904 643892 640756 638518 637128 636606 637105 638695
59370 638695 641002 643222 644777 645953 647593 650166 653467 657267 661742 667051 672965 679321 686428 694555
59356 694555 703365 712488 722425 734214 748243 764093 781549 800961 822412 845314 869293 894760
59344 894760 921969 950020 977488 1003679 1028474 1051179 1070389 1085007 1094698 1099315 1098645 1092955
59332 1092955 1083099 1069759 1053142 1033731 1012727 991285 969725 947930 926143 904907 884537
$$ packed form
59420G98538j0987n293Q37O736J2136J6893K0667K3323K5281K7007K8388K8822
59408I72348K7451K3021J4460K533r516j8050k1757k1701j9126j4381p873q35
59396I26574N230Q874Q335K181q750k0878l0246l5157l6120l4144l0108k5254
59384G30537k0903j7445j4282j1011q073o049m870m012l136k238j390n22M99J590
59370F38695K307K220J555J176J640K573L301L800M475N309N914O356P107Q127
59356F94555Q810R123R937J1789J4029J5850J7456J9412K1451K2902K3979K5467
59344H94760K7209K8051K7468K6191K4795K2705J9210J4618R691M617o70n690
59332A092955r856j3340j6617j9411k1004k1442k1560k1795k1787k1236k0370
$$ plain form
59321 884537 865099 846699 829381 813024 797735 784156 772902 763881 756484 750251 744948 740283
59309 740283 736055 732526 730222 729451 730262 732620 736249 740765 746504 754830 766785 781512 796832 811420
59295 811420 825680 840243 854262 865429 871276 870394 863056 851009 836382 820647 804750 789889
59283 789889 777333 767494 759880 754153 750522 748944 748729 749409 751422 755489 761736 769743 779004 789078
59269 789078 799705 811045 823313 835938 847652 857611 865873 872509 876985 878849 878306 875535 870078
59256 870078 861561 850465 837546 822994 806886 790008 773467 757845 743486 731208 721828 715070
59244 715070 709761 705068 700967 697643 695192 693909 694161 695795 698164 700776 703493 706188 708646 710774
59230 710774 712481 713455 713473 712798 711741 709993 706893 702271 696509 689923 682663 675123 667859 661115 654957
$$ packed form
59321H84537j9438j8400j7318j6357j5289j3579j1254r021p397o233n303m665
59309G40283m228l529k304p71Q11K358L629M516N739Q326J1955J4727J5320J4588
59295H11420J4260J4563J4019J1167N847q82p338j2047j4627j5735j5897j4861
59283G89889j2556r839p614n727l631j578k15O80K013M067O247Q007R261J0074
59269G89078J0627J1340J2268J2625J1714R959Q262O636M476J864n43k771n457
59256H70078q517j1096j2919j4552j6108j6878j6541j5622j4359j2278r380o758
59244G15070n309m693m101l324k451j283K52J634K369K612K717K695K458K128
59230G10774J707R74J8o75j057j748l100m622n762o586p260p540p264o744o158
$$ plain form
59215 654957 649756 646035 643937 643404 644675 647871 652216 656543 660636 665264 670784 676502 681673 686287
59201 686287 690491 693965 696429 698214 699810 701226 702259 703098 704195 705762 707790 710423 713973 718573
59187 718573 723926 729399 734376 738668 742504 745980 748701 750248 750794 750770 750169 748741 746783 745063 743919
59172 743919 743082 742459 742472 743474 745434 748325 752177 756621 761104 765843 771839 779542 788049 796001 802695
59157 802695 807982 811681 813630 813864 812297 808683 803244 796853 790162 783111 775678 768478 761988 755753
59143 755753 749105 742239 735844 730048 724510 719278 714672 710441 705873 700826 695960 691816 688238 684862
59129 684862 681702 679014 676931 675390 674283 673757 674450 677143 681846 687550 693360 699631 707400 716860 727028
59114 727028 736847 746015 754800 763747 773617 784913 797176 809241 820295 830218 838915 846073 851811
$$ packed form
59215F54957n201l721k098n33J271L196M345M327M093M628N520N718N171M614
59201F86287M204L474K464J785J596J416J033Q39J097J567K028K633L550M600
59187G18573N353N473M977M292L836L476K721J547N46k4o01j428j958j720j144
59172G43919q37o23J3J002J960K891L852M444M483M739N996P703Q507P952O694
59157H02695N287L699J949K34j567l614n439o391o691p051p433p200o490o235
59143G55753o648o866o395n796n538n232m606m231m568n047m866m144l578l376
59129F84862l160k688k083j541j107n26O93K693M703N704N810O271P769R460J0168
59114G27028R819R168Q785Q947R870J1296J2263J2065J1054R923Q697P158N738
$$ plain form
59101 851811 856773 861077 863780 863942 861777 858178 853587 848004 841812 835816 830508 825925 822138 819207
59087 819207 816586 813362 809341 805382 802213 799359 795675 790597 784365 777230 769086 759964 750399 741069
59073 741069 732276 723977 716080 708543 701353 694664 688844 684104 680025 675647 670289 664271 658705 654353
59059 654353 650718 646462 640910 634918 629959 626516 623782 620994 618452 616951 616636 616997 617795 619357 621788
59044 621788 624329 625818 625711 624524 623265 622492 621900 620851 619230 617588 616454 615818 615520 615826 617263 620000
59028 620000 623774 628409 634107 641235 650098 660927 673854 688821 705615 723896 743059 762216
59016 762216 780543 797450 812256 824064 832375 837566 840239 840285 837113 830707 821963 812140 802600 794838
59002 794838 789830 787162 785585 784711 785417 788278 792383 796224 799100 801011 801733 800798 798196 794433 789938
$$ packed form
59101H51811M962M304K703J62k165l599m591n583o192n996n308m583l787k931
59087H19207k621l224m021l959l169k854l684n078o232p135q144r122r565r330
59073G41069q793q299p897p537p190o689n820m740m079m378n358o018n566m352
59059F54353l635m256n552n992m959l443k734k788k542j501l15L61P98J562K431
59044F21788K541J489j07j187j259p73n92j049j621j642j134o36k98L06J437K737
59028F20000L774M635N698P128Q863J0829J2927J4967J6794J8281J9163J9157
59016G62216J8327J6907J4806J1808Q311N191K673M6l172o406q744r823r540p762
59002G94838n008k668j577q74P06K861M105L841K876J911P22r35k602l763m495
$$ plain form
58987 789938 784856 779366 773800 768466 763557 759132 755001 750885 746892 743602 741441 740311 740109 741266
58973 741266 744400 749723 757144 766549 777542 789239 800937 812707 824721 836180 845729 852987 858895
58960 858895 864296 868834 871685 872837 873014 872515 870673 866563 859889 851053 840650 829181 817126 804940
58946 804940 792796 780547 768162 756156 745395 736531 729770 725034 722108 720653 720283 720571 720808 720069
58932 720069 717998 715353 713195 711522 709277 705736 701141 695898 689975 683552 677477 672402 667973 663549
58918 663549 659303 655809 652862 649578 645712 642173 640068 639755 640994 643533 647193 651721 656919 662977
58904 662977 670512 680176 692188 706281 722097 739405 757701 775848 792609 807541 820850 832410
58892 832410 841602 848391 853856 859247 865135 871988 880883 892722 906947 921790 935744 948260 959136
$$ packed form
58987G89938n082n490n566n334m909m425m131m116l993l290k161j130k02J157
58973G41266L134N323P421R405J0993J1697J1698J1770J2014J1459R549P258N908
58960H58895N401M538K851J152J77m99j842m110o674q836j0403j1469j2055j2186
58946H04940j2144j2249j2385j2006j0761q864o761m736k926j455l70K88K37p39
58932G20069k071k645k158j673k245l541m595n243n923o423o075n075m429m424
58918F63549m246l494k947l284l866l539k105l13J239K539L660M528N198O058
58904F62977P535R664J2012J4093J5816J7308J8296J8147J6761J4932J3309J1560
58892H32410R192O789N465N391N888O853Q895J1839J4225J4843J3954J2516J0876
$$ plain form
58879 959136 967886 973853 976601 976145 972971 967672 960340 950640 938789 926000 913499 901404 889193
58866 889193 876939 865408 855079 845724 836899 828235 819294 809760 799850 790090 780674 771519 762805
58853 762805 754896 747735 740899 734277 728155 722572 717113 711461 705649 699671 693318 686526 679437 671990
58839 671990 663873 655073 646124 637671 630015 623098 616662 610443 604550 599601 596125 593843 591930 589996
58825 589996 588373 587463 587222 587327 587447 587269 586679 586034 585955 586769 588336 590312 592268 593736 594651 595644 597394
58808 597394 599669 601514 602366 602506 602379 602023 601271 599999 598030 595203 591654 587733 583660 579629 576162
58793 576162 573801 572490 571746 571386 571483 571703 571476 570997 571359 573397 576969 581573 586996 593057 599400 605980
58777 605980 613201 621044 628503 634415 638653 642019 645114 647615 648538 647052 643214 637992 632374 626427
$$ packed form
58879I59136Q750N967K748m56l174n299p332r700j1851j2789j2501j2095j2211
58866H89193j2254j1531j0329r355q825q664q941r534r910r760r416r155q714
58853G62805p909p161o836o622o122n583n459n652n812n978o353o792p089p447
58839F71990q117q800q949q453p656o917o436o219n893m949l476k282j913j934
58825E89996j623r10k41J05J20j78n90o45p9Q14J567J976J956J468R15R93J750
58808E97394K275J845Q52J40j27l56p52j272j969k827l549l921m073m031l467
58793E76162k361j311p44l60R7K20k27m79L62K038L572M604N423O061O343O580
58777F05980P221P843P459N912M238L366L095K501R23j486l838n222n618n947
$$ plain form
58763 626427 619569 611739 603821 596811 591126 586846 584000 582238 580806 579357 578416 578568 579572 580751 581956
58748 581956 583557 585606 587679 589660 592217 596190 601662 607913 614272 620805 628002 635966 644349 653124
58734 653124 662860 673801 685084 695449 704521 712819 720747 728247 735272 741720 746849 749607 749779 748189
58720 748189 745595 742119 737987 734001 730790 728248 726192 724958 724784 725097 725047 724447 723653 722713 721076 717976
58704 717976 712825 705472 696381 686273 675383 663334 649867 635315 620176 604727 589390 574985
58692 574985 562186 551022 541163 532262 523753 514940 505799 497279 490336 485088 481270 478903 477725 476473
58678 476473 473753 469659 465773 463417 462499 462238 462511 464118 467859 473616 480430 487526 495123 503976 514188
58663 514188 524996 535825 546943 558577 569861 579298 586017 589997 591203 589187 583734 575475 565654
$$ packed form
58763F26427o858p830p918p010n685m280k846j762j432j449r41J52J004J179J205
58748E81956J601K049K073J981K557L973N472O251O359O533P197P964Q383Q775
58734F53124R736J0941J1283J0365R072Q298P928P500P025O448N129K758J72j590
58720G48189k594l476m132l986l211k542k056j234j74L13n0o00p94r40j637l100
58704G17976n151p353r091j0108j0890j2049j3467j4552j5139j5449j5337j4405
58692E74985j2799j1164r859q901q509q813r141q520o943n248l818k367j178j252
58678D76473k720m094l886k356r18k61K73J607L741N757O814P096P597Q853J0212
58663E14188J0808J0829J1118J1634J1284R437O719L980J206k016n453q259r821
$$ plain form
58650 565654 555471 545692 536583 527995 519607 511199 502836 494846 487601 481212 475470 470176 465443 461413
58636 461413 457805 454105 450278 447014 445146 444960 446026 447502 448700 449648 450983 453073 455515 457897 460653
58621 460653 464480 469193 474005 478797 484139 490012 495547 500255 504587 508964 513228 517363 521750 526251
58607 526251 530028 532926 536035 540129 544456 547987 551080 554848 559416 563846 567403 569920 571308 571712
58593 571712 572041 573406 576016 579261 582786 586839 591729 597585 604651 613296 623728 635930 649577 663764
58579 663764 677275 689597 701194 712297 722046 729544 735225 740410 745981 752281 759849 769230 780360
58566 780360 793044 807786 825165 844661 865191 886674 909952 935042 960488 984691 1007002
58555 1007002 1027283 1045272 1060733 1073520 1083137 1088852 1090617 1089338 1085931 1080512 1072796 1062838 1051116
$$ packed form
58650E65654j0183r779r109q588q388q408q363p990p245o389n742n294m733m030
58636D61413l608l700l827l264j868j86J066J476J198R48J335K090K442K382K756
58621D60653L827M713M812M792N342N873N535M708M332M377M264M135M387M501
58607E26251L777K898L109M094M327L531L093L768M568M430L557K517J388M04
58593E71712L29J365K610L245L525M053M890N856P066Q645J0432J2202J3647J4187
58579F63764J3511J2322J1597J1103R749P498N681N185N571O300P568R381J1130
58566G80360J2684J4742J7379J9496K0530K1483K3278K5090K5446K4203K2311
58555A007002K0281J7989J5461J2787R617N715J765j279l407n419p716r958j1722
$$ plain form
58542 1051116 1038153 1024292 1009527 993389 975190 954543 931568 906745 880829 854757 829297
58531 829297 804817 781592 760131 740937 724191 709984 698499 689538 682274 676124 671588 669503
58519 669503 669590 670449 670988 671199 671458 671752 671816 671562 671099 670541 669905 669053 667770 666054 664148 662223 660331 658842
58501 658842 658389 658974 659651 659629 659189 658976 658942 658775 658806 659557 660703 661486 661948 662854 664613 667376 672033 679821
58483 679821 690693 703187 716343 730823 747643 766634 786829 807714 829323 851272 872259
58472 872259 890522 904579 913678 917753 917054 911911 902925 891101 877444 862645 847487 833321 821588
58459 821588 812871 806806 802857 800823 800681 802410 805950 811043 817107 823435 829368 834165 837052 837641 835939
58444 835939 831835 825119 816306 806694 797127 787361 777231 767692 759908 753994 749495 746517 745416 745921
$$ packed form
58542A051116j2963j3861j4765j6138j8199k0647k2975k4823k5916k6072k5460
58531H29297k4480k3225k1461j9194j6746j4207j1485q961p264o150m536k085
58519F69503Q7Q59N39K11K59K94O4k54m63n58o36q52j283j716j906j925j892j489
58501F58842m53N85O77k2m40k13l4j67L1P51J146P83M62R06J759K763M657P788
58483F79821J0872J2494J3156J4480J6820J8991K0195K0885K1609K1949K0987
58472H72259J8263J4057R099M075o99n143q986j1824j3657j4799j5158j4166j1733
58459H21588q717o065l949k034j42J729L540N093O064O328N933M797K887N89j702
58444H35939m104o716q813r612r567r766j0130r539p784n914m499k978j101N05
$$ plain form
58430 745921 747616 750850 756097 762777 769847 777288 785893 795763 806123 816474 826794 836627 844987
58417 844987 851204 855029 856077 854116 849733 843729 836003 826101 814694 803377 792991 783162 773473
58404 773473 764095 755300 747428 741298 737582 735747 734586 733771 733897 735175 737212 739995 743858 748411 752667
58389 752667 756217 759198 761212 761619 760909 760349 760126 759198 757245 755409 754787 755449 757336 760794 765730 771314
58373 771314 777047 783237 790030 796969 803773 810674 817828 825309 833680 843501 854258 864920 875472
58360 875472 886610 898003 908483 918077 928118 938943 949104 957400 964174 969909 974081 976253 977080
58347 977080 977459 977709 978242 979920 983098 987240 992022 997942 1005485 1014645 1025467 1037983 1051444 1064798
58333 1064798 1078079 1092090 1106672 1120758 1134206 1147872 1161566 1173706 1183506 1191851 1199449 1205798
$$ packed form
58430G45921J695L234N247O680P070P441Q605R870J0360J0351J0320R833Q360
58417H44987O217L825J048j961m383o004p726r902j1407j1317j0386r829r689
58404G73473r378q795p872o130l716j835j161q15J26J278K037K783L863M553M256
58389G52667L550K981K014M07p10n60k23r28j953j836o22O62J887L458M936N584
58373G71314N733O190O793O939O804O901P154P481Q371R821J0757J0662J0552
58360H75472J1138J1393J0480R594J0041J0825J0161Q296O774N735M172K172Q27
58347I77080L79K50N33J678L178M142M782N920P543R160J0822J2516J3461J3354
58333A064798J3281J4011J4582J4086J3448J3666J3694J2140R800Q345P598O349
$$ plain form
58321 1205798 1210549 1214259 1217128 1218629 1219018 1219617 1220952 1222221 1223189 1224897 1227817 1231149 1234737 1239976 1247910
58306 1247910 1258091 1270039 1284123 1300136 1316762 1333276 1350061 1366788 1382074 1395762 1409427
58295 1409427 1423722 1437446 1450355 1464452 1480994 1498441 1515144 1532147 1551527 1573730 1598219
58284 1598219 1625063 1654005 1683440 1712051 1740317 1769038 1797810 1826279 1855329 1885598 1916308
58273 1916308 1946962 1978787 2013211 2050395 2090237 2133096 2178471 2224860 2272047 2321570 2373951
58262 2373951 2427687 2482117 2538757 2598423 2659512 2720618 2782221 2844319 2905170 2964270 3023875
58251 3023875 3085733 3149001 3213184 3280142 3351124 3424968 3501486 3583467 3672794 3767716 3866614
58240 3866614 3971275 4083652 4202696 4327422 4459882 4601888 4751952 4908798 5074787
$$ packed form
58321A205798M751L710K869J501L89N99J335J269R68J708K920L332L588N239P934
58306A247910J0181J1948J4084J6013J6626J6514J6785J6727J5286J3688J3665
58295A409427J4295J3724J2909J4097J6542J7447J6703J7003J9380K2203K4489
58284A598219K6844K8942K9435K8611K8266K8721K8772K8469K9050L0269L0710
58273A916308L0654L1825L4424L7184L9842M2859M5375M6389M7187M9523N2381
58262B373951N3736N4430N6640N9666O1089O1106O1603O2098O0851N9100N9605
58251C023875O1858O3268O4183O6958P0982P3844P6518Q1981Q9327R4922R8898
58240C866614J04661J12377J19044J24726J32460J42006J50064J56846J65989
$$ plain form
58231 5074787 5252619 5442006 5643014 5859200 6093793 6346267 6616440 6908201 7225221
58222 7225221 7566917 7932980 8327981 8757019 9221063 9721525 10265322 10860419 11510733
58213 11510733 12220731 13000540 13861251 14810620 15859829 17029590 18343516 19821772 21488809
58204 21488809 23381990 25546459 28030489 30897005 34235468 38157790 42797145 48327690
58196 48327690 54980441 63029989 72776376 84547096 98682926 115469008 135058186
58189 135058186 157462596 182599466 210311935 240325894 272116825 304610134 335757634
58182 335757634 362376784 380743232 387887768 382800636 366687355 342209139 312412466
58175 312412466 280030831 247265434 215776273 186695194 160662038 137909103 118367611
$$ packed form
58231E074787J77832J89387K01008K16186K34593K52474K70173K91761L17020
58222G225221L41696L66063L95001M29038M64044N00462N43797N95097O50314
58213A1510733P09998P79809Q60711R49369J049209J169761J313926J478256J667037
58204B1488809J893181K164469K484030K866516L338463L922322M639355N530545
58196D8327690O652751Q049548R746387J1770720J4135830J6786082J9589178
58189A35058186K2404410K5136870K7712469L0013959L1790931L2493309L1147500
58182C35757634K6619150J8366448P144536n087132j6113281k4478216k9796673
58175C12412466l2381635l2765397l1489161k9081079k6033156k2752935j9541492
$$ plain form
58168 118367611 101774673 87777256 76011404 66135030 57833378 50829692 44897865
58161 44897865 39856834 35554589 31863417 28682691 25932624 23543785 21456706 19625837
58153 19625837 18014495 16587370 15313371 14171569 13146875 12222284 11381462 10615728
58145 10615728 9921479 9292475 8720328 8200202 7729789 7303999 6915944 6561719 6239188
58136 6239188 5943477 5668400 5411018 5170240 4942380 4722700 4510345 4307534 4114873
58127 4114873 3931412 3758128 3597154 3448111 3308814 3178833 3058944 2947957 2843575
58118 2843575 2745693 2655539 2572293 2493757 2419685 2351294 2288034 2227885 2170284 2115851 2063680
58107 2063680 2011777 1959890 1909293 1860103 1811217 1762478 1714555 1667215 1620062 1574486 1532527
$$ packed form
58168A18367611j6592938j3997417j1765852r876374q301652p003686n931827
58161D4897865n041031m302245l691172l180726k750067k388839k087079j830869
58153A9625837j611342j427125j273999j141802j024694r24591q40822p65734
58145A0615728o94249o29004n72147n20126m70413m25790l88055l54225l22531
58136F239188k95711k75077k57382k40778k27860k19680k12355k02811j92661
58127D114873j83461j73284j60974j49043j39297j29981j19889j10987j04382
58118B843575r7882r0154q3246p8536p4072o8391o3260o0149n7601n4433n2171
58107B063680n1903n1887n0597m9190m8886m8739m7923m7340m7153m5576m1959
$$ plain form
58096 1532527 1494207 1458114 1424031 1392748 1363860 1336105 1309505 1284932 1261952 1239306 1217338
58085 1217338 1197766 1181116 1166162 1151809 1137848 1124042 1110003 1095732 1080952 1064491 1045675
58074 1045675 1025556 1005306 984322 961585 937963 915274 893873 873098 853328 835579 819644
58063 819644 804600 790704 778906 769019 760164 752424 746174 740353 733424 725575 718023 710646 702309
58050 702309 693145 684362 676085 667450 658716 651229 645366 640380 636135 633021 630197 625955 620053 613861
58036 613861 608031 601759 594525 586875 579235 571559 564267 557918 551718 543998 534453 524453 514910 505335
58022 505335 495325 485542 476810 469372 463234 458085 452858 446639 440117 434879 431238 428118 425058 422825
58008 422825 421829 421422 421139 421298 421997 422693 423168 423819 424790 425854 427317 429894 433535 437486 441616 446500
$$ packed form
58096A532527l8320l6093l4083l1283k8888k7755k6600k4573k2980k2646k1968
58085A217338j9572j6650j4954j4353j3961j3806j4039j4271j4780j6461j8816
58074A045675k0119k0250k0984k2737k3622k2689k1401k0775j9770j7749j5935
58063H19644j5044j3896j1798r887q855p740o250n821o929p849p552p377q337
58050G02309r164q783q277q635q734p487n863m986m245l114k824m242n902o192
58036F13861n830o272p234p650p640p676p292o349o200p720r545j0000r543r575
58022E05335j0010r783q732p438o138n149n227o219o522n238l641l120l060k233
58008D22825r96m07k83J59O99O96M75O51R71J064J463K577L641L951M130M884
$$ plain form
57992 446500 452117 457743 463331 469649 476666 483030 487585 490345 491701 491769 490844 489347 486874 482344 475577
57977 475577 467798 460178 452803 445494 438660 432794 427790 423270 419016 414904 410993 407813 405913 405048
57963 405048 404434 403690 402834 401571 399576 397405 396006 395357 394606 393598 393086 393294 393466 393117 392730 392932 393955
57946 393955 396116 399765 404469 409230 413860 419232 425946 433707 442233 451788 462471 473894 485774
57933 485774 497901 509419 519324 527939 536624 545453 552390 555437 554630 551280 546221 539637 531727 522611
57919 522611 512054 500022 487127 474102 461315 449195 438483 429481 421546 413827 406191 399110
57907 399110 393109 388625 385877 384510 383692 382747 381305 378871 375040 370317 365963 362668 359959 357246 354787
57892 354787 353364 353577 355793 360066 365692 371374 376327 380902 385867 391392 396888 401505 404695 406606
$$ packed form
57992D46500N617N626N588O318P017O364M555K760J356O8r25j497k473m530o767
57977D75577p779p620p375p309o834n866n004m520m254m112l911l180j900q65
57963D05048o14p44q56j263j995k171j399o49p51j008n12K08J72l49l87K02J023
57946C93955K161L649M704M761M630N372O714P761Q526R555J0683J1423J1880
57933D85774J2127J1518R905Q615Q685Q829O937L047q07l350n059o584p910r116
57919E22611j0557j2032j2895j3025j2787j2120j0712r002p935p719p636p081
57907C99110o001m484k748j367q18r45j442k434l831m723m354l295k709k713k459
57892C54787j423K13K216M273N626N682M953M575M965N525N496M617L190J911
$$ plain form
57878 406606 407904 408847 408787 407077 404128 400728 396622 390850 383478 375865 369110 363233 358075 353891 350710
57863 350710 348066 345787 344265 343701 343962 345335 348388 352714 356871 360049 362882 366183 369815 373303 376540
57848 376540 379264 380729 380581 379340 377451 374634 370736 366423 362344 358331 354032 349667 345540 341424
57834 341424 337069 332738 328757 325143 322157 320510 320489 321532 323145 325552 328935 332814 336690 340518 344049
57819 344049 346596 348129 349679 351891 354010 355078 355256 355086 354312 352553 350382 348510 346376 342715 337253
57804 337253 330885 324584 319078 315128 312948 311552 309809 308016 307434 308368 309783 310815 311568 312240 312425
57789 312425 311766 310623 309644 309068 308749 308615 308959 310390 313396 317782 322752 327819 333332 339769 346821 353630
57773 353630 359596 364473 368010 370159 371521 372903 374420 375443 375330 373822 370851 366530 361339 355915
$$ packed form
57878D06606J298R43o0j710k949l400m106n772p372p613o755n877n158m184l181
57863C50710k644k279j522n64K61J373L053M326M157L178K833L301L632L488L237
57848C76540K724J465j48j241j889k817l898m313m079m013m299m365m127m116
57834C41424m355m331l981l614k986j647k1J043J613K407L383L879L876L828L531
57819C44049K547J533J550K212K119J068J78j70p74j759k171j872k134l661n462
57804C37253o368o301n506l950k180j396j743j793n82R34J415J032P53O72J85
57789C12425o59j143r79n76l19j34L44J431L006M386M970N067N513O437P052O809
57773C53630N966M877L537K149J362J382J517J023j13j508k971m321n191n424
$$ plain form
57759 355915 350630 345656 341314 337969 335553 333422 330718 326888 322094 317185 312960 309298 305411 301022
57745 301022 296757 293205 290265 287770 286018 285155 284646 284035 283662 283937 284369 284139 283299 282610 282401 282290 281849
57728 281849 280885 279235 276922 274423 272189 270075 267785 265616 264129 263237 262287 260902 259151 257062 254648
57713 254648 252335 250689 249758 249217 249003 249138 249068 247995 245963 243913 242556 241892 242040 243802 247896 253937
57697 253937 260610 266743 272034 276829 281304 284876 286554 285945 283657 280547 276878 272579 267967 263666
57683 263666 259979 256865 254541 253681 255036 259146 266344 276699 290066 306529 326792 351891 382668
57670 382668 419693 463327 513478 569469 630418 695295 761894 825707 880168 918110 933441
57659 933441 922810 887205 832162 765675 695243 626382 562728 506294 457544 416071 381512
$$ packed form
57759C55915n285m974m342l345k416k131k704l830m794m909m225l662l887m389
57745C01022m265l552k940k495j752q63n09o11l73K75M32k30q40o89k09j11m41
57728B81849r64j650k313k499k234k114k290k169j487q92r50j385j751k089k414
57713B54648k313j646r31n41k14J35p0j073k032k050j357o64J48J762M094O041
57697B53937O673O133N291M795M475L572J678o09k288l110l669m299m612m301
57683B63666l687l114k324q60J355M110P198J0355J3367J6463K0263K5099L0777
57670C82668L7025M3634N0151N5991O0949O4877O6599O3813N4461L7942J5331
57659I33441j0631l5605n5043o6487p0432o8861o3654n6434m8750m1473l4559
$$ plain form
57648 381512 353584 331455 313700 298953 286223 274799 264408 255317 247678 240873 234150 227794
57636 227794 222864 219657 217124 214093 210461 206907 203910 201496 199636 198420 197822 197477 196780 195304 193197
57621 193197 190996 188975 186845 184225 181096 177657 174130 170949 168643 167089 165352 162864 160381 159094
57607 159094 159088 159394 159361 159222 159316 159487 159411 158989 158312 157567 156920 156182 154772 152362 149325 146167 142900 139530
57589 139530 136637 134663 132942 130399 127081 124064 121873 119916 117612 115122 112735 110325 107780 105375
57575 105375 103420 101977 100999 100232 98981 96672 93748 91356 89956 88884 87428 85693 84209 83321 83202
57560 83202 83873 84932 85725 85923 85491 84213 82007 79693 78537 78723 79141 78977 78640 78658 78561 77606 76065 75006
57542 75006 75149 76474 78658 81323 84049 86587 89026 91616 94562 97924 101272 103405 103092 100412 96806
$$ packed form
57648C81512k7928k2129j7755j4747j2730j1424j0391r091p639o805o723o356
57636B27794m930l207k533l031l632l554k997k414j860j216n98l45o97j476k107
57621A93197k201k021k130k620l129l439l527l181k306j554j737k488k483j287
57607A59094oL06l3j39R4J71p6m22o77p45o47p38j410k410l037l158l267l370
57589A39530k893j974j721k543l318l017k191j957k304k490k387k410k545k405
57575A05375j955j443r78p67j251k309k924k392j400j072j456j735j484q88j19
57560H3202O71J059P93J98m32j278k206k314j156J86M18j64l37J8r7r55j541j059
57542G5006J43J325K184K665K726K538K439K590K946L362L348K133l13k680l606
$$ plain form
57527 96806 93538 90616 87481 84046 80571 77063 73415 69739 66107 62243 57956 53554 49474 45859
57513 45859 42869 40992 40541 41157 42241 43655 45656 48421 52006 56459 61576 66895 72203 77669 83132
57498 83132 87783 91116 93674 96262 98776 100503 101233 101276 100602 98832 96103 93170 90494 87894 85260
57483 85260 82992 81396 80142 78656 76769 74746 72981 71825 71368 71088 70025 67718 64837 62532 61179
57468 61179 60126 58670 56883 55240 53784 52092 50025 47983 46229 44369 41920 39240 37448 37369 38792
57453 38792 40756 42282 42828 42428 41622 41109 41244 41842 42396 42433 41782 40749 40001 40086 41082 42744 44827 46986
57435 46986 48670 49547 49931 50341 50670 50341 49328 48471 48504 49201 49779 49833 49548 49186 48698 47872 46657 45272
57417 45272 43939 42589 41069 39685 39118 39488 39904 39446 38326 37462 37220 37317 37769 38937 40502 41378 41033
$$ packed form
57527I6806l268k922l135l435l475l508l648l676l632l864m287m402m080l615
57513D5859k990j877m51O16J084J414K001K765L585M453N117N319N308N466N463
57498H3132M651L333K558K588K514J727P30M3o74j770k729k933k676k600k634
57483H5260k268j596j254j486j887k023j765j156m57k80j063k307k881k305j353
57468F1179j053j456j787j643j456j692k067k042j754j860k449k680j792p9J423
57453C8792J964J526N46m00q06n13J35N98N54L7o51j033p48Q5R96J662K083K159
57435D6986J684Q77L84M10L29l29j013q57L3O97N78N4k85l62m88q26j215j385
57417D5272j333j350j520j384n67L70M16m58j120q64k42R7M52J168J565Q76l45
$$ plain form
57400 41033 40168 39689 39683 39858 40277 40951 41177 40031 37422 34235 31615 30339 30517 31483 32236 32433 32694 33620
57382 33620 34819 35375 35054 34536 34521 35102 35992 36961 37889 38656 39179 39557 40043 40762 41458 41737 41701 42021 42993
57363 42993 43839 43477 41849 39858 38085 36372 34680 33417 32578 31427 29603 27836 26955 26766 26579 26383
57347 26383 26739 27744 28806 29365 29411 29397 29948 31382 33154 34117 33833 33324 33975 35863 37760 38610 38405 37606
57329 37606 36376 34634 32509 30377 28502 26739 24681 22109 19220 16221 12891 8966 4910 1681
57314 -391 -1964 -3633 -5126 -5982 -6427 -6954 -7502 -7720 -7796 -8281 -9116 -9509 -8908 -7740 -7009 -7416 -8889 -10800
57296 -10800 -12605 -14271 -15991 -17578 -18490 -18567 -18308 -18287 -18689 -19519 -20699 -21652 -21423 -19705 -17282 -15006 -12785
57279 -12785 -10194 -7548 -5663 -4787 -4536 -4737 -5629 -7227 -9026 -10466 -11373 -11965 -12681 -13828 -15080 -15564
$$ packed form
57400D1033q65m79oJ75M19O74K26j146k609l187k620j276J78R66P53J97K61R26
57382C3620J199N56l21n18j5N81Q90R69R28P67N23L78M86P19O96K79l6L20R72
57363D2993Q46l62j628j991j773j713j692j263q39j151j824j767q81j89j87j96
57347B6383L56J005J062N59M6j4N51J434J772R63k84n09O51J888J897Q50k05p99
57329C7606j230j742k125k132j875j763k058k572k889k999l330l925m056A681
57314c91j573j669j493q56m45n27n48k18p6m85q35l93O01J168P31m07j473j911
57296a0800j805j666j720j587r12p7K59K1m02q30j180r53K29J718K423K276K221
57279a2785K591K646J885Q76K51k01q92j598j799j440r07n92p16j147j252m84
$$ plain form
57263 -15564 -14779 -13204 -11679 -10482 -9460 -8680 -8357 -8302 -8024 -7277 -6085 -4342 -1874 1225 4748 8676
57247 8676 12956 17178 20950 24413 27847 30956 33165 34498 35586 36841 38156 39386 40559 41627 42524
57232 42524 43567 45344 48121 51633 55372 58740 61187 62730 64252 66748 70289 74273 78626 84128
57218 84128 91477 100587 110858 121523 131605 140206 147280 153739 160501 167716 175119 182688 190526 198350
57204 198350 205660 212512 219832 228739 239586 251717 264101 275993 286931 296367 303700 308718 311759
57191 311759 313334 313778 313238 311697 309089 305788 303002 302167 303783 307244 311875 317620 324548 332312 340401
57176 340401 348402 355720 361688 366422 371017 376442 382687 389337 396380 403903 411656 419622 428513 439027
57162 439027 450984 463741 477003 490551 503687 515753 526812 537071 546036 553096 558614 563535
$$ packed form
57263a5564P85J575J525J197J022P80L23N5K78P47J192J743a874A225L523L928
57247H676M280M222L772L463L434L109K209J333J088J255J315J230J173J068Q97
57232D2524J043J777K777L512L739L368K447J543J522K496L541L984M353N502
57218H4128P349R110J0271J0665J0082Q601P074O459O762P215P403P569P838P824
57204A98350P310O852P320Q907J0847J2131J2384J1892J0938R436P333N018L041
57191C11759J575M44n40j541k608l301k786q35J616L461M631N745O928P764Q089
57176C40401Q001P318N968M734M595N425O245O650P043P523P753P966Q891J0514
57162D39027J1957J2757J3262J3548J3136J2066J1059J0259Q965P060N518M921
$$ plain form
57150 563535 568137 572058 575462 579209 583703 588212 591509 592825 592214 590370 587974 584916 580377 573880
57136 573880 565684 555801 543362 527630 509039 488382 465504 439702 410942 379752 346197 309854
57124 309854 270607 228757 184712 139304 93898 49205 4220 -42850 -93117 -147269 -206895 -274396
57112 -274396 -351901 -441441 -546163 -670731 -820830 -1002841 -1223127 -1486300 -1794398 -2148635
57102 -2148635 -2551684 -3007980 -3523379 -4106337 -4769200 -5527703 -6400977 -7414675 -8604473
57093 -8604473 -10015555 -11698469 -13703336 -16071137 -18822473 -21951300 -25429773 -29219266
57085 -29219266 -33279438 -37576830 -42096498 -46846179 -51835922 -57034506 -62326315 -67493036
57077 -67493036 -72231272 -76207252 -79135208 -80841114 -81269716 -80436318 -78376632 -75143223
$$ packed form
57150E63535M602L921L404L747M494M509L297J316o11j844k396l058m539o497
57136E73880q196r883j2439j5732j8591k0657k2878k5802k8760l1190l3555l6343
57124C09854l9247m1850m4045m5408m5406m4693D220d2850n0267n4152n9626o7501
57112b74396p7505q9540j04722j24568j50099j82011k20286k63173l08098l54237
57102b148635m03049m56296n15399n82958o62863p58503q73274j013698j189798
57093h604473j411082j682914k004867k367801k751336l128827l478473l789493
57085b9219266m060172m297392m519668m749681m989743n198584n291809n166721
57077f7493036m738236l975980k927956j705906m28602Q33398K059686L233409
$$ plain form
57069 -75143223 -70839508 -65644596 -59803196 -53593786 -47295979 -41162778 -35397815 -30142863
57061 -30142863 -25478433 -21432047 -17988586 -15102618 -12712016 -10748485 -9143435 -7832435
57053 -7832435 -6759553 -5878747 -5151906 -4547419 -4040666 -3613358 -3250797 -2940410 -2672797
57044 -2672797 -2441865 -2242486 -2068850 -1915616 -1779382 -1658144 -1550172 -1453815 -1367398 -1288795
57034 -1288795 -1215971 -1148236 -1085914 -1028546 -974543 -922799 -873219 -825207 -777149 -728075 -678492
57023 -678492 -628742 -578047 -526555 -477404 -435229 -402777 -379673 -363782 -352612 -343777 -335510 -327237
57011 -327237 -319264 -311814 -304689 -297696 -290871 -284095 -276799 -268302 -258567 -248537 -239468 -231801 -224931 -218192
56997 -218192 -211623 -205469 -199476 -193273 -186912 -180315 -172598 -162936 -151792 -140283 -128459 -115263 -100167
$$ packed form
57069g5143223M303715N194912N841400O209410O297807O133201N764963N254952
57061c0142863M664430M046386L443461K885968K390602J963531J605050J311000
57053g832435J072882Q80806P26841O04487N06753M27308L62561L10387K67613
57044b672797K30932J99379J73636J53234J36234J21238J07972R6357Q6417P8603
57034a288795P2824O7735O2322N7368N4003N1744M9580M8012M8058M9074M9583
57023f78492M9750N0695N1492M9151M2175L2452K3104J5891J1170Q835Q267Q273
57011c27237P973P450P125O993O825O776P296Q497R735J0030R069P667O870O739
56997b18192O569O154N993O203O361O597P717R662J1144J1509J1824J3196J5096
$$ plain form
56984 -100167 -83763 -66617 -48652 -30014 -11650 5285 19848 30908 37358 39068 37003 32243
56972 32243 25724 19004 14059 11724 11227 11825 14034 18639 25410 33599 43120 54402 67489 81983
56958 81983 97547 113928 130786 147881 165007 181261 194757 203531 206502 203462 194889 182267
56946 182267 168050 154591 143235 134622 129191 126841 126654 127765 130272 134858 141824 151045 162497
56933 162497 176227 192035 209725 229448 251175 273883 295539 313659 325638 329201 323506 309892
56921 309892 291008 269225 246155 223285 202171 183827 168477 156044 146428 139165 133341 128211
56909 128211 123739 120322 118103 116715 115530 114049 112197 110385 109268 109309 110468 112292 114361 116702 119766
56894 119766 123991 129531 136525 145382 156441 169378 183346 197881 213348 230316 248687 267558
$$ packed form
56984a00167J6404J7146J7965J8638a1650E285J4563J1060O450J710k065m760
56972C2243o519o720m945k335m97N98K209M605O771Q189R521J1282J3087J4494
56958H1983J5564J6381J6858J7095J7126J6254J3496Q774K971l040q573j2622
56946A82267j4217j3459j1356q613n431k350j87J111K507M586O966R221J1452
56933A62497J3730J5808J7690J9723K1727K2708K1656J8120J1979L563n695j3614
56921C09892j8884k1783k3070k2870k1114j8344j5350j2433r616p263n824n130
56909A28211m472l417k219j388j185j481j852j812j117M1J159J824K069K341L064
56894A19766M225N540O994Q857J1059J2937J3968J4535J5467J6968J8371J8871
$$ plain form
56882 267558 285599 301265 312914 319246 319905 315590 307633 297539 286843 277081 269549 264965 263422
56869 263422 264803 269234 277054 288415 303294 322017 345430 374194 408036 445919 486794 529805
56857 529805 573734 616373 654320 683279 699182 699984 686831 663349 633745 601563 569703 540682
56845 540682 516398 497904 485733 480408 482590 492834 511231 537322 570572 611011 659068 714546
56833 714546 776078 841786 909745 976827 1037197 1082990 1107198 1106268 1080736 1034493 973690 905372
56821 905372 836002 770574 712393 663075 622843 591480 569176 556293 552627 557517 570605 591799
56809 591799 620492 655499 695872 741026 789705 839060 884703 921133 942417 943902 924375 886680
56797 886680 836135 778485 718856 661258 608226 561165 521275 489626 466177 449507 438169
$$ packed form
56882B67558J8041J5666J1649O332O59m315p957j0094j0696r762p532m584j543
56869B63422J381M431P820J1361J4879J8723K3413K8764L3842L7883M0875M3011
56857E29805M3929M2639L7947K8959J5903Q02j3153k3482k9604l2182l1860k9021
56845E40682k4284j8494j2171n325K182J0244J8397K6091L3250M0439M8057N5478
56833G14546O1532O5708O7959O7082O0370M5793K4208r30k5532m6243o0803o8318
56821I05372o9370o5428n8181m9318m0232l1363k2304j2883l666M890J3088K1194
56809E91799K8693L5007M0373M5154M8679M9355M5643L6430K1284J485j9527l7695
56797H86680n0545n7650n9629n7598n3032m7061l9890l1649k3449j6670j1338
$$ plain form
56786 438169 431888 431041 435528 444827 458775 477477 500417 526125 552672 577920 599095 612530
56774 612530 614637 603795 581604 552007 518860 484344 449662 416386 386226 359820 336763 316780
56762 316780 299909 285495 272208 259530 248325 239402 232297 226109 220738 216497 213074 209760 206410
56749 206410 203450 201073 199039 197132 195372 193837 192630 191815 191102 189856 187757 185205 182820 180840 179299
56734 179299 178386 178215 178505 178846 179022 178866 178198 177314 177053 177877 179198 180133 180638 181362 182564 183759 184400 184551
56716 184551 184864 186079 188417 191311 193940 196128 198363 200804 202878 204267 205687 208000 210910 213265
56702 213265 214547 215410 216739 218697 220820 222591 223796 224584 225366 226521 228168 230198 232378 234337 235666
56687 235666 236192 236065 235514 234713 233862 233076 232051 230194 227271 223682 220021 216659 213787 211421 209213 206791
$$ packed form
56786D38169o281q47M487R299J3948J8702K2940K5708K6547K5248K1175J3435
56774F12530K107j0842k2191k9597l3147l4516l4682l3276l0160k6406k3057j9983
56762C16780j6871j4414j3287j2678j1205q923p105o188n371m241l423l314l350
56749B06410k960k377k034j907j760j535j207q15p13j246k099k552k385j980j541
56734A79299r13j71K90L41J76j56o68q84k61Q24J321R35N05P24J202J195O41J51
56716A84551L13J215K338K894K629K188K235K441K074J389J420K313K910K355
56702B13265J282Q63J329J958K123J771J205P88P82J155J647K030K180J959J329
56687B35666N26j27n51q01q51p86j025j857k923l589l661l362k872k366k208k422
$$ plain form
56671 206791 204447 203028 202839 203166 203243 203237 203840 205231 206905 208332 209450 210617 212290 214594 217191 219794
56655 219794 222743 226631 231419 236505 241643 247056 252599 257698 262358 267240 272325 276477 278932 280383
56641 280383 281871 283417 284508 285082 285050 283530 279751 274359 268808 263666 258476 252998 247558 242249 236784
56626 236784 231312 226565 222986 220247 217809 215468 213277 211291 209443 207481 205186 202822 200982 199722
56612 199722 198349 196511 194892 194185 193893 192942 191107 189056 187277 185817 184791 184324 184165 184162 184852 186674
56596 186674 188747 189508 188701 187779 188137 189744 191780 193763 195603 197169 198338 199192 199838 200227 200322 200198 199878
56579 199878 199262 198397 197682 197738 198990 201206 203443 204797 205319 205823 206740 207725 208633 210064 212421 215105 217400
56562 217400 219713 223114 228014 233962 240454 247171 253654 259441 264391 268401 271106 272416 272956 273379 273740
$$ packed form
56671B06791k344j419j89L27P7oO03J391J674J427J118J167J673K304K597K603
56655B19794K949L888M788N086N138N413N543N099M660M882N085M152K455J451
56641B80383J488J546J091N74l2j520l779n392n551n142n190n478n440n309n465
56626B36784n472m747l579k739k438k341k191j986j848j962k295k364j840j260
56612A99722j373j838j619p07k92r51j835k051j779j460j026m67j59lO90J822
56596A86674K073P61q07r22L58J607K036J983J840J566J169Q54O46L89R5j24l20
56579A99878o16q65p15N6J252K216K237J354N22N04R17R85R08J431K357K684K295
56562B17400K313L401M900N948O492O717O483N787M950M010K705J310N40M23L61
$$ plain form
56547 273740 274118 275223 277442 279817 280997 280855 280163 279129 277400 275221 273274 271440 268894 265449 261726
56532 261726 257981 253942 249920 246896 245144 243784 242041 240156 238716 237825 237240 236724 236096 235414 235049 235048
56516 235048 234754 233788 233017 233408 234267 233976 232381 230994 230643 230385 229174 227200 225003 222560 220010 218139
56500 218139 217258 216421 214586 211933 209439 207803 207320 208042 209402 210307 210273 209990 210332 211317 212431 213380 214117
56483 214117 214677 215347 216435 217567 217907 217316 216512 215819 214770 213457 213216 215093 218360 221388 223468 224998
56467 224998 226361 227448 228036 228002 227337 226359 225628 225337 225170 224939 224778 224468 223349 221427 219870 219779 220977
56450 220977 222557 224017 225221 225826 225604 225068 225046 225714 226504 226798 226418 225718 225487 226412 228316 230361 232203
56433 232203 234399 237336 240342 242412 243338 243694 244151 245242 247229 249664 251464 251969 251610 251193 250965 250698
$$ packed form
56547B73740L78J105K219K375J180j42o92j034j729k179j947j834k546l445l723
56532B61726l745m039m022l024j752j360j743j885j440q91n85n16o28o82l65j
56516B35048k94r66p71L91Q59k91j595j387l51k58j211j974k197k443k550j871
56500B18139q81q37j835k653k494j636m83P22J360R05l4k83L42R85J114R49P37
56483B14117N60O70J088J132L40n91q04o93j049j313k41J877L267L028K080J530
56467B24998J363J087N88l4o65r78p31k91j67k31j61l10j119j922j557r1J198
56450B20977J580J460J204O05k22n36k2O68P90K94l80p00k31R25J904K045J842
56433B32203K196K937L006K070R26L56M57J091J987K435J800N05l59m17k28k67
$$ plain form
56417 250698 250223 249408 248134 246717 245848 245628 245126 243425 240689 237781 235270 233267 231690 230147 228047
56402 228047 225400 223095 221892 221578 221582 221821 222299 222356 221174 218879 216465 214774 214032 214172 215151 217055 220147
56385 220147 224566 229700 234311 237590 239754 241370 242695 243984 245647 247492 248458 247855 246422 245402 244929
56370 244929 244059 242187 239793 237982 237763 239517 242676 246146 249376 252696 256279 259429 261466 262807 264476
56355 264476 266957 270156 274020 278465 282951 286907 290348 293468 295817 296651 296014 294900 294334 294680 295688
56340 295688 296748 297200 296835 296110 295649 295715 296302 297373 298809 300459 302472 305146 308314 311471 314676 318576
56324 318576 323221 327640 331071 333766 336008 337352 337718 338391 340761 344504 348028 350378 351741 352507 352994
56309 352994 353969 356315 360019 364220 368340 372597 377455 383178 389847 397191 404505 411275 417836 424782
$$ packed form
56417B50698m75q15j274j417q69k20n02j701k736k908k511k003j577j543k100
56402B28047k647k305j203l14MK39M78N7j182k295k414j691p42J40R79J904L092
56385B20147M419N134M611L279K164J616J325J289J663J845R66o03j433j020m73
56370B44929q70j872k394j811k19J754L159L470L230L320L583L150K037J341J669
56355B64476K481L199L864M445M486L956L441L120K349Q34o37j114n66L46J008
56340B95688J060M52l65p25m61O6N87J071J436J650K013K674L168L157L205L900
56324C18576M645M419L431K695K242J344L66O73K370L743L524K350J363P66M87
56309C52994R75K346L704M201M120M257M858N723O669P344P314O770O561O946
$$ plain form
56295 424782 431745 437252 439883 439319 436411 432560 428862 425543 422305 419279 417232 416679 417374 418988 421683
56280 421683 425623 430467 435806 441526 447389 452975 458545 465152 473245 481901 490165 498340 507039 515759
56266 515759 523585 530921 539396 550291 563931 580291 599226 620223 642825 667357 694671 725406
56254 725406 760019 799133 843120 891602 944020 1000452 1061441 1127380 1198444 1274375 1353750
56243 1353750 1434210 1514191 1593613 1671968 1746578 1813983 1872494 1922147 1962616 1992517 2010642
56232 2010642 2016695 2010859 1993528 1965539 1928042 1882296 1829995 1773138 1712943 1649595 1583822 1517805
56220 1517805 1453483 1390874 1329327 1269561 1212958 1159543 1108380 1059523 1013933 971691 931942
56209 931942 894512 860014 828439 799148 772287 748645 728016 709148 691554 675972 662769
$$ packed form
56295D24782O963N507K631n64k908l851l698l319l238l026k047n53O95J614K695
56280D21683L940M844N339N720N863N586N570O607Q093Q656Q264Q175Q699Q720
56266E15759P826P336Q475J0895J3640J6360J8935K0997K2602K4532K7314L0735
56254G25406L4613L9114M3987M8482N2418N6432O0989O5939P1064P5931P9375
56243A353750Q0460P9981P9422P8355P4610O7405N8511M9653M0469K9901J8125
56232B010642O053n836j7331k7989l7497m5746n2301n6857o0195o3348o5773o6017
56220A517805o4322o2609o1547n9766n6603n3415n1163m8857m5590m2242l9749
56209I31942l7430l4498l1575k9291k6861k3642k0629j8868j7594j5582j3203
$$ plain form
56198 662769 651236 640795 631644 623801 616618 609705 603427 598174 593913 590629 588302 586329 583827 580751
56184 580751 577988 576262 575599 575800 576686 577903 579141 580431 581685 582408 582571 583150 584895 587221 589311 591609
56168 591609 594953 599014 603115 607940 614672 622830 630770 638159 646219 655612 665889 677030 689740
56155 689740 703994 718878 734250 751151 770456 792453 817832 847637 882162 921343 966305
56144 966305 1019121 1081124 1152930 1235988 1332280 1442330 1565021 1699248 1843806 1995385
56134 1995385 2148423 2297230 2436806 2562040 2668803 2756808 2829706 2891640 2944965 2991005
56124 2991005 3030376 3061573 3081203 3086841 3078565 3057505 3024797 2982512 2933397 2878228 2814484 2738369
56112 2738369 2647112 2539411 2415879 2280232 2138611 1996892 1859489 1730535 1613963 1511601
$$ packed form
56198F62769j1533j0441r151p843p183o913o278n253m261l284k327j973k502l076
56184E80751k763j726o63K01Q86J217J238J290J254P23J63N79J745K326K090K298
56168E91609L344M061M101M825O732Q158P940P389Q060R393J0277J1141J2710
56155F89740J4254J4884J5372J6901J9305K1997K5379K9805L4525L9181M4962
56144I66305N2816O2003P1806Q3058R6292J10050J22691J34227J44558J51579
56134A995385J53038J48807J39576J25234J06763Q8005P2898O1934N3325M6040
56124B991005L9371L1197J9630N638q276k1060l2708m2285m9115n5169o3744p6115
56112B738369r1257j07701j23532j35647j41621j41719j37403j28954j16572j02362
$$ plain form
56102 1511601 1422873 1346964 1283605 1231417 1187730 1150977 1121383 1098462 1079863 1063749 1050435
56091 1050435 1040571 1033487 1028411 1025530 1024662 1024579 1024822 1026584 1030553 1035324 1039139 1041851 1044243 1046879 1050646
56076 1050646 1056809 1065327 1074380 1082593 1090546 1099369 1109215 1119826 1131232 1143261 1155799 1169852 1186641
56063 1186641 1205352 1223795 1241677 1260808 1281485 1301268 1318313 1333432 1347719 1360706 1372264
56052 1372264 1383857 1396355 1408819 1420959 1434574 1451029 1469473 1489118 1511012 1535906 1562464
56041 1562464 1589286 1616698 1644962 1672823 1699523 1726254 1754080 1782404 1810894 1840747 1872638
56030 1872638 1905667 1939743 1976504 2016354 2057169 2097567 2138810 2181745 2224694 2266339 2308077
56019 2308077 2351586 2396735 2443748 2494462 2549446 2606869 2666315 2730524 2801119 2875967 2953276
$$ packed form
56102A511601q8728p5909o3359n2188m3687l6753k9594k2921j8599j6114j3314
56091A050435r864p084n076k881q68q3K43J762L969M771L815K712K392K636L767
56076A050646O163Q518R053Q213P953Q823R846J0611J1406J2029J2538J4053J6789
56063A186641J8711J8443J7882J9131K0677J9783J7045J5119J4287J2987J1558
56052A372264J1593J2498J2464J2140J3615J6455J8444J9645K1894K4894K6558
56041A562464K6822K7412K8264K7861K6700K6731K7826K8324K8490K9853L1891
56030A872638L3029L4076L6761L9850M0815M0398M1243M2935M2949M1645M1738
56019B308077M3509M5149M7013N0714N4984N7423N9446O4209P0595P4848P7309
$$ plain form
56008 2953276 3034832 3122313 3213833 3307306 3404152 3506542 3613983 3725812 3843914 3969771
55998 3969771 4101758 4238475 4381660 4532858 4690703 4854628 5027530 5211346 5403953
55989 5403953 5604266 5816494 6045455 6291580 6554589 6837870 7144893 7475472 7830085
55980 7830085 8213741 8631239 9083254 9571616 10103477 10685540 11319857 12010617 12769143
55971 12769143 13606868 14530423 15550330 16687520 17964464 19398271 21011415 22841927
55963 22841927 24935275 27337194 30107765 33336648 37137202 41641280 47019082 53497925
55955 53497925 61348359 70862422 82355741 96159044 112555009 131701240 153613049
55948 153613049 178197127 205275710 234584951 265710637 297817543 329138993 356620714
$$ packed form
56008B953276Q1556Q7481R1520R3473R6846J02390J07441J11829J18102J25857
55998C969771J31987J36717J43185J51198J57845J63925J72902J83816J92607
55989E403953K00313K12228K28961K46125K63009K83281L07023L30579L54613
55980G830085L83656M17498M52015M88362N31861N82063O34317O90760P58526
55971A2769143Q37725R23555J019907J137190J276944J433807J613144J830512
55963B2841927K093348K401919K770571L228883L800554M504078N377802O478843
55955E3497925P850434R514063J1493319J3803303J6395965J9146231K1911809
55948A53613049K4584078K7078583K9309241L1125686L2106906L1321450K7481721
$$ plain form
55941 356620714 376334312 384768839 380257345 363570158 337398368 305274058 270620602
55934 270620602 236210539 203960545 174952632 149607654 127908413 109578446 94206432
55927 94206432 81346387 70586486 61567639 53976748 47550862 42084806 37418883 33418455
55919 33418455 29970025 26986023 24397540 22142197 20165159 18425763 16892886 15535960
55911 15535960 14327152 13247877 12284935 11422628 10644845 9941352 9305260 8726974 8196649
55902 8196649 7709946 7265504 6859004 6484691 6139963 5823351 5530470 5256853 5002194
55893 5002194 4767088 4548163 4341159 4146188 3965218 3796840 3638318 3490422 3355195
55884 3355195 3230853 3113814 3004175 2904538 2814739 2732109 2655532 2584792 2517000 2448112 2377485
$$ packed form
55941C56620714J9713598Q434527m511494j6687187k6171790l2124310l4653456
55934B70620602l4410063l2249994k9007913k5344978k1699241j8329967j5372014
55927I4206432j2860045j0759901r018847p590891o425886n466056m665923m000428
55919C3418455l448430k984002k588483k255343j977038j739396j532877j356926
55911A5535960j208808j079275r62942q62307p77783p03493o36092n78286n30325
55902H196649m86703m44442m06500l74313l44728l16612k92881k73617k54659
55893E002194k35106k18925k07004j94971j80970j68378j58522j47896j35227
55884C355195j24342j17039j09639r9637q9799q2630p6577p0740o7792o8888p0627
$$ plain form
55873 2377485 2307277 2238183 2169341 2101462 2036336 1973841 1912872 1854519 1800949 1751668 1704149
55862 1704149 1657783 1614241 1574302 1537033 1501681 1467744 1433725 1398272 1362142 1326941 1292756
55851 1292756 1259112 1227018 1197558 1169634 1141688 1114494 1089489 1065473 1040042 1013503 988333
55840 988333 965360 943381 922122 902554 884439 866373 848358 831862 817269 803478 789903
55829 789903 776675 763141 748433 733464 720220 709188 699470 691104 684995 680587 675794 669356 661514
55816 661514 652501 642264 631579 621591 612355 603366 595117 588314 582246 575994 570788 568855 570243 573063
55802 573063 576612 581760 588240 594180 598818 603462 609055 614708 619113 621681 621803 618823 613320 606848
55788 606848 599948 591892 582684 573734 566181 560069 555545 553327 553535 555511 559251 565741 575631 589010
$$ packed form
55873B377485p0208o9094o8842o7879o5126o2495o0969n8353n3570m9281m7519
55862A704149m6366m3542l9939l7269l5352l3937l4019l5453l6130l5201l4185
55851A292756l3644l2094k9460k7924k7946k7194k5005k4016k5431k6539k5170
55840I88333k2973k1979k1259j9568j8115j8066j8015j6496j4593j3791j3575
55829G89903j3228j3534j4708j4969j3244j1032r718q366o109m408m793o438p842
55816F61514r013j0237j0685r988r236q989q249o803o068o252n206j933J388K820
55802E73063L549N148O480N940M638M644N593N653M405K568J22k980n503o472
55788F06848o900q056r208q950p553o112m524k218K08J976L740O490R890J3379
$$ plain form
55774 589010 606729 630462 661055 698145 741340 789668 838877 880901 907328 913245 898124 864937
55762 864937 819206 767313 714172 662613 614880 573352 539125 511071 487238 466576 448913
55751 448913 434137 422080 412572 405060 398706 393131 388503 384801 381728 379486 378755 379660 381500 383678
55737 383678 385989 387782 387756 385019 379665 372117 362710 352218 341964 332930 325270 318836 313501 308791
55723 308791 303962 298893 294409 291455 290272 290416 291251 292486 294661 298853 305458 313654 322668 332933
55709 332933 344968 357500 367854 374001 375266 371539 363310 352375 340895 329467 317308 304451
55697 304451 292260 281477 271335 261260 252114 244900 239342 234655 230851 228438 227414 227345 227968 229148
55683 229148 230687 232582 235083 238200 241652 245486 250109 255478 260916 265976 270774 275210 278621 280590
$$ packed form
55774E89010J7719K3733L0593L7090M3195M8328M9209M2024K6427N917j5121l3187
55762H64937m5731n1893n3141n1559m7733m1528l4227k8054k3833k0662j7663
55751D48913j4776j2057r508p512o354n575m628l702l073k242p31R05J840K178
55737C83678K311J793k6k737n354p548r407j0492j0254r034p660o434n335m710
55723C08791m829n069m484k954j183J44Q35J235K175M192O605Q196R014J0265
55709C32933J2035J2532J0354O147J265l727q229j0935j1480j1428j2159j2857
55697C04451j2191j0783j0142j0075r146p214n558m687l804k413j024o9O23J180
55683B29148J539J895K501L117L452L834M623N369N438N060M798M436L411J969
$$ plain form
55669 280590 281370 281152 279623 276764 273477 270886 269383 268667 268245 267638 266573 265236 263965 262664 261113
55654 261113 259834 259825 261189 262809 263719 264150 264893 266256 267992 269627 270598 270615 270155 269978 269911 268755 265573
55637 265573 260437 253791 245908 237287 228720 220501 212335 204415 197789 193109 189764 186839 184240 182207
55623 182207 180417 178410 176500 175438 175383 175815 176242 176450 176204 175245 173566 171367 168880 166453 164588 163534
55607 163534 162968 162281 161065 159274 157160 155165 153642 152548 151579 150592 149614 148574 147429 146445 145824 145109
55591 145109 143610 141425 139393 137968 136875 136065 136214 137886 140785 144177 147542 150524 152828 154621 156616
55576 156616 159429 163219 168096 174307 181677 189411 196950 204684 213476 223684 234895 246237 256722
55563 256722 265524 272243 276767 279071 279408 278485 276772 273724 268398 260918 252558 244253 235858 227145 218636
$$ packed form
55669B80590P80k18j529k859l287k591j503p16m22o07j065j337j271j301j551
55654B61113j279rJ364J620R10M31P43J363J736J635R71J7m60j77o7j156l182
55637B65573n136o646p883q621q567q219q166p920o626m680l345k925k599k033
55623A82207j790k007j910j062n5M32M27K08k46r59j679k199k487k427j865j054
55607A63534n66o87j216j791k114j995j523j094r69r87r78j040j145r84o21p15
55591A45109j499k185k032j425j093q10J49J672K899L392L365K982K304J793J995
55576A56616K813L790M877O211P370P734P539P734Q792J0208J1211J1342J0485
55563B56722Q802O719M524K304L37r23j713l048n326p480q360q305q395q713q509
$$ plain form
55548 218636 210967 204004 197237 190654 184810 180265 177218 175421 174371 173841 174141 175407 176866 177493 177291
55533 177291 177054 176957 176419 175432 174864 175098 175487 175590 175872 176607 177119 176827 176098 175334 174108 172066 169865 168309
55515 168309 167141 165515 163080 159836 155572 150387 145221 140945 137358 133880 130716 128388 126585 124562
55501 124562 122445 121139 121136 122302 124655 128373 132974 137395 141038 144074 146671 148544 149413 149354 148597 147374
55485 147374 145990 144644 143177 141302 138966 136231 133051 129561 126299 123652 121311 118791 116289 114448
55471 114448 113393 112512 111165 109195 106842 104550 102778 101677 101054 100847 101351 102650 104214 105485 106576
55456 106576 107978 109859 112035 114243 115968 116476 115628 114391 113823 113907 114001 114147 114994 116577 118073 118969 119691
55439 119691 120783 122044 122835 122950 122829 123006 123489 123755 123433 122932 123044 123884 124735 125136 125520 126415 127694 129166
$$ packed form
55548B18636p669o963o767o583n844m545l047j797j050n30L00J266J459O27k02
55533A77291k37r7n38r87n68K34L89J03K82P35N12k92p29p64j226k042k201j556
55515A68309j168j626k435l244m264n185n166m276l587l478l164k328j803k023
55501A24562k117j306lJ166K353L718M601M421L643L036K597J873Q69n9p57j223
55485A47374j384j346j467j875k336k735l180l490l262k647k341k520k502j841
55471A14448j055q81j347j970k353k292j772j101o23k07N04J299J564J271J091
55456A06576J402J881K176K208J725N08q48j237n68Q4R4J46Q47J583J496Q96P22
55439A19691J092J261P91J15j21J77M83K66l22n01J12Q40Q51M01L84Q95J279J472
$$ plain form
55421 129166 131272 134418 138133 141777 145743 150978 157535 164555 171602 178972 186550 193311 198313 201436
55407 201436 202826 202297 199633 194986 188639 180861 172333 164212 157344 151611 146378 141337 136651 132489
55393 132489 128796 125493 122659 120378 118505 116716 114905 113421 112703 112741 113196 113951 115037 115995 115967 114774
55377 114774 113313 112463 112109 111730 111334 111149 110876 110058 108898 107995 107533 107467 108153 109906 112087 113591 114255
55360 114255 114934 116109 117288 117945 118216 118369 118260 117685 116741 115553 114095 112519 111175 110122 109086 108107
55344 108107 107727 108260 109258 110008 110241 110200 110309 110935 112164 113598 114583 114731 114067 112772 111190 109985 109791
55327 109791 110575 111717 112778 113782 114709 115186 114927 114123 113263 112754 112821 113493 114599 115916 117241 118165 118098
55310 118098 116968 115698 115449 116433 117902 119130 119881 120118 120037 120356 121810 124152 126242 127263 127367 127152
$$ packed form
55421A29166K106L146L715L644L966N235O557P020P047P370P578O761N002L123
55407B01436J390n29k664m647o347p778q528q121o868n733n233n041m686m162
55393A32489l693l303k834k281j873j789j811j484p18L8M55P55J086R58k8j193
55377A14774j461q50l54l79l96j85k73q18j160r03m62o6O86J753K181J504O64
55360A14255O79J175J179O57K71J53j09n75r44j188j458j576j344j053j036r79
55344A08107l80N33R98P50K33m1J09O26J229J434R85J48o64j295j582j205j94
55327A09791P84J142J061J004R27M77k59q04q60n09O7O72J106J317J325R24o7
55310A18098j130j270k49R84J469J228P51K37q1L19J454K342K090J021J04k15
$$ plain form
55294 127152 127245 128409 131206 135166 138984 141865 144109 146173 147974 149512 151328 153552 155096 154639 152163
55279 152163 148788 145312 141655 137741 134218 131939 131083 131018 130914 130318 129228 127776 126027 124066 122090
55264 122090 120235 118501 117036 116263 116342 116703 116585 115947 115394 115302 115557 116057 116768 117240 116826 115644 114628 114331
55246 114331 114306 114064 113954 114533 115589 116489 117168 118018 118952 119260 118537 117252 116200 115666 115316 114787 114143 113700
55228 113700 113522 113327 112947 112590 112351 111796 110550 109141 108596 109139 109947 110343 110590 111138 111709 111650 110855 109817
55210 109817 108978 108395 107944 107528 107184 107127 107535 108168 108498 108401 108367 108791 109405 109722 109762 109972 110576 111402 112230 113039
55190 113039 113919 114904 115818 116254 115897 114956 114039 113498 113113 112526 111679 110731 109905 109602 110273 111873 113676 114945
55172 114945 115573 115889 116079 116112 116028 115970 116014 116137 116262 116253 116026 115768 115859 116446 117272 118009 118544 118897 119076 119117 119031 118702
$$ packed form
55294A27152R3J164K797L960L818K881K244K064J801J538J816K224J544m57k476
55279A52163l375l476l657l914l523k279q56o5j04n96j090j452j749j961j976
55264A22090j855j734j465p73P9L61j18o38n53r2K55N00P11M72m14j182j016k97
55246A14331k5k42j10N79J056R00O79Q50R34L08p23j285j052n34l50n29o44m43
55228A13700j78j95l80l57k39n55j246j409n45N43Q08L96K47N48N71n9p95j038
55210A09817q39n83m51m16l44n7M08O33L30r7l4M24O14L17M0K10O04Q26Q28Q09
55190A13039Q80R85R14M36l57r41r17n41l85n87q47r48q26l03O71J600J803J269
55172A14945O28L16J90L3q4n8M4J23J25rk27k58R1N87Q26P37N35L53J79M1q6l29
$$ plain form
55150 118702 118088 117513 117381 117590 117664 117501 117510 117852 118096 117893 117526 117419 117476 117297 116766 116080 115408 114811 114390 114305
55130 114305 114661 115412 116236 116653 116584 116620 117291 118256 118843 119258 120387 122326 124023 124647 124485 124070 123337 122179
55112 122179 121089 120569 120491 120584 120967 121609 121955 121707 121359 121287 120986 120020 119117 119347 120660 122187 123598 125200
55094 125200 126959 128427 129472 130175 130211 129286 128059 127703 128476 129615 130580 131496 132352 132696 132348 131660 130897
55077 130897 130073 129482 129547 129972 129786 128530 126721 124994 123501 122350 121857 122044 122517 123109 123965 124756 124659 123567
55059 123567 122551 122494 122875 122578 121441 120290 119743 119613 119425 118985 118469 118284 118769 119783 120678 120900 120430 119545
55041 119545 118425 117229 116229 115602 115322 115458 116219 117376 118077 117779 117172 117623 119619 122166 123768 123735 122490
55024 122490 120968 119892 119485 119542 119714 119819 120047 120865 122546 124729 126610 127671 128063 128141 127993 127753 127942
$$ packed form
55150A18702o14n75j32K09P4j63RL42K44k03l67j07N7j79n31o86o72n97m21q5
55130A14305L56P51Q24M17o9L6O71R65N87M15J129J939J697O24j62m15p33j158
55112A22179j090n20p8R3L83O42L46k48l48p2l01r66r03K30J313J527J411J602
55094A25200J759J468J045P03L6r25j227l56P73J139R65R16Q56L44l48o88p63
55077A30897q24n91O5M25j86j256j809j727j493j151m93J87M73N92Q56P91r7j092
55059A23567j016n7L81k97j137j151n47j30j88m40n16j85M85J014Q95K22m70q85
55041A19545j120j196j000o27k80J36P61J157P01k98o07M51J996K547J602l3j245
55024A22490j522j076m07N7J72J05K28Q18J681K183J881J061L92P8j48k40J89
$$ plain form
55007 127942 128887 129913 129905 128787 127775 127865 128699 129291 129292 128985 128499 127744 126990 126786 127215 127746 127989 128239 128994
54988 128994 130164 131091 131330 131195 131327 131865 132337 132476 132757 133732 135028 135571 134895 133688 132896 132759 133028 133651
54970 133651 134707 135961 136991 137710 138380 139122 139764 140131 140196 139968 139518 139074 138812 138611 138306 138115 138454 139341
54952 139341 140387 141454 142843 144609 146044 146252 145158 143637 142776 143156 144654 146581 148126 148972 149470
54937 149470 149985 150261 149921 149454 149980 151731 153420 153732 153028 152938 154481 157327 160860 165088 170168 175748
54921 175748 181382 187290 194098 201859 209734 216668 222163 226358 229507 231433 231545 229426 225274 219576
54907 219576 212493 204045 194888 186372 179513 174232 169803 165686 161713 157996 155060 153601 153593 153946 153587
54892 153587 152644 152033 152159 152605 152950 153237 153698 154580 156260 159005 162635 166849 171808 177803 184479 191055
$$ packed form
55007A27942R45J026qj118j012R0Q34N92Jl07m86p55p54k04M29N31K43K50P55
54988A28994J170R27K39j35J32N38M72J39K81R75J296N43o76j207p92j37K69O23
54970A33651J056J254J030P19O70P42O42L67O5k28m50m44k62k01l05j91L39Q87
54952A39341J046J067J389J766J435K08j094j521q61L80J498J927J545Q46M98
54937A49470N15K76l40m67N26J751J689L12p04r0J543K846L533M228N080N580
54921A75748N634N908O808P761P875O934N495M195L149J926J12k119m152n698
54907B19576p083q448r157q516o859n281m429m117l973l717k936j459qL53l59
54892A53587r43o11J26M46L45K87M61Q82J680K745L630M214M959N995O676O576
$$ plain form
54876 191055 197439 204364 212158 219938 226320 230498 232409 232358 230846 228344 224802 219628 212534 204183 195740
54861 195740 187997 181219 175596 171372 168490 166406 164477 162524 160940 160138 159907 159480 158325 156622 154783
54846 154783 152802 150462 147944 145757 144168 143124 142615 142588 142566 141973 140855 139761 138901 138039 137295 137305 138237
54829 138237 139256 139346 138274 136482 134588 133276 133112 133906 134663 134654 134242 134264 134990 136208 137997 140720 144263
54812 144263 147792 150401 151767 152264 152684 153786 155818 158469 161328 164259 167256 170166 172748 174858 176407
54797 176407 177338 177693 177430 176146 173476 169911 166644 164247 162007 159073 155785 153245 151908 151359 151310 152021
54781 152021 153608 155610 157551 159461 161562 163739 165659 167256 168911 171192 174583 179358 185549 192947
54767 192947 201205 210041 219440 229538 240237 250996 261116 270109 277616 283147 286260 286930 285381
$$ packed form
54876A91055O384O925P794P780O382M178J911n1j512k502l542n174p094q351q443
54861A95740p743o778n623m224k882k084j929j953j584q02k31m27j155j703j839
54846A54783j981k340k518k187j589j044n09k7k2n93j118j094q60q62p44J0R32
54829A38237J019R0j072j792j894j312j64P94P57rm12K2P26J218J789K723L543
54812A44263L529K609J366M97M20J102K032K651K859K931K997K910K582K110J549
54797A76407R31L55k63j284k670l565l267k397k240k934l288k540j337n49m9P11
54781A52021J587K002J941J910K101K177J920J597J655K281L391M775O191P398
54767A92947Q258Q836R399J0098J0699J0759J0120Q993P507N531L113O70j549
$$ plain form
54754 285381 281605 275501 267487 258409 248804 238763 228637 219195 210825 203227 196231 190307 185832 182487
54740 182487 179873 178157 177447 177085 176287 175085 173930 172810 171577 170791 171291 173131 175717 178819 182536
54725 182536 186501 190206 194181 199697 206982 214674 221451 227272 232511 236682 238764 238242 235234 230084
54711 230084 223481 216546 210124 204128 198062 191934 186180 181013 176383 172400 169202 166505 163861 161365
54697 161365 159559 158619 158105 157577 156952 156149 154894 153140 151258 149499 147637 145510 143625 142699 142717 142946
54681 142946 142877 142630 142365 141850 140968 140171 139944 140052 139867 139295 138889 138986 139277 139303 138926 138174 137108 136075 135611
54662 135611 135790 136043 135939 135818 136189 136876 137259 137214 137271 137865 138849 139840 140717 141718 143170 145075 146813 147481
54644 147481 146801 145536 144731 144731 145258 146134 147347 148521 148989 148537 147610 146634 145597 144481 143650 143413 143480 143240
$$ packed form
54754B85381l776o104q014r078r605j0041j0126r442q370p598o996n924m475l345
54740A82487k614j716p10l62p98j202j155j120j233p86N00J840K586L102L717
54725A82536L965L705L975N516P285P692O777N821N239M171K082n22l008n150
54711B30084o603o935o422n996o066o128n754n167m630l983l198k697k644k496
54697A61365j806r40n14n28o25q03j255j754j882j759j862k127j885r26J8K29
54681A42946o9k47k65n15q82p97k27J08j85n72m06R7K91K6l77p52j066j033m64
54662A35611J79K53j04j21L71O87L83m5N7N94R84R91Q77J001J452J905J738O68
54644A47481o80j265q05%N27Q76J213J174M68m52r27r76j037j116q31k37O7k40
$$ plain form
54626 143240 142552 141992 142216 143160 143965 143748 142397 140487 138543 136693 135134 134410 134864 136155 137729 139511
54610 139511 141674 143961 145729 146582 146514 145614 144165 142864 142288 142176 141862 141393 141512 142473 143633 144433 145090
54593 145090 145984 147038 148074 149200 150327 150876 150551 149990 150044 150666 151057 150706 149708 148280 146612 145210 144773
54576 144773 145474 146711 147746 148400 148954 149612 150293 150874 151428 152046 152523 152454 151830 151382 151989 153706 155657 156944
54558 156944 157427 157479 157330 156907 156193 155492 155256 155654 156276 156396 155744 154975 155109 156507 158658 160893 162888 164479
54540 164479 165526 166225 167152 168683 170598 172392 173677 174183 173769 172737 171804 171431 171426 171386 171189 170811 170072 168860
54522 168860 167334 165614 163705 162028 161496 162453 163900 164413 163679 162531 161672 160984 160055 158744 157209 155895
54506 155895 155456 156131 157124 157228 156194 155005 154589 154814 155020 154993 154965 154991 154825 154311 153587 152937 152687 153124 154332
$$ packed form
54626A43240o88n60K24R44Q05k17j351j910j944j850j559p24M54J291J574J782
54610A39511K163K287J768Q53o8r00j449j301n76j12l14m69J19R61J160Q00O57
54593A45090Q94J054J036J126J127N49l25n61N4O22L91l51r98j428j668j402m37
54576A44773P01J237J035O54N54O58O81N81N54O18M77o9o24m48O07J717J951J287
54558A56944M83N2j49m23p14p01k36L98O22J20o52p69J34J398K151K235J995J591
54540A64479J047O99R27J531J915J794J285N06m14j032r33l73nm0j97l78p39j212
54522A68860j526j720j909j677n32R57J447N13p34j148q59o88r29j311j535j314
54506A55895m39O75R93J04j034j189m16K25K06k7k8K6j66n14p24o50k50M37J208
$$ plain form
54487 154332 156127 158271 160583 162712 164065 164282 163780 163569 164432 166338 168561 170192 170630 169875 168540 167514
54471 167514 167463 168572 170621 173109 175328 176618 176887 176852 177468 179001 180841 182285 183230 183898 184192 183827 183028
54454 183028 182587 183005 183905 184450 184107 182835 180893 178701 176662 174836 172984 171147 169900 169695 170160 170437
54438 170437 170110 169416 168592 167500 165968 164173 162555 161555 161465 162257 163495 164631 165525 166429 167430 168154
54422 168154 168231 167824 167485 167532 167848 168259 168904 170028 171454 172500 172641 172190 172027 172600 173480 174104 174659 175799
54404 175799 177619 179355 180234 180280 180084 180074 180249 180507 180881 181395 181896 182198 182396 182874 183863 185047 185768 185719 185324
54385 185324 185326 186056 187160 187954 187942 187079 185728 184367 183266 182428 181756 181193 180712 180381 180398 180894 181655 182289 182740
54366 182740 183298 184090 184899 185601 186323 186972 187137 186893 187114 188398 190092 191111 191410 191779 192363 192439 191806 191393
$$ packed form
54487A54332J795K144K312K129J353K17n02k11Q63J906K223J631M38p55j335j026
54471A67514n1J109K049K488K219J290K69l5O16J533J840J444R45O68K94l65p99
54454A83028m41M18R00N45l43j272j942k192k039j826j852j837j247k05M65K77
54438A70437l27o94q24j092j532j795j618j000r0P92J238J136Q94R04J001P24
54422A68154P7m07l39M7L16M11O45J124J426J046J41m51j63N73Q80O24N55J140
54404A75799J820J736Q79M6j96j0J75K58L74N14N01L02J98M78R89J184P21m9l95
54385A85324KP30J104P94j2q63j351j361j101q38o72n63m81l31J7M96P61O34M51
54366A82740N58P92Q09P02P22O49J65k44K21J284J694J019K99L69N84P6o33m13
$$ plain form
54348 191393 192026 193355 194547 195359 195961 196244 196062 195817 196044 196532 196546 195896 195176 194860 194702 194260 193543 192826
54330 192826 192097 191069 189638 188079 186740 185711 184831 183986 183305 183044 183228 183475 183213 182122 180386 178508
54314 178508 176865 175431 174008 172749 172261 172960 174408 175545 175659 175004 174490 174933 176533 178706 180361 180684
54298 180684 179882 178963 178601 178454 177848 176863 176316 176664 177330 177349 176525 175716 175862 176843 177513 177004 175799 175223 175963
54279 175963 177459 178744 179447 179784 180013 180263 180622 180976 180960 180467 180024 180277 181131 181872 182193 182658 183941 185834
54261 185834 187306 187496 186563 185566 185489 186404 187602 188462 188943 189206 189187 188884 188702 188990 189422 189359 188805 188375 188278
54242 188278 187922 186795 185145 183455 181725 179840 178276 177746 178162 178484 177818 176316 174871 174160 174128 174231
54226 174231 174015 173492 173017 172845 172883 172963 173134 173464 173664 173280 172336 171439 171080 171082 170966 170616 170271 169986 169502 168774
$$ packed form
54348A91393O33J329J192Q12O02K83j82k45K27M88J4o50p20l16j58m42p17p17
54330A92826p29j028j431j559j339j029q80q45o81k61J84K47k62j091j736j878
54314A78508j643j434j423j259m88O99J448J137J14o55n14M43J600K173J655L23
54298A80684q02r19l62j47o06r85n47L48O66J9q24q09J46R81O70n09j205n76P40
54279A75963J496J285P03L37K29K50L59L54j6m93m43K53Q54P41L21M65J283J893
54261A85834J472J90r33r97p7R15J198Q60M81K63j9l03j82K88M32o3n54m30r7
54242A88278l56j127j650j690j730j885j564n30M16L22o66j502j445p11l2J03
54226A74231k16n23m75j72L8Q0J71L30K00l84r44q97l59Kj16l50l45k85m84p28
$$ plain form
54206 168774 168258 168454 169346 170534 171802 173244 174835 176254 177263 178004 178649 178931 178372 176954 175274 173984
54190 173984 173340 173347 173968 174950 175656 175425 174109 172123 170049 168334 167209 166622 166307 166159 166495 167671 169504
54173 169504 171383 172949 174292 175361 175647 174793 173272 172057 171697 171975 172382 172593 172553 172389 172316 172374 172276 171825
54155 171825 171482 172070 173711 175439 176193 175967 175528 175279 174931 174320 173894 174043 174383 174218 173497 172868 172851 173391
54137 173391 174229 175246 176292 177092 177574 177952 178197 177790 176386 174438 172749 171612 170925 170934 172105 174170 176018
54120 176018 176908 177280 178011 179258 180508 181391 181985 182495 183099 183959 185021 185952 186584 187156 187762 187907 187218 186317
54102 186317 186262 187144 188027 188324 188434 188745 188799 188005 186593 185283 184348 183578 182887 182377 181990 181639 181653 182587 184479
54083 184479 186605 188062 188461 188144 187950 188664 190349 192219 193313 193301 192563 191735 191398 191966 193450 195386 197274
$$ packed form
54206A68774n16J96Q92J188J268J442J591J419J009P41O45K82n59j418j680j290
54190A73984o44PO21R82P06k31j316j986k074j715j125n87l15j48L36J176J833
54173A69504J879J566J343J069K86q54j521j215l60K78M07K11m0j64p3N8r8m51
54155A71825l43N88J641J728P54k26m39k49l48o11m26J49L40j65p21o29j7N40
54137A73391Q38J017J046Q00M82L78K45m07j404j948j689j137o87RJ171K065J848
54120A76018Q90L72P31J247J250Q83N94N10O04Q60J062R31O32N72O06J45o89r01
54102A86317n5Q82Q83K97J10L11N4p94j412j310r35p70o91n10l87l51J4R34J892
54083A84479K126J457L99l17j94P14J685J870J094j2p38q28l37N68J484J936J888
$$ plain form
54066 197274 199017 200732 202397 204124 206516 210103 214429 218340 221392 224402 228397 233557 239614 246680
54052 246680 254940 263711 271562 277529 281698 284346 284976 282773 277900 271926 266746 263245 261029 259213
54038 259213 257246 255213 253747 253659 255356 258458 262180 266102 270276 274538 278230 280962 283280 286053 289352
54023 289352 292471 295024 297440 300152 302735 304184 303945 302519 301091 300592 300956 301269 300682 299116 296925
54008 296925 294062 290039 284653 278394 271987 265894 260371 255619 251638 248157 245006 242362 240482 239337
53994 239337 238618 237920 236809 235038 232905 231067 229759 228499 226939 225660 225551 226481 227207 226744 225356 223982
53978 223982 223119 222603 222225 222049 222176 222559 223129 223804 224237 223879 222623 221260 220884 221757 223059 223960 224688 226295
53960 226295 229517 234128 239284 244141 248153 251238 253941 257212 261690 267108 272429 276629 279383 281135
$$ packed form
54066A97274J743J715J665J727K392L587M326L911L052L010L995N160O057P066
54052B46680Q260Q771P851N967M169K648O30k203m873n974n180l501k216j816
54038B59213j967k033j466q8J697L102L722L922M174M262L692K732K318K773L299
54023B89352L119K553K416K712K583J449k39j426j428m99L64L13n87j566k191
54008B96925k863m023n386o259o407o093n523m752l981l481l151k644j880j145
53994B39337p19o98j111j771k133j838j308j260j560j279j09R30P26m63j388j374
53978B23982q63n16l78j76J27L83N70O75M33l58j256j363l76Q73J302R01P28J607
53960B26295L222M611N156M857M012L085K703L271M478N418N321M200K754J752
$$ plain form
53946 281135 282522 283762 284679 285270 285961 287026 288060 288506 288619 289354 291191 293643 296188 299107 302874 307031
53930 307031 310344 312107 312819 313494 314670 316257 318042 320028 322262 324549 326540 328208 330187 333386 338118
53915 338118 343762 349456 355020 361000 367873 375442 383045 390188 396921 403688 410861 418414 426050 433598
53901 433598 441224 449206 457616 466212 474419 481332 485931 487458 485544 479918 470292 456843 440711 423749
53887 423749 407661 393325 380731 369317 358486 348105 338515 329951 322074 314345 306767 299841 293735
53874 293735 287920 281944 276262 271862 269059 267053 264852 262430 260657 260111 260274 260018 258673 256399 253725
53859 253725 251094 248830 247166 246072 245266 244519 243769 242896 241638 239898 237835 235483 232587 229182 226022
53844 226022 224036 223464 223878 224849 226020 226653 225902 223877 221921 221287 221805 222298 222102 221636 221532 221759 221898
$$ packed form
53946B81135J387J240R17N91O91J065J034M46J13P35J837K452K545K919L767M157
53930C07031L313J763P12O75J176J587J785J986K234K287J991J668J979L199M732
53915C38118N644N694N564N980O873P569P603P143O733O767P173P553P636P548
53901D33598P626P982Q410Q596Q207O913M599J527j914n626r626j3449j6132j6962
53887D23749j6088j4336j2594j1414j0831j0381r590q564p877p729p578o926o106
53874B93735n815n976n682m400k803k006k201k422j773n46J63k56j345k274k674
53859B53725k631k264j664j094q06p47p50q73j258j740k063k352k896l405l160
53844B26022j986n72M14R71J171O33p51k025j956o34N18M93j96m66j04K27J39
$$ plain form
53827 221898 221870 221936 222121 222084 221726 221579 222275 223767 225331 226321 226628 226436 225922 225411 225521 226725 228824 231121
53809 231121 233130 234898 236652 238514 240667 243552 247493 252214 256962 261246 265290 269659 274553 279640
53795 279640 284541 289228 293855 298435 302903 307304 311565 315195 317662 319214 320908 323473 326408 328513
53781 328513 329160 328661 327476 325540 322576 318730 314588 310637 306906 303231 299682 296590 294111 291849 288994
53766 288994 284929 279741 274163 268983 264445 260211 256000 252159 249328 247517 245959 244198 242864 242787 243581
53751 243581 243899 243106 241887 240956 239969 238251 235965 233892 232461 231659 231548 232123 232803 232825 232206 231681 231625 231645
53733 231645 231387 231132 231287 231698 231870 231680 231544 231973 233077 234468 235618 236412 237303 238769 240737 242796 244832
53716 244832 247053 249405 251395 252647 253299 253689 253971 254226 254711 255816 257797 260645 264017 267291 269912
$$ packed form
53827B21898k8O6J85l7l58j47O96J492J564R90L07j92n14n11J10J204K099K297
53809B31121K009J768J754J862K153K885L941M721M748M284M044M369M894N087
53795B79640M901M687M627M580M468M401M261L630K467J552J694K565K935K105
53781C28513O47m99j185j936k964l846m142l951l731l675l549l092k479k262k855
53766B88994m065n188n578n180m538m234m211l841k831j811j558j761j334p7P94
53751B43581L18p93j219r31r87j718k286k073j431q02j11N75O80K2o19n25n6K0
53733B31645k58k55J55M11J72j90j36M29J104J391J150P94Q91J466J968K059K036
53716B44832K221K352J990J252O52L90K82K55M85J105J981K848L372L274K621
$$ plain form
53701 269912 271817 273419 275181 277377 280173 283585 287250 290570 293309 295900 298970 302671 306552 310007
53687 310007 312754 314936 316782 318183 318744 318292 317127 315638 314011 312592 312110 312945 314345 315054 314711 314088
53671 314088 313905 314056 314105 313863 313196 311923 310287 309025 308522 308303 307794 307124 306684 306313 305528 304349 303303
53654 303303 302649 302137 301542 301020 300833 301010 301377 301694 301734 301383 300731 300045 299712 300181 301715 304099 306815 309576
53636 309576 312410 315139 317220 318359 318907 319302 319474 319266 319127 319824 321533 323692 325693 327308 328519 329430
53620 329430 330471 332240 334997 338522 342553 347031 351822 356510 360695 364341 367689 370977 374415 378345
53606 378345 383177 388987 395215 400919 405524 409260 412773 416384 419919 423123 425859 427943 429306 430368
53592 430368 431789 433672 435516 437143 439053 441456 443608 444683 444804 444572 444029 442918 441534 440350 438933
$$ packed form
53701B69912J905J602J762K196K796L412L665L320K739K591L070L701L881L455
53687C10007K747K182J846J401N61m52j165j489j627j419m82Q35J400P09l43o23
53671C14088j83J51M9k42o67j273j636j262n03k19n09o70m40l71p85j179j046
53654C03303o54n12n95n22j87J77L67L17M0l51o52o86l33M69J534K384K716K761
53636C09576K834K729K081J139N48L95J72k08j39O97J709K159K001J615J211R11
53620C29430J041J769K757L525M031M478M791M688M185L646L348L288L438L930
53606C78345M832N810O228N704M605L736L513L611L535L204K736K084J363J062
53592D30368J421J883J844J627J910K403K152J075J21k32n43j111j384j184j417
$$ plain form
53577 438933 436329 432565 428794 425696 422676 419072 415208 411624 408033 403972 400062 397649 397134 397381 397030
53562 397030 395930 394983 394824 395048 394886 394407 394621 396214 398494 400100 400604 400871 401793 403299 404827 406240
53546 406240 407824 409763 412060 414805 418094 421743 425333 428525 431255 433842 436993 441352 446817 452587
53532 452587 458185 464114 471197 479566 488771 498595 509186 520458 531951 543385 554927 566844 579297
53519 579297 592535 606858 622161 637910 653827 670355 688196 707634 728621 751316 776007
53508 776007 802412 829438 855920 881557 906965 932897 959585 986722 1013741 1039916 1064565
53497 1064565 1087613 1109927 1132659 1156120 1179590 1202323 1224333 1245965 1267216 1287985 1308707
53486 1308707 1330082 1352150 1374197 1395658 1416600 1437129 1456835 1475213 1492350 1508820 1524969
$$ packed form
53577D38933k604l764l771l098l020l604l864l584l591m061l910k413n15K47l51
53562C97030j100r47j59K24j62m79K14J593K280J606N04K67R22J506J528J413
53546D06240J584J939K297K745L289L649L590L192K730K587L151M359N465N770
53532D52587N598N929P083Q369R205R824J0591J1272J1493J1434J1542J1917J2453
53519E79297J3238J4323J5303J5749J5917J6528J7841J9438K0987K2695K4691
53508G76007K6405K7026K6482K5637K5408K5932K6688K7137K7019K6175K4649
53497A064565K3048K2314K2732K3461K3470K2733K2010K1632K1251K0769K0722
53486A308707K1375K2068K2047K1461K0942K0529J9706J8378J7137J6470J6149
$$ plain form
53475 1524969 1540555 1554991 1567712 1578436 1587197 1594078 1598859 1601187 1601204 1599630 1596839 1592128 1584358
53462 1584358 1573192 1559288 1543504 1526523 1509218 1492544 1476631 1460421 1442668 1423040 1401981
53451 1401981 1379896 1356999 1333691 1310449 1287328 1264008 1240382 1216818 1193827 1171864 1151401
53440 1151401 1132742 1115621 1099434 1084104 1070449 1059440 1051291 1045392 1040865 1036977 1033307 1029990
53428 1029990 1027748 1027418 1029321 1033167 1038473 1045007 1052939 1062693 1074594 1088594 1104407 1121885 1141031
53415 1141031 1161574 1182890 1204622 1227207 1251474 1277793 1305893 1335353 1366013 1397899 1431087
53404 1431087 1465734 1502055 1540221 1580373 1622780 1667819 1715734 1766470 1819743 1875246 1932787
53393 1932787 1992251 2053354 2115426 2177556 2239079 2299885 2360279 2420644 2481142 2541452 2600665
$$ packed form
53475A524969J5586J4436J2721J0724Q761O881M781K328J7j574k791m711p770
53462A584358j1166j3904j5784j6981j7305j6674j5913j6210j7753j9628k1059
53451A401981k2085k2897k3308k3242k3121k3320k3626k3564k2991k1963k0463
53440A151401j8659j7121j6187j5330j3655j1009q149n899m527l888l670l317
53428A029990k242l30J903L846N306O534P932R754J1901J4000J5813J7478J9146
53415A141031K0543K1316K1732K2585K4267K6319K8100K9460L0660L1886L3188
53404A431087L4647L6321L8166M0152M2407M5039M7915N0736N3273N5503N7541
53393A932787N9464O1103O2072O2130O1523O0806O0394O0365O0498O0310N9213
$$ plain form
53382 2600665 2657653 2711723 2762769 2810826 2855754 2897465 2936017 2971249 3002644 3029828 3052884
53371 3052884 3071843 3086203 3095325 3098995 3097230 3089832 3076516 3057072 3030878 2996790 2954373 2905042
53359 2905042 2851215 2794445 2735194 2674177 2612751 2551769 2491056 2430448 2370427 2311351 2253022
53348 2253022 2195690 2140603 2088651 2039005 1989899 1940414 1890653 1840679 1790375 1740367 1692193
53337 1692193 1647239 1605908 1567810 1532241 1498499 1466311 1436118 1408619 1384016 1362069 1342716
53326 1342716 1326053 1311704 1298750 1286390 1274167 1261613 1248336 1234668 1221611 1209824 1199181
53315 1199181 1189610 1181681 1175799 1171379 1167555 1164441 1162955 1163444 1165275 1167890 1171585 1176857 1183521 1191032
53301 1191032 1199415 1209347 1221292 1235001 1250043 1266555 1285269 1306823 1331166 1357590 1385269 1413758
$$ packed form
53382B600665N6988N4070N1046M8057M4928M1711L8552L5232L1395K7184K3056
53371C052884J8959J4360R122L670j765p398j3316j9444k6194l4088m2417m9331
53359B905042n3827n6770n9251o1017o1426o0982o0713o0608o0021n9076n8329
53348B253022n7332n5087n1952m9646m9106m9485m9761m9974n0304n0008m8174
53337A692193m4954m1331l8098l5569l3742l2188l0193k7499k4603k1947j9353
53326A342716j6663j4349j2954j2360j2223j2554j3277j3668j3057j1787j0643
53315A199181r571p929n882m420l824l114j486M89J831K615L695N272O664P511
53301A191032Q383R932J1945J3709J5042J6512J8714K1554K4343K6424K7679K8489
$$ plain form
53289 1413758 1443008 1472957 1503276 1533602 1563846 1593955 1623329 1650822 1675556 1697576 1717446
53278 1717446 1735316 1750686 1763063 1772575 1779767 1784969 1787908 1787916 1784490 1777711 1768106 1756059 1741491
53265 1741491 1724207 1704367 1682361 1658350 1632251 1604165 1574492 1543610 1511768 1479286 1446458
53254 1446458 1413171 1379057 1344305 1309906 1276735 1244613 1212672 1180524 1148680 1117841 1088097
53243 1088097 1058982 1030107 1001559 973632 946246 918846 891101 863610 837652 814142 793020
53232 793020 773603 755229 737560 720717 705341 692159 681183 671523 662149 652594 642776 632599
53220 632599 622038 611303 600479 589290 577566 565667 554024 542530 530846 519080 507602
53209 507602 496409 485253 474371 464426 455603 447338 439084 430905 423060 415430 407651 399650 391783
$$ packed form
53289A413758K9250K9949L0319L0326L0244L0109K9374K7493K4734K2020J9870
53278A717446J7870J5370J2377R512P192N202K939Ql426o779r605j2047j4568
53265A741491j7284j9840k2006k4011k6099k8086k9673l0882l1842l2482l2828
53254A446458l3287l4114l4752l4399l3171l2122l1941l2148l1844l0839k9744
53243A088097k9115k8875k8548k7927k7386k7400k7745k7491k5958k3510k1122
53232G93020j9417j8374j7669j6843j5376j3182j0976r660r374r555r818j0177
53220F32599j0561j0735j0824j1189j1724j1899j1643j1494j1684j1766j1478
53209E07602j1193j1156j0882r945q823q265q254q179p845p630p779q001p867
$$ plain form
53196 391783 384537 378119 372232 366271 359911 353428 347291 341625 336369 331682 327725 324172 320562 317101
53182 317101 314478 312743 311030 308711 306240 304350 302921 301175 298784 296229 294141 292743 291959 291642 291550
53167 291550 291330 290724 289716 288394 286681 284311 281213 277954 275613 274941 275639 276622 276988 276595 275836 275154
53151 275154 274731 274340 273482 271964 270248 268909 267836 266444 264689 263204 262316 261604 260807 260488 261214 262519
53135 262519 263381 263533 263685 264556 266215 268318 270413 271953 272519 272255 271809 271662 271720 271660 271506 271699 272626 274085
53117 274085 275247 275292 274183 272610 271159 269889 268877 268604 269234 269834 269102 266852 264151 261933 260133 258397
53101 258397 256923 256157 256128 256609 257614 259159 260744 261624 261620 261240 260949 260742 260511 260387 260422 260221 259235 257406
53083 257406 255296 253679 253122 253874 255819 258464 261138 263363 264993 266060 266648 266972 267306 267680 267801 267446
$$ packed form
53196C91783p246o418n887n961o360o483o137n666n256m687l957l553l610l461
53182C17101k623j735j713k319k471j890j429j746k391k555k088j398p84l17r2
53167B91550k20o06j008j322j713k370l098l259k341o72O98R83L66l93p59o82
53151B75154m23l91q58j518j716j339j073j392j755j485q88p12p97l19P26J305
53135B62519Q62J52J52Q71J659K103K095J540N66k64m46j47N8o0j54J93R27J459
53117B74085J162M5j109j573j451j270j012k73O30O00p32k250k701k218j800j736
53101B58397j474p66k9M81J005J545J585Q80ml80k91k07k31j24L5k01r86j829
53083B57406k110j617n57P52J945K645K674K225J630J067N88L24L34L74J21l55
$$ plain form
53067 267446 266777 266061 265227 263965 262257 260501 259084 258024 257102 256178 255382 255115 255759 257146 258446 258951
53051 258951 258933 259264 260138 260709 260227 259032 258052 257732 257912 258391 258987 259146 258258 256511 254997 254674 255436 256381
53033 256381 256797 256699 256547 256702 257236 258150 259490 261071 262257 262397 261526 260301 259190 258106 256975 256116 255723
53016 255723 255459 255097 255139 256165 257861 259411 260635 262001 263566 264764 265279 265376 265242 264834 264648 265702 268203
52999 268203 270931 272609 273306 273863 274500 274806 274767 274859 275145 275061 274220 272964 271944 271651 272350 274034 276314 278623
52981 278623 280593 281988 282524 282218 281800 282118 283032 283536 283192 282815 283398 284879 286512 288015 289736 291819
52965 291819 293925 295859 297891 300158 302113 302992 302743 302123 301728 301185 299622 296937 294241 292831 292880 293431
52949 293431 293513 292913 291881 290596 289183 287916 287015 286308 285381 284112 282893 282317 282561 283016 282599 280750 278179
$$ packed form
53067B67446o69p16q34j262j708j756j417j060r22r24p96k67O44J387J300N05
53051B58951j8L31Q74N71m82j195r80l20J80M79N96J59q88j747j514l23P62R45
53033B56381M16r8j52J55N34R14J340J581J186J40q71j225j111j084j131q59l93
53016B55723k64l62M2J026J696J550J224J366J565J198N15R7j34m08j86J054K501
52999B68203K728J678O97N57O37L06l9R2K86q4q41j256j020k93O99J684K280K309
52981B78623J970J395N36l06m18L18R14N04l44l77N83J481J633J503J721K083
52965B91819K106J934K032K267J955Q79k49o20l95n43j563k685k696j410M9N51
52949B93431Q2o00j032j285j413j267r01p07r27j269j219n76K44M55m17j849k571
$$ plain form
52932 278179 276326 275939 276455 276906 276978 276861 276560 275980 275454 275416 275525 274845 273171 271587 271308 272357 273732 274584
52914 274584 274793 274664 274543 274722 275271 275858 275927 275185 273875 272649 272200 272786 273842 274242 273299 271519 270088
52897 270088 269654 269851 269992 269905 269946 270462 271420 272415 272977 272985 272875 273291 274438 275829 276719 276696 275875 274741 273821
52878 273821 273378 273320 273483 273932 274754 275630 275966 275581 274931 274532 274469 274640 275115 275890 276588 276866 277000 277583 278748
52859 278748 280024 280947 281350 281068 279888 278030 276303 275422 275323 275293 274572 272746 269872 266535 263571 261408
52843 261408 259750 258084 256331 254744 253326 251782 250031 248377 247087 246130 245474 245342 245904 246868 247683 248135
52827 248135 248555 249425 250870 252537 253799 254079 253186 251559 250131 249747 250540 251869 252942 253529 254022 254889
52811 254889 256216 257896 260014 262747 265850 268533 270047 270302 269708 268521 266578 263722 260204 256532 253068
$$ packed form
52932B78179j853l87N16M51P2j17l01n80n26l8J09o80j674j584k79J049J375Q52
52914B74584K09j29j21J79N49N87O9p42j310j226m49N86J056M00r43j780j431
52897B70088m34J97J41q7M1N16R58R95N62Qj10M16J147J391Q90k3q21j134r20
52878B73821m43n8J63M49Q22Q76L36l85o50l99o3J71M75P75O98K78J34N83J165
52859B78748J276R23M03k82j180j858j727q81r9l0p21j826k874l337k964k163
52843B61408j658j666j753j587j418j544j751j654j290r57o56j32N62R64Q15M52
52827B48135M20Q70J445J667J262K80q93j627j428l84P93J329J073N87M93Q67
52811B54889J327J680K118K733L103K683J514K55n94j187j943k856l518l672l464
$$ plain form
52796 253068 250006 247587 246035 245209 244576 243706 242647 241711 241105 240959 241435 242428 243306 243474 243250 243634 244979
52779 244979 246430 247129 247433 248291 249746 250908 251315 251488 251930 252447 252765 253101 253551 253591 252846 251854 251282 250817
52761 250817 249743 248292 247440 247397 247394 247077 247042 247555 247733 246709 244896 243386 242643 242556 243297 245214 248026 250886
52743 250886 253247 255117 256606 257840 259213 261092 263252 265154 266758 268511 270509 272287 273562 274665
52729 274665 276074 277933 280076 282098 283415 283785 283774 284087 284434 283826 282135 280458 279568 278826 277290 275182
52713 275182 273505 272679 272344 272186 272180 272186 271998 271738 271635 271474 270826 269745 268766 268266 268285 268826 269828 270930 271830
52694 271830 272797 274263 276022 277475 278594 279873 281247 281884 281410 280622 280511 281109 281810 282323 282728 282858 282346
52677 282346 281292 280449 280558 281606 282757 282982 281968 280473 279577 279498 279437 278728 277697 277097 277043 277042 276847 276736
$$ packed form
52796B53068l062k419j552q26o33q70j059r36o06j46M76R93Q78J68k24L84J345
52779B44979J451O99L04Q58J455J162M07J73M42N17L18L36M50M0p45r92n72m65
52761B50817j074j451q52m3ll17l5N13J78j024j813j510p43q7P41J917K812K860
52743B50886K361J870J489J234J373J879K160J902J604J753J998J778J275J103
52729B74665J409J859K143K022J317L70j1L13L47o08j691j677q90p42j536k108
52713B75182j677q26l35j58oOj88k60j03j61o48j081r79n00J9N41J002J102R00
52694B71830R67J466J759J453J119J279J374O37m74p88j11N98P01N13M05J30n12
52677B82346j054q43J09J048J151K25j014j495q96p9o1p09j031o00n4jj95j11
$$ plain form
52659 276736 276986 277550 278404 279784 281876 284517 287414 290454 293580 296476 298643 299813 300182 300122 299715 298679
52643 298679 296806 294383 292036 290165 288663 287229 285860 284943 284906 285792 287142 288283 288795 288737 288418 288052
52627 288052 287761 287759 288272 289230 290282 291164 291812 292065 291596 290361 288896 287870 287420 287149 286716 286232 286066 286319
52609 286319 286536 285994 284492 282901 282644 284398 287462 290528 292798 294147 294591 294239 293674 293737 294623 295556 295648
52592 295648 294886 293981 293451 293167 292714 291875 290701 289384 288202 287471 287395 287950 288934 290076 291121 291913 292481
52575 292481 292917 293108 292732 291666 290261 289016 288056 287211 286466 285935 285363 284230 282571 281266 281040 281520 281727
52558 281727 281305 280709 280328 280027 279606 279138 278677 278086 277363 276753 276342 275927 275447 275153 275082 274838 274180 273459 273058
52539 273058 272746 272031 270997 270229 270003 270001 269909 269928 270489 271698 273216 274647 275898 277108 278283 279191 279725 280195
$$ packed form
52659B76736K50N64Q54J380K092K641K897L040L126K896K167J170L69o0m07j036
52643B98679j873k423k347j871j502j434j369r17l7Q86J350J141N12n8l19l66
52627B88052k91kN13R58J052Q82O48K53m69j235j465j026m50k71m33m84j66K53
52609B86319K17n42j502j591k57J754L064L066K270J349M44l52n65O3Q86R33R2
52592B95648p62r05n30k84m53q39j174j317j182p31p6N55R84J142J045P92N68
52575B92481M36J91l76j066j405j245r60q45p45n31n72j133j659j305k26M80K07
52558B81727m22n96l81l01m21m68m61n91p23o10m11m15m80k94p1k44o58p21m01
52539B73058l12p15j034p68k26kr2J9N61J209J518J431J251J210J175R08N34M70
$$ plain form
52521 280195 280948 281874 282689 283587 285064 287053 288855 290098 291116 292140 292842 293235 294336 297167 301416 305740
52505 305740 309109 311257 312161 311903 310899 309516 307492 304386 300533 296884 293997 291860 290584 290407 290922
52490 290922 291159 290718 290147 289983 290149 290540 291435 292880 294314 295277 296008 296931 298081 299424 301109 302885 303868
52473 303868 303650 303241 304123 306506 309255 311452 313362 315651 318228 320231 321033 321017 321344 322880 325366 327727
52457 327727 329077 329219 328260 326323 323811 321404 319367 317246 314620 311848 309643 308198 307152 306135 304888
52442 304888 303015 300187 296609 292993 290065 288180 287245 286815 286467 286241 286396 286660 286336 285417 284909 285396 285999
52425 285999 285562 284385 283777 284203 284959 285524 286106 286728 286940 286807 287203 288618 290473 292119 293822 296160 299102
52408 299102 302311 305919 310328 315573 321434 327928 335129 342616 349554 355133 358636 359427 357435 353565
$$ packed form
52521B80195P53R26Q15Q98J477J989J802J243J018J024P02L93J101K831M249M324
52505C05740L369K148R04k58j004j383k024l106l853l649k887k137j276j77N15
52490B90922K37m41n71j64J66L91Q95J445J434R63P31R23J150J343J685J776R83
52473C03868k18m09Q82K383K749K197J910K289K577K003Q02j6L27J536K486K361
52457C27727J350J42r59j937k512k407k037k121k626k772k205j445j046j017j247
52442C04888j873k828l578l616k928j885r35m30l48k26J55K64l24r19n08M87O03
52425B85999m37j177o08M26P56N65N82O22K12j33L96J415J855J646J703K338K942
52408B99102L209L608M409N245N861O494P201P487O938N579L503P91j992l870
$$ plain form
52394 353565 349079 344529 339610 334046 328250 323076 319178 316699 315433 315122 315524 316180 316413 315946 315412 315733
52378 315733 316909 318050 318791 319955 322391 325796 329351 332991 337205 341827 345953 349038 351362 353328
52364 353328 354917 355973 356423 356061 354679 352661 350974 350308 350574 351426 352787 354607 356528 358207 359688
52349 359688 361100 362224 362732 362721 362751 363432 365183 368175 372143 376312 379860 382598 385029 387742 390893 394363
52333 394363 398272 403137 409464 417301 426280 436020 446285 456737 466969 477096 487998 500494 514319
52320 514319 528405 542164 555889 569741 583044 595156 606651 618991 633074 648622 664959
52309 664959 681789 698974 716071 732607 748722 765122 782263 799793 816909 833093 848332
52298 848332 862786 876587 889966 903081 915417 925695 932907 937356 940111 941497 940775 937526 932645
$$ packed form
52394C53565m486m550m919n564n796n174l898k479j266l11M02O56K33m67n34L21
52378C15733J176J141P41J164K436L405L555L640M214M622M126L085K324J966
52364C53328J589J056M50l62j382k018j687o66K66Q52J361J820J921J679J481
52349C59688J412J124N08j1L0O81J751K992L968M169L548K738K431K713L151L470
52333C94363L909M865O327P837Q979R740J0265J0452J0232J0127J0902J2496J3825
52320E14319J4086J3759J3725J3852J3303J2112J1495J2340J4083J5548J6337
52309F64959J6830J7185J7097J6536J6115J6400J7141J7530J7116J6184J5239
52298H48332J4454J3801J3379J3115J2336J0278P212M449K755J386p22l249m881
$$ plain form
52285 932645 927391 921924 915531 908151 900878 894763 889640 884535 878995 873692 869833 868112 868214 869221
52271 869221 870479 872068 874495 878135 883120 889532 897308 905990 914938 923942 933355 943529 954380 965680
52257 965680 977538 990362 1004422 1019628 1035536 1051381 1066218 1079356 1090711 1100615 1109323 1116803
52245 1116803 1122938 1127610 1130532 1131300 1129885 1126978 1123545 1119873 1115265 1108828 1100562 1091458 1082507 1073831
52231 1073831 1064944 1055606 1046095 1036679 1027244 1017651 1008217 999571 992076 985662 980166 975604 971965 968987
52217 968987 966303 963794 961626 959921 958559 957453 956951 957763 960336 964430 969367 974638 980064 985400 990108
52202 990108 993777 996766 1000163 1004914 1010955 1017272 1022905 1027826 1032771 1038315 1044365 1050609 1057088 1063978
52188 1063978 1070947 1077112 1081724 1084569 1085645 1084789 1081916 1077412 1072024 1066296 1060255 1053563 1045933 1037498
$$ packed form
52285I32645n254n467o393p380p273o115n123n105n540n303l859j721J02J007
52271H69221J258J589K427L640M985O412P776Q682Q948R004R413J0174J0851J1300
52257I65680J1858J2824J4060J5206J5908J5845J4837J3138J1355R904Q708P480
52245A116803O135M672K922P68j415k907l433l672m608o437q266r104q951q676
52231A073831q887r338r511r416r435r593r434q646p495o414n496m562l639k978
52217I68987k684k509k168j705j362j106n02Q12K573M094M937N271N426N336M708
52202I90108L669K989L397M751O041O317N633M921M945N544O050O244O479O890
52188A063978O969O165M612K845J076q56k873m504n388n728o041o692p630q435
$$ plain form
52174 1037498 1028888 1020824 1013568 1006904 1000694 995156 990418 986151 982074 978642 976741 976673 977847 979554
52160 979554 981532 983675 985634 987141 988456 990048 991912 993624 995016 996393 997898 999063 999339 998948 998804
52145 998804 999502 1000754 1002107 1003906 1006921 1010961 1014445 1015824 1015058 1013249 1011195 1009111 1007636 1008055 1011007
52130 1011007 1015622 1020631 1025934 1032468 1040939 1051446 1064197 1079675 1097841 1117814 1138694 1160252
52118 1160252 1182565 1205409 1228391 1251293 1273876 1295571 1315828 1334745 1353045 1371387 1389792
52107 1389792 1407585 1423777 1437668 1449401 1459879 1469983 1479893 1489258 1497826 1505708 1513100 1519942
52095 1519942 1525743 1529619 1530606 1528134 1522235 1513364 1502239 1489725 1476385 1461998 1446064 1429034 1412512
52082 1412512 1397784 1384683 1372491 1361368 1352071 1344668 1338545 1333494 1329694 1326682 1323644 1321071 1320903
$$ packed form
52174A037498q610q064p256o664o210n538m738m267m077l432j901o8J174J707
52160I79554J978K143J959J507J315J592J864J712J392J377J505J165K76l91j44
52145I98804O98J252J353J799L015M040L484J379p66j809k054k084j475M19K952
52130A011007M615N009N303O534Q471J0507J2751J5478J8166J9973K0880K1558
52118A160252K2313K2844K2982K2902K2583K1695K0257J8917J8300J8342J8405
52107A389792J7793J6192J3891J1733J0478J0104R910R365Q568P882P392O842
52095A519942N801L876R87k472n899q871j1125j2514j3340j4387j5934j7030j6522
52082A412512j4728j3101j2192j1123r297p403o123n051l800l012l038k573j68
$$ plain form
52069 1320903 1324310 1330247 1336945 1344010 1352184 1361716 1372054 1382790 1393945 1405498 1417431 1430107
52057 1430107 1443775 1457776 1471045 1483331 1495193 1506762 1517282 1525986 1532680 1537289 1539452 1538824
52045 1538824 1535282 1528681 1519025 1507033 1493920 1480347 1466072 1450875 1435235 1419806 1404768 1390118
52033 1390118 1376078 1362710 1349535 1336058 1322490 1309469 1297243 1285467 1273640 1261417 1248683
52022 1248683 1235713 1223210 1211882 1201848 1192572 1183359 1173994 1164996 1157189 1150792 1145029 1138913 1132199
52009 1132199 1125128 1117445 1108462 1098052 1086651 1074115 1059534 1042686 1024751 1006974 989385 971597
51997 971597 954052 937520 921955 906913 892655 879721 867679 855473 842895 830577 818435
51986 818435 805325 790510 774520 758254 742153 726602 712172 698840 685661 671795 657368
$$ packed form
52069A320903L407N937O698P065Q174R532J0338J0736J1155J1553J1933J2676
52057A430107J3668J4001J3269J2286J1862J1569J0520Q704O694M609K163o28
52045A538824l542o601r656j1992j3113j3573j4275j5197j5640j5429j5038j4650
52033A390118j4040j3368j3175j3477j3568j3021j2226j1776j1827j2223j2734
52022A248683j2970j2503j1328j0034r276r213r365q998p807o397n763o116o714
52009A132199p071p683q983j0410j1401j2536j4581j6848j7935j7777j7589j7788
51997I71597j7545j6532j5565j5042j4258j2934j2042j2206j2578j2318j2142
51986H18435j3110j4815j5990j6266j6101j5551j4430j3332j3179j3866j4427
$$ plain form
51975 657368 642910 628625 614786 602233 591827 583719 577683 573780 572153 572513 574424 577877 583012
51962 583012 589442 596313 602905 608737 613259 615941 616601 615276 611890 606496 599783 592896 586739 581734
51948 581734 578120 576006 575067 574688 574724 576000 579817 586910 596828 608310 620335 632844 646319 660702
51934 660702 674991 687999 699171 708453 715693 720468 722291 720681 715276 706241 694406 680677 665452
51921 665452 648878 631426 613823 596607 580216 565312 552488 541667 532336 524425 518485 514943
51909 514943 513648 514315 516939 521510 527716 535232 544089 554468 566255 579051 592439 606102 619721
51896 619721 632924 645224 655906 664022 668568 668619 663428 652758 637318 618700 598724 578874 560282
51883 560282 543839 530020 518810 510133 504273 501559 501636 503379 505714 508355 511541 515233 518860 521898
$$ packed form
51975F57368j4458j4285j3839j2553j0406q108o036l903j627L60J911L453N135
51962E83012O430O871O592N832M522K682O60j325l386n394o713o887o157n005
51948E81734l614k114r39l79L6J276L817P093R918J1482J2025J2509J3475J4383
51934F60702J4289J3008J1172R282P240M775J823j610n405r035j1835j3729j5225
51921F65452j6574j7452j7603j7216j6391j4904j2824j0821r331p911n940l542
51909E14943j295O67K624M571O206P516Q857J0379J1787J2796J3388J3663J3619
51896F19721J3203J2300J0682Q116M546N1n191j0670j5440j8618j9976j9850j8592
51883E60282j6443j3819j1210q677n860k714P7J743K335K641L186L692L627L038
$$ plain form
51869 521898 524318 526190 527024 526037 523149 519288 515375 511367 506803 502072 498461 496753 496331 496037 495601
51854 495601 495753 497081 499194 501071 501838 501101 498827 495195 490524 485168 479390 473359 467160 460823 454472
51839 454472 448559 443816 440725 439063 438169 437670 437682 438312 439342 440592 442208 444176 445844 446494 446250 445815
51823 445815 445292 443981 441571 438871 436861 435558 434401 433396 433132 433811 435006 436454 438377 440717 442617
51808 442617 443153 442396 441334 440768 440606 440238 439362 438244 437279 436591 436208 436444 437722 439952 442351 444015 444493
51791 444493 443741 441863 439150 436069 432937 429824 426976 424983 424097 423691 422917 421705 420601 419786 418943 418117
51775 418117 418002 419218 421767 425381 429875 434961 440240 445741 452118 459985 469212 478975 488153 495602
51761 495602 500595 503332 504653 504930 503586 500007 494499 487893 480579 472542 464194 456481 450050 444718
$$ packed form
51869E21898K420J872Q34r87k888l861l913m008m564m731l611j708m22k94m36
51854D95601J52J328K113J877P67p37k274l632m671n356n778o031o199o337o351
51839D54472n913m743l091j662q94m99J2O30J030J250J616J968J668O50k44m35
51823D45815n23j311k410k700k010j303j157j005k64O79J195J448J923K340J900
51808D42617N36p57j062n66j62l68q76j118r65o88l83K36J278K230K399J664M78
51791D44493p52j878k713l081l132l113k848j993q86m06p74j212j104q15q43q26
51775D18117j15J216K549L614M494N086N279N501O377P867R227R763R178P449
51761D95602M993K737J321K77j344l579n508o606p314q037q348p713o431n332
$$ plain form
51747 444718 439965 435682 432308 430357 429916 430543 431711 433345 435799 439291 443633 448644 454526 461486 469160
51732 469160 476794 483886 490295 495708 499407 500827 500275 499016 498634 500154 503477 507506 510868 512638 512602
51717 512602 511008 508211 504429 499800 494687 489885 486283 484155 482864 481353 478954 475863 473027 471495
51703 471495 471583 472632 473768 474755 475710 476195 475328 473007 470317 468319 467039 466162 466108 467557 470102 472155
51687 472155 472263 470068 466098 461237 456404 452116 448154 443993 439646 435675 432407 429646 427294 425706
51673 425706 425191 425568 426543 428269 431205 435558 441099 447489 454728 463243 473426 484852 496040 505294
51659 505294 511736 515329 516118 514018 509396 503308 496906 490940 485944 482467 480841 480981 482577 485128 487668
51644 487668 488891 487895 484536 478946 471226 462016 452815 445014 438690 432918 427190 422078 418484 416790
$$ packed form
51747D44718m753m283l374j951m41O27J168J634K454L492M342N011N882O960P674
51732D69160P634P092O409N413L699J420n52j259l82J520L323M029L362J770l6
51717E12602j594k797l782m629n113m802l602k128j291j511k399l091k836j532
51703D71495Q8J049J136R87R55M85q67k321k690j998j280q77n4J449K545K053
51687D72155J08k195l970m861m833m288l962m161m347l971l268k761k352j588
51673D25706n15L77R75J726K936M353N541O390P239Q515J0183J1426J1188R254
51659E05294O442L593P89k100m622o088o402n966m996l477j626J40J596K551K540
51644D87668J223r96l359n590p720r210r201p801o324n772n728n112l594j694
$$ plain form
51630 416790 416814 418159 420312 422667 424694 426035 426506 426189 425521 424956 424453 423552 422005 420015 417750 414993
51614 414993 411639 408278 405859 404764 404495 404232 403452 402057 400364 399095 398993 400150 401975 404125 407212
51599 407212 412142 418889 426438 433991 441749 450321 459877 470139 480733 490993 499662 505422 507833
51586 507833 507494 505291 501815 497471 492733 488183 484544 482724 483495 486976 492685 500214 509663 521354
51572 521354 535293 551038 567864 585033 602137 619263 636600 653793 670004 684810 698929
51561 698929 713893 731166 751593 775445 802698 833332 867318 903973 941175 975523 1003739
51550 1003739 1024055 1036228 1040500 1036811 1024960 1005214 978648 946917 911649 874047 835094 796023
51538 796023 758296 723062 690863 661916 636286 613648 593355 575126 559387 546510 535898
$$ packed form
51630D16790K4J345K153K355K027J341M71l17o68n65n03r01j547j990k265k757
51614D14993l354l361k419j095k69k63p80j395j693j269j02J157J825K150L087
51599D07212M930O747P549P553P758Q572R556J0262J0594J0260Q669N760K411
51586E07833l39k203l476m344m738m550l639j820P71L481N709P529R449J1691
51572E21354J3939J5745J6826J7169J7104J7126J7337J7193J6211J4806J4119
51561F98929J4964J7273K0427K3852K7253L0634L3986L6655L7202L4348K8216
51550A003739K0316J2173M272l689j1851j9746k6566l1731l5268l7602l8953l9071
51538G96023l7727l5234l2199k8947k5630k2638k0293j8229j5739j2877j0612
$$ plain form
51527 535898 526333 517168 508698 501347 494933 488929 483088 477550 472500 467950 463793 459922 456302 452987
51513 452987 450010 447298 444717 442252 440057 438303 436956 435768 434590 433756 433966 435491 437596 439174 440084
51498 440084 441492 444635 449555 455246 460679 465263 468686 470894 472120 472437 471401 468662 464865 461298
51484 461298 458553 456153 453605 451100 448796 446040 441984 436585 430479 424113 417684 411819 407473 404866
51470 404866 402936 400253 396347 391947 388072 385068 382492 379749 376788 374135 372297 371194 370297 369265
51456 369265 368335 368092 368915 370577 372309 373419 374143 375783 379698 386063 393866 402159 410930 420642 431456
51441 431456 443361 456642 471412 486607 500104 510209 516700 520325 521839 521910 521305 520391 518528 514608
51427 514608 508244 499992 490540 480349 470134 460840 452707 444988 437138 429799 423965 419567 415701 412168
$$ packed form
51527E35898r565r165q470p351o414o004n841n538n050m550m157l871l620l315
51513D52987k977k712k581k465k195j754j347j188j178q34K10J525K105J578R10
51498D40084J408L143M920N691N433M584L423K208J226L17j036k739l797l567
51484D61298k745k400k548k505k304k756m056n399o106o366o429n865m346k607
51470D04866j930k683l906m400l875l004k576k743k961k653j838j103q97j032
51456C69265r30k43Q23J662J732J110P24J640L915O365P803Q293Q771R712J0814
51441D31456J1905J3281J4770J5195J3497J0105O491L625J514P1o05r14j863l920
51427E14608o364q252r452j0191j0215r294q133p719p850p339n834m398l866l533
$$ plain form
51413 412168 409936 409847 411521 413869 416230 418559 420774 422451 423255 423462 423959 425714 429087 433599 438462
51398 438462 443401 448825 455155 462197 469336 476213 483006 490044 497329 504542 511544 518823 527376 538140
51384 538140 551654 568236 588256 612001 639508 670879 706575 746928 791329 838415 887190
51373 887190 937433 988590 1038535 1083809 1120930 1147432 1162225 1165656 1159027 1143446 1119061 1085876
51361 1085876 1045179 999476 950846 900084 847818 795815 746479 701368 660848 625017 594155
51350 594155 568096 545839 526206 508621 493090 479785 468865 460303 453471 447215 440779 434524
51338 434524 429323 425422 422343 419751 417804 416544 415543 414397 413167 412069 411027 409743 407909 405189
51324 405189 401387 396925 392783 389637 387301 385267 383372 381613 379794 378000 377035 377593 379142 380436 381136
$$ packed form
51413D12168k232q9J674K348K361K329K215J677Q04K07M97J755L373M512M863
51398D38462M939N424O330P042P139O877O793P038P285P213P002P279Q553J0764
51384E38140J3514J6582K0020K3745K7507L1371L5696M0353M4401M7086M8775
51373H87190N0243N1157M9945M5274L7121K6502J4793L431o629j5581k4385l3185
51361A085876m0697m5703m8630n0762n2266n2003m9336m5111m0520l5831l0862
51350E94155k6059k2257j9633j7585j5531j3305j0920q562o832o256o436o255
51338D34524n201l901l079k592j947j260j001j146j230j098j042j284j834k720
51324D05189l802m462m142l146k336k034j895j759j819j794r65N58J549J294P00
$$ plain form
51309 381136 382086 383811 385575 386448 386666 387279 388688 390137 390569 389636 387928 386487 386069 386710 387983 389670
51293 389670 391918 394651 397180 398741 399311 399586 400209 401203 402185 402897 403413 403806 403822 403157 402155 401852 402919
51276 402919 404785 406303 407083 407542 407789 407382 406385 405722 405944 406421 406445 406449 407292 408869 410353 411503 412696 413777
51258 413777 413907 412731 410844 408822 406582 404069 401818 400324 399308 398138 396677 395275 394159 393234 392381
51243 392381 391645 391174 391133 391574 392244 392669 392573 392167 391958 392390 393606 395359 397138 398571 399714 400729 401377
51226 401377 401243 400438 399563 398861 397932 396570 395383 395096 395518 395741 395323 394863 395315 396902 398852 400169 400607
51209 400607 400802 401477 402769 404464 406514 408859 411026 412638 414255 416999 421148 425755 429816 433087 435488
51194 435488 436609 436411 435715 435208 434508 432953 430885 429282 428384 427564 426477 425512 425042 424963 425065 425300 425558
$$ packed form
51309C81136R50J725J764Q73K18O13J409J449M32r33j708j441m18O41J273J687
51293C89670K248K733K529J561N70K75O23R94R82P12N16L93J6o65j002l03J067
51276D02919J866J518P80M59K47m07r97o63K22M77K4MQ43J577J484J150J193J081
51258D13777J30j176j887k022k240k513k251j494j016j170j461j402j116r25q53
51243C92381p36m71m1M41O70M25r6m06k09M32J216J753J779J433J143J015O48
51226D01377j34q05q75p02r29j362j187k87M22K23m18m60M52J587J950J317M38
51209D00607J95O75J292J695K050K345K167J612J617K744M149M607M061L271K401
51194D35488J121j98o96n07p00j555k068j603q98q20j087r65m70p9J02K35K58
$$ plain form
51177 425558 425616 425386 424848 423801 422113 420077 418070 416049 413849 411724 409986 408442 407009 406548 408058
51162 408058 411164 414504 417614 421145 425113 428362 430299 431786 433528 434790 434746 433973 433382 432558 430531
51147 430531 427589 424881 422645 420385 418535 418326 419800 421456 422315 422990 424118 425060 425121 425084 426282 428597
51131 428597 430516 431071 430802 430654 430677 430211 428953 427472 426637 426763 427386 427890 428248 429015 430661 433113 435920
51114 435920 438619 440926 442825 444577 446501 448701 451124 453797 456835 460264 464020 468013 471901 475034
51100 475034 477037 478363 479832 481693 483641 485586 487678 489532 490273 489661 488477 487365 485962 483699 480923
51085 480923 478592 477214 476609 476382 476075 475206 473786 472589 472338 472789 473133 473044 472707 472070 470862 469420 468733
51068 468733 469487 471544 474499 478238 482838 488377 494991 502689 511040 519539 528406 538499 550209 562891
$$ packed form
51177D25558N8k30n38j047j688k036k007k021k200k125j738j544j433m61J510
51162D08058L106L340L110L531L968L249J937J487J742J262m4p73n91q24k027
51147D30531k942k708k236k260j850k09J474J656Q59O75J128R42O1l7J198K315
51131D28597J919N55k69j48K3m66j258j481q35J26O23N04L58P67J646K452K807
51114D35920K699K307J899J752J924K200K423K673L038L429L756L993L888L133
51100D75034K003J326J469J861J948J945K092J854P41o12j184j112j403k263k776
51085D80923k331j378o05k27l07q69j420j197k51M51L44q9l37o37j208j442o87
51068D68733P54K057K955L739M600N539O614P698Q351Q499Q867J0093J1710J2682
$$ plain form
51054 562891 575550 587546 598439 607853 616134 624782 635513 648892 664145 680059 695591 709858
51042 709858 722231 732581 741007 747154 750163 749488 745574 739559 732464 724792 716640 707836 697921 686227
51028 686227 672245 656094 638699 621486 605786 592405 581654 573662 568496 565912 565130 565192 565738
51015 565738 567385 571124 577285 585166 593671 602068 610120 617719 624733 631139 637164 643315 650292 658682
51001 658682 668508 679131 689777 700160 710512 721145 732175 743507 754905 766151 777337 788850
50989 788850 800820 812752 823975 834285 843818 852493 860127 867017 873850 880944 888081 895244 903007
50976 903007 911933 921943 932529 943317 954343 966208 980233 998026 1020547 1047816 1079655 1116221
50964 1116221 1157464 1202601 1250692 1301492 1355230 1411737 1470282 1530056 1590236 1649644 1706876
$$ packed form
51054E62891J2659J1996J0893R414Q281Q648J0731J3379J5253J5914J5532J4267
51042G09858J2373J0350Q426O147L009o75l914o015p095p672q152q804r915j1694
51028F86227j3982j6151j7395j7213j5700j3381j0751p992n166k584p82O2N46
51015E65738J647L739O161P881Q505Q397Q052P599P014O406O025O151O977Q390
51001F58682R826J0623J0646J0383J0352J0633J1030J1332J1398J1246J1186J1513
50989G88850J1970J1932J1223J0310R533Q675P634O890O833P094P137P163P763
50976I03007Q926J0010J0586J0788J1026J1865J4025J7793K2521K7269L1839L6566
50964A116221M1243M5137M8091N0800N3738N6507N8545N9774O0180N9408N7232
$$ plain form
50953 1706876 1760877 1810960 1856304 1895958 1929580 1957805 1981629 2001600 2017717 2029923 2038546
50942 2038546 2044471 2048995 2053326 2057963 2062457 2065782 2066925 2065225 2060322 2051904 2039663 2023599 2004314
50929 2004314 1982646 1958885 1932604 1903335 1871010 1835545 1796431 1753319 1706794 1658052 1607948
50918 1607948 1556930 1505849 1456129 1408881 1364293 1322125 1282424 1245505 1211579 1180741 1153108
50907 1153108 1128683 1107136 1087880 1070334 1054079 1038955 1025061 1012532 1001227 990818 981161
50896 981161 972439 964920 958764 953955 950107 946411 942306 938318 935729 935145 935795 936594 937450 939043 941571
50881 941571 944361 946789 949105 952178 956597 962126 967903 973192 978142 983798 991186 1000402 1010729 1021662
50867 1021662 1033546 1047141 1062731 1079848 1097843 1116631 1136979 1160101 1187019 1218227 1253899
$$ packed form
50953A706876N4001N0083M5344L9654L3622K8225K3824J9971J6117J2206Q623
50942B038546N925M524M331M637M494L325J143j700m903q418j2241j6064j9285
50929B004314k1668k3761k6281k9269l2325l5465l9114m3112m6525m8742n0104
50918A607948n1018n1081m9720m7248m4588m2168l9701l6919l3926l0838k7633
50907A153108k4425k1547j9256j7546j6255j5124j3894j2529j1305j0409r657
50896I81161q722p519o156m809l848l696m105l988k589n84O50P99Q56J593K528
50881I41571K790K428K316L073M419N529N777N289M950N656P388R216J0327J0933
50867A021662J1884J3595J5590J7117J7995J8788K0348K3122K6918L1208L5672
$$ plain form
50856 1253899 1294323 1340046 1391628 1449371 1513443 1584254 1662489 1748577 1842221 1942762 2050046
50845 2050046 2164533 2286294 2414090 2545826 2679700 2814509 2948895 3080755 3207451
50836 3207451 3326229 3434361 3529380 3609551 3673941 3721954 3753201 3768193 3768896 3758295 3739496
50825 3739496 3715405 3688811 3662216 3637486 3615937 3598724 3586796 3580354 3578438 3579065 3579607 3577146 3568723
50812 3568723 3551418 3522443 3479563 3421798 3349668 3264611 3168275 3062469 2949423 2831614 2711318
50801 2711318 2590667 2472145 2358605 2252571 2155601 2068324 1990889 1923283 1865457 1817349
50791 1817349 1778749 1749039 1727073 1711412 1700781 1694429 1692053 1693271 1697162 1702438 1708016 1713169 1717122
50778 1717122 1718942 1718126 1714976 1710036 1703294 1694293 1682829 1669160 1653591 1636238 1617104 1596060 1572838
$$ packed form
50856A253899M0424M5723N1582N7743O4072P0811P8235Q6088R3644J00541J07284
50845B050046J14487J21761J27796J31736J33874J34809J34386J31860J26696
50836C207451J18778J08132R5019Q0171O4390M8013L1247J4992P03j0601j8799
50825C739496k4091k6594k6595k4730k1549j7213j1928o442j916O27N42k461q423
50812C568723j7305k8975m2880n7765p2130q5057r6336j05806j13046j17809j20296
50801B711318j20651j18522j13540j06034r6970q7277p7435o7606n7826m8108
50791A817349l8600k9710k1966j5661j0631o352k376J218L891N276N578N153L953
50778A717122J820q16l150m940o742r001j1464j3669j5569j7353j9134k1044k3222
$$ plain form
50765 1572838 1547461 1520588 1493019 1464898 1435970 1406557 1377580 1349494 1321937 1294915 1269686
50754 1269686 1247814 1229649 1214336 1201101 1189916 1181013 1174485 1170540 1169667 1172182 1177869 1186314 1197506
50741 1197506 1211999 1230495 1253350 1280440 1311555 1346942 1387299 1433004 1483551 1538064 1596302
50730 1596302 1658778 1725779 1796689 1870447 1946245 2023309 2100184 2174771 2245212 2310483 2370050
50719 2370050 2423260 2469248 2507101 2535752 2553869 2560324 2555022 2539207 2514913 2484356 2449940 2414461
50707 2414461 2380808 2351258 2327112 2308920 2296774 2290305 2288624 2290489 2294540 2299342 2303243 2304259 2300090
50694 2300090 2288381 2267264 2235925 2194749 2144957 2088201 2026462 1962095 1897613 1835251 1776671
50683 1776671 1723027 1675204 1634030 1600195 1574013 1555363 1544094 1540490 1545105 1557998 1578333 1604855
$$ packed form
50765A572838k5377k6873k7569k8121k8928k9413k8977k8086k7557k7022k5229
50754A269686k1872j8165j5313j3235j1185q903o528l945q73K515N687Q445J1192
50741A197506J4493J8496K2855K7090L1115L5387M0357M5705N0547N4513N8238
50730A596302O2476O7001P0910P3758P5798P7064P6875P4587P0441O5271N9567
50719B370050N3210M5988L7853K8651J8117O455n302j5815k4294l0557l4416l5479
50707B414461l3653k9550k4146j8192j2146o469j681J865M051M802L901J016m169
50694B300090j1709k1117l1339m1176m9792n6756o1739o4367o4482o2362n8580
50683A776671n3644m7823m1174l3835k6182j8650j1269l604M615J2893K0335K6522
$$ plain form
50671 1604855 1636629 1673132 1713806 1757839 1804270 1851879 1898916 1943385 1983898 2020077 2051943
50660 2051943 2079221 2101571 2119368 2133779 2146084 2157235 2168064 2179312 2190998 2202032 2211014
50649 2211014 2217592 2222865 2228508 2235764 2245341 2257857 2273990 2294228 2318755 2347633 2380889 2418294
50637 2418294 2459159 2502506 2547379 2592854 2637735 2680618 2720517 2757410 2791792 2823565 2851629
50626 2851629 2874774 2892810 2906470 2916026 2919983 2914870 2896328 2861114 2809181 2744444 2673403 2602620
50614 2602620 2537104 2480227 2434099 2399469 2375709 2361379 2354786 2353930 2356401 2359866 2362518 2362680 2358111
50601 2358111 2346204 2324992 2293786 2252918 2203185 2145656 2081782 2013518 1943132 1872574 1802886
50590 1802886 1734477 1668127 1605383 1547726 1495764 1449553 1409112 1373978 1342760 1314184 1288456
$$ packed form
50671A604855L1774L6503M0674M4033M6431M7609M7037M4469M0513L6179L1866
50660B051943K7278K2350J7797J4411J2305J1151J0829J1248J1686J1034Q982
50649B211014O578N273N643P256R577J2516J6133K0238K4527K8878L3256L7405
50637B418294M0865M3347M4873M5475M4881M2883L9899L6893L4382L1773K8064
50626B851629K3145J8036J3660R556L957n113j8542l5214n1933o4737p1041p0783
50614B602620o5516n6877m6128l4630k3760j4330o593q56K471L465K652J62m569
50601B358111j1907k1212l1206m0868m9733n7529o3874o8264p0386p0558o9688
50590A802886o8409o6350o2744n7657n1962m6211m0441l5134l1218k8576k5728
$$ plain form
50579 1288456 1266658 1248742 1233222 1219062 1206757 1196940 1188885 1181330 1174126 1168133 1163918 1161541 1161332
50566 1161332 1163808 1168736 1175265 1183321 1194165 1209091 1228071 1250096 1274498 1301522 1331818 1365826
50554 1365826 1403630 1445081 1489847 1537352 1586654 1636513 1685710 1733349 1778773 1821329 1860550
50543 1860550 1896643 1930592 1963663 1997061 2032196 2070934 2114998 2164966 2220144 2279705 2343841
50532 2343841 2413619 2489879 2572729 2662187 2758748 2862923 2974497 3092775 3217363 3348021
50522 3348021 3483629 3621849 3759943 3895365 4025319 4146410 4255346 4349729 4427756 4487502
50512 4487502 4526920 4544249 4538029 4507270 4452429 4376084 4281905 4172985 4051863 3922055 3788587
50501 3788587 3656700 3530661 3414052 3310423 3222944 3153754 3104038 3074412 3064753 3073763 3098967
$$ packed form
50579A288456k1798j7916j5520j4160j2305r817q055p555p204n993m215k377k09
50566A161332K476M928O529Q056J0844J4926J8980K2025K4402K7024L0296L4008
50554A365826L7804M1451M4766M7505M9302M9859M9197M7639M5424M2556L9221
50543A860550L6093L3949L3071L3398L5135L8738M4064M9968N5178N9561O4136
50532B343841O9778P6260Q2850Q9458R6561J04175J11574J18278J24588J30658
50522C348021J35608J38220J38094J35422J29954J21091J08936R4383P8027N9746
50512D487502L9418J7329o220l0759n4841p6345r4179j08920j21122j29808j33468
50501C788587j31887j26039j16609j03629q7479o9190m9716k9626r659R010K5204
$$ plain form
50490 3098967 3137001 3183710 3234268 3283521 3326181 3356794 3370193 3362564 3332067 3278459 3202701
50479 3202701 3107349 2996704 2875623 2747983 2616587 2484255 2354273 2229561 2111829 2001705
50469 2001705 1899319 1804692 1717887 1639039 1568151 1504820 1448324 1397972 1353160 1313275 1277924
50458 1277924 1247265 1221643 1200756 1183537 1169105 1157488 1149158 1144179 1142087 1142332 1144425 1147841 1152283
50445 1152283 1158076 1165917 1176059 1187917 1200474 1212808 1224204 1234130 1242367 1249098 1254711 1259631 1264351
50432 1264351 1269358 1274916 1281194 1288825 1298942 1312236 1328135 1345475 1363942 1384345 1407416 1432947
50420 1432947 1460326 1489422 1520556 1554132 1590877 1632098 1678944 1731334 1788129 1848418 1912174
50409 1912174 1979610 2050336 2123298 2197167 2270579 2342401 2411972 2478822 2541899 2599319 2649085
$$ packed form
50490C098967L8034M6709N0558M9253M2660L0613J3399p629l0497n3608p5758
50479C202701r5352j10645j21081j27640j31396j32332j29982j24712j17732j10124
50469B001705j02386r4627q6805p8848p0888o3331n6496n0352m4812l9885l5351
50458A277924l0659k5622k0887j7219j4432j1617q330m979k092K45K093L416M442
50445A152283N793P841J0142J1858J2557J2334J1396R926Q237O731N613M920M720
50432A264351N007N558O278P631J0117J3294J5899J7340J8467K0403K3071K5531
50420A432947K7379K9096L1134L3576L6745M1221M6846N2390N6795O0289O3756
50409A912174O7436P0726P2962P3869P3412P1822O9571O6850O3077N7420M9766
$$ plain form
50398 2649085 2689858 2720871 2741393 2750540 2747434 2731311 2701661 2658575 2602942 2536278 2460590 2378543
50386 2378543 2293489 2208912 2127825 2052676 1985443 1927479 1879404 1841429 1813705 1796205 1788544
50375 1788544 1790160 1800352 1817682 1839511 1862630 1884272 1902216 1914093 1917353 1910145 1891915 1863119
50363 1863119 1824821 1778691 1726857 1671300 1613467 1554555 1495796 1438228 1382449 1328902 1278164
50352 1278164 1230729 1186607 1145384 1106599 1069944 1035313 1002936 973408 947396 925262 906993
50341 906993 892271 880481 870828 862658 855637 849629 844655 841087 839513 840075 842229 845569 850660 858509
50327 858509 869273 882051 896023 911234 928010 946004 964079 980706 994128 1002568 1004996 1001867
50315 1001867 994916 986256 977676 970331 964530 959865 956022 953409 952578 953173 954170 955236 957115 960311 964055
$$ packed form
50398B649085M0773L1013K0522R147l106j6123k9650m3086n5633o6664p5688q2047
50386B378543q5054q4577q1087p5149o7233n7964m8075l7975k7724j7500p661
50375A788544J616J0192J7330K1829K3119K1642J7944J1877L260p208j8230k8796
50363A863119l8298m6130n1834n5557n7833n8912n8759n7568n5779n3547n0738
50352A278164m7435m4122m1223l8785l6655l4631l2377k9528k6012k2134j8269
50341I06993j4722j1790r653q170p021o008m974l568j574N62K154L340N091P849
50327H58509J0764J2778J3972J5211J6776J7994J8075J6627J3422Q440K428l129
50315A001867o951q660q580p345n801m665l843k613q31N95R97J066J879L196L744
$$ plain form
50300 964055 967185 969519 971646 973673 975062 975629 975890 976219 976313 975734 974434 972504 969991 967274 965051 963451
50284 963451 961550 958336 953915 949398 945871 943930 943846 945460 948023 950797 953934 958248 964103 971003 978312
50269 978312 985841 993619 1001657 1010078 1018877 1027203 1033533 1037145 1039094 1041177 1044111 1047209 1049619 1051263
50255 1051263 1052541 1053690 1054687 1055410 1055692 1055457 1054994 1054957 1055950 1058221 1061843 1067002 1073975 1082990 1094339 1108587
50239 1108587 1126481 1148603 1175105 1205718 1239932 1277248 1317378 1360173 1405200 1451308 1496725
50228 1496725 1539675 1578982 1614173 1645194 1672142 1695241 1714848 1731388 1745239 1756569 1764963
50217 1764963 1768966 1766108 1753800 1730641 1697062 1654811 1605954 1552420 1496289 1440112 1386579 1337828
50205 1337828 1295041 1258583 1228240 1203174 1181887 1162559 1143598 1123809 1102112 1077463 1049397
$$ packed form
50300I64055L130K334K127K027J389N67K61L29R4n79j300j930k513k717k223j600
50284I63451j901l214m421m517l527j941q4J614K563K774L137M314N855O900P309
50269I78312P529P778Q038Q421Q799Q326O330L612J949K083K934L098K410J644
50255A051263J278J149R97P23K82k35m63l7R93K271L622N159O973R015J1349J4248
50239A108587J7894K2122K6502L0613L4214L7316M0130M2795M5027M6108M5417
50228A496725M2950L9307L5191L1021K6948K3099J9607J6540J3851J1330Q394
50217A764963M003k858j2308k3159l3579m2251m8857n3534n6131n6177n3533m8751
50205A337828m2787l6458l0343k5066k1287j9328j8961j9789k1697k4649k8066
$$ plain form
50194 1049397 1018696 987300 957327 929949 905049 881869 860029 840007 822607 808016 795526
50183 795526 784190 773601 763970 755610 748480 742124 735926 729578 723412 718124 713997 710583 707343 704403
50169 704403 702261 700920 699775 698416 697071 696118 695614 695575 696405 698571 701976 705970 709990 714016 718447
50154 718447 723770 730321 738191 747298 757584 768971 780953 792354 801802 808589 813015 815932 818083
50141 818083 819852 821373 822677 823822 825029 826728 829439 833660 839871 848526 859823 873496 889045
50128 889045 906362 925987 948573 974196 1002508 1033596 1068400 1108160 1153685 1205340 1263355
50117 1263355 1327800 1398386 1474633 1555990 1641309 1728308 1814170 1896880 1975733 2050578 2121199
50106 2121199 2187614 2250267 2309323 2363924 2412493 2453375 2484613 2503362 2506341 2491302 2457999
$$ packed form
50194A049397l0701l1396k9973k7378k4900k3180k1840k0022j7400j4591j2490
50183G95526j1336j0589r631q360p130o356o198o348o166n288m127l414l240k940
50169G04403k142j341j145j359j345r53n04l9Q30K166L405L994M020M026M431
50154G18447N323O551P870R107J0286J1387J1982J1401R448O787M426K917K151
50141H18083J769J521J304J145J207J699K711M221O211Q655J1297J3673J5549
50128H89045J7317J9625K2586K5623K8312L1088L4804L9760M5525N1655N8015
50117A263355O4445P0586P6247Q1357Q5319Q6999Q5862Q2710P8853P4845P0621
50106B121199O6415O2653N9056N4601M8569M0882L1238J8749K979j5039l3303
$$ plain form
50095 2457999 2407881 2343288 2267022 2182160 2091732 1998444 1904714 1812848 1724988 1642826 1567396
50084 1567396 1499073 1437820 1383502 1336056 1295398 1261169 1232509 1208016 1186056 1165460 1146107
50073 1146107 1128749 1114103 1102136 1092176 1083471 1075497 1067971 1060886 1054403 1048453 1042497 1035867 1028330
50060 1028330 1020136 1011556 1002579 993020 982787 972075 961417 951437 942365 933884 925700 918124 911723
50047 911723 906512 901956 897885 894984 894098 895382 898460 903197 909833 918311 927862 937518 946923 956411
50033 956411 966315 976418 986264 995851 1005707 1016154 1026653 1036041 1043369 1048475 1051841 1054103 1055582
50020 1055582 1056141 1055452 1053452 1050470 1046882 1042843 1038482 1034131 1030013 1025863 1021357 1017031 1014422 1015027 1019207
50005 1019207 1026256 1035428 1046768 1061122 1079662 1103490 1133415 1169738 1212087 1259626 1311595 1367467
$$ packed form
50095B457999n0118o4593p6266q4862r0428r3288r3730r1866q7860q2162p5430
50084A567396o8323o1253n4318m7446m0658l4229k8660k4493k1960k0596j9353
50073A146107j7358j4646j1967r960q705p974p526p085o483n950n956o630p537
50060A028330q194q580q977r559j0233j0712j0658r980r072q481q184p576o401
50047I11723n211m556m071k901q86J284L078M737O636Q478R551R656R405R488
50033I56411R904J0103R846R587R856J0447J0499R388P328N106L366K262J479
50020A055582N59o89k000k982l588m039m361m351m118m150m506m326k609O05M180
50005A019207P049R172J1340J4354J8540K3828K9925L6323M2349M7539N1969N5872
$$ plain form
49993 1367467 1426244 1485611 1542313 1593722 1638865 1677879 1710964 1738337 1760809 1779521 1794857
49982 1794857 1805976 1811518 1810389 1801681 1784180 1756295 1716620 1664840 1602482 1532806 1459579 1385761
49970 1385761 1313357 1244166 1180007 1122118 1070864 1026149 987630 954408 925189 899226 876747
49959 876747 858098 842921 830623 821150 814683 810872 809101 809349 812040 816960 822955 828847 834095 838382
49945 838382 841162 842105 841646 840676 839786 838957 837722 835340 831049 824518 815967 805635 793301 778748 762563
49930 762563 746024 730088 714868 700297 686948 675847 667525 661439 656349 651227 646030 641750 639541
49917 639541 639539 640656 641739 642722 644296 646645 649167 651560 654550 659113 665354 672621 680447 688879 698106
49902 698106 708319 719894 733105 747475 761857 775317 787588 798540 807634 814197 817940 818856
$$ packed form
49993A367467N8777N9367N6702N1409M5143L9014L3085K7373K2472J8712J5336
49982A794857J1119N542j129q708j7501k7885l9675n1780o2358o9676p3227p3818
49970A385761p2404o9191o4159n7889n1254m4715l8519l3222k9219k5963k2479
49959H76747j8649j5177j2298r473o467l811j771K48K691M920N995N892N248M287
49945H38382K780R43m59r70q90q29j235k382m291o531q551j0332j2334j4553j6185
49930G62563j6539j5936j5220j4571j3349j1101q322o086n090n122n197m280k209
49917F39541kJ117J083R83J574K349K522K393K990M563O241P267P826Q432R227
49902F98106J0213J1575J3211J4370J4382J3460J2271J0952R094O563L743R16
$$ plain form
49890 818856 816929 812311 805645 797757 788908 778649 766524 752788 738312 723883 709772 696044
$$ packed form
49890H18856j927m618o666p888q849j0259j2125j3736j4476j4429j4111j3728
$$ [...]
##END NTUPLES=NMR SPECTRUM
##END=
