##TITLE=AC1415_BRAA12224_7652885_dGozNmR9BP
##JCAMPDX= 6.0         $$ Bruker NMR JCAMP-DX V2.0
##DATA TYPE= NMR SPECTRUM
##DATA CLASS= NTUPLES
##ORIGIN= BRUKER
##OWNER= Administrator
$$ 1.72 TOPSPIN		Version 2.1
$$ 2013-04-15 09:21:01.303 -0700  Administrator@X
$$ Compression mode = diff/dup
##.OBSERVE FREQUENCY= 400.02188249412
##.OBSERVE NUCLEUS= ^1H
##.ACQUISITION MODE= SIMULTANEOUS (DQD)
##.ACQUISITION SCHEME= undefined
##.AVERAGES= 8
##.DIGITISER RES= 22
##SPECTROMETER/DATA SYSTEM= spect
##.PULSE SEQUENCE= zg30
##.SOLVENT NAME= COFFEE_meoh
##.SHIFT REFERENCE= INTERNAL, COFFEE_meoh, 1, 14.98509
##AUDIT TRAIL= $$ (NUMBER, WHEN, WHO, WHERE, PROCESS, VERSION, WHAT)
$$ ##TITLE= Audit trail, TOPSPIN		Version 2.1
$$ ##JCAMPDX= 5.01
$$ ##ORIGIN= Bruker BioSpin GmbH
$$ ##OWNER= Administrator
$$ $$ E:\/data/COFFEE/nmr/AC1415_BRAA12224_7652885_dGozNmR9BP/10/pdata/1/auditp.txt
$$ ##AUDIT TRAIL=  $$ (NUMBER, WHEN, WHO, WHERE, PROCESS, VERSION, WHAT)
(   1,<2013-04-15 09:20:53.819 -0700>,<Administrator>,<X>,<go>,<TOPSPIN 2.1>,
      <created by zg
	started at 2013-04-15 09:19:47.897 -0700,
	POWCHK enabled, PULCHK disabled,
       configuration hash MD5:
       33 CF 6A 21 5C D3 B9 40 6C 15 AA 8D 27 A2 4F 13
       data hash MD5: 64K
       B6 44 34 DC 80 D6 6E AE 90 F8 96 41 08 A6 02 DA>)
(   2,<2013-04-15 09:20:57.053 -0700>,<Administrator>,<X>,<proc1d>,<TOPSPIN 2.1>,
      <Start of raw data processing
       efp LB = 0 FT_mod = 6 PKNL = 1 PHC0 = 0 PHC1 = 0 SI = 32K 
       data hash MD5: 32K
       C6 40 3D 31 56 5E 21 6D 9D 0C AF B9 D0 6A F9 6F>)
(   3,<2013-04-15 09:20:57.459 -0700>,<Administrator>,<X>,<proc1d>,<TOPSPIN 2.1>,
      <pk PHC0 = 96.94885 PHC1 = 0 
       data hash MD5: 32K
       5C 79 EC 8F DB 17 E4 B2 6E 90 1B 55 8A F8 1B DC>)
(   4,<2013-04-15 09:20:57.678 -0700>,<Administrator>,<X>,<proc1d>,<TOPSPIN 2.1>,
      <abs ABSG = 1 
       data hash MD5: 32K
       95 8C C4 7F 3D EB B4 3F DC 9D 5E 88 6D 8E DB A0>)
(   5,<2013-04-15 09:20:57.834 -0700>,<Administrator>,<X>,<proc1d>,<TOPSPIN 2.1>,
      <abs ABSG = 2 
       data hash MD5: 32K
       47 34 56 C8 A5 35 70 06 0F 96 23 CD EC 30 58 51>)
(   6,<2013-04-15 09:20:57.912 -0700>,<Administrator>,<X>,<proc1d>,<TOPSPIN 2.1>,
      <abs ABSG = 3 
       data hash MD5: 32K
       43 6D BD 46 6D AF 26 D1 DA 8F 3A 4A C4 2C BA 12>)
(   7,<2013-04-15 09:20:58.069 -0700>,<Administrator>,<X>,<proc1d>,<TOPSPIN 2.1>,
      <abs ABSG = 4 
       data hash MD5: 32K
       13 FE 46 72 67 74 C4 5D 4B 03 D1 72 03 98 3B 3E>)
(   8,<2013-04-15 09:20:58.162 -0700>,<Administrator>,<X>,<proc1d>,<TOPSPIN 2.1>,
      <abs ABSG = 5 
       data hash MD5: 32K
       C2 51 26 8D 36 C5 A9 6C 08 E0 12 17 40 5A 98 06>)
$$ ##END=
$$ 
$$ $$ hash MD5
$$ $$ 53 4D BE 5A 29 90 56 F5 21 51 B1 FD F7 0E 34 27
##$RELAX= 
##$RELAX= 
##$RELAX= 
##$RELAX= 
##$RELAX= 
##$RELAX= 
##$RELAX= 
$$ Bruker specific parameters
$$ --------------------------
##$DU= <E:\>
##$EXPNO= 10
##$NAME= <AC1415_BRAA12224_7652885_dGozNmR9BP>
$$ [...]
##$TP= (0..7)
150 150 150 150 150 150 150 150
##$TP07= 0
##$TPNAME0= <>
##$TPNAME1= <>
##$TPNAME2= <>
##$TPNAME3= <>
##$TPNAME4= <>
##$TPNAME5= <>
##$TPNAME6= <>
##$TPNAME7= <>
##$TPOAL= (0..7)
0.5 0.5 0.5 0.5 0.5 0.5 0.5 0.5
##$TPOFFS= (0..7)
0 0 0 0 0 0 0 0
##$TUNHIN= 0
##$TUNHOUT= 0
##$TUNXOUT= 0
##$USERA1= <user>
##$USERA2= <user>
##$USERA3= <user>
##$USERA4= <user>
##$USERA5= <user>
##$V9= 5
##$VALIST= <valist>
##$VCLIST= <CCCCCCCCCCCCCCC>
##$VD= 0
##$VDLIST= <DDDDDDDDDDDDDDD>
##$VPLIST= <PPPPPPPPPPPPPPP>
##$VTLIST= <TTTTTTTTTTTTTTT>
##$WBST= 2048
##$WBSW= 25
##$XGAIN= (0..3)
0 0 0 0
##$XL= 0
##$YL= 0
##$YMAX_a= 651910
##$YMIN_a= -554667
##$ZGOPTNS= <>
##$ZL1= 120
##$ZL2= 120
##$ZL3= 120
##$ZL4= 120
##$ABSF1= 14.98509
##$ABSF2= -5.573092
##$ABSG= 5
##$ABSL= 3
##$ALPHA= 0
##$AQORDER= 0
##$ASSFAC= 0
##$ASSFACI= 0
##$ASSFACX= 0
##$ASSWID= 0
##$AUNMP= <proc_prof1d_extract_pilot.lims>
##$AXLEFT= 0
##$AXNAME= <>
##$AXNUC= <1H>
##$AXRIGHT= 0
##$AXTYPE= 0
##$AXUNIT= <>
##$AZFE= 0.1
##$AZFW= 0.1
##$BCFW= 0
##$BC_mod= 0
##$BYTORDP= 0
##$COROFFS= 0
##$CY= 15
##$DATMOD= 1
##$DC= 0
##$DFILT= <>
##$DTYPP= 0
##$F1P= 0
##$F2P= 0
##$FCOR= 0.5
##$FTSIZE= 32768
##$FT_mod= 6
##$GAMMA= 0
##$GB= 0
##$INTBC= 1
##$INTSCL= 1
##$ISEN= 128
##$LB= 0
##$LEV0= 0
##$LPBIN= 0
##$MAXI= 10000
##$MC2= 0
##$MEAN= 0
##$ME_mod= 0
##$MI= 0
##$NCOEF= 0
##$NC_proc= -8
##$NLEV= 6
##$NOISF1= 0
##$NOISF2= 0
##$NSP= 0
##$NTH_PI= 0
##$NZP= 0
##$OFFSET= 14.98509
##$PC= 1
##$PHC0= 96.94885
##$PHC1= 0
##$PH_mod= 1
##$PKNL= yes
##$PPARMOD= 0
##$PPDIAG= 0
##$PPIPTYP= 0
##$PPMPNUM= 2147483647
##$PPRESOL= 1
##$PSCAL= 4
##$PSIGN= 0
##$PYNMP= <proc.py>
##$REVERSE= no
##$SF= 400.02
##$SI= 32768
##$SIGF1= 0
##$SIGF2= 0
##$SINO= 400
##$SIOLD= 32768
##$SPECTYP= <>
##$SREGLST= <1H.CDCl3>
##$SSB= 0
##$STSI= 32768
##$STSR= 0
##$SW_p= 8223.68421052631
##$SYMM= 0
##$S_DEV= 0
##$TDeff= 65536
##$TDoff= 0
##$TI= <>
##$TILT= no
##$TM1= 0
##$TM2= 0
##$TOPLEV= 0
##$USERP1= <user>
##$USERP2= <user>
##$USERP3= <user>
##$USERP4= <user>
##$USERP5= <user>
##$WDW= 1
##$XDIM= 32768
##$YMAX_p= 476270958
##$YMIN_p= -663702
##$CURPLOT= <Network HP LaserJet P1505>
##$CURPRIN= <$Network HP LaserJet P1505>
##$DFORMAT= <normdp>
##$LAYOUT= <+/1D_H.xwp>
##$LFORMAT= <normlp>
##$PFORMAT= <normpl>
##$SURQMSG= 1
$$ End of Bruker specific parameters
$$ ---------------------------------
##NTUPLES= NMR SPECTRUM
##VAR_NAME=  FREQUENCY,     SPECTRUM/REAL,   SPECTRUM/IMAG
##SYMBOL=    X,             R,               I
##VAR_TYPE=  INDEPENDENT,   DEPENDENT,       DEPENDENT
##VAR_FORM=  AFFN,          ASDF,            ASDF
##VAR_DIM=   32768,         32768,           32768
##UNITS=     HZ,            ARBITRARY UNITS, ARBITRARY UNITS
##FACTOR=    0.250966925370066, 1,           1
##FIRST=     8223.43324360094, 74233,        35574
##LAST=      0,             37750,           -93773
##MIN=       0,             -663702,         0
##MAX=       8223.43324360094, 476270958,    0
$$ Real data points
##PAGE= N=1
##DATA TABLE= (X++(R..R)), XYDATA
$$ [...]
23823 -418120 44658 10262 604 -7180 -78094 120786 -39383 -86459 -209874 -66538 244121
23811 -30682 -35884 -356980 -148716 164887 -40801 -37251 -39154 -78404 -115222 -416301 -270239
23800 -270239 18162 -97308 -136005 -95780 13436 -246864 -54309 39718 -2639 -7240 -129128
23789 -129128 11562 -20195 -203897 -107166 120482 -148349 256766 31076 35577 85713 182613
23778 182613 84949 -13686 10607 -146440 128690 -159382 62512 624600 167618 -57125
23767 -185151 -116890 393787 293885 141855 -453848 -221480 273248 29299 95442 -7179 -88338
23756 -88338 110500 68107 93844 -220505 -162845 46061 -108922 57175 -79318 -142726 118396
23744 -146615 -114586 -97303 -69277 -208940 78704 43985 -487690 1050 -210926 -97088 36474
23732 80692 -57570 87246 28135 367650 -73389 65236 -49794 63104 -147665 53406 -122211
23720 -24288 -51201 -42877 141790 178552 14810 -82910 -232255 163500 -47212 -173181 113092
23708 -70356 41997 -91041 -137280 47420 -292598 160962 -15966 51855 87755 318748 250016
23697 250016 33785 -25498 92122 186477 21667 -280410 52139 -264333 270951 43307 254511
23686 254511 -161120 -1378 -162482 -61512 129232 -138630 35142 131683 136548 214403 -119933
23674 -548804 93742 -237330 -66130 -482203 -18228 -7810 -256313 105275 -212835 25318 -81926
23662 -108740 -244649 -201752 38985 266793 105984 -143695 -66721 56782 -393255 -484430
23652 -484430 -438708 -166223 391315 266231 -53218 -157173 348863 -59399 197169 -138565
23641 337097 76843 -373497 126468 117260 -359959 106149 -191201 -29899 17191 258658
23631 258658 -187576 -83640 218650 -27091 255297 -92909 -382061 -3811 171969 -131222
23620 237061 -177172 -217856 -78566 -52297 -119950 -48637 -244319 89649 -135860 -6565 -15986
23609 -15986 -133483 106386 -41940 256691 -439027 307482 54994 -109588 77158 22676
23598 8611 -89423 21743 35925 -198580 -59164 -206079 243953 -47353 41992 -77081 98662
23586 430623 148933 114438 -134900 -18844 291928 388662 -340456 184597 -230435 -40345
23575 -161174 117003 -54446 -230737 48515 -67935 7083 225170 -436677 -320614 -12083 -183579
23564 -183579 -113321 136610 199048 -84044 -426254 128075 -107306 -96262 -167080 199743
23553 217891 -45285 -303795 11107 -108881 10353 -30328 -101180 -1104 66085 -203344 -125536
23542 -125536 -119411 -210513 -65440 -157370 -197992 -153130 -92687 254958 -84581 204692 147265
23531 147265 159334 74271 -5635 -228509 61884 -267877 -104848 141906 9704 -179013 294975
23519 -173499 78673 -12013 146379 141740 -51453 194931 -152490 -99845 -330352 -5532 -155376
23508 -155376 442522 36008 3161 90635 -242182 82141 270659 -160857 -145625 -67868 -104479
23497 -104479 -3772 -305794 103027 -163161 -57627 70847 186409 179559 -223480 -24827 -60570
23486 -60570 -119431 22710 33177 217871 155258 143683 255223 -44637 -155743 30347 -47038
23474 -11931 267571 13191 5857 177138 15341 10699 87114 -13013 -3465 -211393 44468 176205
23462 176205 16537 10059 33937 -146937 -71187 270989 301465 243200 6369 -309381 -28719
23450 243303 -89491 -298057 7656 130965 153604 -224002 62746 -470 125187 -417430 258762
23438 72121 134419 -122940 -127723 21013 -311016 318115 9921 33386 -4159 -128788 -8350 398478
23425 341469 -56951 83438 23582 -184626 -170671 198507 -117436 -206022 -85898 -12824 -141403
23414 -141403 125561 -45465 -58034 -112691 -229894 -21161 65159 202747 -292057 -99552 272563
23402 102818 -18349 -76119 101763 -148800 40226 223865 175248 -538731 -4167 -117536 163285
23390 -107830 -341839 28689 -185726 89227 -486589 -18333 -50626 376818 -175073 -41836
23379 63921 -158631 205689 56444 296374 -51889 299155 153382 44720 -79485 80328 -46947
23367 84635 -246968 -52420 -229729 127538 149993 109929 4363 9549 -76695 -73455 298620
23355 -60587 -174504 41184 75185 40544 -262529 271763 -5502 -127117 45985 -153190 -144047
23344 -144047 17207 279053 -230240 -22351 183786 -23248 -95931 87669 366510 27784 49320
23333 49320 42049 58223 -496562 -177783 -133905 104553 -126019 -286245 -169129 -62077 257076
23321 15587 144894 -82286 -293949 -335248 -39145 -98970 -47366 220473 86328 -26808 -179514
23310 -179514 -75362 -278064 74680 -64613 208436 -112789 -5873 -20773 247335 -6742 -308269
23299 -308269 213866 55487 -199304 -201053 69303 175215 -247442 360100 -230583 -255417
23289 -255417 -48151 81934 -330339 441780 77654 144 -17350 -159235 93345 373951 -36278
23277 182027 212956 132844 297481 -75449 -212160 -174650 -55409 -18223 17493 -152370 -43392
23265 -108775 39816 -97154 27408 205154 -221607 -155158 154936 42135 240392 -132166
23254 41082 58629 369109 168481 354652 -229469 54246 -301644 -263889 -1917 -74311 -380941
23243 -380941 -36241 -284998 -66954 -46623 107954 -171533 151495 -394816 355588 -94371
23232 147728 -115400 -20022 99712 50415 -530948 -107963 177841 -129419 31061 65413
23222 65413 233359 -19545 -6807 -279242 47144 -25240 -299526 -110290 216103 33251 -55764
23210 -53366 -277636 446108 -86640 24905 -91260 47666 135497 -68176 -97119 1585 -213844
23198 193686 427442 -21122 -284254 -337769 -52158 -329498 66360 114188 -487871 -205388
23187 131804 58036 -119718 112706 274399 -122802 -244085 120805 23668 51304 -12614
23176 66600 128819 98958 -233284 466256 37501 -162518 27776 80036 22172 -169326 162809
23164 -16960 -156591 80045 -3827 -29754 38655 16298 -12641 -51546 -127665 80218 -142600
23152 117938 -283987 70432 70993 -66559 -264003 76585 -71146 -3895 -117293 58462 -1729 -16112
23140 -16112 -210659 -280482 69255 19309 -40439 10885 240947 -222779 76517 -86402 -12151
23128 -189998 -57734 87232 99994 1774 50255 263060 18830 -98186 -267174 114862 -230129
23116 136617 -127504 -7374 -210058 -267274 174907 -360486 23213 -102600 -1356 -153156 -559
23104 -280973 167031 47305 227346 5373 82588 -52585 -152593 -143677 127433 -64587 -30603
23092 -241768 -87939 163820 48605 -134438 -33121 -168970 -7965 307774 -78552 -72609 178693
23080 170891 -97427 70925 49592 -175563 -47364 66938 25605 -329541 -154899 60882 -355131
23068 -187953 -229583 194674 256961 -42086 53737 -17284 104390 -63203 -135699 65547 -58454
23056 224254 -205696 -133015 -318459 -214462 -136628 164140 -233706 69604 -173829 -333182
23046 -333182 169019 124216 123710 152067 310552 4691 103203 332526 169775 -157629 188111
23034 -138565 242730 73318 -158112 38699 272935 -56189 109859 74599 28447 196523
23024 196523 -12776 -147527 -71795 -47726 -9960 -81276 80789 -71784 1877 399985 350415
23013 350415 -173389 -311080 -417465 -288501 -266761 156572 17670 266956 -38475 -260270
23003 -260270 -177945 61826 -290339 -222464 -19609 -320058 439730 -86544 68901 -68982 52389
22991 243608 93237 111910 163636 -161534 -14441 -62016 19041 352016 148059 67448 56716
22980 56716 -123280 112174 -136090 -180035 59527 180696 46644 -70183 -47156 -196785 -43575
22968 115724 225215 -152902 -3071 163571 -295472 24864 -75423 74879 98919 56600 -109616
22956 129637 -332648 12530 157910 60726 81373 -254951 37217 51691 -60533 127855 85123
22945 85123 50313 157842 -156470 36642 -29971 161511 -82306 -81087 184453 -4677 -133777
22934 -133777 -24473 508520 -152062 89134 186688 -107523 19643 -82846 -246770 -24266 -48873
22923 -48873 215902 -80869 277113 91927 217298 -172339 132939 -12843 -321573 -316166 -2247
22911 183543 98448 206874 -221576 -17373 29233 -126523 -121659 -68506 129724 -147112 -4434
22899 -152570 125931 214369 -112843 69771 -191268 -32284 44734 -234946 27134 -80714 22704
22887 -23198 -5243 -311983 -231965 -104467 158089 -159100 44208 106274 141539 263844 -96316
22875 -246242 -204998 59706 67559 211801 -163961 -34067 122072 121750 12753 169390 271598
22864 271598 -263852 -160214 -375139 138565 53568 -42003 -78036 -133709 -44194 -132765 -246494
22853 -246494 78682 -166629 -6272 -220605 177081 117275 -312162 -58534 -4015 -149786 26127
22841 -49502 217797 -28074 -137906 -17406 -97582 -70694 -40527 -99092 300523 -290383 14782
22829 -272975 162956 73415 -92077 193196 221715 19471 -283408 -25166 264859 -251469
22818 -242434 226664 -330178 -200647 -122074 -17484 28396 -83832 -324991 -221140 -34883
22807 -173595 -320178 -66379 -181539 218312 117539 -351073 -394049 -138406 -40642 227387
22796 -71173 -100337 -313334 54214 -349881 49949 259624 128730 -207567 33445 -58701 -112338
22785 -112338 -213241 -78381 42669 -156884 127244 172487 188076 125995 -34562 -203255 180374
22773 11213 -60166 78163 -152542 238058 97377 -233029 39657 -291782 -306 127105 -189723
22761 -45904 -72369 -275910 134104 147855 -152829 -122763 -3259 -78316 -217865 -55153 -4035
22749 -557705 -179207 -43396 -180549 -104966 50981 4662 -136516 60114 -134935 216238 -102873
22737 -272067 54075 167682 -43218 -96296 -15455 -114697 225863 -5492 -63267 149390 151432
22726 151432 7767 19763 -137057 142007 -39431 180854 42978 52210 335152 116057 -15847
22714 -108137 -154233 221450 -389275 -69757 -11790 -47111 2574 143614 -247781 -47652 -37207
22703 -37207 -122911 -149838 -583534 -32162 143472 150805 51270 -79919 -168175 -299870 -48771
22691 92221 97536 -38310 86312 -55169 11509 202758 -243836 -179459 -191517 -18707 70422
22679 50873 156557 -98760 40452 -358358 91695 188705 -7338 97450 202639 -77313 38285
22667 -254533 -44779 -124166 -61688 145312 125481 53330 141527 157554 -63140 -95724 -279247
22656 -279247 -235260 108008 79281 -101130 44307 -66833 -325675 -10604 88962 -134128 -93423
22645 -93423 245105 34624 -81579 -108412 71737 -102708 -1517 -159399 276215 296910 51427
22633 -151851 36669 389328 -317843 178301 -231501 -40345 44759 82075 129752 109284 -150972
22621 -128847 -18945 -54695 2062 50924 -205865 -202582 284081 -378879 -243609 165159 -44318
22609 -64497 26774 175955 -202636 -115475 138386 -11553 132122 -9553 -2907 6004 -117516
22597 352006 186640 114616 -359094 141115 -175708 110488 -117206 182264 -75183 -54902
22587 -54902 131098 -102026 -67044 -82025 -340038 -87504 16874 67923 -34342 144684 77584
22576 77584 -608842 100463 -157109 -45157 179285 -144455 -140989 -235803 -55570 298982 150967
22565 150967 30619 -79010 -102385 154244 -259407 -68651 58305 -161012 -40759 144034 201351
22554 201351 -17425 206454 97133 -94571 214262 117046 -7187 223996 93267 -16824 37226
22542 -274037 -115367 49529 184213 -27666 -148065 -203525 -305351 -95672 81231 14081 109714
22531 109714 -129089 -58795 167163 -459752 -253592 -246593 -310750 -89772 -189764 14582 -87676
22519 -29600 402615 198578 -207694 -175308 -300495 -102982 155770 106071 82688 -34376
22508 -122518 -333601 -192675 -108766 -22023 4703 41907 239161 225892 -181160 -35141 -147426
22497 -147426 203856 117173 -248517 35519 -93692 -82072 -532820 335076 -306618 -119119
22486 -83062 -250491 -8401 26586 -88724 -267143 72986 -475723 7995 -115606 378883 -425782
22474 -20522 8518 5886 187714 -48239 -270936 206801 -19114 254751 280833 8715 134605
22463 134605 300258 48592 45644 81658 45822 41131 -2146 -143337 -234376 115626 35871
22451 -78062 -354120 -198458 24582 6811 -217823 293847 49295 15140 32295 -115412 222942
22439 271035 173515 11876 112114 11605 -244569 -244853 -70058 72137 -7599 32354 -125980
22427 97043 196528 110093 -279668 43016 203895 57668 51546 131451 188437 290046 -197145
22415 -15825 -188120 -126831 -59656 -411494 -212067 -420890 147781 -114837 285949 56041
22404 -328462 -91155 -97565 -134845 -490992 -348200 123234 -234235 -217932 -89860 -159381 -260252
22393 -260252 -56033 -282731 -167259 -105617 -113391 -22032 -167793 -53943 238156 179559 91059
22382 91059 290886 402874 57585 12113 -220925 176133 -265237 165045 78884 -12995
22371 121401 454854 -62922 -49936 24043 44786 168749 -426109 129170 -79653 103719
22360 219587 -67252 108840 199541 5960 -65274 -190992 -141918 106110 -7187 4122 -154792
22348 166354 189506 -223252 -147436 -139912 -145672 -132977 43321 -277750 166540 -126245 -188564
22337 -188564 -104264 -402561 -131626 -179238 421126 -178145 71559 -184243 -23026 -247424
22327 -247424 220598 -196224 -242904 180466 94578 -58339 -54674 -144281 189151 230336 -70835
22315 -136407 -118439 -490744 -172509 336630 24869 144959 14611 -153472 -75045 -283175
22305 -283175 76563 -410374 29238 -68537 -182704 -152550 156876 142713 284601 27151 180
22293 -105534 31702 131271 75027 -21177 -92237 -174211 -87964 54436 -2861 101422 34413
22281 -30213 272534 -94253 104580 -121813 -183780 -107190 -153237 171114 220758 -20278 -64443
22270 -64443 816 -254429 249468 123364 44163 93250 45229 -885 137199 203575 -484301
22258 28444 -79036 14120 -215682 -139600 45046 -138718 -109855 163658 -10579 -358450 -143332
22246 143101 154588 -75743 -174380 -442319 7937 -15801 58548 -46626 74814 -283863 220565
22234 45752 -95636 110863 13789 -114932 -74749 -52130 -94499 -18535 -15700 321640 -79146
22222 -458851 -263705 -149275 124468 -22763 -142361 -116796 1644 -378746 178709 -80213
22211 -953 23833 47580 -210494 -77699 -131050 -103166 140827 255822 -157585 -36087 36570
22199 153625 -340897 -34192 -58221 -178233 198759 368914 76255 96085 40891 -197878
22188 145616 -60392 73502 166831 215580 -98539 -205707 33871 -108359 30561 -159374 -49348
22176 -9479 70045 7319 215225 257526 -386257 -16689 -370811 -265417 -179481 -260908 206148
22164 -443286 -11666 9104 -262897 -73929 304488 77909 -207839 72609 -7634 219241 188651
22153 188651 180457 -61165 -123926 -29449 -120758 -168113 -28991 79591 -134799 -76536 -30154
22141 -239628 -102710 -2872 40538 -91625 -284313 -180746 163631 -121544 263849 69605
22130 -156504 -101592 -73024 -25017 17993 25784 34702 -187296 -95208 150835 -120973 -218608
22119 -218608 -164762 -80573 46965 -39939 -138863 105482 42125 71567 -156133 147544 -116517
22107 -314347 -73542 -141609 22226 -205964 94608 -166523 157558 264922 255994 -176959 -320583
22096 -320583 -56457 9755 -356312 -98459 211717 -159792 127964 -32591 -241937 -182549 -240112
22085 -240112 445761 56697 -320621 -61577 -360312 25916 1670 71538 237525 -300167 -12037
22073 -137885 -193315 -186807 -38309 181392 61081 5906 169312 137308 -133325 -355 -188876
22062 -188876 87044 -30966 118423 52599 -40660 -121410 39481 -191084 -39153 75358 -107572
22050 -4104 53988 2248 -67978 -115588 -319100 139234 -122508 -8596 43125 -1342 -32766 -26102
22038 -26102 -55680 213807 93607 -126392 -291253 -122639 278064 -325059 213216 -448197
22027 69149 -265645 149756 183608 -80091 -24094 81934 28255 186550 -169715 -87086 52366
22015 102613 -167596 -10056 -195531 75772 8698 -27554 11351 8341 -132750 157506 -160791
22003 -139724 -18322 -475086 184018 -39582 10996 -34181 -60501 11581 -70146 -53960 -183334
21992 -183334 -39947 132082 3053 139107 -18845 -182665 -114171 -26193 25201 -97463 116499
21980 106017 -401189 -110975 -205064 66701 -91274 118624 -112990 -199980 -27214 -160665
21970 -160665 567339 -44094 143600 -271666 166793 -294028 -155683 -22027 -220744 30722
21959 -113587 -293722 -28797 109678 3551 129377 58137 156032 225409 125883 10763 220306
21948 220306 -153240 -5197 -64660 -267170 -49707 -154577 11362 -128542 -103114 -302966 80345
21936 232015 -8388 82517 131049 166309 -1236 -260955 191569 -168127 54086 -109656 -310493
21925 -310493 173873 41827 102060 -8518 70059 160566 -289448 -142515 13424 -157997 47746
21913 -165623 18923 -281375 67134 -68360 -251501 -193208 -12172 -13752 53628 -144024 -204427
21902 -204427 -80253 19250 -12193 -123092 222903 -128746 190643 144871 261543 -134068
21891 -243905 -55652 -36837 -249533 53717 -30790 -130160 -211706 -236989 174901 -238115 113387
21879 69083 56022 -71553 -66130 -176827 -329656 47012 -210468 124620 -93031 59020 107398
21868 107398 169419 -176499 -272973 61993 -197335 -147397 -99474 -72447 -170100 -1058 -76187
21857 -76187 -100426 -45358 -247007 58328 -273471 -27247 172379 63831 -147000 -143786 -127707
21846 -127707 -168120 -178699 -383822 83730 60940 43067 28847 -372837 -94482 -50167 206640
21834 120324 -98583 -256961 -203117 -380292 -228333 -162197 173047 37103 -201085 -295999
21824 -295999 -397750 279130 407149 -160244 168699 -334024 69103 -78305 90210 -31885
21813 -300346 -115068 53289 153695 -180315 -332691 -33928 49559 -262573 211316 -145393
21802 65661 77809 -192641 123745 361093 80013 24238 -57429 -378349 -147625 -96858 -276042
21791 -276042 28267 -17103 -15357 66792 10366 -34027 344143 -288056 13965 99273 6304
21779 -238493 49825 -152240 10713 4704 -114236 -39799 -7479 70446 -221961 -174290 -150010
21768 -150010 14920 244744 -114110 -106431 -34364 4647 48079 -495766 107390 -206432 209973
21756 -17041 61509 94213 -20736 136767 146528 211132 -87882 -318705 59639 68770 180605
21745 180605 -76942 -180640 121766 -264984 121756 -153217 -131893 76019 16682 45256
21735 45256 -8359 364603 124823 -20020 544556 38793 290714 84652 315027 148379 161358
21724 161358 -39675 -72249 130508 269551 -73300 147199 -266971 70614 -34529 -165237
21714 -165237 -41616 179123 -155569 -119390 39535 164262 176577 -135815 -69868 -401388
21704 -401388 162009 53647 115046 -369036 205932 79551 -13247 -56304 -228764 -147958 -194621
21693 -194621 -23036 -552150 -286807 23937 -213419 39502 -237290 -23723 74145 83508 -324535
21681 51225 113561 1664 91587 151034 33736 294814 -462618 -105982 495862 20717 11581
21670 11581 138681 -87825 -406753 142691 -146644 -609871 428311 214541 176849 -284846
21659 -49017 -84098 118870 -76481 -162300 30985 14283 -214657 -80504 43756 -391149 82918
21647 449525 64774 -132204 -4516 -203007 -30100 -22885 -79971 281819 -113531 -136981 -94191
21636 -94191 -267311 152866 -149420 59968 -321927 -290107 34958 64161 -122031 -315673
21626 -315673 -79393 -117325 -108975 -333228 -185412 -194591 -119728 99753 58608 122118 133738
21615 133738 374757 -233811 35932 198523 -317385 -58478 -242721 -296148 17598 -128223
21604 31796 73673 -77943 22688 -300398 130623 238366 274619 56888 -26196 16701 -130096
21592 83481 156937 13121 -25132 112329 -13459 -231473 13732 -147306 111711 72279 -256491
21580 191858 -83293 17901 184660 -286672 -112146 252300 -136884 -251516 -110554 -67552
21570 -67552 179956 -229851 -193565 122447 -48812 -294413 -290 348587 -77269 -202141 -131866
21559 -131866 -57402 -89095 -28939 314853 -204945 -9452 184141 60335 9615 -4282 -358310
21548 -358310 156665 -346393 -115783 -198305 197423 -35211 -43918 -188782 77268 -101012
21537 -28221 8570 -441888 -213502 191272 -65713 204518 -90748 192460 83712 -68853 -65345
21526 -65345 -107960 73620 164136 -181008 -196689 -546757 596958 38782 -232567 19033 -228450
21514 -229340 -234241 -245909 -12368 -23248 -122075 -41269 211253 -61385 -295086 2506 -219940
21502 -200409 26787 152632 76180 -71797 -98896 -249984 -136282 -60440 238310 141776 39058
21490 -44849 -347408 -184736 -72666 -298824 111150 273318 359245 -156099 -437695 84550
21479 117582 120396 -500812 -45960 -318450 180716 -37186 -19908 -381705 177859 -77113 -85690
21468 -85690 48410 -92564 -179473 176006 -175485 16733 -57749 -85956 -28217 -3748 -100580
21457 -100580 -75398 -238818 -510719 78602 -140497 -69558 -187157 -9185 131917 158658 83224
21446 83224 -204688 -163335 -18152 134269 284359 195951 149393 549841 344337 51952 -10577
21434 145011 -125709 185242 -49682 -167088 5409 -1981 -16351 -5535 142098 -164345 219365
21422 54922 115149 -333531 143043 128281 -200477 -317951 -45876 148942 -251003 381653
21411 160671 -129904 168818 286526 -133513 41950 -77435 -135266 -284284 27721 -282246
21400 148429 -52843 -198432 -233474 -33120 44747 -120138 -85058 -183774 30863 -36242 -191017
21389 -191017 -112059 -157897 -68156 -482084 -371992 -411805 -131688 173549 -129759 -250363
21379 -250363 103326 -206909 -37091 39619 -61062 -165920 100717 -203087 95715 -29583
21368 45737 231505 -63252 -101396 79668 -144467 -34140 -215539 124098 -113071 101757
21357 -328118 -41529 138643 76565 234380 -271907 -176316 -420249 -8171 161835 -20131 -57478
21346 -57478 179430 167628 -8586 -161550 11038 -219669 -17928 -144238 -25602 -59086 160386
21334 -119864 108838 -130658 119716 26239 -26788 -46589 -385958 -68020 346016 -400498
21323 -183606 109882 34678 -137139 10965 137957 -136991 -126008 -164769 -119736 165766
21312 -74001 -36759 -273874 58097 129374 -140616 104810 -112302 -50421 -197474 -357345
21302 -357345 191186 -50273 -358033 -162290 -66401 -328372 -65862 74056 -131148 -203471
21292 -203471 -31846 112714 -238166 -37154 -288155 121300 -43536 -405657 -109846 -208733
21282 -208733 3116 226944 -166651 -79734 108620 3651 -269044 291778 -17535 10799 -32895
21270 -134907 582575 -30483 -25457 -206588 198037 610 -255466 178969 248350 -66425 -66315
21259 -66315 -252308 -317249 -50851 277929 -328048 -108793 23159 -188371 568069 38153
21248 139293 139663 130672 208001 -104373 -215467 -28488 -148356 -89847 -369862 -406389 -16880
21236 113643 -82825 -188857 -248126 71800 135977 -75626 107576 -41721 -181694 -54859 184547
21224 -89847 211304 -37096 -209547 -298119 -210606 -407554 -184647 -306475 82223 3388 17909
21213 17909 -185554 95916 -126157 -260297 -175851 -200418 51035 -239394 -213639 211906 174878
21202 174878 -253271 -105753 -29942 206455 -86953 21004 10517 -404333 -18512 -277272
21192 -277272 -401043 -140445 -25739 38094 142025 -1105 -88737 335648 14663 235088 12693
21180 270852 -20018 274751 -15857 28879 172077 116105 -246672 -178930 -341398 -10654 -333626
21169 -333626 -56556 -168293 3013 -18615 -84963 -469303 -232289 -40284 114343 -202183 -52550
21157 268410 24437 -76807 83546 96410 -98029 -115102 131296 149142 -86804 -157957 56520
21145 -473734 140177 21245 -209667 -207264 -77154 12401 -126203 -191278 -15893 30267 -221486
21133 -19449 -44590 -14578 71474 248361 151887 -361880 -63632 -206375 -54801 132543 -104340
21121 -93776 -239757 -57811 -122236 97080 64731 -7756 -183386 -105347 -239119 111699 -109576
21109 3715 18108 -6051 246499 -156264 -179550 106442 -150238 -46519 -85423 -374443 99454
21097 -75419 -29386 -25741 364202 273338 -35668 -264714 220197 29820 -51122 -65141 36320
21085 206076 -156972 -397116 -77544 -111621 118127 204790 3566 -2219 45482 32568 151402
21074 151402 -130692 -109231 68699 42515 -66962 -5118 -233916 60855 159476 -227244 -220861
21063 -220861 19089 311267 217720 -359883 -3750 -123011 117439 -277041 -48305 166198
21052 -106119 -42697 -1143 -74180 -34730 -240236 165375 -47325 14037 -155205 157036 161067
21041 161067 -155272 121775 55505 -137580 52682 -247967 -92592 -66509 53733 90715 -98131
21029 92398 -93859 49106 19538 21656 138991 -172124 256422 -17785 202735 -126852 -411644
21018 -411644 -138335 -27963 12334 14755 32725 126409 -280044 52522 223297 -35850 82422
21006 214698 -38045 -9757 44760 79291 65864 98585 -11610 197452 67895 -311953 143769
20994 -44255 -19909 179292 -22400 -269080 -436417 114210 -50035 -291628 -118625 -139495
20984 -139495 -50545 -154183 -269169 -231276 -156338 23886 -492076 -193221 22093 -18415 482607
20972 -159025 -53847 -289676 -279909 117925 60228 -42131 123640 34248 -135527 29392 -10245
20960 79811 -126411 -327415 -161945 -124193 -109983 88149 83106 -197072 57319 38669 88157
20949 88157 23764 -122806 -166807 227809 -296248 -409208 -180112 146485 -8555 44540 -156489
20937 47141 -4873 -9659 -49162 -56305 283165 -18605 280403 31457 -132838 -11755 -38310 -18100
20924 235255 -251683 281751 118662 -30878 -11171 97737 -326850 -168249 -250187 -103435
20913 -330906 265623 -209228 157858 66971 5978 221221 -210666 -191178 -74829 -145748 -37180
20901 116059 255573 177572 -527897 -170267 -33243 -119356 -109437 -138122 -189836 -88765 41728
20889 -140760 37584 29612 255975 94352 4558 61993 148464 -148771 -85613 223376 191762
20878 191762 -408357 183442 -58654 336348 -648925 -48924 55905 -998 -31151 205952 -286936
20866 -137150 13574 125110 -77818 -160320 20320 35576 144629 -197945 -238368 -124698 -288353
20855 -288353 249376 43011 -291541 -11423 108199 139853 -93149 43350 138313 218706 5373
20843 -57852 347055 -26840 -274094 12004 -242425 -25185 -39694 176985 -117479 7419 99246
20832 99246 -66657 228491 200092 -243075 -150899 94337 -41810 -168231 -316501 106215 -113685
20820 8609 -57568 -47287 62847 -324493 -221528 65578 -114524 -291092 -171608 163040 111361
20809 111361 -262975 -178173 151089 -92148 -123559 367387 -177533 202813 27587 -52746
20798 -89193 -31744 255537 233397 -94427 -191770 102484 -208618 -87553 -168920 110319 -253457
20786 -84165 162319 -22902 177218 -93080 -8814 125827 226103 423781 -120298 88091 147202
20775 147202 -82877 42980 -115524 -110215 260487 -38611 -104950 -210117 -97254 -176039 13863
20763 86292 106439 176140 93361 -51721 93187 -259139 -248792 -1298 120024 -40503 -160979
20752 -160979 -167682 193660 -48048 -40760 -217393 -361987 322023 -71225 -114665 -90768 -263291
20741 -263291 -284964 -53767 51683 -165101 -5638 -44850 -49738 -89755 -11510 245263 200243
20730 200243 41809 -154911 -213351 65368 -31867 295857 -416030 -368369 33655 -106389 -291554
20719 -291554 -8788 87025 408115 -203539 -139001 -139551 -136969 77901 6570 39485 -20929 -125770
20707 -125770 -309132 -468867 73162 -75926 -174113 -37556 -16156 17667 -182532 -181728 -98357
20696 -98357 -62264 106830 -160462 -157859 -121988 30516 78536 -313730 224754 -203596 -83068
20684 387735 114247 -76351 51943 -80212 -264222 -335767 -1007 -64030 -36989 -409025 -288807
20673 -288807 -84449 -29320 97494 -168356 78313 42620 68565 -73114 -222063 -169848 102624
20661 -283374 100389 209079 105600 -139290 8469 -10402 110631 -61319 -106508 -95262 228187
20649 -64042 -217240 -126641 -227730 201834 -152964 -201241 -157837 -109400 -181554 -509599 -16968
20637 -52374 213702 -95545 -107574 37307 23296 -76067 -73004 171762 33428 325541 -105534
20625 121471 -131011 -111908 175157 -3611 -129779 82356 -66752 26675 -74305 -89084 -248818
20614 -248818 40952 -325825 -149266 162644 -164483 -59568 -42470 -192146 -245860 -52672
20603 72742 53570 250538 -83764 -39654 -70054 169492 -37844 -77298 -226035 -12685 -46261
20592 -46261 15083 41348 139892 -362756 -7104 326074 23218 86181 -139093 119656 -115009
20580 -183531 429331 -176419 -206177 -187519 74380 -229331 133949 44076 70172 297448
20570 297448 -124901 -35578 230362 -592760 -34162 -112975 -167156 -182980 -442273 -332030
20560 -332030 -63413 -69921 165075 -102478 159950 -99906 1346 -201708 -356765 90364 -280944
20548 -89959 -16903 213885 -165399 -159012 -261114 -13216 -76706 -364152 -110598 -7496 -97672
20537 -97672 60736 -94557 152247 -237169 -84295 -120246 -273787 -233744 71909 247936 26389
20525 -53700 84528 -51544 185763 92777 -154041 44148 69405 -249145 -323282 -64292 158457
20513 -209019 -43403 -282024 -90591 -210785 -177590 152692 -112866 -211280 -200170 3407 318095
20502 318095 -126974 -174517 -308257 -282947 -418239 -215057 283693 69988 169299 556029
20492 556029 -238203 103042 103868 -145294 26323 36026 -194315 -464776 -379919 125980 283151
20481 283151 244558 -89633 -2309 -50833 -197503 -75140 193952 -330536 -37900 -136679 96202
20469 -105537 234110 -208850 -21861 94524 122647 220197 161116 63337 266663 234302 343632
20458 343632 124697 90812 -155004 -6312 -51099 96222 -2082 -234789 -5558 -169812 157734
20446 -128624 71580 -181397 -287181 -183350 -424185 -298038 -80765 -161855 -98035 74016
20435 6343 -654 -22923 194272 3533 -133089 282222 120311 -279566 -140088 97339 306604
20424 306604 16305 -103487 17017 -168879 120402 53151 -72074 -144673 54434 -291221 -40969
20412 -35146 -74453 -283731 93422 -495114 210233 -203463 36152 158282 103311 -36873 118204
20400 338929 -294268 216003 -27786 -65956 -78635 -103056 -541896 78687 -302128 -2346 -112505
20389 -112505 -50493 -103060 -58389 166031 -242193 -164936 -73464 -7406 -23782 11678 37958
20378 37958 685 77119 212414 -192761 37413 -166494 -131673 -45964 -85569 -315164 -272206
20367 -272206 95261 -75905 -59576 113031 424853 87196 -173161 110293 -168221 69775
20356 124814 -346795 70109 34892 46214 -12415 83350 -163047 85749 -168982 -317842 368018
20344 140505 -35547 165627 158798 -363947 -164728 -138149 -45536 -366808 -356067 -75707 -108615
20333 -108615 9786 201998 333123 301784 -306526 -208529 -47020 71443 -91517 31131 58295
20322 58295 292701 -35982 108085 38921 29322 -119071 -89702 -452965 92475 184565 20878
20310 -179043 599343 -233688 15042 -35375 -233582 -106332 4305 -244460 213877 27598
20299 289800 -97492 -152804 -50053 -60898 -87348 18779 -117143 -131728 -323093 54336 148964
20288 148964 -171274 65102 -311586 -117614 104333 -75246 175972 -344087 213978 -218857
20277 12810 -42764 -69713 -89633 -186734 -47178 22896 163242 -119061 222792 1018 -179481
20265 94969 -80567 -99696 58460 -106721 -92025 81373 10217 15558 49554 -81377 -245502
20254 -245502 -129990 -55444 38955 -58301 -39710 -43693 -172192 -79355 198793 -255628 -218689
20243 -218689 -4586 82742 -99336 -389858 -19925 141983 16360 113977 -432703 -18381 -155185
20232 -155185 -96658 440960 315919 -329581 -183278 -83238 -192950 264453 39972 -103950
20221 -57077 -124401 -132707 -402816 -347290 3295 -189541 -115152 -517394 -189265 1085 90167
20210 90167 -394626 -101516 24114 -220724 -7982 -57729 -112723 -511 -122164 112481 -97682
20198 -167707 -229016 -304893 233793 -272954 -9545 -199733 9955 -428715 183745 -386824 -198035
20187 -198035 300723 -166328 -234469 35262 29887 229918 -101212 -214323 302620 -133431
20176 -13551 -119751 146779 -328667 -280242 -120092 -83429 148912 262532 -203196 -109907
20166 -109907 229312 -166227 195009 49283 -186629 292487 204247 -242969 -260442 -44771
20155 -36992 -272436 -18322 1193 -50762 42554 -63196 -115411 118457 -27370 96444 -134401
20143 294677 57539 477130 28976 -268452 201045 -157713 76146 102431 -154231 159380
20132 221265 210734 -213593 -419826 -67832 37935 196996 -129318 330072 -185344 35719
20121 -95636 153735 -97829 -77971 -154233 -102162 -153737 287349 14614 -212102 316770 -154456
20109 -100616 -122649 -64667 -255395 61817 -6305 116128 -143535 -69470 58385 156268 -182299
20097 -50180 325402 -294654 -66083 -185218 -428236 -149018 -211270 333449 -340864 216224
20086 120925 -8079 -43277 -360057 -153411 -273675 -149793 80347 -80960 -53938 -51925 261965
20074 613 -323570 -196398 -156124 231879 40384 3570 197583 -78656 -203880 -62250 79569
20062 74956 -180398 134658 131116 207481 116377 333422 -531052 -73207 -181634 19600 -5990
20050 -131918 -40749 5362 130025 -72214 411721 345670 -56078 -232494 -66524 -179441 -84378
20038 -389865 -214145 161634 -188347 -228949 -603875 -86840 -51514 -23673 137024 99014
20028 99014 -157637 -38361 -151861 -265905 187275 -204987 -168485 143232 -235220 91745
20017 -100821 -349120 -226920 149055 -290822 61028 -1974 -225600 -43307 -163610 -12037
20006 -119512 64546 -51980 -67851 209368 -293288 244925 -357148 -189401 -182973 -209317 -208571
19995 -208571 -112519 -11490 58140 39506 -187875 16702 -24466 -277206 -272912 -10964 56495
19983 -126014 -193116 413370 -335129 326494 -463200 -252661 30050 166077 113354 454400
19973 454400 -144899 8766 -31221 68849 -131699 -252812 12081 -57684 200012 -5446 58266
19961 -199479 2249 199076 299784 -124698 286912 27570 106888 -43644 -153326 -100408 -58460
19950 -58460 207300 -137310 -196356 48230 -4800 -248444 -251626 -203471 148671 -238402 -127320
19939 -127320 -90290 202729 -99866 -124103 -52248 -242513 5017 -113954 -188567 -202110 -293478
19928 -293478 -80608 -207117 -180983 32252 -167618 -71059 40067 162236 30108 -46954 -101901
19917 -101901 6931 -62776 -237896 -10884 -391868 -181843 -17206 -275561 -156111 -17068 -45004
19906 -45004 -126313 -28572 -59330 -19507 -61740 84103 -22693 -238257 -86504 89661 92861 -238224
19893 -165484 99397 -196440 -219908 -194928 -232688 -124744 -84572 -224943 139337 18024 258506
19882 258506 153574 64018 33939 -35340 -51022 -313358 -8235 -173777 -154873 172696 181226
19871 181226 7517 -4224 -306005 -156034 77190 217925 -391414 -134964 -16176 104263 237179
19860 237179 6714 191577 -66045 -40528 264729 -284264 -99517 96998 -131601 -365524 -158347
19848 -223502 38205 -29417 -27426 -329335 -115916 -169668 174460 -1425 -4278 -295839 44330
19836 308796 -264290 -46154 -9237 -96020 -244919 162504 34889 -165263 -123602 -42511 -23838
19825 -23838 -278414 -46166 154606 -63549 44586 -215441 -246941 -529145 -148063 -49824 303665
19813 69842 -214878 -375432 -70864 -299951 399835 -118233 -219284 -45199 190380 -97988
19802 380012 -40053 273520 49892 297303 65496 25325 -77793 -73628 -21195 -13048 327070
19790 -131887 -138681 -2267 101995 341989 -132676 -55673 158422 112498 -136672 89981 115289
19779 115289 78021 33519 58005 -421660 -142469 -58482 -381585 -98548 186772 -94178 -315480
19768 -315480 -123958 -85735 142911 41610 435473 118261 22141 -27029 -82250 153293
19757 -257739 44993 70912 137169 -273450 -17540 -115982 -306358 40056 -320527 -226716 -257386
19746 -257386 -95635 185300 -94183 -68905 180174 -145489 -297111 -62803 118422 -100417
19735 46632 326358 -251587 201381 9556 -98916 -157729 -100981 -162851 200453 128854 141949
19724 141949 120181 61575 -176765 -189095 -31255 -233298 61000 39561 -13797 -113188 -184557
19713 -184557 -20398 -234780 -195405 80057 130695 106336 -492898 -24705 233050 -126623 59961
19701 -82660 -52433 163234 -240791 159970 -118947 -179998 -199074 -234562 157704 -268077
19690 -118982 -56728 -51541 -297593 5198 152315 -22247 104663 -134714 289785 294396 -112967
19678 57937 206593 -51725 225896 73432 2084 -288477 -300918 -90457 -133946 -348264 -382498
19667 -382498 -173567 -161993 -6868 -53130 -187161 173480 -326355 -119094 35915 -274395
19656 -208259 -23069 293770 160053 -205327 -205760 -119709 215692 -401847 116818 -98826 110860
19644 -44298 -109925 -103820 -151840 -185132 -87069 138979 -72809 -23751 361800 29012 134647
19633 134647 -157120 -27134 -230897 -12628 167845 3964 -338994 -177998 -54929 -141552 -68952
19621 -288943 119507 291188 -333409 8653 19111 -272972 -2796 25825 364675 -161691 111061
19609 123215 -73329 42694 27687 11272 -775 105128 112421 -96036 7130 -220327 -203651 -325360
19597 -325360 -221436 -300475 -160086 -168457 24689 -203626 -222308 -27099 -70853 -99369 -406580
19586 -406580 3630 -163223 -79533 -203258 77449 135108 -22719 -189614 -404481 -4922 -62939
19575 -62939 -179988 234636 26291 254067 -188266 -51336 -317141 -89624 -73224 -116205 -178101
19564 -178101 -128187 12709 -14018 -71320 -345274 -45231 -143581 99900 -49816 -158229 -266085
19553 -266085 99417 -284583 -90938 28057 71554 -51059 -87809 -165277 8932 202858 148619
19542 148619 56212 -278548 -10433 -267265 160771 -11506 -287292 20792 -185826 25124
19531 -241112 -115456 3511 -314839 -181635 -19162 -235319 -257019 -138276 29397 -84223 110418
19519 -82554 -178128 -168384 -128977 246922 -285051 -111353 -261811 -281618 168238 -10865 -72653
19508 -72653 -198839 -1523 24012 -57778 -38652 -81094 -283032 -92697 105268 152900 -193350
19496 10130 -89596 -269551 -263207 77921 -35092 -93674 -242999 -210986 263628 -213452 -385562
19485 -385562 -316579 -12544 142579 -179707 17515 -50365 -278467 -179633 86389 -6999 -240642
19474 -240642 -440833 -192124 64473 -21314 -117996 -67977 51641 -16138 58162 -53372 -73979
19463 -73979 91272 193190 -107671 -148837 -80458 -122180 186246 28799 -137128 -150987 469396
19451 35059 -97609 24076 78084 -7324 -125900 19253 -167999 17752 306578 -195150 273021
19439 -100120 -93437 -110111 17799 -276901 -126151 -56477 83310 -209732 -47167 -288049 35521
19427 -29016 160340 -100637 162138 193294 198650 -33801 -204258 -119006 47956 160064 -241731
19415 -277766 -219825 91429 51863 153360 -232326 -101457 -50599 -135206 -34342 98351 -133047
19403 -243546 302803 40556 -52780 -142333 -46700 158829 -187100 177251 -152536 96617
19392 -300530 35075 -115892 104365 -557218 152839 -40003 -15821 10181 156992 -23906
19381 -20454 -159382 30796 -349173 -156271 118187 2023 146059 -67546 -150885 270875 70135
19369 -172219 263955 -92217 -102361 -44524 134733 149497 267785 99932 -438108 -41025 -5657
19357 -155870 -147933 -153605 -270696 -208993 -454970 229918 -86208 -22686 -83526 -363499 -308948
19346 -308948 -63547 -157420 179255 116301 -194009 90905 -272196 -269472 421355 -342525 -21562
19334 -49226 58722 -75158 -174848 517317 -182854 -684 112328 -81220 84194 101795 -22777
19322 305241 -210243 -373742 -315112 102118 -336679 -193413 -19939 -16845 5531 -96741 -118697
19311 -118697 -165907 -246046 -7295 84063 -36843 332219 -35478 -173220 133623 -48044 -10734
19299 51025 -100631 -348622 -77607 -13622 131767 -130116 -168414 -330681 -123027 51301
19288 -127538 -179506 251750 -116632 17906 -202593 31319 -44721 -109919 -142525 -72848 -156713
19277 -156713 -156641 -171294 205400 -412386 17553 -269960 -86149 30034 -331889 -118863 -48217
19265 -14369 -344868 -283263 -57906 11397 324979 40460 73641 213816 -127957 -284884 -164985
19254 -164985 -39402 -112591 -234232 -179538 172893 -197859 32289 -17990 -234024 -77819 -210970
19243 -210970 -71710 -243241 211135 -307359 38709 278632 -301199 265224 -261454 -217881
19233 -217881 -274921 -314698 90911 -181979 -296242 160051 -262223 -58124 -147465 10120 -258992
19221 -470789 -113072 83270 -194246 -345554 -50306 -66605 -2002 391443 -11345 -120819 -61403
19210 -61403 84230 40743 81175 215012 -33415 -222493 -64357 -72854 -221353 -15999 -100009
19199 -100009 -242295 172844 -94737 261851 132299 242998 -261622 -308456 74171 152797
19189 152797 -243968 27974 -47640 -75209 -51398 -351571 62564 -132653 -106250 51150 -71797
19177 -151988 6366 18432 -300220 17007 -328225 69952 43139 -251375 -44505 -190928 -90532
19165 191028 -321886 -12801 74015 -193315 -302816 -639000 6796 41333 277493 17718 135318
19154 135318 -328024 -167027 161364 181293 -102659 -204639 -102960 -84356 211802 -278223
19143 -225691 -152955 -58443 60302 -63164 -202908 -134553 219016 30468 -152429 -350828 -116725
19131 -52771 -45493 -109457 -268 183600 -382693 -415467 189401 151934 -197384 -3768 98747 258399
19119 258399 -231891 -281214 -174455 140803 -298357 306970 39662 -272043 219259 -93893
19108 116464 115007 -264060 -232842 134627 55894 204055 -207030 -220713 273275 87075 -277649
19096 -174519 -387027 202984 -66603 -178401 -167236 291550 184470 -402771 117539 -141668
19085 -459703 -343434 -68034 -183320 114666 -71474 -49526 86326 -288092 -745 -142107 -92570
19074 -92570 -258610 -462380 214144 -202705 -281101 -102037 -76769 90941 -296973 206351
19063 -181016 261931 -56883 3860 246912 152248 -348841 200474 -56390 -356252 -226448
19053 -226448 243176 -23769 60940 140578 68514 74535 -147823 -291025 -261059 41199 -127579
19041 168301 -121247 65615 -20450 -86443 -210716 86424 99743 -211518 -56123 11740 153860
19030 153860 -99912 176324 -419190 -27427 17737 -125313 166785 -8457 -30857 -107655 -38683
19018 159959 -73593 -168767 -328564 293556 -191516 41945 -72959 -339951 157841 80197
19008 80197 -119293 -185779 -105519 -22730 96113 -407213 -159820 -325780 -119776 98853 331067
18997 331067 -138752 -130888 -45282 -63268 -92772 375566 164564 41722 -102475 -234887 -367344
18986 -367344 40668 158244 55814 158790 -209493 20646 -130494 110948 -319569 -143063
18975 -35575 -109089 -240116 -171746 -170317 208507 -458048 -46519 -225073 -151313 110113 12703
18963 120798 -354376 -350726 -86928 58097 68438 -259882 -297920 -21205 -159188 147905 -360530
18951 -247084 -178555 -416043 -28296 72669 255939 55437 253695 -360534 -55326 -124333 -201914
18940 -201914 61887 -306611 -73595 -34343 44072 -73359 -179181 487650 -292827 243627
18929 84788 -136055 -118163 -198347 -244896 208748 79807 70134 -281013 -315488 -228357 -31356
18917 53476 -103020 -326996 101530 -195377 173141 -272006 -169889 -194712 130132 -51377
18906 -90647 -266777 57865 -148534 -218882 5951 -254364 -167746 147128 -99287 -48131 -486241
18895 -486241 287330 57246 42477 272631 -139506 51264 235381 180717 3219 28433 -264102
18883 -285717 -31230 -235491 146973 204013 11850 -347747 -275982 367214 -81242 -44341 -57568
18872 -57568 45145 -432869 7712 -174635 150482 -324854 -74726 -76921 -65629 -142151 -175173
18861 -175173 -325063 165188 284733 -332145 61055 54083 -3585 30094 252489 -43589 161350
18849 -243095 -131874 372450 39956 -100162 -125961 194294 -306726 241602 -263415 -196052
18839 -196052 87859 200202 -39066 -218024 148972 -250613 25543 78280 25382 59633 -175684
18827 -327688 -72163 -100590 -41981 -143734 -134613 208718 28522 -11469 66684 284977 24007
18815 220040 -294815 85513 117630 216360 214078 348439 -56112 32465 145194 159604 265398
18804 265398 256312 51682 -445746 -62820 -224819 59717 13482 80522 113936 -89401 -200897
18793 -200897 55125 -185767 112064 117149 534 -9834 -210933 -3855 147615 -205119 -70517
18781 47795 -397999 -445229 195917 -35250 -55981 54858 -125944 156457 104850 -375984 -32821
18769 -178137 -210457 -173789 -147103 -133483 -74267 -69004 -152928 32715 -300771 -68750 -173841
18758 -173841 -123450 -187309 282724 133978 -69866 -197636 -387670 -182616 306021 -27680
18747 -84361 -17478 -324083 -54784 4011 -221259 -6794 -127667 58668 350696 187247 -59659
18735 7979 30196 -369269 -269929 -80179 266612 117579 149541 27360 18071 -156016 76933
18723 -63838 2002 -52997 -259721 -81801 -230365 142917 192809 -296345 -311405 122498 -566335
18711 286283 -30486 -41209 114462 -82412 29831 -65423 -342942 192183 125587 -138368 -58145
18699 10070 171751 -17767 -42329 -267668 -196345 137987 4288 1823 57558 348040 -256789
18687 -124717 -148737 -50753 -100271 27517 -226656 49273 -11475 -94316 -414561 -56297 93814
18675 -81647 -283507 -214174 204867 53854 41830 36881 -179319 63332 188098 383486 -421872
18663 -423493 60500 -37412 182704 -174396 -263507 -375017 70171 46488 214119 -103304
18652 541540 66798 -80420 -19238 97384 16606 -250157 -5206 367094 -309504 -206958 125047
18640 184043 470420 210177 -63880 -170039 161770 -47720 -70553 31167 211448 -130192
18629 119908 347162 167945 67287 -21619 162884 -250978 25307 -109790 -40018 -527897
18619 -527897 -22418 131234 72558 -296307 -122071 -357474 65227 55305 139138 337735 83170
18607 252449 -111059 -41772 89700 -118018 -152292 52628 -49085 -41521 233213 55737 -264162
18595 -33480 162218 -484740 -177192 -90131 -37211 -219047 38623 -9150 -190840 -312335 -32561
18583 -576048 163007 150420 249437 146881 -197866 19226 51525 143264 -57360 -40271 176229
18571 -302607 -3135 -268762 -530732 51142 -121309 82359 -124036 -109077 -238433 482164
18560 -304420 -160872 -89815 -203492 -71971 -241244 -228740 -18724 24585 87115 26267 -114676
18548 305129 175179 -121785 -140383 -283146 -176083 124394 -4384 42000 -227710 27962
18537 -89626 -75877 -31994 185729 172976 -133718 -369203 365398 -58720 -88888 158854 -90284
18525 -215788 26075 -29859 37656 -136508 -254971 -541041 63604 -182999 -285051 -81801
18514 16049 -304233 126150 -397689 -13704 -326206 -141767 -600066 -157993 185992 -87367
18503 41175 -105650 -133923 162060 -575407 -143685 81093 -226941 378486 25021 -15696
18492 394201 -311765 -130801 -484801 374455 -280906 155861 -377660 -295771 263509 -304862
18481 54529 48177 -40127 -76402 80727 68073 -266351 -6480 -241206 30300 -21928 -390734
18470 -390734 159227 -112678 -140659 -39283 -108771 10961 -121732 -335642 66222 242511
18460 242511 -141886 145948 -70350 -283435 -224114 -177792 259262 -190940 -52232 -491226
18450 -491226 -304446 -205914 -136556 30515 -221242 -393115 30324 -15423 -262427 -247139 325647
18438 104319 -37882 -9072 -194054 119927 -33158 192300 69952 -131778 -84076 -135097 -6481
18426 -245870 -132006 50351 -76508 196512 118593 -96785 -272289 -153786 -201750 -289564 80008
18414 136828 -113235 -280038 169348 -44065 -360389 -212805 -1612 22624 9823 -115572 115268
18402 263693 -231212 -1608 -11459 -112836 -374998 -3021 182942 -20823 -360889 81824 -360176
18390 -295928 -28538 -66402 -140511 281231 -373635 227961 187255 136342 63344 -236643 -1764
18378 12698 -319539 -91728 106600 -87221 19058 226686 -123595 68472 195926 -226085
18367 28616 35271 69182 110837 -255500 82331 343470 -242685 356594 36784 -33703 -127465
18356 -127465 -96130 -118880 -178795 263293 -322020 -77447 -43698 -36568 -111604 104250 -64387
18344 -11960 -46664 33965 -37645 -153505 38853 175379 -134613 -199218 -41866 136011 -367686
18332 -13006 31947 -17860 -284860 -210290 -127235 -53817 245718 199932 150513 135540 -16945
18320 243575 802 -239144 114119 111650 -84007 -345414 -211610 -2067 -384069 3160 -34316
18308 -55609 -121463 216447 -21217 95744 -108719 38279 -11073 99151 -165583 -197153 -152672
18297 -152672 -40976 -308723 193110 189144 111935 206244 -210712 59280 -338183 33280 26007
18286 26007 -122601 -191293 63065 -180578 110091 23593 -226621 5493 154544 -357220 -228806
18275 -228806 -248835 -211959 -56821 -177475 -134325 2273 -140342 -110158 41447 -259176 -365503
18264 -365503 95200 -92681 -77937 -299218 75996 187031 91285 -28039 -96218 136703 -64167
18252 -66858 41857 -130031 -60426 -121563 -232712 -26283 -437091 117619 -84629 -221029 114247
18240 152111 -131258 -341585 -232807 -83562 -124434 126670 6830 -286 -58522 134019 -202344
18228 -227418 -67632 -45133 210250 -71784 -77145 187603 331941 121570 25014 80341 65914
18217 65914 72047 -305583 -55317 176926 212811 43669 -29168 130787 -230997 -41429 -202396
18206 -202396 -104509 23088 -11310 98073 -124045 10877 205955 -67609 -328465 -284483 -256367
18195 -256367 -154876 -48348 123743 144873 89110 -286424 -29943 -249504 280326 4098 -274227
18183 -106837 -211666 -156796 -420831 -190918 322216 -83724 -108957 308096 -108847 198192
18172 -246364 -275890 -76468 -109747 -415876 -4530 -142477 -181273 -155531 229027 -110901 -91660
18161 -91660 94996 149076 -114370 55966 -14242 31402 164057 10579 -286005 242217 -100659
18149 60827 30660 308510 -174253 99085 -31819 -226677 -260600 -196680 104068 -81382 69126
18137 -188101 285067 -27383 14849 -34485 128493 -109219 -39156 321611 5479 22963 76526
18126 76526 -60402 110275 83217 129355 -256922 225939 -291460 -249911 12264 93177 -91952
18114 119714 365091 -81096 389153 -266996 193722 53345 224005 -98794 19537 -191176
18103 353823 276960 -134287 60028 92326 -56924 161778 -268162 -264056 12297 -22000 63408
18091 -316146 223766 -66870 -60093 -75103 -76860 -45648 149729 -427020 247894 41042 -352017
18079 -71225 171775 -183235 -134751 -41689 -25307 -113963 -284891 352541 124732 -118618
18068 69111 122006 363144 156700 -11866 72372 21684 -248338 17897 141229 -55518 117170
18056 -296758 56683 108492 -127215 -247068 -297407 53605 81428 -15195 -128996 -232662 20204
18044 26687 37834 -217094 -235602 -214596 -205382 153784 -227672 -222174 -308694 -375073 -357437
18033 -357437 -26111 266694 -56229 -239279 -142261 -229104 57710 -275638 -72816 81566 -118531
18021 18523 268172 243779 122197 -25068 -470153 -228604 273903 -173472 80715 -16504
18010 -125235 -25918 178838 -32959 -240216 130192 -42083 136802 -245271 106980 27788
17999 -159803 163452 35443 89114 16165 235636 -404252 294967 -104088 -23299 -219317
17989 -219317 564522 -231750 -355453 138731 -165488 -88191 -388931 86555 -32331 17573
17978 23640 -137736 -154420 -348217 -171980 -9675 51057 -216652 -114444 139063 -29813 241688
17966 -290566 29143 159940 -43588 -31069 -210680 -94593 -162685 16021 42277 136645 -137882
17954 49600 154443 -171055 -128841 -180780 -48474 77145 127781 -31711 -159872 288525 248713
17943 248713 -49708 -314318 173694 104677 96208 23567 189826 -291005 98859 -35580 -179636
17932 -179636 90621 -141331 -80326 216068 192569 -111159 -229981 174551 -41970 -236902
17922 -236902 -110123 -123972 -84626 -331075 153964 -266797 181573 -198345 -22174 -105002
17912 -105002 76753 -124859 -43240 -287577 -113721 12058 -165287 17083 -338771 45498
17901 439277 -19194 -116295 -170352 234457 -102580 -47134 -70585 334406 326614 -95238 185724
17889 -144293 -118052 -174979 244189 142305 25784 -258899 -7703 23788 -131172 63867 149037
17878 149037 -27233 -65423 -53865 4262 117839 -23918 -921 118842 199039 -146325 86215
17866 -195768 77973 -264941 1669 -5079 81494 42815 -99537 -61406 36351 86945 -13380 -222890
17854 -222890 52157 -71160 -118138 128399 523241 57385 17385 124493 -104432 274365
17843 -162190 -9124 -78157 -52027 -7948 -11940 283316 289597 298133 46233 -95540 -204630 -22841
17830 55819 136126 103266 285597 -15433 203471 39041 88 -160740 -281348 -164517 34578
17818 -90610 12837 50876 45785 5308 126583 48456 -2748 229339 -151530 -7993 -15735 41325
17805 -564 137310 2995 -230190 228445 44663 20257 80065 90151 214575 132388 -288546
17793 107982 -29986 -235952 -142434 -47413 99559 -18611 54962 6243 -194798 -129766 -25860
17781 318371 -237235 -4038 295519 227742 -74365 -6145 165206 -196940 -71194 -229742 133399
17769 -17298 -266103 -149632 -66908 278471 163881 131370 -85005 519169 -87328 141918
17758 -50723 74546 35432 -90749 92487 -227590 707 -75250 121526 -392333 209930 -143538
17746 38618 53255 114803 -167459 244347 -244641 -192101 -9324 -11283 -4253 -311159 93746
17734 -349157 35799 -172963 22886 58915 -142312 10668 62837 86421 -7205 340554 -163141
17722 -158861 174440 61989 218685 -9655 -316475 81326 -106387 91089 -221702 -403776
17712 -403776 -61742 261110 -121359 -52946 -94226 32680 -173870 496614 -159660 134790
17701 296245 294621 125431 377475 99899 -85663 -177256 70365 16349 -98077 -90820 218061
17689 -37592 -69621 182019 346289 472364 27544 -156251 -173089 85069 -163624 -242103 -53271
17677 235422 -364344 160245 -64068 -64971 -46711 97377 -46521 -84304 -34608 -29171 103059
17665 333792 344369 205110 154892 -186423 -50408 -86936 335824 158431 8096 43602 34494
17654 34494 -5606 81161 11056 202514 95042 -57158 -121830 273303 269725 64448 89670 -288618
17641 -149488 131080 -71422 -358287 -145842 61697 -66345 207845 144662 -344493 100174
17630 -128760 -243170 55189 183841 -212503 218802 -70204 220142 -104446 163100 182072
17620 182072 198015 219547 203460 -537 -38336 37223 -226325 332706 -321832 164030 7997
17608 -24677 357584 -24777 42085 466844 261792 -41022 -139000 100364 104841 -133251 34794
17596 56453 144686 40807 90133 132815 -282757 -294004 258720 15202 -140081 -40301 -50046
17585 -50046 451071 119289 131152 432925 70084 41772 190171 -12142 139929 -6340 341511
17573 30915 1783 -99744 -5097 125782 -39759 -149729 75353 -219913 267655 185584 20556
17561 -34076 181853 36870 -289145 6190 224869 -135757 22520 91410 169079 95542 56580
17550 56580 222433 39487 249889 -70999 52368 189674 123587 193813 291827 -30522 -236677
17539 -236677 -94079 91710 357976 -99664 66586 -54287 120723 459786 -175653 290627
17528 102901 32276 41157 88602 154572 -150786 40912 65383 -143957 -55126 77719 250409
17517 250409 -45887 165821 -88863 297962 287825 234484 67993 75994 31863 228052 -100721
17505 53571 243964 32790 272814 452328 -110525 -180218 306736 -87619 42409 257332
17495 257332 295947 -85753 46440 -86344 187815 267420 -20165 195655 48018 112696 416723
17484 416723 105740 335449 126543 189016 15701 485233 127257 33349 -148618 129662
17473 -152392 71529 413204 136503 128362 337726 84478 436723 107280 66412 160707 -319027
17461 26497 215638 -48797 452375 -272430 207272 101564 80031 -122674 -98893 313738
17450 185281 488992 373263 153598 605478 164218 80460 158677 343428 301467 177461
17440 177461 235053 466694 71329 401743 301932 355760 27117 52186 128925 388696 -117289
17428 311083 199910 305062 498768 164076 202109 -103518 314919 301087 355246 30831
17417 280107 172238 424707 214720 339349 164638 262055 150975 357577 366973 49790
17406 -1240 376597 172643 574901 192461 504118 504706 20636 49621 104111 214018 429331
17395 429331 129365 -32335 508227 240026 244937 365384 -143948 -24216 90912 90607 -108271
17383 129636 -118147 307452 362511 147410 10999 243558 159533 -150991 -4277 581803
17372 265485 -61085 32487 286199 90815 -15138 191809 146277 96664 431023 -74589 183880
17360 243537 215529 331544 209095 54900 266927 330643 295280 185233 -43790 82209 68583
17349 68583 -157643 2866 303263 429004 344149 331565 372678 41719 237625 -18777 150627
17337 -70497 -107274 135424 197995 120057 74049 -24439 49825 394951 -284260 149807 184375
17326 184375 -14373 73907 -6241 85625 96622 -25107 76199 237817 250284 388417 13664
17314 215988 93292 -199245 129636 -70026 -81088 118033 313514 93341 145360 146 162703
17303 162703 114062 -123977 186118 297934 102881 59588 304245 -76492 -64544 150790
17292 1959 304333 169215 663553 166504 164651 153434 -47591 91237 213883 98289 157725
17281 157725 306901 40125 69295 -53325 -11146 176502 37221 417298 283479 79232 1467
17269 -210038 167045 218906 283026 117824 51744 92912 1558 -96598 96772 166813 369690
17258 369690 213287 20337 -52091 203854 50550 -41096 294378 275719 319934 131497 -73199
17246 113434 -281312 -33336 343773 401364 414037 168025 -19605 256799 -11813 176954
17235 -24810 246552 319743 97279 124811 370830 -157725 26711 376550 181209 244725 488810
17224 488810 256888 -32167 378505 144924 632786 48579 -44345 445678 451255 10380 287046
17213 287046 422270 7801 361275 206234 169234 355882 -40041 394417 373964 278308 135642
17201 137154 433598 237710 71226 303460 81611 246030 487399 280943 152344 637312
17191 637312 283199 415273 206444 581114 401217 364143 289735 124504 259001 478951
17181 478951 343664 457038 452078 464228 506937 365547 198799 486481 425744 -52307 373270
17169 138905 238931 283845 302547 196515 451844 362563 164116 140825 136186 570615 379501
17158 379501 347217 48095 117552 157214 478226 -55003 118758 409564 385225 428842 216275
17147 216275 319935 501919 64469 194989 233682 404435 102493 143773 228958 432093
17137 432093 196870 355354 365508 284342 336817 300948 84782 290929 73333 484737 295235
17126 295235 698261 309542 181370 286379 418492 560330 188785 -70596 59173 235606
17116 235606 232106 775401 528474 269200 471679 302242 419167 85649 435506 663933
17106 663933 445369 258243 248000 663356 378343 522559 376507 360189 365385 332062
17096 332062 343001 384454 412493 236784 -157939 511971 332049 506679 119856 417885
17086 417885 436947 436291 613324 323400 477124 422380 496703 -22603 295025 444314 359445
17075 359445 719107 642254 476950 404139 960395 506422 574873 783244 616672 380172
17065 380172 723140 -30067 878786 653220 659722 523602 679929 319937 755237 357343
17054 1042487 587899 532488 697438 891037 543617 399496 537003 638537 661917 423117
17044 423117 866587 432193 864254 536934 751858 303286 827199 623624 616573 667354
17034 667354 770434 659505 523137 328006 357385 628914 505185 828472 703462 461785
17024 461785 801165 638595 783127 691843 680417 634290 697934 364857 341505 683180
17014 683180 805511 737305 520561 479562 697975 604347 682626 612386 698858 945878 541432
17003 541432 904828 842872 793959 1137203 829785 588430 706121 990134 828730 954401
16993 954401 682745 852998 669943 664295 689056 679404 1080814 1033162 575225 736749 1043103
16982 1043103 1096319 817829 1192461 784954 816352 817164 836866 619689 1162709 625275
16972 625275 1231606 477016 661572 1166990 1117191 1148264 1031816 836879 905796 866573
16962 866573 808394 1000476 1132361 1220633 1112915 1182299 1083958 778768 966581 895071
16952 895071 1179816 1028552 1023000 957075 1201228 1281493 1213285 1384461 1247124 1287065 1131745
16941 1131745 1248827 1030855 950118 1094550 1227523 1320653 897014 1190083 1264469 1372537
16931 1372537 1027355 1165062 1330102 1221565 1361108 1411483 1090231 1606133 1460391 1406364
16921 1406364 1556321 1246276 1724669 1524774 1584406 1471902 1573770 1496606 1690731 1458165
16911 1458165 1676871 1612701 1488662 1641139 1733732 1845141 1466310 1652279 1772144 1758707
16901 1758707 1777831 1670139 2005500 1603411 1626778 1754806 1929636 1766201 2181696 2136514
16891 2136514 2122210 1829932 1988490 1810172 2172816 2048062 1874642 2089746 1975601 2102570
16881 2102570 2218157 2441795 2227066 2314369 2427230 2320161 2210219 2497030 2115131 2403675
16871 2403675 2462475 2750979 2188220 2330875 3097349 2821370 2817619 2791074 2808810 2638852
16861 2638852 2718426 3105117 3214025 2778685 3174015 3199374 3144704 3544084 3280397 3394633
16851 3394633 3242342 3225519 3383909 3728435 3729136 3328989 3669278 3637238 3635623 3907611 3711677
16840 3711677 3942551 3621306 4490313 4247612 4195282 4231487 4329194 4578227 4307225 4417618
16830 4417618 4753273 4706470 4910044 4873159 4651861 5275454 5058737 5322458 5210508 5488053
16820 5488053 5325853 5745252 5775857 5983330 5899577 5660299 6172168 6084560 6638925 6638536
16810 6638536 6390436 6972460 7315826 6594661 7154741 7347513 7632895 8085337 8129867 7974254
16800 7974254 8403262 8881953 9095609 9090022 9234578 9243220 9687588 9592392 10280665 10442017
16790 10442017 10671205 11412887 11445325 11264945 12016988 11986363 12539771 12836920 13016638 13536108
16780 13536108 13762345 14572330 14806649 15159541 15942904 16350245 16960469 17111035 17999870
16771 17999870 18587233 18988574 20057444 20438821 21238766 21840966 23210667 23372587 24618993
16762 24618993 25529953 26516956 27413158 28639514 29753710 31126537 32794518 33942048
16754 33942048 35715667 37136118 38565796 40501428 42614752 44354114 47009279 49502010
16746 49502010 51405478 54388219 57020287 60187833 63237840 66981494 70510039 74458759
16738 74458759 78794141 82950581 87827799 92800292 98131435 103705405 109753522 115861110
16730 115861110 122156753 128665761 135360883 141974799 148599423 155029152 161301156 167354906
16722 167354906 172395832 176883987 180811806 183499000 185183516 185917521 185318538 183463970
16714 183463970 181212735 177561807 172989269 167591539 161581280 155515335 148927996 142302514
16706 142302514 135369261 128615233 122049815 115402762 109121023 103190293 97598008 92151651
16698 92151651 87205989 81998299 77467096 73226037 69215185 65711548 61983923 58926104
16690 58926104 55784021 52992167 50263834 47789653 45201038 43292590 41132313 39136286
16682 39136286 37544289 35857629 34261584 32647859 31575399 29831118 28705654 27646976
16674 27646976 26603489 25499944 24565557 23807285 22696795 22074911 20804514 20085529 19881961
16665 19881961 18481065 18218203 17507839 16904344 16409988 15790679 15212097 14862787 14619579
16656 14619579 14327106 13703907 13004380 12819164 12506561 11985626 11726126 11336759 10790463
16647 10790463 10775949 10270545 10414347 9592233 9801103 9464095 9088583 8918353 8441846
16638 8441846 8732823 8125131 7720021 7953307 7546405 7405122 7510606 6984666 6849251
16629 6849251 6969193 6744400 6219698 6593133 6450766 6068188 6075021 6027324 5722596 5603652
16619 5603652 5575436 5142592 5262621 5024420 5121088 4869413 4893585 5087431 4945439 4797187
16609 4797187 4664955 4518412 4091660 4240577 3924083 4080875 4059460 4147824 3819174 3798048
16599 3798048 3998291 3443944 3955487 3658494 3290704 3551605 3348278 3462841 3039038
16590 3039038 3380760 2930873 2976047 3025130 2927531 2870151 3217998 2916644 2787618 2786442
16580 2786442 2722880 2631928 2713911 2790684 2778759 2301384 2664352 2202120 2562005 1987673
16570 1987673 2311857 2389979 2450149 2380167 2516812 2029973 2187794 2082637 2254012 2208978
16560 2208978 2219137 1933649 1941279 1924391 2014755 2049302 1978351 1707579 1870506 2078333 1778039
16549 1778039 1986401 1716933 1525552 1605967 1751491 1827698 1683400 1578289 1628104 1718822
16539 1718822 1669999 1665162 1442730 1762226 1547785 1315371 1533838 1447973 1249411 1244928
16529 1244928 1089651 1725019 1242931 1120153 1492230 1352850 1299699 1002691 1500504 1171400
16519 1171400 1520866 1119765 1002434 1000447 971676 1076905 1385919 1556320 1003033 1286646
16509 1286646 1589159 1106274 1042669 1344350 929445 1041492 1218499 1128987 725431 1179712
16499 1179712 793266 921106 740553 1035403 836083 962883 707038 1174759 898358
16490 898358 802823 912409 1025218 842032 642859 797481 1080041 1179753 665464 728768
16480 728768 1142432 811107 717003 973465 1096156 947312 1065938 854511 996015 1199532
16470 1199532 959585 842232 781050 993965 592814 918482 877115 897012 810805 690058
16460 690058 786331 580645 598600 776418 429013 560124 604175 1024615 729424 882058
16450 882058 623025 818816 754295 731392 556081 774624 868465 139008 716322 644240
16440 644240 1001251 505707 614060 708677 793705 856747 485338 540436 482855 426304 604499
16429 604499 640985 491505 642307 554019 534451 912458 378046 673394 415932 542323
16419 542323 228416 551852 155216 365129 469709 730037 500123 625694 398577 384517
16409 384517 218998 542070 362793 237776 403883 399685 192072 258238 332741 42362
16398 156042 552875 420794 385773 550498 455665 515610 541306 185065 710798 163232
16387 335363 406594 158769 407406 562403 -19097 365631 456051 202041 332374 62868
16376 328763 361226 683366 309264 200517 333897 362054 213555 324283 94850 389922
16366 389922 308929 360752 230817 482163 210406 309699 510756 391975 543240 386813
16356 386813 306271 185818 140588 -12342 289426 502933 300499 286804 129709 358564
16346 358564 409228 631565 264716 253533 190668 443486 497956 588440 373960 311247 -166875
16334 525543 263305 274759 176757 545679 262201 406817 317112 383367 272190 287398
16324 287398 494126 339904 257670 210074 -9634 444906 124632 -30382 12694 317789 96058
16312 355964 172551 497710 430458 297754 316124 -19370 598779 429369 174627 163626
16302 163626 -7609 348388 375862 61421 185793 123741 -80669 278156 18528 498103 217725
16290 136153 198928 389687 390374 455248 241871 30026 251221 399257 253555 245443 169979
16279 169979 484953 149010 21657 181490 -49010 167942 361201 444855 368345 351721
16269 351721 382631 206792 -82368 106613 233654 304419 167366 130533 190103 90940 229226
16258 229226 417400 408456 169723 272326 106177 38180 340549 120753 285847 -74216
16247 246331 260740 329377 -243978 165642 263492 -237332 538505 -200352 -68398 14328
16236 -17014 484304 194523 -256998 -17755 35739 -10616 193304 135131 143962 -27278 121910
16224 243263 67214 -132901 -23674 52707 141160 246418 -99259 41276 253750 357731 207554
16213 207554 245700 -186043 294905 167286 191840 14176 394328 120235 323908 15886
16202 71695 151786 62313 -151394 138411 7832 -27506 -235349 482861 71137 71335 403322
16191 403322 102283 102985 71994 36242 -58013 215361 142099 -1544 30321 248599 -114636
16179 11291 296575 -94365 166862 23122 211106 118424 -137954 -79671 199886 341902
16169 341902 74852 110048 67583 -82680 5708 91538 104252 78733 -35977 336307 232579
16158 232579 -45148 -276803 94736 12094 12 55005 -100075 39729 -381798 156213 169200
16147 169200 -260013 57973 316454 171304 185980 68010 113338 -86464 142478 236528 -142685
16135 123468 -13517 -111823 203506 43485 154172 140781 168367 158566 166410 390447 -75945
16123 99063 53487 -97587 20946 134172 155653 -51307 -67215 -183874 72008 -179705 86911
16111 195033 -21091 -155485 -49737 -167710 209767 223288 222900 212016 9956 -22803 -29545 187186
16098 44627 117495 -266533 264282 147066 46956 -190517 190076 -12502 100788 131093
16088 131093 69947 360353 39607 218592 -169511 93490 -29755 -145556 -123935 57507 -153988
16076 -53893 -110210 68535 186215 -164199 209912 285551 33021 158574 138844 -48812 160554
16064 396652 -99624 56155 -106190 247710 -282576 -140764 -52000 110245 92541 -36790
16053 -271853 -94980 27715 -77109 -56789 67928 67117 -189814 27208 71357 -14228 -155090
16042 -155090 -56704 -105569 134824 -481096 -105687 118467 -223755 -270871 6064 -229850
16031 -353303 -160446 71239 -20420 35178 -37493 -339198 93546 -18889 386628 277034 -174665
16019 -271591 -61723 235666 -106275 -42657 -98746 156825 -70301 -170890 -323406 -167161
16009 -167161 129259 125601 4756 -218415 -231468 -56279 28045 79825 -166164 293056 5424
15997 -152315 57844 133890 97038 41570 -44867 -38634 -64307 91017 -37938 210017 222089
15986 222089 144267 41418 126545 171175 -167340 373775 447675 536658 45416 337390 189581
15975 189581 38748 58667 -137624 -45339 164430 34990 136057 -320211 -117113 -152721
15965 -152721 75011 -155243 -79274 25237 -51333 -10456 -51538 -105988 -57077 106376 -82552
15953 29832 67278 -17401 -75947 15156 -79984 64525 -6483 168309 196586 163185 -235382
15941 -63649 23565 116156 35477 -171692 233210 86190 -208731 -208911 -297153 -138343 -88279
15930 -88279 254517 -343103 20270 106283 10004 -95136 -205668 -105605 386645 266942
15920 266942 89308 -221135 4946 -76699 14947 -27235 412533 -96354 154167 -37266 -98870
15909 -98870 197954 -192697 -55323 175651 85319 269105 -24016 101741 -52650 -173354
15899 -173354 170416 -215698 1439 261727 246307 -392789 107534 -360249 54624 -23464
15888 -228356 -236825 -138278 -131890 -167305 293868 -94647 278625 -429854 -1782 -359636 35147
15876 200194 -138484 66263 -213101 -108001 -39540 162722 -79171 -213426 186957 -51768
15865 -65723 -221939 -124811 -372387 23299 -179818 -137186 -330344 -338173 -156764 -161138 -228899
15854 -228899 -280628 -72523 -41336 140087 -36929 201711 -208945 -11049 -143905 72703 22976
15842 -37678 253520 -146824 -473837 -141493 -298496 170531 -273262 77637 369865 -44570
15831 444331 26778 -34060 -22007 -239299 144116 -5586 5272 -170460 214506 -246836 196129
15819 -222949 -186528 123414 -41905 -99263 181111 -158604 -129796 -121302 -41672 -50297 132457
15807 -14296 -122705 91001 198875 67098 -201735 -26742 109017 106509 -193986 -366430 -115405
15795 159043 -145398 -201137 -98176 -87922 48700 143530 288317 269713 -140408 -51233 96682
15783 194748 -313520 -24381 -147961 -96883 -81318 -113355 -273436 86486 191135 -66162 -286589
15772 -286589 -67505 -10880 72371 76604 -108805 -113482 -81937 -107415 -5312 114697 124114 -234285
15759 -263545 31935 335055 35129 47064 182114 -158185 8788 207928 285817 -59845 278141
15747 239334 -37567 -101683 -79555 279322 118271 -1849 -51707 -301201 -117569 58422 10921
15735 125079 17462 -403664 236395 -296390 91853 -297847 -300777 -134081 -100298 -59068 50313
15723 20367 -57540 -17798 51630 -4111 310597 -283869 48315 -100595 -323323 -104445 297166
15711 59816 30499 -75621 -453139 -89508 -88637 95608 -121352 137119 70475 946 247036 -72927
15698 327342 -192417 -42584 147647 -318679 14136 -297867 33491 151 107013 -32797 -29604
15687 -29604 -41883 70903 -83776 56547 -224906 -478811 -198972 197077 265718 -258689 68108
15675 14199 -98144 -6870 -137115 -27579 195918 -21786 -231148 -109173 -109035 -34876 197552
15663 -82848 215169 252440 169455 111995 -122632 -63026 45601 108459 -14941 -255342 100800
15651 40079 -471070 -98929 -199637 -232596 -19051 13176 -331600 -109291 237489 -40692 -167734
15640 -167734 -42457 -339779 -41093 -33303 322095 63692 -148984 134976 -113189 -147183 -197429
15629 -197429 -162138 148538 -314102 -289431 124307 3184 154609 -74601 155919 -149586
15618 -57832 -121560 32314 45542 226111 -152027 -73362 -15794 150930 -35577 152721 -81556
15606 -132516 -66760 8424 -38051 312489 231242 -54303 111288 453 -130675 -51481 -181535
15595 -181535 -28937 27033 3516 -91541 238707 219966 -41011 -116148 -124130 193572 127021
15584 127021 -90268 -48340 55769 -238179 -135835 432693 20501 -391644 -174066 -166415 -85199
15573 -85199 -441356 41092 225278 -46424 -198100 -234429 -112386 -102340 -268300 -457965
15563 -457965 -84558 224998 231779 -31212 147038 52219 9565 960 -61065 107331 -97562 -52201
15551 -52201 -25538 -130522 -177228 -266449 -19118 -12678 -154101 48215 36345 -238958 -92532
15539 -454020 275666 128833 -128805 60069 -138726 -35957 -48803 297775 100796 -131013
15528 47558 33327 -168255 -133776 -219946 196606 -205811 -67250 -256252 347277 -7324 15484
15516 79423 -96834 -262748 55546 -193877 166700 -193917 -8795 124932 -127555 122486
15505 -371367 277030 -183917 -45389 54721 7946 -48877 45404 -350297 -61484 125276 -271273
15493 -64313 95691 209640 -88621 -191578 5716 165874 19997 -303577 -198241 -95878 203646
15481 284907 -68574 -191294 -107877 61821 72219 313151 527747 -406055 28366 -44312 149466
15469 117468 6242 -290919 371979 189038 -25037 73738 59719 -58975 -143539 31314 -98627
15457 182132 244213 115313 -11443 -120432 -33572 -2252 186079 16257 140044 -141410 77116
15445 -53734 64797 67754 -20576 73871 -212820 314699 -15703 209960 -110576 115540 -27993
15433 4758 -216998 -158671 -22095 -41237 -131360 97250 -40530 76949 -277522 16900 -136171
15421 -108747 10921 123592 -142262 7398 -51415 254993 180747 85503 247515 -352230 -159802
15409 -122568 1052 -365800 295556 -73896 -60133 -150491 -3653 87494 -124036 -43146 -73326
15398 -73326 37063 -169870 -149484 -46036 6215 -5937 -120129 -181296 148788 75487 5737 -309599
15385 -213562 97497 180230 -145264 -29358 113854 -110201 -117442 153671 -221003 197876
15374 263632 20093 -34188 -115856 227826 108214 78450 74917 147910 -170919 321884 255461
15363 255461 -197994 106652 -44030 -53495 87833 125679 5740 -353598 263362 198688 84810
15351 -17885 83262 -320864 -128747 -29734 165171 -211022 166359 -58008 129334 156641
15341 156641 -203496 -252044 -152373 116321 -242110 116778 357716 201764 43581 88530
15331 88530 110181 333759 319040 -169405 519578 -268665 -3902 -101894 9683 60673 14437
15319 93920 247146 85467 141146 348883 164512 -179164 118587 -9570 47332 24643 -119808
15307 -202388 83252 160585 219517 -268043 316575 -95576 46704 -255371 183763 -73774 145353
15295 462392 -21484 -80311 -161923 118291 15437 -17871 -84352 277120 248596 283718 261902
15284 261902 -384857 257234 201051 -269571 130914 188629 10563 168364 259693 17402
15273 97001 77273 -116545 -66960 -80109 -353536 301978 335789 -14044 125170 83160 277978
15262 277978 -16373 270525 165448 9831 6483 -33822 50639 -120404 177512 229843 87989
15250 176102 413614 786835 1548818 1679019 1239028 1556124 717598 316633 191171 -158208
15239 290370 74302 33723 250159 -13262 43643 -370694 346286 -56968 70079 83522 167688
15228 167688 259451 314052 -58315 -164546 44706 -4306 94721 250072 230621 -182787 68495
15216 21886 -359476 9343 -63272 146409 71804 193562 94787 -45667 313966 60647 -171675
15204 -193992 81235 90846 -160264 -128144 -147336 139383 -161883 148417 323943 -36643 147672
15192 171613 111688 2462 -28286 72903 55850 -182750 272090 -4555 132393 295896 56222
15180 155725 163545 -423271 277440 109913 -10142 -317460 -123213 -211707 91696 84571 226740
15169 226740 -104889 199656 277421 110781 533877 18254 15497 224505 132502 -41297 -97261
15158 -97261 87898 162271 171094 64161 144843 214017 -4041 -93178 -46139 -176697 354924 -10321
15145 -166741 164097 126528 -47194 375854 138988 85576 252893 -62609 184118 72500
15134 -113331 -10928 49351 107197 317055 -74300 -79532 269423 -1558 111970 137549 -86308
15122 223812 -60358 218156 -17730 -88683 -212139 375553 -434938 301925 171249 336437
15112 336437 -86197 -109148 277721 -243844 25758 369699 108058 48519 119020 -45478 -241209
15101 -241209 -14180 407662 -5983 4210 158957 40980 433328 -265212 -231322 196813 81034
15089 100755 114602 128405 29806 254866 552251 5741 -79258 125891 216440 30430 350135
15078 350135 137987 -166905 7227 253110 499294 464848 79455 136735 107436 502315 -207625
15066 217480 352653 146931 -115437 -105715 333682 257966 366444 44274 395618 -60669
15055 94160 238599 143966 -122335 183561 -67502 237759 -14863 166850 56762 176924
15045 176924 112120 362302 429208 279330 149292 -154190 75548 405947 255926 430674
15035 430674 133088 291332 345915 -42341 -35634 482896 29226 85547 256828 97618 152534
15024 152534 36196 156098 346082 257919 -228532 329801 97699 237973 300058 197974
15014 197974 411210 -69432 283590 452413 80652 166092 288288 81215 -63156 211448
15003 77167 518385 233481 536792 252181 147391 412266 303224 115592 100061 219569
14993 219569 208577 612949 404939 485173 3449 318242 273324 -62149 276831 50998 92929
14982 92929 418178 125227 164662 157734 -20419 421132 -46523 449609 227262 204459 134856
14971 134856 288608 140143 459765 138093 174539 124431 -132899 180666 366010 326739
14961 326739 -97582 373784 307909 275830 -103063 533760 440488 406115 452006 396001 138271
14949 22707 228383 342217 495085 268112 435407 176200 383449 401372 242792 324184
14939 324184 190471 336797 4327 264448 262961 273603 206459 22766 227281 202660 504236
14928 504236 208143 280558 356788 84854 390593 95037 530079 446592 34610 340341 -79258
14916 809890 522022 392741 264402 792452 206303 450412 363653 316666 258066 242852
14906 242852 84791 580691 356698 346435 432673 139448 282118 35555 406936 741586
14896 741586 422250 734879 229876 85988 213793 367804 487810 420156 457118 244584
14886 244584 348231 347892 544064 418594 427509 219558 218660 329293 467983 306637 449765
14875 449765 274516 115171 358238 -128391 379217 340644 404961 466082 505020 269633
14865 269633 545457 307512 588472 422948 100235 249965 242834 614214 414693 205877
14854 432631 665965 445480 159569 499917 210841 616688 -41067 64523 553117 439847
14844 439847 495464 414522 390949 483090 119557 636276 364767 429160 695215 545494
14834 545494 591000 396049 316809 384671 657448 427493 218657 695477 664269 383785
14824 383785 448069 428322 768249 191061 400634 607916 333938 485585 306473 763895
14814 763895 751776 230063 565364 613112 309047 468465 464581 341516 682391 500478
14804 500478 241191 500984 741410 536780 544665 775995 675027 663539 704200 474176
14794 474176 552807 574578 595266 414526 557530 381415 418296 681204 259616 642656
14784 642656 582999 556691 423474 600768 632398 575489 584331 443494 358806 404846 673643
14773 673643 729072 340478 487024 931876 571342 633232 525339 378514 454441 297511
14763 297511 558566 934629 718927 338556 651836 656272 562351 471438 776317 877645
14753 877645 598034 837504 725768 511794 874116 512971 691101 483975 965195 565268
14743 565268 599333 588646 644363 264978 678795 479983 817552 1004866 711715 860444
14733 860444 1038546 811550 743324 701631 571101 785319 461837 858368 919473 915906
14723 915906 623636 708468 877662 947538 726524 840380 899732 665627 1116946 916479
14713 916479 563687 915377 593778 662524 765927 618560 879827 753150 529191 1111964
14703 1111964 607880 726632 572416 592566 687082 886014 1137961 1141962 640140 1032671
14693 1032671 853877 1262358 1114387 765903 777775 1047779 921074 892849 682425 720899
14683 720899 838335 1111167 516496 1044219 835248 898940 739064 865813 1105215 1018226
14673 1018226 597011 1230522 1099628 813489 1121826 981717 974738 1108205 860494 988526
14663 988526 925159 1372084 1194823 1464279 582358 745143 1175026 1183453 1013778 930868
14653 930868 885261 1174520 1230097 1030489 1331720 953786 1182791 1033694 961926 1082305
14643 1082305 1344954 1207960 1204038 1358376 947626 972188 1345535 1292194 1347999 1229530
14633 1229530 1295585 1419907 1302130 1195720 1017703 1418506 975282 1374554 1455157 1463711
14623 1463711 1467641 1338005 1180617 1902642 1101776 1349896 1533659 1006668 1697280 1203431
14613 1203431 1485502 1789362 1881774 1507343 1436279 1285970 1668120 1467912 1664224 1648574
14603 1648574 1475416 1499865 1702048 1365847 1710755 1739893 2005593 1547624 1986606 1463391
14593 1463391 1752048 1596661 1914559 1821370 1857001 1654483 1495724 1869923 1755334 1721886
14583 1721886 1793241 2106380 1835127 2118400 1661004 2110796 1867019 2015694 1723778 1837032
14573 1837032 2122580 2209431 2299345 2177108 2287497 2395985 2165816 2430994 2488177 2497697
14563 2497697 2676610 2450988 2815363 2587673 2701444 2648666 3096371 2916299 3461264 3175639
14553 3175639 3710044 4183964 4676303 5393251 6923899 10767090 19118401 33451504 46332996
14544 46332996 28862686 12992455 5897134 3338738 2535040 2079141 2040838 1897191
14536 1897191 2200260 1968933 1824271 1764212 2168562 1907961 2258138 1991323 2061381 2188086
14526 2188086 2093746 2263187 2409652 2480519 2333053 2276359 2297172 2363778 2423264 2682731
14516 2682731 2436474 2364673 2461107 2504381 2404644 2631132 2643557 2680129 2782354 3106520
14506 3106520 2780229 3091329 2876720 3097441 3241913 3161481 3377745 3243631 3389070 2878793
14496 2878793 3118038 3292606 3395732 3237060 3388708 3089432 3277204 3053031 3329943
14487 3329943 3470940 3665976 3453305 3545185 3458520 3566196 3866733 3733156 4154981 3615929
14477 3615929 3939495 3845791 4095633 3997550 3952494 4287251 4113291 4346038 4292583 4154095
14467 4154095 4232454 4673751 4420109 4650029 4874778 4222511 4530458 4586066 5051840 4827345
14457 4827345 4812786 4772885 5050867 5302311 4817959 5503787 5263060 5123710 5300236 5411612
14447 5411612 5513902 5835445 5621671 6044298 5766073 5939050 5766062 6078033 6152269 6150793
14437 6150793 6228215 6340849 6291955 6608047 6517949 6651441 6481992 6581741 7008567 7241111
14427 7241111 6991285 7319662 6923155 7587774 7563846 7097183 7947689 7954609 8032403 8158706
14417 8158706 7743474 8205903 8246976 8580008 8756898 9005138 8684744 8501946 9483965 9181127
14407 9181127 9349447 9363661 9661781 9547278 9743057 9984111 9755576 10068893 10530426 10604032
14397 10604032 10941473 10895022 11295044 11337943 11411367 11617460 12055908 12178842 11910837 12340076
14387 12340076 12611489 12836908 13150397 13289630 13452474 13829113 14228495 14098700 14906213
14378 14906213 15336421 14788147 15464148 15888831 16229477 16301322 16471279 17191365 17424205
14369 17424205 17361064 18253241 18811397 18913960 18928385 19571908 19828214 20472317 20684707 21242887
14359 21242887 21562787 22345785 22838881 23634813 23766204 24316464 25322659 25918385 26393012
14350 26393012 26703986 27637146 28329748 29013580 29857321 30516955 31452290 32324343 33001669
14341 33001669 33725339 34737810 36058042 36851843 37396589 39146502 39926031 41313511 42495544
14332 42495544 43358134 45248629 46310886 47962591 49405596 50878408 52601067 54263860
14324 54263860 56323053 58364644 60113697 62201808 64489580 67256444 69004641 72050916
14316 72050916 75212072 77466919 80755064 84079308 86845397 90603222 94903135 99015108
14308 99015108 103138708 107697559 112405163 117572491 123144302 128784650 134803136 141354114
14300 141354114 148001702 155375981 163189555 171534298 179895727 189493867 199342659 209667614
14292 209667614 220402438 232187561 244507061 257564217 271061785 285076044 299918883
14285 299918883 315360077 330611671 346974156 363030710 379344813 395231521 410824026
14278 410824026 425400860 438939421 450755801 460809420 469091033 474784940 476270958
14271 476270958 473905605 471936466 471797865 469698741 464979074 457777436 448345188 437785422
14263 437785422 424352824 409910895 394116323 377953555 361327226 344832146 328277442
14256 328277442 312233329 296765768 282465067 268749100 255096595 241367094 229109630
14249 229109630 217434095 206224718 195820160 186235394 177171530 168656447 160763930
14242 160763930 153170276 145709284 138959672 132855585 126807640 121818607 116172500 110783971
14234 110783971 106297390 101690514 97662360 94109027 90417263 86674789 82955952 79862447
14226 79862447 76829450 73841254 71438047 68660172 66171530 63884360 61590387 60004985
14218 60004985 57964603 56081438 53842525 52299624 50776285 49573766 47831122 46299071
14210 46299071 44965146 43484381 42239711 41465878 40492910 39440844 37629034 36830864
14202 36830864 35830091 34910374 34511000 33402378 32403131 31721336 30440351 29824974 29022910
14193 29022910 28510436 27605286 26903794 26401284 25996483 25108757 24588395 24062897 23277997
14184 23277997 23307867 22544862 22043683 21545771 21100508 20832337 20242222 19823264 19175439
14175 19175439 18989534 18531581 18114008 18057010 17798525 17038575 17187809 16485932 16211862
14166 16211862 15879854 15618832 15401674 14893558 14819703 14431761 14329569 14114712 13778912
14157 13778912 13660650 13248754 13291999 12822325 12657594 12513034 12352174 11920541 11783576
14148 11783576 11763181 11560791 11230737 11336456 10908630 11043488 10366807 10247993 10275186 10136110
14138 10136110 10102722 9769706 9623433 9344812 9621793 9075243 9207916 9294963 9011694 8835105
14128 8835105 8576957 8661619 8599059 8118994 8157741 7894925 7952016 7991106 7562058 7703574
14118 7703574 7654293 7429265 7216925 7101087 7203782 7055804 6731958 6915726 6659797 6501279
14108 6501279 6378229 6296336 6591614 6359764 6190470 6156768 6069823 6110517 6115720 5859948
14098 5859948 6033408 6046524 5686982 5159973 5835038 5400346 5231905 5177270 5348837 5312077
14088 5312077 5162874 4943811 5097946 5332594 5152302 4881379 4987749 4748080 4715832 4633329
14078 4633329 4796198 4437144 4442210 4562978 4228637 4299917 4658258 4168865 4418561 4466041
14068 4466041 4118524 3886283 4057702 4030118 4010234 4047778 4243817 4011044 4158762 3926421
14058 3926421 3904208 3849389 3890577 3690675 3914388 3863925 3756276 3463310 3683114 3489009
14048 3489009 3616461 3563293 3547301 3438805 3514273 3450364 3050132 3212215 3270367 3002178
14038 3002178 3021281 2792247 3233472 3415360 3247952 2943095 3214941 3179028 2954780 2749611
14028 2749611 3126384 2957524 2783881 3113738 2510186 2857234 2644345 2800252 2790517 2572155
14018 2572155 2877939 2440607 2539189 2866444 2586888 2436907 2826750 2475198 2344400 2246211
14008 2246211 2635637 2096649 2494364 2302326 2313854 2205703 2254317 2026467 2190587 2065504
13998 2065504 2108362 2093227 2055391 2218034 1931021 2172196 2043445 1917685 2591287 3190662
13988 3190662 5771127 12686232 26334246 44018837 32717127 16381269 9551299 6329992
13980 6329992 5055516 4473482 3604405 3178951 3314348 3185487 3128934 3180719 2514819 2420610
13970 2420610 2675573 2385365 2488585 2409753 2632321 2408311 2264755 1873557 2289349 2281732
13960 2281732 2320286 1934816 2207072 1850545 2190516 1879313 1794079 2063804 1898218 1874552
13950 1874552 2082211 1971499 1683698 1963866 1733269 1920323 1964497 1812402 1592155 1636545
13940 1636545 1669798 1481937 1695559 1698808 1951529 1827479 1839909 1609649 1705401 1378885
13930 1378885 1737242 1814383 1840008 1653967 1498955 1767716 1484016 1850182 1319509 1615863
13920 1615863 1424013 1836690 1766822 1397024 1732591 1142772 1695214 1552151 1865277 1557601
13910 1557601 1422745 1603645 1734351 1513981 1550114 1300601 1107663 1637504 1338897 1745941
13900 1745941 1528545 1118505 1478967 1557074 1057607 1303892 1465370 1140524 1393781 1470221
13890 1470221 999788 1390506 1324750 1413660 1128526 1246917 1061415 975808 1168116 1307114
13880 1307114 1088715 1343550 1223982 1412070 774086 1406843 1177308 1237408 1048820 1264659
13870 1264659 1212015 1163656 1232022 962338 1001745 1285439 959575 844997 1131378 1211460
13860 1211460 1149980 1205467 1363451 1126859 819361 1413129 983324 1151293 1284657 1016312
13850 1016312 1302956 1189872 894464 1028249 1048743 1230918 1006379 1027688 1168404 914135
13840 914135 1067025 1062633 901394 1116656 798918 830487 734268 859245 755961 884628
13830 884628 662370 797864 1268498 770159 968964 828236 859555 837109 1002470 875148
13820 875148 746102 738216 852324 862291 1106632 813234 821772 985260 763258 885520 1021716
13809 1021716 1140984 709138 789918 444919 641818 1256008 951341 486553 927273 482572
13799 482572 1016730 871315 588100 946205 649161 882029 1204930 565297 611877 890319
13789 890319 571321 1323780 839806 709461 865861 598996 1066813 896469 257674 643869
13779 643869 933188 344220 557185 759661 988853 810688 730542 919811 792002 867941
13769 867941 490493 750906 685450 750246 806029 645638 641097 609582 530297 835003 725850
13758 725850 978424 618631 542074 804353 835904 671594 648622 789937 763711 740206
13748 740206 631526 546139 640414 578449 746095 641437 801294 950567 496206 253900
13738 253900 800403 545399 1041263 656388 465147 702073 532063 671099 770425 468272
13728 468272 609198 628147 148848 667974 324347 686631 541257 445529 535619 705906
13718 705906 774269 676612 514029 502261 288787 379116 417604 685959 301529 449805
13708 449805 475172 439551 688253 384114 664702 887312 744084 883657 758669 696068
13698 696068 346484 810214 348234 616086 618180 212621 554431 635185 167840 560755
13688 560755 240936 241862 528832 527489 524698 484199 663793 372245 873494 327848 595931
13677 595931 370019 537493 533011 347400 387059 289210 307354 126895 253809 433887
13667 433887 489710 492370 368790 237330 304697 489467 329745 598255 559184 330471
13657 330471 624997 351801 357255 187923 461065 463233 231577 717956 436994 356707
13647 356707 558490 314449 443137 710326 327802 260363 498540 342640 675687 328231
13636 590346 555314 489234 565126 518052 -94722 504281 175407 557069 476952 439237 844756
13625 844756 449013 385830 167274 399654 105098 517843 405947 432488 397525 245784
13615 245784 649420 437081 513656 242815 407501 639584 347452 493082 332585 -65942
13604 244900 353772 97141 197829 385713 347093 35612 489384 385089 168681 802291
13594 802291 194296 336100 562436 451769 199156 240371 330096 394223 167860 400344
13584 400344 294412 499051 298096 331774 268806 217137 239374 325570 626579 456426
13574 456426 511143 445273 364568 364061 306095 153173 481875 285177 152417 360391 615411
13563 615411 531936 -60339 179924 393467 507079 233209 308486 217224 337967 338583 482438
13552 482438 2226 508033 305193 248179 405418 151858 166081 124334 -36769 497146 293420
13541 293420 291509 55102 495295 796638 410339 130829 210896 407462 120461 262635
13531 262635 412317 399142 334146 327966 471680 556366 271970 302848 -168169 331309 -4281
13519 507303 381733 673178 176113 355038 565873 298485 338061 21041 358359 359968
13509 359968 251557 44734 177049 543053 205449 324071 117494 -222468 231023 341591
13499 341591 170640 36902 112703 396892 112519 224301 262096 83574 360030 238440
13489 238440 561961 141989 122119 -272 98811 -7783 167855 326830 221006 605596 283452
13477 252067 566308 643385 562940 93613 235524 -299178 323762 485392 317430 311368
13467 311368 -127477 111949 241503 178272 186271 37732 198235 -115049 290819 180024
13457 180024 99678 526701 215082 251944 199645 454290 189325 168915 418690 176222
13446 70361 119023 302578 -209147 300938 86181 110739 303706 163524 -6545 338949 -165685
13434 264749 167176 401797 265955 -177801 35155 -48403 91386 241247 309232 513651
13424 513651 270601 435010 54623 301143 218432 252160 282684 189245 250086 319166 203866
13413 203866 218257 -19651 457669 184085 22693 474232 278028 241550 334619 267842 94270
13401 425509 239223 595676 141287 -250127 109319 -57697 198148 57737 242461 158081
13391 158081 -100293 144856 238144 -30868 4454 211977 498747 -12919 394846 54201 226587
13380 226587 -116794 314540 160875 90302 180857 40548 76685 432954 -78711 483576
13369 356192 323614 436805 242978 382861 272602 57779 259077 75037 128995 505249
13359 505249 275453 223536 339897 288656 63471 302481 -58628 -8450 252905 604438 126855
13347 317508 -17726 485332 90039 214700 374290 453311 399076 425955 139517 421756
13337 421756 193689 323941 370141 343257 442560 -23908 372345 290264 371025 202818 -56043
13325 718 152832 96106 291436 241290 279942 304058 251833 319562 267899 146269 567294
13314 567294 427099 245089 400870 283291 47342 136538 -108595 201602 602758 49786
13303 166458 287677 140526 -21159 -100838 131540 188914 151397 -144312 140381 -34853
13292 -4197 9814 288358 192050 -95930 -2713 181855 74034 151784 149116 -61432 -25471 269305
13279 429982 232802 67679 14822 230329 12462 74133 58945 282546 351427 288372 46539
13267 -14460 357617 -31866 -124467 -98286 75488 104483 61223 34687 171347 91670 15495
13255 225957 228744 -58075 352743 -21020 438303 -68708 189692 -26056 -116408 -191 115809
13243 77980 12083 1839 355881 183001 142960 110679 176384 127437 229427 19695 224314
13232 224314 505704 13313 140153 -7021 209071 54517 389817 -16703 8034 -31128 -143758
13221 -143758 329878 -112236 407714 273421 -163469 -138073 -48390 234001 -4181 168327
13210 231403 -56780 -187201 263805 265603 276857 -21929 -66734 89926 132194 -31978 29890
13198 122154 267492 210814 364314 -262985 163575 94454 231974 -138114 53593 292015
13188 292015 -36968 120227 274496 -29027 234613 -23442 135765 213072 273905 -27611 471874
13176 215573 -48209 -24990 269145 77965 -135386 -233752 49833 15635 -1241 102391 74373
13165 74373 240473 96028 -75444 239649 30475 -117309 105196 324487 199492 84749
13154 14471 176388 -125616 147194 -50434 -182655 22951 344866 -8260 41696 30551 170819
13143 170819 35001 78445 -9571 -59495 -7054 -30439 -53891 20112 -70068 -27344 81653 -1297
13130 -306414 120494 -171741 -65536 180898 -57630 160780 -270519 -89750 68702 -121556
13119 474714 -64208 68727 69211 15146 -159497 -89837 -87726 52699 124146 39366 130518 220515
13107 220515 66875 -25791 146340 266539 98419 136753 506859 -182229 515844 -166470
13096 -44489 -49105 -133248 339284 59368 183902 -26637 -2485 -172305 265221 197776 77209
13084 164768 -218866 181901 143582 -164358 74137 67016 -17638 -87798 157858 -150600 219886
13072 92622 138623 351386 74598 156574 -13876 165373 -87360 228299 59459 234709 -64021
13060 -90309 396050 245603 154412 270796 360292 209509 31497 -113203 -109316 -31041 -46360
13049 -46360 -284241 61607 304493 477899 461 235928 119495 -102458 322156 211628
13039 211628 479485 -206736 247960 161066 155971 -55641 284773 49301 262516 324256 313947
13028 313947 187494 146874 -16044 238027 104183 166901 -138314 44627 395786 266780
13018 266780 56496 218246 156285 23292 57077 172194 338623 371255 269798 198488 -4624
13006 418869 320325 -196499 202936 421367 30448 289877 107518 103904 302213 -218790
12995 267159 54520 -80657 138215 -49614 112685 287247 193149 -70247 -26851 113455 -85020
12983 -64479 154985 101247 39531 152064 169542 -107264 378437 -28705 172197 348220
12973 348220 212114 278114 36568 -288940 9531 82122 89292 149892 -151156 94408 49168
12962 49168 103445 173048 139579 -47421 195060 -119326 -34281 33854 -207638 40028 54543
12951 54543 -60830 87883 146164 185665 261679 268673 318325 -110640 168849 347896 -257927
12939 -221224 114180 291241 146150 -132692 192642 36762 -19135 -164619 79798 116800
12929 116800 35394 -68809 -359441 -158880 -194227 218481 151952 313734 -63553 -78941 98159
12917 107705 150189 -79823 140200 41173 232204 60791 -143394 19674 -1729 -3867 58469
12905 354920 167526 -31845 -50363 191832 -68256 94677 -58980 -119021 -127515 371546 102579
12893 -246650 -131279 30341 255401 203996 116955 -44289 -26211 62504 -189755 -21391 -64724
12882 -64724 246667 -156903 -110875 -158308 -212054 -62228 417787 -232818 -227019 -38452 -8279
12870 -88426 -40326 152149 19920 10837 -247706 -257640 364818 -118993 -241748 335524 390911
12859 390911 51622 36331 116869 29309 -154382 200833 -161184 35980 -34543 246738 48950
12847 -134954 -130250 -66434 137350 98519 310853 166956 54157 -43040 -96668 130199 -73057
12835 81004 -409800 -265141 -103247 97056 52428 97351 -3392 255015 -122831 23884 -153449
12823 -319838 -24570 92166 212440 311943 19265 -178573 134809 66045 -218806 127746
12812 205554 -392959 -188179 -8007 114401 -3524 -414726 -98533 76212 -110795 83451 328750
12801 328750 -66525 107401 52140 -181799 236554 -67989 288601 -84198 170423 -218936
12790 -142772 142919 150090 15564 -125755 -115924 -108036 74112 127550 83309 67476 1114 -20675
12777 -76090 164174 27273 -20541 101569 -55951 15658 -38239 173594 62024 79421 5637
12765 54907 -120741 142394 221365 130342 134433 -20517 -226071 267767 79614 -145285 481586
12753 -158184 -217700 -67241 -21472 331499 -139681 327407 -68317 235217 427209 71300
12742 383634 182998 -51437 -90093 220324 215011 60336 -43329 142143 -115536 186390 -54918
12730 28853 372543 222950 -59315 309903 193990 -126040 -142462 306686 97606 392786
12720 392786 -120142 82063 -223095 -242329 219820 -148307 -147841 -173800 -218510 -91164 124230
12708 176206 -15317 50780 141061 293284 322440 226783 150724 239490 173873 46025 228512
12697 228512 283690 81610 -131055 -25999 88842 96291 -23035 -170113 -44716 53226 77037
12686 77037 -81217 193726 -8798 -212323 -105737 -202757 -156003 9766 238351 49452 249706
12675 249706 -79684 18122 -113139 49455 152938 -55870 -145787 601229 -13170 -134193 89338
12663 -71666 96328 20317 -93158 109587 -51982 -92146 365829 270958 290818 138081 -13329
12651 -33548 -106215 240786 51473 62834 93145 -114382 -97086 46906 -50724 158553 318452
12640 318452 106572 -292536 -125282 -313775 387353 144127 -255270 192473 -145776 89364
12629 255315 -182357 -41839 194085 196076 242800 -138041 112751 429312 210770 252238
12619 252238 187123 156588 102165 -128305 81019 424104 -33729 -31373 476457 -6309 188855
12607 306407 94459 224067 -427550 27658 -147249 101810 273170 64176 -88892 135320
12596 -62367 226428 195769 -89926 -93400 162899 -53149 -79947 215868 143420 -61515 -52349
12585 -52349 -57794 115776 -106236 -282312 -213862 -46012 -174943 -86251 -152955 117931 212285
12574 212285 -235947 9842 -247295 -190553 72529 -120196 -320203 -24368 331488 18913 95254
12563 95254 -68287 -17987 675 130785 50630 -16736 75336 -60947 -202704 122993 423789
12552 423789 101927 107067 -235026 123510 14697 173785 19785 -19889 288834 349722 22140
12540 98642 -126289 155715 48152 -236396 -41398 332788 -113686 306945 223851 -104212
12529 225374 92142 -40835 99511 80544 -229146 199652 -193036 222645 103399 165171
12519 165171 -119774 58424 -42506 290957 29752 -38397 -64037 207899 -59840 63030 284
12507 -46153 -20968 271946 24215 126689 147927 323679 243670 -259571 -10382 53916 129683
12496 129683 107865 -156700 147355 238075 96393 37638 8174 105029 -281716 47167 50149
12485 50149 140615 -19255 83818 -750 75956 24262 345607 44894 129970 11331 25098 -163244
12472 -69777 -244123 22329 -12847 -63603 458471 111432 -103086 144634 98637 50968 -213730
12460 104943 -126251 104083 116301 -39570 84226 136222 70415 -304086 517044 100338
12449 -34029 105840 -38749 222265 133228 88667 -19835 156254 174460 -14045 -4177 80946
12437 347300 -167961 4468 -267495 -141576 244860 -41148 40011 53866 406069 116146
12426 -24223 -3999 42594 -159334 81940 -4762 -57753 93152 9330 -168531 -136020 -93292 -159587
12414 -159587 96753 -271906 274433 -86134 -16125 66064 -137330 11765 -154698 282699
12403 -67091 185985 206903 -143744 -246342 182472 -308935 -150843 228516 -263670 113386
12392 -123445 181839 -64838 -33071 -20325 -111900 -207927 101994 -49134 157917 -133044 53079
12380 -248071 -110418 -211777 129713 -264333 -81675 -175609 132845 -111844 315688 -29222
12369 -69235 -75758 100467 -125022 30534 153885 -288826 288517 -243639 87618 115382 82067
12358 82067 10039 -177839 47702 254161 119153 124440 -30293 197214 -52637 -69190 62691
12346 39442 -125610 -83147 408073 -127927 -32767 59035 -31286 59637 -89563 47283 61552
12335 61552 115809 208563 80527 286230 6326 -98520 -476412 188326 -21472 -320592 -80935
12323 -170865 31858 -259154 168602 196515 -134180 -55084 78620 214341 60847 -6951 -128495
12312 -128495 196822 288612 423700 38688 12155 119974 76028 -82379 76511 143769 -301416
12300 56114 -245984 61317 -5606 222410 32379 -69690 191994 -55862 157706 63875 118851
12289 118851 -109944 8826 231254 -176384 370520 63716 22769 -112669 134581 353430
12279 353430 4408 34985 143857 -201809 74489 163498 128378 138722 11043 4435 -237293
12267 -187728 100450 -121539 -241669 -165594 -74261 -172422 91293 610970 -162332 75414
12256 195589 -6136 8900 329382 88009 204115 30417 -174568 189570 75255 18993 -14935
12244 -22824 148749 176965 -185029 85447 285545 -240397 66687 408480 -17401 -4704 -21956
12233 -21956 255120 170035 156190 -61012 -232197 -38273 413926 -336138 221103 22871 409308
12222 409308 231993 508182 331730 335010 512161 -31778 97243 262692 -163616 316954
12211 33980 105293 278522 263005 -20288 -67396 -34511 272681 -4170 -41949 -2896 337578
12199 241879 372775 305897 132881 190400 246184 247755 344771 287081 10037 -45603 276248
12187 331672 -41083 432574 458685 244925 214898 175451 197245 -88843 14302 168810 187908
12176 187908 49828 200533 134958 186838 220009 -121739 -99460 306586 31869 89011 33190
12164 281885 251673 -31146 -295194 374253 -54393 -250191 56257 -382313 220819 370196
12154 370196 217033 17489 -56289 -60183 46087 -68622 89326 29322 243034 63495 190523
12143 190523 135056 -173538 125883 235797 182971 95201 341422 -176388 105878 552697
12133 552697 -5051 210122 20314 -164994 -48180 251302 53410 -49398 9963 -154984 104618
12121 132935 100494 -91856 156300 140039 -79150 130192 -239921 95045 -188044 -74776 158459
12109 150501 235031 -25163 -103709 -124948 55927 64478 -158012 -30934 11871 143299 171139
12098 171139 77647 67672 110058 -69815 -238760 -153993 187102 175500 322413 -317569 -232804
12087 -232804 297006 -134851 226674 33287 -39091 -205289 -100714 -31244 416910 68363
12076 174652 95594 -202676 137873 58006 13191 -61442 430937 808302 1545384 1292497
12066 1292497 431898 136873 439138 564 -29692 -139005 91516 372582 240916 19010
12055 -199199 30986 -238557 44565 72345 -119895 -182229 -188255 -99617 -167595 68213 -196674
12043 -99974 -119467 -47672 224665 -18022 -167300 -45859 -40225 -227381 217361 -196347 -152541
12032 -152541 372111 -228944 28913 177860 37255 -153904 -193994 -282082 -62831 -81146 203540
12020 -77851 -67230 -271765 -131013 -19709 150358 -7009 8800 110537 -861 81413 65564 -181833
12007 150016 -298511 -71301 106433 -108805 -46027 -104092 -33341 -20110 73220 -187917 177292
11995 -381328 -44501 303041 -50042 34967 159020 -425245 146319 22069 4953 -361188 -115929
11983 -85585 -172293 -283164 -25621 -49905 274609 139302 125482 13868 42795 210101 156132
11972 156132 -192968 73254 -122063 34536 86893 46810 -64484 190842 119241 360171 -225047
11960 92053 39303 8356 -184237 -99675 248807 31657 -257751 -253111 321100 -545648 137614
11948 -66911 147966 150405 -150485 238962 -139872 225751 27494 3444 184651 -81669 -194312
11937 -194312 -89563 80292 -88522 25176 -160671 -20971 -139927 106931 171086 194015 218822
11926 218822 264553 -86729 156381 -130492 3335 6043 62547 -129031 -179823 180412 -21158
11914 22698 -144462 203491 -60469 249553 38970 -48207 -120767 -35623 -288801 -90897 291942
11902 66518 32859 10532 -504449 -122100 -227988 -126965 -144003 131006 118366 292494
11892 292494 -219178 -238039 117724 -205095 -13920 -185583 229315 25402 178295 63989
11881 273507 -243736 145961 26293 -196225 -225466 -366625 -60695 -34933 -43548 161749 116051
11870 116051 -215349 116807 -68276 9601 -136480 -199924 6895 99076 -131137 161649 -276401
11858 -388065 188667 -72801 -159356 -14969 -47022 128680 -45159 -142072 -110464 -421371 321169
11846 -244296 -71960 31662 -247406 -29316 -221378 -60469 -305161 -72239 -47282 23605 -44282
11834 29129 -139727 -194611 78031 -132066 -147142 93512 12035 -14704 -134029 255368 -93542
11822 464492 -19655 -41818 -64806 -148049 -80975 294632 124481 122665 -56551 146186 275883
11811 275883 87813 -48233 -36642 -88845 118852 -197775 -35581 94160 -152875 -68506 -424201
11800 -424201 -90602 -61363 120950 120630 122820 61994 58897 -217273 -175396 228961 -48223 -273083
11788 -273083 -122041 233881 -252654 88805 109270 -4987 6478 92227 78117 -123789 -120293
11777 -120293 -402253 -138853 -321661 -238928 -122065 -146754 -8518 115332 -276392 221782
11766 133049 -133281 -200785 -173449 -247116 -136011 171412 -367843 -90858 -263551 -238755
11756 -238755 -99144 -121948 54167 -143928 104912 -114198 -106704 -101088 10627 -77711 -72721
11745 -72721 -5832 354944 130387 151888 -59251 107413 130541 3381 151005 -98223 72984
11733 -300423 -28541 116995 -167264 298803 160457 -125940 -74954 -226409 113376 233324
11723 233324 -45373 -12762 171932 156823 79298 -257210 -309563 34496 285784 109078 -155082
11711 127578 -203281 -143199 -246319 16025 -114223 -92833 10220 151917 7263 347592 38576
11699 -47875 39428 302582 182573 184260 66217 -54624 -68399 121549 203950 -170946 123920
11687 123521 172274 -40240 6360 -58010 -323060 227979 -157400 136092 185750 93972 37327
11675 317298 91311 325848 368336 85806 316900 -221984 181566 118151 7718 378029 -51648
11663 -112682 139281 2880 -59442 -87146 -92678 -84495 -291979 -80296 100080 205183 -96617
11651 33146 -12349 170551 35617 23337 -280173 -198461 240535 91007 123404 -246813 -62126
11639 -135257 -222064 219306 97845 -88978 -4232 -169369 95512 309127 180964 50927 -224839
11627 223972 -139746 94931 135621 159782 -163055 -142307 8331 -12860 -39715 52666 68902
11616 68902 32296 -199908 -56567 -22008 -20283 -113390 96719 -42545 -29399 -142144 145935
11604 -82847 161530 -222408 58698 -81521 -145943 490485 16897 32600 192896 410697 -202287
11592 -79658 311309 10327 -206712 73414 240310 44590 -2902 46257 -261029 303549 -66283
11580 72876 99542 -54433 213197 46592 -54247 63080 224826 395040 399398 167005 445682
11569 445682 298780 -81482 -244097 23239 -156136 124042 189216 97510 181335 254023 369343
11558 369343 -72906 -72608 -268287 247038 161988 -98991 59672 -180114 -160042 120999 140893
11547 140893 -47289 -221739 189546 56193 7878 60312 41928 144122 -21252 122249 238660
11536 238660 244079 -90715 205259 66381 29423 -101091 -140740 -17325 65959 -150512 -15709
11524 -37045 188239 -88755 -55870 392397 -121666 206705 105689 327392 -104817 245991
11513 -150735 143179 -253801 -194778 112282 160714 -149400 -229977 -123337 -8507 204241
11502 8062 17212 143300 396424 10138 295750 -2817 -29023 197215 1049 151735 138191
11491 138191 -136182 -120660 14182 135109 239243 92765 230882 361804 119326 40627
11480 66018 63136 185718 335781 274475 104176 189291 161880 231524 11595 259648 -390302
11468 92102 -53646 1893 -107452 120810 -55383 76913 180026 136106 77149 -24762 61160
11456 56278 -277013 82290 115864 -165565 494487 122262 126403 55189 337657 117119 -332483
11444 252844 213042 -55886 444260 31239 168409 -35023 -265773 247845 53786 4757 124905
11433 124905 131725 -358236 268724 150714 254666 -74799 191310 -41586 91701 20715 89802
11422 89802 -63819 334002 -36307 137452 -7441 -164688 -41406 341757 -113003 209767 265763
11411 265763 107746 -84614 30937 103207 -139602 237077 -189998 304581 -149079 345679
11400 237037 92143 167566 267167 -83554 -40601 -67195 120806 439418 -271184 -285234 -57561
11388 -27004 557493 95216 -54773 14821 38466 35228 213072 129605 155590 158443 -115502
11376 77522 55902 -202225 252167 -189522 -29284 32331 -190330 -159710 81770 -138594 -312374
11365 -312374 -72745 373525 -85911 -59558 -108043 150822 98886 11079 -10566 -212099 111351
11353 143845 424008 -59698 -109079 42802 68626 -177554 315171 -109433 402755 75411
11342 -102609 -121060 -328504 -103590 -290140 -299769 391567 106752 23956 139026 -5297 -133493
11331 -133493 -356112 4778 -173852 164099 -145805 246514 -61611 -221773 203005 -32939
11320 171696 -281613 221718 -228570 93620 31472 -144174 -300286 17653 -90973 307596
11309 -376055 -401465 192538 -132495 230908 -224663 185136 -166589 356510 -68443 -208976
11299 -208976 -87337 -296796 -172321 31898 -99051 57250 188190 -38561 165215 407262
11289 407262 -76224 -81832 -71334 166803 -239881 -40762 58471 33425 -65995 -420941 -58759
11277 25784 86478 -90040 -132192 26284 157853 141193 159961 215332 103927 -87344 -148146
11266 -148146 -60115 -110787 -140108 -168992 261713 -68469 -54128 132344 134272 24660 -417771
11254 -423467 -114525 -42627 -271596 32948 -121647 221452 -192783 202267 -225902 -7828
11243 198977 -4322 -90052 20056 -296562 -158069 168325 12278 -152327 -68953 -54426 179514
11231 -72893 -27427 -200726 74626 -11305 -133232 -101554 -244007 -6070 -88207 -123937 243300
11219 -52173 -42975 -218911 462 195948 -13512 -77935 63433 23590 122812 184865 -40014 -187408
11207 -187408 -31340 66985 -927 -139794 -92246 -158044 -69317 123113 2544 -225278 -421819
11196 -421819 -4878 -22499 54006 -137499 -108265 -150250 -218678 -460520 459888 -359566 -172350
11184 -68298 -123284 -219215 295835 -336988 97409 -376913 13644 47862 -183089 -305677 -33414
11172 -198670 128782 8622 -264079 -204056 -17764 88372 -15308 -152975 110133 280665 259612
11161 259612 271462 -56101 -130452 66389 -235471 162421 -284217 -72256 -146464 84237 -42935
11149 -209292 -242019 -359792 32205 -16532 -73079 54321 -6733 -494521 -33490 150410 346808
11138 346808 59873 -303333 -74119 -63932 -190164 117680 -53806 -25094 -146135 -297532
11128 -297532 440768 146234 114045 -75669 97926 -86160 -11991 -57762 187714 289014 10252
11116 -43171 229896 193884 90304 108707 241208 -367181 -383105 7494 -72150 -141510 353261
11104 451723 -22602 334150 349911 393102 -277461 -30468 312901 -77081 301058 185331
11094 185331 120103 109953 -295316 70021 274459 75571 -93180 504711 88514 -47957 37687
11082 -45635 329296 -15558 -135466 4989 105417 28798 72826 425294 784276 183477 -199016
11070 412643 320173 225504 446838 446430 654119 476262 437056 530416 372812 602793 730171
11059 730171 520866 495062 314539 360951 974111 820727 619589 728477 633759 444622
11049 444622 892183 612598 836197 667699 545372 838436 930805 731261 823875 786651
11039 786651 623373 936515 397485 772608 576198 781976 543885 865924 906617 463965
11029 463965 695279 746174 787456 547469 743503 926440 917078 842354 780064 524842 781203
11018 781203 614574 622386 744881 625891 597849 624248 627728 1009661 807911 716289 695894
11007 695894 413509 848960 950021 469644 604944 706656 346069 998798 902331 658076
10997 658076 1083997 1111832 762081 289221 556111 495178 806066 703643 650648 772269
10987 772269 903223 949886 878897 1131778 837038 1245153 1388023 1228584 1213774 1735462
10977 1735462 1487810 1883947 2134195 2514865 2493245 2780660 3032734 2883880 3008654 2773270
10967 2773270 2860404 2327301 2251250 2145467 1975223 1685439 1549532 1484368 1612270 1435278
10957 1435278 1741055 1739318 1605845 1516902 1344298 1175959 1096669 1176155 1022337 567907
10947 567907 771783 429135 394505 590033 415366 253218 301404 509225 359487 235782
10937 235782 344907 82357 -179489 5676 269398 355163 126297 -127421 222001 76387
10926 31506 218509 -115507 143351 87493 220317 -60025 -109346 46455 -113992 -356929
10916 -356929 -4700 158510 -166911 66321 -244860 -210306 114946 -128487 105296 1009 -119425
10904 161858 7707 58701 22636 37068 -157223 -56790 -198002 107498 -209783 -62260 -154480
10893 -154480 69740 -227026 -13043 130495 66871 -99584 -131990 -235779 103454 -334716
10882 112660 -56536 -70473 -234162 -396748 129141 -6390 -167481 88344 4185 -82910 -63347
10871 -63347 42163 113431 -95794 110312 -203205 -339993 83211 -140034 52961 147408 -496055
10859 2561 -75128 -11065 -171072 157472 -9107 81606 -304350 131360 154477 115274 46379
10847 -86673 -117419 10841 -170293 -396542 41548 11047 -151766 -166961 -28123 196956 149728
10836 149728 -383349 54462 -218308 393626 -91113 -161002 116806 -107597 -738 -22671 205033
10824 160103 320477 -328850 47860 -190656 137150 -161639 -115814 102434 86603 53173
10814 53173 163479 7123 297012 -213881 -175586 -140012 219335 -237547 -89716 222448 153848
10803 153848 192386 -39775 2714 -125308 -194282 -19642 -178010 -21647 130190 -148629 -55268
10791 14978 -52336 -206166 -66446 166000 -119008 448068 -202851 22122 336839 -30629
10780 26330 25468 87763 -223776 -66742 -91349 -124534 -324736 -140194 -101693 245159 71833
10768 26490 199022 4578 10801 -11222 -108695 -9517 35214 122234 -162728 -136578 299331 102677
10755 183980 -137821 -198079 -185437 28370 -33017 -93485 -23813 -151857 31103 -176100 118397
10743 -112854 -107867 93003 -113736 -78775 58070 -189904 150508 -130699 -176923 126653 -38491
10731 -45170 -113723 -214502 36248 -259528 -43449 187446 -130097 -310625 93879 93829 76692
10720 76692 238591 -637 -289999 -175631 15962 122510 -355621 11265 -243280 -22415 -352919
10709 -352919 236427 125149 -276930 106199 -307056 69865 -140182 9018 -4288 -208854
10699 -208854 -145366 -303390 126207 153847 -131443 88992 -214966 -50945 144154 -201631
10688 25828 -298408 -1635 -112294 -349500 124017 -252218 46614 -206219 3376 7781 -207667
10676 -164589 -38892 -22035 -8600 243400 93356 -149353 50426 409560 65129 93383 261634
10665 261634 -25708 -9642 -30246 302783 -297390 28077 -95964 -197262 -306734 13897 -100073
10653 10187 171986 11314 -58422 4311 -89006 -145833 -111666 -25322 281740 -96016 150215
10641 48486 -331508 -278271 149728 53546 51718 132585 117458 -351270 -108695 -124204 233232
10629 -449620 225858 -38099 -15727 -24950 109971 120464 194177 34193 -389046 5087 -130547
10617 -123892 -175775 137513 -125086 26807 -46125 159850 190108 -48464 201263 55052 19614
10605 -285494 -113404 204685 154645 -7371 -84813 -233225 -19921 -186832 -86438 243786 -191057
10593 41282 145090 127373 84442 -125975 -318000 125617 108055 285195 -279921 241097
10582 -118142 -63530 -171045 33708 252253 -77182 -364827 -154595 130116 122534 -392645
10571 335315 -258547 -58927 15295 162413 72022 -135206 9475 -13277 -258715 -287397 -79644
10559 322860 -107970 -227821 223503 -183068 -256455 -110274 -236517 26085 -385093 -35786
10548 122727 173699 -78290 -200876 -37842 -187510 89484 87117 208196 135947 214079 -203049
10536 152249 -100317 -216787 98137 87665 -178604 200434 108622 59672 -65493 -40818 -16913
10524 -122257 -199190 280325 121189 -16634 -266749 196978 -75470 137862 -166360 -93037
10514 -93037 222214 -61834 -177082 67565 -187547 138246 -318753 -144134 -160624 312161
10503 -131659 -101077 -105147 -11159 41748 -62739 -243737 -57946 69655 -222799 272845 79903
10491 -573489 169341 77642 -71413 11122 -191875 -46491 107740 31714 55890 269532 311413
10480 311413 369507 196378 283060 345577 82031 -131757 -214484 -201240 -146698 -61215 -83805
10469 -83805 -183613 -103749 21831 -219485 51231 58274 376454 -14613 140975 -345216 330766
10457 -412479 -25510 209879 -132468 -98245 -20189 -91207 117841 270729 326628 -60193 -13142
10445 248134 3034 13509 -90330 136570 344376 48079 132754 -68358 -17569 10952 67623
10434 67623 131522 -32923 290918 34517 -143973 -127582 39649 -158728 197772 -53183 315582
10422 -314330 17873 98543 29328 21338 -185326 -41272 -347393 20789 66860 75465 175182
10411 175182 -129231 222669 -21157 206351 -17999 -161459 -198364 -102599 -26539 -36641 66526
10399 -235960 -29303 -218388 187910 -115017 -346705 641592 10906 177248 56105 282709
10389 282709 252260 178101 248311 -181174 224259 207230 -271485 100275 -164086 60897
10378 105855 99231 126528 177858 295056 342367 229419 47539 111514 193384 405445 272889
10367 272889 453193 454377 464531 567254 336778 605615 135389 79878 145061 326208
10357 326208 -193642 -189795 68112 252855 215274 345924 773153 598190 858368 609958
10347 609958 490119 363285 498337 201065 348673 245181 234957 82826 12114 311470
10337 311470 398904 112574 144960 249626 -320469 93395 327430 -91343 156754 226619
10327 226619 251149 -22367 31459 32778 345579 205927 118220 341061 350739 -10647 510082
10315 -128271 86343 -41759 57212 15573 172801 145361 -69817 102409 230432 67469 -83672
10303 -182450 31876 316368 -207011 -174981 230802 -210706 77643 -29687 132816 11083
10292 -163555 -135201 113741 -100500 -22168 195088 -223168 8887 41068 -126011 -363172
10282 -363172 -230658 -177781 -278886 -107538 148856 -252474 -147560 -533 228429 283239
10272 283239 -276554 -312341 107003 57873 -203152 183227 147938 -178210 50051 275146
10262 275146 -68292 413544 346921 244353 144700 -31746 184828 244934 374078 -110036
10251 104160 192476 -70980 -27493 -119050 401078 -255936 156302 -325904 -7061 -188970 99824
10239 251993 296081 16211 -198929 22803 -170916 132497 43557 -120197 -29632 -377769
10229 -377769 -337391 -80902 -162883 -21503 -406540 170030 91148 -33607 -160132 -484837 -317032
10218 -317032 -296049 85832 96410 42347 -24637 -294085 104549 56201 150294 15020 47328
10207 47328 -49824 2744 -220068 -191496 -20718 -114982 63450 -116954 -204603 58827 -231949
10195 -198877 -118508 164411 -144719 64634 -315606 101483 -139372 238570 -73438 53096
10184 -76541 -205706 -2035 -142929 110081 -39292 21315 -38218 -53518 62823 -68553 139452
10172 25138 143578 -168610 468 -84412 -123789 -31820 286077 25730 85818 38680 13766
10160 -44757 -461993 -34386 -24647 104486 128154 262737 166525 249671 -2986 -14863 40943
10148 169865 -217913 7592 109859 -83681 91871 -191836 105109 -297518 30100 -90941 -225770
10137 -225770 -121563 -317436 -3462 -8250 15794 -175768 -92769 -333096 182645 20183 -56277
10125 161301 -58371 104279 -142985 126042 5677 94736 -228762 -12583 -268010 4577 -375238
10113 -163064 -86408 -312736 -30857 -133416 -165280 -756 -127200 -274286 31097 -304227 260430
10101 25541 68177 -135864 -262224 80763 -80333 -161232 -75857 171902 -31852 -156890 58158
10089 -29792 -68698 225889 424032 -16883 -96410 -4663 61177 -231727 -164631 333572 -114247
10077 -73755 -28925 -222914 8837 -170099 32493 -110473 123701 -255194 -231195 175954 45261
10065 -100846 -143607 -12669 -197758 -166861 16448 285076 -257119 8899 -157463 -83380 -22640
10053 -254019 59643 27492 -28553 -259085 140191 15859 25432 242707 -165488 241507 -10896
10041 -152008 54975 -7502 -68591 -203931 218779 -357306 -14404 85417 59633 -98240 -4352
10029 -144245 261140 -99633 -219339 47470 136067 -611538 -176565 247877 198447 32710
10018 -210559 -260273 269498 68427 207912 -67535 359374 -296516 -281853 -247237 -99202 126653
10006 179455 -6044 -11686 -22098 47159 -67713 54076 -250368 -274206 184704 -137507 -215834
9995 -215834 -166792 61604 -203358 -255901 184043 -28019 40865 276582 20345 128357 -47357
9983 -168535 -22307 -616334 -44872 -223575 -32047 -214769 -230074 65636 -132450 32895 -167515
9971 -212271 -184347 -171316 -29346 24589 176315 57667 16745 -93464 -77005 173998 -38649
9959 29490 -19725 -168535 -271622 -153459 -50399 -63239 -40444 -108560 174487 -57765 -398442
9948 -398442 -370887 107349 -299425 58806 -255859 78054 126699 -269647 -292006 -479666 -35426
9936 119939 56125 9253 146189 6234 -194836 -336164 98988 -59577 86948 -479995 312949
9924 4250 31712 114311 153366 -141141 -55232 120760 -42428 173077 -79787 -146013 100706
9912 194656 37141 -363404 -232511 -176266 -430935 -17545 -59823 -237822 239643 92621 -143322
9900 37939 -208304 260812 -64970 -329797 -302942 -44029 79008 104139 -103962 -93098 -99244
9889 -99244 -92457 -31741 91107 85914 -115730 12343 -201891 -97298 -397557 150111 -89047
9877 104273 -294922 -240705 -50978 -211111 -249405 -213887 -17467 -95593 -105604 172064 4397
9865 136549 77260 21488 195118 -338094 -44342 190157 -178011 93258 -53369 15993 64716
9854 64716 -238477 108774 -371671 -275497 226100 -506048 -218842 35155 62234 -82459 -317586
9843 -317586 -21461 -56613 831 -213689 285709 -168216 -256406 124713 12872 -51143 -141408
9832 -141408 -1749 -255371 -212675 306317 -89163 -199154 -68922 -318861 -148542 -239204 -106503
9820 -117091 -127184 -76087 -108092 175201 26667 -20545 -66449 -97444 -252473 -65039 -1196
9808 335241 295732 -211700 -427199 -116456 -95835 112845 -202486 16851 -118849 -13317
9797 123641 107135 -59083 199927 -256324 -75742 312268 233819 333457 -59558 103710 -130283
9785 -93524 -346015 -153953 32070 -261111 134346 -185501 -118761 42152 157337 40154 209913
9774 209913 -60983 -102573 -30742 -108250 -218461 76292 -460153 -205268 -101559 -417109 84472
9762 -119842 229077 37531 11927 -152922 -218511 161658 333727 -142958 -228411 -260136 148587
9750 13972 41543 -357263 36529 211283 235603 95193 43111 -84323 84502 -243383 -98938
9738 29206 970 -34707 186916 -175645 3558 -50965 78454 -322246 45660 -30978 -622447 -337672
9726 -337672 19474 -71884 -51783 -313006 11616 -150397 -4685 -7500 50098 12758 -294463
9714 -179535 -235099 -91538 236220 377504 -177464 123283 -235386 -14792 80541 -104290
9703 -339169 -194543 63916 60595 -174992 150660 -300889 32242 -282675 -108848 8324 -220818
9691 -127338 203717 152860 -318063 35102 195560 102056 -302994 80620 -146583 187726
9680 1791 -144163 -194121 -53872 487278 -81982 -213063 -125096 -112523 -190544 1545 -288956
9668 136309 159080 137372 -120856 -243976 -160914 -400579 28255 -286855 -111457 59412 -193783
9656 30216 324550 -112009 -338875 -269330 -82092 -12463 -11713 150983 27411 -127872 -139974
9645 -139974 85149 -40402 -216714 86984 117500 37722 91969 -67989 308326 -367431 -95920
9633 -138282 -61961 76749 -156437 -166333 -177186 124590 26377 -44898 99814 -108097 -97229
9622 -97229 -225884 214522 17442 73078 -425705 295868 90271 88359 -58432 -75660 -25506
9610 -16014 163659 -64219 15116 -151788 18930 -387094 -231626 409006 90431 -138947 -38596
9598 -101707 -49307 -225097 170765 -94417 38376 -43604 277345 -38013 -221760 -173033 -133337
9587 -133337 202356 194335 189068 -82826 -120618 99814 320103 -263688 -226864 -155054 328776
9575 -294646 131591 65356 -199295 -156614 40232 -64707 -208543 -68352 30087 -311463 90559
9563 140731 62895 -251437 -228376 40315 -157048 -67995 247342 102390 -133966 -44792 107502
9551 39722 -16788 32225 159540 -216565 -133128 178395 -200814 -123305 -175848 -52411 -78584
9540 -78584 -316555 14711 45299 -167991 36089 194269 -79912 144583 -214244 309601 -172992
9528 -321603 -306663 145767 113852 53685 -32506 -12740 -148779 -559585 -74771 98680 -198784
9516 -261959 -265774 -3678 41045 -198056 -62993 -187660 52817 -188781 -80771 -70430 -231868
9505 -231868 194615 -61650 -77505 8958 -308303 86285 -45925 13790 -225688 36504 -397477
9493 -395471 213137 -96759 -327030 -242736 -42018 26227 -42355 204390 140790 -117655 -316649
9482 -316649 -195398 150699 -193858 34153 177721 -53568 32669 -303892 -148161 -320111
9472 -320111 95284 -68258 -519234 -275965 -332213 104363 -174768 -108571 195466 177479 -201115
9460 -59320 -198826 -150530 132352 -95486 -86228 -88911 -69564 89512 110546 -48223 -7337 55654
9447 -74068 -71942 86811 -184328 14622 -300156 28551 373813 49878 -58820 -297531 -313768
9436 -313768 -36753 -38063 132910 230656 526336 -173020 -125345 198991 -22852 -81334 -11676
9424 -308929 150736 -324142 313217 94782 78507 296349 156965 116155 150400 -119970
9413 -129994 137111 60286 -58923 27014 16786 23231 -73684 -268887 208750 -275988 167019
9401 -136373 131769 13219 153171 -78091 -275957 -29514 -154686 -358306 -408395 -244647
9391 -244647 59810 -88722 278007 119547 187064 212141 79640 -31590 7651 -192994 -166756
9380 -166756 -17296 42773 -271696 -43139 -143569 -256460 107874 -85490 -93858 166399 19558
9368 -92608 62715 -155051 -193029 -128484 -75543 171839 -43241 -94213 27251 199450 187342
9357 187342 -216441 -93782 108599 -78135 79025 -281904 -113871 23353 -97325 -368166 35484
9345 -127440 -210127 -195627 -536918 236769 -23548 -110726 114058 -31339 265105 -116585 284250
9333 -83713 -150552 192807 79445 -236915 -14975 -59316 97597 -114295 19043 -477957 15279
9321 -63965 125505 -358032 -156569 208869 90430 -163867 -113216 -399421 -238138 -111018
9310 -103544 167218 -100270 -103308 -235373 -26148 51039 293941 -165195 19936 14066 -195285
9298 142985 -227063 -273792 98883 -153287 -297274 -16051 -134612 265524 -3510 2409 11864
9287 11864 24616 -109924 -287988 177888 -7924 207204 13423 -12180 -32746 -63736 -3729
9275 -81442 -107675 -15779 -30621 173022 -120086 97900 -199072 -34631 -176781 -272635 89027
9263 -217448 148119 -239193 -8797 137079 -129590 -247553 -35561 334079 -61631 9224 60670
9252 60670 241253 38662 125973 75498 -65127 324224 -29534 -71424 -245499 -80381 96547
9240 -156564 -8344 41244 -201801 -39012 30551 -86747 -15724 -147556 -225368 -96809 -19012
9228 -55593 100473 -154576 -230009 158537 291457 -112821 -4684 162255 241143 15985 -45331
9216 -29650 -164452 -204547 -235119 -245929 -22096 -254959 -54669 -109078 -134150 -302873 250272
9204 191731 -231782 -38003 84975 -62385 -110149 231497 -203486 -286116 -90001 -282272 60077
9192 -133013 47674 -115698 140184 -98401 -120570 273171 -55471 -219540 46581 4473 -187118
9180 106666 -273017 -286315 -155077 -223002 27604 -133211 -68037 -91823 -407363 84579 -39808
9168 -279977 137282 -565701 -178994 -209939 61617 -247191 257811 -4992 -97280 -492011 72260
9156 2157 82223 -353991 -120715 -145405 -164541 -257243 317436 -24970 -84946 -107409 -34187
9144 91288 138700 -254178 82180 251216 84507 60012 -179963 -198461 261457 -247272 644
9132 89238 -70588 -46026 295596 110919 -111283 157434 -81447 -220685 -138258 173924 181302
9121 181302 -76168 4958 -327465 -152037 -77393 -423331 -289471 227594 726 -26317 -78964
9110 -78964 9807 161573 -243110 -130749 -273071 -339914 -176525 -25556 -95752 320461 84050
9098 50947 -87337 -157813 -63552 95703 -126585 -105540 -179932 96544 -7561 -15289 29846 -75137
9085 -71546 31001 -7049 298642 350819 -157257 162336 -318255 10946 52988 43255 -217773
9073 16236 -166266 -4482 -262544 175581 39924 122702 28493 -195556 -139061 -157947 -305399
9062 -305399 157544 85482 -45725 110574 181753 30533 -174185 90613 -351146 -2340 -195921
9051 -195921 249416 98297 210470 -275319 -13624 29303 -114851 -17896 -97647 -230933 -508749
9040 -508749 1226 235631 -95431 -23996 -146684 7385 -54044 95679 -414812 -240464 109303
9028 252353 -102938 -78953 -150581 1911 -208369 -54362 -235291 261110 -61685 239120 -145247
9016 -79198 -40413 487771 -170155 462556 -205548 96297 -351038 -176112 -465041 -376338
9006 -376338 103528 -116889 107461 -27614 -14168 14394 145282 102279 -28059 -269033 -280933
8995 -280933 -129246 -161060 1086 52384 -52380 -126206 -204154 36550 -44342 32016 -191584
8983 69912 -358635 454877 90016 -45731 -177710 75377 -174206 214149 -235889 -51386 -97121
8972 -97121 183402 -121390 -206978 -74565 152964 59004 319685 11718 -186094 -230805 -249011
8961 -249011 -315203 174744 -337988 -76295 -238755 -109690 -191925 -89492 -141220 309192 -33886
8949 -89671 -142388 -199148 -427567 168799 126576 274525 -496485 112779 51031 40800 -101692
8937 -20590 59097 -84011 54314 133326 -214820 -168699 25890 -107023 121614 -108631 260867
8925 -25106 96193 690080 1935044 4588712 8894213 3209011 640439 530577 130948
8915 148841 -47872 126682 -54754 -66562 102599 -14063 -87093 -12037 -97181 141918 -72533
8903 83293 -375456 -140076 -169596 -96698 12307 -169814 -210919 -43232 -312197 117934 -39910
8891 206598 45674 183508 -36407 -125778 193602 -113920 -250606 -135728 44105 176697
8881 176697 159086 115455 59289 -27004 153583 -116771 -135713 89380 211227 -126589 -191532
8870 -191532 -80650 -126289 -254277 -276465 -85133 -143286 -168790 183633 -187827 -27792 61815
8858 118111 -146948 -31575 306207 125930 -30546 41583 -47523 -252268 -334841 -409599 -174705
8846 17057 238522 -26646 -237057 -53309 -202428 -173917 -111083 99107 -149401 96177 -60839
8834 25143 -13224 -150204 78783 -129327 191986 179866 107810 -30158 -20233 -139703 -16934
8822 205430 279585 237164 -34471 23680 -141385 -218597 -93940 62611 -28294 141996 -206553
8810 -90642 -357235 208894 -33193 74443 -163569 -94528 -23548 -127158 -193714 745 151301
8799 151301 -37166 101668 -176077 -358128 -183024 37541 57076 -114501 23844 -126975
8788 -377257 247254 -350513 16705 179595 -121726 -60701 282564 -7489 -22805 -26993 140540
8776 15360 302370 304763 -139100 -225478 -170340 -160636 -99307 111973 -330518 -19082 415710
8764 -41080 -54168 -247577 51013 -405283 -89706 -220761 -177885 12529 -129029 -347943 -10452
8752 -89362 -111526 126824 -20092 -174135 -254706 -309592 82436 72592 -140519 -423174 41504
8740 -173387 294889 174730 106110 -237571 -147206 -59031 -237227 -772 -188137 65997 3329
8728 16638 -70503 -319053 9743 -213262 217292 -388187 70359 -319750 -120255 -122157 -175354
8717 -175354 169790 -204044 94226 236453 71492 53398 -112908 209997 -282527 122203
8706 170866 23336 -370667 -60347 -37534 -60120 64008 -104669 119401 81402 -16638 83493
8694 91872 -56526 3982 -146812 -163487 -216746 -263556 186170 133860 -71952 -86223 -155223 -255639
8682 -255639 -107954 -113626 122151 62163 -99851 151072 -36571 208597 -130472 36126 223315
8671 223315 -86762 -155500 63093 -124921 32226 113800 -367991 231959 96308 -89657 78675
8659 -71624 204932 109665 -155910 214023 -307028 -197993 -12605 318569 62060 -183604
8648 -190202 -244313 198006 17091 -55080 -360757 -4662 434809 127697 256582 -16149 -46546
8637 -46546 151010 85384 -135682 -55751 -112545 -161281 -15380 34986 -272939 23383 -95749
8625 4379 -219490 100783 -67225 -85154 -325246 9101 106716 36029 189368 -186800 -467608
8614 -467608 68880 -7808 127216 -227092 104132 -249167 147081 -181749 -131022 278292
8603 -41721 -219877 -66282 -121298 -254902 -79415 68616 -126919 -111328 194659 120213 -261774
8591 84749 -134818 -145359 149754 414950 -55037 -353728 -306209 7714 -276512 -183752 -473166
8580 -473166 -358939 -133792 -12017 -98010 -212567 -47267 -49638 436981 72517 -3031 24642
8568 -105386 -48168 -276638 -266421 -318094 -86540 22671 6029 -222115 -110275 -244487 679
8556 1769 94378 -34960 -217030 113546 -42051 -77797 -165548 56938 -13305 145101 -14345
8544 -234043 12546 -186872 -106144 -172423 -171677 41699 -163977 -72452 -53827 -96439 -229647
8533 -229647 233388 -119893 247029 -121041 408598 -122022 95559 -107412 -28245 -10459
8522 -282712 -146521 -119837 -25127 19521 -81285 -108409 142659 -95360 -437926 344551 -61438
8510 -116630 -128788 -297246 -199250 203142 -27696 -46584 164364 -148117 51056 -9655 -301775
8499 -301775 -85356 -538030 31343 -24187 -153158 -168616 -359960 28617 261586 -177652 22494
8487 177744 -147747 140591 128805 72141 -68164 -12474 53092 550489 24858 192811 -41713
8475 1041 293426 -17916 -375648 -129816 155704 -77500 -95098 -104912 150683 -107361 247105
8463 -94313 -383448 -55785 -325504 334523 -219107 172100 21219 75385 165069 99794 -212163
8451 44239 139471 -41798 -292911 -284127 -88998 103014 -205562 111832 16340 67325 -164239
8439 14826 -391735 -83483 65471 -69647 -150544 80702 -110745 328432 112183 250217 -129949
8427 197703 78291 79419 22578 -192504 -17812 -9598 -177210 -95069 -145038 98386 -60422 275938
8414 -359409 -68463 -109895 103819 -326145 140862 -339996 110455 -60846 -37317 -92652 278700
8402 -114876 207904 -145120 -449704 -65938 -29006 -178626 26258 216058 -122669 -337541
8392 -337541 -96659 -329646 -401031 -175637 86685 8964 -271845 -140329 -133400 -64042 13723
8380 -251054 -54370 -100901 -383503 155733 126658 32640 36261 -235792 -56091 -28990 -217108
8369 -217108 -332908 -334572 -250624 -500706 -223863 119885 110049 -30086 -225004 -75698 -298579
8358 -298579 -298545 30790 176328 58098 -183606 -207662 62210 -42770 -316519 -224684 -61969 116991
8345 252347 129912 -49972 -257721 -421928 53599 42729 93396 169398 -13756 325237 -127634
8333 30303 156898 -301889 77932 82968 -74262 -74342 35867 -112757 -262109 -162543 77748 -29644
8320 47845 66784 178129 -157791 -236648 156997 45715 -352231 -69067 35254 -90788 77209
8308 -307582 -34883 -165180 -227140 265437 -371162 75049 -117750 -295140 -117812 -246426
8298 -246426 -202455 56936 313663 382658 24680 99783 -36780 94506 -117849 -102912 9346
8286 -206061 -304748 210878 -43419 20959 -5583 -26369 169757 2872 -266499 -165984 24598
8274 138012 -200075 -259118 -328107 336501 -145637 -63779 139351 -368429 -57014 -1706 -154367
8263 -154367 -12149 -57953 -82221 -263585 64119 126252 -190985 -116966 33097 -31916 -178042
8252 -178042 -102293 57649 -193195 115411 316046 -27517 -147660 -396785 105091 -128650
8241 -74356 -65387 263172 -253807 -208827 -468061 -681 -71272 -139581 -281864 -112184 109746
8229 -99593 -205293 -133521 142294 -281078 127163 70743 -267137 -82745 -44175 -94643 53783
8217 8689 -189152 -50503 -5996 -140878 -149895 -142582 -114312 91080 -86952 315468 303346 -88240
8204 -391378 146601 84083 65443 -404 139892 -49195 -209343 119741 202745 116336 33077
8192 6395 236133 77841 77536 -56151 -3571 -297505 -55106 -141451 -90583 -340962 95289 64893
8180 64893 260440 -11238 -188814 -129401 -126191 262550 -193459 -38630 -247638 -2826 -22103
8169 -22103 -276108 -266268 -106987 -173550 -323062 -112857 -221745 -202119 199070 -129586 90914
8157 45631 196430 -160320 -15171 81551 -25391 -315765 118506 304228 6329 -49518 -166857
8146 -166857 102962 -390180 208831 -142547 -22650 -75833 174753 -41175 -112662 -291798
8136 -291798 -94005 51647 229701 56486 138155 157593 64370 -345296 159106 -339642 195956
8124 50986 48115 312478 244680 -62812 -123352 133213 -195413 -152111 -122760 158752 -62720
8112 100478 -144296 178661 4126 -31789 -19086 -171584 -116655 -91257 12802 -100449 -50647
8101 -50647 -23245 -196902 -84074 -76297 -384058 91003 -106593 -342669 -125506 -126580 -298892
8090 -298892 122825 -233976 6287 43050 -97056 -265025 100818 -46839 -273099 132952 -234894
8078 -316671 31434 -92723 116554 -78487 -176714 57959 32635 -217171 84368 -237538 -106780
8066 -209787 90724 123296 279 -210696 98868 109812 73654 -414931 -183415 -42055 19306
8054 -207110 -282516 -64575 -70901 -541322 212101 98 -199987 -318296 125755 322621 312616
8043 312616 101895 170814 189763 -229194 -136633 8940 102100 173452 -282744 165213 -167978
8031 104113 -299172 -21663 -382485 -190831 -552601 -115151 211863 29466 103511 20940
8020 -174450 276199 289272 298672 40983 -590317 -57032 217969 -60281 -47188 2005 119686
8009 119686 79182 168111 24802 -16185 -6923 251425 -49309 -287121 -130207 -99855 249545
7997 -134399 -67084 -194380 -69032 68010 -260770 -106399 109769 145141 -185149 -233624 -188917
7986 -188917 -267153 -176041 -44457 -37164 69888 -212846 -75224 -168060 252080 -42353 -255613
7975 -255613 -64588 -200242 -167415 24501 -161570 216098 119261 -336762 -3099 139537 -89616
7963 -5747 -258839 6290 -92629 93038 -266483 40209 -197378 -354171 261297 40273 48765
7952 48765 -214352 -4505 -109688 -35332 -203081 -30386 182306 -165429 240955 32233 31872
7941 31872 149077 265841 238512 -300735 115444 140903 229360 -190591 -104365 107611 -22629
7929 -130188 -171652 21440 -74644 -331682 -284859 -43946 65961 17673 131993 371834 119924
7917 -120071 -155051 73583 16586 -103724 -248962 -226883 79401 154800 18439 145644 -151379
7905 -111154 -146833 -141498 -51221 62833 61826 256982 -5397 -68028 -271954 68086 -120565 4555
7892 100806 -101664 146660 -269622 -82221 -253356 -229018 131714 -445602 267338 -451218
7881 -5691 -128190 -97554 -530025 -47037 -247944 -307529 -142239 73454 -202075 -88612 186072
7869 33028 -190609 34408 -177051 159210 -68873 -174071 72949 -84003 245348 -88549 93101
7857 -31601 11072 125314 -298156 51258 181446 -505503 -151260 197777 226070 -71912 176511
7845 -217736 88419 290972 204685 -137622 -61321 -55751 155082 214624 35794 -31677 58977
7833 54450 205224 -203012 -17352 86140 -81611 33995 134770 -54064 -356314 7633 -158640
7821 -27752 -210943 -371395 -92431 312965 -14866 213457 -310238 59743 -224429 144958
7810 44137 -178627 -13661 -199732 -86094 -264114 -202537 68778 111156 97139 -161218 66040
7798 -172366 -124005 282010 180638 -124430 -290886 -97402 11564 270340 164692 -243462
7787 -367533 11197 -375705 -66888 85948 -61991 -200391 -323696 -279428 -109608 -222333 -190362
7776 -190362 20376 196832 35212 -6135 -118972 34986 37039 255252 -60556 182781 -399116
7764 141534 -102079 -50318 -161305 167738 -277136 -54650 -88194 -141024 -171678 5082 -269956
7752 80709 -71857 150215 -165344 42745 -29554 234295 -44837 -192439 100102 210809 -275867
7740 -281028 -33696 -253680 -31735 250968 118153 172643 -145680 -447620 269982 -1562 26165
7728 -303499 87740 -342999 191460 87369 -45267 -17585 -109981 -255585 -45596 -222088 114725
7716 14220 99771 -95831 -80642 -307150 -25881 129750 11246 -261463 -84051 304885 -54580
7704 74559 201727 -214608 146711 -95720 233540 -142202 -329275 141517 -56703 -120391
7694 -120391 -27319 149354 109877 -35373 -15009 -105703 -53949 -136123 -51048 220128 -10765
7682 -250107 30539 -279415 -135651 24651 -12198 117559 161755 -364890 101914 47347 -72071
7670 159006 -102497 -46303 -54343 113048 -157976 -105379 -49284 40858 216958 187280 -265010
7658 -188770 -114119 -246899 163744 -21539 39813 -48295 -85756 30841 -131050 -7261 11246
7646 149900 -259450 -335738 -375316 -136869 229683 -163012 -166580 246805 6235 -12470 214755
7634 -128848 -88793 67057 100465 362597 83561 -133901 44871 -34881 104036 280 14112
7623 14112 -53576 -158576 -241785 -159776 -160527 -301848 135666 -1029 129599 -264618 98831
7611 -109081 -54897 3798 87041 94264 275044 105766 -29141 -195650 232760 -13888 256278
7599 -354922 -16115 -80033 85442 -44430 51583 -141266 178459 -257963 162318 -77524 60376
7587 -4557 -234105 -102120 -122923 -11284 -39164 -110520 47215 -474572 -48877 -36680 -146158
7576 -146158 -216368 175590 -221869 -34821 31386 -155387 77530 -33188 117829 -143719 -12558
7564 -249807 -85778 488697 4380 -16407 -118279 211371 62284 -206432 -64015 38091 122029
7553 122029 -42653 -145033 112769 -60162 -235826 -77074 -96374 -66316 24318 -195464 -202579
7542 -202579 230089 -207309 144747 -355689 224885 -52810 -2465 -112013 3795 161751 -141399
7530 -350278 -205601 65351 144303 158503 -154450 -26625 -47870 -167452 95506 221916 3034
7518 119284 105586 -13360 -37818 62682 -354256 -117548 67444 192447 81219 -160286 37143
7506 77804 -248017 63710 -33268 -184348 74908 395871 32472 105594 -18041 -198688 129276
7494 -186109 118268 101328 -76796 83294 32925 -10577 -123576 -29683 -159106 102101 -353788
7482 -113822 -20792 182069 143773 -158717 47352 191104 -398126 -31802 -313364 -90346 515666
7470 -123357 -246835 57091 -455756 -315279 149030 -358814 -361754 117284 -67146 68818 117970
7459 117970 -103593 -411747 98924 -33234 -291392 -317421 104294 -258066 -9148 -237128 250872
7447 185634 -207467 -170265 225046 -109713 -85469 37380 -7083 102052 -207275 -138702 -166307
7436 -166307 -80343 100728 -122398 -87931 -159111 163675 -119030 51906 156434 -141437
7425 -17697 362316 -344254 -68440 123117 -358220 419667 -194338 -7756 145838 -45652 -375773
7414 -375773 -58541 -53978 -82845 -383717 242653 333275 28786 208989 113446 -174716 -26646
7402 -90850 178071 329601 -55745 -354756 52553 -320227 -96545 -45404 -110709 -47557 -57195
7391 -57195 -142549 162230 -203422 1103 -55588 -71028 62103 311922 59569 -167320 -154270
7380 -154270 102891 -4265 191094 -74727 10185 -201556 -13824 25790 -116319 -137809 -23636
7368 -325336 105909 22770 -167058 -17746 66819 34336 160031 -331641 -79575 143680 -16145
7356 -196783 153693 -139453 -72618 -63796 -232275 -101469 -122482 309124 57755 175634 -240885
7344 386971 4354 65375 4613 55419 -322634 -115967 86281 -189907 -282782 294566 122007
7332 148254 157959 173206 -11305 -49411 -19078 78422 -38334 230274 -119162 238826 -303818
7320 -462094 -2885 -193288 177811 -350225 -286252 -53766 -57013 54919 225926 -126142 -24110
7308 23654 40175 -57116 46866 20183 -433194 240173 -92884 313005 50689 -145394 278467
7296 233140 42937 -7536 45501 339825 236909 -201968 263100 224030 127733 143272 195591
7285 195591 -198155 -47027 202996 95988 -224668 -214160 -89839 226581 -394375 -33744 185649
7273 -113964 -291070 -120485 -232798 -294815 -128825 75349 204155 -89394 -102417 18633 -65633
7261 90156 -31620 -320768 167456 31211 -327839 -213225 86411 -31434 -20455 -101464 -185823
7250 -185823 -349771 -209882 107558 -24569 231555 -411473 31755 -120259 170474 80816
7239 -140024 -25661 40742 -299739 -61685 -320169 -82292 -247822 -59939 227089 -204666 -237805
7228 -237805 -46126 26967 1801 -117377 300964 -2352 232627 24536 -141888 -210271 -19346
7216 -141511 -268294 99532 -336774 268734 -107873 -125839 11529 -203187 -38522 -187005
7206 -187005 -448167 83926 247751 -93656 -35562 230923 -100573 -258423 -79396 -202968
7196 -202968 96724 154152 -64237 44155 123714 108424 90058 -102871 180941 118971 -157668
7184 77623 -178265 149417 44628 35411 -88388 -134032 -261554 -235238 -4081 -225180 194739
7172 68440 -50075 -13103 -31985 166746 97182 2374 111818 -71211 -70941 -293965 -68110 -71093
7160 -71093 -73898 -12638 -180781 218731 116620 -5772 -229998 135343 67542 393488 -144701
7148 -40596 -272826 12941 -33677 97074 61338 38604 -182703 186116 186241 53021 175250
7137 175250 50419 122511 -104021 -94618 64388 -20804 -100062 -2305 -200333 -111039 -119599 -229921
7125 -229921 -176274 -168436 -213318 -77474 -64291 -231244 -127709 -200461 51422 -59787 -407392
7114 -407392 168469 -104289 -94397 -38983 -222485 31725 222474 102271 -158285 168627
7103 131828 -88080 76783 -32497 136409 -236976 -360267 32775 208277 62433 211485 -146762
7091 -87073 39780 -200129 -487888 -155818 -334344 -299691 1815 66267 65024 -278437 38572
7079 181204 44925 235755 -54265 -16824 -432915 -194726 123198 -110035 134845 -166668
7068 -1745 14852 -71716 -5783 -105893 349079 -101269 -9621 -195511 -230718 25155 178251
7057 178251 222787 20437 77523 -11453 -30184 -296256 108790 120819 -199239 200794 -63551
7045 -197011 -200446 -29624 149414 -82688 -6601 169849 -49121 -41779 -100191 -202834 -253603 -363884
7033 -363884 174437 168333 -206333 -77945 18861 193881 -14665 -94525 167899 -166423 47622
7021 37599 55690 353185 -201239 112974 -215425 -106454 125810 -380945 -71939 295589
7010 424383 23071 440476 -364332 17039 119845 -14899 100869 -93137 -249996 -159614 -90992
6999 -90992 -100386 -97967 130945 -152871 135545 -234906 56728 283793 70184 189062 129473
6988 129473 -154721 109988 3157 50121 114407 -239256 -180043 -76831 -21661 61290 302171
6977 302171 226786 -51168 -150413 8045 -167780 161545 36057 254163 -151464 49400 -26125
6965 98552 -189618 -161777 -182225 -25094 -180073 -44610 -107235 -58772 15835 -36915 -44329 -95682
6953 -95682 85584 122636 98710 -37398 -65598 -246471 -20410 -47794 -69527 481033 -22462
6941 49599 -10428 193648 113817 -6437 -106728 52570 -94729 -46494 95836 -81412 -152035 -208973
6929 -208973 -43709 -231682 83200 242326 -238243 373171 -124153 -191742 -65329 -106437 403525
6917 -239072 -431158 129795 -1620 -46184 -175788 99680 -64977 -118059 81766 -117319 37169
6905 -62797 -88175 215156 23274 -288909 54155 -97021 -32661 194276 -228550 90130 -433813
6893 -20382 -167643 90908 -64177 -47819 371930 -138365 -325376 3282 88535 125163 -100835
6881 -243449 -57967 77621 -41969 -341 -73811 -210532 -166250 40245 -85667 318166 -200662
6869 -188323 -221610 -292232 -200922 -145772 99980 -41768 43298 31022 -352571 133178 91470
6858 91470 -9444 -151269 362509 12685 21092 51269 -49657 129210 -98747 143088 -127807
6846 7313 -51604 5895 17423 158616 63432 136042 -57455 202454 134213 148301 160998 -260179
6833 -309807 36793 -179187 -313029 6161 -130827 -140102 -57090 -146226 -59605 153413 279382
6822 279382 150678 -41107 4239 -271822 -53221 -273349 -345061 279417 143226 -90460 93229
6810 -112590 2406 -459972 -128940 -191315 -261035 -290201 -34474 -24093 -65134 -57408 -18689 -93959
6798 -93959 -132365 -37602 -92728 -23342 -85392 117770 -203337 174530 83855 18196 252523
6787 252523 94013 54617 152675 55935 -187613 202928 103111 -167841 20479 174649 166049
6776 166049 124766 -247585 -106555 19592 89793 -108462 -306456 73615 -342747 25406 -168080
6764 267788 -219347 -1652 151027 -222598 67804 -174611 -52631 1650 -71471 -180309 -14640
6752 -59134 -178800 -61374 -97139 110050 -78023 -2331 -17663 28225 -48593 21151 -104530
6740 -108198 36000 131969 -236208 161266 105948 -158705 64636 -156194 170213 -14065 -110109
6729 -110109 284701 -211865 -304136 110540 94181 113120 165326 -82663 -221998 123347 76201
6718 76201 112574 -30706 242378 -72223 -217980 -242964 185023 38912 297539 -260161 86533
6706 75801 -197141 97980 10830 241400 -110177 -225867 99691 60402 58836 -133785 -263476
6695 -263476 -77098 -391435 104721 -122510 148168 388757 -303730 99184 81135 35622
6684 80014 -278865 -167357 41883 -83111 140391 263357 -147732 -261656 -55672 -26390 135875
6672 -204614 -36878 -94041 58382 508964 46226 -133378 -15502 156241 75667 13896 -342953
6660 -26327 -88290 -22107 -96422 266925 -41649 -178482 1139 -9649 71751 -70662 -94350 8870
6647 -37043 -422719 111982 -92426 -151598 194609 -257976 125576 -35761 249 169736 27078
6635 -123973 39863 -38607 233789 66582 -68691 -185611 -165000 -172244 -240334 52480 -68837
6623 232001 174705 -76733 -219001 17299 -63862 -100463 -60996 9774 178061 295035 104715
6611 51759 210327 -96896 176292 -82772 -44003 -78950 -136187 -132111 23436 81116 152237 -323165
6598 17587 128701 -330679 -222539 -35405 -147596 2530 -40244 142552 -97845 -208080 93752
6586 -267903 60004 222957 -19430 95645 327495 -136726 135074 250013 -139628 -68495
6575 -209150 48246 269565 281148 16845 -73973 -127786 -171359 81197 -368147 -126462 -105009
6564 -105009 79648 -223777 -310003 -103809 -205487 -145386 275359 -172882 -171188 -5839 -269281
6553 -269281 -287907 -130718 -167691 -123755 260372 46050 57135 -98637 131178 -120624 -305853
6542 -305853 -135867 -172803 73621 -19326 40331 -3269 -34131 -219941 176251 -248628 -142245
6531 -142245 135940 183750 -19740 -128903 -248472 -57426 57840 -260030 -476449 -16226 83673
6519 79063 -8700 104001 -289495 -335948 -158642 7781 179643 -104975 -86022 -194125 -25271
6507 -27189 -50044 103106 -29094 19323 -68232 -199614 -124711 -75243 314532 -139625 98091
6495 -250203 -210871 -130475 116121 -76991 -306654 -368054 -367394 -40815 74928 165143 -183208
6483 -94181 51366 -291264 -139136 34719 -227052 44436 74258 -4109 -73669 -42242 76866
6471 52954 -150211 -284773 -82740 41002 -104808 -181425 -265087 -38376 35884 -84570 66680
6459 63289 7005 -11563 36688 -156672 265639 416662 259497 298092 -398616 354246 -22416
6447 -118518 -33300 119628 -101424 67270 350883 -265998 114495 235803 -36976 139336
6436 -297130 52916 50972 -82815 -178693 67209 -12983 -134960 218387 448534 -5119 182119
6424 -146459 197082 -309099 -198196 78816 51558 94785 -224408 28614 -186289 -185666 209959
6412 83094 52688 -73418 -222484 -387566 276519 63628 3145 271085 -91433 137565 385126
6401 385126 239199 -298481 99766 -150581 -440 -152284 47425 43688 -306717 167348 165498
6390 165498 -43025 160905 153346 -375677 54151 118115 175329 -121673 68 283400 232507 87387
6377 -62458 -113460 -15769 216752 144094 -60764 -102198 189959 -14227 97168 70379 2521 49096
6365 49096 73954 1191 175832 -21425 148448 -6896 -27876 -48674 213942 -102531 -80883
6354 -80883 -144104 -139002 3131 -121598 169561 9968 16617 295780 -303356 268927 -305588
6342 -440052 4432 88760 340903 -25169 -152572 82996 105976 -246269 9560 -6212 228250
6330 -284641 -89263 48278 63587 -105798 126636 -191087 -223540 -35933 107607 -157577 16114
6318 -141392 -170954 118974 256010 24034 -365337 -159263 -100675 -325557 122281 289522
6308 289522 165798 -127896 -100322 92699 -145238 -12052 -80412 -44797 -22372 -228612 192180
6296 -19320 -105908 -52988 99285 43462 57802 218633 161396 -234789 -141189 -65321 -120478
6285 -120478 -161336 -269639 -93691 193153 94099 172648 -185140 174341 25598 25498 -79928
6273 -377621 107254 -241829 149363 59099 72929 -219083 75360 448800 -89657 101014
6262 -395038 21526 -363536 74294 163046 160561 99430 250971 64003 -296432 -57968 -340145
6251 -340145 98338 190264 31299 -186506 86888 142377 101110 -291976 7644 -44270 74502
6239 12344 -168256 51729 -113263 -106540 -21296 -107356 203500 426501 -4712 212073 278624
6228 278624 33644 -170437 -111981 -96608 -1911 -437085 -179932 -11649 148294 24766 -89130
6216 -50928 -169890 -11357 -182153 125472 73771 -341127 -195158 47476 -151415 11940 -150313
6204 91053 -174744 15993 -69601 -21337 -150114 -164277 55563 185047 -44882 -101408 -66529
6193 -66529 128087 83034 164817 81186 -107586 284183 -56449 -107954 -199395 69334 -48082
6181 148170 115321 369265 -29490 206675 -338384 43436 93530 43423 123357 -4622 183532
6169 -295644 15368 -211896 -551598 -98791 -99692 152992 -230247 157806 -71094 -98724 -195834
6158 -195834 -67171 198362 310083 -256250 89653 94882 -152259 127231 24434 -148916 46822
6146 -4014 206854 -40004 -259188 -93776 -15214 285540 91387 -244264 -291264 -168356 44040
6134 -6695 -159259 -316136 294447 259429 -64219 155216 235140 -238507 278682 123376 18150
6122 180197 27334 -2333 327569 48340 -406951 -421867 -79036 -309371 -21393 10039 -38482
6110 -323381 48716 205185 -29242 1538 -174062 110439 -179787 171243 -210175 -110416 -158679
6099 -158679 33769 -112080 -183890 -279590 63570 300991 140341 -168629 -184249 -137945 65487
6087 155047 -48187 -220681 338209 -430401 -61503 218045 77361 93865 -224147 118703
6076 -50843 18743 28459 224014 -8547 -28148 4841 80144 -68631 -298016 -205999 113986 101874
6064 101874 174006 120870 -324404 285943 106180 -75428 329376 177749 10513 -289770
6053 -203789 79726 195543 -72076 35036 -86830 -198728 220285 114147 -181747 152770
6042 152467 -84112 -2094 26240 -25255 -314960 -199095 -127053 19528 32815 86822 36197
6030 171003 -274507 -70987 36657 255638 -85100 179884 243615 -60219 -199032 518749 -230511
6018 -183060 122188 403818 -90761 -233514 17649 -177014 57191 -12596 -188458 112056
6007 141955 -4944 74140 -319296 -237762 154377 -258899 8413 -55934 -19084 149324 86338
5996 86338 78229 -56706 42487 297021 60939 -100897 -237021 -102470 29792 123995 115301
5985 115301 -143196 89729 32886 -271082 -81820 -160741 181824 322594 17770 -107989 -173929
5974 -173929 -50910 -115310 -18198 -121401 -45479 -241890 426734 -16708 243355 -168607 -78720
5962 -103385 -184270 63696 -244706 -17738 167919 -55362 23302 121503 162138 80151 -178084
5950 -320025 -433813 -192123 574430 -2729 51234 -64914 140813 -29443 -88240 -4887 -284699
5939 -284699 166297 -387692 -25107 -101703 18494 -18258 -100319 137313 122255 -33223 75459
5927 55421 -139693 27682 -153508 -19891 -56647 -13189 -235618 -9793 194757 -80129 -119706
5916 -119706 457412 266068 -141682 -131824 15044 -193117 -69419 237418 15643 99983 -179690
5904 119735 -267028 96964 -251796 -75877 -40803 112691 50774 -39418 34104 3842 218352
5893 218352 242224 143989 136254 162880 7612 165404 -53252 126247 32942 99993 87624 2904
5880 -176551 137353 579 8341 -74370 150942 91000 -299119 2589 -156089 -244677 -311709 -165736
5868 -165736 -251459 120474 -130531 -313702 -50026 -28718 334059 280822 171391 -122879
5857 443747 56309 210812 -198680 -90776 -28647 -234936 95763 -56176 107110 363335 56320
5845 -16479 -45063 -103145 -37767 -34740 147029 -35726 23495 -139360 -460453 133745 58437
5833 266268 -106535 -265161 -90189 94580 227655 -36732 166631 -269501 180462 -371101
5822 -170869 -314349 -129700 -343503 88708 290 -434327 165246 28 178193 54604 -90024
5810 -266588 -199502 -391725 -29571 174692 -35713 52156 -65194 -314845 36889 -197932 -229022
5799 -229022 -77884 -49060 -322047 -75621 -222185 -209884 20035 2977 160882 -133040 44967
5787 -169205 -162332 -224026 160260 14168 147662 203499 -116750 -124269 -247592 295985 116146
5775 28770 264806 334777 198060 -118640 -147648 114611 -49526 69100 -182167 -121523 14448
5763 -24493 260755 -112215 -322920 51211 -137778 267258 -187705 -163244 211216 522 -13156
5751 -351681 176084 53512 -35103 193260 -140107 214321 141190 46384 -18747 232236 133519
5740 133519 222455 68690 -15826 39691 -98653 -102216 94344 391211 -351122 105130 -386250
5728 185538 9744 -359988 73160 41937 166599 12147 242751 147487 244126 129412 -64364
5716 187858 9741 -315820 -169266 -680 -108348 215569 68495 179303 -140426 82982 101442
5705 101442 -92821 -146506 334600 84871 61486 -201167 48090 -245356 -237107 -50217 357127
5693 312112 240653 -34492 16120 -169034 77089 71508 58049 128239 21203 -177365 -52070
5681 -240297 483 23592 -263899 21593 188404 -72516 -216649 -10043 -356282 -68783 34310
5669 -1052 -297913 159012 27306 126461 96100 -275086 89662 -40812 -339474 -19688 -372772
5658 -372772 -84498 -47968 163687 -275372 151614 -98512 191595 -218542 -12849 268332
5647 -27527 65758 157232 138792 -148758 -108435 -56687 -94155 -64724 5900 216268 -178794
5635 -266698 -72105 -246247 388391 -128978 189713 -39698 361391 -126187 351796 -114554
5624 113040 -127713 65957 281999 89143 -94250 676413 -239160 45566 69300 -202266 -175068
5613 -175068 -194607 -371571 -15457 354396 -265043 -21207 58046 -12591 125675 -131497 317322
5601 -299709 -175378 104232 -174906 125103 -24315 -201547 -101160 -100282 -69302 -242549 67566
5589 13466 -54410 6818 -45693 -18837 374442 -283482 -74030 -262511 103510 364470 26262
5577 8341 -19343 -54025 88328 105437 18461 72287 -14663 100693 -117883 -449339 130283
5565 43505 -148787 55961 -225274 97924 33796 132234 53588 57953 -94055 296471 53037
5553 -300883 -331753 -88919 41647 -127130 -386083 -144975 123824 -2605 -271061 -111177 141831
5541 221421 278020 -108165 65553 128880 254866 130368 177773 101247 318895 264115 462894
5530 462894 -203755 -78033 57391 -158322 279552 11389 -49200 -122142 -128639 -25607 -146093
5519 -146093 113477 3224 -190122 207395 -5461 178222 74846 -387437 -187769 -56010 296955
5507 163082 43591 68049 177399 223310 21825 -394057 -74728 296155 -35714 -65602 356951
5495 -249749 -83437 13819 -13403 111043 -262306 321821 -124320 41705 -94337 12878 -282093
5483 -121221 -164152 229209 45494 -241302 113860 21123 24106 108170 203054 -127978 36542
5471 98497 -13282 -309175 -17907 -82853 54317 240986 175408 284882 -1119 124597 -34175
5459 146363 262975 24748 -111933 -98421 27429 350014 11695 -65853 5458 47408 121459
5448 121459 -82498 341807 493937 163449 -80519 -122533 62020 -89523 217899 324328 -147188
5436 -477070 154032 128389 22637 -56917 -101438 102332 -114122 -21279 -222796 -266557 -43060
5424 383011 -203671 -159827 -252188 29728 -148010 81526 -1540 19869 43812 25186 -36960
5412 218669 -82886 38842 -134320 -225160 230179 98021 -518213 200617 -156195 -431538
5402 -431538 -87908 -154 -424061 -192610 114365 32825 -184475 127279 4421 148760 -215030
5390 -160908 110533 -124650 355233 -232072 135031 204817 229742 323885 -81964 308090
5379 -126123 -162353 93483 98859 -178029 3668 127221 197191 -29021 -458505 262733 -104967
5367 -91057 -218355 143307 268986 147544 331229 -9258 353411 -54524 -66828 52159 248266
5356 248266 -36411 157879 335331 -27806 -97350 -17958 -163842 41244 3430 132773 275679
5345 275679 287245 380704 172839 36676 -250760 148652 7075 43231 -260162 354592 -264144
5333 -198650 244980 -292131 -169859 -244720 -110843 55862 155339 -167233 -225712 -196148 37707
5321 33027 -188230 92735 19754 121877 -364745 12522 497823 -35535 -111904 285864 -26784
5309 -70837 7648 -1281 -298155 98837 148823 -274368 -273514 91575 -175024 -64805 -120637 -91592
5297 -91592 -121660 -37894 402230 69070 -32585 -6045 -268446 104779 71427 -242129 -22299
5285 106479 25710 323610 192056 269151 206538 118726 9678 -128899 -268470 -47810 -57990
5274 -57990 -12915 -167021 -84021 111880 130812 -135686 -43783 192062 -116863 97658 -5811
5262 42901 -23272 11355 -180462 -201421 -134544 245580 -226208 181251 282349 -361002 111594
5250 55919 212799 -11637 -20580 72682 -199201 17616 94641 -293697 340020 69624 887 -31828
5237 146162 79265 -106449 157464 -145098 170749 173792 -374590 152414 101680 65462 205824
5226 205824 -39492 -175258 190398 -137093 -34744 62274 264087 -99270 -63923 -61568 -48109
5215 -48109 -33784 -81520 6807 -195964 -33304 -51024 -56195 -264012 187540 300124 73978
5203 -742 -29884 114281 -131060 245278 230336 74510 118354 77264 125364 -271772 170871
5191 -116827 148946 90972 75904 770 114885 377041 -406790 118574 -64511 102426 50198
5179 -207912 243080 87944 147147 17882 -72296 -87089 95976 116955 -74605 -349894 17505
5167 -179740 -134388 292790 21615 -180248 -427507 120174 -47512 52719 183993 191294 -164814
5155 254116 16664 177851 -21432 146692 196408 180477 -102790 296442 -184831 -128515 -369762
5144 -369762 67783 -81088 251366 205296 -288430 105440 -290920 -217754 401560 61445 291424
5133 291424 -47729 286 172354 -454176 -39377 9761 -52279 76469 19616 -216664 337610
5121 100502 74336 304399 228341 -320464 -104672 274070 -7745 -197869 30932 200502 40885
5109 -103059 -125896 76090 128391 52757 -68444 17319 74515 -118468 51873 375261 13245
5097 -229606 9563 8445 114349 52387 92817 -39789 164683 247938 101010 -24237 74946
5085 -148489 -210242 -313456 233678 -27381 -352345 128643 -89754 -41304 39430 -99817 8132
5073 4696 237872 227348 -134400 193411 175801 195272 -26953 34660 183130 -194314 -67749
5061 -99617 154065 -78064 -172909 -98439 93697 1825 -136 198241 -140963 -185816 -295645 41749
5048 -210289 -123293 145497 -21362 -105973 29355 205399 65289 206017 134994 -175868 30983
5036 -12640 126286 -10879 -15926 -16026 -159271 -312403 -39044 -146717 -256349 -208431 -242849
5025 -242849 89592 -281874 56572 -80303 -232122 19740 -500871 -288715 -93145 269166 152183
5014 152183 -106009 34640 -102786 116502 -244151 55926 77605 189519 -177253 -60947
5003 20913 165958 -208540 -148852 136145 61285 -19053 -121532 47396 -98367 70106 99514
4992 99514 -307082 -128011 -146138 -67160 -59296 -229285 -58205 -172758 156945 317408 408839
4981 408839 -325790 31454 -273783 2588 147640 178526 105327 -50803 99822 -69058 105836
4969 -20406 195424 234474 91011 278579 -176441 -129226 -19075 207286 101440 -168446 146040
4957 110178 223776 192138 -54603 -32137 174952 217992 -6366 -2233 220287 -209434 126132
4945 46297 -60233 104607 161040 26507 272897 27958 325197 65986 188435 -8980 145684
4933 -91984 298745 -28501 -2835 -58984 19809 -373052 -560940 -36806 20029 -175953 -106043
4922 -106043 -22161 -285418 56749 -66555 -129611 -204683 93239 99187 36990 -294561 -111752
4910 94808 -197805 120611 -216649 126187 20608 -78233 176046 143469 15279 -178380 119679
4898 35266 -242782 -168967 22858 -121105 -199913 -87063 -41444 150535 166438 58771 -217431
4886 -93758 20322 -84233 -117743 -108501 -144396 -3573 -185209 -3885 415810 138118 -235675 -111310
4873 317457 -253695 360286 193538 25225 87034 -85688 -252871 -200480 84340 -20204 148321
4861 210366 -10064 -131770 -203996 -211588 -408167 -72009 -135804 211085 -37423 378527 107026
4849 -119250 115344 -16751 210794 129939 124217 205712 -56312 -15856 -287700 80533 -52877
4837 49369 -89856 46341 370655 -215863 -36756 -220249 -359236 78051 59784 232271 44713
4825 -163300 -54203 -340499 -41247 -14425 186078 51461 -74478 -190872 3466 98960 250825
4814 250825 -257557 -43824 227005 11208 233147 -358017 177751 48528 27764 -202413
4803 73534 230270 56413 114546 -232945 35995 24108 -75780 263390 -274310 -264548 -79689
4791 205624 122335 198074 -229430 -108137 82595 -14237 -352799 104549 194286 -231886 -47179
4779 170383 116604 91409 -274991 304260 169719 28133 81268 -132131 7240 217325 24618
4767 -21082 -399663 69439 -94279 -69941 -10330 -196665 -94547 38004 -186692 37785 -65537
4755 -193698 70709 139318 32052 32378 35197 75456 -80301 59901 -3086 122476 292255 71877
4742 134799 185101 246157 151194 -55445 -75724 199966 -98920 -173536 76292 309494 -59127
4730 122296 -68438 -61791 -27331 -14859 -5557 -46847 -91738 23401 101630 -90586 319529 -18143
4717 176670 39131 -395950 -39810 -171923 94106 50224 329683 -203781 248493 -241271
4706 110285 -52064 558 -100102 201555 242284 193086 143696 -239742 90164 -102187 239566
4694 -29878 78002 290822 14221 -384405 -103450 -35860 221659 142625 -24349 134938 -136553
4682 -171257 -141750 149713 -69243 -17587 225165 72497 86149 -155216 159975 128095 -653
4670 41536 55773 72862 122770 225518 24285 69223 -316034 151221 47814 93281 7671
4658 -6386 -244091 -284598 504354 122100 -182599 -123127 -131173 -245870 65831 84934 -135429
4646 235105 -119268 35935 139384 -108640 -193914 27221 -332463 -58601 -239005 -163934 378953
4634 341291 -152 -224251 113920 47019 -81348 105329 198557 274745 123580 -336821 -453809
4623 -453809 -306343 60498 219249 333972 -47085 -120037 21096 -86387 172989 293842 -183858
4611 -14521 20563 -107438 -13936 169324 -455589 -104821 114750 -71122 -61786 247194 -186848
4599 4923 -155315 -102951 -130368 -49286 266859 67144 -93254 159083 -24446 136469 125545
4588 125545 325048 -34530 -172968 -114800 123748 218289 111005 -153787 22484 -145769
4577 32995 256845 145472 -342018 49630 -173430 -202663 -122842 150187 -183740 313004
4566 108859 214304 55872 -5594 180320 82935 7360 149531 39970 -29251 -46314 5830 13323
4554 13323 -371487 -60955 99003 9673 255420 -111767 158518 321535 -18175 10768 -44962
4542 18106 -19774 -171698 35219 263534 -36060 -67350 51692 340615 36858 478980 312986
4531 312986 62184 -252682 131231 -115394 -28203 -163151 86379 -76083 -192861 -5823 -118169
4520 -118169 -261662 92692 173202 -252014 -93681 -134651 89173 -42842 -46209 103772 -66886
4508 -3088 -16624 -166256 123639 -9973 239113 -29013 42484 -295424 263251 -24817 -87969
4497 -87969 -31722 121795 -133819 238290 -151139 83380 -261853 55643 172601 -409050
4486 -2290 -194864 -345376 -370141 -3222 -84439 -253016 270324 -54217 372568 -7881 160134
$$ [...]
##END NTUPLES=NMR SPECTRUM
##END=
