##TITLE=AC1416_KCHHT12226_7764033_5FSMWOzXic
##JCAMPDX= 6.0         $$ Bruker NMR JCAMP-DX V2.0
##DATA TYPE= NMR SPECTRUM
##DATA CLASS= NTUPLES
##ORIGIN= BRUKER
##OWNER= Administrator
$$ 1.72 TOPSPIN		Version 2.1
$$ 2013-04-11 17:48:42.752 -0700  Administrator@X
$$ Compression mode = diff/dup
##.OBSERVE FREQUENCY= 400.02188249412
##.OBSERVE NUCLEUS= ^1H
##.ACQUISITION MODE= SIMULTANEOUS (DQD)
##.ACQUISITION SCHEME= undefined
##.AVERAGES= 8
##.DIGITISER RES= 22
##SPECTROMETER/DATA SYSTEM= spect
##.PULSE SEQUENCE= zg30
##.SOLVENT NAME= COFFEE_meoh
##.SHIFT REFERENCE= INTERNAL, COFFEE_meoh, 1, 14.98509
##AUDIT TRAIL= $$ (NUMBER, WHEN, WHO, WHERE, PROCESS, VERSION, WHAT)
$$ ##TITLE= Audit trail, TOPSPIN		Version 2.1
$$ ##JCAMPDX= 5.01
$$ ##ORIGIN= Bruker BioSpin GmbH
$$ ##OWNER= Administrator
$$ $$ E:\/data/COFFEE/nmr/AC1416_KCHHT12226_7764033_5FSMWOzXic/10/pdata/1/auditp.txt
$$ ##AUDIT TRAIL=  $$ (NUMBER, WHEN, WHO, WHERE, PROCESS, VERSION, WHAT)
(   1,<2013-04-11 17:48:34.674 -0700>,<Administrator>,<X>,<go>,<TOPSPIN 2.1>,
      <created by zg
	started at 2013-04-11 17:47:29.352 -0700,
	POWCHK enabled, PULCHK disabled,
       configuration hash MD5:
       33 CF 6A 21 5C D3 B9 40 6C 15 AA 8D 27 A2 4F 13
       data hash MD5: 64K
       A0 07 D2 41 36 7D 8F D6 EB 0F BE 33 AC E7 C6 E0>)
(   2,<2013-04-11 17:48:37.768 -0700>,<Administrator>,<X>,<proc1d>,<TOPSPIN 2.1>,
      <Start of raw data processing
       efp LB = 0 FT_mod = 6 PKNL = 1 PHC0 = 0 PHC1 = 0 SI = 32K 
       data hash MD5: 32K
       6E 76 BF DE B5 10 1F 32 9C 39 BF 97 B8 23 F7 01>)
(   3,<2013-04-11 17:48:38.236 -0700>,<Administrator>,<X>,<proc1d>,<TOPSPIN 2.1>,
      <pk PHC0 = 97.58057 PHC1 = 0 
       data hash MD5: 32K
       A5 56 57 43 0E FF 6E 8B EA 0F 9E BB E2 2D BA AC>)
(   4,<2013-04-11 17:48:38.455 -0700>,<Administrator>,<X>,<proc1d>,<TOPSPIN 2.1>,
      <abs ABSG = 1 
       data hash MD5: 32K
       48 63 AC 9F EF 5E 9F 48 D5 2B F9 6E BA 19 E4 E9>)
(   5,<2013-04-11 17:48:38.611 -0700>,<Administrator>,<X>,<proc1d>,<TOPSPIN 2.1>,
      <abs ABSG = 2 
       data hash MD5: 32K
       D2 1A BC EF 3C 87 45 86 D9 1C 24 2C 05 0F FE B0>)
(   6,<2013-04-11 17:48:38.752 -0700>,<Administrator>,<X>,<proc1d>,<TOPSPIN 2.1>,
      <abs ABSG = 3 
       data hash MD5: 32K
       61 E3 F8 CC C4 F4 AE 39 98 CE 49 95 63 32 CC 0C>)
(   7,<2013-04-11 17:48:38.908 -0700>,<Administrator>,<X>,<proc1d>,<TOPSPIN 2.1>,
      <abs ABSG = 4 
       data hash MD5: 32K
       BE A8 E9 35 01 E7 15 8A B2 DA 07 4D 09 8E 8C 01>)
(   8,<2013-04-11 17:48:39.065 -0700>,<Administrator>,<X>,<proc1d>,<TOPSPIN 2.1>,
      <abs ABSG = 5 
       data hash MD5: 32K
       B3 06 3D 64 A9 E9 AB AB CF 69 1E E5 93 34 44 6F>)
$$ ##END=
$$ 
$$ $$ hash MD5
$$ $$ CC B8 00 5F D4 2E 18 13 9C D6 61 EB D6 27 B8 C6
##$RELAX= 
##$RELAX= 
##$RELAX= 
##$RELAX= 
##$RELAX= 
##$RELAX= 
##$RELAX= 
$$ Bruker specific parameters
$$ --------------------------
##$DU= <E:\>
##$EXPNO= 10
##$NAME= <AC1416_KCHHT12226_7764033_5FSMWOzXic>
$$ [...]
150 150 150 150 150 150 150 150
##$TP07= 0
##$TPNAME0= <>
##$TPNAME1= <>
##$TPNAME2= <>
##$TPNAME3= <>
##$TPNAME4= <>
##$TPNAME5= <>
##$TPNAME6= <>
##$TPNAME7= <>
##$TPOAL= (0..7)
0.5 0.5 0.5 0.5 0.5 0.5 0.5 0.5
##$TPOFFS= (0..7)
0 0 0 0 0 0 0 0
##$TUNHIN= 0
##$TUNHOUT= 0
##$TUNXOUT= 0
##$USERA1= <user>
##$USERA2= <user>
##$USERA3= <user>
##$USERA4= <user>
##$USERA5= <user>
##$V9= 5
##$VALIST= <valist>
##$VCLIST= <CCCCCCCCCCCCCCC>
##$VD= 0
##$VDLIST= <DDDDDDDDDDDDDDD>
##$VPLIST= <PPPPPPPPPPPPPPP>
##$VTLIST= <TTTTTTTTTTTTTTT>
##$WBST= 2048
##$WBSW= 25
##$XGAIN= (0..3)
0 0 0 0
##$XL= 0
##$YL= 0
##$YMAX_a= 643667
##$YMIN_a= -547163
##$ZGOPTNS= <>
##$ZL1= 120
##$ZL2= 120
##$ZL3= 120
##$ZL4= 120
##$ABSF1= 14.98509
##$ABSF2= -5.573092
##$ABSG= 5
##$ABSL= 3
##$ALPHA= 0
##$AQORDER= 0
##$ASSFAC= 0
##$ASSFACI= 0
##$ASSFACX= 0
##$ASSWID= 0
##$AUNMP= <proc_prof1d_extract_pilot.lims>
##$AXLEFT= 0
##$AXNAME= <>
##$AXNUC= <1H>
##$AXRIGHT= 0
##$AXTYPE= 0
##$AXUNIT= <>
##$AZFE= 0.1
##$AZFW= 0.1
##$BCFW= 0
##$BC_mod= 0
##$BYTORDP= 0
##$COROFFS= 0
##$CY= 15
##$DATMOD= 1
##$DC= 0
##$DFILT= <>
##$DTYPP= 0
##$F1P= 0
##$F2P= 0
##$FCOR= 0.5
##$FTSIZE= 32768
##$FT_mod= 6
##$GAMMA= 0
##$GB= 0
##$INTBC= 1
##$INTSCL= 1
##$ISEN= 128
##$LB= 0
##$LEV0= 0
##$LPBIN= 0
##$MAXI= 10000
##$MC2= 0
##$MEAN= 0
##$ME_mod= 0
##$MI= 0
##$NCOEF= 0
##$NC_proc= -8
##$NLEV= 6
##$NOISF1= 0
##$NOISF2= 0
##$NSP= 0
##$NTH_PI= 0
##$NZP= 0
##$OFFSET= 14.98509
##$PC= 1
##$PHC0= 97.58057
##$PHC1= 0
##$PH_mod= 1
##$PKNL= yes
##$PPARMOD= 0
##$PPDIAG= 0
##$PPIPTYP= 0
##$PPMPNUM= 2147483647
##$PPRESOL= 1
##$PSCAL= 4
##$PSIGN= 0
##$PYNMP= <proc.py>
##$REVERSE= no
##$SF= 400.02
##$SI= 32768
##$SIGF1= 0
##$SIGF2= 0
##$SINO= 400
##$SIOLD= 32768
##$SPECTYP= <>
##$SREGLST= <1H.CDCl3>
##$SSB= 0
##$STSI= 32768
##$STSR= 0
##$SW_p= 8223.68421052631
##$SYMM= 0
##$S_DEV= 0
##$TDeff= 65536
##$TDoff= 0
##$TI= <>
##$TILT= no
##$TM1= 0
##$TM2= 0
##$TOPLEV= 0
##$USERP1= <user>
##$USERP2= <user>
##$USERP3= <user>
##$USERP4= <user>
##$USERP5= <user>
##$WDW= 1
##$XDIM= 32768
##$YMAX_p= 453931336
##$YMIN_p= -666384
##$CURPLOT= <Network HP LaserJet P1505>
##$CURPRIN= <$Network HP LaserJet P1505>
##$DFORMAT= <normdp>
##$LAYOUT= <+/1D_H.xwp>
##$LFORMAT= <normlp>
##$PFORMAT= <normpl>
##$SURQMSG= 1
$$ End of Bruker specific parameters
$$ ---------------------------------
##NTUPLES= NMR SPECTRUM
##VAR_NAME=  FREQUENCY,     SPECTRUM/REAL,   SPECTRUM/IMAG
##SYMBOL=    X,             R,               I
##VAR_TYPE=  INDEPENDENT,   DEPENDENT,       DEPENDENT
##VAR_FORM=  AFFN,          ASDF,            ASDF
##VAR_DIM=   32768,         32768,           32768
##UNITS=     HZ,            ARBITRARY UNITS, ARBITRARY UNITS
##FACTOR=    0.250966925370066, 1,           1
##FIRST=     8223.43324360094, 13768,        -260982
##LAST=      0,             69518,           44379
##MIN=       0,             -666384,         0
##MAX=       8223.43324360094, 453931336,    0
$$ Real data points
##PAGE= N=1
##DATA TABLE= (X++(R..R)), XYDATA
$$ [...]
$$ plain form
19560 137311 -309947 -5347 11197 -249007 28705 58703 205011 -480631 111464 132876 179241
19549 179241 31197 -199840 322775 -177129 -66174 93098 181505 38527 -193121 -226943 18241
19537 -48418 -236368 -66724 -237499 -343679 -60426 293147 246831 107609 -167119 -46353
19526 -64673 -188808 -126955 -259032 -32032 -167482 112083 -60568 -34268 72436 152023 -203740
19514 172020 -21323 -234906 -126477 -218097 -246338 78193 59379 -156554 -110004 39188 23001
19503 23001 -55986 -207149 50330 -3909 -88999 -245019 -254908 52356 -50010 90405 -35545 277556
19490 24619 -178402 67555 -184890 -78528 -188797 128428 -341357 -19375 -123911 13870
19479 -280898 -99331 -274999 -30289 -103058 -14879 -66019 -130130 -54111 -194982 215841 -6358
$$ packed form
19560A37311c09947e347A1197b49007B8705K9998J46308d80631A11464K1412M6365
19549A79241C1197a99840C22775a77129f6174I3098Q8407C8527a93121l3822A8241
19537d8418j87950f6724j70775j06180f0426B93147m6316A07609a67119d6353
19526f4673j24135O1853j32077c2032j35450A12083f0568K6300G2436P9587b03740
19514A72020b1323k13583J08429r1620k8241G8193j8814a56554M6550C9188j6187
19503B3001e5986j51163E0330c909q5090j56020r889E2356e0010I0405c5545B77556
19490B4619a78402F7555a84890g8528j10269A28428c41357a9375j04536A3870
19479b80898i9331j75668c0289p2769a4879n1140o4111e4111j40871B15841f358
$$ plain form
19467 -140728 -91770 106812 -129511 -270672 -143799 18210 -397592 -100633 -334634 -76494
19456 -178695 -257901 87852 -24672 -104771 -168331 -140291 -51193 -94312 43335 -108495 -102255
19445 -102255 -74298 -202331 48378 -299876 -289858 66089 72100 -42953 -100543 93326 57340
19434 57340 -27442 -291541 236309 -5412 -178935 -408301 -10170 15439 90654 85946 -183892
19422 27675 124191 -364464 -133732 -356352 -173858 -267504 35743 -321321 78585 -335682
19411 186176 16327 -198587 632 -84140 -267063 -118736 -54705 -35315 -40291 106135 63484
19400 63484 259308 59411 48522 -271389 152054 -329187 -209721 -140356 -94171 186066
19389 -127041 -291068 87845 150613 265180 -213999 240902 -449790 -73046 -128622 32521
$$ packed form
19467a40728M8958A06812a29511j41161J26873A8210c97592a00633k34001g6494
19456a78695p9206H7852b4672q0099o3560K8040e1193m3119D3335a08495O240
19445a02255K7957j28033D8378b99876J0018F6089O011d2953n7590I3326l5986
19434E7340b7442k64099B36309e412j73523k29366a0170A5439P5215m708a83892
19422B7675R6516c64464a33732k22620a73858r3646C5743c21321G8585c35682
19411A86176A6327a98587F32h4140j82923a18736e4705J9390m976A06135m2651
19400F3484J95824E9411j0889b71389A52054c29187J19466O9365M6185A86066
19389a27041j64027H7845O2768J14567b13999B40902d49790g3046n5576C2521
$$ plain form
19378 121463 -148716 -137886 219975 -121586 137300 33088 91534 -72708 -123624 45320 -176886
19366 178853 108313 11445 -302120 -27031 56169 -231429 93426 -131032 -338198 59347 4234
19354 -136567 -212259 -235142 -22174 -209391 -292183 54158 -78556 -230165 86908 -18344 92603
19342 -110903 226125 143531 12652 163793 -160916 4152 -513011 -201796 -23261 10192 -169175
19330 154969 -109562 -343171 -34519 -26291 -212397 115614 155384 -159791 -112123 71405 264674
19319 264674 313435 -284791 -190601 -83968 -357599 35315 237478 -111568 -49782 67710 86092
19308 86092 -90195 -103941 128765 -9554 124886 -229774 184247 -199828 -240110 -184415 175119
19296 -68055 34515 -201186 1344 -16693 -120262 62937 -163653 -93155 -88081 124836 -137772
$$ packed form
19378A21463a48716J0830B19975a21586A37300C3088N8446g2708n0916D5320a76886
19366A78853p0540A1445c02120b7031E6169b31429I3426a31032k07166E9347D234
19354a36567p5692k2883b2174j87217q2792E4158g8556j51609H6908a8344I2603
19342a10903B26125q2594A2652J51141a60916D152e13011b01796b3261A0192a69175
19330A54969a09562k33609c4519Q228j86106A15614L9770a59791M7668G1405J93269
19319B64674M8761b84791R4190h3968k73631C5315K02163a11568d9782F7710J8382
19308H6092i0195j3746A28765i554A24886b29774A84247a99828m0282N5695A75119
19296f8055C4515b01186A344a6693j03569F2937a63653P0498N074A24836a37772
$$ plain form
19284 -13267 -91917 -101893 -125894 74673 -159068 -47342 84336 -84923 144839 -35134 -279641
19273 -279641 56037 377068 266456 -47199 -201923 208963 -61032 66648 168027 -340566
19262 -154318 134857 -96358 -53883 -52745 -32559 88307 -213129 43634 -286769 -30716 135535
19250 870 54287 -62820 -40285 -114328 -12928 165231 -85291 103148 403045 -197956 -96645
19238 -184609 -238175 -28571 14584 -161417 208403 -203623 -123068 12932 199765 -462428
19227 -157162 -241425 -48315 -4985 -140715 -142834 -250352 13951 7126 27938 -43491 -145193
19216 -145193 16581 46870 -215283 -104769 -121692 48288 -256416 -95772 128807 -321531
19205 -314316 1197 41767 -113029 7316 -118290 -189740 107523 -184562 -240452 -145952 -119526
$$ packed form
19284a3267p8650r976k4001G4673a59068d7342H4336h4923A44839c5134k44507
19273b79641E6037L21031j10612d7199j54724B08963f1032F6648J01379c40566
19262a54318A34857i6358M2475J138K0186H8307b13129D3634b86769c0716A35535
19250H70N3417f2820K2535p4043a2928A65231h5291A03148K99897a97956i6645
19238a84609n3566b8571A4584a61417B08403b03623Q0555A2932J86833d62428
19227a57162q4263d8315d985j35730k119j07518A3951o825K0812d3491j01702
19216a45193A6581L0289b15283a04769j6923D8288b56416i5772A28807c21531
19205c14316A197M0570a13029G316a18290p1450A07523a84562n5890R4500K6426
$$ plain form
19194 -119526 -18844 -64833 143714 -65951 -13853 -54681 -47523 -187341 -288410 -295388 78970
19182 79004 134979 37885 198477 -143295 18119 134556 547 -137885 -107869 -158833 -363942
19171 -363942 -352758 -175241 -177047 -12700 -142978 304180 93117 -66017 178244 -150520 -279351
19160 -279351 -98990 61879 -207367 -64013 -36638 87629 61946 120603 221880 -221107 -45161
19148 32912 28629 -135765 -204643 -67987 -15769 -289253 -238919 -79927 -385822 156497 -335007
19136 -103950 118486 142990 69269 -68949 -86447 12611 192301 -153770 -60943 147680 300070
19125 300070 -232776 -75564 -25541 -35952 -345613 -8863 -119576 59570 162961 100801 -93341
19113 -148277 -197121 16967 -76721 18572 -301433 -161674 -132856 129148 -89348 -61621 140293
$$ packed form
19194a19526a8844m5989A43714f5951a3853m0828P158j39818j01069o978G8970
19182G9004N5975C7885J60592a43295A8119J16437E47a37885L0016n0964k05109
19171c63942J1184a75241j806a2700j30278C04180I3117f6017A78244a50520j28831
19160b79351i8990F1879b07367f4013K7375H7629k5683N8657J01277b21107d5161
19148C2912m283a35765o8878f7987a5769k73484N0334g9927l05895A56497c35007
19136a03950A18486K4504F9269f8949j7498A2611J79690a53770f0943A47680J52390
19125C00070b32776g5564b5541j0411l09661h863j10713E9570J03391o2160i3341
19113a48277m8844A6967g6721A8572c01433J39759K8818A29148h9348K7727A40293
$$ plain form
19101 -136587 -123387 -179678 4377 12793 310674 -190637 -287729 102529 -21596 -342729 -245614
19090 -245614 -78900 283729 184456 -84740 -172920 -306787 -168661 45067 -371612 -131492
19079 -29334 187929 -192466 -232475 2709 -271343 95048 -114440 167806 233652 -113900 209513
19067 209277 112137 5778 -254992 146412 -187635 232029 -20902 -297645 246726 -266134
19056 -165066 -199184 281764 -191427 -415566 -100647 -154116 4971 -583 95335 -235346 204854
19044 -5518 -257495 -30083 -77626 -34622 -217578 -2267 -105118 -244157 -243246 206420 106314
19033 106314 118123 -56572 -173122 310452 15970 29182 56415 352698 77470 108715 151854
19022 151854 18322 -115095 156585 -73349 32133 -199396 -77325 -140906 101748 -275714
$$ packed form
19101a36587J3200n6291D377Q416K97881a90637r7092A02529b1596l21133R7115
19090b45614g8900B83729r9273h4740q8180j33867J38126D5067c71612a31492
19079b9334A87929a92466m0009B709b71343I5048a14440A67806O5846a13900B09513
19067B09277r7140E778b54992A46412a87635B32029b0902k76743B46726b66134
19056a65066l4118B81764a91427k24139a00647n3469D971e83I5335b35346B04854
19044e518k51977c0083m7543c4622j82956b267j02851j39039R11B06420j00106
19033A06314J1809e6572j16550C10452A5970J3212K7233K96283G7470L1245M3139
19022A51854A8322a15095A56585g3349C2133a99396g7325o3581A01748b75714
$$ plain form
19011 246446 122670 -178421 144705 285987 120158 -75377 66102 -497132 87777 -72699
19000 -299730 22482 -163794 146283 -263457 -18403 -21605 -128681 -113867 -25072 -129470 -38902
18988 192155 -192328 -56218 -3209 107129 -95416 63138 286197 48220 -192121 -20556 -105365
18977 -105365 -233978 -155750 69466 -206736 290626 27989 -90441 -198026 243934 25003
18966 -236957 -181639 -1298 -496613 -161933 156420 -73555 77076 108211 105769 -228932 347979
18954 83267 -637883 -145858 191531 -11062 24462 113585 -138533 -95331 168596 105529 139376
18943 139376 -393057 -166404 420683 -67540 -3274 -65400 68772 -65108 -17311 49854 186474
18932 186474 -147573 -67024 -25537 15571 -26578 -77538 392866 -133580 25898 -84343 -53253
$$ packed form
19011B46446A22670a78421A44705J41282A20158g5377F6102d97132H7777g2699
19000b99730B2482a63794A46283b63457a8403l202j07076J4814b5072j04398c8902
18988A92155a92328e6218c209A07129i5416F3138K23059D8220a92121b0556q4809
18977a05365j28613P8228F9466b06736B90626B7989i0441j07585B43934B5003
18966b36957N5318a298m95315a61933A56420g3555G7076L1135k442b28932C47979
18954H3267f37883a45858A91531a1062B4462Q9123a38533M3202A68596o3067L3847
18943A39376c93057a66404D20683f7540c274o2126F8772f5108a7311D9854J36620
18932A86474a47573f7024b5537A5571b6578n0960C92866a33580B5898h4343L1090
$$ plain form
18921 -53253 355196 263739 -236533 178814 -81117 181303 -307613 -76065 59534 -181973
18910 181831 -116272 -148979 -70649 121628 -61401 -562811 -159507 -127741 143266 -333498
18899 22272 -6904 94012 778 5532 -69638 -65376 -135644 59594 -147888 -56287 -227909 47620
18886 -168617 -27724 -38217 -222421 -150118 -580584 244870 -282897 78125 157563 -119077
18875 -309019 -47480 -23359 83369 -155692 294661 92335 -56844 31744 -237985 79777 14728
18863 100450 -211871 60316 -273499 -268434 -293510 177094 -173999 128971 169589 -64065 82643
18851 -169595 193861 -170830 175033 -35640 26187 -136496 116978 -188071 80683 -120023
18840 -311250 -56861 29274 95541 90672 8408 -13233 104488 287466 -148559 -29619 114726
$$ packed form
18921e3253C55196r1457b36533A78814h1117A81303c07613g6065E9534a81973
18910A81831a16272l2707g0649A21628f1401n01410a59507L1766A43266c33498
18899B2272f904I4012G78M754f9638M262p0268E9594a47888e6287j71622D7620
18886a68617b7724j0493j84204P2303m30466B44870b82897G8125P9438a19077
18875c09019d7480b3359H3369a55692B94661I2335e6844C1744b37985G9777A4728
18863A00450b11871F0316b73499N065k5076A77094a73999A28971M0618f4065H2643
18851a69595A93861a70830A75033c5640B6187a36496A16978a88071H0683a20023
18840c11250e6861B9274O6267m869H408a3233A04488J82978a48559b9619A14726
$$ plain form
18828 -53920 7915 -162392 -218430 -116074 28933 -257622 14595 -50038 91039 -110307 -48334
18816 108301 94836 -18861 139079 25966 -188983 155764 276914 -176318 263558 359885
18806 359885 230207 -70191 103018 37197 219485 -98595 -53815 -83385 157094 -237811
18795 -172793 5583 -207955 244113 24015 124429 4787 -243583 -186004 236203 -388976 -315718
18784 -315718 -217311 -97828 -321471 383796 -174507 -43972 -118445 -689 -120637 -165184 -114769
18773 -114769 28682 22330 170330 135504 -147058 -202284 66640 -114132 82336 -259052 -193794
18762 -193794 -178232 101119 203036 -7995 -141061 155174 -187357 -52523 -124998 192401
18751 -84554 -404834 98586 524412 41389 -31908 -91751 -368627 -221878 -220313 -236259 -129763
$$ packed form
18828e3920G915a62392n6038J02356B8933b57622A4595e0038I1039a10307d8334
18816A08301j3465a8861A39079B5966a88983A55764J21150a76318B63558R6327
18806C59885j29678g0191A03018C7197J82288i8595M4780k9570A57094b37811
18795a72793E583b07955B44113B4015J00414D787b43583N7579B36203c88976P3258
18784c15718R8407i7828k23643C83796a74507d3972p4473f89j19948m4547N0415
18773a14769B8682o352J48000l4826a47058n5226F6640a14132H2336b59052O5258
18762a93794J5562A01119J01917g995j33066A55174a87357e2523p2475A92401
18751h4554l20280I8586M25826D1389c1908n9843k76876J46749J565j5946J06496
$$ plain form
18740 -129763 -178989 -320263 -48258 129894 -103308 55852 -364942 -89045 97437 49587 71746
18729 71746 99079 -152060 25606 2081 -4502 -133291 -5595 209504 -47274 87206 100878 135204
18717 135204 76057 74109 -66359 -97949 -378286 75598 -450703 110155 -9107 200773 82484
18705 -86677 -72840 -13220 -177809 -42881 -117334 51147 -82286 -62649 157279 -25395 -289947
18694 -289947 44733 -72703 40981 -150197 68326 -223273 -376512 -79860 233376 396607
18684 396607 46013 -362642 -17891 -151630 -259040 8881 40962 -252382 -109096 -121647 249181
18672 -413506 -153077 -73040 67283 153480 -114977 -151928 131049 -18407 -67196 75015 -220078
18660 166042 175158 -92349 -199902 49588 -238102 -44134 -91999 -173153 8139 178824 -145616
$$ packed form
18740a29763m9226j41274d8258A29894a03308E5852c64942h9045I7437m7850K2159
18729G1746K7333a52060B5606B081d502j28789e595B09504d7274H7206J3672L4326
18717A35204n9147j948f6359l1590k80337G5598d50703A10155i107B00773H2484
18705h6677J3837a3220j64589d2881p4453E1147h2286J9637A57279b5395k64552
18694b89947D4733g2703D0981a50197F8326b23273j53239g9860B33376J63231
18684C96607D6013c62642a7891j33739j07410H881L2081b52382a09096j2551B49181
18672d13506a53077g3040F7283Q6197a14977l6951A31049a8407m8789G5015b20078
18660A66042R116i2349j07553D9588b38102d4134m7865q1154H139J70685a45616
$$ plain form
18648 -83570 -174513 4745 41588 152334 242839 -62967 -58768 -2843 11303 195356 -46475 -330843
18636 -330843 99707 -56156 242205 160769 34718 -346310 -27430 -165340 -322676 274440
18625 -111767 210051 -61800 -270709 -359637 -93597 249934 -206672 -44357 44173 122577 -140112
18613 108120 -172134 -29583 -49301 91908 -82220 -180094 190006 -200 -42488 -342521 -132686
18601 132763 -87270 -257998 -72654 -128316 -326375 27587 -256493 -96598 -177330 -353151 -40938
18589 -158824 43788 -165888 -65036 -7893 -241457 122326 30391 238940 -61378 -205525 -52899
18577 40675 246704 -25168 -118908 -414007 127074 -68457 -57659 -101720 72528 -130043 -151422
18566 -151422 -194413 -13692 105060 -29379 -151473 96846 -120352 -95398 397003 122671
$$ packed form
18648h3570r0943D745L6843J10746R0505f2967M199b843A1303J84053d6475k84368
18636c30843I9707e6156B42205q1436C4718c46310b7430j37910j57336B74440
18625a11767B10051f1800k08909q8928i3597B49934b06672d4357D4173P8404a40112
18613A08120a72134b9583j9718I1908h2220r7874A90006b00m2288l00033a32686
18601A32763h7270j70728g2654n5662j98059B7587b56493i6598q0732j75821d0938
18589a58824D3788a65888f5036g893k33564A22326C0391K08549f1378j44147e2899
18577D0675K06029b5168r3740k95099A27074f8457J0798m4061G2528a30043k1379
18566a51422m2991a3692A05060b9379j22094I6846a20352K4954C97003A22671
$$ plain form
18555 -296173 -43345 35806 -56280 -103770 -20532 358041 44433 -91639 -130085 -202348 -256343
18544 -256343 175109 -353333 -122955 -185724 -32337 -160714 -237799 -116366 42375 -129217
18533 -4272 -70148 85199 -57686 -91776 180114 -78211 -417343 188936 -153058 -630614 -19128
18521 137158 309779 -349728 -61484 -143123 107014 248845 -185525 -88579 30601 -101969
18510 235673 -385733 160379 -110210 75606 -17772 -130439 -97686 -277067 219932 31299
18499 -552784 -322314 -57133 -174624 -35837 -80467 -287016 490458 -67636 -59570 -93776 232934
18487 -88927 -251790 113046 34118 18936 149696 -40936 240149 207555 55524 116263 -104005
18475 99165 65971 -305153 -88130 -150075 -44545 -179442 65989 95333 33930 -288828 47114
$$ packed form
18555b96173d3345C5806e6280m7490b0532C58041D4433i1639l8446p2263n3995
18544b56343A75109c53333a22955o2769c2337j28377p7085a16366D2375a29217
18533d272o5876H5199e7686l4090A80114g8211l39132A88936a53058m77556a9128
18521A37158J72621c49728f1484q1639A07014J41831a85525h8579C0601a01969
18510B35673c85733A60379a10210G5606a7772j12667L2753j79381B19932C1299
18499e52784K30470e7133j17491c5837m4630k06549D90458f7636Q066l4206B32934
18487h8927j62863A13046C4118j5182J30760d0936B40149l2594E5524O0739a04005
18475I9165l3194c05153h8130o1945d4545j34897F5989K9344C3930b88828D7114
$$ plain form
18463 -174454 298275 -102705 -133009 -19902 -6854 -71713 -11570 -325199 -127927 -3305 -115521
18452 -115521 -121269 -112829 97481 -43908 58483 -102679 -276880 238840 -59463 151509 33994
18440 -177030 -98029 162039 -202244 -58645 20638 24874 -45985 -206608 91771 92445 -129347
18428 79808 -357234 103258 54582 -73298 -27617 -46843 215810 -18486 -142851 -134973 -194611
18417 -194611 363856 -1286 247550 -262059 -15048 123042 -123905 37426 80336 -170206
18406 142668 -109176 -136402 -174080 62365 100036 32915 110245 617 64975 112096 -93779 205934
18393 31567 -29421 99001 139095 -136729 -12042 -192287 19297 -89153 -273271 236131 -57571
18381 -77275 -257858 -176613 -160379 -170359 -7976 -116416 -195942 68732 153355 195281 -86759 -197162
$$ packed form
18463a74454B98275a02705l0304a9902f854o4859a1570l13629a27927c305j12216
18452a15521n748Q440I7481d3908E8483a02679j74201B38840e9463A51509C3994
18440a77030P9001A62039b02244e8645B0638M236d5985j60623I1771O74a29347
18428G9808c57234A03258m8676g3298b7617j9226B15810a8486j24365P878n9638
18417a94611C63856a286B47550b62059a5048A23042a23905C7426M2910a70206
18406A42668a09176k7226l7678F2365L7671C2915P7330F17O4358M7121i3779B05934
18393C1567b9421I9001M0094a36729a2042j80245A9297h9153j84118B36131e7571
18381g7275j80583Q1245J6234r980g976j08440p9526F8732Q4623M1926h6759j10403
$$ plain form
18369 -197162 -24370 271143 136007 32104 -12931 -32538 207640 -164022 2178 -87286 86778
18357 41798 118719 160987 410593 -84900 -107168 74043 71107 -125749 213739 34186 -115052
18345 -171548 -278491 -128996 -223777 59072 -160620 34663 82698 -31398 -192282 136936
18334 -213775 127920 -54625 -406429 -297570 -16584 49651 -162907 86940 -35792 -274240
18324 -274240 -184861 -109229 23803 -31932 195340 -95878 -167841 102693 -265805 58396 -81794
18312 22585 -174109 -159404 -143015 -157108 123980 -80815 -308623 170810 323560 492017
18302 492017 -167950 -453271 190622 155422 3534 349383 -150727 -57809 192665 -286487
18291 -116121 194568 95523 2020 224047 58279 -86003 137564 -31396 23001 126390 -87344
$$ packed form
18369a97162b4370B71143j35136C2104a2931j9607B07640a64022B178h7286H6778
18357D1798P6921M2268K49606h4900k2268G4043k936a25749B13739C4186a15052
18345a71548j06943a28996r4781E9072a60620C4663M8035c1398j60884A36936
18334b13775A27920e4625l51804J08859a6584D9651a62907H6940c5792k38448
18324b74240Q9379P5632B3803c1932A95340i5878p1963A02693b65805E8396h1794
18312B2585a74109J4705J6389j4093A23980h0815k27808A70810J52750J68457
18302D92017a67950k85321A90622l5200C534L45849a50727e7809A92665b86487
18291a16121A94568I5523B020K22027E8279h6003A37564c1396B3001J03389h7344
$$ plain form
18279 -578022 -26237 -68087 24498 84808 3787 31331 153365 156573 162963 -168005 -127740 -116592
18267 -116592 -39340 -84051 -81216 -164243 46330 -156647 386315 53923 99299 -150820 245175
18255 36720 9924 -641931 -266669 -112540 308265 147279 -543353 -61981 135931 -261329
18244 -62663 31712 -67751 -115800 293785 -63261 99698 8976 400159 -121163 -25781 -88722
18233 -88722 43664 -262182 -200597 -64537 -182907 -171729 -256798 203212 -51458 557379 -231193
18221 -86281 -118344 1647 -300232 -40472 -50990 -73656 128701 -117730 -50127 -16858 -34789
18210 -34789 -46981 97462 -324448 31117 -267133 -44576 170726 153417 6692 134070 -83248
18198 17693 55526 220851 21254 -31536 -68790 5066 -156883 -48274 101655 -204279 -143964
$$ packed form
18279e78022b6237m1850B4498O0310C787K7544J22034L208O390a68005M0265J1148
18267a16592c9340m4711K835q3027D6330a56647C86315E3923M5376a50820B45175
18255C6720I924f41931b66669a12540C08265A47279e43353f1981A35931b61329
18244f2663C1712f7751m8049B93785f3261I9698H976L91183a21163b5781o2941
18233h8722D3664b62182O1585f4537j18370J1178q5069B03212e1458E57379b31193
18221h6281l2063A647c00232d0472j0518k2666A28701a17730e0127a6858j7931
18210c4789j2192I7462c24448C1117b67133d4576A70726j7309F692J27378h3248
18198A7693L7833J65325B1254c1536l7254E066a56883d8274A01655b04279O0315
$$ plain form
18187 -143964 -270914 127133 -308867 22736 72538 -181276 124254 -10843 23099 -133060
18176 -344436 -274138 259719 49686 -74844 -260315 306221 85763 -201457 31368 15695 -163554
18164 51507 -21787 -84779 267781 100670 -21038 -118256 -283190 -21429 221671 -6782 86220
18152 11930 -227444 55546 -38226 -56602 108250 -85996 239078 -51756 -322843 -234221 -230912
18141 -230912 -59736 -9893 81333 -68822 31208 -231833 -197392 307888 -160001 104618 -300292
18129 -76631 -271156 -198274 156354 -285876 -750 126656 -306034 191825 -208574 -348726
18119 -348726 27049 -172039 239506 -110218 -46557 106702 135680 -122782 -185806 -237655
18109 -237655 15612 -70894 -126632 -19008 -249739 253863 -69046 -355795 13095 -134257 -246784
$$ packed form
18187a43964j26950A27133c08867B2736M9802a81276A24254a0843B3099a33060
18176c44436P0298B59719D9686g4844j85471C06221H5763b01457C1368j5673a63554
18164E1507b1787o2992B67781A00670b1038r7218j64934b1429B21671f782H6220
18152A1930b27444E5546c8226j8376A08250h5996B39078e1756k71087Q8622L309
18141b30912e9736i893H1333f8822C1208b31833L4441C07888a60001A04618c00292
18129g6631j94525P2882A56354b85876g50A26656c06034A91825b08574j40152
18119c48726B7049a72039B39506a10218d6557A06702K8978a22782o3024n1849
18109b37655A5612g0894n5738a9008k30731B53863f9046k86749A3095a34257j12527
$$ plain form
18098 -246784 -26475 -45523 -61407 91665 -68948 -174847 58255 -99233 -94261 22769 -89118
18086 -92204 108820 -33121 245040 -352551 65020 -259075 -144630 -444709 -79055 -34145
18075 -485923 -212959 -256260 -214497 -23284 -43132 128480 130152 37820 -102465 -149831 -265490
18064 -265490 -103563 -16215 18695 203060 56203 102492 168579 35242 121606 166683 -20155
18052 -36246 -30534 -36707 117510 369398 -28752 317084 36448 66367 120286 -124219 27329
18040 -340279 81268 42892 9087 248987 -9803 -105783 243827 -184600 318658 209086 26461
18028 -32604 28000 94859 -199241 -59001 148501 105523 14859 104202 165798 147386 21558
18016 -252476 150922 245352 -428184 -300142 -332112 16491 75055 -116029 -187221 -21776 -83960
$$ packed form
18098b46784b6475j9048j5884I1665f8948j05899E8255i9233M972B2769h9118
18086i2204A08820c3121B45040c52551F5020b59075J14445l00079g9055c4145
18075d85923b12959m3301M1763b3284j9848A28480J672C7820a02465m7366j15659
18064b65490a03563a6215A8695J84365E6203M6289O6087C5242Q6364M5077b0155
18052c6246N712o173A17510K51888b8752C17084C6448K9919N3919a24219B7329
18040c40279H1268l8376I087K39900i803r5980B43827a84600C18658j09572B6461
18028c2604B8000O6859a99241e9001A48501m2978A4859Q9343O1596j8412B1558
18016b52476A50922R4430d28184J28042l1970A6491N8564a16029p1192b1776o2184
$$ plain form
18005 -83960 -122204 -7434 -315459 -12433 -45376 -263918 -137787 253464 133016 55916 -45426
17993 -167447 -27981 -421683 -30555 8832 -62803 109998 -173465 -81272 -15860 9636 104285
17982 104285 398517 183662 -204290 300560 253190 -108071 -243268 -281439 -112463 9077
17971 -45422 -47165 89377 24124 -362795 -36260 -83153 196355 42829 117729 -239427 34867
17959 -112953 186508 -70544 18772 88742 221327 144753 141991 -66046 -205206 -43239 -64214
17948 -64214 -5678 90312 -213818 243021 -108321 -208281 12719 15078 172822 25299 -90646
17936 69724 -113129 -141718 95328 -358463 169393 -360913 -181222 19074 -126232 -240148
17926 -240148 -126180 -209496 -235159 -139753 117195 207211 315551 -23646 33593 101554 246170
$$ packed form
18005h3960l8244g434l08025a2433l2943k18542J26131B53464j20448E5916d5426
17993a67447b7981l93702c0555H832f2803A09998a73465h1272a5860I636R4649
17982A04285K94232A83662b04290C00560m7370a08071j35197l8171a12463I077
17971d5422j743H9377B4124c62795c6260m6893A96355D2829P4900b39427C4867
17959a12953A86508g0544A8772O9970J32585p6574k762f6046j39160d3239k0975
17948f4214e678I0312b13818B43021a08321r9960A2719K359J57744B5299i0646
17936F9724a13129k8589I5328c58463A69393c60913J79691A9074a26232j13916
17926b40148J13968q3316k5663R5406A17195R0016J08340b3646C3593O7961J44616
$$ plain form
17915 246170 138927 -231891 -31086 -278393 -141126 158297 -6372 -29355 -299574 -113931
17904 -17462 -96789 -31335 -180664 149386 440641 16537 -112011 -150521 -357456 -82534 75617
17892 177817 308377 11498 -40647 62382 -94596 -6683 -108633 255054 -89243 114150 114782
17881 114782 -332582 -120832 -66372 47296 -169971 -170202 -143197 -118317 -118140 177764 -40923
17869 -197631 327233 277004 -96495 295985 205270 -172648 -5252 -310787 216677 89532 -68609
17857 67129 -52093 57666 60846 -68850 255231 -47019 122573 65473 -55600 -240226 247454
17845 43677 -355386 11002 163113 -191684 -195029 92501 148865 -9685 -95653 134799 -80866
17833 26680 210571 -22466 -454540 284376 253620 99805 -25280 -40353 20003 369143 -110749
$$ packed form
17915B46170j07243b31891c1086k47307J37267A58297f372k2983k70219a13931
17904a7462p9327c1335j49329A49386K91255A6537a12011l8510k06935h2534G5617
17892A77817J30560A1498d0647F2382i4596f683j01950B55054h9243A14150O32
17881A14782c32582a20832N4460D7296a69971k31K7005K4880J77A77764d0923
17869a97631C27233n0229i6495B95985r0715a72648e252l05535B16677H9532f8609
17857F7129e2093E7666L180f8850B55231d7019A22573n7100e5600j84626B47454
17845D3677c55386A1002J52111a91684l345I2501N6364i685q5968A34799h0866
17833B6680J83891b2466m32074B84376l0756I9805b5280j5073B0003L49140a10749
$$ plain form
17821 261692 58305 -159083 -206746 -158027 61556 -156372 -188606 173615 732 -212889 -44846
17809 259563 113114 93902 53027 162809 -131396 -198102 -104982 206051 246291 369532
17799 369532 51091 -7333 12143 24801 -91853 167011 86026 30906 -105043 229267 -115860
17787 -169366 341007 -147829 -100439 31746 -34432 505240 34578 136834 463640 -33886
17776 228654 -16841 37796 -74740 -25274 -82407 -158579 61526 137895 106496 289529 99377
17764 -51616 284243 -64124 164330 51440 40483 -82648 -177478 -214152 185719 82481 56240
17753 56240 106480 109957 -55018 -254635 -14011 -164264 -68156 129649 34796 42304 -302242
17741 63120 50267 -355625 238403 -330073 -53012 -102215 38146 -97546 150592 107317 3121
$$ packed form
17821B61692E8305a59083m7663M8719F1556a56372l2234A73615G32b12889d4846
17809B59563A13114j9212m0875J09782a31396o6706R3120B06051M0240J23241
17799C69532E1091g333A2143J2658i1853A67011q0985C0906a05043B29267a15860
17787a69366C41007a47829M7390C1746c4432E05240C4578J02256L26806c3886
17776B28654a6841C7796g4740b5274n7133p6172F1526P6369l1399J83033I9377
17764e1616B84243f4124A64330E1440j0957h2648r4830l6674A85719H2481k6241
17753E6240N0240L477e5018j99617a4011j50253f8156A29649C4796P508c02242
17741F3120j2853c55625B38403c30073e3012m9203C8146i7546A50592m3275C121
$$ plain form
17729 84954 -80475 146991 79469 147401 19134 -14977 -114233 -96415 12411 8723 32300 38009
17717 38009 162573 -110494 174528 -206591 -82261 -25718 362018 38113 -28694 52976 -179491
17705 222626 112138 -31842 209797 214323 -95728 -44782 -117375 72681 -113800 -192436 -174201
17694 -174201 -318481 95184 151052 -110066 -418949 -65782 -183952 -153904 -160152 -367495 391866
17682 456434 -11669 183022 -36264 -111270 150769 76500 36543 -220453 67840 48376 21346
17670 -55064 32974 55038 178397 -56588 -304690 46986 -39555 -71998 84731 248239 9744
17658 -73112 -165588 218417 56104 -173142 -108276 -223440 -174002 144199 168909 200134 149166
17647 149166 510150 102351 201155 118683 426810 225407 149808 107749 104007 -240467 -335213
$$ packed form
17729H4954h0475A46991o7522O7932A9134a4977r9256J7818A2411l688K3577N709
17717C8009J24564a10494A74528b06591h2261b5718C62018C8113b8694E2976a79491
17705B22626j10488c1842B09797M526i5728d4782p2593G2681a13800p8636J8235
17694a74201j44280I5184N5868a10066l08883f5782j18170L0048o248k07343C91866
17682D56434a1669A83022c6264p5006A50769p4269C6543b20453F7840j9464B1346
17670e5064C2974K2064J23359e6588k48102D6986c9555l2443H4731J63508I744
17658g3112r2476B18417E6104a73142O4866j15164M9438A44199K4710L1225n0968
17647A49166L60984A02351R8804q2472L08127k01403p5599m2059l742b40467r4746
$$ plain form
17636 -335213 280161 55496 -394132 65579 -208385 135044 47575 -132 -163826 138960 269158
17625 269158 109162 86408 118291 414479 69694 -138237 230101 157140 77556 -3063 105592
17613 -29324 228545 30170 -37325 302652 -136753 -78448 65669 -140628 -201469 -163826 44544
17601 -100731 85879 230637 421992 79330 302161 -42640 151777 -59221 -310298 592859
17590 -64619 88422 32585 202848 457194 124234 -193108 178861 -14719 -211535 73177
17579 -215539 385560 187666 163410 123938 43036 269309 152581 16937 359162 -240427
17568 -170680 210703 297952 65230 76808 134539 -67829 73671 -64953 -83839 233051 132503
17557 132503 -87329 -222722 -173774 77773 57051 166141 -90858 241116 -216743 14914 -85350
$$ packed form
17636c35213B80161E5496c94132F5579b08385A35044D7575a32j63694A38960J30198
17625B69158A09162k2754L1883K96188F9694a38237B30101p2961G7556c063A05592
17613b9324B28545C0170c7325C02652a36753N8305F5669a40628o0841L7643D4544
17601a00731H5879J44758J91355G9330K22831d2640A51777e9221k51077E92859
17590f4619H8422C2585J70263K54346A24234a93108A78861a4719j96816G3177
17579b15539C85560A87666k4256l9472D3036K26273j16728A6937L42225b40427
17568a70680B10703Q7249F5230J1578N7731f7829G3671f4953j8886B33051j00548
17557A32503h7329j35393M8948G7773k0722J09090i0858B41116b16743A4914h5350
$$ plain form
17545 17973 73788 -117643 -16753 17133 216738 231885 -91260 -289069 -238966 -267408 -34181
17533 112799 -136981 68240 -172887 -101204 -46363 203624 16684 301853 -93074 39223 35970
17522 35970 -218612 278666 -20030 179638 58474 234973 103051 244712 -109790 5494
17511 133498 173318 379294 96177 -228378 119355 82550 341528 -53122 207670 399144
17501 399144 -16088 246787 196409 265900 -171533 150912 376498 49501 153973 95390
17491 95390 -17762 -61684 169976 -22075 386485 77153 209383 -56672 177199 90310 6527
17479 22013 -30971 195477 45949 -79484 327725 -101809 325384 51610 307123 15521 80820
17468 80820 203882 -151974 417836 20890 87254 107288 337758 269401 13011 -78091 -69365
$$ packed form
17545A7973N5815a17643a6753A7133J99605J5147i1260j97809N0103k8442c4181
17533A12799a36981F8240a72887P1683d6363B03624A6684K85169i3074C9223l253
17522C5970b18612B78666b0030A79638E8474J76499A03051J41661a09790E494
17511A33498L9820K05976I6177b28378A19355l6805K58978e3122B07670J91474
17501C99144a6088B46787n0378O9491a71533A50912K25586D9501J04472n8583
17491I5390a7762m3922A69976b2075C86485G7153J32230e6672A77199q6889F527
17479B2013c0971A95477D5949g9484C27725a01809C25384E1610K55513A5521O5299
17468H0820J23062a51974D17836B0890O6364K0034K30470o8357A3011g8091Q726
$$ plain form
17457 -69365 248891 369001 192574 338153 408225 205601 326173 269226 194341 236294
17447 236294 391537 112715 298966 363383 -213764 370107 191657 -55761 355601 -33575
17436 387660 284256 110327 370152 -92215 317105 311824 219314 688281 151740 303363
17426 303363 207843 308151 271833 65132 308225 93082 301974 227570 229650 8343 131770
17415 131770 -16190 361947 260636 119239 166763 338498 141714 111912 472126 -4400
17404 -169254 112379 197951 80164 269947 517397 119381 145795 196679 23121 -41800 174438
17392 53781 162997 -154896 139425 161915 -29089 268701 546831 142610 -79606 -41753
17382 -41753 121662 19794 140180 107124 -66294 262500 -73211 132902 403336 -123247
$$ packed form
17457f9365B48891J20110j76427J45579P0072k02624J20572n6947p4885M1953
17447B36294J55243A12715J86251O4417b13764C70107j78450e5761C55601c3575
17436C87660j03404A10327K59825i2215C17105n281r2510M68967A51740J51623
17426C03363r5520J00308l6318F5132K43093I3082K08892p4404K080H343J23427
17415A31770a6190C61947j01311A19239M7524J71735A41714k9802L60214d400
17404a69254A12379Q5572H0164J89783K47450A19381K6414N0884B3121d1800A74438
17392E3781J09216a54896A39425K2490b9089B68701K78130A42610g9606L7853
17382d1753A21662A9794J20386l3056f6294B62500g3211A32902K70434a23247
$$ plain form
17371 155710 385476 152118 212834 311076 144008 -175557 -98360 -81346 -6556 76168 234667
17360 234667 177508 7433 53844 -1982 167941 -46750 314097 192646 308864 -54903 123476
17348 -69077 -13128 267368 64976 224170 286451 158815 259491 83686 173363 284781 187520
17337 187520 -82700 130995 211018 1383 945 97010 185996 158087 115757 182861 280453 125185
17324 475095 -49401 114768 -31860 853 -56010 143693 525409 421771 300187 -16598 -138025
17313 -138025 216276 5192 442711 229724 178295 541123 145502 568507 293679 216046
17303 216046 267696 236733 89513 -3697 73505 -136243 -1585 270584 382552 -105703 196510
17291 -11426 -355378 228508 108458 228428 -102536 -44323 311984 222000 280024 74901
$$ packed form
17371A55710K29766A52118O0716R8242A44008a75557P7197J7014f556G6168J58499
17360B34667n7159G433M6411a982A67941d6750C14097j21451J16218e4903A23476
17348f9077a3128B67368F4976J59194O2281j27636J00676H3686Q9677J11418r7261
17337A87520h2700A30995Q0023A383m38R6065Q8986k7909m2330O7104R7592A25185
17324D75095d9401A14768c1860H53e6010A43693L81716j03638j21584a6598j21427
17313a38025B16276E192M37519k12987n1429L62828A45502M23005k74828p7633
17303B16046N1650l0963H9513c697G3505a36243a585B70584J11968a05703A96510
17291a1426l43952B28508A08458J19970a02536d4323C11984q9984N8024G4901
$$ plain form
17280 309638 346701 23513 101479 -41892 169312 339061 -10855 158588 -59691 320960 127959
17268 98710 147881 365021 19824 141559 358651 273404 94335 -98610 -73287 91844 173297
17257 173297 81381 108623 71901 588392 96665 163958 157137 284980 47850 119007 -14449
17245 -33480 547367 167419 259820 96206 266468 256636 433769 313844 145234 143240 327043
17234 327043 483817 48394 83384 18653 154448 -130658 -68579 303183 -162617 249171
17223 134513 43921 384153 362666 279502 142703 154549 581513 -15173 222464 3002 190288
17212 190288 80235 364103 189130 241654 237993 279754 -71492 113394 183225 278858 353161
17201 353161 134443 251941 213519 99282 -73010 265062 -210763 447376 329498 42337
$$ packed form
17280C09638L7063B3513P7966d1892A69312J69749a0855A58588e9691C20960A27959
17268I8710M9171K17140A9824J21735K17092q5247I4335i8610K5323I1844Q1453
17257A73297H1381K7242l6722N16491I6665O7293o821J27843D7850P1157a4449
17245c3480E47367A67419R2401I6206J70262r832J77133j19925A45234j994J83803
17234C27043J56774D8394L4990A8653J35795a30658O2079C03183a62617B49171
17223A34513D3921L40232k1487q3164j36799J1846M26964a5173B22464C002J87286
17212A90288H0235K83868j74973N2524l661M1761g1492A13394O9831R5633P4303
17201C53161A34443J17498l8422I9282g3010B65062b10763D47376j17878D2337
$$ plain form
17190 220579 161554 261980 332935 243260 212959 57366 544679 469783 439689 454380 289537
17179 289537 480005 374355 88164 345702 289786 255621 182950 129843 225217 291748 458794
17168 458794 392969 410827 320365 247527 171200 149456 250704 319821 37708 263591 256839
17157 256839 344123 70200 149926 548445 265648 53287 83630 663566 290719 433523
17147 433523 702404 400175 421043 208935 332560 227452 250544 217856 249987 424936
17137 424936 431704 560236 225677 70893 186426 589992 329038 16488 273102 532644
17127 532644 125484 214859 349847 310213 100255 167524 171781 223678 367329 448047 254653
17116 254653 407899 494042 309068 662662 788325 521334 261038 357173 238954 340050
$$ packed form
17190B20579n9025J00426P0955q9675l0301E7366M87313p4896l0094J4691j64843
17179B89537J90468j05650H8164K57538n5916l4165p2671n3107R5374O6531J67046
17168D58794o5825J7858r0462p2838p6327k1744J01248O9117C7708K25883o752
17157B56839Q7284G0200P9726L98519B65648E3287L0343N79936B90719J42804
17147D33523K68881l02229K0868B08935J23625j05108K3092l2688L2131J74949
17137D24936O768J28532B25677G0893J15533M03566k60954A6488K56614K59542
17127E32644A25484Q9375J34988l9634A00255O7269M257N1897J43651Q0718j93394
17116B54653J53246Q6143j84974L53594J25663k66991k60296R6135j18219J01096
$$ plain form
17106 340050 406825 499246 453867 546945 584638 585377 395020 695032 171141 467215 550264
17095 550264 551903 665683 530397 477106 259682 665176 272205 386223 357589 395097
17085 395097 698981 353655 632903 756675 490736 575885 551111 331262 481045 651436
17075 651436 373783 549500 473782 490627 429654 658088 383757 694780 256413 587250
17065 587250 321025 484303 118938 413327 786167 506943 238083 544554 326703 778705
17055 778705 470790 452987 608590 659437 228921 223848 521953 724119 347011 323961
17045 323961 232085 777776 237660 576725 764644 426408 453657 447502 633960 221859
17034 361576 831148 586369 422924 629201 927590 458150 778836 353947 523382 823800
$$ packed form
17106C40050O6775R2421m5379R3078L7693P39j90357L00012A71141K96074Q3049
17095E50264J639J13780j35286n3291k17424M05494B72205J14018k8634L7508
17085C95097L03884l45326K79248J23772k65939Q5149k4774k19849J49783J70391
17075F51436k77653J75717p5718J6845o0973K28434k74331L11023B56413L30837
17065E87250k66225J63278A18938K94389L72840k79224B38083L06471k17851M52002
17055G78705l07915j7803J55603N0847B28921n073K98105K02166C47011k3050
17045C23961r1876N45691B37660L39065J87919l38236K7249o155J86458B21859
17034C61576M69572k44779j63445K06277K98389D58150L20686C53947J69435L00418
$$ plain form
17024 823800 836592 437315 216022 661016 921725 898923 708027 733421 669237 474987
17014 474987 864025 385713 404802 788847 429215 716355 396049 366971 473781 851007
17004 851007 387453 488433 549849 658398 771096 562772 628760 511038 774362 655296
16994 655296 1032116 854629 743494 848778 807709 821584 770096 771119 846184 857948 730471
16983 730471 725624 729703 790797 1015133 853673 794249 848598 639710 579761 680165 814586
16972 814586 595340 1028199 1233342 860558 1252877 1198447 1082481 1014796 677650 970962
16962 970962 972700 1104692 1197254 1023718 878892 942696 1061514 1191477 917507 1009127
16952 1009127 1230509 794624 1120398 1124350 1118942 893457 1201020 968722 856662 1455574
$$ packed form
17024H23800J2792l99277B16022M44994K60709k2802j90896K5394o4184j94250
17014D74987L89038C85713J9089L84045l59632K87140l20306k9078J06810L77226
17004H51007C87453J00980O1416J08549J12698k08324O5988j17722K63324j19066
16994F55296L76820j77487j11135J05284m1069J3875n1488J023P5065J1764j27477
16983G30471m847M079O1094K24336j61460n9424N4349k08888n9949J00404J34421
16972H14586k19246M32859K05143l72784L92319n4430j15966o7685l37146K93312
16962I70962J738J31992R2562j73536j44826O3804J18818J29963k73970R1620
16952A009127K21382m35885L25774L952n408k25485L07563k32298j12060N98912
$$ plain form
16942 1455574 988380 1162084 1066929 990454 1049293 1219335 1096415 1155312 1443361 1367935
16932 1367935 1171146 1269247 1164448 1092145 1083637 1184927 1360645 1240585 1267548 1240232
16922 1240232 1091638 1176708 1446544 974496 1357512 1295105 1315842 1488731 1665515 1549669
16912 1549669 1841347 1641963 1532445 1670590 1298954 2060361 1635098 1734091 1730192 1485704
16902 1485704 1818612 1417836 1731338 1660366 1603330 1957736 1488320 1912534 1950472 1643536
16892 1643536 2072476 1686702 1553942 1922649 1568460 2019932 1800083 1981957 1782710
16883 1782710 1932999 2077552 2096658 2011164 2239339 2172930 2234145 2301078 2191119 2060756
16873 2060756 2134011 2350358 2140327 2598543 2231553 2477822 2447090 2830011 2342555 2479738
$$ packed form
16942A455574m67194J73704r5155p6475N8839J70042j22920N8897K88049p5426
16932A367935j96789R8101j04799p2303q508J01290J75718j20060K6963k7316
16922A240232j48594Q5070K69836m72048L83016o2407K0737J72889J76784j15846
16912A549669K91678j99384j09518J38145l71636P61407m25263R8993l899k44488
16902A485704L32908m00776L13502p0972n7036L54406m69416M24214L7938l06936
16892A643536M28940l85774j32760L68707l54189M51472k19849J81874j99247
16883A782710J50289J44553J9106q5494K28175o6409O1215O6933j09959j30363
16873B060756P3255K16347k10031M58216l66990K46269l0732L82921m87456J37183
$$ plain form
16863 2479738 2566747 2471390 3012510 2755151 2980719 2957675 2633357 2854759 2708470 2853018
16853 2853018 3210296 2962693 3249623 3294476 3291468 3308876 3475816 3121696 3070620 3464549
16843 3464549 3830218 3428411 3507345 3744203 3476406 3543027 3850607 3989766 4202565 3919181
16833 3919181 4270130 4246866 4301411 4582002 4249578 4226592 4480033 4776845 4925379 4836751
16823 4836751 5057162 5067455 4936879 4916195 5165726 5183101 5352808 5459189 5350700 5722094
16813 5722094 5962241 5732114 5845633 5924499 6225161 6688283 6799965 6547779 6789053 6613833
16803 6613833 6892299 7115632 7429844 7910071 7371628 7922961 8347048 8140560 8542586
16794 8542586 8739563 9054720 9322140 9196049 9607460 9845557 10276579 10484002 10605093
$$ packed form
16863B479738Q7009r5357N41120k57359K25568k3044l24318K21402j46289J44548
16853B853018L57278k47603K86930M4853l008J7408J66940l54120n1076L93929
16843C464549L65669m01807P8934K36858k67797O6621L07580J39159K12799k83384
16833C919181L50949k3264N4545K80591l32424k2986K53441K96812J48534q8628
16823D836751K20411J0293j30576k0684K49531J7375J69707J06381j08489L71394
16813E722094K40147k30127J13519P8866L00662M63122J11682k52186K41274j75220
16803F613833K78466K23333L14212M80227n38443N51333M24087k06488M02026
16794H542586J96977L15157K67420j26091M11411K38097M31022K07423J21091
$$ plain form
16785 10605093 10816980 11277970 11475705 12020522 12111663 12724812 12996330 13344177 13521223
16776 13521223 14063834 14416537 15081756 15336954 16343114 16835320 17204024 18050170 18352279
16767 18352279 18704679 19727436 20278846 21086804 21979867 22662700 23844145 24338829 25576816
16758 25576816 26383925 27587281 28706699 29928971 31135600 32572702 34391684 35763418
16750 35763418 37650849 39199200 41070230 42865352 45189248 47392366 49894311 52962269
16742 52962269 55812892 58828288 61899220 65637313 69245089 73389643 77933201 82722676
16734 82722676 87549743 92982246 98670378 104575580 111050963 117590538 124668139 131354005
16726 131354005 139088741 146613857 153967152 161353665 168442297 175133569 181316747 186302407
$$ packed form
16785A0605093K11887M60990J97735N44817R1141O13149K71518L47847J77046
16776A3521223N42611L52703O65219K55198J006160M92206L68704Q46146L02109
16767A8352279L52400J022757N51410Q07958Q93063O82833J181445M94684J237987
16758B5576816Q07109J203356J119418J222272J206629J437102J818982J371734
16750C5763418J887431J548351J871030J795122K323896K203118K501945L067958
16742E2962269K850623L015396L070932L738093L607776M144554M543558M789475
16734H2722676M827067N432503N688132N905202O475383O539575P077601O685866
16726A31354005P734736P525116P353295P386513P088632O691272O183178M985660
$$ plain form
16718 186302407 190230880 193248192 195037000 195636239 194061542 192092796 188104001 183935603
16710 183935603 178095183 171559653 164885747 157120787 149673723 141935767 134143614 126958181
16702 126958181 119566743 112574894 105614250 99557077 93346307 87916588 82480806 77641958
16694 77641958 73133507 68926785 64794020 61143777 57907260 54592109 51525965 48680689
16686 48680689 46394603 43963336 41294877 39508364 37815506 35825998 33888737 32731190
16678 32731190 31324085 29767130 28215628 26946867 26218235 24945408 24012265 22812739
16670 22812739 22157964 21460332 20030298 19455760 18640215 18054722 17498306 17050450 16159799
16661 16159799 15599137 14994911 14560625 13851149 13834038 13362169 13211534 12272084 11961358
$$ packed form
16718A86302407L928473L017312J788808N99239j574697j968746l988795m168398
16710A83935603n840420o535530o673906p764960p447064p737956p792153p185433
16702A26958181p391438o991849o960644o057173o210770n429719n435782m838848
16694G7641958m508451m206722m132765l650243l236517l315151l066144k845276
16686D8680689k286086k431267k668459j786513j692858j989508j937261j157547
16678C2731190j407105j556955j551502j268761p28632j272827r33143j199526
16670B2812739o54775o97632j430034n74538q15545n85493n56416m47856q90651
16661A6159799n60662o04226m34286p09476j7111m71869j50635r39450l10726
$$ plain form
16652 11961358 11430704 11134013 10920885 10374891 10083678 10137749 9547373 9566477 9640545 9136305
16642 9136305 8776023 8536298 8582983 8157068 7626883 7454488 7194700 7348157 7008987 6974953
16632 6974953 7184839 6316901 6578829 6140252 6273335 6122650 5447667 5743807 5450428
16623 5450428 5440395 5393789 5005965 4852647 5032242 5035798 4695333 4622217 4770322 4646176
16613 4646176 4347004 4371132 4418878 4137525 4194339 3812489 3808926 3897710 3714104 3392377
16603 3392377 3805714 3339208 3761777 3390684 3282263 3334904 3425139 3042744 3138635 2830362
16593 2830362 2919885 2943875 3195328 2578855 2807140 2663341 2800725 2665944 2483764 2563252
16583 2563252 2327287 2497822 2507348 2395493 2201963 2455304 2324548 2285477 2071883 2463753
$$ packed form
16652A1961358n30654k96691k13128n45994k91213N4071n90376J9104P4068n04240
16642I136305l60282k39725M6685m25915n30185j72395k59788J53457l39170l4034
16632F974953K09886q67938K61928m38577J33083j50685o74983K96140k93379
16623E450428j0033m6606l87824j53318J79595L556l40465p3116J48105j24146
16613D646176k99172K4128M7746k81353N6814l81850l563Q8784j83606l21727
16603C392377M13337m66506M22569l71093j08421N2641R0235l82395R5891l08273
16593B830362Q9523K3990K51453o16473K28285j43799J37384j34781j82180P9488
16583B563252k35965J70535R526j11855j93530K53341j30756l9071k13594L91870
$$ plain form
16573 2463753 2345849 2033768 2359418 1990791 2206375 1988148 2086325 1908014 1822993 1729877
16563 1729877 1627469 1875063 2017227 1682333 1621022 1647324 1789808 1906000 1434048 1736765
16553 1736765 1740734 1337829 1533563 1424696 1498312 1254395 1466699 1490809 1196172 1354167
16543 1354167 1576075 1326797 1263179 1061168 1153237 1122454 1518231 1552513 1424074 1185302
16533 1185302 1065352 1442953 1238095 1363397 1080610 1387028 932936 1201414 1030475
16524 1030475 1231037 1262200 1084700 1038055 906143 971683 1149791 1336637 617426 945612
16514 945612 776032 831628 1012116 1079898 762672 1020163 739169 841144 1104822 1114403
16504 1114403 785390 768427 948454 902938 721305 924630 742643 1042157 663201 910091
$$ packed form
16573B463753j17904l12081L25650l68627K15584k18227R8177j78311q5021r3116
16563A729877j02408K47594J42164l34894o1311K6302J42484J16192m71952L02717
16553A736765L969m02905J95734j08867P3616k43917K12304K4110k94637J57995
16543A354167K21908k49278o3618k02011R2069l0783L95777L4282j28439k38772
16533A185302j19950L77601k04858J25302k82787L06418m54092K68478j70939
16524A030475K00562L1163j77500m6645j31912O5540J78108J86846F17426L28186
16514I45612j69580N5596J80488O7782l17226K57491k80994J01975K63678R581
16504A114403l29013j6963J80027m5516j81633K03325j81987K99514l78956K46890
$$ plain form
16494 910091 662985 806445 805088 788969 946143 780925 739723 688217 817079 771693 758296
16483 758296 627766 933153 774564 708915 696574 799206 548208 556074 598621 507287 432597
16472 432597 694311 560680 823417 679865 628260 393608 830264 589253 782130 465696
16462 465696 431722 525692 680314 837305 501972 653293 489884 626737 538432 644549
16452 644549 624016 646517 421159 474569 378740 832040 679613 344477 414635 790903
16442 790903 600440 472521 463818 644094 508713 405926 343675 281586 473553 573170
16432 573170 559221 257279 477878 204200 59575 414505 355424 364525 -35921 214029 260531
16421 260531 405849 567532 436872 230040 67517 499096 521996 551281 407758 339948
$$ packed form
16494I10091k47106J43460j357j6119J57174j65218m1202n1506J28862m5386j3397
16483G58296j30530L05387j58589o5649j2341J02632k50998P866M2547r1334p4690
16472D32597K61714j33631K62737j43552n1605k34652M36656k41011J92877l16434
16462D65696l3974R3970J54622J56991l35333J51321j63409J36853q8305J06117
16452F44549k0533K2501k25358N3410r5829M53300j52427l35136P0158L76268
16442G90903j90463j27919q703J80276j35381j02787o2251o2089J91967R9617
16432E73170j3949B57279K20599B04200E9575L54930n9081R101c5921B14029M6502
16421B60531J45318J61683j30660k06832F7517M31579K2900K9285j43523o7810
$$ plain form
16411 339948 409262 482229 568880 182736 315775 65810 413775 32681 287971 367233 321893
16400 321893 542195 168121 446516 372442 462434 600171 522797 266824 424187 121702
16389 317952 502218 438779 74410 394665 368143 -409928 485225 454743 22630 79552 346065
16378 346065 457362 367622 346863 409634 189828 321839 482264 434677 24074 546564
16368 546564 15772 451423 340426 -183333 494191 481690 -85985 176040 330967 233467
16358 233467 397950 510412 165499 63134 106695 351045 423973 -16672 -42505 252361
16347 106284 377212 -178908 182191 106797 248746 86604 287801 425540 119411 451965
16337 451965 -76736 326360 154644 126173 336968 -63343 222911 137921 396341 -114695
$$ packed form
16411C39948O9314P2967Q6651A82736J33039F5810L47965C2681K55290P9262m5340
16400C21893K20302A68121K78395p4074Q9992J37737p7374k55973J57363A21702
16389C17952J84266o3439G4410L20255k6522d09928D85225l0482B2630N6922K66513
16378C46065J11297q9740k0759O2771A89828J32011J60425m7587B4074N22490
16368E46564A5772M35651j10997a83333D94191j2501h5985A76040J54927r7500
16358B33467J64483J12462A65499F3134M3561K44350P2928a6672k5833B52361
16347A06284K70928a78908A82191p5394J41949H6604K01197J37739A19411L32554
16337D51965g6736C26360A54644k8471K10795f3343B22911q4990K58420a14695
$$ plain form
16326 108130 -41915 454626 123488 253437 192194 375155 183243 333588 560917 93354
16315 431112 190116 106042 210522 58952 369354 -9351 327225 -266398 37369 -64370 308464
16303 281113 88657 236454 -49682 257994 379471 253423 376088 28715 108851 206851
16293 206851 110772 199949 8810 -85786 35468 42374 36423 198449 166610 85264 78860 291090
16281 291090 201369 263485 148459 126309 259418 -34040 445447 87408 -68134 105808 -364923
16269 -2868 -264395 -121162 -15395 31657 149722 80974 69666 45741 -14636 153132 310454
16258 310454 32826 243392 295052 -206353 -86547 -33930 156227 95919 -16806 285300 314303
16247 314303 316578 -161789 -150893 -100264 194975 185619 -24023 65943 203488 222960 -82392
$$ packed form
16326A08130d1915D54626A23488J29949o1243J82961A83243J50345K27329I3354
16315D31112A90116q4074J04480E8952L10402i351C27225b66398C7369f4370C08464
16303B81113H8657J47797d9682B57994J21477j26048J22665B8715Q0136R8000
16293B06851r6079Q9177H810h5786C5468O906n951J62026l1839q1346o404K12230
16281B91090q9721O2116j15026k2150J33109c4040D45447H7408f8134A05808c64923
16269b868k61527a21162a5395C1657J18065o8748j1308k3925a4636A53132J57322
16258C10454C2826K10566N1660b06353h6547c3930A56227o0308a6806B85300K9003
16247C14303K275a61789J0896N0629A94975r356b4023F5943J37545J9472h2392
$$ plain form
16235 -25348 170453 -9787 -74045 314891 163069 -171195 168467 81952 39827 283100 -113387
16223 80574 195209 -35976 143902 -116552 146049 193556 84819 -52895 260505 328493 339026
16212 339026 67503 -135874 -98588 123668 -115603 -51030 -133902 -165698 20048 228758 82723
16200 -370617 136149 198394 -56744 -106116 -11298 -298717 114176 234992 156900 -96533 -94507
16189 -94507 -116593 182341 39312 58 41569 121743 72586 -47970 155496 -430411 -106603
16177 -191073 -267405 -84216 -354510 -146895 -183690 155933 195064 -35634 18075 -21601 102152
16165 225370 34487 60664 59031 102388 235705 -88044 86856 -124218 -201758 -215750 207163
16153 -172413 114911 -51658 30790 -92331 195457 -32437 -48857 -2507 -154190 -247281 6476
$$ packed form
16235b5348A70453i787o4258C14891j51822a71195A68467H1952C9827K43273a13387
16223H0574J14635c5976A43902a16552A46049M7507H4819e2895B60505O7988J0533
16212C39026F7503a35874L7286A23668a15603e1030q2872l1796B0048K08710H2723
16200c70617A36149O2245e6744m9372a1298k87419A14176J20816p8092i6533K026
16189i4507k2086A82341C9312E8M1511Q0174m9157d7970A55496d30411a06603
16177a91073p6332h4216k70294a46895l6795A55933L9131c5634A8075b1601A02152
16165B25370C4487K6177j633M3357J33317h8044H6856a24218p7540j3992B07163
16153a72413A14911e1658C0790i2331A95457c2437j6420b507j51683r3091F476
$$ plain form
16141 -185734 -2256 71332 112560 70225 109812 -40673 36542 67932 195963 -217815 -144912
16130 -144912 155508 -21985 232152 -240201 -40573 -144928 91512 223929 -102354 23545
16119 21208 -334830 99851 334687 -70915 156501 -44093 79309 -70123 -89942 109981 -139337
16107 -79833 80020 193210 172475 -93905 126344 -163880 -63067 -224617 233764 -182301
16096 18005 -57090 304310 -1980 30246 112120 261498 -208338 33873 -31846 -84209 50841
16084 -78713 -92962 -131637 281911 -73811 -155441 -168040 72553 144280 255045 -74807 181520
16072 39395 -23004 12120 28815 9689 -50166 113940 -74732 -68267 -12828 -256533 109199
16060 -176616 346032 -119608 -261281 -150599 355330 106998 30327 164350 -175514 -155264
$$ packed form
16141a85734b256G1332M1228m2335L9587d0673C6542L1390J28031b17815P2903
16130a44912A55508b1985B32152b40201d0573j04355I1512J32417a02354B3545
16119B1208c34830I9851K34836g0915A56501d4093G9309g0123j9819A09981a39337
16107g9833H0020J13190k0735i3905A26344a63880f3067j61550B33764a82301
16096A8005e7090C04310a980C0246Q1874J49378b08338C3873c1846n2363E0841
16084g8713j4249l8675B81911g3811q1630j2599G2553P1727J10765g4807A81520
16072C9395b3004A2120J6695I689e0166A13940g4732O465a2828k43705A09199
16060a76616C46032a19608j41673J10682C55330A06998C0327J34023a75514K0250
$$ plain form
16050 -155264 -184497 94540 -176533 200113 -239447 -142763 -300135 -70114 -89410 269207
16039 53496 -90600 -359091 -23254 351758 21897 178012 -103238 146441 6543 301897 157002
16028 157002 86308 -85335 24688 92287 83509 -98793 97254 -149687 75693 -65514 -180305
16017 -180305 320404 -147733 -275800 15514 -23451 42244 -39511 -272326 -277936 -56042 -15216
16005 -265505 3280 -49153 105035 -106984 82603 3552 -248675 -66690 172492 69685 -216699
15993 148891 303289 -178782 115393 186514 -75485 -205445 374852 127925 73401 153593
15983 153593 294257 394799 480363 46853 216107 -111126 165116 187750 359291 -114382
15972 15197 -48581 49798 -47409 119271 -117728 215857 104719 -163307 71055 50194 -249927
$$ packed form
16050a55264k9233I4540a76533B00113b39447R6684j57372g0114j9296B69207
16039E3496i0600k68491b3254C51758B1897J56115a03238A46441F543K95354j44895
16028A57002p0694h5335B4688O7599q778i8793I7254a49687G5693f5514j14791
16017a80305C20404a47733j28067A5514b3451D2244c9511k32815n610e6042a5216
16005b65505C280d9153A05035a06984H2603C552b48675f6690A72492F9685b16699
15993A48891J54398a78782A15393P1121g5485j29960C74852A27925n4524Q0192
15983A53593J40664J00542Q5564D6853J69254a11126A65116K2634J71541a14382
15972A5197d8581D9798d7409A19271a17728B15857A04719a63307G1055k0861b49927
$$ plain form
15960 -32326 67892 -265719 -299125 -306895 433914 -86368 63039 31755 122018 73759 64277 -307806
15947 183386 198469 -256556 -42449 -362558 -176238 -137024 -42273 -115659 90220 -204317 297762
15935 43449 -30641 63264 94972 147080 92343 53556 -235088 -2319 -77442 -127179 -95685 164518
15922 -13991 74415 -265966 -139459 134057 -267008 368633 69300 -257356 -116451 114551
15911 106294 -194673 -392498 -67139 70833 -7821 54130 -270307 -121171 179120 -53026 146298
15899 83759 -299255 -56433 -138692 -258327 24312 80 -12060 84702 153573 -187983 -31803 -157943
15887 -157943 115207 69575 14578 -111084 -90243 -237102 -14083 163 70247 -191480 62338
15875 221015 -92549 -11661 37134 -4542 127457 -179316 -202429 13573 -81122 -249981 -148971
$$ packed form
15960c2326F7892b65719l3406p770D33914h6368F3039l1284R0263m8259r482c07806
15947A83386J5083b56556d2449l20109a76238L9214d2273p3386I0220b04317B97762
15935D3449c0641F3264L1708N2108n4737l8787b35088b319p5123m9737L1494A64518
15922a3991G4415b65966J26507A34057b67008C68633F9300b57356a16451A14551
15911A06294a94673j97825f7139G0833g821E4130b70307a21171A79120e3026A46298
15899H3759b99255e6433q2259j19635B4312H0a2060H4702O8871a87983c1803j26140
15887a57943A15207m5632A4578a11084K0841j46859a4083A63P0084a91480F2338
15875B21015i2549a1661C7134d542A27457a79316k3113A3573h1122j68859J01010
$$ plain form
15864 -148971 -54168 154789 32077 71415 -269095 23403 108974 140836 -233039 -46368 -103186
15853 -103186 -223169 22270 -383195 64330 -8110 110745 248488 -45866 55111 -4261 275149
15841 60798 -195123 15618 -265591 8275 -361551 -306246 25256 -166333 -39519 74907 227407
15830 227407 182571 160843 126250 -81020 -110945 -196336 35790 -51836 -139704 169527 -94665
15818 -459582 -321684 387022 -260899 -214698 91143 206741 -218150 -24753 69749 -159738
15807 20400 -166110 -22042 -136757 -4836 -373525 -427422 50259 9664 -290422 -201280 376531
15795 -211444 145788 55568 -188825 -185589 189542 145608 133083 -142944 86070 -282766 -291365
15784 -291365 -54960 -240106 46001 451655 -170736 103472 -449323 -168253 -115324 23211
$$ packed form
15864a48971e4168A54789C2077L9338b69095B3403Q5571L1862b33039d6368n6818
15853a03186j19983B2270c83195F4330h110A10745J37743d5866E5111d261B75149
15841F0798a95123A5618b65591H275c61551N5305B5256a66333c9519G4907J52500
15830B27407m4836k1728l4593h1020k9925q5391C5790e1836q7868A69527i4665
15818d59582J37898C87022b60899M6201I1143J15598b18150b4753F9749a59738
15807B0400a66110b2042j14715d836l68689n3897E0259I664b90422Q9142C76531
15795b11444A45788E5568a88825L236A89542m3934j2525a42944H6070b82766q599
15784b91365e4960j85146D6001M05654a70736A03472d49323a68253N2929B3211
$$ plain form
15773 -133313 -117359 -193324 27450 -195145 -326166 160518 -184058 -19764 21513 -118147
15762 56410 -57392 -208616 96239 190290 178696 156084 48079 58260 286571 264824 -56710
15750 322734 33417 -19987 -51198 -28793 168285 -60414 139312 55059 -9666 290541 -232929
15738 -14968 -369458 71065 23053 -286772 -2510 -111512 117174 -70411 -38376 -175160 -470946
15727 -470946 -83167 43792 70719 -151290 -117598 11031 -48781 -26077 -186438 -19135 -124817
15716 -124817 -2756 -13865 17541 -24734 189999 237005 -72866 -191784 177519 -296593 146356
15704 11479 393604 -266600 18008 -18795 -112423 103339 -381418 -216206 97258 21264 158755
15693 158755 -82189 275942 189594 170382 82005 225835 90293 145906 -265828 154943 -198533
$$ packed form
15773a33313J5954p5965B7450a95145j31021A60518a84058a9764B1513a18147
15762E6410e7392j51224I6239R4051j1594k2612D8079J0181K28311k1747e6710
15750C22734C3417a9987l1211K2405A68285f0414A39312E5059i666B90541b32929
15738a4968l54490G1065B3053b86772b510j09002A17174g0411L2035j36784k95786
15727d70946h3167D3792K6927a51290L3692A1031d8781K2704j60361a9135j05682
15716a24817b756j1109A7541b4734A89999M7006g2866j18918A77519b96593A46356
15704A1479L82125b66600A8008a8795r3628A03339c81418J65212I7258B1264J37491
15693A58755h2189B75942q6348j9212H2005J43830I0293N5613b65828A54943a98533
$$ plain form
15681 82073 -40398 -61763 46521 323780 1831 -176118 -207845 3179 -209567 -84472 -218579
15670 -218579 -200443 42040 -84291 -99413 434133 -130455 41013 -61847 138032 168264 74858
15658 96571 161835 39732 -223583 9145 -108622 1311 212921 102452 145873 167447 -285813
15646 -23230 -269199 102499 -41530 28698 20445 -27579 -72506 -107105 -54322 -180401 142241
15634 82676 -86170 -141725 23624 -34461 -279449 -23722 140302 199380 -107182 -409219 323749
15622 159706 -64075 -26254 -33453 -35818 -68003 69038 156985 -190100 -17339 -270795 72322
15610 -146682 -17491 98207 -230174 -102310 85120 -185679 -137588 32168 169303 -162916
15599 -112924 195025 -44834 10477 117336 -131105 -158165 115306 9477 -40195 -24998 22753
$$ packed form
15681H2073d0398k1365D6521K77259A831a76118l1727C179b09567h4472j34107
15670b18579J8136D2040h4291j5122D34133a30455D1013f1847A38032L0232G4858
15658I6571O5264C9732b23583I145a08622A311K11610A02452M3421K1574b85813
15646b3230k45969A02499d1530B8698q253b7579m4927l4599N2783j26079A42241
15634H2676h6170n5555B3624c4461k44988b3722A40302N9078a07182l02037C23749
15622A59706f4075b6254p199k365l2185F9038Q7947a90100a7339k53456G2322
15610a46682a7491I8207b30174a02310H5120a85679M8091C2168J37135a62916
15599a12924A95025d4834A0477J06859a31105k7060A15306I477d0195J5197B2753
$$ plain form
15587 -193925 71947 71860 -159128 12096 229580 95071 -101512 -143320 95951 -166762 14156
15575 28717 81265 -93212 -34937 -83556 32825 -375130 120215 233986 -234292 145784 -129576
15563 -55154 208292 -141511 3415 259479 183686 383463 -233335 -215538 86382 159248 35625
15551 -134198 -94645 -58696 -141330 -39760 -137407 -184510 -8596 65661 -200406 12677 -64204
15539 34046 155157 -71253 104979 83961 -154993 230954 328086 128986 281125 -342177
15528 60016 349574 133813 -82970 72274 -108230 12747 -151323 323915 45921 -177225
15517 -10271 183453 38459 -116143 -211545 45454 -162130 -76436 288328 -441021 175489
15506 71546 51725 235092 301027 236236 -312540 6290 118170 128502 -143743 235048 23281
$$ packed form
15587a93925G1947q7a59128A2096K17484I5071a01512m1808I5951a66762A4156
15575B8717N2548i3212c4937m8619C2825c75130A20215J13771b34292A45784a29576
15563e5154B08292a41511C415K56064p5793J99777b33335J7797H6382P2866C5625
15551a34198L9553L5949q2634c9760r7647m7103h596F5661b00406A2677f4204
15539C4046J21111g1253A04979k1018a54993B30954R7132A28986J52139c42177
15528F0016K89558A33813h2970G2274a08230A2747a51323C23915D5921a77225
15517a0271A83453C8459a16143r5402D5454a62130g6436B88328d41021A75489
15506G1546j9821J83367O5935o4791c12540F290J11880J0332a43743B35048B3281
$$ plain form
15494 115710 250068 133053 205001 37253 -60085 -289353 83938 384088 -135753 -211010
15484 -211010 -164586 -147746 10236 -111015 -9616 55708 -30520 8266 -202702 94494 98120 -40318
15471 -184912 -162683 -377130 4397 -14488 49175 -157546 -61414 85279 -141921 -357335 115133
15459 -252282 114576 -108936 -171115 -265788 -126632 76440 -78466 45331 16338 -229848 -56482
15447 226182 53578 -61492 199042 -160447 -136472 12996 298353 -2397 206207 -108244 -282257
15436 -282257 -62352 290267 -175575 -152195 208758 -207610 -191455 325240 -487331 -14570
15425 -173558 96455 87178 53303 -12077 10462 63395 -120759 -154643 39161 -5089 -540079
15414 -540079 129370 -81469 274465 249820 -139996 340518 -77730 100302 27701 151204
$$ packed form
15494A15710J34358j17015P1948C7253f0085k29268H3938L00150a35753p5257
15484b11010M6424J6840A0236a11015i616E5708c0520H266b02702I4494L626d0318
15471a84912K2229k14447D397a4488D9175a57546f1414H5279a41921k15414A15133
15459b52282A14576a08936o2179r4673a26632G6440g8466D5331A6338b29848e6482
15447B26182E3578f1492A99042a60447K3975A2996K85357b397B06207a08244j74013
15436b82257f2352B90267a75575K3380B08758b07610J6155C25240d87331a4570
15425a73558I6455r277l3875a2077A0462N2933a20759l3884C9161e089n34990
15414e40079A29370h1469B74465k4645a39996C40518g7730A00302B7701J23503
$$ plain form
15404 151204 1861 1825 260935 283186 -137828 317475 145682 316649 -204107 174889 175843
15393 175843 -78782 17559 67933 -45870 -65654 81221 242924 145463 -236115 -346321 -164731
15381 187581 68138 -93949 -307616 -89077 36392 -64650 331596 36226 -45929 -254654 144924
15369 -169021 -103723 -279845 -101544 -63361 -37900 14624 -56517 6699 -26721 140370 -21968
15357 191591 -50783 290098 79754 231270 -127413 386941 52285 49345 106428 323239 145042
15345 -71443 127845 -35579 -251297 -14472 209316 152145 -156264 -65916 -56753 -63683 -159085
15334 -159085 28282 -89228 252061 12678 -335977 183713 270984 96022 -112380 25194 222030
15323 222030 -33226 29838 150879 -332841 179796 -124637 141793 -44248 -88566 -24603
$$ packed form
15404A51204A861l6K59110K2251a37828C17475A45682J70967b04107A74889R54
15393A75843g8782A7559N0374d5870j9784H1221J61703r7461b36115j10206a64731
15381A87581F8138i3949k13667h9077C6392f4650C31596C6226d5929k08725A44924
15369a69021O5298j76122a01544L8183K5461A4624e6517F699b6721A40370b1968
15357A91591e0783B90098G9754J51516a27413C86941E2285k940N7083K16811A45042
15345g1443A27845c5579k15718a4472B09316n7171a56264f5916R163o930r5402
15334a59085B8282h9228B52061A2678c35977A83713Q7271I6022a12380B5194J96836
15323B22030c3226B9838J21041c32841A79796a24637A41793d4248m4318b4603
$$ plain form
15312 326718 -19223 112082 189355 -213542 119023 239626 46948 -29704 -221624 -111479
15302 -111479 52280 214132 143773 277063 112045 -123098 79051 -129982 85969 -39504
15291 -256369 322048 11782 19599 72641 87746 325436 -126426 -96380 -124001 386993 -73918
15279 296608 25217 329981 -200194 9815 -89985 223207 8932 168562 -164983 -84465 243721
15267 40943 7030 -22102 160820 -20802 19294 -13469 204560 -57182 179232 108115 249736
15256 249736 194586 -46513 -83425 219055 244077 -48975 167022 217846 320201 1176620 1837243
15245 1837243 1476642 1947778 1549861 675553 115065 154412 -220424 102175 269670 108913
15234 231959 226194 -34848 -154757 93982 80830 179702 -144520 366472 103659 169297 191770
$$ packed form
15312C26718a9223A12082P7273b13542A19023J20603D6948b9704j91920J10145
15302a11479E2280J61852p0359J33290A12045a23098G9051a29982H5969c9504
15291b56369C22048A1782P817N3042J5105K37690a26426L0046k7621C86993g3918
15279B96608B5217L04764b00194I815h9985B23207H932J59630a64983Q0518B43721
15267D0943G030b2102A60820b0802A9294a3469B04560e7182A79232p1117J41621
15256B49736n5150d6513l6912B19055K5022d8975A67022N0824J02355Q56419O60623
15245A837243l60601M71136l97917F75553A15065L9347b20424A02175J67495A08913
15234B31959n765c4848j19909I3982j3152R8872a44520C66472A03659O5638K2473
$$ plain form
15223 191770 112039 52112 199352 -312577 302448 185509 -73693 33551 267952 -87036
15212 -11974 -172716 -53022 -13768 19300 -36472 -90363 70595 -56124 -4620 19270 118648 23859
15199 -71037 253929 110385 -86103 345868 159082 232062 -175114 -68612 114056 276531
15189 276531 43676 331808 188642 -124816 -141124 91453 -101419 89845 -14417 74944 47366
15178 47366 130020 258746 360185 179469 72814 -88096 74112 203693 175192 133974 -259740
15166 265732 -355340 9158 314926 333895 313854 -51744 -151660 6584 131800 47035 -1652
15154 68494 171193 328783 49112 33387 -27677 290503 -178650 88930 201765 -63562 196933
15142 123560 102233 434374 238619 -61231 352282 109939 58395 -92350 335041 -128870
$$ packed form
15223A91770p9731E2112J47240c12577C02448j16939g3693C3551K34401h7036
15212a1974j60742e3022a3768A9300c6472n3891G0595e6124d620A9270R9378B3859
15199g1037B53929A10385h6103C45868A59082P2980a75114f8612A14056J62475
15189B76531D3676K88132j43166a24816j6308I1453a01419H9845a4417G4944k7578
15178D7366Q2654J28726J01439A79469G2814h8096G4112J29581k8501m1218b59740
15166B65732c55340I158L05768J8969k0041e1744r9916F584J25216D7035a652
15154F8494J02699J57590D9112j5725b7677B90503a78650H8930J12835f3562A96933
15142A23560k1327L32141j95755f1231C52282A09939n1544i2350C35041a28870
$$ plain form
15131 319778 144721 69318 -123502 242555 -169867 234957 135652 -35591 115416 -28765
15120 34092 -25994 449537 19818 -70959 -347393 289488 424241 206851 -100084 125823
15109 -46319 155920 -43831 -25763 189533 300472 226516 129834 43188 277150 7473 45315
15098 45315 87432 333553 -213229 277128 220770 90230 -6143 498995 -159962 244220 47416
15086 23605 109901 -3577 223378 152210 175418 172640 114388 167496 -168345 -308745 429931
15074 12046 391087 213789 347710 -31888 76065 64556 -18583 -108444 76391 159059 145456
15063 145456 -85221 286026 367286 262207 172539 136259 203919 171108 222660 251158 65414
15051 356773 189751 -112068 150487 -236780 -239553 241994 175127 -269616 24914 210102
$$ packed form
15131C19778A44721F9318a23502B42555a69867B34957r9305c5591A15416b8765
15120C4092b5994D49537A9818g0959k76434B89488J34753B06851a00084A25823
15109d6319A55920d3831J8068A89533J10939p3956r6682D3188K33962G473L7842
15098D5315M2117K46121b13229B77128n6358I0230f143D98995a59962B44220D7416
15086B3605Q6296c577B23378p1168K3208k778n8252N3108a68345j40400D29931
15074A2046L79041j77298J33921c1888G6065j1509a8583q9861G6391Q2668j3603
15063A45456h5221B86026Q1260j05079q9668l6280O7660l2811N1552K8498F5414
15051C56773j67022a12068A50487b36780k773B41994o6867b69616B4914J85188
$$ plain form
15041 210102 264242 230481 249820 239836 411313 480256 257775 116040 628415 1580 261564
15030 261564 -28513 306881 266116 352916 86532 217661 271041 52407 49585 321505 104668
15018 181292 282405 247896 103855 171008 41951 310672 448314 166840 183124 296842
15008 296842 237153 448583 -72525 192370 158559 -238074 302214 119440 416587 134880
14997 326137 531756 8490 269846 478802 -72200 568387 -41457 153041 147044 249815 362395
14986 362395 172031 450406 -33626 274282 208726 224808 199735 61724 53366 335422 276550
14975 276550 26211 504100 44416 164430 168316 506816 151563 368197 23142 502602
14965 502602 -67065 168982 124510 412028 11491 114663 151480 29838 -67254 379767 174528
$$ packed form
15041B10102N4140l3761J9339r984J71477O8943k22481A16040N12375A580K59984
15030B61564b8513C06881m0765Q6800H6532J31129N3380E2407k822K71920A04668
15018A81292J01113l4509A03855O7153D1951K68721J37642A66840J6284J13718
15008B96842n9689K11430g2525A92370l3811b38074C02214A19440K97147A34880
14997C26137K05619H490K61356K08956g2200E68387d1457A53041n997J02771J12580
14986C62395A72031K78375c3626B74282o5556J6082k5073F1724q358K82056n8872
14975B76550B6211M77889D4416J20014L886L38500A51563K16634B3142M79460
14965E02602f7065A68982m4472K87518A1491J03172L6817B9838f7254C79767A74528
$$ plain form
14953 -73728 327933 442476 345065 264533 529235 211799 319971 302996 -54586 276794
14942 231781 284872 466340 218554 499840 280946 175096 64993 201717 335208 300378
14932 300378 469615 561556 59884 71822 644598 373835 57932 167212 160309 293898 264912
14921 264912 267780 348621 588345 235540 27604 391610 -213699 505480 365689 -7869 133200
14909 388513 509302 99697 -32026 306881 300027 235604 387068 130427 283667 316313 475153
14898 475153 357110 268297 353519 389538 294478 210133 328183 437494 386091 699468 396426
14887 396426 429737 333604 445924 618554 34604 171455 537726 278302 222881 482836
14877 482836 342177 508208 398234 583618 424679 474814 458096 424215 265196 397253
$$ packed form
14953g3728C27933J14543r7411q0532K64702B11799J08172j6975e4586B76794
14942B31781N3091J81468B18554K81286k18894j05850F4993J36724J33491l4830
14932C00378J69237R1941E9884J1938N72776k70763E7932J09280o903J33589k8986
14921B64912K868Q0841K39724B35540B7604L64006b13699E05480j39791g869A33200
14909C88513J20789I9697c2026C06881o854o4423J51464A30427J53240L2646J58840
14898D75153j18043q8813Q5222L6019r5060q4345J18050J09311n1403L13377l03042
14887C96426L3311r6133J12320J72630C4604J36851L66271k59424n5421K59955
14877D82836j40659J66031j09974J85384j58939N0135j6718l3881j59019J32057
$$ plain form
14867 397253 491518 347803 323272 246540 446780 518190 91935 355891 567200 507131 505463
14856 505463 234611 629543 474532 406398 522666 602654 633674 275189 489627 215965
14845 161263 404609 592726 239205 117433 333678 621631 201846 622552 456565 694870
14835 694870 422383 290421 97456 975966 227429 260444 499076 521583 583979 540911
14825 540911 282494 521612 628938 581147 684813 161431 312722 481867 362792 481701
14815 481701 650351 911030 541292 254132 326859 609419 352944 621944 535296 451549
14805 451549 418114 814005 221471 572999 456236 437472 669011 445848 701421 774357
14795 774357 398196 423743 531231 563384 572083 360296 438952 388155 512076 382411 530397
$$ packed form
14867C97253R4265j43715k4531p6732K00240P1410I1935K63956K11309o0069j668
14856E05463B34611L94932j55011o8134J16268P9988L1020B75189K14438B15965
14845A61263K43346J88117B39205A17433K16245K87953B01846M20706j65987K38305
14835F94870k72487j31962I7456Q78510B27429L3015K38632K2507O2396m3068
14825E40911k58417K39118J07326m7791J03666A61431J51291J69145j19075J18909
14815D81701J68650K60679l69738B54132P2727K82560k56475K69000q6648q3747
14805D51549l3435L95891B21471L51528j16763j8764K31539k23163K55573P2936
14795G74357l76161K5547J07488L2153Q699k11787P8656n0797J23921j29665J47986
$$ plain form
14784 530397 627400 599516 341871 519689 365344 842742 313193 400540 346062 504410
14774 504410 946509 677271 240270 487245 376713 636900 815794 464361 608721 711004
14764 711004 583845 540795 394211 998597 671731 593411 737498 674092 902203 763652
14754 763652 810131 180885 709968 760400 416757 732056 411155 802356 570753 649974
14744 649974 738740 836386 897624 935646 800431 701026 566188 981190 663734 556750
14734 556750 910989 587051 811965 956843 854859 791440 709675 559649 872092 817190
14724 817190 906755 836309 856646 795274 984955 834518 1073011 971433 922538 377070
14713 1009461 732807 1075746 753778 895340 979115 803538 858288 723144 798766 900329
$$ packed form
14784E30397R7003k7884k57645J77818j54345M77398C13193Q7347n4478J58348
14774E04410M42099k69238B40270K46975j10532K60187J78894l51433J44360J02283
14764G11004j27159m3050j46584O04386l26866p8320J44087o3406K28111j38551
14754G63652M6479A80885N29083N0432l43643L15299l20901L91201k31603P9221
14744F49974Q8766R7646O1238L8022j35215r9405j34838M15002l17456j06984
14734E56750L54239l23938K24914J44878j01984o3419q1765j50026L12443n4902
14724H17190Q9565p0446K0337o1372J89681j50437K38493j01578m8895C77070
14713A009461k76654L42939l21968J41562Q3775j75577N4750j35144P5622J01563
$$ plain form
14703 900329 795849 681646 1072342 779650 1392314 899115 803171 949698 988137 841316
14693 841316 908142 773467 820740 748619 933731 924503 867768 961735 698535 1297282 1091401
14682 1091401 1058611 1291587 901494 1068899 851230 785299 1154247 879214 1140942 1054813
14672 1054813 1154831 908922 948775 1025131 1065409 894740 1023224 1190822 1189668 1124076
14662 1124076 842865 988389 1222461 1117623 963954 983092 1264055 987236 1100243 1382052
14652 1382052 1025545 1202140 1523651 1231192 1023762 1236049 1093330 1242069 1174494 1109084
14642 1109084 1162601 1007808 1191969 1371448 1172446 1316689 1233432 1441052 1503076 1200301
14632 1200301 1080044 1135132 1281704 890710 1368131 1163396 1212956 1122161 1277703 1385926
$$ packed form
14703I00329j04480j14203L90696k92692O12664m93199r5944J46527L8439j46821
14693H41316O6826j34675M7273p2121J85112r228n6735R3967k63200N98747k05881
14682A091401l2790K32976l90093J67405k17669o5931L68948k75033K61728q6129
14672A054813J00018k45909L9853P6356M0278j70669J28484J67598j154o5592
14662A124076k81211J45524K34072j04838j53669J9138K80963k76819J13007K81809
14652A382052l56507J76595L21511k92459k07430K12287j42719J48739o7575o5410
14642A109084N3517j54793J84161J79479j99002J44243q3257K07620O2024l02775
14632A200301j20257N5088J46572l90994M77421k04735M9560r0795J55542J08223
$$ plain form
14622 1385926 1437258 1362735 1499125 1689308 1610429 1300352 1453713 1167786 1331539 1604474
14612 1604474 1529385 1644699 1664841 1680644 1460570 1459342 1454805 1359963 1487514 1833215 1554871
14601 1554871 1712284 1712701 1520717 1388959 1642788 1395473 1716918 1683577 1866965 1699392
14591 1699392 1602122 1689632 1767305 1652088 1960895 1840196 1664230 1904069 1964700 1826196
14581 1826196 2058892 2089626 2092552 2203120 2423910 2365204 2280459 2156864 1887068 2242909
14571 2242909 1939104 2578238 2424736 2324206 2253431 2398468 2128227 2456951 2616291 2421745
14561 2421745 2680302 2874731 3035740 3015047 2894959 3193481 3388216 3726001 3925401 4083884
14551 4083884 4883276 5765019 8743446 13534092 23227230 40817888 40550420 17383054
$$ packed form
14622A385926N1332p4523J36390J90183p8879l10077J53361k85927J63753K72935
14612A604474p5089J15314K0142J5803k20074j228m537r4842J27551L45701k78344
14601A554871J57413M17j91984j31758K53829k47315L21445l3341J83388j67573
14591A699392r7270Q7510P7673j15217L08807j20699j75966K39839O0631j38504
14581A826196K32696L0734K926J10568K20790n8706q4745j23595k69796L55841
14571B242909l03805O39134j53502j00530p0775J45037k70241L28724J59340j94546
14561B421745K58557J94429J61009k0693j20088K98522J94735L37785J99400J58483
14551D083884P99392Q81743K978427M790646R693138J7590658k67468A7383054
$$ plain form
14542 9024091 7659551 4680720 2743468 2274945 1952405 1933787 2357130 1632746 1730552
14533 1730552 2009919 1924920 2081063 2268991 2419959 2387240 2110819 2647989 2318956 2649763
14523 2649763 2486595 2374163 2353147 2623834 2265227 2658392 2549803 2667690 2772317 2631341
14513 2631341 2740986 2995051 2735614 2600451 2814774 3018854 3153078 3057526 3024900 2848505
14503 2848505 2798779 2887274 2960915 3118716 3206658 3075254 3394835 2906337 3485329 3195668
14493 3195668 3223095 3231517 3637047 3406269 3435725 3691533 3457585 3502995 3401132 3629657
14483 3629657 3860507 4061531 3843936 4056782 3651242 4102902 4226400 3912189 4059901
14474 4059901 4160348 4126903 4120477 3967654 4405873 4518802 4729052 4537003 4562030 4406821
$$ packed form
14542I024091j364540k978831j937252m68523l22540j8618M23343p24384R7806
14533A730552K79367q4999J56143J87928J50968l2719k76421N37170l29033L30807
14523B649763j63168j12432k1016K70687l58607L93165j08589J17887J04627j40976
14513B631341J09645K54065k59437j35163K14323K04080J34224r5552l2626j76395
14503B848505m9726Q8495P3641J57801Q7942j31404L19581m88498N78992k89661
14493C195668K7427Q422M05530k30778K9456K55808k33948M5410j01863K28525
14483C629657K30850K01024k17595K12846m05540M51660J23498l14211J47712
14474D059901J00447l3445o426j52823M38219J12929K10250j92049K5027j55209
$$ plain form
14464 4406821 4379905 5111218 4609871 4697798 4787321 4748373 4968689 5031975 5033863 4861024 5368225
14453 5368225 5176233 5304006 5397246 5184503 5741576 5459100 5683528 5492163 5879224 5700311
14443 5700311 5888604 5753772 6192940 6002965 5990692 6386786 6390722 6342810 6296763 6542363
14433 6542363 6389926 6575883 6749099 6754402 6946252 7017653 7036191 7411009 7003641 7484485
14423 7484485 7416913 7382472 7677422 7710525 8198421 8166313 8308155 8526774 8267463 8801454
14413 8801454 8757238 8895600 8610952 9052767 9630328 9201153 9786148 9843343 9693536 9870759
14403 9870759 10144627 10309082 10306848 10425778 10704984 11015917 10812287 11158793 11698954 11597797
14393 11597797 11602702 11829403 12234718 12526884 12313318 13169915 12941612 13416353 13533899 13990812
$$ packed form
14464D406821k6916P31313n01347Q7927Q9523l8948K20316O3286J888j72839N07201
14453E368225j91992J27773R3240k12743N57073k82476K24428j91365L87061j78913
14443E700311J88293j34832M39168j89975j2273L96094L936m7912m6047K45600
14433F542363j52437J85957J73216N303J91850P1401J8538L74818m07368M80844
14423G484485o7572l4441K94950L3103M87896l2108J41842K18619k59311N33991
14413H801454m4216J38362k84648M41815N77561m29175N84995N7195j49807J77223
14403I870759K73868J64455k234J18930K79206L10933k03630L46506N40161j01157
14393A1597797M905K26701M05315K92166k13566Q56597k28303M74741J17546M56913
$$ plain form
14383 13990812 14267217 14457477 14412556 14543430 14629882 15283424 15435800 16107667 15952156 16769737
14373 16769737 16613546 17075143 17491098 17979005 18407156 18578605 19150417 18865399 19520986
14364 19520986 20023889 20243028 20543930 21186763 21976796 22376997 22882872 23203921 24096688
14355 24096688 24383190 24895724 25692824 25993576 26820386 27544613 27968850 28418375 29651103
14346 29651103 30021825 31000877 31862642 32370723 33457548 34243552 35452262 36127232 37572010
14337 37572010 38237316 39636422 40344005 42144509 43262124 44525555 45630749 47421438
14329 47421438 48450042 49851118 51654875 53304724 55058333 56911110 59000361 60841339
14321 60841339 63085834 65176836 68026781 70013346 72407722 75502769 78462013 81583833
$$ packed form
14383A3990812K76405J90260m4921J30874Q6452O53542J52376O71867j55511Q17581
14373A6769737j56191M61597M15955M87907M28151J71449N71812k85018O55587
14364A9520986N02903K19139L00902O42833P90033M00201N05875L21049Q92767
14355B4096688K86502N12534P97100L00752Q26810P24227M24237M49525J232728
14346B9651103L70722R79052Q61765N08081J086825P86004J208710O74970J444778
14337C7572010O65306J399106P07583J800504J117615J263431J105194J790689
14329D7421438J028604J401076J803757J649849J753609J852777K089251J840978
14321F0841339K244495K091002K849945J986565K394376L095047K959244L121820
$$ plain form
14313 81583833 84675584 87803192 91473830 95448416 99076253 103297924 108083483 112614524
14305 112614524 117462636 122734982 128507859 134122968 140526059 147124487 154554027 161612105
14297 161612105 169659501 178092559 187038120 196278895 205978533 216811235 227619930 239176813
14289 239176813 251198066 263906079 276893573 290788376 304968094 319141176 334001798
14282 334001798 348950781 363459665 378108780 392219034 405864272 418803486 430457781
14275 430457781 440530017 447384692 451366637 452380264 452529377 453352697 453931336 450509187
14267 450509187 446149794 439453318 431935042 422141904 410591656 397994763 384088435
14260 384088435 369392673 354316706 338654432 323239707 307837953 293249976 278566459
$$ packed form
14313H1583833L091751L127608L670638L974586L627837M221671M785559M531041
14305A12614524M848112N272346N772877N615109O403091O598428P429540P058078
14297A61612105Q047396Q433058Q945561R240775R699638J0832702J0808695J1556883
14289B39176813J2021253J2708013J2987494J3894803J4179718J4173082J4860622
14282C34001798J4948983J4508884J4649115J4110254J3645238J2939214J1654295
14275D30457781J0072236O854675L981945J013627J49113Q23320N78639l422149
14267D50509187m359393o696476p518276r793138j1550248j2596893j3906328
14260C84088435j4695762j5075967j5662274j5414725j5401754j4587977j4683517
$$ plain form
14253 278566459 265677997 253243306 240948045 228737833 217544962 206374937 196689809
14246 196689809 186930707 177814017 169706845 161686586 153965997 146290761 140059315 133711710
14238 133711710 127836433 122722560 117264886 111959607 107165486 102938951 99115115 95228539
14230 95228539 91381745 87484384 84274138 80757577 77841747 75121045 72183335 69504606
14222 69504606 67009654 64865258 62710265 60543615 58621680 56584466 54708656 53147428
14214 53147428 51684807 50477487 48613031 46859152 45440822 44377245 43215921 42608155
14206 42608155 41443163 39774409 38426880 37359166 36428477 35696596 34850813 33908158 32790397
14197 32790397 31943736 31197118 30197989 29720279 29012189 28421800 27808331 26801857 26246102
$$ packed form
14253B78566459j2888462j2434691j2295261j2210212j1192871j1170025r685128
14246A96689809r759102r116690q107172q020259p720589p675236o231446o347605
14238A33711710n875277n113873n457674n305279m794121m226535l823836l886576
14230I5228539l846794l897361l210246l516561k915830k720702k937710k678729
14222F9504606k494952k144396k154993k166650j921935k037214j875810j561228
14214E3147428j462621j207320j864456j753879j418330j063577j161324o07766
14206D2608155j164992j668754j347529j067714r30689p31881q45783r42655j117761
14197C2790397q46661p46618r99129m77710p08090n90389o13469j006474n55755
$$ plain form
14188 26246102 25628305 25215832 24274830 23702562 23440691 22648376 22353803 21616256 21251942
14179 21251942 21010849 20741659 20254049 19862236 19143052 18767438 18673433 18270639 17975972
14170 17975972 17493168 17268799 16889291 16398782 15993125 15872190 15598190 15166534 15035039
14161 15035039 14754021 14569450 13987623 13699272 13680858 13237675 13169808 12809174 12890098 12574990
14151 12574990 12381821 12313681 11836339 11773737 11396004 11270573 11165852 10931504 10933376 10591592
14141 10591592 10547365 10345123 10080117 10683432 9960209 9647909 9542145 9765516 9190457
14132 9190457 9652641 9206448 8782344 8930125 8740022 8535506 8318785 8614985 8156655
14123 8156655 8305436 8216138 8143264 8040968 7784948 7843590 7954349 7674297 7493002 6958230
$$ packed form
14188B6246102o17797m12473r41002n72268k61871p92315k94573p37547l64314
14179B1251942k41093k69190m87610l91813p19184l75614r4005m02794k94667
14170A7975972m82804k24369l79508m90509m05657j20935k74000m31656j31495
14161A5035039k81018j84571n81827k88351j8414m43183o7867l60634Q0924l15108
14151A2574990j93169o8140m77342o2602l77733j25431j04721k34348J872l41784
14141A0591592m4227k02242k65006O03315p23223l12300j05764K23371n75059
14132I190457M62184m46193m24104J47781j90103k04516k16721K96200m58330
14123H156655J48781q9298p2874j02296k56020N8642J10759k80052j81295n34772
$$ plain form
14113 6958230 7437226 7105721 7170219 7061214 6863616 6705909 6697285 6543039 6299526 6413692
14103 6413692 6616930 6413480 6077307 5815019 6060532 6063077 5668783 5794700 5836279 5632551
14093 5632551 5610125 5645851 5400029 5345211 5568560 5400675 5293157 5287898 4817400 4995285
14083 4995285 4961984 4724052 5092763 5028160 4821419 4487312 4852028 5073422 4773476 4557369
14073 4557369 4341354 4410985 4795129 4197197 4513620 4347095 4406449 4151657 3863068 4357293
14063 4357293 4271566 4079999 3908494 4297268 4562915 4253869 4006180 3878124 3945624 4203646
14053 4203646 3832223 3738753 3690128 4137734 3671607 3531766 3090030 3203705 3556598 3470949
14043 3470949 2976611 3004392 3579975 2964899 3161664 3064092 3153340 3237730 3153785 3231998
$$ packed form
14113F958230M78996l31505O4498j09005j97598j57707q624j54246k43513J14166
14103F413692K03238k03450l36173k62288K45513K545l94294J25917M1579k03728
14093E632551k2426L5726k45822n4818K23349j67885j07518n259m70498J77885
14083D995285l3301k37932L68711o4603k06741l34107L64716K21394k99946k16107
14073D557369k16015O9631L84144n97932L16423j66525N9354k54792k88589M94225
14063D357293q5727j91567j71505L88774K65647l09046k47689j28056O7500K58022
14053D203646l71423r3470m8625M47606m66127j39841m41736J13675L52893q5649
14043C470949m94338K7781N75583o15076J96765r7572Q9248Q4390q3945P8213
$$ plain form
14033 3231998 2765959 3146108 2987348 3371953 3329927 3083931 2696479 2961539 2742995 2914434
14023 2914434 2710251 2764774 2641065 2665193 2536206 2497082 2756385 2401543 2447124 2614188
14013 2614188 2563005 2454045 2423108 2065349 2086829 2479459 2402629 2285166 2276033 2048221
14003 2048221 2086843 2245339 2159166 2044533 2154084 1835756 1899794 2128893 2234020 2172538
13993 2172538 1945268 2068902 1958196 3014068 4439646 7726054 16494157 35139501
13985 35139501 44091306 23208898 12178161 7752387 6312384 4744836 3830934 3977733
13977 3977733 3405101 3035233 2854395 2872191 2398590 2437669 2297447 2373978 2633383 2539909
13967 2539909 2070364 2394842 2146150 2501797 2017575 2038237 1874354 2129526 2146284 1779204
$$ packed form
14033C231998m66039L80149j58760L84605m2026k45996l87452K65060k18544J71439
14023B914434k04183N4523j23709K4128j28987l9124K59303l54842M5581J67064
14013B614188n1183j08960l0937l57759K1480L92630p6830j17463r133k27812
14003B048221L8622J58496q6173j14633J09551l18328O4038K29099J05127o1482
13993B172538k27270J23634j10706J055872J425578L286408Q768103J8645344
13985C5139501Q951805k0882408j1030737m425774j440003j567548r13902J46799
13977C977733n72632l69868j80838J7796m73601L9079j40222P6531K59405r3474
13967B539909m69545L24478k48692L55647m84222K0662j63883K55172J6758l67080
$$ plain form
13957 1779204 1815380 1881607 2053699 2150081 2087467 2083829 2215512 1941267 1427365 1782307
13947 1782307 1969744 1858573 1865652 1754138 1943948 1652461 1962696 1767174 2190176 1728254
13937 1728254 1675742 1909680 1800660 1642103 1692875 1879546 1786079 1659664 1652711 1787168
13927 1787168 1742160 1444540 1666947 1905555 1637330 1391216 1540477 1276493 1844434 1001607
13917 1001607 1641703 1228059 1529726 1471719 1606911 1465088 1362321 1544699 1648877 1586635
13907 1586635 1595115 1436352 1444259 1347505 1576742 1630557 1467114 1267596 1233149 1345082 1384010
13896 1384010 1899441 1354055 1395613 1306691 1257851 1090148 1475393 1388276 1302059 1447237
13886 1447237 1025262 1090582 1341784 1158891 1201185 1018589 1094210 1378969 1260071 1081988
$$ packed form
13957A779204L6176O6227J72092R6382o2614l638J31683k74245n13902L54942
13947A782307J87437j11171P079j11514J89810k91487L10235j95522M23002m61922
13937A728254n2512K33938j09020j58557N0772J86671r3467j26415o953J34457
13927A787168m5008k97620K22407K38608k68225k46114J49261k63984N67941q42827
13917A001607O40096m13644L01667n8007J35192j41823j02767J82378J04178o2242
13907A586635Q480j58763P907r6754K29237N3815j63443j99518l4447J11933L8928
13896A384010N15431n45386M1558q8922m8840j67703L85245q7117q6217J45178
13886A447237m21975O5320K51202j82893M2294j82596P5621K84759j18898j78083
$$ plain form
13876 1081988 1261833 1198479 1229889 1131813 1034341 1128119 1454084 1052565 1224119 1283110
13866 1283110 1122304 1128695 782568 948477 691814 1214117 1008434 1095398 984244 1074569
13856 1074569 1018215 1143541 841271 859772 1148828 1081303 654354 903566 874534 1023140
13846 1023140 1127970 975060 959873 1304182 931951 1162936 886320 861704 882276 738661
13836 738661 833760 913923 788555 945152 788664 1020221 876693 648505 840647 1198294
13826 1198294 794973 793433 814794 849821 954961 745487 826235 873670 1037108 960334 1073483
13815 1073483 808527 904935 795022 844883 973162 1120693 784508 482909 929526 1115772
13805 1115772 753467 793196 777134 693945 850162 852327 962850 764162 606483 868900
$$ packed form
13876A081988J79845o3354L1410r8076r7472R3778L25965m01519J71554N8991
13866A283110j60806O391l46127J65909k56663N22303k05683Q6964j11154R0325
13856A074569n6354J25326l02270J8501K89056o7525m26949K49212k9032J48606
13846A023140J04830j52910j5187L44309l72231K30985k76616k4616K0572j43615
13836G38661R5099Q0163j25368J56597j56488K31557j43528k28188J92142L57647
13826A198294m03321j540K1361L5027J05140k09474Q0748M7435J63438p6774J13149
13815A073483k64956R6408j09913M9861J28279J47531l36185l01599M46617J86246
13805A115772l62305L9729j6062q3189J56217K165J10523j98688j57679K62417
$$ plain form
13795 868900 689908 696875 695189 819005 905077 504209 424405 925605 994116 665560 814780
13784 814780 772958 930663 631885 1074920 781942 519132 635158 615573 670294 551728
13774 551728 571592 915387 651364 732263 726443 793789 971674 700956 856424 747644
13764 747644 609485 974501 589393 777523 652451 637233 545907 466509 274737 1001714
13754 1001714 822229 487000 716528 604383 836865 981040 573831 593457 308820 490955
13744 490955 534277 305507 459933 774695 634445 620290 734402 918851 556115 653908
13734 653908 375194 538370 520837 379399 546465 362206 729300 456770 507999 395545
13724 395545 367651 762309 338176 800144 531190 904511 949888 587994 445818 581249
$$ packed form
13795H68900j78992O967j686J23816Q6072m00868p9804N01200O8511l28556J49220
13784H14780m1822J57705k98778M43035k92978k62810J16026j9585N4721j18566
13774E51728J9864L43795k64023Q0899n820O7346J77885k70718J55468j08780
13764G47644j38159L65016l85108J88130j25072j5218r1326p9398j91772P26977
13754A001714j79485l35229K29528j12145K32482J44175m07209J9626k84637J82135
13744D90955M3322k28770J54426L14762j40250j4155J14112J84449l62736R7793
13734F53908k78714J63176j7533j41438J67066j84259L67094k72530N1229j12454
13724C95545k7894L94658C38176M61968k68954L73321M5377l61894j42176J35431
$$ plain form
13714 581249 625126 333763 499684 519148 504505 594627 604088 728718 689974 750248 546600
13703 546600 419644 619923 446088 599840 451818 482271 695614 475965 379888 889069
13693 889069 502553 330920 912155 636778 375196 392165 453977 719347 579346 745524
13683 745524 662672 277672 292655 474284 416494 404936 554282 361127 282481 443140
13673 443140 397397 536861 494992 517762 406474 273122 866420 405605 368619 294989
13663 294989 319502 784649 592969 542725 385536 362796 444807 511605 356473 213396
13653 213396 307802 91512 295310 172445 408137 457546 562253 312320 462150 438243
13643 438243 282783 382928 600927 487322 264170 317721 410807 625956 246658 336614
$$ packed form
13714E81249M3877k91363J65921J9464j4643R0122R461J24630l8744O0274k03648
13703E46600j26956K00279j73835J53752j48022L0453K13343k19649r6077N09181
13693H89069l86516j71633N81235k75377k61582J6969O1812K65370j40001J66178
13683G45524q2852B77672J4983J81629n7790j1558J49346j93155p8646J60659
13673D43140m5743J39464m1869K2770j11288j33352N93298D05605l6986p3630
13663B94989K4513M65147j91680n0244j57189k2740Q2011O6798j55132j43077
13653B13396R4406I1512K03798j22865K35692M9409J04707k49933J49830k3907
13643D38243j55460J00145K17999j13605k23152N3551R3086K15149B46658Q9956
$$ plain form
13633 336614 623796 525411 337113 401817 438424 -52595 563751 271171 275981 332394 296944
13622 296944 20666 691242 440421 762024 380051 516229 570539 352530 463992 410095
13612 410095 565047 341622 314473 381835 213070 334746 656767 315281 417136 738382
13602 738382 218088 414316 249700 169370 222749 110783 209770 546602 295863 156302
13592 156302 499953 405954 83689 440357 377840 711871 418381 220108 145608 576648
13582 576648 441981 185030 -50104 265443 421203 235300 354582 429544 416462 54467
13571 438211 521966 579842 224541 274666 514890 428837 280765 192986 439557 238845
13561 238845 297751 328846 248363 419779 657063 188024 322727 184864 482191 172248
$$ packed form
13633C36614K87182r8385j88298O4704L6607e2595E63751B71171M810N6413l5450
13622B96944B0666O70576k50821L21603C80051J36178N4310k18009J11462n3897
13612D10095J54952k23425k7149O7362j68765J21676L22021C15281J01855L21246
13602G38382B18088J96228j64616q0330N3379A10783R8987L36832k50739j39561
13592A56302L43651r3999H3689L56668o2517L34031k93490j98273p4500M31040
13582E76648j34667A85030e0104B65443J55760j85903J19282P4962j3082E4467
13571D38211Q3755N7876B24541N0125K40224q6053j48072q7779K46571k00712
13561B38845N8906L1095q0483J71416K37284A88024J34703j37863K97327A72248
$$ plain form
13550 488307 248026 220626 564536 -171751 360190 660556 205340 430684 427548 285129
13540 285129 248076 298639 9656 303277 247542 447007 251961 157692 365886 346777 451536
13529 451536 441287 528456 377445 260354 232412 216637 624351 299895 54767 185332
13519 185332 43311 335785 362448 391907 148429 424921 355526 229974 142820 26986 487978
13508 487978 373224 256516 495523 168021 369766 288950 199250 310716 338543 508913
13498 508913 75058 342309 625684 263934 231960 330604 73462 356812 -28077 283621
13487 498700 116982 -132930 359712 177704 367919 147209 43905 399246 320639 134993
13476 218553 156420 321901 492069 408354 260240 462955 -57579 53431 365032 199361
$$ packed form
13550D88307k40281k7400L43910a71751C60190L00366B05340K25344l136j42419
13540B85129l7053N0563I656K93621n5735J99465j95046r4269K08194j9109J04759
13529D51536j0249Q7169j51011j17091k7942j5775M07714B99895E4767J30565
13519A85332D3311K92474K6663K9459A48429K76492o9395j25552q7154B6986M60992
13508D87978j14754j16708K39007A68021K01745q0816q9700J11466K7827J70370
13498E08913G5058K67251K83375B63934l1974R8644G3462K83350b8077B83621
13487D98700A16982a32930C59712A77704J90215A47209D3905L55341p8607A34993
13476B18553o2133J65481J70168q3715j48114K02715e7579E3431L11601j65671
$$ plain form
13466 199361 57098 539435 460582 -140589 46817 -36229 284147 304253 243734 301263 247053
13455 247053 291804 788901 21448 139029 189154 720810 431317 328143 351021 -268920
13444 430045 398867 -86120 467729 497434 -362 -46715 195732 245544 216812 -38145 348551
13432 110246 -111542 -15374 375760 -48045 281729 278290 186475 232252 545353 -48227 247107
13420 106355 198256 341754 211457 269307 90736 736562 -233095 293069 315450 90530
13409 317127 74082 -1858 260509 215112 95212 281426 199965 125717 331223 39102 87199
13398 87199 377050 -17796 152993 224614 -3642 71495 155658 366847 269233 57215 93585
13387 93585 353008 91576 337156 155735 262480 229226 210958 80941 342475 70804 -35885
$$ packed form
13466A99361E7098M82337p8853a40589D6817c6229B84147K0106o0519N7529n4210
13455B47053M4751M97097B1448J17581N0125N31656k89493j03174K2878b68920
13444D30045l1178h6120D67729K9705c62m6353A95732M9812k8732c8145C48551
13432A10246a11542a5374C75760d8045B81729l439r1815M5777L13101d8227B47107
13420A06355R1901J43498j30297N7850I0736O45826b33095B93069K2381I0530
13409C17127G4082a858B60509m5397I5212J86214q1461p4248K05506C9102M8097
13398H7199K89851a7796A52993P1621c642G1495Q4163K11189r7614E7215L6370
13387I3585K59423I1576K45580A55735J06745l3254j8268H0941K61534G0804c5885
$$ plain form
13375 319027 313596 318628 245768 438000 244496 142372 -21510 47931 114900 153710 371945
13364 371945 327770 -215063 147239 260832 107637 386028 42213 71496 350582 157325
13353 241613 -12314 233023 404201 256788 83119 591953 578561 215463 438233 518033
13343 518033 328377 236295 245903 116462 103826 154640 226730 107723 62465 -7309 298462
13331 133277 323329 421912 277122 27702 103989 221758 211285 272065 94756 -123390 -171530
13320 -171530 -78927 267551 16788 146195 502243 142235 568837 -291735 70956 215434
13310 215434 143093 105105 23641 97573 117422 -21219 -91166 -19938 286747 -127887 288348
13298 47281 372776 408286 -14138 256551 -130951 -20903 -80110 -78638 266618 61407 313669
$$ packed form
13375C19027n431N032p2860J92232j93504j02124b1510D7931O6969L8810K18235
13364C71945m4175b15063A47239J13593A07637K78391D2213K9283K79086A57325
13353B41613a2314B33023J71178j47413H3119N08834j3392B15463K22770P9800
13343E18033j89656r2082R608A16462j2636N0814P2090A07723m5258g309B98462
13331A33277J90052R8583j44790B7702P6287J17769j0473O0780I4756a23390m8140
13320a71530g8927B67551A6788J29407L56048A42235M26602b91735G0956J44478
13310B15434p2341l7988B3641P3932J9849b1219o9947a9938B86747a27887B88348
13298D7281L25495L5510a4138B56551a30951b0903n9207J472B66618F1407K52262
$$ plain form
13287 313669 -259326 -158679 89521 263849 164245 336421 210624 -102776 -625 315963
13276 208479 132332 -19527 359697 152172 155416 -116217 432790 34399 -72027 368020 -48241
13264 39139 -52179 -91754 185841 240409 141648 122635 73309 159529 131797 59931 277500
13253 277500 39329 79580 -7153 34025 97918 110677 188480 212332 368286 117428 101224
13242 101224 207651 97927 352120 -131416 316624 129720 372530 141019 207946 112485
13232 112485 196764 -208135 -100698 -90299 -250689 40682 120069 60748 235647 -278655
13221 189245 -102893 -88533 146687 283874 109949 34192 282581 148969 118352 -89340
13210 96391 284708 1157 -33053 36938 53130 171114 241035 178516 16513 -196808 -258961
$$ packed form
13287C13669b59326J00647H9521J74328r9604J72176j25797a02776f25C15963
13276B08479p6147a9527C59697A52172L244a16217D32790C4399g2027C68020d8241
13264C9139e2179l9575A85841N4568r8761j9013m9326Q6220k7732E9931K17569
13253B77500C9329M0251g153C4025O3893J2759P7803K3852J55954A17428j6204
13242A01224J06427I7927K54193a31416C16624A29720K42810A41019O6927r5461
13232A12485Q4279b08135a00698J0399j60390D0682P9387n9321J74899b78655
13221A89245a02893J4360A46687J37187A09949C4192K48389j33612l0617h9340
13210I6391J88317A157c3053C6938J6192J17984O9921o2519A6513a96808o2153
$$ plain form
13199 -258961 162822 125683 61401 -17200 264611 202143 138583 224916 57899 219309 316227
13188 316227 -142336 102218 66351 23364 387837 -3652 -92645 305419 20185 78675 112548
13177 112548 43760 -27140 251892 297365 141453 158558 18316 -51000 52028 130078 -42669
13165 178897 274573 -162333 130899 360817 482755 74298 -141817 -21881 -110635 -42827
13154 22004 235894 86833 351934 330888 14396 203012 172589 10450 81038 220927 216458
13143 216458 340205 398236 10184 244935 95536 -142867 -53165 175814 213284 -7395 -38765
13132 -38765 48998 -311079 133964 166765 -36741 -133826 142623 224958 243173 43906 127762
13121 127762 295004 152750 -308025 272744 4393 18034 80232 57712 459046 -34566 225309
$$ packed form
13199b58961A62822l7139F1401a7200B64611o2468o3560Q6333E7899J61410R6918
13188C16227a42336A02218l5867B3364L64473c652q8993C05419B0185N8490L3873
13177A12548D3760b7140B51892M5473A41453J7105A8316e1000E2028P8050d2669
13165A78897R5676a62333A30899K29918J21938G4298a41817b1881q8754d2827
13154B2004K13890H6833K65101k1046A4396J88616l0423A0450P0588J39889m469
13143B16458J23747N8031A0184K34751I5536a42867e3165A75814L7470g395l1370
13132c8765D8998c11079A33964L2801c6741r7085A42623Q2335J8215D3906Q3856
13121A27762J67242j42254c08025B72744D393J3641O2198k2520M01334c4566B25309
$$ plain form
13109 -121896 255761 328069 112070 431255 -162255 -119272 -79911 -24475 -249873 235090
13098 23867 97226 134348 602128 113117 150945 13460 75427 245673 -233356 -276759 54949
13086 94738 -40082 33959 -164853 276 172676 323794 -35164 111071 47598 424939 259377
13075 259377 93611 39047 -150899 21054 192875 -106974 -38381 345913 13555 222069
13065 222069 -35477 238965 202869 -7291 -57146 268609 479465 -183394 -35024 191655 10968
13053 245709 -244882 130784 -79983 180869 -17578 447618 368085 -217549 167861 182283
13043 182283 -168906 185147 234894 122666 201176 -165416 65273 216583 93122 88139 -275593
13031 411618 61033 38346 -45896 472261 117461 304523 34376 -745 121065 161434 161760
$$ packed form
13109a21896B55761P2308A12070L19185a62255M2983L9361b4475k25398B35090
13098B3867P3359L7122M67780A13117L7828A3460O1967J70246b33356m3403E4949
13086I4738d0082C3959a64853B76J72400J51118c5164A11071D7598L77341j65562
13075B59377I3611C9047a50899B1054J71821a06974c8381C45913A3555K08514
13065B22069c5477B38965l6096g291m9855B68609K10856a83394c5024A91655A0968
13053B45709b44882A30784g9983A80869a7578D47618p9533b17549A67861J4422
13043A82283a68906A85147M9747j12228P8510a65416F5273J51310I3122m983b75593
13031D11618F1033k2687d5896D72261A17461J87062C4376g45A21065M0369L26
$$ plain form
13020 161760 9291 176801 -48052 76542 200516 153156 11943 183462 -29089 336506 25940
13008 151918 475927 -4347 87583 58748 -182388 44350 140071 206587 -23036 251954 244990
12997 244990 207677 356460 68 281313 -2711 68497 -181617 47080 -179808 158522 233959
12986 233959 98823 22528 169970 96577 14575 24072 339627 -51079 -47550 -72508 -82734
12975 -82734 180064 -151422 -264781 259471 115103 53493 -92774 -11124 -122917 -135404
12965 -135404 99418 -196394 258589 -225562 85590 -151578 8642 -88650 -248454 -91089 -18889
12953 79693 -74757 350892 107155 -107680 171907 404474 132528 24525 70643 -143544
12942 38531 36088 -124817 213794 -158882 48105 -30489 -127443 452924 215277 291321 -199669
$$ packed form
13020A61760I291J67510d8052G6542J23974m7360A1943J71519b9089C36506B5940
13008A51918L24009d347H7583k8835a82388D4350R5721O6516b3036B51954o964
12997B44990l7313J48783F8K81245b711F8497a81617D7080a79808A58522P5437
12986B33959I8823B2528J47442p3393A4575R497L15555e1079L529k4958j0226
12975h2734A80064a51422j13359B59471A15103E3493i2774a1124j11793j2487
12965a35404I9418a96394B58589b25562H5590a51578H642h8650j59804i1089a8889
12953G9693g4757C50892A07155a07680A71907K32567A32528B4525M6118a43544
12942C8531k443a24817B13794a58882D8105c0489r6954D52924B15277P6044a99669
$$ plain form
12930 216607 78204 -204786 -98557 166045 46725 -70318 -147144 -35571 85557 201218 135195
12919 135195 -64362 232353 14582 -201811 54210 97267 -58015 -195249 8388 -226953 -173597
12908 -173597 198834 15719 -85147 135676 -93590 -162638 257294 70143 -6522 161296 294670
12897 294670 295446 -178266 -88900 131432 177072 203648 -99442 24620 166846 30395 13102
12885 196532 103882 113026 -66023 -3371 -10651 111278 100311 -97030 -265119 232736 82185
12873 -65736 -591 -168444 63612 -223961 122013 212558 -82783 -180245 -71338 121967 -130387
12861 -191473 115221 95716 -129720 29464 297548 -192374 431820 -110687 102091 -51783
12850 165845 -117161 -37250 59421 74821 298372 5837 -186118 91314 1034 137545 -72940
$$ packed form
12930B16607G8204b04786i8557A66045D6725g0318p6826c5571H5557J15661o6023
12919A35195f4362B32353A4582b01811E4210M3057e8015j37234H388b26953N3356
12908a73597A98834A5719h5147A35676i3590o9048B57294G0143f522A61296J33374
12897B94670P76a78266h8900A31432M5640K6576i9442B4620J42226C0395A3102
12885A96532r2650R144f6023c371p280A11278j0967i7030j68089B32736H2185
12873f5736e91j67853F3612b23961A22013R0545h2783r7462g1338A21967a30387
12861a91473A15221j9505a29720B9464K68084a92374D31820a10687A02091e1783
12850A65845a17161c7250E9421J5400K23551E837a86118I1314A034J36511g2940
$$ plain form
12838 25651 16686 -293385 -143604 -124333 199986 -79177 196389 90071 -158054 -94658 205538
12826 24555 -86788 209617 68575 203310 60230 314964 175769 -7347 -16639 35021 -136481
12814 88436 66956 281501 28826 -108967 344210 177696 -35824 -89046 29002 -60012 -21359
12802 134366 208245 196718 217146 -55345 294249 206540 -203575 224943 121464 -143076
12791 141959 71996 86774 -25233 -10488 -133474 -128972 60395 -7413 -155896 78690 120643
12780 120643 -178891 127659 23651 -214505 164749 33917 172234 26522 35754 -58361 9157
12768 -152882 205067 226255 68212 15136 147420 44895 32079 -126126 93598 141726 211781
12757 211781 195175 -238712 -25956 212252 -118077 -100391 32369 161441 -64848 235841
$$ packed form
12838B5651q965b93385a43604J9271A99986g9177A96389I0071a58054O3396B05538
12826B4555h6788B09617F8575J34735F0230K54734j39195g347r292C5021a36481
12814H8436k1480K14545B8826a08967C44210j66514c5824n3222B9002f0012b1359
12802A34366P3879j1527K0428e5345B94249q7709b03575B24943j03479a43076
12791A41959o9963J4778b5233a0488j22986M502F0395g413j48483G8690M1953
12780A20643a78891A27659B3651b14505A64749C3917J38317B6522R232e8361I157
12768a52882B05067K1188F8212A5136J32284D4895j2816a26126I3598M8128P0055
12757B11781j6606b38712b5956B12252a18077J7686C2369J29072f4848B35841
$$ plain form
12746 -141376 55381 234360 -6714 276101 -322352 -207059 338904 -151151 96704 494626
12736 494626 37710 -73155 62312 77075 33879 370699 215711 76770 6014 49436 183836
12725 183836 -5060 -38302 -11943 364287 -23100 182159 94115 -301005 -46096 -37931 153229
12713 190821 53707 -159088 384938 167612 425258 189409 212906 105941 359819 2296
12702 -174972 83624 43321 92977 -45152 217109 -101505 44893 -18794 -147896 319927 59352
12690 -64866 41255 -434507 386718 -182808 247342 -45395 13295 149302 282913 -65533
12679 250713 -5784 336896 -49922 125577 -5377 376110 -35526 -102068 -382771 200493 261264
12668 261264 75697 -1004 -58296 -1494 7649 275003 -85306 429228 71667 138045 101330 -47216
$$ packed form
12746a41376E5381J78979f714B76101c22352J15293C38904a51151I6704L97922
12736D94626C7710g3155F2312J4763C3879L36820j54988G6770F014M3422J34400
12725A83836e060l3242a1943C64287b3100A82159q8044c01005d6096Q165A53229
12713A90821E3707a59088C84938A67612K57646A89409K3497A05941K53878B296
12702a74972H3624m0303M9656d5152B17109a01505D4893a8794j29102C19927E9352
12690f4866D1255d34507C86718a82808B47342d5395A3295J36007J33611f5533
12679B50713e784C36896d9922A25577e377C76110c5526o6542k80703B00493O0771
12668B61264G5697a004n7292a494G649K67354h5306D29228G1667O6378l6715d7216
$$ plain form
12655 528048 -253624 11454 -13453 48982 303462 8565 34690 -3353 117686 -79626 97968
12643 114825 54230 298966 220154 160591 -171134 -351745 232755 239895 3383 27578 116019
12632 116019 309382 131498 427545 -39874 -90990 429347 224734 236601 -130447 163578
12621 257933 215651 -9641 145298 124031 -5218 59975 46561 -66268 -26563 -50892 38632 -19081
12608 213304 -315243 49745 -184560 230760 -9894 27065 170388 173633 -134859 -120654 208212
12596 114674 183991 -154937 161024 459756 422721 -188577 313375 37942 -247765 152634
12585 -220865 -322649 93191 -57873 -60224 76677 304237 274828 -79751 141458 -57881 115875
12573 105846 154900 -101857 -13219 113514 222291 53682 -165848 249247 353942 -44367
$$ packed form
12655E28048b53624A1454a3453D8982K54480H565K6125c353A17686g9626I7968
12643A14825E4230K44736p8812n9563a71134j80611B32755P140C383K4195Q8441
12632A16019J93363A31498K96047c9874n1116D29347k04613J1867a30447A63578
12621B57933m2282i641A45298k1267e218E9975j3414f6268b6563k4329C8632a9081
12608B13304c15243D9745a84560B30760i894B7065J43323L245a34859J4205B08212
12596A14674O9317a54937A61024K98732l7035a88577C13375C7942b47765A52634
12585b20865j01784I3191e7873k351G6677K27560k9409g9751A41458e7881A15875
12573A05846M9054a01857a3219A13514J08777E3682a65848B49247J04695d4367
$$ plain form
12562 -82592 -92379 149158 -68630 -181777 230854 -50196 223317 39789 104559 -108668 -3614
12550 29184 39787 104239 -240436 -156089 -203797 -211427 -174897 -249998 -38134 48629 -124157
12538 -40893 157181 -55294 64689 202510 -334474 184132 90109 200220 108992 -99412 -78280
12527 -78280 -166607 -62964 46278 24467 244953 -169814 312478 199593 175787 448003 128743
12515 -192651 16323 -93937 32974 1986 -39932 71842 -10386 451046 44408 308077 -283702
12503 38343 192542 -32343 -80857 -73735 -117164 55165 84100 -172321 722 -136160 -180211 69981
12490 -22556 109278 -71311 -165470 181727 58727 -113370 228033 182772 -58539 89842 90979
12479 90979 -79925 -195102 73772 -45047 198661 -45313 120915 25679 56668 -127753 103775
$$ packed form
12562h2592r787A49158f8630j13147B30854e0196B23317C9789O4770a08668c614
12550B9184J0603O4452b40436Q4347m7708p630L6530p5101c8134D8629a24157
12538d0893A57181e5294F4689J37821c34474A84132I0109J10111r1228i9412K1132
12527g8280q8327f2964D6278k1811K20486a69814C12478j12885k3806K72216A28743
12515a92651A6323i3937C2974A986c9932G1842a0386D51046D4408K63669b83702
12503C8343J54199c2343m8514P122m3429E5165K8935a72321G22a36160m4051F9981
12490b2556A09278g1311r4159A81727E8727a13370B28033m5261e8539H9842J137
12479I0979g9925j15177G3772d5047A98661d5313A20915B5679L0989a27753A03775
$$ plain form
12467 -89413 30818 -183421 162163 169504 7992 -111280 95903 415167 -163372 168261 156515
12456 156515 -363760 156535 -63670 -78175 8443 188818 91296 103116 159623 -202000 151767
12444 116070 46892 -156357 -25528 -139047 91557 183676 229283 -238267 -184717 -82698 140425
12432 -115072 -4510 -70321 -267560 -40047 -112069 -115189 -253476 -238964 8105 163142 -155381
12420 94127 -66331 -310581 -167021 -7765 34714 3869 203405 61973 -16615 251826 -156658
12408 32085 11924 41223 -185340 100936 -219 93800 95103 -131612 -245818 19643 -142461
12396 90220 -83959 121810 -24051 6388 261049 -139375 156235 -281574 210360 -37136 -18193
12384 127778 -241055 247159 -75857 -388187 -63020 76676 119398 -39292 -81597 -104925 -103367
$$ packed form
12467h9413C0818a83421A62163P341G992a11280I5903L19264a63372A68261j1746
12456A56515c63760A56535f3670j4505H443J80375I1296J1820N6507b02000A51767
12444A16070D6892a56357b5528j13519I1557R2119M5607b38267N3550h2698A40425
12432a15072d510o5811j97239d0047p2022l120j38287J4512H105J55037a55381
12420I4127f6331k44250J43560g765C4714C869J99536F1973a6615B51826a56658
12408C2085A1924K9299a85340A00936b19I3800J303a31612j14206A9643a42461
12396I0220h3959A21810b4051F388K54661a39375A56235b81574B10360c7136a8193
12384A27778b41055B47159g5857l12330f3020G6676M2722c9292m2305k3328J558
$$ plain form
12373 -103367 181596 141034 -157556 25916 -157002 34176 108305 -133423 -267032 88603
12362 233972 -60291 -214209 -38447 311789 -181838 -69148 170820 382065 150565 127868
12352 127868 230868 -115153 -12806 139201 43299 -38928 386663 70973 87814 141847 155878
12341 155878 372007 -3734 18420 -33857 14210 338397 -76549 -114463 -109010 -96031 -182256
12330 -182256 196604 -41341 -15818 196625 -87723 -157849 -75146 19148 237856 -185883 -327388
12319 -327388 199928 98785 -278438 36961 -204687 165261 -57032 51313 133850 22814 445031
12308 445031 -180860 -16866 367864 -28171 74380 -14201 69610 247705 31458 -193563 346363
12296 53490 10021 355385 81834 2915 64183 263071 323161 -61767 246226 140604 -157984
$$ packed form
12373a03367A81596m0562a57556B5916a57002C4176P4129a33423j33609H8603
12362B33972f0291j53918c8447C11789a81838f9148A70820K11245A50565k2697
12352A27868J03000a15153a2806A39201D3299c8928C86663G0973J6841N4033J4031
12341A55878K16129c734A8420c3857A4210L24187g6549l7914N453J2979q6225
12330a82256A96604d1341a5818A96625h7723p0126g5146A9148K18708a85883j41505
12319c27388A99928I8785b78438C6961b04687A65261e7032E1313Q2537B2814M22217
12308D45031a80860a6866C67864b8171G4380a4201F9610J78095C1458a93563C46363
12296E3490A0021L45364H1834B915O1268J98888O0090f1767B46226j05622a57984
$$ plain form
12284 38017 -446114 97757 106659 73282 116141 -162197 -109568 -321028 285318 401049 352246
12273 352246 223329 75517 134834 10936 -141550 101964 -3161 179647 9426 -184867 -28719
12261 180768 112682 33913 12434 178244 107342 349973 160984 -24752 122902 10853 -203355
12249 262056 218841 247190 124832 309536 105574 48009 144799 240214 -72891 29024 -26641
12237 -39581 -3642 250962 50796 129218 93315 47065 2798 204319 124190 -70584 -29816 -17457
12225 -17457 -101600 93879 79088 310015 276673 -29636 347194 205585 106418 95270 94934
12214 94934 270530 -26966 10382 46489 88975 401409 490288 -184440 8701 -205317 15961
12202 11663 345153 131695 112925 100722 164647 606415 164290 214748 162141 210485 197325
$$ packed form
12284C8017d46114I7757Q902l3377M2859a62197N2629k11460B85318J15731m8803
12273C52246j28917G5517N9317A0936a41550A01964c161A79647I426a84867b8719
12261A80768o8086C3913A2434J65810p0902K42631A60984b4752A22902A0853b03355
12249B62056m3215K8349j22358J84704A05574D8009R6790R5415g2891B9024b6641
12237c9581c642B50962E0796P8422l5903m6250B798K01521q0129g0584b9816J2359
12225a7457q4143I3879j4791K30927l3342b9636C47194j41609r9167j1148l36
12214I4934J75596b6966A0382L6107M2486L12434Q8879a84440H701b05317A5961
12202A1663L33490A31695j8770j2203O3925M41768A64290N0458n2607M8344j3160
$$ plain form
12191 197325 65396 -156111 134009 -138424 -47448 -82261 21665 76781 -181192 -55254 27238
12179 -186208 84480 -29528 210124 327290 100474 -268655 -164659 161276 168003 155309
12169 155309 360875 -224129 193655 -3766 359329 96044 305810 148402 336204 -196446
12158 129639 147935 141447 209582 382849 176528 171171 25311 -16933 162484 1120 -122024
12146 -94818 -22135 187662 -393377 163154 373047 -178867 319913 169473 239039 119655
12136 119655 272660 195991 115814 152725 -115905 170251 -167571 -92317 168409 84279
12126 84279 -161259 -48968 193695 -125394 280806 -62964 -33916 49217 7629 301254 -201786
12114 -81125 181490 322837 -217425 125221 63420 -103695 186891 -20503 -37454 117973
$$ packed form
12191A97325F5396a56111A34009a38424d7448l4813B1665N5116a81192e5254B7238
12179a86208H4480b9528B10124J17166A00474b68655J03996A61276O727j2694
12169A55309K05566b24129A93655c766C59329I6044K09766A48402J87802a96446
12158A29639J8296o488O8135J73267A76528n357B5311a6933A62484A120a22024
12146i4818b2135A87662c93377A63154K09893a78867C19913j50440O9566j19384
12136A19655J53005p6669q0177L6911a15905A70251a67571P5254A68409q4130
12126H4279a61259d8968A93695a25394B80806f2964K9048D9217G629K93625b01786
12114h1125A81490J41347b17425A25221o1801a03695A86891b0503j6951A17973
$$ plain form
12103 388098 -81982 216901 98560 134444 -178819 -3889 -130567 71050 128593 -121506 -410376
12092 -410376 -20654 -197188 -14833 -193742 101859 -325893 -84070 -209720 -240206 21064
12081 -45268 172783 172757 -36689 -159917 314579 -181493 389423 187444 1184986 1872216 789589
12069 117841 323751 73188 182199 226793 -219649 192358 -557084 -30437 210861 58422
12058 102133 160892 105942 171487 418640 -53229 -167170 56706 298903 179430 -24568 82377
12046 92441 173568 -186383 -85675 130737 106283 106253 147211 122947 -67601 -18166 -9741 -148653
12034 -148653 -114969 -121216 -130545 -199475 97905 34563 -125940 -281804 -71908 151421 -99596
12022 250664 -117159 -142470 373062 94361 -65656 20543 -10843 -101262 -13663 149933 -270694
$$ packed form
12103C88098h1982B16901I8560L5884a78819c889j26678G1050N7543a21506k88870
12092d10376b0654j76534a4833j78909A01859c25893h4070j25650l0486B1064
12081d5268A72783k6c6689j23228C14579a81493C89423A87444R97542O87230G89589
12069A17841K05910G3188J09011M4594b19649A92358e57084c0437B10861E8422
12058A02133N8759n4950O5545K47153e3229j13941E6706K42197j19473b4568H2377
12046I2441Q1127a86383h5675A30737k4454l0M0958k4264f7601a8166Q425j38912
12034a48653L3684o247r329o8930I7905C4563a25940j55864g1908A51421i9596
12022B50664a17159k5311C73062I4361f5656B0543a0843r0419a3663A49933b70694
$$ plain form
12010 48878 203503 -71908 75841 -195034 53980 -131792 -7019 -62018 -41374 56677 -68186
11998 218543 -82125 124647 51379 249785 291276 92902 217479 -2883 4498 -100140 145898
11986 -230646 -60366 -227089 -102878 -130334 -145774 -242141 -296026 342899 112099 36327 185181
11975 185181 43431 348850 233388 305310 -23826 -160293 285471 -410854 -244564 127605
11964 -270378 253633 358054 -211221 262430 -252732 -99495 125835 127820 -36552 26411
11953 -100126 27537 -77556 -32600 -124448 95835 -88385 -128313 -286866 303193 -382985 -146667
11941 -308219 -21983 162200 213494 -202880 -57539 84413 -128913 350032 -297871 89776
11930 -397116 -101699 -53260 177895 86741 64679 121834 -112780 -203162 -49616 -12384 -37233
$$ packed form
12010D8878J54625g1908G5841a95034E3980a31792g019n4999K0644E6677f8186
11998B18543h2125A24647E1379J98406M1491I2902J24577b883D498a00140A45898
11986b30646f0366j66723a02878k7456j5440r6367n3885C42899A12099C6327J48854
11975A85181D3431L05419j15462P1922b3826j36467B85471d10854J66290A27605
11964b70378B53633J04421b11221B62430b52732i9495A25835J985c6552B6411
11953a00126B7537g7556c2600r1848I5835h8385l9928j58553C03193c82985a46667
11941c08219b1983A62200N1294b02880e7539H4413a28913C50032b97871H9776
11930c97116a01699M8439A77895H6741k2062N7155a12780r0382d9616a2384k4849
$$ plain form
11919 -37233 -240608 208619 -89521 250893 121255 -67916 105542 -129972 52614 103161
11909 103161 28700 -109640 207531 -170036 -274345 -32372 20632 -342038 133509 -43580
11898 -30724 -218876 253731 -220199 118699 20620 -98230 -309904 49091 117125 -55769 53831
11886 26989 148015 137033 -124770 -126761 175455 -130760 56357 73305 124744 95027 -76776
11874 177885 -102318 118255 163652 -272601 -132440 -101678 101677 202868 -371045 274406
11863 -50670 139735 -256871 -53726 -88047 -245366 19598 -100407 -2809 -200237 -51840 -141395
11852 -141395 57242 30928 -253977 -322332 199690 -69769 -74157 145914 108562 81396 -280761
11840 181712 35985 -276530 -201693 -121578 -43239 100431 -461642 44483 110351 -62384 230980
$$ packed form
11919c7233k03375B08619h9521B50893A21255f7916A05542a29972E2614N0547
11909A03161B8700a09640B07531a70036j04309c2372B0632c42038A33509d3580
11898c0724j88152B53731b20199A18699B0620i8230k11674D9091O8034e5769E3831
11886B6989J21026j0982a24770j991A75455a30760E6357J6948N1439k9717g6776
11874A77885a02318A18255M5397b72601a32440L0762A01677J01191c71045B74406
11863e0670A39735b56871e3726l4321j57319A9598a00407b809j97428e1840q9555
11852a41395E7242k6314b53977o8355A99690f9769m388A45914l7352k7166b80761
11840A81712C5985b76530P4837Q0115d3239A00431d61642D4483O5868f2384B30980
$$ plain form
11828 -200604 -191491 259733 -176993 145964 -255636 -69360 96182 290450 -147989 18082
11817 13195 -104079 126985 -109416 -13747 -116617 -60449 -110169 90568 -124910 -198482 -79198
11805 -161722 -71008 2230 -220405 -422269 -351322 -117283 56176 74855 -244036 -51842 -43892
11794 -43892 19811 -306631 227550 92122 358489 -175155 -114731 -42980 -227957 -244761 140760
11782 -11256 -100238 -9919 151727 156813 168465 64356 -181247 113608 -133120 49509 -17390
11770 2218 -141843 -106108 -359115 -101270 153075 9578 107743 -106707 9186 -33386 -65931
11759 -65931 -211189 234025 -192085 -145441 426345 28650 -8453 -218231 -88089 63540 -323256
11747 190156 37433 175388 32449 279202 -125563 18869 -68642 -115905 -234024 -89547 -319308
$$ packed form
11828b00604R113B59733a76993A45964b55636f9360I6182J94268a47989A8082
11817A3195a04079A26985a09416a3747j02870N6168m9720I0568a24910p3572g9198
11805a61722g1008B230b20405k01864P0947a17283E6176J8679b44036e1842P950
11794d3892A9811c06631B27550I2122K66367a75155O0424d2980j84977j6804A40760
11782a1256q8982i919A51727N086J1652F4356a81247A13608a33120D9509a7390
11770B218a41843L5735k53007a01270A53075I578R8165a06707I186c3386l2545
11759f5931j45258B34025a92085M6644D26345B8650h453k09778h8089F3540c23256
11747A90156C7433J37955C2449K46753a25563A8869f8642m7263j18119h9547k29761
$$ plain form
11736 -319308 256191 -9415 -55846 5280 -101915 198775 -441033 21408 -59136 217655 -55942
11724 -149505 -78486 49082 213948 -29337 25223 201360 163828 209597 -241283 22661 154194
11713 154194 132945 102572 -224362 -270985 -79708 -147338 -205468 18405 422718 -107177 24435
11701 29987 57523 -66701 193109 185923 157799 69504 -188029 118646 -22708 -107898 144224
11689 -4248 46859 -50577 -141383 193214 19421 312335 -43939 249034 398720 60451 163714
11678 163714 224331 203751 54083 -416737 11118 29606 102251 -142210 -126262 -313197 204957
11666 176557 27773 -174969 287874 -269144 29575 16778 386406 11413 202803 -13999
11655 261685 37045 188633 68695 101170 210063 198819 241592 -362338 43081 -282646 103187
$$ packed form
11736c19308B56191i415m6431E280a01915A98775d41033B1408e9136B17655e5942
11724a49505P1019D9082J64866b9337B5223J76137l7532M5769b41283B2661J31533
11713A54194k1249l0373b24362m6623g9708o7630n8130A8405M04313a07177B4435
11701B9987K7536f6701A93109p186k8124F9504a88029A18646b2708q5190A44224
11689d248D6859e0577r0806A93214A9421K92914d3939B49034J49686F0451J03263
11678A63714O0617k0580E4083d16737A1118J8488P2645a42210J5948j86935B04957
11666A76557B7773a74969B87874b69144B9575j2797L69628A1413J91390a3999
11655B61685C7045J51588F8695L2475J08893j1244M2773c62338D3081b82646A03187
$$ plain form
11643 -65034 85365 -29780 -71209 -110566 -41269 -118721 -145031 286535 417108 -22552 75668
11631 308546 -1443 -193405 131700 -10483 59892 -174636 -105626 -140862 -127579 4768 393249
11620 393249 212060 352932 -166799 -34862 81088 -271633 -130629 -155716 -45648 -103691
11610 -103691 226640 85061 -116340 -321230 90677 90777 235750 -27055 86964 -131367 -16562
11598 -44165 29716 -6805 439793 163836 -17868 319107 -12601 230163 -619 -102365 -118455
11587 -118455 -269783 220407 240246 207923 319862 120967 296561 72931 104892 -97731
11576 319598 104635 -79830 84599 116660 264018 289919 -41257 81812 163067 177743 -76027
11564 32198 -95397 198788 -138584 478879 85957 -251760 150168 -126615 316519 -276146
$$ packed form
11643f5034H5365b9780m1429l9357d1269p7452k6310B86535J30573b2552G5668
11631C08546a443j91962A31700a0483E9892a74636O9010l5236J3283D768L88481
11620C93249j81189J40872a66799c4862H1088b71633a30629k5087d5648n8043
11610a03691B26640H5061a16340k04890I0677J00J44973b7055H6964a31367a6562
11598d4165B9716f805D39793A63836a7868C19107a2601B30163f19j01746j6090
11587a18455j51328B20407J9839l2323J11939A20967J75594G2931L1961i7731
11576C19598A04635g9830H4599L2061J47358K5901d1257H1812Q1255J4676g6027
11564C2198i5397A98788a38584D78879H5957b51760A50168a26615C16519b76146
$$ plain form
11553 213375 120760 130158 208457 380561 118950 67097 16672 126800 332048 90751 75203
11542 75203 376461 152248 321564 428098 -11710 65306 210016 -108596 -10112 690592
11531 -186502 87842 -73519 -14460 -338019 128883 89253 214084 66232 147543 155279 192854
11520 192854 346113 41302 -106656 21555 336413 406791 107920 361586 271682 81597
11509 101932 -152940 -62930 313067 338966 417979 62987 62908 -170367 222033 70016 -82517
11497 -2250 39371 5560 -62555 206838 -102360 127084 197167 137121 311898 67236 -79305
11485 27919 62046 95040 138601 418963 1358 -31658 95450 -245793 175955 338822 -157460
11473 260105 -187118 223112 441204 90715 170076 162632 466738 154193 111667 224394
$$ packed form
11553B13375r2615R398P8299J72104A18950n1853A6672J10128K05248I0751j5548
11542G5203L01258A52248J69316J06534a1710F5306J44710a08596a0112F90592
11531a86502H7842g3519a4460l23559A28883l9630J24831F6232Q1311P736L7575
11520A92854J53259D1302a06656B1555L14858P0378A07920K53666q9904H1597
11509A01932a52940f2930C13067K5899P9013F2987p9a70367B22033G0016h2517
11497b250C9371E560f2555B06838a02360A27084P0083o0046J74777F7236g9305
11485B7919L4127L2994M3561K80362A358c1658I5450b45793A75955J62867a57460
11473B60105a87118B23112K18092I0715P9361p444L04106A54193m2526J12727
$$ plain form
11463 224394 50278 183509 -39864 12771 -155520 -69620 42941 48958 286668 108438 187047
11452 187047 30709 131699 122655 123887 180822 216953 293867 -11081 106060 -199915 261055
11440 4676 -44365 243503 -163599 -178205 68055 329979 329722 -179566 -316281 24636 -59410
11428 -73218 -104062 -129964 96645 120900 -96662 -459480 -127568 -148707 199555 72535 -321254
11416 -76791 122051 103989 206190 -56778 27284 322861 89945 436139 -244343 314175
11405 5315 -158435 44239 84086 107225 -301617 28479 114887 -25879 9130 -116600 -111666 217882
11392 -116656 138631 -49907 76492 201864 -116825 -42462 -60043 -123385 306225 76347 169108
11381 169108 -356817 -107964 -267329 188221 -135982 -236871 -20037 11172 140897 72588
$$ packed form
11463B24394E0278J33231c9864A2771a55520f9620D2941O017K37710A08438P8609
11452A87047C0709J00990r044J232N6935L6131P6914a1081A06060a99915B61055
11440D676d4365B43503a63599j4606F8055K61924k57a79566j36715B4636e9410
11428g3218l0844k5902I6645K4255i6662l62818a27568k1139A99555G2535c21254
11416g6791A22051j8062J02201e6778B7284K95577H9945L46194b44343C14175
11405E315a58435D4239L9847K3139c01617B8479Q6408b5879I130a16600M934B17882
11392a16656A38631d9907G6492J25372a16825d2462j7581o3342C06225G6347R2761
11381A69108c56817a07964j59365A88221a35982j00889b0037A1172J29725o8309
$$ plain form
11371 72588 -91298 -1026 152105 -40561 10708 187197 -160 -72331 -46803 155255 -71826 -166358
11359 -166358 -42438 142532 -41774 -174547 167414 -52533 28769 319284 -66314 147828
11348 -215551 172851 216474 -388073 22780 35566 43605 -293011 184118 -39906 262020 -9490
11336 149826 92400 -94674 -122207 -40139 -187685 125755 -10963 -209931 -113 154654 -91821
11324 -195477 -47786 -68444 2326 -102780 318418 -23747 94346 118111 148770 -67754 -319218
11313 -319218 -168342 143435 3333 34565 252745 118968 -28592 -295719 -100067 163550
11302 520936 -211737 -78186 -41667 -176032 -286573 140718 23336 130310 53249 -41504
11291 -43001 -73879 -29169 116882 -42012 -20922 -5555 26789 98629 -36296 28805 -139807
$$ packed form
11371G2588i1298a026A52105d0561A0708J76489a60p2171K5528A55255g1826r4532
11359a66358d2438A42532d1774j32773A67414e2533B8769K90515f6314A47828
11348b15551A72851M3623c88073B2780J2786Q039b93011A84118c9906B62020i490
11336A49826n7426i4674k7533d0139j47546A25755a0963j98968a13A54654i1821
11324a95477d7786k0658B326a02780C18418b3747I4346K3765L0659f7754k51464
11313c19218J50876A43435C333L1232K18180A18968b8592k67127a00067A63550
11302E20936b11737g8186L6519j34365j10541A40718B3336J06974E3249d1504
11291d3001l0878b9169A16882d2012b0922e555B6789P1840c6296B8805a39807
$$ plain form
11279 378795 189459 -33084 129889 42183 42788 -76276 -78880 -94123 -452 -123430 172160 74637
11266 -22856 -125072 -146987 -57861 -105374 12604 -287737 -84630 106866 -252348 318239 -181945
11254 176415 166969 -89484 -227638 -325063 73530 -42733 -291453 65730 -151599 -89588 -22698
11242 30494 -112041 390164 -287260 -119925 -176958 -139985 -355712 78762 -131544 33186
11231 144989 -171466 1916 66860 -206451 -116006 299576 -38932 118905 -95785 -420455 -98493
11219 56111 -294341 66083 -31511 172856 128549 91609 -163610 -90182 -328551 12886 130241
11208 130241 67966 -44413 4067 -164119 112379 -157584 56329 -323672 404046 214089
11198 214089 183677 16792 -286493 226450 -213627 -285961 -401456 -84972 -175430 -95905 -9293
$$ packed form
11279C78795j89336c3084A29889D2183O05g6276k604j5243d52j22978A72160G4637
11266b2856j02216k1915e7861m7513A2604b87737h4630A06866b52348C18239a81945
11254A76415r446h9484j38154r7425G3530d2733k48720F5730a51599O2011b2698
11242C0494a12041C90164b87260a19925n7033L6973k15727G8762a31544C3186
11231A44989a71466A916O4944b06451R0445B99576c8932A18905i5785l24670i8493
11219E6111b94341F6083c1511A72856m4307l6940a63610P3428k38369A2886J17355
11208A30241o2275d4413D067a64119A12379a57584E6329c23672D04046j89957
11198B14089l0412A6792b86493B26450b13627p2334j15495h4972r0458P9525i293
$$ plain form
11186 -34361 113635 -374663 -22547 -215711 -111773 -21097 -8006 23092 -78269 -175271 -189749
11175 -189749 49935 259048 53896 251129 -81742 -127716 -53714 -227267 -247762 -64484 -345019
11164 -345019 -194999 -208618 -15770 273942 166600 -269790 161822 154588 -229824 161392
11153 209204 -14305 -259423 4020 86305 -279211 173177 21567 -107667 173185 -88062 29987
11141 191067 -83038 216383 101754 35366 172349 144790 -42567 -44960 146024 529521 168199
11129 -3848 -74292 -96869 -128679 -77601 158314 137940 27977 -23297 -60220 -780 -240231 299318
11116 -130805 -152593 72265 277273 2719 177765 -29388 35323 104795 270958 253695 32862
11104 344957 29774 118332 349696 -75050 338353 299513 17321 339705 91377 -54061 521966
$$ packed form
11186c4361A13635c74663b2547j93164J03938b1097h006B3092g8269r7002j4478
11175a89749D9935K09113E3896J97233h1742m5974e3714j73553k0495f4484k80535
11164c45019J50020j3619a5770B73942j07342b69790A61822p234b29824A61392
11153B09204a4305k45118D020Q2285b79211A73177B1567a07667A73185h8062B9987
11141A91067h3038B16383A01754C5366J36983k7559d2567k393A46024L83497A68199
11129c848p0444k2577l1810N1078A58314k0374B7977b3297l6923g80k39451B99318
11116a30805k1788G2265K05008B719J75046b9388C5323O9472J66163j7263C2862
11104C44957B9774Q8558K31364g5050C38353l8840A7321L22384I1377e4061E21966
$$ plain form
11092 334217 61703 81196 253063 -64016 306954 528193 43941 278243 170600 121867
11082 121867 -99942 129132 246353 -94397 191592 243170 118330 279548 237599 268307
11072 268307 585384 248771 394796 222494 339978 574551 492621 429186 258353 441010
11062 441010 615664 366802 131720 397260 604496 376248 740068 563251 381369 411921
11052 411921 860698 644479 797550 678203 955816 727426 917763 755880 692970 1128355
11042 1128355 945106 599466 659950 521875 695212 808893 730730 763601 653911 838185
11032 838185 501765 543431 638986 705090 613978 618791 829374 946638 667951 708606 650515
11021 650515 469347 610317 401151 933570 293859 601957 740378 521760 517589 788508
$$ packed form
11092C34217F1703J9493J71867f4016C06954K21239D3941K34302j07643m8733
11082A21867i9942A29132J17221i4397A91592N1578A18330J61218m1949L0708
11072B68307L17077B48771J46025j72302J17484K34573q1930o3435j70833J82657
11062D41010J74654k48862A31720K65540K07236k28248L63820j76817j81882L0552
11052D11921M48777k16219J53071j19347K77613k28390J90337j61883o2910M35385
11042A128355j83249l45640O0484j38075J73337J13681p8163L2871j09690J84274
11032H38185l36420M1666R5555O6104r1112M813K10583J17264k78687M0655n8091
11021F50515j81168J40970k09166N32419B93859L08098J38421k18618m171K70919
$$ plain form
11011 788508 465147 538678 629143 545282 759272 635136 558842 889330 588043 733814
11001 733814 688608 662737 527260 747639 480421 804267 628047 734613 821269 420455
10991 420455 828953 779154 802414 870206 597661 581020 955452 768708 981804 1502304
10981 1502304 915674 1340727 1173664 1299662 1641244 1765640 1925215 2135936 2480843
10972 2480843 2506046 2875923 2689191 2656605 2864006 2308759 1993496 1909846 1884174 1540385
10962 1540385 1561838 1559989 1823981 1794170 1599991 2139884 1942832 2015007 1712582 1867054
10952 1867054 1183402 1563312 1339570 929592 602129 808911 419739 321021 449151 196684
10941 206693 282751 263034 204849 210163 108124 282263 385705 22760 -77374 2890 -21520
$$ packed form
11011G88508l23361P3531R0465q3861K13990j24136p6294L30488l01287J45771
11001G33814m5206k5871j35477K20379k67218L23846j76220J06566Q6656m00814
10991D20455M08498m9799K3260O7792k72545j6641L74432j86744K13096N20500
10981A502304n86630M25053j67063J25998L41582J24396J59575K10721L44907
10972B480843K5203L69877j86732l2586K07401n55247l15263q3650k5672l43789
10962A540385K1453j849K63992k9811j94179N39893j97052P2175l02425J54472
10952A867054o83652L79910k23742m09978l27463K06782l89172r8718J28130A96684
10941B06693P6058j9717n8185N314j02039J74139J03442B2760g7374B890b1520
$$ plain form
10929 -21068 -91664 70458 -278195 29441 -66314 356037 92740 -106324 -99868 66003 -96690
10917 299168 84403 263597 190210 24450 69570 45823 366867 -22857 -13623 53402 180891
10906 180891 -76549 -108031 -229132 208489 -153405 195196 -56589 253706 -62196 -116344
10896 -116344 -208475 448109 201030 45624 -117116 -16798 3982 119680 -70853 74830 209413
10885 209413 131617 136199 90792 -33493 -261220 -137821 195128 -338780 -26645 -331602 66898
10873 275546 309958 -78030 125 -61341 -349671 -12640 -83163 232700 94240 103013 41927 -204149
10860 26894 -2234 -126357 167962 -50713 41028 -176574 -340152 -84438 54318 249667 116467
10848 -261935 61133 134700 113463 -1501 323806 -116960 -9101 -199306 -15517 -180347 196972
$$ packed form
10929b1068p0596G0458b78195B9441f6314C56037I2740a06324O456F6003i6690
10917B99168H4403J79194p3387B4450M5120k3747L21044b2857R234E3402J27489
10906A80891g6549l1482j21101B08489a53405A95196e6589B53706f2196n4148
10896a16344r2131D48109B01030D5624a17116a6798C982J15698g0853G4830J34583
10885B09413p7796M582m5407c3493k27727J23399A95128c38780b6645l04957F6898
10873B75546L4412g8030A25f1341k88330a2640p0523B32700I4240Q773D1927b04149
10860B6894b234j24123A67962e0713D1028a76574j63578h4438E4318J95349A16467
10848b61935F1133P3567k1237a501C23806a16960i101j90205a5517j64830A96972
$$ plain form
10836 145931 102360 427949 16426 -266154 -23072 211983 168402 -312006 -109325 -93431
10826 -93431 33334 -46179 288574 172735 -95061 -231654 109839 -75901 -54619 -75707 60628
10814 -191083 155269 379367 -38734 -98535 -71257 -93415 -119546 -153676 -85794 102455 -80106
10802 -396132 -88518 -73059 210180 318123 160270 201556 5457 207338 -92522 -174335 280925
10790 -280372 -82486 -19431 231957 -38171 -301693 -259222 -447541 196155 9289 158720 -11939
10778 -168689 -127739 -97827 477454 1370 -135550 18955 -132104 -138336 138034 180329 -20174
10766 -183101 -187427 -99777 105183 54153 78297 11966 -199187 3492 263166 -260315 -215379
10755 -215379 -84796 210506 -51716 -391594 -195521 -13569 189476 1987 -191480 -454729
$$ packed form
10836A45931m3571L25589A6426b66154b3072B11983m3581c12006a09325J5894
10826i3431C3334d6179B88574j15839i5061j36593A09839g5901K1282k1088F0628
10814a91083A55269K24098c8734n9801K7278k2158k6131l4130O7882A02455h0106
10802c96132h8518J5459B10180J07943j57853M1286E457K01881i2522q1813B80925
10790b80372h2486a9431B31957c8171k63522M2471j88319A96155I289J49431a1939
10778a68689M0950K9912D77454A370a35550A8955a32104o232A38034M2295b0174
10766a83101m326Q7650A05183n1030K4144A1966a99187C492K59674b60315M4936
10755b15379h4796B10506e1716l39878a95521a3569A89476A987a91480k63249
$$ plain form
10745 -454729 -176735 -271966 201722 25351 -149533 100466 100912 -164751 44 109018 -108986
10733 -208022 -53832 -198120 2878 -93937 -303502 -16102 64229 130390 -67154 -122412 196571
10721 -278280 -29480 -8903 -255623 -269550 86767 -250461 -158767 46374 49071 -122124 56329
10709 -153080 -312335 -161564 22890 115932 70866 99326 -229813 345329 -233529 -144676
10699 -144676 -251425 -22679 -62169 -388048 113384 144101 27254 365220 189592 -61161
10688 -204000 -24098 -52481 -61925 41683 73887 77336 491642 146691 124103 -112264 -72298
10677 -72298 30318 4578 -175236 -42207 -194221 -38206 142151 -61380 -261932 -23199 42488
10665 173574 80558 164027 -378023 -69636 -363312 64663 181618 -84452 49382 -213544 -29197
$$ packed form
10745d54729a76735r5231B01722B5351a49533A00466M46a64751D4J08974a08986
10733b08022e3832j44288B878i3937k09565a6102F4229O6161f7154n5258A96571
10721b78280b9480h903k46720j3927H6767b50461R1694D6374K697a22124E6329
10709a53080j59255J50771B2890R3042m5066K8460b29813C45329b33529Q8853
10699a44676j06749b2679l9490l25879A13384L0717B7254L37966j75628f1161
10688b04000b4098k8383r444D1683L2204L449M14306A46691k2588a12264L9966
10677g2298C0318D578a75236d2207j52014c8206A42151f1380k00552b3199D2488
10665A73574H0558Q3469c78023f9636k93676F4663J16955h4452D9382b13544b9197
$$ plain form
10653 -253986 -87908 -218684 -58423 76901 906 -118921 -41135 67410 -294778 -40253 223040
10641 192115 -57971 -12624 242518 -98233 -219686 -236904 4109 92756 -250938 -37902 -285708
10630 -285708 -269898 -29356 -259272 291494 -71436 -125527 -110281 11085 -275882 324702 -68747
10618 -4175 193919 15643 88130 -54991 -237100 306763 8207 188871 -217453 -368973 -145081
10606 -74200 -113352 2333 -314203 -129410 223859 -229009 -117195 -200309 -261802 70590 -69974
10594 285125 149790 -180814 -35248 214008 -169659 -294712 360741 -220787 2341 -155458
10583 -41957 110232 68053 25796 63622 -47365 130437 -78558 -5946 -136626 -91064 -58106
10572 -58106 91303 -156711 -23176 289030 302203 -242525 -230702 -205134 -307459 -23801 63806
$$ packed form
10653b53986h7908j30776e8423G6901I06a18921d1135F7410b94778d0253B23040
10641A92115e7971a2624B42518i8233j21453j7218D109Q8647b50938c7902k47806
10630b85708J5810b9356k29916B91494g1436n4091J5246A1085b75882C24702f8747
10618d175A93919A5643P2487e4991j82109C06763H207J80664b17453j51520a45081
10606g4200l9152B333c14203a29410B23859b29009J11814q3114o1493G0590f9974
10594B85125j35335a80814c5248B14008a69659j25053C60741b20787B341a55458
10583d1957A10232m2179B5796L7826d7365A30437g8558e946j30680M5562L2958
10572e8106I1303a56711b3176B89030J3173b42525J1823K5568j02325b3801F3806
$$ plain form
10560 -454652 137360 -66732 -130937 48889 -265112 -228373 -69507 55057 113411 -331134 313081
10548 -176009 121413 165814 -5853 -36324 -252885 -168968 140705 -94472 -130698 -226065 60915
10536 -216062 -326409 -373829 326159 51006 300085 33521 -234501 -195092 -19887 135907
10525 -231034 26092 -76334 -360514 99763 213312 -187190 -534855 -61385 -9535 -104150 -142142
10514 -142142 181095 -147933 9338 107737 9699 96705 507639 58096 130616 122143 136921
10503 136921 -89921 -47034 232631 -40229 36606 -6524 -253498 99508 -136674 -214772 -138169
10492 -138169 -95910 101918 -203430 67301 -117965 -195539 -11161 52894 299913 71040 265227
10481 265227 793185 747027 1035402 484622 -30522 265070 250297 -136762 -425 246881 251863
$$ packed form
10560d54652A37360f6732o4205D8889b65112L6739f9507E5057N8354c31134C13081
10548a76009A21413M4401e853l0471k16561Q3917A40705i4472l6226r5367F0915
10536b16062j10347m7420C26159E1006K49079C3521b34501L9409a9887A35907
10525b31034B6092g6334k84180I9763J13549a87190l47665f1385i535r4615l7992
10514a42142A81095a47933I338R8399I699Q7006M10934E8096P2520q473J4778
10503A36921h9921M2887B32631d0229C6606f524k46974I9508a36674p8098P6603
10492a38169M2259A01918b03430F7301a17965p7574a1161E2894K47019G1040J94187
10481B65227N27958m6158K88375D84622c0522B65070j4773a36762d25B46881M982
$$ plain form
10470 251863 225548 -15752 97507 -28693 1177 -255702 -17833 -34762 -190689 -120052 179094
10458 -123300 -219460 -134747 -145368 -141599 158871 -240820 -158238 -517196 -74952 103107 -125311
10446 -263471 144566 -174523 388147 -242202 -150649 -186681 171745 197611 127319 -126256
10435 -96994 -366953 -165802 79022 227694 -23740 180715 87586 -23522 -42314 -175793 -82119
10423 -215843 184469 -23474 102984 -19583 210927 -156634 -72495 31613 -209639 170285
10412 43665 189484 -162478 -288280 333883 284643 -48100 -186071 -549162 -114959 31758
10401 95179 -37879 131339 44041 515421 -330839 -263840 82785 178037 72207 359658 247964
10390 247964 -134739 188346 384352 286704 84256 32084 -291982 129128 -50536 210405
$$ packed form
10470B51863k6315a5752I7507b8693A177b55702a7833j6929j55927P0637A79094
10458a23300r6160Q4713j0621L769A58871b40820Q2582l58958g4952A03107a25311
10446b63471A44566a74523C88147b42202R1553l6032A71745K5866p0292a26256
10435i6994k69959a65802G9022J48672b3740A80715H7586b3522j8792j33479h2119
10423b15843A84469b3474A02984a9583B10927a56634g2495C1613b09639A70285
10412D3665J45819a62478j25802C33883m9240d8100j37971l63091a14959C1758
10401I5179c7879A31339D4041M71380c30839O6999H2785R5252G2207K87451j11694
10390B47964a34739A88346J96006r7648H4256C2084b91982A29128e0536B10405
$$ plain form
10379 277957 581853 118744 -37588 270920 73005 84445 421705 337612 372013 52043 38457
10368 38457 311227 587319 465716 265749 334685 74973 13906 30113 145335 147468 111357
10357 111357 202232 291258 251533 518528 483822 211217 569396 431070 540525 729462
10347 729462 428024 -38311 279683 309407 623200 416267 148318 83095 -216495 445575
10336 335773 354487 252678 270029 80546 227085 -142412 257606 299354 200732 149600 262472
10325 262472 354909 -48526 -11058 702517 382678 316856 -41868 97603 -86316 447645 322793
10314 322793 226115 240114 -22935 34968 -147834 -288298 -128830 -193429 -325097 -37108 65749
10302 130714 -137981 -57337 -190700 -212291 -54828 24823 217937 94061 -72897 40810 -428967
$$ packed form
10379B77957L03896A18744c7588B70920G3005J1440L37260q4093L4401E2043j3586
10368C8457K72770K76092j21603j99967O8936G4973A3906J6207J15222K133l6111
10357A11357R0875Q9026l9725K66995l4706B11217L58179j38326J09455J88937
10347G29462l01438c8311B79683K9724L13793k06933A48318o5223b16495D45575
10336C35773J8714j01809J7351H0546J46539a42412B57606M1748r8622n1132J12872
10325B62472R2437d8526a1058G02517l19839o5822d1868I7603h6316D47645j24852
10314C22793r6678J3999b2935C4968a47834j40464a28830o4599j31668c7108F5749
10302A30714a37981e7337j33363k1591e4828B4823J93114I4061g2897D0810d28967
$$ plain form
10290 312325 -151277 71904 86165 210711 -176491 -247267 304501 214108 -265080 -35111
10279 91869 -148125 283489 -158239 -101902 66861 -88111 -20713 11259 -118245 139414 -95391
10267 33227 55337 -238520 -37632 -27700 -211910 16721 137087 304048 300013 429710 -82325
10255 225287 537757 419569 232413 200429 -310787 126014 57466 -41313 -406534 -171386
10244 139472 -277342 191274 -38034 60603 125088 -85742 -14245 -348501 19980 -68123 49349
10232 -347570 250310 150441 36137 -62782 -56122 136995 31524 40823 182756 -154844 -30682
10220 -193285 -76018 174998 36018 -253539 -357306 -52198 97158 -304730 -101555 -272413
10210 -272413 324111 175345 150807 -53733 -199896 113695 -342383 -190098 -47537 -187373
$$ packed form
10290C12325a51277G1904J4261J24546a76491p0776C04501r0393b65080c5111
10279I1869a48125B83489a58239N6337F6861h8111b0713A1259a18245A39414i5391
10267C3227K2110b38520c7632R932j84210A6721J20366J66961m035J29697h2325
10255B25287L12470j18188j87156l1984c10787A26014E7466d1313l65221a71386
10244A39472b77342A91274c8034F0603O4485h5742a4245l34256A9980f8123D9349
10232c47570B50310r9869C6137f2782O660A36995C1524R299J41933a54844c0682
10220a93285g6018A74998C6018b53539j03767e2198I7158c04730a01555j70858
10210b72413C24111j48766k4538e3733j46163A13695c42383J52285d7537j39836
$$ plain form
10200 -187373 164101 -88608 -149796 8628 -9921 -360903 136776 82923 -122250 -62354 167729
10188 -301591 -179547 -206210 70166 -46783 149310 121530 -97953 -111704 323801 74 -249802
10176 -57638 -57803 -99450 -252520 238733 -15645 -211334 250804 -78164 7307 -154947 -163463
10165 -163463 -26662 102634 53698 -303921 -126734 256666 -293016 3841 133081 214114
10155 214114 -269258 175223 -100698 -184498 -321971 250493 800 -67359 -199722 -239935 -18221
10143 -159305 138235 23592 -135055 33131 -81019 -225184 -84683 -97121 -142091 -196368 -153103
10132 -153103 -243915 4534 28716 126018 -238138 -173967 -12902 -42960 -252905 -37795 -96767
10121 -96767 -163315 -192659 -205866 -158119 -105694 -404817 -505898 -145988 -493125 -201708 -108017
$$ packed form
10200a87373A64101h8608o1188H628i921l50982A36776n3853a22250N9896A67729
10188c01591J22044k6663G0166d6783A49310k7780i7953j3751C23801G4b49802
10176e7638j65m1647j53070B38733a5645j95689B50804g8164G307a54947q516
10165a63463b6662A02634m8936c03921a26734B56666b93016C841J29240Q1033
10155B14114b69258A75223a00698q3800j37473B50493H00f7359j32363m0213a8221
10143a59305A38235B3592a35055C3131h1019j44165h4683j2438m4970n4277M3265
10132a53103r0812D534K4182R7302b38138O4171a2902l0058k09945c7795n8972
10121i6767o6548k9344j3207M7747N2425k99123j01081a45988l47137b01708R3691
$$ plain form
10110 -108017 -198831 -152743 -104578 37818 153832 -153571 -297106 -164156 -37185 -84464 -311388
10099 -311388 107274 -16273 -252905 -66934 -224365 -115636 23306 -226929 -54786 -116525
10089 -116525 -48401 -193561 8786 190004 12382 -75071 -52988 -10794 -386574 -143544 156701
10077 -111812 104968 -165445 -24185 26745 -382812 -425409 -199964 -75361 -140972 -167906 -177564
10066 -177564 14653 311016 -22773 11014 -87958 166905 -16774 -275522 44907 -69710 -157365
10055 -157365 209650 -93474 -167828 -268134 -13166 116518 120516 214056 -114394 70618 -42603
10043 -298846 -51985 -48591 -94672 243902 -52632 -112397 -14347 -276835 -54394 -327252 -379465
10032 -379465 -387847 1577 -86776 -175286 -30573 -148843 -106947 -65493 -87835 -196089 -158750
$$ packed form
10110a08017r0814M6088M8165C7818J16014a53571j43535J32950c7185m7279k26924
10099c11388A07274a6273k36632f6934j57431J08729B3306b26929e4786o1739
10089a16525d8401j45160H786J81218A2382g5071K2083a0794l75780a43544A56701
10077a11812A04968a65445b4185B6745c82812m2597a99964g5361o5611k6934r658
10066a77564A4653K96363b2773A1014h7958A66905a6774k58748D4907f9710q7655
10055a57365B09650i3474p4354j00306a3166A16518L998R3540a14394G0618d2603
10043b98846e1985L394m6081B43902e2632n9765a4347k62488e4394k72858n2213
10032c79465q382A577h6776q8510c0573j18270M1896M1454k2342j08254L7339
$$ plain form
10021 -158750 151195 39539 -108527 216556 172562 -139207 -63104 -94955 -321956 48909
10010 129821 -132228 18433 268126 -242795 -63906 -24470 178264 -317629 164454 83983
10000 83983 43922 -66353 -119908 -268846 -20846 196611 208040 47869 19785 -77041 -188747
9989 -188747 13139 -43580 -75061 -71931 122884 177780 183166 -70771 -144249 -180795 -245315 -100055
9976 -153941 -169478 95246 -88490 -359061 -268404 -87534 191100 158590 -412 -42608 33960 213565
9964 213565 -172887 -337146 3512 72803 -142989 -290700 -43475 88490 -106607 16511 61705
9953 61705 -48268 -92410 22470 -237103 102764 348730 -267315 -175514 -3246 -171425 -94817
9942 -94817 -216378 212678 178098 -48066 -142233 -16135 -106517 -181971 175557 -184158 533705
$$ packed form
10021a58750A51195C9539a08527B16556m3994a39207f3104l1851k27001D8909
10010A29821a32228A8433K49693b42795f3906b4470A78264c17629A64454q0471
10000H3983m0061f6353n3555j48938b0846A96611J1429D7869A9785g7041j11706
9989a88747A3139d3580l1481L130A22884N4896N386g0771p3478l6546o4520a00055
9976a53941j5537I5246h8490k70571R0657h7534A91100l2510d12m2196C3960J79605
9964B13565a72887j64259C512O9291a42989j47711d3475H8490a06607A6511M5194
9953F1705d8268m4142B2470b37103A02764K45966b67315R1801c246j68179P6608
9942i4817j21561B12678l4580d8066r4167a6135r0382p5454A75557a84158E33705
$$ plain form
9930 -272634 511964 145287 -152180 -221280 187340 -42837 -47456 435133 -297941 175910
9919 225443 55517 -132867 -42978 -15755 -254543 -145808 -162800 -248527 -293415 61182 -78724
9907 -252202 -80354 -344784 -184141 51471 -8981 -536456 -287784 -7686 183308 58049 -348871
9895 -14055 176301 -280363 38114 -221207 -277625 -141621 43728 213693 -160457 -73008 -196548
9884 -196548 11317 224758 -259845 -120873 -431590 -192818 -213872 -100051 -197499 91770
9873 258205 -17996 15888 -98063 -136280 -275108 87163 315055 -121103 -28767 150565 -42151
9861 185292 -186198 -9018 -237040 -153035 -186621 -431159 62658 -150429 -11436 11486 -147138
9849 -165665 -2311 196920 94465 29125 337221 130027 -67949 -313448 -115927 37951 -380257
$$ packed form
9930b72634E11964A45287a52180o9100A87340d2837m619D35133b97941A75910
9919B25443E5517a32867d2978a5755k38788J08735j6992q5727m4888F1182g8724
9907b52202h0354k64430J60643E1471h981n27475K48672g686A83308E8049c48871
9895a4055A76301b80363C8114b21207n6418J36004D3728J69965a60457g3008j23540
9884a96548A1317K13441b59845a20873l10717a92818k1054a00051r7448I1770
9873B58205a7996A5888i8063l8217j38828H7163K27892a21103b8767A50565d2151
9861A85292a86198i018k28022Q4005l3586k44538F2658a50429a1436A1486a47138
9849a65665b311A96920I4465B9125L08096A30027f7949k45499a15927C7951c80257
$$ plain form
9837 -94791 -145196 -130502 -167569 -141970 -158751 -73218 -43315 -61997 -35221 -12020 -170509 -190713
9825 -190713 -220131 -177306 49223 -266759 5199 8578 29696 253393 -224589 -87902 -112418
9814 -112418 -164550 -173130 -213828 -14482 -125256 -356073 -349798 205928 -119136 87797 -358198
9802 114862 -79486 -35469 144971 19268 54774 -37506 -8903 139344 -72625 -178239 -263023
9791 -263023 -164742 -230419 43755 -57693 72033 -303420 -149589 48519 -91372 -53976 -154080
9780 -154080 -41863 93047 -17387 -69437 192166 62370 -92796 72228 -42813 73028 -24397
9768 -112620 148220 311871 -39488 -261258 -174297 115365 -174203 -481593 -187587 -84975
9757 85313 309917 241392 -309948 -202009 -142351 -173024 -22565 103275 -104655 -296975 3462
$$ packed form
9837i4791n0405J4694l7067K5599j6781g3218K9903j8682K6776a2020j58489k0204
9825a90713k9418M2825D9223b66759E199L379K1118K23697b24589h7902k4516
9814a12418n2132q580m0698a4482j10774k30817O275B05928a19136H7797c58198
9802A14862g9486c5469A44971A9268L5506c7506h903A39344g2625j05614q4784
9791b63023R8281o5677D3755e7693G2033c03420a49589D8519i1372L7396j00104
9780a54080d1863I3047a7387n2050A92166F2370i2796G2228d2813G3028b4397
9768a12620A48220J63651c9488k21770Q6961A15365a74203l07390a87587h4975
9757H5313K24604o8525c09948J07939N9658l0673b2565A03275a04655j92320C462
$$ plain form
9745 38081 -38367 13039 -32381 -66185 6872 -80340 160801 -47401 -17182 4845 163779 -173977
9732 -311078 -160346 -171015 -262684 -43118 74334 189814 -542 179042 -9729 80342 -292655
9720 36028 -41833 -399375 -80352 84119 -146332 21718 -19331 -408766 -41959 -89932 -150988
9709 -150988 202470 71512 -167084 246514 -249208 49120 -193827 -61400 225207 -37189
9698 -152214 -46990 -292540 110960 169436 -157096 -99078 -106684 -254375 -94094 -5388 26470
9686 -142834 -395596 -116970 -276084 -162686 42977 -151504 47238 -207198 -507321 -270618
9676 -270618 -87391 -317695 -631 118948 -3204 99293 -383389 165528 -307610 253678 -187698
9664 161277 27931 26762 -345791 -38861 -80999 -12291 -55758 356321 -233237 228663 -152630
$$ packed form
9745C8081c8367A3039c2381l3804F872h0340A60801d7401a7182D845J58934a73977
9732c11078J50732j0669r1669d3118G4334J15480e42A79042i729H0342b92655
9720C6028d1833l57542h0352H4119a46332B1718a9331l89435d1959m7973o1056
9709a50988B02470G1512a67084B46514b49208D9120a93827f1400B25207c7189
9698a52214d6990k45550A10960N8476a57096N8018p606j47691i4094e388B6470
9686a42834k52762a16970j59114J13398D2977a51504D7238b07198l00123K36703
9676b70618h7391k30304f31A18948c204I9293c83389A65528c07610B53678a87698
9664A61277B7931j169c45791c8861m2138a2291m3467C56321b33237B28663a52630
$$ plain form
9652 -46475 178727 -26722 -155243 -198686 -194456 4614 -134973 -120570 -168391 -35006 15459 -368119
9639 -167109 -203219 82568 -137210 -204708 -33065 -150462 -183495 16279 -150241 -17115 22424
9627 54859 -285537 -227415 128065 412571 -48948 -178654 -53741 -552824 -21550 -82073 -220822
9616 -220822 -93976 1310 -96912 -220670 -58882 -46134 -116543 35659 -64336 -185870 13527
9604 -17666 -430281 -184393 -66103 358849 63304 2112 -258149 23176 112790 161304 16576
9592 101511 -363040 -107289 -358113 -34558 -341600 136591 83563 115205 1738 33329 205114
9581 205114 68639 -295184 212918 -237744 -73907 17267 39075 -33278 -283016 -134787 -66767
9569 -226758 178562 -116627 -166258 -167859 -118250 -38114 148952 62413 158854 850 -182215
$$ packed form
9652d6475A78727b6722j28521m3443M230D614a34973J4403m7821c5006A5459c68119
9639a67109l6110H2568a37210o7498c3065j17397l3033A6279a50241a7115B2424
9627E4859b85537N8122A28065K84506d8948j29706e3741m99083b1550o0523j38749
9616b20822i3976A310i6912j23758e8882J2748p0409C5659f4336j21534A3527
9604a7666m12615a84393f6103C58849F3304B112b58149B3176Q9614M8514A6576
9592A01511c63040a07289k50824c4558l07042A36591n3028L1642A738L1591J71785
9581B05114F8639b95184B12918b37744g3907A7267K1808c3278k49738a34787f6767
9569b26758A78562a16627m9631j601M9609c8114A48952F2413R6441H50a82215
$$ plain form
9557 -232035 -92931 -73901 -47240 -12659 -185824 -295331 -337642 -11869 38229 25127 -100377
9545 145028 -11103 -2099 240110 -514772 -201111 17679 -275230 98236 65156 94975 -129425
9533 -86442 -259092 -68434 61332 -121049 -204518 -195756 -445176 -37604 -144081 152098 126831
9522 126831 -109458 -71579 -133679 168805 -28516 142816 -5143 144731 293748 101425 13908
9510 -7266 77617 -115652 149890 -160560 -156236 -313656 -237911 -243920 56141 243032 103016
9498 -70147 -252513 14073 -30294 258729 -184304 249545 20365 -59834 -283728 -332630 91658
9486 -251957 -266327 249416 56026 -72665 -57255 130458 -208072 175823 368159 91982 -106193
9474 206628 -75094 -49525 -286300 -3412 -30405 -64735 102229 -242072 91202 -80071 -28350
$$ packed form
9557b32035i2931J9030K6661a2659j73165j09507m2311a1869C8229j3102a00377
9545A45028a1103b099B40110e14772b01111A7679b75230I8236l3080K9819a29425
9533h6442j72650f8434F1332a21049q3469Q762k49420c7604j06477A52098k5267
9522A26831a09458L7879o2100A68805b8516A42816e143A44731J49017A01425A3908
9510g266G7617a15652A49890a60560M324j57420P5745o009E6141J86891A03016
9498g0147j82366A4073c0294B58729a84304B49545B0365e9834k23894m8902I1658
9486b51957j4370B49416E6026g2665J5410A30458b08072A75823J92336I1982a06193
9474B06628g5094K5569k36775c412k6993l4330A02229b42072I1202h0071b8350
$$ plain form
9462 16227 -158437 -6406 -97656 42333 -31527 -120096 -646 -63495 220572 -152333 -314672 295331
9449 -343547 117540 150020 17063 -84782 30287 -552813 23449 177934 -16823 -291199 100954
9437 -354866 204687 19655 172718 -194455 -146269 -51101 102039 38455 -285642 -186431 -270410
9426 -270410 -62553 -101394 149202 42633 19603 -78301 63387 -247025 3870 166352 226725
9415 226725 52531 22164 -15840 -182125 123307 32206 -95796 -131463 34757 -481956 276366
9403 -161509 152108 169325 163272 -17916 -65087 23640 -58846 142947 -138588 -184343 -391932
9392 -391932 -76935 -59552 -245667 113307 20926 -217590 339547 -251386 -144931 -212916
9382 -212916 -40576 -29309 -54412 -130242 312045 -400294 -209168 -324169 31363 -293309 -52178
$$ packed form
9462A6227a58437f406r1250D2333c1527q8569f46o2849B20572a52333j62339B95331
9449c43547A17540L2480A7063h4782C0287e52813B3449J54485a6823k74376A00954
9437c54866B04687A9655J53063a94455M8186e1101A02039C8455b85642R9211q3979
9426b70410f2553l8841A49202D2633A9603g8301F3387b47025C870J62482O0373
9415B26725E2531B2164a5840j66285A23307C2206i5796l5667C4757d81956B76366
9403a61509A52108J7217o053a7916m7171B3640e8846A42947a38588m5755k07589
9392c91932g6935J7383j86115A13307B0926b17590C39547b51386J06455o7985
9382b12916d0576J1267k5103p5830C12045d00294J91126j15001C1363b93309e2178
$$ plain form
9370 -236218 -57551 -237031 -38824 320108 -22669 1476 236150 -290528 -104551 -79376 -203613
9359 -203613 -161961 109039 159979 133786 -172368 -43827 115042 370648 37108 240967 45582
9347 49873 -139021 84031 24799 -167479 4667 -35107 3599 -113549 80605 -153804 -126351
9336 -126351 -10762 352587 -120803 -357967 -179216 -429546 216397 -3373 -166649 156310
9325 -254151 47027 -273582 -297313 -336177 -205721 -257887 47267 -50279 25447 -204324 147219
9313 1544 -320748 -72142 8854 61013 -163186 -2001 -184206 -54244 79587 156081 -74405 -200637
9301 -200637 90542 67493 -289478 -214572 117229 -193411 38308 156178 -26704 -297831 -119200
9289 -294775 -51092 -358695 -177079 -267478 -81277 13929 -165514 -148638 -188578 87737 47933
$$ packed form
9370b36218e7551j79480c8824C20108b2669A476K34674b90528a04551K5175j24237
9359b03613M1652A09039N0940k6193a72368d3827A15042K55606C7108K03859D5582
9347D9873a39021H4031B4799a67479D667c5107C599a13549H0605a53804K7453
9336a26351a0762C52587a20803k37164J78751k50330B16397c373j63276A56310
9325b54151D7027b73582k3731l8864J30456n2166D7267e0279B5447b04324A47219
9313A544c20748g2142H854N2159a63186b001j82205e4244G9587P6494g4405j26232
9301b00637I0542k3049b89478P4906A17229a93411C8308J17870b6704k71127a19200
9289b94775e1092l07603a77079r0399h1277A3929a65514J6876l9940H7737l9804
$$ plain form
9278 47933 256101 -43781 119722 -289496 165246 -8315 -97059 -52030 -191712 29 -41811 -51646
9266 -51646 -170969 -206220 -222266 -280056 -49782 -162666 -46080 150793 -34121 115820 -27016
9254 -367057 359189 -209512 -167941 -303271 -11696 -171588 -4022 -231305 -121720 -50772 99867
9242 -342245 -136777 -464872 55267 -230150 133563 -192921 -215330 -575475 134644 -198802
9231 -128441 -125864 -248897 32288 16425 -108084 -48535 23231 -333676 106275 -134747 -54483
9219 284294 24496 118327 -8321 107340 175253 167639 -139581 208540 -242092 -251401 -32576
9207 -48891 79950 58656 -65599 -148465 -215462 14042 -98467 -146747 -2773 328150 -36698 -115853
9195 -115853 116841 31608 -161629 -28450 90844 -194942 -68813 35380 -188407 -100705 40988
$$ packed form
9278D7933K08168d3781A19722b89496A65246h315q8744M5029j39682B9d1811r835
9266e1646j19323l5251j6046n7790d9782j12884d6080A50793c4121A15820b7016
9254c67057C59189b09512M1571j35330a1696j59892d022k27283J09585e0772I9867
9242c42245a36777l28095E5267b30150A33563a92921k2409l60145A34644a98802
9231a28441K577j23033C2288j5863a08084d8535B3231c33676A06275a34747e4483
9219B84294B4496R3831h321A07340O7913p614a39581B08540b42092r309c2576
9207d8891G9950k1294f5599q2866o6997A4042i8467m8280b773C28150c6698p9155
9195a15853A16841C1608a61629b8450I0844a94942f8813C5380a88407Q7702D0988
$$ plain form
9183 34154 154284 -106406 -73002 -36609 179002 140527 -50266 142681 -175702 -98934 -90488
9172 -90488 -414544 -3267 -25143 -110720 66542 -9971 -221184 -83278 -315947 16775 2072 -360725
9159 -195509 -41762 -167561 92962 35887 -25216 140268 82219 -336180 52407 -96180 -53755
9148 -53755 73564 -80218 -215289 -38072 140769 -40267 104622 -156347 82736 -288723 -199482
9137 -199482 94178 6097 165042 -25388 225902 76545 14814 -140660 -318417 185128 -23120
9125 36401 63323 86129 -115149 149400 -291777 127848 -124397 31998 427903 49143 -247707
9113 -139990 -109266 -114326 -289898 2043 156134 -228438 -57473 -177900 192901 -31505 -253155
9102 -253155 100802 -185044 -89034 -37297 10330 122941 -84507 -225730 13126 -40593 28472
$$ packed form
9183C4154J20130a06406L3404L6393A79002l8475e0266A42681a75702P6768Q446
9172i0488l24056c267k1876q5577F6542i971k11213h3278k32669A6775B072c60725
9159a95509d1762j25799I2962C5887b5216A40268n8049c36180E2407i6180M2425
9148e3755G3564h0218j35071c8072A40769d0267A04622a56347H2736b88723Q9241
9137a99482I4178F097J58945b5388B25902G6545A4814a40660j77757A85128b3120
9125C6401K6922K2806a15149A49400b91777A27848a24397C1998L95905D9143b47707
9113a39990L0724n060j75572B043J54091b28438e7473j20427A92901c1505k21650
9102b53155A00802a85044h9034c7297A0330J12611h4507j41223A3126d0593B8472
$$ plain form
9090 -36020 -9815 -354011 -77621 -63673 -90018 -156327 -12987 -140625 223622 146576 -48549
9078 -21931 -161571 37439 -95112 274662 -256177 -207893 68554 -24750 -32172 -152614 -193802
9067 -193802 141598 1850 125249 -99308 -203982 134795 -292239 499940 -438028 -43613
9056 394131 40118 131504 -235759 67203 -171432 -328626 -112326 91850 -35995 -97123 -59341
9045 -59341 -150935 85286 125205 -271663 -107955 -167784 -234098 -41903 190462 -318248 84412
9033 -24032 70277 145918 177969 -57395 -265554 50465 40911 221508 110275 -316905 -278945
9022 -278945 -508533 -8105 -119511 -107462 121802 -354609 194438 -48114 32327 79970 300365
9011 300365 -277440 -322584 -35929 -277391 -197833 -146266 -477429 -18490 103240 -7627 24948
$$ packed form
9090c6020i815l44196g7621J3948k6345o6309a2987j27638B23622p7046d8549
9078b1931j39640C7439i5112B74662b56177M8284F8554b4750p422j20442m1188
9067a93802A41598A850J23399i9308j04674A34795b92239D99940d38028d3613
9056C94131D0118R1386b35759F7203a71432j57194a12326I1850c5995o1128L7782
9045e9341r1594H5286L9919b71663a07955n9829o6314d1903A90462c18248H4412
9033b4032G0277P5641L2051e7395k08159E0465r554J80597A10275c16905L7960
9022b78945k29588h105j11406J2049A21802c54609A94438d8114C2327M7643K20395
9011C00365b77440m5144c5929k41462P9558N1567l31163a8490A03240g627B4948
$$ plain form
8999 78602 148859 80511 205348 -50637 -128855 -135430 28770 -126778 10127 33458 -186239
8987 8724 -244808 -329361 94409 98664 51269 30906 279627 143778 -505116 -216080 -59517
8975 -80787 59838 -80664 -268044 43103 -103702 -211586 -87248 -187766 -73007 -86317 -411892
8964 -411892 61392 -68381 -70539 -137002 16346 114781 42454 -261830 -228771 274255 55345
8952 -5781 -26409 124601 -28121 190122 41313 -4010 -122589 -137121 175695 -36963 132160
8940 -115113 -186104 120645 52896 54549 141760 117545 221614 -57572 307758 -78423 45495
8928 -144928 -130507 111301 449555 681240 1113647 2422540 8247722 7596177 2127022
8918 973021 294639 347700 13441 297864 -4551 -63474 -204895 -405119 43628 8130 23512
$$ packed form
8999G8602P0257o8348J24837e0637p8218o575B8770a26778A0127K3331a86239
8987H724b44808q4553I4409M255m7395k0363K48721j35849e05116b16080e9517
8975h0787E9838h0664j87380D3103a03702j07884h7248j00518g3007j3310l25575
8964d11892F1392f8381k158o6463A6346R8435D2454b61830L3059B74255E5345
8952e781k0628A24601b8121A90122D1313d010j18579j4532A75695c6963A32160
8940a15113p0991A20645E2896J653Q7211k4215J04069e7572C07758g8423D5495
8928a44928J4421A11301L38254K31685M32407J308893N825182o51545B127022
8918I73021B94639N3061A3441K84423d551n8923j41421k00224D3628H130J5382
$$ plain form
8907 23512 -168684 91515 67631 -193889 -78221 -133299 62320 121525 35241 23635 -1330 -173465
8895 -173465 -287610 195833 138572 31437 174799 307871 -58748 -241723 174108 -286827
8884 -13605 328921 348124 63608 -34834 -77909 -228050 259506 147665 81060 33254 -263813
8872 19892 -95763 -60691 53603 149121 104520 203778 -200323 -213642 -293545 143857 -95854
8860 -91154 -92492 -242233 -273184 -13705 -161065 89027 99342 54551 -109921 72197 -67976
$$ packed form
8907B3512a68684I1515k3884a93889g8221n5078F2320N9205C5241j1606a330j72135
8895a73465j14145A95833n7261C1437J43362J33072e8748j82975A74108b86827
8884a3605C28921J9203F3608c4834m3075j50141B59506j11841o6605C3254b63813
8872A9892i5763L5072E3603R5518m4601R9258b00323j3319p9903A43857i5854
8860i1154j338j49741l0951a3705j47360H9027J0315m4791a09921G2197f7976
$$ [...]
##END NTUPLES=NMR SPECTRUM
##END=
