##TITLE=AC1416_KCHHT12226_7764033_5FSMWOzXic
##JCAMPDX= 6.0         $$ Bruker NMR JCAMP-DX V2.0
##DATA TYPE= NMR SPECTRUM
##DATA CLASS= NTUPLES
##ORIGIN= BRUKER
##OWNER= Administrator
$$ 1.72 TOPSPIN		Version 2.1
$$ 2013-04-11 18:01:44.616 -0700  Administrator@X
$$ Compression mode = diff/dup
##.OBSERVE FREQUENCY= 400.02188249412
##.OBSERVE NUCLEUS= ^1H
##.ACQUISITION MODE= SIMULTANEOUS (DQD)
##.ACQUISITION SCHEME= undefined
##.AVERAGES= 64
##.DIGITISER RES= 22
##SPECTROMETER/DATA SYSTEM= spect
##.PULSE SEQUENCE= noesygpps1d.comp
##.SOLVENT NAME= COFFEE_meoh
##.SHIFT REFERENCE= INTERNAL, COFFEE_meoh, 1, 14.96084
##AUDIT TRAIL= $$ (NUMBER, WHEN, WHO, WHERE, PROCESS, VERSION, WHAT)
$$ ##TITLE= Audit trail, TOPSPIN		Version 2.1
$$ ##JCAMPDX= 5.01
$$ ##ORIGIN= Bruker BioSpin GmbH
$$ ##OWNER= Administrator
$$ $$ E:\/data/COFFEE/nmr/AC1416_KCHHT12226_7764033_5FSMWOzXic/12/pdata/1/auditp.txt
$$ ##AUDIT TRAIL=  $$ (NUMBER, WHEN, WHO, WHERE, PROCESS, VERSION, WHAT)
(   1,<2013-04-11 18:01:38.803 -0700>,<Administrator>,<X>,<go>,<TOPSPIN 2.1>,
      <created by zg
	started at 2013-04-11 17:50:09.080 -0700,
	POWCHK enabled, PULCHK disabled,
       configuration hash MD5:
       33 CF 6A 21 5C D3 B9 40 6C 15 AA 8D 27 A2 4F 13
       data hash MD5: 64K
       E1 B2 11 07 A1 69 E5 6B 68 2B 58 A2 54 05 C3 9B>)
(   2,<2013-04-11 18:01:41.835 -0700>,<Administrator>,<X>,<proc1d>,<TOPSPIN 2.1>,
      <Start of raw data processing
       efp LB = 0.3 FT_mod = 6 PKNL = 1 PHC0 = 0 PHC1 = 0 SI = 128K 
       data hash MD5: 128K
       8B FA 9B 8D 70 9D 46 14 52 77 BC 4F A9 79 D9 1D>)
(   3,<2013-04-11 18:01:42.882 -0700>,<Administrator>,<X>,<proc1d>,<TOPSPIN 2.1>,
      <pk PHC0 = -79.65088 PHC1 = 0 
       data hash MD5: 128K
       48 8A 17 91 A5 DC CF 05 E4 93 2A DE 69 27 C3 55>)
(   4,<2013-04-11 18:01:43.616 -0700>,<Administrator>,<X>,<proc1d>,<TOPSPIN 2.1>,
      <abs ABSG = 1 
       data hash MD5: 128K
       89 A2 00 18 59 04 D0 82 80 4F 6B 92 79 D8 69 C1>)
(   5,<2013-04-11 18:01:43.772 -0700>,<Administrator>,<X>,<proc1d>,<TOPSPIN 2.1>,
      <abs ABSG = 2 
       data hash MD5: 128K
       48 69 23 0B BC 44 EF 04 1F 6D 06 E5 9E 9A 1D B4>)
(   6,<2013-04-11 18:01:43.928 -0700>,<Administrator>,<X>,<proc1d>,<TOPSPIN 2.1>,
      <abs ABSG = 3 
       data hash MD5: 128K
       D1 DE BC 3D 33 CD AE 35 7C C7 F1 9C B2 94 AC E1>)
(   7,<2013-04-11 18:01:44.116 -0700>,<Administrator>,<X>,<proc1d>,<TOPSPIN 2.1>,
      <abs ABSG = 4 
       data hash MD5: 128K
       F0 F6 C9 F6 76 DF E4 7D A3 39 1B 76 DC 1D 9F 14>)
(   8,<2013-04-11 18:01:44.288 -0700>,<Administrator>,<X>,<proc1d>,<TOPSPIN 2.1>,
      <abs ABSG = 5 
       data hash MD5: 128K
       A3 33 0B 41 68 53 34 0C B9 5C F4 77 0D 5A 41 61>)
$$ ##END=
$$ 
$$ $$ hash MD5
$$ $$ 39 2B AB 41 3D 4F 53 42 E1 DE 3E 7E 31 D7 7E 35
##$RELAX= 
##$RELAX= 
##$RELAX= 
##$RELAX= 
##$RELAX= 
##$RELAX= 
##$RELAX= 
##$RELAX= 
$$ Bruker specific parameters
$$ --------------------------
##$DU= <E:\>
##$EXPNO= 12
$$ [...]
##$TP07= 0
##$TPNAME0= <>
##$TPNAME1= <>
##$TPNAME2= <>
##$TPNAME3= <>
##$TPNAME4= <>
##$TPNAME5= <>
##$TPNAME6= <>
##$TPNAME7= <>
##$TPOAL= (0..7)
0.5 0.5 0.5 0.5 0.5 0.5 0.5 0.5
##$TPOFFS= (0..7)
0 0 0 0 0 0 0 0
##$TUNHIN= 0
##$TUNHOUT= 0
##$TUNXOUT= 0
##$USERA1= <user>
##$USERA2= <user>
##$USERA3= <user>
##$USERA4= <user>
##$USERA5= <user>
##$V9= 5
##$VALIST= <valist>
##$VCLIST= <CCCCCCCCCCCCCCC>
##$VD= 0
##$VDLIST= <DDDDDDDDDDDDDDD>
##$VPLIST= <PPPPPPPPPPPPPPP>
##$VTLIST= <TTTTTTTTTTTTTTT>
##$WBST= 2048
##$WBSW= 25
##$XGAIN= (0..3)
0 0 0 0
##$XL= 0
##$YL= 0
##$YMAX_a= 6081365
##$YMIN_a= -13708343
##$ZGOPTNS= <>
##$ZL1= 120
##$ZL2= 120
##$ZL3= 120
##$ZL4= 120
##$ABSF1= 14.96084
##$ABSF2= -5.597342
##$ABSG= 5
##$ABSL= 3
##$ALPHA= 0
##$AQORDER= 0
##$ASSFAC= 0
##$ASSFACI= 0
##$ASSFACX= 0
##$ASSWID= 0
##$AUNMP= <proc_prof1d_extract.lims>
##$AXLEFT= 0
##$AXNAME= <>
##$AXNUC= <1H>
##$AXRIGHT= 0
##$AXTYPE= 0
##$AXUNIT= <>
##$AZFE= 0.1
##$AZFW= 0.1
##$BCFW= 0
##$BC_mod= 0
##$BYTORDP= 0
##$COROFFS= 0
##$CY= 15
##$DATMOD= 1
##$DC= 0
##$DFILT= <>
##$DTYPP= 0
##$F1P= 0
##$F2P= 0
##$FCOR= 0.5
##$FTSIZE= 131072
##$FT_mod= 6
##$GAMMA= 0
##$GB= 0
##$INTBC= 1
##$INTSCL= 1
##$ISEN= 128
##$LB= 0.3
##$LEV0= 0
##$LPBIN= 0
##$MAXI= 10000
##$MC2= 0
##$MEAN= 0
##$ME_mod= 0
##$MI= 0
##$NCOEF= 0
##$NC_proc= -2
##$NLEV= 6
##$NOISF1= 0
##$NOISF2= 0
##$NSP= 0
##$NTH_PI= 0
##$NZP= 0
##$OFFSET= 14.96084
##$PC= 1
##$PHC0= -79.65088
##$PHC1= 0
##$PH_mod= 1
##$PKNL= yes
##$PPARMOD= 0
##$PPDIAG= 0
##$PPIPTYP= 0
##$PPMPNUM= 2147483647
##$PPRESOL= 1
##$PSCAL= 4
##$PSIGN= 0
##$PYNMP= <proc.py>
##$REVERSE= no
##$SF= 400.020009701927
##$SI= 131072
##$SIGF1= 0
##$SIGF2= 0
##$SINO= 400
##$SIOLD= 131072
##$SPECTYP= <>
##$SREGLST= <1H.CDCl3>
##$SSB= 0
##$STSI= 131072
##$STSR= 0
##$SW_p= 8223.68421052631
##$SYMM= 0
##$S_DEV= 0
##$TDeff= 65536
##$TDoff= 0
##$TI= <>
##$TILT= no
##$TM1= 0
##$TM2= 0
##$TOPLEV= 0
##$USERP1= <user>
##$USERP2= <user>
##$USERP3= <user>
##$USERP4= <user>
##$USERP5= <user>
##$WDW= 1
##$XDIM= 131072
##$YMAX_p= 407493739
##$YMIN_p= -11258
##$CURPLOT= <Network HP LaserJet P1505>
##$CURPRIN= <$Network HP LaserJet P1505>
##$DFORMAT= <normdp>
##$LAYOUT= <+/1D_H.xwp>
##$LFORMAT= <normlp>
##$PFORMAT= <normpl>
##$SURQMSG= 1
$$ End of Bruker specific parameters
$$ ---------------------------------
##NTUPLES= NMR SPECTRUM
##VAR_NAME=  FREQUENCY,     SPECTRUM/REAL,   SPECTRUM/IMAG
##SYMBOL=    X,             R,               I
##VAR_TYPE=  INDEPENDENT,   DEPENDENT,       DEPENDENT
##VAR_FORM=  AFFN,          ASDF,            ASDF
##VAR_DIM=   131072,        131072,          131072
##UNITS=     HZ,            ARBITRARY UNITS, ARBITRARY UNITS
##FACTOR=    0.0627417313425164, 1,          1
##FIRST=     8223.62146879497, 2399,         -62029
##LAST=      0,             4504,            -61194
##MIN=       0,             -11258,          0
##MAX=       8223.62146879497, 407493739,    0
$$ Real data points
##PAGE= N=1
##DATA TABLE= (X++(R..R)), XYDATA
$$ [...]
61575C41630L54J54m35q81r08p93q29p81k37O77J278J173P39O05R41J422J715
61558C45824J659J275Q30P81J311K066K551K620K385J915J358J054J111J075M96
61543C68311l60q22o95k91J54N40N72Q9l56p3O74R54O57O95J443J929J194k93
61525C74322j312j466j334j393j543j545j386j138q70o91o68p82j056j450j588
61510C56100j027MO32M79K70P98J762K229J966J619J638J743J541J159J065J543
61494C73521K400L036K838J829P98N57J050J533J485R83L25l23p68p72l79M2K65
61477C88420N48J264K349L330L856L972L769L052J674J04p76o35j47j73p43j278
61461D08586j530j704j728j141N9J098J302Q74M83M59P32J237J924K594L022L125
$$ y = [341630, 341984, 342138, 341703, 340822, 339914, 339121, 338292, 337511, 337274, 337951, 339229, 340402, 341141, 341746, 342687, 344109, 345824, 347483, 348758, 349588, 350369, 351680, 353746, 356297, 358917, 361302, 363217, 364575, 365629, 366740, 367815, 368311, 367951, 367129, 366434, 366143, 366297, 366837, 367409, 367498, 367142, 367069, 367743, 368697, 369354, 370049, 371492, 373421, 374615, 374322, 373010, 371544, 370210, 368817, 367274, 365729, 364343, 363205, 362335, 361644, 360976, 360194, 359138, 357688, 356100, 355073, 355077, 355709, 356188, 356458, 357256, 359018, 361247, 363213, 364832, 366470, 368213, 369754, 370913, 371978, 373521, 375921, 378957, 381795, 383624, 384422, 384979, 386029, 387562, 389047, 390030, 390355, 390032, 389264, 388492, 388113, 388155, 388420, 388968, 390232, 392581, 395911, 399767, 403739, 407508, 410560, 412234, 412338, 411562, 410927, 410780, 410607, 409864, 408586, 407056, 405352, 403624, 402483, 402542, 403640, 404942, 405816, 406299, 406758, 407490, 408727, 410651, 413245, 416267, 419392]
61445D19392K893K342J693J315J308J496J793K161K199J436L08J1R37J922J764
61430D42970Q14K58M14O77Q17J162J566J276J20j002j202n17M86J460K154K142
61414D53595J196j80j070j017l81J10M0m49j001j462j890k232k289k044j766j658
61398D37502j680j753j801j485m15J065J879J435M18j46m6L29Q64J575K062K006
61382D41809J945K586L557L816L276K981L541M390M860N006M924M283L106K297
61368D92377K558L288L290K257R58J97J09L52N03L31L9J24P94J631K120K299K571
61351E15798L055L533M002M855O324P851Q324P088M746K661J652J400J247J115
61337E73651J247J476J449J306J402J465R04j6k83L48Q98O35J34K47Q08J215J616
$$ y = [419392, 422285, 424627, 426320, 427635, 428943, 430439, 432232, 434393, 436592, 438028, 438336, 438347, 439284, 441206, 442970, 443784, 444042, 444456, 445133, 445950, 447112, 448678, 449954, 450074, 449072, 447870, 447353, 447839, 449299, 451453, 453595, 454791, 454611, 453541, 452524, 452143, 452253, 452293, 451844, 450843, 449381, 447491, 445259, 442970, 440926, 439160, 437502, 435822, 434069, 432268, 430783, 430368, 431433, 433312, 434747, 435165, 435019, 434973, 435302, 436166, 437741, 439803, 441809, 443754, 446340, 449897, 453713, 456989, 459970, 463511, 467901, 472761, 477767, 482691, 486974, 490080, 492377, 494935, 498223, 501513, 503770, 504728, 504925, 505034, 505386, 505889, 506220, 506259, 506383, 507177, 508808, 510928, 513227, 515798, 518853, 522386, 526388, 531243, 537567, 545418, 553742, 560830, 565576, 568237, 569889, 571289, 572536, 573651, 574898, 576374, 577823, 579129, 580531, 581996, 582900, 582884, 582601, 582949, 583847, 584482, 584616, 584863, 585671, 586886, 588502]
61320E88502K524L622L989L515L136L529M338M961N528O644Q527J0736J2602J3769
61306F75922J4414J5080J6177J7493J8276J7820J5967J3110R789O288K562j440
61294H21458n384q637j0843j2253j3382j4413j5059j4956j4095j2880j1807j1109
61282F76640j0698j0421j0129r425p731n032k322p13j20N36J840L220L935M040
61268F33620M007L972L882L895M144M446M696N222O272P484Q325Q818R298R748
61254G17829R801R196P835N653K977O72o68j426k289l140l358k965k650k668k569
61239G32230k141j793j766j668j167n13l6M02J099K059L165M457N936P391Q623
61224G56278R497R717R050P953P406P795Q430Q551Q257P997P740P183O425N800
$$ y = [588502, 591026, 594648, 598637, 602152, 605288, 608817, 613155, 618116, 623644, 630288, 638815, 649551, 662153, 675922, 690336, 705416, 721593, 739086, 757362, 775182, 791149, 804259, 814048, 820336, 822898, 821458, 816074, 807437, 796594, 784341, 770959, 756546, 741487, 726531, 712436, 699556, 687749, 676640, 665942, 655521, 645392, 635967, 628236, 623204, 620882, 620169, 620049, 620585, 622425, 625645, 629580, 633620, 637627, 641599, 645481, 649376, 653520, 657966, 662662, 667884, 674156, 681640, 689965, 698783, 708081, 717829, 727630, 736826, 744661, 750314, 753291, 753963, 753295, 751869, 749580, 746440, 743082, 740117, 737467, 734799, 732230, 730089, 728296, 726530, 724862, 723695, 723182, 723146, 723548, 724647, 726706, 729871, 734328, 740264, 747655, 756278, 765775, 775492, 784542, 792495, 799901, 807696, 816126, 824677, 832934, 840931, 848671, 855854, 862279, 868079]
61210H68079N295M748M294M061L646K637J408P27O67P47J014K082L979N887P419
61195I16690R275J1991J4756J6254J6251J5526J4485J2657R620N764J901j456
61183A043714m223o457q175r353r982j0263j0635j1425j2448j3173j3293j3014
61171I21273j2831j3150j4013j4940j5211j4611j3769j3444j3579j3461j2809
61160G69455j2056j1532j0940r973q868p959p036n705m015k276m90J483L337M491
61146F97916M876M994N008M289K183r84m024n944o768p295q073q712q313o596
61132F62557m336k480j116L90K439M777O970Q794J0200J1311J2519J4226J6309
61119G42560J8173J9510K0677K2181K4004K5706K6894K7396K7174K6321K5143
$$ y = [868079, 873374, 878122, 882416, 886477, 890123, 892760, 894168, 894895, 895562, 896309, 897323, 899405, 903384, 909271, 916690, 925965, 937956, 952712, 968966, 985217, 1000743, 1015228, 1027885, 1037505, 1043269, 1045170, 1043714, 1039491, 1033034, 1024859, 1015506, 1005524, 995261, 984626, 973201, 960753, 947580, 934287, 921273, 908442, 895292, 881279, 866339, 851128, 836517, 822748, 809304, 795725, 782264, 769455, 757399, 745867, 734927, 724954, 716086, 708127, 701091, 695386, 691371, 689095, 688605, 690088, 693425, 697916, 702792, 707786, 712794, 717083, 719266, 718282, 714258, 708314, 701546, 694251, 686178, 677466, 669153, 662557, 658221, 655741, 654625, 655015, 657454, 662231, 669201, 677995, 688195, 699506, 712025, 726251, 742560, 760733, 780243, 800920, 823101, 847105, 872811, 899705, 927101, 954275, 980596, 1005739]
61108A005739K3905K2540K0762J8551J6409J4889J3801J2164R226N379J544k287
61096A162622p058j2905j8244k1495k3065k4549k6310k7221k6846k6442k7127
61085I21360k8200k8078k6206k3236k0015j7233j5542j5023j4718j3579j1687
61074G07843r932q670p448n949m392l007j813r42n61l89Q2Q48J454J833K452L473
61058F74882M454N199O236Q051J0240J1891J2577J2696J3007J4043J5729J7466
61046H06471J8771J9878K1368K3218K4774K5747K6594K7630K8406K8555K8631
61035A080043K9381L0506L0990L0586L0185L0478L1101L1383L1473L2150L3882
61024A422158L6463L9458M2534M5449M8138N0789N3523N6000N7888N9819O3426
$$ y = [1005739, 1029644, 1052184, 1072946, 1091497, 1107906, 1122795, 1136596, 1148760, 1157986, 1163365, 1164909, 1162622, 1155564, 1142659, 1124415, 1102920, 1079855, 1055306, 1028996, 1001775, 974929, 948487, 921360, 893160, 865082, 838876, 815640, 795625, 778392, 762850, 747827, 733109, 719530, 707843, 697911, 689241, 681793, 675844, 671452, 668445, 666632, 665690, 665129, 664740, 664822, 665670, 667124, 668957, 671409, 674882, 679336, 684535, 690771, 698822, 709062, 720953, 733530, 746226, 759233, 773276, 789005, 806471, 825242, 845120, 866488, 889706, 914480, 940227, 966821, 994451, 1022857, 1051412, 1080043, 1109424, 1139930, 1170920, 1201506, 1231691, 1262169, 1293270, 1324653, 1356126, 1388276, 1422158, 1458621, 1498079, 1540613, 1586062, 1634200, 1684989, 1738512, 1794512, 1852400, 1912219, 1975645]
61013A975645O9987P9365R0715J03880J19446J37551J57516J78985K02913K31152
61003C347155K65718L08824L62872M29669N10110O05353P17865Q50462J004910
60994H402938J182848J387661J622632J884125K152881K386638K517621K464307
60986B4001651K166935J635880R75634L51781q5978k70062k27601m9327J44875
60977B8643788K27250R0049l07635r03369j548412k079554k394990k481670k388893
60968A6856564k184282j925957j655722j400590j174417r80574q16846o79771
60960F038405n66068m72342l95326l32673k82931k44511k14928j91323j71673
60951C166630j55265j41856j30633j20340j10363j01193r3529q7272q1879p7435
$$ y = [1975645, 2045632, 2124997, 2215712, 2319592, 2439038, 2576589, 2734105, 2913090, 3116003, 3347155, 3612873, 3921697, 4284569, 4714238, 5224348, 5829701, 6547566, 7398028, 8402938, 9585786, 10973447, 12596079, 14480204, 16633085, 19019723, 21537344, 24001651, 26168586, 27804466, 28780100, 29131881, 29045903, 28775841, 28548240, 28498913, 28643788, 28871038, 28961087, 28653452, 27750083, 26201671, 24122117, 21727127, 19245457, 16856564, 14672282, 12746325, 11090603, 9690013, 8515596, 7535022, 6718176, 6038405, 5472337, 4999995, 4604669, 4271996, 3989065, 3744554, 3529626, 3338303, 3166630, 3011365, 2869509, 2738876, 2618536, 2508173, 2406980, 2313451, 2226179, 2144300, 2066865]
60941B066865p4675p3773p3689p3099p1637o9723o7521o4690o1158n7464n4012
60930A325424n0536m6653m2638l9071l6007l3038l0073k7517k5536k3718k1741
60919I48896j9897j8582j7563j6226j4441j2731j1533j0664r665q460p385o610
60907G95139n884m955m111l875m203m400m092l824m209m849m854m249m064m796
60893G32774n678n847n544n454n508n088m150l409l402l997m776n381n587n484
60879F63469n564o205p168p928q374q673q727q346p869p790p816p084n476l946
60865E62503l278l179k992k605k216j739j001j77N31J282K187K841K759K134J595
60850E58645J359J136Q58R48J679K613L034K780K387K262J976P22j432l341m148
$$ y = [2066865, 1992190, 1918417, 1844728, 1771629, 1699992, 1630269, 1562748, 1498058, 1436900, 1379436, 1325424, 1274888, 1228235, 1185597, 1146526, 1110519, 1077481, 1047408, 1019891, 994355, 970637, 948896, 928999, 910417, 892854, 876628, 862187, 849456, 837923, 827259, 817594, 809134, 801749, 795139, 789255, 784300, 780189, 776314, 772111, 767711, 763619, 759795, 755586, 750737, 745883, 741634, 737570, 732774, 727096, 721249, 715705, 710251, 704743, 699655, 695505, 692096, 688694, 684697, 679921, 674540, 668953, 663469, 657905, 651700, 644532, 636604, 628230, 619557, 610830, 602484, 594615, 586825, 579009, 571925, 566449, 562503, 559225, 556046, 553054, 550449, 548233, 546494, 545493, 545316, 545847, 547129, 549316, 552157, 554916, 557050, 558645, 560004, 561140, 561998, 562946, 564625, 567238, 570272, 573052, 575439, 577701, 579677, 580399, 578967, 575626, 571478]
60835E71478m418n109n830n193l030j011n10q34n06N57J231J092Q50R61J009O42
60819E51379K07M1j34p02j576k461l189l544l237k413j786j869k431l037l684
60804E21564m526n292n540n308n054m985m890m637m445m543m864n181n357n347
60790D51595n066m430l522k627k047j813j645j287q88q86j422k026k022j215q6
60775D20613O35N74K0l25M9J001J894K225K070J917K153K817L664M401M819M879
60759D53406M682M416M290M385M417L883K551Q52m89j157j437j637j717j502j093
60744D73850q38j043j731k585l195l573m275n665p123p558o790n733n070m440
60730D14231l405k485k450l072l456l324l086k817k094q51L96J345K025K104J052
$$ y = [571478, 567060, 561951, 556121, 550928, 547898, 546887, 546377, 545543, 545037, 545594, 546825, 547917, 548767, 549728, 550737, 551379, 551586, 551627, 551493, 550791, 549215, 546754, 543565, 540021, 536784, 534371, 532585, 530716, 528285, 525248, 521564, 517038, 511746, 506206, 500898, 495844, 490859, 485969, 481332, 476887, 472344, 467480, 462299, 456942, 451595, 446529, 442099, 438577, 435950, 433903, 432090, 430445, 429158, 428270, 427384, 425962, 423936, 421914, 420699, 420613, 421248, 421822, 421842, 421517, 421566, 422567, 424461, 426686, 428756, 430673, 432826, 435643, 439307, 443708, 448527, 453406, 458088, 462504, 466794, 471179, 475596, 479479, 482030, 482882, 482393, 481236, 479799, 478162, 476445, 474943, 473850, 473012, 471969, 470238, 467653, 464458, 460885, 456610, 450945, 443822, 436264, 429474, 423741, 418671, 414231, 410826, 408341, 405891, 402819, 399363, 396039, 392953, 390136, 388042, 387191, 387587, 388932, 390957, 393061, 394113]
60715C94113o20j354l87J136J670J169P32Q86J208J314J271J086O57L01N87J492
60699D05261K282K416K093J848J977K414K805K778K442K505L357M346M571M229
60685D45324M328N073N462M740L367K252J763J884K577L459L718L045K153J826
60671D90971J912J745J110J64j116k653l814m071l854m022m607m892m686m627
60657D57560n045n289m571l052j613q38n43j62N91J484K139K536K901L082K540
60642D51720J198j87j035j848l341m963n258l796j862r70j283j901k041j530n85
60627D22318L50P89O36L77O13J398K177K309J660P54K74L34L90N7l41l66k39m60
60609D33030q79r26n75l63m58n20n67j032j704j595l26J154J789J616J246Q72
$$ y = [394113, 393493, 392139, 391752, 392888, 394558, 395727, 396459, 397345, 398553, 399867, 401138, 402224, 402881, 403182, 403769, 405261, 407543, 409959, 412052, 413900, 415877, 418291, 421096, 423874, 426316, 428821, 432178, 436524, 441095, 445324, 449652, 454725, 460187, 464927, 468294, 470546, 472309, 474193, 476770, 480229, 483947, 486992, 489145, 490971, 492883, 494628, 495738, 495902, 494786, 492133, 488319, 484248, 480394, 476372, 471765, 466873, 462187, 457560, 452515, 447226, 442655, 439603, 437990, 437152, 436609, 436447, 437038, 438522, 440661, 443197, 446098, 449180, 451720, 452918, 452731, 451696, 449848, 446507, 441544, 436286, 432490, 430628, 429658, 428375, 426474, 424433, 422903, 422318, 422668, 423457, 424093, 424470, 425083, 426481, 428658, 430967, 432627, 433381, 433655, 433989, 434379, 434436, 434095, 433729, 433490, 433030, 432151, 431225, 430650, 430287, 429829, 429309, 428742, 427710, 426006, 424411, 424085, 425239, 427028, 428644, 429890, 430762]
60593D30762N26O13J359K141K248J912J842K035J955J550J246J021M72k16k95
60578D49171L78J042J229J479K417L708M448M321L968M267N513P170Q434R111
60564E06656R827J1129J2631J3452J3378J2882J2056J0334P552M523K051q0k518
60551F13873n077o761o903n746l884j742L31J913K856L625M946P066R474J1503
60537F25474J3164J5195J8187K1775K4882K6790K7691K8138K8193K7178K4201
60526H80868J8833J1610L953k587p364j0817j3625j5846j7087j7206j6498j5339
60514G98895j4000j2767j1832j0933r496p280m603j845R13L488N362O388P514
60501G49804J0046J4103J8446K2114K5581K9936L5302M0735M5374M8999N1520
$$ y = [430762, 431288, 431901, 433260, 435401, 437649, 439561, 441403, 443438, 445393, 446943, 448189, 449210, 449682, 449466, 449171, 449549, 450591, 451820, 453299, 455716, 459424, 463872, 468193, 472161, 476428, 481941, 489111, 497545, 506656, 516483, 527612, 540243, 553695, 567073, 579955, 592011, 602345, 609897, 614420, 616471, 616391, 613873, 608796, 602035, 595132, 589386, 585502, 583760, 584091, 586004, 588860, 592485, 597431, 604497, 613971, 625474, 638638, 653833, 672020, 693795, 718677, 745467, 773158, 801296, 829489, 856667, 880868, 899701, 911311, 915264, 912677, 905313, 894496, 880871, 865025, 847938, 830732, 814234, 798895, 784895, 772128, 760296, 749363, 739867, 732587, 727984, 726139, 727052, 730540, 735902, 742290, 749804, 759850, 773953, 792399, 814513, 840094, 870030, 905332, 946067, 991441, 1040440, 1091960]
60490A091960N2593N1998M9892M6469M1727L5818K9387K3321J8256J4307J0939
60479A466667P085J802n002j2784k1287l0722m0834n0361n7810o2434o4164o3238
60467A066918o0377n6745n2987m8616m3038l6907l1669k7977k5362k3323k1775
60456F38142k0292j8068j5059j2324j0653r558q248o931o364o520o527n808m594
60443E07196l359k380j833j722j710j475j297j727k591k966k322j224n12l20k74
60428D81484k85n45r90j320j510j748j953j827j472j338j385r22L34J600J968
60413D70091J601J323J302J006M09K71Q92J394R56J68K77J370K153J709P39N97
60397D86258J585K707L044K820K872L424L842L704L548M097M983N015L821K527
$$ y = [1091960, 1144553, 1196551, 1246443, 1292912, 1334639, 1370457, 1399844, 1423165, 1441421, 1455728, 1466667, 1473752, 1475554, 1470552, 1457768, 1436481, 1405759, 1364925, 1314564, 1256754, 1194320, 1130156, 1066918, 1006541, 949796, 896809, 848193, 805155, 768248, 736579, 708602, 683240, 659917, 638142, 617850, 599782, 584723, 572399, 561746, 552188, 543940, 537009, 530645, 524125, 517598, 511790, 507196, 503837, 501457, 499624, 497902, 496192, 494717, 493420, 491693, 489102, 486136, 483814, 482590, 482078, 481758, 481484, 481199, 480654, 479664, 478344, 476834, 475086, 473133, 471306, 469834, 468496, 467111, 466189, 466523, 468123, 470091, 471692, 473015, 474317, 475323, 475732, 476003, 476895, 478289, 479245, 479413, 479690, 481060, 483213, 484922, 485661, 486258, 487843, 490550, 493594, 496414, 499286, 502710, 506552, 510256, 513804, 517901, 522884, 527899, 531720, 534247]
60383E34247K346L080L634L621L628M030M394M171L375K319J313Q24J338K594
60369E74914L465L068J778P31N71J067J649J861J459O46J62N80J552K182K246
60354E97931K430L236M240M756M795M854N169N688O479P538Q255P848O402M868
60340F74489L814K751J023j219l382n178o484o953o544o086o363o820o208m549
60326F22291l345l509m154m099l623l730m399m729m490m356m548m306l057j247
60312E68699L63J624K815M060N364O903Q760J0613J2094J3366J4973J7146J9488
60299F86268K1295K1947K0930J7806J2557N907r15p106j2739j8073k2428k4387
60287G01062k3322k0265j6843j3738j0739p936o050n453n570n579n282n065n241
$$ y = [534247, 536593, 539673, 543307, 546928, 550556, 554586, 558980, 563151, 566526, 568845, 570158, 570982, 572320, 574914, 578379, 581447, 583225, 583956, 584527, 585594, 587243, 589104, 590563, 591209, 591371, 591951, 593503, 595685, 597931, 600361, 603597, 607837, 612593, 617388, 622242, 627411, 633099, 639578, 647116, 655371, 663219, 669621, 674489, 678303, 681054, 682077, 680858, 677476, 672298, 665814, 658861, 652317, 646231, 639868, 633048, 626840, 622291, 618946, 615437, 611283, 607184, 603561, 599831, 595432, 590703, 586213, 581857, 577309, 573003, 569946, 568699, 569062, 570686, 573501, 577561, 582925, 589828, 598588, 609201, 621295, 634661, 649634, 666780, 686268, 707563, 729510, 750440, 768246, 780803, 786710, 785795, 778689, 765950, 747877, 725449, 701062, 677740, 657475, 640632, 626894, 616155, 608219, 602169, 596716, 591146, 585567, 580285, 575220, 569979]
60274E69979n690n940n554m593l669l279l207k881k273j932k121k465k517k228
60260E21630j697r51k43m1l87o70l90J99N22M35J89m5j80mN40R89P66o9p96p87
60240E19010r5P53J248J225Q86N43L17J61J58N50J353K197K749L091L488L996
60224E41630M515M980N238N049M483M117M455N296O067O588P081P534P664P555
60210F22252P767Q551R395R692R542R495R680R625Q956P893O952O421O236O159
60196G38616N806M763L041J372O10P17O79l10j966l503m645n603o287o344n904
60181G21042n583n558n334m662m091m155m507m426l822l179k800k591k443k280
60167F65611j871j177p84j384k731l675l427k381j479j236j580k237k814k747
$$ y = [569979, 564289, 558349, 552795, 548202, 544533, 541254, 538047, 535166, 532893, 530961, 528840, 526375, 523858, 521630, 519933, 518982, 518739, 518698, 518311, 517641, 517251, 517450, 517972, 518407, 518596, 518551, 518371, 518367, 518907, 519896, 520662, 520593, 519797, 519010, 518915, 519668, 520916, 522141, 523027, 523570, 523887, 524048, 524206, 524756, 526109, 528306, 531055, 534146, 537634, 541630, 546145, 551125, 556363, 561412, 565895, 570012, 574467, 579763, 585830, 592418, 599499, 607033, 614697, 622252, 630019, 638570, 647965, 657657, 667199, 676694, 686374, 695999, 704955, 712848, 719800, 726221, 732457, 738616, 744422, 749185, 752226, 753598, 754208, 754925, 755604, 755294, 753328, 749825, 745180, 739577, 733290, 726946, 721042, 715459, 709901, 704567, 699905, 695814, 691659, 687152, 682726, 678904, 675725, 672925, 670334, 667891, 665611, 663740, 662563, 661779, 660395, 657664, 653989, 650562, 648181, 646702, 645466, 643886, 641649, 638835, 636088]
60153F36088j686M3J628K516K782K817K896L025K991K491J500O13P38K102L803
60138F64347M721M802M934N605O322O668P131Q286R621J0048R405Q534P899O950
60124G65273N169K968J196L19M68J637L310M468M570M147L918L756L219K621K647
60109H09686L106L065K322J764J917J962Q13j398l528m820n466n943o358o601
60095G90521o648o525o195n679n153m707m166l364k546k217k511k934k851k137
60081G32888j189m77k53m81q48j031j211k095l968o056p298p662p990q610q961
60066F74758q716q403q461q450p809o856o345o401o492o163n303m004k693k087
60052E86575k395k867k608j585l49Q52J958K627K684K789L762N361O538O821O537
$$ y = [636088, 634402, 634445, 636073, 638589, 641371, 644188, 647084, 650109, 653100, 655591, 657091, 657704, 658442, 660544, 664347, 669068, 673870, 678804, 684409, 690731, 697399, 704530, 712816, 722437, 732485, 741890, 750424, 758323, 765273, 770442, 773410, 774606, 774925, 775393, 777030, 780340, 784808, 789378, 793525, 797443, 801199, 804418, 807039, 809686, 812792, 815857, 818179, 819943, 821860, 823822, 824635, 823237, 819709, 814889, 809423, 803480, 797122, 790521, 783873, 777348, 771153, 765474, 760321, 755614, 751448, 748084, 745538, 743321, 740810, 737876, 735025, 732888, 731699, 731222, 730969, 730488, 729640, 728609, 727398, 725303, 721335, 715279, 707981, 700319, 692329, 683719, 674758, 666042, 657639, 649178, 640728, 632919, 626063, 619718, 613317, 606825, 600662, 595359, 591355, 588662, 586575, 584180, 581313, 578705, 577120, 576771, 577623, 579581, 582208, 584892, 587681, 591443, 596804, 603342, 610163, 616700]
60037F16700N834M580L197K549K655K565J807R53L77m60j828k965l320l657m878
60022F24109o395o922o414n994o125o057n274m408m254m720n266n823o645p527
60008E42285p736o809n129l636k919k622j860l71J019J365Q38N34J055J864K170
59993E20048J937J655J639J979K835M250N744O661O920O981P003O533N233L545
59979E82963K257J607J166L82r29k499l700l942l337k783l050l834m181l689k763
59964E53668j685k06J743L518M413M432M102L834L807L951L772K630P14p77j031
59949E86885p09r65j719j877j062j33J43RJ8J47P7j66k88j53J88O23R78J187J498
59930E84681K224L240M181N088O282P555Q184Q023P924Q617R842J0987J2025J3199
$$ y = [616700, 622534, 627114, 630311, 632860, 635515, 638080, 639887, 640840, 641217, 640757, 638929, 635964, 632644, 628987, 624109, 617714, 610792, 604378, 598384, 592259, 586202, 580928, 576520, 572266, 567546, 562280, 556457, 549812, 542285, 534549, 527740, 522611, 518975, 516056, 513434, 511574, 511203, 512222, 513587, 514425, 514959, 516014, 517878, 520048, 521985, 523640, 525279, 527258, 530093, 534343, 540087, 546748, 553668, 560649, 567652, 574185, 579418, 582963, 585220, 586827, 587993, 588375, 587446, 584947, 581247, 577305, 573968, 571185, 568135, 564301, 560120, 556431, 553668, 551983, 551777, 553520, 557038, 561451, 565883, 569985, 573819, 577626, 581577, 585349, 587979, 588693, 587916, 586885, 586176, 585211, 583492, 581615, 580553, 580420, 580563, 580572, 580590, 580737, 580814, 580648, 580360, 580207, 580395, 581018, 581996, 583183, 584681, 586905, 590145, 594326, 599414, 605696, 613251, 621435, 629458, 637382, 645999, 655841, 666828, 678853, 692052]
59916F92052J4163J4182J2985J0938Q500O036L974K625J770Q60l59j614k516k937
59902G60659l065l187l407l580l656m016n044o325o832o138m903l781k531p33
59888G03461J165K305K677L100M087N383O580P606Q470R074R306R052Q230P144
59874G87640O521O618O575N385L288J436K32r82k553l831m278m388m868n611o051
59859G85133o074n985n988o184o703p331p427o754n976n789n887n452m249k565
59845G02769l90K348M978O540P165Q005R502J0588J0067Q048N485K986P82o48
59831G78225p27N47K546M520N703N342L200j6l267o045q195r255q781p247n724
59816G50826m577l241j516k17n3n99j046j389k191l492m747n612o145o268n776
$$ y = [692052, 706215, 720397, 733382, 744320, 752820, 758856, 762830, 765455, 767225, 768085, 767726, 766112, 763596, 760659, 757594, 754407, 751000, 747420, 743764, 739748, 734704, 728379, 721547, 715409, 710506, 706725, 704194, 703461, 704626, 706931, 709608, 712708, 716795, 722178, 728758, 736364, 744834, 753908, 763214, 772266, 780496, 787640, 794161, 800779, 807354, 812739, 816027, 817463, 817695, 816713, 814160, 810329, 806051, 801663, 796795, 791184, 785133, 779059, 773074, 767086, 760902, 754199, 746868, 739441, 732687, 726711, 720922, 715035, 709583, 705334, 702769, 702379, 704727, 709705, 716245, 723410, 731415, 740917, 751505, 761572, 769620, 775105, 778091, 778873, 778225, 777498, 778045, 780591, 785111, 790814, 796156, 799356, 799340, 796073, 790028, 781833, 772578, 763797, 756550, 750826, 746249, 743008, 741492, 741275, 741222, 740623, 739577, 738188, 735997, 732505, 727758, 722146, 716001, 709733, 703957]
59801G03957m907m322m324m514m382l859l193k662k518k847l391l735l787l708
59787F51808l392k528j342p21j165j996k149j479p69n71n59k00M40Q85J026J272
59771F38560J982K922L598L920M313N077N876O139N801N408N453N935O541P026
59757G08551P254P200P135P606Q843J0300J1094J0984J0539J0258R818Q616O828
59744H25026N374M756M369L340J672R6j009j871k641l085l123l027k850k286j439
59729H23302j102j674k391k313j654j277j230p52K86R97P63M0m71q01j329j946
59713H08448k101j509m94K64K93j38o1J191L110M581N316O015P078Q022Q487R037
59697H57539J0327J2074J3479J4253J4593J4428J3369J1310Q539N401K208o12
$$ y = [703957, 699050, 694728, 690404, 685890, 681508, 677649, 674456, 671794, 669276, 666429, 663038, 659303, 655516, 651808, 648416, 645888, 644546, 643825, 642660, 640664, 638515, 637036, 636267, 635696, 635137, 634937, 635377, 636262, 637288, 638560, 640542, 643464, 647062, 650982, 655295, 660372, 666248, 672387, 678188, 683596, 689049, 694984, 701525, 708551, 715805, 723005, 730140, 737746, 746589, 756889, 767983, 778967, 789506, 799764, 809582, 818198, 825026, 830400, 835156, 839525, 842865, 844537, 844633, 843624, 841753, 839112, 836027, 832904, 829877, 827027, 824741, 823302, 822200, 820526, 818135, 815822, 814168, 812891, 811661, 810909, 811195, 812192, 812955, 812995, 812524, 811723, 810394, 808448, 806347, 804838, 804344, 804608, 804901, 804763, 804702, 805893, 809003, 813584, 818900, 824915, 831993, 840015, 848502, 857539, 867866, 879940, 893419, 907672, 922265, 936693, 950062, 961372, 969911, 975312, 977520, 976908]
59685I76908k717m110m962n309n258n213n537o152o832p674q909j0338j1370j1626
59671H80901j1204j0404r440q397p290o143n030l940k675j169J42P82J075J967
59657H19175L785N772P156Q011Q650Q894Q564Q089P790P004M796J320k343n477
59643H91186q142j0405j2070j3108j3693j3766j3263j2663j2542j2583j1848j0114
59631G46989q180o718n610m700m321m681n346n883o477p431q381q570p706o310
59617F56675n307n347o189o741o161m965m479n046n496m698k964j366l23L91P11
59602E98695L45l47m19M82J608K021J601Q76L49K89R01K141L399L761K839J188
59586F19729k21q38p56l22J02N4q98k638m373n276n192m518l727l213l325l998
$$ y = [976908, 974191, 970081, 965119, 959810, 954552, 949339, 943802, 937650, 930818, 923144, 914235, 903897, 892527, 880901, 869697, 859293, 849853, 841456, 834166, 828023, 822993, 819053, 816378, 815209, 815351, 816133, 817208, 819175, 822960, 828732, 835888, 843899, 852549, 861443, 870007, 878096, 885886, 892890, 897686, 899006, 896663, 891186, 883044, 872639, 860569, 847461, 833768, 820002, 806739, 794076, 781534, 768951, 757103, 746989, 738809, 732091, 726481, 721781, 717460, 712779, 707433, 701550, 695073, 687642, 679261, 670691, 662985, 656675, 651368, 646021, 639832, 633091, 626930, 621965, 617486, 612440, 606944, 602246, 599282, 597916, 597593, 597984, 598695, 599040, 598693, 598274, 598756, 600364, 602385, 603986, 604862, 605211, 605500, 606401, 608542, 611941, 615702, 618541, 619729, 619508, 618670, 617914, 617592, 617694, 617748, 616850, 614212, 609839, 604563, 599371, 594853, 591126, 587913, 584588, 580590]
59570E80590m537m311l582l134l051k579j320O3P52P64N95L62o3l42O3R78J555
59553E62803J428J177J378J755J790J732K309L591M830N492N827O209O600P092
59539F14013Q310J0568J3172J5313J7235J9398K0640J8659J2788N211j273n718
59527G48316q520r537q191n108k210q54p21o90j48O64R97J28j883l958n040n394
59511F97851o176p782r277r722r216q396p529o533n437m391l455k691k183j853
59497F13210j453q27N4J221K480L205K946K232K116K843L680M181M850O183P771
59482F54692Q836R147Q992Q689Q578R061J0125J1134J1491J1180J0402R027O824
59469G78178L868M47l071n984p379p006n713m495l479k203n93J000K432L958N798
$$ y = [580590, 576053, 571742, 568160, 565026, 561975, 559396, 558076, 558139, 558891, 559655, 560250, 560612, 560549, 560207, 560270, 561248, 562803, 564231, 565408, 566786, 568541, 570331, 572063, 574372, 577963, 582793, 588285, 594112, 600321, 606921, 614013, 622323, 632891, 646063, 661376, 678611, 698009, 718649, 737308, 750096, 755307, 754034, 748316, 739796, 730259, 722068, 716960, 714750, 713896, 713175, 712485, 712337, 713001, 713998, 714126, 712243, 708285, 703245, 697851, 691675, 683893, 674616, 664894, 655678, 647282, 639753, 633220, 627783, 623392, 619937, 617246, 615063, 613210, 611757, 610930, 610984, 612205, 614685, 617890, 620836, 623068, 625184, 628027, 631707, 635888, 640738, 646921, 654692, 663528, 672675, 681667, 690356, 698934, 707995, 718120, 729254, 740745, 751925, 762327, 771354, 778178, 782046, 782493, 779422, 773438, 766059, 759053, 753340, 748845, 745366, 743163, 742570, 743570, 746002, 749960, 755758]
59454G55758P886R978J1699J2735J3171J3421J3597J3245J2034J0335Q695P003
59442H89557M589R89l644q496j2177j3396j2154j0047q801q709q873q697q412
59429G91729q420q703q988q898q008o135l560p36K177N192Q253J1414J4841J8202
59415G98360K0574K1639K2559K4839K8515L2157L4131L2920K6727J4709q19j4758
59403A041553k2797k4240k1042j5107p310J648J0512J7429K0053J6329O202p414
59391A015816k0077k8552l2027l1321k7757k2786j7738j3364r714o589l840j308
59379H00743J091L099M281M632M725N070N632O058O195O075N711N202M887N027
59365H68428N383N376M770L951L454L485L963M718N437N683N416N353O418Q663
$$ y = [755758, 763644, 773622, 785321, 798056, 811227, 824648, 838245, 851490, 863524, 873859, 882554, 889557, 894146, 895135, 891491, 882995, 870818, 857422, 845268, 835221, 826420, 817711, 808838, 800141, 791729, 783309, 774606, 765618, 756720, 748712, 742577, 739017, 738281, 740458, 745650, 753903, 765317, 780158, 798360, 818934, 840573, 863132, 887971, 916486, 948643, 982774, 1015694, 1042421, 1057130, 1056311, 1041553, 1018756, 994516, 973474, 958367, 951057, 952705, 963217, 980646, 1000699, 1017028, 1023230, 1015816, 995739, 967187, 935160, 903839, 876082, 853296, 835558, 822194, 812480, 805891, 802051, 800743, 801834, 804933, 809214, 813846, 818571, 823641, 829273, 835331, 841526, 847601, 853312, 858514, 863401, 868428, 873811, 879187, 883957, 887908, 891362, 894847, 898810, 903528, 908965, 914648, 920064, 925417, 931835, 940498]
59351I40498J1144J2966J4189J5385J6648J7551J8004J8566J9613K0568K0409
59340A125541J8840J6578J4396J2236R510O078K460q88m086p372j0382j2388j3230
59327A157293j3621j4357j5462j6324j6502j6049j5219j4162j3033j2099j1523
59316I98942j1155j0753j0397j0412j0843j1214j1045j0466j0039j0012j0167
59305H82439j0377j0804j1286j1033r457p105n143l951k842j225N86K001L131
59292H14934M671P072J0164J3269J5278J4838J1186N003j893p900j2426j5344
59280H58852j6239j4787j1621q072m881j701J850N216P575R053J0449J1932J2875
59267H60501J3042J2958J2743J1571Q977N855L306J137j514m510o817q112r164
$$ y = [940498, 951642, 964608, 978797, 994182, 1010830, 1028381, 1046385, 1064951, 1084564, 1105132, 1125541, 1144381, 1160959, 1175355, 1187591, 1197101, 1203179, 1205639, 1204751, 1200665, 1193293, 1182911, 1170523, 1157293, 1143672, 1129315, 1113853, 1097529, 1081027, 1064978, 1049759, 1035597, 1022564, 1010465, 998942, 987787, 977034, 966637, 956225, 945382, 934168, 923123, 912657, 902618, 892606, 882439, 872062, 861258, 849972, 838939, 829482, 822377, 817234, 813283, 810441, 809216, 809802, 811803, 814934, 819605, 826677, 836841, 850110, 865388, 880226, 891412, 896415, 894522, 886622, 874196, 858852, 842613, 827826, 816205, 808133, 803252, 801551, 803401, 808617, 816192, 825245, 835694, 847626, 860501, 873543, 886501, 899244, 910815, 919792, 925647, 928953, 930090, 928576, 924066, 917249, 909137, 899973]
59254H99973j0510j1659j1886j1079r600p995o899o599o483n650m080k548j374
59241H03611j65J136J997K444L322M891O109O031N117M399M059L680L321L327
59227H53279L470L067J908L89j043k138k797l191l697m271m294l530k744k762
59213H31646l350l700l646l674l915l985l763l674m066m685m970m619l891l373
59199G76335l297l146k297r71N6O57J409K350K756K545K764L928N041N195N094
59184G98419N821O994P445P074O612O144N325M648M904N637N631M897M598N057
59170H79206N397N375N900P271Q355Q271P596P141O597N274L338J406m21k436
59156I48270m700p118r684j2089j3578j3778j3337j3335j4223j5469j6022j5134
$$ y = [899973, 889463, 877804, 865918, 854839, 845239, 837244, 830345, 823746, 817263, 811613, 807533, 804985, 803611, 803446, 804582, 806579, 809023, 812345, 817236, 823345, 829376, 834493, 838892, 842951, 846631, 849952, 853279, 856749, 859816, 861724, 862113, 861070, 858932, 856135, 852944, 849247, 844976, 840682, 837152, 834408, 831646, 828296, 824596, 820950, 817276, 813361, 809376, 805613, 801939, 797873, 793188, 788218, 783599, 779708, 776335, 773038, 769892, 767595, 766624, 766680, 767337, 768746, 771096, 773852, 776397, 779161, 783089, 788130, 793325, 798419, 804240, 811234, 818679, 825753, 832365, 838509, 843834, 848482, 853386, 859023, 864654, 869551, 874149, 879206, 884603, 889978, 895878, 903149, 911504, 919775, 927371, 934512, 941109, 946383, 949721, 951127, 950706, 948270, 943570, 936452, 926768, 914679, 901101, 887323, 873986, 860651, 846428, 830959, 814937, 799803]
59144G99803j3186j1657j1681j2709j3192j2489j1261j0075q800p486o682o412
59132F74173n844m531l084k099j331n32j96o34j029k48J799M249O319P676Q322
59117F83010Q709R502J0688J1434J1240J0669J0369J0037R043P507N957M466K856
59104G95487J428O24K16l94j291k091k658l111l332l184l093l647m606m963m131
59089G61254k633j441j008j052j100j084j380k205l109l459l396l771m901o052
59075G24663o398o029n544n191m896m715m699m600m197l669l266k958k707k727
59061F63067l010l075k652k206k193k285j922j270r58j068j119q55m40j3M07O06
59045F41014L34l31j127j974k755k993k340j184l15m3p0o3J59P75J866L223M584
$$ y = [799803, 786617, 774960, 763279, 750570, 737378, 724889, 713628, 703553, 694753, 687267, 680585, 674173, 668329, 663798, 660714, 658615, 657284, 656752, 656556, 655922, 654893, 654645, 656444, 660693, 667012, 674688, 683010, 691719, 701221, 711909, 723343, 734583, 745252, 755621, 765658, 774701, 782208, 788165, 792631, 795487, 796915, 797539, 797755, 797361, 796070, 793979, 791321, 788210, 784878, 781694, 778601, 774954, 770348, 765385, 761254, 758621, 757180, 756172, 755120, 754020, 752936, 751556, 749351, 746242, 742783, 739387, 735616, 730715, 724663, 718265, 712236, 706692, 701501, 696605, 691890, 687191, 682591, 678394, 674725, 671459, 668501, 665794, 663067, 660057, 656982, 654330, 652124, 649931, 647646, 645724, 644454, 643496, 642428, 641309, 640454, 640014, 640001, 640408, 641014, 641348, 641017, 639890, 637916, 635161, 632168, 629828, 628644, 628329, 628286, 628216, 628153, 628312, 629087, 630953, 634176, 638760]
59028F38760N892P098Q081R061J0555J2427J3604J3422J2683J2521J2700J2031
59016G68835J0169P861N583L188R45l62o79j024k056l238l873m199m763n350n244
59001G65793m153k373l33J608L176M385N462O305O405N591M444L563K869K110
58987H04852J591J765K368K733K853L440M817O440P753Q901J0250J1681J2865
58974H82309J3882J4956J5809J5953J5601J5607J6245J6652J5873J4062J2165
58963A049114J0780R710Q448O609M017P91k663o092r550j2922j5615j7316j8663
58950A006648k0420k2191k2794k1888k0357j9052j7917j6569j4915j2951j0687
58939H06907q488o845n626m289k891j992j422k90J409K356J775N95M1K7j58n09
$$ y = [638760, 644652, 651750, 659831, 668892, 679447, 691874, 705478, 718900, 731583, 744104, 756804, 768835, 779004, 786865, 792448, 795636, 796581, 796219, 795540, 794516, 792460, 789222, 785349, 781150, 776387, 771037, 765793, 761640, 759267, 758934, 760542, 763718, 768103, 773565, 779870, 786275, 791866, 796310, 799873, 802742, 804852, 806443, 808208, 810576, 813309, 816162, 819602, 824419, 830859, 838612, 847513, 857763, 869444, 882309, 896191, 911147, 926956, 942909, 958510, 974117, 990362, 1007014, 1022887, 1036949, 1049114, 1059894, 1069604, 1078052, 1084661, 1088678, 1089469, 1086806, 1080714, 1071164, 1058242, 1042627, 1025311, 1006648, 986228, 964037, 941243, 919355, 898998, 879946, 862029, 845460, 830545, 817594, 806907, 798419, 791574, 785948, 781659, 778768, 776776, 775354, 775064, 776473, 778829, 780604, 781199, 781240, 781267, 781109, 780600]
58923G80600p17j029j651j963j469q39r02j198q49k41m24j086p56J043L213M790
58907G76522O005P325Q550R366J0029J1127J3101J5923J8764K0210J9686J8364
58895I34972J7823J7979J7441J5753J4013J3227J3333J4008J5232J6607J7236
58884A107624J6838J6069J5307J4004J1708Q871O061L188N9k990n592p884r962
58871A173301j1464j2125j2258j2260j2124j1833j1646j1609j1294j0502r739
58860A046447r529r763j0096j0543j1189j1804j2112j2184j2145j1873j1249j0387
58848I13573r403q408p823q193r459j0940j2167j3164j3750j3432j2320j1354
58836G83160j1097j1005j0392r395q442p371n862m122k540j078L13J167J168R60
$$ y = [780600, 779883, 778854, 777203, 775240, 773771, 772932, 772030, 770832, 769983, 769742, 769318, 768232, 767476, 768519, 771732, 776522, 782527, 789852, 798402, 807768, 817797, 828924, 842025, 857948, 876712, 896922, 916608, 934972, 952795, 970774, 988215, 1003968, 1017981, 1031208, 1044541, 1058549, 1073781, 1090388, 1107624, 1124462, 1140531, 1155838, 1169842, 1181550, 1190421, 1196482, 1199670, 1199729, 1196739, 1191147, 1183263, 1173301, 1161837, 1149712, 1137454, 1125194, 1113070, 1101237, 1089591, 1077982, 1066688, 1056186, 1046447, 1036918, 1027155, 1017059, 1006516, 995327, 983523, 971411, 959227, 947082, 935209, 923960, 913573, 904170, 895762, 887939, 879746, 870287, 859347, 847180, 834016, 820266, 806834, 794514, 783160, 772063, 761058, 750666, 741271, 732829, 725458, 719596, 715474, 712934, 711856, 712169, 713336, 714504, 715464]
58822G15464J558L148N082O734P749P788O778N327M236L691L382L182L082K735
58808G79936J773M30p90j948l482n232o463o863o892o911o708o149n695n838o355
58793G12813o576o143n234m219l334k510j394L64K587M530N582N925O322P261
58779G15974Q510R458R693R224Q293P109N631L585Q55k127m566o146p357q805
58765G49331j0396j1595j2223j2413j1957j0498q448o835n911m809l033j431r22
58752F48860j105j105j098j817k916l158k156p76K38J022J835K637L613N054O521
58737F55649P057O543N877N548N039M022L041K496J943J099N65P92J211J165R87
58722G03034J252J658J604J330J534K256L053L894M963N831N797M934L991L252
$$ y = [715464, 717022, 720170, 725252, 731986, 739735, 747523, 754301, 759628, 763864, 767555, 770937, 774119, 777201, 779936, 781709, 782139, 781349, 779401, 775919, 770687, 764224, 757361, 750469, 743558, 736850, 730701, 725006, 719168, 712813, 706237, 700094, 694860, 690641, 687307, 684797, 683403, 683767, 686354, 690884, 696466, 702391, 708713, 715974, 724484, 733942, 743635, 752859, 761152, 768261, 773892, 777477, 778332, 776205, 771639, 765493, 758136, 749331, 738935, 727340, 715117, 702704, 690747, 680249, 671801, 664966, 659055, 654246, 651213, 649782, 648860, 647755, 646650, 645552, 643735, 640819, 637661, 635505, 634729, 634967, 635989, 637824, 640461, 644074, 649128, 655649, 662706, 669249, 675126, 680674, 685713, 689735, 692776, 695272, 697215, 698314, 698879, 699671, 700882, 702047, 703034, 704286, 705944, 707548, 708878, 710412, 712668, 715721, 719615, 724578, 730409, 736206, 741140, 745131, 748383]
58708G48383K289Q06r54k712m476o267q025r835j1802j3678j5045j5783j6047
58695F46854j5857j5118j3975j2740j1466r981q299o671n356m541m382m714m940
58682E28814m577l892l583l885m266m038k966j372J03Q89R29P56R92J765K808
58667E08477L877M855N640O164O532O876P090O803N574L197K9l007n032n929o184
58652E44962n994n102l610k419k350l170l964m209m113m001l841l395k580j574
58638D94640o64L7P11J563K516L327L870M041L607K557J445Q11L70n50j801k358
58622E14122j679l72P28J510K253L016L774M690N824O901P652Q033Q011P582P094
58607E79139O984P077O719N763M764M151L890M002M552M918M108K116J02r93j096
$$ y = [748383, 750672, 751478, 750524, 747812, 743336, 737069, 729044, 719209, 707407, 693729, 678684, 662901, 646854, 630997, 615879, 601904, 589164, 577698, 567717, 559418, 552747, 547391, 542850, 538468, 533754, 528814, 524237, 520345, 516762, 512877, 508611, 504573, 501607, 500235, 500338, 501227, 502156, 502912, 503904, 505669, 508477, 512354, 517209, 522849, 529013, 535545, 542421, 549511, 556314, 561888, 565085, 565114, 562107, 557075, 551146, 544962, 538968, 533866, 530256, 527837, 525487, 522317, 518353, 514144, 510031, 506030, 502189, 498794, 496214, 494640, 493976, 494013, 494724, 496287, 498803, 502130, 506000, 510041, 513648, 516205, 517650, 518461, 518831, 518281, 516480, 514122, 512443, 512071, 512799, 514309, 516562, 519578, 523352, 528042, 533866, 540767, 548419, 556452, 564463, 572045, 579139, 586123, 593200, 599919, 605682, 610446, 614597, 618487, 622489, 627041, 631959, 636067, 638183, 638285, 637292, 636196]
58592F36196j58J948M263N037M084L441M674O776Q020Q592R747J1294J1795J0902
58578G26611R788R295R041Q477P616O640N733N332N717O452P003P684R181J1431
58564H36001J3867J6410J9223K1768K3187K3500K3336K2645K0745J7541J3621
58553A051844R178M031j202n148p218q124q559q337p262n949n257n498o583q471
58539I87445j1069j4102j7313k0475k3070k4455k4526k3818k2766k1181j8720
58528G65950j5611j2677j0605r282q001o480n372n295n637n150l765k695k544
58515F72836k438j630p49n69o43k68R9l02j038j173q73r59j310j125m26M4K01
58498F59677N41R12P12K32L80J109J465J270J423K385L585M597N683O914P830
$$ y = [636196, 636038, 637986, 642249, 647286, 651370, 654811, 659485, 666261, 674281, 682873, 692620, 703914, 715709, 726611, 736399, 745694, 754735, 763212, 770828, 777468, 783201, 788533, 794250, 800702, 807705, 815389, 824570, 836001, 849868, 866278, 885501, 907269, 930456, 953956, 977292, 999937, 1020682, 1038223, 1051844, 1061022, 1065053, 1063851, 1058703, 1051485, 1043361, 1034802, 1026465, 1019203, 1013254, 1007997, 1002499, 995916, 987445, 976376, 962274, 944961, 924486, 901416, 876961, 852435, 828617, 805851, 784670, 765950, 750339, 737662, 727057, 717775, 709774, 703294, 697922, 692627, 686990, 681840, 678075, 675380, 672836, 670398, 668768, 668019, 667450, 666807, 666539, 666638, 666336, 665298, 664125, 663252, 662293, 660983, 659858, 659432, 659476, 659677, 660218, 661130, 661842, 662074, 662454, 663563, 665028, 666298, 667721, 670106, 673691, 678288, 683971, 690885, 698715]
58483F98715Q360R128J0591J2690J5355J8395K0825K1457K0347J8659J6904J4345
58471H85771J0369N435L30m580q925j2038j3486j3305j1625q749n644l383j887
58458H18283j0K899O233R071J1168J2720J3791J4179J3464J1274P885M233P85
58445I25975l117p968j2692j5578j6247j5693j4665j3162j1239r164o875m364
58433G95211k273j043R8K065M327N808O828Q423J0199J0793J0334J0276J0687
58420H71733R830O936L393N23j985m576o548p286p436p853q419q719q822q768
58406H22003q245p345o694o421n954n077m117k925j039R94J875J523J354K191
58392G82123L298L872M031L945L456L041L530M396M017K254J048J745L447M789
$$ y = [698715, 707075, 716203, 726794, 739484, 754839, 773234, 794059, 815516, 835863, 854522, 871426, 885771, 896140, 901575, 901905, 897325, 888400, 876362, 862876, 849571, 837946, 829197, 823553, 820170, 818283, 818273, 821172, 827405, 836476, 847644, 860364, 874155, 888334, 901798, 913072, 920957, 925190, 925975, 922858, 914890, 902198, 886620, 870373, 854680, 840015, 826853, 815614, 806450, 799575, 795211, 792938, 791895, 791993, 794058, 798385, 804193, 811021, 819444, 829643, 840436, 850770, 861046, 871733, 881563, 888499, 891892, 892415, 890430, 885854, 879306, 872020, 864584, 856731, 848312, 839593, 830771, 822003, 813758, 806413, 799719, 793298, 787344, 782267, 778150, 775225, 774186, 775180, 777055, 778578, 779932, 782123, 785421, 789293, 793324, 797269, 800725, 803766, 807296, 811692, 815709, 817963, 819011, 820756, 824203, 828992]
58378H28992N667O294O196N320M681M841N041M815N073O487Q157R019R349R861
58364I19793J0419J0756J1325J2428J3434J3811J3893J3821J2864J0633P870N275
58352A056322K715L35q63n15K41L63K87Q57J988L274M817O579P925Q508Q804R233
58336A110870R830J0963J3041J5257J6229J6167J6688J8007J8408J7014J4974
58325A277448J3057J0340O491L207J951J983J997K028K490K963L222L893N066
58312A336136N794N983O910Q851J0233J0204J0046J0807J1657J1903J2507J4103
58300A455134J5595J6204J6861J8129J8875J8541J8522J9650K0558K0207J9837
58289A658113K0703K1991K2759K3616K4816K4977K3690K2969K4188K5908K6613
$$ y = [828992, 834659, 840953, 847149, 852469, 857150, 861991, 867032, 871847, 876920, 883407, 891564, 900583, 909932, 919793, 930212, 940968, 952293, 964721, 978155, 991966, 1005859, 1019680, 1032544, 1043177, 1051047, 1056322, 1059037, 1059372, 1058509, 1057994, 1058235, 1058598, 1058885, 1059742, 1061730, 1065004, 1069821, 1076400, 1084325, 1092833, 1101637, 1110870, 1120700, 1131663, 1144704, 1159961, 1176190, 1192357, 1209045, 1227052, 1245460, 1262474, 1277448, 1290505, 1300845, 1307336, 1310543, 1312494, 1314477, 1316474, 1318502, 1320992, 1323955, 1327177, 1331070, 1336136, 1341930, 1347913, 1354823, 1363674, 1373907, 1384111, 1394157, 1404964, 1416621, 1428524, 1441031, 1455134, 1470729, 1486933, 1503794, 1521923, 1540798, 1559339, 1577861, 1597511, 1618069, 1638276, 1658113, 1678816, 1700807, 1723566, 1747182, 1771998, 1796975, 1820665, 1843634, 1867822, 1893730, 1920343]
58278A920343K7165K8527K9646K9819L0612L3144L5934L7604L9198M1640M3679
58267B297311M4630M6259M9501N2304N3255N4235N6809N9285O0210O1436O4473
58256B899708O7263O7877O8081O9793P1547P2139P4054P9203Q4923Q8437R1680
58245C734705R7271J03457J07850J12470J19919J28153J34372J40607J49892J60392
58235D989088J69071J77791J89724K03133K14861K26688K41917K59048K75381
58226F946702K93379L16575L42714L68022L94750M27179M63961N02087N44464
58217A0599833N95488O53207P14487P83677Q67113R63769J071075J195338J346034
58208A8790021J525120J733482J982895K289624K661632L104562L633750M266424
$$ y = [1920343, 1947508, 1976035, 2005681, 2035500, 2066112, 2099256, 2135190, 2172794, 2211992, 2253632, 2297311, 2341941, 2388200, 2437701, 2490005, 2543260, 2597495, 2654304, 2713589, 2773799, 2835235, 2899708, 2966971, 3034848, 3102929, 3172722, 3244269, 3316408, 3390462, 3469665, 3554588, 3643025, 3734705, 3831976, 3935433, 4043283, 4155753, 4275672, 4403825, 4538197, 4678804, 4828696, 4989088, 5158159, 5335950, 5525674, 5728807, 5943668, 6170356, 6412273, 6671321, 6946702, 7240081, 7556656, 7899370, 8267392, 8662142, 9089321, 9553282, 10055369, 10599833, 11195321, 11848528, 12563015, 13346692, 14213805, 15177574, 16248649, 17443987, 18790021, 20315141, 22048623, 24031518, 26321142, 28982774, 32087336, 35721086, 39987510]
58200C9987510N010225N876493O898129Q117872R569417J1289623J3333535J5746748
58192A15829552J8534816K1694388K5251374K9180371L3202758L6602442L8179674
58185C18475375L6422061L0017155J8691572L887576j1463905k4213740l2435338
58178C39380756l5945092l5727998l3049591k8982520k4359213j9809776j5772038
58171A45734528j2552333j0382535r341338r214000r518263r743853r594212r038101
58163F6349893q200563p236987o267743n364511m561705l873143l298907k825058
58155B4721276k430673k099951j823569j591011j390521j216446j068771r45294
58147A2155040q40904p53397o82596o24391n72662n26263m87286m53512m19541
$$ y = [39987510, 44997735, 50874228, 57772357, 65890229, 75459646, 86749269, 100082804, 115829552, 134364368, 156058756, 181310130, 210490501, 243693259, 280295701, 318475375, 354897436, 384914591, 403606163, 407493739, 396029834, 371816094, 339380756, 303435664, 267707666, 234658075, 205675555, 181316342, 161506566, 145734528, 133182195, 122799660, 113458322, 104244322, 94726059, 84982206, 75387994, 66349893, 58149330, 50912343, 44644600, 39280089, 34718384, 30845241, 27546334, 24721276, 22290603, 20190652, 18367083, 16776072, 15385551, 14169105, 13100334, 12155040, 11314136, 10560739, 9878143, 9253752, 8681090, 8154827, 7667541, 7214029, 6794488]
58138F794488l84630l52369l23154k93756k64168k38138k16782j97744j80933
58129D342814j69156j62610j58043j53790j50615j47456j41409j32375j23174
58120C004186j14838j06064r7203r0362q5364p9946p4030o9759o7283o4521o1166
58109B093650n9024n8264n7082n5108n3556n2151m9557m6553m5144m4761m3095
58098A529355m0363l8900l8686l7303l4454l2472l2060l1273k9302k7573k6514
58087A160455k4720k2010k0034j9203j8147j6733j6519j7592j8012j7150j6563
58076I53772j6913j6825j5675j4784j4928j5164j4848j4530j4230j3108j1418
58065G91349j0569j0676j0277q880p605p000o405n872o444q106r583j0473j1495
$$ y = [6794488, 6409858, 6057489, 5734335, 5440579, 5176411, 4938273, 4721491, 4523747, 4342814, 4173658, 4011048, 3853005, 3699215, 3548600, 3401144, 3259735, 3127360, 3004186, 2889348, 2783284, 2686081, 2595719, 2510355, 2430409, 2356379, 2286620, 2219337, 2154816, 2093650, 2034626, 1976362, 1919280, 1864172, 1810616, 1758465, 1708908, 1662355, 1617211, 1572450, 1529355, 1488992, 1450092, 1411406, 1374103, 1339649, 1307177, 1275117, 1243844, 1214542, 1186969, 1160455, 1135735, 1113725, 1093691, 1074488, 1056341, 1039608, 1023089, 1005497, 987485, 970335, 953772, 936859, 920034, 904359, 889575, 874647, 859483, 844635, 830105, 815875, 802767, 791349, 780780, 770104, 759827, 750947, 743342, 736342, 729937, 724065, 717621, 709515, 699932, 689459, 677964]
58052F77964j2427j2065j0463r000p990o512m768m251n129n894n923o084o468
58039E80990o001m842m655n813o655o277n789n981o080n749o175p996j0022j1011
58025D87944j1114j0712r528p716o259n561n058m669m977n527m907l083j884k340
58011D04609l329l536l133k743k392k193k491k686j552O81K130J863J023P31N80
57996C87562K7m07k98k37o34q61m18K41O73J082J434J212M96N1m7n12j319j611
57978C86434j405j703k492k461j289l17j93K37J725L122L226K567K150J799R56
57963C92356n4o85j038j219r19l51n09j686k938l638m246m905m783l624k527k178
57947C57056j748n61N63Q05R36K091L962N503O517P453Q333Q962R563J0330J0969
$$ y = [677964, 665537, 653472, 643009, 634009, 626019, 619507, 614739, 610488, 605359, 599465, 593542, 587458, 580990, 574989, 570147, 565492, 559679, 553024, 546747, 540958, 534977, 528897, 523148, 516973, 508977, 498955, 487944, 476830, 466118, 456590, 448874, 442615, 437054, 431996, 427327, 422350, 416823, 411916, 408833, 406949, 404609, 401280, 397744, 394611, 391868, 389476, 387283, 384792, 382106, 380554, 381235, 383365, 385228, 386251, 386982, 387562, 387589, 387182, 386884, 386647, 386013, 385152, 384734, 384975, 385648, 386730, 388164, 389376, 389872, 389923, 389876, 389364, 388045, 386434, 385029, 383326, 380834, 378373, 377084, 376767, 376574, 376811, 378536, 381658, 384884, 387451, 389601, 391400, 392356, 392302, 391617, 390579, 389360, 388441, 388090, 387581, 385895, 382957, 379319, 375073, 370168, 365385, 361761, 359234, 357056, 355308, 354747, 355310, 356115, 357051, 359142, 363104, 368607, 375124, 382577, 390910, 399872, 409435, 419765, 430734]
57932D30734J1272J1472J1415J0315P915N046K512L14j636l078m138n400o754
57919D69989p390p343p632q353q157o392m209k719j554j99P62Q92R42J511J911
57904D22059J533R73O81j78k187m303n428n998o677o686n180l158k149j890j056
57889C80356L27J085J028J122J725K125J848J156L04o37j335j511j486j744k235
57874C82128k786l615m632m937l899k215r30o9R36K067K971L695M299M386L940
57859C81339L866M677N531N559N349N768O218N543M066L138L065K975K454J829
57845D41377R27r21l557n823o947p150o943o656o631p050p570p735p557p130o150
57830C54484m557l104k462k242j750j088n54K77J725K837K497J283P40J088J076
$$ y = [430734, 442006, 453478, 464893, 475208, 483123, 488169, 490681, 490995, 489359, 486281, 482143, 476743, 469989, 462599, 455256, 447624, 439271, 431114, 424722, 420513, 417794, 416240, 416041, 416803, 417695, 418637, 420148, 422059, 423592, 424565, 425246, 425068, 422881, 418578, 413150, 407152, 400475, 393789, 388609, 385451, 383302, 381412, 380356, 380683, 381768, 382796, 383918, 385643, 387768, 389616, 390772, 391076, 390439, 389104, 387593, 386107, 384363, 382128, 379342, 375727, 371095, 366158, 362259, 360044, 359114, 359045, 359981, 362048, 365019, 368714, 373013, 377399, 381339, 385205, 389882, 395413, 400972, 406321, 412089, 418307, 423850, 427916, 431054, 434119, 437094, 439548, 441377, 442304, 441383, 437826, 432003, 425056, 417906, 410963, 404307, 397676, 390626, 383056, 375321, 367764, 360634, 354484, 349927, 346823, 344361, 342119, 340369, 339281, 338727, 339004, 340729, 343566, 346063, 347346, 348086, 349174, 350250]
57815C50250Q7j069j614j776j969k100k033j932j863j723j711k202l162m185n101
57800C17897n928o407o225n533m683l600k121n54O85J750K964M112M867N477O277
57785C08978O943P078P005P113O932N974N001N233O515P453P258O329N178L970
57771C96960L026K595K040L90k144m246n185n585o347p671r176j0217j0062q607
57757C35771o862n875n292m041k232j162j312j563q68L88J195J266J079J120J577
57742C13189K303K855K898K701K777L108L250L217L589M617N726O097N379L854
57728C65560K198J067O00M43L71M87O71M86M4J39R80J647J595J725K848M023L797
57711C88681K417J257N06q82l185n475p123q225q454p102m518k132o13O77K108
$$ y = [350250, 350337, 349268, 347654, 345878, 343909, 341809, 339776, 337844, 335981, 334258, 332547, 330345, 327183, 322998, 317897, 311969, 305562, 299337, 293804, 289121, 285521, 283400, 282846, 283531, 285281, 288245, 292357, 297224, 302701, 308978, 315921, 322999, 330004, 337117, 344049, 350023, 355024, 360257, 366772, 374225, 381483, 387812, 392990, 396960, 399986, 402581, 404621, 405011, 402867, 398621, 393436, 387851, 381504, 373833, 364657, 354440, 344378, 335771, 328909, 323034, 317742, 313701, 311469, 310307, 308995, 307432, 306564, 306952, 308147, 309413, 310492, 311612, 313189, 315492, 318347, 321245, 323946, 326723, 329831, 333081, 336298, 339887, 344504, 350230, 356327, 361706, 365560, 367758, 368825, 369425, 369868, 370239, 370726, 371397, 371883, 371927, 372066, 373046, 374693, 376288, 378013, 380861, 384884, 388681, 391098, 392355, 392861, 391979, 388794, 383319, 376196, 367971, 359517, 352415, 347897, 345765, 345152, 345829, 347937]
57696C47937L019L000K677K548K118P28j509m131o803q940r708q879p203n586
57682C09268m371l445k332k47L163P064J0305J3030J6417K0957K6031L1331L7478
57669D64649M4970N3393O1845O8949P2209O8590N6402L6225J0329j7578m2315
57658H77668n9076o6452o6813o3234n7127m9162m0773l3465k7575k2660j8550
57647C72781j5281j2612j0406q848p820o708n325m273l954l908l697l570l720
57634B82659l689l154k594k554k795k812k589k358k160k111k488l105l227k592
57620B44431j937k002k612l092l042k419j492q77r82j202o26L54K83j150k417
57605B21218k311j564j484k010k173j659q48M8R43J381R71m1j165k255l165l378
$$ y = [347937, 350956, 353956, 356633, 359181, 361299, 362027, 360518, 356387, 349584, 340644, 330936, 322057, 314854, 309268, 304897, 301452, 299120, 298873, 302036, 309100, 319405, 332435, 348852, 369809, 395840, 427171, 464649, 509619, 563012, 624857, 693806, 766015, 834605, 891007, 927232, 937561, 919983, 877668, 818592, 752140, 685327, 622093, 564966, 515804, 475031, 441566, 413991, 391331, 372781, 357500, 344888, 334482, 325634, 317814, 311106, 305781, 301508, 297554, 293646, 289949, 286379, 282659, 278970, 275816, 273222, 270668, 267873, 265061, 262472, 260114, 257954, 255843, 253355, 250250, 247023, 244431, 242494, 240492, 237880, 234788, 231746, 229327, 227835, 226958, 225976, 224774, 224148, 224502, 224785, 223635, 221218, 218907, 217343, 215859, 213849, 211676, 210017, 209169, 209217, 210160, 211541, 212512, 212471, 211306, 209051, 205886, 202508]
57589B02508k638j441m53R2R8n77j495j658p17M39Q22M29k70j053j644j602j131
57572A89709j177k064k896k950k718k854l118l223l634m517m820l638j707l71
57558A50022J75M91N14j04q58r31m28J27R40K347L569L568K776K495K798K510
57542A70011J283K14J79Q93J862K984L817L454J740j47r85p51k26M2j0k82n79
57525A83499o49l93P1N96J065J357J414J343J233J023O78K85j91q08j217r24j94
57508A88188j2p24j433j303p39n80p72o74j79K90M22qj222k781l473k764j763
57491A70473j704k215k188j758j973k825l132k471j752j695j862j564q34j82l0
57476A44288n41j377j666r55J8K04k83n40l72l67o21n62j12J21m1j57k18p68j647
$$ y = [202508, 199870, 198429, 197976, 198068, 198166, 197589, 196094, 194436, 193719, 194158, 194980, 195409, 195139, 194086, 192442, 190840, 189709, 188532, 186468, 183572, 180622, 177904, 175050, 171932, 168709, 165075, 160558, 155738, 152100, 150393, 150022, 150197, 150688, 151202, 151098, 150240, 149309, 148881, 149008, 149948, 152295, 155864, 159432, 162208, 164703, 167501, 170011, 171294, 171508, 171687, 172580, 174442, 177426, 181243, 184697, 186437, 186290, 185305, 184554, 184328, 184370, 184360, 184078, 183499, 182850, 182457, 182528, 183124, 184189, 185546, 186960, 188303, 189536, 190559, 191237, 191522, 191331, 190523, 189306, 188382, 188188, 188176, 187452, 186019, 184716, 183977, 183397, 182625, 181951, 181772, 182062, 182484, 182476, 181254, 178473, 175000, 172236, 170473, 168769, 166554, 164366, 162608, 160635, 157810, 154678, 152207, 150455, 148760, 146898, 145334, 144500, 144318, 144288, 143747, 142370, 140704, 139749, 139767, 139971, 139688, 139148, 138776, 138409, 137788, 137226, 137114, 137235, 137194, 137037, 136819, 136051, 134404]
57457A34404j778p04O24J098P72L86L19M91P07O93K68k42k27L18P72Q96J164J785
57439A41746K128J667Q43M81P04R39P48K59j20j25K20P61J419K117K434J779K82
57422A58282r97j213p39m43m33k48N0n8n87j084j489j994k167j278M78K026K801
57405A50907L043K682J152j306l270l678k884j779p34J12M13J72P2N60J149J203
57389A47814Q71P06Q41J053J264J437J359R47N74O79J290K131K857L066K558J777
57373A71224J435J467J022k23j339j319l79M56O53M18k3o53j242j353q91l34j66
57356A68753l02j93M81J370J808J578J114Q67Q13Q31J105J686K035J608P56L41
57340A84651N66Q48Q44Q59J122J365J284R80P20O36P67J005J102J086J475K482
$$ y = [134404, 132626, 131922, 132546, 133644, 134416, 134802, 135121, 135612, 136319, 137012, 137280, 137038, 136811, 137129, 137901, 138797, 139961, 141746, 143874, 145541, 146384, 146865, 147569, 148508, 149256, 149515, 149395, 149270, 149490, 150251, 151670, 153787, 156221, 158000, 158282, 157285, 156072, 155333, 154890, 154457, 154209, 154259, 154201, 153614, 152530, 151041, 149047, 146880, 145602, 146080, 148106, 150907, 153950, 156632, 157784, 156478, 153208, 149530, 146646, 144867, 144133, 144245, 144658, 144830, 144902, 145462, 146611, 147814, 148685, 149391, 150232, 151285, 152549, 153986, 155345, 156292, 156866, 157545, 158835, 160966, 163823, 166889, 169447, 171224, 172659, 174126, 175148, 174925, 173586, 172267, 171888, 172344, 172997, 173415, 173392, 172739, 171497, 170144, 169253, 168919, 168753, 168451, 168258, 168739, 170109, 171917, 173495, 174609, 175476, 176289, 177120, 178225, 179911, 181946, 183554, 184310, 184651, 185217, 186065, 186909, 187768, 188890, 190255, 191539, 192519, 193239, 193875, 194642, 195647, 196749, 197835, 199310, 201792]
57324B01792L278K854J532O64Q31J149O87l02q87n73M05J390J670J074K31j31
57308B15664j35l45o64m61K55P60Q10Q81J059Q15J59q0M16Q37O12M00R82J956
57290B23921K336J856J011K35k90m25k01J76P01J551K425K607K032J642K268L688
57274B45533N143O132O433O038N519N668O397O729O318O079O700P465P366O656
57260C34176O294O474O636O530O401O347O270O196O099N721N139N023N646O150
57246D19102N580M317L650M099M975N480N537N525N780O452P299P670P072N828
57232D98366M874M879N737O815P518P794Q176R123J0300J0872J0561R969R708
57219F04692R767R953J0400J1228J2118J2653J2847J3076J3669J4642J5675J6422
$$ y = [201792, 205070, 207924, 209456, 210120, 210951, 212100, 212787, 212485, 211598, 211025, 211430, 212820, 214490, 215564, 215795, 215664, 215529, 215184, 214520, 214059, 214314, 215074, 215884, 216765, 217824, 218639, 218798, 218718, 219134, 219971, 220583, 220983, 221965, 223921, 226257, 228113, 229124, 229359, 229069, 228644, 228443, 228619, 229320, 230871, 233296, 235903, 237935, 239577, 241845, 245533, 250676, 256808, 263241, 269279, 274798, 280466, 286863, 293592, 299910, 305989, 312689, 320154, 327520, 334176, 340470, 346944, 353580, 360110, 366511, 372858, 379128, 385324, 391423, 397144, 402283, 407306, 412952, 419102, 424682, 428999, 432649, 436748, 441723, 447203, 452740, 458265, 464045, 470497, 477796, 485466, 492538, 498366, 503240, 508119, 513856, 520671, 528189, 535983, 544159, 553282, 563582, 574454, 585015, 594984, 604692, 614459, 624412, 634812, 646040, 658158, 670811, 683658, 696734, 710403, 725045, 740720, 757142]
57207G57142J7211J9063K2446K6298K9127L0773L2030L2813L2251L0589K9346
57196A059089K9059K8492K6877K5437K5521K6512K6825K6112K5188K4504K3945
57185A347561K3658K4015K4962K6236K7830K9616L1060L1881L2437L2880L2708
57174A664844L1765L0853L0585L0547L0361L0621L1823L3316L4323L5130L6142
57163B020310L6704L6116L5099L4870L5388L5746L5762L5889L6046L5793L5343
57152B413066L5237L5405L5506L5687L5993L5611L3831L1207K8665K6153K3325
57141B769686K0866J9808K0062K0935K2488K5076K8198L1162L4280L8061M1853
57130C072475M4849M7664N1279N4990N7145N7390N6630N5339N3844N3613N6253
$$ y = [757142, 774353, 793416, 815862, 842160, 871287, 902060, 934090, 966903, 999154, 1029743, 1059089, 1088148, 1116640, 1143517, 1168954, 1194475, 1220987, 1247812, 1273924, 1299112, 1323616, 1347561, 1371219, 1395234, 1420196, 1446432, 1474262, 1503878, 1534938, 1566819, 1599256, 1632136, 1664844, 1696609, 1727462, 1758047, 1788594, 1818955, 1849576, 1881399, 1914715, 1949038, 1984168, 2020310, 2057014, 2093130, 2128229, 2163099, 2198487, 2234233, 2269995, 2305884, 2341930, 2377723, 2413066, 2448303, 2483708, 2519214, 2554901, 2590894, 2626505, 2660336, 2691543, 2720208, 2746361, 2769686, 2790552, 2810360, 2830422, 2851357, 2873845, 2898921, 2927119, 2958281, 2992561, 3030622, 3072475, 3117324, 3164988, 3216267, 3271257, 3328402, 3385792, 3442422, 3497761, 3551605, 3605218, 3661471]
57119C661471O1452O7801P5290Q4975R6617J08778J21187J34949J50697J68653
57109D731870J90281K17593K50903K89553L34832L89984M57445N38409O34856
57100H035726P49425Q83314J037038J213246J416306J649306J913917K211808
57092A9110086K541881K896438L264005L634881L998888M339991M641443M893605
57084D9321218N079364N142565M986436M528016L763157K773590J671179N41366
57076G7806891n66648j617776k575749l404937m075792m567486m871759m996429
57068E1130315m962563m797578m531301m195069l818862l427053l037621k664465
57060A9695803k318169k004709j725870j481684j271491j093116r42960q17733
$$ y = [3661471, 3722923, 3790724, 3866014, 3950989, 4047606, 4156384, 4277571, 4412520, 4563217, 4731870, 4922151, 5139744, 5390647, 5680200, 6015032, 6405016, 6862461, 7400870, 8035726, 8785151, 9668465, 10705503, 11918749, 13335055, 14984361, 16898278, 19110086, 21651967, 24548405, 27812410, 31447291, 35446179, 39786170, 44427613, 49321218, 54400582, 59543147, 64529583, 69057599, 72820756, 75594346, 77265525, 77806891, 77240243, 75622467, 73046718, 69641781, 65565989, 60998503, 56126744, 51130315, 46167752, 41370174, 36838873, 32643804, 28824942, 25397889, 22360268, 19695803, 17377634, 15372925, 13647055, 12165371, 10893880, 9800764, 8857804, 8040071]
57052H040071p15097o32287n65071n08639m59119m14238l73263l36561l04584
57043C731212k76948k52549k30483k10362j91841j74391j57742j42161j28021
57034A966714j15245j03397r2156q1546p1694o2539n3805m5254l6713k7931j8565
57023A257869q484K259J3899K7147M2425N8996P4757Q6161Q7988P4506M3250j196
57011A759577m8047q6185j09956j20001j19917j13070j01909q8698p5702o4511
57001H31581n5399m7591m0370l3860k8572k4366k0412j6280j2517r771p738n577
56989E29128l081q13R92L002N941R426J1985J2098R106L412l671j0346j5130j7697
56975E34352j8824j9333j9276j8277j6406j4206j1960r425o503l667j397N74L003
$$ y = [8040071, 7324974, 6692687, 6127616, 5618977, 5159858, 4745620, 4372357, 4035796, 3731212, 3454264, 3201715, 2971232, 2760870, 2569029, 2394638, 2236896, 2094735, 1966714, 1851469, 1748072, 1655916, 1574370, 1502676, 1440137, 1386332, 1341078, 1304365, 1276434, 1257869, 1249385, 1251644, 1265543, 1292690, 1335115, 1394111, 1468868, 1555029, 1643017, 1717523, 1760773, 1759577, 1711530, 1625345, 1515389, 1395388, 1275471, 1162401, 1060492, 971794, 896092, 831581, 776182, 728591, 688221, 654361, 625789, 601423, 581011, 564731, 552214, 542443, 534705, 529128, 526047, 525234, 526226, 529228, 535169, 544595, 556580, 568678, 577784, 581196, 577525, 567179, 552049, 534352, 515528, 496195, 476919, 458642, 442236, 428030, 416070, 406645, 400142, 396475, 395078, 395652, 398655]
56962C98655O205R748J3055J6086J9115K1924K3357K1870J6622Q140j968j1752
56950E41057j9487k4041k5317k4286k2223j9809j7094j4113j1050p870m311m38
56938C51018L250O483R573J2939J6713K0911K5441K9457L1224K9115K2764J2979
56926E71867J006j1564k2556k9819l2589l1972k9910k7678k5383k2630j9406j6301
56914C03065j3868j2029j0264q301o389m871l830l166k729k226j374k09R53K040
56900B36802L303M798O189P280Q358R622J0701J1175J1380J2230J4225J6986J9726
56887C72775K1946K3483K4041K2803J8767J1743K950n647j2609j7443k0011k0184
56875D22614j8236j5006j1399p890m592j377K207O654J1914J7425K2895K8607
$$ y = [398655, 404860, 414608, 427663, 443749, 462864, 484788, 508145, 530015, 546637, 554777, 552809, 541057, 521570, 497529, 472212, 447926, 425703, 405894, 388800, 374687, 363637, 355767, 351456, 351018, 354268, 360751, 370324, 383263, 399976, 420887, 446328, 475785, 507009, 536124, 558888, 571867, 572873, 561309, 538753, 508934, 476345, 444373, 414463, 386785, 361402, 338772, 319366, 303065, 289197, 277168, 266904, 258603, 252214, 247343, 243513, 240347, 237618, 235392, 234018, 233809, 234762, 236802, 240105, 244903, 251092, 258372, 266730, 276352, 287053, 298228, 309608, 321838, 336063, 353049, 372775, 394721, 418204, 442245, 465048, 483815, 495558, 498508, 492861, 480252, 462809, 442798, 422614, 404378, 389372, 377973, 370083, 365491, 364114, 366321, 372975, 384889, 402314, 425209, 453816]
56863D53816L4837M1423M8004N3943N7754N7175N0403L7151J8590k838k3356l8749
56851G88153m6592m7561m4216l8708l1972k4322j6026p443Q83Q517J5860K4012
56839E80585L3483M3602N3715O4257P5722Q6971R5244R7349R0170P1228M0743
56828A333069L528l2593o1047p9185q7391q7184q0732p0858o0097m9627l9455
56817F88428k9428j9663j0212q28Q791J8601K8225L7457M6601N5918O4386O9194
56805I57470O6761N4580L2614L909k5893n0678o6792p4264p5131p1236o3955n5022
56793F32363m6125l7758k9467k1301j4070q077k539L390R632J5661K1370K7022
56781E50101L2463L6491L6913L1598K0107M460j1962k6270l6747m2558m3823m1880
$$ y = [453816, 488653, 530076, 578080, 632023, 689777, 746952, 797355, 834506, 853096, 850258, 826902, 788153, 741561, 694000, 649784, 611076, 579104, 554782, 538756, 531313, 532196, 540713, 556573, 580585, 614068, 657670, 711385, 775642, 851364, 938335, 1033579, 1130928, 1221098, 1292326, 1333069, 1336597, 1304004, 1242957, 1163772, 1076381, 989197, 908465, 837607, 777510, 727883, 688428, 659000, 639337, 629125, 628297, 637088, 655689, 683914, 721371, 767972, 823890, 888276, 957470, 1024231, 1078811, 1111425, 1115334, 1089441, 1038763, 971971, 897707, 822576, 751340, 687385, 632363, 586238, 548480, 519013, 497712, 483642, 475565, 473026, 476416, 486048, 501709, 523079, 550101, 582564, 619055, 655968, 687566, 707673, 712133, 700171, 673901, 637154, 594596, 550773, 508893]
56769E08893l8524l4731l0655k6703k3627k1454j9309j6782j4561j3260j2369
56758B56918j1057r490q503q273q011o985n338l830l061l038l277l263k788j945
56744A78059r55j41J75J2j46N3K64j43j140k016k250j948j411p81k02J41L58P92
56726A68721J477K038K244K238K115J716J077O32O36Q15Q80J062J691K483K697
56711A92522K041J075O56J093J883K228J809J094Q54J386K255K729K435J611Q15
56696B16486L21j23p97j439j499r82n59o43q79q49p62r89j395j629j690j599j024
56679A99949M8P11J36j011j222j98P36M16q47k066k789l049k794k000j019l31
56663A84670j04k07m12m77l60m69j292k605l506l408k664j948j449r45l53J50
$$ y = [508893, 470369, 435638, 404983, 378280, 354653, 333199, 313890, 297108, 282547, 269287, 256918, 245861, 236371, 227868, 219595, 211584, 204599, 199261, 195431, 192370, 189332, 186055, 182792, 180004, 178059, 177104, 176963, 177138, 177150, 177004, 177057, 177321, 177178, 176038, 174022, 171772, 169824, 168413, 167632, 167430, 167571, 167929, 168721, 170198, 172236, 174480, 176718, 178833, 180549, 181626, 182258, 182894, 183709, 184589, 185651, 187342, 189825, 192522, 194563, 195638, 196294, 197387, 199270, 201498, 203307, 204401, 205255, 206641, 208896, 211625, 214060, 215671, 216486, 216807, 216684, 215887, 214448, 212949, 211967, 211408, 210765, 209886, 209037, 208275, 207286, 205891, 204262, 202572, 200973, 199949, 199997, 200708, 200844, 199833, 198611, 198413, 199149, 199565, 198718, 196652, 193863, 190814, 188020, 186020, 185001, 184670, 184566, 184359, 183947, 183470, 183110, 182641, 181349, 178744, 175238, 171830, 169166, 167218, 165769, 164824, 164471, 164621]
56647A64621M41O22Q58J167J334J143P26M76M89L98J6k13J04N70M83r1m72l87
56629A72285k10k25l49n87j058j534j620j402j274j158o66r2j93q27p99M17J757
56612A62465K044J616J633K333K899K817K460K280K124J641R43N77Q57J403J480
56597A89572Q19k0l06kL55N27P93J328J776J731J321J061J271J768K037J724J038
56580B06793N35L59M9o74j260r72J34J377K341K938K987K462J995K263L000L470
56564B27797L770M647O074P126P477P911Q876R549Q896O908M237J396j097k547
56550C01020k781k539k556k709k535k112j856j861k008k354k915l336l248k745
56536B65465k136j457o51L6J80l77j397k397k905k772k335j940j503q83n21j007
$$ y = [164621, 165062, 165684, 166542, 167709, 169043, 170186, 170912, 171388, 171877, 172275, 172291, 172078, 172182, 172752, 173235, 173144, 172672, 172285, 172075, 171850, 171501, 170914, 169856, 168322, 166702, 165300, 164026, 162868, 162202, 162110, 161917, 161090, 160291, 160708, 162465, 164509, 166125, 167758, 170091, 172990, 175807, 178267, 180547, 182671, 184312, 185255, 185832, 186689, 188092, 189572, 190391, 190371, 190065, 190063, 190418, 190945, 191738, 193066, 194842, 196573, 197894, 198955, 200226, 201994, 204031, 205755, 206793, 207328, 207687, 207736, 207062, 205802, 204830, 204964, 206341, 208682, 211620, 214607, 217069, 219064, 221327, 224327, 227797, 231567, 236214, 242288, 249414, 256891, 264802, 273678, 283227, 292123, 299031, 303268, 304664, 303567, 301020, 298239, 295700, 293144, 290435, 287900, 285788, 283932, 282071, 280063, 277709, 274794, 271458, 268210, 265465, 263329, 261872, 261221, 261257, 261437, 261060, 259663, 257266, 254361, 251589, 249254, 247314, 245811, 244928, 244407, 243400]
56520B43400k118l001l304l379l338k844j980j393j297j216j000j129j602j569
56506B14230o83J64J45k99l07J13M74P91J245J424Q86J21N2P68J477J535R57J41
56488B23234l67r2Q74J801K143K036J747J194M55J11M06O56K28l64k02O31J255
56471B35746J316J249J310J209P87L53K01K34J57k56j026j817k063j589q83n16
56455B34412m57l34o3K13N45J095J731K098K058J781J420J013N20q8p32j105r53
56438B43154m57j18j63l67m88n13n30o65j018j324r82qM99l51j744k166j613j464
56420B29682k180k678k290j724j456p43R10K638L593M203M935N051L864K251J528
56405B47584J585J416Q50M33J66l29p78o13n1K82M45Q91J449J636J658K058K638
$$ y = [243400, 241282, 238281, 234977, 231598, 228260, 225416, 223436, 222043, 220746, 219530, 218530, 217401, 215799, 214230, 213547, 213711, 213856, 213557, 213250, 213363, 213837, 214628, 215873, 217297, 218183, 218304, 218356, 219124, 220601, 222136, 223093, 223234, 222867, 222775, 223649, 225450, 227593, 229629, 231376, 232570, 233025, 233136, 233542, 234198, 234426, 234062, 233860, 234491, 235746, 237062, 238311, 239621, 240830, 241617, 241970, 242171, 242405, 242562, 242306, 241280, 239463, 237400, 235811, 234928, 234412, 233955, 233621, 233558, 233771, 234316, 235411, 237142, 239240, 241298, 243079, 244499, 245512, 246032, 245944, 245212, 244107, 243154, 242697, 242579, 242416, 242049, 241561, 241048, 240518, 239853, 238835, 237511, 236529, 236521, 237020, 236669, 234925, 232759, 231146, 229682, 227502, 224824, 222534, 220810, 219354, 218611, 219521, 222159, 225752, 229955, 234890, 239941, 243805, 246056, 247584, 249169, 250585, 251435, 251868, 252034, 251705, 250927, 250314, 250263, 250545, 250990, 251881, 253330, 254966, 256624, 258682, 261320]
56388B61320K735K284J646P39n80j528j057N54J782J688R06O39J349K531L327
56373B78335L313K880K679K655K200J336Q64R92Q91J92j68N55J612J954J705J464
56357C03459J125N50L79R39J264O32L1N68J411J109J27Q9J035J622J610K023K846
56340C20819K869J976J505J844J711N31k69N86K271L036K335R66j11l08M81J717
56324C41959K553K706K519K274K077K289L101L767L318K065J343J626K045J931
56310C75573J694J865K307K791L498M482N380N979O549P399Q621J0175J1671J2230
56296D60214J1236R152O883M762K863J777K006K940L640M255N463O845P354P149
56282E36539P460Q612R729J0436J1344J2653J3751J4533J5652J7107J8003J8153
$$ y = [261320, 264055, 266339, 267985, 268724, 268144, 266616, 265559, 266113, 267895, 269583, 270489, 271128, 272477, 275008, 278335, 281648, 284528, 287207, 289862, 292062, 293398, 294262, 295254, 296145, 296337, 296169, 296724, 298336, 300290, 301995, 303459, 304584, 305134, 305513, 306452, 307716, 308348, 308379, 308947, 310358, 311467, 311594, 311683, 312718, 314340, 315950, 317973, 320819, 323688, 325664, 327169, 329013, 330724, 331255, 330986, 331572, 333843, 336879, 339214, 340180, 340069, 339761, 340242, 341959, 344512, 347218, 349737, 352011, 354088, 356377, 359478, 363245, 366563, 368628, 369971, 371597, 373642, 375573, 377267, 379132, 381439, 384230, 387728, 392210, 397590, 403569, 410118, 417517, 426138, 436313, 447984, 460214, 471450, 480602, 487485, 492247, 495110, 496887, 498893, 501833, 505473, 509728, 515191, 522036, 529390, 536539, 543999, 552611, 562340, 572776, 584120, 596773, 610524, 625057, 640709, 657816, 675819, 693972]
56270F93972J8628K0165K2291K4448K6847K9607L2182L4312L6716M0250M5063
56259A024481N0876N7456O4614P2416Q1327R1465J01962J12056J22431J34208
56249A913292J46961J59160J70332J81056J90856J98049K01972K03456K02478
56240C567612J97102J85654J68545J47087J21740R2495O0015K5617r203m2783
56230D513881p3738j01620j26295j46735j61644j71417j77936j82129j83143j80359
56220C008865j74741j67658j59707j51248j42746j34007j24368j14209j04990
56211A735191r7275r0057q2630p5755p0255o5706o1277n6790n2265m7501m2671
56200I93009l8361l4590l0860k7371k4900k3215k1077j8222j5773j4277j2905
$$ y = [693972, 712600, 732765, 755056, 779504, 806351, 835958, 868140, 902452, 939168, 979418, 1024481, 1075357, 1132813, 1197427, 1269843, 1351170, 1442635, 1544597, 1656653, 1779084, 1913292, 2060253, 2219413, 2389745, 2570801, 2761657, 2959706, 3161678, 3365134, 3567612, 3764714, 3950368, 4118913, 4266000, 4387740, 4480235, 4540250, 4565867, 4556664, 4513881, 4440143, 4338523, 4212228, 4065493, 3903849, 3732432, 3554496, 3372367, 3189224, 3008865, 2834124, 2666466, 2506759, 2355511, 2212765, 2078758, 1954390, 1840181, 1735191, 1637916, 1547859, 1465229, 1389474, 1319219, 1253513, 1192236, 1135446, 1083181, 1035680, 993009, 954648, 920058, 889198, 861827, 836927, 813712, 792635, 774413, 758640, 744363, 731458]
56189G31458j1217j0020r643q954p095m943l833l899m378m536l820k206p99q06
56175F55309j671j620k87Q51R96J049J617K062K162K818M196N121N181N544O744
56160F90072P732Q153R445J2290J4995J6003J6279J7548J9794K2087K4466K7337
56148H86201L0334L3236L6880M1842M7435N3247O0302O9445P9870R0499J01415
56137A530706J12753J23454J32378J39195J43018J41757J34269J21969J07330
56128B686829R2301P9041P0039O5758O3523O0016N3505M2896K7168P478j2288
56117C236266k9098m3393n6761o9249q0911r3649j08812j24391j36966j45136
56107B347900j48974j47766j40854j29630j16370j02058q7249p3666o2741n3565
$$ y = [731458, 720241, 710221, 700578, 691624, 684529, 679586, 675753, 671854, 667476, 662940, 659120, 656914, 656115, 655309, 653638, 652018, 651731, 652582, 653578, 654627, 656244, 658306, 660468, 663286, 667482, 672603, 677784, 683328, 690072, 697804, 705957, 715402, 727692, 742687, 758690, 774969, 792517, 812311, 834398, 858864, 886201, 916535, 949771, 986651, 1028493, 1075928, 1129175, 1189477, 1258922, 1338792, 1429291, 1530706, 1643459, 1766913, 1899291, 2038486, 2181504, 2323261, 2457530, 2579499, 2686829, 2779130, 2858171, 2928210, 2993968, 3057491, 3117507, 3171012, 3213908, 3241076, 3248554, 3236266, 3207168, 3163775, 3107014, 3037765, 2956854, 2863205, 2754393, 2630002, 2493036, 2347900, 2198926, 2051160, 1910306, 1780676, 1664306, 1562248, 1474999, 1401333, 1338592, 1285027]
56097A285027m4482l5765k8718k3236j8291j3941j0854q697o744n166m207l178
56085A081748j705o26k13Q32L036M725M739M600N911P571P920P708Q470R690J0182
56070A154588J0642J2165J3770J4073J3911J4737J5832J5867J5603J6330J7100
56059A314618J6449J5416J5830J6916J6575J4985J3956J3827J3785J4132J5479
56048A481968J6754J6809J6733J8010J9706K0255K0477K1889K3631K4131K4310
56037A704673K5924K8247K9593L0620L2750L4892L5236L4923L6361L9199M1424
56026B073842M3038M5152M6850M6678M5852M6475M7956M8719M9852N3271N7889
56015B605574O1464O4609O9089P3926P7263Q0295Q5102R0462R4090R7130J01926
$$ y = [1285027, 1240545, 1204780, 1176062, 1152826, 1134535, 1120594, 1109740, 1101043, 1094299, 1089133, 1084926, 1081748, 1080043, 1079417, 1079204, 1080036, 1083072, 1087797, 1092536, 1097136, 1103047, 1110618, 1118538, 1126246, 1134716, 1144406, 1154588, 1165230, 1177395, 1191165, 1205238, 1219149, 1233886, 1249718, 1265585, 1281188, 1297518, 1314618, 1331067, 1346483, 1362313, 1379229, 1395804, 1410789, 1424745, 1438572, 1452357, 1466489, 1481968, 1498722, 1515531, 1532264, 1550274, 1569980, 1590235, 1610712, 1632601, 1656232, 1680363, 1704673, 1730597, 1758844, 1788437, 1819057, 1851807, 1886699, 1921935, 1956858, 1993219, 2032418, 2073842, 2116880, 2162032, 2208882, 2255560, 2301412, 2347887, 2395843, 2444562, 2494414, 2547685, 2605574, 2667038, 2731647, 2800736, 2874662, 2951925, 3032220, 3117322, 3207784, 3301874, 3399004, 3500930]
56004C500930J07384J11240J14848J20834J28066J34025J40020J48770J59034
55995D665151J68036J76959J88325K00371K10064K19363K32276K48070K63745
55986F572360K80678L01986L26031L49630L75072M06461M42159M78561N18319
55977A0051257N66399O21386O79731P45164Q24235R16104J017369J133669J275466
55968A7830780J445963J645213J882702K173399K525243K943882L445078M047608
55960C7939868M759499N588706O563219P723929R105869J0747572J2707326J5038584
55952A10174572J7754119K0847087K4335194K8211633L2275100L5936680L8106827
55945C07641212L7268344L1920343K1442884O915855q912629k2782191l2426961
$$ y = [3500930, 3608314, 3719554, 3834402, 3955236, 4083302, 4217327, 4357347, 4506117, 4665151, 4833187, 5010146, 5198471, 5398842, 5608906, 5828269, 6060545, 6308615, 6572360, 6853038, 7155024, 7481055, 7830685, 8205757, 8612218, 9054377, 9532938, 10051257, 10617656, 11239042, 11918773, 12663937, 13488172, 14404276, 15421645, 16555314, 17830780, 19276743, 20921956, 22804658, 24978057, 27503300, 30447182, 33892260, 37939868, 42699367, 48288073, 54851292, 62575221, 71681090, 82428662, 95135988, 110174572, 127928691, 148775778, 173110972, 201322605, 233597705, 269534385, 307641212, 344909556, 376829899, 398272783, 405188638, 396276009, 373493818, 341066857]
55938C41066857l7300832l8185375l6333430l2899238k8784667k4628023k0795604
55931A22139688j7432395j4568094j2183463j0219420q595215p246675o133740
55924D5760686n216733m451805l810033l278255k839362k469655k155126j892564
55916A9647153j673879j484536j317576j174748j053424r45303q47951p65184
55908A0384552o95673o32407n73509n22936m80402m40647m02657l70122l42758
55899E923441l16269k90571k69346k51653k32688k12693j96651j85096j73437
55890C795037j60495j49671j41356j32045j21583j13711j08591j01960r2666q4236
55880B588723p7977p1036o2486n5065m9673m3977l7766l4215l4661l7222m1323
$$ y = [341066857, 303766025, 265580650, 229247220, 196347982, 167563315, 142935292, 122139688, 104707293, 90139199, 77955736, 67736316, 59141101, 51894426, 45760686, 40543953, 36092148, 32282115, 29003860, 26164498, 23694843, 21539717, 19647153, 17973274, 16488738, 15171162, 13996414, 12942990, 11997687, 11149736, 10384552, 9688879, 9056472, 8482963, 7960027, 7479625, 7038978, 6636321, 6266199, 5923441, 5607172, 5316601, 5047255, 4795602, 4562914, 4350221, 4153570, 3968474, 3795037, 3634542, 3484871, 3343515, 3211470, 3089887, 2976176, 2867585, 2765625, 2672959, 2588723, 2510746, 2439710, 2377224, 2322159, 2272486, 2228509, 2190743, 2156528, 2121867, 2084645, 2043322]
55869B043322m8363n7029o3132o5226o5607o5048o1528n5039m8778m4319m0198
55858A429055l6255l4733l5860l6732l5918l5097l5047l4137l1940l0457l0398
55847A052481k9948k8344k7139k6857k5927k3886k2251k1326j9593j7051j5639
55836G94520j5497j4433j1974j0411j0688j0839r661q554q422p999o683n923o459
55823F66977p044p128p906r537j0303r730r591j0563j0822r408q005p829p482
55810E51629n623l301j892r45K74J210J510K176L750N192N736O083O576O107L973
55795E82455J102j619m440p266r012r422r725j0474j0595r404p797o450m737k377
55781D90239l43P67J516J991J408J92M19L145P191J1530J6815K3255K9023L2023
$$ y = [2043322, 1994959, 1937930, 1874798, 1809572, 1743965, 1678917, 1617389, 1562350, 1513572, 1469253, 1429055, 1392800, 1358067, 1322207, 1285475, 1249557, 1214460, 1179413, 1145276, 1113336, 1082879, 1052481, 1022533, 994189, 967050, 940193, 914266, 890380, 868129, 846803, 827210, 810159, 794520, 779023, 764590, 752616, 742205, 731517, 720678, 711017, 702463, 694041, 686042, 679359, 673436, 666977, 659933, 652805, 644899, 635362, 625059, 615329, 605738, 595175, 584353, 574945, 566940, 559111, 551629, 546006, 542705, 540813, 539868, 540142, 541352, 542862, 545038, 548788, 553980, 559716, 565799, 572375, 578482, 582455, 583557, 581938, 577498, 570232, 561220, 551798, 542073, 531599, 521004, 511600, 503803, 497353, 492616, 490239, 489896, 490663, 492179, 494170, 495578, 495770, 496189, 499334, 506525, 518055, 534870, 558125, 587148, 619171]
55767F19171L1528K6911J6896J913j4308k7271l4992l7926l7171l4052l0211k6608
55755D53880k3165j9955j7580j5812j3429j0265p833o944o374m976l550l277l709
55742C17011l631k775j411N40K835M354M377L485K310N44j846l725m287m344n003
55727C08434o031o668o999p344p199o039m427l250k521j827j209p09K23J931L847
55712B60212N404O931Q887J0864J2046J1996J0403O930K093k537n766p819r427
55699C10217j0684j1407j1784j1936j1468j0153q456o894n436l905k351p57R10
55686B15896K228K711K750L149L813M047M141N080O531O816N377L592K509J417
55672B70057l85k054k545k234k025j956j661j288j012n61nMn36o13J86Q92P40
$$ y = [619171, 650699, 677610, 694506, 696419, 682111, 654840, 619848, 581922, 544751, 510699, 480488, 453880, 430715, 410760, 393180, 377368, 363939, 353674, 345841, 338897, 332523, 327547, 323997, 320720, 317011, 313380, 310605, 309194, 309734, 312569, 316923, 321300, 324785, 327095, 327639, 325793, 322068, 317781, 313437, 308434, 302403, 295735, 288736, 281392, 274193, 268154, 263727, 260477, 257956, 256129, 254920, 254211, 254434, 256365, 260212, 265616, 272547, 281434, 292298, 304344, 316340, 326743, 333673, 335766, 333229, 327463, 319644, 310217, 299533, 288126, 276342, 264406, 252938, 242785, 234329, 227435, 221999, 218094, 215743, 214986, 215896, 218124, 220835, 223585, 226734, 230547, 234594, 238735, 243815, 250346, 257162, 262539, 266131, 268640, 270057, 269672, 267618, 265073, 262839, 260814, 258858, 257197, 255909, 254897, 254336, 254331, 254335, 253799, 253186, 253372, 254264, 255004]
55655B55004L58M79P49P05P29J056R85Q1r54j604k467l919n058n095m636m397
55639B32016l944k970k528l513m940n285m690m354m512m519m244l945l310k014
55625A77248p77n29r80j152q80o50m48J3M34L67L6k19o96j529j906j254n54j093
55607A65431k474l227k929k395k113j829j448j207j013o29k60j00L33J318J917
55592A49375J032q29j954j501j03J301K239K505K216K028K460L105L233K887K657
55577A70651K785L271M362O096P772Q816R737J1277J3111J4332J4785J4798J4078
55564B95871J2027Q864N316J542k563o379r058j0812j2450j3852j4111j3089j1656
55551B29650j0377r087p793o864o143n003l446k235j747j512j110o91m15q0M41
$$ y = [255004, 255362, 255841, 256590, 257295, 258024, 259080, 260065, 260146, 259192, 257588, 255121, 251202, 246144, 241049, 236413, 232016, 228072, 225102, 222574, 219061, 214121, 208836, 204146, 199792, 195280, 190761, 186517, 182572, 179262, 177248, 176471, 175942, 174962, 173810, 172930, 172280, 171832, 171845, 172279, 172646, 172682, 172463, 171767, 170238, 168332, 167078, 166524, 165431, 162957, 159730, 156801, 154406, 152293, 150464, 149016, 147809, 146796, 146167, 145907, 145807, 146140, 147458, 149375, 150407, 149578, 147624, 146123, 146020, 147321, 149560, 152065, 154281, 156309, 158769, 161874, 165107, 167994, 170651, 173436, 176707, 181069, 187165, 194937, 203753, 213490, 224767, 237878, 252210, 266995, 281793, 295871, 307898, 316762, 322078, 323620, 321057, 314678, 305620, 294808, 282358, 268506, 254395, 241306, 229650, 219273, 210186, 202393, 195529, 189386, 184383, 180937, 178702, 176955, 175443, 174333, 173642, 173227, 173147, 173588]
55536A73588R03R62L79q40k151k572j756o54m55j138j750j793j545j300j175j464
55520A57239k341l294l631l392l126k971k647k166j789j507j285j472k224k823
55506A22571k469j461p98q61j224j531j713j638j338j226j340q54P01K321K754
55491A11894K306K203K545K348J435P69P95Q36M46J07K79P58J282J870K333K296
55475A34502J913J773J995K118J884J328K31j557l360m164l920l414k997k439
55461A23893j910j906k166j858r97n05o75p71l81m8k21n84p97r59j075r92r78
55444A07070j454j977j590l83M97N45M59O73O95L21K13N81N43l67j166q18K12
55427A04054P33M90J49J93N61R74J074O46J17K67J115J766J721J546J818K162
$$ y = [173588, 174491, 175453, 175832, 174992, 172841, 170269, 168513, 167859, 167404, 166266, 164516, 162723, 161178, 159878, 158703, 157239, 154898, 151604, 147973, 144581, 141455, 138484, 135837, 133671, 131882, 130375, 129090, 127618, 125394, 122571, 120102, 118641, 117843, 116982, 115758, 114227, 112514, 110876, 109538, 108312, 106972, 106118, 106819, 109140, 111894, 114200, 116403, 118948, 121296, 122731, 123500, 124295, 125131, 125577, 125684, 125963, 126721, 128003, 129873, 132206, 134502, 136415, 138188, 140183, 142301, 144185, 145513, 145744, 144187, 140827, 136663, 132743, 129329, 126332, 123893, 121983, 120077, 117911, 116053, 115056, 114551, 113876, 113105, 112724, 112676, 112455, 111871, 111074, 110115, 109040, 108048, 107070, 105616, 103639, 102049, 101666, 102163, 102708, 103167, 103840, 104535, 104856, 105069, 105650, 106193, 105826, 104660, 103842, 104054, 104787, 105277, 105426, 105619, 106180, 107154, 108228, 108874, 108991, 109258, 110373, 112139, 113860, 115406, 117224, 119386]
55411A19386J984J358O61n3o59o79n9M33J68m98r78j343j853k166j852j205p67
55394A11878n09j51Q0j86o52o38o2N03O26M04J76L00R85J974K524K066Q16m86
55376A19648j222j163n56l7j19n93r39j305k283l617m120l368k541k776l522l401
55360H8086k139o32M57J142J426J151N84L20M56N22L01J77N01J096J576J821J929
55343I8774J899J502N53o45j292q68K6J96o53j414r99L07J321J395P97M1n23o36
55325I9781k99kk62q81j096n35L31P82O31K90K15M36O75P96R48J077P01l98j460
55306A01730j406k61P45P41K48L04J104J900J910Q97o98j860j687l67Q31R53L19
55289A05403k07l55l30p2N67J220J293Q28M20K96J00l49o21k89M26Q36M92m21
$$ y = [119386, 121370, 122728, 123389, 123336, 122677, 121998, 121939, 122372, 122540, 122042, 121064, 119721, 117868, 115702, 113850, 112645, 111878, 111369, 111218, 111298, 111112, 110460, 109822, 109760, 110263, 110889, 111293, 111469, 111769, 112754, 114728, 117252, 119318, 120134, 119648, 118426, 117263, 116707, 116670, 116551, 115958, 115019, 113714, 111431, 107814, 103694, 100326, 97785, 95009, 91487, 88086, 85947, 85315, 85772, 86914, 88340, 89491, 90075, 90395, 90851, 91373, 91674, 91851, 92352, 93448, 95024, 96845, 98774, 100673, 102175, 102728, 102083, 100791, 99923, 99949, 100145, 99492, 98078, 97079, 97386, 98707, 100102, 100899, 100940, 100417, 99781, 99482, 99480, 99218, 98337, 97241, 96706, 97037, 97819, 98450, 98740, 98955, 99391, 100066, 100862, 101810, 102887, 103588, 103190, 101730, 100324, 100063, 100808, 101549, 101797, 102101, 103205, 105105, 107015, 107912, 107214, 105354, 103667, 103300, 104131, 105084, 105403, 105196, 104841, 104511, 104439, 105006, 106226, 107519, 108347, 108767, 109063, 109163, 108814, 108193, 107904, 108330, 109166, 109658, 109237]
55271A09237j321j774j825j707j386o59K60P44N30J20J20N08Q94J121J248J164
55255A07274P17N5n44j057j539j719j162R0J370J925J475L64o99j140j011q66
55239A03533r69r39l93L24N26K11J50Q56J826K104J343J31p41r91q53o09l71k51
55221A04887l58n01k43M55R67P33qn09m48p6K73M10J64l89o70j91O42R26M68o
55201A06526J00O48J251J677J665J078L84K47M80J87q07j564j410p95l05K29R51
55184A10542J233O02k72m62j53j88o55q57n10o4N3k19q20j468j472m20J047J879
55166A07796J930J881J968J597M85o31q25o2Q51J107N44l47q66p98n98p11r28
55149A12393p71l55k46m64l10N45J344J064k16j338j391o66j43k57n56m95j59
$$ y = [109237, 107916, 106142, 104317, 102610, 101224, 100565, 100825, 101569, 102099, 102219, 102339, 102847, 103741, 104862, 106110, 107274, 107991, 108046, 107502, 106445, 104906, 103187, 102025, 102115, 103485, 105410, 106885, 107249, 106550, 105410, 104399, 103533, 102564, 101625, 101232, 101556, 102082, 102293, 102443, 103299, 105125, 107229, 108572, 108703, 107962, 106971, 106118, 105509, 105138, 104887, 104529, 104028, 103785, 104240, 105207, 105940, 105932, 105423, 104975, 104899, 105172, 105582, 105746, 105357, 104687, 104496, 105138, 106064, 106532, 106526, 106626, 107274, 108525, 110202, 111867, 112945, 113329, 113576, 114056, 114243, 113436, 111872, 110462, 109667, 109362, 109591, 110542, 111775, 112377, 112105, 111643, 111490, 111302, 110647, 109790, 109280, 109216, 109269, 109050, 108230, 106762, 105290, 104870, 105917, 107796, 109726, 111607, 113575, 115172, 115657, 115026, 114201, 114139, 114990, 116097, 116641, 116294, 115428, 114630, 114032, 113321, 112393, 111622, 111267, 111021, 110557, 110247, 110792, 112136, 113200, 112984, 111646, 110255, 109589, 109446, 109189, 108633, 108138, 107979]
55132A07979L2j0n8p0j92l68l99l27l22j81M48J307J602J008P7n41p17n26oN24
55112A09260N96L84O12J316J508O35l93l72O19J628K213K545K579K097J357Q24
55096A27408L97k78r69j105p71n61n27j27P19J317J187P30N83Q16R98P72J88l29
55078A30448l23J62N59M58J27L8K11L79M89N49K88m34j109j122n53N5M63O73M19
55059A31777m11j123q72N3M81m9q30j206j352j518j448r71n13m52m67q8N52R42
55041A22505Q87N26n7p31j117q55j44L94L77kl18l47p4M63J132J519J146P0r37
55022A24437j125n96l3K09K71J57k88p27m37N64J299J153P04O63P41L42k60l57
55004A26717N4M84Q58J316J457Q10j54n19k92k55n89o51k16J48P8j18j67j32P2
$$ y = [107979, 108011, 108001, 107943, 107873, 107681, 107313, 106914, 106587, 106265, 106084, 106532, 107839, 109441, 110449, 110526, 109985, 109268, 108742, 108736, 109260, 109856, 110240, 110852, 112168, 113676, 114311, 113918, 113546, 114165, 115793, 118006, 120551, 123130, 125227, 126584, 127408, 127805, 127527, 126558, 125453, 124682, 124121, 123594, 123467, 124186, 125503, 126690, 127420, 128003, 128819, 129817, 130589, 130777, 130448, 130125, 130287, 130846, 131304, 131431, 131469, 131680, 132059, 132548, 133097, 133385, 132951, 131842, 130720, 130167, 130222, 130685, 131358, 131777, 131366, 130243, 129371, 129424, 129905, 129856, 129026, 127820, 126468, 124950, 123502, 122531, 122018, 121566, 121099, 121011, 121563, 122505, 123392, 123918, 123861, 123130, 122013, 121158, 121014, 121408, 121785, 121783, 121465, 121118, 121044, 121507, 122639, 124158, 125304, 125374, 124437, 123312, 122716, 122683, 122892, 123163, 123320, 123032, 122305, 121868, 122432, 123731, 124884, 125588, 126251, 126992, 127334, 127074, 126717, 126771, 127255, 128113, 129429, 130886, 131696, 131542, 131023, 130731, 130476, 129887, 129236, 129020, 129168, 129246, 129128, 128961, 128829, 128901]
54985A28901N95R92N79l12n36J60O96L77q8O6L38p1p29n51N30J475J581J205R58
54966A36166R05P34K92k23n13n10n06q08j211j104j66J215K330K667K049O40r40
54949A41017j844j683r41m45m92o75m89M0M28L86J90K71N38M96K7m20m93l14N3
54930A35650Q05J770K225J976J894K723L952M714N175N963O775O854O558O938
54916A93972P764P453N309K522L86j271l205n284o710p114o752o035n364m975
54902A70696m671m063l251k723k527k195j685j485j645j447n19N36R89Q00L06
54887A47116j48j1J188K884L723L272K703L211M509N538N898N942O007O248O664
54872B04744O741N629L234N80j428k963m496n785o357o349o177n843n244m656
$$ y = [128901, 129496, 130488, 131067, 130755, 130219, 130379, 131075, 131452, 131364, 131430, 131768, 131697, 130968, 130417, 130947, 132422, 134003, 135208, 136166, 137071, 137805, 138097, 137874, 137361, 136851, 136345, 135537, 134326, 133222, 133056, 134271, 136601, 139268, 141317, 141957, 141017, 139173, 137490, 136549, 136104, 135612, 134937, 134448, 134488, 134916, 135302, 135492, 135763, 136301, 136797, 136824, 136404, 135911, 135597, 135650, 136455, 138225, 140450, 142426, 144320, 147043, 150995, 155709, 160884, 166847, 173622, 180476, 187034, 193972, 201736, 209189, 214498, 217020, 217406, 216135, 212930, 207646, 200936, 193822, 187070, 181035, 175671, 170696, 166025, 161962, 158711, 155988, 153461, 151266, 149581, 148096, 146451, 145004, 144485, 145021, 146010, 146810, 147116, 146968, 146957, 148145, 151029, 154752, 158024, 160727, 163938, 168447, 173985, 179883, 185825, 191832, 198080, 204744, 211485, 217114, 220348, 220928, 219500, 216537, 212041, 206256, 199899, 193550, 187373, 181530, 176286, 171630]
54858A71630m255l693k758j883j397r61l95l30j146j962j781j091j179k192l002
54843A43605k897k288j770j419j226j341j607j482o71M20J015N87o61j765j785
54828A26715q30Q9M68Q23J458J623P07n05q50m89m18o64k75R49J912J738Q22N3
54810A33326k68l82m81n25l10L53J302J919J713R32K47j4K4K16N07Q14J143J532
54792A42048J695J193K44k48m4p5r20j636j125J7M30J68M80J600K316J936J277
54775A49356J274J817K431L097L850M361M530M888N948P546R090J0044J0073R181
54761B27486P826O466M949K894N26j541l186m722o097o993p585q236q563p868
54747A95356o550n832n881n471l918k177j393j440j576j583j476r70j05L24j81
$$ y = [171630, 167375, 163682, 160924, 159041, 157644, 156683, 156288, 155958, 154812, 152850, 151069, 149978, 148799, 146607, 143605, 140708, 138420, 136650, 135231, 134005, 132664, 131057, 129575, 128904, 129324, 130339, 130926, 130265, 128500, 126715, 125885, 125974, 126442, 127265, 128723, 130346, 131053, 130548, 129698, 129209, 128791, 128127, 127852, 128801, 130713, 132451, 133273, 133326, 133058, 132676, 132195, 131670, 131360, 131713, 133015, 134934, 136647, 137579, 137826, 137812, 137836, 138052, 138559, 139373, 140516, 142048, 143743, 144936, 145180, 144932, 144888, 144813, 143893, 142257, 141132, 141149, 141579, 141747, 142227, 143827, 146143, 148079, 149356, 150630, 152447, 154878, 157975, 161825, 166186, 170716, 175604, 181552, 189098, 198188, 208232, 218305, 227486, 235312, 241778, 246727, 249621, 250147, 248606, 245420, 240698, 234601, 227608, 220023, 211787, 203224, 195356, 188806, 182974, 177093, 171622, 167704, 165527, 164134, 162694, 161118, 159535, 158059, 157089, 156984, 157308, 157127]
54732A57127q26m93Q05K136K964L413L656L768M068M820N715O126N865N226M415
54717B08785L360K001M55j043k218k941l439m058m726n063n071n185n479n444
54703A69934m780l850l031k300j757j787k221k087r39J96J18q11j181m73M04N74
54687A46009J93j18k01l61q55j593k128j997j256n58m74q32j049r18o90n28l48
54670A32296j18k5j78m21m25J6P10J064O43k32p86p57n52l61J96J125J545Q25
54652A34565k71m64L04Q91O03k6k15Q5M41N68M47J63n9K8L47N18L35Ok48m85q16
54631A36717j041p67J24J192J714J345N29J19M83J149J401R87J82n70q79n78L2
54614A42139L30K8m88o95n39l17j60qJ35K18K61K42R5l4J22L30j45j430k465k214
$$ y = [157127, 156301, 155808, 156613, 158749, 161713, 165126, 168782, 172550, 176618, 181438, 187153, 193279, 199144, 204370, 208785, 212145, 214146, 214601, 213558, 211340, 208399, 204960, 200902, 196176, 191113, 186042, 180857, 175378, 169934, 165154, 161304, 158273, 155973, 154216, 152429, 150208, 148121, 147182, 147378, 147496, 146685, 145504, 145031, 145435, 146009, 146202, 146084, 145883, 145522, 144667, 143074, 140946, 138949, 137693, 137135, 136661, 135829, 134780, 133862, 133172, 132644, 132296, 132178, 132153, 131975, 131554, 131129, 131145, 131855, 132919, 133562, 133330, 132544, 131787, 131235, 130874, 131070, 132195, 133740, 134565, 134294, 133830, 134134, 135025, 135628, 135602, 135387, 135472, 135913, 136481, 136928, 137091, 137032, 137060, 137407, 137925, 138260, 138266, 138018, 137533, 136717, 135676, 134909, 135033, 136225, 137939, 139284, 139813, 139932, 140415, 141564, 142965, 143952, 144134, 143564, 142685, 142107, 142139, 142469, 142497, 142009, 141314, 140775, 140458, 140298, 140290, 140425, 140643, 140904, 141146, 141241, 141207, 141329, 141659, 141514, 140084, 137619, 135405]
54594A35405j080k88k12j85J83M93N49Q06J440J748J118Ko52o43o25j115j843
54577A35101k058j301J54J483K036J874J455R43J77o76j002m55N69J369J522R75
54561A42166m7r94j260p53P7Q95J671K125J676M30m60j36P36R07L74K55Q77J205
54543A49744M85n24o11K78J223J659J720J523R52K06j24K53R75J467J400P03m05
54526A60924j319j484j095r50j374j832j836j630j511j118j16Q35P53k52j087
54511A46908j174r62q77p15l52j62k65j56L43N41J2m84p3P45P80%m44rN05K95
54491A44456l61p43o58k60M01J141J417R50K46RK93O65Q94R84Q65N53M72R74J605
54472A53903J476M89l88k96N42J336J758K027K212K018J262K26o38j104j192j019
$$ y = [135405, 134325, 134037, 133825, 133640, 133823, 134316, 134865, 135671, 137111, 138859, 139977, 139979, 139327, 138684, 138059, 136944, 135101, 133043, 131742, 131896, 133379, 135415, 137289, 138744, 139687, 139864, 139188, 138186, 137731, 138300, 139669, 141191, 142166, 142119, 141125, 139865, 139112, 139189, 140084, 141755, 143880, 145556, 145986, 145526, 145390, 146126, 147033, 147407, 147662, 148539, 149744, 150229, 149705, 149094, 149372, 150595, 152254, 153974, 155497, 156449, 156655, 156531, 156784, 157759, 159226, 160626, 161329, 160924, 159605, 158121, 157026, 156076, 154702, 152870, 151034, 149404, 147893, 146775, 146659, 147494, 148247, 147995, 146908, 145734, 144772, 143895, 143180, 142828, 142666, 142401, 142245, 142588, 143129, 143141, 142657, 142584, 143329, 144109, 144109, 143665, 143656, 144161, 144456, 144095, 143352, 142694, 142434, 142835, 143976, 145393, 146343, 146589, 146598, 146891, 147556, 148450, 149434, 150299, 150852, 151324, 152298, 153903, 155379, 155868, 155480, 155184, 155726, 157062, 158820, 160847, 163059, 165077, 166339, 166565, 165927, 164823, 163631, 162612]
54456A62612p60o13o27o43n33m27n49q69j077r67o84n59p17r35q81m79j9J68J24
54437A51565J71M05N01K18j67k40j16k04m14j98M53P33K03l60N5J215J908J648
54419A57376J232J454J974J933J128J14o12r01p26j93K55J74k55l51J55P12O80
54402A64149K07N7O37J546K087J983J481R23M56K07M03J045J582J277J16j011
54386A77145j244o84n5L13N81O83K22o72j140p10r4j79o48m12P58J920K276K008
54368A80068J594J079M87K27N60J144J600K095K822L375L305K952L000L395L445
54353B11148K907K182J431L05j254k585l084k911k665k720l139l839m467m527
54339A86782l855k840j958j351r96r26j024r10l63L13O30M69J33l4P2K77K39k28
$$ y = [162612, 161852, 161239, 160612, 159969, 159436, 159009, 158460, 157591, 156514, 155547, 154863, 154304, 153587, 152652, 151771, 151292, 151273, 151441, 151565, 151736, 152141, 152642, 152860, 152693, 152453, 152337, 152133, 151719, 151521, 151974, 152707, 152910, 152550, 152605, 153820, 155728, 157376, 158608, 160062, 162036, 163969, 165097, 165211, 164599, 163698, 162972, 162779, 163034, 163208, 162953, 162602, 162757, 163469, 164149, 164356, 164413, 165050, 166596, 168683, 170666, 172147, 173070, 173526, 173733, 174136, 175181, 176763, 178040, 178156, 177145, 175901, 175217, 175162, 175475, 176056, 176739, 176961, 176289, 175149, 174439, 174345, 174166, 173518, 173106, 173864, 175784, 178060, 180068, 181662, 182741, 183228, 183455, 184015, 185159, 186759, 188854, 191676, 195051, 198356, 201308, 204308, 207703, 211148, 214055, 216237, 217668, 217973, 216719, 214134, 211050, 208139, 205474, 202754, 199615, 195776, 191309, 186782, 182927, 180087, 178129, 176778, 175782, 174856, 173832, 172922, 172559, 172872, 173502, 173971, 174104, 174070, 174142, 174419, 174658, 174430]
54321A74430q24r81n26O5J90k68q94j109n80M99J432J556Q46k00j144j816k060
54304A68616j783j233p36j91O25J338J296O85M18O61M78n65j454j131j03M01J88
54287A67510Q0M72J008J432J785J830J237L52q9K9J80K18M58P68N25k46n95M9
54269A77003J044J411R95L01k58n15l38K44R66J579J969J952J399P09N82J051
54253A90094J290O82m10j255j571j370n82N19J032K99j106j955j775j139o63m05
54237A81685k47k34l74n58q27j325j874j988j495p75k01L12R27J438J603J644
54221A77711J895K105J600L09q41r03k3P78P84J87l94o09m85k04j9j14m14o87
54203A80676r57j525k289k497j612j82O57N26P0j17j86m28n97k98K55M69K34k
$$ y = [174430, 173606, 172625, 172099, 172164, 172354, 172086, 171192, 170083, 169503, 170002, 171434, 172990, 173836, 173636, 172492, 170676, 168616, 166833, 165600, 164864, 164673, 165298, 166636, 167932, 168617, 169035, 169696, 170174, 169609, 168155, 167024, 166921, 167322, 167510, 167590, 168062, 169070, 170502, 172287, 174117, 175354, 175706, 175617, 175646, 175826, 176044, 176502, 177270, 177795, 177549, 176954, 177003, 178047, 179458, 180453, 180754, 180496, 179981, 179643, 179887, 180853, 182432, 184401, 186353, 187752, 188461, 189043, 190094, 191384, 192066, 191656, 190401, 188830, 187460, 186878, 187397, 188429, 188728, 187622, 185667, 183892, 182753, 182090, 181685, 181438, 181204, 180830, 180272, 179445, 178120, 176246, 174258, 172763, 171988, 171787, 172099, 173026, 174464, 176067, 177711, 179606, 181711, 183311, 183620, 182779, 181876, 181853, 182631, 183415, 183602, 183208, 182599, 182114, 181910, 181891, 181777, 181363, 180676, 179719, 178194, 175905, 173408, 171796, 171614, 172271, 172797, 172867, 172750, 172564, 172136, 171539, 171241, 171496, 171965, 172199, 172197]
54185A72197jp3m08n15J60J260J734J122J97l4M72R81J062Q60L99n34j675k134
54167A75070j490m55M3l2j72k74m92n24O5Q93J049M23p3J22M14mj013j861k113
54148A69576j882j406r24p08p91p85k97N34J182J331J099P66N05L52L34M91P18
54131A70095O75J09n93n44N88J904K251J607Q74N04J73j27K05J243J976J633P83
54114A83356N00Q92J276J301J110P17Q6l47r1N12N91K9l09J54Q83J008M58r9j59
54095A91868J58M33M92N52Q86J381J669J700J873K404K939L167L459M290N309
54080B22580N682N308M848M512L616J695o44k465l519m005l863k994j909j395
54066B27447j558j818j822j808j930j799j044K1O32L91l48q45o17J52P98Q81O35
$$ y = [172197, 172196, 172123, 171715, 171200, 171360, 172620, 174354, 175476, 175673, 175639, 176111, 177092, 178154, 179014, 179413, 178879, 177204, 175070, 173580, 173125, 173168, 173136, 172964, 172690, 172198, 171674, 171739, 172632, 173681, 174104, 174031, 174153, 174567, 174563, 173550, 171689, 169576, 167694, 166288, 165364, 164656, 163865, 163080, 162783, 163317, 164499, 165830, 166929, 167695, 168200, 168552, 168886, 169377, 170095, 170770, 170879, 170286, 169742, 170330, 172234, 174485, 176092, 176966, 177470, 177643, 177516, 177721, 178964, 180940, 182573, 183356, 183856, 184748, 186024, 187325, 188435, 189152, 189238, 188891, 188800, 189312, 189903, 189932, 189623, 189777, 190660, 191668, 192126, 192027, 191868, 192026, 192459, 192951, 193503, 194389, 195770, 197439, 199139, 201012, 203416, 206355, 209522, 212981, 217271, 222580, 228262, 233570, 238418, 242930, 246546, 248241, 247597, 245132, 241613, 237608, 233745, 230751, 228842, 227447, 225889, 224071, 222249, 220441, 218511, 216712, 215668, 215689, 216321, 216712, 216364, 215519, 214902, 215054, 215852, 216733, 217368]
54049B17368O16R25J210J321J497J709J485Q76R49K506M641N568M874L954L969
54034B53468M447M469M296M779N825O613O999P512P941P197N000K693J677J749
54020C24665J660Q33k03q56j152j403j696j866j767j512j507k067k984l738m223
54005C02184m890n880o458n840m263k832k374k912m003n094n594n193m238l371
53991B39242k728j922q49n8m1o23j308j887k316k347j765r36n70q10r56l51P00
53974B20475J250Q44m4p16r74r24m84M55J486J874J371N03j19l97m77k26N64J630
53956B26091K306K197J636J381J892K873L520L304K537K073K414L283M154M904
53942B64565N731O591P087P022O816P177Q266R380R659R096Q440Q098P556O234
$$ y = [217368, 217984, 218909, 220119, 221440, 222937, 224646, 226131, 227007, 227956, 230462, 235103, 240671, 245545, 249499, 253468, 257915, 262384, 266680, 271459, 277284, 283897, 290896, 298408, 306349, 313546, 318546, 321239, 322916, 324665, 326325, 327158, 326955, 326099, 324947, 323544, 321848, 319982, 318215, 316703, 315196, 313129, 310145, 306407, 302184, 297294, 291414, 284956, 279116, 274853, 272021, 269647, 266735, 262732, 257638, 252044, 246851, 242613, 239242, 236514, 234592, 233743, 233685, 233644, 233021, 231713, 229826, 227510, 225163, 223398, 222462, 221892, 221082, 220126, 219775, 220475, 221725, 222569, 222525, 221809, 220835, 219911, 219427, 219882, 221368, 223242, 224613, 225116, 224997, 224600, 224123, 223897, 224461, 226091, 228397, 230594, 232230, 233611, 235503, 238376, 241896, 245200, 247737, 249810, 252224, 255507, 259661, 264565, 270296, 276887, 283974, 290996, 297812, 304989, 313255, 322635, 332294, 341390, 349830, 357928, 365484, 371718]
53928C71718M357K432L08k336m843n945n395m237l237k081n03Q77J595K228L362
53913C58300M439M683M601N325O800P785P563O600N478M241K881J602L59j040
53899D19617k254k620k260k146k810l723m265m516m703m567l933l376l683m954
53885C69807o560p748q004p347o504o360o850o870n728m146l347l582m176m575
53871B88010m606m072k886j684j395k117k941l158k967k830k690k340k078k325
53857B49921k801k758k119j744k238l020l061k267j453j108r66q20r71j407j349
53842B21839l37P66P64j79p76m55K9o3m66o00m83m10l42j68p3j31Q0Q76J760J896
53822B23527J117J01l94j29O23J330J516J132N94L31M53Q89J542K128K302K174
$$ y = [371718, 376075, 378507, 378815, 376479, 371636, 365691, 360296, 356059, 352822, 350741, 350238, 351115, 352710, 354938, 358300, 362739, 367422, 372023, 377348, 384148, 391933, 399496, 406096, 411574, 415815, 418696, 420298, 420657, 419617, 417363, 414743, 412483, 410337, 407527, 403804, 399539, 395023, 390320, 385753, 381820, 378444, 374761, 369807, 363247, 355499, 347495, 340148, 333644, 327284, 320434, 313564, 307836, 303690, 300343, 296761, 292585, 288010, 283404, 279332, 276446, 274762, 273367, 271250, 268309, 265151, 262184, 259354, 256664, 254324, 252246, 249921, 247120, 244362, 242243, 240499, 238261, 235241, 232180, 229913, 228460, 227352, 226386, 225566, 224595, 223188, 221839, 221502, 222268, 223032, 222853, 222077, 221622, 221651, 221588, 221122, 220522, 220039, 219629, 219287, 219119, 219046, 218915, 218995, 219871, 221631, 223527, 224644, 224745, 224351, 224222, 224845, 226175, 227691, 228823, 229417, 229748, 230201, 231090, 232632, 234760, 237062, 239236]
53806B39236K284K820L287L348L432L968M517M428L984M040M594M723M016L273
53792B91950L327L939M320M245M100M081L890L251K316J469R15N49J40m24j101
53777C26967j880k774l560l788l348k826k921l522l930l952m183m938n528n119
53763B74698l953l051k874k929k744k560k729k987k814k240j797j691j574j203
53749B39552q27p74r44j026r34p49m78j47Nj68m18m43l97o23r20o78J85R59J081
53730B32256Q31P80Q72N91j56p78o58J82J132J522J171M88P9J64N08Q24J107J419
53712B42334J717J984K297K652K936L158L452L690L512K957K598K689K658J970
53698B80604J159J310K625M076M574L980K964K247K052J947J243j71j468j770
$$ y = [239236, 241520, 244340, 247627, 250975, 254407, 258375, 262892, 267320, 271304, 275344, 279938, 284661, 288677, 291950, 295277, 299216, 303536, 307781, 311881, 315962, 319852, 323103, 325419, 326888, 327803, 328352, 328492, 328068, 326967, 325087, 322313, 318753, 314965, 311617, 308791, 305870, 302348, 298418, 294466, 290283, 285345, 279817, 274698, 270745, 267694, 264820, 261891, 259147, 256587, 253858, 250871, 248057, 245817, 244020, 242329, 240755, 239552, 238725, 237951, 237007, 235981, 235047, 234298, 233820, 233673, 233678, 233510, 233092, 232649, 232252, 231629, 230709, 230031, 230216, 231175, 232256, 233087, 233867, 234739, 235330, 235174, 234396, 233738, 233920, 235052, 236574, 237745, 238233, 238312, 238476, 238984, 239808, 240915, 242334, 244051, 246035, 248332, 250984, 253920, 257078, 260530, 264220, 267732, 270689, 273287, 275976, 278634, 280604, 281763, 283073, 285698, 289774, 294348, 298328, 301292, 303539, 305591, 307538, 308781, 308610, 307142, 305372]
53684C05372j260q93j050j177q62n49p49j121r39j78M65N49L58L22L46K3p17j412
53666B96528j538j053l76O1J12j59n81q62p01r1O32J180J545J663J237K77n18
53649B97356m28L82J095J280J163R59O44M23P08J373J668J268Q35J060J676J932
53633C13394J630J201R81J013J356K015K609K649K173J696J573J719J931K122
53619C38062K259K441K971M016N155N669N397M892M707M814M880M704M265L660
53605C97892L243L452M214M776M510L684L061K802K281J060l31r39n40Q0pq85
53589D28353j794j986j408o16j90l17p57j094j076q76r81j654k568l103k990k524
53573D04419k052j553q37l6L94J47n30j075j159r26p24o76o31m27p1L85Q99J291
$$ y = [305372, 304112, 303219, 302169, 300992, 300130, 299581, 298832, 297711, 296772, 296594, 297059, 297608, 297966, 298288, 298634, 298657, 297940, 296528, 294990, 293937, 293561, 293622, 293734, 293575, 292994, 292132, 291431, 291340, 291972, 293152, 294697, 296360, 297597, 297874, 297356, 296928, 297310, 298405, 299685, 300848, 301807, 302451, 302874, 303582, 304955, 306623, 307891, 308726, 309786, 311462, 313394, 315024, 316225, 317206, 318219, 319575, 321590, 324199, 326848, 329021, 330717, 332290, 334009, 335940, 338062, 340321, 342762, 345733, 349749, 354904, 360573, 365970, 370862, 375569, 380383, 385263, 389967, 394232, 397892, 401135, 404587, 408801, 413577, 418087, 421771, 424832, 427634, 429915, 430975, 430644, 429705, 429165, 429245, 429238, 428353, 426559, 424573, 423165, 422549, 422359, 422042, 421285, 420191, 419115, 418239, 417258, 415604, 413036, 409933, 406943, 404419, 402367, 400814, 399977, 399941, 400335, 400482, 399952, 398877, 397718, 396792, 396068, 395392, 394761, 394334, 394263, 394648, 395547, 396838]
53555C96838J269P91K80K05N43R14J125J245J226R53P27J123K074K660K300J691
53539D15964J911K937L813M230M917O272P513P736P216O907P183P783Q710J0202
53525E03294J1830J2576J2169J1641J2054J3189J4041J4231J4315J4796J5566
53514F49702J6377J7378J8796K0446K1874K2848K3426K3674K3648K3644K4015
53503H85828K4589K4625K3653K2160K1024K0436J9884J9191J8840J9068J9207
53492A118505J8594J7628J7275J7740J8327J8549J8573J8564J8303J7754J7242
53481A317054J6827J6137J5156J4520J4461J4171J2828J0768Q871P224N230K810
53469A456057N57j284l172n492q067j0561j2685j4023j4345j4222j4578j5427
$$ y = [396838, 398107, 398898, 399178, 399383, 399926, 400840, 401965, 403210, 404436, 405389, 406116, 407239, 409313, 411973, 414273, 415964, 417875, 420812, 424625, 428855, 433772, 440044, 447557, 455293, 462509, 469416, 476599, 484382, 493092, 503294, 515124, 527700, 539869, 551510, 563564, 576753, 590794, 605025, 619340, 634136, 649702, 666079, 683457, 702253, 722699, 744573, 767421, 790847, 814521, 838169, 861813, 885828, 910417, 935042, 958695, 980855, 1001879, 1022315, 1042199, 1061390, 1080230, 1099298, 1118505, 1137099, 1154727, 1172002, 1189742, 1208069, 1226618, 1245191, 1263755, 1282058, 1299812, 1317054, 1333881, 1350018, 1365174, 1379694, 1394155, 1408326, 1421154, 1431922, 1440793, 1448017, 1453247, 1456057, 1456614, 1455330, 1452158, 1446666, 1438599, 1428038, 1415353, 1401330, 1386985, 1372763, 1358185, 1342758]
53457A342758j5863j5575j5495j6387j7642j8274j8400j8789j9335j9134j7964
53446A149900j6707j6088j5856j5478j4926j4266j3088j0969q243n754l889k299
53434A012337p00N35Q21K48k69J76J677L624N422O868P885Q390Q634R344J1099
53419A076091J3539J5630J6769J7413J8418K0018K1669K2847K3735K4964K6761
53408A297854K8608K9865L0588L1416L2762L4389L5964L7537L9296M1097M2699
53397A682075M4290M6310M8712N0809N1962N2199N2074N2150N2621N3187N3154
53386B239543N1973M9879M7825M6499M5507M3691M0312L5855L1550K8168K5302
53375B686104K1913J7524J2654Q046L827m19m951r780j5059k0971k7151l2714
$$ y = [1342758, 1326895, 1311320, 1295825, 1279438, 1261796, 1243522, 1225122, 1206333, 1186998, 1167864, 1149900, 1133193, 1117105, 1101249, 1085771, 1070845, 1056579, 1043491, 1032522, 1024279, 1018525, 1014636, 1012337, 1011637, 1012172, 1012993, 1013241, 1012972, 1013148, 1014825, 1018449, 1023871, 1030739, 1038624, 1047014, 1055648, 1064992, 1076091, 1089630, 1105260, 1122029, 1139442, 1157860, 1177878, 1199547, 1222394, 1246129, 1271093, 1297854, 1326462, 1356327, 1386915, 1418331, 1451093, 1485482, 1521446, 1558983, 1598279, 1639376, 1682075, 1726365, 1772675, 1821387, 1872196, 1924158, 1976357, 2028431, 2080581, 2133202, 2186389, 2239543, 2291516, 2341395, 2389220, 2435719, 2481226, 2524917, 2565229, 2601084, 2632634, 2660802, 2686104, 2708017, 2725541, 2738195, 2746241, 2750068, 2749649, 2744698, 2734918, 2719859, 2698888, 2671737, 2639023]
53363B639023l7101m0568m3607m6183m7902m8644m8749m8641m8511m8294m7716
53352B133107m6497m4610m2344m0029l7918l6340l5628l5623l5625l5127l4348
53341A709018l3714l3069l1849k9893k7566k5197k2839k0536j8374j6258j4112
53330A435611j2294j1280j0897j0469r913j0033j1320j3090j4322j4877j5193
53319A301923j5111j3986j1934j0186r729j0156j0244r326p650n661l512j399
53307A193029K27J126J778K908M534N885O483O951Q296J0616J3014J4863J6526
53294A286236J8596K0896K2706K3677K4041K4055K3722K3026K2077K0925J9544
53283A529501J8011J6435J4728J2777J0754Q877O862M098M90l261o427q966j1252
$$ y = [2639023, 2601922, 2561354, 2517747, 2471564, 2423662, 2375018, 2326269, 2277628, 2229117, 2180823, 2133107, 2086610, 2042000, 1999656, 1959627, 1921709, 1885369, 1849741, 1814118, 1778493, 1743366, 1709018, 1675304, 1642235, 1610386, 1580493, 1552927, 1527730, 1504891, 1484355, 1465981, 1449723, 1435611, 1423317, 1412037, 1401140, 1390671, 1380758, 1370725, 1359405, 1346315, 1331993, 1317116, 1301923, 1286812, 1272826, 1260892, 1250706, 1240977, 1230821, 1220577, 1211251, 1203601, 1197940, 1194428, 1193029, 1193256, 1194382, 1196160, 1199068, 1203602, 1209487, 1215970, 1222921, 1231217, 1241833, 1254847, 1269710, 1286236, 1304832, 1325728, 1348434, 1372111, 1396152, 1420207, 1443929, 1466955, 1489032, 1509957, 1529501, 1547512, 1563947, 1578675, 1591452, 1602206, 1611083, 1617945, 1622043, 1622533, 1619272, 1612845, 1603879, 1592627]
53270A592627j3441j5395j6999j8221j9079j9825k0941k2622k4429k5734k6411
53259A369530k6754k6894k6712k6270k5934k5999k6404k6846k6876k6094k4608
53248A080139k3249k2834k3135k3117k2277k1188k0497k0005j9285j8528j8143
53237H47881j7788j6712j4994j3573j2955j2541j1612j0235q849p559o378n724
53225G08961n951o663p171p563q563j0329j2061j3038j3461j3962j4628j5010
53213E80561j4813j4228j3605j3064j2412j1360r946q711q231q464q781q748q489
53200D39709q286q222q376q861r440r538r061q610q498q070o734n175m608n020
53186C31210n147m291l238l013l512l848l519k720j929j532j683k081k195j894
$$ y = [1592627, 1579186, 1563791, 1546792, 1528571, 1509492, 1489667, 1468726, 1446104, 1421675, 1395941, 1369530, 1342776, 1315882, 1289170, 1262900, 1236966, 1210967, 1184563, 1157717, 1130841, 1104747, 1080139, 1056890, 1034056, 1010921, 987804, 965527, 944339, 923842, 903837, 884552, 866024, 847881, 830093, 813381, 798387, 784814, 771859, 759318, 747706, 737471, 728622, 721063, 714685, 708961, 703010, 696347, 689176, 681613, 673050, 662721, 650660, 637622, 624161, 610199, 595571, 580561, 565748, 551520, 537915, 524851, 512439, 501079, 491133, 482422, 474191, 465727, 456946, 448198, 439709, 431423, 423201, 414825, 405964, 396524, 386986, 377925, 369315, 360817, 352747, 346013, 340838, 336230, 331210, 326063, 321772, 318534, 315521, 312009, 308161, 304642, 301922, 299993, 298461, 296778, 294697, 292502, 290608]
53172B90608j636j757j981j916j719j818k159k234j764r79k96M7qm09r83j491
53156B69505j687j437q66l57j84j36J90O75O78j40j288k050k217j984j447o52
53140B56603R3M43M54N08Q14J210J384J093K63q32j599j521o01O41J521J626J117
53123B63217O21N33N03k6p77q33O4J036J319J270J609K213K407J981J241L69n53
53106B76194j148j118r04j160j739j885j341o27j64J05K53J62r8k72l89o86j010
53089B64173j009q76j222k091k732k583j823q39K31J139J443J106O42M11K87K51
53073B56508O40J418J866J466O31L9l06p72j279j389j089q94j143j553j551r33
53057B51659j98j20p97j288o51P43J575J318Q22R59J427J485J158J009J114J001
$$ y = [290608, 288972, 287215, 285234, 283318, 281599, 279781, 277622, 275388, 273624, 272645, 272349, 272396, 272388, 271979, 270996, 269505, 267818, 266381, 265515, 265158, 264974, 264838, 265028, 265703, 266381, 266241, 264953, 262903, 260686, 258702, 257255, 256603, 256696, 257139, 257593, 258101, 258915, 260125, 261509, 262602, 262865, 262033, 260434, 258913, 258312, 258953, 260474, 262100, 263217, 263838, 264371, 264874, 264848, 264071, 263238, 263302, 264338, 265657, 266927, 268536, 270749, 273156, 275137, 276378, 276747, 276194, 275046, 273928, 273024, 271864, 270125, 268240, 266899, 266272, 266108, 266213, 266466, 266628, 266530, 266258, 265869, 265183, 264173, 263164, 262288, 261066, 258975, 256243, 253660, 251837, 250998, 251229, 252368, 253811, 254917, 255559, 255970, 256257, 256508, 257148, 258566, 260432, 261898, 262529, 262568, 262262, 261490, 260211, 258822, 257733, 256839, 255696, 254143, 252592, 251659, 251461, 251341, 250544, 249256, 248605, 249348, 250923, 252241, 253063, 254022, 255449, 256934, 258092, 259101, 260215, 261216]
53041B61216M45k49o85p17m19p1J7j48j98O8M27O88R99J385J441Q73K3n63p57
53022B63775o97l68K23Q27J252J606J875J725J148Q11J187J759J742J184O73L16
53006B79038j45m94k13N38R73P90N06N56P61Q17P31N36R3n48j011r89m85L35J191
52987B82980J577J163L54J6M73J195J559J533J450J499J665J892K095K137J970
52972C03558J669J279P85J99l29n02m9Q74J461J014n0m41L66J431J636J054L22
52955C14277n39j740k705k642j903j593j877j853j203p23r31j252j102p90p50
52940B92674p30m14j29k72n08k18N72J312J590J355P37O3l07l76m82o82o61l71
52922B93153j99k70j90K01N01M65M23N19L43k76p69p04m96n86o23k39K7m79j336
$$ y = [261216, 261661, 261412, 260727, 260010, 259591, 259520, 259537, 259389, 259191, 259259, 259686, 260374, 261373, 262758, 264199, 265072, 265095, 264532, 263775, 263078, 262710, 262933, 263760, 265012, 266618, 268493, 270218, 271366, 272177, 273364, 275123, 276865, 278049, 278722, 279038, 278893, 278399, 278186, 278724, 279697, 280487, 280993, 281549, 282310, 283127, 283858, 284394, 284487, 283939, 282928, 281939, 281454, 281789, 282980, 284557, 285720, 286074, 286090, 286563, 287758, 289317, 290850, 292300, 293799, 295464, 297356, 299451, 301588, 303558, 305227, 306506, 307291, 307490, 307161, 306659, 306610, 307484, 308945, 309959, 309909, 309468, 309834, 311265, 312901, 313955, 314277, 313738, 311998, 309293, 306651, 304748, 303155, 301278, 299425, 298222, 297499, 296568, 295316, 294214, 293424, 292674, 291944, 291530, 291401, 291129, 290621, 290403, 290975, 292287, 293877, 295232, 295969, 296032, 295725, 295349, 294867, 294185, 293524, 293153, 292954, 292684, 292494, 292695, 293196, 293661, 294084, 294603, 294946, 294670, 293901, 293197, 292701, 292115, 291492, 291253, 291280, 290801, 289465]
52903B89465j563r81j71N83J287J432L88j365k460k279j524r99p17m89m42m90
52887B79675o0J027J894J515P2j185j318n34L14O58N51K99L7k41l70n5O83J379
52869B84341J658J748K142K898L591L785L370K533J639J006N31k24j310k106k157
52854C03445j926k167k763k999k763k693l068l368l163k742k523k486k520k728
52840B65536l003k810j912r02n10p22r96j071j028q26l40K16M06K15J42N94J395
52823B54384K017K016J274Q1r69j357j048m49J0J89K04L11P59J575K370K575J988
52806B65930J069N81Q91J576J749Q35q42k281k679k121j367j069j219j379j237
52791B58437q81n95n38o44p55p73o81m53MP44J579K022J644N57n54j031q55m91
$$ y = [289465, 287902, 286921, 286750, 287333, 288620, 290052, 290440, 289075, 286615, 284336, 282812, 281813, 281096, 280607, 280165, 279675, 279615, 280642, 282536, 284051, 284123, 282938, 281620, 281086, 281400, 282058, 282609, 282908, 282945, 282704, 282334, 282279, 282962, 284341, 285999, 287747, 289889, 292787, 296378, 300163, 303533, 306066, 307705, 308711, 309242, 309018, 307708, 305602, 303445, 301519, 299352, 296589, 293590, 290827, 288134, 285066, 281698, 278535, 275793, 273270, 270784, 268264, 265536, 262533, 259723, 257811, 256909, 256399, 255677, 254681, 253610, 252582, 251756, 251416, 251632, 252038, 252253, 252395, 252989, 254384, 256401, 258417, 259691, 259772, 258803, 257446, 256398, 255949, 255959, 256148, 256352, 256663, 257422, 258997, 261367, 263942, 265930, 266999, 267580, 268471, 270047, 271796, 272631, 271789, 269508, 266829, 264708, 263341, 262272, 261053, 259674, 258437, 257556, 256961, 256423, 255779, 255024, 254251, 253570, 253117, 253121, 253865, 255444, 257466, 259110, 259667, 259113, 258082, 257227, 256736]
52773B56736k95k63k78k59o8L97Q51P76J00o09q55p98q48r66q38m87k69k97l31
52754B51399j73J41N48R73J227J165R69R00Q90P90R04J642K707L246K984K568
52738B72880K546K582K158J423Q79O02L96M19R74J850K471K644K621K428J779
52723B98652P67J4j40j30n23j273j942k358k608k590k041r76K27J149J478R49
52707B88655l68j707k038j167n0L54J55J22M77P14N44L54M99P37O72L83J70O4
52689B88570p1j90k83n87j077j074q5J117J194Q8p56l96K58j58j425k159j885
52672B81081j547j810j965j094L54J023M38m29n23M7M07K05l8K02P81J302J814
52655B80248K655L673M204L925L329L071L109K897K174J135m9j361k542l049k715
$$ y = [256736, 256441, 256178, 255900, 255641, 255573, 255970, 256821, 257597, 257697, 257088, 256233, 255435, 254587, 253621, 252783, 252296, 252027, 251730, 251399, 251226, 251367, 251915, 252888, 254115, 255280, 256249, 257149, 258039, 258829, 259733, 261375, 264082, 267328, 270312, 272880, 275426, 278008, 280166, 281589, 282468, 283070, 283466, 283885, 284859, 286709, 289180, 291824, 294445, 296873, 298652, 299419, 299433, 299293, 299163, 298640, 297367, 295425, 293067, 290459, 287869, 285828, 284852, 285079, 286228, 287706, 288655, 288287, 286580, 284542, 283375, 283325, 283679, 283834, 283956, 284433, 285147, 285691, 286045, 286544, 287281, 287953, 288336, 288506, 288570, 288499, 288309, 288026, 287439, 286362, 285288, 285203, 286320, 287514, 287602, 286846, 286450, 286708, 286550, 285125, 282966, 281081, 279534, 277724, 275759, 274665, 275019, 276042, 276480, 276051, 275528, 275575, 275982, 276187, 276149, 276351, 277132, 278434, 280248, 282903, 286576, 290780, 294705, 298034, 301105, 304214, 307111, 309285, 310420, 310371, 309010, 306468, 303419, 300704]
52640C00704k060j678j573j385j041p71o35m44j58k4j36k62j92j9J09K93O25Q77
52622B92230P18J83l56o82q68r80r05n86j53K80P15J084J169Q95M90K13N7q9j63
52603B93252p0M8qj25L0M81P70M41m04j181j360r06k91k0j84m46m92l35p2L95
52583B89523J090J618J532J050R30J397J736J276L64o8K34O41O22L04p8o76j567
52566B99928k217k025j225o61p21r71j036j153j541j720j084O9O90K04q66j642
52550B84029j743j318o56p4J62R8J20M48P54O18J29j76L5N44Q42N54k37r68j033
52531B82128m33J91L24J52J46L57N27O34Q95J257J451J414J309J132P80N13P88
52514B93565J606K482L180L982M960N548N190M015K600J276R6q86j639k318l087
$$ y = [300704, 298644, 296966, 295393, 294008, 292967, 292196, 291561, 291117, 290959, 290935, 290799, 290537, 290345, 290326, 290435, 290728, 291353, 292230, 292948, 293131, 292775, 292093, 291225, 290245, 289340, 288754, 288601, 288881, 289596, 290680, 291849, 292744, 293234, 293447, 293504, 293415, 293252, 293182, 293230, 293222, 293097, 293127, 293608, 294378, 294819, 294415, 293234, 291874, 290968, 290677, 290657, 290473, 290027, 289535, 289200, 289128, 289523, 290613, 292231, 293763, 294813, 295743, 297140, 298876, 300152, 300516, 300448, 300682, 301323, 301945, 302249, 302171, 301495, 299928, 297711, 295686, 294461, 293800, 293079, 292108, 291072, 289919, 288378, 286658, 285574, 285643, 286333, 286537, 285671, 284029, 282286, 280968, 280312, 280238, 280400, 280498, 280618, 281066, 281820, 282438, 282567, 282391, 282426, 282970, 283812, 284366, 284129, 283161, 282128, 281695, 281886, 282210, 282362, 282508, 282865, 283392, 284026, 284921, 286178, 287629, 289043, 290352, 291484, 292264, 292777, 293565, 295171, 297653, 300833, 304815, 309775, 315323, 320513, 324528, 327128, 328404, 328500, 327614, 325975, 323657, 320570]
52499C20570l839m343m494m255l575k595j711j182q42m64j88k48m97n26j63M40
52483B92088J075J494J394P83K54M19J103J575J557J488J706J943J892J797K022
52468C12590K372K335J867J483J563J928K238K422K539K394J623J81j505k890
52454C31140l728m049l931l521l123l061l287l377k990k278j734j701k077k388
52440B89895k144j308m25j01k58j90M72J180J155M95O2L71J007J239Q41J17n33
52423B91875q62p68l53P9K49P6l27o80n55L48J719K713K790K309K075K412L019
52406C06119L577M106M673N224N813O598P351P302N911L641J539M3j374l295n415
52391C51813o726o487m925l086k079k220k706k322p21J086J757J075J69K22J288
$$ y = [320570, 316731, 312388, 307894, 303639, 300064, 297469, 295758, 294576, 293734, 293270, 293082, 292834, 292337, 291811, 291648, 292088, 293163, 294657, 296051, 296834, 297088, 297507, 298610, 300185, 301742, 303230, 304936, 306879, 308771, 310568, 312590, 314962, 317297, 319164, 320647, 322210, 324138, 326376, 328798, 331337, 333731, 335354, 335535, 334030, 331140, 327412, 323363, 319432, 315911, 312788, 309727, 306440, 303063, 300073, 297795, 296061, 294360, 292283, 289895, 287751, 286443, 286018, 285917, 285659, 285469, 285941, 287121, 288276, 288771, 288833, 289204, 290211, 291450, 292291, 292408, 291875, 291013, 290245, 289892, 289971, 290220, 290296, 289969, 289289, 288734, 289082, 290801, 293514, 296304, 298613, 300688, 303100, 306119, 309696, 313802, 318475, 323699, 329512, 336110, 343461, 350763, 356674, 360315, 361854, 361897, 360523, 357228, 351813, 345087, 338600, 333675, 330589, 328510, 326290, 323584, 321262, 320541, 321627, 323384, 324459, 324628, 324850, 326138]
52376C26138K443K934K878K933L497M326M857M727M005L056K284J900J765J502
52362C69245R19L34K36N66O28o5j091j570j202n09r2M5L29J012J895K547K701
52345C75928K439K033J676J447J525K127L076L755L739L338L171L426L930M726
52331D16336O012P532Q699R354R956J0813J1689J2399J3200J4183J4828J4658
52319E49659J4029J3719J3969J4452J5013J5875J7078J8276J9161J9813K0428
52308G31472K1027K1556K2070K2691K3427K4102K4427K4247K3773K3460K3431
52297I85683K3169K2021J9923J7415J4954J2511R873P098M536K494R55m05j927
52284A118300l595n026n878o262o568p010p442p635p506p075o336n291m026k706
$$ y = [326138, 328581, 331515, 334393, 337326, 340823, 345149, 350006, 354733, 358738, 361794, 364078, 365978, 367743, 369245, 370164, 370498, 370734, 371300, 371928, 371863, 370772, 369202, 368000, 367491, 367399, 367444, 367773, 368785, 370680, 373227, 375928, 378367, 380400, 382076, 383523, 385048, 387175, 390251, 394006, 397745, 401083, 404254, 407680, 411610, 416336, 422348, 429880, 438579, 447933, 457889, 468702, 480391, 492790, 505990, 520173, 535001, 549659, 563688, 577407, 591376, 605828, 620841, 636716, 653794, 672070, 691231, 711044, 731472, 752499, 774055, 796125, 818816, 842243, 866345, 890772, 915019, 938792, 962252, 985683, 1008852, 1030873, 1050796, 1068211, 1083165, 1095676, 1105549, 1112647, 1117183, 1119677, 1120632, 1120227, 1118300, 1114705, 1109679, 1103801, 1097539, 1090971, 1083961, 1076519, 1068884, 1061378, 1054303, 1047967, 1042676, 1038650, 1035944]
52270A035944j472l74O25J614K727M089N639O972P636P796Q369J0068J2447J4404
52256A116484J5561J6600J8069J9527K0285K0399K0367K0142J9090J6842J3683
52245A317049J0159O764L959K055R16Qj157k743m643o565q230r731j1495j3654
52231A282692j5655j6848j7306j7636j8072j8305j8129j7765j7445j7100j6584
52220A091847j5887j5006j3925j2801j1887j1160j0253q907p281n843n002m761
52208I69134m540l510j524N07J504J443J186J224J206Q11M40O67J498K528L563
52193I76137M642N640O214O147N535M643L742L029K546K113J379Mk050m400o494
52178A008827q041r047r472r210q493p846p444o921o109n399m934m073k424q01
$$ y = [1035944, 1034472, 1034098, 1034723, 1036337, 1039064, 1043153, 1048792, 1055764, 1063400, 1071196, 1079565, 1089633, 1102080, 1116484, 1132045, 1148645, 1166714, 1186241, 1206526, 1226925, 1247292, 1267434, 1286524, 1303366, 1317049, 1327208, 1333972, 1337931, 1339986, 1340902, 1340910, 1339753, 1337010, 1332367, 1325802, 1317572, 1307841, 1296346, 1282692, 1267037, 1250189, 1232883, 1215247, 1197175, 1178870, 1160741, 1142976, 1125531, 1108431, 1091847, 1075960, 1060954, 1047029, 1034228, 1022341, 1011181, 1000928, 992021, 984740, 978897, 973895, 969134, 964594, 961084, 959560, 960067, 961571, 963014, 964200, 965424, 966630, 967441, 967881, 968548, 970046, 972574, 976137, 980779, 986419, 992633, 998780, 1004315, 1008958, 1012700, 1015729, 1018275, 1020388, 1021767, 1021771, 1019721, 1015321, 1008827, 1000786, 991739, 982267, 973057, 964564, 956718, 949274, 942353, 936244, 930845, 925911, 921838, 919414, 918613]
52164I18613j94j77N51K158L504L946M088M397M286L179J507R8o97p41O2J148
52148I45728J452R26R97K622M723N602N170M602M304L604K280J119P89J140J791
52133I86849K658L700M875O440Q659J1150J3228J4928J6971J9604K2145K3898
52121A135105K4948K5784K6681K7625K8363K8435K7587K6261K5157K4284K3092
52110A423322K1583K0482K0036J9470J8189J6854J6580J7400J8285J8452J8022
52099A628675J7404J6660J5577J4053J2061R468O091K031k204o060r463j2803
52087A691490j6245j9243k1082k1758k1976k2255k2405k1964k0846j9410j8091
52076A466215j7056j6062j4674j2754j0643q667o694m549k579j208m7J783M380
$$ y = [918613, 918419, 918242, 918793, 920951, 924455, 928401, 932489, 936886, 941172, 944351, 945858, 945956, 945259, 944518, 944580, 945728, 947180, 948106, 949103, 951725, 956448, 962050, 967220, 971822, 976126, 979730, 982010, 983129, 983918, 985058, 986849, 989507, 993207, 998082, 1004522, 1013181, 1024331, 1037559, 1052487, 1069458, 1089062, 1111207, 1135105, 1160053, 1185837, 1212518, 1240143, 1268506, 1296941, 1324528, 1350789, 1375946, 1400230, 1423322, 1444905, 1465387, 1485423, 1504893, 1523082, 1539936, 1556516, 1573916, 1592201, 1610653, 1628675, 1646079, 1662739, 1678316, 1692369, 1704430, 1713898, 1719989, 1722020, 1719816, 1713756, 1704293, 1691490, 1675245, 1656002, 1634920, 1613162, 1591186, 1568931, 1546526, 1524562, 1503716, 1484306, 1466215, 1449159, 1433097, 1418423, 1405669, 1395026, 1386359, 1379665, 1375116, 1372537, 1371329, 1371282, 1373065, 1377445]
52063A377445O851Q635J0261J2383J4681J6330J7102J7421J7658J7927J8337J8837
52051A553868J8935J8036J6053J3394J0492P674N163K776j09l749p362r823j1023
52038A614325j1929j3291j4857j6023j6700j7233j7809j8301j8516j8379j8023
52027A433264j7819j8024j8368j8253j7568j6964j7057j7574j7690j7074j6171
52016A240702j5480j4928j4153j3135j2175j1400j0652r970r828j0572j1802j2724
52004A093883j3189j3969j5710j7950j9583k0145k0152k0103j9663j8216j5913
51993H99290j3713j2400j1925j1869j2180j3090j4420j5405j5474j4954j4687
51982G49173j5010j5444j5428j4997j4551j4229j3864j3366j2759j1838j0263
$$ y = [1377445, 1384296, 1392931, 1403192, 1415575, 1430256, 1446586, 1463688, 1481109, 1498767, 1516694, 1535031, 1553868, 1572803, 1590839, 1606892, 1620286, 1630778, 1638452, 1643615, 1646391, 1646282, 1642533, 1635171, 1625348, 1614325, 1602396, 1589105, 1574248, 1558225, 1541525, 1524292, 1506483, 1488182, 1469666, 1451287, 1433264, 1415445, 1397421, 1379053, 1360800, 1343232, 1326268, 1309211, 1291637, 1273947, 1256873, 1240702, 1225222, 1210294, 1196141, 1183006, 1170831, 1159431, 1148779, 1138809, 1128981, 1118409, 1106607, 1093883, 1080694, 1066725, 1051015, 1033065, 1013482, 993337, 973185, 953082, 933419, 915203, 899290, 885577, 873177, 861252, 849383, 837203, 824113, 809693, 794288, 778814, 763860, 749173, 734163, 718719, 703291, 688294, 673743, 659514, 645650, 632284, 619525, 607687, 597424]
51971E97424q061n774l908k413r10P65K450L952N183O088O605O752O539N848M568
51956F25108K824R00j077l146n092o342o469n601m176k385k06K111M029N346O512
51941F12336Q071J0006J1827J3218J4236J4919J4978J4123J2475J0458Q331N988
51929G50966L267L03k545n007p046q675r853j0605j1028j1012j0106p965m873
51916F65821j580J384L860N469N267K492k452p976j2362j4771j5450j5129j4236
51903F00337j2588r942o851m570l883m282m639m543m589n494p310r472j1207j1945
51889D99022j1731j1227j0948j0498r065o612m032k015l69J340L040M448N618
51876D46971O729P702Q441R152R873J0084R247P556N592L490J032j587l767n232
$$ y = [597424, 589363, 583589, 579681, 577268, 576358, 577123, 579573, 583525, 588708, 594796, 601401, 608153, 614692, 620540, 625108, 627932, 628832, 627755, 624609, 619517, 613175, 606706, 601105, 596929, 594544, 594338, 596449, 600478, 605824, 612336, 620407, 630413, 642240, 655458, 669694, 684613, 699591, 713714, 726189, 736647, 744978, 750966, 754233, 754536, 751991, 746984, 739938, 731263, 721410, 710805, 699777, 688765, 678659, 670694, 665821, 664241, 665625, 669485, 674954, 680221, 682713, 680261, 672285, 659923, 645152, 629702, 614573, 600337, 587749, 577807, 570956, 566386, 562503, 558221, 553582, 549039, 544450, 538956, 531646, 522174, 510967, 499022, 487291, 476064, 465116, 454618, 445553, 438941, 434909, 432894, 432525, 433865, 436905, 441353, 446971, 453700, 461402, 469843, 478995, 488868, 498952, 508199, 515755, 521347, 524837, 525869, 524282, 520515, 515283]
51862E15283o063o063m879k945j523j241j258m32J110K204K210J597J026M67n49
51847D98944k175l999n389n987o018o052o343o492n974m905l964l575l522l412
51833D31137l074k366j092N21J674J754J144O93O01K75o29j687k311k386k008
51818D22246j173j57K28m79j491j427rJ561K107J772J447J422J212M86m20r53
51802D26372q71k57O03J252J331J048R94J327J425P60k03m99n3J30o38j710j987
51785D29024j417r43j076j321j139p92p39p48l04L99O18L01M33J852M167O213
51769D34528P359P934Q493R068R317R090Q665Q326P885O775M672J937p21k894
51755E20434m623o012o996p546p837q016q016p776p431p075o487n384l891k490
$$ y = [515283, 509220, 503157, 498278, 495333, 493810, 492569, 491311, 490879, 491989, 494193, 496403, 498000, 499026, 499493, 498944, 496769, 492770, 487381, 481394, 475376, 469324, 462981, 456489, 450515, 445610, 441646, 438071, 434549, 431137, 428063, 425697, 424605, 425126, 426800, 428554, 429698, 430391, 430992, 431267, 430638, 428951, 426640, 424254, 422246, 421073, 420916, 421144, 420665, 419174, 417747, 417738, 419299, 421406, 423178, 424625, 426047, 427259, 427745, 427325, 426372, 425501, 425244, 425847, 427099, 428430, 429478, 430472, 431799, 433224, 433984, 433781, 433282, 433229, 433359, 432721, 431011, 429024, 427607, 426664, 425588, 424267, 423128, 422336, 421597, 420849, 420545, 420944, 421562, 421863, 422296, 424148, 428315, 434528, 441887, 449821, 458314, 467382, 476699, 485789, 494454, 502780, 510665, 517440, 522112, 524049, 523328, 520434, 515811, 509799, 502803, 495257, 487420, 479404, 471388, 463612, 456181, 449106, 442619, 437235, 433344, 430854]
51741D30854j459o25K74J227K156L275M884O783Q194Q514P951P162O386N211L318
51726D94105J123m82p97L48K627N229O964O786M429O18l310o053p050o799o318
51711D91420o031n441m136k748k425l466n002n917n702m446k616q46M08J166J512
51696D45730J124k31j925k871k847k553k337j759p02ll48j296k049k580l264l925
51680D18164m043l544k675j389L47J971K807K981L148L515L823M108M658N312
51666D39183N733O351Q127J1081J3851J5050J4447J2546R650N810J317l203o988
51653E32955r293r756q750p127n435l644j672K21J620K123J310r19l912o624q559
51638D72538r862j0522j0169q867p366o157m881l170j451l73Q9M21P49Q99R52
$$ y = [430854, 429395, 428770, 429044, 430271, 432427, 435702, 440586, 447369, 455563, 464077, 472028, 479190, 485576, 490787, 494105, 495228, 494746, 493949, 494297, 496924, 502153, 509117, 515903, 520332, 520950, 517640, 511587, 504537, 497738, 491420, 485389, 479948, 475812, 473064, 470639, 467173, 462171, 456254, 450552, 446106, 443490, 442644, 443052, 444218, 445730, 446854, 446623, 444698, 441827, 438980, 436427, 434090, 432331, 431629, 431626, 431278, 429982, 427933, 425353, 422089, 418164, 414121, 410577, 407902, 406513, 406860, 408831, 411638, 414619, 417767, 421282, 425105, 429213, 433871, 439183, 444916, 451267, 459394, 470475, 484326, 499376, 513823, 526369, 536019, 541829, 543146, 539943, 532955, 523662, 513906, 505156, 498029, 492594, 488950, 487278, 487499, 489119, 491242, 492552, 491633, 487721, 481097, 472538, 462676, 452154, 441985, 433118, 425752, 419595, 414714, 411544, 410093, 409720, 409809, 410230, 410979, 411878, 412830]
51623D12830J148J392J377J155J100J353J663J770J609J193N79j1l79o32j078
51608D25069j824k625l081k947k314j601j175q89k83P16J593J948K076K569L606
51593D20838M942O294P468Q252Q481Q058O712M052K04l765o473p234o329m501
51579D46999k437n15J312L318N460P308Q625R809J1344J3113J4619J5673J6515
51566E51143J7373J8308J9321K0293K0923K1120K1381K2434K4543K7289K9910
51555G94038L1602L1785L0309K7269K2491J5629O993k217j0887j8735k5668l1029
51543H71580l4254l5774l6452l6361l5011l2487k9469k6221k2569j8805j5637
51532E48540j3107j0592q050o339n876n886n371m150k545q39N36J027P80P54J458
$$ y = [412830, 413978, 415370, 416747, 417902, 419002, 420355, 422018, 423788, 425397, 426590, 427169, 427158, 426779, 426147, 425069, 423245, 420620, 417539, 414592, 412278, 410677, 409502, 408613, 408330, 409046, 410639, 412587, 414663, 417232, 420838, 425780, 432074, 439542, 447794, 456275, 464333, 471045, 475097, 475301, 471536, 465063, 457829, 451500, 446999, 444562, 444047, 445359, 448677, 454137, 461445, 470070, 479879, 491223, 504336, 518955, 534628, 551143, 568516, 586824, 606145, 626438, 647361, 668481, 689862, 712296, 736839, 764128, 794038, 825640, 857425, 887734, 915003, 937494, 953123, 960116, 957899, 947012, 928277, 902609, 871580, 837326, 801552, 765100, 728739, 693728, 661241, 631772, 605551, 582982, 564177, 548540, 535433, 524841, 516791, 510452, 504576, 498690, 493319, 489169, 486624, 485785, 486321, 487348, 488128, 488882, 490340]
51517D90340K179K125J566J236J026K34j262k866m088m848n109m923m717m936
51503D65957n357n359m849m361m165l870l049j869r18n62o34o00q4O50Q45J13
51487D31888j067j897k115j956j535q05q9k2p46j592j819j448j076j111j387j495
51471D11728j218o31L5M38K10p56j987k682k517k034j914k082j891j127k88J84
51455C93468L80N17N59N18O66J111J555J804K078K587L101L409L711M275N066
51440D24805O093P611R439J0617J0347Q943P227N413L379J588P07L99m98k454
51426D93616m704o363p260p451o818n554m380l756l322k516j315kJ326K546L179
51411D47226K800J665M63l67q16r09o05p6K53J41j34n8N61J401K059K527L063
$$ y = [490340, 492519, 494644, 496210, 497446, 498472, 498706, 497444, 494578, 490490, 485642, 480533, 475610, 470893, 465957, 460600, 455241, 450392, 446031, 441866, 437996, 434947, 433078, 432160, 431598, 430964, 430364, 430280, 430930, 431775, 431888, 430821, 428924, 426809, 424853, 423318, 422513, 422424, 422402, 421656, 420064, 418245, 416797, 415721, 414610, 413223, 411728, 410510, 409879, 409914, 410352, 410562, 409806, 407819, 405137, 402620, 400586, 398672, 396590, 394699, 393572, 393284, 393468, 393848, 394365, 394924, 395442, 396108, 397219, 398774, 400578, 402656, 405243, 408344, 411753, 415464, 419739, 424805, 430898, 438509, 447948, 458565, 468912, 477855, 485082, 490495, 493874, 495462, 496169, 496568, 496070, 493616, 488912, 482549, 475289, 467838, 461020, 455466, 451086, 447330, 444008, 441492, 440177, 440175, 441501, 444047, 447226, 450026, 451691, 452154, 451787, 450971, 450062, 449457, 449381, 449634, 449775, 449641, 449583, 450144, 451545, 453604, 456131, 459194]
51394D59194L677M134M493N182O336P501Q353R269J0705J2501J4386J6749K0104
51381E82584K4091K7951L1749L6076M0568M3922M5630M6554M7245M6700M3502
51370A016572L7365K8887J8493O648n449j6392k5703l3693m0350m5039m7350m7714
51358H46275m7011m5801m3937m0863l6441l1534k7332k3979k0512j6447j2761
51347D99657j0657r918r303q239p274o979p138p130o570n469m200l291k900k560
51333D08029j825r98q02j412k218k499j955p64M93J093Q11K19MJ57K94M28R11
51316C99966J759K616L255L597L471K977K741L122L393K605J110J30j60q70k495
51301D27217l982m302l934l884m127l994l598l714m439m904m479l510k661k075
$$ y = [459194, 462871, 467005, 471498, 476680, 483016, 490517, 498870, 508139, 518844, 531345, 545731, 562480, 582584, 606675, 634626, 666375, 702451, 743019, 786941, 832571, 879125, 926370, 973070, 1016572, 1053937, 1082824, 1101317, 1107965, 1102516, 1086124, 1060421, 1026728, 986378, 941339, 893989, 846275, 799264, 753463, 709526, 668663, 632222, 600688, 573356, 549377, 528865, 512418, 499657, 489000, 479082, 469779, 461540, 454266, 447287, 440149, 433019, 426449, 420980, 416780, 413489, 410589, 408029, 406204, 405206, 404404, 402992, 400774, 398275, 396320, 395556, 396049, 397142, 397953, 398172, 398176, 398333, 398627, 399055, 399966, 401725, 404341, 407596, 411193, 414664, 417641, 420382, 423504, 426897, 429502, 430612, 430742, 430582, 429712, 427217, 423235, 418933, 414999, 411115, 406988, 402994, 399396, 395682, 391243, 386339, 381860, 378350, 375689, 373614]
51287C73614j388l65Q22J786K341K667L077L658M317N038N746N978N217L758K648
51272D18914K386K202J205k02p47k2J055J528J497J642K169K592K281J036p22
51257D36814k139k521k014j460j480j834j995j986k232k698k760k129j440j480
51243D08646k194k820k872k513k031j552j243j278j440j255p67n85r06j034m21
51228C85735L92N37R8j15J82N10N41M89N93Q86J493K447L209L119K481K402L340
51211D08339M492M908M526L739K720J698J222J494J861J602R55P78J396K209K377
51196D44316J583K48q59j366j703k400l127l094k407k127k642k998k475j801j932
51181D17216k387k008q80j76l57p03o50m81l88j8P11J143P84J8m91o03n47l93
$$ y = [373614, 372226, 371861, 372683, 374469, 376810, 379477, 382554, 386212, 390529, 395567, 401313, 407291, 412508, 416266, 418914, 421300, 423502, 424707, 424505, 423758, 423736, 424791, 426319, 427816, 429458, 431627, 434219, 436500, 437536, 436814, 434675, 432154, 430140, 428680, 427200, 425366, 423371, 421385, 419153, 416455, 413695, 411566, 410126, 408646, 406452, 403632, 400760, 398247, 396216, 394664, 393421, 392143, 390703, 389448, 388681, 388096, 387190, 386156, 385735, 386127, 386664, 386762, 386647, 386829, 387339, 387880, 388369, 388962, 389848, 391341, 393788, 396997, 400116, 402597, 404999, 408339, 412831, 417739, 422265, 426004, 428724, 430422, 431644, 433138, 434999, 436601, 437556, 438334, 439730, 441939, 444316, 445899, 446147, 445288, 443922, 442219, 439819, 436692, 433598, 431191, 429064, 426422, 423424, 420949, 419148, 417216, 414829, 412821, 411941, 411765, 411408, 410705, 410055, 409574, 409186, 409168, 409879, 411022, 411806, 411824, 411333, 410730, 410183, 409790]
51163D09790r7K68O72J277K168L105L796M125M042L443K425J393O69J66m16j126
51147D35700j640j589j021n15p32j658k523k656k257k037k246k453k221j651j231
51132D09270j316j771j983j394j84Q70J419J971K940L824L975L710L817M207M030
51117D33385L089K216K165K904M034N063N241M083K334J419J571J531N26m86k86
51102D68789Q28J640J698J375Q26m1q22r18n17m16q76j374j526j505j488j340
51086D64333r86n82j78K53M77K42j03N4N45M65m55j255j016j15M91O85J113J896
51068D65864K349K132J889K394L561M805N960P289Q814J0311J1925J4075J6459
51055E57827J7825J7195J5040J2695J0914R610Q836R120J0556J2152J2630J1574
$$ y = [409790, 409693, 409961, 410633, 411910, 414078, 417183, 420979, 425104, 429146, 432589, 435014, 436407, 437076, 437242, 436826, 435700, 434060, 432471, 431450, 430935, 430203, 428545, 426022, 423366, 421109, 419072, 416826, 414373, 412152, 410501, 409270, 407954, 406183, 404200, 402806, 402622, 403492, 404911, 406882, 409822, 413646, 417621, 421331, 425148, 429355, 433385, 436474, 438690, 440855, 443759, 447793, 452856, 458097, 462180, 464514, 465933, 467504, 469035, 469561, 469075, 468789, 469617, 471257, 472955, 474330, 475156, 475115, 474293, 473375, 472858, 472442, 471566, 470192, 468666, 467161, 465673, 464333, 463347, 462765, 462587, 462840, 463317, 463559, 463456, 463510, 464055, 464520, 464065, 462810, 461794, 461679, 462170, 462855, 463968, 465864, 468213, 470345, 472234, 474628, 478189, 482994, 488954, 496243, 505057, 515368, 527293, 541368, 557827, 575652, 592847, 607887, 620582, 631496, 641106, 649942, 659062, 669618, 681770, 694400, 705974]
51043G05974R495O946M030O81k942o430r300j1112j1564j0637q711o559n057m795
51029F50019n800p625r539j0649j0244q350n860l706j997k03J928M001N537O465
51015F03977P025P542Q281R128R470Q780P381O144N485N204N308O193P799R286
51001G07003R916R755R133Q105O870O079O075O244N750M533L036J426j56r58j80
50986G82631J838L749M713N204O281Q484J1627J5141J8512K1559K4468K7398L0118
50973I61723L2154L3180L3266L3098L4009L7185M2360M7852N2468N6879O2352
50962A426526O8642P4119P7840Q0388Q2557Q4183Q4577Q3288Q0045P4612O7177
50951B283954N8457M9043L8960K8177J7134O562k963j1084j7652k2731k6389k8431
$$ y = [705974, 715469, 722415, 726445, 727126, 724184, 717754, 708454, 697342, 685778, 675141, 666430, 659871, 654814, 650019, 644219, 636594, 627055, 616406, 606162, 597812, 591952, 588246, 586249, 586046, 587974, 591975, 597512, 603977, 611002, 618544, 626825, 635953, 645423, 654203, 661584, 667728, 673213, 678417, 683725, 689918, 697717, 707003, 716919, 726674, 735807, 743912, 750782, 756861, 762936, 769180, 774930, 779463, 782499, 783925, 783769, 782811, 782631, 784469, 788218, 792931, 798135, 804416, 812900, 824527, 839668, 858180, 879739, 904207, 931605, 961723, 993877, 1027057, 1060323, 1093421, 1127430, 1164615, 1206975, 1254827, 1307295, 1364174, 1426526, 1495168, 1569287, 1647127, 1727515, 1810072, 1894255, 1978832, 2062120, 2142165, 2216777, 2283954, 2342411, 2391454, 2430414, 2458591, 2475725, 2482287, 2479324, 2468240, 2450588, 2427857, 2401468, 2373037]
50939B373037k8824k8345k8197k8813k9600l0084l0598l1470l2232l2330l2176
50928B040368l2756l4391l6446l8230l9700m1216m2991m4905m6697m8211m9403
50917A585422n0065m9614m7548m4202m0690l7825l5369l2614k9468k6574k4457
50906A166996k2902k1281j9325j7447j6228j5586j4654j2765j0408q734q121p762
50894I91783o823n464m264l157j588M64K224K990K824K290J893J917K502L569
50880I91160M719N463N699N858O479P624Q955J0296J1797J3404J4584J5044J5416
50867A116498J6636J8711K0773K2437K4433K7632L1956L6660M1299M6010N1137
50856A454182N6900O3263O9960P6891Q4625R4029J05184J17053J28623J39886
$$ y = [2373037, 2344213, 2315868, 2287671, 2258858, 2229258, 2199174, 2168576, 2137106, 2104874, 2072544, 2040368, 2007612, 1973221, 1936775, 1898545, 1858845, 1817629, 1774638, 1729733, 1683036, 1634825, 1585422, 1535357, 1485743, 1438195, 1393993, 1353303, 1315478, 1280109, 1247495, 1218027, 1191453, 1166996, 1144094, 1122813, 1103488, 1086041, 1069813, 1054227, 1039573, 1026808, 1016400, 1007666, 999545, 991783, 984960, 979496, 975232, 972075, 970487, 970951, 973175, 976165, 978989, 981279, 983172, 985089, 987591, 991160, 995879, 1001342, 1007041, 1012899, 1019378, 1027002, 1035957, 1046253, 1058050, 1071454, 1086038, 1101082, 1116498, 1133134, 1151845, 1172618, 1195055, 1219488, 1247120, 1279076, 1315736, 1357035, 1403045, 1454182, 1511082, 1574345, 1644305, 1721196, 1805821, 1899850, 2005034, 2122087, 2250710, 2390596]
50846B390596J51307J62638J72898J81293J87689J92256J94999J95473J92584
50837D021733J84857J71394J52526J29274J02507P3080M2518J2762j4858l9971
50827D835822o2402q1559r6605j06816j11659j10971j05364r6206q5115p3595
50817C905530o3126n5035m9980m7836m8338n1639n7915o6580p6303q5884r4882
50806C208012j03285j10819j16879j20999j23023j22754j19895j14671j08101
50797B167586j01064r3365q4376p4481o4996n6596m8717m0960l4088k8918k4940
50786A515085k1032j7018j3533j0683p864m945k578j222n92l05l39p25j371k349
50772A430529l690m883n286n185n645p049q623r737j0773j2156j3384j3842j3873
$$ y = [2390596, 2541903, 2704541, 2877439, 3058732, 3246421, 3438677, 3633676, 3829149, 4021733, 4206590, 4377984, 4530510, 4659784, 4762291, 4835371, 4877889, 4890651, 4875793, 4835822, 4773420, 4691861, 4595256, 4488440, 4376781, 4265810, 4160446, 4064240, 3979125, 3905530, 3842404, 3787369, 3737389, 3689553, 3641215, 3589576, 3531661, 3465081, 3388778, 3302894, 3208012, 3104727, 2993908, 2877029, 2756030, 2633007, 2510253, 2390358, 2275687, 2167586, 2066522, 1973157, 1888781, 1814300, 1749304, 1692708, 1643991, 1603031, 1568943, 1540025, 1515085, 1494053, 1477035, 1463502, 1452819, 1444955, 1440010, 1437432, 1436210, 1435618, 1435313, 1434974, 1434249, 1432878, 1430529, 1426839, 1421956, 1416670, 1411485, 1405840, 1398791, 1390168, 1380431, 1369658, 1357502, 1344118, 1330276, 1316403]
50759A316403j4132j4339j3608j1903j0171r054q172o886n098l091r57J501M561
50746A225054Q299J2425J6464K0317K4463K9348L4812M0422M6139N2161N8400
50735A568304O4631P1031P7813Q4399Q9739R3523R6449R8950J00481J00499R9440
50724B545259R8050R6215R3121Q8329Q1974P3980O3800N0977L5510J7654k078
50713C242791k2520m1944n8822p2312q1955q7307q8160q4920p8480o9867o0076
50702B496428n0063m0673l2632k6580k2830k1127k0978k2420k6045l2042l9626
50691B161412m7648n5373o2225o7249o9657o9736o8528o6471o3046n7852n1393
50680A482234m4535l7717l1114k5003j9526j4412r368m553k95L422O794R802J2345
$$ y = [1316403, 1302271, 1287932, 1274324, 1262421, 1252250, 1243196, 1235024, 1228138, 1223040, 1219949, 1218992, 1220493, 1225054, 1233353, 1245778, 1262242, 1282559, 1307022, 1336370, 1371182, 1411604, 1457743, 1509904, 1568304, 1632935, 1703966, 1781779, 1866178, 1955917, 2049440, 2145889, 2244839, 2345320, 2445819, 2545259, 2643309, 2739524, 2832645, 2920974, 3002948, 3076928, 3140728, 3191705, 3227215, 3244869, 3242791, 3220271, 3178327, 3119505, 3047193, 2965238, 2877931, 2789771, 2704851, 2626371, 2556504, 2496428, 2446365, 2405692, 2373060, 2346480, 2323650, 2302523, 2281545, 2259125, 2233080, 2201038, 2161412, 2113764, 2058391, 1996166, 1928917, 1859260, 1789524, 1720996, 1654525, 1591479, 1533627, 1482234, 1437699, 1399982, 1368868, 1343865, 1324339, 1309927, 1300559, 1296006, 1295711, 1299133, 1305927, 1315729, 1328074]
50667A328074J4556J6522J7846J7973J6979J5621J4629J4257J4432J4919J5385
50656A501193J5744J6457J8056K0323K2341K3527K4243K5260K6998K9476L2555
50645A756173L5899L8953M1427M3724M6591N0321N4370N7767N9828O0607O0634
50634B306294O0143N8598N5259N0236M4679L9788L5899L2722L0066K8035K6542
50623B768261K4959K2152J6766P834m375j7848k9514l6777l8717l6103l0512k3377
50611B622749j5695q361k376J457L083K999J448k034q051j6564k6799l7707m8339
50598B465810n7980o6294p3167p8240q0812q0596p8369p5374p2070o7999o2969
50587A671940n7659n2803m8261m3516l8803l5023l2627l1073k9536k7633k5276
$$ y = [1328074, 1342630, 1359152, 1376998, 1394971, 1411950, 1427571, 1442200, 1456457, 1470889, 1485808, 1501193, 1516937, 1533394, 1551450, 1571773, 1594114, 1617641, 1641884, 1667144, 1694142, 1723618, 1756173, 1792072, 1831025, 1872452, 1916176, 1962767, 2013088, 2067458, 2125225, 2185053, 2245660, 2306294, 2366437, 2425035, 2480294, 2530530, 2575209, 2614997, 2650896, 2683618, 2713684, 2741719, 2768261, 2793220, 2815372, 2832138, 2839972, 2835597, 2817749, 2788235, 2751458, 2712741, 2676638, 2646126, 2622749, 2607054, 2598693, 2596317, 2597774, 2600857, 2603856, 2605304, 2603270, 2595219, 2578655, 2551856, 2514149, 2465810, 2407830, 2341536, 2268369, 2190129, 2109317, 2028721, 1950352, 1874978, 1802908, 1734909, 1671940, 1614281, 1561478, 1513217, 1469701, 1430898, 1395875, 1363248, 1332175, 1302639, 1275006, 1249730]
50576A249730k2363j8972j5577j2544r582o161k365J042L579N543P511R626J1680
50563A201147J3535J5173J6529J7635J8801K0357K2302K4390K6415K8151K9164
50552A433599K9138K8293K7080K5557K3513K1228J9630J9360K0168K1364K2555
50541A691485K3714K5076K7359L1651L8332M6245N3584N9662O5367P1804P9042
50530B213321Q6389R3382J00032J06511J12988J19720J26652J32925J37248J39042
50520C368210J38883J37505J34563J28805J19403J06636R1187P3226N2703L0253
50510D381374P275j5001l6233n6513p5429r1785j04228j12041j15361j14668j10136
50499C557254j01536q8855p2892n4991l6314j7563N04J6778L0216M0264M6517
$$ y = [1249730, 1227367, 1208395, 1192818, 1180274, 1170692, 1164531, 1162166, 1163208, 1166787, 1172330, 1179841, 1189467, 1201147, 1214682, 1229855, 1246384, 1264019, 1282820, 1303177, 1325479, 1349869, 1376284, 1404435, 1433599, 1462737, 1491030, 1518110, 1543667, 1567180, 1588408, 1608038, 1627398, 1647566, 1668930, 1691485, 1715199, 1740275, 1767634, 1799285, 1837617, 1883862, 1937446, 1997108, 2062475, 2134279, 2213321, 2299710, 2393092, 2493124, 2599635, 2712623, 2832343, 2958995, 3091920, 3229168, 3368210, 3507093, 3644598, 3779161, 3907966, 4027369, 4134005, 4225192, 4298418, 4351121, 4381374, 4388649, 4373648, 4337415, 4280902, 4205473, 4113688, 4009460, 3897419, 3782058, 3667390, 3557254, 3455718, 3366863, 3293971, 3238980, 3202666, 3185103, 3185607, 3202385, 3232601, 3272865, 3319382]
50488C319382M8131M4073L3988J8527j223k4210m9066p3591r5264j12508j25225
50477B983014j33911j38537j38754j35057j29061j22314j15113j06935r7696q8059
50467A777577p8647o9562o0836n2795m5616l8974l2485k6312k0967j6708j3442
50456A321233j0979r024p038m527j503J580M387O920R270J1467J3608J5822J8049
50443A369265K0084K1949K3929K6194K8456L0095L0411K8752K4785J8911J2344
50432A635175O562K595P00M36R61J466J614J570J626J958K745M210O323Q696J1002
50417A687639J3374J6151J9456K3373K8281L4409M1060M6880N1311N5174N9418
50406B076526O3611O6344O6939O6025O4322O1628N7312N1380M4408L6707K8008
$$ y = [3319382, 3367513, 3411586, 3445574, 3464101, 3462878, 3438668, 3389602, 3316011, 3220747, 3108239, 2983014, 2849103, 2710566, 2571812, 2436755, 2307694, 2185380, 2070267, 1963332, 1865636, 1777577, 1698930, 1629368, 1568532, 1515737, 1470121, 1431147, 1398662, 1372350, 1351383, 1334675, 1321233, 1310254, 1301230, 1294192, 1289665, 1288162, 1289742, 1294129, 1301049, 1310319, 1321786, 1335394, 1351216, 1369265, 1389349, 1411298, 1435227, 1461421, 1489877, 1519972, 1550383, 1579135, 1603920, 1622831, 1635175, 1641737, 1644332, 1645032, 1645468, 1646429, 1647895, 1649509, 1651079, 1652705, 1654663, 1657408, 1661618, 1667941, 1676637, 1687639, 1701013, 1717164, 1736620, 1759993, 1788274, 1822683, 1863743, 1910623, 1961934, 2017108, 2076526, 2140137, 2206481, 2273420, 2339445, 2403767, 2465395, 2522707, 2574087, 2618495, 2655202, 2683210]
50395B683210J7899O212o993k1293l5769m9307o1148p0915p8100q2011q2362p9599
50383B139824p4360o6992n7873m7806l7537k7035j5889m530N487J2810J7460K0243
50371A863802K1247J9613J4804P466j324j1146k1952l3020m2864n0401n5582n8790
50359A651853o0193n9962n8579n6397n3275m9213m4998m1528l8667l5516l1763
50348A121762k8033k4727k1371j7458j3251r259n356j051L567P737J0621J1703
50336A034884J0776Q017M053l56m623q134j0125j0224q968p235n288k913l62J570
50322A001072K613L544N164P212Q785R528R806R777Q936O862M012J345o45k083
50308A075928l048l270k731k024j631j156J57K176L831M451M557M974N705O186
$$ y = [2683210, 2701109, 2707321, 2700328, 2679035, 2643266, 2593959, 2532811, 2461896, 2383796, 2301785, 2219423, 2139824, 2065464, 1998472, 1940599, 1892793, 1855256, 1828221, 1812332, 1807802, 1813289, 1826099, 1843559, 1863802, 1885049, 1904662, 1919466, 1926932, 1925608, 1914462, 1892510, 1859490, 1816626, 1766225, 1710643, 1651853, 1591660, 1531698, 1473119, 1416722, 1363447, 1314234, 1269236, 1227708, 1189041, 1153525, 1121762, 1093729, 1069002, 1047631, 1030173, 1016922, 1007663, 1002307, 1001256, 1004823, 1012560, 1023181, 1034884, 1045660, 1053677, 1057730, 1057374, 1052751, 1044617, 1034492, 1024268, 1015300, 1008065, 1002777, 999864, 999502, 1001072, 1003685, 1007229, 1012393, 1019605, 1028390, 1037918, 1047724, 1057501, 1066437, 1073299, 1077311, 1078656, 1078011, 1075928, 1072880, 1069610, 1066879, 1064855, 1063224, 1062068, 1062225, 1064401, 1068232, 1072683, 1077240, 1082214, 1087919, 1094105]
50294A094105O347O688P461Q304Q906R508J0392J0994R856N720j287r504j6890
50281A150600k2224k5175k5614k3482j9437j4903j1005p792m872k305l83J088
50269I94496K474L563L867L597L505L638L078J345o87j732j542q63k70L41J211
50254A016021K204L028L700M513N614O749P538P974Q447R205R990J0374J0294
50241A105651R986R641R526J0101J1542J3125J3775J3185J1906J0239P770M255
50229A230702K48l601p277j0893j3850j5262j4992j3667j1840r740p786o666o685
50216A108691p543r023j1474j5243j9803k3760k5768k5392k3283k0640j8430j6890
50204H91442j5641j4265j2732j1340j0332r695r273q975q794q672q456q025p375
$$ y = [1094105, 1100452, 1107140, 1114601, 1122905, 1131811, 1141319, 1151711, 1162705, 1172561, 1178281, 1176994, 1167490, 1150600, 1128376, 1103201, 1077587, 1054105, 1034668, 1019765, 1008760, 1000968, 996096, 993791, 993408, 994496, 996970, 1000533, 1004400, 1007997, 1011502, 1015140, 1018218, 1019563, 1018876, 1017144, 1015602, 1014739, 1014469, 1014810, 1016021, 1018225, 1021253, 1024953, 1029466, 1035080, 1041829, 1049367, 1057341, 1065788, 1074993, 1084983, 1095357, 1105651, 1115637, 1125278, 1134804, 1144905, 1156447, 1169572, 1183347, 1196532, 1208438, 1218677, 1226447, 1230702, 1230950, 1227349, 1220072, 1209179, 1195329, 1180067, 1165075, 1151408, 1139568, 1129828, 1122042, 1115376, 1108691, 1101148, 1092125, 1080651, 1065408, 1045605, 1021845, 996077, 970685, 947402, 926762, 908332, 891442, 875801, 861536, 848804, 837464, 827132, 817437, 808164, 799189, 790395, 781723, 773267, 765242, 757867]
50191G57867o587n787n203n075n364n671n694n625n788o023n792n014m289m131
50177F81824m278m077l374k651k383k494k547k271j820j462j166o70j7L30J37
50162F53081p7L59J298J938J998K056K551L117L255L172L453M241N196N991O391
50147F98020O163N345M396L653K896J905J139J213J995K902M014O061R208J2611
50133G61521J5467J7921K0567K3507K6302K8433K9533K9527K8853K8252K8053
50122A037936K7965K7838K8131K9112K9976K9442K7082K3456J8915J3026N570
50111A298449k495r628j5122j9404k3019k5863k7633k8492k8838k8527k6950k3984
50099A038494k0471j7455j5268j3708j2828j2963j3950j4939j5205j4817j4238
$$ y = [757867, 751280, 745493, 740290, 735215, 729851, 724180, 718486, 712861, 707073, 701050, 695258, 690244, 685955, 681824, 677546, 673469, 670095, 667444, 665061, 662567, 660020, 657749, 655929, 654467, 653301, 652631, 652614, 652944, 653081, 653004, 653363, 654661, 656599, 658597, 660653, 663204, 666321, 669576, 672748, 676201, 680442, 685638, 691629, 698020, 704183, 709528, 713924, 717577, 720473, 722378, 723517, 724730, 726725, 729627, 733641, 739702, 748910, 761521, 776988, 794909, 815476, 838983, 865285, 893718, 923251, 952778, 981631, 1009883, 1037936, 1065901, 1093739, 1121870, 1150982, 1180958, 1210400, 1237482, 1260938, 1279853, 1292879, 1298449, 1295954, 1286326, 1271204, 1251800, 1228781, 1202918, 1175285, 1146793, 1117955, 1089428, 1062478, 1038494, 1018023, 1000568, 985300, 971592, 958764, 945801, 931851, 916912, 901707, 886890, 872652]
50088H72652j3589j2569j1040r222p408n682m004k390r87LN09P80J247K014K722
50073H13036L046L255L877M881N608N608N175M829M627M273L658K869J805L23
50059H66870j228k130k202k141k622l394l771l741m006m864n629n488m446l174
50045H18034k143j337o29J8P71J903L400M851N906O693P571Q603R542J0320J1209
50030H84712J2309J3093J2883J1737J0536R965R706Q993P747O636O093N720M933
50017A005063L888L271L424L906M023L557K921K682L019L679M373N054N633N810
50003A060303N499N319O091P843R876J1787J3758J5428J5349J2328O959R84m691
49990A166833j0466j6560k2010k5616k7287k7984k8581k9242k9652k9480k8577
$$ y = [872652, 859063, 846494, 835454, 826232, 818824, 813142, 809138, 806748, 805761, 805764, 806273, 807053, 808300, 810314, 813036, 816082, 819337, 823214, 828095, 833703, 839311, 844486, 849315, 853942, 858215, 861873, 864742, 866547, 866870, 865642, 863512, 861310, 859169, 856547, 853153, 849382, 845641, 841635, 836771, 831142, 825654, 821208, 818034, 815891, 814554, 813925, 813943, 814714, 816617, 820017, 824868, 830774, 837467, 845038, 853641, 863183, 873503, 884712, 897021, 910114, 922997, 934734, 945270, 955235, 964941, 973934, 981681, 988317, 994410, 1000130, 1005063, 1008951, 1012222, 1015646, 1019552, 1023575, 1027132, 1030053, 1032735, 1035754, 1039433, 1043806, 1048860, 1054493, 1060303, 1065802, 1071121, 1077212, 1085055, 1094931, 1106718, 1120476, 1135904, 1151253, 1163581, 1170540, 1171524, 1166833, 1156367, 1139807, 1117797, 1092181, 1064894, 1036910, 1008329, 979087, 949435, 919955, 891378]
49979H91378k7028k5030k2723k0136j7370j4696j2441j0786r610q487o968n107
49967G10996l567k958l136l425l435l330l288l126k596j738q01J2O53J282K220
49952F83763L582N029O145P037Q089R123R299Q097N977L880K420J686J434J173
49938G56734M37p84k165l692n650p819r353r972j0556j1919j3402j3593j2143
49925F56123j0041q150o464m885l796l345k879j687K3J402K071K427K951L577
49911F27327L941L973M035M446N091N640O089O729P589Q304Q765R444J0653J1849
49897G23875J2221J1749J0998J0063Q453O054L457J089j238l685n918p714r363
49884G60041j1045j2263j2511j2064j1541j1063j0390r679r318r163q559p157
$$ y = [891378, 864350, 839320, 816597, 796461, 779091, 764395, 751954, 741168, 731558, 723071, 716103, 710996, 707429, 704471, 701335, 697910, 694475, 691145, 687857, 684731, 682135, 680397, 679596, 679608, 680261, 681543, 683763, 687345, 692374, 698519, 705556, 713645, 722768, 732067, 740164, 746141, 750021, 752441, 754127, 755561, 756734, 757171, 756387, 754222, 750530, 744880, 737061, 727708, 717736, 707180, 695261, 681859, 668266, 656123, 646082, 637932, 631468, 626583, 622787, 619442, 616563, 614876, 614899, 616301, 618372, 620799, 623750, 627327, 631268, 635241, 639276, 643722, 648813, 654453, 660542, 667271, 674860, 683164, 691929, 701373, 712026, 723875, 736096, 747845, 758843, 768906, 777359, 783413, 786870, 787959, 786721, 783036, 777118, 769404, 760041, 748996, 736733, 724222, 712158, 700617, 689554, 679164, 669485, 660167, 651004, 642445, 635288]
49872F35288n295l553k386k004k133j906o42J208K522K955L354M497O044P113
$$ y = [635288, 629993, 626440, 624054, 622050, 619917, 618011, 617369, 618577, 621099, 624054, 627408, 631905, 637949, 645062]
$$ [...]
##END NTUPLES=NMR SPECTRUM
##END=
