##TITLE=AC1417_GUARH12227_7763989_HObMMIYiT9
##JCAMPDX= 6.0         $$ Bruker NMR JCAMP-DX V2.0
##DATA TYPE= NMR SPECTRUM
##DATA CLASS= NTUPLES
##ORIGIN= BRUKER
##OWNER= Administrator
$$ 1.72 TOPSPIN		Version 2.1
$$ 2013-04-17 01:24:01.541 -0700  Administrator@X
$$ Compression mode = diff/dup
##.OBSERVE FREQUENCY= 400.02188249412
##.OBSERVE NUCLEUS= ^1H
##.ACQUISITION MODE= SIMULTANEOUS (DQD)
##.ACQUISITION SCHEME= undefined
##.AVERAGES= 64
##.DIGITISER RES= 22
##SPECTROMETER/DATA SYSTEM= spect
##.PULSE SEQUENCE= noesygpps1d.comp
##.SOLVENT NAME= COFFEE_meoh
##.SHIFT REFERENCE= INTERNAL, COFFEE_meoh, 1, 14.96104
##AUDIT TRAIL= $$ (NUMBER, WHEN, WHO, WHERE, PROCESS, VERSION, WHAT)
$$ ##TITLE= Audit trail, TOPSPIN		Version 2.1
$$ ##JCAMPDX= 5.01
$$ ##ORIGIN= Bruker BioSpin GmbH
$$ ##OWNER= Administrator
$$ $$ E:\/data/COFFEE/nmr/AC1417_GUARH12227_7763989_HObMMIYiT9/12/pdata/1/auditp.txt
$$ ##AUDIT TRAIL=  $$ (NUMBER, WHEN, WHO, WHERE, PROCESS, VERSION, WHAT)
(   1,<2013-04-17 01:23:56.385 -0700>,<Administrator>,<X>,<go>,<TOPSPIN 2.1>,
      <created by zg
	started at 2013-04-17 01:12:26.337 -0700,
	POWCHK enabled, PULCHK disabled,
       configuration hash MD5:
       33 CF 6A 21 5C D3 B9 40 6C 15 AA 8D 27 A2 4F 13
       data hash MD5: 64K
       09 04 54 F1 60 63 32 76 08 D9 D7 07 9F 57 7E E1>)
(   2,<2013-04-17 01:23:59.385 -0700>,<Administrator>,<X>,<proc1d>,<TOPSPIN 2.1>,
      <Start of raw data processing
       efp LB = 0.3 FT_mod = 6 PKNL = 1 PHC0 = 0 PHC1 = 0 SI = 128K 
       data hash MD5: 128K
       B0 13 8E 79 A7 2F DF 78 F1 34 D4 67 D5 E6 96 E2>)
(   3,<2013-04-17 01:24:00.416 -0700>,<Administrator>,<X>,<proc1d>,<TOPSPIN 2.1>,
      <pk PHC0 = -76.4209 PHC1 = 0 
       data hash MD5: 128K
       DC F9 D9 F9 AF DD A8 CB 81 73 FF 0D 2E D0 AD 5F>)
(   4,<2013-04-17 01:24:00.901 -0700>,<Administrator>,<X>,<proc1d>,<TOPSPIN 2.1>,
      <abs ABSG = 1 
       data hash MD5: 128K
       26 8D D0 7E 9D 5D 2F 09 62 E1 7D 23 D2 15 EB 36>)
(   5,<2013-04-17 01:24:01.041 -0700>,<Administrator>,<X>,<proc1d>,<TOPSPIN 2.1>,
      <abs ABSG = 2 
       data hash MD5: 128K
       FE B4 1B 34 02 EE 81 20 FD 96 07 5A 05 34 A4 CB>)
(   6,<2013-04-17 01:24:01.135 -0700>,<Administrator>,<X>,<proc1d>,<TOPSPIN 2.1>,
      <abs ABSG = 3 
       data hash MD5: 128K
       FC 00 3A 05 A1 D5 3A B6 99 52 9F B4 84 5F FB 23>)
(   7,<2013-04-17 01:24:01.245 -0700>,<Administrator>,<X>,<proc1d>,<TOPSPIN 2.1>,
      <abs ABSG = 4 
       data hash MD5: 128K
       68 86 0D A2 F8 53 33 2E 2A 74 EB 90 B0 9A CE C5>)
(   8,<2013-04-17 01:24:01.338 -0700>,<Administrator>,<X>,<proc1d>,<TOPSPIN 2.1>,
      <abs ABSG = 5 
       data hash MD5: 128K
       F5 A5 09 CE 96 B4 59 66 4F F6 D7 B5 3E EE 26 E2>)
$$ ##END=
$$ 
$$ $$ hash MD5
$$ $$ FA A1 6F 63 6F EB B6 5C 39 0A B4 15 FD 6B 1D DD
##$RELAX= 
##$RELAX= 
##$RELAX= 
##$RELAX= 
##$RELAX= 
##$RELAX= 
##$RELAX= 
##$RELAX= 
$$ Bruker specific parameters
$$ --------------------------
##$DU= <E:\>
##$EXPNO= 12
$$ [...]
##$TP07= 0
##$TPNAME0= <>
##$TPNAME1= <>
##$TPNAME2= <>
##$TPNAME3= <>
##$TPNAME4= <>
##$TPNAME5= <>
##$TPNAME6= <>
##$TPNAME7= <>
##$TPOAL= (0..7)
0.5 0.5 0.5 0.5 0.5 0.5 0.5 0.5
##$TPOFFS= (0..7)
0 0 0 0 0 0 0 0
##$TUNHIN= 0
##$TUNHOUT= 0
##$TUNXOUT= 0
##$USERA1= <user>
##$USERA2= <user>
##$USERA3= <user>
##$USERA4= <user>
##$USERA5= <user>
##$V9= 5
##$VALIST= <valist>
##$VCLIST= <CCCCCCCCCCCCCCC>
##$VD= 0
##$VDLIST= <DDDDDDDDDDDDDDD>
##$VPLIST= <PPPPPPPPPPPPPPP>
##$VTLIST= <TTTTTTTTTTTTTTT>
##$WBST= 2048
##$WBSW= 25
##$XGAIN= (0..3)
0 0 0 0
##$XL= 0
##$YL= 0
##$YMAX_a= 5019127
##$YMIN_a= -11054733
##$ZGOPTNS= <>
##$ZL1= 120
##$ZL2= 120
##$ZL3= 120
##$ZL4= 120
##$ABSF1= 14.96104
##$ABSF2= -5.597142
##$ABSG= 5
##$ABSL= 3
##$ALPHA= 0
##$AQORDER= 0
##$ASSFAC= 0
##$ASSFACI= 0
##$ASSFACX= 0
##$ASSWID= 0
##$AUNMP= <proc_prof1d_extract.lims>
##$AXLEFT= 0
##$AXNAME= <>
##$AXNUC= <1H>
##$AXRIGHT= 0
##$AXTYPE= 0
##$AXUNIT= <>
##$AZFE= 0.1
##$AZFW= 0.1
##$BCFW= 0
##$BC_mod= 0
##$BYTORDP= 0
##$COROFFS= 0
##$CY= 15
##$DATMOD= 1
##$DC= 0
##$DFILT= <>
##$DTYPP= 0
##$F1P= 0
##$F2P= 0
##$FCOR= 0.5
##$FTSIZE= 131072
##$FT_mod= 6
##$GAMMA= 0
##$GB= 0
##$INTBC= 1
##$INTSCL= 1
##$ISEN= 128
##$LB= 0.3
##$LEV0= 0
##$LPBIN= 0
##$MAXI= 10000
##$MC2= 0
##$MEAN= 0
##$ME_mod= 0
##$MI= 0
##$NCOEF= 0
##$NC_proc= -2
##$NLEV= 6
##$NOISF1= 0
##$NOISF2= 0
##$NSP= 0
##$NTH_PI= 0
##$NZP= 0
##$OFFSET= 14.96104
##$PC= 1
##$PHC0= -76.4209
##$PHC1= 0
##$PH_mod= 1
##$PKNL= yes
##$PPARMOD= 0
##$PPDIAG= 0
##$PPIPTYP= 0
##$PPMPNUM= 2147483647
##$PPRESOL= 1
##$PSCAL= 4
##$PSIGN= 0
##$PYNMP= <proc.py>
##$REVERSE= no
##$SF= 400.020009622519
##$SI= 131072
##$SIGF1= 0
##$SIGF2= 0
##$SINO= 400
##$SIOLD= 131072
##$SPECTYP= <>
##$SREGLST= <1H.CDCl3>
##$SSB= 0
##$STSI= 131072
##$STSR= 0
##$SW_p= 8223.68421052631
##$SYMM= 0
##$S_DEV= 0
##$TDeff= 65536
##$TDoff= 0
##$TI= <>
##$TILT= no
##$TM1= 0
##$TM2= 0
##$TOPLEV= 0
##$USERP1= <user>
##$USERP2= <user>
##$USERP3= <user>
##$USERP4= <user>
##$USERP5= <user>
##$WDW= 1
##$XDIM= 131072
##$YMAX_p= 401133452
##$YMIN_p= -11955
##$CURPLOT= <Network HP LaserJet P1505>
##$CURPRIN= <$Network HP LaserJet P1505>
##$DFORMAT= <normdp>
##$LAYOUT= <+/1D_H.xwp>
##$LFORMAT= <normlp>
##$PFORMAT= <normpl>
##$SURQMSG= 1
$$ End of Bruker specific parameters
$$ ---------------------------------
##NTUPLES= NMR SPECTRUM
##VAR_NAME=  FREQUENCY,     SPECTRUM/REAL,   SPECTRUM/IMAG
##SYMBOL=    X,             R,               I
##VAR_TYPE=  INDEPENDENT,   DEPENDENT,       DEPENDENT
##VAR_FORM=  AFFN,          ASDF,            ASDF
##VAR_DIM=   131072,        131072,          131072
##UNITS=     HZ,            ARBITRARY UNITS, ARBITRARY UNITS
##FACTOR=    0.0627417313425164, 1,          1
##FIRST=     8223.62146879497, 697,          -38163
##LAST=      0,             1409,            -39002
##MIN=       0,             -11955,          0
##MAX=       8223.62146879497, 401133452,    0
$$ Real data points
##PAGE= N=1
##DATA TABLE= (X++(R..R)), XYDATA
$$ [...]
63933B473264K62491K80183K96139L10117L20797L26062L24035L13894K95639
63924E202621K69522K36247J97559J55794J12357O7105J9517k9891p9625j28114
63914F023092j73907k15182k49889k76657k95317l06600l11608l11494l07029
63905C575409k98327k85247k68242k48555k27503k05875j84081j62616j42122
63896A552841j23217j06332r1598p8879o8072n9287n2469m6965m2008l7630l4540
63885H11844l2840l1466k9268k6215k3087k0390j8127j6320j5084j4229j3416
63874E71402j2691j2360j2279j1796j0584r094p956p213o383m991k872j50K887
63861D75920N902Q628J0821J2297J3238J4362J6332J8977K1491K3489K5367K7463
$$ plain form
63933 2473264 2735755 3015938 3312077 3622194 3942991 4269053 4593088 4906982 5202621
63924 5202621 5472143 5708390 5905949 6061743 6174100 6241205 6260722 6230831 6151206 6023092
63914 6023092 5849185 5634003 5384114 5107457 4812140 4505540 4193932 3882438 3575409
63905 3575409 3277082 2991835 2723593 2475038 2247535 2041660 1857579 1694963 1552841
63896 1552841 1429624 1323292 1231694 1152815 1084743 1025456 972987 926022 884014 846384 811844
63885 811844 779004 747538 718270 692055 668968 648578 630451 614131 599047 584818 571402
63874 571402 558711 546351 534072 522276 511692 502598 494642 487429 481046 476055 473183 473033 475920
63861 475920 481822 490450 501271 513568 526806 541168 557500 576477 597968 621457 646824 674287
63849F74287K9441L0820L1681L2349L2679L2277L1181K9749K7956K5346K1767
63838I99533J7573J3038Q062K696k556p312j1780j6266k0542k4127k6946k9231
63826I02142l0906l1715l1893l2174l2887l3534l3514l2794l1574k9792k7458
63815E53901k5108k3353k2047k0500j8439j6229j4188j2299j0700r790r561r399
63803C62288q870q200p602o735n422m390m536n693o791p087o628n712m676m084
63789B75862m272m617m125k840j907j932k196j933j471j446j614j398j041j277
63775B43793j966k164j487o60m35p37j136j524j926k063j673j035p31r07j065
63760B24284p19l0L67J38l16l52P6L27q8q59j263r96l86N4N9k37l15M09J888L230
$$ plain form
63849 674287 703728 734548 766229 798578 831257 863534 894715 924464 952420 977766 999533
63838 999533 1017106 1030144 1038206 1040902 1038346 1031034 1019254 1002988 982446 958319 931373 902142
63826 902142 871236 839521 807628 775454 742567 709033 675519 642725 611151 581359 553901
63815 553901 528793 505440 483393 462893 444454 428225 414037 401738 391038 381248 371687 362288
63803 362288 353418 345218 337616 330881 325459 321069 316533 310840 304049 296962 290334 284622 279946 275862
63789 275862 271590 266973 262848 260008 258101 256169 253973 252040 250569 249123 247509 246111 245070 243793
63775 243793 241827 239663 238176 237516 237081 236344 235208 233684 231758 229695 228022 226987 226256 225349 224284
63760 224284 223565 223535 223902 224040 223724 223372 223448 223775 223687 222828 221565 220569 220183 220237 220296 220059 219744 220153 222041 225271
63740B25271L505K792J989J701J696J500J101Q63J035J611K419L146L453L262
63726B55344K845K600K805L571M789O054O878P111O976O605N823M512K976J678
63712C20567P25j32j068j909k357k356k193k229k572k998l224l131k703j888p09
63697B91823N14J314J499J331J239J464J956K395K394J847J103O50N99O16L28
63682C11072l91j401k261k282j077Q08K156K278J679J363J666K123K297K309K495
63667C22834K833K934K586K060J786J729J349L08j019k014k676l608n015o176
63653C17911o182n028l700l168l477l851l559k650j780j399j267q67o8Q71J758
63638B83544K544L030K966K508K200K341K720L059L420L989M776N677O561P162
$$ plain form
63740 225271 228776 231568 233557 235258 236954 238454 239555 240418 241453 243064 245483 248629 252082 255344
63726 255344 258189 260789 263594 267165 271954 278008 284886 291997 298973 305578 311401 315913 318889 320567
63712 320567 321292 321160 320092 318183 315826 313470 311277 309048 306476 303478 300254 297123 294420 292532 291823
63697 291823 292337 293651 295150 296481 297720 299184 301140 303535 305929 307776 308879 309529 310128 310744 311072
63682 311072 310681 309280 307019 304737 303660 304468 306624 308902 310581 311944 313610 315733 318030 320339 322834
63667 322834 325667 328601 331187 333247 335033 336762 338111 338419 337400 335386 332710 329102 324087 317911
63653 317911 311729 306701 303001 299833 296356 292505 288946 286296 284516 283117 281850 280983 280915 281786 283544
63638 283544 286088 289118 292084 294592 296792 299133 301853 304912 308332 312321 317097 322774 329335 336497
63624C36497P257P166P645R020J0712J1962J2736J3604J4910J6531J8270K0092
63612D86402K2017K4083K6500K9523L3064L6460L8714L9053L7445L4491L0620
63601H38372K5508J8674J0631K911l265p825j1137j3151j3758j3509j3294j3537
63589H06620j4241j5602j7869k0693k3234k4947k5843k6025k5408k4002k1998
63578E66758j9583j6901j4177j1571q987o417m238k778j713m36J081K329L110
63565D86477L713M261M516M499M647N189N855O434P104P996Q996J0277J2441J5714
63551E88119J9420K2746K5708K8877L2448L6178L9941M3629M6359M6326M1982
63540I71733L3334K2052J0339j44q566j4524j7811j8631j7800j6440j5431j5147
$$ plain form
63624 336497 343754 350920 358565 367585 378297 390259 402995 416599 431509 448040 466310 486402
63612 486402 508419 532502 559002 588525 621589 658049 696763 735816 773261 807752 838372
63601 838372 863880 882554 893185 896096 892831 885006 873869 860718 846960 833451 820157 806620
63589 806620 792379 776777 758908 738215 714981 690034 664191 638166 612758 588756 566758
63578 566758 547175 530274 516097 504526 495539 489122 484884 482106 480393 479957 481038 483367 486477
63565 486477 490190 494451 498967 503466 508113 513302 519157 525591 532695 540691 549687 559964 572405 588119
63551 588119 607539 630285 655993 684870 717318 753496 793437 837066 883425 929751 971733
63540 971733 1005067 1027119 1037458 1037314 1028748 1014224 996413 977782 959982 943542 928111 912964
63528I12964j5570j6547j8076k0443k3878k7889l1263l3051l3325l2728l1616
63517F28578l0087k8435k6902k5150k2696j9813j7294j5348j3541j1744j0357
63506D07211r389q241o818n909n954o144n407l815k305j465j143r95q50p02p44
63491C47330j182j703j601p04K46O14P28J208J906K236K196K311K817L526M326
63476C64254N134N501M993L888K915K294J586M41j008k414l404l631l183k792
63462C74574l071l679l858l601l548l788l633k672j339j56Q40J729K282K321K053
63447C54454J905K201L104M446N677O395O837P442Q069Q409Q951J0666J3706J7311
63433D59573K1154K5575L0158L3189L3279L0760K6879K2461J8105J4831J3431
$$ plain form
63528 912964 897394 880847 862771 842328 818450 790561 759298 726247 692922 660194 628578
63517 628578 598491 570056 543154 518004 495308 475495 458201 442853 429312 417568 407211
63506 407211 397822 389581 382763 376854 370900 364756 359349 355534 353229 351764 350621 349626 348776 348074 347330
63491 347330 346148 344445 342844 342140 342386 343000 343728 344936 346842 349078 351274 353585 356402 359928 364254
63476 364254 369388 374889 379882 383770 386685 388979 390565 391006 389998 387584 384180 380549 377366 374574
63462 374574 371503 367824 363966 360365 356817 353029 349396 346724 345385 345229 346069 347798 350080 352401 354454
63447 354454 356359 358560 361664 366110 371787 378182 385019 392461 400530 408939 417890 428556 442262 459573
63433 459573 480727 506302 536460 569649 602928 633688 660567 683028 701133 715964 729395
63422G29395J3581J4520J6324J9641K4443K9853L4990L9241M1893M2328M0483
63411A046692L6403K9651K0104R306r6o574j0727j3867j6435j8167j9052j9524
63399A037714k0059k1054k2788k5219k7946l0577l2810l4235l4472l3719l2600
63388G22235l1245k9130k6167k3309k1452k0146j8156j5078j1737q979o770m626
63376E05440k426n27P18J379K070L614O260R229J1425J2649J3771J5573J7843
63363E97018J9925K1702K3633K6008K8683L1523L4631L8061M1520M4430M6011
63352I53145M5363M1878L5744K7871J9171J0194J520n950j1472j5097j7477j9146
63340A065744k0279k1002k1516k1977k2649k4082k6710l0051l2796l3961l3766
$$ plain form
63422 729395 742976 757496 773820 793461 817904 847757 882747 921988 963881 1006209 1046692
63411 1046692 1083095 1112746 1132850 1142156 1142060 1135486 1124759 1110892 1094457 1076290 1057238 1037714
63399 1037714 1017655 996601 973813 948594 920648 890071 857261 823026 788554 754835 722235
63388 722235 690990 661860 635693 612384 590932 570786 552630 537552 525815 516836 510066 505440
63376 505440 503014 502487 503205 504584 506654 510268 516528 525757 537182 549831 563602 579175 597018
63363 597018 616943 638645 662278 688286 716969 748492 783123 821184 862704 907134 953145
63352 953145 998508 1040386 1076130 1104001 1123172 1133366 1134886 1128936 1117464 1102367 1084890 1065744
63340 1065744 1045465 1024463 1002947 980970 958321 934239 907529 877478 844682 810721 776955
63329G76955l3104l2415l1397k9592k6952k3829k0720j7946j5304j2102p825l000
63317E22769Q46K255Q90k418o413j0112j2972j4781j5549j5433j4635j3325j1696
63304D09426r982q340o789n370m294l698l312k722k009j764k231k870l126l232
63290C49687l668m102l700k510j663j918k687k966k631k200j827j274o86o34j280
63275C15941k056k301j895j163n31l42o57j116j199p74k05R1L3j81l26k82j19
63258C02918m7r9L2O42J526K115K096J665J153P19M13K95L42M59N97P05O33L86
63240C16550L09O50R69N96k71n69K01J145J165M88K75R55J774K075K217K798L530
63223C34857L550K654J669J475K049K644K725K432K230K350K708L144L604M081
$$ plain form
63329 776955 743851 711436 680039 650447 623495 599666 578946 561000 545696 533594 525769 522769
63317 522769 523615 525870 526760 524342 517929 507817 494845 480064 464515 449082 434447 421122 409426
63304 409426 399444 391104 384315 378945 374651 370953 367641 364919 362910 361146 358915 356045 352919 349687
63290 349687 346019 341917 338217 335707 334044 332126 329439 326473 323842 321642 319815 318541 317855 317221 315941
63275 315941 313885 311584 309689 308526 307995 307653 306996 305880 304681 303907 303702 303793 303826 303645 303319 303037 302918
63258 302918 302871 302772 302804 303446 304972 307087 309183 310848 312001 312720 313133 313428 313770 314229 314826 315531 316164 316550
63240 316550 316859 317509 318478 319074 318803 318234 318435 319580 320745 321233 321508 322463 324237 326312 328529 331327 334857
63223 334857 338407 341061 342730 344205 346254 348898 351623 354055 356285 358635 361343 364487 368091 372172
63209C72172M555N021N459N767N839N680N370M902M228L466K885K605K488K445
63195D32882K671L313M058M345M060L747M023M948O140P311Q477R650J0625J1271
63181E17521J1864J2841J4227J5471J6032J5932J5545J5044J4304J3361J2556
63170F74698J2087J1700J1084J0331R690R037P988O535N118L915K400q0l509p245
63156G53749j0715j3718j6148j7797j8551j8583j8225j7790j7514j7391j7041
63145E70276j6019j4373j2657j1210r736p895o005m744m258l987l377k376j196
63132D72443m9P71R81P64Q80J927L603N004N632N860O336P135P669P478O894O692
63116E40020P046P284O846O143N901O037N899N492N534O113O218N151L631K797
$$ plain form
63209 372172 376727 381748 387207 392974 398813 404493 409863 414765 418993 422459 425344 427949 430437 432882
63195 432882 435553 438866 442924 447269 451329 455076 459099 464047 470187 477498 485975 495625 506250 517521
63181 517521 529385 542226 556453 571924 587956 603888 619433 634477 648781 662142 674698
63170 674698 686785 698485 709569 719900 729590 738627 746615 753150 758268 762183 764583 764503 760994 753749
63156 753749 743034 729316 713168 695371 676820 658237 640012 622222 604708 587317 570276
63145 570276 554257 539884 527227 516017 506281 498386 492381 487637 483379 479392 476015 473639 472443
63132 472443 472394 473165 474146 474910 475790 477717 481320 486324 491956 497816 504152 511287 518956 526434 533328 540020
63116 540020 547066 554350 561196 567339 573240 579277 585176 590668 596202 602315 608533 613684 617315 620112
63102F20112K744K817K845L105L379L153K739L099M325N278N157M670M985O085
63088F74493O900O773O136N671N370M639L195J498J86q28k271m446o646q033q746
63073F83891r545j0524j0984j0593r904r461r108q495p696o821n589l831k065
63060E79275r97n90j45Q36K182L399M152M496M856N683O970Q242R068R378R318
63045F46123R082Q981R223R520R385Q910Q728Q977Q994Q314P301O329N160L700
63031G58727K668K575K652J766M7j438k324l183m191m767m768n005o118p635q548
63016G20458q343p232n828m745m139l505k338q38N94K299M960Q328J1354J3666
63002G24691J5834J8046J9706K0784K2308K4653K6489K6442K5061K3968K3685
$$ plain form
63102 620112 622856 625673 628518 631623 635002 638155 640894 643993 648318 653596 658753 663423 668408 674493
63088 674493 681393 688166 694302 699973 705343 709982 713177 714675 714861 714033 711762 707316 700670 692637 683891
63073 683891 674346 663822 652838 642245 632341 622880 613772 605277 597581 590760 585171 581340 579275
63060 579275 578278 577688 577543 578379 580561 583960 588112 592608 597464 603147 610117 618359 627427 636805 646123
63045 646123 655205 664186 673409 682929 692314 701224 709952 718929 727923 736237 743538 749867 755027 758727
63031 758727 761395 763970 766622 768388 768435 766997 764673 761490 757299 752532 747764 742759 736641 729006 720458
63016 720458 712115 704883 699055 694310 690171 686666 684328 683490 684084 686383 691343 699671 711025 724691
63002 724691 740525 758571 778277 799061 821369 846022 872511 898953 924014 947982 971667
62991I71667K3460K2845K2233K1935K1841K1970K2437K2765K2134K0408J8182
62980A211877J5637J2202P576K286l033q289j3468j8189k2184k5737k9124l1977
62968A097577l3680l4160l3826l2909l1347k9242k7056k5243k3909k2886k1994
62957G81325k1163k0418j9755j9125j8525j8077j7819j7440j6432j4703j2899
62946E84969j1911j2020j2562j2561j1688j0519r819r650r401q635p545o480n426
62933D56752m308l445l246l510l524k905j943j083m27Q9M00M15K55J64K05K13
62917D34102m0n99j241j644j716j649j607j517j334j222j234j099o62k93m04o94
62901D17147m99K28Q89J248J804K919M223N197N829O307O515O311N994O048O531
$$ plain form
62991 971667 995127 1017972 1040205 1062140 1083981 1105951 1128388 1151153 1173287 1193695 1211877
62980 1211877 1227514 1239716 1247292 1249578 1246545 1238256 1224788 1206599 1184415 1158678 1129554 1097577
62968 1097577 1063897 1029737 995911 963002 931655 902413 875357 850114 826205 803319 781325
62957 781325 760162 739744 719989 700864 682339 664262 646443 629003 612571 597868 584969
62946 584969 573058 561038 548476 535915 524227 513708 503889 494239 484838 476203 468658 462178 456752
62933 456752 452444 448999 445753 442243 438719 435814 433871 432788 432361 432450 432850 433265 433520 433684 433889 434102
62917 434102 434062 433463 432222 430578 428862 427213 425606 424089 422755 421533 420299 419200 418538 418245 417841 417147
62901 417147 416648 416876 417765 419013 420817 423736 427959 433156 438985 445292 451807 458118 464112 470160 476691
62886D76691P037P154O783O151N595N117M219K537O16o46j385k737n014o912p258
62871D97948o768p013q179r020q785p964p230o675o330o322o296n577m300l459
62857D04030l448l451k755j877j632j852j780j283q60q01j078j689k436k671k003
62842C74414j045o66p78p28o52j342k656l247k326p88N7J40K79P34R74O46L2m56
62824C62592o48m83l3L43L23J26K44O05N69m3n32k23N29Q36M43j25m74p48j015
62805C62286r21k67M37N52J92R8N97J185J156L58q55k000k636k473j659q70p40
62788C54440j185j503j090J3J266K115K371K293K342K774L494M299N069N602N519
62773C87819M689L649L146L312L599L572L330L065K654J991J293O83j85j556k841
$$ plain form
62886 476691 483728 490882 497665 503816 509411 514528 518747 521284 521900 521254 519869 517132 512118 505206 497948
62871 497948 491180 484167 475988 466968 458183 450219 442989 436314 429984 423662 417366 411789 407489 404030
62857 404030 400582 397131 394376 392499 390867 389015 387235 385952 385092 384291 383213 381524 379088 376417 374414
62842 374414 373369 372703 371925 371197 370545 369203 366547 363300 360974 360186 360243 360383 360662 361396 362370 363016 363048 362592
62824 362592 361944 361461 361428 361771 362094 362220 362464 363069 363638 363595 363063 362840 363369 364205 364648 364523 364049 363301 362286
62805 362286 361365 361098 361535 362087 362279 362377 362974 364159 365315 365673 364818 362818 360182 357709 356050 355180 354440
62788 354440 353255 351752 350662 350675 351941 354056 356427 358720 361062 363836 367330 371629 376698 382300 387819
62773 387819 392508 396157 399303 402615 406214 409786 413116 416181 418835 420826 422119 422802 422617 421061 418220
62758D18220l055k105j096j158k261l491m220m584m970n381n542n390n194n156
62744C64617n071m588l727k948k619k607k557k393k271k124j657q90l21l20o05
62729C29919o26l44j78k60j57M39J122J238Q06N89J212K491L756M543M831M857
62713C54238M970N525O590P707Q294Q354Q602R703J1625J3794J5775J7583J9487
62700D92247K1653K3910K5807K7066K8104K9827L2635L5901L8735M1045M3265
62689H40195M5247M6093M5295M3350M0846L7383L2068K4821J6613Q409L76p804
62677A172892j6140k4054l0682l5471l8692m1287m3877m5944m6384m4892m2393
62666G63076l9884l7421l4573l1519k8970k7109k5215k2630j9692j7283j5706
$$ plain form
62758 418220 415165 413060 411964 410806 408545 405054 400834 396250 391280 385899 380357 374967 369773 364617
62744 364617 359546 354958 351231 348283 345664 343057 340500 338107 335836 333712 332055 331165 330844 330524 329919
62729 329919 329293 328949 328771 328511 328354 328793 329915 331153 331959 332548 333760 336251 340007 344550 349381 354238
62713 354238 359208 364733 371323 379030 387324 395678 404280 413983 425608 439402 455177 472760 492247
62700 492247 513900 537810 563617 590683 618787 648614 681249 717150 755885 796930 840195
62689 840195 885442 931535 976830 1020180 1061026 1098409 1130477 1155298 1171911 1180320 1180696 1172892
62677 1172892 1156752 1132698 1102016 1066545 1027853 986566 942689 896745 850361 805469 763076
62666 763076 723192 685771 651198 619679 590709 563600 538385 515755 496063 478780 463074
62655D63074j4374j2657j0687r058q030p289o539n968n877o057n879n055m065
62642C61539l662l983m291l676j961M3J229J174L67m52r81j275j333j146j003
62627C40589j291j922k412k628k946l431l422k438j094m57o80r13n94j08j6j74
62611C16063n0M73J004J194R77M43k22p11p75n08k16KL21P66R64N62j49l77K75
62592C20036J290J888K019K282K878L214K816K094J710J641J487J383J768K329
62578C48835K092Q37m65r81j085j494k068k166j810j569j566j368q36m37n44j032
62562C34343j586j954j813r74J21O41L54m9J48Q30J418J681J783J825J736J557
62546C40061J444J427J362J153Q14M15N7j14n7R4J98L12N89J054J516J758J697
$$ plain form
62655 463074 448700 436043 425356 416298 408268 400979 394440 388472 382595 376538 370659 365604 361539
62642 361539 357877 353894 349603 345927 343966 344009 345238 346412 346779 346327 345346 344071 342738 341592 340589
62627 340589 339298 337376 334964 332336 329390 325959 322537 320099 319005 318548 317868 316955 316361 316253 316237 316063
62611 316063 316013 316486 317490 318684 319661 320104 319882 319171 318396 317888 317672 317674 317995 318761 319725 320287 320138 319761 320036
62592 320036 321326 323214 325233 327515 330393 333607 336423 338517 340227 341868 343355 344738 346506 348835
62578 348835 350927 351764 351299 350318 349233 347739 345671 343505 341695 340126 338560 337192 336356 335919 335375 334343
62562 334343 332757 330803 328990 328016 328137 328778 329132 329083 329231 330061 331479 333160 334943 336768 338504 340061
62546 340061 341505 342932 344294 345447 346261 346676 346733 346619 346562 346656 346854 347166 347755 348809 350325 352083 353780
62529C53780J434J217J292J747K486L283L846L987L872M070N090O878Q919J0823
62515D12724J2563J4200J5714J7237J9078K1370K3821K6052K7947K9533L0747
62504F50986L1462L1535L0729K8840K6084K3057K0043J6671J2678Q761O144N282
62492H92272N501O021O919Q775J1668J4971J8114K1260K4968K9278L3403L6367
62480A109517L7765L7568L5489L1074K4620J7419J0635M125l195j1943k1545l0886
62468A240643l9162m6025n1302n4903n6841n7162n5917n3383n0200m7008m3854
62457F84886m0151l5427l0088k5148k1141j7624j4007j0551q007o408m932l140
62445D68262j623j050j046o05O92K432M108N525O559P033O894O203M996L475K114
$$ plain form
62529 353780 355214 356431 357723 359470 361956 365239 369085 373072 376944 381014 386104 392982 401901 412724
62515 412724 425287 439487 455201 472438 491516 512886 536707 562759 590706 620239 650986
62504 650986 682448 713983 744712 773552 799636 822693 842736 859407 872085 880846 886990 892272
62492 892272 897773 903794 910713 919488 931156 946127 964241 985501 1010469 1039747 1073150 1109517
62480 1109517 1147282 1184850 1220339 1251413 1276033 1293452 1304087 1308212 1305017 1293074 1271529 1240643
62468 1240643 1201481 1155456 1104154 1049251 992410 935248 879331 825948 775748 728740 684886
62457 684886 644735 609308 579220 554072 532931 515307 501300 490749 482742 476334 471402 468262
62445 468262 466639 465589 464543 463938 464630 467062 471170 476695 483254 490287 497181 503384 508380 511855 513969
62430E13969J121L3j668l687n263o279p232q144q299p362o039n221n054n219n496
62415D40160n624n116l878k584j929j773j567j238j005o79O2P84N82o01j610j375
62399D12609m3J408K327K730K895K987L058L110L173L313L516L569L277K802K582
62384D53313K864L586M684O109P431P936P439O680O494O834P094P159P541Q502
62370E43666R670J0743J2011J3724J5442J6559J7335J8820K1685K5617L0000L4691
62358G69963L9869M5450N1066N6394O1074O4331O5202O3299N9084N3201M5742
62347A374675L6477K5675J4433M093m570j1625j7628k3111k8300l3065l6990l9607
62335A260457m0811m1054m0968m0664l9576l7224l3978l0794k8230k6057k3928
$$ plain form
62430 513969 515090 515123 513455 509768 504505 498226 490994 482850 474551 467189 461150 455929 450875 445656 440160
62415 440160 434536 429420 425542 422958 421029 419256 417689 416451 415446 414767 414829 415613 416195 415594 413984 412609
62399 412609 412566 413974 416301 419031 421926 424913 427971 431081 434254 437567 441083 444652 447929 450731 453313
62384 453313 456177 459763 464447 470556 477987 485923 493362 500042 506536 513370 520464 527623 535164 543666
62370 543666 553336 564079 576090 589814 605256 621815 639150 657970 679655 705272 735272 769963
62358 769963 809832 855282 906348 962742 1023816 1088147 1153349 1216648 1275732 1328933 1374675
62347 1374675 1411152 1436827 1451260 1455353 1450783 1439158 1421530 1398419 1370119 1337054 1300064 1260457
62335 1260457 1219646 1178592 1137624 1096960 1057384 1020160 986182 955388 927158 901101 877173
62324H77173k2048k0866k0346j9923j9261j8706j8740j9218j9456j9096j8440
62313F61073j7859j7119j5727j3763j1907j0603r592q447p133n798m394k877j542
62300E34312p02k00L60J058J658K145K715L359L839M167M636N314N861N988N736
62285E80246N240M542L806L335L208L233L293L451L605L478L137L071L592M440
62271F31677N202N809O357O851P434Q548J0572J3436J6753K0132K3338K6563L0564
62258H13236L6007M2439M8525N3464N7571O1140O3567O4085O2533N8716N1899
62247A413182M2022L0790K0374J1248K445o451j4868k2659l0417l8051m4425m8978
62235A314212n2511n5654n7607n7339n5169n2172m8629m4190l9141l4410l0408
$$ plain form
62324 877173 855125 834259 813913 793990 774729 756023 737283 718065 698609 679513 661073
62313 661073 643214 626095 610368 596605 584698 574095 564503 556056 548923 543125 538731 535854 534312
62300 534312 533610 533410 533770 534828 536486 538631 541346 544705 548544 552711 557347 562661 568522 574510 580246
62285 580246 585486 590028 593834 597169 600377 603610 606903 610354 613959 617437 620574 623645 627237 631677
62271 631677 636879 642688 649045 655896 663330 671878 682450 695886 712639 732771 756109 782672 813236
62258 813236 849243 891682 940207 993671 1051242 1112382 1175949 1240034 1302567 1361283 1413182
62247 1413182 1455204 1485994 1506368 1517616 1520061 1513610 1498742 1476083 1445666 1407615 1363190 1314212
62235 1314212 1261701 1206047 1148440 1091101 1035932 983760 935131 890941 851800 817390 786982
62224G86982k6726k3062j9649j6682j4021j1663r857q537p134n321l539k464k150
62211F36177k032j605q22J03J045K063L298M859O695Q514R869J0505J0683J1030
62197G00382J1872J2769J3021J2586J2250J2700J3656J4155J3589J2280J1030
62186H40290J0296R852R202Q199P169O378N628M573L274K138J394R13O51Q71J846
62171I12674L610O172R680J4186J9463K5191L1096L6763M1609M5245M7569M8234
62159A241492M6398M1505L4244K6194J8391J0671K644n134j1475j6008j9776k3983
62147A345163k8515l2282l4865l7061l9405m0902m0058l6827l2725k9093k6070
62136I67360k3302k0693j8174j5543j2988j1150j0219r609r011r000r925j0876
$$ plain form
62224 786982 760256 737194 717545 700863 686842 675179 665322 656785 649651 644330 640791 638327 636177
62211 636177 634145 632540 631718 631821 632866 634929 638227 643086 649781 658295 668164 678669 689352 700382
62197 700382 712254 725023 738044 750630 762880 775580 789236 803391 816980 829260 840290
62186 840290 850586 860438 869640 877839 885008 891386 897014 901587 904861 906999 908393 909306 909957 910828 912674
62171 912674 916284 922456 932136 946322 965785 990976 1022072 1058835 1100444 1145689 1193258 1241492
62159 1241492 1287890 1329395 1363639 1389833 1408224 1418895 1421539 1416405 1404930 1388922 1369146 1345163
62147 1345163 1316648 1284366 1249501 1212440 1173035 1132133 1092075 1055248 1022523 993430 967360
62136 967360 944058 923365 905191 889648 876660 865510 855291 845682 836671 827671 817746 806870
62124H06870j0691r582q781q739q713q057p035o122n254m102k551o64J331K950
62110G30860L800M231N130O894R072J1195J3384J5746J7591J7757J5634J1705
62098H62999P304L903K301K239K962M126N751P222P069M293l59m879p723q686
62084H88522q352p222n503l371j092J211L790P056J0940J4604J7122J8444J9296
62071I55445K0139K0751K1042K1652K3201K5315K7106K8468L0181L2561L4655
62060A240516L5084L3269K9566K4489J8317J1324L999l075r356j4416j8210k1350
62048A330157k4703k8530l2253l5330l7931m0306m1844m1600l9819l7995l7005
62037I32841l5935l3503k9947k6705k4564k3177k2142k1417k0570j8836j6323
$$ plain form
62124 806870 796179 786597 777816 769077 760364 752307 745272 739150 733896 729794 727243 726579 727910 730860
62110 730860 734660 738891 744021 750915 759987 771182 784566 800312 817903 835660 851294 862999
62098 862999 870303 874206 876507 878746 881708 885834 891585 898807 905876 910169 909810 904931 897208 888522
62084 888522 880170 872948 867445 864074 862982 864193 867983 875039 885979 900583 917705 936149 955445
62071 955445 975584 996335 1017377 1039029 1062230 1087545 1114651 1143119 1173300 1205861 1240516
62060 1240516 1275600 1308869 1338435 1362924 1381241 1392565 1396564 1393489 1384133 1369717 1351507 1330157
62048 1330157 1305454 1276924 1244671 1209341 1171410 1131104 1089260 1047660 1007841 969846 932841
62037 932841 896906 863403 833456 806751 782187 759010 736868 715451 694881 676045 659722
62026F59722j4207j3135j2328j0968r553r016r161r084q677q565q697q265p129
62013E30937o224o167o432o341o024n766n123l541j506k00q8m67m09L24J374K329
61997D86676K956L158K926K343J631J148J142J336J027j57j752l075m147n540
61983D89672p290q536q511p535o681o603o983p055o404n300m398m049l856l119
61969D03352j827q88r73j453j059M30J878K304K067K097K503K677K454K382K769
61954D18713L216L339L404L818M350M391L834L316L517M529N880O989P541P629
61940D84466P638P925Q546R309J0004J0498J0674J0502J0184J0068J0241J0322
61928F00377R867Q902P847O860N533L465R72j125k429l305m221n097n502n214
$$ plain form
62026 659722 645515 632380 620052 609084 599531 590515 581354 572270 563593 555028 546331 538066 530937
62013 530937 524713 518546 512114 505773 499749 493983 488860 485319 483813 483613 483525 483058 482649 482973 484347 486676
61997 486676 489632 492790 495716 498059 499690 500838 501980 503316 504343 504186 502434 499359 495212 489672
61983 489672 482382 473846 465335 457800 451119 444516 437533 430478 424074 418774 414376 410327 406471 403352
61969 403352 401525 400637 399664 398211 397152 397582 399460 401764 403831 405928 408431 411108 413562 415944 418713
61954 418713 421929 425268 428672 432490 436840 441231 445065 448381 451898 456427 462307 469296 476837 484466
61940 484466 492104 500029 508575 517884 527888 538386 549060 559562 569746 579814 590055 600377
61928 600377 610244 619146 626993 633853 639386 642851 643823 642698 640269 636964 632743 627646 622144 616930
61914F16930m217k509k67J947L676N167P023R235J1036J1811J1672J1039J0143
61901F92686R063P853O344M269J819l32j862l193m708o047o603o402n988n683
61887F81216n432n132m684l979l246l109l850m984o140p872j0721j3807j5488
61874E92772j5365j4565j3930j3081j1613j0105r118q166o590m763l485k604j215
61861D78172Q88K909M227N060N924O984Q208R612J1207J2961J4923J7149J9437
61848E97661K1437K2891K3575K3224K1924K0364J9114J7805J5589J2373Q856N435
61836H10248J857j774m608o147p001p763p772n986k764K32K104L767O512J0150
61822G91055J3114J4138J3275J1332Q847N870K456j064m383p509j0582j3418j5544
$$ plain form
61914 616930 612713 610204 609937 611884 615560 620727 627750 636985 648021 659832 671504 682543 692686
61901 692686 701749 709602 715946 720215 722034 721702 719840 716647 711939 705892 699289 692887 686899 681216
61887 681216 675784 670652 665968 661989 658743 655634 651784 646800 640660 632788 622067 608260 592772
61874 592772 577407 562842 548912 535831 524218 514113 504995 496829 490239 485476 481991 479387 478172
61861 478172 479060 481969 486196 491256 497180 504164 512372 521984 533191 546152 561075 578224 597661
61848 597661 619098 641989 665564 688788 710712 731076 750190 767995 783584 795957 804813 810248
61836 810248 812105 810331 805723 799576 792575 784812 777040 771054 768290 768522 770626 774393 780905 791055
61822 791055 804169 818307 831582 842914 851761 857631 860087 859023 854640 847131 836549 823131 807587
61809H07587j6688j7086j7170j7098j6723j5951j4975j4143j3573j2984j2004
61798F39192j0702r647r201q990q417p492o632n756m367k674j698j799j898r94
61784E58925J77J08j264k458k584k327k489k645j950n88M00M24r9l70Q0J036J813
61767E46189J933J791K260L603N244O739Q203R479R807Q971Q050Q088Q594Q356
61753F37307P252O077M851K685n27l612n689p167q651r833j0184r924r550q972
61739E84063p976p054o879p200p091o162m884l720k613j463n10K7K96N73R10J214
61723E31531J522J923K247K096J337M89K48N54N94k8n17M5J216J640R26N9k44
61706E45638m87j251k084k327k204k197k032j320o58r15j770k157k017k330l342
$$ plain form
61809 807587 790899 773813 756643 739545 722822 706871 691896 677753 664180 651196 639192
61798 639192 628490 618843 609642 600652 592235 584743 578111 572355 567988 565314 563616 561817 559919 558925
61784 558925 559102 559210 557946 555488 552904 550577 548088 545443 543493 542905 543305 543729 543630 543260 543340 544376 546189
61767 546189 548122 549913 552173 555776 561020 567759 575962 585441 595248 604219 612269 620357 628951 637307
61753 637307 644559 650636 655487 658172 657645 654033 648344 641177 632526 622693 612509 602585 593035 584063
61739 584063 576087 569033 562154 554954 547863 541701 536817 533097 530484 529021 528511 528538 528834 529407 530317 531531
61723 531531 533053 534976 537223 539319 540656 541145 541393 541947 542541 542513 541996 542041 543257 544897 545823 545882 545638
61706 545638 545151 543900 541816 539489 537285 535088 533056 531736 531078 530163 528393 526236 524219 521889 518547
61691E18547m021l626k789k433k551k610k539k665l083l580l947m026l742l282
61677D73653k961k792k563k354k416k601k478k100j893j716r55J53L75p23j836
61662D46793j595m26K73J16j58j50j72k82j06L00L14k22o35l36M57J191J627J754
61644D48743J581J316J412K085K933L270K731J552L50l55n44n85p31q99j057j421
61628D60381j985k313k242k345l094l913l846k997k411k575k857k638k077j507
61614D23581q16J6L94l16j928l589m570m665m201l874m254n118n581n118m132
61599C75829l342k977k930l228l854m323l989k764j280l16k49q52j514j687j376
61584C41148j022r29r92j074j230j443j488j283j068r62p55l40l0p4k13o6L37
$$ plain form
61691 518547 514526 510900 508111 505678 503127 500517 497978 495313 492230 488650 484703 480677 476935 473653
61677 473653 470692 467900 465337 462983 460567 457966 455488 453388 451495 449779 448824 448977 449352 448629 446793
61662 446793 445198 444772 445045 445161 445003 444853 444681 444399 444293 444593 444907 444685 444050 443714 444171 445362 446989 448743
61644 448743 450324 451640 453052 455137 458070 461340 464071 465623 465973 465618 465074 464489 463758 462859 461802 460381
61628 460381 458396 456083 453841 451496 448402 444489 440643 437646 435235 432660 429803 427165 425088 423581
61614 423581 422765 422781 423175 422859 420931 417342 412772 408107 403906 400032 395778 390660 385079 379961 375829
61599 375829 372487 369510 366580 363352 359498 355175 351186 348422 347142 346826 346577 345725 344211 342524 341148
61584 341148 340126 339197 338205 337131 335901 334458 332970 331687 330619 329657 328902 328562 328532 328458 328245 328179 328516
61567C28516P77J224J586J492Q50K73L60P29N61o8j93O12J568J774J356J091J309
61550C43817J692J936K102K263K202J686Q72K28J6L0J3R2M91R40Q50J83m13m84
61532C58516k91j35K18Q67J116L54p42q12L66J521J536O71j03l02q1K40L16j98
61514C63057j233k151k332j841j249r37p65l43M43J119R79qp85k40J385K683K733
61497C60515J968J255Q69P67J110J901K527K419J829J413J296J126P95M59Q8l80
61481C79957n90k10L02R5q23j508j404r90q20o63j43L96L08l06o62l75J05K40
61463C72909J16J96N90Q97P94M97M76P53P77K14m22k29R19K071K249J525Q53R13
61445C86098J437J690J432J143J304J646J471O74N4L67J319J932J793J458J579
$$ plain form
61567 328516 329293 330517 332103 333595 334445 334718 335078 335807 336368 336300 336107 336719 338287 340061 341417 342508 343817
61550 343817 345509 347445 349547 351810 354012 355698 356570 356798 356814 356844 356857 356949 357440 358380 359230 359413 359000 358516
61532 358516 358225 358090 358308 359175 360291 360645 359903 359091 359457 360978 362514 363185 363082 362780 362699 362939 363255 363057
61514 363057 361824 359673 357341 355500 354251 353314 352549 352206 352649 353768 354747 354739 353954 353714 355099 357782 360515
61497 360515 362483 363738 364607 365374 366484 368385 370912 373331 375160 376573 377869 378995 379790 380249 380337 379957
61481 379957 379367 379157 379459 379554 378731 377223 375819 374829 374009 373346 373203 373599 373907 373601 372939 372564 372669 372909
61463 372909 373025 373221 373811 374708 375502 375999 376475 377228 378005 378219 377797 377568 378487 380558 382807 384332 385185 386098
61445 386098 387535 389225 390657 391800 393104 394750 396221 396895 396949 397316 398635 400567 402360 403818 405397
61430D05397K064K247J676N97j79P1J169J976J563M09o2P27J842K205J888J592
61414D25182J410R47L10J24N18Q32N26j45n64m91j36J52J36j37l28j73J22J58
61396D28443o0j68j07j82l60j24O80J382J352Q78O95R03J092J276J952L066L685
61379D44403L113J905J282J721K623L239L466L540L422K921K314K245K800L085
61365D82079K200M20j057j541j487j581j754j514q70l48k47l43k88N3O93J553
61349D75968K418L138L868M858O052P203Q294R381J0095R764Q286O377M742L385
61335E63829J993O33l60r22j320j768k294k881l451l689l238k110p73K06O22P47
61319E45224J055J728K421K711K675K826L409M148M797N493O366P154P641Q114
$$ plain form
61430 405397 407461 409708 411384 411981 411802 411873 413042 415018 416581 416990 416928 417655 419497 421702 423590 425182
61414 425182 426592 427539 427849 427973 428491 429323 429849 429704 429140 428649 428513 428665 428801 428664 428336 428163 428285 428443
61396 428443 428383 428215 428108 427926 427566 427442 428122 429504 430856 431734 432429 433332 434424 435700 437652 440718 444403
61379 444403 447516 449421 450703 452424 455047 458286 461752 465292 468714 471635 473949 476194 478994 482079
61365 482079 484279 484699 483642 482101 480614 479033 477279 475765 474895 474547 474300 473957 473669 473722 474415 475968
61349 475968 478386 481524 485392 490250 496302 503505 511799 521180 531275 541039 549325 555702 560444 563829
61335 563829 565822 566455 566095 565173 563853 562085 559791 556910 553459 549770 546532 544422 543649 543855 544477 545224
61319 545224 546279 548007 550428 553139 555814 558640 562049 566197 570994 576487 582853 590007 597648 605762
61305F05762Q959J0072J1112J2096J3193J4069J4121J3355J2422J1659J0614Q725
61293G46159N999K768p23m162p016q974j0288j1309j1929j1897j1520j1435j1664
61280F54009j1419j0105q189o711o062n630m634l017j367j98M03O32P19Q56J088
61265F00375J257J299J560K418L604M337M342M240M662N487O416P660R403J0902
61251F67962J1071R822P990N979L436L69k382m232n499o461o583n512m216m122
61237F67622n276o187n521l351p41J333K572L366M372N769O971P342P170P446
61223F92887Q706J0443J1852J2660J3015J2931J2161J0571Q385O101M232L076
61211H07020K570K384K212K004J909K034K189J928R44n03j658j927j438q78p01
$$ plain form
61305 605762 614721 624793 635905 648001 661194 675263 689384 702739 715161 726820 737434 746159
61293 746159 752158 754926 754203 750041 743025 734051 723763 712454 700525 688628 677108 665673 654009
61280 654009 642590 632485 624296 617585 611523 605893 601259 598242 596875 596677 597080 597712 598431 599287 600375
61265 600375 601632 602931 604491 606909 610513 614850 619192 623432 628094 633581 639997 647657 657060 667962
61251 667962 679033 688855 696845 702824 706260 706629 704247 700015 694516 688055 681472 675960 671744 667622
61237 667622 662346 656159 650638 647287 646546 647879 650451 653817 658189 663958 670929 678271 685441 692887
61223 692887 701593 712036 723888 736548 749563 762494 774655 785226 793611 799712 803944 807020
61211 807020 809590 811974 814186 816190 818099 820133 822322 824250 825194 824691 823033 821106 819668 818790 818089
61196H18089n18N75K939N702P438P736P727Q629J0147J0911J0358R284Q379P164
61182I14560M894J845j035l276m964o038o338o276o702p930r410j0539j1325j2110
61168H35356j2945j3505j3580j3486j3966j5348j6857j7195j6049j4548j3751
61157F74126j3236j1845r540p609p027p375p525o829n390l657k018n54R84K813
61143E95318M716O255P168P300O389M386J850m82k303l568l994l448k510j866
61129F15211j245K17K563M918O805Q560J0266J1382J1850J2678J4680J7396J9748
61116G35029K1162K1576K1122K0406K0407K1273K1733K0540J8065J5767J4358
61105I51438J3270J1700R470O961M734L217K268J214m23k444m614p265j0752j4627
$$ plain form
61196 818089 817571 818146 821085 826787 834225 841961 849688 858317 868464 879375 889733 899017 907396 914560
61182 914560 919454 921299 920264 916988 912024 905986 899648 893372 886670 878740 869330 858791 847466 835356
61168 835356 822411 808906 795326 781840 767874 752526 735669 718474 702425 687877 674126
61157 674126 660890 649045 639505 631896 624869 617494 609969 603140 597750 594093 592075 591521 592505 595318
61143 595318 600034 606289 613457 620757 627146 631532 633382 632900 630597 627029 623035 619587 617077 615211
61129 615211 613966 614183 616746 621664 628469 637029 647295 658677 670527 683205 697885 715281 735029
61116 735029 756191 777767 798889 819295 839702 860975 882708 903248 921313 937080 951438
61105 951438 964708 976408 985878 992839 997573 1000790 1003058 1004272 1003849 1001405 996791 989526 978774 964147
61091I64147j7982k0450k2282k3659k4506k4848k4807k4323k3307k1977k0516
61080G15490j8626j5939j2854j0330q929q423q234p814o780n283m067l627l434
61067F01150k615j274l51j82j6Q23J998K808L129L322L642M198N187O599P847
61052F36265Q149P495O980P872J0276J2905J4434J4915J5507J6850J8338J9254
61040G89240J9858K0782K1803K2095K1487K0682K0251K0135K0166K0387K0702
61029A017588K0801K0741K0999K1717K2354K2422K2243K2583K3738K5377K7186
61018A267749K9418L2709L7359M2889M8343N2975N6493N8825O0043O0722O2030
61007A809555O5194P1080Q0155R2271J06304J20681J34546J48009J61407J75643
$$ plain form
61091 964147 946165 925715 903433 879774 855268 830420 805613 781290 757983 736006 715490
61080 715490 696864 680925 668071 657741 648812 640389 632155 624341 617561 612278 608211 604584 601150
61067 601150 598535 597261 596910 596728 596712 597535 599533 602341 605470 608792 612434 616632 621819 628418 636265
61052 636265 644414 651909 658889 666761 677037 689942 704376 719291 734798 751648 769986 789240
61040 789240 809098 829880 851683 873778 895265 915947 936198 956333 976499 996886 1017588
61029 1017588 1038389 1059130 1080129 1101846 1124200 1146622 1168865 1191448 1215186 1240563 1267749
61018 1267749 1297167 1329876 1367235 1410124 1458467 1511442 1567935 1626760 1686803 1747525 1809555
61007 1809555 1874749 1945829 2025984 2118255 2224559 2345240 2479786 2627795 2789202 2964845
60997B964845J93612K19835K57817L09082L75632M61347N69611P02422Q65430
60988F919633J072186J339719J681324K105824K612275L159733L627636L826109
60980B6344439L590960K905903J941320R66402K13326j95414k36913L3488M68724
60971C6032235Q29911Q66604M50522l47856j309816k197041k852344l220836l320491
60962B4930888l208660k958329k637995k297337j965767j659569j387109j150300
60954G665822r47193p75808o34918n22064m33066l63547l09558k67160k33095
60945C179413k05819j84473j67117j51323j36200j22295j09642r7505q6102p7005
60935A841932p1367o8751o7907o7665o6916o4888o1818n8569n5341n1570m7157
$$ plain form
60997 2964845 3158457 3378292 3636109 3945191 4320823 4782170 5351781 6054203 6919633
60988 6919633 7991819 9331538 11012862 13118686 15730961 18890694 22518330 26344439
60980 26344439 29935399 32841302 34782622 35749024 35962350 35766936 35530023 35563511 36032235
60971 36032235 36862146 37728750 38179272 37831416 36521600 34324559 31472215 28251379 24930888
60962 24930888 21722228 18763899 16125904 13828567 11862800 10203231 8816122 7665822
60954 7665822 6718629 5942821 5307903 4785839 4352773 3989226 3679668 3412508 3179413
60945 3179413 2973594 2789121 2622004 2470681 2334481 2212186 2102544 2005039 1918937 1841932
60935 1841932 1770565 1701814 1633907 1566242 1499326 1434438 1372620 1314051 1258710 1207140 1159983
60924A159983m2833l9117l5773l2554k9680k7255k4936k2465j9967j7577j5239
60913H52587j3019j1059r298p678o421n478m077j691P86J968J936K108L117M060
60899H07841M122L665L240K676J862J460K064L298M418N322O308P456Q706J0164
60885H72602J1837J3472J4931J6288J7310J7436J6582J5337J4114J2732J1179
60874A033820R934R078P817N541K697K8k504n380q545j1504j4042j6262j8076
60861I92602j9257j9773j9774j9482j9313j9684k0382k0603j9948j8937j8168
60850G77281j7548j6770j5926j5125j4107j2795j1703j1208j0913j0332r670r332
60838F21852r175q950q942r429r995j0168j0217j0454j0313r117p398o267n741
$$ plain form
60924 1159983 1117150 1078033 1042260 1009706 980026 952771 927835 905370 885403 867826 852587
60913 852587 839568 828509 819211 811533 805112 799634 795557 793866 794652 796620 798556 800664 803781 807841
60899 807841 811963 815628 818868 821544 823406 824866 826930 830228 834646 839968 846276 853732 862438 872602
60885 872602 884439 897911 912842 929130 946440 963876 980458 995795 1009909 1022641 1033820
60874 1033820 1043754 1052832 1060649 1066190 1068887 1068915 1066411 1061031 1052486 1040982 1026940 1010678 992602
60861 992602 973345 953572 933798 914316 895003 875319 854937 834334 814386 795449 777281
60850 777281 759733 742963 727037 711912 697805 685010 673307 662099 651186 640854 631184 621852
60838 621852 612677 603727 594785 585356 575361 565193 554976 544522 534209 525092 517694 511427 505686
60825E05686m840l272j829r82k16R23K063K633K546J965J097M48N53J178J485
60810E09438J196R12J041J174R68P77Q97Q83K64n09o25r0K96j8q11j533j797j521
60792E10942r84p28j032j516j548j115j045k148m244o132o696o069n506n940o913
60777D59326p256o630n850n690n913n775n040m144l555l281k919k092q51L12R99
60762D01641J359J762K151K194K024K246L079L979M401M383M153L671L010K694
60748D42747L123L944M531M834N222N634N444M235K272J81j498k529l112l768
60734D71260m777n756o150o051o051o321o415o107n818n899n933n235l771k198
60720C94778j166r41j516k558l332l229k441j760j568j476j121q40j111j663j710
$$ plain form
60825 505686 500846 497574 495745 494763 494547 495470 497533 500166 502712 504677 505774 506222 506775 507953 509438
60810 509438 510634 511546 512587 513761 514729 515506 516403 517286 517550 517041 516416 516326 516622 516604 515793 514260 512463 510942
60792 510942 509958 509230 508198 506682 505134 504019 502974 500826 496582 490450 483754 477685 472179 466239 459326
60777 459326 452070 445440 439590 433900 427987 422212 417172 413028 409473 406192 403273 401181 400330 400642 401641
60762 401641 403000 404762 406913 409107 411131 413377 416456 420435 424836 429219 433372 437043 440053 442747
60748 442747 445870 449814 454345 459179 464401 470035 475479 479714 481986 482167 480669 478140 475028 471260
60734 471260 466483 460727 454577 448526 442475 436154 429739 423632 417814 411915 405982 400747 396976 394778
60720 394778 393612 392671 391155 388597 385265 382036 379595 377835 376267 374791 373670 372830 371719 370056 368346
60705C68346j001p3N06O65M75j60j092j642j272l51K07J04j2N26J538K301K447
60688C71512K265K200K358K632L028L611M201M436M332M520N534O988P896P919
60674D33432P818Q375R299R641R078Q183P490O811N660L911J829k71k137l505
60660E05614m174m140l637l099k991l501m213m337l461k045j024r08j339j610
60646D65135j493j402j703k180k438k636l272m280m939m937m840n084n078m055
60632D16798k365j131p84q10q40r72r68j50J435K662K661J805Q79n1j169j980
60616D15020j817r48l01k51m10n00n56l38N52J780K316J744R16P78J145J159O08
60599D20897J80N02J435K336K721K581K274K138K212K364K663L401M595N701O059
$$ plain form
60705 368346 367345 367272 367778 368443 368918 368758 367666 366024 364752 364401 364608 364712 364700 365226 366764 369065 371512
60688 371512 373777 375977 378335 380967 383995 387606 391807 396243 400575 405095 410629 417617 425513 433432
60674 433432 441250 449625 458924 468565 477643 485826 493316 500127 505787 509698 511527 511256 509119 505614
60660 505614 501440 497300 493663 490564 487573 484072 479859 475522 472061 470016 468992 468084 466745 465135
60646 465135 463642 462240 460537 458357 455919 453283 450011 445731 440792 435855 431015 425931 420853 416798
60632 416798 414433 413302 412518 411708 410868 409896 408928 408778 410213 412875 415536 417341 418220 418169 417000 415020
60616 415020 413203 412255 411954 411703 411293 410793 410237 409899 410451 412231 414547 416291 417207 417985 419130 420289 420897
60599 420897 421077 421579 423014 425350 428071 430652 432926 435064 437276 439640 442303 445704 450299 456000 462059
60584D62059N497M336K926J533N22K34N52R19J006J097J617K451L115L504M111
60569D95479N397P226R119J0839J2541J4446J6642J9096K1651K3993K5815K6959
60557F89203K7147K5674K1798J5648Q411J430m640r604j3129j4893j5168j4617
60545G17260j3420j1180p870m340j410J197M399Q397J2397J5844J9361K4088L0424
60532G95147L7810M5486N2934N9517O4178O5813O3827N8219M9305L7546K3697
60521A353479R020m861j6594k5809l3008l8542m1899m2459m0692l8002l5264l2193
60509A013176k8327k3939j9498j4964j0285o031k632O48M952J0135J4963J9124
60497I57322K3976L0873L9667M9432N9813P0867Q2021R1971R9364J02986J01737
$$ plain form
60584 462059 467556 471892 474818 476351 476873 477107 477659 478578 479584 480681 482298 484749 487864 491368 495479
60569 495479 500876 508102 517221 528060 540601 555047 571689 590785 612436 636429 662244 689203
60557 689203 716350 742024 763822 779470 787881 789311 784671 775067 761938 747045 731877 717260
60545 717260 703840 692660 684790 680450 679040 680237 684636 693033 705430 721274 740635 764723 795147
60532 795147 832957 878443 931377 990894 1055072 1120885 1184712 1242931 1292236 1329782 1353479
60521 1353479 1362499 1357638 1341044 1315235 1282227 1243685 1201786 1159327 1118635 1080633 1045369 1013176
60509 1013176 984849 960910 941412 926448 916163 910132 907500 908148 913100 923235 938198 957322
60497 957322 981298 1012171 1051838 1101270 1161083 1231950 1313971 1405942 1505306 1608292 1710029
60486A710029R5157Q3961O9592N3442L7025K2550J2353P592P887J2189J9271K7253
60474B158301L3419L5127L0796K0005L117j8751m3486o8145q9639j05650j15302
60463A839792j19190j18601j14661j08134r9740r0262q0410p0844o2267n5009
60453I20674m8602m2250l5921l0465k6482k3547k0883j8307j6048j3965j1609
60442F32595r035o960n919n669n618n535n534n564n295m496l242j770l38P00R63
60427E69283L96o75k020l743n759p275p481o608n791n654n668n075l899k612j377
60412E06042k39M14K67k54m27k16k13o52j074j025n48O4N27N98L49L21Q86J572
60394E06392J606J093Q68J195J438J194Q71Q39Q80P95Q26R91Q49L94K99O80N88
$$ plain form
60486 1710029 1805186 1889147 1958739 2012181 2049206 2071756 2084109 2091701 2099588 2111777 2131048 2158301
60474 2158301 2191720 2226847 2257643 2277648 2280765 2262014 2218528 2150383 2060744 1955094 1839792
60463 1839792 1720602 1602001 1487340 1379206 1279466 1189204 1108794 1037950 975683 920674
60453 920674 872072 829822 793901 763436 736954 713407 692524 674217 658169 644204 632595
60442 632595 623560 616600 610681 605012 599394 593859 588325 582761 577466 572970 569728 567958 567620 568320 569283
60427 569283 569679 569004 566984 563241 557482 550207 542726 536118 530327 524673 519005 513930 510031 507419 506042
60412 506042 505803 506217 506484 506230 505803 505587 505374 504722 503648 502623 502075 502139 502666 503264 503613 503934 504820 506392
60394 506392 507998 509091 509959 511154 512592 513786 514657 515496 516376 517171 517997 518988 519837 520231 520530 521210 521798
60377E21798m57j289o13R71J722J164L97K23K76J10n1K5J15J02K30N19O91P79
60359E26712J078J332R47J68J9O71R84K70n69m87J21L28L93J239K679L512L339
60342E42736L065L354L657L189K121J197O84K61l14q47j034r16r04j262j653j422
60326E51912m70N23J022J334J934K480K261J408Q50J017J355J286Q87M12j39n43
60310E67529j53J290L119M589N841P475R600J1989J5016J9484K5352L1238L5470
60297G37839L7292L6739L3794K8168J9901R803q93j1102j9973k6670l0552l1699
60285G82647l0903k8874k5766k1768j7722j4523j2110r848p839o970p373p811
60273E91140p166n789m717m184l804l704m329n186n013l404j446l76k34k63l0
$$ plain form
60377 521798 521341 520052 519439 520410 522132 523296 523693 523916 524192 524302 524251 524276 524391 524493 524723 525242 525933 526712
60359 526712 527790 529122 530069 530237 530256 530927 531911 532181 531612 531125 531246 531574 531967 533206 535885 539397 542736
60342 542736 545801 549155 552812 556001 558122 559319 560003 560264 559950 559103 558069 557153 556249 554987 553334 551912
60326 551912 551442 551965 552987 554321 556255 558735 560996 562404 563254 564271 565626 566912 567799 568211 568072 567529
60310 567529 567376 568666 571785 576374 582215 589690 599290 611279 626295 645779 671131 702369 737839
60297 737839 775131 811870 845664 873832 893733 903536 902643 891541 871568 844898 814346 782647
60285 782647 751744 722870 697104 675336 657614 643091 630981 621133 613294 606324 598951 591140
60273 591140 583974 578185 573468 569284 565480 561776 557447 552261 547248 543844 542398 542022 541788 541525 541495
60258E41495L60P06Q54O93L95M45J090J885K153J709R20K43k1K54Q68J214P63
60241E56026l03j214j431j130q52r32j344j873k190j880p63P58J884K192K134
60226E49082K510L517M574N088N041M705M203L659L372L450L537L347L262L834
60212F03181M870N594N714N659N766N901O012O333O785O778O055N137M562M160
60198F82507L549K828K248J601O10l70p58o95j008k204l941n446o090n704m737
60183F62390m035m041m343m336m076m016m104l843l108k279j591r25l08%Pl0k20
60166F21142j005k327l388l579l124k610k264k042j908j746j370q98p22q46o78
60151E92635J19J106J738K166K836L734M558N459O846Q593R978J0529J0496J0438
$$ plain form
60258 541495 541855 542561 543415 544108 544503 544948 546038 547923 550076 551785 552705 552948 552927 553181 554049 555263 556026
60241 556026 555723 554509 553078 551948 551096 550164 548820 546947 544757 542877 542114 542872 544756 546948 549082
60226 549082 551592 555109 559683 564771 569812 574517 578720 582379 585751 589201 592738 596085 599347 603181
60212 603181 608051 613645 619359 625018 630784 636685 642697 649030 655815 662593 668648 673785 678347 682507
60198 682507 686056 688884 691132 692733 693343 692973 692215 691520 690512 688308 684367 678921 672831 667127 662390
60183 662390 658355 654314 649971 645635 641559 637543 633439 629596 626488 624209 622618 621693 621385 621385 621392 621362 621142
60166 621142 620137 617810 614422 610843 607719 605109 602845 600803 598895 597149 595779 594881 594159 593313 592635
60151 592635 592754 593860 595598 597764 600600 604334 608892 614351 621197 629790 639768 650297 660793 671231
60137F71231J0687J1220J1783J2162J2465J3004J3609J3391J1719R281P364O079
60125H03995M073M24l835o726p491p059o510n837m494k547p15N38J389K139K751
60110G70095L058L096K895K306J401Q54J379K773M034M520M539M662M967N303
60096H15882N752O314O503N870M703L565K333L21k495n112o629p184p474p800
60082H14549p985p868p441o673n591m502l823l702l944m299m671n147n916o981
60068G36006p916q174p847p753q416r298r475q900q303p959p354o289n581n972
60054F26769o868o893n592l932l017k928k976k722k256j778j234l95R17K618M268
60039E93981N218N069L975K529J397R80J171J323P04p83k438l465l724l607l425
$$ plain form
60137 671231 681918 693138 704921 717083 729548 742552 756161 769552 781271 790552 797916 803995
60125 803995 808068 808492 804657 797931 790440 783381 776871 771034 766540 763993 763278 763816 765205 767344 770095
60110 770095 773153 776249 779144 781450 782851 783705 785084 787857 791891 796411 800950 805612 810579 815882
60096 815882 821634 827948 834451 840321 845024 848589 850922 851243 848748 843636 837007 829823 822349 814549
60082 814549 806564 798696 791255 784582 778991 774489 770666 766964 763020 758721 754050 748903 742987 736006
60068 736006 728090 719916 712069 704316 695900 686602 677127 668227 659924 651965 644611 638322 632741 626769
60054 626769 619901 613008 607416 603484 600467 597539 594563 591841 589585 587807 586573 586178 587095 589713 593981
60039 593981 599199 604268 608243 610772 612169 613149 614320 615643 616347 615564 613126 609661 605937 602330 598905
60024E98905l246l260l843n059o338o896o458n522m856m768m814m349l304k266
60010E33926j770j736j841k082k615l220l371k881k105j477j165j132j193r94
59996E06344l16N52J112J390J907K836L774M500N373O562P356O922N447M035L507
59981E61301L760M187M235L619K416J092J27m84j068j712k128k134j944j865j912
59966E67490j786j202j45J060J963K475L022M084N553O739P054O544N739N149
59952F13739M913M816M556M083L694L762M337M991N053M115K431Q00j76o52j108
59937F59354j555j603j352j470k175k711k412j758j705k289k604k028q75J72O92
59922F35681P03P08J471L158M859N568N531N910P114Q386R132R676J0322J0578
$$ plain form
60024 598905 595659 592399 588556 583497 577159 570263 563805 558283 553427 548659 543845 539496 536192 533926
60010 533926 532156 530420 528579 526497 523882 520662 517291 514410 512305 510828 509663 508531 507338 506344
59996 506344 506028 506580 507692 509082 510989 513825 517599 522099 527472 534034 541390 548312 553759 557794 561301
59981 561301 565061 569248 573483 577102 579518 580610 580737 580253 579185 577473 575345 573211 571267 569402 567490
59966 567490 565704 564502 564357 565417 567380 569855 572877 576961 582514 589253 596307 602851 608590 613739
59952 613739 618652 623468 628024 632107 635801 639563 643900 648891 653944 658059 660490 661290 661114 660462 659354
59937 659354 657799 656196 654844 653374 651199 648488 646076 644318 642613 640324 637720 635692 634817 634989 635681
59922 635681 636384 637092 638563 641721 646580 652148 657679 663589 670703 679089 688221 697897 708219 718797
59908G18797R948Q756P476N775L118j1k378l417l724m092m653n078n037m363l060
59893G18057j482j88N48R52J356J753J899J816J914K451K996K836K064J764K659
59878G41395L918M077L051K289K725L439L000J325n41j991l222m291m825m825
59864G45524m935n507o010n723m726l787l483l660l730l297k535j961j839j824
59850F92507j355l34P06J144Q56L58M02J306K625L602M056M543N544O881Q218
59835G31059R742J1846J4296J6199J6749J5638J2917Q976M676J065j142j654m83
59822H39884J706L300K645n54n067r479j3120j5691j6805j6352j4833j2893j0900
59809G31841r166q057p412o399m535k509j420j480k061k723l424l886l632k888
$$ plain form
59908 718797 728745 737501 744977 750752 753870 753859 751481 748064 744340 740248 735595 730517 725480 721117 718057
59893 718057 716575 716387 716935 717887 719243 720996 722895 724711 726625 729076 732072 734908 736972 738736 741395
59878 741395 745313 749390 752441 754730 757455 760894 763894 765219 764678 762687 759465 755174 750349 745524
59864 745524 740589 735082 729072 723349 718623 714836 711353 707693 703963 700666 698131 696170 694331 692507
59850 692507 691152 690818 691524 692668 693524 693882 694284 695590 698215 701817 705873 710416 715960 722841 731059
59835 731059 740801 752647 766943 783142 799891 815529 828446 837422 842098 843163 842021 840367 839884
59822 839884 841590 844890 847535 846981 841914 832435 819315 803624 786819 770467 755634 742741 731841
59809 731841 722675 714618 707206 700807 696272 693763 692343 690863 688802 686079 682655 678769 675137 672249
59795F72249k653l410m361m496m035m037m775n234m511l144k470k968l833m215
59781F18107m314m814n664o063n636n020m957n249n083m275l545l483l625k997
59767E53382j426J88R27Q61P18R01J263J714K471L500M304M613M896N699O764
59752E90775P319P148O711O226N350L967K670K049J898J577Q96K01k57n77q97
59737F35056j192j441j708j988k144k095j900j641j332j000p51o05l56K65J117
59722F18285J525R45k49r74o92m7Q0k10j31N21J151J374J520J918K393K798L405
59705F33612M368N299N836O211O795P498Q108Q796R721J0571J0984J1198J1574
59692G40571J1772J1030R158O696M212K050N60j15m28r76j679k079k264k765l470
$$ plain form
59795 672249 669596 666186 661825 657329 653294 649257 644482 639248 634737 631593 629123 626155 622322 618107
59781 618107 613793 608979 603315 597252 591616 586596 581639 576390 571307 567032 563487 560004 556379 553382
59767 553382 551956 552144 553071 553932 554650 555551 556814 558528 560999 564499 568803 573416 578312 584011 590775
59752 590775 598094 605242 611953 618179 623529 627496 630166 632215 634113 635690 636586 636787 636530 635953 635056
59737 635056 633864 632423 630715 628727 626583 624488 622588 620947 619615 618615 617864 617259 616903 617168 618285
59722 618285 619810 620755 620506 619532 618840 618793 618873 618663 618532 619053 620204 621578 623098 625016 627409 630207 633612
59705 633612 637980 643279 649115 655326 662121 669619 677727 686523 696244 706815 717799 728997 740571
59692 740571 752343 763373 772531 779227 783439 785489 786049 785934 785506 784530 782851 780772 778508 775743 772273
59677G72273l636l165l030l934n306o137o253o171o154o053n753n243m374k936
59663G04128r58J312L529N230O094O412O935P925Q803R061Q982Q973Q747P819
59649G92992O498N438M426K481o84m098o729q591j0340j2240j3957j5057j5254
59636G24885j4365j2429r929p613o000n116m632m250l993m087m561n016n031m682
59622F33181m435m528m759m918n105n399n581n430n151n151n422n478m940l953
59608E62931k947k123j369n72J33M83L85R2N1M85J056J055J41j178j960j787j075
59591E53801l92J82P81J197J031L63k81o34r76j505j884j709j195j046j670k786
59575E43277l750m074l715k964k111j282o33m72r17j535j748j603j585j684j276
$$ plain form
59677 772273 768637 765472 762442 758508 753202 747065 740812 734641 728487 722434 716681 711438 707064 704128
59663 704128 703170 704482 708011 713241 719335 725747 732682 740607 749410 758471 767453 776426 785173 792992
59649 792992 799490 804928 809354 811835 811151 807053 800324 791733 781393 769153 755196 740139 724885
59636 724885 710520 698091 688162 680549 674549 669433 664801 660551 656558 652471 647910 642894 637863 633181
59622 633181 628746 624218 619459 614541 609436 604037 598456 593026 587875 582724 577302 571824 566884 562931
59608 562931 559984 557861 556492 555920 556053 556536 556921 557013 557064 557549 558605 559660 559801 558623 556663 554876 553801
59591 553801 553409 553591 554372 555569 556600 556963 556682 556048 555072 553567 551683 549974 548779 547733 546063 543277
59575 543277 539527 535453 531738 528774 526663 525381 524748 524276 523359 521824 520076 518473 516888 515204 513928
59560E13928j86Q37J128R95R85R22M34k8K67J085J503J391J534K234K861L132
59544E33022L703M916N971O183O263P459R948J3079J6606K0378K2962K2123J7202
59531F89815J0149L540j664n809q819r895q835o668m652l172j873n06P54J535
59517F53900J535O91o77k037l145m277n655o912p464p382p348p642p753p266o609
59502E81959o417o431n722l974j955o00o8Q6K40M56O86R00J122J497K211L200
59486E67190M032M292M005L621L615M112M871N521N820N770N552N478N902O906
59472F36687P898P873O336L805J207r69k603l442l302k585j926j320k66J201K391
59457F50985L039L792N218P028Q659J0051J1307J2136J2286J2150J2243J2308
$$ plain form
59560 513928 513742 514579 515707 516702 517687 518609 519043 519015 519282 520367 521870 523261 524795 527029 529890 533022
59544 533022 536725 541641 547612 553795 560058 567517 577465 590544 607150 627528 650490 672613 689815
59531 689815 699964 703504 701840 696031 687212 677317 668482 661814 657162 653990 652117 651611 652365 653900
59517 653900 655435 656126 655449 653412 650267 645990 640335 633423 625959 618577 611229 603587 595834 588568 581959
59502 581959 575542 569111 563389 559415 557460 556860 556792 556878 557118 557574 558260 559160 560282 561779 563990 567190
59486 567190 571222 575514 579519 583140 586755 590867 595738 601259 607079 612849 618401 623879 629781 636687
59472 636687 644585 652458 658794 662599 663806 662837 660234 656792 653490 650905 648979 647659 647393 648594 650985
59457 650985 654024 657816 663034 670062 678721 688772 700079 712215 724501 736651 748894 761202
59445G61202J1501R316N911J776k445o061q803j1054j3112j4532j4683j3707j2381
59432F92928j1172j0123r345q879q225o822n029l766l114k082j4K625N131P463
59418F39576R847J2188J4393J6802J9800K3431K7658L2278L5996L6234L0878K0234
59406I19315O953n667j4960j9392j8957j5118r483k599N326J2553J5823J2847
59394H86641M368o476j6343k3147k6320k6553k5154k2983k0022j6175j2170r078
59382F86588p036n136k649R0K255L464L873L795L624L927N013O493P658Q319Q867
59367G29145R483R782R466Q881Q609Q777R078R240R154Q762Q171P769P785P875
59353H51977P570P061P058P789Q631R008R217J0034J1647J3344J4218J4069J3574
$$ plain form
59445 761202 772703 782019 787930 789706 787261 781200 772397 761343 748231 733699 719016 705309 692928
59432 692928 681756 671633 662288 653409 645184 638362 633333 629567 626453 624371 624357 626982 632113 639576
59418 639576 649423 661611 676004 692806 712606 736037 763695 795973 831969 868203 899081 919315
59406 919315 926268 920601 905641 886249 867292 852174 842691 840092 845418 857971 873794 886641
59394 886641 891009 884533 868190 845043 818723 792170 767016 744033 724011 707836 695666 686588
59382 686588 679552 674416 671767 671857 674112 677576 681449 685244 688868 692795 697808 704301 711959 720278 729145
59367 729145 738628 748410 757876 766757 775366 784143 793221 802461 811615 820377 828548 836317 844102 851977
59353 851977 859547 866608 873666 881455 890086 899094 908311 918345 929992 943336 957554 971623 985197
59340I85197J3539J3921J3651J1720Q338M841K330P45p67k851n452q013r981j1203
59326A016015j1962j2517j2723j2379j1811j1598j1735j1616j1004j0426j0275
59315H87969j0124r407q255p099n880m360k988k648l476m562m989m653m051l633
59301H11844l604l884m155m157m071m307m843n187n070m814m747m560l524j236
59287G53685K038N707R436J3463J8162K3121K6669K6756K2449J4579N022m210
59275I16877j1404j5512j6623j5824j4140j1787q640n049j754Q47K820M153M506
59262H28470L667J962L8j661l142m741o676q731j0319j1051j1100j0894j0589
59249G55233j0062r369q818q449p781o312m155j951k27J000J992K888L615M065
$$ plain form
59340 985197 998736 1012657 1026308 1038028 1046366 1051207 1053537 1054282 1053515 1050664 1045212 1037199 1027218 1016015
59326 1016015 1004053 991536 978813 966434 954623 943025 931290 919674 908670 898244 887969
59315 887969 877845 868438 860183 853084 847204 842844 839856 837208 833732 829170 824181 819528 815477 811844
59301 811844 808240 804356 800201 796044 791973 787666 782823 777636 772566 767752 763005 758445 754921 753685
59287 753685 755723 761430 770866 784329 802491 825612 852281 879037 901486 916065 921087 916877
59275 916877 905473 889961 873338 857514 843374 831587 822947 817898 816144 816991 819811 823964 828470
59262 828470 832137 834099 834137 832476 829334 824593 817917 809186 798867 787816 776716 765822 755233
59249 755233 745171 735802 726984 718535 710754 704442 700287 698336 698109 699109 701101 703989 707604 711669
59235G11669M272M382M537M762M981N095N065M902M609M107L266K017M82r90j920
59220G61236j979j309n07q9M8M59J337K148K353K255K652L665M467M379L745L361
59204G88221L341L154K558J922J524J099L50m89r49q95n79l10l04o55j093r83
59188G95912J7J346K004J673J000P04P52O92M01J69J50J73N6j12j63j10r8j91
59170H04375k79j73L21J342K939M943O885Q219Q730Q693Q507Q189P433O103M455
59155H80682K800J183n41k511m860p570j0186j1944j2498j2274j1911j1588j1292
59142G87490j1384j2212j3247j3321j1972j0075q840q486q295p678o801o241o260
59129F62678o498o221n000l118j277J33J301K588M081N608O993Q171R261J0487
$$ plain form
59235 711669 715941 720323 724860 729622 734603 739698 744763 749665 754274 758381 761647 763664 764146 763156 761236
59220 761236 759257 757948 757441 757352 757400 757859 759196 761344 763697 765952 768604 772269 776736 781115 784860 788221
59204 788221 791562 794716 797274 799196 800720 801819 802169 801680 800731 799836 799257 798947 798643 797988 796895 795912
59188 795912 795929 797275 799279 800952 801952 802656 803408 804100 804501 804670 804820 804993 805049 804937 804774 804664 804566 804375
59170 804375 804096 803923 804244 805586 808525 813468 820353 828572 837302 845995 854502 862691 870124 876227 880682
59155 880682 883482 884665 884124 881613 876753 869183 858997 847053 834555 822281 810370 798782 787490
59142 787490 776106 763894 750647 737326 725354 715279 706439 697953 689658 681980 675179 668938 662678
59129 662678 656180 649959 644959 641841 640564 640697 641998 644586 648667 654275 661268 669439 678700 689187
59115F89187J1845J2874J3111J2699J2158J1515J0311Q631P372P057O953O094
59103H09807M647L467K597J165j150l476m832n232n331n497n662n692n495m906
59089G74410l875k663j695j227j299j837k665l619m748o223p895r231r810r749
59075G07874r359q670p578o360n530n210m940m311l449k750k335k056j905k056
59061F41365k431k589k269j795j671j905k040j847j572j412j152n88L5L36M42
59046F20907Q60J706K399K270J323J80n67q58r83j074r59o15m22o88j003n29R73
59029F22920K805M184N066N873O847P993R329J0745J1831J2278J2227J1826J0800
59016G34724Q982O947N501M599L544K074O14o31j980l541m773n118m560l338j702
$$ plain form
59115 689187 701032 713906 727017 739716 751874 763389 773700 782331 789703 796760 803713 809807
59103 809807 814454 817921 820518 821683 820533 817057 812225 806993 801662 796165 790503 784811 779316 774410
59089 774410 770535 767872 766177 764950 763651 761814 759149 755530 750782 744559 736664 727433 717623 707874
59075 707874 698515 689845 682267 675907 670377 665167 660227 655916 652467 649717 647382 645326 643421 641365
59061 641365 638934 636345 634076 632281 630610 628705 626665 624818 623246 621834 620682 620094 620129 620465 620907
59046 620907 621767 623473 625872 628142 629465 629645 629078 628220 627237 626163 625204 624589 624167 623479 622476 621947 622920
59029 622920 625725 629909 634975 640848 647695 655688 665017 675762 687593 699871 712098 723924 734724
59016 734724 743706 750653 756154 760753 764297 766371 766985 766354 764374 760833 756060 750942 746382 743044 741342
59001G41342j38P86J162J783L062M412N041M855M199L236K134J353J105Q40j20
58986G75052j676l171m290n111n602n634n386n076m447l091j189O86K425M346
58972G37836O336P842Q820R950J1525J2899J3487J3744J4456J5506J6051J5725
58960H84177J4873J3579J1261P642L540J10k487n057q040j0870j2866j4203j5459
58947H66200j6608j7189j7259j7332j7256j6067j3456j0584q714p633o343m851
58935G12908m140m377m366l212j597p93r72j253j002m79k76o65j492k270k481
58920F83533k047j522j516j957k206j821r50LP78J351J878K660L900N403O688
58905F94175P528Q279R495J1280J3115J4347J4848J5084J5505J5970J5982J5482
$$ plain form
59001 741342 741204 741990 743152 744935 747997 752409 757450 762305 766504 769740 771874 773227 774332 775172 775052
58986 775052 773376 770205 765915 760804 755202 749568 744182 739106 734659 731568 730379 731065 733490 737836
58972 737836 744172 752014 760834 770784 782309 795208 808695 822439 836895 852401 868452 884177
58960 884177 899050 912629 923890 931532 935072 935182 932695 927638 919598 908728 895862 881659 866200
58947 866200 849592 832403 815144 797812 780556 764489 751033 740449 731735 724102 717759 712908
58935 712908 708768 704391 700025 696813 695216 694423 693451 692198 691196 690717 690441 689776 688284 686014 683533
58920 683533 681486 679964 678448 676491 674285 672464 671514 671517 672295 673646 675524 678184 682084 687487 694175
58905 694175 701703 709982 719477 730757 743872 758219 773067 788151 803656 819626 835608 851090
58893H51090J5050J5170J5627J5977J6393J7555J9695K2191K4165K5093K4733
58882A062739K2925J9879J6374J3251J0715Q352N696K592q70m410p598j0067j1799
58869A127779j3010j3797j4042j3627j2651j1518j0940j1602j3441j5375j6201
58858I81575j5819j5213j5254j5964j6937j7881j8503j8335j7211j5591j4094
58847H00773j2870j1804j0996j0639j0576j0436j0084r634r137q615q222q003
58835F79757p646o904o116n845o053o149n802n196m456l410k101r81l16J86Q85
58820F19853J720K442L075L828M715N501N894N757N247M769M503M024K831J229
58806F75388J90J36M05J96m66j080j568k231l077l732l935l753l357k921k740
$$ plain form
58893 851090 866140 881310 896937 912914 929307 946862 966557 988748 1012913 1038006 1062739
58882 1062739 1085664 1105543 1121917 1135168 1145883 1154235 1159931 1162523 1161653 1157243 1149645 1139578 1127779
58869 1127779 1114769 1100972 1086930 1073303 1060652 1049134 1038194 1026592 1013151 997776 981575
58858 981575 965756 950543 935289 919325 902388 884507 866004 847669 830458 814867 800773
58847 800773 787903 776099 765103 754464 743888 733452 723368 713734 704597 695982 687760 679757
58835 679757 672111 665207 659091 653246 647193 641044 635242 630046 625590 622180 620079 619098 618782 618968 619853
58820 619853 621573 624015 627090 630918 635633 641134 647028 652785 658032 662801 667304 671328 674159 675388
58806 675388 675578 675714 676119 676315 675849 674769 673201 670970 667893 664161 660226 656473 653116 650195 647455
58791F47455k981l389l429k839j766m58R97K610M395O343Q303R932J0906J1227
58777F87306J1237J1258J1218J0674R165O664L547J92l257o546r081j0509j1340
58764G10528j2469j3950j4853j4408j2828j0848q926p259n984n000l902k508j237
58751E96356o23p39j252j673j379M7K116L617L954L933M649O091P412Q137Q425
58736F39071Q388P976P442P254P478P766P900P860P542O914O384O419O855P097
58722G42346O984O903P163P770Q766J0196J1657J2474J2424J1803J0774R082O560
58709H64902L419J9l273o087q319j0382j2709j5107j7112j8809k0583k2137k2632
58696G11190k1989k1166k0794k0307j8865j6537j4055j1886j0105q826q092p545
$$ plain form
58791 647455 644474 641085 637656 634817 633051 632593 633590 636200 640595 646938 655241 665173 676079 687306
58777 687306 698543 709801 721019 731693 740858 747522 751069 751261 748004 741458 732377 721868 710528
58764 710528 698059 684109 669256 654848 642020 631172 622246 614987 609003 604003 600101 597593 596356
58751 596356 595733 594994 593742 592069 590690 590737 592853 596470 600424 604357 609006 615097 622509 630646 639071
58736 639071 647459 655435 662877 670131 677609 685375 693275 701135 708677 715591 721975 728394 735249 742346
58722 742346 749330 756233 763396 771166 779932 790128 801785 814259 826683 838486 849260 858342 864902
58709 864902 868321 868340 865067 858980 850661 840279 827570 812463 795351 776542 755959 733822 711190
58696 711190 689201 668035 647241 626934 608069 591532 577477 565591 555486 546660 538568 531023
58684E31023o709n588m610m052l762l439k992k605k501k608k475j695l53J063
58670D88697K207L139M124N421P087Q825J0117J0786J1186J1506J1193R559O745
58657E90592L512K73k959n841p796q855r608j0168j0017r083q090p463o723n434
58643E02340m066l252k856k335j606r29k95L86Q87R88R99J356J873J906J211J56
58627D96763q45j684k290k440j935q64L62J314J937K584L533M575N395O167P235
58612E19807Q275Q417P405O026N096M517L636K139K56j455k360k158j340q29r97
58597E56435j454j858k269k500j973o62O30J489K675M928P630R507J0272J0698
58583E93548J1304J1833J2001J1990J2015J1891J1164R519P176N015L943L926
$$ plain form
58684 531023 524314 518726 514116 510064 506302 502863 499871 497266 494765 492157 489682 487987 487634 488697
58670 488697 490904 494043 498167 503588 510675 519500 529617 540403 551589 563095 574288 583847 590592
58657 590592 594104 594377 591418 585577 577781 568926 559318 549150 539133 530050 521960 514497 507774 502340
58643 502340 498274 495022 492166 489831 488225 487296 487001 487387 488274 489262 490261 491617 493490 495396 496607 496763
58627 496763 495918 494234 491944 489504 487569 486705 487067 488381 490318 492902 496435 501010 506405 512572 519807
58612 519807 528082 536499 543904 549930 555026 559543 563179 565318 565574 564119 561759 559601 558261 557432 556435
58597 556435 554981 553123 550854 548354 546381 545719 546349 547838 550513 555441 563071 572578 582850 593548
58583 593548 604852 616685 628686 640676 652691 664582 675746 685265 692441 697456 701399 705325
58571G05325M119M268N342Q197J2127J5541J7717J9155K0468K1759K2912K3708
58559H80638K3594K2060J9295J5984J2427Q390L818q40n010q352j0678j1945j2239
58546I37142j1584j0013q159p307q206j0127j1785j2891j4125j5767j7325j8483
58534G91370j9484k0294k0230j8812j6468j4031j1914j0023q235o590n245m337
58522F35707l771l183k283j203k52M10O78L22n80j320j158k24O48Q30K93o95j623
58505F22596j740p29O52J239P89M7l34l31o0L57M64j49r51q72J96J152J294J308
58487F24928K105L502M742N662O542P329P842Q497R909J1909J3649J4629J4974
58474G36219J4630J3053R986O004J971j714m968p536r094r730r834r523q522o715
$$ plain form
58571 705325 709444 713712 719054 727251 739378 754919 772636 791791 812259 834018 856930 880638
58559 880638 904232 926292 945587 961571 973998 982388 986206 985366 980356 972004 961326 949381 937142
58546 937142 925558 915545 907386 900079 891873 881746 869961 857070 842945 827178 809853 791370
58534 791370 771886 751592 731362 712550 696082 682051 670137 660114 651879 645289 640044 635707
58522 635707 631936 628753 626470 625267 625015 625425 626103 626425 625845 624525 623367 623143 623791 624621 624914 624219 622596
58505 622596 620856 620127 620779 622018 622807 622854 622520 622189 622129 622486 622950 622801 621850 620978 621174 622326 623620 624928
58487 624928 627033 630535 635277 640939 647481 654810 662652 671149 681058 692967 706616 721245 736219
58474 736219 750849 763902 773888 779892 781863 780149 775181 767645 758551 748821 738987 729464 720942 714227
58460G14227m552k643j107M54K478N057P894J0399J1970J2417J2034J1088R424
58447G89140O829L563J05l434p082j0273j2058j2181j1297r958q013n401k860
58434G17080j259o13k70J72O34J052J671K856M713O832Q377Q852Q740Q887R180
58419G76904Q472O070K641o14k986m198m134l237k496k500k921l418m276n631
58405G57676o840p255p025o506n596m328l324k833k080m75J281K284K786L404
58391G21169L795L416K842K872K922J895L37n5J044K219K577K705L059L057K317
58376G56171J580J637K347L228M183N189O044O837P927R129R697R430R074R335
58362H41808J0120J1070J2150J3344J4266J4316J3121J0827Q333O770O245N485
$$ plain form
58460 714227 709675 707032 705925 706379 708857 713914 721808 732207 744177 756594 768628 779716 789140
58447 789140 795969 799532 799637 796203 789121 778848 766790 754609 743312 733354 725341 719940 717080
58434 717080 715821 715208 714938 715110 715744 716796 718467 721323 726036 732868 741245 750097 758837 767724 776904
58419 776904 785376 791446 794087 793473 790487 786289 782155 778918 776422 773922 771001 767583 763307 757676
58405 757676 750836 743581 736556 730050 724454 720126 716802 713969 711889 711414 712695 714979 717765 721169
58391 721169 724964 728380 731222 734094 737016 738911 739248 739193 740237 742456 745033 747738 750797 753854 756171
58376 756171 757751 759388 761735 764963 769146 774335 780379 787216 795143 804272 813969 823399 832473 841808
58362 841808 851928 862998 875148 888492 902758 917074 930195 941022 949355 956125 962370 967855
58350I67855L506J189K03P67J603J925K260L232M634N968P003P736Q391R491J1223
58335A036986J3007J4313J5459J6772J7601J7227J6179J5341J4408J2585J0318
58324A200196Q705P624O099M277L205K977K813K813L678M889N120M572M825O210
58310A268003P420P957Q835J0434J1738J2282J2877J3810J4239J4004J4135J4901
58298A410635J5215J4700J4481J5200J6020J6305J6513J6808J6641J6283J6973
58287A585774J8822K0536K1706K3345K5549K6932K7117K7515K8790K9865L0372
58276A866323L1652L4152L6219L6807L7034L7772L8103L7661L8180M0953M4795
58265B279651M8064N0781N3246N4696N4930N5350N6772N8028N8124N7826N7909
$$ plain form
58350 967855 971361 972550 972753 973520 975123 977048 979308 982540 987174 993142 1000145 1007881 1016272 1025763 1036986
58335 1036986 1049993 1064306 1079765 1096537 1114138 1131365 1147544 1162885 1177293 1189878 1200196
58324 1200196 1208901 1216525 1222624 1226901 1230106 1233083 1235896 1238709 1242387 1247276 1252396 1256968 1261793 1268003
58310 1268003 1275423 1283380 1292215 1302649 1314387 1326669 1339546 1353356 1367595 1381599 1395734 1410635
58298 1410635 1425850 1440550 1455031 1470231 1486251 1502556 1519069 1535877 1552518 1568801 1585774
58287 1585774 1604596 1625132 1646838 1670183 1695732 1722664 1749781 1777296 1806086 1835951 1866323
58276 1866323 1897975 1932127 1968346 2005153 2042187 2079959 2118062 2155723 2193903 2234856 2279651
58265 2279651 2327715 2378496 2431742 2486438 2541368 2596718 2653490 2711518 2769642 2827468 2885377
58254B885377N7861N7609N8324O0403O2793O5362O9371P4660P9223Q2710Q7267
58243C640960R3687R9950J05077J10872J18274J25544J31914J39327J48646J58005
58233D872256J66898J77689J90950K03800K15362K29129K47036K66041K83778
58224F852939L02720L25207L49365L73725M00995M33376M69142N07649N52389
58215A0567507O05252O63658P27280Q01037Q87304R82708J087545J210360J358122
58206A8890773J531059J733362J979065K280893K645439L088670L645283M354506
58198D0149050N250173O374060P783687R539590J1709282J4397888J7744368K1855993
58190A34804091K6737822L2209529L7686506M1881520M2864874L8856959K9385828
$$ plain form
58254 2885377 2943238 3000847 3059171 3119574 3182367 3247729 3317100 3391760 3470983 3553693 3640960
58243 3640960 3734647 3834597 3939674 4050546 4168820 4294364 4426278 4565605 4714251 4872256
58233 4872256 5039154 5216843 5407793 5611593 5826955 6056084 6303120 6569161 6852939
58224 6852939 7155659 7480866 7830231 8203956 8604951 9038327 9507469 10015118 10567507
58215 10567507 11172759 11836417 12563697 13364734 14252038 15234746 16322291 17532651 18890773
58206 18890773 20421832 22155194 24134259 26415152 29060591 32149261 35794544 40149050
58198 40149050 45399223 51773283 59556970 69096560 80805842 95203730 112948098 134804091
58190 134804091 161541913 193751442 231437948 273319468 316184342 355041301 384427129
58183C84427129J5840143Q66180j2881517k3657138l0785452l4381094l5035324
58176B64392927l3559142l0746850k7226976k3449470j9720868j6208117j2955568
58169A00525936r950441p168516m573687k171197j42109J125319J263390K48618
58161G9157313j512244l421466n004594o041626o512220o501499o142940n579156
58153C8441568m927126m265008l640707l081232k596142k183460j837332j550132
58145A4360429j311703j112292r46024q09449o98612o09445n38909m83833m40475
58136G409687m06336l80231l59694l40665l20531k99272k77178k53884k30040
58127D541856k07285j85966j65238j45874j30541j20928j16645j16827j20256
$$ plain form
58183 384427129 400267272 401133452 388251935 364594797 333809345 299428251 264392927
58176 264392927 230833785 200086935 172859959 149410489 129689621 113481504 100525936
58169 100525936 90575495 83406979 78833292 76662095 76519986 77645305 78908695 79157313
58161 79157313 77645069 74223603 69219009 63177383 56665163 50163664 44020724 38441568
58153 38441568 33514442 29249434 25608727 22527495 19931353 17747893 15910561 14360429
58145 14360429 13048726 11936434 10990410 10180961 9482349 8872904 8333995 7850162 7409687
58136 7409687 7003351 6623120 6263426 5922761 5602230 5302958 5025780 4771896 4541856
58127 4541856 4334571 4148605 3983367 3837493 3706952 3586024 3469379 3352552 3232296
58118C232296j23848j24042j20378j15400j10698j05465r9118r2625q6483p9946
58108B174293p3052o7231o3098n9669n6469n4328n3355n2141m9926m7763m6513
58097A550748m5286m2914l9662l6494l3648l0777k7719k4625k1913k0260j9871
58086A207579j9816j8931j7349j6219j6115j6742j7918j9561k1014k1610k1802
58075A000502k2449k3178k2779k1130j9348j8094j7024j5918j5028j4219j3004
58064G98331j1561j0567r994r161p959o997o586o618p185q271r048q785q132q250
58050F79217q963r106q401p526o599n290m220m500n728o251n659n314o004o814
58036E88842o997p223q120q917q686p910p751q455r327r806r845r611r294q965
$$ plain form
58118 3232296 3108448 2984406 2864028 2748628 2637930 2532465 2433347 2340722 2254239 2174293
58108 2174293 2101241 2034010 1970912 1911243 1854774 1800446 1747091 1694950 1645024 1597261 1550748
58097 1550748 1505462 1462548 1422886 1386392 1352744 1321967 1294248 1269623 1247710 1227450 1207579
58086 1207579 1187763 1168832 1151483 1135264 1119149 1102407 1084489 1064928 1043914 1022304 1000502
58075 1000502 978053 954875 932096 910966 891618 873524 856500 840582 825554 811335 798331
58064 798331 786770 776203 766209 757048 749089 742092 735506 728888 721703 713432 704384 695599 687467 679217
58050 679217 670254 661148 652747 645221 638622 633332 629112 624612 618884 612633 606974 601660 595656 588842
58036 588842 581845 574622 566502 557585 548899 540989 533238 524783 515456 505650 495805 486194 476900 467935
58022D67935q408p451o390n652n108m399l769l774m244m404l989l433k916k198
58008D01800j385j021j236j629j931k034j504n7J519K027J510J165J516J797J351
57993D01888M85m23j576l016m187m672m619m093k928j559j081j849k779k668j672
57978C65251r27j172k167l111l248k403j200m93m98p54q73r20j053j253j394j258
57962C42527o38K03N34J20k38J89Q75Q34J35m61r40j843k865k971k015r76m64
57945C32006k04n1k11k24R08L128N066N893O328P204Q228Q756Q854Q840Q577P947
57929D11045P323O989O665O061N243M125K390L02j253j983k607l622m544m965
57915D31169n398o312p139p193o883p091p753p975p337o369n826n996o570o861
$$ plain form
58022 467935 459527 452076 445686 440034 434926 430527 426758 422984 418740 414336 410347 406914 403998 401800
58008 401800 400415 399394 398158 396529 394598 392564 391060 391003 392522 394549 396059 397224 398740 400537 401888
57993 401888 402373 401950 400374 397358 393171 388499 383880 379787 376859 375300 374219 372370 369591 366923 365251
57978 365251 364324 363152 360985 357874 354626 352223 351023 350530 350032 349278 348405 347485 346432 345179 343785 342527
57962 342527 341889 342092 342626 342746 342508 342697 343572 344406 344541 344080 343140 341297 338432 335461 333446 332470 332006
57945 332006 331802 331751 331540 331316 332224 335352 340418 346311 352639 359843 368071 376827 385681 394521 403098 411045
57929 411045 418368 425357 432022 438083 443326 447451 449841 450143 448890 446907 444300 440678 436134 431169
57915 431169 425771 419459 412320 405127 398244 391153 383400 375425 368088 361719 355893 349897 343327 336466
57901C36466o312n116m092l747l833l954m059m123l845l038j857m44J185K678
57887B95909L409L267K913K894L136L524M270N257N671M879L266J742P31N4n76
57872C40346j306k150l004l859m942o249p120o941o213o010o408o441n765n193
57858B68745n143m769l357j617o81n09k27N82J648K673L458L744L613L675M321
57843B76156N097N278M729L794K793K006J682J637J310N77p8n27j353k772l960
57828B96369m151l702l355l067k382j453q54o89o32m83o0R87K567L723L629K775
57812B89222K387K879L488L376K505J499J036J271J594J231K17o78j121j634k547
57797C04725l355l671l928m472m756m223l334k830k604k275k255l053m030l992
$$ plain form
57901 336466 330154 325038 320946 317199 313366 309412 305353 301230 297385 294347 292490 292046 293231 295909
57887 295909 299318 302585 305498 308392 311528 315052 319322 324579 330250 335129 338395 340137 340868 340922 340346
57872 340346 339040 336890 333886 330027 325085 318836 311716 304775 298562 292552 286144 279703 273938 268745
57858 268745 263602 258833 255476 253859 253178 252669 252442 253024 254672 257345 260803 264547 268160 271835 276156
57843 276156 281253 286531 291260 295054 297847 299853 301535 303172 304482 305059 304981 304454 303101 300329 296369
57828 296369 292218 288516 285161 282094 279712 278259 277405 276716 276084 275601 275541 276528 279095 282818 286447 289222
57812 289222 291609 294488 297976 301352 303857 305356 306392 307663 309257 310488 310705 310027 308906 307272 304725
57797 304725 301370 297699 293771 289299 284543 280320 276986 274156 271552 269277 267022 263969 259939 255947
57783B55947k893j801j334j138r18q93j078j022n28P3O05J393K695M203N279N553
57767B64143N238N037N464O125O057N018L841L120K310P62j004j911j683p91L86
57752C02112J468J702P81l74p51p28j285k194k463k342l190n182o663o379n012
57737B69500l872l205k597k092j987k083j918j447q74j68P39J532J734J266N54
57722B55082J67L89R50J183P13j47r31j690k662l506l585k934k267k038k102k257
57706B34365k386k141j335n57n53r30m85R75K275K640K764L390L947L430J977
57691B47376N51m63j347k115k395k242k197k444k532k056j144o2J194K715M427
57676B37266O309Q671J1921J6077K0823K6160L2803M1651N2862O5521P7894Q7411
$$ plain form
57783 255947 253054 251253 249919 248781 247863 246970 245892 244870 244342 244415 245020 246413 249108 253311 258590 264143
57767 264143 269381 274418 279882 286007 292064 297082 300923 304043 306353 307115 306111 304200 302517 301726 302112
57752 302112 303580 305282 306063 305689 304938 304210 302925 300731 298268 295926 292736 287554 280891 274512 269500
57737 269500 265628 262423 259826 257734 255747 253664 251746 250299 249425 249257 249996 251528 253262 254528 255082
57722 255082 255249 255638 256588 257771 258484 258337 257406 255716 253054 249548 245963 243029 240762 238724 236622 234365
57706 234365 231979 229838 228503 227946 227393 226463 225978 226953 229228 231868 234632 238022 241969 245399 247376
57691 247376 247927 247464 246117 244002 241607 239365 237168 234724 232192 230136 228992 228930 230124 232839 237266
57676 237266 243575 252246 264167 280244 301067 327227 360030 401681 454543 520064 597958 685369
57664F85369R0465Q3340O4567L6584M763k5220m9280o5323p3114p4042p0259o3682
57652E44168n5731m7600m0049l3048k6344k0342j5831j2847j0558q386o553n350
57640B61529m563l876l174k319j280o55j186k457k952j977o78l84p88p28j80k06
57624B34126j073j748j543j110j233j479r66l5n4j473k980l102k026j176j326
57609B12802j901k110j865j301k61J131J987J592M77k09j65l7k15m01m32o27j087
57592B07378j392j317j269j563j853j733j428j370j397r64m4O61N08l61j258j732
57576A90866j978k395k926l087k689k126j789j596j452j771k902m300m954m582
57562A52319l834l336l116k956k683k117j301p81j025j536j309k25P55J061J316
$$ plain form
57664 685369 775834 859174 923741 960325 965088 939868 890588 825265 752151 678109 607850 544168
57652 544168 488437 440837 400788 367740 341396 321054 305223 292376 281818 273432 266879 261529
57640 261529 256966 253090 249916 247597 246317 245662 244476 242019 239067 237090 236412 236028 235240 234512 234332 234126
57624 234126 233053 231305 229762 228652 227419 225940 224974 224939 224885 223412 220432 217330 215304 214128 212802
57609 212802 210901 208791 206926 205625 205364 206495 208482 210074 210551 210342 210177 210140 209925 209524 209092 208465 207378
57592 207378 205986 204669 203400 201837 199984 198251 196823 195453 194056 193092 193048 193709 194217 193856 192598 190866
57576 190866 188888 186493 183567 180480 177791 175665 173876 172280 170828 169057 166155 161855 156901 152319
57562 152319 148485 145149 142033 139077 136394 134277 132976 132195 131170 129634 128325 128100 128855 129916 131232
57547A31232K236L452M016L582K558J478P07M81P17R63Q50M61K5m86j194j985
57531A49093k631l003l006k548j811j276j187j229r25j91P00J504K125K542K795
57516A40952K943K984K866K615K296J896J419R60N85K08j38k51k07m61j096j414
57500A56157q93j43j43q39j422j748k327k979k768j519l33j17n19p26n47k33j4
57483A38887j29o25q88k56O97N70q38k075k179j900k095k209j503o70p84j486
57467A22517j670j347j401j837j820j263r48r73m93P01J508R76m37j580j861j418
57451A08654o31J7J1p49j768k373k262j594p76k39j58l21l65j69J07K70K56J67
57433I8077K02M45O84P40Q75J451K154K248J671J185J085O59n48j767k101j854
$$ plain form
57547 131232 133468 136920 140936 144518 147076 148554 149261 149742 150459 151422 152272 152733 152758 152272 151078 149093
57531 149093 146462 143459 140453 137905 136094 134818 133631 132402 131477 131286 131986 133490 135615 138157 140952
57516 140952 143895 146879 149745 152360 154656 156552 157971 158931 159516 159724 159586 159335 159128 158667 157571 156157
57500 156157 155264 155121 154978 154139 152717 150969 148642 145663 142895 141376 141043 140926 140407 139681 139134 138901 138887
57483 138887 138758 138133 137245 136989 137686 138256 137418 135343 133164 131264 129169 126960 125457 124787 124003 122517
57467 122517 120847 119500 118099 116262 114442 113179 112231 111258 110765 111466 112974 113950 113513 111933 110072 108654
57451 108654 108023 108040 108051 107302 105534 103161 100899 99305 98529 98290 98132 97811 97446 97277 97384 97654 97910 98077
57433 98077 98279 98724 99408 100148 101023 102474 104628 106876 108547 109732 110817 111476 110928 109161 107060 105206
57417A05206j873k116j948j442j261j436j342r19q35j289j561j078k40J74j06
57402H7934p44j203j107n76k08l67o01k23O02J037P35K21L0J45M51J097K080K935
57384I2238L260L232L280L396L120K173R39J77K02M81K82l79q24p97q13j221j564
57367A07182j342q92q52j179j353j189q53l54K81O24L16k20k47L15Q97J133J060
57350A03327P69M39N09J099J579J358Q04N84M69k30j333j929j782j487j318r80
57334A01878o08p93j427j599j023n05n90p28m03j31o01j467j778j217l81m1n02
57317H8084j330j551n49J000J728J244N55O16J121J215O37l14j325j992j742n20
57301H6877Q22J439J451J479J566J251M97r9r7K97O16P35R03J355J961K319K234
$$ plain form
57417 105206 103333 101217 99269 97827 96566 95130 93788 92869 92034 90745 89184 88106 87866 88040 87934
57402 87934 87190 85987 84880 84304 84096 83729 83128 82905 83507 84544 85279 85500 85530 85675 86126 87223 89303 92238
57384 92238 95498 98730 102010 105406 108526 110699 111638 111815 112017 112498 112780 112401 111577 110780 109967 108746 107182
57367 107182 105840 104948 104096 102917 101564 100375 99522 99168 99449 100073 100389 100169 99922 100237 101134 102267 103327
57350 103327 104096 104535 105044 106143 107722 109080 109884 110468 110937 110707 109374 107445 105663 104176 102858 101878
57334 101878 101270 100477 99050 97451 96428 95923 95333 94605 94202 94071 93470 92003 90225 89008 88627 88586 88084
57317 88084 86754 85203 84654 85654 87382 88626 89181 89797 90918 92133 92770 92456 91131 89139 87397 86877
57301 86877 87699 89138 90589 92068 93634 94885 95382 95283 95186 95483 96099 96834 97737 99092 101053 103372 105606
57284A05606J935J739J629J455J354J498J643J421J033R89J170R01J06l27L14
57269A22466J623K648K928K624K091J658J543J620J604J547J754K059J787P49
57255A48701k67m59k6K54J50J70P19J554K072J969J552J370J549J699J656J859
57239A64522K614L355L333K743K366K281J920J373J493K518L610M139M436M816
57225B05519M889M444M122M439M957N151N364O036O636O302N178M256M150M712
57211B76155N562O343O695O615O596O945P300P321P453Q361R995J1799J3457J4807
57197C95404J5397J4923J3949J3391J3448J3555J3324J2942J2829J3264J4166
57186E46592J4885J4586J3274J2044J1774J2079J2191J2237J2780J3626J4112
$$ plain form
57284 105606 107541 109280 110909 112364 113718 115216 116859 118280 119313 120302 121472 122373 122479 122152 122466
57269 122466 124089 126737 129665 132289 134380 136038 137581 139201 140805 142352 144106 146165 147952 148701
57255 148701 148434 147975 147949 148203 148353 148523 149242 150796 152868 154837 156389 157759 159308 161007 162663 164522
57239 164522 167136 170491 173824 176567 178933 181214 183134 184507 186000 188518 192128 196267 200703 205519
57225 205519 210408 214852 218974 223413 228370 233521 238885 244921 251557 257859 263037 267293 271443 276155
57211 276155 281717 288060 294755 301370 307966 314911 322211 329532 336985 345346 355341 367140 380597 395404
57197 395404 410801 425724 439673 453064 466512 480067 493391 506333 519162 532426 546592
57186 546592 561477 576063 589337 601381 613155 625234 637425 649662 662442 676068 690180
57175F90180J4354J5051J6142J6715J6393J5846J5681J5684J5537J5570J6314
57164H63467J7645J8798J9060J8365J7395J6982J7288J7736J7980J8440J9410
57153A062566K0209J9990J9077J8535J8653J8784J8680J8866J9571K0273K0660
57142A275864K1120K1829K2198K1851K1468K1982K3307K4515K5006K4976K4929
57131A529045K5149K5652K6283K6871K7531K8691L0641L3026L4988L5955L6301
57120A860133L7167L9387M2612M5780M8527N1657N5998O1424O7580P4924Q4157
57109B469346R4903J06014J17258J29767J44798J63029J85556K14684K53264L03855
57099D182474L69006M51732N55135O81689Q32622J006667J198642J400508J605343
$$ plain form
57175 690180 704534 719585 735727 752442 768835 784681 800362 816046 831583 847153 863467
57164 863467 881112 899910 918970 937335 954730 971712 989000 1006736 1024716 1043156 1062566
57153 1062566 1082775 1102765 1121842 1140377 1159030 1177814 1196494 1215360 1234931 1255204 1275864
57142 1275864 1296984 1318813 1341011 1362862 1384330 1406312 1429619 1454134 1479140 1504116 1529045
57131 1529045 1554194 1579846 1606129 1633000 1660531 1689222 1719863 1752889 1787877 1823832 1860133
57120 1860133 1897300 1936687 1979299 2025079 2073606 2125263 2181261 2242685 2310265 2385189 2469346
57109 2469346 2564249 2670263 2787521 2917288 3062086 3225115 3410671 3625355 3878619 4182474
57099 4182474 4551480 5003212 5558347 6240036 7072658 8079325 9277967 10678475 12283818
57090A2283818J810322K014761K214821K399866K552613K651720K675747K608240
57082C1211908K441441K175223J812961J361298Q36980K73722k81071p80816j195661
57073C7855985j519330j764774j953376k103460k222404k305497k341784k322674
57065B1322686k247451k123372j962591j778912j585459j393234j210620j043464
57057G977583q95152p66593o56862n64221m86635m21667l66822l20332k81130
57048C218169k48008k19479j94723j73844j56621j41683j27619j14367j02732
57039A739093r2875q4048p5700o8042o1488n6060n1394m6968m2390l7646l3115
57028A089367k9145k5913k3599k2143k0666j7915j3695r033m430J092Q380J6841
$$ plain form
57090 12283818 14094140 16108901 18323722 20723588 23276201 25927921 28603668 31211908
57082 31211908 33653349 35828572 37641533 39002831 39839811 40113533 39832462 39051646 37855985
57073 37855985 36336655 34571881 32618505 30515045 28292641 25987144 23645360 21322686
57065 21322686 19075235 16951863 14989272 13210360 11624901 10231667 9021047 7977583
57057 7977583 7082431 6315838 5658976 5094755 4608120 4186453 3819631 3499299 3218169
57048 3218169 2970161 2750682 2555959 2382115 2225494 2083811 1956192 1841825 1739093
57039 1739093 1646218 1562170 1486470 1418428 1356940 1300880 1249486 1202518 1160128 1122482 1089367
57028 1089367 1060222 1034309 1010710 988567 967901 949986 936291 927258 922828 923920 932300 949141
57016I49141K5972L7190N2609P2735R7027J25358J55482J78590J81183J54526
57006B029813J01971L6164k9611q6408j28949j54357j62901j58293j45853j30258
56996A171318j14524r9829q5946p2453n9824m8939l9740l1262k3080j5816r943
56985E69962n020o60K411L003R10k945p489j2047j5945j8449j9359j9264j8767
56972D56341j7766j5799j2915r755o822m171j816O3J607L451N990Q786J1174J3322
56958D31690J5926J8844K0479J8929J3575N533l180j0792j6356j9683k0953k0526
56946D33486j8998j7054j4990j2574r650o658m201k200Q1L272P420J2183J7123
56933C87240K1786K5832K8960L0345K8444K2138J2190J058q974j7020k3044k6888
$$ plain form
57016 949141 975113 1012303 1064912 1137647 1234674 1360032 1515514 1694104 1875287 2029813
57006 2029813 2131784 2167948 2138337 2051929 1922980 1768623 1605722 1447429 1301576 1171318
56996 1171318 1056794 956965 871019 798566 738742 689803 650063 618801 595721 579905 569962
56985 569962 564942 564282 566693 569696 570606 567661 560172 548125 532180 513731 494372 475108 456341
56972 456341 438575 422776 409861 400106 393284 389113 387297 387360 388967 392418 398408 407194 418368 431690
56958 431690 447616 466460 486939 505868 519443 524976 521796 511004 494648 474965 454012 433486
56946 433486 414488 397434 382444 369870 360220 353562 349361 347161 347242 350514 357934 370117 387240
56933 387240 409026 434858 463818 494163 522607 544745 556935 557993 549019 531999 508955 482067
56921D82067k8365k7879k6292k4273k2018j9526j6873j4240j1750r348o964m922
56909B69617l927m274n145n198l944k149q33k69n9K71R61J967K943L535L837M361
56893B61694N510P291R545J2108J4746J7296J9745K1777K2264J9945J4751P918
56881D34590Q16n769j1131j4439j5579j5511j5185j4479j2727r754n872j344L465
56868C17081P817J1301J4680J9320K5731L3296M1329M9566N7182O1863O0625N1800
56856G51591L6335J7278j850j8376l0750l8304m1185m0353l7055l2133k6006j9195
56844E19997j2333n573J542R414J7995K7289L7749M9838O3384P7460R0188R8312
56832I75262R7664Q5268O1544L0369k799l2988n6780p2654q0821q2529p9294p2535
$$ plain form
56921 482067 453702 425823 399531 375258 353240 333714 316841 302601 290851 281503 274539 269617
56909 269617 265690 261416 256271 251073 247129 244980 244147 243878 243819 244090 245051 247018 249961 253496 257333 261694
56893 261694 267204 274495 284040 296148 310894 328190 347935 369712 391976 411921 426672 434590
56881 434590 435406 429637 418506 404067 388488 372977 357792 343313 330586 320832 314960 313616 317081
56868 317081 324898 336199 350879 370199 395930 429226 470555 520121 577303 639166 699791 751591
56856 751591 787926 805204 803354 784978 754228 715924 674739 634386 597331 565198 539192 519997
56844 519997 507664 502091 503633 513047 531042 558331 596080 645918 709302 786762 876950 975262
56832 975262 1072926 1158194 1219738 1250107 1247308 1214320 1157540 1084886 1004065 921536 842242 769707
56820G69707o3575n3549m3236l3112k3374j3820m032O196J6762K7755L9607N2259
56808F77588O4285P3005P5357O8752N2119K7249r99k6819m6450n9238o6168o8190
56796G70491o6092o1087n4593m7449l9743l1577k3565j6380r993l681L171J0516
56784D30018J7929K5107L1677L6628L8321L5280K7040J4423o72j5700k8225l6678
56772E75148m0765m1334l9865l7651l5070l1762k7706k3734k0620j8098j5474
56761B43069j2893j1111j0127r078p568o171n246m306l023j993j777j987j992
56748A65797j918k126k275j862j244j240j814k097j596o70J31N09K52n92j361
56733A47894j292o02l40r92j809j838j093l43r5j77j50K90J180K268L045L051
$$ plain form
56820 769707 706132 652583 609347 576235 552861 539041 535009 541205 557967 585722 625329 677588
56808 677588 741873 814878 890235 958987 1011106 1038355 1037356 1010537 964087 904849 838681 770491
56796 770491 704399 643312 588719 541270 501527 469950 446385 430005 420012 416331 419502 430018
56784 430018 447947 473054 504731 541359 579680 614960 642000 656423 655751 640051 611826 575148
56772 575148 534383 493049 453184 415533 380463 348701 320995 297261 276641 258543 243069
56761 243069 230176 219065 208938 199860 192292 186121 180875 176569 173546 171553 169776 167789 165797
56748 165797 163879 161753 159478 157616 156372 155132 153318 151221 149625 148955 149086 149595 149847 149255 147894
56733 147894 146602 146000 145660 144668 142859 141021 139928 139585 139490 139313 139163 139453 140633 142901 145946 148997
56717A48997K270J186L60p6l95p55r65q67o94o81n35J48J049J290N91l12o30l78
56699A49603j0K53L80K48j37n20p92j117j372j012Q8J164J492J345J378J516J217
56682A53724N62L01Q01J532J750J259N20J63M08P64O37K69N14J430J807P59q93
56665A66307j663j342r10q80p63k08L90N53K78j78m38L4J357K650K842K158J932
56648A72119K739L659L688L057K598K552K609K567K400J994J422J143J431J834
56634B05812J625O96l80j039j116p20j06K77K1q09j611j803j402r74r80j248j265
56617A94978q87n42o44j103j543j719j495p44L33J034Q42J20l07k55l03p91j245
56600A85729j133o52l99m57k93L52Q96O08k73n83L86J922K736K517K001J673J240
$$ plain form
56717 148997 151267 152453 152813 152737 152342 151587 150622 149755 149061 148380 147845 147993 149042 150332 150923 150611 149981 149603
56699 149603 149593 149846 150226 150474 150337 149817 149025 147908 146536 145524 145612 146776 148268 149613 150991 152507 153724
56682 153724 154286 154587 155388 156920 158670 159929 160449 160612 161020 161784 162421 162690 163204 164634 166441 167200 166307
56665 166307 164644 163302 162392 161512 160749 160541 160931 161484 161762 161584 161146 161180 162537 165187 168029 170187 172119
56648 172119 174858 178517 182205 185262 187860 190412 193021 195588 197988 199982 201404 202547 203978 205812
56634 205812 207437 208133 207753 206714 205598 204878 204772 205049 205070 204261 202650 200847 199445 198471 197491 196243 194978
56617 194978 194091 193549 192905 191802 190259 188540 187045 186301 186634 187668 188510 188630 188323 188068 187765 186974 185729
56600 185729 184596 183944 183545 183088 182795 183147 184043 184651 184378 183795 184181 186103 188839 191356 193357 195030 196270
56583A96270N40J10L19O47M47p7k78K1N77J289K015K229J634Q52P59J369K015
56566B10738K429K838L255L512L981N387P790J0388J2411J3559J3569J2082R208
56553C11147N708K486J85q60q17l92j24J94Q77J387Q95l22r98n28K97M58j17q12
56535C18664j111q61l26j26o64j538k074k395l221m547n412n216m444l793l329
56520B79607k927k790l014l220l189l351m086m949n078m199k847j810j565k051
56506B34531k733l123l299l670m184m260l600k647k008j773j558r98r1O34N04
56491B01725m20j114p46J77N75M06N23J060J163N14o2L6L00J89J18O09J271J411
56473B07735J090Q20P77R43J464K171K363J767J212J479J988J583L26n09j77P56
$$ plain form
56583 196270 196810 196920 197239 197886 198333 198256 197978 197999 198576 199865 201880 204109 205743 206595 207354 208723 210738
56566 210738 213167 216005 219260 222772 226753 232140 239930 250318 262729 276288 289857 301939 311147
56553 311147 316855 319341 319526 318666 317849 317457 317333 317527 318404 319791 320686 320364 319366 318838 319135 319593 319476 318664
56535 318664 317553 316692 316366 316240 315576 314038 311964 309569 306348 301801 296389 291173 286729 282936 279607
56520 279607 276680 273890 270876 267656 264467 261116 257030 252081 247003 242804 239957 238147 236582 234531
56506 234531 231798 228675 225376 221706 217522 213262 209662 207015 205007 203234 201676 200678 200587 201221 201725
56491 201725 201305 200191 199445 199622 200197 200603 201126 202186 203349 203863 203801 203837 204137 204326 204444 205053 206324 207735
56473 207735 208825 209645 210422 211365 212829 215000 217363 219130 220342 221821 223809 225392 225718 225209 225032 225788
56457B25788J349J309Q36K35q8K55J116J743J538P48K00M29J174J751J774J419
56441B41576R94N75K23K67Q86J594J673J153P96J027J429J518J425J474J616J611
56425B59837J447J225R55P14P08R06J000R02Q76R57P21o5r90j555j738j701j336
56408B62863o32p1j67p76j310j474j400j218q82m27j4K06J60j32m71n52l25p5
56390B53303l4n4Q6K84K40p4l85m67m15l82j81O46K119L393L531K759K324K851
56372B69544L515L335K588K177K140J838J270J059J241J157O20K33L27N33N80
56357B92157O93Q81O97np48j149j308j351j229j101j213j277p20L63J262J725
56341B87677K107K474K505K338K483K766K480J745J565K232K914L106L251L466
$$ plain form
56457 225788 227137 228446 229282 229517 229429 229684 230800 232543 234081 234829 235029 235458 236632 238383 240157 241576
56441 241576 242570 243145 243368 243635 244521 246115 247788 248941 249737 250764 252193 253711 255136 256610 258226 259837
56425 259837 261284 262509 263464 264178 264886 265792 266792 267694 268570 269527 270248 270183 269193 267638 265900 264199 262863
56408 262863 262231 262160 261993 261217 259907 258433 257033 255815 254933 254506 254492 254698 254858 254726 254255 253703 253378 253303
56390 253303 253269 253215 253301 253585 253825 253751 253366 252899 252484 252102 251921 252567 254686 258079 261610 264369 266693 269544
56372 269544 273059 276394 278982 281159 283299 285137 286407 287466 288707 289864 290484 290717 291044 291577 292157
56357 292157 292850 293731 294428 294423 293675 292526 291218 289867 288638 287537 286324 285047 284327 284690 285952 287677
56341 287677 289784 292258 294763 297101 299584 302350 304830 306575 308140 310372 313286 316392 319643 323109
56327C23109L077K001J302J573K048K069K178K783K976J906M02q1N93J354J480
56312C48770R83J63l74J75J761L105L212K711K846L736M561M988N382N946O395
56297C94360O344N535M008K439J683J685J530Q87N38R95J719K228K946M078M821
56282D35796M570M032M128M649M877M804M792M883N218O233P686Q481Q253Q037
56268E16439Q456Q643Q056P928R445J1690J3092J3889J5374J7625J9791K1954
56256F72382K4835K8177L1146L4059L8116M3623M9904N6652O4061P1957Q0052
56245A194964Q8625R7736J06353J13544J19792J25667J30038J31264J29481J25828
56235B363292J19961J10304R6431P9349N9716L7744J4760p129k7084m5608o2595
$$ plain form
56327 323109 326186 328187 329489 331062 333110 335179 337357 340140 343116 345022 345424 345343 345936 347290 348770
56312 348770 349753 349916 349542 349717 351478 354583 357795 360506 363352 367088 371649 376637 382019 387965 394360
56297 394360 400704 406239 410247 412686 414369 416054 417584 418471 419009 420004 421723 423951 426897 430975 435796
56282 435796 440366 444398 448526 453175 458052 462856 467648 472531 477749 483982 491668 500149 508402 516439
56268 516439 524895 533538 541594 549522 558967 570657 583749 597638 613012 630637 650428 672382
56256 672382 697217 725394 756540 790599 828715 872338 922242 978894 1042955 1114912 1194964
56245 1194964 1283589 1381325 1487678 1601222 1721014 1846681 1976719 2107983 2237464 2363292
56235 2363292 2483253 2593557 2689988 2769337 2829053 2866797 2881557 2874428 2847344 2801736 2739141
56224B739141p6980q8396r7499j04501j08890j10622j10239j07819j03384r8102
56214A732709r3444q9221q4137p8185p2649o7839o2727n7094n2069m8178m4635
56203I82531m0928l7484l4344l0825k6972k3784k1601j9672j7659j6024j4699
56192F98539j2943j0864r472q893q107o783n733n149m207k880k291k684k865k326
56178F13342k200l122l910l493k614k364k346j596l23M65L89k05q91j191o28N99
56162E89912J614K003K183K414K404K271K811M248N694O400O745P437Q548R767
56148F54451J0897J1702J2025J2293J3287J5117J6979J8012J7893J6838J5750
56137H15244J6028J8319K1812K5690L0623L7709M6605N6244O6585P7823Q8246
$$ plain form
56224 2739141 2662161 2573765 2476266 2371765 2262875 2152253 2042014 1934195 1830811 1732709
56214 1732709 1639265 1550044 1465907 1387722 1315073 1247234 1184507 1127413 1075344 1027166 982531
56203 982531 941603 904119 869775 838950 811978 788194 766593 746921 729262 713238 698539
56192 698539 685596 674732 665260 656367 648260 641477 635744 630595 626388 623508 621217 618533 615668 613342
56178 613342 611142 608020 604110 600617 598003 595639 593293 591697 591374 591839 592228 592023 591132 589941 589313 589912
56162 589912 591526 593529 595712 598126 600530 602801 605612 609860 615554 621954 628699 636136 644684 654451
56148 654451 665348 677050 689075 701368 714655 729772 746751 764763 782656 799494 815244
56137 815244 831272 849591 871403 897093 927716 965425 1012030 1068274 1134859 1212682 1300928
56126A300928R5011R6923R4652Q8519P8413O6026N4818M6931M1758L7850L4359
56115B036188L0255K4165J5901O897j277p772j2038j4349j6720k1540k9206l8588
56103A971916m9361o1598p3382q1481q4751q4513q1549p5289o6362n7114m8775
56092A207741m0623l2558k5978k1295j7115j2783r321o972m354j039J444K303
56080A039450K830M005N038N342N726O596P167P401Q431J0246J1354J1532J2357
56067A137475J4252J5695J6208J7204J8828J9119J7578J6446J6842J6831J4995
56056A321473J2921J2216J1902J0878J0188J0803J1705J2138J3248J5582J7456
56045A460510J7748J7812J8917K0325K1572K3808K7111K9387K9783L0278L2042
$$ plain form
56126 1300928 1395939 1492862 1587514 1676033 1754446 1820472 1875290 1922221 1963979 2001829 2036188
56115 2036188 2066443 2090608 2106509 2113406 2112129 2104357 2092319 2077970 2061250 2039710 2010504 1971916
56103 1971916 1922555 1860957 1787575 1706094 1621343 1536830 1455281 1379992 1313630 1256516 1207741
56092 1207741 1167118 1134560 1108582 1087287 1070172 1057389 1048068 1041096 1036742 1035703 1037147 1039450
56080 1039450 1042280 1046285 1051323 1056665 1062391 1068987 1076154 1083555 1091986 1102232 1113586 1125118 1137475
56067 1137475 1151727 1167422 1183630 1200834 1219662 1238781 1256359 1272805 1289647 1306478 1321473
56056 1321473 1334394 1346610 1358512 1369390 1379578 1390381 1402086 1414224 1427472 1443054 1460510
56045 1460510 1478258 1496070 1514987 1535312 1556884 1580692 1607803 1637190 1666973 1697251 1729293
56034A729293L3370L3150L3114L4454L5551L5452L6156L8981M1857M2948M3682
56023B138008M5524M7027M6888M6738M8052M9472N0036N1639N5427N9094O0786
56012B698691O2275O5322O8447P0407P3153P8076Q3063Q6546R0602R6701J02431
56001C575714J06076J10209J16997J24153J29549J35463J44209J53876J62595
55992D758841J72478J85133J98091K09896K23663K41092K58530K73713K90503
55983F811940L11914L34891L57412L83856M17114M52693M87561N27315N77160
55974A0661856O33546O93012P61078Q43497R37053J038746J155720J296208J460177
55965A9480893J649939J879947K164573K508274K922298L439919M101242M937046
$$ plain form
56034 1729293 1762663 1795813 1828927 1863381 1898932 1934384 1970540 2009521 2051378 2094326 2138008
56023 2138008 2183532 2230559 2277447 2324185 2372237 2421709 2471745 2523384 2578811 2637905 2698691
56012 2698691 2760966 2826288 2894735 2965142 3038295 3116371 3199434 3285980 3376582 3473283 3575714
56001 3575714 3681790 3791999 3908996 4033149 4162698 4298161 4442370 4596246 4758841
55992 4758841 4931319 5116452 5314543 5524439 5748102 5989194 6247724 6521437 6811940
55983 6811940 7123854 7458745 7816157 8200013 8617127 9069820 9557381 10084696 10661856
55974 10661856 11295402 11988414 12749492 13592989 14530042 15568788 16724508 18020716 19480893
55965 19480893 21130832 23010779 25175352 27683626 30605924 34045843 38147085 43084131
55957D3084131N983775P298545Q943207J0977983J3496602J6640853K0540152
55950A26965248K5234587L0613146L6238627M1024034M3137953M0620774L2547997
55943C76382366J9825618M871776r547866k1382242k9653919l4273504l5728063
55936B70494166l4809912l2364353k9098014k5520050k1976596j8684121j5746698
55929I2294422j3192556j1017327r197631p688454o437764n406126m562854l872477
55921C0919233l300013k823839k430790k103849j825739j589012j391360j225199
55913A4229432j081237r57383q54663p68404o91992o25094n69808n22587m77926
55904G680338m36420m01499l71595l42678l15303k92151k71662k50684k30538
$$ plain form
55957 43084131 49067906 56366451 65309658 76287641 89784243 106425096 126965248
55950 126965248 152199835 182812981 219051608 260075642 303213595 343834369 376382366
55943 376382366 396207984 401079760 391531894 370149652 340495733 306222229 270494166
55936 270494166 235684254 203319901 174221887 148701837 126725241 108041120 92294422
55929 92294422 79101866 68084539 58886908 51198454 44760690 39354564 34791710 30919233
55921 30919233 27619220 24795381 22364591 20260742 18435003 16845991 15454631 14229432
55913 14229432 13148195 12190812 11336149 10567745 9875753 9250659 8680851 8158264 7680338
55904 7680338 7243918 6842419 6470824 6128146 5812843 5520692 5249030 4998346 4767808
55895D767808k14090j99658j84012j68621j56832j47361j36555j24711j14490
55886C321478j05162r3995q1365o9237n6521m0957k3634o847J0366K9586M7937
55875B931649O0506O5822O4320N3830L2224L184k5985n1500p3793r2741j07255
55864B860261j18614j29136j37826j41511j39829j35157j28386j18821j07591
55855A703390r7080q7330p6745o5993n7504n1506m6084m0881l7321l5406l3575
55844A073965l1539l0226k9275k7493k5392k4314k3693k1976j9701j8537j8095
55833H03724j6727j4894j4398j4784j3875j1667j0358j0546j0560r753r382r942
55821F56838j0400j0399j0642j0971j0400r197q618q568p883o685o051n547l713
$$ plain form
55895 4767808 4553718 4354060 4170048 4001427 3844595 3697234 3560679 3435968 3321478
55886 3321478 3216316 3122321 3040956 2971719 2915198 2874241 2850607 2843760 2854126 2883712 2931649
55875 2931649 2992155 3057977 3122297 3176127 3208351 3211535 3185550 3134050 3060257 2967516 2860261
55864 2860261 2741647 2612511 2474685 2333174 2193345 2058188 1929802 1810981 1703390
55855 1703390 1606310 1518980 1442235 1376242 1318738 1267232 1221148 1180267 1142946 1107540 1073965
55844 1073965 1042426 1012200 982925 955432 930040 905726 882033 860057 840356 821819 803724
55833 803724 786997 772103 757705 742921 729046 717379 707021 696475 685915 676162 666780 656838
55821 656838 646438 636039 625397 614426 604026 594829 586211 577643 569760 563075 557024 551477 547764
55808E47764q71J123J974L175N151O744P702Q992J0432J0493Q959P228N637K868
55794F27371j351n387q224j0679j3293j5106j5354j4583j3321j1322q798o803
55782E03150n745m954m224m316n450o759p628q166q024o263k794J404N812J0643
55768D56686J5184J7429J5978J1249M536k949r840j4756j7242j7806j6930j4925
55756D26614j2548j0595r015p523o792p667r411j0231r590q591q109p965p940
55743C10637q129q137p290n740m267l025j718p27o77j054q03j28k22j262k301
55728B65157k997l824m622m692m360m661n419n416m601m215m476m088k528q95
55714B08363J41J346L131M477M691M654N329O213O278N442M124K291j94k956n385
$$ plain form
55808 547764 546893 548016 549990 553165 558316 565060 572762 581754 592186 602679 611638 618866 624503 627371
55794 627371 626020 620633 612409 601730 588437 573331 557977 543394 530073 518751 509953 503150
55782 503150 497405 492451 488227 483911 478461 471702 464074 455908 447884 441621 438827 440231 446043 456686
55768 456686 471870 489299 505277 516526 521062 518113 508273 493517 476275 458469 441539 426614
55756 426614 414066 403471 394456 386933 380141 372474 363063 352832 343242 334651 326542 318577 310637
55743 310637 302508 294371 287081 281341 277074 274049 272331 271604 270927 269873 269070 268942 268720 267458 265157
55728 265157 262160 258336 253714 249022 244662 240001 234582 229166 224565 220350 215874 211786 209258 208363
55714 208363 208504 209850 212981 217458 222149 226803 232132 238345 244623 250065 254189 256480 256286 253330 247945
55699B47945p074p719p396o967p249p745p254n820m774m762m970m604l805k785
55685A65021j396N8Q11Q69J075J632J802J431J333J731J654N09r31j739j922j819
55669A70119j560j486k021k677k370j123j31J51O06J683K579K872L397M605N479
55654A80123N183M516M578N029M825L883K914K171J322Q1j676l832n607n959m909
55639A92642l804l770m578n424n888n770m951l914l469l543l200k236j517j422
55625A39156j215n49j52l42l00K71K68r42k126j983j155j009j477j525r90n15
55609A25415k39N2N2n74j249j250r79j299k049k375k129j795j414p45j40j73n33
55592A08576m39P8L29K30L27O66P12M30M15Q02R48M36l05n98j84P62J854K597
$$ plain form
55699 247945 240871 233152 225756 218789 211540 203795 196541 190721 185947 181185 176215 171611 167806 165021
55685 165021 163625 163683 164494 165363 166438 168070 169872 171303 172636 174367 176021 176530 175599 173860 171938 170119
55669 170119 168559 167073 165052 162375 160005 158882 158751 158902 159508 161191 163770 166642 170039 174644 180123
55654 180123 185306 189822 194400 199429 204254 208137 211051 213222 214544 214625 212949 209117 203510 197551 192642
55639 192642 188838 185068 180490 175066 169178 163408 158457 154543 151074 147531 144331 142095 140578 139156
55625 139156 137941 137392 137240 136898 136598 136869 137137 136195 134069 132086 130931 129922 128445 126920 125930 125415
55609 125415 125176 125228 125280 124706 123457 122207 121228 119929 117880 115505 113376 111581 110167 109422 109282 109109 108576
55592 108576 108137 108215 108544 108774 109101 109767 110479 110909 111324 112126 113074 113510 113205 112607 112423 113185 115039 117636
55574A17636K764K700K958L660M549N451O282O773O663O066N298M419L276J813
55560A80308J39j599l160m294m992n393n452n118m855n248n987n990m892l541
55546A19926k709k229j874k063k859l225k333r29l09m78m17J61N18K07l62p41
55530A00284j011j360j718j901j829j552j339j465j755j688j229r68j124j167
55516H0178q47p45j049p64Q34K705L255K455J567J126N89k06o56n93o29r98j136
55499H5086o91q7K38L45K82j64q75j286j183r81r63p87j40P19J404J933K444K782
55481H8076K675K133J386O48K7n16j106j667j792j290p05p91j438j694r80J97
55465H3163R69J071Q27N00Q5m15q24r69q51n34L9R63J938K252J517L62j47J62
$$ plain form
55574 117636 120400 123100 126058 129718 134267 139718 146000 152773 159436 165502 170800 175219 178495 180308
55560 180308 180447 178848 175688 171394 166402 161009 155557 150439 145584 140336 134349 128359 123467 119926
55546 119926 117217 114988 113114 111051 108192 104967 102634 101705 101396 100918 100501 100662 101180 101387 101025 100284
55530 100284 99273 97913 96195 94294 92465 90913 89574 88109 86354 84666 83437 82469 81345 80178
55516 80178 79331 78586 77537 76773 77607 80312 83567 86022 87589 88715 89304 89098 88442 87849 87220 86222 85086
55499 85086 84395 84308 84546 84891 85173 85009 84134 82848 81665 80684 79721 78934 78794 79513 80917 82850 85294 88076
55481 88076 90751 92884 94270 94918 94945 94429 93323 91656 89864 88574 87869 87078 85640 83946 82966 83163
55465 83163 84132 85203 86030 86530 86615 86200 85376 84407 83556 83022 83061 84024 85962 88214 89731 90093 89946 90108
55447I0108L84j39r50j340j379j468j408p94L5K76j41m69k68J13L22N84J136J609
55429H6211J423N49l79p18l74K13N90P09P90Q26N97J71N1N64J425K155K582K726
55411A00111K567K250K141K293K188J425K53q72j862k660k836k168j272r58j205
55396I9395j359j112o35rP12J086P43R9j08ml95j362j924j423m82j96q16j633
55378I0577j874j360n40o0j69m92n15j62L36Q89J432J555R00j14o36m85l80q17
55360H8085j383j461j109q00n96j28P60J647J945J495O87N6k20l67n87p32n14
55343H6778J30R47J526J444N19q67j915k094j557p79n2M60N83L93L22O23R40P13
55325H8114q8r62j409j220n57L9Pn32p72j62Q88J611J744J425P68j4m61l57m6
$$ plain form
55447 90108 90492 90353 89403 88063 86684 85216 83808 83014 83049 83325 83184 82715 82447 82560 82882 83466 84602 86211
55429 86211 87634 88183 87804 87086 86712 86925 87515 88224 89014 89840 90437 90608 90659 91223 92648 94803 97385 100111
55411 100111 102678 104928 107069 109362 111550 112975 113228 112356 110494 107834 104998 102830 101558 100600 99395
55396 99395 98036 96924 96289 96280 96992 98078 98821 98920 98812 98808 98413 97051 95127 93704 93222 93026 92210 90577
55378 90577 88703 87343 86803 86743 86574 86082 85567 85405 85741 86630 88062 89617 90517 90403 89767 89282 88902 88085
55360 88085 86702 85241 84132 83332 82736 82608 83368 85015 86960 88455 89142 89198 88978 88611 88024 87292 86778
55343 86778 86908 87855 89381 90825 91344 90477 88562 86468 84911 84132 84080 84540 85123 85516 85838 86461 87401 88114
55325 88114 88026 87064 85655 84435 83878 83917 83924 83392 82620 82458 83346 84957 86701 88126 88894 88880 88419 88062 88016
55306H8016J23K44L32k3q53j258n01Q25J549J472J223J026O03O8j50j87n10q74
55288I1125n31M95J353J606J603J517J075L92Q0K52L00q8n28p74j056j293r40
55271I4588m1M95J72l31k07L58P05O70M78J78k53o43q62j017j116r41m71L5N10
55252I2307J045J268N59q12j618j144n5O66R07J010R72P09N20N50L65l25j043
55235I5881j285j336j584j599q01K96N26l57j379j603r65R5J095J554J255O25
55219I0418M35R23J571J754J198j7j472k305j787k29J067J129L62j6N23J223J070
55202I5847J33m77m2Q06Q99K7r52j340j217q23n6J001J676J408M93l57q65j139
55184I5022j121o35J13O63Q13P03M68J90M3O9n0n61j063q29J94J140J146L07m92
$$ plain form
55306 88016 88139 88383 88715 88692 87839 86581 86080 86905 88454 89926 91149 92175 92778 92846 92696 92509 91999 91125
55288 91125 90594 91089 92442 94048 95651 97168 98243 98635 98715 98967 99267 99179 98651 97877 96821 95528 94588
55271 94588 94547 95042 95214 94883 94676 95034 95739 96409 96887 97065 96812 96169 95307 94290 93174 92233 91762 91797 92307
55252 92307 93352 94620 95179 94367 92749 91605 91550 92216 93123 94133 95105 95814 96334 96884 97249 96924 95881
55235 95881 94596 93260 91676 90077 89276 89572 90098 89741 88362 86759 85794 85889 86984 88538 89793 90418
55219 90418 90853 91776 93347 95101 96299 96282 94810 92505 90718 90489 91556 92685 93047 93031 93554 94777 95847
55202 95847 95980 95503 95461 96267 97166 97193 96241 94901 93684 92861 92805 93806 95482 96890 97383 97026 96161 95022
55184 95022 93901 93266 93379 94042 94855 95558 96026 96216 96259 96328 96278 95717 94654 93825 94019 95159 96305 96612 96120
55165I6120n36K0M36K58j68j82L70J006J254J122Q47N62L44K60K29J13N0K84O26
55146A03015N98K09Q5M17N00j85j012j034l77K0j66l55j54P7n7l11k25J92N71
55127A01808O36M15Q4k48o47j214j708j548n09P12J075L70n56q12l23L97Q93R94
55109I9819O64J9n85o90r4R17J716J833J399R82Q62P30K75j98j03N41J070J048
55091A10205P19M48J86k16n02l08J98M01J3n48p03m09q6O9L13Q13J118N52q28
55072A11435k056k239j522p31k67J68P73J093O65k01p36o79m20k49k6K58J76m67
55054A04975j068r17k17J60j12m39k47L12P50Q74P41M14P6qJ09L3l12m52j17K17
55034A04772J5m58n93l37p6P8K59L92M01O28J285J707J074k60j024p35j62KK7
$$ plain form
55165 96120 95584 95604 96040 96298 96130 95948 96318 97324 98578 99700 100547 101109 101453 101713 101942 102055 102105 102389 103015
55146 103015 103613 103822 103907 104324 104824 104639 103627 102593 102216 102236 102070 101715 101561 101638 101581 101270 101045 101237 101808
55127 101808 102444 102859 102943 102695 102048 100834 99126 97578 97069 97781 98856 99226 98670 97858 97535 97932 98825 99819
55109 99819 100483 100502 99917 99227 99133 100050 101766 103599 104998 105980 106842 107572 107847 107649 107546 108087 109157 110205
55091 110205 110924 111372 111558 111342 110840 110532 110730 111131 111144 110596 109893 109484 109398 109467 109780 110593 111711 112263 111435
55072 111435 109379 107140 105618 104887 104620 104788 105561 106654 107319 107118 106382 105703 105283 105034 105008 105266 105442 104975
55054 104975 103907 102990 102773 102933 102821 102382 102135 102447 103197 104071 104812 105226 105302 105294 105403 105436 105124 104672 104555 104772
55034 104772 104787 104329 103736 103399 103323 103401 103660 104052 104453 105081 106366 108073 109147 108887 107863 107128 106966 106968 106995
55015A06995K98N33L80J09J34L24L78L88N61P18N62J75j26j83kL91Q51J192J483
54996A15161J898K231J999J238N67K51j05o86r87o86k75k96n29n23l84m16m86
54979A17972m20n31j006j266p36R0K61j95m18p7K97L92N67R57R56R2j117j643
54961A14175j089o4N30M16J48L87J039J346R18K33p0j5K8K3J93M86O33N63L56
54942A20236M7j88M8P12J042N05k89l97R2L54L23Q81K386L960M549M069L176K514
54924A44020K542L548N364P311Q679R140Q678P539O219N112L941K004q52l830
54910B09415n924o802o868o706o660o700o550o017n184m172k991j895j481j940
54896A39525k485k219j405j078j435j557q30K95J271K217L116L234K223J177J597
$$ plain form
55015 106995 107293 107826 108206 108315 108449 108773 109151 109539 110100 110818 111380 111555 111429 111246 111244 111635 112486 113678 115161
54996 115161 117059 119290 121289 122527 123094 123345 123240 122554 121567 120881 120606 120310 119781 119258 118874 118458 117972
54979 117972 117552 117021 116015 114749 114013 114103 114364 114169 113751 113674 113971 114363 114930 115887 116843 116935 115818 114175
54961 114175 113086 113022 113552 113968 114116 114503 115542 116888 117806 118039 117969 117954 117982 118005 118198 118684 119317 119880 120236
54942 120236 120283 120095 120143 120855 121897 122402 122113 121716 121808 122162 122485 123366 125752 129712 134261 138330 141506 144020
54924 144020 146562 150110 155474 162785 171464 180604 189282 196821 203040 208152 212093 214097 213245 209415
54910 209415 203491 196689 189821 183115 176455 169755 163205 157188 152004 147832 144841 142946 141465 139525
54896 139525 137040 134821 133416 132338 130903 129346 128516 128811 130082 132299 135415 138649 140872 142049 143646
54881A43646L488N434O420O720P017P481P966Q355Q296P153M681J481j589m146
54867B12403o075p062o947o407o468p185p470o562n094m147l779l241k378j852
54853A37736j964k079j641j014q23j024j138j092j209j565j863j839j478r11m45
54838A17651m76j052j726k042j988j687j039p1P16Q75O40N57O82O60L71ml87p41
54820A10939p87l56J59K68J62M23J018J248P19k28j052j460j372r70p77j053j210
54803A05671m35J097K327K675K565K473K251J622P69L9m05m09K00J152J736J544
54787A24872Q28O1m74n58q2N79P65L32j86l39j05N15J604K811L466L492L594M231
54769A45406N113N999P121Q398R064Q790Q354Q423Q289O807M098J390o02k181
$$ plain form
54881 143646 147134 152568 158988 165708 172725 180206 188172 196527 204823 211976 216657 218138 216549 212403
54867 212403 206328 199266 192319 185912 179444 172259 164789 158227 153133 148986 145207 141966 139588 137736
54853 137736 135772 133693 132052 131038 130215 129191 128053 126961 125752 124187 122324 120485 119007 118096 117651
54838 117651 117175 116123 114397 112355 110367 108680 107641 107570 108286 109161 109801 110358 111040 111700 112071 112067 111680 110939
54820 110939 110152 109796 109955 110223 110385 110808 111826 113074 113793 113565 112513 111053 109681 108711 107934 106881 105671
54803 105671 105236 106333 108660 111335 113900 116373 118624 120246 121015 121054 120649 120240 120440 121592 123328 124872
54787 124872 125700 125761 125287 124729 124647 125226 125991 126323 126137 125798 125693 126208 127812 130623 134089 137581 141175 145406
54769 145406 150519 156518 163639 172037 181101 189891 198245 206668 214957 221764 225862 227252 226650 224469
54755B24469l766n359o891q234q821q051o307m878m555m828m704l850k622j414
54741A50189m58l0l44j125j588j148r7P09Q36P31R26J235J186J044J612K965M203
54724A60846M753N190O215P475Q052P694O741N217K869p1k855n076o814p967q122
54709A84147p293o182n392m849m246l651l319l197k981k562k128j938k034k100
54695A32275j646n66M60N36l57j192j145n89m68r46j285r96m88k97k42J36O42
54678A23832N85j78r24j044p83o84o95l71L00P63O06l7p52j123q28J42J219J662
54660A21690J329O96J57k99n93l80L25Q00M12m97j025q76o19p61j043r06l07K54
54642A18357M69O09R74J296J088M82K04N24Q17N09m3k02j19m09r89j124n80O3
$$ plain form
54755 224469 220703 215344 208453 200219 191398 183347 177040 172162 167607 162779 158075 154225 151603 150189
54741 150189 149731 149701 149357 148232 146644 145496 145399 146108 146944 147675 148601 149836 151022 152066 153678 156643 160846
54724 160846 165599 170789 177004 184479 192531 200225 206966 212183 215052 214981 212126 207050 200236 192269 184147
54709 184147 176854 170672 165280 160431 156185 152534 149215 146018 143037 140475 138347 136409 134375 132275
54695 132275 130629 130063 130523 131059 130702 129510 128365 127776 127308 126362 125077 124081 123593 123296 123054 123190 123832
54678 123832 124417 124239 123315 122271 121488 120804 120109 119738 120038 120801 121407 121370 120618 119495 118667 118809 120028 121690
54660 121690 123019 123715 123872 123573 122980 122600 122925 123725 124137 123640 122615 121739 121120 120359 119316 118410 118103 118357
54642 118357 118826 119435 120409 121705 122793 123275 123479 124003 124820 125329 125286 125084 124965 124556 123567 122443 121863 121926
54624A21926L81N60O95M33k72p92o51k00L2P9J83J99p4l38j83K71O27Q05R21Q17
54604A25419K87l83o59m99l75n77q10n42L91J498J942J352L21k34k24l51q51j028
54586A24677m27K80K72j75k23J47J81l77q68o69J27J022J627J714J253N05k14
54569A28852q30j328j467j032k76K91N13O05O71O21M47K27q1m83p55p00m58k44
54551A24573K7L91M86N3l57M2J027J412N67o71j010j74R69J541J536J559J928
54534A33899K295K142J442N57k76r29j053m38K60J8j067j646r40J82N77L99L29
54517A35751J47p42j849k066j369p79p14o65m44n22q95q55k41K22K18L84J070
54500A26651J580J273N03j53p43j372j594j086k56M68J296K259K504J350m42j411
$$ plain form
54624 121926 122307 122867 123562 123995 123723 122931 122280 122080 122112 122191 122374 122573 122499 122161 121978 122249 122876 123681 124602 125419
54604 125419 125706 125323 124664 124165 123790 123213 122403 121861 122252 123750 125692 127044 127365 127131 126907 126556 125705 124677
54586 124677 124250 124530 124802 124627 124404 124551 124732 124355 123487 122818 122945 123967 125594 127308 128561 129066 128852
54569 128852 128022 126694 125227 124195 123919 124210 124723 125328 125999 126620 127067 127294 127213 126730 125975 125275 124817 124573
54551 124573 124600 124991 125477 125530 125173 125215 126242 127654 128221 127550 126540 126366 127335 128876 130412 131971 133899
54534 133899 136194 138336 139778 140335 140059 139130 138077 137639 137899 137917 136850 135204 134264 134446 135023 135422 135751
54517 135751 135898 135156 133307 131241 129872 129093 128379 127714 127270 126748 125853 124998 124757 124979 125197 125581 126651
54500 126651 128231 129504 130007 129854 129111 127739 126145 125059 124803 125271 126567 128826 131330 132680 132238 130827
54484A30827j107k65M30Q59J008Q76P87J057J330J038M05K48P42J105P42J7l65
54467A39734k07K47O94P96L60k29j87N94J128N33o68j130m71L00K35l68o49m78
54449A40234l78n30n91m62m92p62q06m02n3k12n31m36k7J84J18Q7R6n0j25K74
54429A35136Q00N71m69j212q07K03P34O01M63O77Q42N35nj43L76J036J002O7j002
54410A39405j268o77MK90M44Q37J300J479J352J127Q86P20Q70J442K033K058J360
54393A53662L76k74k43L00P83P65L92K07M02O02L84k21r14j434j598j318p54k81
54375A50836j47l56p87j178j056k42O38P12M1m55l06k1K7L19J187J871J454K98
54357A52835l83j93P8k50q34q75j23R49J610J542J164J242J935K497K292J754
$$ plain form
54484 130827 129720 129455 129885 130744 131752 132628 133415 134472 135802 136840 137245 137493 138235 139340 140082 140099 139734
54467 139734 139527 139774 140468 141264 141624 141395 141208 141802 142930 143463 142795 141665 141194 141494 141729 141361 140712 140234
54449 140234 139856 139326 138735 138273 137781 137019 136213 135811 135758 135546 135015 134579 134552 134736 134854 134941 135037 134987 134862 135136
54429 135136 135936 136507 136038 134826 134019 134222 134956 135557 136020 136697 137539 138074 138069 137926 138302 139338 140340 140407 139405
54410 139405 138137 137460 137464 137754 138198 139035 140335 141814 143166 144293 145179 145899 146769 148211 150244 152302 153662
54393 153662 154038 153764 153521 153821 154604 155369 155761 155968 156370 156972 157356 157135 156221 154787 153189 151871 151117 150836
54375 150836 150689 150333 149546 148368 147312 147070 147708 148420 148461 148006 147700 147679 147706 148025 149212 151083 152537 152835
54357 152835 152452 152259 152337 152087 151253 150378 150255 151204 152814 154356 155520 156762 158697 161194 163486 165240
54341A65240J818K514K867K173Q61k09p77j251j998k888l412l198k441j810j790
54326A55699k167k343k047j537j166r67p60m23m1J45j1k99l35k3L18M58N50P24
54308A45775P73N08J75Q4P8j98o92j104j410j736j849j387n25J78N79R99J442
54291A41690J448Q66J72k30m44n45k84L11N92K28o1O02J855K399J637L16o05r83
54273A48964j098q35J28J503K359J998O51p33j280p95J12N50J44n41o03J65J044
54256A51733J274R06N48M90N07L68J54rj74l45l74k30k33o54j280j563j201m03
54238A49514L33N76J74o61j448j783j640j292r38m83K61J213J925J911J107n0
54222A48719j012j548j712j527r32J3R74J487J273M30n15r39n95K32J102J725
$$ plain form
54341 165240 167058 169572 172439 174612 175473 175264 174487 173236 171238 168350 164938 161740 159299 157489 155699
54326 155699 153532 151189 149142 147605 146439 145472 144712 144289 144248 144393 144382 144083 143748 143725 144043 144501 145051 145775
54308 145775 146548 147056 147231 147315 147393 147195 146503 145399 143989 142253 140404 139017 138492 138670 139249 140248 141690
54291 141690 143138 144004 144176 143946 143502 142957 142673 142984 143576 143804 143743 144345 146200 148599 150236 150552 149947 148964
54273 148964 147866 147031 147159 148662 151021 153019 153670 152937 151657 150862 150974 151524 151668 151127 150524 150689 151733
54256 151733 153007 153913 154461 154951 155458 155826 155980 155971 155797 155452 155078 154848 154615 153961 152681 151118 149917 149514
54238 149514 149847 150423 150597 149936 148488 146705 145065 143773 142835 142352 142613 143826 145751 147662 148769 148719
54222 148719 147707 146159 144447 142920 141988 142001 142975 144462 145735 146165 145650 144711 144116 144348 145450 147175
54206A47175J860J258R1q79j057p47o76r46j043p70m66k89J7M92P86Q30J068J649
54188A48353K037J760J040L15l43q95j020o01p5J81L14M01J6r90j759j350n7R80
54170A48307J216J033Q23N20M6n06j094j571j417l54R22J297O45j07l35m07p86
54153A48232j207j147n69J15N35N09O8m00m22l6J83j53p22r62p45m04k82m02m42
54134A41749RR78J878K036J448P46L80J85k12q16j255j144m47L56N90R0n37o14
54116A45420j92K42N32Q46J073R13N77O86J339J894J845J382Q51K72l28o60o05
54099A56087m60m68m09m7M24O86P63Q08P24L33k55p11p44k47O36J401J522J015
54081A61058M36J87J88L13O69J198J490J306R47P19M75J6l93l31J94R37J822K712
$$ plain form
54206 147175 149035 150293 150384 149505 148448 147701 147025 146079 145036 144266 143800 143511 143528 144020 144806 145636 146704 148353
54188 148353 150390 152150 153190 153505 153162 152267 151247 150646 150571 150752 151066 151467 151483 150493 148734 147384 147327 148307
54170 148307 149523 150556 151379 151899 151945 151439 150345 148774 147357 147003 147925 149222 149867 149760 149425 149018 148232
54153 148232 147025 145878 145309 145424 145959 146468 146536 146136 145714 145678 145861 145708 144986 144024 143279 142875 142593 142191 141749
54134 141749 141758 142736 144614 146650 148098 148844 149224 149409 149197 148381 147126 145982 145535 145891 146481 146571 146034 145420
54116 145420 145228 145470 146002 146848 147921 148834 149411 150097 151436 153330 155175 156557 157408 157680 157352 156692 156087
54099 156087 155627 155159 154750 154703 155127 155813 156576 157384 158108 158441 158186 157475 156731 156484 157120 158521 160043 161058
54081 161058 161494 161681 161869 162182 162851 164049 165539 166845 167792 168511 168986 169002 168609 168278 168472 169409 171231 173943
54063A73943L045K349J064K67M83J166J511J455J657K650M180N503O167O351O301
54048B18092N687M009J584l95j100r44r42j514k248k484j871n76O77J137R88J467
54032B21567L405N909P183O625N507N316O100O721O373N286M155L383L010K996
54018B93536L262L495L254K436J455Q42P06P41O44K78m22j403k345k921l204l530
54002B96824l994m391m695n075n419n298m661m031l724l349k465j375p55p75r87
53987B45830j034j019j266j980l018l870l975l309k451j932j700j438j072p36
53973B17030m88l24k58k05m1N0k54p28o76oM44J88j4O83J693J737Q44M53J446
53954B21574L019L782L270K068J043P14R59J125Q09M91Q72J695J928J292P58J237
$$ plain form
54063 173943 176988 179337 180401 180668 181151 182317 183828 185283 186940 189590 193770 199273 205440 211791 218092
54048 218092 223779 227788 229372 228977 227877 226933 225991 224477 222229 219745 217874 217298 217975 219112 220100 221567
54032 221567 224972 230881 238064 244689 250196 255512 261612 268333 274706 279992 284147 287530 290540 293536
54018 293536 296798 300293 303547 305983 307438 308280 308986 309727 310371 310649 310227 308824 306479 303558 300354 296824
54002 296824 292830 288439 283744 278669 273250 267952 263291 259260 255536 252187 249722 248347 247592 246817 245830
53987 245830 244796 243777 242511 240531 237513 233643 229668 226359 223908 221976 220276 218838 217766 217030
53973 217030 216542 216218 215960 215755 215714 215764 215510 214782 214106 214100 214544 214732 214718 215401 217094 218831 219675 220128 221574
53954 221574 224593 228375 231645 233713 234756 235470 236429 237554 238363 238854 239726 241421 243349 244641 245399 246636
53938B46636K468L572M129M259M097L804L734M097M591M714M282L442K435J529
53924B97789R84Q24R23J358K274L339L865L772L852M686N814O529O888P363P868
53909C58128Q015Q053Q723J0064J1130J1114J0238R318Q897R017R442R880J0196
53896D82215J0554J1065J1226J0010O810K084l034p609j1221j3723j5001j5049
53884D68327j4156j2935j1995j1492j1061j0376r615r160q865q113o675n171m411
53871C44302m540n038n359n329n043m674m455m539m827n057n076m976m934m983
53857B75472m999m868m642m488m423m209l620k809k216k013j877j461r06o90j001
53842B31250j490j668j418j047q92r04o75N6R02J129N43j52k16J29j4r15j788
$$ plain form
53938 246636 249104 252676 256805 261064 265161 268965 272699 276796 281387 286101 290383 293825 296260 297789
53924 297789 298773 299597 300520 301878 304152 307491 311356 315128 318980 323666 329480 336009 342897 350260 358128
53909 358128 366143 374196 382919 392983 404113 415227 425465 434783 443680 452697 462139 472019 482215
53896 482215 492769 503834 515060 525070 531880 533964 530930 523321 512100 498377 483376 468327
53884 468327 454171 441236 429241 417749 406688 396312 386697 377537 368672 360559 353884 348713 344302
53871 344302 339762 334724 329365 324036 318993 314319 309864 305325 300498 295441 290365 285389 280455 275472
53857 275472 270473 265605 260963 256475 252052 247843 244223 241414 239198 237185 235308 233847 232941 232251 231250
53842 231250 229760 228092 226674 225627 224735 223831 223156 223212 224114 225243 225786 225634 225418 225547 225533 224618 222830
53825B22830j749r25k26k40o47p20j89M34L78n14j517j785j263n99k56j26m1m2
53807B12803O6Q11K180L224L157K481K378L233M513N771O866P269O370M762M048
53792B69932M863N963O004N334N043M995M162K594J623J920K485K158J182N47
53778C18805M14K5j060k346l064l008k572k329k620l373m165m526m334l878l588
53763B78381l710m140m482m330l643k869k576k921l475l648l269k702k365k286
53749B31965k240k160k154k145j844j258q90j147j734j940j473p11j47J21L56
53734B12599Q44J569K144K107J438O58J90j34o09r44n84K66O47O7q19j152j041
53717B17246j215j734j695m17J480K567K151J022M71O97O58l49j455j244L01J659
$$ plain form
53825 222830 221081 220156 219930 219690 219043 218323 218134 218568 218946 218432 216915 215130 213867 213268 213012 212886 212845 212803
53807 212803 212869 213680 215860 219084 222241 224722 227100 230333 234846 240617 247483 254752 261122 265884 269932
53792 269932 274795 280758 286762 292096 297139 302134 306296 308890 310513 312433 314918 317076 318258 318805
53778 318805 319219 319244 318184 315838 312774 309766 307194 304865 302245 298872 294707 290181 285847 281969 278381
53763 278381 274671 270531 266049 261719 258076 255207 252631 249710 246235 242587 239318 236616 234251 231965
53749 231965 229725 227565 225411 223266 221422 220164 219274 218127 216393 214453 212980 212269 212122 212243 212599
53734 212599 213443 215012 217156 219263 220701 221359 221549 221415 220806 219862 219278 219544 220191 220258 219439 218287 217246
53717 217246 216031 214297 212602 212185 213665 216232 218383 219405 219876 220573 221231 220882 219427 218183 218484 220143
53701B20143J717J025P97J337K067K584K914L066K958K768K607K060O81j067k024
53686B43633j700p69j22L4j34n89j152j188k28J239K074J598J68j272k009j988
53670B37595j677j518j506j364j096j045j313j515j260n75K70J016J281P05l95
53655B27603r85m75M21N55k06j079j566j803j756j028L09J441J709J292P66M06
53639B25604K24J71R6j03r2N94J687K223J741Q23J97n2L4P30J900K548K000J040
53621B41365R52J812K626K865K806K550J895J215J367K364L153L089K730K739
53607B73528K790K290J551J436K138K956L195K767K028J359R96R78J199J455J386
53592C02052O69m53j033m05P89J226N50l60q13j087j480j573j024l96l20m89j79
$$ plain form
53701 220143 221860 222885 223682 225019 227086 229670 232584 235650 238608 241376 243983 246043 246724 245657 243633
53686 243633 241933 241164 241042 241076 240942 240353 239201 238013 237785 239024 241098 242696 242864 241592 239583 237595
53670 237595 235918 234400 232894 231530 230434 229389 228076 226561 225301 224726 224996 226012 227293 227998 227603
53655 227603 226618 226143 226564 227119 226913 225834 224268 222465 220709 219681 219990 221431 223140 224432 225198 225604
53639 225604 225828 225999 226095 225992 225900 226494 228181 230404 232145 232968 233165 233113 233147 233877 235777 238325 240325 241365
53621 241365 242317 244129 246755 249620 252426 254976 256871 258086 259453 261817 264970 268059 270789 273528
53607 273528 276318 278608 280159 281595 283733 286689 289884 292651 294679 296038 297034 298012 299211 300666 302052
53592 302052 302721 302268 301235 300830 301619 302845 303395 303035 302222 301135 299655 298082 297058 296662 296342 295853 295674
53575B95674O07J272J530J411P13o41j887k009j087l08m87j252j797j847j584
53560B88308j157o32j46J28J47L9P4M55J033J383J338J224J295J283R27O23R89
53543B97311J904K538K420J950J866K488L516M280M287L770L523L986M741N263
53529C43843N677O265O738O780O939Q018R674J0653J0449R856R706R993J0445
53516D55036J1061J1721J2144J2634J4086J6634J9063K0176K0223K0229K0514
53505F33521K0613K0378K0197K0203K0009J9317J8370J7559J6919J6166J5097
53494H38349J3905J3112J3093J3595J3908J3651J3174J3084J3590J4399J5055
53483I88915J5217J4826J4197J3748J3544J3280J2751J1996J0983R510P586N556
$$ plain form
53575 295674 296281 297553 299083 300494 301207 300566 298679 296670 295583 295275 294788 293536 291739 289892 288308
53560 288308 287151 286519 286373 286501 286648 286687 286761 287216 288249 289632 290970 292194 293489 294772 295699 296322 297311
53543 297311 299215 301753 304173 306123 307989 310477 313993 318273 322560 326330 329853 333839 338580 343843
53529 343843 349520 355785 362523 369303 376242 384260 393934 404587 415036 424892 434598 444591 455036
53516 455036 466097 477818 489962 502596 516682 533316 552379 572555 592778 613007 633521
53505 633521 654134 674512 694709 714912 734921 754238 772608 790167 807086 823252 838349
53494 838349 852254 865366 878459 892054 905962 919613 932787 945871 959461 973860 988915
53483 988915 1004132 1018958 1033155 1046903 1060447 1073727 1086478 1098474 1109457 1118967 1126553 1132109
53471A132109L666J808j89k307m536o888r045j0501j1296j2161j3590j5169j6200
53458A035701j6634j6928j7313j7700j8094j8600j9095j9302j9141j8728j8110
53447H36056j7316j6568j6133j6021j6009j5892j5476j4555j3079j1290r514p954
53435F66249o719n802m932l750k311j074k34O48K091M029N917P225P747P773Q116
53420F84973R475J1586J3495J4843J6210J7928J9369K0072K0773K2414K4624K6215
53408I01977K6864K7308K8032K8777K9424L0411L1995L3847L5652L7535L9580
53397A251402M1470M2866M3807M4479M4955M5310M5744M6341M6905M7062M6508
53386A746849M5266M3825M2722M1747M0029L7267L4375L2233L0310K7400K3429
$$ plain form
53471 1132109 1135775 1137583 1137394 1135087 1130551 1123663 1114618 1104117 1092821 1080660 1067070 1051901 1035701
53458 1035701 1019067 1002139 984826 967126 949032 930432 911337 892035 872894 854166 836056
53447 836056 818740 802172 786039 770018 754009 738117 722641 708086 695007 683717 674203 666249
53435 666249 659530 653728 648796 645046 642735 641661 641427 642075 644166 648195 654112 661337 669084 676857 684973
53420 684973 694448 706034 719529 734372 750582 768510 787879 807951 828724 851138 875762 901977
53408 901977 928841 956149 984181 1012958 1042382 1072793 1104788 1138635 1174287 1211822 1251402
53397 1251402 1292872 1335738 1379545 1424024 1468979 1514289 1560033 1606374 1653279 1700341 1746849
53386 1746849 1792115 1835940 1878662 1920409 1960438 1997705 2032080 2064313 2094623 2122023 2145452
53375B145452J9447J5910J2145P709L173q81m732q806j2988j7213k2025k7777
53363B109414l3703l8642m2357m5479m8321n0427n1315n1153n0580n0042m9420
53352A597975m8280m6485m4549m3091m2094m1084l9973l9128l8538l7626l6159
53341A140968l4666l3539l2416l0950k9586k8794k8067k6571k4540k3014k2274
53330H26551k1346j9374j6720j4389j2807j1589j0215q565o865n388m290l590
53318F91413l202k878k173p36J246L033L990M163M130M425N254O528P997R402
53304G32592J0694J1984J3304J4617J6051J7768J9511K0700K1230K1668K2472
53293I22591K3456K4384K5418K6500K6890K6139K5051K4736K4950K4308K2129
$$ plain form
53375 2145452 2164899 2180809 2192954 2200663 2203836 2202955 2198223 2189417 2176429 2159216 2137191 2109414
53363 2109414 2075711 2037069 1994712 1949233 1900912 1850485 1799170 1748017 1697437 1647395 1597975
53352 1597975 1549695 1503210 1458661 1415570 1373476 1332392 1292419 1253291 1214753 1177127 1140968
53341 1140968 1106302 1072763 1040347 1009397 979811 951017 922950 896379 871839 848825 826551
53330 826551 805205 785831 769111 754722 741915 730326 720111 711546 704681 699293 695003 691413
53318 691413 688211 685333 683160 682424 683670 686703 690693 694856 698986 703411 708665 715193 723190 732592
53304 732592 743286 755270 768574 783191 799242 817010 836521 857221 878451 900119 922591
53293 922591 946047 970431 995849 1022349 1049239 1075378 1100429 1125165 1150115 1174423 1196552
53282A196552J9137J6219J3492J0794Q304O151M076J906k05k287m724p489r805
53269A252121j1079j1707j2525j3865j5595j7589j9618k1178k2082k2859k3991
53258A060033k5113k5632k5810k6401k7401k8023k7879k7385k6862k6148k5261
53247G68118k4714k4666k4447k3399k1832k0616k0127j9945j9430j8344j7058
53236E33540j6248j6212j6403j5990j4884j3730j2840j1840j0553r528r118q794
53224C77400q000p058o503o024n085m161m227n128n571m955m153m112m667n192
53210C02564n655o303o862o752n863m584l295k231j634j641k102k724l223l232
53196B46463k487j271l69j70k90k54j78l96q64j382j979k609k858k511j983j674
$$ plain form
53282 1196552 1215689 1231908 1245400 1256194 1264498 1270649 1274725 1276631 1276426 1274139 1269415 1261926 1252121
53269 1252121 1241042 1229335 1216810 1202945 1187350 1169761 1150143 1128965 1106883 1084024 1060033
53258 1060033 1034920 1009288 983478 957077 929676 901653 873774 846389 819527 793379 768118
53247 768118 743404 718738 694291 670892 649060 628444 608317 588372 568942 550598 533540
53236 533540 517292 501080 484677 468687 453803 440073 427233 415393 404840 395312 386194 377400
53224 377400 369400 362342 355839 349815 344730 340569 336342 331214 325643 320688 316535 312423 307756 302564
53210 302564 296909 290606 283744 276992 271129 266545 263250 261019 259385 257744 255642 252918 249695 246463
53196 246463 243976 242705 242336 242166 241876 241622 241444 241048 240184 238802 236823 234214 231356 228845 226862 225188
53180B25188j305n41R4j29q89j094m34K68L52R1p5k44o07r33r94r48r28o75j7
53161B16180N60M02m56j245j268n64J61J77n50j292j332p15nM65P11O76K62k36
53143B11931l82k50k83m72m16k08l87q30o75K24P74K28n93n34J92N41K90N6k0
53124B09186l78r04q16J08J083J412J304J345J720K235K559K269J177j97r36p36
53108B20431j34L43P09J009R09J88q02j609k196k662k773k245j317n62k90m06
53092B08593p30j100j271j051n98l28n37j165j880k305k227j729j059l32M34R99
53076A93714R31J65o67p61N6J159J731J411M86m08q03p10m33j96j16l73j028j654
53058A92504j603q58j35O9R6L98O96M33k21m91j30K75J53l77q69j081r52n01J4
$$ plain form
53180 225188 223883 223342 223436 223307 222418 221324 220890 221158 221510 221601 221526 221282 220675 219742 218748 217800 216872 216197 216180
53161 216180 216740 217142 216686 215441 214173 213609 213770 213947 213397 212105 210773 210058 210053 210518 211229 211905 212167 211931
53143 211931 211549 211299 211016 210544 210128 209920 209533 208703 208028 208252 209026 209254 208661 208127 208319 208860 209150 209206 209186
53124 209186 208808 207904 207088 207196 208279 209691 210995 212340 214060 216295 218854 221123 222300 222103 221167 220431
53108 220431 220297 220640 221349 222358 223267 223455 222653 221044 218848 216186 213413 211168 209851 209289 208999 208593
53092 208593 207863 206763 205492 204441 203843 203515 202978 201813 199933 197628 195401 193672 192613 192281 192715 193714
53076 193714 194645 194810 194143 193382 193438 194597 196328 197739 198225 197817 197014 196304 195871 195675 195559 195186 194158 192504
53058 192504 190901 190043 189908 189977 190073 190471 191167 191600 191379 190888 190758 191033 191186 190809 189940 188859 187907 187406 187420
53039A87420J45k84r53j480j795j900j638j028n43o34j108j296q78k34P8q4l92
53022A73396m55j57L09O94R34J085J067O66q9p76j021r53r58j123j228j199j185
53005A69007j125o24M70J587J895J236L41M8M22P89N75o0m57k36L38P41P15L88
52987A76050J3k13j98K4L49P37J215J636J691J288P57M76M41M88P02J177J586
52970A88219J487J056R17J132R53q4j380j993j808j441j225q72j59N55P20K96
52954A86373k24m35m48o21r31r90p87j027k176l452l478k026l84L18L45N60J050
52937A71667J309J232J081P85P5p54j038o91k91k11k69l10m16m93k53K11M19K88
52919A72341L23P50J055O68k76j191j639j514r95n46n25o53l27M18Q13M67n0r1
$$ plain form
53039 187420 187565 187281 186328 184848 183053 181153 179515 178487 177944 177310 176202 174906 174028 173794 173872 173788 173396
53022 173396 172941 172784 173093 173787 174721 175806 176873 177539 177450 176674 175653 174700 173742 172619 171391 170192 169007
53005 169007 167882 167258 167728 169315 171210 172446 172787 172835 173257 174046 174621 174561 174104 173868 174206 174947 175662 176050
52987 176050 176063 175850 175652 175676 176025 176762 177977 179613 181304 182592 183349 183825 184266 184754 185456 186633 188219
52970 188219 189706 190762 191679 192811 193764 193680 192300 190307 188499 187058 185833 184961 184802 185357 186077 186373
52954 186373 186149 185714 185266 184645 183714 182724 181937 180910 178734 175282 171804 169778 169394 169712 170057 170617 171667
52937 171667 172976 174208 175289 176074 176149 175395 174357 173666 173375 173164 172895 172585 172169 171676 171423 171634 172053 172341
52919 172341 172664 173414 174469 175137 174861 173670 172031 170517 169522 168976 168451 167798 167471 167889 168702 169169 169119 169028
52901A69028J93L02K04J05Km4L61J244J722R62n26j355j003k93j68o20r83p58
52883A68373N5R63J198L53j020j774j300n1J076J566J425R18M11K89P60J695K629
52866A77566K987K494J550R71J182J812K363K882L646M409M494L597K039L06j221
52851B11077k189k446k334k356k560k686k771l129l655l825l384k510j332k1O57
52836A76536j46j949k970k174n57K93J79P1M63J040J600K312L016L190K691J822
52820A85417O69q55k200k441j560p22p27r80n33N07J321J701K125K776L203L021
52804A90722K247J004n57j896k382k065j691j680j647j190o55n99r63j280j452
52789A75916j750k151k240j850j282q30m25O5N88J032J281J022o7j616k444j649
$$ plain form
52901 169028 169221 169523 169727 169832 169834 169790 170151 171395 173117 174079 173553 172198 171195 170902 170734 170114 169131 168373
52883 168373 168428 169391 170589 170942 169922 168148 166848 166797 167873 169439 170864 171782 172193 172482 173242 174937 177566
52866 177566 180553 183047 184597 185568 186750 188562 190925 193807 197453 201862 206356 209953 211992 212298 211077
52851 211077 208888 206442 204108 201752 199192 196506 193735 190606 186951 183126 179742 177232 175900 175879 176536
52836 176536 176390 174441 171471 169297 168740 169033 169212 169283 169746 170786 172386 174698 177714 180904 183595 185417
52820 185417 186086 185231 183031 180590 179030 178308 177581 176601 176068 176575 177896 179597 181722 184498 187701 190722
52804 190722 192969 193973 193416 191520 189138 187073 185382 183702 182055 180865 180210 179611 178648 177368 175916
52789 175916 174166 172015 169775 167925 166643 165813 165388 165453 166041 167073 168354 169376 169309 167693 165249 163600
52773A63600K90J902K253J717J159Q09K84m47p17l8J017J308M86n40p81l54j45
52756A71803m90p77m01M17R99J089J014J093J197R62M40K73J013K213K638J708
52740A85191M24K74J344K263J965P37o28j849k769k786j496L76J550J576J062
52725A87234O09K41j00j39L11Q54P62k66j690k538k290j411q23q50j014r37q85
52708A77068j084j122o27p4j82p99j098q11m18k10M7L60L17j61n28m25k13k93
52690A69747m76m42k74j05L05J098J776J752J245J041J394J680J299M62j18j39
52674A80245Q5K40N15J132J624J136l51j589j459m22P6m66j070p69J67Q10Q14
52657A80718N50L83L62M72P66J320K190L295M274M728M684M479M087K995J010
$$ plain form
52773 163600 163890 165792 168045 169762 170921 171730 172014 171567 170850 170812 171829 173137 173623 173083 172302 171948 171803
52756 171803 171313 170536 170135 170552 171551 172640 173654 174747 175944 176906 177346 177619 178632 180845 183483 185191
52740 185191 185615 185889 187233 189496 191461 192198 191570 189721 186952 184166 182670 183046 184596 186172 187234
52725 187234 187843 188084 187984 187845 188156 189010 189772 189506 187816 185278 182988 181577 180754 179904 178890 177953 177068
52708 177068 175984 174862 174235 174161 173979 173180 172082 171271 170853 170643 170690 171050 171367 171206 170678 170253 170040 169747
52690 169747 169271 168829 168555 168450 168755 169853 171629 173381 174626 175667 177061 178741 180040 180502 180384 180245
52674 180245 180330 180570 181085 182217 183841 184977 184626 183037 181578 181156 181232 180766 179696 178927 179094 179904 180718
52657 180718 181268 181651 182013 182485 183251 184571 186761 190056 194330 199058 203742 208221 212308 215303 216313
52642B16313j251l055m248m916m822l774k345j488j450j546j065o5Q43J201J153
52627A89485J286J997K868K932J784K43n15l37j67p64j766k207j694q08m29p70
52611A91138j186r02P0R75J192Q54M30P4l19o79p71n82l31j14J29L33L14R3o1
52592A90657p0j61m38n64j00Q20J486J340O83L50P49J396J624J454J363J380J032
52575B03001K60k37N9O74P95L42j32l31m39n32l92L1M55O18M63o5r39j695j663
52556B00273q08M0J62j94k86j4m0p75j683j887j253m90j99j86P6N72P27K41m72
52537A93804p89n74j20L27P06R62R85Q08O13M94L83K23J00J34L17M79M63K98K22
52518A99835M77J059J688J987J757J206R04J337K380L396L960M145L923K855R06
$$ plain form
52642 216313 215062 212007 207759 202843 198021 194247 191902 190414 188964 187418 186353 186288 187131 188332 189485
52627 189485 190771 192768 195636 198568 200352 200595 200080 199743 199576 198812 197046 194839 193145 192337 191908 191138
52611 191138 189952 189050 189120 190095 191287 192141 192571 192645 192326 191647 190876 190294 189963 189849 189978 190311 190625 190718 190657
52592 190657 190587 190426 189988 189424 189324 190144 191630 192970 193653 194003 194752 196148 197772 199226 200589 201969 203001
52575 203001 203261 203024 203083 203757 204552 204894 204762 204431 203992 203460 203068 203099 203554 204172 204635 204570 203631 201936 200273
52556 200273 199465 199505 199667 199473 199187 199173 199133 198358 196675 194788 193535 193045 192846 192660 192736 193308 194035 194276 193804
52537 193804 193015 192441 192321 192648 193354 194316 195301 196109 196722 197216 197599 197822 197922 198056 198373 198852 199315 199613 199835
52518 199835 200312 201371 203059 205046 206803 208009 208913 210250 212630 216026 219986 224131 228054 230909 231815
52503B31815q87j452j182j437k540l330k995k240k052k231j983j258o10j89K31
52488B07660N00K49l16n32j22O19J313J661J391O87L77R76J813J895J371J263
52472B20805J809K173J835J344J374J891K555L224L666L443K555J693J462J691
52458B51520J776J333L25j025k251k986l345l610l612l054k355k324k918l180
52444B24294k653j976j670j352o73q7k4q7J00O2n62r99l89O45P51j54r01r35q67
52425B12523r97o80L41J087O71k97m98L36J238J366Q90M74M42O12O51M40J13p9
52407B18633L9N31J404K559L749M742N505O090O403O282N758M923L616J586r17
52392B70903l107m459n229n855o128n420l736j965r48n77j45O31J333J523J286
$$ plain form
52503 231815 230928 229476 228294 226857 224317 220987 217992 215752 213700 211469 209486 208228 207618 207429 207660
52488 207660 208160 208409 208093 207561 207439 208058 209371 211032 212423 213110 213487 214463 216276 218171 219542 220805
52472 220805 222614 224787 226622 227966 229340 231231 233786 237010 240676 244119 246674 248367 249829 251520
52458 251520 253296 254629 254954 253929 251678 248692 245347 241737 238125 235071 232716 230392 227474 224294
52444 224294 221641 219665 217995 216643 215970 215883 215859 215772 215872 215934 215372 214373 213984 214629 215380 215226 214325 213390 212523
52425 212523 211526 210846 211187 212274 212945 212648 212150 212486 213724 215090 215980 216454 216896 217508 218159 218599 218712 218633
52407 218633 218672 219203 220607 223166 226915 231657 237162 243252 249655 255937 261695 266618 270234 271820 270903
52392 270903 267796 263337 258108 252253 246125 240705 236969 235004 234056 233479 233334 233965 235298 236821 238107
52377B38107R71O99M48L44O04J180J851K562L380M083M170L443K293J276N58j13
52361B65856j007k076k838k632j358Q3M91k69j059q35J69R88J176J039R14Q84
52345B59526J026J347J451Q31l93j495j951j857j437o32N71J806K647L047L239
52330B67726L386L545L790M121M428M650M875N132N257N091M680M101L350K584
52316C26716K199K376K740K851K870L274L906L923K927J711J460K466M019N348
52302C68786O189O431N912M847M030M106M768N082M525L362K030O62o76j658j973
52287D16423j772j501j371j227r63p33o63n60j32N59J093J230J221J417J739J853
52271D16613J780J962K586L224L488L663M250N054N252M444L171K315K277K856
$$ plain form
52377 238107 239078 239777 240225 240569 241173 242353 244204 246766 250146 254229 258399 261842 264135 265411 265969 265856
52361 265856 264849 262773 259935 257303 255945 256028 256519 256250 255191 254356 254525 255513 256689 257728 258642 259526
52345 259526 260552 261899 263350 264181 263788 262293 260342 258485 257048 256416 256987 258793 261440 264487 267726
52330 267726 271112 274657 278447 282568 286996 291646 296521 301653 306910 312001 316681 320782 324132 326716
52316 326716 328915 331291 334031 336882 339752 343026 346932 350855 353782 355493 356953 359419 363438 368786
52302 368786 374975 381406 387318 392165 396195 400301 405069 410151 414676 418038 420068 420730 420054 418396 416423
52287 416423 414651 413150 411779 410552 409589 408856 408193 407633 407501 408060 409153 410383 411604 413021 414760 416613
52271 416613 418393 420355 422941 426165 429653 433316 437566 442620 447872 452316 455487 457802 460079 462935
52257D62935L569L979L944L742L677L629L342L161L822N278O315N807M022K206
52243E19428J192Q99R12R74R73R18R38R87P70L30L60J374K779L494L429L535M239
52226E47531M750M335L532L409M119M850N065N033N132N233N028M629M504M873
52212F12023N353N302M631M101M548N810O833O989O790O932P084O346M776L582
52198F91100L568M178M529M766N617O966P769P510O890O718O735O155M926L733
52184G71160K859J801K13j422k509l210m065m980n345n133n151n843o461o019
52170G25895m763l946m127m387l585j828j73P65J337K037K813L326L427L140K487
52155G22418J613P96P9q50k115l199l338k314o33R83K100K686K962L113L031K516
$$ plain form
52257 462935 466504 470483 474427 478169 481846 485475 488817 491978 495800 501078 507393 513200 517222 519428
52243 519428 520620 521519 522431 523405 524378 525296 526234 527221 527991 528321 528681 530055 532834 536328 539757 543292 547531
52226 547531 552281 556616 560148 563557 567676 572526 577591 582624 587756 592989 598017 602646 607150 612023
52212 612023 617376 622678 627309 631410 635958 641768 648601 655590 662380 669312 676396 682742 687518 691100
52198 691100 694668 698846 703375 708141 713758 720724 728493 736003 742893 749611 756346 762501 767427 771160
52184 771160 774019 775820 776033 774611 772102 768892 764827 759847 754502 749369 744218 738375 731914 725895
52170 725895 721132 717186 713059 708672 705087 703259 703086 703851 705188 707225 710038 713364 716791 719931 722418
52155 722418 724031 724827 724906 724056 721941 718742 715404 713090 712457 713440 715540 718226 721188 724301 727332 729848
52139G29848J734J092N88k73j558k458k331j691j420j396p35P86K528M148N906
52124G34768P729R030R729J0480J1391J1575J0627R528R242R147P969N610L015
52111H49840O31j797m058n328n384n069n144n364m929l473j305Q81K390K982L037
52096H17910L110L361L590L571L013J503r26l403n022n851o527p044o803n773
52082G94709m649l791k880j875j360j515j559q11L34J061J263J391J616J778J880
52067G85592K075K276K275K138K094K172K199K093J899J689J623J911K475K856
52053H15367K650J902R47J11l69n16q41k010m006o019p369q133q544q406p533
52038G67231o378n554n041m431l698l171k813k254j391n37P8M23M27J21LP00K153
$$ plain form
52139 729848 731582 732674 733262 732989 731431 728973 726642 724951 723531 722135 721400 722186 724714 728862 734768
52124 734768 742497 751527 761256 771736 783127 794702 805329 814857 824099 833246 841215 846825 849840
52111 849840 850471 848674 844616 839288 833904 828835 823691 818327 813398 809925 808620 809501 811891 814873 817910
52096 817910 821020 824381 827971 831542 834555 836058 835132 831729 826707 820856 814329 807285 800482 794709
52082 794709 790060 786269 783389 781514 780154 778639 777080 776269 776603 777664 778927 780318 781934 783712 785592
52067 785592 787667 789943 792218 794356 796450 798622 800821 802914 804813 806502 808125 810036 812511 815367
52053 815367 818017 819919 820866 820977 820608 820092 819251 817241 813235 807216 799847 791714 783170 774764 767231
52038 767231 760853 755299 750258 745827 742129 738958 736145 733891 732500 731963 732041 732464 732891 733012 733015 733715 735868
52021G35868L628M611N243N774O139O205O062N830N542N407N765O503O911O450
52007H15938N354M137K724O11k281n372q130j0567j2822j4556j5197j4663j3562
$$ plain form
52021 735868 739496 744107 749350 755124 761263 767468 773530 779360 784902 790309 796074 802577 809488 815938
52007 815938 821292 825429 828153 828764 826483 821111 812981 802414 789592 775036 759839 745176 731614
$$ [...]
##END NTUPLES=NMR SPECTRUM
##END=
