##TITLE=AC1417_GUARH12227_7763989_HObMMIYiT9
##JCAMPDX= 6.0         $$ Bruker NMR JCAMP-DX V2.0
##DATA TYPE= NMR SPECTRUM
##DATA CLASS= NTUPLES
##ORIGIN= BRUKER
##OWNER= Administrator
$$ 1.72 TOPSPIN		Version 2.1
$$ 2013-04-17 01:11:01.524 -0700  Administrator@X
$$ Compression mode = diff/dup
##.OBSERVE FREQUENCY= 400.02188249412
##.OBSERVE NUCLEUS= ^1H
##.ACQUISITION MODE= SIMULTANEOUS (DQD)
##.ACQUISITION SCHEME= undefined
##.AVERAGES= 8
##.DIGITISER RES= 22
##SPECTROMETER/DATA SYSTEM= spect
##.PULSE SEQUENCE= zg30
##.SOLVENT NAME= COFFEE_meoh
##.SHIFT REFERENCE= INTERNAL, COFFEE_meoh, 1, 14.98509
##AUDIT TRAIL= $$ (NUMBER, WHEN, WHO, WHERE, PROCESS, VERSION, WHAT)
$$ ##TITLE= Audit trail, TOPSPIN		Version 2.1
$$ ##JCAMPDX= 5.01
$$ ##ORIGIN= Bruker BioSpin GmbH
$$ ##OWNER= Administrator
$$ $$ E:\/data/COFFEE/nmr/AC1417_GUARH12227_7763989_HObMMIYiT9/10/pdata/1/auditp.txt
$$ ##AUDIT TRAIL=  $$ (NUMBER, WHEN, WHO, WHERE, PROCESS, VERSION, WHAT)
(   1,<2013-04-17 01:10:54.555 -0700>,<Administrator>,<X>,<go>,<TOPSPIN 2.1>,
      <created by zg
	started at 2013-04-17 01:09:48.680 -0700,
	POWCHK enabled, PULCHK disabled,
       configuration hash MD5:
       33 CF 6A 21 5C D3 B9 40 6C 15 AA 8D 27 A2 4F 13
       data hash MD5: 64K
       60 71 71 1D 24 80 6A 89 43 22 D2 B6 C6 DF 50 8A>)
(   2,<2013-04-17 01:10:57.587 -0700>,<Administrator>,<X>,<proc1d>,<TOPSPIN 2.1>,
      <Start of raw data processing
       efp LB = 0 FT_mod = 6 PKNL = 1 PHC0 = 0 PHC1 = 0 SI = 32K 
       data hash MD5: 32K
       B9 5B 19 B6 99 9A 77 07 4E 83 B0 86 A6 8F 6C DC>)
(   3,<2013-04-17 01:10:57.930 -0700>,<Administrator>,<X>,<proc1d>,<TOPSPIN 2.1>,
      <pk PHC0 = 101.7004 PHC1 = 0 
       data hash MD5: 32K
       16 C5 6C 84 3D DC E7 89 DC C9 1E F1 60 4F 81 22>)
(   4,<2013-04-17 01:10:58.024 -0700>,<Administrator>,<X>,<proc1d>,<TOPSPIN 2.1>,
      <abs ABSG = 1 
       data hash MD5: 32K
       F0 E5 13 9E 5B B5 33 93 91 AC EA 16 8D 53 37 AA>)
(   5,<2013-04-17 01:10:58.102 -0700>,<Administrator>,<X>,<proc1d>,<TOPSPIN 2.1>,
      <abs ABSG = 2 
       data hash MD5: 32K
       3C A5 9D E4 74 66 5F DA 80 D8 E5 11 DF E7 22 B3>)
(   6,<2013-04-17 01:10:58.180 -0700>,<Administrator>,<X>,<proc1d>,<TOPSPIN 2.1>,
      <abs ABSG = 3 
       data hash MD5: 32K
       BC 3A EB 4B DE 64 31 E7 17 50 D1 D3 B2 18 C4 63>)
(   7,<2013-04-17 01:10:58.243 -0700>,<Administrator>,<X>,<proc1d>,<TOPSPIN 2.1>,
      <abs ABSG = 4 
       data hash MD5: 32K
       56 CB C1 A5 41 84 7C B3 BF 3E D7 54 C0 C7 62 F4>)
(   8,<2013-04-17 01:10:58.305 -0700>,<Administrator>,<X>,<proc1d>,<TOPSPIN 2.1>,
      <abs ABSG = 5 
       data hash MD5: 32K
       E3 70 37 84 0F 4F 53 2C 25 0F 13 38 BA 56 B7 5D>)
$$ ##END=
$$ 
$$ $$ hash MD5
$$ $$ 6C 5F 29 AB 32 85 74 A1 ED EB 5F 03 D7 B0 B1 DF
##$RELAX= 
##$RELAX= 
##$RELAX= 
##$RELAX= 
##$RELAX= 
##$RELAX= 
##$RELAX= 
$$ Bruker specific parameters
$$ --------------------------
##$DU= <E:\>
##$EXPNO= 10
##$NAME= <AC1417_GUARH12227_7763989_HObMMIYiT9>
$$ [...]
150 150 150 150 150 150 150 150
##$TP07= 0
##$TPNAME0= <>
##$TPNAME1= <>
##$TPNAME2= <>
##$TPNAME3= <>
##$TPNAME4= <>
##$TPNAME5= <>
##$TPNAME6= <>
##$TPNAME7= <>
##$TPOAL= (0..7)
0.5 0.5 0.5 0.5 0.5 0.5 0.5 0.5
##$TPOFFS= (0..7)
0 0 0 0 0 0 0 0
##$TUNHIN= 0
##$TUNHOUT= 0
##$TUNXOUT= 0
##$USERA1= <user>
##$USERA2= <user>
##$USERA3= <user>
##$USERA4= <user>
##$USERA5= <user>
##$V9= 5
##$VALIST= <valist>
##$VCLIST= <CCCCCCCCCCCCCCC>
##$VD= 0
##$VDLIST= <DDDDDDDDDDDDDDD>
##$VPLIST= <PPPPPPPPPPPPPPP>
##$VTLIST= <TTTTTTTTTTTTTTT>
##$WBST= 2048
##$WBSW= 25
##$XGAIN= (0..3)
0 0 0 0
##$XL= 0
##$YL= 0
##$YMAX_a= 608088
##$YMIN_a= -520375
##$ZGOPTNS= <>
##$ZL1= 120
##$ZL2= 120
##$ZL3= 120
##$ZL4= 120
##$ABSF1= 14.98509
##$ABSF2= -5.573092
##$ABSG= 5
##$ABSL= 3
##$ALPHA= 0
##$AQORDER= 0
##$ASSFAC= 0
##$ASSFACI= 0
##$ASSFACX= 0
##$ASSWID= 0
##$AUNMP= <proc_prof1d_extract_pilot.lims>
##$AXLEFT= 0
##$AXNAME= <>
##$AXNUC= <1H>
##$AXRIGHT= 0
##$AXTYPE= 0
##$AXUNIT= <>
##$AZFE= 0.1
##$AZFW= 0.1
##$BCFW= 0
##$BC_mod= 0
##$BYTORDP= 0
##$COROFFS= 0
##$CY= 15
##$DATMOD= 1
##$DC= 0
##$DFILT= <>
##$DTYPP= 0
##$F1P= 0
##$F2P= 0
##$FCOR= 0.5
##$FTSIZE= 32768
##$FT_mod= 6
##$GAMMA= 0
##$GB= 0
##$INTBC= 1
##$INTSCL= 1
##$ISEN= 128
##$LB= 0
##$LEV0= 0
##$LPBIN= 0
##$MAXI= 10000
##$MC2= 0
##$MEAN= 0
##$ME_mod= 0
##$MI= 0
##$NCOEF= 0
##$NC_proc= -8
##$NLEV= 6
##$NOISF1= 0
##$NOISF2= 0
##$NSP= 0
##$NTH_PI= 0
##$NZP= 0
##$OFFSET= 14.98509
##$PC= 1
##$PHC0= 101.7004
##$PHC1= 0
##$PH_mod= 1
##$PKNL= yes
##$PPARMOD= 0
##$PPDIAG= 0
##$PPIPTYP= 0
##$PPMPNUM= 2147483647
##$PPRESOL= 1
##$PSCAL= 4
##$PSIGN= 0
##$PYNMP= <proc.py>
##$REVERSE= no
##$SF= 400.02
##$SI= 32768
##$SIGF1= 0
##$SIGF2= 0
##$SINO= 400
##$SIOLD= 32768
##$SPECTYP= <>
##$SREGLST= <1H.CDCl3>
##$SSB= 0
##$STSI= 32768
##$STSR= 0
##$SW_p= 8223.68421052631
##$SYMM= 0
##$S_DEV= 0
##$TDeff= 65536
##$TDoff= 0
##$TI= <>
##$TILT= no
##$TM1= 0
##$TM2= 0
##$TOPLEV= 0
##$USERP1= <user>
##$USERP2= <user>
##$USERP3= <user>
##$USERP4= <user>
##$USERP5= <user>
##$WDW= 1
##$XDIM= 32768
##$YMAX_p= 459986984
##$YMIN_p= -706071
##$CURPLOT= <Network HP LaserJet P1505>
##$CURPRIN= <$Network HP LaserJet P1505>
##$DFORMAT= <normdp>
##$LAYOUT= <+/1D_H.xwp>
##$LFORMAT= <normlp>
##$PFORMAT= <normpl>
##$SURQMSG= 1
$$ End of Bruker specific parameters
$$ ---------------------------------
##NTUPLES= NMR SPECTRUM
##VAR_NAME=  FREQUENCY,     SPECTRUM/REAL,   SPECTRUM/IMAG
##SYMBOL=    X,             R,               I
##VAR_TYPE=  INDEPENDENT,   DEPENDENT,       DEPENDENT
##VAR_FORM=  AFFN,          ASDF,            ASDF
##VAR_DIM=   32768,         32768,           32768
##UNITS=     HZ,            ARBITRARY UNITS, ARBITRARY UNITS
##FACTOR=    0.250966925370066, 1,           1
##FIRST=     8223.43324360094, -64470,       -176599
##LAST=      0,             -183678,         -207631
##MIN=       0,             -706071,         0
##MAX=       8223.43324360094, 459986984,    0
$$ Real data points
##PAGE= N=1
##DATA TABLE= (X++(R..R)), XYDATA
$$ [...]
$$ plain form
19555 -40082 -150765 -118942 235737 212632 21795 -9769 -120229 85784 -129377 -40843 21993
19543 53362 -294887 76542 -217359 17464 -98144 -11410 -176745 97868 217459 13411 -265246
19531 64031 107963 92506 141169 131599 229970 -8978 -92490 -142228 -96420 -130549 41906 -16548
19518 -222523 70399 -240615 -20992 -224814 237187 -93418 250682 212869 101782 192005
19508 192005 -139091 -160232 99969 198462 -118136 -109132 -286372 269815 -580190 -185703
19497 -271286 -39964 -218546 -11556 -455386 -153545 -135814 54282 103132 -106774 -124196 -338756
19486 -338756 -148388 -112234 -87787 -245042 -37509 -25443 -152761 -86115 149025 194721 62704
19474 -108823 273850 -357577 -31532 -340056 21977 10044 -6881 77864 -143405 195646 132192
$$ packed form
19555d0082j10683L1823B35737k3105B1795i769j10460H5784a29377d0843B1993
19543E3362b94887G6542b17359A7464i8144a1410j65335I7868J19591A3411b65246
19531F4031M3932j5457M8663r570R8371h978q3512m9738M5808l4129D1906a6548
19518b22523G0399b40615b0992k03822B37187i3418B50682l7813A01782R0223
19508A92005a39091k1141I9969R8493a18136R004j77240B69815e80190a85703
19497b71286c9964j78582a1556m43830a53545J7731E4282M8850a06774j7422k14560
19486c38756a48388L6154K4447j57255c7509J2066j27318O6646A49025M5696F2704
19474a08823B73850c57577c1532l08524B1977A0044f881G7864a43405A95646o3454
$$ plain form
19463 132192 -74334 -414504 -143131 -374504 3395 -35422 274795 -123900 -341106 -332066 186034
19451 86524 8212 -223689 -217517 228223 119750 42412 -175852 -195246 -199977 -179602 -67862
19439 -162582 45088 -192686 -329087 -54809 158296 117280 -173751 -428413 -152141 193862
19428 -21185 -79194 -66120 -34018 -191795 -134734 358 132666 -175244 253291 -17977 7254
19416 -283611 103324 -146807 65293 -54579 -185622 -402240 -71511 -209353 -19895 149682
19405 -34517 184507 -220189 367652 -101562 -1848 168199 50285 89662 -72738 -36120 -213758
19394 -213758 98801 -16018 -54171 -71724 33158 145232 -71246 192839 -132888 -195379 -188799
19383 -188799 32140 38803 -84668 149187 -128126 -243418 -50031 -468510 -177278 137458
$$ packed form
19463A32192g4334l40170a43131k31373C395c5422B74795a23900k17206R040A86034
19451H6524H212b23689O172B28223j08473D2412a75852j9394m731K0375f7862
19439a62582D5088a92686j36401e4809A58296m1016a73751k54662a52141A93862
19428b1185n8009J3074L2102j57777N7061C58J32308a75244B53291a7977G254
19416b83611A03324a46807F5293e4579j31043k16618g1511j37842a9895A49682
19405c4517A84507b20189C67652a01562a848A68199E0285L9377g2738c6120j77638
19394b13758I8801a6018l8153j7553C3158J12074g1246A92839a32888o2491O580
19383a88799C2140O663h4668A49187a28126j15292e0031m18479a77278A37458
$$ plain form
19372 -111129 -6321 185706 37135 -134469 -134805 254454 -79437 -167636 -276626 -33662 -191373
19361 -191373 317778 -484178 -97682 -296130 -180271 -163577 -353934 -108556 -306874 70373
19350 -59361 69227 -17490 -132897 -114927 -104250 -26660 -245667 306798 -126626 103340 -39547
19338 -97655 309640 -114494 -204197 -25211 -69355 26146 11585 -282756 133339 153098 52709
19326 -294582 -460514 -170632 -169583 -298665 -17558 -247893 180251 55557 38421 -41284 -50651
19315 -50651 -177156 -77490 50809 -22088 -220472 -32914 -319617 -15029 105774 133288 -218008
19303 114327 -181133 -255273 -188901 150046 -76870 -145199 -142523 151283 29697 113404 -207236
19291 45538 195356 228054 -14661 61943 20705 -96755 45109 -233028 18479 446813 112680
$$ packed form
19372a11129f321A85706C7135a34469l36B54454g9437q8199j08990c3662j57711
19361a91373C17778d84178i7682j98448J15859J6694j90357a08556j98318G0373
19350e9361F9227a7490j15407J7970J0677b6660k19007C06798a26626A03340c9547
19338i7655C09640a14494q9703b5211m4144B6146A1585b82756A33339J9759E2709
19326b94582j65932a70632J049j29082a7558k30335A80251E5557j7136d1284r367
19315e0651j26505g7490E0809b2088j98384c2914k86703a5029A05774K7514b18008
19303A14327a81133p4140O6372A50046g6870o8329K676A51283B9697Q3707b07236
19291D5538J49818L2698a4661F1943B0705i6755D5109b33028A8479M28334A12680
$$ plain form
19279 84251 184640 -326 -318171 -224774 -67706 -1794 -122482 -113751 -486121 -138033 -4878 33733
19266 -287947 -126853 57672 26211 -216924 -202852 -29303 86222 -229766 -106317 -96838 -70545
19255 -70545 -258104 -45996 281077 -366912 -254776 -11078 137687 -403216 31105 338020
19245 338020 161886 215292 -59863 -11123 136414 -248205 139354 101879 -331156 -121975
19234 -28090 -103832 -65964 -96211 -64314 195778 -101608 -232945 -300544 89456 149764 55460
19222 -21376 702 177472 112981 306739 -62248 223230 -216025 -140403 -60182 185220 -30443
19210 5285 185740 240200 12906 -283267 53205 -97613 -267936 75547 -236849 -79783 -117160
19199 -117160 78741 16203 38476 -31035 34671 -195537 73979 149146 -40399 295917 -144386
$$ packed form
19279H4251J00389c26l17845R3397f7706a794j20688Q731l72370a38033d878C3733
19266b87947a26853E7672B6211b16924J4072b9303H6222b29766a06317R479K6293
19255g0545j87559d5996B81077c66912J12136a1078A37687d03216C1105L06915
19245C38020A61886N3406e9863a1123A36414b48205A39354l7475c31156a21975
19234b8090p5742L7868l0247L1897A95778a01608j31337o7599H9456O0308E5460
19222b1376G02J76770o4491J93758f2248B23230b16025P5622f0182A85220c0443
19210E285J80455N4460A2906b83267E3205i7613j70323G5547b36849g9783l7377
19199a17160G8741A6203K2273c1035C4671a95537G3979P5167d0399B95917a44386
$$ plain form
19187 99309 37337 80304 -267687 80074 -167610 -267437 -141719 -340800 -42727 -108105 -193100
19176 -193100 -150602 -18806 58634 -247867 -204724 -162237 -286493 -46296 -250113 -188242 14391
19164 -380733 119668 176219 100675 -8732 -180270 -28368 -101978 -114566 -248945 -125862 173270
19152 52036 -82485 108859 77652 -86244 84158 332842 -218858 -298350 -278499 -146256 13147
19140 -163223 -97774 87838 -375651 -30873 -412693 54658 36082 -36823 273015 -342952 14964
19128 166109 -121965 8693 4899 -120893 -213278 -213424 -83392 292728 -48477 -221048 -62746
19116 181730 53350 241887 -69204 -152988 -137448 -68382 -164297 6617 -29824 142026 -132690
19104 -104706 -159655 21034 6587 136947 58591 -178422 -208306 108464 20211 -273607 148480
$$ packed form
19187I9309C7337M2967b67687H0074a67610r9827J25718j99081d2727o5378q4995
19176a93100M2498a8806E8634b47867M3143M2487j24256d6296k03817O1871A4391
19164c80733A19668N6551p5544h732j71538b8368p3610j2588j34379J23083A73270
19152E2036h2485A08859l1207h6244H4158K48684b18858p9492J9851J32243A3147
19140a63223O5449H7838c75651c0873l81820E4658j8576c6823B73015c42952A4964
19128A66109a21965H693l794a20893r2385j46h3392B92728d8477j72571f2746
19116A81730E3350J88537f9204q3784J5540f8382r5915F617b9824A42026a32690
19104a04706n4949B1034F587J30360E8591a78422k9884A08464B0211b73607A48480
$$ plain form
19092 222793 -341 132266 -8871 -91445 -58258 -28543 -411547 -196832 28164 -134650 -370783
19081 -370783 64071 -131075 27733 -277603 -173541 65271 285151 3527 119778 -151679
19070 53880 -24890 125372 -353943 -151957 34058 244893 -225786 26604 -196382 -88710
19059 -164181 66854 -74640 31570 150273 238396 78129 -375821 -71151 -13663 -295902 -83937
19047 -171785 33502 -192442 56202 -79622 -232552 -268889 209824 -69858 -385276 56242 58640
19036 58640 -83087 123310 186528 -347887 1888 -97193 -241384 -70804 -61326 -133286 -135490 252100
19023 -18657 -47822 522203 -223553 55058 -266969 78929 -194900 -53516 -110110 43212 -32538
19011 -54613 23530 237426 71738 -145278 -81804 80329 -586391 123653 -75081 18849 -28725
$$ packed form
19092B22793c41A32266h871q2574L3187b8543l83004a96832B8164a34650k36133
19081c70783F4071a31075B7733b77603J04062F5271K19880C527J16251a51679
19070E3880b4890A25372c53943a51957C4058K10835b25786B6604a96382h8710
19059a64181F6854g4640C1570J18703Q8123G8129c75821g1151a3663k82239h3937
19047a71785C3502a92442E6202g9622j52930l6337B09824f9858l15418E6242K398
19036E8640h3087A23310O3218c47887A888i7193j44191g0804R478p1960k204B52100
19023a8657k9165E22203b23553E5058b66969G8929a94900e3516n6594D3212c2538
19011e4613B3530K13896G1738a45278O3474H0329e86391A23653g5081A8849b8725
$$ plain form
18999 122019 123738 293 240372 91939 41779 116252 -212138 -37098 42086 138613 -16514 53648
18986 234059 -316570 -26535 -94619 63496 174861 347225 -123310 -79159 -85066 -25523 -4820
18974 -244725 24160 -114121 -312669 13947 335074 -36745 -295937 26751 -194478 -22694
18963 -37671 -115355 106670 -335814 177179 109631 99661 226510 -193706 88088 -123855 25371
18951 116678 396860 155131 5802 62987 157713 -82044 477383 80835 -87077 46755 31284
18940 31284 -59775 -192262 -125704 -151462 -141546 -67202 15039 325502 -56541 -219775 -235299
18929 -235299 -244801 -185620 53227 107700 -237882 -126785 -58596 16626 8466 87694 262875
18918 262875 -41855 -6053 -148048 -302929 -83148 -111391 -36636 255228 -210296 68469 -2293
$$ packed form
18999A22019J719B93K40079I1939D1779P4473b12138c7098D2086R6527a6514E3648
18986B34059c16570b6535o8084F3496J11365J72364a23310M4151n907b5523d820
18974b44725B4160a14121j98548A3947L21127c6745k59192B6751a94478b2694
18963c7671p7684A06670c35814A77179o7548r970J26849a93706H8088a23855B5371
18951A16678K80182A55131E802N7185R4726h2044D77383H0835h7077D6755j5471
18940C1284e9775j32487O6558k5758R916f7202A5039L10463e6541j63234j5524
18929b35299r502N9181E3227N4473b37882J11097e8596A6626q160P9228J75181
18918B62875d1855f053j41995j54881h3148k8243c6636B55228b10296F8469b293
$$ plain form
18906 -50670 -291591 -8366 208429 66687 -54999 -149199 -55626 -226452 480925 291082 -224029
18894 135082 29792 -167204 164965 112289 98300 17750 25105 -134673 -61180 -46378 -113124
18883 -113124 51724 -46980 75921 -26453 -38792 -84285 -172032 -120355 167531 -173296 -354251
18872 -354251 200250 -140485 -102668 -362363 -139508 -256140 78972 180479 148577 -294359
18861 168650 57910 -46008 153509 160892 -275729 -72273 -52650 -88370 41970 -248472 -202897
18850 -202897 -163320 -185386 -35032 150463 -52879 -187933 136197 181895 33616 196562 11141
18838 -117626 -401393 -50976 -66563 40407 -34719 118313 -409861 168758 165671 203825 -348394
18826 34499 -253912 -175699 138184 4530 -47648 98930 308330 20572 135676 -79139 13257
$$ packed form
18906e0670k40921h366B08429F6687e4999r4200e5626j70826D80925j89843b24029
18894A35082B9792a67204A64965n2676j3989A7750P355a34673f1180J4802o6746
18883a13124E1724d6980G5921b6453j2339m5493q7747N1677A67531a73296j80955
18872c54251B00250a40485L7817k59695a39508j16632G8972J01507l1902b94359
18861A68650E7910d6008A53509P383b75729g2273J9623l5720D1970b48472M5575
18850b02897L9577k2066c5032A50463e2879j35054A36197M5698C3616J62946A1141
18838a17626k83767e0976j5587D0407c4719A18313d09861A68758l087L8154c48394
18826C4499b53912P8213A38184D530d7648I8930K09400B0572J15104g9139A3257
$$ plain form
18814 107481 -55854 23887 -134464 241518 214545 -225168 1622 72805 182222 89421 14998
18802 34323 -28779 -308879 -27451 -315349 -408662 -37597 -284213 -534416 42197 -191782 -467422
18791 -467422 58349 -231337 1557 -146329 -282575 15773 -71133 -202657 -188407 122158 148008
18780 148008 -324506 212564 145453 -349499 -243680 -152244 115072 206471 411781 -240326
18769 194598 -7733 -183634 141654 208262 35078 176330 -73934 70774 -83630 114719 -263821
18757 96143 15952 -166103 -221103 -141090 57487 35057 97794 -54877 -225826 -343166 -141692
18745 -43052 -69263 -6003 -267712 333085 -116376 102132 75617 171297 -74275 70178 242732
18734 242732 -208505 -90805 -5915 -6857 -179726 182155 -114893 -248146 -85083 -75030 101585
$$ packed form
18814A07481e5854B3887a34464B41518k6973b25168A622P1183J09417H9421A4998
18802C4323b8779k80100b7451k87898r3313c7597k46616k50203D2197a91782k75640
18791d67422E8349b31337A557a46329j36246A5773g1133j31524J4250A22158K5850
18780A48008c24506B12564o7111c49499J05819R1436A15072R1399K05310b40326
18769A94598g733j75901A41654O6608C5078J41252g3934G0774h3630A14719b63821
18757I6143A5952a66103n5000Q0013E7487k2430O2737e4877j70949j17340a41692
18745d3052k6211f003k61709C33085a16376A02132k6515R5680g4275G0178J72554
18734B42732b08505i0805e915r42j72869A82155a14893j33253h5083J0053A01585
$$ plain form
18722 44080 208006 -9121 126449 -188498 -144114 -202964 158104 -138267 -40975 59086 -356
18710 157449 34095 258600 -166774 235722 -198947 54963 -126945 -139542 144995 -65706
18699 241830 -38818 -130323 84550 -216134 -124305 63412 6224 34490 -139292 171747 -167724
18687 -117303 136181 46608 188016 -31893 -548738 -155078 -248442 46194 -78139 -203039
18677 -203039 -123157 -18898 -339816 45000 75697 203259 17923 25801 181360 -65623 236636
18665 -259588 202453 -249215 -189026 -25022 -197219 -258923 -89954 -523457 -191579 -240793
18655 -240793 -256160 177884 -180249 -228789 -393042 73654 133476 -231445 162134 -235408
18644 -216918 112273 22569 -190592 -90016 185254 -324376 -112839 542109 255691 24290
$$ packed form
18722D4080J63926i121A26449a88498M4384n8850A58104a38267d0975E9086c56
18710A57449C4095K24505a66774B35722a98947E4963a26945j2597A44995f5706
18699B41830c8818r1505H4550b16134R1829F3412F224K8266a39292A71747a67724
18687a17303A36181D6608J41408c1893n16845a55078r3364D6194g8139j24900
18677b03039P9882a8898l20918D5000L0697J27562A7923P878J55559f5623B36636
18665b59588B02453b49215O0189b5022j72197o1704h9954m33503a91579m9214
18655b40793j5367A77884a80249m8540j64253G3654N9822b31445A62134b35408
18644b16918A12273B2569a90592i0016A85254c24376a12839E42109B55691B4290
$$ plain form
18633 -326845 -422788 111554 -248989 160280 -50008 -271168 -10434 30672 -257915 -26792
18622 -16293 62151 -173445 162073 174332 -35041 49557 -140793 -319471 -57516 24061 -44089
18610 108 30883 153197 82674 14871 9164 -181101 -109298 12 243030 18126 -404050 163906
18597 98271 -95655 164460 -4148 61089 -153432 -462694 -262251 -6119 -129972 211598 173760
18586 173760 -347673 188298 249161 191182 -253083 -16124 163286 154580 -34880 -89068 -188737
18575 -188737 -75230 -55588 -174961 -141247 8093 -208693 -60514 111644 -43497 151309 79560
18564 79560 -41321 -184463 8002 213702 -130442 -212688 -519214 -53391 62500 -29373 -38739
18553 -38739 203436 -5322 66335 -139345 -273385 -80693 185837 -48663 109393 398559 -61440
$$ packed form
18633c26845r5943A11554b48989A60280e0008k21160a0434C0672b57915b6792
18622a6293F2151a73445A62073J2259c5041D9557a40793j78678e7516B4061d4089
18610A08L0775J22314p0523A4871n707a81101P1803A2K43018A8126d04050A63906
18597I8271i5655A64460d148F1089a53432l09262K00443f119j23853B11598l7838
18586A73760c47673A88298O0863n7979b53083a6124A63286q706c4880n4188r9669
18575a88737g5230J9642j19373L3714H093b08693f0514A11644d3497A51309p1749
18564G9560d1321j43142H002K05700a30442q2246l06526e3391F2500b9373r366
18553c8739B03436e322F6335a39345j34040h0693A85837d8663A09393K89166f1440
$$ plain form
18541 -16982 160145 419 -381661 208163 -98118 -85048 -234510 194714 -193233 -498669 -90372
18529 57740 -103985 -14326 -272400 -32038 -292092 -83377 178237 -16426 -147806 38416 172457
18518 172457 -139084 261354 239585 86654 66400 -8920 308251 -59307 -26882 -410345 -343665
18507 -343665 -90021 111767 -120032 -126717 170811 -371313 -71446 281333 34904 -284721
18496 -172168 -152990 100278 -463486 -70067 -369661 -137755 64381 76050 -502020 97341
18485 29877 -36532 279965 -181221 243262 -221265 -38524 343094 57083 -107043 149385
18474 -147374 -53865 -273873 27902 199599 -107297 2244 12416 15898 -439863 -213798 -209581
18463 -209581 -131036 320841 401996 -263839 -1138 -157611 121017 194344 -54845 83076 -168174
$$ packed form
18541a6982A60145D19c81661B08163i8118J3070j49462A94714a93233l05436i0372
18529E7740a03985a4326k58074c2038k60054h3377A78237a6426j31380C8416J34041
18518A72457a39084B61354k1769H6654k0254h920C08251e9307b6882l83463O6680
18507c43665i0021A11767a20032o685A70811c71313g1446B81333C4904b84721
18496a72168J9178A00278d63486g0067k99594a37755F4381J1669e02020I7341
18485B9877c6532B79965a81221B43262b21265c8524C43094E7083a07043A49385
18474a47374e3865k20008B7902J71697a07297B244J0172L482d39863b13798M217
18463b09581P8545C20841Q1155b63839a138j56473A21017P3327e4845H3076a68174
$$ plain form
18451 860 -144853 -89858 -22811 -200876 -114805 51225 -92241 -40042 -407336 -181691 -174845
18440 -174845 -96057 97778 -371576 -61504 -237447 -200585 -53993 -218671 -15591 -47614 55353
18428 106218 32071 -239961 -54 20417 -52937 -189029 -53964 -17632 317960 -59674 -51739 -51017
18416 -51017 -137086 -228380 123630 -145490 -372992 -69672 -69676 44388 -165672 -171842 6833 -287560
18403 -161679 -205139 -171312 -61305 -277201 205803 -119424 -150252 -221642 -319459 163344 -72339
18391 -28956 155845 -266630 -97785 238811 -170839 55744 -51933 36685 112654 -100063 -358385
18380 -358385 -201827 -58743 -58021 3062 -34916 -152407 158783 -17371 102881 184267 -100298
18368 -39017 48414 37523 -344596 169905 60361 84927 25856 93289 -18595 -111891 -55521
$$ packed form
18451H60a44853N4995b2811j78065Q6071E1225i2241d0042l67294a81691O846
18440a74845P8788I7778c71576f1504j75943L6862e3993j64678a5591l2023E5353
18428A06218C2071b39961e4B0417e2937j36092e3964a7632C17960e9674P935P22
18416e1017q6069r1294A23630a45490k27502f9672mD4388a65672o170F833b87560
18403a61679m3460L3827f1305k15896B05803a19424l0828p1390r7817A63344g2339
18391b8956A55845b66630i7785B38811a70839E5744e1933C6685P5969a00063k58322
18380c58385J56558e8743P22C062c4916j17491A58783a7371A02881Q1386a00298
18368c9017D8414j0891c44596A69905F0361K4566B5856O7433a8595r3296e5521
$$ plain form
18356 37745 -247166 -31956 105105 -148526 432327 200532 195751 -267199 -209631 470780
18345 103617 -91607 -304327 64536 -205957 -58239 -152833 196646 -348669 -253996 51425 38194
18334 38194 39142 -49694 -17646 19684 -36408 45844 -165362 -128094 -11759 293101 82411 71473
18322 71473 -148481 -127060 -65898 159765 119257 90740 -100357 55522 213352 -36997 -78408
18311 -78408 -126803 171205 -224595 33744 -203407 216300 -99632 159827 15784 -105054
18300 -68161 -254868 -100037 -352990 -18954 -106829 -161554 -372738 -63837 38520 74328 256810
18289 256810 162230 -119224 -95796 -34081 -85654 -165444 -247472 35188 29470 105837 -365230
18277 889 -137565 -54381 177409 145186 190112 -209239 33932 -72173 -206569 195316 -164418
$$ packed form
18356C7745b47166c1956A05105a48526D32327B00532m781b67199N7568D70780
18345A03617i1607k12720F4536b05957e8239r4594A96646c48669R4673E1425j3231
18334C8194R48d9694a7646A9684c6408D5844a65362L7268a1759B93101H2411j0938
18322G1473a48481K1421O1162A59765m0508k8517a00357E5522J57830c6997m1411
18311g8408m8395A71205b24595C3744b03407B16300i9632A59827A5784a05054
18300f8161j86707a00037k52953a8954q7875n4725k11184f3837C8520L5808J82482
18289B56810r4580a19224K3428c4081n1573p9790q2028C5188n718P6367c65230
18277H89a37565e4381A77409l2223M4926b09239C3932g2173j34396A95316a64418
$$ plain form
18265 -157056 -108616 -40220 178739 256211 110317 -360142 -221724 -128016 -143039 121436
18254 -227580 73923 196144 -334893 -38314 154596 -281936 -256193 22837 -57199 144244
18243 -266806 159871 -219822 6079 -9650 426686 119741 -158803 29047 235837 -138564
18232 81089 85268 -379382 -157149 76453 -156238 -132021 16192 -104653 -255287 328 112015
18221 112015 -85715 -210998 78738 222952 -12119 240802 72817 20892 -103008 -179396 19424
18209 -61424 -141521 20132 144196 -174422 -213460 -176362 -137261 27348 -144613 -220406 277942
18197 -279449 -93817 -119917 -31592 -6703 -46194 -261457 -138347 218819 -27829 -181417 146856
18185 26385 -106395 -221724 -310057 -167162 -55756 233370 265357 116758 -100925 -288666
$$ packed form
18265a57056M8440d0220A78739P7472A10317c60142J38418R3708j5023A21436
18254b27580G3923J22221c34893c8314A54596b81936K5743B2837e7199A44244
18243b66806A59871b19822F079i650D26686A19741a58803B9047K06790a38564
18232H1089M179c79382a57149G6453a56238K4217A6192a04653j50634C28J11687
18221A12015h5715j25283G8738J44214a2119B40802G2817B0892a03008p6388A9424
18209f1424q0097B0132J24064a74422l9038L7098L9101B7348a44613p5793B77942
18197b79449i3817k6100c1592f703l9491k15263J23110B18819b7829j53588A46856
18185B6385a06395j15329q8333J42895e5756B33370L1987A16758a00925j87741
$$ plain form
18175 -288666 -331293 -143735 -168286 191483 21027 -185895 4331 -444302 -91366 -317770 353621
18163 -271228 84456 123692 -66309 184931 -24452 -37815 170166 -318953 -86585 -81102 -6223
18151 59728 -14041 -274104 137395 22949 -72748 32474 -117079 185738 296551 337980 -131558
18139 -253750 -298226 12614 -110376 334531 -9379 24418 69333 309926 -200740 -375687 75595
18127 82885 256167 125959 -69671 -126062 -5070 107468 16815 -331406 -58730 -62286 -48240
18116 -48240 91779 284041 40792 41794 -571081 -53017 83494 -506174 -329977 117419 22168
18104 104273 -4496 159688 -201588 -187369 -56925 -26636 51130 161074 -53225 186504 -22779
18092 -5890 77132 -89242 21633 45283 -15379 -53695 153555 -174775 -76508 -332006 15872
$$ packed form
18175b88666m2627a43735k4551A91483B1027a85895D331d44302i1366k26404C53621
18163b71228H4456L9236f6309A84931b4452j3363A70166c18953h6585N483f223
18151E9728a4041k60063A37395B2949g2748C2474a17079A85738J10813M1429a31558
18139b53750m4476A2614a10376C34531i379B4418M4915K40593b00740j74947G5595
18127H2885J73282A25959f9671n6391e070A07468A6815c31406e8730l556J4046
18116d8240I1779J92262D0792J002e71081e3017H3494e06174J76197A17419B2168
18104A04273d496A59688b01588J4219e6925b6636E1130J09944e3225A86504b2779
18092e890G7132h9242B1633K3650a5379l8316A53555a74775g6508k55498A5872
$$ plain form
18080 -3886 -15888 83467 -214379 -217287 -106739 139028 -367093 -36523 -336236 -215214 512
18068 -137221 34653 -182015 -268858 99903 -213554 -119241 101489 -130351 -5113 -306629 -258304
18057 -258304 115599 -176394 -28600 357315 -19841 108492 -249730 316045 132840 -97674
18046 234543 24383 -122828 12910 155544 95229 -33868 169349 32948 -204276 1188 -223324
18034 -29702 169432 -248445 -154454 -183777 -136312 -245385 -66810 -145450 244159 26725 83884
18023 83884 -132313 94284 -348700 -374773 30202 -110297 -197135 129424 -59818 182277 -186409
18011 -278672 125199 -147969 -217200 -13675 105219 -9187 -123627 -80759 71365 156008 -225339
17999 22402 -52366 -186245 73769 -63210 138075 167711 -205877 129226 -151898 48319 71178
$$ packed form
18080c886j2002H3467b14379k908a06739A39028c67093c6523k99713J21022E12
18068a37221C4653a82015q6843I9903b13554R4313A01489a30351e113l01516M8325
18057b58304A15599a76394b8600C57315a9841A08492b49730C16045A32840i7674
18046B34543B4383a22828A2910J42634o0315c3868A69349C2948b04276A188b23324
18034b9702A69432b48445R3991k9323M7465j09073f6810p8640B44159B6725N7159
18023H3884a32313I4284c48700k6073C0202a10297q6838A29424e9818A82277a86409
18011b78672A25199a47969o9231a3675A05219i187j14440M2868G1365Q4643b25339
17999B2402e2366j33879G3769f3210A38075K9636b05877A29226a51898D8319K2859
$$ plain form
17988 71178 -284757 -233039 -77896 169437 296181 -231023 419696 -292952 -135369 -33425
17977 -145949 -57017 -167624 33689 236048 -103966 293475 -44954 11901 -33906 119141
17966 116366 106084 -34084 139658 101469 -71822 2919 291616 -143275 -61593 36249 577196
17955 577196 -100476 -199280 147411 -438929 199795 -65414 -146088 160089 96247 204055
17945 204055 -66432 -64808 -190435 -28729 -202228 55282 46912 -107494 -131781 -76104 158689
17933 105535 -167766 -250037 -136600 -24227 17930 141357 322973 -106520 -126185 -372766
17923 -372766 47840 -4871 -134795 126724 -313247 40992 61064 -9208 84106 10781 142033
17912 142033 -103048 17289 -209643 171273 -29723 -196226 -26979 -92457 287059 54533
$$ packed form
17988G1178b84757N1718g7896A69437J26744b31023D19696b92952a35369c3425
17977a45949e7017j10607C3689K02359a03966B93475d4954A1901c3906A19141
17966A16366j0282c4084A39658l8189g1822B919K88697a43275f1593C6249N40947
17955E77196a00476r8804A47411d38929A99795f5414q0674A60089o3842J07808
17945B04055f6432J624j25627b8729j73499E5282q370a07494k4287N5677A58689
17933A05535a67766q2271J13437b4227A7930J23427J81616a06520j9665k46581
17923c72766D7840d871j29924A26724c13247D0992K0072i208H4106A0781J31252
17912A42033a03048A7289b09643A71273b9723j66503b6979o5478B87059E4533
$$ plain form
17901 -210041 -33215 -107213 54381 -125022 -361670 208482 -139514 228611 -287011 -85837
17890 -53089 306936 -38197 -195642 17753 -404382 -302546 108626 46229 -474470 61101
17879 -37755 92132 -115194 128642 -104661 -47981 66654 -107250 188615 -204503 -115810
17869 -115810 258645 182335 -154068 81538 392970 -458235 -5734 -114130 29524 -52487 -11226
17857 31081 61120 -50090 35466 -40488 -102027 -52519 -233447 -149588 -160411 -60328 -173689
17846 -173689 212798 120658 -224825 36983 277098 129314 136151 110118 -195379 37020 68010
17835 68010 -240974 -288926 -95590 212390 -21462 47228 279213 -81559 85470 -39308 -54511
17824 -54511 -300776 140828 -34129 264204 117191 54387 -6273 -150128 -25536 158056 120678
$$ packed form
17901b10041c3215p3998E4381a25022k36648B08482a39514B28611b87011h5837
17890e3089C06936c8197j57445A7753d04382J01836A08626D6229d74470F1101
17879c7755I2132a15194A28642a04661d7981F6654a07250A88615b04503Q8693
17869a15810B58645p6310a54068H1538L11432d58235e734j08396B9524e2487a1226
17857C1081L0039e0090C5466d0488o1539M9508j80928Q3859j0823f0328j13361
17846a73689B12798r2140b24825C6983K40115A29314O837k6033a95379C7020L0990
17835F8010b40974m7952i5590B12390b1462D7228K31985h1559H5470c9308j5203
17824e4511k46265A40828c4129B64204A17191E4387f273j43855b5536A58056l7378
$$ plain form
17813 120678 -201036 252317 224166 -41817 81755 120737 248090 -198651 356254 129103
17802 25998 -149837 387313 -145083 103095 137824 -100266 -237905 -259522 230975 -17096
17791 -226123 60682 329140 186124 21742 -365941 -112619 208939 162706 81308 -2317 39244
17779 52498 -19176 -228092 69256 -136022 70403 104213 8262 60389 31384 153636 -210224
17767 -20463 138306 142199 -90839 100099 86056 326409 48780 -162195 143725 88543 366676
17756 366676 -52209 244623 -258815 -132576 -104830 65871 -199171 205289 326870 -122353
17745 -17958 131172 66162 142186 -101370 -57714 265807 16858 -93492 -30697 -136683 151595
17733 -95344 20263 -125826 193485 -248857 -146766 93244 -154688 -68045 192599 156110
$$ packed form
17813A20678b01036B52317k8151d1817H1755L8982J27353a98651C56254A29103
17802B5998a49837C87313a45083A03095L4729a00266j37639k1617B30975a7096
17791b26123F0682K68458j43016B1742c65941a12619B08939m6233H1308b317C9244
17779E2498a9176k08916F9256a36022G0403L3810H262N2127k9005J22252b10224
17767b0463A38306L893i0839A00099j4043K40353D8780a62195A43725n5182K78133
17756C66676e2209B44623b58815J26239K7746F5871a99171B05289J21581a22353
17745a7958A31172o5010P6024a01370M3656B65807A6858i3492c0697j05986A51595
17733i5344B0263a25826A93485b48857J02091I3244a54688f8045A92599l6489
$$ plain form
17723 156110 71938 95287 111082 12570 278081 -77032 -222900 -233558 174527 135904 -182836
17711 122986 86149 -105328 120956 27345 -107497 43713 -63957 -277441 64659 96955 -3883
17699 -24362 -48349 268128 272450 130648 198064 52426 86881 285374 -254807 425088 152923
17687 -237210 -36529 220787 38169 80629 -255223 -1630 -104083 -9998 -43725 6797 -60116
17675 -327582 -38565 220210 161793 -9958 384649 270973 -274262 -114622 96699 1849 -163211
17663 -20046 -127361 203048 87426 -10652 84060 -19205 197770 288978 161042 38287 164491
17652 164491 -28206 83717 -24757 79387 -5944 -165424 -175510 -87878 280130 -53546 96025
17640 -161010 -91391 -12291 3802 233494 -73393 -114917 161086 -200328 -139509 -55994 -63629
$$ packed form
17723A56110G1938K3349J5795A2570K65511g7032j45868j0658A74527l8623a82836
17711A22986l6837a05328A20956B7345a07497D3713f3957k13484F4659L2296c883
17699b4362k3987B68128M322A30648O7416E2426L4455J98493b54807D25088A52923
17687b37210c6529B20787C8169M2460b55223a630j02453i998l3727F797f0116
17675c27582c8565B20210n8417i958C84649j13676b74262a14622I6699A849a63211
17663b0046j07315B03048H7426a0652H4060a9205A97770R1208j27936C8287J26204
17652A64491b8206H3717b4757G9387e944j59480j0086Q7632B80130e3546I6025
17640a61010O9619a2291C802K29692g3393m1524A61086b00328O0819e5994p635
$$ plain form
17629 -63629 101323 90420 266345 -28539 -80497 -98320 -15619 25178 96086 333452 127091
17617 204442 -98684 -184247 -193964 186117 -37692 128898 -61454 -159527 32968 41013 152506
17606 152506 423230 -193037 -208316 -226208 88562 -130094 122658 -149572 -372173 223655
17595 -55668 -102651 -74213 176754 -91638 62483 170756 125248 -509475 -30479 40844 -90489
17583 62941 -114857 27990 192985 -195055 97312 -154437 -18479 82937 116166 -118658 -18874
17571 -7526 45468 104231 101945 56660 -41954 -6214 -352523 -237000 132748 191682 71555 320384
17559 320384 271968 474596 110700 20936 -76707 400789 201022 -119660 196405 229832
17549 229832 -71900 94182 312880 141333 29379 -73567 140745 8315 -248113 215253 -57997
$$ packed form
17629f3629A01323j0903J75925b8539n1958j7823a5619B5178P0908K37366A27091
17617B04442i8684q5563r717A86117c7692A28898f1454r8073C2968Q045J11493
17606A52506K70724a93037j5279j7892H8562a30094A22658a49572k22601B23655
17595e5668m6983K8438A76754i1638F2483J08273m5508e09475c0479D0844i0489
17583F2941a14857B7990J64995a95055I7312a54437a8479H2937L3229a18658a8874
17571g526D5468N8763k286m5285d1954f214l46309J15523A32748N8934G1555K48829
17559C20384m8416K02628A10700B0936g6707D00789j99767a19660A96405L3427
17549B29832g1900I4182K18698A41333B9379g3567A40745H315b48113B15253e7997
$$ plain form
17537 409549 -51547 323619 233862 267622 48155 72949 13115 244447 39159 -165513 -40678
17525 179788 187113 48727 -129962 375242 327352 475718 135761 142009 -296737 159497 -92817
17513 -229845 14520 62471 145211 -171434 40968 -309572 -236094 110402 50129 125470 -112892
17501 11377 72855 108373 263414 210341 288402 -24231 -59696 70437 107090 178727 415424
17490 415424 358065 381671 -10305 16009 193050 148751 -279503 114294 227923 -6733 95570
17478 -42154 -4847 77427 252448 -26250 -88269 127131 -119030 296733 160572 -117242 609569
17466 101242 53772 177483 145803 49140 -86856 418220 -105121 -59427 143713 144439 44096
17454 -5261 427363 253206 85842 213182 -49300 357887 218961 205372 176860 194577 82313
$$ packed form
17537D09549e1547C23619q9757L3760D8155K4794A3115K31332C9159a65513d0678
17525A79788P325D8727a29962C75242m7890J48366A35761O248b96737A59497i2817
17513b29845A4520M7951Q2740a71434D0968c09572P3478A10402E0129P5341a12892
17501A1377O1478L5518J55041n3073P8061b4231l5465G0437L6653P1637K36697
17490D15424n7359K3606a0305A6009J77041m4299b79503A14294J13629f733I5570
17478d2154d847G7427J75021b6250o2019A27131a19030B96733j36161a17242F09569
17466A01242m7470J23711l1680D9140h6856D18220a05121M5694A43713P26D4096
17454e261D27363j74157H5842J27340d9300C57887j38926j3589k8512J7717H2313
$$ plain form
17442 178184 190729 80592 165304 510855 22551 184846 180101 164622 237713 14642 76848
17431 76848 233020 422808 130709 283825 -17709 -35038 82250 256557 11721 -131313
17420 267193 104152 232703 106623 38389 168338 15822 -125745 -50482 431382 11168
17409 13674 345659 155631 392754 57266 162567 247957 158213 212488 78353 275355 45304
17397 63409 171284 32059 79232 109611 368067 170507 -114442 265658 177223 24087 -71857
17385 229463 18020 104263 -69347 38464 64646 -47715 -156444 160674 283467 -171470 340952
17373 45156 87491 339182 66202 287655 -11452 16210 247051 284986 -37844 180128 206734
17362 206734 275201 177221 118449 -3095 65355 192606 331691 136519 -23383 221992 116484
$$ packed form
17442A78184J2545H0592Q4712L45551B2551J62295m745j5479P3091A4642O2206
17431G6848J56172J89788A30709J53116a7709j7329H2250J74307A1721a31313
17420B67193A04152J28551A06623C8389J29949A5822a25745e0482D31382A1168
17409A3674L31985A55631K37123E7266J05301Q5390q9744N4275G8353J97002D5304
17397F3409J07875C2059M7173L0379K58456A70507a14442B65658q8435B4087g1857
17385B29463A8020Q6243f9347C8464K6182d7715j08729A60674J22793a71470C40952
17373D5156M2335K51691F6202K21453a1452A6210K30841L7935c7844A80128K6606
17362B06734O8467r7980n8772c095F5355J27251J39085A36519b3383B21992j05508
$$ plain form
17351 116484 199126 -194062 135595 62004 30820 335808 162491 104229 156406 84736 -189253
17339 196771 398120 226187 -105564 276132 346103 -103513 188028 173535 182330 -60480
17328 10989 293918 126088 333609 97300 82662 463740 288974 299404 165348 -25127
17317 310169 111446 153490 168829 157005 287020 -46169 246562 103651 99856 -5352 84470
17305 -26912 84980 193137 -219240 305917 -18834 307470 -36744 137590 -8199 208265 189566
17294 189566 143927 334396 -24539 -63909 274025 39151 220549 323765 402600 434728 -126073
17282 113002 285788 -119905 69242 198896 89420 99583 109467 38715 122067 224200 194865
17271 194865 224510 119760 318831 289001 -152438 12485 512651 59104 223934 256557
$$ packed form
17351A16484Q2642a94062A35595F2004C0820L04988A62491n8262N2177p1670a89253
17339A96771K01349j71933a05564B76132O9971a03513A88028j4493Q795f0480
17328A0989K82929A26088K07521I7300j4638L81078j74766J0430j34056b5127
17317C10169A11446M2044J5339j1824J30015d6169B46562A03651l795e352H4470
17305b6912H4980J08157b19240C05917a8834C07470c6744A37590h199B08265j8699
17294A89566m5639J90469b4539l9370B74025C9151J81398J03216P8835L2128a26073
17282A13002J72786a19905F9242J29654H9420J0163R884C8715Q3352J02133k9335
17271A94865K9645j04750J99071k9830a52438A2485N00166E9104J64830L2623
$$ plain form
17261 256557 2462 -42007 223653 80024 243735 233860 351661 417846 292317 -97915 31290
17249 291105 168895 292428 -23909 -141487 111592 11424 200897 174933 32306 412530
17239 412530 160431 -1149 -75297 -23546 44009 282972 254691 157570 213609 264595 213395
17228 213395 -19669 264933 388675 223281 172225 213761 126467 -56142 -190301 -4154 205048
17216 231394 -15078 235790 -158283 419241 231277 172224 89992 228674 36938 264927
17206 264927 102029 234750 154928 557936 258047 152096 499607 7926 165918 213981
17196 213981 44622 406452 2008 199403 122500 -66907 -4673 273932 455211 147530 326137
17185 326137 282457 200115 -136073 530776 368462 161791 399829 302055 154528 287856
$$ packed form
17261B56557B462d2007B23653H0024J63711r875J17801O6185j25529i7915C1290
17249B91105j22210J23533b3909j17578A11592A1424J89473k5964C2306L80224
17239D12530A60431a149p4148b3546D4009K38963k8281r7121N6039N0986n1200
17228B13395a9669B64933J23742j65394n1056M1536q7294e6142j34159d154B05048
17216B31394a5078B35790a58283D19241j87964n9053q2232J38682C6938K27989
17206B64927A02029J32721p9822M03008B58047j05951L47511G926J57992M8063
17196B13981D4622L61830B008J97395p6903f6907d673B73932J81279A47530J78607
17185C26137m3680q2342a36073E30776j62314A61791K38038r7774j47527J33328
$$ plain form
17175 287856 157126 202103 110463 110721 2531 153025 384846 107584 411363 233254 262475
17164 262475 196992 667180 -251714 436559 406016 133744 164405 154008 -339836 220558
17153 201549 36044 303979 353495 348216 358767 220548 355474 18085 191627 430627 262109
17142 262109 422208 456255 361100 255045 65391 293202 403733 616903 157794 103909
17132 103909 472887 309581 573476 338243 219169 229222 -61621 737717 305885 162493
17122 162493 268721 275238 403262 521010 156950 152104 166014 370602 807431 125042
17111 88745 99671 328518 531525 477798 851318 314586 696006 339336 231560 154276
17101 154276 315296 276275 288266 364931 187446 331982 308117 497962 55234 98072 513776
$$ packed form
17175B87856j30730M4977r1640K58B531J50494K31821A07584L03779j78109K9221
17164B62475o5483M70188b51714D36559l0543A33744L0661j0397c39836B20558
17153B01549C6044K67935M9516n279J0551j38219J34926A8085J73542K39000j68518
17142B62109J60099L4047r5155j06055F5391K27811J10531K13170A57794n3885
17132A03909L68978j63306K63895k35233j19074J0053f1621G37717C05885j43392
17122A62493J06228O517J28024J17748A56950m846J3910K04588M36829A25042
17111H8745J0926K28847K03007n3727L73520C14586L81420C39336j07776p7284
17101A54276J61020l9021J1991P6665j77485J44536k3865J89845E5234M2838M15704
$$ plain form
17090 513776 260244 126218 314459 245010 269592 686333 205347 703440 428469 621099
17080 621099 361271 442947 408292 228525 280897 534145 350944 387516 550413 262626
17069 430799 421804 490037 469674 390292 134038 444855 271733 493776 514415 523212 190254
17057 507048 437091 516201 586659 537065 543405 595384 246363 428448 542851 381587 624435
17046 624435 352015 534898 743494 350156 725582 296260 160057 379381 4244 540655
17036 540655 472534 401187 534050 751246 624747 658722 786844 286766 373742 816135
17026 816135 1014098 501885 605501 522380 560985 722961 173533 367573 608849 476511
17016 476511 300579 653896 737595 633801 609329 515406 661353 629806 830743 610493
$$ packed form
17090E13776k53532A26218J88241o9449K4582M16741B05347M98093k74971J92630
17080F21099k59828Q1676l4655j79767N2372K53248j83201L6572J62897B62626
17069D30799q995O8233k0363p9382A34038L10817j73122K22043K0639Q797A90254
17057E07048o9957P9110P0458m9594O340N1979B46363J82085J14403j61264K42848
17046F24435k72420J82883K08596C50156L75426B96260j36203K19324D244N36411
17036E40655o8121p1347J32863K17196j26499L3975J28122B86766Q6976M42393
17026H16135J97963E01885J03616q3121L8605J61976A73533J94040K41276j32338
17016D76511j75932L53317Q3699j03794k4472r3923J45947l1547K00937k20250
$$ plain form
17006 610493 675955 810109 623085 685994 580712 616101 627255 775872 754677 877470
16996 877470 587539 448033 692892 887293 683306 701795 459829 775249 413006 767502
16986 767502 959652 603175 954586 736991 416620 667815 946485 560199 811957 966264
16976 966264 538310 829369 880006 848682 960139 796205 729160 744105 1092983 689022
16966 689022 943709 608496 1112551 469691 970341 705428 1027355 905089 868765 821702
16956 821702 996587 1007851 877899 1100894 984183 774814 1026520 973496 925423 877123
16946 877123 659273 1261587 941159 1155509 999963 976057 972515 1045528 961835 810963
16936 810963 1298615 1035524 1300945 1080440 1176481 1049849 1266618 1020583 1290272 1260007
$$ packed form
17006F10493O5462J34154j87024O2909j05282L5389J1154J48617k1195J22793
16996H77470k89931j39506K44859J94401k03987J8489k41966L15420l62243L54496
16986G67502J92150l56477L51411k17595l20371K51195K78670l86286K51758J54307
16976I66264m27954K91059N0637l1324J11457j63934o7045J4945L48878m03961
16966F89022K54687l35213N04055D69691N00650k64913L21927j22266l6324m7063
16956H21702J74885J1264j29952K22995j16711k09369K51706n3024m8073m8300
16946H77123k17850O02314l20428K14350j55546k3906l542P3013q3693j50872
16936H10963M87652k63091K65421k20505R6041j26632K16769k46035K69689l0265
$$ plain form
16926 1260007 1275784 1094004 1295301 1268900 1315237 1307006 1109658 1461680 1393107 1010279
16916 1010279 1341374 1276844 1352497 1145556 1634232 1396238 1247059 1159320 1482162 1698518
16906 1698518 1683670 1559386 1627256 1447317 1763155 1462364 1602854 1439239 1867832 1438729
16896 1438729 1639117 1423611 1575969 1854064 1702964 1781168 2028128 1457481 1672784 1775805
16886 1775805 1838745 2031998 1780074 2106339 2002219 1604249 2002414 1970176 2298680 2011978
16876 2011978 2122520 2188123 2402405 2073454 2052156 2232721 2274313 2245504 2323444 2675744
16866 2675744 2439286 2318599 2055648 2595595 2504990 2558908 2537277 2440550 3047705 2460067
16856 2460067 3025930 2812003 2841627 2973321 2922629 2761253 3037221 2786737 3326925 3350794
$$ packed form
16926A260007J5777j81780K01297k6401M6337q231j97348L52022o8573l82828
16916A010279L31095o4530P5653k06941M88676k37994j49179q7739L22842K16356
16906A698518j4848j24284O7870j79939L15838l00791J40490j63615M28593m29103
16896A438729K00388k15506J52358K78095j51100P8204K46960n70647K15303J03021
16886A775805O2940J93253k51924L26265j04120l97970L98165l2238L28504k86702
16876B011978J10542O5603K14282l28951k1298J80565M1592k8809P7940L52300
16866B675744k36458j20687k62951N39947r0605N3918k1631r6727O07155n87638
16856B460067N65863k13927K9624J31694n0692j61376K75968k50484N40188K3869
$$ plain form
16846 3350794 2789708 3168217 3151875 3168048 3588637 3773953 3607396 3331228 3475593 3589734
16836 3589734 3685707 3699785 3882637 3838011 3837594 4034084 4178201 4379955 3916272 4365622
16826 4365622 4545689 4236585 4328173 4854053 4799090 5063434 5146033 5295269 5023629 4888210
16816 4888210 5131517 5583892 5194121 5600981 5721035 5921250 5717073 5868175 6036975
16807 6036975 6418949 5918012 6545696 6446045 6696838 6892236 6896971 7496010 7497123 7770997
16797 7770997 7739997 8260346 8049545 8501390 8444519 8601461 8637570 9207405 9664030 9785479
16787 9785479 9981903 10134113 10489224 10910709 11229536 11686915 11592849 12169590 12370711 12786877
16777 12786877 13332965 13589533 13937722 14478283 15004336 15297031 16087054 16586399 16946988
$$ packed form
16846C350794n61086L78509j6342J6173M20589J85316j66557k76168J44365J14141
16836C589734R5973J4078J82852m4626m17J96490J44117K01754m63683M49350
16826D365622J80067l09104R1588N25880n4963K64344Q2599J49236k71640j35419
16816D888210K43307M52375l89771M06860J20054K00215k04177J51102J68800
16807F036975L81974n00937O27684r9651K50793J95398M735N99039J113K73874
16797G770997l1000N20349k10801M51845n6871J56942L6109N69835M56625J21449
16787I785479J96424J52210L55111M21485L18827M57379r4066N76741K01121M16166
16777A2786877N46088K56568L48189N40561N26053K92695P90023M99345L60589
$$ plain form
16768 16946988 17013312 18151661 18530728 19489403 20570260 20874902 21748203 22399360 23327213
16759 23327213 24383912 25235804 26463476 27607733 28639925 29878028 31219745 32328696
16751 32328696 34189724 35743282 37734737 39278954 41217152 43009484 45059775 47454803
16743 47454803 49754141 52493907 55606775 58422331 61762765 65494023 68964673 73249769
16735 73249769 77329262 81838304 86819815 91426335 96837646 102996850 108234556 114789286
16727 114789286 120932665 127163592 134212391 140223858 146708776 152742439 158760062 163739125
16719 163739125 168196857 171846947 174323225 175879468 176642186 175598788 173683216 170625336
16711 170625336 166910499 162305448 156699592 151006119 144715085 138318716 131635557 125055891
$$ packed form
16768A6946988O6324J138349L79067R58675J080857L04642Q73301O51157R27853
16759B3327213J056699Q51892J227672J144257J032192J238103J341717J108951
16751C2328696J861028J553558J991455J544217J938198J792332K050291K395028
16743D7454803K299338K739766L112868K815556L340434L731258L470650M285096
16735G3249769M079493M509042M981511M606520N411311O159204N237706O554730
16727A14789286O143379O230927P048799O011467O484918O033663O017623M979063
16719A63739125M457732L650090K476278J556243P62718j043398j915572l057880
16711A70625336l714837m605051n605856n693473o291034o396369o683159o579666
$$ plain form
16703 125055891 118545111 112177096 106168351 100076330 94210747 89298115 83841513 79225166
16695 79225166 74745165 70187840 66579109 62993760 59289509 56327099 52938675 49824658
16687 49824658 47925633 45509703 43231298 40924073 39057227 37359216 35217033 33768281
16679 33768281 31949034 30787631 29305394 27975230 26936037 26189251 24640883 24043888
16671 24043888 22731306 22001504 21125950 20275776 19452108 18827318 18110452 17495161 16925825
16662 16925825 16564637 15880340 15003284 14521562 14288673 13761466 13537700 12849649 12494406
16653 12494406 12455341 11783889 11597127 11276409 10982634 10525934 10054714 9829067 9645386
16644 9645386 9104204 8898931 8992506 8516551 8451844 8007668 7880507 7926379 7748581 7401224
$$ packed form
16703A25055891o510780o368015o008745o092021n865583m912632n456602m616347
16695G9225166m480001m557325l608731l585349l704251k962410l388424l114017
16687D9824658j899025k415930k278405k307225j866846j698011k142183j448752
16679C3768281j819247j161403j482237j330164j039193p46786j548368n96995
16671B4043888j312582p29802q75554q50174q23668o24790p16866o15291n69336
16662A6925825l61188o84297q77056m81722k32889n27207k23766o88051l55243
16653A2494406l9065o71452j86762l20718k93775m56700m71220k25647j83681
16644I645386n41182k05273R3575m75955o4707m44176j27161M5872j77798l47357
$$ plain form
16634 7401224 7052000 7129523 6865169 6813600 6154399 6088077 6292885 6262370 5938368 5910974
16624 5910974 5568362 5585243 5275840 5356321 5262659 5017452 5088071 5003563 4747618 4668554
16614 4668554 4522030 4282468 4316299 4148902 4315092 4000148 3922816 3868826 3531486 3906102
16604 3906102 3617792 3757664 3400423 3449243 3788669 3518835 3337757 3304631 3475472 3409079
16594 3409079 3131180 3486635 3193920 3078372 3035693 3378807 2990648 2777656 2577451 2849202
16584 2849202 3094006 3062527 2552922 2422271 2448086 2505056 2405381 2276712 2239257 2596695
16574 2596695 2155869 2188824 2545023 2278612 2036647 2472883 1529953 1774566 1997479 2132702
16564 2132702 2218814 2050948 1628919 1790205 1916018 1765588 1640378 1723532 1586962 1641524
$$ packed form
16634G401224l49224P7523k64354n1569o59201o6322K04808l0515l24002k7394
16624E910974l42612J6881l09403Q0481r3662k45207P0619q4508k55945p9064
16614D668554j46524k39562L3831j67397J66190l14944p7332n3990l37340L74616
16604C906102k88310J39872l57241M8820L39426k69834j81078l3126J70841o6393
16594C409079k77899L55455k92715j15548m2679L43114l88159k12992k00205K71751
16584B849202K44804l1479n09605j30651K5815N6970r9675j28669l7455L57438
16574B596695m40826L2955L56199k66411k41965M36236r42930K44613K22913J35223
16564B132702Q6112j67866m22029J61286J25813j50430j25210Q3154j36570N4562
$$ plain form
16554 1641524 1699940 1682655 1852274 1686538 1766533 1539481 1824792 1411886 1843400 1353796
16544 1353796 1608572 1275489 1857775 1591303 1541306 1555978 1642529 1846413 1458867 1613241
16534 1613241 1575551 1618504 1559200 984452 1501441 1260090 1282487 1008865 1227270 1120314
16524 1120314 1370909 1135652 1001621 1236097 1104215 1313837 1025963 989182 1202472 952775
16514 952775 1182249 1218528 1060398 935005 971604 1339040 1141158 925253 1158384 1032083
16504 1032083 865624 1011714 1123703 940711 1333155 886202 502536 922247 530113
16495 530113 883124 1062940 996066 1158092 1180471 954927 1087189 1061458 716159 1122879
16485 1122879 577914 845133 979149 773791 649253 742345 1211413 660854 614647 837692
$$ packed form
16554A641524N8416j7285J69619j65736P9995k27052K85311m12906M31514m89604
16544A353796K54776l33083N82286k66472m9997J4672Q6551K03884l87546J54374
16534A613241l7690M2953n9304n74748N16989k41351K2397k73622K18405j06956
16524A120314K50595k35257j34031K34476j31882K09622k87874l6781K13290k49697
16514I52775K29474L6279j58130j25393L6599L67436j97882k15905K33131j26301
16504A032083j66459J46090J11989j82992L92444m46953l83666M19711l92134
16495E30113L53011J79816o6874J62026K2379k25544J32262k5731l45299M06720
16485A122879n44965K67219J34016k05358j24538R3092M69068n50559m6207K23045
$$ plain form
16475 837692 789905 449954 773649 569865 663404 383781 565051 821855 597009 549538
16465 549538 860062 785297 736354 663748 759627 699323 940965 711559 738334 462669 552419
16454 552419 795803 753528 839095 678188 574113 520798 865648 644439 687333 557125
16444 557125 694601 409969 565352 478106 181887 684819 283527 785549 717574 488149
16434 488149 761688 495734 398937 800246 347879 371252 618028 113740 438738 435457
16424 435457 594730 332115 335500 214340 799472 372053 496142 541999 341514 604713
16414 604713 491762 301535 657410 334294 646425 552195 499267 334256 342628 502412
16404 502412 481703 351800 311215 44501 462221 559676 483468 715192 537675 455306 472489
$$ packed form
16475H37692m7787l39951L23695k03784R3539k79623J81270K56804k24846m7471
16465E49538L10524p4765m8943p2606R5879o0304K41642k29406K6775k75665Q9750
16454E52419K43384m2275Q5567j60907j04075n3315L44850k21209M2894j30208
16444E57125J37476k84632J55383q7246A81887N02932B83527N02022o7975k29425
16434D88149K73539k65954r6797M01309C47879K3373K46776A13740L24998l281
16424D35457J59273k62615L385j21160N85132C72053J24089M5857k00485K63199
16414F04713j12951j90227L55875l23116L12131r4230n2928j65011Q372J59784
16404E02412k0709j29903m0585D4501M17720R7455p6208K31724j77517q2369J7183
$$ plain form
16393 472489 606029 198051 406021 227563 45511 397679 452220 504083 364087 173265
16382 76082 805797 398186 423664 225667 377129 555741 579795 554903 360689 455041
16372 455041 200314 129814 443789 541191 150835 284372 419232 300017 209712 316587
16362 316587 656530 723058 378989 297636 452419 123351 336841 384147 511730 252266
16351 117186 330637 301669 139987 387305 340699 332683 483370 192705 333580 121796
16340 548627 36485 282938 217891 235205 219264 366655 48429 180890 54686 683 328986
16329 328986 255819 310546 394112 207728 56643 -5751 139836 189837 28182 589709 58503
16317 128976 288938 166470 227995 241739 222376 321720 -80521 -37478 -15348 4222 -2090
$$ packed form
16393D72489J33540A98051K07970j78458D5511L52168N4541N1863j39996A73265
16382G6082P29715C98186K5478j97997J51462J78612K4054k4892j94214R4352
16372D55041B00314p0500L13975R7402A50835J33537J34860j19215r0305J06875
16362C16587L39943O6528l44069q1353J54783A23351K13490M7306J27583B52266
16351A17186K13451k8968A39987K47318m6606q016J50687A92705J40875A21796
16340E48627C6485K46453o5047J7314j5941J47391D8429J32461E4686F83L28303
16329C28986p3167N4727Q3566j86384E6643e751A39836N0001B8182N61527E8503
16317A28976J59962j22468O1525J3744j9363R9344h0521c7478a5348D222b090
$$ plain form
16305 36004 137335 299024 385217 173308 102753 -52586 -68534 215506 86090 -128743 77067
16293 138952 -100652 92348 240815 465310 378212 135383 -84754 28933 145178 248308
16283 248308 255684 -103118 198465 244375 344501 420326 154685 105102 263352 62844 156334
16272 156334 177197 -88393 141797 106258 58557 182975 367903 359226 -176571 141345 83389
16261 83389 214500 330427 -66835 210192 -126637 52335 -157315 339229 346462 47807 -20550
16249 -24710 178370 -151612 175910 -143428 19894 -275764 177847 -69324 -344593 464745
16238 -64445 115333 330687 -98816 329053 432144 -29660 -73741 -208981 -143839 -86117 83715
16226 211370 -274687 368355 254260 225015 138791 -17169 -63944 -31626 -174714 490953
$$ packed form
16305C6004J01331J61689Q6193A73308p0555e2586j5948B15506H6090a28743G7067
16293A38952a00652I2348J48467K24495q7098A35383h4754B8933J16245J03130
16283B48308P376a03118A98465M5910J00126P5825A54685m9583J58250F2844R3490
16272A56334K0863h8393A41797l5539m7701J24418J84928q677a76571A41345n7956
16261H3389J31111J15927f6835B10192a26637E2335a57315C39229P233D7807b0550
16249b4710A78370a51612A75910a43428A9894b75764A77847f9324k75269D64745
16238f4445A15333K15354i8816C29053J03091b9660m4081j35240O5142N7722H3715
16226B11370b74687C68355j14095k9245q6224a7169m6775c1626j43088D90953
$$ plain form
16215 242940 52140 178120 129135 127887 187406 -145082 134697 277774 39399 261383 -117015
16203 196339 176864 150417 103419 411200 156792 189112 356869 103326 -38245 258810
16192 -40646 16635 4770 -122723 -145877 344014 -193856 126779 151507 -217664 54324 -126922
16180 -126546 -64940 171020 456417 184371 279670 194643 135155 -147376 -180812 78475 392461
16169 392461 186450 144168 301682 -49976 234572 -43465 -241734 -80596 -101809 33555 -224575
16157 -108860 295590 -37812 306336 100506 111973 95124 -7482 -16431 -88260 374975 -1044
16145 112911 -134775 -251393 83273 -287049 364840 137670 309525 -24216 -116628 151015
16134 184234 -363084 -75378 45682 -233465 224896 72268 146395 69937 129822 42135 9568
$$ packed form
16215B42940E2140J25980m8985j248N9519a45082A34697J43077C9399K21984a17015
16203A96339j9475k6447m6998L07781A56792L2320J67757A03326c8245B58810
16192d0646A6635D770a22723k3154C44014a93856A26779K4728b17664E4324a26922
16180a26546O1606A71020K85397A84371R5299q5027n9488a47376l3436G8475L13986
16169C92461A86450m2282J57514d9976B34572d3465j98269h0596k1213C3555b24575
16157a08860B95590c7812C06336A00506J1467j6849g482q949p1829C74975a044
16145A12911a34775j16618H3273b87049C64840A37670J71855b4216r2412A51015
16134A84234c63084g5378D5682b33465B24896G2268P4127F9937N9885D2135I568
$$ plain form
16122 56174 -351154 55916 48134 183309 38569 -235910 -350946 -305220 400739 -425084 43676
16110 -10971 154763 -12334 -7398 15471 170353 46687 243694 367879 -4358 373419 98593
16098 365506 -29329 47790 208475 31509 191281 171728 12412 235010 -165642 -74578 -313848
16087 -313848 67548 -331157 227169 -108970 136531 253851 -130400 -56629 69448 8628
16076 -76539 -107388 10540 -20087 -92005 -50800 28230 37431 -294678 70053 -25820 470768
16064 214951 293780 373222 321790 -97 8083 -91684 270472 10816 -81158 -127512 -178917 83533
16051 -84703 -20170 -203316 31471 106318 -349529 324720 -28026 9427 -192231 28062 165369
16040 165369 -71140 -28630 -94395 -261923 -283573 471240 -67403 -73424 -13830 -246585 -44947
$$ packed form
16122E6174c51154E5916p782J35175C8569b35910j15036M5726D00739d25084D3676
16110a0971A54763a2334M936A5471J54882D6687J97007J24185d358C73419I8593
16098C65506b9329D7790J60685C1509J59772j9553A2412K22598a65642g4578k39270
16087c13848F7548c31157B27169a08970A36531J17320a30400e6629F9448H628
16076g6539l0849A0540b0087p1918M1205B8230R201b94678G0053b5820D70768
16064B14951P8829P9442n1432i7H083i1684B70472A0816h1158m6354n1405H3533
16051h4703b0170j83146C1471P4847c49529C24720b8026I427a92231B8062J37307
16040A65369g1140b8630o5765j67528k1650D71240f7403o021a3830k32755d4947
$$ plain form
16028 -19077 -79493 -312370 77710 102740 -183176 -187723 -74175 235267 -58687 -176635 -164466
16017 -164466 -214761 256162 -82160 5297 72787 159966 -56683 -190068 30891 -48995 64249
16005 59599 427247 -134633 -71087 16180 90938 350671 -18478 -20798 -118079 37397 -327021
15993 234430 111060 134304 -277478 15236 111336 -35913 -104237 -247069 104805 76285 600313
15982 600313 159520 35918 228269 145944 385899 189670 11040 -171231 85268 -156907
15971 -186132 -213811 168388 24591 -70392 115701 -53716 -142003 -9321 144364 34133 -82172
15959 -4318 18472 593721 3911 -304407 -104219 190535 -35565 -303496 202932 118278 2742
15947 40793 -363438 134993 25882 -182550 -261163 55083 -292115 274353 -89224 19739 -132891
$$ packed form
16028a9077o0416k32877G7710K5030a83176m547g4175B35267e8687j17948J2169
16017a64466n0295B56162h2160E297O7490Q7179e6683j33385C0891d8995F4249
16005E9599L67648a34633O3546A6180P4758K59733a8478k320r7281C7397c27021
15993B34430A11060K3244b77478A5236R6100c5913o8324j42832A04805k8520N24028
15982F00313A59520C5918J92351q2325K39955A89670A1040a71231H5268a56907
15971a86132k7679A68388B4591g0392A15701e3716q8287i321A44364C4133h2172
15959d318A8472N75249C911c04407a04219A90535c5565k67931B02932q4654B742
15947D0793c63438A34993B5882a82550p8613E5083b92115B74353h9224A9739a32891
$$ plain form
15935 -100538 -58136 166629 -112883 104167 -253646 124128 88856 189111 -3284 -269756
15925 -269756 141978 347721 -142136 118061 -9608 -48893 -30913 -172532 -65067 363984
15914 -213531 131271 -128179 141794 19956 -201723 -330122 -95660 -307058 129805 -282315
15903 284551 131771 -244206 538122 176515 -441939 -257255 48503 -68764 -177560 25516
15892 94013 -192389 -197686 -167142 -232980 -37476 -6102 297551 -342961 64155 -196881 -29743
15880 107770 -113991 460820 -47369 123992 -146850 -44178 90315 -47491 -134151 -345298
15870 -345298 102821 -115205 -181735 -47197 175920 189057 -405955 -330064 120280 92965
15860 92965 -54080 -146138 -35243 -200456 48106 -40441 -71583 164598 -66385 215077 -20551
$$ packed form
15935a00538M2402A66629a12883A04167b53646A24128l5272J00255c284k66472
15925b69756A41978K05743a42136A18061i608l9285J7980j41619f5067C63984
15914b13531A31271a28179A41794A9956b01723j28399i5660k11398A29805b82315
15903B84551A31771b44206E38122A76515d41939J84684D8503f8764j08796B5516
15892I4013a92389n297L0544o5838c7476f102B97551c42961F4155a96881b9743
15880A07770a13991D60820d7369A23992a46850d4178I0315d7491q6660k11147
15870c45298A02821a15205o6530d7197A75920J3137d05955P5891A20280k7315
15860I2965e4080r2058c5243j65213D8106d0441l1142A64598f6385B15077b0551
$$ plain form
15848 -120563 228365 88000 123044 -88721 258552 -253079 -96928 166073 -37136 61319 56910
15837 56910 166389 -104663 -175351 -9938 -356827 1415 60376 -157038 74396 -100617 -310610
15826 -310610 4085 -285578 -124892 -209323 -385762 37000 228118 -155573 -326925 70336
15815 -23114 133449 -119096 -350142 105551 41256 79600 -78682 98228 144269 -174497 26786
15803 3627 -270711 -140527 -15558 148154 126280 -302442 -140061 68255 78342 -11951 -129170
15792 -129170 26838 -351394 -199171 215230 67602 128721 -139862 27540 128541 -41510
15781 -107098 182339 -39508 21279 167258 106311 -43619 33184 -39572 342568 -22981 210449
15769 -186436 -143138 -83892 265583 181822 10824 333487 -284983 237759 -496070 -65653
$$ packed form
15848a20563B28365H8000L5044h8721B58552b53079i6928A66073c7136F1319m409
15837E6910J09479a04663p0688i938l46889A415N8961a57038G4396a00617k09993
15826c10610D085b85578a24892q4431j76439C7000J91118a55573j71352G0336
15815b3114A33449a19096k31046A05551D1256L8344g8682I8228M6041a74497B6786
15803C627b70711J30184a5558A48154k1874c02442a40061F8255J0087a1951j17219
15792a29170B6838c51394J52223B15230F7602O1119a39862B7540J01001d1510
15781a07098A82339c9508B1279J45979o0947d3619C3184c9572C42568b2981B10449
15769a86436M3298N9246B65583q3761A0824L22663b84983B37759d96070f5653
$$ plain form
15758 -28423 131391 -74179 -128451 -201717 141314 187609 -14933 281649 -629478 258784 97100
15746 -160816 -35460 117089 30896 -318891 -91318 -72025 244652 -136462 21993 213642
15736 213642 -354013 -329526 -114658 -111889 -100084 210703 -139871 -138147 -235326 175638 -127473
15724 30338 8859 -230518 10314 -117783 -21112 226588 -236684 -230384 -52555 -197173 -193149
15713 -193149 -5774 406979 -185018 383413 -230090 141556 -548022 -77244 56509 -244789
15702 47079 -34470 -251377 323999 -158455 -136989 166995 7706 -84702 -308734 37300 325711
15691 325711 -290073 -122236 347984 123643 45449 34200 148096 -148040 162505 -203635
15680 -181411 -436110 139979 215643 -375142 -23338 -145613 -234695 424181 -44142 -54843
$$ packed form
15758b8423A31391g4179n4272p3266A41314M6295a4933B81649f29478B58784I7100
15746a60816c5460A17089C0896c18891i1318J9293B44652a36462B1993J91649
15736B13642c54013K4487a14658K769J1805B10703a39871J724r7179A75638a27473
15724C0338H859b30518A0314a17783b1112B26588b36684O300e2555j44618M024
15713a93149e774D06979a85018C83413b30090A41556e48022g7244E6509b44789
15702D7079c4470k16907C23999a58455K1466A66995G706h4702k24032C7300K88411
15691C25711b90073a22236C47984A23643D5449j1249J13896a48040A62505b03635
15680a81411k54699A39979P5664c75142b3338j22275q9082D24181d4142j0701
$$ plain form
15670 -54843 -9794 24073 -98364 59750 -113212 -169465 -147313 12903 -87507 -186799 248768
15658 114102 -258007 -73541 213196 27696 -14345 70254 -7423 23736 -20596 316200 50204
15646 -366987 -295400 30989 -71835 216679 -14336 -71919 -274556 149351 -61928 -88631 -493855
15635 -493855 -148148 -73722 118187 -262578 -114943 -82458 45198 12606 -70982 42495 32164
15624 32164 175252 -286484 137420 -140766 123526 102946 -81795 46616 276848 38635
15613 53551 -136571 71311 -150298 -232711 -55951 -201153 73942 -10691 107491 -146463 73986
15601 -184230 27422 -9019 137275 95219 47807 -194329 -86673 -421322 -25004 -288367 72042
15589 136354 -37036 -32004 -136190 -274146 -233977 -318806 -25255 -98595 136045 -19970 180431
$$ packed form
15670e4843i794B4073i8364E9750a13212n6253K2152A2903h7507r9292B48768
15658A14102b58007g3541B13196B7696a4345G0254g423B3736b0596C16200E0204
15646c66987P1587C0989g1835B16679a4336n7583k02637A49351f1928k6703m05224
15635d93855a48148g3722A18187b62578a14943L2485D5198A2606g0982D2495j0331
15624C2164J43088b86484A37420a40766A23526k0580h1795D6616K30232C8635
15613E3551a36571G1311a50298q2413e5951j45202G3942a0691A07491a46463G3986
15601a84230B7422i019A37275m2056m7412a94329h6673l34649b5004k63363G2042
15589A36354c7036N032j04186j37956M0169q4829b5255p3340A36045a9970A80431
$$ plain form
15577 -192761 61331 -186584 -103342 -254911 291658 122538 4589 -295733 164199 -92583
15566 268277 65850 118293 274286 5851 355167 182372 -65504 -277271 -27121 210661 47590
15554 308876 -238165 -21516 -81827 261090 99050 44915 -219514 -218391 -55878 31179 -205769
15542 215230 214271 -347415 -79324 -94793 -49065 -107575 23924 -290390 -38740 166539 34157
15530 -105373 -127758 100584 -3115 151502 -272913 213742 244797 93452 103350 -70748 -190104
15519 -190104 -77679 46197 -238499 -52067 76103 24841 -194144 82296 192558 -199673 425614
15507 -88479 92 -22726 -78197 -52138 206398 370499 234097 75788 71074 218326 -224566
15495 152642 39288 -250628 -120241 -11025 -187158 -83962 63744 85505 20592 -350815 210927
$$ packed form
15577a92761F1331a86584Q3242j51569B91658A22538D589b95733A64199i2583
15566B68277F5850N2443J55993E851L49316j72795f5504k11767b7121B10661D7590
15554C08876b38165b1516o0311B61090I9050D4915b19514J123e5878C1179b05769
15542B15230r59c47415g9324j5469M5728n8510B3924b90390c8740A66539C4157
15530a05373k2385A00584c115A51502b72913B13742L1055I3452R898g0748j19356
15519a90104g7679D6197b38499e2067G6103B4841a94144H2296J10262a99673D25614
15507h8479I2b2726n5471K6059B06398J64101j36402G5788m714J47252b24566
15495A52642C9288b50628a20241a1025j76133h3962F3744K1761B0592c50815B10927
$$ plain form
15483 103605 -72015 -169464 72010 199682 92356 -11853 93258 11757 35333 -124867 -497123
15472 -497123 41529 103708 124585 -275234 -141392 -234033 124193 -235000 106706 129363
15462 129363 -449077 -13105 -221043 -135969 184228 -254547 -5895 -214964 -104418 -2882 203327
15450 49359 75115 406231 -204102 151470 -50458 -34449 -97926 -99401 72531 -364015 -30638
15438 122418 -56990 414648 79909 -245195 355397 -188633 -36718 80999 295755 266927
15428 266927 -202952 22678 -253577 -34036 165007 95032 -237820 315580 50588 96454
15418 96454 346923 95576 -5676 -109897 249815 345917 -62445 -66874 -230510 -431159 100511
15406 137085 89932 -76580 179192 77044 231782 -90299 160030 446904 595918 102363
$$ packed form
15483A03605g2015r7449G2010J27672I2356a1853I3258A1757K3576a24867l72256
15472d97123D1529O2179K0877b75234J33842r2641A24193b35000A06706K2657
15462A29363d49077a3105k07938Q5074A84228b54547e895k09069a04418b882B03327
15450D9359K5756L31116b04102A51470e0458J6009o3477j475G2531c64015c0638
15438A22418e6990D14648G9909b45195C55397a88633c6718H0999K14756k8828
15428B66927b02952B2678b53577c4036A65007o9975b37820C15580E0588M5866
15418I6454K50469I5576e676j04221B49815R6102f2445m429j63636k00649A00511
15406A37085m7153g6580A79192G7044J54738i0299A60030K86874J49014A02363
$$ plain form
15395 213012 56339 -128925 -21492 -15254 -53169 -55521 -124595 -78984 -33531 -467106 447 -194790
15382 307890 29185 53000 -218868 163854 269062 282575 335015 85698 -243968 150944
15371 -104296 276707 494105 -280731 -106699 38038 -87286 249276 -99967 37695 -16222
15360 277257 -130500 -74283 106823 107785 -79288 51645 263574 260813 93639 26373 -3284 -87129
15348 -87129 -198528 179101 -238217 46459 -84147 120162 -133281 -7991 107459 146833 -41540
15336 -107040 -515794 -128617 -10577 43862 -110846 -22609 65742 14447 -268787 213794
15325 -157845 174521 -171658 -114957 124429 188361 -81933 184307 -76044 -168139 -263977 -263549
15314 -263549 36775 -50890 165875 154289 -7513 -93398 -188824 -235558 -177488 -128828 245367
$$ packed form
15395B13012E6339a28925b1492O238l7915k352o9074M5611c3531m33575D47a94790
15382C07890B9185K3815b18868A63854J05208J3513N2440H5698b43968A50944
15371a04296B76707K17398b80731a06699C8038h7286B49276i9967C7695a6222
15360B77257a30500N6217A06823R62g9288E1645K11929k761I3639B6373c284q3845
15348h7129j11399A79101b38217D6459h4147A20162a33281g991A07459L9374d1540
15336a07040m08754a28617a0577D3862a10846b2609F5742A4447b68787B13794
15325a57845A74521a71658N6701A24429O3932h1933A84307g6044r2095r5838M28
15314b63549C6775e0890A65875j1586g513q5885r5426m6734N8070M8660B45367
$$ plain form
15302 331205 -74755 118055 162139 535774 288566 -26865 -261660 101893 -49680 -219557
15292 -219557 -337584 273978 122640 -321521 -178671 283425 12899 -128126 -152912 185954
15281 -2528 -75834 -54157 32938 198523 -133609 109672 225395 197025 -12729 -18919 -63072
15270 -63072 -48027 43800 -57336 136315 -90638 -57870 479239 280122 178049 223098 -200303
15258 -174587 -81481 396571 331835 11297 4365 114525 335772 123787 88605 101080 84866
15247 84866 304196 847060 1700302 2523991 1608959 2466441 1490289 262145 175782 299404
15237 299404 -259518 213546 -109588 -39865 -179369 289025 172970 -47423 51710 22670
15226 -202473 386283 139781 72865 451126 51222 -15551 157329 224763 297442 107704
$$ packed form
15302C31205g4755A18055M4084L73635k47208b6865k34795A01893d9680j69877
15292b19557j18027B73978A22640c21521J42850B83425A2899a28126k4786A85954
15281b528p3306K1677C2938J65585a33609A09672J15723k8370a2729o190m4153
15270f3072J5045D3800e7336A36315i0638L2768D79239j99117j02073M5049b00303
15258a74587h1481C96571o4736A1297D365J10160K21247A23787l5182J2475j6214
15247H4866K19330N42864Q53242Q23689r15032Q57482r76152B62145q6363J23622
15237B99404b59518B13546a09588c9865j39504B89025j16055d7423E1710B2670
15226b02473C86283A39781o6916L78261E1222a5551A57329O7434P2679A07704
$$ plain form
15215 407110 -49144 48710 189397 -99991 36428 -124711 -92891 379027 267396 -149742
15204 232930 172408 362656 56317 -171285 218780 181640 -165777 -134466 -196545 -34630 398435
15192 -20792 -179817 -87911 -132886 -74296 104917 53295 7166 -25022 365740 -41892 61492
15180 -83340 105475 48564 45160 -125207 55992 25213 317698 286348 132194 -248214 -200639
15169 -200639 -100909 57951 192228 -58683 30898 240661 241248 296423 -128764 231576 -14992
15157 160310 114529 -66321 221342 72072 -433864 268698 -104253 142398 26696 -38448
15146 79449 -103779 -60376 -50874 8442 79940 107557 258310 -86974 66927 71014 92592 275703
15134 275703 289661 368512 162692 251340 -87811 18167 183673 -153706 190262 174843 34896
$$ packed form
15215D07110d9144D8710J40687i9991C6428a24711L1820C79027j11631a49742
15204B32930o0522J90248E6317a71285B18780l7140a65777L1311o2079c4630C98435
15192b0792j59025h7911m4975N8590A04917n1622G166b5022C65740d1892F1492
15180h3340A05475D8564l404a25207E5992B5213K92485l1350A32194b48214M7575
15169b00639R9730E7951J34277e8683C0898K09763N87N5175a28764B31576a4992
15157A60310m5781f6321B21342G2072d33864B68698a04253A42398B6696c8448
15146G9449a03779M3403R502H442P1498K7617J50753h6974F6927M087K1578J83111
15134B75703J3958P8851A62692Q8648h7811A8167J65506a53706A90262j5419C4896
$$ plain form
15122 73991 -168069 603696 32614 189757 179284 459499 213704 55922 111004 152276 225430
15111 225430 129797 221803 112541 211373 253792 207057 -116430 265039 45615 -69731 473065
15099 -226709 -221019 72083 358471 28535 199498 270173 102035 -70527 372906 349079 -141548
15087 10641 120515 112722 -330790 407745 8050 119799 372868 131679 -74695 252009 -336783
15075 198250 -131636 352756 80266 421319 350483 -136183 325876 223288 65122 325858
15065 325858 61850 233750 -243670 188375 423734 70350 107639 255877 10281 -42519
15054 205189 148574 223915 242174 350208 20525 -11568 -128237 235630 117385 283827
15044 283827 220882 -14117 223576 265447 -14345 -72462 156479 217723 -202813 142632 58616
$$ packed form
15122G3991a68069F03696C2614J57143j0473K80215B13704E5922N5082M1272P3154
15111B25430r5633R2006j09262R8832M2419m6735a16430B65039D5615f9731D73065
15099b26709N690G2083K86388B8535J70963P0675A02035g0527C72906k3827a41548
15087A0641J09874p793c30790D07745H050J11749K53069A31679g4695B52009c36783
15075A98250a31636C52756H0266L41053p0836a36183C25876j02588F5122K60736
15065C25858F1850J71900b43670A88375K35359G0350L7289J48238A0281d2519
15054B05189n6615P5341J8259J08034B0525a1568j16669B35630A17385J66442
15044B83827o2945a4117B23576M1871a4345n8117A56479O1244b02813A42632E8616
$$ plain form
15032 362901 -30266 77315 -22906 143853 266475 220128 18473 217135 145883 348644 303912
15021 303912 320361 582272 256692 324388 269579 83106 -39614 -10419 -68684 111419 48690
15009 82984 290420 195711 215116 178106 247198 307076 282604 354758 152478 158604 53529
14997 252587 -165820 -93458 142532 296636 316190 253884 619788 10769 441536 -6068 185001
14985 440942 251841 -29299 -80507 493918 66567 36230 306272 75439 62216 467965 183434
14973 192859 -54552 382315 106357 150034 -20159 222767 426965 -256247 322699 109396
14962 181668 38169 411834 103016 -171264 229227 292593 425454 516346 395366 456824
14952 456824 213997 321511 335274 179317 176466 116089 59502 538663 245949 427376
$$ packed form
15032C62901c0266G7315b2906A43853J22622m6347A8473J98662p1252K02761m4732
15021C03912J6449K61911B56692O7696n4809H3106c9614a0419n8265A11419D8690
15009H2984K07436r4709J9405l7010O9092N9878k4472P2154A52478O126E3529
14997B52587a65820P2362A42532J54104J9554o2306L65904A0769M30767f068A85001
14985D40942j89101b9299n1208D93918F6567l0337K70042G5439j3223M05749A83434
14973A92859e4552C82315A06357M3677b0159B22767K04198b56247C22699A09396
14962A81668C8169L73665A03016a71264B29227O3366J32861R0892j20980O1458
14952D56824B13997J07514J3763j55957k851o0377n6587M79161B45949J81427
$$ plain form
14942 427376 381795 210754 170720 -163082 188151 379359 219055 361232 628982 -8392
14931 -46497 223190 486729 -170822 87559 -61068 539485 107951 322323 431324 402158
14921 402158 144090 281519 381431 474413 216567 603158 64809 211502 68794 99626
14911 99626 290994 169838 477250 54757 428103 297569 418134 236061 126522 195351
14901 195351 352432 199541 720056 509464 -80689 193320 472687 500481 358390 386498
14891 386498 250899 -15953 193151 66083 385635 145860 325431 536214 79001 168552
14881 168552 20000 320391 328315 339658 545594 148723 209741 260292 218789 256811 105582
14869 590707 547847 485227 380693 135264 688783 253116 525650 493036 614549 384322
$$ packed form
14942D27376m5581j71041m0034a63082A88151J91208j60304J42177K67750h392
14931d6497B23190K63539a70822H7559f1068E39485A07951K14372J09001k9166
14921D02158A44090J37429R9912R2982B16567L86591F4809J46693F8794L0832
14911I9626J91368j21156L07412E4757L73346j30534J20565j82073j09539O8829
14901A95351J57081j52891N20515k10592h0689A93320K79367K7794j42091K8108
14891C86498j35599a5953A93151F6083L19552A45860J79571K10783G9001Q9551
14881A68552B0000L00391P924J1343K05936A48723O1018N0551m1503L8022A05582
14869E90707m2860o2620j04534A35264N53519B53116K72534l2614J21513k30227
$$ plain form
14859 384322 261744 297798 295501 373241 227405 54281 786274 376624 389752 327421 198811
14848 198811 83620 252978 338296 615025 366277 278835 503247 480721 143793 566746
14838 566746 350739 473827 478983 410448 311276 522718 303061 442143 428405 676547
14828 676547 95671 341591 463851 497886 545206 484714 461171 374601 237690 403184 363143
14817 363143 144566 340968 323305 760403 682715 358495 229841 456213 409209 658967
14807 658967 561033 591085 329994 158027 532163 562133 404436 247375 413299 291221
14797 291221 127718 491292 651114 443117 541434 444408 904932 710137 476949 449356
14787 449356 232939 594095 547142 251467 455625 357890 618394 529505 834820 599336
$$ packed form
14859C84322j22578L6054k297P7740j45836E4281P31993C76624J3128o2331j28610
14848A98811H3620J69358Q5318K76729k48748q7442K24412k2526A43793M22953
14838E66746k16007J23088N156o8535r9172K11442k19657J39082j3738K48142
14828F76547I5671K45920J22260L4035M7320o0492k3543q6570j36911J65494m0041
14817C63143A44566J96402j7663M37098p7688l24220j28654K26372m7004K49758
14807F58967r7934L0052k61091A58027L74136K9970j57697j57061J65924j22078
14797B91221A27718L63574J59822k07997R8317r7026M60524j94795k33188k7593
14787D49356k16417L61156m6953B51467K04158r7735K60504q8889L05315k35484
$$ plain form
14777 599336 555584 357052 190883 553263 943730 704806 550416 337446 737605 674224
14767 674224 668285 535740 409788 1033867 540964 834836 504217 635099 495957 553593
14757 553593 850975 476713 598208 646706 606856 641309 764480 647570 749341 540025
14747 540025 444822 128855 670913 629696 681190 425409 705044 846486 484418 368967
14737 368967 519760 613897 746062 974040 327014 805907 634050 701443 555708 575738
14727 575738 784086 622269 376137 221278 685380 506222 437547 801079 412312 841965
14717 841965 910461 755493 405591 764777 873023 1006368 678214 568774 582134 343868
14707 343868 801694 883430 713224 1002844 606202 605164 780842 746157 978845 693172
$$ packed form
14777E99336m3752j98532j66169L62380L90467k38924j54390k12970M00159o3381
14767F74224n939j32545j25952O24079m92903K93872l30619J30882j39142N7636
14757E53593K97382l74262J21495M8498l9850L4453J23171j16910J01771k09316
14747E40025r5203A28855N42058m1217N1494k55781K79635J41442l62068j15451
14737C68967J50793R4137J32165K27978C27014M78893j71857O7393j45735K0030
14727E75738K08348j61817k46132j54859M64102j79158o8675L63532l88767M29653
14717H41965O8496j54968l49902L59186J08246J33345l28154j09440J3360k38266
14707C43868M57826Q1736j70206K89620l96642j038J75678l4685K32688k85673
$$ plain form
14697 693172 755380 636203 834829 967913 721185 810499 646490 1341706 571846 658632
14687 658632 1076312 938298 517953 663383 1055591 687609 897193 888589 1019390 848545
14677 848545 846322 688297 1055913 848853 1093234 770038 835998 852015 692710 576815
14667 576815 618949 1106943 936306 836229 880107 969535 1041984 917047 934802 1204046
14657 1204046 1121172 1040360 1069965 1011432 1258268 988649 908215 1032639 902716 997599
14647 997599 618204 1117283 1306217 1324739 1063660 949490 923483 1092269 1045274 899002
14637 899002 934846 1150931 1201619 1266798 1091553 1401797 941781 1142590 1324679 1260969
14627 1260969 652816 896945 1188312 1222223 1262722 1239312 1267164 965828 1247027 1358284
$$ packed form
14697F93172O2208j19177J98626J33084k46728Q9314j64009O95216E71846Q6786
14687F58632M17680j38014m20345J45430L92208l67982K09584q604J30801j70845
14677H48545k223j58025L67616k07060K44381l23196O5960J6017j59305j15895
14667E76815M2134M87994j70637j00077M3878Q9428P2449j24937J7755K69244
14657A204046q2874q0812K9605n8533K46836k69619q0434J24424j29923R4883
14647I97599l79395M99079J88934J8522k61079j14170k6007J68786m6995j46272
14637H99002L5844K16085N0688O5179j75245L10244m60016K00809J82089o3710
14627A260969o08153K44129K91367L3911M0499k3410K7852l01336K81199J11257
$$ plain form
14617 1358284 1074061 1212759 1109320 1437846 1425096 1070394 992978 1468367 1499894 1322035
14607 1322035 1501540 1166000 1229339 1550710 1370684 1387093 1590111 1403798 1388226 1336262
14597 1336262 1480882 1525695 1566308 1643558 1567193 1359107 1483948 1433475 1275513 1387592
14587 1387592 1614717 1276546 1540022 1781242 1606296 1842284 1523691 1384160 2005292
14578 2005292 1729145 1753953 1783449 1834149 1723238 1950367 1828071 1504032 1887664 1960032
14568 1960032 2159461 2285464 2229126 2005061 2138351 1935356 2236660 2542199 2287216 2308264
14558 2308264 2460521 2376901 2447846 2678129 2896780 3024167 3189634 3840043 5007965 6346032
14548 6346032 10599554 20628066 41102213 40474381 16617289 6526872 4221395 4911897
$$ packed form
14617A358284k84223J38698j03439L28526j2750l54702p7416M75389L1527j77859
14607A322035J79505l35540O3339L21371j80026J6409K03018j86313j5572n1964
14597A336262J44620M4813M0613P7250p6365k08086J24841n0473j57962J12079
14587A387592K27125l38171K63476K41220j74946K35988l18593j39531O21132
14578B005292k76147K4808K9496N0700j10911K27129j22296l24039L83632P2368
14568A960032J99429J26003n6338k24065J33290k02995L01304L05539k54983K1048
14558B308264J52257q3620P0945K30283K18651J27387J65467O50409J167922J338067
14548F346032M253522J0028512K0474147o27832A6617289F526872k305477O90502
$$ plain form
14540 4911897 7145694 3450572 2071144 1426106 1528824 1751022 2057465 1856239 1842001
14531 1842001 1791308 1824517 2010226 1978362 2187733 1987560 2002193 1833779 2253282 1943539
14521 1943539 2080125 2027331 2071471 2457695 2202976 2260519 2305128 2381550 2409791 2272637
14511 2272637 2461754 2538952 2157150 2491131 2470720 2359898 2687283 2628395 2598952 2621062
14501 2621062 2814048 2493892 2894917 2731439 2572506 2705060 2598502 2929389 2869625 2999886
14491 2999886 3228224 3114287 2948642 2946611 3034352 3301234 3303013 3479164 3326400 3131415
14481 3131415 3557219 3562264 3299903 3382830 3403596 3500275 3505631 3514934 3661568 3605741 3690123
14470 3690123 4080244 3653853 3761940 3700125 3936120 3744730 4014078 4013073 3897258 3908800
$$ packed form
14540D911897K233797C450572j379428o45038J02718K22198L06443k01226j4238
14531A842001n0693L3209J85709l1864K09371k00173J4633j68414M19503l09743
14521A943539J36586n2794M4140L86224k54719N7543M4609P6422K8241j37154
14511B272637J89117P7198l81802L33981k0411j10822L27385n8888k9443K2110
14501B621062J92986l20156M01025j63478j58933J32554j06558L30887n9764J30261
14491B999886K28338j13937j65645k031Q7741K66882J779J76151j52764j94985
14481C131415M25804N045k62361Q2927K0766R6679N356R303J46634n5827Q4382
14470C690123L90121m26391J08087o1815K35995j91390K69348j005j15815J1542
$$ plain form
14460 3908800 4384999 4000422 4054985 4401488 4316933 4527734 4115625 4453374 4758084 4848888
14450 4848888 4879087 4695551 4890267 4796455 5210441 4930932 4842161 5381528 5203016 4813414
14440 4813414 5400674 5412361 5513933 5160159 5639276 5644684 5575379 5890282 5638337 5914017
14430 5914017 5799415 6229856 6285360 6179133 6424075 6213214 6380941 6845435 6856524 7010311
14420 7010311 6865360 7114026 6503840 7181763 7641742 7416122 7675637 7763879 8052340 7845747
14410 7845747 8082020 7943517 7995922 8244905 8476610 8355773 8767479 8433812 8873068 9296501
14400 9296501 9559107 9422658 9557527 9646627 9912349 9946825 10364295 10433691 10567880 10476018
14390 10476018 11021697 10634842 11152560 11485834 11555327 11509277 12147185 12084823 12362237 12450326
$$ packed form
14460C908800M76199l84577N4563L46503q4555K10801m12109L37749L04710R0804
14450D848888L0199j83536J94716r3812M13986k79509q8771N39367j78512l89602
14440D813414N87260J1687J01572l53774M79117N408o9305L14903k51945K75680
14430E914017j14602M30441N5504j06227K44942k10861J67727M64494J1089J53787
14420G010311j44951K48666o10186O77923M59979k25620K59515Q8242K88461k06593
14410G845747K36273j38503N2405K48983K31705j20837M11706l33667M39256M23433
14400I296501K62606j36449J34869Q9100K65722L4476M17470O9396J34189r1862
14390A0476018N45679l86855N17718L33274O9493m6050O37908o2362K77414Q8089
$$ plain form
14380 12450326 13051342 13088820 12863916 13823777 14092346 13983943 14476586 14509281 15014983 15135535
14370 15135535 15249656 15713798 16425356 16293319 16937559 16912597 17587947 17848282 18436697
14361 18436697 18668582 18940755 19604003 20005568 20159398 20847485 20842314 21599942 22215502 22366660
14351 22366660 23665714 23897912 24129192 25253676 25642872 25813054 26817401 27626815 28466456
14342 28466456 28928902 30088904 30378071 31252204 32446243 33079884 34262381 35133765 36286598
14333 36286598 37333978 38623932 39597706 40954282 42322550 43381532 44906315 46505929
14325 46505929 47635208 49435488 51239133 53240172 55093708 57064653 58758159 60824881
14317 60824881 63273095 65582106 68257000 70808909 73441280 76665583 79855760 83060679
$$ packed form
14380A2450326O01016L7478k24904R59861K68569j08403M92643L2695N05702J20552
14370A5135535J14121M64142P11558j32037O44240k4962O75350K60335N88415
14361A8436697K31885K72173O63248M01565J53830O88087n171P57628O15560J51158
14351B2366660J299054K32198K31280J124484L89196J70182J004347Q09414Q39641
14342B8466456M62446J160002K89167Q74133J194039O33641J182497Q71384J152833
14333C6286598J047380J289954R73774J356576J368268J058982J524783J599614
14325D6505929J129279J800280J803645K001039J853536J970945J693506K066722
14317F0824881K448214K309011K674894K551909K632371L224303L190177L204919
$$ plain form
14309 83060679 86834479 90657751 94470476 98719461 103408438 108011378 112953253 118288811
14301 118288811 124318332 130213755 136608962 143532994 151093883 158506217 166872146 175929835
14293 175929835 185065723 195016607 205656759 217178947 228934543 241605406 254866178
14286 254866178 268697689 283189103 298090372 313798204 329713510 345729988 362063309
14279 362063309 377826247 393794081 408790979 422575118 435403814 446463717 454816167
14272 454816167 458635316 459979469 459896943 459986984 458602428 455924044 450332434 441577978
14264 441577978 430420304 416601225 401960978 386086790 369384215 352699620 336006481
14257 336006481 319550947 303672827 287936197 272707793 258347568 244227774 232989808
$$ packed form
14309H3060679L773800L823272L812725M248985M688977M602940M941875N335558
14301A18288811O029521N895423O395207O924032P560889P412334Q365929R057689
14293A75929835R135888R950884J0640152J1522188J1755596J2670863J3260772
14286B54866178J3831511J4491414J4901269J5707832J5915306J6016478J6333321
14279C62063309J5762938J5967834J4996898J3784139J2828696J1059903Q352450
14272D54816167L819149J344153q2526R0041j384556k678384n591610q754456
14264D41577978j1157674j3819079j4640247j5874188j6702575j6684595j6693139
14257C36006481j6455534j5878120j5736630j5228404j4360225j4119794j1237966
$$ plain form
14250 232989808 220942591 209268109 198072159 187809286 177797287 168667491 160667012
14243 160667012 152672573 144859598 137666129 130823869 125198788 119451967 114149551 109020559
14235 109020559 103598383 99214347 95019092 90996039 87790339 84029798 80277016 77338620
14227 77338620 74197230 71162137 68679829 66231939 63205912 61042532 59266402 57078814
14219 57078814 54929834 52991857 51349361 49624883 48066814 46789070 45543813 43384476
14211 43384476 42399194 40894994 39771743 39023267 38493824 37182911 36050623 34682453
14203 34682453 33645633 32691809 31726654 31557438 30104080 29603996 28624355 27845088 27461886
14194 27461886 26687736 26100290 25273376 24470851 23822725 23468853 22749367 22164439 21538764
$$ packed form
14250B32989808j2047217j1674482j1195950j0262873j0011999r129796q000479
14243A60667012p994439p812975p193469o842260n625081n746821n302416n128992
14235A09020559n422176m384036m195255m023053l205700l760541l752782k938396
14227G7338620l141390l035093k482308k447890l026027k163380j776130k187588
14219E7078814k148980j937977j642496j724478j558069j277744j245257k159337
14211D3384476r85282j504200j123251p48476n29443j310913j132288j368170
14203C4682453j036820r53824r65155j69216j453358n00084r79641p79267l83202
14194B7461886p74150n87446q26914q02525o48126l53872p19486n84928o25675
$$ plain form
14185 21538764 21142714 20739699 20514995 19922446 19140613 19128682 18717133 18341398 17775092
14176 17775092 17575302 16995666 16897965 16124872 16410514 15400760 15399212 14796266 14969685 14424478
14166 14424478 14434559 14142000 13588620 13586238 13499500 12760328 12818754 12785161 12460731 11888824
14156 11888824 12026822 11684818 11665480 11240432 10950189 10955872 10778216 10677248 10426763 10397918
14146 10397918 10045148 9979081 9668636 9258413 9540440 9178209 9048802 8752682 8706377 9035707
14136 9035707 8775934 8756404 8533786 8254579 8221029 7967854 7779571 7367341 7478798 7666838
14126 7666838 7260022 7612162 7375134 6919873 6793917 6880780 6762072 6566603 6565874 6814798
14116 6814798 6615495 6325287 6517767 6125550 6236579 5811638 6053550 5777794 5792852 5779109
$$ packed form
14185B1538764l96050m03015k24704n92549p81833j1931m11549l75735n66306
14176A7775092j99790n79636r7701p73093K85642j009754j548o02946J73419n45207
14166A4424478J0081k92559n53380k382q6738p39172N8426l3593l24430n71907
14156A1888824J37998l42004j9338m25048k90243N683j77656j00968k50485k8845
14146A0397918l52770o6067l10445m10223K82027l62231j29407k96120m6305L29330
14136I035707k59773j9530k22618k79207l3550k53175j88283m12230J11457J88040
14126G666838m06816L52140k37028m55261j25956Q6863j18708j95469p29K48924
14116F814798j99303k90208J92480l92217J11029m24941K41912k75756J5058j3743
$$ plain form
14106 5779109 5790007 5834064 5222375 5589996 5515433 5185627 5601940 5187128 5320939 5011672
14096 5011672 5066396 4946688 4792610 5042148 4789851 4778565 4593969 4718650 4440402 4539985
14086 4539985 4490154 4903290 4707697 4261623 4627049 4359825 3956792 4332388 3863486 4494646
14076 4494646 4038470 4175662 4338541 3896331 4123048 3845340 3969990 3718448 3807632 3613323
14066 3613323 3719151 3604714 3729612 3491145 3596728 3316260 3620260 3819807 3537878
14057 3537878 3645055 3549460 3653592 3242279 3442663 2959612 3065755 2929038 3106742 3317110
14047 3317110 3357164 3142569 3169759 3202686 3025717 2866168 2960036 2791277 2622421 2445768
14037 2445768 3048358 2762240 2829914 2500433 2546130 2905042 2487313 2808096 2470186 2725532
$$ packed form
14106E779109J0898M4057o11689L67621p4563l29806M16313m14812J33811l09267
14096E011672N4724j19708j54078K49538k52297j1286j84596J24681k78248R9583
14086D539985m9831M13136j95593m46074L65426k67224m03033L75596m68902O31160
14076D494646m56176J37192J62879m42210K26717k77708J24650k51542Q9184j94309
14066C613323J05828j14437J24898k38467J05583k80468L04000J99547k81929
14057C537878J07177r5595J04132m11313K00384m83051J06143j36717J77704K10368
14047C317110M0054k14595K7190L2927j76969j59549R3868j68759j68856j76653
14037B445768O02590k86118O7674l29481M5697L58912m17729L20783l37910K55346
$$ plain form
14027 2725532 2559120 2436741 2460917 2368280 2169931 2412486 2478008 2404239 2279459 2179325
14017 2179325 1911533 2359228 2345112 2394588 2458261 2111508 1935825 1752300 1979281 2338991
14007 2338991 2122129 2202716 1981672 2146036 2072091 1762338 1775449 1607257 1815676 1946483
13997 1946483 2150174 1962680 1865332 1709032 2096160 1720921 2099823 2544610 3110703 5898725
13987 5898725 14310671 34942866 44566296 22672196 11353922 7072599 4972926 4081473
13979 4081473 3404737 3518167 2647218 2760764 2450724 2271842 2394649 2436599 2292470 2271828
13969 2271828 2032486 2612115 1974022 1923084 2409932 1833505 1970821 1992989 1761219 1851533
13959 1851533 1776355 1970390 1856019 1768406 2057055 1715521 1681820 1717181 1708447 1608219
$$ packed form
14027B725532j66412j22379K4176r2637j98349K42555O5522p3769j24780j00134
14017B179325k67792M47695j4116M9476O3673l46753j75683j83525K26981L59710
14007B338991k16862Q0587k21044J64364p3945l09753J3111j68192K08419J30807
13997A946483K03691j87494r7348j56300L87128l75239L78902M44787N66093K788022
13987E898725Q411946K0632195R623430k1894100j1318274m281323k099673q91453
13979D081473o76736J13430q70949J13546l10040j78882J22807M1950j44129k0642
13969B271828k39342N79629o38093n0938M86848n76427J37316K2168k31770R0314
13959A851533p5178J94035j14371q7613K88649l41534l3701L5361q734j00228
$$ plain form
13949 1608219 1484625 1698202 1764341 1602848 1779690 1812147 1555275 1508881 1748185 1374464
13939 1374464 1970267 1714390 1574164 1754485 1582103 1198073 1511778 1443904 1530195 1498948
13929 1498948 1440953 1505863 1077583 1183974 1589727 1490804 1104723 1494501 1400638 1214051
13919 1214051 1347134 1469808 1596388 1463261 1279916 1465019 1159689 1392864 1224228
13910 1224228 1242066 1325623 1178167 1112981 1338038 1134862 1179815 852258 1127906 1734731
13900 1734731 1388327 1153172 1067857 912746 1107406 1461221 1041179 1219793 1155955 1317173
13890 1317173 1056983 932011 1171256 915370 663661 1080133 1213894 1011769 1079275 1398784
13880 1398784 800825 1194027 1170813 966253 1029203 1029398 1316622 1041445 1259170 1264355 795479
$$ packed form
13949A608219j23594K13577O6139j61493J76842L2457k56872m6394K39304l73721
13939A374464N95803k55877j40226J80321j72382l84030L13705o7874Q6291l1247
13929A498948n7995O4910m28280J06391M05753r8923l86081L89778r3863j86587
13919A214051J33083J22674J26580j33127j83345J85103l05330K33175j68636
13910A224228J7838Q3557j47456o5186K25057k03176M4953l27557K75648O06825
13900A734731l46404k35155q5315j55111J94660L53815m20042J78614o3838J61218
13890A317173k60190j24972K39245k55886k51709M16472J33761k02125O7506L19509
13880A398784n97959L93202k3214k04560O2950J95K87224k75177K17725N185m68876
$$ plain form
13869 795479 873485 1245266 1085113 944472 868473 866145 1220380 1078324 1020821 1109419 1090544
13858 1090544 908293 850666 731133 721442 907802 915922 894940 1023948 959732 949127 963898
13847 963898 762086 786085 607042 636852 1073456 618561 998516 736191 987928 815134
13837 815134 975594 748317 858256 781295 1167781 487452 1024794 1237031 712267 1150522
13827 1150522 766185 789900 830539 826910 909902 650047 713701 1042668 971850 648499 661525
13816 661525 688574 824820 653158 1085892 474557 629820 602098 756513 564614 739815
13806 739815 725391 348708 466063 498742 872815 699549 775693 696386 696821 433168 1124958
13795 1124958 726521 631039 828954 770603 792116 920470 794494 271314 722581 521224
$$ packed form
13869G95479P8006L71781j60153j40641p5999k328L54235j42056n7503Q8598j8875
13858A090544j82251n7627j19533r691J86360Q120k0982J29008o4216j0605J4771
13847I63898k01812K3999j79043K9810M36604m54895L79955k62325K51737j72794
13837H15134J60460k27277J09939p6961L86486D87452N37342K12237n24764M38255
13827A150522l84337K3715M0639l629Q2992k59855O3654L28967p0818l23351J3026
13816F61525K7049J36246j71662M32734D74557J55263k7722J54415j91899J75201
13806G39815j4424C48708J17355L2679L74073j73266P6144p9307M35k63653O91790
13795A124958l98437r5482J97915n8351K1513J28354j25976B71314M51267k01357
$$ plain form
13785 521224 742563 574002 539910 685764 595757 733320 398381 629564 711354 752478
13775 752478 717836 604904 802209 411254 657125 774078 832786 554038 482598 447450
13765 447450 606552 832209 286713 375051 556350 850538 253180 529520 720353 373919
13755 373919 526523 407792 382191 457150 598969 566829 526292 459491 723744 390486
13745 390486 671637 362255 569208 338132 328040 727803 343492 769527 669546 632369
13735 632369 172658 412944 522528 571519 373361 460013 442660 462749 487925 465081 456008
13724 456008 421968 451124 565664 152663 481937 394183 291339 625889 586653 53460
13713 382506 360923 536945 757196 608753 677081 664687 218838 383677 426299 463034
$$ packed form
13785E21224K21339j68561l4092J45854r0007J37563l34939K31183Q1790M1124
13775G52478l4642j12932J97305l90955K45871J16953N8708k78748p1440l5148
13765D47450J59102K25657B86713Q8338J81299K94188B53180K76340J90833l46434
13755C73919J52604j18731k5601P4959J41819l2140m0537o6801K64253l33258
13745C90486K81151l09382K06953k31076j0092L99763C43492M26035r9981l7177
13735F32369A72658K40286J09584M8991j98158Q6652j7353K0089K5176k2844r073
13724D56008l4040K9156J14540A52663L29274q7754j02844L34550l9236E3460
13713C82506k1583J76022K20251j48443O8328j2394B18838J64839M2622L6735
$$ plain form
13703 463034 700779 344113 590762 516593 356871 466141 487565 305385 602124 755614
13693 755614 864688 164021 482337 505626 616250 319617 70633 447072 329629 404085
13683 404085 455322 710314 460485 405910 494695 671894 170510 523265 796865 307764
13672 748935 -58951 434438 309434 107423 233452 478394 352150 471029 492344 288130
13662 288130 248937 333407 563947 607083 394945 75500 370681 300542 383056 554675 604043
13651 604043 660515 573357 547556 526907 448328 369240 501855 365340 328776 300350 315436
13640 315436 423444 249672 248471 407385 637915 321684 415869 155358 110455 309943
13630 309943 699421 497037 694893 137303 345571 382561 368046 385745 164386 280654
$$ packed form
13703D63034K37745C44113K46649p4169j59722J09270K1424j82180K96739J53490
13693G55614J09074A64021L18316K3289J10624k96633G0633L76439j17443P4456
13683D04085N1237K54992k49829n4575Q8785J77199A70510L52755K73600C07764
13672G48935e8951D34438j25004A07423J26029K44942j26244J18879K1315k04214
13662B88130l9193Q4470K30540M3136k12138G5500K95181p0139Q2514J71619M9368
13651F04043N6472q7158k5801k0649p8579p9088J32615j36515l6564k8426J5086
13640C15436J08008j73772j201J58914K30530l16231R4185A55358m4903J99488
13630C09943L89478k02384J97856A37303K08268L6990j4515J7699A64386J16268
$$ plain form
13620 280654 281855 186350 307581 585548 368708 160525 261079 377806 137411 41036
13609 482295 621285 111864 114784 97382 389709 275752 569333 534883 80482 524143
13599 524143 277206 140658 407701 328177 430225 239835 422652 491341 294343 219509
13589 219509 332308 292571 162013 185214 215650 20609 451883 304115 332597 525200
13579 525200 130586 146531 450222 406886 94072 554468 148126 358451 -96631 553046
13568 171680 490609 571496 350719 15669 482928 191460 471124 281015 363957 158982
13557 307967 313963 133539 558270 360661 196516 400971 43190 211022 315436 281524
13547 281524 176865 303924 315022 251817 27779 268648 355736 22165 295156 296799 521267
$$ packed form
13620B80654J201r5505J21231K77967k16840A60525J00554J16727A37411D1036
13609D82295J38990A11864K920j7402K92327j13957K93581l4450H0482M43661
13599E24143k46937j36548K67043p9524J02048j90390J82817O8689j96998p4834
13589B19509J12799l9737j30558K3201L0436B0609M31274j47768K8482J92603
13579E25200A30586J5945L03691m3336I4072M60396A48126K10325i6631E53046
13568A71680L18929Q0887k20777A5669M67259A91460K79664j90109Q2942A58982
13557C07967N996A33539M24731j97609j64145K04455D3190J67832J04414l3912
13547B81524j04659J27059J1098o3205B7779K40869Q7088B2165K72991J643K24468
$$ plain form
13536 521267 205831 303919 229525 212522 224513 296450 431317 -31625 264884 94329 278574
13525 278574 336939 210916 455415 144586 82696 207070 489231 74057 452882 226096
13514 25715 90125 219878 180987 236140 379606 257844 51643 543923 215898 -21957 122635
13502 527657 97389 164120 50112 121995 -132282 233468 459936 299938 247749 161537 146531
13491 146531 43694 361779 159051 -191419 160664 547746 130350 353042 -84848 305610
13480 299832 121222 275582 184734 295133 172492 119874 163867 193427 197639 138882 117068
13469 117068 225394 384194 473644 162006 250635 282154 -78016 335644 734379 267904
13458 343997 433173 148072 -44802 176836 494287 342820 -33440 -26361 274755 333836 217557
$$ packed form
13536E21267B05831R8088p4394j7003J1991P1937J34867c1625B64884I4329J84245
13525B78574N8365j26023K44499A44586o1890J24374K82161G4057L78825B26096
13514B5715O4410J29753l8891N5153J43466j21762E1643M92280B15898b1957A22635
13502E27657I7389O6731E0112P1883a32282B33468K26468j59998n2189q6212j5006
13491A46531D3694L18085A59051a91419A60664L87082A30350K22692h4848C05610
13480B99832A21222J54360r0848J10399j22641n2618M3993K9560M212n8757k1814
13469A17068J08326J58800Q9450A62006Q8629L1519g8016C35644L98735B67904
13458C43997Q9176A48072d4802A76836L17451j51467c3440P079B74755N9081j16279
$$ plain form
13447 217557 106572 241821 335873 -67305 452785 214723 273613 190259 388598 361 -25582
13435 385990 -62519 -167261 429995 -42564 -7199 190748 -67702 81825 354897 179598 54610
13423 164959 387880 50113 542199 353060 189840 483651 194284 305304 178598 124569
13413 124569 205222 139187 498759 377586 230881 181435 279125 105038 457945 231531
13403 231531 149444 553129 -58446 276636 15298 268156 186373 -50867 528063 149950
13392 99467 -293 -69738 480341 59759 87671 343749 312502 244322 245504 -15265 256688 340134
13380 340134 252750 -23848 8693 137118 -80288 -9018 180023 320645 519154 22453 -131255
13368 106265 344537 97989 59052 174598 248255 223061 478026 183129 302495 376476
$$ packed form
13447B17557A06572J35249R4052f7305D52785B14723N8890q3354J98339C61b5582
13435C85990f2519j04742D29995d2564g199A90748f7702H1825K73072j75299E4610
13423A64959K22921E0113M92086j89139j63220K93811A94284J11020j26706n4029
13413A24569Q0653o6035L59572j21173j46705m9446R7690A05038L52907k26414
13403B31531q2087M03685e8446B76636A5298K52858q1783e0867E28063A49950
13392I9467b93o9445D80341E9759K7912K56078l1247o8180J182a5265B56688Q3446
13380C40134q7384b3848H693J28425h0288i018A80023J40622J98509B2453a31255
13368A06265K38272I7989l8937J15546P3657k5194K54965A83129J19366P3981
$$ plain form
13358 376476 -17640 115722 -25468 -118935 -86988 20032 73287 179376 196799 334090 155895
13346 145791 260810 320107 123647 109594 183825 493511 54069 254116 433265 90638
13335 91975 347620 -185787 219464 271148 308799 115258 181595 262379 110311 229228
13325 229228 173969 321387 52478 -35830 94190 277651 58159 -81089 16439 261831 99495
13313 167227 119437 114452 -62888 -12158 76316 -96223 94227 -198291 148387 -111951 83525
13301 -15613 -185565 575896 120941 38735 -153720 188325 113847 165624 207550 129074 -143424
13289 -135389 376162 435559 291528 51674 272402 -104211 261910 48176 65693 129732
13279 129732 260778 66293 -28245 164523 -57620 -53086 -20182 -165924 161927 -132372 114104
$$ packed form
13358C76476a7640A15722b5468r3467L1947B0032N3255J06089J7423J37291A55895
13346A45791J15019N9297A23647j4053P4231L09686E4069K00047J79149I0638
13335I1975K55645a85787B19464N1684L7651A15258O6337Q0784A10311J18917
13325B29228n5259J47418E2478c5830I4190J83461E8159h1089A6439K45392I9495
13313A67227m7790m985f2888a2158G6316i6223I4227a98291A48387a11951H3525
13301a5613j69952E75896A20941C8735a53720A88325p4478N1777M1926p8476a43424
13289a35389C76162N9397j44031E1674K20728a04211B61910D8176J7517O4039
13279A29732J31046F6293b8245A64523e7620M534b0182j45742A61927a32372A14104
$$ plain form
13267 272938 269715 130506 298781 219370 150738 -76133 169078 396839 169250 -56447 144545
13255 236789 -2693 139275 305020 209276 -68901 176468 175784 116607 221618 132802 457667
13244 457667 445168 266954 378049 -49638 -79788 -151235 -142303 58526 -229936 -113871 241755
13232 159157 -212275 223014 -177439 257250 265190 178453 -13220 -812 -58892 -1136 93197
13220 -82627 240999 301189 -94666 -34742 33114 -20189 78750 103006 -146931 -303480 98754
13208 -24745 46008 182731 140234 12451 63464 13782 -147353 18111 158190 99051 62515
13197 62515 317106 351208 273514 193263 40841 -334320 73161 210335 45282 188187 -174593
13185 74235 -182669 241086 32176 216321 -427915 106626 217321 63041 382092 179221
$$ packed form
13267B72938l223A30506J68275p9411o8632g6133A69078K27761A69250e6447A44545
13255B36789b693A39275J65745r5744f8901A76468o84n9177J05011q8816L24865
13244D57667j2499j78214J11095d9638l0150p1447Q932E8526b29936a13871B41755
13232A59157b12275B23014a77439B57250P940q6737a3220h12n8080a136I3197
13220h2627B40999O0190i4666c4742C3114b0189G8750K4256a46931j56549I8754
13208b4745D6008J36723m2497A2451N1013A3782a47353A8111J40079n9139l6536
13197F2515K54591L4102p7694q0251D0841c34320G3161J37174D5282J42905a74593
13185G4235a82669B41086C2176J84145d27915A06626J10695F3041L19051A79221
$$ plain form
13174 431333 39877 75077 170335 97218 14579 216334 158877 96 513986 100505 161934
13163 161934 19021 50017 -166599 253824 -141858 -328537 197464 -65140 160884 52693
13152 269279 372416 -28557 29635 -35064 315607 157709 166689 50767 182186 62803 -258587
13140 -114314 -41494 251402 405816 -49789 21616 225308 31991 6160 65229 39056 130175
13129 130175 294139 -139508 298445 -180872 -21107 143780 601364 394274 264353 -252197
13118 -138039 -120578 514512 29633 167782 192400 -94006 357374 146170 -13389 82150 -127806
13106 16675 -170519 191637 16271 -60782 100176 5042 -151366 346411 -194248 31144 543451
13095 543451 -32683 7751 -129464 475451 454762 -157432 167801 111574 -19686 -148274 348148
$$ packed form
13174D31333C9877L5200R5258p3117A4579K01755n7457I6N13890A00505O1429
13163A61934A9021L0996a66599B53824a41858j86679A97464f5140A60884E2693
13152B69279J03137b8557B9635c5064C15607A57709Q980E0767J31419F2803b58587
13140a14314d1494B51402J54414d9789B1616K03692C1991F160N9069k6173R1119
13129A30175J63964a39508B98445a80872b1107A43780M57584k07090j29921b52197
13118a38039J7461E14512B9633J38149K4618i4006C57374A46170a3389H2150a27806
13106A6675a70519A91637A6271f0782A00176E042a51366C46411a94248C1144N12307
13095E43451c2683G751a29464D75451k0689a57432A67801n6227a9686j28588C48148
$$ plain form
13083 -127146 270557 171839 253319 -97040 -35398 249358 -107145 376581 52649 -446562
13072 203455 -28666 -124284 100638 71924 -109260 -191350 9203 239717 106226 -9794 285046
13060 42272 163575 328865 69388 -109368 -104941 -92737 -219703 194416 388162 136284
13049 -48700 11164 -392474 -84471 -249411 -64272 96817 71672 -122192 111207 241482 535996
13038 535996 -171616 136501 -29670 11616 -8223 251122 -69647 -120744 -67022 189339 34389
13026 337056 7720 165870 185932 -57152 -170739 185739 107047 -23577 -250722 -65568 49116
13014 138454 143218 322669 -34327 67394 198203 -79550 203448 70644 -151594 -58956 -26729
13002 -38126 -57534 256850 -213073 -38212 25790 -2365 -108550 131843 -377410 86290 42652
$$ packed form
13083a27146B70557r8718Q1480i7040c5398B49358a07145C76581E2649d46562
13072B03455b8666r5618A00638k8714a09260q2090I203K30514A06226i794B85046
13060D2272J21303J65290F9388a09368M427J2204j26966A94416J93746A36284
13049d8700A1164c92474h4471j64940f4272I6817k5145a22192A11207J30275K94514
13038E35996a71616A36501b9670A1616h223B51122f9647n1097N3722A89339C4389
13026C37056G720J58150K0062e7152j13587A85739p8692b3577k27145f5568D9116
13014A38454M764J79451c4327F7394J30809g9550B03448G0644a51594e8956b6729
13002c8126j9408B56850b13073c8212B5790b365j06185A31843c77410H6290D2652
$$ plain form
12990 206797 223874 -145467 155507 58714 -167623 145260 127706 -125815 -179776 80336
12979 144776 238853 181085 -90657 329076 -28277 190573 92230 -114265 85643 -105793 258975
12967 176010 -43964 -102910 180048 37711 151931 213272 192283 174994 50037 -121133 -251806
12956 -251806 -86437 172324 178362 26300 296396 -98425 -184825 -124934 204343 4239 -223193
12944 15757 223862 -27292 41656 274435 -153011 -115053 51107 27991 127090 271354 47133
12932 -21768 308539 8004 -135812 -192455 -156327 126720 41512 -36722 -85875 -45773 -165648
12921 -165648 243705 -51207 129176 26650 68232 332459 -63122 -23153 -49926 -79651 54857
12909 33914 63446 189163 186201 132636 -16256 15099 -114732 -23549 151461 108263 122964
$$ packed form
12990B06797J7077a45467A55507E8714a67623A45260j7554a25815n3961H0336
12979A44776R4077n7768i0657C29076b8277A90573I2230a14265H5643a05793B58975
12967A76010d3964n8946A80048C7711J14220O1341k0989j7289E0037a21133j30673
12956b51806h6437A72324O038B6300K70096i8425q6400N9891B04343D239b23193
12944A5757K08105b7292D1656K32779a53011L7958E1107k3116R9099J44264D7133
12932b1768C08539H004a35812n6643L6128A26720D1512c6722m9153M0102j19875
12921a65648B43705e1207A29176B6650M1582K64227f3122b3153k6773k9725E4857
12909C3914K9532J25717k962n3565a6256A5099a14732b3549A51461m3198J4701
$$ plain form
12898 122964 -143228 -177912 -44100 91246 420047 67035 375943 85747 -111067 -174808 165705
12886 -124459 -132675 79316 56106 69496 296652 77810 291642 -11170 -5719 79395 -63187
12874 186677 -134583 -30748 72653 317950 -332787 -222410 54415 43074 308297 28938
12863 133351 192666 -133991 -147545 72305 471927 311368 -60829 232672 -225161 -14493
12852 -198969 116879 -565116 -91823 28772 -150506 -282441 326746 -186757 -197814 100813
12841 -53782 92177 276439 -52188 -231596 60324 -276803 115067 14046 92906 105938 -64743
12829 -195949 -10370 -99673 140424 -7239 168444 138917 31965 100197 84314 216222 50078
12817 52434 -45861 35063 45685 -196983 141394 -193562 231837 -25691 232659 93679 -88279
$$ packed form
12898A22964a43228l4684d4100I1246L28801F7035L08908H5747a11067o3741A65705
12886a24459q216G9316k3210J3390K27156G7810K13832a1170N451G9395f3187
12874A86677a34583c0748G2653K45297c32787J10377E4415j1341K65223B8938
12863A33351N9315a33991j3554G2305L99622j60559f0829B32672b25161a4493
12852a98969A16879e65116i1823B8772a50506j31935C26746a86757j1057A00813
12841e3782I2177J84262e2188j79408F0324b76803A15067A4046P8860J3032f4743
12829a95949a0370q9303A40424g239A68444k9527C1965O8232j5883J31908E0078
12817E2434d5861C5063J0622a96983A41394a93562B31837b5691B32659I3679h8279
$$ plain form
12805 138504 -107494 189141 -324414 305511 -226832 144456 -42573 -5276 130492 383998
12795 383998 110500 -28566 393198 270306 212061 93794 -298210 8500 -79260 -260595 51749
12783 195888 -59251 -78251 55934 -92332 -139408 -643026 -196003 470225 490990 -167645 -31065
12771 -15659 106673 10605 220992 228814 56953 -12195 175578 166792 -359887 -96369 -108847
12760 -108847 37485 206263 -24693 -144783 53222 61492 99579 311677 -148785 118061 -201841
12748 -142095 93992 -101803 -88928 -189395 238063 264196 -84535 197879 -288036 -153161
12738 -153161 201019 -141453 56883 130512 -139079 84939 61220 136456 196391 -25348 100231
12726 -100520 65051 -64663 -228562 -425191 -161162 -94309 127524 151819 301134 26300
$$ packed form
12805A38504a07494A89141c24414C05511b26832A44456d2573e276A30492K53506
12795C83998A10500b8566C93198j22892n8245I3794b98210H500g9260j81335E1749
12783A95888e9251j9000E5934i2332m7076n03618a96003D70225K0765a67645c1065
12771a5659A06673A0605K10387P822E6953a2195A75578q786c59887i6369j2478
12760a08847C7485J68778b4693j20090E3222Q270L8087K12098a48785A18061b01841
12748a42095I3992a01803J2875j00467B38063K6133h4535A97879b88036J34875
12738a53161B01019a41453E6883P3629a39079H4939k3719P5236N9935b5348A00231
12726a00520F5051f4663j63899j96629a61162O6853A27524K4295J49315B6300
$$ plain form
12715 -299300 117764 -311538 7443 67050 116974 -29135 -103954 86816 -40734 -7081 77350
12703 89177 229470 359657 96172 -87422 -186208 62465 92805 -123367 228607 19916 -117966
12691 -50322 -6045 52373 313980 215087 34088 128509 -51791 240900 119471 125187 248938
12680 248938 324871 98155 -180531 -134854 2325 -109249 -258525 -245539 186609 265577 -72271
12668 -57194 74749 56718 16535 21407 164482 11708 148897 -79665 -118323 -13779 176036
12656 -137831 -99795 192889 -15338 167171 472534 467808 -36913 -14847 281809 184822 141879
12645 141879 -32625 -256473 328386 6423 71197 -33267 7220 4518 95575 -110746 -150842
12634 -150842 38024 126598 65492 -187302 411983 -70217 230528 224231 267303 170474 137924
$$ packed form
12715b99300A17764c11538G443N9607M9924b9135p4819H6816d0734g081G7350
12703H9177J40293J30187I6172h7422r8786F2465L0340a23367B28607A9916a17966
12691e0322f045E2373K61607r8893C4088R4421e1791B40900A19471N716J23751
12680B48938P5933I8155a80531M5677B325a09249j49276J2986A86609P8968g2271
12668e7194G4749j8031A6535M872J43075A1708J37189g9665l8658a3779A76036
12656a37831L8036A92889a5338A67171L05363m726c6913a4847B81809r6987m2943
12645A41879c2625k23848C28386F423O4774c3267G220k702R1057a10746m0096
12634a50842C8024Q8574o1106a87302D11983g0217B30528o297M3072r6829l2550
$$ plain form
12623 137924 198497 79940 388615 431475 65824 177671 192324 -5552 279025 264078 330140
12612 330140 -55540 71764 442894 -235613 -249405 101441 61210 100724 33769 -143211 276193
12600 291018 261565 112817 -151545 74819 168622 -266613 -271496 -177314 162748 126150 -137920
12588 171155 -4950 262763 -25085 165011 -139740 174876 178010 7097 225316 53426 -7766
12576 274770 -155387 1310 30676 -136905 310911 178219 -357405 -304167 -404415 208544
12565 4819 124048 300734 -166765 -231824 -231390 -162318 249908 1762 100230 -167692 32461
12553 276553 357928 -260892 -127573 -246896 -244389 156938 -100084 313964 -39989 -96769
12543 -96769 -35182 -274794 256404 -22067 80207 106589 -9913 36567 63369 96012 -50698
$$ packed form
12623A37924O0573G9940L08675M2860F5824J11847J4653e552B79025j4947O6062
12612C30140e5540G1764L71130b35613j3792A01441m0231L9514C3769a43211B76193
12600B91018k9453A12817a51545G4819R3803b66613m883R4182A62748l6598a37920
12588A71155d950B62763b5085A65011a39740A74876L134G097K18219E3426g766
12576B74770a55387A310K9366a36905C10911j32692c57405N3238j00248B08544
12565D819J19229J76686a66765o5059M34O9072B49908A762R8468a67692C2461
12553B76553Q1375b60892a27573j19323K507A56938a00084C13964c9989n6780
12543i6769c5182k39612B56404b2067H0207K6382i913C6567K6802L2643e0698
$$ plain form
12531 168435 150538 133444 -132785 -316605 -52726 45760 323082 -18580 -164723 277015
12520 122634 -117033 -154594 -409199 -343891 -210328 -251975 -182713 427044 230245 19978
12509 16097 215552 -240531 -105182 29733 228724 8272 68870 -5449 6345 -127617 35679
12497 20629 -307643 -110258 -5570 -132887 74271 232925 -316926 -93999 44014 94624 175714
12486 175714 3131 -44169 -79089 -90046 130802 -341405 -143442 -124508 -366730 -112136 91961
12474 -41430 -86325 -57331 187635 235218 10130 -27364 152132 -164246 -175654 104436 86414
12463 86414 184117 -157200 17974 91539 286194 26863 -142744 -43063 -204761 31776 37016
12452 37016 193430 -109233 65782 173497 -197863 47959 -58393 106056 61240 -239190
$$ packed form
12531A68435j7897j7094a32785j83820e2726D5760K77322a8580j46143B77015
12520A22634a17033l7561k54605O5308J33563m1647O9262D27044j96799A9978
12509A6097J99455b40531a05182B9733J98991H272O0598e449F345a27617C5679
12497B0629c07643a10258e570j27317G4271J58654c16926i3999D4014N0610Q1090
12486A75714C131d4169l4920j0957A30802c41405a43442J8934k42222a12136I1961
12474d1430m4895K8994A87635M7583A0130b7364A52132a64246j1408A04436j8022
12463H6414R7703a57200A7974P3565J94655B6863a42744d3063j61698C1776N240
12452C7016J56414a09233F5782J07715a97863D7959e8393A06056m4816b39190
$$ plain form
12441 6496 105687 -84358 304183 86822 -199135 -65163 -55439 -115414 164646 -222148 175090
12429 -161368 13587 -51925 41777 69218 135511 100943 -28671 110336 280403 38668 -55176
12417 -210136 -21066 117185 117791 57154 -64467 -6886 88564 73357 -40280 -183971 -195033 -214193
12405 -214193 -348564 162764 208025 207893 143531 25718 68349 -190012 -27663 -114170 115862
12393 -50010 -257011 -266602 -125504 5102 -78672 -85500 136906 -16075 -88203 -4201 -86935 -24690
12380 71708 -134493 33411 133806 323425 97244 -159280 -114574 234870 -90384 63629 -35652
12368 82447 -38503 -151251 -26006 -80566 -21572 102154 314930 -411947 -28241 86508 153247
12357 153247 97869 -230258 -33838 182929 -48423 -181695 -53372 -199837 95960 17299 -142265
$$ packed form
12441F496R9191h4358C04183H6822a99135f5163R724n9975A64646b22148A75090
12429a61368A3587e1925D1777K7441O6293l4568b8671A10336J70067C8668e5176
12417b10136b1066A17185O06E7154f4467f886H8564j5207d0280j43691j1062j9160
12405b14193j34371A62764M5261j32o4362B5718M2631a90012b7663q6507A15862
12393e0010k07001r591a25504E102g8672o828A36906a6075p2128d201q2734b4690
12380G1708a34493C3411J00395J89619I7244a59280M4706B34870i0384F3629c5652
12368H2447c8503j12748b6006n4560b1572A02154K12776d11947b8241H6508O6739
12357A53247n5378b30258c3838A82929d8423j33272e3372j46465I5960A7299a42265
$$ plain form
12345 50223 -213587 147724 31082 -74779 -191182 263956 73624 164021 67518 -138200 -188126
12334 -188126 -18802 4118 -127646 -232170 219320 84179 -104409 132297 -2357 71142 91515
12323 91515 160240 373393 -158538 165344 94311 -51409 152790 -230813 321784 -111662
12312 152334 105702 11906 -10806 159817 88793 131037 23687 36664 -290839 106600 315659
12301 315659 274020 292647 -366113 87324 -349615 -228514 235853 -27001 -119014 246444
12290 127070 -222139 230836 76147 118083 189143 51572 243276 70282 208708 177074 -137915
12278 281902 -102677 -34404 -84503 264330 62207 279241 -47416 -45496 114753 -111048 -179502
12267 -179502 20542 -133634 -12759 -42815 25240 -21291 65587 -59234 183396 167719 -652979
$$ packed form
12345E0223b13587A47724C1082g4779j16403B63956G3624R0397F7518a38200m9926
12334a88126a8802D118a27646j04524B19320H4179a04409A32297b357G1142K0373
12323I1515O8725K13153a58538A65344p1033e1409A52790b30813C21784a11662
12312A52334m6632A1906a0806A59817p1024M2244B3687J2977b90839A06600K09059
12301C15659m1639J8627c66113H7324c49615J21101B35853b7001r2013B46444
12290A27070b22139B30836G6147M1936P1060E1572J91704G0282J38426l1634a37915
12278B81902a02677c4404n0099B64330F2207K17034d7416J920A14753a11048o8454
12267a79502B0542a33634a2759l0056B5240b1291F5587e9234A83396j5677f52979
$$ plain form
12255 90912 -296586 55085 100538 206577 -58000 85412 165074 -313485 85574 -85629 318695
12243 -109216 -229229 -59811 -22001 -30510 117438 -77931 286285 -67220 213178 274164 97619
12231 376459 50917 218448 125100 -43505 197365 330689 105070 236368 55556 179876
12221 179876 174748 323980 -9487 205030 277025 -41918 232420 173384 70837 -422589 26768
12209 112093 -253177 -10281 -49891 437404 151084 -252948 168533 261164 27527 175249
12199 175249 255730 66732 37669 396350 27871 -231 362600 118342 455046 -353745 139010
12187 -330451 -143736 369380 -60097 -205980 -161520 3455 73233 -134489 70730 -26217 316226
12175 116848 -107454 55805 273656 -224365 24266 -118580 90225 123741 48959 294159
$$ packed form
12255I0912b96586E5085M5453J06039e8000H5412P9662c13485H5574h5629C18695
12243a09216j20013e9811b2001q509A17438g7931B86285f7220B13178O0986I7619
12231C76459E0917J67531r3348d3505A97365J33324A05070J31298E5556J24320
12221A79876n128J49232i487B05030P1995d1918B32420n9036G0837d22589B6768
12209A12093b53177a0281l9610D37404A51084b52948A68533R2631B7527J47722
12199A75249Q0481F6732k9063L58681B7871b31C62600A18342L36704c53745A39010
12187c30451a43736C69380f0097j45883M4460C455O9778a34489G0730b6217C16226
12175A16848a07454E5805K17851b24365B4266a18580I0225L3516D8959K45200
$$ plain form
12165 294159 -108798 72642 148405 -23711 -2065 222850 278368 149107 214293 36904 161702
12154 161702 37865 9058 131884 -2093 208371 -95175 -61628 -241262 118774 184473 226758
12143 226758 164836 365392 -92593 5797 43881 259260 21406 144346 -28098 -315214 -246682
12132 -246682 27657 481655 120343 300214 267064 -308904 -242267 -210694 286654 107982
12121 65216 -53997 91991 434917 -219567 -118088 17477 231485 -183723 -71881 159640
12110 -174133 -198394 -30659 -164163 -286615 15639 -85489 -441502 225283 14536 138500
12100 138500 -149957 -234449 60603 64328 -17919 -53817 160726 -48411 -61513 -28441 -212233
12089 -212233 -81091 -300476 249900 349546 -755 141373 -180066 -118778 279370 62170 -30327
$$ packed form
12165B94159a08798G2642P5763b3711b065B22850N5518j29261O5186C6904J24798
12154A61702C7865I058J22826b093B08371i5175L3547j79634A18774O5699M2285
12143B26758o1922K00556i2593E797L8084K15379B1406J22940b8098k87116O8532
12132b46682B7657M53998A20343J79871l3150c08904O6637L1573B86654A07982
12121F5216e3997I1991L42926b19567J01479A7477K14008a83723g1881A59640
12110a74133k4261c0659j33504j22452A5639h5489l56013B25283A4536J23964
12100A38500a49957q4492F0603L725a7919l5898A60726d8411j3102b8441j83792
12089b12233h1091k19385B49900R9646g55A41373a80066O1288B79370F2170c0327
$$ plain form
12077 -60113 -146753 -25532 -92207 -74682 382724 -62807 107947 377442 1016993 1280274 383250
12065 -114649 167268 -115106 -86439 -11762 237612 -83960 86713 130357 221761 -46560 185893
12053 91047 189145 -257208 325515 -54476 100071 165389 -288267 -33979 35504 -28537 25715
12041 -300186 93784 83218 -175633 -172689 -10864 -158729 -181721 -45129 -122266 -184443 -45090
12029 5915 10923 -802 -78621 -65231 -444052 -177646 -46951 -65885 -165710 116998 -53114 -241374
12017 -241374 -224497 100594 -335777 248892 -35213 79185 100955 423979 -139142 434832
12006 -279179 -84200 118372 67586 -199891 123718 -263151 72919 -127868 -195474 -285203
11996 -285203 100440 126337 391958 -3816 -38140 -38926 -299177 -44380 75672 -104233 -195648
$$ packed form
12077f0113q6640b5532o6675J7525C82724f2807A07947K69495O39551K63281C83250
12065a14649A67268a15106K8667a1762B37612h3960H6713M3644R1404d6560A85893
12053I1047R8098b57208C25515e4476A00071O5318b88267c3979C5504b8537B5715
12041c00186I3784j0566a75633K944a0864j47865k2992d5129p7137o2177d5090
12029E915N008h02p7819J3390l78821a77646d6951j8934r9825A16998e3114j88260
12017b41374J6877A00594c35777B48892c5213G9185K1770L23024a39142D34832
12006b79179h4200A18372n0786a99891A23718b63151G2919a27868o7606q9729
11996b85203A00440K5897K65621c816l4324p86k60251d4380G5672a04233r1415
$$ plain form
11985 -195648 -356500 -431997 249865 -148987 57472 -36205 -231676 -22610 -146129 66578
11974 12493 123690 -301827 -217891 6516 -183248 -73542 -356504 -276987 -117110 159212 -137613
11962 172183 -122938 243426 104501 162339 -152779 -50436 -87403 47739 58948 -193108
11951 -298040 99686 -83202 149781 75674 -140938 -104642 204858 159385 105452 -118178 -103671
11940 -103671 63370 -268037 172395 -80250 -31094 9591 41060 -365084 -160991 -361831 -403436
11929 -403436 -128052 78991 -44005 -76047 -86396 -7188 -179180 -166117 -107158 -125312 77678
11917 205963 129885 -122025 153723 -285245 37546 269480 180260 -10143 188770 -104070
11906 -214346 165478 22415 -238690 -11798 -166295 -182490 9473 -116608 28934 -213030 14637
$$ packed form
11985a95648j60852p5497B49865a48987E7472c6205j95471b2610j23519F6578
11974A2493J11197c01827Q3936F516a83248g3542k82962P9517a17110A59212a37613
11962A72183a22938B43426A04501N7838a52779e0436l6967D7739J1209a93108
11951b98040I9686h3202A49781p4107a40938L6296B04858m5473n3933a18178J4507
11940a03671F3370b68037A72395h0250c1094I591L1469c65084a60991k00840m1605
11929d03436a28052G8991d4005l2042j0349g188j71992J3063N8959j8154G7678
11917B05963p6078a22025A53723b85245C7546K31934q9220a0143A88770a04070
11906b14346A65478B2415b38690a1798j54497j6195I473a16608B8934b13030A4637
$$ plain form
11894 -38957 -41555 -89215 52277 90238 -201701 200438 -62545 43698 -496033 -31397 -94955
11883 -94955 -173233 165596 -221879 -119433 -233028 -120155 58027 -87933 135436 37028
11872 -106479 102725 -57188 -337681 126497 -107730 323209 -23667 18771 321022 -135438
11861 248170 -44188 -80330 232855 -7055 -226166 120119 -59136 -75440 -61269 -11114 99349
11849 116956 -119358 44751 -23282 310829 -215120 -154885 -237487 -64807 -215154 -400762
11839 -400762 50737 57058 -112572 15770 -164801 -283073 -104 -176303 97504 110132 -154793
11827 -173250 267883 380571 -91121 -305281 135088 -115084 -59542 -148886 -57825 124879
11816 -73218 -40240 -237281 -286413 86434 -314233 -142931 -114326 305502 -21778 -36647 33200
$$ packed form
11894c8957k598m7660E2277L7961b01701B00438f2545D3698d96033c1397o3558
11883i4955p8278A65596b21879J02446j13595J12873E8027h7933A35436C7028
11872a06479A02725e7188k80493A26497a07730C23209b3667A8771L02251a35438
11861B48170d4188l6142B32855g055k19111A20119e9136j6304J4171a1114I9349
11849A16956a19358D4751b3282C10829b15120O0235q2602f4807j50347j85608
11839d00762E0737O321a12572A5770a64801j18272a04j76199I7504J2628a54793
11827a73250B67883J12688i1121k14160A35088a15084N5542q9344e7825A24879
11816g3218L2978j97041m9132H6434c14233a42931K8605C05502b1778j4869C3200
$$ plain form
11804 -202646 -42437 56134 68397 -8239 -164643 -11105 -68657 -185674 -250872 -315155 -190088
11793 -190088 26496 -38308 -295849 -248088 134156 29389 -64529 59618 -129541 315206 217187
11782 217187 -169047 -18746 -30050 -142516 92412 -83139 -71391 69431 -191182 44072 -146813
11770 208506 -226501 185063 -87486 -349582 -189717 202269 -14029 -237922 42660 -69863
11759 154616 -89734 83338 -199822 -234179 -2810 -243790 -33357 -707 -213443 138385 -80600
11747 -360695 60608 -232539 -80625 -213035 -176115 205244 -112448 -171726 403591 151805
11736 -346815 31156 45973 -4914 81582 384235 -83379 -133213 39746 -47585 7829 -74486 247212
11723 -112975 -159008 105653 -99770 83934 -17222 -226388 -95809 10259 38755 -88988 -126633
$$ packed form
11804b02646d2437E6134J2263h239j56404a1105n7552j17017o5198o4283J25067
11793a90088B6496c8308k57541M7761A34156B9389f4529E9618a29541C15206r8019
11782B17187a69047a8746j1304j12466I2412h3139J1748F9431a91182D4072a46813
11770B08506b26501A85063h7486k62096J59865B02269a4029k23893D2660f9863
11759A54616h9734H3338a99822l4357b810k40980c3357g07k12736A38385h0600
11747c60695F0608b32539h0625j32410L6920B05244a12448n9278D03591A51805
11736c46815C1156J4817d914H1582L02653h3379m9834C9746d7585G829g4486B47212
11723a12975m6033A05653i9770H3934a7222k09166i5809A0259K8496h8988l7645
$$ plain form
11712 -126633 147698 329448 287133 49540 282749 47404 -9635 -41703 212722 83669 30342
11700 -74005 -285819 36736 -83390 42326 19567 37074 -217682 233725 -24562 -88782 -53444
11689 -53444 -51047 -156187 -162153 151676 -357960 -102806 43837 41155 196989 139526 -117241
11677 -69819 272528 -120718 166632 -217922 32823 201402 64162 210515 137896 -59540
11666 -58407 80701 -109316 -197937 219893 237204 -28844 167039 -25500 -325357 -149123 392198
11654 56238 65945 51510 127052 -59774 -290260 176010 140293 -56923 214965 301822 -201920
11642 -383973 29344 -330614 -108900 141323 77230 40002 -102395 160983 98523 20720
11631 403101 -72937 -92522 -193745 -223702 128734 377320 36894 97926 -77158 -26976 213164
$$ packed form
11712a26633A47698J81750m2315D9540K33209D7404i635l2068B12722H3669C0342
11700g4005k11814C6736h3390D2326A9567J7507b17682B33725b4562o4220L5338
11689e3444K397j05140n966A51676c57960a02806D3837k682J55834n7463a17241
11677f9819B72528a20718A66632b17922C2823J68579F4162J46353p2619e9540
11666e8407H0701a09316q8621B19893J7311b8844A67039b5500k99857a49123C92198
11654E6238R707j4435P5542e9774k30486A76010l5717e6923B14965Q6857b01920
11642c83973B9344c30614a08900A41323o4093l7228a02395A60983o2460B0720
11631D03101g2937j9585j01223k9957A28734K48586C6894O1032g7158b6976B13164
$$ plain form
11619 54043 -105914 160901 -57086 223171 -197960 -107845 -2628 141010 -145570 -159857 -16771
11607 151219 44284 85572 -241916 103674 -294054 -226597 -69395 48883 -15535 -189563 19515
11595 329454 85937 -206171 133880 -51221 -217748 266570 -30187 153866 185126 248178
11585 248178 -264279 -116079 -65015 -5129 -33638 99169 232504 -66914 -258804 -47987 -222664
11574 -222664 32134 28388 -84985 -234493 335005 290370 -201952 -50129 126767 199536 14001
11562 200037 -95903 38090 -295777 -487604 26603 -47720 202848 -96589 217191 -12504 -484935
11551 -484935 50704 170697 -130487 140286 -207899 -59851 -6887 -10697 55635 196473 158296
11540 158296 -200812 -114549 60517 233004 -73701 -174890 -96676 53392 -186480 191670
$$ packed form
11619E4043a05914A60901e7086B23171a97960R0115b628A41010a45570j4287a6771
11607A51219D4284M1288b41916A03674b94054O7457f9395D8883a5535j74028A9515
11595C29454H5937b06171A33880e1221j66527B66570c0187A53866L1260O3052
11585B48178b64279a16079N1064e129k8509I9169J33335f6914j91890d7987j74677
11574b22664C2134l746h4985j49508C35005m4635b01952e0129A26767P2769A4001
11562B00037i5903C8090b95777j91827B6603d7720B02848i6589B17191a2504m72431
11551d84935E0704J19993a30487A40286b07899e9851f887l810E5635J40838l8177
11540A58296b00812Q6263F0517J72487g3701j01189P8214E3392a86480A91670
$$ plain form
11529 127579 52952 -68641 402659 -44431 22643 33802 -70090 -158298 -106714 355520 -58040
11517 -83848 -7121 152424 -119938 193000 295453 -108438 34061 179382 -1800 259728 102059
11505 -149275 -73964 31182 -93902 -59237 35050 -61110 -52287 115646 194688 168164 130669
11494 130669 245916 114887 -56642 -25944 -252942 124507 178750 -99276 44144 288433
11484 288433 -120339 33185 -299335 102799 -335265 223077 -24416 -123684 -15983 98857
11473 388567 177867 -65680 140094 -13400 -36365 209818 -173977 -362238 217632 75420
11462 -219104 284305 20001 -188971 193476 270597 -44600 139540 141758 117791 -10724 71506
11450 2847 177711 158250 56553 -76284 80936 -175707 171457 285158 -1307 167814 -128455
$$ packed form
11529A27579E2952f8641D02659d4431B2643J1159g0090q8208N1584C55520e8040
11517h3848g121A52424a19938A93000J02453a08438C4061J45321a800B59728A02059
11505a49275g3964C1182i3902L4665C5050f1110Q823A15646P9042k6524l7495
11494A30669J15247A14887e6642b5944k26998A24507N4243i9276D4144K44289
11484B88433a20339C3185b99335A02799c35265B23077b4416r9268a5983I8857
11473C88567A77867f5680A40094a3400k2965B09818a73977j88261B17632G5420
11462b19104B84305B0001a88971A93476P7121d4600A39540K218k3967a0724G1506
11450B847J74864j9461E6553g6284H0936a75707A71457J13701a307A67814a28455
$$ plain form
11438 43700 35103 90384 188441 -41310 -59693 34192 -130975 -281561 64953 236250 31206
11426 -127035 -147484 -6642 -384836 -54592 -196459 -463 -47424 58632 -148979 113337 94059
11415 94059 -54698 267106 1086 165808 -41208 241349 153443 19156 -181630 -193885 46908
11403 90674 -25691 304963 -176317 103971 57893 -321027 -53839 -413654 -31976 -71907 -71587
11392 -71587 -19141 -90016 -189409 -258373 259604 -271010 260411 -100140 151424 -99725 56095
11380 60964 135204 -374435 233652 149039 6889 20980 59683 192292 -58535 -46542 -220750
11369 -220750 353792 131179 -158850 -187629 -138817 -33794 182779 43270 -340199 89145
11358 122607 -165649 66353 -70736 116006 1391 208907 -108604 -105914 -236537 174245 -382119
$$ packed form
11438D3700q597N5281R8057d1310j8383C4192a30975j50586F4953J71297C1206
11426a27035k0449f642l78194e4592j41867d63m6961E8632a48979A13337j9278
11415I4059e4698B67106A086J64722d1208B41349q7906A9156a81630j2255D6908
11403I0674b5691C04963a76317A03971m6078c21027e3839l59815c1976l9931L20
11392g1587a9141p0875r9393o8964B59604b71010B60411a00140A51424i9725E6095
11380F0964P4240c74435B33652q4613F889J4091L8703J32609e8535J1993j74208
11369b20750C53792A31179a58850k8779M8812c3794A82779D3270c40199H9145
11358A22607a65649F6353g0736A16006A391K07516a08604K690j30623A74245c82119
$$ plain form
11346 101406 -220325 294284 -459981 264487 -536111 141917 52045 -109084 -1021 12597
11335 -43134 -125735 -173732 53356 275963 -194791 -72496 315670 263417 300583 -143945 99330
11323 -41928 -262081 280682 106162 68026 89556 -51474 -51295 201732 141165 27319 -45635
11311 -213762 19097 100361 -231701 87672 19929 -176486 -98035 16614 86790 -11955 435421
11299 5031 86646 -279918 121643 -15751 -287247 73588 105432 165320 91540 190706 66140
11287 -29850 108281 -410338 11679 -197212 -374945 -151406 75971 76761 257919 -65796 -106067
11276 -106067 7765 -126465 30806 -64473 89756 -17630 241138 -72942 160286 63294 -53079
11264 23939 -64631 -99496 -24212 479224 -55168 190714 -388449 -155656 -342069 122899
$$ packed form
11346A01406b20325B94284d59981B64487e36111A41917E2045a09084a021A2597
11335d3134q2601m7997E3356K22607a94791g2496C15670n2253L7166a43945I9330
11323d1928k20153B80682A06162l8136K1530e1474J79B01732o0567B7319d5635
11311b13762A9097Q1264b31701H7672A9929a76486P8451A6614P0176a1955D35421
11299E031Q1615b79918A21643a5751k71496G3588L1844N9888p3780R9166F6140
11287b9850A08281d10338A1679a97212j77733a51406G5971P90J81158f5796m0271
11276a06067G765a26465C0806f4473H9756a7630B41138g2942A60286F3294e3079
11264B3939f4631l4865b4212D79224e5168A90714c88449a55656j86413A22899
$$ plain form
11253 229012 -151609 -7178 25559 163910 -93914 -47359 -105731 -116094 -186460 -151690 -229593
11242 -229593 108830 -269205 -9059 -228917 164914 -45403 311754 84974 -77413 12690 -323738
11230 -38043 96744 -79421 -180448 132339 -238698 116965 -71430 12891 71348 -112724 -238476
11219 -238476 -145678 -162523 -115202 -247080 -91577 189615 9791 -51961 192605 -64907 56536
11207 -139448 62502 100127 235415 -318592 39925 -222735 182940 -120115 11275 -40205
11196 222917 44768 -121253 -128749 -37267 -102980 -178379 -170255 -319620 -429349 -80684 181130
11184 -4853 459167 -38015 24171 -11748 108683 319658 -184309 -99475 163195 65075 87600
11173 87600 -169089 37636 56804 -94991 -214725 -93229 -88384 351329 416955 -35091 -108077
$$ packed form
11253B29012a51609g178B5559J38351i3914M6555n8372j0363p0366L4770p7903
11242b29593A08830b69205i059k19858A64914d5403C11754H4974g7413A2690c23738
11230c8043I6744g9421j01027A32339b38698A16965g1430A2891N8457a12724j25752
11219b38476R2798j6845M7321j31878i1577A89615I791e1961A92605f4907E6536
11207a39448F2502L7625J35288c18592C9925b22735A82940a20115A1275d0205
11196B22917D4768a21253p496c7267o5713p5399Q124j49365j09729h0684A81130
11184d853D59167c8015B4171a1748A08683K10975a84309Q4834A63195F5075K2525
11173H7600a69089C7636J9168i4991j19734i3229M845C51329O5626c5091p2986
$$ plain form
11162 -108077 -58203 235812 -218154 -146054 50881 -429990 -393502 -62312 155000 194868 314019
11151 314019 -103601 -265994 54343 -6859 -293883 -114027 154413 -249096 130272 -100331
11140 -38213 -272231 39255 -63761 38627 -162485 57634 383195 132030 311345 78000 208185
11129 208185 98788 41235 102216 66147 -129997 82852 -68418 150887 229179 -91670 -499382
11118 -499382 157077 365773 215331 -136917 183997 -53562 49374 325673 -119302 -218453
11108 -218453 343340 75773 239129 54182 325459 -84273 75952 194132 -114877 -66863
11098 -66863 -77887 64252 212727 221323 192866 236295 183897 506634 -114953 4750 35194
11087 35194 81657 292633 190863 127321 237900 150354 -403923 -232195 340712 602661
$$ packed form
11162a08077M9874B35812b18154P2100E0881d29990L6488f2312A55000L9868J19151
11151C14019a03601j62393E4343f859k87024a14027A54413b49096A30272a00331
11140c8213k34018C9255f3761C8627a62485E7634L25561A32030J79315G8000J30185
11129B08185I8788D1235O0981l6069a29997H2852f8418A50887P8292i1670m07712
11118d99382A57077K08696j50442a36917A83997e3562D9374K76299a19302r9151
11108b18453C43340G5773J63356E4182K71277h4273G5952J18180a14877M8014
11098f6863j1024F4252J48475Q596k8457M3429n2398L22737a14953D750L0444
11087C5194M6463K10976j01770o3542J10579q7546d03923J71728C40712K61949
$$ plain form
11077 602661 392426 169910 -148115 47911 160313 160471 223002 435034 85081 54522 497120
11066 497120 108729 352992 182960 301115 81323 507085 572497 425414 -101737 311445
11055 312412 378396 486534 500317 615463 511195 484070 229817 576942 653872 293837
11044 225757 324103 355234 580327 429287 245818 286204 481490 359164 391680 413047
11034 413047 312698 749781 638560 572176 459730 562179 549965 693819 398877 521120
11024 521120 441032 601938 521227 444082 357946 72472 151488 280693 570531 474100 245650
11013 245650 415611 609558 210025 709947 294838 523512 387437 349123 393047 85388
11002 490224 834225 231903 244425 577564 579181 500306 321926 483882 513845 474198 312042
$$ packed form
11077F02661k10235A69910a48115D7911J12402J58O2531K12032H5081l0559M42598
11066D97120A08729K44263j70032J18155H1323M25762O5412j47083a01737C11445
11055C12412O5984J08138J3783J15146j04268k7125B29817L47125P6930B93837
11044B25757R8346L1131K25093j51040j83469M0386J95286j22326L2516K1367
11034D13047j00349M37083j11221o6384j12446J02449j2214J43854k94942J22243
11024E21120q0088J60906q0711p7145q6136G2472P9016J29205K89838r6431k28450
11013B45650J69961J93947B10025M99922B94838K28674j36075l8314M3924H5388
11002D90224L44001B31903J2522L33139J617p8875j78380J61956K9963l9647j62156
$$ plain form
10991 312042 394752 629839 417510 594048 598486 607693 634714 573205 686092 607888 838094
10980 838094 521402 958936 1164646 987506 1302502 1753580 1736324 2204577 2101444 2238447
10970 2238447 2032422 2255161 1709862 1780995 1472995 1379349 1306954 988511 918874 804161
10960 804161 1105148 1156317 1224460 1077252 1044573 1044324 851343 438879 710834 409993 375698
10949 375698 274074 127872 245944 263023 -23433 402738 186068 218595 -76588 497894
10938 -441595 -72374 308543 166992 244238 -120144 174456 57989 196910 19809 5566 -28227
10926 91008 101997 -321312 -17745 -108037 190374 222391 376665 46631 445729 284183 -56730
10914 231710 -69917 -189661 -96639 -57010 -410 59687 93718 -203000 -29479 392301 -7517
$$ packed form
10991C12042Q2710K35087k12329J76538M438R207K7021o1509J12887p8204K30206
10980H38094l16692M37534K05710j77140L14996M51078j7256M68253j03133J37003
10970B238447k06025K22739n45299P1133l08000r3646p2395l18443o9637j14713
10960H04161L00987N1169O8143j47208l2679k49j92981m12464K71955l00841l4295
10949C75698j01624A27872J18072J7079b3433D02738A86068L2527g6588D97894
10938d41595g2374C08543j41551P7246a20144A74456E7989J38921A9809E566b8227
10926I1008J0989c21312a7745r0292A90374L2017J54274D6631L99098j61546e6730
10914B31710f9917j19744R3022L9629d10E9687L4031b03000b9479C92301g517
$$ plain form
10902 -275178 -141230 -14024 -148817 32479 30994 57097 -345719 62384 -57591 -66941 -41809
10891 -41809 91712 -240861 -108797 -120655 -50573 4782 69218 42824 16568 31588 -3082 -427878
10879 -427878 -160909 -142885 -218602 -69094 -236192 95856 -171751 44859 8614 -231347 -23218
10867 -70725 26648 225288 -10797 94305 -133016 -123204 -25608 49163 291629 24209 102236
10856 102236 37443 -164322 -87678 192008 33363 18818 -11649 -15673 232693 -38107 16740
10844 -187198 183053 -19620 57703 168315 -64950 -114344 34265 -122474 152902 -90835 -470029
10833 -470029 -64799 -71780 -26178 -15217 74887 247713 -323068 -24703 -113680 -29983 -181097
10822 -181097 103059 72088 -37999 196059 -155276 -8048 63623 -206643 -215271 -110066 -197598
$$ packed form
10902b75178J33948a4024j34793C2479j485K6103c45719F2384e7591r350K5132
10891d1809I1712b40861a08797j1858e0573D782O4436k6394A6568J5020c082m24796
10879d27878a60909J8024p5717f9094j67098I5856a71751D4859H614b31347b3218
10867g0725B6648J98640a0797I4305a33016R812b5608D9163K42466B4209P8027
10856A02236C7443a64322P6644A92008C3363j4545a1649m024B32693c8107A6740
10844a87198A83053a9620E7703J10612f4950m9394C4265a22474A52902i0835l79194
10833d70029f4799o981b6178J0961G4887J72826c23068b4703q8977b9983j51114
10822a81097A03059l0971c7999A96059a55276h048F3623b06643q628J05205q7532
$$ plain form
10811 -197598 -80599 -177759 99754 43533 -21276 61835 95728 -132090 -248947 63527 -7861
10799 59167 -49183 166302 355003 191354 3986 -233444 -175129 198350 27906 -181877 110698
10787 -46975 -65542 92295 -192320 -29526 -67927 -305568 74347 72850 -253032 86756 197239
10776 197239 -64634 -234927 13703 -130252 -20410 -76155 -29852 -44256 -241490 -142305 54974
10764 -195693 32264 -50069 -183012 -315605 -48503 170169 -408387 -370166 51184 -96075 -77104
10753 -77104 -41342 105560 158469 -74214 -26905 76370 3664 -5172 87838 117959 120815 -226873
10740 -32758 -277890 -39456 -31965 142723 -426573 -32460 106414 -298902 128193 147731 343028
10729 343028 -27675 -53691 -25806 -271524 -137356 -112544 126640 -182336 210067 -189440
$$ packed form
10811a97598h0599r7160I9754D3533b1276F1835L3893a32090j16857F3527g861
10799E9167d9183A66302J88701j63649C986b33444N8315A98350B7906a81877A10698
10787d6975j8567I2295a92320b9526l8401k37641G4347j497b53032H6756J10483
10776A97239f4634j70293A3703a30252b0410n5745b9852j4404j97234R9185E4974
10764a95693C2264e0069j32943j32593d8503A70169d08387L8221E1184i6075J8971
10753g7104L5762A05560N2909g4214b6905G6370C664e172H7838L0121K856b26873
10740c2758k45132c9456P491A42723d26573c2460A06414b98902A28193J9538J95297
10729C43028b7675k6016b5806k45718J34168K4812A26640a82336B10067a89440
$$ plain form
10718 70712 56828 -285405 -90791 -176959 22331 -157579 132585 -41182 341632 -151464 -4352
10706 157141 -181313 16724 -102419 -306669 -57871 -45624 -53347 -33144 -202245 -14291 -168490
10695 -168490 124845 -147408 31316 -230987 -5754 -21355 81961 18963 98999 -42917 -36995
10684 -36995 54583 56242 146576 242414 25815 -85283 149736 -22569 -142600 361507 -193413
10672 80565 -37282 -320535 214039 99175 18835 151743 -64715 -20158 113133 138587 -90914
10660 88373 -17926 -58233 1376 -361425 11618 236071 -304631 -91577 85999 -296614 -8319
10648 -469737 -303690 -206455 -93873 231819 -127247 -71050 -43263 297179 77997 130234 -81002
10636 -103429 25633 140370 -267560 -13003 -23391 -200483 166800 -83375 -276942 21580
$$ packed form
10718G0712j3884b85405i0791q6168B2331a57579A32585d1182C41632a51464d352
10706A57141a81313A6724a02419k04250e7871J2247p723K0203j69101a4291j54199
10695a68490A24845a47408C1316b30987e754j5601H1961A8963Q0036d2917N922
10684c6995E4583J659R0334R5838B5815h5283A49736b2569j20031C61507a93413
10672H0565c7282k83253B14039I9175A8835J32908f4715b0158A13133K5454i0914
10660H8373a7926m0307A376c61425A1618K24453c04631i1577H5999b96614h319
10648d69737J66047R7235i3873B31819a27247N6197K7787B97179G7997N2237h1002
10636a03429B5633J14737b67560a3003j0388j77092A66800h3375j93567B1580
$$ plain form
10625 13930 -203413 14299 -104420 -181031 167510 202971 -56718 330561 22899 -231989 -50456
10613 -51459 -25036 -340838 -26559 -75195 -5598 57581 101536 -113338 -335289 -120319 126999
10601 -73384 52093 448816 -174487 -32418 4458 -261224 66792 106639 -17691 -273016 -280321
10590 -280321 113456 -49297 -3693 -41203 121402 -122658 -209465 -74564 -423898 158688 323681
10579 323681 97778 -88990 -185336 -234380 -137408 -126411 -228613 -28692 123465 113650 30915
10567 -20930 37835 -244879 219330 -389800 -226145 -81796 25345 -292626 -39761 -252359
10557 -252359 -28858 -53920 -363388 46802 -263304 161868 -10870 -265227 150586 -55599
10546 245885 58334 110662 163463 94019 39923 127653 14367 82279 -71237 -266006 -152271
$$ packed form
10625A3930b03413A4299a04420p6611A67510L5461e6718C30561B2899b31989e0456
10613e1459b5036l15802b6559m8636e598E7581M3955a13338k21951a20319A26999
10601g3384E2093L96723a74487c2418D458b61224F6792L9847a7691k55325p305
10590b80321A13456d9297c693l7510A21402a22658q6807g4564l49334A58688J64993
10579C23681I7778h8990r6346m9044R6972J0997j02202b8692A23465r815C0915
10567b0930C7835b44879B19330c89800J63655h1796B5345b92626c9761k12598
10557b52359b8858k5062l09468D6802b63304A61868a0870k54357A50586e5599
10546B45885E8334N2328N2801o9444C9923Q7730A4367O7912g1237j94769J13735
$$ plain form
10535 -152271 -150321 -267216 -80414 -134234 171331 -109241 -135211 -9361 -131451 -49377 258453
10523 -180088 -196806 -198094 56614 -196673 -142307 81070 124572 -67182 -97576 -251102 -289531
10512 -289531 -330017 -135497 174324 -65333 -281128 -220461 -132030 218149 58003 -213440
10501 111455 -100225 -282986 26355 188027 -312222 -69507 79784 -175451 -295933 -136229
10490 -11626 -144036 -182008 -15921 -3312 300149 -69353 -90909 -230633 -80752 252939 -175088
10478 12703 -128509 183917 -224673 -5114 50382 -73619 -24111 52613 40131 -9320 -54577
10467 -54577 65222 -31043 -121676 305409 142809 -403167 -179388 75390 209553 284410 73783
10455 -29298 -91984 156923 -60269 129791 -205388 -188966 -122073 -340322 71213 217388 -5037
$$ packed form
10535a52271J950j16895h0414n3820A71331a09241k5970i361j22090d9377B58453
10523a80088j6718j288E6614a96673N4366H1070M3502f7182l0394j53526l8429
10512b89531m0486a35497A74324f5333k15795O0667Q8431B18149E8003b13440
10501A11455a00225j82761B6355J61672c12222f9507G9784a75451j20482a36229
10490a1626j32410l7972a5921c312C00149f9353k1556j39724h0752B52939a75088
10478A2703a28509A83917b24673e114E0382g3619b4111E2613j2482i320m5257
10467e4577F5222c1043r0633C05409A42809d03167a79388G5390J34163P4857G3783
10455b9298o2686A56923f0269A29791b05388J6422O6893k18249G1213J46175e037
$$ plain form
10443 -188169 -12984 -176238 -151803 -84604 -191840 -98416 251760 -200958 200980 -173219
10432 -39898 322150 91441 -150063 34216 42676 58174 -50506 53478 -98633 -62413 385194
10420 61613 -46974 -39048 -296580 -155416 -34545 -289315 -100036 -141435 -153432 -72255 648592
10408 49151 -136623 -84311 101975 21827 -229316 281838 -68010 97717 -184320 -331044
10398 -331044 60885 333368 254241 -112733 -100886 199265 -32875 109346 47497 -54687 -50335
10387 -50335 97639 40838 27582 134442 45935 -123366 305791 22249 93381 -236331 212231
10375 96797 -33176 -17425 257744 210539 451469 315879 335251 -176200 452234 223871
10364 97609 512274 -157909 188516 -159999 -177085 304313 117716 -1235 89781 180550 22580
$$ packed form
10443a88169a2984j63254K4435O7199j07236R3424B51760b00958B00980a73219
10432c9898C22150I1441a50063C4216Q460J5498e0506E3478i8633L6220C85194
10420F1613d6974P926k57532J41164c4545k54770a00036m1399j1997g2255F48592
10408D9151a36623N2312A01975B1827b29316B81838f8010I7717a84320j46724
10398c31044F0885K72483p9127a12733J1847A99265c2875A09346D7497e4687M352
10387e0335I7639D0838j3256J06860D5935a23366C05791B2249P1132b36331B12231
10375I6797c3176J5751B57744m7205K40930j35590J9372a76200D52234B23871
10364I7609M14665a57909A88516a59999j7086C04313A17716a235H9781R0769B2580
$$ plain form
10352 239043 216602 198957 729375 456092 25256 307831 449358 152466 94318 -26189
10341 279857 200163 3198 368296 225468 -98882 -239071 244559 91823 60137 -243526 -200821
10330 -200821 252134 -160529 124779 54807 129013 271748 -65087 -4412 55131 290161 14356
10318 -119975 -56610 96539 -141165 161412 49390 203498 -163634 -21004 31642 60526 -100199
10306 286303 -8913 96056 -197786 -85907 369497 -257528 479622 121427 26184 294766
10296 294766 -184370 -12563 260899 -96183 36611 -243791 -155533 -367701 97840 -35037 -222314
10285 -222314 38973 -231526 -117776 -172429 104056 -23196 -219149 -92515 -174955 -20542 -234490
10274 -234490 107289 116310 -139001 -25622 -107827 117441 -160464 -158882 -137957 -279760 -285948
$$ packed form
10352B39043k2441j7645N30418k73283B5256K82575J41527A52466n8148b6189
10341B79857p9694C198L65098j42828i8882j40189B44559I1823l1686b43526M2705
10330b00821B52134a60529A24779E4807P4206J42735f5087d412E5131K35030A4356
10318a19975e6610I6539a41165A61412D9390J54108a63634b1004C1642K8884a00199
10306B86303h913I6056a97786h5907C69497b57528D79622A21427B6184K68582
10296B94766a84370a2563B60899i6183C6611b43791Q8258k12168I7840c5037j87277
10285b22314C8973b31526J13750n4653A04056b3196j95953i2515q2440b0542k13948
10274b34490A07289R021a39001b5622q2205A17441a60464J582K0925j41803o188
$$ plain form
10263 -285948 -109911 161161 348096 35089 265074 499518 -37289 28812 636407 66805
10252 -190044 342260 1121 -44970 426387 -34117 -253849 126951 125038 -109240 -155680 -185777
10241 -185777 130759 -286224 58442 -221042 90884 132080 102461 -367280 -163543 -181177
10231 -181177 -174807 -97736 185427 138846 -238493 97951 187066 -245017 182653 -101351 -212348
10220 -212348 -118221 -76251 311651 175144 30401 -111436 117943 9600 4759 4733 116166
10209 116166 -10397 -68636 -70689 -103183 -57521 -73405 -47161 -218579 293874 -14228 -135842
10198 -135842 -41532 -212067 -58152 269619 -284563 8953 -81683 -223485 162049 -176198
10187 69542 -97740 69634 -12002 -314081 -8918 -103817 66581 169732 -6184 -154686 -349600
$$ packed form
10263b85948a09911A61161J86935C5089K29985K34444c7289B8812O07595F6805
10252a90044C42260A121d4970D26387c4117k19732A26951j913a09240m6440l0097
10241a85777A30759b86224E8442b21042I0884M1196k9619c67280a63543j7634
10231a81177O370P7071A85427m6581b38493I7951Q9115b45017A82653a01351j10997
10220b12348R4127M1970C11651j36507C0401a11436A17943I600D759k6J11433
10209A16166a0397n8239k053l2494M5662j5884K6244j71418B93874a4228j21614
10198a35842d1532j70535e8152B69619b84563H953h1683j41802A62049a76198
10187F9542i7740F9634a2002l02079h918r4899F6581J03151f184j48502j94914
$$ plain form
10176 -349600 -135062 -102899 24558 -434758 -23153 -77195 133883 -17528 -30956 157393 66742
10164 170825 -238553 -104379 -185068 216157 -272047 12282 181678 -107400 91364 127841
10154 127841 139998 286473 251494 6102 159166 -25816 -73728 210552 169381 199235 41388
10142 -31939 -45405 76156 -102512 -206416 -117990 -175483 132958 50969 -135556 83138 14098
10130 -72653 149593 -48878 61959 -111905 122723 -43007 -174367 -150868 220267 -86413 -36654
10118 125894 -362889 -110035 -39138 -87981 -222967 -299931 6457 261820 196554 -262223 -88170
10106 89942 148583 339745 186844 -205145 -44753 -89293 -243085 159499 -131002 190599
10095 -292105 -10342 26373 -6936 -19176 183721 30222 -287450 -12847 -139905 -287685 13
$$ packed form
10176c49600a35062L2163B4558d34758b3153n4042A33883a7528j3428A57393F6742
10164A70825b38553a04379q0689B16157b72047A2282J69396a07400I1364L6477
10154A27841J2157J46475l4979F102J53064b5816m7912B10552m1171K9854D1388
10142c1939j3466G6156a02512j03904Q8426n7493A32958E0969a35556H3138A4098
10130g2653A49593d8878F1959a11905A22723d3007j31360K3499B20267h6413c6654
10118A25894c62889a10035c9138m8843j34986p6964F457K55363o5266b62223h8170
10106H9942N8641J91162j52901b05145d4753m4540j53792A59499a31002A90599
10095b92105a0342B6373f936j2240A83721C0222b87450a2847j27058j47780A3
$$ plain form
10083 -26661 173697 -198503 -38754 -15415 -228490 -164620 -90077 158733 -373197 -325412 21644
10071 205398 53405 -96672 434665 -102092 22965 -241511 189439 -33540 367853 -127434
10060 -121959 74604 -190121 -355402 214551 4858 53309 -97427 -106178 -289239 -89519 -161755
10049 -161755 68102 47673 308299 -118622 108342 -257440 -95354 109850 242036 -386140
10038 -406415 -244005 32409 -249951 29724 94167 154921 63832 -159734 229772 9481 -86696
10026 78331 -355009 129615 -292284 -443851 -122575 379160 -214627 -94016 89474 85715
10016 85715 -133778 -54523 -314960 -90908 -232705 -46712 -462333 178444 -239519 -71252
10005 -50673 -42839 236439 -217186 137395 265282 -183991 -298918 25885 -236987 -226183
$$ packed form
10083b6661A73697a98503c8754a5415k13075O3870P4543A58733c73197M7785B1644
10071B05398E3405i6672D34665a02092B2965b41511A89439c3540C67853a27434
10060a21959G4604a90121j65281B14551D858M8451i7427q751j83061h9519p2236
10049a61755F8102k0429K60626a18622A08342b57440i5354A09850J32186c86140
10038d06415J62410C2409b49951B9724O4443O0754F3832a59734B29772I481h6696
10026G8331c55009A29615b92284j51567a22575C79160b14627i4016H9474l759
10016H5715a33778e4523k60437i0908j41797d6712m15621A78444b39519g1252
10005e0673P834B36439b17186A37395J27887a83991j14927B5885b36987J0804
$$ plain form
9995 -226183 117410 22522 -91049 -190249 303604 203204 -375845 203520 -352003 188135
9984 24791 -92621 -24520 -493772 -46822 85442 -13104 229253 159807 -25203 -248576 -141856
9973 -141856 86803 -430323 -22613 -110623 246143 36810 -201643 -262098 197384 91062 82213
9962 82213 112078 -56265 641 -65476 -157465 131965 -271064 -76112 -75014 -240492 26733 130004
9950 130004 -75530 53384 101347 12752 20695 7865 -26064 41017 -35826 153477 -111219 -274728
9938 -274728 55586 -58192 -366912 435730 -6107 90627 -16914 1880 -86680 -221259 -188047
9927 -188047 -177442 -33355 -119346 -133490 -96432 -331325 -177454 -345524 43132 35739 217385
9916 217385 -275092 -55937 155607 322965 174013 -115827 -59628 -296549 268425 3597
$$ packed form
9995b26183A17410B2522i1049r9200C03604j00400c75845B03520c52003A88135
9984B4791i2621b4520m69252d6822H5442a3104B29253o9446b5203k23373J06720
9973a41856H6803d30323b2613q8010B46143C6810b01643o0455A97384I1062q849
9962H2213K9865e6265F41f5476r1989A31965b71064g6112J098j65478B6733J03271
9950A30004g5530E3384M7963A2752P943G865b6064D1017c5826A53477a11219j63509
9938b74728E5586e8192l08720D35730f107I0627a6914A880h6680j34579L3212
9927a88047J0605c3355q5991j4144L7058k34893J53871j68070D3132p393J81646
9916B17385b75092e5937A55607J67358j48952a15827N6199k36921B68425C597
$$ plain form
9905 -363182 -22882 -140764 -73812 -144238 -70906 -157390 -69702 -377703 54766 -83661 -44573
9894 -44573 152776 -103578 -116154 293266 -183140 150051 -166156 82318 6558 106695 -14012
9882 62260 39591 13721 -162997 -119098 169456 38967 -180823 -26242 -306237 -16337 167130
9870 -238702 327479 -168034 -128347 -173689 234817 -160402 -200572 -42982 -350466 -230566
9860 -230566 -179746 363676 -283553 262977 -45729 -253584 228147 74932 23263 -130700
9849 -157151 -79925 91059 166000 -47970 -218107 -87971 102346 -240165 -8948 -72897 -231611
9838 -231611 114741 126235 -71292 -166900 -185284 -211307 -41584 196043 -235796 -38080 321416
9826 83208 -65617 -9479 -162922 -268904 -180280 208128 245086 45263 -20764 -369467 68174
$$ packed form
9905c63182b2882j17882O6952p0426g0906q6484f9702l08001E4766h3661L9088
9894d4573A52776a03578j2576B93266a83140A50051a66156H2318F558J00137a4012
9882F2260k2669A3721a62997M3899A69456C8967a80823b6242k79995a6337A67130
9870b38702C27479a68034L9687m5342B34817a60402m0170d2982l07484J19900
9860b30566N0820C63676b83553B62977d5729k07855B28147G4932B3263a30700
9849a57151P7226I1059P4941d7970j70137h7971A02346b40165h948o3949j58714
9838b31611A14741J1494g1292r5608j8384k6023d1584A96043b35796c8080C21416
9826H3208f5617i479j53443j05982Q8624B08128L6958D5263b0764l48703F8174
$$ plain form
9814 5298 43297 -53231 -226061 -67697 -110016 45236 -177887 55034 3130 -239829 -153140 -60937
9801 -25750 50417 -296404 -35984 20805 -117797 6547 -67806 33855 -188465 -230905 111924
9789 -62624 51285 1348 -121308 66995 160434 138718 22061 -27075 271463 -48956 -63178 -230255
9777 -230255 -346294 20783 -53829 -41857 -251709 -34034 -14046 -52445 81281 -113761 309747
9765 375912 -62181 -196182 -91647 -158441 276001 26747 -441311 -148765 8980 -111689 -259055
9754 -259055 46896 -105054 -121422 -86728 -145320 10602 -24426 -162445 -16343 -74741 -143218
9743 -143218 -104304 -371612 -101221 172697 4772 39558 -6374 141340 -320632 -84540 -14140
9731 182816 119512 76187 -109389 239778 -118987 -10526 -341500 -79716 -92668 -419959 -116631
$$ packed form
9814E298L7999e3231j72830f7697m2319D5236a77887E5034C130b39829Q6689f0937
9801b5750E0417b96404c5984B0805a17797F547f7806C3855a88465m2440A11924
9789f2624E1285A348a21308F6995R3439k1716B2061b7075B71463d8956j4222j67077
9777b30255j16039B0783e3829J1972k09852c4034a4046l8399H1281a13761C09747
9765C75912f2181j34001i1647o6794B76001B6747d41311a48765H980a11689j47366
9754b59055D6896a05054j6368L4694n8592A0602b4426j38019a6343n8398o8477
9743a43218L8914k67308a01221A72697D772L4786f374A41340c20632h4540a4140
9731A82816o3304m3325a09389B39778a18987a0526l30974g9716j2952l27291a16631
$$ plain form
9719 -21741 -176519 20798 253175 -25604 128983 -56503 17270 96978 114847 -152505 216745
9707 466859 -24269 -31428 155812 -151809 -142591 -53877 198754 -7677 -93571 -139225 -81631 -10292
9694 129065 -21453 -156495 -123730 -95285 -194867 -71531 189318 195435 -52926 -14678 90568
9682 -145230 109524 4112 187572 -140227 106800 1201 122355 -5023 94777 -92244 -344415
9671 -344415 -39111 -209284 -330594 -51798 108318 -372575 -45183 -364789 80373 30131 235747
9660 235747 31447 -16177 -162642 -378507 -196918 -113663 -493105 128485 122400 -69169 -145862
9649 -145862 -175684 -169511 -206629 -28534 -89165 166454 56744 300938 30316 -215016 -33718
9637 -169246 24753 87441 -82751 -92738 -445572 -140547 -6213 -144574 156767 36516 -167916
$$ packed form
9719b1741j54778B0798K32377b5604A28983e6503A7270P9708J7869a52505B16745
9707D66859b4269p159A55812a51809R218e3877A98754g677q5894m5654N7594a0292
9694A29065b1453j35042L2765K8445r9582g1531A89318O117e2926a4678I0568
9682a45230A09524D112J83460a40227A06800A201J21154e023I4777i2244k52171
9671c44415c9111j70173j21310e1798A08318c72575d5183l19606H0373C0131K05616
9660B35747C1447a6177j46465k15865J81589Q3255l79442A28485o085f9169p6693
9649a45862k9822O173l7118b8534o0631A66454E6744K44194C0316b15016c3718
9637a69246B4753O2688h2751r987l52834a40547f213j38361A56767C6516a67916
$$ plain form
9625 -224547 -177148 -100466 41019 -338619 -218265 -402857 -71766 304892 116225 -68603 -47413
9614 -47413 -324196 113245 19702 -245374 -108376 -184426 -206766 -207795 -104637 -71501 49726
9602 -320377 -78163 -236083 -147425 -60940 -159 26692 -288661 -226900 51269 -39584 -351645
9591 -351645 -65290 10616 -15923 192893 -38061 124237 -205753 -276172 -48164 31930 -436768
9579 -145541 -274858 -56836 174926 82278 156519 131014 -19475 -376436 84471 -164156 187990
9567 3660 -129182 -174114 -99847 -63539 -37765 -112059 -169486 89014 103554 11528 81118 40625
9555 40625 -27615 -123886 -382244 -116989 -3318 -108320 -169928 307139 -137521 -228351 -68662
9543 -223295 68261 109012 141515 -356016 9720 -96483 103292 -243119 -285683 -257644 19251
$$ packed form
9625b24547M7399P6682D1019c38619J20354j84592g1766C04892A16225f8603K1190
9614d7413k76783A13245A9702b45374a08376p6050k2340j029J03158L3136D9726
9602c20377g8163j57920Q8658f0940a59B6692b88661O1761E1269c9584l12061
9591c51645f5290A0616a5923A92893c8061A24237b05753p0419d8164C1930d36768
9579a45541j29317e6836A74926H2278P4241k5505a9475l56961H4471a64156A87990
9567C660a29182m4932P4267L6308K5774p4294n7427H9014J4540A1528O9590m0493
9555D0625b7615r6271k58358a16989c318j05002o1608C07139a37521r0830f8662
9543b23295F8261M0751L2503c56016I720i6483A03292b43119m2564K8039A9251
$$ plain form
9531 276805 209928 -215483 218336 -204252 46363 -278235 91967 -106989 59037 251714
9521 251714 -67426 -167606 171796 -218042 -18819 -59507 -225091 -322783 123654 -2507 -158809
9510 -158809 -109605 94948 93294 35686 46801 -121881 -276361 -89744 -3609 -534534 -7388 -214324
9498 -214324 -256427 -207425 31164 -150989 -198035 11088 -247588 -199355 -149254 123462 58014
9486 262746 -492127 129723 7854 244318 -118965 -356918 -69884 -140982 -255521 102704
9475 -327920 257686 -284964 -197028 236477 3892 140464 141158 35745 -353297 -18762 -320979
9464 -320979 180598 8159 -260275 7866 35584 -21151 108366 274182 -90040 -207555 46115
9452 -158240 98844 178515 432586 47246 -269902 -21565 -134718 -75475 -140304 291977 354837
$$ packed form
9531B76805o6877b15483B18336b04252D6363b78235I1967a06989E9037J92677
9521B51714f7426j00180A71796b18042a8819m0688j65584r7692A23654b507j56302
9510a58809M9204I4948j654C5686J1115a21881j54480h9744c609n30925g388k06936
9498b14324m2103M9002C1164a50989m7046A1088b47588M8233N0101A23462E8014
9486B62746d92127A29723G854K36464a18965k37953f9884p1098j14539A02704
9475c27920B57686b84964Q7936B36477C892J36572O94C5745c53297a8762l02217
9464c20979A80598H159b60275G866K7718b1151A08366J65816i0040j17515D6115
9452a58240I8844P9671K54071D7246b69902b1565j13153N9243o4829B91977O2860
$$ plain form
9441 354837 86325 -293702 -355314 -145186 -136773 -82321 166651 -203454 190734 210106 -101251
9429 195690 -206061 247324 426645 -195920 -70002 -155455 -172716 -44866 -110619 14864 -18244
9417 15574 173980 394167 50862 176735 221686 191114 -259084 -50358 -71920 -101799 86402
9405 -94300 275158 -132338 148439 274093 -161962 -116206 -302171 -289477 -72943 -30089 -290336
9394 -290336 30658 187782 -207529 -25540 23746 35383 -125168 98463 -317082 -39296 -145158
9383 -145158 -62255 -209510 31634 -88344 -157236 -111044 -51271 -247841 71931 -191691 -207942
9372 -207942 -72103 -246874 234578 -272332 -197496 -46287 -358654 178103 -9336 42302 215901
9361 215901 -180268 76827 34837 -314980 228493 82536 -10884 192782 -312015 59549 -361336
$$ packed form
9441C54837H6325b93702o1612a45186Q413N4452A66651b03454A90734J9372a01251
9429A95690b06061B47324J79321a95920g0002q5453j7261d4866o5753A4864a8244
9417A5574J58406K20187E0862J25873M4951l0572b59084e0358k1562k9879H6402
9405i4300B75158a32338A48439J25654a61962M5756j85965J2694g2943c0089k60247
9394b90336C0658J57124b07529b5540B3746J1637a25168I8463c17082c9296j05862
9383a45158f2255j47255C1634h8344o8892M6192e1271j96570G1931a91691j6251
9372b07942g2103j74771B34578b72332P4836d6287l12367A78103i336D2302J73599
9361B15901a80268G6827C4837c14980B28493H2536a0884A92782c12015E9549c61336
$$ plain form
9349 -203349 62595 110607 262210 -352845 200705 56592 292733 91946 -195044 -106777 -179260
9338 -179260 -222550 -59750 -200119 -165237 47530 240949 313744 -31031 79259 -252058 -218012
9327 -218012 -123448 -194260 1867 -46818 -58390 -99583 138288 -136243 -158036 35917 -178990
9315 -40673 280583 124173 -7656 -193067 -251993 -125768 -208361 129618 145370 -188116 46594
9303 -58252 -92395 -249788 -208842 -163940 -84918 -99260 -386251 -416605 80145 -155820 -57184
9291 -105168 58378 -123829 84449 16877 -57819 318802 -391924 -28505 54128 21400 104340
9280 104340 33381 19316 12586 93571 -74649 -100046 -62367 171289 195216 152386 90264 -170742
9267 -239605 -162343 -198912 157024 -112472 -37524 -91307 -306016 229300 176985 82702 -111443
$$ packed form
9349b03349F2595M8012J51603c52845B00705E6592K36141I1946a95044Q8267p2483
9338a79260m3290e9750j40369L4882D7530J93419P2795c1031G9259b52058L4046
9327b18012R4564p0812A867d6818j1572m1193A38288a36243k1793C5917a78990
9315d0673B80583A24173g656j85411n8926a25768q2593A29618J5752a88116D6594
9303e8252l4143j57393M0946M4902P9022j4342k86991l0354H0145a55820e7184
9291a05168E8378a23829H4449A6877e7819C18802c91924b8505E4128B1400Q2940
9280A04340C3381j4065o730Q0985g4649k5397L7679A71289K3927m2830o2122a70742
9267b39605P7262l6569A57024a12472c7524n3783k14709B29300n2315H2702a11443
$$ plain form
9255 -188487 -394830 38153 -321008 -5118 -330863 302186 -349534 -139549 -60645 -33415 -58479
9244 -58479 -172041 229941 162765 -38804 198480 -240417 256382 -423473 -326023 -30768 -277447
9233 -277447 201400 -76048 -128557 47218 207102 -225117 81164 -73363 -262576 -87770 -355171
9222 -355171 -40411 -402186 49825 -94106 -94935 69886 -162163 269374 -257508 68880 -51230
9210 -189305 62496 -35403 218071 -39547 173095 -15564 42705 123453 211241 -32865 105704
9198 -225951 185779 372825 -146 -57808 117471 -130425 108104 -190625 -293679 -78475 12535
9186 233910 -99207 -321472 -13643 -27492 -276355 -9564 -10340 -6518 -322784 -32916 93947 -323812
9173 -48219 -96552 58013 -128908 255766 -110777 -272115 -276357 -280743 -75974 -258251 90866
$$ packed form
9255a88487k06343C8153c21008e118l25745C02186c49534a39549f0645K7230k5064
9244e8479j13562B29941o7176c8804A98480b40417B56382d23473R7450c0768k46679
9233b77447B01400g6048n2509D7218J59884b25117H1164g3363j89213h7770k67401
9222c55171d0411l61775D9825i4106q29F9886a62163B69374b57508F8880e1230
9210a89305F2496c5403B18071c9547A73095a5564D2705Q0748Q7788c2865A05704
9198b25951A85779J87046a46n7662A17471a30425A08104a90625j03054g8475A2535
9186B33910i9207k22265a3643j3849k48863i564p76L822l16266c2916I3947c23812
9173d8219m8333E8013a28908B55766a10777j61338m242m386g5974j82277I0866
$$ plain form
9161 110692 6852 -239158 -33650 -236756 -121866 -250372 94992 45736 217159 239982 -89613
9149 -80780 -375337 25797 -27750 -284587 -101483 -203139 -206242 -156383 -286311 -45348 -138733
9138 -138733 162892 267979 206164 6563 123359 -301574 13497 164971 46760 -12599 65846
9126 83647 43703 -79528 -118433 -352743 -275355 213185 -130831 248957 79296 -271516 -118064
9114 -2992 -69484 -190686 -40202 -406774 9885 -173402 -176594 1752 -91737 -63315 -64620 37277
9101 183813 -40954 -307386 191320 6310 -122993 -27593 227127 156270 -109172 -295883 -147395
9089 150486 379307 78086 -2414 -228785 -147385 12435 -17860 -177072 90832 234187 23873
9077 8581 411515 57134 -114967 124459 -28278 78739 -86758 -37633 -133948 -250524 18852
$$ packed form
9161A10692F852b39158c3650k03106J14890j28506I4992D5736J71423K2823h9613
9149h0780k94557B5797b7750k56837a01483j01656l103M9859j29928d5348r3385
9138a38733A62892J05087o1815F563J16796c01574A3497J51474D6760a2599F5846
9126H3647l9944g9528l8905k34310P7388B13185a30831B48957G9296b71516a18064
9114b992o6492j21202d0202l66572I885a73402l192A752i1737K8422j305C7277
9101A83813d0954k66432A91320F310a22993b7593B27127p0857a09172j86711a47395
9089A50486K28821G8086b414k26371Q1400A2435a7860j59212I0832J43355B3873
9077H581M02934E7134a14967A24459b8278G8739h6758c7633r6315j16576A8852
$$ plain form
9065 -110846 152433 -152684 -25111 -222195 -34403 -22086 -216428 -102269 -71110 172586
9054 -187017 91215 -233915 -99170 73282 -303380 -26733 -261142 -210405 122337 37361 -38478
9042 -267314 -6546 -129759 -17881 -241337 -161213 -172050 -164192 145464 -142816 235042 -112032
9030 -114107 -161674 -142859 239329 -61774 -114718 296155 -139587 -57512 -106218 -131781 -488397
9019 -488397 -57626 273897 -44607 -349833 -156952 158954 97024 -137235 -25363 174356
9008 97905 -146775 -188261 -109229 43315 -108029 4319 -231978 150149 103225 -45906 -170230
8997 -170230 103316 -66385 330181 236046 -18062 -68737 38531 53430 -379334 50228 -251056
8985 -208745 -165807 -146411 -55856 20229 106837 -231647 129576 -163480 129891 194293 -438219
$$ packed form
9065a10846A52433a52684b5111j97084c4403J2317j94342a02269L1159A72586
9054a87017I1215b33915i9170G3282c03380b6733k34409N0737A22337C7361c8478
9042b67314f546j23213a7881k23456Q0124j0837P858A45464a42816B35042a12032
9030a14107m7567J8815B39329f1774n2944B96155a39587e7512m8706k5563l56616
9019d88397e7626B73897d4607l05226a56952A58954o1930a37235b5363A74356
9008I7905a46775m1486P9032D3315a08029D319b31978A50149m6924d5906j24324
8997a70230A03316f6385C30181r4135a8062n0675C8531J4899c79334E0228b51056
8985b08745M2938J9396e5856B0229Q6608b31647A29576a63480A29891O4402d38219
$$ plain form
8973 -499435 240416 -92901 94088 -128589 70111 -436739 -48067 -456899 -8725 -455496 -155754
8961 -69330 22291 -70747 308094 59816 -263856 -134298 -158109 260720 101186 97222 59248
8950 59248 -236507 -25154 -262899 -228347 -155164 -2536 5851 -163070 -5377 -21813 69570 197169
8938 197169 -45781 46163 -254153 -211369 -201281 52478 -196299 -132915 35446 -54436 -90219
8927 -90219 126845 -136585 -116204 -45739 260409 1494990 2932236 788794 187484 155915
8917 155915 -13052 -3129 -89853 241331 114581 187761 180332 -252407 263951 -29474 180006
8905 -339101 -291597 135427 31802 -80502 -130063 -84603 -130729 -52028 -129543 -324898 -15709
8893 -137846 34015 -205063 -3338 -484283 -13998 -454649 -228965 -159985 -113701 -253633 -212003
$$ packed form
8973d99435B40416i2901I4088a28589G0111d36739d8067m08832h725m46771a55754
8961f9330B2291g0747C08094E9816b63856J29558k3811B60720A01186l964l7974
8950E9248b36507b5154k37745L4552P3183b536E851a63070e377j6436F9570J27599
8938A97169d5781D6163b54153M2784J0088E2478a96299O3384C5446e4436l5783
8927i0219A26845a36585K0381d5739B60409J234581J437246G88794A87484l1569
8917A55915a3052c129q6724B41331A14581P3180p429b52407B63951b9474A80006
8905c39101M7504A35427C1802h0502m9561M5460m6126e2028p7515j95355a5709
8893a37846C4015b05063c338m80945a3998m40651K25684O8980M6284j39932M1630
$$ plain form
8882 -212003 121036 53198 8856 -407091 94235 -101080 -223143 -249444 -67590 -29116 31200
8870 -52619 -101684 -426010 84868 -29243 39087 438518 -226877 17397 -327190 138560 -89426
8858 -60669 203323 -104728 -41460 -56841 -76758 -6118 30672 -42483 -65509 -74580 -201083 69922
8845 -229992 -33107 -138674 -122693 27615 -257880 -155942 -119891 -86127 158230 8874 133120
$$ packed form
8882b12003A21036E3198H856d07091I4235a01080j22063k6301f7590b9116C1200
8870e2619m9065l24326H4868b9243C9087L99431b26877A7397c27190A38560h9426
8858f0669B03323a04728d1460j5381j9917f118C0672d2483k3026r071j26503F9922
8845b29992c3107j05567J5981B7615b57880J01938L6051L3764A58230H874J24246
$$ [...]
##END NTUPLES=NMR SPECTRUM
##END=
