##TITLE=AC1418_SALAH12228_7764077_btbhybD9DB
##JCAMPDX= 6.0         $$ Bruker NMR JCAMP-DX V2.0
##DATA TYPE= NMR SPECTRUM
##DATA CLASS= NTUPLES
##ORIGIN= BRUKER
##OWNER= Administrator
$$ 1.72 TOPSPIN		Version 2.1
$$ 2013-04-11 18:22:16.953 -0700  Administrator@X
$$ Compression mode = diff/dup
##.OBSERVE FREQUENCY= 400.02188249412
##.OBSERVE NUCLEUS= ^1H
##.ACQUISITION MODE= SIMULTANEOUS (DQD)
##.ACQUISITION SCHEME= undefined
##.AVERAGES= 8
##.DIGITISER RES= 22
##SPECTROMETER/DATA SYSTEM= spect
##.PULSE SEQUENCE= zg30
##.SOLVENT NAME= COFFEE_meoh
##.SHIFT REFERENCE= INTERNAL, COFFEE_meoh, 1, 14.98509
##AUDIT TRAIL= $$ (NUMBER, WHEN, WHO, WHERE, PROCESS, VERSION, WHAT)
$$ ##TITLE= Audit trail, TOPSPIN		Version 2.1
$$ ##JCAMPDX= 5.01
$$ ##ORIGIN= Bruker BioSpin GmbH
$$ ##OWNER= Administrator
$$ $$ E:\/data/COFFEE/nmr/AC1418_SALAH12228_7764077_btbhybD9DB/10/pdata/1/auditp.txt
$$ ##AUDIT TRAIL=  $$ (NUMBER, WHEN, WHO, WHERE, PROCESS, VERSION, WHAT)
(   1,<2013-04-11 18:22:07.109 -0700>,<Administrator>,<X>,<go>,<TOPSPIN 2.1>,
      <created by zg
	started at 2013-04-11 18:21:01.328 -0700,
	POWCHK enabled, PULCHK disabled,
       configuration hash MD5:
       33 CF 6A 21 5C D3 B9 40 6C 15 AA 8D 27 A2 4F 13
       data hash MD5: 64K
       29 13 F3 3B 15 B4 57 17 23 D3 E6 78 2E 38 B9 0E>)
(   2,<2013-04-11 18:22:10.328 -0700>,<Administrator>,<X>,<proc1d>,<TOPSPIN 2.1>,
      <Start of raw data processing
       efp LB = 0 FT_mod = 6 PKNL = 1 PHC0 = 0 PHC1 = 0 SI = 32K 
       data hash MD5: 32K
       75 12 B6 98 E3 77 A0 99 D3 C5 13 8A EB 21 B5 5C>)
(   3,<2013-04-11 18:22:10.797 -0700>,<Administrator>,<X>,<proc1d>,<TOPSPIN 2.1>,
      <pk PHC0 = 98.53638 PHC1 = 0 
       data hash MD5: 32K
       66 09 F3 A7 26 ED E2 84 BF B4 63 D7 38 7B 24 B9>)
(   4,<2013-04-11 18:22:11.031 -0700>,<Administrator>,<X>,<proc1d>,<TOPSPIN 2.1>,
      <abs ABSG = 1 
       data hash MD5: 32K
       E0 E3 41 6E 48 43 07 2D 4C 46 40 2A C6 72 6B 2A>)
(   5,<2013-04-11 18:22:11.172 -0700>,<Administrator>,<X>,<proc1d>,<TOPSPIN 2.1>,
      <abs ABSG = 2 
       data hash MD5: 32K
       3B BE 1C 88 04 17 5E D6 29 54 01 4C 15 F3 50 0C>)
(   6,<2013-04-11 18:22:11.328 -0700>,<Administrator>,<X>,<proc1d>,<TOPSPIN 2.1>,
      <abs ABSG = 3 
       data hash MD5: 32K
       49 4E 19 F2 50 15 82 5F 74 2D D3 CE 34 B0 96 08>)
(   7,<2013-04-11 18:22:11.468 -0700>,<Administrator>,<X>,<proc1d>,<TOPSPIN 2.1>,
      <abs ABSG = 4 
       data hash MD5: 32K
       1C 80 F9 54 6F E0 65 14 21 02 59 82 BA 08 3A 98>)
(   8,<2013-04-11 18:22:11.625 -0700>,<Administrator>,<X>,<proc1d>,<TOPSPIN 2.1>,
      <abs ABSG = 5 
       data hash MD5: 32K
       C0 D1 D0 B8 42 2A 0D 36 35 23 09 C4 32 07 47 A6>)
$$ ##END=
$$ 
$$ $$ hash MD5
$$ $$ FA ED 33 0F 5B 20 1E AC F2 B6 CB 1F 36 5C 3B 15
##$RELAX= 
##$RELAX= 
##$RELAX= 
##$RELAX= 
##$RELAX= 
##$RELAX= 
##$RELAX= 
$$ Bruker specific parameters
$$ --------------------------
##$DU= <E:\>
##$EXPNO= 10
##$NAME= <AC1418_SALAH12228_7764077_btbhybD9DB>
$$ [...]
##$TP= (0..7)
150 150 150 150 150 150 150 150
##$TP07= 0
##$TPNAME0= <>
##$TPNAME1= <>
##$TPNAME2= <>
##$TPNAME3= <>
##$TPNAME4= <>
##$TPNAME5= <>
##$TPNAME6= <>
##$TPNAME7= <>
##$TPOAL= (0..7)
0.5 0.5 0.5 0.5 0.5 0.5 0.5 0.5
##$TPOFFS= (0..7)
0 0 0 0 0 0 0 0
##$TUNHIN= 0
##$TUNHOUT= 0
##$TUNXOUT= 0
##$USERA1= <user>
##$USERA2= <user>
##$USERA3= <user>
##$USERA4= <user>
##$USERA5= <user>
##$V9= 5
##$VALIST= <valist>
##$VCLIST= <CCCCCCCCCCCCCCC>
##$VD= 0
##$VDLIST= <DDDDDDDDDDDDDDD>
##$VPLIST= <PPPPPPPPPPPPPPP>
##$VTLIST= <TTTTTTTTTTTTTTT>
##$WBST= 2048
##$WBSW= 25
##$XGAIN= (0..3)
0 0 0 0
##$XL= 0
##$YL= 0
##$YMAX_a= 604537
##$YMIN_a= -516177
##$ZGOPTNS= <>
##$ZL1= 120
##$ZL2= 120
##$ZL3= 120
##$ZL4= 120
##$ABSF1= 14.98509
##$ABSF2= -5.573092
##$ABSG= 5
##$ABSL= 3
##$ALPHA= 0
##$AQORDER= 0
##$ASSFAC= 0
##$ASSFACI= 0
##$ASSFACX= 0
##$ASSWID= 0
##$AUNMP= <proc_prof1d_extract_pilot.lims>
##$AXLEFT= 0
##$AXNAME= <>
##$AXNUC= <1H>
##$AXRIGHT= 0
##$AXTYPE= 0
##$AXUNIT= <>
##$AZFE= 0.1
##$AZFW= 0.1
##$BCFW= 0
##$BC_mod= 0
##$BYTORDP= 0
##$COROFFS= 0
##$CY= 15
##$DATMOD= 1
##$DC= 0
##$DFILT= <>
##$DTYPP= 0
##$F1P= 0
##$F2P= 0
##$FCOR= 0.5
##$FTSIZE= 32768
##$FT_mod= 6
##$GAMMA= 0
##$GB= 0
##$INTBC= 1
##$INTSCL= 1
##$ISEN= 128
##$LB= 0
##$LEV0= 0
##$LPBIN= 0
##$MAXI= 10000
##$MC2= 0
##$MEAN= 0
##$ME_mod= 0
##$MI= 0
##$NCOEF= 0
##$NC_proc= -8
##$NLEV= 6
##$NOISF1= 0
##$NOISF2= 0
##$NSP= 0
##$NTH_PI= 0
##$NZP= 0
##$OFFSET= 14.98509
##$PC= 1
##$PHC0= 98.53638
##$PHC1= 0
##$PH_mod= 1
##$PKNL= yes
##$PPARMOD= 0
##$PPDIAG= 0
##$PPIPTYP= 0
##$PPMPNUM= 2147483647
##$PPRESOL= 1
##$PSCAL= 4
##$PSIGN= 0
##$PYNMP= <proc.py>
##$REVERSE= no
##$SF= 400.02
##$SI= 32768
##$SIGF1= 0
##$SIGF2= 0
##$SINO= 400
##$SIOLD= 32768
##$SPECTYP= <>
##$SREGLST= <1H.CDCl3>
##$SSB= 0
##$STSI= 32768
##$STSR= 0
##$SW_p= 8223.68421052631
##$SYMM= 0
##$S_DEV= 0
##$TDeff= 65536
##$TDoff= 0
##$TI= <>
##$TILT= no
##$TM1= 0
##$TM2= 0
##$TOPLEV= 0
##$USERP1= <user>
##$USERP2= <user>
##$USERP3= <user>
##$USERP4= <user>
##$USERP5= <user>
##$WDW= 1
##$XDIM= 32768
##$YMAX_p= 457409254
##$YMIN_p= -742083
##$CURPLOT= <Network HP LaserJet P1505>
##$CURPRIN= <$Network HP LaserJet P1505>
##$DFORMAT= <normdp>
##$LAYOUT= <+/1D_H.xwp>
##$LFORMAT= <normlp>
##$PFORMAT= <normpl>
##$SURQMSG= 1
$$ End of Bruker specific parameters
$$ ---------------------------------
##NTUPLES= NMR SPECTRUM
##VAR_NAME=  FREQUENCY,     SPECTRUM/REAL,   SPECTRUM/IMAG
##SYMBOL=    X,             R,               I
##VAR_TYPE=  INDEPENDENT,   DEPENDENT,       DEPENDENT
##VAR_FORM=  AFFN,          ASDF,            ASDF
##VAR_DIM=   32768,         32768,           32768
##UNITS=     HZ,            ARBITRARY UNITS, ARBITRARY UNITS
##FACTOR=    0.250966925370066, 1,           1
##FIRST=     8223.43324360094, 16051,        38952
##LAST=      0,             -180136,         -10769
##MIN=       0,             -742083,         0
##MAX=       8223.43324360094, 457409254,    0
$$ Real data points
##PAGE= N=1
##DATA TABLE= (X++(R..R)), XYDATA
$$ [...]
19553E2441J76053k068a40131j05972G2373h4231l1500d6742p6208N7194o8845
19542a34601o3413A80009p1082J800J45612a41702e2903B5276P1950c79074a50083
19530C27999f4411e276l17444F4002q915c6333k20393O6876j69293A1835K0989
19519C2824c1809d417k01842a0212B65503a89038P1729A39962E1754D270c02594
19507A57003M616L0454F83M9640a98377A3844J11673b82880R9733j64857a1817
19495B8061a19535A28536i5612r7129j45687B28050A13015J52399q2173c31621
19484E2954J5308b94424M5642B7320a39079f2449o1777j4887A39574b46840k99502
19473e46342a50862I2780c68629C895Q5882a27195H6377a2430C7171J37880a58104
$$ y = [52441, 228494, 226426, -140131, -246103, 72373, -84231, -115731, -46742, -122950, -65756, -134601, -198014, 180009, 108927, 110727, 256339, -141702, -52903, 25276, 97226, -379074, -150083, 327999, -64411, -5276, -322720, 64002, 55087, -36333, -256726, -189850, -359143, 11835, 32824, -31809, -4417, -206259, -10212, 265503, -189038, -117309, 139962, 51754, 4270, -302594, 157003, 161619, 192073, 683, 50323, -198377, 13844, 125517, -282880, -183147, -348004, -11817, 28061, -119535, 128536, -95612, -192741, -338428, 228050, 113015, 265414, 183241, -331621, 52954, 68262, -294424, -248782, 27320, -139079, -62449, -124226, -139113, 139574, -246840, -546342, -150862, 92780, -368629, 3895, 89777, -127195, 86377, -12430, 37171, 175051, -158104]
19461A42657n6042d4555C6564O0139M5455R3955a22918j03748i536B78931a61946
19449f7436A60401a59175J396C13660a27707A08664a37285B07118d04387A00720
19438D5549b92324a9484n91308a21365l41454D1867a32590l6942q9450g9317B34420
19426d982k39859C8180c90014e8488k20591C066a48348n427M7248j5349A13765
19414a7567l2728m45050J57310J18655A00589L4348m6605A1111c77664B33558
19403b09578c7622j1400B5230a73765g5507q4355l291N6115C02472A38888L440
19392A42328P1293f4002j5112D3261N0815L6109m5337a62573f2593k25236F6975
19380B2716K9037K6813b5453H3119K6933b73010L5069D1845b31591k6043J05080
$$ y = [142657, 86615, -44555, 36564, 96703, 142158, 236113, -122918, -226666, -9536, 278931, -161946, -67436, 160401, -159175, -157779, 313660, -127707, 108664, -137285, 207118, -404387, 100720, 45549, -292324, -19484, -610792, -121365, -462819, 41867, -132590, -169532, -258982, -79317, 234420, -4982, -244841, 38180, -390014, -58488, -279079, 3066, -148348, -153775, -106527, -121876, 113765, -17567, -50295, -495345, -338035, -219380, 100589, 134937, 88332, 11111, -377664, 233558, -209578, -37622, -49022, 25230, -173765, -75507, -159862, -163153, -107038, 302472, 138888, 142328, 213621, -64002, -79114, 43261, 94076, 130185, 84848, -162573, -62593, -287829, 66975, 22716, 51753, 78566, -25453, 83119, 110052, -273010, -237941, 41845, -231591, -257634, -152554]
19369a52554K7061G0392A0882f1856l84077G0033K10047b23837A6493J2028K08963
19358B37484b11390j57295a74849g799B42172p4585b18370J06880j33119a3463
19347a62348A83631b6413j69729L8198B09111l3214a0918j84053E5594b22374
19336h2572E2954d11823f8685B10919J21901a65339G7423a24337j05006B65542
19325b71201C53382d1686A33254c42285B60210D1443J22464d77968a46307e5074
19314a54727a0370A82984a92923k11476e2234j78820O1674r430A03450e7193n6924
19303a14117a0824c015G9470a32653q494j59648k2511e7817B3150K2992c4541
19291c98167a68781C26050A0769a47014L9480J7920E4775i4055b0871F4031c45262
$$ y = [-152554, -125493, 70392, 10882, -61856, -445933, 70033, 280080, -223837, 16493, 28521, 237484, -211390, -368685, -174849, -7799, 242172, 167587, -218370, -111490, -244609, -13463, -162348, 183631, -26413, -196142, -157944, 209111, 175897, -10918, -194971, 55594, -222374, -82572, 52954, -411823, -68685, 210919, 332820, -165339, 77423, -124337, -229343, 265542, -271201, 353382, -41686, 133254, -342285, 260210, 41443, 163907, -477968, -146307, -55074, -154727, -10370, 182984, -192923, -404399, -52234, -231054, -169380, -178810, 103450, -57193, -114117, -10824, -3015, 79470, -132653, -141147, -300795, -323306, -57817, 23150, 46142, -34541, -398167, -168781, 326050, 10769, -147014, -107534, -89614, 54775, -94055, -20871, 64031, -345262]
19279A08286A50b37663J15887o5613C5536P2797a05128B17671F4666f7180k13715
19268b80895a23205p1323G8651J58646c7269A6728A435b8821G5198a76933C59632
19256A00402g7937J4394E9317J5864M4789b39308M7017i0292K7965A92733a42139
19244a53132o245C4591m071M04620b1662l75576B75616g3578A4297K29901C1665
19232b7161p4487A28791a31326K0245M1524j10853r4031c3111k54540i0561N759
19221h4802j78719A36665a4220A61922c50091h6944J3627p8935A19461b4119A54502
19209a48001A12680i1444D4867b29378N8104A11269K1073j3123P2915b66038D2116
19197b08697O0853l20365i8769l0099m0519b7187C26945F8273d2838k26568g3580
$$ y = [108286, 150, -237663, -121776, -187389, 35536, 108333, -105128, 217671, 64666, -67180, -280895, -123205, -194528, 78651, 237297, -37269, 16728, 1435, -28821, 75198, -176933, 359632, 100402, -77937, -63543, 59317, 75181, 119970, -239308, -192291, -90292, -62327, 192733, -142139, -153132, -159377, 34591, 30520, 435140, -21662, -397238, 275616, -73578, 14297, 244198, 31665, -27161, -101648, 128791, -131326, -111081, -69557, -180410, -274441, -33111, -287651, -90561, -84802, -263521, 136665, -14220, 161922, -350091, -86944, -73317, -152252, 119461, -24119, 154502, -148001, 112680, -91444, 44867, -229378, -171274, 111269, 132342, 119219, 192134, -266038, 42116, -208697, -147844, -468209, -98769, -128868, -169387, -27187, 326945, 68273, -42838, -269406, -73580]
19185a97668N0102p412C5327d0260R412j34308O3890I8261b01043O8415d4142
19173d0802j9306j71296B42347c2062A98814a90856A26501a25781A50802b82624
19162b03491a2167j54027C534i5465A92478f2776J06J1865o540k40662h8117l19974
19150d08091D8013d6247E776L7616P355A8029K26145a15217H1455d19288A43716
19138C9002e3630b4953J2271A91376a52725G3180J02211b72125j8174C3810c14032
19126F6065J6697j987J39697a24259o3183k4313j84854I668a75352A42686C2839
19114A87631b1682j11764A5123e0968j61252d8080A08066h6920k97262C5042j1803
19103B3239h6417j40368R9244A29107a27764q7527e4425B8006K0793a17413a5645
$$ y = [-197668, -147566, -154978, 35327, -40260, -30848, -165156, -101266, 98261, -201043, -132628, -44142, -40802, -60108, -231404, 242347, -32062, 198814, -190856, 126501, -125781, 150802, -282624, -203491, -12167, -166194, 3534, -95465, 192478, -62776, -62670, -50805, -57345, -298007, -88117, -408091, 48013, -46247, 5776, 43392, 50747, 18029, 244174, -115217, 81455, -419288, 143716, 39002, -53630, -24953, -12682, 191376, -152725, 73180, 175391, -272125, -290299, 33810, -314032, 66065, 82762, 80775, 220472, -124259, -187442, -211755, -396609, 9668, -175352, 142686, 32839, 187631, -21682, -133446, 15123, -50968, -212220, -48080, 108066, -86920, -384182, 35042, 23239, -86417, -226785, -127541, 129107, -127764, -215291, -54425, 28006, 48799, -117413, -15645]
19091F3613b25277M429k0158J07055n9266Q6713j15140I3401h6179l5860C04675
19079A12419b52109D6071a04234B12759r3999b11219h7579A98171G4755A4869
19068c4791k44449i0427j27751f1223A77204C2913c7812A52488d3696k51634J31519
19057a63811g3764F3036b17689a1560E688d40694F1348b31965B2668a28739j19258
19046b47997F0029a07634j28300j37685A91633J66736N4098k547A10921b68434
19035a86945j8026d4474A8795L65171G9956K47629a54228e9508l62125A50609
19024B5074Q8508a36059m8609a1137j11316R54r556m3252F2021c2606j41174h957
19011a92237D145R8749a84356A14909b56330f9316K159o88E325h8935b0971j99301
$$ y = [63613, -225277, -220848, -241006, -133951, -193217, -106504, -221644, 93401, -86179, -122039, 304675, 112419, -252109, 46071, -104234, 212759, 118760, -211219, -87579, 198171, 74755, 14869, -34791, -279240, -90427, -218178, -61223, 177204, 32913, -37812, 152488, -43696, -295330, -163811, -73764, 63036, -217689, -11560, 5688, -440694, 61348, -231965, 22668, -128739, -247997, 60029, -107634, -235934, -373619, 191633, 358369, 412467, 409920, 110921, -268434, -186945, -204971, -44474, 18795, 383966, 79956, 327585, -154228, -59508, -421633, 150609, 25074, 113582, -136059, -184668, -11137, -122453, -121499, -131055, -174307, 62021, -32606, -173780, -8957, -192237, 4145, 102894, -184356, 114909, -256330, -69316, -67157, -67845, 5325, -88935, -20971, -220272]
18999b20272C2965K52467a975A60042b14880j09781a10133j6361n6355L8451H9184
18987A4637b79726B8792a54053a3702A14783P842Q2010r6199c9201A06645b30197
18975I1115h8431A8345J12985E9001d0412l1855A9201a31344r5997a994q0373
18964h2367r9747N0577J1789e7446a8943B8368J28104b14731J03050A5236a97129
18952A3031R2463a80666c3823k37902p3367a02750r905C33350g3630A14115l3172
18941H0943O7204f6828C5812g9796f622I0b11571A38378D2913J99358q7694P5376
18929B29953a74890l3066g2530j1087A87855q2257a08323E3644b88548J15615
18919a72933n2643l5782O9881H441K5820c40407B50399A04778b11646k7976B16070
$$ y = [-220272, 32965, 285432, -1975, 160042, -214880, -324661, -110133, -126494, -182849, -144398, 89184, 14637, -279726, 28792, -154053, -13702, 114783, 122625, 204635, 108436, -39201, 106645, -230197, 91115, -88431, 18345, 131330, 59001, -40412, -72267, 19201, -131344, -227341, -1994, -82367, -182114, -131537, -119748, -57446, -18943, 28368, 156472, -214731, -111681, 15236, -197129, 13031, 105494, -180666, -33823, -271725, -345092, -102750, -112655, 333350, -73630, 114115, 80943, 148147, -66828, 35812, -79796, -6622, 90, -211571, 138378, 42913, 242271, 154577, 229953, -174890, -207956, -72530, -83617, 187855, 105598, -108323, 53644, -288548, -172933, -225576, -261358, -191477, 8441, 34261, -340407, 250399, 104778, -211646, -239622, 216070]
18907I2917c0247C0591a86712H3336b28989O0721A6341a27230F1390a88042B10645
18895A78254K04100I4834m426a07349k5902D4848g0668A18618a12651F6524e5777
18883B87694b15126R1687c5540A62390b67531i7332e983C19470A27548n6318K36084
18872C07314E8371a99330D9907a3482N603j93976f672o6026p075k11621m00409
18861f91803a54131J7401e1792F8248a29379a7944B5025b52691f7012B75956b8145
18849a1535n2194q2028L2747d6683j42974h4943J009r4994a5312B43237i5063
18837h8141j71686F8549c16733K6137P6425f6364A94085a21469C0805i388m0613
18826e0001l90575B5936J77017d3531A19705M9448o9243J01230a62262H9112Q901
$$ y = [92917, -30247, 30591, -186712, 83336, -228989, -168268, 16341, -127230, 61390, -188042, 210645, 178254, 382354, 94834, 90408, -107349, -133251, 44848, -70668, 118618, -112651, 66524, -55777, 287694, -215126, -123439, -35540, 162390, -267531, -97332, -5983, 319470, 127548, 71230, 307314, 58371, -199330, 49907, -13482, -7879, -201855, -6672, -72698, -79773, -291394, -691803, -154131, -136730, -51792, 68248, -129379, -17944, 25025, -252691, -67012, 275956, -28145, -11535, -63729, -145757, -113010, -46683, -189657, -84943, -83934, -178928, -15312, 243237, -95063, -88141, -259827, 68549, -316733, -290596, -214171, -66364, 194085, -121469, 30805, -9388, -50001, -440576, 25936, 202953, -43531, 119705, 169153, 99910, 201140, -162262, 89112, 98013]
18815I8013k0239a12149B84388A03772K38428a47858A50030A8410J04285c9332
18804G7206L0729J84257a30035p8886F1016J41189f8007k05584a7803E2764h4444
18792H482J75707o9465F48a95778a1802j47261q503i7j89204K1165g2944j94845
18780b67789H2272J94924b50542e5615A95371c76745A04466P8531h1658n0357
18770a32015m06L5848b1269B34056a58463Q847p6547P3061O2252K1681A22098
18758A42910b09710O6571j20105A37313J03697j04790C3425c13284A67895J36684
18748C04579f3114j0521k93410a37708I8838O1639d3594A30964o1799i6175B4636
18736b91811A6317L57521G0667A4437h1063c3582k68858R4868O2035j78170c6178
$$ y = [98013, 77774, -112149, 284388, 103772, 342200, -147858, 150030, 18410, 122695, -39332, 77206, 107935, 292192, -130035, -208921, 61016, 202205, -68007, -273591, -17803, 52764, -84444, 8482, 184189, 114724, 648, -195778, -11802, -159063, -167566, -97, -189301, -168136, -72944, -267789, 82272, 277196, -250542, -55615, 195371, -376745, 104466, 182997, -81658, -132015, -132421, -96573, -21269, 234056, -158463, -149616, -226163, -153102, -90850, -69169, 122098, 142910, -209710, -143139, -263244, 137313, 241010, 136220, 33425, -313284, 167895, 304579, -63114, -73635, -367045, -137708, 98838, 160477, -43594, 130964, 69165, -96175, 24636, -291811, 16317, 373838, 70667, 14437, -81063, -33582, -302440, -207572, -145537, -323707, -36178]
18724B7155d11904a19634m1352l2364D0710d2130F710a01667C1564c10773B37549
18712e20183b09738J8317j68454P7017J08891j74174J7216A29409e9958B27687
18701a23874a8133G2477c83585J53010a6370B41429K7776E117d00928J98072E5861
18689B81686c30165a16043P568k26509b1591j97303g2658o1853B031J81423a02567
18677F6121L5593b43128M7772n3897J02997C58442a25283E2388L77197a57632
18666A46990K7339i1013j07419a2349j7018A01024c95535a12006A41288A4380
18655F5897h3890c1916H5893I86K92752H1670O6673J9115K26160I5202h5712j10255
18643a95967f5747p1090B88452A41901J17582d6403k50739J47046B53987h6445
$$ y = [27155, -411904, -119634, -160986, -193350, 40710, -42130, 6710, -101667, 31564, -310773, 237549, -520183, -209738, -191421, -359875, -282858, -173967, -348141, -330925, 129409, -59958, 227687, -123874, -18133, 72477, -383585, -230575, -16370, 241429, 269205, 5117, -400928, -202856, 55861, 281686, -330165, -116043, -108475, -334984, -21591, -218894, -72658, -134511, 2031, 183454, -102567, 66121, 101714, -243128, -195356, -249253, -146256, 358442, -125283, 52388, 429585, -157632, 146990, 174329, -91013, -198432, -12349, -29367, 101024, -395535, -112006, 141288, 14380, 65897, -83890, -31916, 85893, 986, 293738, 81670, 148343, 167458, 393618, 95202, -85712, -195967, -65747, -136837, 288452, 141901, 259483, -46403, -297142, -150096, 253987, -86445]
18632i1987J5034B12671b03434M0113j12691I6233J09251f0045E1540b29126A66282
18620f4494j36561N8684j0410A11588h9681J4633D4244c74376A7187h7546L7232
18609e0314l6729D17068b47648d049m62l5348l7932n7196B57683c2611i954C70390
18596B85264a34091O2204r1062A58829G1673a38839c3715q252r1428n8395F836
18584e82253F4902N366b29988A41121k9301a52734j37549A04252I831a52470p1498
18573b23968K2993e7859H812a34190m6659A7382L52630j83402g1604k5742D273
18561a57489A29244a78821J35a7828n3744G9652e20339A24732D8928J81225a27275
18549a06621b9953l28506a17215k30943G0272c69005a1581A2601b23045d371k29843
$$ y = [-91987, -76953, 212671, -203434, -163321, -276012, 96233, 205484, -60045, 51540, -229126, 166282, -64494, -201055, -142371, -152781, 111588, -89681, -75048, 44244, -374376, 17187, -87546, -50314, -87043, 417068, -247648, -4049, -4511, -39859, -77791, -134987, 257683, -32611, -9954, 370390, 285264, -134091, -71887, -162949, 158829, 71673, -138839, -33715, -41967, -133395, -191790, 6836, -582253, 64902, 70268, -229988, 141121, 111820, -152734, -290283, 104252, 9831, -152470, -223968, -200975, -57859, 8812, -134190, -180849, 17382, 370012, 186610, -71604, -97346, 4273, -157489, 129244, -178821, -178686, -17828, -71572, 79652, -520339, 124732, 48928, 230153, -127275, -106621, -29953, -358459, -117215, -348158, 70272, -369005, -11581, 12601, -223045, -4371, -234214]
18538b34214d5323l8236C18197G308a44588j165k26894E3473a16495k33586a47842
18526A49459m2641D4928c7020p1402E5939b1354k74006a26150L4589c938j09025
18515a12963F9010d4633G2075M4661f3136j53730R6985A9680a93907n2391D71541
18503a38609o8505G3289B5335J98370n8928a7824H9739M6355l7486B4915a58696
18491A66068J3305a11325A07258e6638q1920j79602a25431A84269C4860a06161
18480a95370j56065A03963b78879E3540b06803g2063j67544h666j86761e8057
18469g2512A07550a22017k45967J54657d111E7417a55806a3767n7661A13923P197
18458A21120i0549c3958B10232a38162A78038c38407j12743J95958d0109B31355
$$ y = [-234214, -45323, -83559, 318197, 7308, -144588, -145753, -372647, 53473, -116495, -350081, -147842, 149459, 106818, 44928, -37020, -108422, 55939, -21354, -295360, -126150, -91561, -3938, -112963, 69010, -44633, 72075, 116736, -63136, -216866, -119881, 19680, -193907, -246298, 471541, -138609, -207114, 73289, 25335, 223705, 164777, -17824, 89739, 136094, 98608, 24915, -158696, 166068, 179373, -111325, 107258, -56638, -138558, -318160, -125431, 184269, 34860, -106161, -195370, -351435, 103963, -278879, 53540, -206803, -72063, -239607, -8666, -195427, -58057, -72512, 107550, -122017, -367984, -213327, -4111, 57417, -155806, -13767, -71428, 113923, 121120, -90549, -33958, 210232, -138162, 178038, -338407, -451150, -255192, -40109, 231355]
18447A41269b91470a23518j8156A65102F582L36509A15788j1732c3400l1622j50652
18436b15674L0084B06146b49456J16861o4000c5401q8569K844M8606L4877l1396
18425f9039p3616B12060b166A10997a20314N8869j02297K2778l0012A73841a13717
18413a53792N4177l26577I0633b06654j5315l12684a39p7928j71710L4226P6127
18402a39424A62533b6092m8253A17970d10683A05042C3326J26517g6361j97059
18392b73420A51504K1217a81355A8108A646P5402i7440i001A05257C3792M8074
18381H1866c45766p1980a69968B94a38726A71524h1595A79559h5331o393B92483
18369A01740a25802a1362A04721J49644A180a17609A74001r402i1534J5851D6376
$$ y = [141269, -291470, -123518, -141674, 165102, 6582, 343091, 115788, 104056, -33400, -65022, -215674, -185590, 206146, -249456, -132595, -196595, -35401, -123970, -121126, -72520, -37643, -69039, -142655, 212060, -2166, 110997, -120314, -61445, -163742, -140964, -170976, 173841, -113717, -153792, -99615, -426192, 90633, -206654, -221969, -534653, -139, -78067, -249777, -215551, -139424, 162533, -26092, -74345, 117970, -410683, 105042, 33326, 159843, -76361, -273420, 151504, 172721, -181355, 18108, 1646, 77048, -97440, -9001, 105257, 33792, 81866, -345766, -417746, -169968, 294, -138726, 171524, -81595, 179559, -85331, -91724, 292483, 101740, -125802, -11362, 104721, 254365, 1180, -117609, 174001, 164599, -91534, -75683, 46376]
18357e8331j92765D1531L1378c61347a04412B26310a43644A6126J23238J1147
18347A50511d2538A55139B9047b69137J20602F5597k289P3297a66395A08357a60284
18335a7709m5761l275J7890I972g9581E5998f23A60943d15538H6379b51357C82493
18322e5629A28891K0098b4241A0366L030K46137d2380C9728m008b63242n2698
18311c15940D2638c7660n7043I723J35652b661I0532m1432f6790B9274e6256G1540
18298d47382d263j41924M6233J834F8601e7133j04146J9751q8890J2824j92833
18287d10427A56622e9664K2228H0092c5402j83324M5987C6198b6498A78962J25550
18276C04512E5529f1154j40125I527a52573B43417c3825B5219c01334A18068b20457
$$ y = [-58331, -251096, 41531, 72909, -361347, -104412, 226310, -143644, 16126, 139364, 150511, -42538, 155139, 29047, -269137, -148535, 65597, 63308, 136605, -166395, 108357, -160284, -17709, -63470, -66745, -48855, 9972, -79581, 55998, -623, 160943, -415538, 86379, -251357, 382493, -55629, 128891, 148989, -24241, 10366, 13396, 259533, -42380, 39728, 35720, -263242, -315940, 42638, -37660, -94703, 9723, 145375, -2661, 90532, 49100, -66790, 29274, -56256, 71540, -447382, -4263, -146187, -99954, -98120, 68601, -57133, -161279, -141528, -230418, -217594, -410427, 156622, -59664, -37436, 80092, -35402, -218726, -172739, 36198, -26498, 178962, 304512, 55529, -61154, -201279, 9527, -152573, 243417, -33825, 25219, -301334, 118068, -220457]
18264H4759a24394k51920b0372A24159i1543n8179A42318d87857A8603Q025J4381
18253D1009d6598j37242L9158A94447b35448g1229j36514A27954Q1811I0878h5901
18241c1337G8270c28185O8013D6334d4213A79887L759a52109A19833n0986K45687
18230C14534c25192d5795B50334l7958a55231M1372B6085L75171E934J45676p297
18219A44313c61457F5123b39117h1643H1076O2046b32823l1236I7306K5372a99211
18207b73464b1709B73689h288l42530P7877B45329N4818b25566A65754A7985Q0678
18196I8663i4483i590I2100g4490H1589K28539A5669J76985a69986A39275c44503
18184d3683A50560P3137d73087B28675a9505l51461a79515B1723J23584a60714
$$ y = [84759, -124394, -376314, -20372, 124159, -91543, -149722, 142318, -487857, 18603, 26628, 41009, -46598, -183840, -144682, 194447, -235448, -71229, -207743, 127954, 209765, 90878, -85901, -31337, 78270, -328185, -260172, 46334, -44213, 179887, 183646, -152109, 119833, 68847, 314534, -325192, -45795, 250334, 212376, -155231, -113859, 26085, 401256, 5934, 151610, 144313, -361457, 65123, -239117, -81643, 81076, 143122, -232823, -264059, 97306, 122678, -199211, -273464, -21709, 273689, -8288, -350818, -272941, 245329, 300147, -225566, 165754, 17985, 98663, -94483, -9590, 92100, -74490, 81589, 310128, 15669, 192654, -169986, 139275, -344503, -43683, 150560, 223697, -473087, 228675, -19505, -370966, -179515, 21723, 145307, -160714]
18173D3895K42456B4239e02239c9756F8460a35653B5362i7462M2968H4625b0415
18161E0922b863j32788j40650c1615Q044o5209C26933j54333J1684d6647k40951
18150b87598A0242b4687K420F2989a55113D2543f0715D22950A80645H8311f4301
18138I5203b8038r1063A89788a38767C17847a66608M9538n057b7713q0602j50402
18127b58717A6090d8326A33548b43387P7345j06094J30880c3879A00954h9619
18116A48318D3612b19942A92698h9396j76778o9944d3190K0008k56784M2508j5199
18105b52657l4939e3517G8622k0417b23898O6879c61m5559E2207J57012b8999
18093B0916a56574I1241a53388B44737h9026A87879k4584g1296A24382b40679
$$ y = [43895, 286351, 24239, -502239, -39756, 68460, -135653, 25362, -97462, -54494, 84625, -20415, 50922, -2863, -135651, -276301, -31615, -23571, -88780, 326933, 172600, 184284, -46647, -287598, 10242, -24687, -22267, 62989, -155113, 42543, -60715, 422950, 180645, 88311, -64301, 95203, -28038, -119101, 189788, -138767, 317847, -166608, -117070, -122127, -27713, -108315, -258717, 16090, -48326, 133548, -243387, -166042, -272136, -141256, -33879, 100954, -89619, 148318, 43612, -219942, 192698, -89396, -266174, -336118, -43190, -23182, -279966, -237458, -252657, -287596, -53517, 78622, 58205, -223898, -157019, -361, -45920, 52207, 209219, -28999, 20916, -156574, 91241, -153388, 244737, -89026, 187879, 163295, -71296, 124382, -240679]
18082a24246B01221a10480A10447a37353A79312D4458d05788A03533f8595H3782
18071D3917f7964p083B13568a25356a354m64950G5929a94490A71287G813N8624
18060F6437A1445a93381A8632a29555k00411o5891B1241K71218j38215b15648
18049a63874J1540B21424b06717B19597a67532j31667J45707n092a6248g608l42852
18038c50460A4019K22713g4394r4621J9050k57211d9385F2658J37377a24867j47301
18027b72168a22057N3724B11587a19011k27986a23771e192j969k74547D1169A2244
18015a18619M9766j5134j59836A10183c49303B7860a07108p074p0739B05906c78207
18003D2466b18283B54322j7051a72461d3634A12150C4507R8299A3724i2730M2386
$$ y = [-124246, 201221, -110480, 110447, -137353, 179312, 44458, -405788, 103533, -68595, 83782, 43917, -67964, -75047, 213568, -125356, -1354, -466304, 75929, -194490, 171287, 7813, 66437, 11445, -193381, 18632, -129555, -329966, -395857, 21241, 292459, 154244, -215648, -163874, -152334, 221424, -206717, 219597, -167532, -299199, -153492, -158584, -16248, -7608, -350460, 14019, 236732, -74394, -169015, -149965, -407176, -49385, 62658, 200035, -124867, -272168, -122057, -68333, 211587, -119011, -346997, -123771, -5192, -7161, -281708, 41169, 12244, -118619, -68853, -83987, -243823, 110183, -349303, 27860, -107108, -114182, -184921, 205906, -378207, 42466, -218283, 254322, 237271, -172461, -43634, 112150, 34507, 132806, 13724, -92730, -50344]
17992e0344A49518c2653B67379a21339D873f3551B3027O1414c0001l34023a0339
17980A39662I824K10860a74239F9962j2144J226f6716D8594K86389C5815a40175
17968A44328e2241k6745I2329L7536J01525E8887a81534K5293F3143J96326I4460
17956b05102e5154j56425o5633J5508F6453d7380A04067D327a87720k36825e8865
17944c6562A09907M8929g9333d267A44484B2721N5396a97421d9687A83389a82310
17932b77146a15835A44887a14527A88933K77444A82735C535d9957I0971J83533
17922B74504C4050J90200a52830h297k7944A08836J02423I6432F122h0901m2367
17911a23268K2532K0119G1096a59741m1614H6588m2670e8335h690G7106e47709
$$ y = [-50344, 149518, -32653, 267379, -121339, 4873, -63551, 23027, 84441, -30001, -364024, -10339, 139662, 9824, 220684, -174239, 69962, 57818, 59044, -66716, 48594, 334983, 35815, -140175, 144328, -52241, -78986, 92329, 129865, 231390, 58887, -181534, -156241, 63143, 259469, 94460, -205102, -55154, -211579, -277212, -261704, 66453, -47380, 104067, 4327, -187720, -424545, -58865, -36562, 109907, 158836, -79333, -4267, 144484, 22721, 78117, -197421, -49687, 183389, -182310, -277146, -115835, 144887, -114527, 188933, 466377, 182735, 3535, -49957, 90971, 274504, 34050, 224250, -152830, -8297, -36241, 108836, 211259, 96432, 6122, -80901, -123268, -100736, -80617, 71096, -159741, -201355, 86588, 43918, -58335, -8690, 77106, -547709]
17899A27907n7460J6146a31874e1129j38259g7717r2899B2656I825A93K44452
17888B44645o2274l8200a05004j19766G620Q7537e8000r9000b1280j70574q5108
17877b76962f7208H6490b35675B15649A9165P6370a86241I1604C4803f9407j7188
17866h6595D1708R4447c9453R965m2504A84457j7782P4392i8961r7951A89977
17854a88619E9783b29446e0029M941k5868A54165L4670a99011B4869K34937a04651
17842A35787J93925C7452d23632e5048j20679E6168a22072A29511b72698B44620
17831i8988d9135H8858l3854K00912F5325a3702j35712A38915A5543d5211j51
17820d5362B79777B8943e6489a1612A35601b04017B68322A2792a27149A01088
$$ y = [127907, 70447, 86593, -131874, -51129, -189388, -77717, -170616, 22656, 9825, 193, 244645, 182371, 144171, -105004, -224770, 7620, 95157, -58000, -157000, -21280, -191854, -276962, -67208, 86490, -235675, 215649, 19165, 95535, -186241, 91604, 34803, -69407, -86595, 41708, 136155, -39453, -29488, -71992, 184457, 166675, 241067, -98961, -196912, 189977, -188619, 59783, -229446, -50029, -45088, -70956, 154165, 188835, -199011, 24869, 259806, -104651, 135787, 329712, 37452, -423632, -55048, -175727, 56168, -122072, 129511, -272698, 244620, -98988, -49135, 88858, 55004, 255916, 65325, -13702, -149414, 138915, 15543, -45211, -45362, 279777, 28943, -56489, -11612, 135601, -204017, 268322, 12792, -127149, 101088]
17809a0030C1136J13710b14298C1054J20544o8757J51096L1841a12630F3736e1425
17797b93648H5382g0026a7115Q485n7026L068q8731A97830c7934A53689a67392
17785a25264B7470d850l4296A92635f4145K5341B70503h1554b3106j92119B75932
17773G1171g8066a5042m504D07466a63775m855j18565c7351q9636a1217D9104
17761A49929O479g3747l4111A72169n9404K5835a43359o2678g6064A17486k7345
17750I0141d11139A67546N9873d9296a0261A43966c9082B45350J3176j28385a20223
17738c17998Q079i8436d2834p0716D8885L9672a13019k18535J13584B67531g3888
17726a3377A28500o710K27808E5238e1333j41722E8847a64598L0567C3702m79
$$ y = [-10030, 31136, 144846, -214298, 31054, 151598, 82841, 233937, 265778, -112630, 63736, -51425, -293648, 85382, -70026, -17115, -8630, -65656, -62588, -151319, 197830, -37934, 153689, -167392, -125264, 27470, -4850, -39146, 192635, -64145, -38804, 270503, -81554, -23106, -215225, 275932, 71171, -78066, -15042, -19546, 407466, -163775, -168630, -287195, -37351, -126987, -11217, 49104, 149929, 156408, -73747, -107858, 172169, 112765, 138600, -143359, -206037, -76064, 117486, 90141, -411139, 167546, 227419, -49296, -10261, 143966, -39082, 245350, 258526, 130141, -120223, -317998, -309919, -98436, -42834, -113550, 48885, 88557, -113019, -331554, -217970, 267531, -73888, -13377, 128500, 121790, 349598, 55238, -51333, -193055, 58847, -164598, -134031, 33702, 33223]
17715C3223f319j37194F5990J7704J1417a54424A28609m2880a25814M6626B1917
17703b84427J39881M4967j20027j74867A22193b34682B81483f1962b6203j27694
17693a53897P5504A74775a11003o9677Q9305p5696B08414J6170C298g9475A61817
17681b05409g7682J6097H9797g5995C17477i6927J9843B25925i8060e007m5374
17670e0381j19577G1897e7864B69289D5664d3915A59734P8221D3719M08355i3962
17658D5462b35893D0714c29722J62876f0590C8032b60817O6005D81229a95277
17647B624d8423F2458J78008F2816b21156B58587i9688A49882i7159G0007O7829
17636A37836h3818I906a5784j00406A70073m0512a02383m7482A48302R672b22883
$$ y = [33223, -6319, -143513, 65990, 83694, 95111, -154424, 128609, 85729, -125814, -79188, 21917, -284427, -144546, -99579, -219606, -394473, 122193, -234682, 281483, -61962, -26203, -153897, -78393, 174775, -111003, -180680, -91375, -167071, 208414, 224584, 3298, -79475, 161817, -205409, -77682, -61585, 89797, -75995, 317477, -96927, -77084, 225925, -98060, -5007, -50381, -169958, 71897, -57864, 269289, 45664, -43915, 159734, 237955, 43719, 452074, -93962, 45462, -235893, 40714, -329722, -166846, -60590, 38032, -260817, -194812, 481229, -195277, 2624, -48423, 62458, 240466, 62816, -221156, 258587, -99688, 149882, -97159, 70007, 137836, -83818, 9906, -15784, -116190, 170073, 129561, -102383, -149865, 148302, 157974, -222883]
17624a16284A73966b05334A60773B033K34146L86336B8887a52397B20864F7893
17613h3504A96581K47759A5223i6892A17421J93100B0293a89094A41682b0387
17602I1336M19097B00331K389A8139K04393e6009B54604a52126A00390J50940
17592B51330o5457G7941K71240A44010d3466k22780J18305o8346O7327D07106
17581d9153B07665j02049b7837O31F8098J6077a41767B39006I4380i0080j58765
17570b48845g1634p226C87749a35108G1080M0979c27477H5734a0109K397q6074
17559i3786G4491K7685O2058D5152M2714J66905C1058O0270a55968B02165I5340
17547g7427C466i6715l4692b6450A77984C0283J70865C2100J35309c3030j82862
$$ y = [-116284, 173966, -205334, 160773, 2033, 236179, 622515, 28887, -152397, 220864, 67893, -83504, 196581, 444340, 15223, -96892, 117421, 310521, 20293, -189094, 141682, -20387, 91336, 510433, 200331, 202720, 18139, 222532, -56009, 254604, -152126, 100390, 251330, 185873, 77941, 349181, 144010, -43466, -266246, -147941, -216287, -148960, 407106, -49153, 207665, 105616, -27837, -27206, 68098, 84175, -141767, 239006, 94380, -90080, -248845, -71634, -78860, 387749, -135108, 71080, 112059, -327477, 85734, -10109, -7712, -93786, 74491, 102176, 164234, 45152, 87866, 254771, 31058, 91328, -155968, 202165, 95340, -77427, 3466, -96715, -131407, -26450, 177984, 30283, 201148, 32100, 167409, -33030, -215892]
17536b15892Q1797A25605J5288n5872a10521A22495B1581J53047J81794b9428
17525g8763D435f7629A07854b4905k48546a12115A43078K81691b69963f4391C45870
17513C87473c1598j10800N5205B35612I362g6394n0409B41628F9245K9292b02454
17501B35549N6502a8622j28849B06064c5538A4970N9924N7703i8184f737A69744
17489a4074A42504j2148E6045a24065B95304H4443j7059b1162A09601C0356L3171
17478F3527b31486C80985e7722b6098A02280O3521p2202J66405c26133A93615
17467i9227A54974B7170b43887G8157J01927i3768A87708P4063M17681I4679J1076
17456A05755M2857b663B32020M1935J44275j05754a42416B00390j5504Q7095A19100
$$ y = [-215892, -134095, 125605, 140893, 85021, -110521, 122495, 21581, 174628, 356422, -29428, -78763, 4435, -67629, 107854, -24905, -273451, -112115, 143078, 424769, -269963, -64391, 345870, 387473, -31598, -142398, -87193, 235612, 9362, -76394, -126803, 241628, 69245, 98537, -202454, 235549, 292051, -18622, -147471, 206064, -35538, 14970, 74894, 132597, -98184, -6737, 169744, -14074, 142504, 130356, 56045, -124065, 295304, 84443, 67384, -21162, 109601, 30356, 63527, -231486, 380985, -57722, -26098, 102280, 165801, 93599, 260004, -326133, 193615, -99227, 154974, 27170, -243887, 78157, 180084, -93768, 187708, 261771, 679452, 94679, 105755, 148612, -2663, 232020, 273955, 418230, 312476, -142416, 200390, 184886, 271981, 119100]
17444C16763I9085C0169M60235k43433d3786H5505N07411k91061o6908n8507L43043
17433E19483a07914D62427A39913E0938b72151C30413a94352D58770r4815m7700
17423C16255N2716A47109K6613L769L7182r0140K03938n4910M8147j8822A12817
17411B76336l8882A04874K1455a59299N4871B10960j00372c1016G7797j486J66168
17400B42479L2614K0614e2884J9509B70565b400D35075A20415L0640K10794j0071
17389C51778H6998K30075K0401G0062L1702m838e8879B15921D1021J01384m6150
17378I6255M95836b03911A25486B9770L35388j03919m2793a68522f1649B18957
17367G3406j0809M41165c31192G6938n068i8500D23561D6258O9046N9001n480
$$ y = [316763, 99085, 30169, 490404, 246971, -43786, 85505, 592916, 301855, 234947, 176440, 519483, -107914, 462427, 139913, 50938, -272151, 330413, -194352, 458770, 363955, 316255, 368971, 147109, 173722, 177491, 214673, 124533, 328471, 273561, 321708, 302886, 112817, 276336, 237454, 104874, 126329, -159299, -104428, 210960, 110588, -31016, 77797, 76311, 242479, 275093, 295707, -52884, -33375, 270565, -2400, 435075, 120415, 151055, 361849, 351778, 86998, 317073, 337474, 70062, 101764, 96926, -58879, 215921, 41021, 142405, 96255, 592091, -203911, 125486, 29770, 365158, 261239, 218446, -168522, -61649, 218957, 73406, 62597, 503762, -331192, 76938, 71870, -98500, 423561, 46258, 115304, 174305, 168825]
17356A68825H0076K44664f2960A21495c84992B92443F7688r347H870O3432L99705
17345D72007A36567L50535B14755A0567J68604J59342i3068B85723n5118A09786
17334g4146C33164l9040d7639B59089I9784R9331J63702B2787Q9724b15742C05397
17322G9120J0312D577L52278A2373J99233N1079l1135e7539A28905J84918G0446
17310B00045K4720A1489c4968B82721a41949A78852L08107A8308K46665j18555
17300A46418J20752K368J21584A11403J70714k3995j09807e8098B52030A17721
17289G8654N4211P6509l8295n0086K4607M3589M5681Q378J54981e4481A17507
17277C39640E2710J36180E1863K66725j29639m1827K65061A6610K20624J45795
$$ y = [168825, 80076, 324740, -62960, 121495, -384992, 292443, 67688, 58341, 8870, 72302, 472007, 136567, 487102, 214755, 10567, 179171, 338513, -93068, 285723, 230605, 109786, -74146, 333164, 294124, -47639, 259089, 99784, 199115, 362817, 22787, 112511, -215742, 305397, 79120, 89432, 4577, 356855, 12373, 211606, 262685, 231550, -57539, 128905, 313823, 70446, 200045, 224765, 11489, -34968, 282721, -141949, 178852, 486959, 18308, 264973, 146418, 267170, 269538, 391122, 111403, 282117, 258122, 148315, -58098, 252030, 117721, 78654, 132865, 209374, 171079, 120993, 145600, 189189, 234870, 243248, 398229, -54481, 117507, 339640, 52710, 188890, 51863, 318588, 188949, 147122, 412183, 16610, 237234, 383029]
17267C83029r4366a9051j07144B2921K2632L05212p7097d7600k5066b0821q2792
17256a03613D07152C3615J67085f9186A34966M5500n18F2404c0339o2681B46710
17244e7814b8779A24123C2407a02295d5340A3929K13084Q5536N1825j20557J33759
17233C77576o8010M0706N1089J0347o3441p1739A13820d1630I1379K28064r326
17222C10117A32945K64947B4892J00263M8184M5975j0895q4212K01778c1668C59596
17210D26511j57624J67727h5057j5843A77537J3253f4161F7153M97982j16845
17200D48290j21306c6651A36670Q8251G9486J4680L8572J7102p1817J43933j8982
17189B02974A0012K33346H7583h2783B10572D4415J06551c8528B69124l2556J7794
$$ y = [383029, 288663, -19051, -126195, 22921, 45553, 350765, 273668, -47600, -72666, -20821, -103613, 407152, 33615, 200700, -69186, 134966, 180466, 179948, 62404, -30339, -93020, 246710, -57814, -28779, 124123, 32407, -102295, -45340, 13929, 227013, 312549, 364374, 243817, 377576, 309566, 350272, 401361, 411708, 348267, 276528, 113820, -41630, 91379, 319443, 310117, 132945, 397892, 24892, 125155, 173339, 219314, 208419, 124207, 325985, -31668, 359596, 426511, 268887, 436614, -85057, -100900, 177537, 190790, -64161, 67153, 565135, 448290, 326984, -36651, 136670, 224921, 79486, 94166, 132738, 149840, 78023, 221956, 202974, 10012, 243358, 87583, -82783, 210572, 44415, 150966, -38528, 269124, 236568, 254362]
17178B54362K97832A66490K0448K58509A61856j9215P3658o477J16700I7834L49826
17167D47660F7102a14133C14921O8758A32839J90990j11556f8450B56789Q0487
17157C37276J82786b4313B80406q2610K02193j57707A10612R3671J45969j1867
17147C38385G0960J2308R4808K73696J52391A08740M64223k01311N5490j50346
17137B76796J1880J44077j90294K67891j46158j34j81791M20142A81906n9807
17127A22099L50989D1608M36775k03477l0171K9144K5767K5787M8836r4865L5985
17116C15389K38049k41000J84760k5901j20596n1841B9842N47488k56401H3577
17105A92593R2256K34085B56041P6846o8020D7941K09101J61627F5372N02333
$$ y = [254362, 552194, 166490, 186938, 445447, 161856, 142641, 216299, 209822, 326522, 97834, 447660, 67102, -114133, 314921, 383679, 132839, 323829, 212273, -68450, 256789, 337276, 520062, -24313, 280406, 197796, 399989, 242282, 110612, 204283, 350252, 338385, 70960, 83268, 178076, 451772, 604163, 108740, 572963, 371652, 427142, 276796, 288676, 432753, 242459, 510350, 364192, 364058, 182267, 602409, 181906, 122099, 473088, 41608, 478383, 274906, 244735, 273879, 299646, 325433, 374269, 279404, 315389, 553438, 312438, 497198, 471297, 350701, 298860, 29842, 577330, 320929, 83577, 192593, 284849, 518934, 256041, 332887, 264867, 47941, 257042, 418669, 65372, 567705]
17095E67705a08476F92714l41491A20909K86982j52554J16901J1796J98267j48440
17085D33861P8051N2436q1217j5700J25198j60256K69070k43362j21352K01576
17075E38305j90889F5324K69310f0046D68342R5420m420k73767M19066B81432
17064C63734J90843K8449r8906L8587k03699K94145J59323l17308j90455j5138
17054B49575K43736k32473J34915M9631j4552K67369J14502l42618j69749m663
17044B95673J60065j20830K04160k890j01581k7292j2235L80475B76825Q380M69382
17033G54587j4417j47550l5482N8323j77725q9121L94710n7901k02537k22611
17023B60276N74183k40495j10293L45851l49339k2694J11372k01473J7186L07787
$$ y = [567705, -108476, 692714, 351223, 120909, 407891, 255337, 372238, 384034, 582301, 433861, 511912, 564348, 483131, 467431, 592629, 432373, 701443, 458081, 336729, 538305, 347416, 65324, 334634, -60046, 468342, 563762, 559342, 285575, 704641, 281432, 363734, 554577, 583026, 484120, 522707, 319008, 613153, 772476, 455168, 264713, 249575, 493311, 260838, 395753, 445384, 430832, 698201, 812703, 470085, 300336, 295673, 455738, 334908, 539068, 536178, 434597, 407305, 395070, 775545, 276825, 285205, 754587, 740170, 592620, 557138, 615461, 437736, 348615, 743325, 685424, 482887, 260276, 834459, 593964, 483671, 829522, 480183, 457489, 568861, 367388, 384574, 692361]
17013F92361k44351L6849O5121j24222L65121j7551q1522m5238J56956r7736o242
17002F99546R0480k45288q8630J11671L3823Q7175K14066j85052j31753J00854
16992F86892l9043l12025J49250M20221D37063K83582J11404J9929j2682N6476
16982H95772D45738K39437O7060l39554N14063O6711D27864K70645L05125m44102
16972E59532o9141M45769j22336j23225J49537l89929N67496j79877o8107M34609
16962A204328k15064K07711m67688J19555r8685M25209k87402j46241O9860K28811
16952A040394j31331J55757j16068L7922N9144o8172l07553N18570m32748L22975
16942A078890k20022O3430J77851r6301J57887j68782j3818P68L8211M09155l20993
$$ y = [692361, 448010, 484859, 549980, 425758, 790879, 773328, 691806, 646568, 803524, 705788, 699546, 790026, 544738, 456108, 567779, 601602, 688777, 902843, 717791, 586038, 686892, 647849, 335824, 485074, 905295, 437063, 720645, 832049, 851978, 839296, 895772, 445738, 685175, 752235, 412681, 926744, 993455, 427864, 698509, 1003634, 559532, 490391, 936160, 813824, 690599, 840136, 450207, 1017703, 837826, 769719, 1204328, 989264, 1196975, 729287, 848842, 750157, 1175366, 887964, 741723, 811583, 1040394, 909063, 1064820, 948752, 986674, 1045818, 977646, 670093, 1188663, 755915, 1078890, 858868, 922298, 1100149, 1003848, 1161735, 992953, 979135, 979903, 1018114, 1427269, 1106276]
16931A106276l29109L10186k57995K16276K24576J27324J14945j12035k01353
16922A199091J10811Q78j77526j83067K00704j81215M68951j62849J62312j17902
16912A320188L8944K17181l50895J65560J00648j40826n9309K3333J0445J55100
16902A480369m2685M32184j35661q0406j78699l6021l56863M79096J38477p7109
16892A622682j66872O9766K43428j19765j9532K38203N5430j21989k26459R6112
16882A671004L19478k44732K20085O1950k70554J69083J70779Q2609r4642J97820
16872B282880j25505l75857L27950K5059J11287l9096J8264J70534l37933L06219
16862B363802j52172L82066L9993J6073O7082j1959J4870o8838m4645j77415L59269
$$ y = [1106276, 777167, 1087353, 829358, 1045634, 1270210, 1397534, 1512479, 1400444, 1199091, 1309902, 1310780, 1133254, 950187, 1150891, 969676, 1438627, 1275778, 1438090, 1320188, 1359132, 1576313, 1225418, 1390978, 1491626, 1350800, 1291491, 1314824, 1325269, 1480369, 1437684, 1869868, 1734207, 1653801, 1475102, 1439081, 1082218, 1561314, 1699791, 1622682, 1455810, 1525576, 1769004, 1649239, 1629707, 1867910, 1923340, 1801351, 1574892, 1671004, 1990482, 1745750, 1965835, 2027785, 1757231, 1926314, 2097093, 2179702, 2085060, 2282880, 2157375, 1781518, 2109468, 2134527, 2245814, 2206718, 2224982, 2395516, 2057583, 2363802, 2211630, 2593696, 2633689, 2649762, 2716844, 2704885, 2719755, 2650917, 2606272, 2428857, 2788126]
16851B788126M20169m97608P8648m9929N28652k65226L8098J6172N0798J8593
16841C126493J60531R68k60097K40749M41647k62699L64187M5480l50965J54654
16831C660948M1960J52295J54095j96074J50044L20835k69994N34690q9582k7023
16821D432194K92293M1464J1566o380K85705j20816J51727j2359L97351j61678
16811E311067M68473j50325L26113J01361j42644K22336L62212Q9538j38369L75000
16801F824762k5825Q0352K93677M11208p8626J10155L61489q6081K44720L38044
16791H473875M92495k53221L53717L08501Q9324J40102o3317J059306j71262L90503
16781A0820023L43899M86980L00391M27299J50296O80906K51972L08077L48173
$$ y = [2788126, 3208295, 2710687, 2789335, 2739406, 3268058, 3002832, 3040930, 3057102, 3107900, 3126493, 3287024, 3287992, 3027895, 3268644, 3710291, 3447592, 3811779, 3857259, 3506294, 3660948, 3702908, 3855203, 4009298, 3813224, 3963268, 4284103, 4014109, 4548799, 4459217, 4432194, 4724487, 4765951, 4777517, 4771137, 5056842, 4936026, 5087753, 5075394, 5472745, 5311067, 5779540, 5629215, 5955328, 6056689, 5914045, 6136381, 6498593, 6588131, 6449762, 6824762, 6798937, 6879289, 7172966, 7584174, 7505548, 7615703, 7977192, 7891111, 8135831, 8473875, 8966370, 8713149, 9066866, 9375367, 9464691, 9604793, 9541476, 10600782, 10429520, 10820023, 11163922, 11650902, 11951293, 12378592, 12528888, 13209794, 13461766, 13769843, 14118016]
16772A4118016K07264P90326M03016R47136M20446N05487R50048L41003R05494
16763A9588236P11166O40711J201574Q26807N94816J225937J162054O72377J283744
16754B7907422J548191R54084K166219R69771J400098K142471K237843J617811
16746D0943910K009333K384631K326850L139527K540600L263943L030530L443767
16738F3083091L885726M343823M346619M676098M782965N993231N625446O093026
16730A02830025O868461O703152P442840P347745P635801P784534P402014P646406
16722A61660978P026333O622192N284136M839942L335460J608964J083348r81400
16714A90479953k347461l665929n253390n423164o859161p261084p317813q119117
$$ y = [14118016, 14325280, 15115606, 15518622, 16465758, 16886204, 17391691, 18341739, 18682742, 19588236, 20299402, 20940113, 22141687, 22968494, 23563310, 24789247, 25951301, 26623678, 27907422, 29455613, 30409697, 32575916, 33545687, 34945785, 37088256, 39326099, 40943910, 42953243, 45337874, 47664724, 50804251, 53344851, 56608794, 59639324, 63083091, 66968817, 71312640, 75659259, 80335357, 85118322, 91111553, 96736999, 102830025, 109698486, 116401638, 123844478, 131192223, 138828024, 146612558, 154014572, 161660978, 168687311, 175309503, 180593639, 185433581, 188769041, 190378005, 191461353, 190479953, 188132492, 184466563, 179213173, 173790009, 166930848, 159669764, 152351951, 144232834]
16706A44232834p678712p890744p916592o971124p137260o527209o424515n858036
16698H7828642n428377n218862m675916m465381l914516l633263l951535l082741
16690E3458051k965310k857519k693426k243127k325694j946711j965552j870920
16682C4589792j913281j397943j279967j705118j300269j359132p81060q81951
16674B3971071j263738j067466j120186m87797r84042o27027n77408n84347p20386
16665A6538674n19729r63692n45578N4895r66594m03158k84345k25913p25853
16656A1958707k39636l78498m58201j39829m41910m72376J18924r10726J48419
16647I184874j23249j39489n89488l32118k84849Q8273k82848l79111m6231l51172
$$ y = [144232834, 136554122, 128663378, 120746786, 113775662, 106638402, 100111193, 93686678, 87828642, 82400265, 77181403, 72505487, 68040106, 64125590, 60492327, 56540792, 53458051, 50492741, 47635222, 44941796, 42698669, 40372975, 38426264, 36460712, 34589792, 32676511, 31278568, 29998601, 28293483, 26993214, 25634082, 24853022, 23971071, 22707333, 21639867, 20519681, 20031884, 19047842, 18420815, 17843407, 17259060, 16538674, 16018945, 15055253, 14509675, 14564570, 13597976, 13194818, 12910473, 12684560, 11958707, 11719071, 11340573, 10882372, 10742543, 10300633, 9828257, 9947181, 9036455, 9184874, 9061625, 8922136, 8332648, 8000530, 7715681, 7803954, 7521106, 7141995, 7095764, 6744592]
16637F744592M619K3993m48781j08590r1505j72613k8196m35006o4283k62626
16627E161604O0355m2121q7254q2504J03628m56449r4855k65300j02334J99122
16617D393892m38901j56725K72738K89808n98242J26238k14744m8770k61666J29888
16607C493516R7297j87397n8623o2871j38034j39544m6878M01871l18483j47281
16597B893573r6561J74722m57529L08127j8452l3812j52843j13815P9571M0782
16587B623763J0067l4630l76259l9181q428j7591j86433K28671j34851K03382
16577B268510k40262o0153J29869P6230r2215l65916K55339j0546l06544J39719
16567A794031J72459m10517L43379m55192J48171l81355K82404M09777k71380
$$ y = [6744592, 6749211, 6773204, 6324423, 6215833, 6124328, 5951715, 5923519, 5488513, 5424230, 5161604, 5221959, 5179838, 5092584, 5010080, 5113708, 4657259, 4562404, 4297104, 4194770, 4393892, 3954991, 3798266, 4071004, 4360812, 3762570, 3888808, 3674064, 3625294, 3363628, 3493516, 3590813, 3403416, 3344793, 3281922, 3143888, 3004344, 2957466, 3359337, 3040854, 2893573, 2797012, 2971734, 2514205, 2822332, 2803880, 2770068, 2617225, 2503410, 2582981, 2623763, 2633830, 2599200, 2222941, 2183760, 2175332, 2157741, 1971308, 2199979, 2065128, 2268510, 2028248, 1968095, 2097964, 2174194, 2081979, 1716063, 1971402, 1960856, 1654312, 1794031, 1966490, 1555973, 1899352, 1444160, 1592331, 1210976, 1493380, 1903157, 1631777]
16558A631777J60391k52368m7270q4977L26600l00032k10047K73543l60794K86464
16548A423287j59863m8004K27987o3845j70416k9629L57741n19359M30992r0473
16538A358418l21072N9273P0437N7752Q0356m73803K62075K8671N3914k77174
16528H98847L5566k28594J03285K60619k86096K14527m2283J00663j06294L98419
16518A348659m60868J55529r6634k78658K24643L48798k52578l63822M37369J05286
16508A167724l10850j99611n696J62587C24012P99182j43070j73448N84011n74539
16498H16148C82533J80871k4137l409P9005K99210k85449L2352j18113M36561
16488I79424k40824J07300k84613M6286m0856p8983q234j16228K11044K2534K30397
$$ y = [1631777, 1792168, 1539800, 1492530, 1407553, 1734153, 1434121, 1224074, 1497617, 1136823, 1423287, 1263424, 1215420, 1443407, 1379562, 1209146, 1179517, 1537258, 1017899, 1448891, 1358418, 1037346, 1096619, 1167056, 1224808, 1305164, 831361, 1093436, 1122107, 1176021, 898847, 934413, 705819, 809104, 1069723, 783627, 998154, 955871, 1056534, 950240, 1348659, 887791, 1043320, 946686, 668028, 892671, 1241469, 988891, 625069, 1062438, 1167724, 856874, 657263, 651567, 814154, 324012, 1123194, 980124, 806676, 1390687, 816148, 382533, 563404, 539267, 535858, 614863, 914073, 628624, 660976, 542863, 979424, 738600, 845900, 561287, 607573, 566717, 487734, 479500, 363272, 574316, 596850, 827247]
16477H27247B33638R7038K95809k31640J55742j57416M50536l04064l455q397
16467E27791j17077J25807O1668k51852O5411R8678Q520O9308o566L0314j46881
16456D65121P9604p63B57869K66290j02474J64597r7411A10856K40321j24241
16446B26936M73039J2379l8339p2931l7734k36362J72894A24747M45969k03559
16436C67157J42712L24804D00948j08516L9344N5952N86L45896k04428R5726k08243
16425D17265A84274J82337N7359A78106J00824A00233j3646M56742o4375M3106
16415E22060j41358J13326J73984k34406j48533j2823K39736A08053J21063J68025
16405C97141K41556B52181j07228K86766A55081K74934P5341k02292P0386j4744
$$ y = [827247, 233638, 330676, 626485, 394845, 550587, 393171, 843707, 539643, 536188, 527791, 410714, 536521, 598189, 346337, 411748, 510426, 518946, 588254, 581688, 612002, 465121, 544725, 543962, 257869, 524159, 421685, 586282, 488871, 110856, 351177, 226936, 699975, 712354, 674015, 601084, 563350, 326988, 499882, 124747, 570716, 367157, 509869, 834673, 400948, 292432, 331776, 387728, 388314, 734210, 529782, 625508, 417265, 184274, 366611, 423970, 178106, 278930, 100233, 86587, 543329, 478954, 522060, 380702, 494028, 668012, 433606, 285073, 272250, 511986, 108053, 229116, 397141, 638697, 252181, 144953, 431719, 155081, 430015, 505356, 303064, 373450, 358706]
16395C58706R258m6525H6750L11031A39510M62614A42995M08836d9806B8600M36399
16384D64999A97454J66955j37185n8175L06523k23990H4264J06203K23191l9682
16374C73976j29607J48460o943A37210J953P107j304j2602l2774a81710B87141
16362A69578j1554j2283Q6474R3439j4075d6091A75334K55891l5620p8684k0832
16351B96089N9921A26194P9814b0190C95031m5772q3676R0383A03714L65689A58102
16339C67084e2586n0715A74411J03442q3582I7112J26701m3387Q6068K81945A07466
16327D24957p345A90835e1983B26891r3694d1760D21858A65011c0761A28513P35
16316A29248k3373K6036L53491k34804c79C10384p0785b7677C32720F6734J63416
$$ y = [358706, 367964, 321439, 86750, 397781, 139510, 602124, 142995, 551831, -49806, 28600, 464999, 197454, 364409, 227224, 169049, 475572, 251582, 84264, 190467, 413658, 373976, 244369, 392829, 385886, 137210, 139163, 146270, 144966, 132364, 99590, -181710, 287141, 169578, 158024, 145741, 232215, 325654, 311579, -46091, 175334, 431225, 395605, 316921, 296089, 356010, 126194, 206008, -20190, 395031, 349259, 265583, 355966, 103714, 469403, 158102, 367084, -52586, -103301, 174411, 277853, 194271, 97112, 223813, 180426, 266494, 548439, 107466, 424957, 417612, 190835, -51983, 226891, 133197, -41760, 421858, 165011, -30761, 128513, 129248, 105875, 131911, 485402, 250598, -379, 310384, 239599, -27677, 332720, 66734, 230150]
16305B30150Q9165G0417K25525E3639K80062a9788D21461j36522A34087R6035
16295B30122A06865J65045q9294a0026C7550c163k07864R8959A01346N8400a40907
16283B47105M2528n2813P5970j45012a75397C4539c4296F6586J47975r1836K70628
16272C93353A35851g2282A87695J61734A07310n741N89096A51621HP93a8789B55814
16259A61190c9141B47365G8344l0672p234g1425A60007F7108J67186b54084p9881
16248c33965B28480H8880K5088c9300A95691a16571B3536J48748b39014J14599
16238a24415B92879I9846a24455A38229h3631G9407c6411A76999a4618L742j93550
16227b04426A40509c1765A52115J13220b59978e2418j43252B01026n2120b85488
$$ y = [230150, 319315, 70417, 295942, 53639, 333701, -19788, 421461, 284939, 134087, 230122, 106865, 271910, 182616, -10026, 37550, -3163, -211027, -112068, 101346, 159746, -140907, 247105, 289633, 236820, 312790, 167778, -175397, 34539, -34296, 66586, 214561, 122725, 393353, 135851, -72282, 187695, 349429, 107310, 101569, 690665, 151621, 8, 801, -18789, 255814, 161190, -39141, 247365, 78344, 47672, 40438, -71425, 160007, 67108, 234294, -254084, -333965, 228480, 88880, 113968, -39300, 195691, -116571, 23536, 172284, -239014, -124415, 292879, 99846, -124455, 138229, -83631, 79407, -36411, 176999, -14618, -10876, -204426, 140509, -31765, 152115, 265335, -259978, -52418, -195670, 201026, 148906, -285488]
16216E2112J14492K70186b9790B1131K52904j4451a6494B20266h1221l96546H2137
16204B87861b1976A1149a33153F1336J14447C5655b1579k54078D7803J57802d9826
16192A34623C5557e0231a6797B01391a27279A00724Q5160K7082a7800B926J13713
16181A16639J9648c00225j16960C69363A65714f848A43746j8059o0770m922N2480
16170A12475k9174a31725F9650i9780A42147O4850A7446L10255a98694b2147E998
16158C63598h765A42132a10069M6495p2929H3259K22450l5446q1980A8429c09973
16146g7443j0094m7402A66015l4492a3042G2432A7392a76084A56563a85103E1109
16134b0969j4136l39644a81606C6261j1675M2777A9109J23125a82380I8756O6562
$$ y = [52112, 166604, 436790, -29790, 21131, 274035, 259584, -16494, 220266, -81221, -477767, 82137, 287861, -21976, 11149, -133153, 61336, 175783, 35655, -21579, -275657, 47803, 205605, -49826, 134623, 35557, -50231, -16797, 201391, -127279, 100724, 185884, 212966, -17800, 2926, 116639, 136287, -300225, -417185, 369363, 165714, -6848, 143746, 125687, 64917, 59995, 112475, 83301, -131725, 69650, -99780, 142147, 206997, 17446, 327701, -198694, -22147, 5998, 363598, -8765, 142132, -110069, -63574, -136503, 83259, 305709, 270263, 188283, 18429, -309973, -77443, -87537, -134939, 166015, 131523, -13042, 72432, 17392, -176084, 156563, -185103, 51109, -20969, -35105, -374749, -181606, 36261, 24586, 67363, 19109, 142234, -182380, 98756, 165318]
16123A65318b42975H2241A9771a83555q0656B37284a61884l5212C2774j5080J48387
16112A66081b31951J4663R2674F26347A50028a03676D1614J46695i6259k24177
16102c20436B50252a47666e6791G2134d73015G7953a20336j22539a3814j76371
16092a90185H6393d1081c427A22634r87m6464a32562E8747i1746j62147A44697
16080B20463B030K46635K5975A03342K27731e9817F4083A3771J34567b749k46908
16069b49657J12258D10957C8380f0595B55318i8553B37831b53323p7563e291A56899
16057I908a10383J6446b654j36092e4282A18595L0730J9572c865j33248n348A84409
16044E5971J25103f0189E17402c14017A54145a05430j5201L9538a1087p0605G59
$$ y = [165318, -242975, 82241, 19771, -183555, -264211, 237284, -161884, -197096, 32774, 17694, 166081, -231951, -217288, -124614, 626347, 150028, -103676, 41614, 188309, -96259, -320436, 250252, -147666, -56791, 72134, -473015, 77953, -120336, -242875, -13814, -190185, 86393, -41081, -3427, 122634, 121647, 75183, -132562, 58747, -91746, -253893, 144697, 220463, 2030, 248665, 274640, 103342, 331073, -59817, 64083, 13771, 148338, -2749, -249657, -137399, 410957, 38380, -60595, 255318, -98553, 237831, -253323, -330886, -5291, 156899, 9908, -110383, -93937, -2654, -138746, -54282, 118595, 149325, 168897, -3865, -137113, -142461, 184409, 55971, 181074, -60189, 517402, -314017, 154145, -105430, -120631, -81093, -11087, -81692, 759]
16032A32188J38942H4465a2937A7655a55527A00048J25236a06691D1265a41384
16021E9409J17668F0570J58200g6879I6469e4116a6958l32883C41239b81995Q1066
16010b00929k11728D82238A83929a79130A30495l3327C2688h0604n8887l55440
16000d94931a00087M9400l54364B13062C689N8349J39825k9639e7046A8564m104
15989A4460a54115M6253A58017a98882f3229C90552m5892A24343Q5030a28052
15978B45632a26334n7497G8434J16199M0878a34173B589P862a84127d944k02012
15967b06956A0568a93081h5231A19853J98135G0706Q4706a34166B56331a35357
15956B08659a79979N0608K2660L1808C3937J71789a21566q6060M2280A9611g9256
$$ y = [132188, 271130, 84465, -12937, 17655, -155527, 100048, 225284, -106691, 41265, -141384, 59409, 177077, 60570, 218770, -76879, 96469, -54116, -16958, -349841, 341239, -281995, -200929, -412657, 482238, 183929, -179130, 130495, 97168, 32688, -80604, -139491, -494931, -100087, -50687, -405051, 213062, 3689, 62038, 201863, 172224, -57046, 18564, 14460, -154115, -107862, 158017, -198882, -63229, 390552, 344660, 124343, 209373, -128052, 245632, -126334, -183831, 78434, 194633, 235511, -134173, 2589, 10451, -184127, -4944, -206956, 10568, -193081, -85231, 119853, 317988, 70706, 155412, -134166, 256331, -135357, 208659, -179979, -129371, -106711, -74903, 33937, 205726, -121566, -207626, -165346, 19611, -79256]
15944C7034b16461L6776A83961g2832a1384k72081Q8783L3377j4916A01K20701
15933B20802e9294b4218l90267I3a32169o0239I1696l1949J04396b17997G8837
15921B07103a25236D7903d27208a51737a8795r8243A8617K783J80208B525a22021
15909h322I9296c71347A71677M350a53799k59177c015j35963L7616C43488a14455
15897a50413A24264b44437f1715A27737b35721P1173e3516k76438A2943b12938
15886A01859d5952j68159j22269A69578D7758M5702d2874B2371b47539f0252k5870
15875h6122A2587a25663J4736A62705h6800B42677B2345a61277P5785o4481a8019
15863B4015b37388M7887B8170J87608a68592B2009a03496j17708n7140a19025
$$ y = [37034, -216461, -179685, 183961, -72832, -11384, -283465, -194682, -161305, -176221, 101, 220802, -59294, -24218, -414485, 93, -132169, -192408, 91696, 59747, 164143, -217997, 78837, 207103, -125236, 47903, -427208, -151737, -18795, -117038, 18617, 21400, 201608, 2525, -122021, -8322, 99296, -371347, 171677, 176027, -153799, -412976, -3015, -138978, -101362, 343488, -114455, -150413, 124264, -244437, -61715, 127737, -235721, -164548, -53516, -329954, 12943, -212938, 101859, -45952, -214111, -336380, 169578, 47758, 93460, -42874, 22371, -247539, -60252, -86122, 12587, -125663, -110927, 162705, -86800, 242677, 22345, -161277, -85492, -149973, -18019, 24015, -237388, -189501, 28170, 215778, -168592, 22009, -103496, -221204, -278344, -119025]
15852b02393q3400J08945C2370O1919a39776E0287a58461A82528g0043A27197
15841c28719Q3966A31794b27025a02742o2544a9919j3566l4495B1548e2784m5434
15830i8218l33272G794K10971a84471e6594o4690A61224b55589A93651c14750
15819A61423E870c10420C9350f7772r6495j61198E1697a24440A37752b92421A56637
15807b22402F7992a21586J0908k29087c2347B28516D4183A1419O669a18449l71959
15796d90408b3033Q124j53914D50555a65041A14335b26611G66d4086H5252h1316
15784b02760J711A60468b47718I9000a58902H6147j3276a18091c8294j08662A59536
15772I1687a5150j32712M3277k08868i4853l1908D62730a44988m8554B3064K90073
$$ y = [-202393, -285793, -176848, 32370, 94289, -139776, 50287, -158461, 182528, -70043, 127197, -328719, -244753, 131794, -227025, -102742, -165286, -19919, -33485, -67980, 21548, -52784, -98218, -431490, 7794, 218765, -184471, -56594, -121284, 161224, -255589, 193651, -314750, 161423, 5870, -310420, 39350, -67772, -164267, -325465, 51697, -124440, 137752, -292421, 156637, -222402, 67992, -121586, -110678, -339765, -32347, 228516, 44183, 11419, 18088, -118449, -490408, -23033, -14909, -168823, 450555, -165041, 114335, -226611, 766, -44086, 85252, -81316, -202760, -201049, 160468, -247718, 99000, -158902, 86147, 72871, -118091, -38294, -146956, 159536, 91687, -15150, -147862, -104585, -313453, -94853, -126761, 462730, -144988, -193542, 23064, 313137]
15761C13137b8085F9304J3955g6464A57442a85239P5709A35433f2731h26m5527
15750d6353m4656j42140B16337k6485a92575C79443F990a20694C20806j38641
15740A82165h2014E12818f0969I7629m0271K07202E648J19566n0927c4019A58967
15728f2457j30084a8448F7116J1633a15561a0254D3705h8009q6430M5767E5101
15716a41545A73254d455k04763h2533C9617R3543C7280d5012a9240q5105H4624
15704a98698C07949h2900A08839a76391J6335J8118i393j42388P1153B36381a49254
15692I3667b4015j32287a6843j87377D8087N9339a27893k7538d37l35951A29293
15680i2905c379k30618A49949D7735b20961c1584l56403i4227Q53m5659F3913
$$ y = [313137, -28085, 69304, 83259, -76464, 157442, -185239, -109530, 135433, -62731, -826, -46353, -91009, -233149, 216337, 189852, -192575, 379443, 6990, -120694, 320806, 182165, -82014, 512818, -60969, 97629, 57358, 264560, 5648, 125214, 74287, -34019, 158967, -62457, -192541, -18448, 67116, 78749, -115561, -10254, 43705, -88009, -174439, -128672, 55101, -141545, 173254, -4455, -209218, -82533, 39617, 133160, 37280, -45012, -19240, -104345, 84624, -198698, 307949, -82900, 108839, -176391, -160056, -141938, -9393, -151781, -80628, 236381, -149254, 93667, -24015, -156302, -16843, -204220, 48087, 107426, -127893, -155431, -437, -336388, 129293, -92905, -3379, -233997, 149949, 47735, -220961, -31584, -387987, -94227, -93374, -139033, 63913]
15668G8554J01691c39761B26957a9701B40020i6911m1217d2410E8961p436L7661
15657H9186a62784q8155a236j91353p1218J04911F4066f9336j70244c3672B4142
15645c5254m7637I6559c0442B19548a05810c5303l2487b1087D6363J0418N2839
15634A09620e4749K1794c941n0248a1482n940D1121J50234c646C20061b0146k31632
15622b51778A24103a5746C4856f77A765b24905a04108J4427o1099C19772H1744
15610b8791H7600J04260A2837a35769D2079e9128a3174E0080g218l12790d1016
15598F000M6825g3629j33430q0578b6087k57590A06366a25438A77318J91389a91687
15586a80522A08971a40076A77328d45250E6649Q7645e9889B62734j08812b43499
$$ y = [78554, 180245, -339761, 226957, -19701, 240020, -96911, -138128, -42410, 58961, 51525, 89186, -162784, -250939, -1236, -192589, -263807, -158896, 64066, -69336, -239580, -33672, 24142, -35254, -82891, 96559, -30442, 219548, -105810, -35303, -67790, -21087, 46363, 56781, 109620, -54749, -32955, -3941, -54189, -11482, -17422, 41121, 191355, -3646, 320061, -20146, -251778, 124103, -15746, 34856, -677, 1765, -224905, -104108, -89681, -150780, 319772, 81744, -28791, 87600, 191860, 12837, -135769, 42079, -59128, -13174, 50080, -7218, -320008, -41016, 6000, 52825, -73629, -207059, -287637, -26087, -283677, 106366, -125438, 177318, 368707, -191687, -180522, 108971, -140076, 177328, -445250, 56649, 144294, -59889, 262734, 153922, -243499]
15575a80360M0278K2486j45266A721a30616d3201k49601b1242q3354D41483B18313
15563a0374A10604B4561b97648B33680k1232b19610A81258c9739j65732O2884
15553a42587l2281D6042f5448E6527a53646j0466k95279F951M401Q9693b09878
15541c8301F2172J650b5287N012A78552g7034E923J52449b16193Q7446F7942e6610
15528b4393j68178i1434B03798H208N4745b68395B50502D6015C681a05765l21687
15517d27452a5743l31178J37090I4394c70614B40825m9037P5251G977c6260A56360
15505g7570B8585n105a62432C900J63364G1527a14952A71079d4010A13339J04375
15494B17714M2091A06831a27303b503m50406E551O5143a96755H5762b7079l02741
$$ y = [-180360, -140082, -117596, -262862, 1721, -130616, -43201, -292802, -21242, -104596, 441483, 218313, -10374, 110604, 24561, -297648, 233680, 212448, -219610, 181258, -39739, -205471, -142587, -174868, 46042, -65448, 56527, -153646, -164112, -459391, 6951, 11352, 101045, -209878, -38301, 62172, 63822, -25287, -20275, 178552, -77034, 5923, 158372, -216193, -128747, 67942, -56610, -24393, -192571, -91434, 203798, 8208, 62953, -268395, 250502, 46015, 3681, -105765, -427452, -15743, -346921, -209831, 94394, -370614, 240825, 191788, 267039, 7977, -36260, 156360, -77570, 28585, 23480, -162432, 3900, 167264, 71527, -114952, 171079, -44010, 113339, 217714, 259805, 106831, -127303, -2503, -452909, 5551, 70694, -196755, 85762, -27079, -329820]
15483c29820f4592B24159a437j40356I9920J14928b368A60403b59171A63853q1287
15472H2566K5939h1856D4936b49186C9807d76930a86151B28267a4297o3039A17959
15460C29216b42395P1062A02250a46150m0075J344A35003a27039J5403j15258
15450b26894A18031b7969j11430H0426c1775l79703i2574j3869a8971o5528I0874
15438I5501a20847A0821b27742Q1168f424A60597G3083I030a42402A58793b04092
15426a12464N2662A02549k0126O2395a45942B30504a59429C21119c07894B19754
15415B18J25819K77398E6591c23188B03606I0645c26482C8767d5116E238e0059
15403A0756b53660P170I3372i9472k49727f1143r4081C32059d024l35799f2201
$$ y = [-329820, -64592, 224159, -1437, -141793, 99920, 214848, -2368, 160403, -259171, 163853, 82566, 108505, -81856, 44936, -249186, 39807, -476930, -186151, 228267, -14297, -77336, 117959, 329216, -242395, -171333, 102250, -146150, -186225, -184881, 135003, -127039, -111636, -226894, 118031, -27969, -139399, 80426, -31775, -411478, -92574, -106443, -18971, -84499, 90874, 95501, -120847, 10821, -227742, -146574, -6424, 160597, 73083, 9030, -142402, 158793, -204092, -112464, -59802, 102549, 82423, 144818, -145942, 230504, -159429, 321119, -307894, 219754, 218, 126037, 403435, 56591, -323188, 203606, 90645, -326482, 38767, -45116, 5238, -50059, 10756, -253660, -246490, 93372, -99472, -349199, -61143, -155224, 332059, -4024, -339823, -62201]
15391a69838H7264j7292i1968A42027c07157a02906b7816A13827b71085A9735
15380b9614A68912a25961A22267a40776q479B16903a13324B03089i7940h428r3320
15369a01748B46186j01593d1738E9384N9587a35928A46659A9891h545A16307b14009
15357C5613i7807B55391A05817b78628A37293J08123E5079g3898A50570J55953
15347C06523D2660O7671a16141r1753B78182e1561A36720C1897K99084d46346
15336A22132D3300b10440A43253P842F8580J27742a60886a1529l45398B97289
15325C46676j34820r0749f3127B55609a4380F8334k9515J02814k179a43525O2011
15314h1514L3201A30442J2855A7466R8544l9712b4375A88747b45537e0466A0374
$$ y = [-169838, 87264, 69972, -91968, 142027, -307157, -102906, -27816, 113827, -271085, 19735, -29614, 168912, -125961, 122267, -140776, -149255, 216903, -113324, 203089, -97940, -8428, -101748, 246186, 144593, -41738, 59384, 118971, -135928, 146659, 19891, -8545, 116307, -214009, 35613, -97807, 255391, 105817, -278628, 137293, 245416, 55079, -73898, 150570, 306523, 42660, 110331, -116141, -207894, 278182, -51561, 136720, 31897, 330981, -446346, 122132, 43300, -210440, 143253, 151095, 68580, 196322, -160886, -11529, -356927, 297289, 346676, 211856, 121107, -63127, 255609, -14380, 68334, 38819, 141633, 139454, -143525, -81514, -48313, 130442, 143297, 17466, 116010, 76298, -24375, 188747, -245537, -50466, 10374]
15302a11658d2135C82863A76119M097b1014F06498A6446J52384e5964D0542K12359
15291B52901j02956a56376E2119b4394A55986h7033G6557L7434a55952C3251J35402
15280A68653F9497h1943A92085E158M35254B01580c9078E12341a76586A12717
15269a69498e7835j48877C75699A55402b67074A43561c1547A65936B5470J56159
15259A81629c0442k05963b1327C08766l4228A17533E7448J59155j7425J08291
15249C07469E8427J159143R80537j082959N50084j12430F00590G7213P7871J31209
15239B86293i3034B03098J70568m7070j58751k5299h6622B00816e7148B14207
15228a14652D53451p3056F3350b82096N7960h2110C60339F04M06835C8686d9132
$$ y = [-111658, -42135, 382863, 176119, 180216, -21014, 606498, 16446, 168830, -55964, 40542, 252901, 149945, -156376, 52119, -24394, 155986, -87033, 76557, 113991, -155952, 33251, 168653, 69497, -81943, 192085, 5158, 440412, 201580, -39078, 512341, -176586, 112717, -169498, -57835, -206712, 375699, 155402, -267074, 143561, -31547, 165936, 25470, 181629, -30442, -236405, -21327, 308766, 274538, 117533, 57448, 216603, 199178, 307469, 58427, 1217570, 2198107, 1115148, 1665232, 1552802, 600590, 77213, 155084, 286293, -93034, 203098, 373666, 326596, 167845, 142546, -86622, 200816, -57148, 214207, -114652, 453451, 380395, 63350, -282096, -224136, -82110, 360339, 604, 407439, 38686, -49132]
15216I8917m4120a39624B12982E8197K03583C2942K52868A19822Q3861a6698B70699
15204A24032O2275O2494a77608f8951b0542A8155J23192m9255a16671B20171c37748
15192i2418d1633l73509A86284a08346j53459G3811J41939I9244a08659a160C7533
15180a13317C49200e896J558C7972j991f3134p9661B10969A04327a35941B62834
15168A2156L31795j09429o0621o4591a68818B92065h6433A23637D4133J78334
15158B22467K232B8383b10818i9814j9373b4288C40003j66799i9730D6714a59280
15146A20209a97010B51642D9874J52166a3249B27176a97412A77832g3276A18019
15135E7244J85050G8773g4742C66794H9341M4631b8701D7561d78854B13493b73668
$$ y = [98917, 54797, -139624, 212982, 58197, 261780, 32942, 285810, 119822, 203683, -16698, 270699, 124032, 186307, 248801, -177608, -68951, -20542, 18155, 141347, 92092, -116671, 220171, -337748, -92418, -41633, -415142, 186284, -108346, -261805, 73811, 215750, 99244, -108659, -1160, 37533, -113317, 349200, -5896, -4338, 37972, 35981, -63134, -142795, 210969, 104327, -135941, 262834, 12156, 343951, 234522, 173901, 109310, -168818, 292065, -86433, 123637, 44133, 222467, 224699, 28383, -210818, -99814, -119187, -24288, 340003, 173204, -99730, 46714, -159280, 120209, -197010, 251642, 49874, 202040, -13249, 227176, -197412, 177832, -73276, 118019, 57244, 242294, 78773, -74742, 366794, 89341, 133972, -28701, 47561, -478854, 213493, -273668]
15123C50104A10589N0297K7409a12212a5168B77182B959L20454c62542B32197
15112E0956D009K07620b23555I4233g6840m9080B24947L13328B23511i8222A23000
15100a30525A42835a20451A42172g5909A49064a09588A41521J2348R228e1325
15089a49122E00890I1180k6440o458J36643F6508a59224A50354F1859K05516F9319
15077a96334f3195A28209D4236K66480C4640K9392R7521R2992j13507N4351K57391
15066D52780P0964B31688c1969D4029Q6915o3675a12662F5826L5656R1841N218
15055A98541h2915a2926B07262A6366L32880j00690m8693E4532J44599G7998e1972
15043A10750M45513B03054b14174a4132A03322A6611L42391h1072B19783N9838
$$ y = [350104, 110589, 160886, 188295, -112212, -15168, 277182, 2959, 323413, -362542, 232197, 50956, 4009, 211629, -223555, 94233, -76840, -125920, 224947, 538275, 223511, -98222, 123000, -130525, 142835, -120451, 142172, -75909, 149064, -109588, 141521, 153869, 163097, -51325, -149122, 500890, 91180, 64740, 58282, 194925, 66508, -159224, 150354, 61859, 267375, 69319, -196334, -63195, 128209, 44236, 310716, 34640, 64032, 161553, 254545, 141038, 195389, 452780, 523744, 231688, -31969, 44029, 130944, 67269, -112662, 65826, 101482, 193323, 198541, -82915, -12926, 207262, 16366, 349246, 248556, 199863, 54532, 199131, 77998, -51972, 110750, 556263, 203054, -214174, -14132, 103322, 16611, 359002, -81072, 219783, 279621]
15033B79621b16045B59585L7268j40253K71499A91617J85072Q3909D2239A3444
15022e2733b4129B54465a50100A96379B3705L11413F4101Q4758J34616n9012J31786
15011C56249p2892q8495d9236C02653e7997p5884B60832H3709a21440B66377j23540
15000A42837J77404o0958j734A15013K66186A47216J26902L1187j25148J53937
14990C34094A58975J64093p8798q0164g3407B28701D9844Q6882O17774j69150
14980E85350B22259Q377M21622E3393J97452J00781p0202B9773J53732J47974
14970C31479I3921J32615M53309l26703o1822H8860O5108K02728o2737F1683L47095
14959D08778A58345j9199h2244B34748L04237D1251J03073L00506j52622F1030
$$ y = [279621, -216045, 259585, 296853, 156600, 428099, 191617, 376689, 460598, 42239, 13444, -52733, -24129, 254465, -150100, 196379, 23705, 335118, 64101, 148859, 283475, 224463, 356249, 283357, 194862, -49236, 302653, -57997, -133881, 260832, 83709, -121440, 266377, 142837, 320241, 259283, 257549, 115013, 381199, 147216, 274118, 305305, 180157, 334094, 158975, 323068, 244270, 164106, -73407, 228701, 49844, 136726, 754500, 585350, 222259, 230636, 652258, 53393, 250845, 351626, 281424, 29773, 183505, 331479, 93921, 226536, 679845, 353142, 291320, 88860, 153968, 356696, 293959, 61683, 408778, 158345, 139146, -82244, 234748, 538985, 41251, 144324, 444830, 292208, 61030]
14948c7550B37900Q8683A45699K27744e9322B72471o3060a29689E62846B46629
14937I1315L66156A39758K22998D6694J46062r1207K09746n7029H1764J56414
14927B38178o057o2977A6784A980M1527K29953P7A5153a55577A01923L91502A83737
14914C50623q0020G2748J08494M9758P6144K78293k89415n6889K45219j53598
14904C30754A4023L67805J02929j50787p2571R2943j17595O23090A73956L1322
14894B05278J5526r8387R3320J1496m1533Q4946n020l3535n9576M00432k34056
14883C38891j31126J85767O1182B16269K69061k31265K26692A79471J56141K01257
14873E36869k15508n7946R6680j57995K39699k2236K26908C18884M00537l13347
$$ y = [-37550, 237900, 326583, 145699, 373443, -59322, 272471, 209411, -129689, 562846, 246629, 91315, 457471, 139758, 362756, 46694, 192756, 101549, 311295, 254266, 81764, 238178, 232121, 169144, 16784, 1980, 43507, 273460, 273537, 15153, -155577, 101923, 493425, 183737, 350623, 270603, 72748, 181242, 231000, 307144, 585437, 296022, 239133, 484352, 330754, 14023, 381828, 484757, 333970, 261399, 354342, 236747, 859837, 173956, 205278, 220804, 122417, 215737, 227233, 185700, 270646, 265626, 232091, 172515, 572947, 338891, 207765, 393532, 454714, 216269, 485330, 254065, 480757, 179471, 335612, 536869, 321361, 263415, 360095, 202100, 441799, 419563, 646471, 318884, 719421, 406074]
14863D06074n958Q8898B34963m8034J50517j10622J79968j25071K62801A23050
14852D32005j21223J55624B01727J00630K93687k10004j07058M9651P2156J04623
14842E05412A92374H5535J69742J04980J45300j41154r0525K16129K3372p5062
14832D38317K277L44510B37582k3144J68681p8589J23648p2398R6861J90958j71853
14821D71746k11504J08582K25314k7868k67857k2255N38157D01621L08113A85674
14810B57691P1353K51975K27345C5209M64210M14630m43167k07371j08767J06338
14800B61082L26440o2374q2462k3699k6027n7775K92063k02921A12355K64261
14790C76616K7525K50459j88296J0392J05625J6626k94708K71024m0356k27952
$$ y = [406074, 400116, 489014, 234963, 186929, 337446, 226824, 406792, 281721, 544522, 123050, 432005, 310782, 466406, 201727, 302357, 596044, 386040, 278982, 328633, 400789, 505412, 192374, 85535, 255277, 360257, 505557, 364403, 273878, 490007, 513379, 438317, 440594, 785104, 237582, 214438, 383119, 304530, 428178, 355780, 452641, 643599, 471746, 260242, 368824, 594138, 566270, 298413, 276158, 814315, 401621, 709734, 185674, 257691, 329044, 581019, 808364, 35209, 499419, 914049, 470882, 263511, 154744, 261082, 587522, 525148, 442686, 418987, 392960, 335185, 627248, 424327, 112355, 376616, 404141, 654600, 466304, 476696, 582321, 598947, 304239, 575263, 534907, 306955]
14780C06955l4992K0026j2505K37603L7118j69344L75515k55484L26747C94214
14769A87064J21936M12577l15990J24260l4930o2846K56087k65757j20571M97623
14759G99453j79175o9475j63380j07552L42622q4004L05734D15371M9275K31578
14749F96224l11405J28631J23588k34399P8986M51977l10050J59727j52454j83456
14739D47369L1849L19344j53111j94513N62610k38334j30010M7541J75954l25445
14729E43254J69846Q3875k49191J09020N9436M1238j96310J54364P1454O3127
14719H50113p0974j03054n823L3359K65084r7372D32964J07549L32584j68144
14709G04953J59868l73300J85220J46809k68027K48952j38400K07605L02455m42297
$$ y = [306955, 271963, 291989, 279484, 517087, 554205, 384861, 760376, 504892, 831639, 394214, 187064, 309000, 721577, 405587, 529847, 494917, 432071, 688158, 422401, 301830, 799453, 620278, 550803, 387423, 279871, 622493, 538489, 844223, 415371, 464646, 696224, 384819, 513450, 637038, 402639, 481625, 933602, 623552, 783279, 630825, 447369, 479218, 798562, 645451, 450938, 1013548, 775214, 645204, 692745, 868699, 543254, 713100, 796975, 547784, 656804, 716240, 757478, 561168, 715532, 786986, 850113, 779139, 676085, 670262, 703621, 968705, 871333, 432964, 540513, 873097, 704953, 864821, 491521, 676741, 823550, 555523, 804475, 666075, 873680, 1176135, 733838]
14699G33838K39251j05605K6772J50880j21123C07353L73961J31654j29827M88559
14689A171700E61859L47379k32063L11661j66138q1904K23937j67388J83118J43123
14679A123584n30205K15959L77946J56168k98688k09365L2010Q2036R3804k5066
14669A018183m66422K95383J45436j0722m3356L5136l17270L97029l73861O04939
14659A284475k08877k92285K9354P0184J28600l20066K73192J17910J03717n24887
14649F61317N06472q1528q3499J60446l6819l1155J04209j71901L27880j23549
14639A231873J72948n43150j26007N64970j07525M0400j19529R6118o3911K26149
14629A372336l64463r0234K52237k89572K44460n1540L02589l9370k66735K12702
$$ y = [733838, 973089, 867484, 894256, 1045136, 924013, 307353, 681314, 812968, 683141, 1171700, 561859, 909238, 677175, 988836, 822698, 740794, 964731, 797343, 980461, 1123584, 593379, 809338, 1187284, 1343452, 1044764, 835399, 867409, 949445, 1043249, 1018183, 551761, 847144, 992580, 981858, 938502, 973638, 656368, 1053397, 679536, 1284475, 1075598, 783313, 812667, 882851, 1011451, 691385, 964577, 1082487, 1186204, 661317, 1167789, 1086261, 1002762, 1163208, 1126389, 1095234, 1199443, 1027542, 1355422, 1231873, 1404821, 861671, 735664, 1300634, 1193109, 1233509, 1113980, 1210098, 1146187, 1372336, 1007873, 917639, 1169876, 880304, 1124764, 1073224, 1375813, 1336443, 1069708, 1282410]
14619A282410j91814k31667M60118l51070L12777k58987L40671j2670j68202K13748
14609A395314K8284R7456M9735p8167k53488l0294k0583N59037l57245J16281
14599A506330j41494J60548k8128l53711L89759K6647L0901J95792j80142r9209
14589A507293Q4284K57766Q876k76579K80946j84478j79580O76101l77758r0157
14579A706714L444K47285L3381k19604K40878k77304J01427J86112J36122j66641
14569A991814K0337p2373J08394M03243k48112M00837l03504m1225j04221o9343
14559B085847M90582j20322o7791K94134j59858N49895K43079L65130K81536R43273
14549D905505J512560L438001Q069850J9428572J0251979A9582620q974496D582029
$$ y = [1282410, 1090596, 858929, 1319047, 967977, 1280754, 1021767, 1362438, 1349768, 1181566, 1395314, 1423598, 1521054, 1570789, 1492622, 1239134, 1208840, 1188257, 1747294, 1390049, 1506330, 1364836, 1525384, 1497256, 1143545, 1533304, 1559951, 1590852, 1786644, 1606502, 1507293, 1591577, 1849343, 1858219, 1581640, 1862586, 1678108, 1498528, 2174629, 1796871, 1706714, 1710158, 1957443, 1990824, 1771220, 2012098, 1734794, 1836221, 2022333, 2158455, 1991814, 2012151, 1939778, 2048172, 2451415, 2203303, 2604140, 2300636, 2259411, 2155190, 2085847, 2576429, 2456107, 2388316, 2682450, 2522592, 3072487, 3315566, 3680696, 3962232, 4905505, 6418065, 9856066, 17925916, 37354488, 47606467, 19582620, 10608124, 4582029]
14540B696985m21240m08202j22689p123l41745M23658l9699n0122J61298l28114
14530A563007K39479J95620j25591j18613j81261N01398k8523J23063j115j24529
14520B042935J16416j69518m9608L10332j15690J59972J51087n9926L2084o9127
14510B348957K32970j76543M98328k54524L4159M1434l8215k21377L96405k84331
14500B577263K86913j46245k26393N29643j25614J73177j99976K82068j91740
14491B959096J28448j20118K68500k15049N47783n39029L49040l51089N79588
14482C607170k1285k67128K0274K39401k68073M51536r7348P9980l1287j46959
14472C566281K55567k40222m8512J34521J27812J46335J17731r6526j33680M46543
$$ y = [2696985, 2275745, 1867543, 1744854, 1737731, 1395986, 1819644, 1779945, 1729823, 1891121, 1563007, 1802486, 1998106, 1872515, 1753902, 1572641, 2074039, 2045516, 2168579, 2167464, 2042935, 2159351, 1989833, 1940225, 2250557, 2134867, 2294839, 2445926, 2386000, 2418084, 2348957, 2581927, 2405384, 2903712, 2649188, 2683347, 2724781, 2686566, 2465189, 2861594, 2577263, 2864176, 2717931, 2491538, 3021181, 2895567, 3068744, 2868768, 3150836, 2959096, 3087544, 2967426, 3235926, 3020877, 3568660, 3029631, 3378671, 3027582, 3607170, 3585885, 3318757, 3339031, 3578432, 3310359, 3761895, 3664547, 3744527, 3713240, 3566281, 3821848, 3581626, 3533114, 3667635, 3795447, 3941782, 4059513, 3962987, 3829307, 4275850]
14462D275850J16336j74565j85936m790k58524Q18655P2831k88015K90968j37004
14452D525806O9326q8916k2435L66998M0918P1701J62097j19374M9207j88737
14442D866591M10430j19916K93105l122K95155j51750K74149p703J23934l66336
14432E614537K43740q3731M75814k44343Q4650K25156k2835M3551k10818O68761
14422F794482N1762l10271M54180J20197j34614M3662L27495L15580N2699J92257
14412G907429K9418l18475J49453O17763o97797N22040L71769J26793j60167O01850
14402I150076j09359j43122L55749J3834K17901N44128k05306M06189p0613K95025
14392A0454502J97539M60844j93834j52263M36528J18212K68347L11827j97343
$$ y = [4275850, 4392186, 4217621, 4031685, 4026895, 3768371, 4587026, 4659857, 4371842, 4662810, 4525806, 4595132, 4506216, 4483781, 4850779, 4891697, 4963398, 5125495, 5006121, 5055328, 4866591, 5277021, 5157105, 5450210, 5447088, 5742243, 5590493, 5864642, 5856939, 5980873, 5614537, 5858277, 5774546, 6250360, 6006017, 6090667, 6315823, 6292988, 6336539, 6125721, 6794482, 6846244, 6535973, 6990153, 7110350, 6975736, 7019398, 7346893, 7662473, 7715172, 7907429, 7936847, 7618372, 7767825, 8385588, 7687791, 8209831, 8581600, 8708393, 8548226, 9150076, 9040717, 8897595, 9253344, 9267178, 9485079, 10029207, 9823901, 10230090, 10159477, 10454502, 10652041, 11112885, 10919051, 10766788, 11203316, 11321528, 11589875, 11901702, 11704359]
14383A1704359N27572N89503n5680J93189O3790O26699M20209L4866K51926L34044
14373A4690477L72730K38691K77435Q793O70014K00404K73816L40725N47922J34918
14363A7755925L66085K35040N97791M53805L94141L35863N33875M95786M17395
14354B1585706O65002L28146M61883M67661M48534P77539M98128Q48102N58818
14345B6639519Q10111O06365N72361J022583P12021J045478O35122R70504P68622
14336C3782686R42412J462458M38290J088159J343876J172985J551505Q30018
14328D2612389R57134K107651J160310J746655J469275J812341J802926J422245
14320E5090926K162698K443472K052810K172175K415189K557832K753863K594197
$$ y = [11704359, 12231931, 12821434, 12765754, 12958943, 13022733, 13649432, 14069641, 14104507, 14356433, 14690477, 15063207, 15301898, 15579333, 15588126, 16258140, 16458544, 16732360, 17073085, 17621007, 17755925, 18122010, 18357050, 18954841, 19408646, 19802787, 20138650, 20672525, 21168311, 21585706, 22250708, 22578854, 23040737, 23508398, 23956932, 24734471, 25232599, 26080701, 26639519, 27449630, 28055995, 28628356, 29650939, 30362960, 31408438, 32043560, 33014064, 33782686, 34725098, 36187556, 36625846, 37714005, 39057881, 40230866, 41782371, 42612389, 43569523, 45677174, 46837484, 48584139, 50053414, 51865755, 53668681, 55090926, 57253624, 59697096, 61749906, 63922081, 66337270, 68895102, 71648965, 74243162]
14312G4243162K882609L674095L023033L632862M116065L659730M438041M192686
14304A03862283N267133M822680N341122N907414O192516O320252O773005P537559
14296A52023964P430277Q765682R156145R272742J0007256J0440808J1536325
14289B18633199J1867956J2778657J3277399J3964232J4594185J5173428J5433235
14282C15722291J5703872J6206094J5869127J5960073J5126410J4114896J3681044
14275D22383807J1808560J0347494P163817L702383J388532O14661l82064k368825
14267D54658365l357593n706850r715499j1512342j3131434j4523165j5730251
14260C80981231j6243366j6648227j6240437j6407321j5917908j5202786j4108487
$$ y = [74243162, 77125771, 80799866, 83822899, 87455761, 91571826, 95231556, 99669597, 103862283, 109129416, 113952096, 119293218, 125200632, 131393148, 137713400, 144486405, 152023964, 159454241, 168219923, 177376068, 186648810, 196656066, 207096874, 218633199, 230501155, 243279812, 256557211, 270521443, 285115628, 300289056, 315722291, 331426163, 347632257, 363501384, 379461457, 394587867, 408702763, 422383807, 434192367, 444539861, 451703678, 455406061, 456794593, 457409254, 457027190, 454658365, 451300772, 445593922, 435878423, 424366081, 411234647, 396711482, 380981231, 364737865, 348089638, 331849201, 315441880, 299523972, 284321186, 270212699]
14253B70212699j3625224j3564445j3245679j2057923j1766001j0685394r972287
14246A85295746r664729q642478p970008q323294p366887p193317o696418n921846
14238A23516769n503226m671779n444095n078840m653751m206838l711940l027904
14230H7218396m058341l264421l431610l112965k948821k349732k788590k027847
14222F3236069k493819k145638j967604j728614j763231k260461j864420j342053
14214D7670229j602580n87883k016768j417716j529742j148449j136939m04207
14206C7825945q26802j716364j158510q96105j066981o22496q00282m76081j372171
14197B8890153o54742q50679n05273n75884n07083p61221r88052m93930l90502
$$ y = [270212699, 256587475, 243023030, 229777351, 217719428, 205953427, 195268033, 185295746, 175631017, 166988539, 159018531, 150695237, 143328350, 136135033, 129438615, 123516769, 118013543, 113341764, 107897669, 102818829, 98165078, 93958240, 90246300, 87218396, 83160055, 79895634, 76464024, 73351059, 70402238, 68052506, 65263916, 63236069, 60742250, 58596612, 56629008, 54900394, 53137163, 50876702, 49012282, 47670229, 46067649, 45479766, 43462998, 42045282, 40515540, 39367091, 38230152, 37825945, 36999143, 35282779, 34124269, 33228164, 32161183, 31538687, 30738405, 30262324, 28890153, 28235411, 27384732, 26879459, 26303575, 25796492, 25035271, 24047219, 23553289, 23162787]
14188B3162787q04903l29404m84948n93113n54785m79269k21117m19021o58458
14179A8617769l98907l17191n68568k9591k57470l68057o92941j21799l88461
14170A5474784m01567j28533m20255L9550k22160n48099j4687l74681l36568k21987
14160A2845797j07873m66338k43861j27934o6230l20132j48247k83367j15494
14151A0966321j91098k24576K42628j75714o99203M9484j80500j74933Q4455k40124
14141I456740m90450K17074J8409m86150p0952J64216l84830j32233l10259J09643
14131H091208j12296q4303K36357m12962l12552M3256k62388j1550Q2273j42787
14121G114256k8962n38165L77826k67527m8919k60996J86921l03550K06080m12486
$$ y = [23162787, 22357884, 22028480, 21543532, 20950419, 20395634, 19916365, 19695248, 19276227, 18617769, 18218862, 17901671, 17333103, 17303512, 17046042, 16677985, 15985044, 15863245, 15474784, 15073217, 14944684, 14524429, 14563979, 14341819, 13793720, 13779033, 13404352, 13067784, 12845797, 12737924, 12271586, 12027725, 11899791, 11833561, 11513429, 11365182, 11081815, 10966321, 10775223, 10550647, 10793275, 10617561, 9918358, 9967842, 9787342, 9612409, 9696864, 9456740, 8966290, 9183364, 9201773, 8715623, 8644671, 8808887, 8424057, 8291824, 7981565, 8091208, 7978912, 7894609, 8130966, 7718004, 7405452, 7448708, 7186320, 7174770, 7257043, 7114256, 7085294, 6547129, 6924955, 6657428, 6608509, 6347513, 6534434, 6230884, 6436964, 6024478]
14111F024478J18487r536j99767m3346o1888r7613j87457j10942K949q1060k37467
14100E116838J950Q0575l6221j60827l15298L48692Q1215J26637m05004p4986
14090D763571j27162j49984l14108O81945k31637l18004Q1795P0196k91612k7020
14080D137980n8534r5685K45746O6414j22616q1898k17616J69395l06724J77476
14070C913938n2565K3873m02005P2538J94926k59916K00461k26994K26347n3847
14060C636756k19659K90940J12812k87316j61141J22350j6710Q0292m02204K22962
14050C379082k24923J39537k64972J0563K72963k40769j92656j75122k22467L64410
14040B845646J68483k77311l0605O0577q1255l35975M13208j60466P2031o6263
$$ y = [6024478, 6142965, 6133429, 5933662, 5890316, 5828428, 5730815, 5543358, 5432416, 5435365, 5354305, 5116838, 5118788, 5199363, 5163142, 5002315, 4687017, 5035709, 5116924, 5243561, 4838557, 4763571, 4636409, 4486425, 4172317, 4854262, 4622625, 4304621, 4386416, 4456612, 4165000, 4137980, 4079446, 3983761, 4229507, 4295921, 4173305, 4091407, 3873791, 4043186, 3736462, 3913938, 3861373, 3885246, 3483241, 3555779, 3750705, 3490789, 3691250, 3464256, 3690603, 3636756, 3417097, 3708037, 3820849, 3533533, 3372392, 3494742, 3478032, 3558324, 3156120, 3379082, 3154159, 3293696, 3028724, 3039287, 3312250, 3071481, 2878825, 2703703, 2481236, 2845646, 3014129, 2736818, 2706213, 2766790, 2685535, 2349560, 2762768, 2602302, 2674333, 2608070]
14030B608070K69119j61236j27693j27240J60847m20911J07287J73777j57609
14021B324411K85913l43858K17o7440o0959J03121N2957k97189M28570O9310l28674
14010B166379q3566J84955j41372k13240m333k05524M1654J51190J31160m17076
14000A610227L42057k77861K78030n4473j70263J09043o4935k31529M59221J23148
13990B122665J40373M66083K357274O207786J8792840J9767605B4216979A1946205
13981G239012k415325o57161o58654p4475p88896l20649N72121m88044k24043
13972B183886K1814o1537K68891k96162K41621o08593J47472K7251J08292m28976
13962A603959K61814k034Q3756l16083O15Q0388k43957J27828L01570l86035L41595
$$ y = [2608070, 2877189, 2715953, 2588260, 2461020, 2621867, 2200956, 2308243, 2482020, 2324411, 2610324, 2266466, 2266683, 2199243, 2138284, 2241405, 2294362, 1997173, 2425743, 2495053, 2166379, 2082813, 2267768, 2126396, 1913156, 1908823, 1703299, 1744953, 1896143, 2027303, 1610227, 1952284, 1674423, 1952453, 1897980, 1727717, 1836760, 1771825, 1540296, 1999517, 2122665, 2263038, 2729121, 5086395, 11294181, 30087021, 49854626, 24216979, 11946205, 7239012, 4823687, 4166526, 3507872, 3433397, 2644501, 2323852, 2895973, 2407929, 2183886, 2205700, 2144163, 2413054, 2116892, 2358513, 1749920, 1897392, 1924643, 2032935, 1603959, 1865773, 1863739, 1947495, 1631412, 1632027, 1712415, 1468458, 1596286, 1897856, 1511821, 1853416]
13951A853416r6522j06419R1118l37534K45715m7800o9826O9510l89369K88407
13941A500696M3303j19980k7025J96752k52473l5229j0146J89851k73442N12210
13931A724517r322j22335k37426k60556J70883M12299m48089K28377l43431J33145
13921A248062J02950j58153M6542j51764L80588N0377r0929O0050j67088J76347
13911A496982l74658L34776j00581R9725r9189R0486l38390r3987o1588L02872
13901A256448r869j29232q9645K73799k64079Q1029P7625j72376n1451N5805j71713
13890H56341M24328j48266k37055J44504K13367l94855M4525J02873k7200K81338
13880A259900l41364K74390l28900N30628k76121j36804l18718N52526j25767
$$ y = [1853416, 1756894, 1650475, 1741593, 1404059, 1649774, 1601974, 1532148, 1601658, 1212289, 1500696, 1543999, 1424019, 1396994, 1593746, 1341273, 1306044, 1295898, 1485749, 1212307, 1724517, 1715195, 1592860, 1355434, 1094878, 1265761, 1678060, 1229971, 1458348, 1114917, 1248062, 1351012, 1192859, 1239401, 1087637, 1468225, 1518602, 1427673, 1487723, 1320635, 1496982, 1122324, 1457100, 1356519, 1456244, 1357055, 1447541, 1109151, 1015164, 953576, 1256448, 1246579, 1117347, 1027702, 1301501, 1037422, 1118451, 1196076, 1023700, 972249, 1028054, 856341, 1280669, 1132403, 895348, 1039852, 1253219, 858364, 902889, 1005762, 978562, 1259900, 918536, 1192926, 864026, 1394654, 1118533, 981729, 663011, 1215537, 1089770]
13871A089770N2713l46015m2244N17544E93689L35713j57414o4415K62054j45330
13861H24297p4720j2328L29981k66650l504o5725K78235k25122K36013k23251
13851G97226N9960o798l07471M16941k45083L61952k71647N9475j86500L55996
13841A034051k54088K51119r272k74096J51771j52599P7266M4080r8234K11481
13831I81479o1402C27956J06385M20688l46141m9775j04857L56134J49576B06686
13820G31828k59320K99952J74635k87902R2782J11155j04018P924j59693k24265
13810C83078K62223n9667K52870j22766l903j19937J83650m6664l19752J85027
13800E94159j9652q4963N01346l02541k67113L83579r5625Q7605l784k80586N8938
$$ y = [1089770, 1142483, 796468, 754224, 1271768, 593689, 929402, 771988, 707573, 969627, 824297, 749577, 737249, 1067230, 800580, 797076, 731351, 1009586, 784464, 1020477, 797226, 857186, 850388, 542917, 959858, 714775, 1076727, 805080, 864555, 678055, 1034051, 779963, 1031082, 1021810, 747714, 899485, 746886, 824152, 868232, 769998, 981479, 920077, 327956, 434341, 855029, 508888, 459113, 354256, 710390, 859966, 206686, 731828, 472508, 772460, 947095, 659193, 751975, 863130, 759112, 767036, 607343, 383078, 645301, 585634, 838504, 715738, 711835, 591898, 775548, 728884, 409132, 594159, 574507, 489544, 990890, 688349, 421236, 804815, 709190, 796795, 793011, 512425, 571363]
13789E71363L7530j340J55886j62445p9926J13413N7916J86594q2770j28059R3852
13778G62014k99722J7917L13253k34998Q6920m1304j69642J86679j22339A96222
13767D54255J26419P0064K4354l18907K22792K8675J17144p5498j62840L7553
13757E24011n0291P1703k13950j9217K00992K91345r8576k41524M7419J14471
13747F26383B46485J83072J22961j15719J06703R1823k88023K11241j66194K84886
13737F77235J94790l07292K27247k65686q1149j6655P3384K0085j70666j23201
13727B28092K85886K27816j40541m177k14865J82585j96553J29088L29726k48895
13717E78162j0914r5376j99734K0631K32819B43703J86576j08095J18175r3743
$$ y = [571363, 608893, 607553, 763439, 600994, 521068, 634481, 692397, 878991, 796221, 668162, 762014, 462292, 480209, 793462, 558464, 645384, 604080, 434438, 621117, 498778, 196222, 454255, 580674, 650738, 675092, 356185, 578977, 607652, 724796, 649298, 486458, 524011, 473720, 545423, 331473, 312256, 513248, 804593, 706017, 464493, 511912, 626383, 246485, 429557, 552518, 436799, 543502, 635325, 347302, 558543, 392349, 677235, 872025, 564733, 791980, 526294, 445145, 428490, 501874, 521959, 351293, 228092, 513978, 741794, 601253, 597076, 382211, 564796, 368243, 497331, 827057, 578162, 567248, 471872, 272138, 292769, 525588, 243703, 430279, 322184, 440359, 346616]
13707C46616n3276H4334L06676A86750K14957J28132J68042q0927j95069m844
13697D17041m4469O289N2048o1096J12394M9511j78357J65584Q322N2317k76659
13686C02925M8758L6741M9759J07939E7023K73478M9688J55586m0288l3163k11072
13675B51252K54026K61816k27994j37213j99095J99931j7007L58038j82338A86976
13664B21582o6807N3779L27124j77021j04487n8178K22179j65275A1141L98487
13654D09628k5803r9997M72807C68371k4800L8067K13391B37734K65667k4371
13644D79030j66588j0197L31423B00108K33848a04540C92430k7141P1874r7042
13634C40121K81640A96661M3592J22521n4371o0760N9787L36877n9158j99947
$$ y = [346616, 293340, 84334, 391010, 186750, 401707, 529839, 697881, 616954, 421885, 417041, 372572, 378861, 430909, 369813, 482207, 531718, 353361, 518945, 527267, 579584, 302925, 351683, 388424, 438183, 546122, 57023, 330501, 380189, 535775, 495487, 462324, 251252, 505278, 767094, 539100, 401887, 202792, 402723, 385716, 743754, 561416, 186976, 221582, 154775, 208554, 535678, 358657, 254170, 195992, 418171, 252896, 11141, 409628, 383825, 283828, 756635, 368371, 343571, 381638, 595029, 237734, 503401, 479030, 312442, 302245, 633668, 200108, 433956, -104540, 392430, 365289, 437163, 340121, 621761, 196661, 240253, 362774, 308403, 247643, 307430, 644307, 585149, 385202]
13624C85202j06185J86515m6228k01487l5446K55906l7275A25220J77736R5393
13614C98349j93770M94317k67179j31174K9949M3636o7052n2121K42735j45551
13604C52139M433j57573L6611J71036j28974J11260j4504K18549B95811M8291
13594C44102p2274P7973k0728A61663R1348l1425E8537K53296j25383M1514P6312
13583C04276R3671j5158a30354A7287K06192L39575j52016J4604p9168j46696
13573A99778r711J83967A3226K61371J38398j09053j02997Q3258n9228Q4288J48418
13562D57681M6961A81751G5084a9401E44907n3992B10540D6774L0255J01690k6827
13551A51892l4137B1571K50766L07469B31206c8728A84586J59633a71263C24871
$$ y = [385202, 279017, 465532, 419304, 217817, 182371, 438277, 401002, 125220, 302956, 398349, 204579, 698896, 431717, 300543, 330492, 374128, 307076, 254955, 497690, 352139, 356572, 198999, 235610, 406646, 277672, 388932, 374428, 592977, 295811, 344102, 271828, 349801, 329073, 161663, 253011, 221586, 58537, 311833, 186450, 227964, 304276, 397947, 382789, -130354, 17287, 223479, 563054, 411038, 425642, 346474, 199778, 190067, 374034, 13226, 274597, 412995, 303942, 200945, 284203, 224975, 309263, 457681, 504642, 181751, 75084, -19401, 544907, 490915, 210540, 46774, 77029, 178719, 151892, 117755, 21571, 272337, 579806, 231206, -38728, 184586, 344219, -171263, 324871]
13540C28916b3456C52344j428h516D06898q0923J08068j90520i430j47668p4417
13529b31515G7812L54409k03006L18374p4545d93366C69346j74701G4409J30863
13519B05272K75349d9471A49508M3573J2131C2045c52E48379k57480K59442A61718
13507A97769o9195e5261A28554J24896K81663k35720J7370j7500E7803J29677
13497A87480E9436K43979a35325A88997N0042f2072B71110B2610J90804K8619
13487B42033K14964E7915J72456a12334B03454o1133J16799a88276B98192A06112
13476C9510N69864C4862M18127k17990E5057L30168I1213J13097m074L59351d387
13464A19276a11268l3811B16320C3057K61760E1907n297J36489J50471d4715F251
$$ y = [328916, -23456, 352344, 350916, -8516, 406898, 325975, 434043, 243523, -9430, -157098, -231515, 77812, 432221, 229215, 547589, 473044, -493366, 369346, 194645, 74409, 205272, 480621, -49471, 149508, 193081, 205212, 32045, -352, 548379, 290899, 550341, 161718, 197769, 128574, -55261, 128554, 253450, 535113, 299393, 316763, 299263, 57803, 187480, 59436, 303415, -135325, 188997, 239039, -62072, 271110, 22610, 213414, 242033, 456997, 57915, 230371, -112334, 203454, 142321, 259120, -188276, 298192, 106112, 39510, 609374, 34862, 452989, 234999, 55057, 385225, 91213, 204310, 200236, 559587, -4387, 119276, -111268, -145079, 216320, 33057, 294817, 51907, 46610, 183099, 333570, -44715, 6251]
13452C76141k214F5456j9431P5452A0582M15510B10044D0747J52502e1390a7138
13440B63170A17882l3441K59587j30961p7118m12J63838C0760M39222j30764r5989
13429B43229R2298p3024F6855K65938a91367B67782P0109k3520j50082I906K46827
13418B56733n089j6120r2712E1694Q2945K02183A7223L39439a17428E1282b3679
13406E6609L46965n8041L0592b0122A60501K22014j09457J19794A64136h1046
13395B48553J03631A8331O0871d2631B32097E1883R1269K93593G3856N2195J62520
13384B88571A7542K6268K53925L3719F2693J20113J61987j23963M0549a05603
13373F59141f2548H4310P8228o7444C2453b21351C2952J24892J0340J07660E9934
$$ y = [376141, 373927, 65456, 46025, 121477, 10582, 426092, 210044, 40747, 193249, -51390, -17138, 263170, 117882, 84441, 344028, 213067, 135949, 135537, 299375, 30760, 469982, 339218, 243229, 335527, 262503, 66855, 332793, -191367, 267782, 337891, 314371, 164289, 9906, 256733, 251644, 235524, 142812, 51694, 134639, 336822, 17223, 356662, -117428, 51282, -23679, 56609, 403574, 345533, 376125, -20122, 160501, 382515, 273058, 392852, 164136, -81046, 248553, 352184, 18331, 79202, -42631, 232097, 51883, 143152, 436745, 73856, 126051, 288571, 17542, 43810, 297735, 331454, 62693, 182806, 344793, 220830, 261379, -105603, 659141, -62548, 84310, 162538, 95094, 32453, -221351, 32952, 157844, 168184, 275844, 59934]
13361E1030h4508A47799K38285c1371A17755n0537B348L33128A14158n546j6650
13350I1962a33568B31420b33143A79571q7597m2617K76281K6270M9882k9390L4402
13339D06802j38262r7604j92F5497J82890R1566j20204K55490A43997K2737K44041
13328D10775j84427c2242B30964k8768R8823A07383M7664J32601B7501K23919
13318B51420R727K54353k29632j8544b9409A76180e7398A56846o0533e4389G6609
13306f9178m4438B91668b3294E2804L49893P198b4899B88592E4834d11000H370
13294a22056B04313K6198I3571c4359H1356K61586j01069e05066B01766J03314
13284C05080p7951j3002l8773R7961K3566A3976e1560l1101I14a5518C4423b72315
$$ y = [51030, -84508, 147799, 386084, -31371, 117755, 67218, 2348, 335476, 114158, 108612, 91962, -133568, 231420, -233143, 179571, 91974, 49357, 325638, 351908, 401790, 372400, 406802, 268540, 170936, 170744, 65497, 248387, 339953, 219749, 475239, 143997, 166734, 410775, 226348, -32242, 230964, 202196, 301019, 107383, 155047, 287648, 27501, 251420, 261147, 515500, 285868, 267324, -29409, 176180, -57398, 156846, 96313, -54389, 76609, -69178, -113616, 291668, -23294, 52804, 402697, 409895, -24899, 288592, 54834, -411000, 8370, -122056, 204313, 230511, 93571, -34359, 81356, 342942, 241873, -505066, 201766, 305080, 227129, 214127, 175354, 273315, 296881, 13976, -51560, -82661, 914, -15518, 34423, -272315]
13271A49207K3462N9751b51352c1204B61436G3666J92408a43696a3146C7499b46265
13259d7159h726A49892L6168D2534L91501A83073G6143a54933I1607N2375a00888
13247B75563p8255b54769c3449M028e882D38484a04278H3338L9778N5866E0243
13235e4027B85010F0141e6654l2485C46215j41398G9493M5987a3542l3847A06814
13223B00300G6148o464B4459k667a25045E7062a44438I0924a59636C00248r9217
13212B01031Q0945A31052F1113B9519K3725L77400e5191H4907C3919L9853a3291
13200C3906J81286C9950A5985J56105A1520a4232m8699E3228k3275E546J05651
13189A11197C771h0813C0120N9819a92453B20421k829b6205j03434q3210C0150
$$ y = [149207, 172669, 232420, -251352, -31204, 261436, 73666, 266074, -143696, -13146, 37499, -246265, -47159, -8726, 149892, 186060, 42534, 434035, 183073, 76143, -154933, 91607, 143982, -100888, 275563, 197308, -254769, -33449, -29421, -5882, 438484, -104278, 83338, 123116, 178982, 50243, -54027, 285010, 60141, -56654, -89139, 346215, 204817, 79493, 125480, -13542, -47389, 106814, 200300, 76148, 69684, 24459, 21792, -125045, 57062, -144438, 90924, -159636, 300248, 201031, 281976, 131052, 61113, 29519, 53244, 430644, -55191, 84907, 33919, 73772, -13291, 33906, 215192, 39950, 15985, 172090, 11520, -14232, -62931, 53228, 29953, 5546, 111197, 3771, -80813, 30120, 89939, -192453, 220421, 217592, -26205, -129639, -212849, 30150]
13177i6729A36113d9328A63982D8723J87097b28548A23477b6365G9279a06670
13166b90840B67201B8388J28053e4992j1492C76142E2602J65681k7765f1241k7369
13155h8610c6067j51613j15050c9829A87142P6073a83235e8179C55764g1179A33494
13143F0893j9623J50561e8864f211B41026I246J99229L0630H1750b63010A53606
13131f6076F4439g2397o1412A40159b33056B83386d4066E6221K28744r3304A1946
13119a4939o1658F4711b27111j37483a47300m3435D0534g1770I2102a41041a7424
13107B51653a78467B53664q7540o9146k0651N1654E5423b12739B48083j17810
13097A30273R7740h8403A91228c29542A87437a50367M2363j1954A40189J5613
$$ y = [-96729, 136113, -49328, 163982, 48723, 235820, -228548, 123477, -26365, 79279, -106670, -290840, 267201, 28388, 156441, -54992, -66484, 376142, 52602, 218283, 190518, -61241, -88610, -36067, -187680, -302730, -39829, 187142, 263215, -183235, -58179, 355764, -71179, 133494, 60893, 41270, 191831, -58864, -6211, 241026, 9246, 208475, 239105, 81750, -263010, 153606, -66076, 64439, -72397, -133809, 140159, -233056, 283386, -44066, 56221, 284965, 191661, 11946, -14939, -76597, 64711, -227111, -364594, -147300, -190735, 40534, -71770, 92102, -141041, -17424, 251653, -178467, 253664, 166124, 96978, 76327, 127981, 55423, -212739, 248083, 130273, 228013, -88403, 191228, -329542, 187437, -150367, -108004, -119958, 140189, 155802]
13087A55802a94500A15534b7276e688q7284A77703i6782a4700H982N0058J33097
13076A92137H490N09859A06653d1592A24890J13725A6150f2327k11437e2707n6882
13065a09589D5298a0166B08405J24923A37672o7201d9479d452C05100j17743a05094
13053B23061N1403N7750c60243A78481F9498a64670f895B59061A7852a38657M1152
13042i7505f976I1895a9681F0533a01201A92065D8235L93839H2733N9866O0376
13031B02975H9498A7952L2674M8663a19012c5007H5860L7161a39075C27645g4310
13019f288B46972K00666A89742l9819a11469B54161q8560L425a33497O3317A04890
13007B3347L5791J83229j18076Q5952R1314a91992C1439a44123B6810L7117a80101
$$ y = [155802, -194500, 115534, -27276, -5688, -92972, 177703, -96782, -14700, 8982, 59040, 192137, 8490, 518349, 106653, -41592, 124890, 238615, 16150, -62327, -273764, -52707, -109589, 45298, -10166, 208405, 333328, 137672, 70471, -49479, -4452, 305100, 187357, -105094, 223061, 274464, 332214, -360243, 178481, 69498, -164670, -6895, 259061, 17852, -138657, -97505, -6976, 91895, -19681, 60533, -101201, 192065, 48235, 442074, 82733, 142599, 202975, 89498, 17952, 50626, 99289, -119012, -35007, 85860, 123021, -139075, 327645, -74310, -6288, 246972, 447638, 189742, 149923, -111469, 254161, 165601, 169026, -133497, -70180, 104890, 23347, 59138, 242367, 124291, 210243, 301557, -191992, 31439, -144123, 26810, 63927, -180101]
12995a62986j20688E3501J74444e5985e665C85222A86665i4779H980J78370a05299
12983g8227A59844e6212j26837o153A81481A9171P1350A702b89198D16934E0220
12971a79905a9452A0988N69247A16081P1847a03577B85883a54061l7354G8960
12960B0946K71765A15038J12288C8845P0a02542A57823a32245A65482C7480d1172
12948B6833a06973E8735j6323A3260d5209A58630f1392G4385J14643p4528n1246
12937F3254R9075a05679j89929a19821C99670j93336a83240A54751L3064h4810
12926A31185P2234a77293k0144L9608C7787b8971F0954b4600A311R4441k8450
12915F7302a07350B6671d2757A53273a1220l08371A33675C9860a20375M6736J8149
$$ y = [-162986, -283674, 53501, 227945, -55985, -5665, 385222, 186665, -94779, 8980, 187350, -105299, -78227, 159844, -56212, -183049, -189202, 181481, 19171, 90521, 1702, -289198, 416934, 50220, -179905, -19452, 10988, 580235, 116081, 187928, -103577, 285883, -154061, -191415, 78960, 20946, 292711, 115038, 227326, 38845, 38915, -102542, 157823, -132245, 165482, 37480, -41172, 26833, -106973, 58735, 42412, 13260, -45209, 158630, -61392, 74385, 189028, 114500, 63254, 162329, -105679, -295608, -119821, 399670, 206334, -183240, 154751, 187815, -84810, 131185, 203419, -177293, -197437, -157829, 37787, -28971, 60954, -24600, 1311, 95752, 67302, -107350, 26671, -42757, 153273, -11220, -319591, 133675, 39860, -120375, -73639, -55490]
12904e5490l2618j40397A75671a01978B61989d28930e9791B39006I5645a6033
12893B12888b99446C16474m9808b05801F1722J31265k0872K22362E9335K59159
12883C18494A29572i68r6662j09357c7744G4737k7498a75074A12539f4731C45132
12871c1783B8500L5826b07609A55869D6855a94401D7416h6337k3035a9492l08665
12860c28157C46817G6210J59673m8259J10981I223f1451J9707J148j35073C1787
12848g3207b8595A55945o8273i7718A23627J64481C5711Q5154D7576e178G1617
12836A12872J4830J39680j8447r3924E2554e0742j42902h1399J3483a9054p2974
12825i2028o8875d1110F2168c6674j11501K9832q3952E9314c45606A86274F5417
$$ y = [-55490, -88108, -228505, 175671, -101978, 261989, -428930, -59791, 239006, 95645, -16033, 212888, -299446, 316474, 266666, -205801, 61722, 192987, 172115, 394477, 59335, 318494, 129572, -968, -97630, -206987, -37744, 74737, 47239, -175074, 112539, -64731, 345132, -31783, 28500, 64326, -207609, 155869, 46855, -194401, 47416, -86337, -109372, -19492, -328157, 346817, 76210, 235883, 187624, 298605, 9223, -61451, -41744, -40596, -175669, 31787, -73207, -28595, 155945, 87672, -97718, 123627, 288108, 35711, 120865, 47576, -5178, 71617, 112872, 127702, 267382, 248935, 155011, 52554, -50742, -193644, -81399, -67916, -19054, -92028, -160903, -41110, 62168, -36674, -148175, -118343, -202295, 59314, -345606, 186274, 65417]
12813I1885K9150P3690f7149A82836b12618c3031B09317d7658q690a7729I3094
12801c25345d1892m58771h5684A40539J07309a78046H2321B5960a31754B74236
12790A16256h7228B81977H3059a16875e6741j40541q7182D09053c45979F4085
12779B42258A07321c6591j3643k24445B15663b8833p4104A04703a7852E0250J0583
12768F0833J87226h3392k8874H311c24944B98390g0495B28179E2138a47628c5578
12756A30045b07955G8329j7187g0222E74208E4209J27877c91158A53507J4214
12746A67721h8299b2462q0889A52176J41635h3425A09460P3255b09885A73743
12735a20978B3953J55610C2860M21997D2671J37613h689j58385B16289m5885P1481
$$ y = [91885, 121035, 194725, -67149, 182836, -212618, -33031, 209317, -47658, -56348, -17729, 93094, -325345, -41892, -500663, -85684, 140539, 247848, -178046, 82321, 25960, -131754, 274236, 116256, -87228, 281977, 83059, -116875, -56741, -197282, -284464, 409053, -345979, 64085, 242258, 107321, -36591, -50234, -274679, 215663, -28833, -102937, 104703, -17852, 50250, 60833, 248059, -83392, -112266, 8311, -324944, 298390, -70495, 228179, 52138, -147628, -35578, 130045, -207955, 78329, 61142, -70222, 574208, 54209, 182086, -391158, 153507, 167721, -88299, -22462, -103351, 152176, 293811, -83425, 109460, 182715, -209885, 173743, -120978, 23953, 179563, 32860, 454857, 42671, 180284, -8689, -167074, 216289, 170404, 241885]
12724B41885H0570M1221N4414a09083j76808a33131B3626d6758D1780J31859N6779
12713B30418r8463k7271g8991j24494B33344L8229j08564e4014E98042A85905
12702A25621a59165A68187J960o1183K3771j8653i857A0545K77738E7633K30945
12691B88578b17404A64606n3092m3029j8190b6771r1687A80933i3497B86343r6073
12680A90270a0752I4024a32555d4770G2330k1387N3601a34282D2091J78961q0940
12669A40112a32241c4430C70942H4599K2749J08638C0858K4417b31781A04930
12658g9166A17543D2281a08369B77780g255j91774J116A97570e8587B96604r6227
12647B00377g903C6901L8523P0303m1014a75092h905o7237B04754n5377Q0868
$$ y = [241885, 80570, 121791, 176205, -109083, -285891, -133131, 23626, -46758, 41780, 173639, 230418, 131955, 104684, -78991, -203485, 233344, 271573, 163009, -54014, 598042, 185905, 125621, -159165, 168187, 170147, 108964, 132735, 114082, -9857, 10545, 288283, 57633, 288578, -217404, 164606, 111514, 68485, 50295, -26771, -118458, 180933, -93497, 286343, 190270, -10752, 94024, -132555, -44770, 72330, 50943, 104544, -134282, 42091, 221052, 140112, -132241, -34430, 370942, 84599, 107348, 215986, 30858, 55275, -231781, 104930, -79166, 117543, 42281, -108369, 277780, -7255, -199029, -197913, 197570, -58587, 296604, 200377, -7903, 36901, 75424, 145727, 104713, -175092, -8905, -76142, 204754, 149377, 230245]
12636B30245a21055A15211j9391d2758l1904A07988J49315A20866M3087O4432
12626B28385K66520d4627D04307D2986L10364a3128B11992c08755E5748K20550
12616B76298J54865e3957B1289Q1071i8778B83170A30343j821k5706b82969c4874
12604h1961F4509b22148d0984m30926b2065C5817N141O6556J43404l8480k9173
12593A83265D6896J59900a6291j64373A76785a51053I5741e309k49029K84J17914
12582a36140P735G279J34958J55740a15821a7882F9171L7950h0130k07523B7575
12570a2201A48164b18567G2118J92983B6347q913h4896F7652O355O1013n9541
12559G5479R0343p0944Q0908A2111J46287c0084B1107K55975I8018a38113m2844
$$ y = [230245, -121055, 115211, 95820, -42758, -74662, 107988, 257303, 120866, 163953, 228385, 494905, -44627, 404307, 42986, 353350, -13128, 211992, -308755, 55748, 276298, 431163, -53957, 21289, 102360, -98778, 283170, 130343, 128522, 102816, -282969, -34874, -81961, 64509, -222148, -40984, -471910, -22065, 35817, 40958, 107514, 250918, 212438, 183265, 46896, 206796, -16291, -180664, 176785, -151053, 95741, -5309, -254338, -254054, -136140, -128405, 7279, 142237, 297977, -115821, -17882, 69171, 107121, -80130, -287653, 27575, -12201, 148164, -218567, 72118, 265101, 26347, 17434, -84896, 67652, 74007, 135020, 75479, 165822, 94878, 175786, 12111, 158398, -30084, 21107, 277082, 98018, -138113, -180957]
12548a80957j06181N6593A51514a60869A08723L4701H643Q6380a71540A36852
12537e3231k32838B89103g4672A31434K3500g8658C6499b30999e2331N194C15654
12525C3297b36465h8161P209j6094a9874A90565a7129l1020B14818f7573C24578
12513c06648C3896f4302A25739a34390D827b25700o289A6832K52471A11572K2612
12502A34184a1057o4725b2628C63179b10492A58793a12664c7719B52455k4713
12492B27742g1634B51975c00918B05309o8799a30948p4582B50318G4690a80133
12481a59339A4487P169o507P2099b52904F3500J68248A636J68463g1863n1227
12470a23090b0507k36467C26786A23110a51053A00617b45282J0592i5264j34831
$$ y = [-180957, -287138, -230545, 151514, -160869, 108723, 143424, 8643, 95023, -171540, 136852, -53231, -286069, 289103, -74672, 131434, 154934, -78658, 36499, -230999, -52331, -47137, 315654, 33297, -236465, -88161, -80952, -97046, -19874, 190565, -17129, -48149, 214818, -67573, 324578, -306648, 33896, -64302, 125739, -134390, 4827, -225700, -231989, 16832, 269303, 111572, 134184, -11057, -75782, -22628, 363179, -210492, 158793, -112664, -37719, 252455, 227742, -71634, 251975, -300918, 205309, 136510, -130948, -205530, 250318, 74690, -180133, -159339, 14487, 21656, 15149, 87248, -252904, 63500, 231748, 1636, 170099, -71863, -123090, -20507, -256974, 326786, 123110, -151053, 100617, -245282, -234690, -95264, -230095]
12460b30095R433r9784i5833D0437a8192A59624a67561M4627j44694C1948Q5199
12449A17147B3738h4090M181H2660c612n01260e288B93570A5892J38649B7221
12437H3314J01930G7257a01069a8182I0038J12855J02416e4540l3344M3442k46999
12426b91441h0269b3711C60384b38412a11208o1884A05465Q3605H9928e3065m3807
12415i6872E8226d1921F1046d6204A79245d5724G9478j2380J376b3765k23887
12404b47652n8210C4631J25027K0385g4825a3476k96282O0091k35845a92637D5082
12392A54550a40648B10264J09779B4670c6482j12175m7343g2135A94485I7171
12381d4550j73810A47405a04684A64111a53551A31346g0880k00845C7596b7765
$$ y = [-230095, -220662, -320446, -95833, 40437, -18192, 159624, -167561, -122934, -267628, 31948, 117147, 23738, -84090, -79909, 82660, -3612, -504872, -5288, 293570, 15892, 154541, 27221, 83314, 185244, 77257, -101069, -18182, 90038, 202893, 305309, -54540, -87884, -44442, -291441, -80269, -23711, 360384, -238412, -111208, -173092, 105465, 189070, 89928, -53065, -96872, 58226, -41921, 61046, -46204, 179245, -45724, 79478, 67098, 68474, -23765, -247652, -305862, 34631, 159658, 180043, -74825, -13476, -309758, -249667, -485512, -192637, 45082, 154550, -140648, 210264, 320043, 24670, -36482, -148657, -196000, -72135, 194485, 97171, -44550, -218360, 147405, -104684, 164111, -153551, 131346, -70880, -271725, 37596, -27765]
12370B727a69577a0526H3914a49596A30893J38403b9585l45820A57970a10455
12359c7463A4980K8750b92611E4365i6892G9127C954L5701a72956I6111c464k36842
12347b40306B19130G1083b16334Q4945a824k73552R0058c0669c862k53330r1746
12336c48938J02958e4829j20950j10973a10504A56386p1340J39752a2818A60606
12325e5846q4041k63052a62188B79755A6736b26389A09668m5176a21753j82192
12315c03945J44868C60875f1304B39335d1484C34317a57792B07704a70519A25096
12304B17537B9690K37530b47107E2664Q7303J4425K7477a60897L79K4637F6413
12292B94130A33859L9115J80919j37977q7563b52840h3830o7412B45471b09851
$$ y = [2727, -169577, -10526, 83914, -149596, 130893, 269296, -29585, -375405, 157970, -110455, -37463, 14980, 43730, -292611, 54365, -96892, 79127, 3954, 39655, -172956, 96111, -3464, -240306, 219130, 71083, -216334, -131389, -1824, -275376, -185318, -30669, -3862, -257192, -348938, -245980, -54829, -175779, -286752, -110504, 156386, 85046, 224798, -12818, 160606, -55846, -139887, -402939, -162188, 279755, 16736, -226389, 109668, 64492, -121753, -303945, -159077, 360875, -61304, 239335, -41484, 334317, -157792, 207704, -170519, 125096, 217537, 29690, 267220, -247107, 52664, 139967, 154392, 181869, -160897, -160518, -135881, 66413, 294130, 133859, 172974, 353893, 215916, 128353, -252840, -83830, -151242, 245471, -209851]
12281E2283B1379J5512L49532B6727K18595l1555a19795B22231b22620a7610A25064
12269A9933J82033A9197a09441k31026a2207q5368j23630H8403c04213H6345C0832
12257I847K35860b95488b1012A99811k2941K0695G6724P5735J25310d549C6247
12245A77731o6780K53106j57385b6671j71656b5472B12670J13357b16733B63297
12234a28855K7672B88398p9047a71849a2819B63317a58242A21736K69845J44732
12224E36313k63657O0812j12494P4900A0208Q1330J93871j18561A1365Q9889i5910
12212a10229B49534a63495I1088m0814c6955A80763k4808n4658J1997L5658K309
12201A51261m4409i359A60777K331G4816K02915k1119H9794m0464K67086A22851
$$ y = [52283, 21379, 36891, 386423, 26727, 245322, 213767, -119795, 222231, -222620, -17610, 125064, 19933, 201966, 19197, -109441, -340467, -12207, -97575, -221205, 88403, -304213, 86345, 30832, 9847, 245707, -295488, -21012, 199811, 176870, 197565, 76724, 152459, 277769, -4549, 36247, 177731, 110951, 364057, 206672, -26671, -198327, -25472, 212670, 326027, -216733, 263297, -128855, -101183, 288398, 209351, -171849, -12819, 263317, -158242, 121736, 391581, 536313, 272656, 333468, 220974, 295874, 10208, 91538, 285409, 166848, 11365, 101254, -95910, -110229, 249534, -163495, 91088, 50274, -36955, 180763, 155955, 101297, 113294, 148952, 151261, 106852, -9359, 160777, 163108, 74816, 277731, 256612, 89794, 49330, 316416, 122851]
12189A1757g8059A22628N287l1370l8670K5864f685A60032K52988A69707f7262
12177A92850J32278j44511K1206q6330q339C4658a49436B20544m1025a09148A97708
12165a56390A57940e4808F4747Q233F333b23828D8752L57435a25508A55398d2643
12153A52614a1317D05365g6027B15327a26671B98406A48107J78894a27860I7938
12142b85967g1780A00200d5771A56892G7620b51157A70511H517J97386b15617
12131f668A45236e2727C8799d0936A7817d46945b10237L5974D0019b39007b737
12119B27499a81751D9809J44481D797b48033E2051a13671k8048L8625j30771K7568
12108b06297f0564C23018j41304o6684a02257b9554j05505k83635A41601a54713
$$ y = [11757, -78059, 122628, 127915, 96545, 57875, 83739, -6685, 160032, 413020, 169707, -67262, 192850, 325128, 180617, 201823, 115493, 107154, 34658, -149436, 220544, 179519, -109148, 197708, -156390, 157940, -54808, 64747, 72980, 6333, -223828, 48752, 406187, -125508, 155398, -42643, 152614, -11317, 405365, -76027, 215327, -126671, 298406, 148107, 327001, -127860, 97938, -285967, -71780, 100200, -45771, 156892, 77620, -251157, 170511, 8517, 205903, -215617, -6668, 145236, -52727, 38799, -40936, 17817, -446945, -210237, -174263, 40019, -239007, -2737, 227499, -181751, 49809, 194290, 4797, -248033, 52051, -113671, -141719, -103094, -233865, -206297, -60564, 323018, 181714, 115030, -102257, -29554, -135059, -418694, 141601, -154713]
12097A60364F1042b21511B574L09955H9992B6345a9960K695j0678O058o4967o8767
12085a55619A7220a4651B10249E7106b44658J20206p3528B89466B3287J29662
12075A52949l6859i5358B8775e7509A12430J29940J578938j3046D11258B03357
12064B25008a62215A74236O0557n3499b12281E8741O1234C9286K32132n2246a00051
12052b9315I9178a7793D1183a23272q4621h2661A43035b21862f2147B25475p0861
12041A54614J21754d6556k61583B21134A8086J99508h084m15857A49879a48983
12030c02544A22165a01887k70126G9239e4495F3598J96894b08143A88097q5460
12020A02637M024m1241g5817A28182J29767a4117j14208d889j06849A10451c44036
$$ y = [160364, 61042, -221511, 2574, 312529, 89992, 26345, -19960, -17265, -27943, -21885, -86852, -155619, 17220, -14651, 210249, 57106, -244658, -124452, -197980, 289466, 23287, 152949, 116090, -95358, 28775, -57509, 112430, 242370, 1821308, 1808262, 411258, 203357, 225008, -162215, 174236, 234793, 181294, -212281, 58741, 119975, 39286, 271418, 219172, -100051, -29315, 99178, -17793, 41183, -123272, -207893, -82661, 143035, -221862, -62147, 225475, 154614, 276368, -46556, -308139, 221134, 18086, 217594, -8084, -423941, 149879, -148983, -302544, 122165, -101887, -372013, 79239, -54495, 63598, 260492, -208143, 188097, 102637, 106661, 65420, -75817, 128182, 257949, -14117, -128325, -4889, -111738, 110451, -344036]
12008A33686b6649h211k20923e330A77193l1742f1085l93276f8189a6030g460
11996A58526a35148E253e4548f152q0536l4848a2530l8673A34649b31838C6280
11984a5690j09139q0534I5136A5825a56386A1736J26680a66503N4671j05778k60001
11973d77611A09208D8546d4468A97570a80056A67344a95414k772D2087a72681
11962A46794k9404a93258E3723i7282F8147g2791G7384R9218b7548m3902j60929
11951b32379H0730a40397j06202A52437a70243A83089E0580D79b1501B65781p7424
11940A88357p4628P5564a01305j18266P9401B61872G2706a36392G9210b35172
11929a82118P4626a0947j23809Q750e3005O258A66361d8771A48560b35533M9783
$$ y = [133686, -26649, -8211, -229134, -5330, 177193, 145451, -61085, -454361, -68189, -16030, -7460, 158526, -135148, 5253, -54548, -6152, -86688, -121536, -12530, -51203, 134649, -231838, 36280, -15690, -124829, -205363, 95136, 15825, -156386, 11736, 138416, -166503, -111832, -217610, -477611, 109208, 48546, -44468, 197570, -180056, 167344, -195414, -198186, 42087, -172681, 146794, 117390, -193258, 53723, -97282, 68147, -72791, 77384, 176602, -27548, -71450, -232379, 80730, -140397, -246599, 152437, -170243, 183089, 50580, 479, -21501, 265781, 188357, 113729, 189293, -101305, -219571, -140170, 261872, 72706, -136392, 79210, -235172, -182118, -107492, -10947, -134756, -126006, -53005, -46747, 166361, -48771, 148560, -235533, -185750]
11918a85750l08921B937J68305M6625A2644Q968b7020k29662M4776j07420D3089
11906A61572h3478j30285C6699K36337L3567a24532l1025d8252k89698a19194
11895d46353B1262d599B26a09684p7142B35403K5860N9179a43717k6040k14605
11884c84362b2123A70320a47037l5922A64953a08913o7912D1411h6501k66418
11874c52919h6026j9814j39970o4767F1312c89768D4439j4947d8949B2233L0033
11863E2266d1250j56953A46510f4584A61700b91431J43323c0303k47526B38999
11852F6628b0466j67024b2439A18135K08003A7748K25347e5570B63606b25116
11841a31145A49040a00299I575K21973a42925M3199H5093m0757a06462j8666p4206
$$ y = [-185750, -494671, 2937, 171242, 217867, 12644, 21612, -27020, -256682, -211906, -319326, 43089, 161572, -83478, -213763, 36699, 273036, 306603, -124532, -155557, -48252, -337950, -119194, -446353, 21262, -4599, 226, -109684, -186826, 235403, 261263, 320442, -143717, -169757, -384362, -22123, 170320, -147037, -182959, 164953, -108913, -176825, 41411, -86501, -352919, -86026, -105840, -245810, -310577, 61312, -389768, 44439, 29492, -48949, 22233, 52266, -41250, -198203, 146510, -64584, 161700, -291431, -148108, -30303, -277829, 238999, 66628, -20466, -187490, -22439, 118135, 326138, 17748, 243095, -55570, 263606, -225116, -131145, 149040, -100299, 9575, 231548, -142925, -99726, 85093, 44336, -106462, -125128, -199334]
11830a99334A07005c168l18096G4217a71121A12349k1234a4424A96044M3659f8183
11818B41532j00784b36514M9243d9874A72044f1742l13074m8515g7168b6324j08586
11807a34910B09044A01902j5849b35492J07086B11788C2238a09756G0692J89102
11797B59794b12598G8874B8032c8854k45076D4838L20898j31736F4261J57803
11787B22064a22556B4470a07466p7161B3828a01223D2363b81696b8889b223m1650
11776d3873J696A16826a81783A24864a93501E133a06538N2742A8441b13657K0018
11765a93639C80714a53620A46737J916a80034B06606b5448E7316B8072K62379
11755B90451j36488a55506j20704p8856a56470K5096n0359c4677n6418A09856
$$ y = [-199334, 107005, -3168, -321264, 74217, -171121, 112349, 91115, -14424, 196044, 239703, -68183, 241532, 140748, -236514, -187271, -49874, 172044, -61742, -374816, -423331, -77168, -26324, -134910, 209044, 101902, 86053, -235492, -128406, 211788, 32238, -109756, 70692, 259794, -212598, 78874, 28032, -38854, -283930, 44838, 365736, 234000, 64261, 222064, -122556, 24470, -107466, -184627, 23828, -101223, 42363, -281696, -28889, -2223, -43873, -42177, 116826, -181783, 124864, -193501, 5133, -106538, -53796, 18441, -213657, -193639, 380714, -153620, 146737, 148653, -180034, 206606, -25448, 57316, 28072, 290451, 153963, -155506, -276210, -355066, -156470, -131374, -181733, -34677, -91095, 109856]
11744b40776B39484f1801j48827i2289a3057D9215a34249A61607a92886G3879
11733d36732E502c80058F623i6408k28547J60098j8652A92595E2305j8079L14534
11722C48760a95371B39822J65554b0568A3526J15495m2851a06032M0278B91668
11711B83317A04334P0759a12810K2467k44375A54965k3194a54718j93847E9672
11700d31057A29189d9843C49763j07618a59230N1721N2921A3741b0751k37577
11690b58328f4694j3422l619q0399A53566e9173A3261a21972B99332c1474a1759
11678c8436A8536J89666A01144a700A28853nO9804j2865c03026A72372q2177e8032
11665B62002c6063B47051c2261A22210e9189B50012P0614e3063D8714J42324i7400
$$ y = [-240776, 239484, -61801, -210628, -92289, -13057, 49215, -134249, 161607, -192886, 73879, -436732, 5502, -380058, 6623, -96408, -324955, -164857, -183509, 192595, 52305, 34226, 348760, -195371, 239822, 405376, -20568, 13526, 129021, 86170, -106032, -65754, 291668, 283317, 104334, 175093, -112810, -90343, -334718, 154965, 131771, -154718, -348565, 59672, -431057, 129189, -49843, 349763, 242145, -159230, -107509, -54588, 13741, -20751, -258328, -64694, -78116, -81735, -162134, 153566, -59173, 13261, -121972, 299332, -31474, -11759, -38436, 18536, 208202, 101144, -1700, 128853, 128848, 198652, 185787, -303026, 172372, 90195, -58032, 262002, -36063, 247051, -32261, 122210, -59189, 250012, 320626, -53063, 48714, 191038, -97400]
11653E2095b30025a6662B10125q3810C3180b5452k41569f9524E9879J14496b9571
11641b83302A45875c1414j4711q4580B2440a11933b6937b295k82426f0203D06548
11629G3083a72984D8894b3171E0500b16930A56801l1892L8620b45391A6955K04909
11618B21864E4483R6030J313a99387G8340K03058j16742B5215J95911a92745A23976
11606c2257G2340A4893a85753D1064h8130A01764K5210e7340j30315B84924b9371
11594a81565D70989a5370l9047j67624B56841G7619f503B24013a7348j33930E0482
11582A30600D4599M6429N5435J58283b77819g0500C57081a38599N045A51432J5122
11571A66554B1640P2318e5237F4230N394a88518L2603f8235A77752B674L60466
$$ y = [52095, -230025, -16662, 210125, 126315, 33180, -25452, -267021, -69524, 59879, 174375, -29571, -283302, 145875, -31414, -46125, -130705, 22440, -111933, -26937, -2295, -284721, -60203, 406548, 73083, -172984, 48894, -23171, 50500, -216930, 156801, 124909, 163529, -245391, 16955, 221864, 54483, 150513, 151826, -199387, 78340, 281398, 164656, 25215, 221126, -192745, 123976, -32257, 72340, 14893, -185753, 41064, -88130, 101764, 126974, -57340, -187655, 284924, -29371, -181565, 470989, -15370, -54417, -222041, 256841, 77619, -6503, 224013, -17348, -151278, 50482, 130600, 44599, 91028, 146463, 304746, -277819, -70500, 357081, -138599, -133554, 151432, 166554, 21640, 93958, -55237, 64230, 69624, -188518, -155915, -68235, 177752, 2674, 363140]
11560C63140i1989B39433A4178L18270o4676j26317J10270j01435F2161e1736
11549a34708A29166m0090k6285c42188B17046G5815K09371A4006a05598A9979
11538D2086A9764K10525B1024K10290A06209m5025K1172C1157M1764e1940A20186
11526A03843J49871f2351a7554C39050j53890q9687g4574A10722Q5273a6891j6756
11515c3647B4385R4623A370L0230a9618B7137J05866A3487j947M58658A76552
11503B97931D6447J86986a86644B68379h7357j87681A88025a74573B76374c63175
11492A12867J37725l8657J20006D5368K53436Q8516o2571I7769a04291O100B49490
11480b47319C31607D234K13297n6526a1723A68498f6567j15904H4642B9998a38491
$$ y = [363140, -91989, 239433, 14178, 332448, 267772, 141455, 251725, 150290, 62161, -51736, -134708, 129166, 89076, 62791, -342188, 217046, 75815, 285186, 14006, -105598, 19979, 42086, 19764, 230289, 21024, 231314, 106209, 61184, 82356, 31157, 72921, -51940, 120186, 103843, 253714, -62351, -17554, 339050, 185160, 95473, -74574, 110722, 195995, -16891, -33647, 24385, 119008, 1370, 31600, -19618, 27137, 133003, 13487, 11540, 470198, 176552, 297931, 46447, 233433, -186644, 268379, -87357, -275038, 188025, -174573, 276374, -363175, 112867, 250592, 211935, 331941, 45368, 298804, 387320, 324749, 97769, -104291, -98191, 249490, -247319, 331607, 4234, 217531, 161005, -11723, 168498, -66567, -182471, 84642, 29998, -138491]
11468D0594K1491J36025I8598J9960J13909n8199b9982G6830J73532c6278m8153
11457h4431E2719e9056C94052B7996J26789G4477j093O3315N1657K5052p8013
11446A35395g8292A67837M4298a97324D443h9104B15666l1686I253a57234B50835
11434H2976a04965k01031h610j4035H7909a51209j22089F1035k3192j4869J25927
11423A48901b53186B42620d8092J6067G3645e3425A93777a67554n2538h3899I8421
11411c6570k20819h3464C6608L7217J39185E5727J05994C246a73128e4677j91679
11400b46356a6706A62043o2374J7576k364b2906C52015A19887L27369A19130E6577
11388h0717D4279K08285g8172C783a37416j86436e5180K5443l6809E432c57122
$$ y = [40594, 62085, 198110, 98598, 118558, 232467, 174268, -29982, 76830, 250362, -36278, -84431, 52719, -59056, 394052, 27996, 154785, 74477, 73384, 136699, 188356, 213408, 135395, -78292, 167837, 212135, -197324, 4443, -89104, 215666, 183980, 9253, -157234, 250835, 82976, -104965, -305996, -8610, -22645, 87909, -151209, -273298, 61035, 37843, 22974, 148901, -253186, 242620, -48092, -32025, 73645, -53425, 193777, -167554, -220092, -83899, 98421, -36570, -257389, -83464, 36608, 73825, 213010, 55727, 161721, 3246, -173128, -54677, -246356, -16706, 162043, 99669, 117245, 114881, -22906, 352015, 119887, 447256, 119130, 56577, -80717, 44279, 252564, -78172, 3783, -137416, -323852, -55180, -29737, -66546, 5432, -357122]
11376A33579J54678D0929J55489G0119h3399D7061P6409n8118d04618D16549A98648
11364A14058B9203J11231g6554n3423H2396K05066A02702m124d1605j5901a7658
11352C7137a87322F7913l0268c18055J24069B15927d6632A36577o4208a897j70700
11341a72597h3373A92966b24200B32461a72971B50837a23844B55831a85408B33439
11330D3889K08486c5816F1836a59132j81090a16090B60846H999i7161B07050a3616
11318C86181C1753a64771j1379B34410G1184a83375A09315l8227b92594j76098
11308d68692d9974j7661A24699A4476c08706A61253a47837b2967n4052E215a07135
11296b8369F6907N9934b02235A88338b01107I1054a00845j60588o3286C25365
$$ y = [133579, 288257, 40929, 196418, 70119, -83399, 47061, 123470, 65352, -404618, 416549, 198648, 114058, 29203, 140434, -76554, -129977, 82396, 287462, 102702, 98578, -41605, -57506, -17658, 37137, -187322, 67913, 37645, -318055, -193986, 215927, -46632, 136577, 72369, -1897, -172597, -83373, 192966, -224200, 232461, -172971, 250837, -123844, 255831, -185408, 233439, 43889, 252375, -35816, 61836, -159132, -340222, -116090, 260846, 8999, -97161, 207050, -13616, 386181, 31753, -164771, -176150, 234410, 71184, -183375, 109315, 71088, -292594, -468692, -49974, -67635, 124699, 14476, -308706, 161253, -147837, -22967, -77019, 5215, -107135, -28369, 66907, 126841, -202235, 188338, -201107, 91054, -100845, -261433, -324719, 325365]
11285b38089j43423f3185B14361b00698F3091j3969a66834b4328D0493d6008k06614
11274b52622c8424m7957k6515N5584k7974B3935J31331b02562C8012N4957M1001
11263A33970A7204a23535A27958a48405P3678C3653J02529D2452d5291Q373o9698
11252a06616j73869K0165O2863O7121K2115Q846a1710C104c0555B52622a6960
11240H8042i8230A08254n696G5M3439a18635H5939a46768N2076j57611E159f7190
11227A7170a36310e0916F6584e9023A30607g3906l0716j36161b1773k71097B36733
11215a19202l5593I6953b53200L1228f1168j48732b7578k89100J26363h4560l7148
11204a21708L0840A11789a5510m9861B22572r0354a78087f5268k49491J45763
$$ y = [-238089, -381512, -63185, 214361, -200698, 63091, 49122, -166834, -24328, 40493, -46008, -252622, -38424, -86381, -112896, -57312, -85286, 23935, 155266, -202562, 38012, 92969, 133970, 17204, -123535, 127958, -148405, -74727, 33653, 136182, 42452, -45291, -36918, -106616, -280485, -260320, -197457, -130336, -108221, -99375, -11710, 3104, -30555, 252622, -16960, 88042, -98230, 108254, 102558, 75, 43514, -118635, 85939, -146768, -94692, -252303, 5159, -67190, 17170, -136310, -50916, 66584, -59023, 130607, -73906, -104622, -240783, -21773, -292870, 236733, -119202, -154795, 96953, -253200, -221972, -61168, -209900, -27578, -316678, -190315, -84560, -121708, -90868, 111789, -15510, -65371, 222572, 132218, -178087, -65268, -314759, -168996]
11194a68996g5950k57083j7052K3333f0837k61454B32016H7734D1618c00971I7165
11182F0961g3829C57340d0057k84507a24636E3164a08933k59290H2345b28551
11171C8174O864P660J98968b90772A8313a29959j12846O3484d0505A71582b66806
11159a13005C66100b49108K9367R5143E4063Q9373A1773d02473D9324a34246I6895
11147G1242J66002D8323J58312C0409c12719A47145C2623R3177a92736A22511
11136A72046J63319a25116J2026b1871A2004a97995C9102a7517B15636g8903L4514
11125d4389K1940A11604q746K62420j72075n7771l9965o176J86131j30111B2519
11113a43017E250K9425L21734j04837B4882R0962a3231r808k13092K8300B68179
$$ y = [-168996, -75950, -333033, -350085, -326752, -60837, -322291, 232016, 87734, 41618, -300971, 97165, 60961, -73829, 357340, -40057, -324564, -124636, 53164, -108933, -368223, 82345, -228551, 38174, 45038, 52698, 251666, -290772, 18313, -129959, -242805, -179321, -40505, 171582, -266806, -113005, 366100, -249108, -219741, -124598, 54063, 143436, 11773, -402473, 49324, -134246, 96895, 71242, 237244, 48323, 206635, 30409, -312719, 147145, 32623, 125800, -192736, 122511, 172046, 335365, -125116, -113090, -21871, 12004, -197995, 39102, -17517, 215636, -78903, -44389, -22449, 111604, 102858, 365278, 193203, 135432, 95467, 89291, 275422, 145311, 22519, -143017, 5250, 34675, 356409, 251572, 24882, 115844, -13231, -23039, -236131, -207831, 268179]
11101H995K47417m5469K25249F7341Q3466J52972D9750L76817A58936J2283p760
11090A63459E8038O9854K83051j53994b2657B34442P4033J8984K8411G4085J3984
11079H8069J44880L01417A63131a33707C90244A74067K5122J83610A14827m2913
11069G1914A4630J32559K10120o0825J19326j4862O3587q0329J39045j85263K40767
11058E78755p7140o6797J45706l2932j88590K43187k03967J85194P9072K28947
11048H91435D26784J49940J45268l4126J020k576k7985B00769M42768L7715m4046
11037F37206N04375E10006K14613l14356L22178j94654B21959M47827M859r3810
11027E80835j53799K2609m9987K96607m7674j0661K87715D34587M98464k25193
$$ y = [8995, 256412, 210943, 436192, 67341, 150807, 303779, 49750, 426567, 158936, 171219, 163459, 58038, 127892, 410943, 256949, -22657, 234442, 308475, 327459, 355870, 74085, 88069, 232949, 534366, 163131, -133707, 390244, 174067, 199189, 382799, 114827, 71914, 14630, 147189, 357309, 296484, 415810, 400948, 464535, 384206, 523251, 337988, 578755, 501615, 434818, 580524, 547592, 359002, 602189, 398222, 583416, 662488, 891435, 426784, 576724, 721992, 687866, 688886, 686310, 658325, 200769, 643537, 681252, 637206, 1141581, 510006, 724619, 410263, 732441, 537787, 221959, 669786, 674645, 580835, 427036, 449645, 399658, 696265, 648591, 637930, 925645, 434587, 933051, 707858]
11017G07858K3295j11323B43938K98377K19462l28789n6909O6276r5239L73864
11007G20980K87925l65518L34806l23247l1595C04164J05144j53659K98127r9855
10997D53921J08347L07707P6898l54052P489n2672J83837Q5644j90531k1049M7606
10986F53145J90160O5497j11315Q6680q5282K38282J37596J95787k73913K82382
10976A379019L44229J81053J95194Q97L38134K86195Q3207l07469K05476o41351
10966B064584j85162l7685j27388L35135m76872O151M9815n2792J66671P2670
10956A815127j14423o4372j18691k77295J76571n15142j09506l60200A30064P44543
10946H74607B24298J90830j5709E1791L47912A55572e7696A43455R9382h3189
$$ y = [707858, 731153, 619830, 243938, 542315, 761777, 432988, 376079, 442355, 347116, 720980, 1008905, 643387, 978193, 654946, 623351, 304164, 409308, 255649, 553776, 453921, 562268, 869975, 946873, 592821, 600310, 547638, 731475, 817119, 626588, 605539, 653145, 843305, 908802, 797487, 884167, 798885, 1037167, 1174763, 1370550, 1096637, 1379019, 1723248, 1904301, 2099495, 2100392, 2438526, 2724721, 2807928, 2500459, 2705935, 2064584, 1879422, 1841737, 1714349, 2049484, 1572612, 1578763, 1628578, 1575786, 1742457, 1815127, 1700704, 1636332, 1517641, 1240346, 1416917, 901775, 792269, 432069, 130064, 874607, 224298, 415128, 399419, 51791, 399703, 155572, -57696, 143455, 242837, -83189]
10935A49499B3396P4349M06413a51081A20185K07184h4794k24234A53329J06918
10925B60247c0282D4738A8261L07256i5440D5689N3439M0251a57602L9358o7003
10914a85247h8794H897a40870e0348l71979J28157F9901g6847p1711j80444A02603
10902A31341a48286L1118B8363j1904a35135M7047G2122b85184j19763J42316
10892b62631A94158d5713B89665J75478B5796h8358d2643g45o8581A25414a88014
10880A55656d19840J12604O5957K058A4800J73373a39974I2744D5104r235E466
10868B52571m5840r5192i6247B10779B6845A0334K16688d44402F1914b01312g8788
10856d4719D6852P6723a69581e3398l41754E993N18353c2412D6474a61027A12670
$$ y = [149499, 23396, 97745, 504158, -151081, 120185, 327369, -84794, -309028, 153329, 260247, -30282, 44738, 18261, 325517, -95440, 45689, 99128, 139379, -157602, -118244, -185247, -88794, 8897, -140870, -50348, -422327, -294170, 69901, -76847, -148558, -329002, 102603, 131341, -148286, -117168, 28363, 16459, -135135, -88088, 72122, -285184, -404947, -262631, 194158, -45713, 289665, 465143, 25796, -88358, -42643, -745, -69326, 125414, -188014, 155656, -419840, -307236, -241279, -239221, 14800, 188173, -139974, 92744, 45104, 35869, 5466, 252571, 206731, 111539, -96247, 210779, 26845, 10334, 227022, -444402, 61914, -201312, -78788, -44719, 46852, 123575, -169581, -53398, -395152, 5993, 524346, -32412, 46474, -161027, 112670]
10844c271p899j10493b7279G3176b37402d3605H9853J80733E7504b4789C0978
10832c45924B92317h559H4662j6274a0282j25337J4637K1043j98825A08636a29899
10820a72832l7599j84320I6059m5739F184Q8215J09343c18614G6228G762b29271
10808A18440j044f5779K2678F5945b58117k26122A67221E4818k4349e41168b67554
10796B46887a40957A22532b93450H8377m2972a04581A52957d15433K00056i7327
10785b24951M8206c0572C51714c8300j58497d4794m0997B33261j04732k6751l4613
10774F7165e1831b1987r9212a3561k301A68754b54213A46001k3203f2388G7612
10762H3743J8612L9448b13076h8061n934j56494f7288b2242m9455b518r6731k4031
$$ y = [-3271, -11170, -121663, -27279, 73176, -237402, -43605, 89853, 270586, 57504, -24789, 30978, -345924, 292317, -8559, 84662, 68388, -10282, -135619, -120982, -99939, -298764, 108636, -129899, -172832, -210431, -394751, 96059, 50320, 6184, 94399, 203742, -318614, 76228, 7762, -229271, 118440, 117396, -65779, -43101, 65945, -258117, -484239, 167221, 54818, 30469, -541168, -267554, 246887, -140957, 122532, -293450, 88377, 45405, -104581, 152957, -415433, -215377, -97327, -224951, -176745, -30572, 351714, -38300, -196797, -44794, -85791, 233261, 128529, 101778, 67165, -51831, -21987, -121199, -13561, -15862, 168754, -254213, 146001, 122798, -62388, 77612, 83743, 102355, 141803, -213076, -88061, -93995, -250489, -67288, -22242, -71697, -2518, -99249, -123280]
10750a23280j9883A15358A6877L01647a13509J2224A5986a63320c944j1485k59372
10739b74801B04400a72804A93615b19352A19731J39848J1297D24a11636A15722
10728I5614e7083F4882a84568J3693D8327L7260o995h6640m2815C6259c23637
10716E2357K86532A6441h7370A10576a65797K8245m2363E80800e1753D2348a50967
10704b80911a5958j432F0060a97532g8194j75481A07821c11606c8139C9009d4942
10692b92018j115q4503B33639c16078P8579B0661a0493k35914J03994p6307N1630
10681a67090o0067B21404h6674F7243a55339D34173A52220k6675a08281B20872
10670a07004A54468a2849A633O3057l208a71373A57067E4763h1285J1639F1671
$$ y = [-123280, -143163, 115358, 16877, 318524, -113509, -101285, 15986, -163320, -3944, -15429, -274801, 204400, -172804, 193615, -219352, 119731, 259579, 270876, 424, -111636, 115722, 95614, -57083, 64882, -184568, -170875, 48327, 85587, 78592, -86640, -129455, 36259, -323637, 52357, 338889, 16441, -87370, 110576, -165797, -137552, -179915, 580800, -51753, 42348, -150967, -280911, -15958, -17390, 60060, -197532, -78194, -253675, 107821, -311606, -38139, 39009, -44942, -292018, -293133, -377636, 233639, -316078, -237499, 20661, -10493, -246407, -142413, -218720, -167090, -227157, 221404, -86674, 67243, -155339, 434173, 152220, 125545, -108281, 220872, -107004, 154468, -12849, 1633, 64690, 61482, -171373, 157067, 54763, -81285, -69646, 61671]
10658b69279k40100d0447D8545J84716D3559b76604B92663B4311Q8961a75665
10647f427m8611j76017j88971a7520E0302B1317d1494H2984L29023Q5256a76439
10635A207c56119A78954E7735a05276j56416A5087J05091a46269R955m8343A30267
10623H3283a2469C9010b60651b3069k70471a17666c1920l92434A41313c58771
10612B75184A17466E0693a54156B93408a32509e6471A98283c60093C4688b35223
10601a48813j46012H3038c25133O5257e4670C72907E734b40561b1134L81l474
10590b4227j77016A39040b19202F7030b89925n8360J64323J6676A98375c72756
10579d6142l10598E9798c26998I534J21133F0553b197C7543N7701a9120G1591
$$ y = [-269279, -509379, -40447, 48545, 233261, 43559, -276604, 292663, 24311, 113272, -175665, -6427, -55038, -231055, -420026, -17520, 50302, 21317, -41494, 82984, 412007, 497263, -176439, 1207, -356119, 178954, 57735, -105276, -261692, 15087, 120178, -146269, -136314, -184657, 130267, 83283, -12469, 39010, -260651, -23069, -293540, -117666, -31920, -424354, 141313, -358771, 275184, 117466, 50693, -154156, 293408, -132509, -56471, 198283, -360093, 34688, -235223, -148813, -294825, 83038, -325133, -259876, -54670, 372907, 5734, -240561, -21134, -20753, -24227, -201243, 139040, -219202, 67030, -289925, -348285, -183962, -167286, 198375, -372756, -46142, -356740, 59798, -326998, 9534, 130667, 60553, -2197, 37543, 95244, -19120, 71591]
10567B42144A11527D9767J46208b31531d89j3527B08476a95574j06269a09339
10556h6546C11110d38340a7958A69956b138l8240o8064k56357K0822F1676a14258
10544A85704J9665g0611F9243a34686o3310b7345l58871c2676B03900a9153A53463
10532c8540o1793l47895f5388j10087n7767j4138B28437a43435B57119a56587
10521B84750A41483R538b5898l36361A64440A4360K45188r3166a10261j64329
10511b74590c7931k99700A7390c43819d0507k2175j75701a11898A27892C9254
10500a69777g9677j64244R556R8856e009j67476B32341L8088A00204a69113A87191
10488a13717E0088e70132a2843m08599d2715m8451B19409N0103R1415J59115A50371
$$ y = [242144, 111527, 49767, 195975, -231531, -489, -14016, 208476, -195574, -301843, -109339, -86546, 311110, -438340, -17958, 169956, -2138, -40378, -108442, -364799, -343977, 61676, -114258, 185704, 205369, -70611, 69243, -134686, -197996, -27345, -386216, -32676, 203900, -19153, 153463, -38540, -100333, -448228, -65388, -175475, -233242, -247380, 228437, -143435, 257119, -156587, 284750, 141483, 151021, -25898, -362259, 164440, 14360, 259548, 166382, -110261, -274590, -37931, -337631, 17390, -343819, -40507, -62682, -238383, -111898, 127892, 39254, -169777, -79677, -243921, -234365, -135509, -5009, -172485, 232341, 270429, 100204, -169113, 187191, -113717, 50088, -570132, -12843, -421442, -42715, -91166, 219409, 269512, 360927, 520042, 150371]
10476g5559A28268O6081a70884A75005D9859J4742c13823O7696a639A84179b1919
10464A39143j0546D9765J05092a58017I4926N0456o0473N2086a01742j039B12711
10452A49040c4531j21489A64738a32744A25215c4485l92847f0514K0658k75839
10442c15695h2498j83231c9131B42806A12517D0a17669j2452J5169o6888E296
10430b92274R3074B26401J08994j25056q9153c97553a28383j4921A83078a6971
10419I3343M425f4129E4583c1468p1750d6288I3817d06765j98517f4685B7257
10407d724r7345G5527b2694A82355L1144a15591A23729J24367a03732d2725j7106
10396e9831F0898N8351J59320c2318I3315a51197a8767A05951n0811J84571l3168
$$ y = [-75559, 128268, 194349, -170884, 175005, 49859, 64601, -313823, -246127, -1639, 184179, -21919, 139143, 128597, 49765, 154857, -158017, 94926, 145382, 84909, 136995, -101742, -102781, 212711, 149040, -34531, -156020, 164738, -132744, 125215, -34485, -427332, -60514, -39856, -315695, -82498, -265729, -39131, 242806, 112517, 40, -117669, -130121, -114952, -181840, 5296, -292274, -199200, 226401, 335395, 210339, 121186, -397553, -128383, -143304, 183078, -16971, 93343, 97768, -64129, 54583, -31468, -103218, -46288, 93817, -406765, -605282, -64685, 27257, -4724, -102069, 75527, -22694, 182355, 213499, -115591, 123729, 248096, -103732, -42725, -59831, 60898, 119249, 278569, -32318, 93315, -151197, -18767, 105951, 55140, 239711, 206543]
10385B06543r323o3283n831m5842h9258k38490d6450B01556a70877C11371a00737
10373B19917m790J22014K03653A47882K84366G1524J00281K62750L45412A41174
10362B24812K7890a7229A31737b5067F2600a0122C07517n8495K12754j93466F9809
10350D02211L89455B39715k5814K06143A17032L9759K40639A84872q9268N1968
10340A47572K5133F7436J81683J3017q4120O3246e462B95801a37378C15327b46283
10328C41398a02406B9848L10122a70170B38637J04160F2480a14225I699K08694
10318B18393A35K57612E0003K21798a25629B03924a22466j04597e0757A49645
10307A41761C5182A0733M2834n918K02746I3204k2587Q7059L6385A6958K99928
$$ y = [206543, 197220, 133937, 128106, 82264, -89258, -327748, -46450, 201556, -170877, 311371, -100737, 219917, 215127, 337141, 540794, 147882, 432248, 71524, 171805, 434555, 779967, 141174, 224812, 252702, -17229, 131737, -25067, 62600, -10122, 307517, 249022, 461776, 268310, 69809, 402211, 791666, 239715, 213901, 420044, 117032, 156791, 397430, 184872, 95604, 147572, 172705, 67436, 249119, 262136, 178016, 241262, -5462, 295801, -137378, 315327, -246283, 341398, -102406, 29848, 339970, -170170, 238637, 342797, 62480, -114225, 9699, 218393, 135, 257747, 50003, 271801, -125629, 203924, -122466, -227063, -50757, 149645, 141761, 35182, 10733, 53567, 47649, 250395, 93204, 70617, 157676, 194061, 16958, 316886]
10296C16886b6105a058j5733l15321A34765a19955j28823B48059a70991E5743
10285c72773Q8160C28917A4274b18955D6186b75843A89659b19931A21026O2340
10275A83366K0967c2012A75542b27487i7774C81479A73081p275a05506l2607B90337
10263C6406J85490b15941g2232B39927N3452L6699P906J4041k0807C5487b13908
10251A93597o7372f2568E2914j3738d942j8457j4327A43658a54371B33304n176
10240B28128c6389j2305k27326c9300o2684b9730B22862m2242a40403A69064a4831
10228a90194F3809K6130Q0016b89326J43585g2685B2815j0773i1517j72797J3571
10217b50743B17715p8321j6319j4937A5719g9772K5056j32101H242J08455J792
$$ y = [316886, -26105, -1058, -16791, -332112, 134765, -119955, -248778, 248059, -170991, 55743, -372773, -284613, 328917, 14274, -218955, 46186, -275843, 189659, -219931, 121026, 183366, 204333, -32012, 175542, -227487, -97774, 381479, 173081, 165806, -105506, -138113, 290337, 36406, 221896, -215941, -72232, 239927, 293379, 330078, 337984, 352025, 331218, 35487, -213908, 193597, 126225, -62568, 52914, 39176, -4942, -23399, -37726, 143658, -154371, 233304, 228128, -36389, -48694, -276020, -39300, -101984, -29730, 222862, 180620, -140403, 169064, -14831, -190194, 63809, 89939, 169955, -289326, -145741, -72685, 22815, 12042, -91517, -264314, -250743, 217715, 139394, 123075, 108138, 15719, -79772, -54716, -186817, 8242, 116697, 118489]
10206A18489c0379A54610a51633Q582N3890k16921E5744R9503b30605h2615D0719
10194i1590p0157e3176k49016a26648l05039c4188j6706o5967a0470l6678j51050
10183a98198D995b76353e9225C53768j68621a45243j07407Q4612m9373D227a04523
10171f9762k72137a12696D9598a36574I9439K59246a0971m3743d660A23902E8242
10159a58488A8231c47903N3053f8840q7550C20427b34630n2739L1416I6198b65439
10147B63202E7959b46708G8094d738j0632n4484p8496q0831M7315A33735M6872
10136A80607b4096j1927j90873F5612b00358N4843k1657C9925a47151b446k03924
10125b06370C3064e10534g1266D33382i9279B98524g2540l52420e8437K5598m14747
$$ y = [118489, -30379, 154610, -151633, -143051, -89161, -306082, 55744, 155247, -230605, -82615, 40719, -91590, -161747, -53176, -302192, -126648, -431687, -34188, -50894, -116861, -10470, -47148, -198198, 4995, -276353, -59225, 353768, 185147, -145243, -252650, -168038, -217411, 4227, -104523, -69762, -341899, -112696, 49598, -136574, 99439, 358685, -10971, -54714, -4660, 123902, 58242, -158488, 18231, -347903, -294850, -68840, -156390, 320427, -234630, -287369, -255953, 96198, -265439, 263202, 57959, -246708, 78094, -4738, -15370, -69854, -148350, -229181, -181866, 133735, 180607, -24096, -36023, -226896, 65612, -200358, -145515, -167172, 39925, -147151, -2446, -206370, 33064, -510534, -71266, 433382, -99279, 298524, -72540, -424960, -58437, -32839, -447586]
10114d47586a08722N1722A68028b75508a36664E5039e25006a53142b1836B1162
10103a92005A27710f2942B03390a30722j2990A04550D239b4477A07397C8997b8172
10091d8334B61530a99892L9677C42530a79854A86516D9712b2266D8797K84826
10081C33623E0340a4494A40165e7890C43763I8328A2622J3219b0113r9035j47176
10070b66324N0815j34277B05282b68544H1596J55758j00128F600a14434k5475
10060a39909f8485K2817j6817j90477A07285c61594R0032p6286d6124a0337j44652
10049a54989o8929b9904A8889b78072j12339J18412A99001E6570a63584n768c4636
10037a07314K0381A15752e4125C9429A3495a39445A39794F505e2946D6564i8833
$$ y = [-447586, -108722, -57000, 168028, -275508, -136664, 55039, -525006, -153142, -21836, 21162, -192005, 127710, -62942, 203390, -130722, -143712, 104550, 4239, -24477, 107397, 38997, -28172, -48334, 261530, -199892, -160215, 342530, -179854, 186516, 49712, -22266, 48797, 333623, 50340, -14494, 140165, -57890, 343763, 98328, 12622, 25841, -20113, -119148, -266324, -215509, -349786, 205282, -268544, 81596, 237354, 137226, 6600, -114434, -139909, -68485, -45668, -62485, -252962, 107285, -361594, -271562, -347848, -46124, -10337, -154989, -223918, -29904, 18889, -278072, -390411, -271999, 199001, 56570, -163584, -169352, -34636, -107314, -86933, 115752, -54125, 39429, 13495, -139445, 139794, 6505, -52946, 46564, -98833]
10025b93948H1262R0375n4941L7174a69439I437a01755K4938c1700A53404b79451
10013c33810J3007A78686a24767o307c3507k36488O6542r6249d8357k61856R0029
10002b20184e9976j35367c7666F8696I318a43710G1901d4258J2266m7034j61884
9991b40910B68023A30588a90863L3996g7982b4472l0339D82670a88318O860E1530
9979H7458C0273J45222p2068b8663B61b9105k55131D20703a22480k03370P091
9968c18759A0225a39046n4290O0483A46235b15245a5566B5211b32706P2375B1278
9956c3299j35374A40428l6869e7055G5027b93783a18381A16131c5952j70840L1199
9945a75593A19913J91899b4583r4951n198e2283A48520D6761c6238l52115g9079
$$ y = [-293948, 81262, 171637, 116696, 153870, -169439, 9437, -101755, -76817, -31700, 153404, -279451, -333810, -320803, 178686, -124767, -131074, -33507, -269995, -203453, -299702, -48357, -310213, -220184, -59976, -195343, -37666, 68696, 9318, -143710, 71901, -44258, -31992, -79026, -240910, 268023, 130588, -190863, -156867, -77982, -24472, -54811, 482670, -188318, -181458, 51530, 87458, 30273, 175495, 103427, -28663, 261, -29105, -284236, 420703, -122480, -325850, -318759, 10225, -139046, -193336, -132853, 146235, -215245, -15566, 25211, -232706, -160331, 21278, -33299, -168673, 140428, 103559, -57055, 75027, -293783, -118381, 116131, -35952, -206792, -175593, 119913, 311812, -24583, -119534, -124732, -52283, 148520, 46761, -36238, -388353, -79079]
9933c3139r8700L4154C5974a43816j34041B29119c24019i2382r7645r1355j09384
9922c90766R8720G9831b10290c4934r8938D4973b20969O0650d0146p9170L1805
9911h7511o0013k84314A84517c7374q9042B5778b3297D9490K0397J12048i9427
9899a12313j7392N4656q6403O9954p9319D7451a73522I4548J10789p8488B8412
9887A23807a14612l7191n5137Q9594F3216B9161g9394A96537a57152m802B98377
9875A50699e29336B61b2357C64749C4976c4702k9705J4472E8073J45930a47366
9863a36195D7876a51884A17510g7293B170h8759A09213b32766n2925I5132a55513
9851B4267a06438M9142C27053a54637B5780a72977c2416j74526H0273a31899j43217
$$ y = [-33139, -131839, -97685, 35974, -143816, -277857, 229119, -324019, -92382, -190027, -281382, -390766, -292046, 79831, -210290, -34934, -133872, 44973, -220969, -160319, -40146, -119316, -87511, -147524, -431838, 184517, -37374, -126416, 25778, -23297, 49490, 69887, 181935, -99427, -112313, -129705, -75049, -161452, -91498, -170817, 47451, -173522, 94548, 205337, 126849, 28412, 123807, -114612, -151803, -206940, -117346, 63216, 29161, -79394, 196537, -157152, -161954, 298377, 150699, -529336, 261, -22357, 364749, 34976, -34702, -64407, -49935, 58073, 204003, -147366, -136195, 47876, -151884, 117510, -77293, 2170, -88759, 109213, -232766, -285691, 95132, -155513, 24267, -106438, -57296, 327053, -154637, 25780, -172977, -32416, -206942, 80273, -131899, -275116]
9840b75116B38467a686k81807R004J14379j99575g1789b2180k90645R344a09432
9828a39818A10696B6806a62311N4600J3061A85924a06057j197A00430a35439A35730
9816a02147j41506Q9380e7178m33877B23171r2632c24712j3706C54491B5291L3724
9805E9015c5050j33372a6282k68947c2292o9158n5479C08557c6048D6772L40080
9794C86852h6111j80670B59382E6366c2126k35211k25966B24756C192J39158c1780
9782A18569b28890D67472j96745A5934b61071A26466f77j16956L4753K0446j52989
9771b15423j4362a08726k07960a9025k24475B4791a51577l12545B86649b63163
9760e1367j35307G7108A6735c03735a16873k6366A04370c13898A7303c503A418
$$ y = [-275116, 238467, -1686, -283493, -274489, -160110, -359685, -71789, -22180, -312825, -303481, -109432, -139818, 110696, 26806, -162311, -107711, -94650, 185924, -106057, -107254, 100430, -135439, 135730, -102147, -243653, -154273, -57178, -491055, 223171, 130539, -324712, -338418, 354491, 25291, 59015, -35050, -168422, -16282, -285229, -32292, -101450, -156929, 308557, -36048, 46772, 386852, -86111, -266781, 259382, 56366, -32126, -267337, -493303, 224756, 3192, 142350, -31780, 118569, -228890, 467472, 270727, 15934, -261071, 126466, -677, -117633, -82880, -62434, -215423, -229785, -108726, -316686, -19025, -243500, 24791, -151577, -464122, 286649, -263163, -51367, -186674, 77108, 16735, -303735, -116873, -143239, 104370, -313898, 17303, -3503, 1418]
9748E5388b17123D580d98701D3304c49324A15113P7408a36933F5897h933K081
9737f852m2493H3579K49425b82443B212O246a44715l4563n7144k0173A13415n6077
9725E7338h2815A01872b4438k35103L9589D8205h6521L6825q009A16296h0538
9713c40956J46629g3330l02309C0031a83373J0073p0814a01799k06443N2876n7347
9702c12713l1529l926P7593B48867a96460P5731m440r9606l8799e9570k4519j11426
9690a95515N0685q4976H3072a51922H3709d21868a48958M0019d3139k00090d1778
9678c73256d3103J2306m226j98734h1043r0113N662e5807A38403g7095A51614
9666H840a71209l8153E1339b23797G8897M8056d4614o6660J9419j77634I1998
$$ y = [55388, -217123, 4580, -498701, 43304, -349324, 115113, 192521, -136933, 65897, -8933, -6852, -49345, 83579, 333004, -282443, 2212, 8458, -144715, -179278, -236422, -256595, 113415, 57338, -82815, 101872, -24438, -259541, -219952, 48205, -86521, -49696, -57705, 116296, -80538, -340956, -194327, -73330, -375639, 30031, -183373, -173300, -244114, -101799, -308242, -255366, -312713, -344242, -348168, -270575, 248867, -196460, -120729, -125169, -224775, -263574, -59570, -84089, -195515, -144830, -229806, 83072, -151922, 83709, -421868, -148958, -108939, -43139, -243229, -41778, -373256, -43103, -30797, -35023, -233757, -81043, -171156, -165494, -55807, 138403, -77095, 151614, 8840, -171209, -209362, 51339, -223797, 78897, 126953, -44614, -111274, -91855, -269489, 91998]
9654B57176a81686a3532j67375j14089d0334F5661a71849D0615N4024c26647C74225
9642f984j306j4781A01113g3040F4662b81863J26061k60110e8970j11625A17006
9630B4982M2045B9891f9155j33238L7922A04406c73152B09131a0619E8714Q9383
9619A48097m8338b25483k315n5280h5900A51941k0432q749P1145b72607A08352
9607a73827e1758j47691l3691Q7814H9787d604m88624A76403a81821f8903B55534
9595f9876r0572j80854g1714j35190D125c87714g8651o5927r7363K1270b0831
9583b17069n2441i1992C00055a50491n9492A06445b49662A34566a12078H9058
9572b12889L7116j12511B32874n5607G6676i1691A97071a49020M0457m5836K8829
$$ y = [257176, -181686, -13532, -180907, -294996, -40334, 65661, -171849, 40615, 94639, -326647, 374225, -6984, -8290, -23071, 101113, -73040, 64662, -281863, -155802, -415912, -58970, -170595, 117006, 24982, 67027, 29891, -69155, -202393, -164471, 104406, -373152, 209131, -10619, 58714, 148097, 99759, -225483, -227798, -283078, -85900, 151941, 131509, 122760, 193905, -272607, 108352, -173827, -51758, -199449, -233140, -145326, 89787, -4604, -493228, 176403, -181821, -68903, 255534, -69876, -160448, -341302, -71714, -206904, 4125, -387714, -78651, -144578, -241941, -220671, -20831, -217069, -269510, -91992, 300055, -150491, -209983, 106445, -249662, 134566, -112078, 89058, -212889, -175773, -288284, 232874, 177267, 76676, -91691, 197071, -149020, -108563, -154399, -125570]
9561a25570A78345E838K36684c89030a40613m9638o7857a06831c9480k98752Q0044
9550b58188G6571A107O4003h4532k72931a39743j52725d7738l70211j51238b69642
9538c94241a6861G3115c0018B56973d697F158b84966J39913A95401a73188A2163
9526A15747j5388D7080c92441a41108b448C2584a74929l11500A5559J98172a86324
9514a33595C65981g7527m4706B4753R765f5570B84003I412L3655a35331r3651
9503b28982A93703c87478P5310a02457G0378a75939l1312A44256e967A18118J61667
9492B79785g1210H829M4537P8817c87551a76619j79937J49629i7211l48640i0286
9480h3604A51391c467B26417b73704J23814D1518j150b30069M6584q7117j2821
$$ y = [-125570, 178345, 5838, 242522, -389030, -140613, -190251, -258108, -106831, -39480, -338232, -258188, 76571, 1107, 65110, -84532, -357463, -139743, -292468, -47738, -417949, -569187, -269642, -394241, -16861, 73115, -30018, 256973, -4697, 6158, -284966, -145053, 195401, -173188, 12163, 115747, 100359, 47080, -392441, -141108, -2448, 32584, -174929, -486429, 15559, 213731, -186324, -133595, 365981, -77527, -122233, 24753, 34518, -65570, 284003, 9412, 43067, -135331, -228982, 193703, -387478, -312168, -102457, 70378, -175939, -207251, 144256, -5967, 118118, 279785, -71210, 8829, 53366, 132183, -387551, -176619, -356556, -206927, -97211, -445851, -90286, -83604, 151391, -3467, 226417, -273704, -149890, 41518, 40368, -230069, -183485, -270602, -283423]
9469b83423a33896j65561P2482A23548a30829M4692A89288c38810a09797N3574
9459e6223H752L7263b44186d3553j54967B56736d6587l2806C0664P2000a26524
9447b46255A95172h6009K9814j33900J5865m5805D3499a23604j3563j03845A52962
9435a83517d1114B26226r8705c29542B83060g0948k3315A4586K10991a90722L9562
9424a51160k7164B72598r2489c7518k30334B43522l2162e25323a31787E9434a55278
9412A34010a84408M2466D3792a16354M4910D9120a44194n189N9474j5589B2954
9400a44209d3609C10253b8189J2232E3099M4470h621k59213b8959E2462M3768
9389I6230d85775J95299L4535i5313j08822n7762b3674l85l3512A19465e1191
$$ y = [-283423, -133896, -299457, -226975, 123548, -130829, -86137, 189288, -338810, -109797, -56223, 8752, 46015, -244186, -43553, -198520, 256736, -46587, -79393, 30664, 102664, -126524, -246255, 195172, -86009, -56195, -190095, -174230, -220035, 43499, -123604, -137167, -241012, 152962, -183517, -41114, 226226, 127521, -329542, 283060, -70948, -94263, 14586, 225577, -190722, -151160, -178324, 272598, 180109, -37518, -267852, 243522, 211360, -525323, -131787, 59434, -155278, 134010, -184408, -141942, 43792, -116354, -71444, 49120, -144194, -149383, -89909, -105498, 22954, -144209, -43609, 310253, -28189, -15957, 53099, 97569, -8621, -267834, -28959, 52462, 96230, -485775, -290476, -255941, -95313, -204135, -261897, -23674, -24059, -57571, 119465, -51191]
9377I6422a13338k45230i6253B45770c34598b1234I3006J13363C5553b67260i8440
9365e2988B33045G4868a58082A89797c1258l14848g859B22387a61367g7621m20034
9354d97655a33514p337N0493j94175N2252b5424o3308o3215N5631j10129a5857
9342H6955i911H6103b7115A45380e461A8162b57539b607C2247J2515a83942f1634
9329i1910M5020k70800a13267e5044j16870H7836P105C6244J85728c45606a45521
9317a28604a124A75088B5138J0590a77637M316c8863I4373d1814j7601A00860
9305c39523a57029k83592h2541m1342p7276R3407R184A17549O3141q1359J08759
9294B08090c4413k15624N1329g8401A84010A7986R7920a7927D996J25069b90828
$$ y = [96422, -113338, -358568, -96253, 245770, -334598, -21234, 93006, 206369, 35553, -267260, -98440, -52988, 233045, 74868, -158082, 189797, -31258, -346106, -7859, 222387, -161367, -77621, -497655, -133514, -140851, -90358, -284533, -232281, -25424, -88732, -151947, -96316, -206445, -15857, 86955, -9911, 86103, -27115, 145380, -5461, 18162, -257539, -2607, 32247, 44762, -183942, -61634, -91910, -46890, -317690, -113267, -55044, -171914, 87836, 94941, 36244, 221972, -345606, -145521, -128604, -1124, 175088, 25138, 35728, -177637, -173321, -38863, 94373, -41814, -59415, 100860, -339523, -157029, -440621, -82541, -123883, -201159, -107752, -98568, 117549, 180690, 99331, 208090, -34413, -250037, -198708, -78401, 184010, 17986, 115906, -17927, 4996, 130065, -290828]
9282B57695D0200g1136C76932a26585j7380A98280a58765j19007J12812g4795
9271H2432a170p9002j04951C59b57026a19937r7482f7488j150k2839k26850g0498
9258a45620D0888c35817h4925n5047O8028C0122h2967G3727a1427p6122k3192
9247a10741D1086b44441A12386Q8162g0871q1706j65916i036k53111C15224a22912
9235g1781l77629a50508B08656a94989j1451i863A07342c7726B28746B5183g3282
9223b35224i8773E5766a12218k4337j04701a1786D8669R6946l413d51904B19316
9211B9305h3040b8846j77962G3735i8951p0522A0187M2775a17336E7539a89692
9199g4220p9304O5269B85283a64296E3092b6719j81941O6961C84665e8250j62362
$$ y = [257695, 40200, -71136, 376932, -126585, -143965, 198280, -158765, -277772, -164960, -74795, 82432, -1170, -80172, -185123, 359, -257026, -119937, -217419, -67488, -68638, -91477, -318327, -70498, -145620, 40888, -335817, -84925, -139972, -71944, 30122, -82967, 73727, -11427, -87549, -110741, 41086, -244441, 112386, 200548, -70871, -152577, -318493, -9036, -262147, 315224, -122912, -71781, -449410, -150508, 208656, -194989, -206440, -9863, 107342, -37726, 228746, 25183, -73282, -235224, -98773, 55766, -112218, -136555, -241256, -11786, 48669, 145615, 142202, -451904, 219316, 29305, -83040, -28846, -206808, 73735, -98951, -169473, 10187, 52962, -117336, 57539, -189692, -74220, -153524, -88255, 285283, -164296, 53092, -26719, -208660, -141699, 384665, -58250, -220612]
9188b20612R4796j80018c2948A81876p9880O6797a4016o1266I545a86589B26615
9176a71887A19014N2535N2675B0980d5684D9007b49162l81515E0218a91921G3671
9164A23403a08359E8336J54632e7225j14057a8522j68671A9738J00983c28904
9153A02517d27201i345j31000A45522a12063d4118I7333a59117d9540k19350d9158
9141h0911l5978r8512G8202j4097L4873A49a09677C99021H9437f1083C68848d0468
9128H4293a34638I4967J43940d572n701A68848G213a27471o3254j54906F665M4879
9116E1544j294J6553i8026F9087a72539B62487a60257D0507b3839F9385a28312
9104A21958a8188F0863J23591l1782a19433o2567d2379L813C14985a6563B52784
$$ y = [-220612, -125816, -305834, -32948, 181876, 101996, 168793, -14016, -75282, 9545, -186589, 226615, -171887, 119014, 171549, 224224, 20980, -45684, 49007, -249162, -630677, 50218, -191921, 73671, 123403, -108359, 58336, 212968, -57225, -171282, -18522, -187193, 19738, 120721, -328904, 102517, -427201, -9345, -140345, 145522, -112063, -44118, 97333, -159117, -49540, -268890, -49158, -80911, -116889, -215401, 78202, 64105, 98978, 149, -109677, 399021, 89437, -61083, 368848, -40468, 84293, -134638, 94967, 238907, -4572, -10273, 168848, 7213, -127471, -190725, -345631, 6665, 51544, 50250, 66803, -98026, 69087, -172539, 262487, -160257, 40507, -23839, 69385, -128312, 121958, -18188, 60863, 184454, 152672, -119433, -182000, -42379, -38566, 314985, -16563, 252784]
9092b60142j56166J75056n7064c9200A40852F0985k7216e5694k30471J24605A2050
9080B62483b08626b025l6434j4087a2012D76264c82932a0681B86416r9593D0678
9068C9138J82544e2015A96800c8418j08885D6302b00337B8431J22172J1883C9078
9056a00337n3895e2246G8872d02399a1213r0719o7436k90315i6266A01212M2607
9045A43819N2777E3595a07690J3431a8088j05275K2394r6534j27515q7965B80084
9033a81181j56549A1205a91802k2217A11921a45161c1280k55620N7499k1250A16686
9021b44064m966D111a10241o5271A25198g1426j27147K8790M3173A96217a17355
9009f4580q7342J3303M191A12786b50119M3150M3041B4735b29047H1178l2555
$$ y = [-260142, -416308, -241252, -298316, -39200, 140852, 60985, 33769, -55694, -286165, -161560, 12050, 262483, -208626, -2025, -38459, -52546, -12012, 476264, -382932, -10681, 286416, 186823, 40678, 39138, 221682, -52015, 196800, -38418, -147303, 46302, -200337, 28431, 150603, 162486, 39078, -100337, -154232, -52246, 78872, -402399, -11213, -101932, -169368, -459683, -96266, 101212, 143819, 196596, 53595, -107690, -94259, -18088, -123363, -100969, -197503, -325018, -412983, 280084, -181181, -337730, 11205, -191802, -214019, 111921, -145161, -31280, -286900, -229401, -250651, 116686, -244064, -249030, 4111, -110241, -175512, 125198, -71426, -198573, -169783, -126610, 196217, -117355, -64580, -151922, -138619, -134428, 112786, -250119, -206969, -163928, 24735, -229047, 81178, 48623]
8998D8623a48009l1712k8185e1135q4787d4503D11765b67565h0853m415C13028
8986a79874F854b51440b9060k9458k90913A91003p6096J13351A4309a70109H1235
8974e3376l9635p1049A47045b27540B49612a51735j33579D7314J38086b31147
8963a13682a8776j39694A81549a25343j14194h4172A23223f4367A07074a35018
8952D2614K00368b65737g0066a6867r4835j10701k8113C96047A62801A3342c17266
8940D59317f6176m26128h2426l33364A92536f0780e078n5319k90442C9690J88184
8929B27874H1045a66466E7603B6653M68531M1634J123260N293150J270415A658823
8918G72806A46253K93766F2398N2713J0124b48219A32065a30295e8585C5088L13355
$$ y = [48623, -148009, -179721, -207906, -51135, -135922, -44503, 411765, -267565, -80853, -85268, 313028, -179874, 6854, -251440, -29060, -58518, -349431, 191003, 114907, 228258, 14309, -170109, 81235, -53376, -93011, -164060, 147045, -227540, 249612, -151735, -285314, 47314, 185400, -231147, -113682, -18776, -158470, 181549, -125343, -239537, -84172, 123223, -64367, 107074, -135018, 42614, 242982, -265737, -70066, -16867, -111702, -222403, -250516, 396047, 162801, 13342, -317266, 459317, -66176, -492304, -82426, -415790, 192536, -60780, -5078, -60397, -350839, 39690, 227874, 81045, -166466, 57603, 26653, 495184, 536818, 1660078, 6953228, 8223643, 1658823, 772806, 146253, 440019, 62398, 115111, 125235, -248219, 132065, -130295, -58585, 35088, 348443]
8907C48443A64474k6281a2092A35648g5215l3282l3083E5466Q3189k735a63666
8895A34299a60036H553J27504J03583a54609j23366B24504B9200b96955B02763
8884a03990l8980A32928a29634A07678c9406E6531c50090c7250A13761A5355i4135
8872b35898N8888d0353k31035J26322M1100B53793a76639B12241a61149P2401
8862h8748E5537B5101J25743f4642A50414L3478d6343b2232B8563a26745k9399
$$ y = [348443, 164474, 138193, -12092, 135648, -75215, -108497, -141580, 55466, 138655, 135920, -163666, 134299, -160036, 8553, 136057, 239640, -154609, -277975, 224504, 29200, -296955, 202763, -103990, -142970, 132928, -129634, 107678, -39406, 56531, -350090, -37250, 113761, 15355, -94135, -235898, -177010, -40353, -271388, -145066, -103966, 253793, -176639, 212241, -161149, -88748, 55537, 25101, 150844, -64642, 150414, 183892, -46343, -22232, 28563, -126745, -156144]
$$ [...]
##END NTUPLES=NMR SPECTRUM
##END=
