##TITLE=AC1418_SALAH12228_7764077_btbhybD9DB
##JCAMPDX= 6.0         $$ Bruker NMR JCAMP-DX V2.0
##DATA TYPE= NMR SPECTRUM
##DATA CLASS= NTUPLES
##ORIGIN= BRUKER
##OWNER= Administrator
$$ 1.72 TOPSPIN		Version 2.1
$$ 2013-04-11 18:35:20.473 -0700  Administrator@X
$$ Compression mode = diff/dup
##.OBSERVE FREQUENCY= 400.02188249412
##.OBSERVE NUCLEUS= ^1H
##.ACQUISITION MODE= SIMULTANEOUS (DQD)
##.ACQUISITION SCHEME= undefined
##.AVERAGES= 64
##.DIGITISER RES= 22
##SPECTROMETER/DATA SYSTEM= spect
##.PULSE SEQUENCE= noesygpps1d.comp
##.SOLVENT NAME= COFFEE_meoh
##.SHIFT REFERENCE= INTERNAL, COFFEE_meoh, 1, 14.96091
##AUDIT TRAIL= $$ (NUMBER, WHEN, WHO, WHERE, PROCESS, VERSION, WHAT)
$$ ##TITLE= Audit trail, TOPSPIN		Version 2.1
$$ ##JCAMPDX= 5.01
$$ ##ORIGIN= Bruker BioSpin GmbH
$$ ##OWNER= Administrator
$$ $$ E:\/data/COFFEE/nmr/AC1418_SALAH12228_7764077_btbhybD9DB/12/pdata/1/auditp.txt
$$ ##AUDIT TRAIL=  $$ (NUMBER, WHEN, WHO, WHERE, PROCESS, VERSION, WHAT)
(   1,<2013-04-11 18:35:13.046 -0700>,<Administrator>,<X>,<go>,<TOPSPIN 2.1>,
      <created by zg
	started at 2013-04-11 18:23:43.501 -0700,
	POWCHK enabled, PULCHK disabled,
       configuration hash MD5:
       33 CF 6A 21 5C D3 B9 40 6C 15 AA 8D 27 A2 4F 13
       data hash MD5: 64K
       00 9C B7 BD 2B E8 E0 3B CC A8 D3 25 F5 BE 47 BA>)
(   2,<2013-04-11 18:35:17.588 -0700>,<Administrator>,<X>,<proc1d>,<TOPSPIN 2.1>,
      <Start of raw data processing
       efp LB = 0.3 FT_mod = 6 PKNL = 1 PHC0 = 0 PHC1 = 0 SI = 128K 
       data hash MD5: 128K
       19 D1 C4 0A B1 CF D9 22 03 31 BD 9B 16 42 E9 3D>)
(   3,<2013-04-11 18:35:18.689 -0700>,<Administrator>,<X>,<proc1d>,<TOPSPIN 2.1>,
      <pk PHC0 = -79.10706 PHC1 = 0 
       data hash MD5: 128K
       E9 33 42 CB 2F 6B FA 40 4E CF 3F B7 FA 7D D5 96>)
(   4,<2013-04-11 18:35:19.439 -0700>,<Administrator>,<X>,<proc1d>,<TOPSPIN 2.1>,
      <abs ABSG = 1 
       data hash MD5: 128K
       27 C0 B4 57 92 95 81 76 10 40 C4 6E 4C F4 89 4E>)
(   5,<2013-04-11 18:35:19.623 -0700>,<Administrator>,<X>,<proc1d>,<TOPSPIN 2.1>,
      <abs ABSG = 2 
       data hash MD5: 128K
       F3 D0 62 F4 31 E6 28 C9 CF 3F 00 29 16 32 5B 55>)
(   6,<2013-04-11 18:35:19.806 -0700>,<Administrator>,<X>,<proc1d>,<TOPSPIN 2.1>,
      <abs ABSG = 3 
       data hash MD5: 128K
       DC 24 AF F1 56 AC DC 55 5A E8 89 CA 2F 58 C3 E8>)
(   7,<2013-04-11 18:35:19.956 -0700>,<Administrator>,<X>,<proc1d>,<TOPSPIN 2.1>,
      <abs ABSG = 4 
       data hash MD5: 128K
       E7 FC E3 D0 0A F8 62 67 45 C2 A9 4C E8 3D A3 DB>)
(   8,<2013-04-11 18:35:20.140 -0700>,<Administrator>,<X>,<proc1d>,<TOPSPIN 2.1>,
      <abs ABSG = 5 
       data hash MD5: 128K
       F8 8F 98 AC 82 08 52 56 11 AD F2 2E A6 08 F1 DE>)
$$ ##END=
$$ 
$$ $$ hash MD5
$$ $$ 88 21 AF 11 6A A4 96 7B 8E 75 3B 82 69 3B 81 7D
##$RELAX= 
##$RELAX= 
##$RELAX= 
##$RELAX= 
##$RELAX= 
##$RELAX= 
##$RELAX= 
##$RELAX= 
$$ Bruker specific parameters
$$ --------------------------
##$DU= <E:\>
##$EXPNO= 12
$$ [...]
##$TP07= 0
##$TPNAME0= <>
##$TPNAME1= <>
##$TPNAME2= <>
##$TPNAME3= <>
##$TPNAME4= <>
##$TPNAME5= <>
##$TPNAME6= <>
##$TPNAME7= <>
##$TPOAL= (0..7)
0.5 0.5 0.5 0.5 0.5 0.5 0.5 0.5
##$TPOFFS= (0..7)
0 0 0 0 0 0 0 0
##$TUNHIN= 0
##$TUNHOUT= 0
##$TUNXOUT= 0
##$USERA1= <user>
##$USERA2= <user>
##$USERA3= <user>
##$USERA4= <user>
##$USERA5= <user>
##$V9= 5
##$VALIST= <valist>
##$VCLIST= <CCCCCCCCCCCCCCC>
##$VD= 0
##$VDLIST= <DDDDDDDDDDDDDDD>
##$VPLIST= <PPPPPPPPPPPPPPP>
##$VTLIST= <TTTTTTTTTTTTTTT>
##$WBST= 2048
##$WBSW= 25
##$XGAIN= (0..3)
0 0 0 0
##$XL= 0
##$YL= 0
##$YMAX_a= 5608213
##$YMIN_a= -11995025
##$ZGOPTNS= <>
##$ZL1= 120
##$ZL2= 120
##$ZL3= 120
##$ZL4= 120
##$ABSF1= 14.96091
##$ABSF2= -5.597272
##$ABSG= 5
##$ABSL= 3
##$ALPHA= 0
##$AQORDER= 0
##$ASSFAC= 0
##$ASSFACI= 0
##$ASSFACX= 0
##$ASSWID= 0
##$AUNMP= <proc_prof1d_extract.lims>
##$AXLEFT= 0
##$AXNAME= <>
##$AXNUC= <1H>
##$AXRIGHT= 0
##$AXTYPE= 0
##$AXUNIT= <>
##$AZFE= 0.1
##$AZFW= 0.1
##$BCFW= 0
##$BC_mod= 0
##$BYTORDP= 0
##$COROFFS= 0
##$CY= 15
##$DATMOD= 1
##$DC= 0
##$DFILT= <>
##$DTYPP= 0
##$F1P= 0
##$F2P= 0
##$FCOR= 0.5
##$FTSIZE= 131072
##$FT_mod= 6
##$GAMMA= 0
##$GB= 0
##$INTBC= 1
##$INTSCL= 1
##$ISEN= 128
##$LB= 0.3
##$LEV0= 0
##$LPBIN= 0
##$MAXI= 10000
##$MC2= 0
##$MEAN= 0
##$ME_mod= 0
##$MI= 0
##$NCOEF= 0
##$NC_proc= -2
##$NLEV= 6
##$NOISF1= 0
##$NOISF2= 0
##$NSP= 0
##$NTH_PI= 0
##$NZP= 0
##$OFFSET= 14.96091
##$PC= 1
##$PHC0= -79.10706
##$PHC1= 0
##$PH_mod= 1
##$PKNL= yes
##$PPARMOD= 0
##$PPDIAG= 0
##$PPIPTYP= 0
##$PPMPNUM= 2147483647
##$PPRESOL= 1
##$PSCAL= 4
##$PSIGN= 0
##$PYNMP= <proc.py>
##$REVERSE= no
##$SF= 400.020009673987
##$SI= 131072
##$SIGF1= 0
##$SIGF2= 0
##$SINO= 400
##$SIOLD= 131072
##$SPECTYP= <>
##$SREGLST= <1H.CDCl3>
##$SSB= 0
##$STSI= 131072
##$STSR= 0
##$SW_p= 8223.68421052631
##$SYMM= 0
##$S_DEV= 0
##$TDeff= 65536
##$TDoff= 0
##$TI= <>
##$TILT= no
##$TM1= 0
##$TM2= 0
##$TOPLEV= 0
##$USERP1= <user>
##$USERP2= <user>
##$USERP3= <user>
##$USERP4= <user>
##$USERP5= <user>
##$WDW= 1
##$XDIM= 131072
##$YMAX_p= 428693663
##$YMIN_p= -11996
##$CURPLOT= <Network HP LaserJet P1505>
##$CURPRIN= <$Network HP LaserJet P1505>
##$DFORMAT= <normdp>
##$LAYOUT= <+/1D_H.xwp>
##$LFORMAT= <normlp>
##$PFORMAT= <normpl>
##$SURQMSG= 1
$$ End of Bruker specific parameters
$$ ---------------------------------
##NTUPLES= NMR SPECTRUM
##VAR_NAME=  FREQUENCY,     SPECTRUM/REAL,   SPECTRUM/IMAG
##SYMBOL=    X,             R,               I
##VAR_TYPE=  INDEPENDENT,   DEPENDENT,       DEPENDENT
##VAR_FORM=  AFFN,          ASDF,            ASDF
##VAR_DIM=   131072,        131072,          131072
##UNITS=     HZ,            ARBITRARY UNITS, ARBITRARY UNITS
##FACTOR=    0.0627417313425164, 1,          1
##FIRST=     8223.62146879497, -698,         -52402
##LAST=      0,             -209,            -53214
##MIN=       0,             -11996,          0
##MAX=       8223.62146879497, 428693663,    0
$$ Real data points
##PAGE= N=1
##DATA TABLE= (X++(R..R)), XYDATA
$$ [...]
63927E282533J19539Q0256M0335n02m2061q3901j25246j64492j99380k27992k49259
63916D429830k62720k68630k68454k64378k57771k48574k36503k22138k06369
63907B194293j89435j71325j52811j35186j19041j04024q9910p7188o6348n7056
63897A031969m8563m0636l3759k8399k4412k1233j8523j6484j5487j5390j5369
63886G53714j4590j3078j1673j0963j0555r617q089o893o792p381p514o501m527
63873F35541j967J214N149R429J3146J5637J7148J8669K1022K4082K6936K8854
63861H14860K9841L0180K9793K8478K6618K4977K3773K2396K0199J7139J3450
63850A081704R192M503q7m009p249j0312j3713j7596k1669k5328k8109l0122l1913
$$ plain form
63927 5282533 5402072 5482328 5522663 5522161 5480100 5396199 5270953 5106461 4907081 4679089 4429830
63916 4429830 4167110 3898480 3630026 3365648 3107877 2859303 2622800 2400662 2194293
63907 2194293 2004858 1833533 1680722 1545536 1426495 1322471 1232561 1155373 1089025 1031969
63897 1031969 983406 942770 909011 880612 856200 834967 816444 799960 784473 769083 753714
63886 753714 739124 726046 714373 703410 692855 683238 675149 668256 661464 654083 646569 640068 635541
63873 635541 633574 634788 639937 649366 662512 678149 695297 713966 734988 759070 786006 814860
63861 814860 844701 874881 904674 933152 959770 984747 1008520 1030916 1051115 1068254 1081704
63850 1081704 1090896 1095399 1095312 1091303 1084054 1073742 1060029 1042433 1020764 995436 967327 937205 905292
63837I05292l3780l5449l6539l6998l6911l6245l4946l3090l0767k8148k5699
63826E36720k3906k2631k1263j9571j7925j6465j4808j2914j1476j0892j0513
63815C54356r595q419p688p321o662n618m704m121l573k880k187j616j293j461
63801B87218k003k170j508p48r61k079l093l502l648l721l450k860k457k432k463
63786B50123k376k291k084j530j001j152j813k075j648j276j532k043k238k015
63772B25049j431n33K45L14j51l46j72l67j041j114L2J377J596Q01J09k1q3n51
63754B23713j319j919j876j118l25l22r04r20J21J362J919J969J927J547P89N61
63738B25205J471K585K724K405L018M472N074L869J775K65n8O60J976L145L543
$$ plain form
63837 905292 871512 836063 799524 762526 725615 689370 654424 621334 590567 562419 536720
63826 536720 512814 490183 468920 449349 431424 414959 400151 387237 375761 364869 354356
63815 354356 344761 336342 328654 321333 314671 309053 304349 300228 296655 293775 291588 289972 288679 287218
63801 287218 285215 283045 281537 280789 279828 277749 274656 271154 267506 263785 260335 257475 255018 252586 250123
63786 250123 247747 245456 243372 241842 240841 239689 237876 235801 234153 232877 231345 229302 227064 225049
63772 225049 223618 223085 223330 223644 223493 223147 222975 222608 221567 220453 220485 221862 223458 224259 224368 224347 224264 223713
63754 223713 222394 220475 218599 217481 217156 216834 215930 215010 215131 216493 218412 220381 222308 223855 224644 225205
63738 225205 226676 229261 231985 234390 237408 241880 246954 250823 252598 252863 252805 253465 255441 258586 262129
63723B62129L428L635M364M971N110N174N359N085L830K004N04j92k49j37l56
63708C04659j034j672j664j135q19r83j064n94J06M87N60O93R72J161J086Q25
63692C01584O94J154K428M010M872M462L234K076J417J133R03M17m85j548k152
63677C24199j890r99p7M77N88L89J84L40Q97J441J538J223Q03L74j79q12j259
63660C27237j388j383j499j844k418l185l981m480m463m043l504k906k094j155
63646B88894n83p41j283j480j102n96l27j4P95K034L165L766L841L675L589L727
63630C07360L912L890L762L897M353M775N063N587O465P196P486P914R085J0565
63616C91310J1545J2215J3475J5421J7148J8229J9353K1135K3216K5023K6648
$$ plain form
63723 262129 265557 269192 273556 278527 283637 288811 294170 299255 303085 305089 305593 305401 305152 305015 304659
63708 304659 303625 301953 300289 299154 298335 297352 296288 295694 295800 296287 296847 297540 298512 299673 300759 301584
63692 301584 302278 303432 305860 309870 314742 319204 322438 324514 325931 327064 327967 328384 327899 326351 324199
63677 324199 322309 321310 321233 321710 322298 322687 322871 323211 324108 325549 327087 328310 329113 329487 329308 328496 327237
63660 327237 325849 324466 322967 321123 318705 315520 311539 307059 302596 298553 295049 292143 290049 288894
63646 288894 288311 287570 286287 284807 283705 283109 282782 282768 283563 285597 288762 292528 296369 300044 303633 307360
63630 307360 311272 315162 318924 322821 327174 331949 337012 342599 349064 356260 363746 371660 380745 391310
63616 391310 402855 415070 428545 443966 461114 479343 498696 519831 543047 568070 594718
63605E94718K8374K9891L0665L0570K9584K7188K2835J6823J0250M189p38m229
63593H20120o289p232p370o795n764n026n346o889r456j2995j7322k1592k4727
63580F83317k6359k6833k6356k4822k2489k0097j8019j5940j3604j1310r239o941
63568D61308m035j037J187K547L616M585N077N047N133N761O497O725O545O521
63554E15477O859P413Q391J0402J3611J7277K0435K2872K5250K8413L2747L7932
63542G47079M2942M6216M6031M1178L1671J9100O161m549j1684j5281j6028j4608
63530I18228j1722q345n565m226m730p078j0930j5720k0877k5960l0524l4043
63518G38508l6112l6622l5700l3577l0686k7662k5025k2852k0875j8795j6442
$$ plain form
63605 594718 623092 652983 683648 714218 743802 770990 793825 810648 820898 825087 824349 820120
63593 820120 813831 806599 799229 792434 786670 781644 776298 769409 759953 746958 729636 708044 683317
63580 683317 656958 630125 603769 578947 556458 536361 518342 502402 488798 477488 468249 461308
63568 461308 457273 456236 457423 459970 463586 468171 473248 478295 483428 489189 495686 502411 508956 515477
63554 515477 522336 529749 538140 548542 562153 579430 599865 622737 647987 676400 709147 747079
63542 747079 790021 836237 882268 923446 955117 974217 980378 975829 964145 948864 932836 918228
63530 918228 906506 898161 892596 888370 883640 876562 865632 849912 829035 803075 772551 738508
63518 738508 702396 665774 630074 596497 565811 538149 513124 490272 469397 450602 434160
63507D34160j3861j1419r656q758q284p654o849o263o003n697n045m173l359k682
63493C34457k142j795j533r77O0J080J254L84p38j092l80Q88K042K723K847K516
63477C39594K135K229K871L493L565L280L131K949K007J26j834k963l322l609
63463C53652m097m438m325l894l444l096k800k403j678n36P03J447J333N80j21
63448C26883m9J022K604L857M401M657N285O411P584Q354Q728R150J0287J2639
63434D11813J6123K0129K4250K8696L3488L7305L7815L3635K5808J7092R873M894
63422G00921J849O17J526M540Q744J3056J7208K1603K6344L0878L4645L7262L7961
63409I37154L5652L0164K2873J5334P801l3p216j1650j2297j0403q170o896o778
$$ plain form
63507 434160 420299 408880 399224 390466 382182 374528 367679 361416 355413 349716 344671 340498 337139 334457
63493 334457 332315 330520 328987 328010 328070 329150 330404 330788 330050 328958 328578 329466 331508 334231 337078 339594
63477 339594 341729 343958 346829 350322 353887 357167 360298 363247 365254 365380 363546 360583 357261 353652
63463 353652 349555 345117 340792 336898 333454 330358 327558 325155 323477 322941 323644 325091 326424 327004 326883
63448 326883 326834 327856 330460 334317 338718 343375 348660 355071 362655 371009 379737 388887 399174 411813
63434 411813 427936 448065 472315 501011 534499 571804 609619 643254 669062 686154 696027 700921
63422 700921 702770 703387 704913 709453 718197 731253 748461 770064 796408 827286 861931 899193 937154
63409 937154 972806 1002970 1025843 1041177 1048978 1048945 1041729 1030079 1017782 1007379 999209 992313 985535
63396I85535p849j0373j4451j9673k5197l0033l3527l5698l6907l7088l5730l2801
63384F66208k9307k6462k4481k2601k0142j7232j4469j2196j0276q338o146l739
63372D70819j344Q06K599M097N555P207Q949J0344J1200J2020J3576J5988J8544
63359E80360K0564K2168K3987K6357K9008L1569L3999L6345L8154L8473L6626
63348I17610L2847K7791K1624J4152N978j170n840q229r559j0378j0211q927p622
63335I58066p833j0244j4390j9264k3973k8101l1663l4573l6186l5686l3140k9762
63323F53251k6858k4617k2158j8575j3735q188k661K009M551L437j909r827j7024
63310E17696k1018k1853k1142j9859j7823j4945j1943r528p641n927m466l609
$$ plain form
63396 985535 977686 967313 952862 933189 907992 877959 844432 808734 771827 734739 699009 666208
63384 666208 636901 610439 585958 563357 543215 525983 511514 499318 489042 480704 474558 470819
63372 470819 469475 470281 472880 476977 482532 489739 498688 509032 520232 532252 545828 561816 580360
63359 580360 600924 623092 647079 673436 702444 734013 768012 804357 842511 880984 917610
63348 917610 950457 978248 999872 1014024 1020002 1018832 1012992 1004763 995204 984826 974615 965688 958066
63335 958066 950233 939989 925599 906335 882362 854261 822598 788025 751839 716153 683013 653251
63323 653251 626393 601776 579618 561043 547308 539120 536459 538468 543019 546456 544547 534720 517696
63310 517696 496678 474825 453683 433824 416001 401056 389113 379585 371944 366017 361551 357942
63298C57942l365l353l196k815k466k548l127l702l731l266k733k239j660j324
63284C18417j795k840l404k937k041j421q98p1O19L33q74j917j893r64k5K17j91
63267B98315n76l47L85R93J174J247J571K038K359K511K618K687K709K758K811
63252C23253K743K661K876L371L707L717L793M145M362M150M050M774O133P242
63238C80977P678P858Q355R336J0687J2195J3578J4639J5434J6068J6482J6674
63226E29961J6968J7634J8350J8447J7696J6585J5801J5700J6259J7235J8294
63215G18930J9099J9360J8862J7622J5926J3986J1501P944L403j293n408q915
63203H31017j2063j4846j7155j8992k0169k0217j9074j7460j6026j4525j2331
$$ plain form
63298 357942 354577 351224 348028 345213 342747 340199 337072 333370 329639 326373 323640 321401 319741 318417
63284 318417 316622 313782 310378 307441 305400 303979 303081 303010 303629 303962 303088 301171 299278 298314 298289 298506 298315
63267 298315 297739 297392 297777 298770 299944 301191 302762 304800 307159 309670 312288 314975 317684 320442 323253
63252 323253 325996 328657 331533 334904 338611 342328 346121 350266 354628 358778 362828 367602 373735 380977
63238 380977 388655 396513 404868 414204 424891 437086 450664 465303 480737 496805 513287 529961
63226 529961 546929 564563 582913 601360 619056 635641 651442 667142 683401 700636 718930
63215 718930 738029 757389 776251 793873 809799 823785 835286 843230 846633 845340 839932 831017
63203 831017 818954 804108 786953 767961 747792 727575 708501 691041 675015 660490 648159
63192F48159r493o606l904j114J870M779P425R910J2324J4656J6933J9151K1122
63179G35212K2732K4156K5500K6443K6647K6353K6055K5804K5328K4590K3776
63168A012596K2848K1630K0128J8229J5290J0744N071n83n738j0985j6900k3257
63156A069073k9339l4511l8325m0552m1332m0921l9338l6663l3516l0651k8121
63145F75804k5517k2895k0723j8871j6631j3942j1715j0478r579q241o668n466
63133E05078m594l642k678j993j378l86P88J463J480J385J636K189K951M025N246
63118E11570O048O078N674N381N259M968M396L771L201K537J833J595K191L146
63104E67648L479K763J495L68m22r52j137r32p05q30j090r53l47K58N73P62R75
$$ plain form
63192 648159 638666 632060 628156 627042 628912 633691 641116 651026 663350 678006 694939 714090 735212
63179 735212 757944 782100 807600 834043 860690 887043 913098 938902 964230 988820 1012596
63168 1012596 1035444 1057074 1077202 1095431 1110721 1121465 1126536 1125953 1120215 1109230 1092330 1069073
63156 1069073 1039734 1005223 966898 926346 885014 844093 804755 768092 734576 703925 675804
63145 675804 650287 627392 606669 587798 571167 557225 545510 535032 525453 517212 510544 505078
63133 505078 500484 496842 494164 492171 490793 490407 491195 492658 494138 495523 497159 499348 502299 506324 511570
63118 511570 517618 523696 529370 534751 540010 544978 549374 553145 556346 558883 560716 562311 564502 567648
63104 567648 571127 573890 575385 575753 575331 574379 573242 572310 571605 570775 569685 568732 568385 568643 569216 569978 570953
63087E70953J098J109J209J411J381R46M23K23L83O70Q89R85J088J565K680M014
63071E91027M721M568M387N002O133O852O939P091P821Q851R789J0863J2497J4512
63057G01053J6331J7893J9826K2534K5595K8326L0665L3065L5712L8252M0235
63046A009487M1498M2116M2339M2616M3222M3824M3806M3108M2317M1872M1709
63035A477914M1828M2496M3496M3842M2776M0533L7639L3994K9259K3563J6986
63024A874326Q900j161j2209k2435l1036l8459m4904m9695n2325n3051n2179m9590
63012A476182m5428m0457l5266k9741k3702j7385j0946m158K919R565J5259K0385
63000A317227K5596L0847L5497L9014M1238M2280M2605M2897M3524M4372M5256
$$ plain form
63087 570953 572051 573160 574369 575780 577161 578107 578530 578753 579136 579806 580695 581680 582768 584333 587013 591027
63071 591027 595748 600316 604703 609705 615838 622690 629629 636720 644541 653392 663181 674044 686541 701053
63057 701053 717384 735277 755103 777637 803232 831558 862223 895288 931000 969252 1009487
63046 1009487 1050985 1093101 1135440 1178056 1221278 1265102 1308908 1352016 1394333 1436205 1477914
63035 1477914 1519742 1562238 1605734 1649576 1692352 1732885 1770524 1804518 1833777 1857340 1874326
63024 1874326 1883226 1882065 1869856 1847421 1816385 1777926 1733022 1683327 1631002 1577951 1525772 1476182
63012 1476182 1430754 1390297 1355031 1325290 1301588 1284203 1273257 1269099 1272018 1281583 1296842 1317227
63000 1317227 1342823 1373670 1409167 1448181 1489419 1531699 1574304 1617201 1660725 1705097 1750353
62989A750353M6067M6394M5724M4215M2600M0912L8084L3269K6845J9470J0916
62978B144849O61j0915k2892l4911m6962n8270o7396p3513p6883p8128p7684p5932
62966A522024p3230o9658o5165o0015n4671m9382m4300l9836l6326l3487l0755
62955I65199k8148k6227k5203k4648k4053k3200k2042k0697j9536j8763j8029
62944G14653j6935j5782j5152j4884j4178j2730j1035r524q164p101o767o984
62932E75417o825n822m673m159l956l242j994r58n91o88r57j272j440j269r55
62917E36616q79j058j185j241j529j998k121j712j398j790k524k709k161j644
62903E12667j769k265k588k753l046l198k519r33P01J541J651J626J709J645J244
$$ plain form
62989 1750353 1796420 1842814 1888538 1932753 1975353 2016265 2054349 2087618 2114463 2133933 2144849
62978 2144849 2145510 2134595 2111703 2076792 2029830 1971560 1904164 1830651 1753768 1675640 1597956 1522024
62966 1522024 1448794 1379136 1313971 1253956 1199285 1149903 1105603 1065767 1029441 995954 965199
62955 965199 937051 910824 885621 860973 836920 813720 791678 770981 751445 732682 714653
62944 714653 697718 681936 666784 651900 637722 624992 613957 604433 596269 589168 582401 575417
62932 575417 568592 562770 558097 553938 549982 546740 544746 543788 543197 542509 541552 540280 538840 537571 536616
62917 536616 535737 534679 533494 532253 530724 528726 526605 524893 523495 521705 519181 516472 514311 512667
62903 512667 510898 508633 506045 503292 500246 497048 494529 493596 494297 495838 497489 499115 500824 502469 503713
62888E03713O06j18q26j303j307q60k40L64R33J345J330Q30K58J70P27J504J870
62871E08996J567R72O77P94P97K29o36j142j074q05o38l83K45J130J871K223K209
62854E17032J973J685J624K112L233M580N396N159M057K764J728R39M64O97J673
62839E55116K511K218R63l8p3L83O14O36P26O50Q1n20l10P34J671J801J370Q72
62821E69405L10m47j047j033n78k47j30J62O49P40J57m95n46k53l65r42j310j117
62803E62913p79o64m70J38Q56J222J518K445L972N133N202M643M580N610P379
62788F03698R207J0803J2435J4631J7778K1846K6403L0906L5072L8985M2877M6852
62776I11493N0812N4632N8243O1451O3885O5228O5478O4617O2047N6799M8594
$$ plain form
62888 503713 504319 504201 503375 502072 500765 499905 499665 500029 500962 502307 503637 504467 504725 504895 505622 507126 508996
62871 508996 510563 511535 512212 513006 513803 514032 513396 512254 511180 510375 509737 509354 509599 510729 512600 514823 517032
62854 517032 519005 520690 522314 524426 527659 532239 537635 542794 546851 549615 551343 552282 552746 553443 555116
62839 555116 557627 559845 560808 560770 560697 561080 561694 562330 563056 563706 563787 563267 562957 563691 565362 567163 568533 569405
62821 569405 569715 569268 568221 567188 566610 566363 566233 566395 567044 567784 567941 567446 566900 566647 566282 565340 564030 562913
62803 562913 562134 561470 561000 561138 561994 563216 564734 567179 571151 576284 581486 586129 590709 596319 603698
62788 603698 612905 623708 636143 650774 668552 690398 716801 747707 782779 821764 864641 911493
62776 911493 962305 1016937 1075180 1136631 1200516 1265744 1331222 1395839 1457886 1514685 1563279
62765A563279L8451K7805J7145N933o112j8184k9075l8360m6396n3317n8563o1629
62753A340977o2911o3397o3505o2635o0022n5880n1402m7650m4637m1515l7544
62742G49879l2868k8443k5223k3293k1830j9998j7821j5904j4428j2796j0471
62731E26804p777n560m218l443k769k030j253m12N20J467K287K891L292L665M338
62716E17802N603P416R350J0909J1887J2520J3368J4972J7440K0304K2994K5519
62704F90084K8527L2537L7207M1654M5544M9510N4335N9912O5413P0328P4931
62693A249982P9572Q4005Q7659R0151R1121Q9779Q5278P7479O6882N3795L8169
62682B093872K0448K045j5464l1411m5993n9398p1239q0785q7469r1200r2304
$$ plain form
62765 1563279 1601730 1629535 1646680 1652613 1646501 1628317 1599242 1560882 1514486 1461169 1402606 1340977
62753 1340977 1278066 1214669 1151164 1088529 1028507 972627 921225 873575 828938 787423 749879
62742 749879 717011 688568 663345 640052 618222 598224 580403 564499 550071 537275 526804
62731 526804 519027 513467 509249 505806 503037 501007 499754 499342 499862 501329 503616 506507 509799 513464 517802
62716 517802 523405 530821 540171 551080 562967 575487 588855 603827 621267 641571 664565 690084
62704 690084 718611 751148 788355 830009 875553 925063 979398 1039310 1104723 1175051 1249982
62693 1249982 1329554 1413559 1501218 1591369 1682490 1772269 1857547 1935026 2001908 2055703 2093872
62682 2093872 2114320 2116365 2100901 2069490 2023497 1964099 1892860 1812075 1724606 1633406 1541102
62671A541102r1217q8327q4118p9326p4582o9867o4674n8806n2671m6806m1454
62660G89254l6689l2541k8812k5216k1958j9635j8266j6958j5000j2874j1554
62649E49751j1154j0953j0512j0009r453q421o753n012l900l514l352k818j615
62636D62285O1J642K651L104L276L195K683J786P97j39j059j781j979j685j301
62621D73536j019o70k61j11k16K4J007K285L178L735M516N587O336O335N889N551
62605E15702N583O017O893Q081R150R764J0143J0859J2262J4295J6761J9474K2203
62592F67187K4792K7360L0020L2344L3518L3273L2211L0917K9073K5952K1490
62581I88137J6302J0761M685j972q632j4550j9387k3224k6353k9068l1357l2689
$$ plain form
62671 1541102 1449885 1361558 1277440 1198114 1123532 1053665 988991 930185 877514 830708 789254
62660 789254 752565 720024 691212 665996 644038 624403 606137 589179 574179 561305 549751
62649 549751 538597 527644 517132 507123 497670 489249 482496 477484 473584 470070 466718 463900 462285
62636 462285 462346 463988 466639 469743 473019 476214 478897 480683 481480 481341 480282 478501 476522 474837 473536
62621 473536 472517 471847 471586 471475 471259 471283 472290 474575 477753 481488 486004 491591 497927 504262 510151 515702
62605 515702 521285 527302 534195 542276 551426 561190 571333 582192 594454 608749 625510 644984 667187
62592 667187 691979 719339 749359 781703 815221 848494 880705 911622 940695 966647 988137
62581 988137 1004439 1015200 1019885 1017913 1009281 994731 975344 952120 925767 896699 865342 832653
62569H32653l2592l1483l0362k9562k8379k6293k3844k1838k0163j8117j5562
62558E54458j3127j1310r972q712p334n951m895m532m892n496n690n109l799k177
62544D61462r30n50p46o61N8Q26J022Q12P09P54O65M13J43j34l15n4P01J446J994
62525D67615L029N098P544R347J0665J2515J5195J8059K0700K3362K6137K8884
62513F48150L1980L6078M0859M5090M8165N0670N2974N4347N4031N2307M9735
62502A164386M6006M0345L2631K3576J4062M747l999j2098j9404k5153k8289k8582
62490A208228k6858k3878j9727j4566r133l809K025Q898J6083K2378K7611L2494
62478A219746L7200M0963M2850M2204L8442L1378K1982J2174L525l733j0617j8660
$$ plain form
62569 832653 800061 768578 738216 708654 680275 653982 630138 608300 588137 570020 554458
62558 554458 541331 530021 520049 511337 504003 498052 493157 488625 483733 478237 472547 467438 463639 461462
62544 461462 460532 459982 459236 458575 458633 459459 460481 461293 462002 462756 463421 463834 463977 463843 463528 463474 464175 465621 467615
62525 467615 470644 475742 483286 492633 503298 515813 531008 549067 569767 593129 619266 648150
62513 648150 680130 716208 757067 802157 850322 900992 953966 1008313 1062344 1114651 1164386
62502 1164386 1210392 1250737 1283368 1306944 1321006 1325753 1321754 1309656 1290252 1265099 1236810 1208228
62490 1208228 1181370 1157492 1137765 1123199 1114066 1110257 1112282 1121180 1137263 1159641 1187252 1219746
62478 1219746 1256946 1297909 1340759 1382963 1421405 1452783 1474765 1486939 1490464 1486731 1476114 1457454
62466A457454k8945m0987n2494o0815o4914o5779o5042o3715o2085o0004n6968
62455H35706n2449m6578m0247l4326k9010k4133j9682j5733j2161q830n945l835
62443E42777k421j201J91J685L052M300N555O745P612Q021Q071P806O971N240
62429F04404K661k38k838m914o708q481r962j0478r798q679q167q438q702q366
62415E11296p705p180o664n839m875m150l605k998k555k663l074l070k434j675
62401D52809j217r73p19l94P9P51J433J946K503L272L773L395K402J637J268P31
62385D72696n9m69l12j67j75M33K006L646M366M341M304M446M682N288O409P438
62369E18873P762P667P793Q178Q622R532J1468J4142J6779J9301K2323K6108L0297
$$ plain form
62466 1457454 1428509 1387522 1335028 1274213 1209299 1143520 1078478 1014763 952678 892674 835706
62455 835706 783257 736679 696432 662106 633096 608963 589281 573548 561387 552557 546612 542777
62443 542777 540356 539155 539346 541031 544083 548383 553938 560683 568295 576316 584387 592193 599164 604404
62429 604404 607065 606827 603989 599075 592367 583886 573924 563446 553648 544969 536802 528364 519662 511296
62415 511296 503591 496411 489747 483908 479033 474883 471278 468280 465725 463062 459988 456918 454484 452809
62401 452809 451592 450619 449900 449506 449585 450336 451769 453715 456218 459490 463263 466658 469060 470697 471965 472696
62385 472696 472637 472168 471856 471689 471514 471947 473953 477599 481965 486306 490610 495056 499738 505026 511435 518873
62369 518873 526635 534302 542095 550273 558895 568427 579895 594037 610816 630117 652440 678548 708845
62356G08845L4639L9286M4297M9377N4037N7581N9164N8364N5473N0814M4203
62345A256080L5695K6399J7638R641J888n492j1770j6993k2192k7940l3540l7911
62333A191503m0587m1621m1187l9681l7633l5217l2230k8728k5284k2375j9961
62322H26999j7820j6023j4922j4923j6206j8334k0217k0880k0271j9042j7798
62311F30563j6928j6746j7099j7036j5713j3485j1409r754p971o064m849m602
62299D88907m463l665k517j649j082n64j81K7M32J175J671J455J071J451K609
62284D84677L645L903L589L224L048K969K836K689K778L250L764L771L302L084
62270E30529L597M395M790M907N564P181R301J1201J2707J4287J6591J9939K4174
$$ plain form
62356 708845 743484 782770 827067 876444 930481 988062 1047226 1105590 1161063 1211877 1256080
62345 1256080 1291775 1318174 1335812 1345453 1347341 1341849 1330079 1313086 1290894 1262954 1229414 1191503
62333 1191503 1150916 1109295 1068108 1028427 990794 955577 923347 894619 869335 846960 826999
62322 826999 809179 793156 778234 763311 747105 728771 708554 687674 667403 648361 630563
62311 630563 613635 596889 579790 562754 547041 533556 522147 512393 504422 498358 493509 488907
62299 488907 484444 480779 478262 476613 475531 474967 474786 474813 475245 476420 478091 479546 480617 482068 484677
62284 484677 488322 492225 495814 499038 502086 505055 507891 510580 513358 516608 520372 524143 527445 530529
62270 530529 534126 538521 543311 548218 553782 560963 570264 581465 594172 608459 625050 644989 669163
62257F69163K8906L3825L8754M3581M8338N3203N7975O1661O2998O1523N7734
62246A217661N2167M4924L6249K7005J8054R541J195o993j4914k2843l1224l9956
62234A290866m8191n4885n9332o1262o0845n8589n5088n0767m5942m0928l5988
62223G19049l1315k7069k3295j9761j6230j2959j0541r047p789o212m628l602
62211E46601k979k070o19R34K105K844L388L982M774N687O397O695O726O647O287
62196E97399N516M730M408M303L769K869K485L022L661L404K430J865K383L532
62182F45776M514N095N570O087O255N571M066K448J456J177J208J390K073L617
62168F96303O026R274J3531J8689K4028K8845L3253L7742M2039M5020M5856M4572
$$ plain form
62257 669163 698069 731894 770648 814229 862567 915770 973745 1035406 1098404 1159927 1217661
62246 1217661 1269828 1314752 1351001 1378006 1396060 1405601 1406796 1399803 1384889 1362046 1330822 1290866
62234 1290866 1242675 1187790 1128458 1067196 1006351 947762 892674 841907 795965 755037 719049
62223 719049 687734 660665 637370 617609 601379 588420 577879 568832 561043 554831 550203 546601
62211 546601 543622 541552 540933 541867 543972 546816 550204 554186 558960 564647 571044 577739 584465 591112 597399
62196 597399 602915 607645 612053 616356 620125 622994 625479 628501 632162 635566 637996 639861 642244 645776
62182 645776 650290 655385 660955 667042 673297 678868 682934 685382 686838 688015 689223 690613 692686 696303
62168 696303 702329 711603 725134 743823 767851 796696 829949 867691 909730 954750 1000606 1045178
62156A045178M1369L6187K9286K1602J3965O573k16n316q225j0449j4382k0642
62144A134930k7539l3158l6945l9001l9114l7259l4178l0675k6853k2695j8691
62133G88822j5237j2056q928o426n049m272l397k841l442m772n442m903l821k609
62119G05627r30J174K895L897M941O662Q551R660R582Q201N320J264k723n336
62105G58785o204n601l849j591j25n43k678n385p657r088r521q868p185m691j810
62090F83989O85K071K516K988M014N096N724O273P205Q131Q560R133J0893J3585
62076G70863J5833J7041J8080J9797K1793K3092K3296K2666K1565K0331J9321
62065I93678J8772J8837J9888K2278K5637K8846L0973L1877L1631K9976K6726
$$ plain form
62156 1045178 1086547 1122734 1152020 1173622 1187587 1194160 1193944 1188628 1180403 1169954 1155572 1134930
62144 1134930 1107391 1074233 1037288 998287 959173 921914 887736 857061 830208 807513 788822
62133 788822 773585 761529 752601 746175 741126 736854 733457 730616 727174 722402 716960 712057 708236 705627
62119 705627 704697 705871 708766 712663 717604 724266 732817 742477 752059 760260 765580 766844 764121 758785
62105 758785 752581 746980 743131 741540 741415 740872 738194 732809 725152 716064 706543 697675 690490 685799 683989
62090 683989 684674 686745 689261 692249 696263 701359 707083 713356 720561 728692 737252 746385 757278 770863
62076 770863 786696 803737 821817 841614 863407 886499 909795 932461 954026 974357 993678
62065 993678 1012450 1031287 1051175 1073453 1099090 1127936 1158909 1190786 1222417 1252393 1279119
62054A279119K2259J7158J1687O094J089k768o022r968j5188k0941k6231l0909
62042A225379l5392l9644m2985m4825m5201m4513m3113m1249l9135l6811l4125
62031G78386l1038k7886k5074k2637k0383j8379j6880j5723j4313j2451j0746
62020E62876r833r443q824p905p375p511p575o791n464m629m754n264n309m611
62006D67588l459k279j383q79n37M8J004J953K479K650K908L459M094M498M500
61991D86644M006L044J940J073L48p99k614m544n882o653p450q543r505r735q976
61976D32354p389n440l763k743k147j411l80N10Q61Q41R11J271J738J988J800
61961D19001J230O88O97J378K227K523J966R47J95K19R47J903K675L173L397L248
$$ plain form
62054 1279119 1301378 1318536 1330223 1336317 1337406 1334638 1328616 1318648 1303460 1282519 1256288 1225379
62042 1225379 1189987 1150343 1107358 1062533 1017332 972819 929706 888457 849322 812511 778386
62031 778386 747348 719462 694388 671751 651368 632989 616109 600386 586073 573622 562876
62020 562876 553043 543600 534776 526871 519496 511985 504410 497619 492155 487526 482772 477508 472199 467588
62006 467588 464129 461850 460467 459588 459051 459099 460103 462056 464535 467185 470093 473552 477646 482144 486644
61991 486644 490650 493694 495634 496707 497055 496256 493642 489098 483216 476563 469113 460570 451065 441330 432354
61976 432354 424965 419525 415762 413019 410872 409461 409081 409591 410452 411293 412204 413475 415213 417201 419001
61961 419001 420231 420919 421616 422994 425221 427744 429710 430657 430852 431071 432018 433921 436596 439769 443166 446414
61945D46414K765K377K585L465M733O186P786R353J0579J1416J2105J2785J3288
61932E45837J3382J2987J2193J1243J0433R734Q657O933N107L873K981J502o96
61919F44166k540l202l181l475m195m701m674m361l885k934j185J312M201O982
61905F18328R160J0516J1208J1380J0874R486P361M905K414L2k121m048n956p895
61891F75644r487j0289j0406j0394j0544j0552r924q548o810n332m633m868n760
61878E68097o816p679q354r114j0064j0786j0629r510q215p573p431o913n571
61865D59442l851k360j210k32O06J303K015K877L904N166O756Q469R930J1188
61851E04003J2757J4870J7098J8981K0546K1952K3009K3443K3241K2456K1038
$$ plain form
61945 446414 449179 451556 454141 457606 462339 468525 476311 485664 496243 507659 519764 532549 545837
61932 545837 559219 572206 584399 595642 606075 615809 624466 631399 636506 640379 643360 644862 644166
61919 644166 641626 638424 635243 631768 627573 622872 618198 613837 609952 607018 605833 607145 611346 618328
61905 618328 627488 638004 649212 660592 671466 680952 688313 693218 695632 695664 693543 689495 683539 675644
61891 675644 666157 655868 645462 635068 624524 613972 604048 595500 588690 583358 578725 573857 568097
61878 568097 561281 553602 545248 536134 526070 515284 504655 495145 486930 479357 471926 465013 459442
61865 459442 455591 453231 452021 451789 452395 453698 455713 458590 462494 467660 474416 482885 492815 504003
61851 504003 516760 531630 548728 567709 588255 610207 633216 656659 679900 702356 723394
61840G23394J9099J6938J4508J1302P214K936q40m054o627p811p084n238l645
61827G60092k522p97K282O097R440J1685J2935J3483J3384J2398J0227O907K880
61814H58491j401n767j0059j3903j7018j9448k1172k1851k1441k0607j9997j9384
61802F66443j8208j6667j5516j4860j3941j2222j0087q292p228o859o899o907
61790E28757o528n795m972m183l458k953k693k318j540p69o20r92j169q54m43
61775D89470k83l46p00j516k427k531j497n8R08J294J422J268P04J46M18J795
61759D88067L569M668M650M098M005M698N534N690N105M220L133J519n19k217
61745E36220l071l489m190n231o000n998n320m443l777l443l265k981k441j656
$$ plain form
61840 723394 742493 759431 773939 785241 792455 795391 794551 790497 783870 776059 768975 763737 760092
61827 760092 757570 756773 759055 765152 774592 786277 799212 812695 826079 838477 848704 855611 858491
61814 858491 857090 851323 841264 827361 810343 790895 769723 747872 726431 705824 685827 666443
61802 666443 648235 631568 616052 601192 587251 575029 564942 556650 549422 542563 535664 528757
61790 528757 522229 516434 511462 507279 503821 500868 498175 495857 494317 493548 492928 491936 490767 489913 489470
61775 489470 489187 488841 488141 486625 484198 481667 480170 480112 481020 482314 483736 485004 485708 485854 486272 488067
61759 488067 491636 496304 500954 505052 509057 513755 519289 524979 530084 534304 537437 538956 538437 536220
61745 536220 533149 529660 525470 520239 514239 508241 502921 498478 494701 491258 487993 485012 482571 480915
61731D80915p81q1J88O8k5L41J180K114K722K820K521K191K161K331K251J750
61715E02666J214J055J204J348J417J458J378J106P31J90p82j964k455j729n09
61700E06328N8k83j033j989l209m234m354l659k953k575k195j769j743k171k509
61685D71710k527k597k848k864k501k196k142j961j605j728k657l702m015l556
61671D34811k699j588m50N1m81j522k239k429k324j934j213n67n49j115j639j602
61655D12511r40J8P44Q64O39P47J407K079K289K257K334K312J819J062N71N04
61639D31217O05O88P53P81Q21J034J368J380P50k30r49j088p90n24q82k091l501
61622D29342m021l352k328j839j972k437l113l691l590k855k427k792l087k472
$$ plain form
61731 480915 480134 480053 480241 480309 480284 480625 481805 483919 486641 489461 491982 494173 496334 498665 500916 502666
61715 502666 503880 504935 506139 507487 508904 510362 511740 512846 513577 513767 512985 511021 508566 506837 506328
61700 506328 506386 506103 505070 503081 499872 495638 491284 487625 484672 482097 479902 478133 476390 474219 471710
61685 471710 469183 466586 463738 460874 458373 456177 454035 452074 450469 448741 446084 442382 438367 434811
61671 434811 432112 430524 430074 430125 429644 428122 425883 423454 421130 419196 417983 417416 416867 415752 414113 412511
61655 412511 411571 411589 412333 413197 413836 414583 415990 418069 420358 422615 424949 427261 429080 430142 430713 431217
61639 431217 431822 432510 433263 434044 434865 435899 437267 438647 439397 439167 438218 437130 436340 435816 434934 432843 429342
61622 429342 425321 421969 419641 417802 415830 413393 410280 406589 402999 400144 397717 394925 391838 389366
61608C89366j705k171l718m807m710m335m621n309n649n408m693l611k522k103
61594C34004k596l436l932l930l581k964k241j797j804k011k221k537k865k643
61580B95446j559k43L27p4q13j259j315j125p92m35k38k29k20j12k8k7J15O61
61562B88080J487K110K100J371K02q36j037p5J419K198J630M83R1Q16J747J907
61546C03693J316O95N20O66P65O49M47M07O21R06J042J052J051J024J006J390
61530C17250K437L526L523K144L65q24j547k430l438l967l785l203k432j406l33
61515C05880J97j23q42j130n58N80J553J826J425P39np72j328j248n28K28N18
61498C06412M76M12K07l20q20p66k44J90L48N27Q66J147J213J100P11p3q63r26
$$ plain form
61608 389366 387661 385490 381772 376965 372255 367920 363299 357990 352341 346933 342240 338629 336107 334004
61594 334004 331408 327972 324040 320110 316529 313565 311324 309527 307723 305712 303491 300954 298089 295446
61580 295446 293887 293644 293971 293897 293084 291825 290510 289385 288593 288158 287920 287691 287471 287359 287331 287304 287419 288080
61562 288080 289567 291677 293777 295148 295350 294514 293477 293402 294821 297019 298649 299132 299223 300039 301786 303693
61546 303693 305009 305704 306224 306890 307655 308304 308751 309158 309779 310685 311727 312779 313830 314854 315860 317250
61530 317250 319687 323213 326736 328880 329245 328421 326874 324444 321006 317039 313254 310051 307619 306213 305880
61515 305880 306077 305954 305112 303982 303424 304004 305557 307383 308808 309547 309542 308770 307442 306194 305666 305894 306412
61498 306412 306888 307300 307507 307187 306367 305601 305357 305547 305895 306422 307288 308435 309648 310748 311459 311386 310523 309597
61480C09597j17Q28J178J010Q08P08O07P04J367K481L333L344K609J604N74m84
61464C30151j347j505p95J67M96o4r41j440j322p73j25K95L79M77J067K011K494
61447C29225J946P93r9l86l17m2N51J387K015K047J496O86Mk17Q4N74Q56R56J243
61428C42802J770K052J659Q34J93l2j39l22k74L61J375K202K633K915L121K911
61412C64061K108J102L29k58p59q47k73M33N20L6l67n53q80j228j015l86k84r69
61394C60770j459r70o4L26K64L82P38R52J019J107R56L26k58p2P68J510J920K332
61376C70547K705K482J539N46J93N30J150J605J609J252J030J249J551J470J198
61361C90656J175J167N53m30o46M25J838K324J876J656K512M035N148N420N520
$$ plain form
61480 309597 309480 310308 311486 312496 313304 314012 314619 315323 316690 319171 322504 325848 328457 330061 330635 330151
61464 330151 328804 327299 326504 326671 327167 327103 326162 324722 323400 322627 322502 322797 323176 323653 324720 326731 329225
61447 329225 331171 331964 331865 331479 331162 331120 331671 333058 335073 337120 338616 339302 339306 339089 339173 339747 340603 341559 342802
61428 342802 344572 346624 348283 349117 349310 349278 349139 348817 348543 348904 350279 352481 355114 358029 361150 364061
61412 364061 366169 367271 367600 367342 366583 365736 365463 365896 366416 366452 366085 365532 364652 363424 362409 362023 361739 360770
61394 360770 359311 358341 358277 358603 358867 359249 359987 360939 361958 363065 364021 364347 364089 364017 364785 366295 368215 370547
61376 370547 373252 375734 377273 377819 378012 378542 379692 381297 382906 384158 385188 386437 387988 389458 390656
61361 390656 391831 392998 393551 393121 392475 392900 394738 397062 398938 400594 403106 407141 412289 417709 423229
61346D23229O292P557Q246P733O542N441M464L275K073J369J169J031Q51Q72J050
61331D81194J073J010J226J569J331K31j104j863j835j296n69Q2M64N50M78M26
61315D82967O69J608L342N304O698P321P613Q017Q665R660J1178J3162J5279J7143
61301E98626J8409J8767J8131J6649J4264J0629N946J453j623l419n043o966q648
61288F77175r676j0359j1020j1484j1564j1475j1440j1393j1284j1129j0634r267
61276E46450p027m681k978j974j257m37O37J793K488K300J519R10Q54J134J539
61261E41270K145K950L840M904O307P754Q632Q664P940O402M081J772N20K71q7
61246F07365j067j883j786j222j055j406j860k183k201j550k89P88J083J041J393
$$ plain form
61346 423229 429521 437078 445324 453057 459599 465040 469504 472779 474852 476221 477390 478421 479272 480144 481194
61331 481194 482267 483277 484503 486072 487403 487634 486530 484667 482832 481536 480967 481049 481513 482063 482541 482967
61315 482967 483636 485244 488586 493890 500588 507909 515522 523539 532204 541864 553042 566204 581483 598626
61301 598626 617035 635802 653933 670582 684846 695475 701421 702874 701251 697832 692789 685823 677175
61288 677175 667499 657140 646120 634636 623072 611597 600157 588764 577480 566351 555717 546450
61276 546450 539423 534742 531764 529790 528533 528096 528733 530526 533014 535314 536833 537743 538597 539731 541270
61261 541270 543415 546365 550205 555109 561416 569170 577802 586466 594406 600808 604889 606661 607181 607452 607365
61246 607365 606298 604415 602629 601407 600352 598946 597086 594903 592702 591152 590863 591651 592734 593775 595168
61231E95168K040K412K596L246M475N686O503P224Q145Q997R319R133Q905Q994
61217F82843R241R143Q435P427O642O247O064N986N976N652M501K657R79P1l19
61202G61545n72m10N92K134L392M062M718O108Q452J1373J4249J6605J8262J9092
61188H69602J8637J6336J2376P962M379J899q5k021l737m929n678o261o781p239
61174H94460p876r052j0669j1905j1945j1032j0375j0882j2225j3424j3972j4015
61162G57088j3797j3490j3394j3665j3907j3562j2679j1753j0831r478p657n941
61150F16934m609l239j497K78J646K645L351L321K075j51k648n007p184q889r459
61135E87567q550o628m632l108j856l86J349K954M266N665P460R364J0895J2056
$$ plain form
61231 595168 597208 599620 602216 605462 609937 615623 622126 629350 637495 646492 655811 664944 673849 682843
61217 682843 692084 701227 709662 717089 723731 729978 736042 742028 748004 753656 758157 760814 761793 761864 761545
61202 761545 760973 760563 761155 763289 766681 770743 775461 781569 790021 801394 815643 832248 850510 869602
61188 869602 888239 904575 916951 924913 929292 931191 931106 929085 925348 920419 914741 908480 901699 894460
61174 894460 886584 877532 866863 854958 843013 831981 821606 810724 798499 785075 771103 757088
61162 757088 743291 729801 716407 702742 688835 675273 662594 650841 640010 630532 622875 616934
61150 616934 612325 609086 607589 607867 609513 612158 615509 618830 620905 620754 618106 613099 605915 597026 587567
61135 587567 579017 572389 567757 564649 562793 562407 563756 566710 570976 576641 584101 593465 604360 616416
61121F16416J3176J4361J5650J7342J9608K1865K3292K3880K4358K5175K6146
61110H41269K7075K7926K8282K7497K5567K3316K1436J9849J8188J6288J4068
61099A090761J1417Q359M980J104l449q386j3186j7640k1553k4244k5269k5513
61087I77381k6423k8086k9150k8838k7925k7261k6472k4766k2191j9415j6919
61076F99935j5026j4068j3959j3934j3226j1668r478o974m641k906j650n17K80
61063E92168K51k90l57L13J076J735K874M504N609N732N859O978Q646R882J0613
61048F55593J1423J2520J3748J5142J6755J8365J9781K1053K2184K3165K4381
61037H54110K6118K7742K8343K8276K8813L0169L1363L2219L3836L6484L8853
$$ plain form
61121 616416 629592 643953 659603 676945 696553 718418 741710 765590 789948 815123 841269
61110 841269 868344 896270 924552 952049 977616 1000932 1022368 1042217 1060405 1076693 1090761
61099 1090761 1102178 1110537 1115517 1116621 1113172 1104786 1091600 1073960 1052407 1028163 1002894 977381
61087 977381 950958 922872 893722 864884 836959 809698 783226 758460 736269 716854 699935
61076 699935 684909 670841 656882 642948 629722 618054 608576 601602 596961 594055 592405 591888 592168
61063 592168 592419 592129 591772 592085 593161 594896 597770 602274 607883 613615 619474 626452 635098 644980 655593
61048 655593 667016 679536 693284 708426 725181 743546 763327 784380 806564 829729 854110
61037 854110 880228 907970 936313 964589 993402 1023571 1054934 1087153 1120989 1157473 1196326
61026A196326M0244M1741M4181M6460M7201M6685M5990M5541M5765M7887N2763
61015A700784N9984O8987P9770R1638J02915J13104J23768J36640J53022J75986
61005B806598K10133K57341L15731L84888M68926N72252O97145Q49696J043437
60996G606147J290911J594312J945561K317774K631616K735418K466266J783315
60988B4371320Q54066j5104n61191o96798m93017q2025L90028P41058P64623L37239
60978B5610199m64988j379144k111850k502996k565178k405563k134324j828520
60970A0217636j535786j279960j063798q79656p22077n89563m79530l88119l13940
60961B965207k57193k15488j84018j59408j40362j25162j11614r9265q8928q0062
$$ plain form
61026 1196326 1236570 1278311 1322492 1368952 1416153 1462838 1508828 1554369 1600134 1648021 1700784
61015 1700784 1760768 1829755 1909525 2001163 2104078 2217182 2340950 2477590 2630612 2806598
61005 2806598 3016731 3274072 3589803 3974691 4443617 5015869 5713014 6562710 7606147
60996 7606147 8897058 10491370 12436931 14754705 17386321 20121739 22588005 24371320
60988 24371320 25225386 25210282 24649091 23952293 23459276 23377251 23767279 24508337 25272960 25610199
60978 25610199 25145211 23766067 21654217 19151221 16586043 14180480 12046156 10217636
60970 10217636 8681850 7401890 6338092 5458436 4736359 4146796 3667266 3279147 2965207
60961 2965207 2708014 2492526 2308508 2149100 2008738 1883576 1771962 1672697 1583769 1503707
60951A503707p0921o1180n2086m4098l6691l0622k8028k9455l2529l4368l4085
60940A049644l2444l0325k8217k6270k4261k1915j9579j8008j7481j7531j7556
60929G96057j7178j6171j4651j3144j2020j1058j0020r150q544p614n958m296
60917F66253l614l743l688k999j963p20P94K276L301M086N162O456P474Q266R330
60902F96671J0717J2047J3312J4843J6506J7827J8778J9709K0561K0973K1182
60891H83126K1878K3112K4199K4837K5432K6112K6193K5080K3054K0776J8518
60880A142317J6163J3533J0436O718K550j581n349q796j2054j5164j8159k0960
60868A109654k3137k4252k4508k4676k5224k5785k5660k4514k2555k0337j8552
$$ plain form
60951 1503707 1432786 1371606 1319520 1275422 1238731 1208109 1180081 1150626 1118097 1083729 1049644
60940 1049644 1017200 986875 958658 932388 908127 886212 866633 848625 831144 813613 796057
60929 796057 778879 762708 748057 734913 722893 711835 701815 692665 684121 676507 670549 666253
60917 666253 662639 658896 655208 652209 650246 649526 650320 652596 655897 659983 665145 671601 679075 687341 696671
60902 696671 707388 719435 732747 747590 764096 781923 800701 820410 840971 861944 883126
60891 883126 905004 928116 952315 977152 1002584 1028696 1054889 1079969 1103023 1123799 1142317
60880 1142317 1158480 1172013 1182449 1189167 1191717 1190136 1184787 1175991 1163937 1148773 1130614 1109654
60868 1109654 1086517 1062265 1037757 1013081 987857 962072 936412 911898 889343 869006 850454
60857H50454j7641j7415j7295j7085j7161j7713j8145j7662j6292j4826j3725
60846F65494j2692j1446j0446j0251j0553j0530j0086r966j0515j1175j1520j1941
60834E34373j2598j2603j1251r441q624q670q100o320m310k890j716m30N00P47
60820D48667Q60J129Q03o35k187k387j199J08O54O51O18P31R48J135J120R34Q68
60803D52818R96R48M83o0k39q2J58M02N15J37p87j673j967j823j706j764j936
60786D44420k267k673k797k510k196k178k378k784l602m537m725l972l353l821
60772D00627m907n466n130m233k989j681j013j266j518p74N26J184J017Q34R16
60757C76127P93M87O28J218J411R05M63O91J199J482J828K736M019N084N705O004
$$ plain form
60857 850454 832813 815398 798103 781018 763857 746144 727999 710337 694045 679219 665494
60846 665494 652802 641356 630910 620659 610106 599576 589490 579524 569009 557834 546314 534373
60834 534373 521775 509172 497921 488480 479856 471186 463086 456766 452456 449566 447850 447420 447920 448667
60820 448667 449527 450656 451459 450824 448637 446250 445051 445159 445813 446464 447082 447813 448761 449896 451016 451950 452818
60803 452818 453814 454762 455245 455185 454946 454864 455022 455424 455939 456076 455289 453616 451649 449826 448120 446356 444420
60786 444420 442153 439480 436683 434173 431977 429799 427421 424637 421035 416498 411773 407801 404448 400627
60772 400627 395720 390254 385124 380891 377902 376221 375208 373942 372424 371650 372176 373360 374377 375211 376127
60757 376127 376920 377407 378035 379253 380664 381569 382032 382723 383922 385404 387232 389968 393987 399071 404776 410780
60741D10780N913N150L694J981M68q00k145l719n111n685n311m530l955l842m256
60726C88632n130n982o129n516m849m598m415l899l261k767k175j392j088j853
60712C35578l177m011m006l467k554j346l28J8k9J10L72L32J39K91O70O43P4n32
60694C18777q34q72n51L62J665K786L338L257K522J392O13P95J726K796L753M531
60678C46056M857M760M914N693O381O236N727N672N760N192M300M073M327L965
60664D17913K920K233K105J504O0j230j737k124k914l429k992k070j454j178j005
60649D06602j046j195q00L43J419J692J428J042J53j615l569m641m785m813n111
60634C85104n232m696l627k621k211k332k272j476m22q1n32q36n22k56o68j332
$$ plain form
60741 410780 416693 421843 425537 427518 427986 427186 425041 421322 416211 410526 405215 400685 396730 392888 388632
60726 388632 383502 377520 371391 365875 361026 356428 352013 348114 344853 342086 339911 338519 337431 335578
60712 335578 332401 328390 324384 320917 318363 317017 316689 316707 316678 316788 317160 317492 317631 317922 318592 319235 319309 318777
60694 318777 317943 317071 316520 316882 318547 321333 324671 327928 330450 331842 332455 333250 334976 337772 341525 346056
60678 346056 350913 355673 360587 366280 372661 378897 384624 390296 396056 401248 405548 409621 413948 417913
60664 417913 420833 423066 425171 426675 426735 425505 423768 421644 418730 415301 412309 410239 408785 407607 406602
60649 406602 405556 404361 403561 403904 405323 407015 408443 409485 409638 408023 404454 399813 395028 390215 385104
60634 385104 379872 375176 371549 368928 366717 364385 362113 360637 360215 360134 359602 358766 358244 357988 357320 355988
60618C55988j533j265q57k53O05J228J126N22n4n09r49j118p44r8L34N40P99J114
60600C54876J290J278J051M99j39j78O43J570J797J563J680K215K444J946J084
60585C73619L56j11l79m85m79k65M29J548K273J762L62n07O1J476K572L112L896
60568C89240N532P619R253J0064J0432J0869J1419J1722J1415J0333Q523O179
60556E02600L536P62j935m164n573o239o460o172n037l319j891j068j6K002M390
60541D71416O033O906P978R782J2019J4450J7136J9765K1575K2152K1600J9881
60529F50693J6703J2115O650Q82m467q303r993j0322j0568j0756r953q356p554
60516F06771q336r505r496q027n622k735j33J067P38L01R79K312L264M021N543
$$ plain form
60618 355988 354455 353190 352333 352080 352685 353913 355039 355561 355507 354998 354049 352931 352187 352089 352423 352963 353762 354876
60600 354876 356166 357444 358495 358994 358855 358677 359320 360890 362687 364250 365930 368145 370589 372535 373619
60585 373619 373975 373864 373485 373000 372521 372256 372685 374233 376506 378268 378630 378123 378184 379660 382232 385344 389240
60568 389240 394772 402391 411644 421708 432140 443009 454428 466150 477565 487898 496421 502600
60556 502600 506136 506898 504963 500799 495226 488987 482527 476355 471318 467999 466108 465040 465024 467026 471416
60541 471416 477449 484355 492333 502115 514134 528584 545720 565485 587060 609212 630812 650693
60529 650693 667396 679511 686161 687043 682576 674273 664280 653958 643390 632634 622681 614325 606771
60516 606771 598435 588930 579434 571407 565785 563050 562917 563984 564722 565023 566002 568314 571578 575599 581142
60501E81142Q067J1111J4531J8493K2744K6900L1182L5948M0782M4926M8364N1454
60489I35644N3677N3756N1065M6120L9634L1907K3092J3361K580r435k2107l4004
60477A185290m3823n1151n6231n9237o0004n8293n4285m8875m3218l7915l2869
60466F39389k8051k3959k0943j8577j6167j3716j1863j0981j0711j0303r259p741
60454D57118o483o028o009n589m648l903l739l575k818j744r54o28p43j339j956
60439D06962j585l4J316J065l07j135q14l50o57j396j684j273o52l89n59p37o15
60422C97156n49j046j649j199L94J593J249L20M26J398J641N99n84q76m90J7N92
60405C98992J232J633J744J918K169K014J358Q52R77J438J776K005K281K482K517
$$ plain form
60501 581142 589209 600320 614851 633344 656088 682988 714170 750118 790900 835826 884190 935644
60489 935644 989321 1043077 1094142 1140262 1179896 1211803 1234895 1248256 1250836 1241401 1219294 1185290
60477 1185290 1141467 1090316 1034085 974848 914844 856551 802266 753391 710173 672258 639389
60466 639389 611338 587379 566436 547859 531692 517976 506113 495132 484421 474118 464859 457118
60454 457118 450635 444607 438598 433009 428361 424458 420719 417144 414326 412582 411628 411000 410257 408918 406962
60439 406962 405377 405343 406659 407724 407417 406282 405468 405118 404461 403065 401381 400108 399456 399067 398508 397771 397156
60422 397156 396607 395561 393912 392713 393107 394700 395949 396269 396695 398093 399734 400333 399749 398873 398383 398400 398992
60405 398992 400224 401857 403601 405519 407688 409702 411060 411912 412889 414327 416103 418108 420389 422871 425388
60390D25388K596K852L058L030K931K980L114L189L179L079K911K841K950K865
60376D66963K155J116O45J146K078K720K876K673K238J810J679J719J448P96L03
60361D92365L05L62k1n68o17rP85J268J248Q41M70P31J814L278M640N914P230
60344E20036Q197Q199P245N961M721L306J517m22k271m105n828o795o487n383
60330E27891m498m160l800l098k612k878l472l602l251l034l139l181l080l259
60316D80827l790m075l730l127k643j881k45K068M214N714O845Q114R699J1522
60302E09512J3628J6362K0025K4103K7031K7237K4525J9913J4057O585k604j2082
60290F88292j9688k4244k5911k5217k2496j8280j3614r675p083n556m273k861
$$ plain form
60390 425388 427984 430836 433894 436924 439855 442835 445949 449138 452317 455396 458307 461148 464098 466963
60376 466963 469118 470234 470879 472025 474103 476823 479699 482372 484610 486420 488099 489818 491266 492062 492365
60361 492365 492670 493032 493011 492443 491826 491817 492602 493870 495118 495959 496429 497160 498974 502252 506892 512806 520036
60344 520036 528233 536432 543677 549638 554359 557665 559182 558760 556489 552384 546556 539761 533274 527891
60330 527891 523393 519233 515433 512335 509723 506845 503373 499771 496520 493486 490347 487166 484086 480827
60316 480827 477037 472962 469232 466105 463462 461581 461336 463404 467618 473332 480177 488291 497990 509512
60302 509512 523140 539502 559527 583630 610661 637898 662423 682336 696393 702978 700374 688292
60290 688292 668604 644360 618449 593232 570736 552456 538842 529167 522084 516528 512255 509394
60278E09394j965k382l650m313l825l267l690m623n018m909n021n278m889l764
60264D52800k719k251k027j689j355j168j019q22n45J1Q84J510J233K45o03q47
60248D41638o08M4J079J902J739P65L4ljm71q99o53j37k81j276k313k437j321
60230D36801N88K333L089K846K368K386K951L634M074M228M252M316M394M316
60216D82576M044L836L952M377N077O240P836R273R894R760R423R105Q680Q286
60202E82359Q277Q543Q488P845O986O283N646M848L864K823J942J518J555J431
60188F52408M33j327k995l930m237m317m442m791n414o045o334o265o084n858
60174E90802n505n098m717m141l215k253j578j008m24m07j391k486k437j539j348
$$ plain form
60278 509394 507429 505047 501397 497084 493259 489992 486302 481679 476661 471752 466731 461453 456564 452800
60264 452800 450081 447830 445803 444114 442759 441591 440572 439750 439205 439216 440100 441610 442843 443088 442485 441638
60248 441638 441030 441074 442153 444055 445794 446559 446593 446590 446589 446118 445219 444566 444429 444148 442872 440559 438122 436801
60230 436801 437389 439722 442811 445657 448025 450411 453362 456996 461070 465298 469550 473866 478260 482576
60216 482576 486620 490456 494408 498785 503862 510102 517938 527211 537105 546865 556288 565393 574073 582359
60202 582359 590636 599179 607667 615512 622498 628781 634427 639275 643139 645962 647904 649422 650977 652408
60188 652408 652841 651514 648519 644589 640352 636035 631593 626802 621388 615343 609009 602744 596660 590802
60174 590802 585297 580199 575482 571341 568126 565873 564295 563287 562863 562456 561065 558579 556142 554603 553255
60159E53255k293k981k329j077m46m03j52M99J177J703J992J751J091Q78J601
60144E54266K365J960O11k43J98J333K283K903L489M143M762N313N829O322O777
60129F02311P066O914O101M746L188J647J82j038j630j264m5J435K534L133L701
60114F38981M554N263N075L974K882K674L214L577L001J482m20k143l525m607
60100F63982n275n376n190n377o094o631o352n568m965m532l785k765k004j587
60086E98481j095n03k69m30l95J49P80J005P79K30n17j182j611k248l597n219
60070E84358o079o023n919o190o259n778n335n365n366m945m672n095n601n190
60056E06541l893k603j910j770j940k022j552n60K43M21M61R56J786K640L749
$$ plain form
60159 553255 550962 547981 545652 544575 544129 543726 543574 544073 545250 546953 548945 550696 551787 552665 554266
60144 554266 556631 558591 559202 558959 559157 560490 562773 565676 569165 573308 578070 583383 589212 595534 602311
60129 602311 609377 616291 622392 627138 630326 631973 632155 631117 629487 628223 628178 629613 632147 635280 638981
60114 638981 643535 648798 653873 657847 660729 663403 666617 670194 673195 674677 674257 672114 668589 663982
60100 663982 658707 653331 648141 642764 636670 630039 623687 618119 613154 608622 604837 602072 600068 598481
60086 598481 597386 596883 596614 596184 595789 595938 596718 597723 598502 598732 598215 597033 595422 593174 589577 584358
60070 584358 578279 572256 566337 560147 553888 548110 542775 537410 532044 527099 522427 517332 511731 506541
60056 506541 502648 500045 498135 496365 494425 492403 490851 490291 490534 490955 491416 492372 494158 496798 500547
60041E00547N301O731P442P711Q006P888O717N072M216M260L977K599P25q47k172
60026E68173l580m810n371n359n408n996p038q010q342p888p082o472o138n777
60012D80902n237m588l783k706j614j132j594k613l410l418k657j673j096j052
59998D44329j096q79o36o93p28q4J201K291K645K717L230M079M478M065L448L412
59982D71779L968M423M273L600K584J156n87k014k483k126j690j743k323l217
59968D75600m046m232l522k524k149k394k276j144N62K046L016L538L664L545
59954D69684L418L153K377J331R65J746K932L514L340K828K221J770K084L409
59940E04772M844N074L804J869J14j166j871j927j622j488j681j879j810j529
$$ plain form
60041 500547 505848 512579 520021 527732 535738 543626 550343 555415 559631 563891 567868 570467 571192 570345 568173
60026 568173 564593 559783 554412 549053 543645 537649 530611 522601 514259 506371 499289 492817 486679 480902
60012 480902 475665 471077 467294 464588 462974 461842 460248 457635 454225 450807 448150 446477 445381 444329
59998 444329 443233 442354 441718 441025 440297 440213 441414 443705 446350 449067 452297 456376 460854 464919 468367 471779
59982 471779 475747 480170 484443 488043 490627 491783 491196 489182 486699 484573 482883 481140 478817 475600
59968 475600 471554 467322 463800 461276 459127 456733 454457 453313 453875 455921 458937 462475 466139 469684
59954 469684 473102 476255 478632 479963 480928 482674 485606 489120 492460 495288 497509 499279 501363 504772
59940 504772 509616 514690 518494 520363 520477 519311 517440 515513 513891 512403 510722 508843 507033 505504
59926E05504j137n86R7P15J068J123J071J255J899K732L174L129L226M056N440
59911E32766O835Q039R024R333Q324N987L071L91j635k865l342l423l541l725
59897E65239l575k830j768r14m78k28J31N86R38J324K295M075O000P059O964O248
59881E91066N368M349L313K744K903L459L923M082L831L072J940O66q84k981n244
59866F21607o804p437p781q117p859o723n520n030m819m030k759j804j410j106
59852E50408n08M51J821L546N254O729Q273J0070J1654J2557J2952J2812J1129
59839F47148P092J874j970l055k200q51N26K102L580M059K817p2l717o915q875
59824F41543r617r650r389r007q533p863o892n870n284n124m656l382j797p16
$$ plain form
59926 505504 504367 503781 503878 504593 505661 506784 507855 509110 511009 513741 516915 520044 523270 527326 532766
59911 532766 539601 547640 556664 565997 574321 580308 583379 583770 582135 579270 575928 572505 568964 565239
59897 565239 561664 558834 557066 556152 555674 555446 555577 556163 557101 558425 560720 564795 570795 577854 584818 591066
59881 591066 596434 600783 604096 606840 609743 613202 617125 621207 625038 628110 630050 630716 629832 626851 621607
59866 621607 614803 607366 599585 591468 583609 576886 571366 566336 561517 557487 554728 552924 551514 550408
59852 550408 549900 550351 552172 555718 560972 567701 575974 586044 597698 610255 623207 636019 647148
59839 647148 654240 656114 654144 651089 648889 648038 648564 650666 654246 658305 661122 661050 657333 650418 641543
59824 641543 631926 622276 612887 603880 595347 587484 580592 574722 569438 564314 559658 556276 554479 553763
59810E53763j81L79J072J312O40o76j896k428k293k104k405k953l049k630k446
59795E34105k884l326l045k140j098p0Q44J270J061N85Jj028k322k785j902q43
59779E16423r56j877k231j741j325j451j683j687j537j161n04r3l93p33k0J512
59763E00543K452K159J474J328J673K051K332K553K758L206M078M999N452N587
59749E42645N930O374O377N994N861O083O013N268M175L149K356J969K043K193
59735F06430K068J966K221K361J838J180J303J930K036J609J512J715J330N37
59721F30036P06K107L182K830J870J386J086L91j22K93J039R61N2q07j291j685
59705F42034j871j297P2J633K862L639L965M023M335N321O724P989R069J0427
$$ plain form
59810 553763 553582 553961 555033 556345 556985 556309 554413 551985 549692 547588 545183 542230 539181 536551 534105
59795 534105 531221 527895 524850 522710 521612 521542 522386 523656 524717 525302 525303 524275 521953 519168 517266 516423
59779 516423 515467 513590 511359 509618 508293 506842 505159 503472 501935 500774 500270 500177 499784 499051 499031 500543
59763 500543 502995 505154 506628 507956 509629 511680 514012 516565 519323 522529 526607 531606 537058 542645
59749 542645 548575 554949 561326 567320 573181 579264 585277 590545 594720 597869 600225 602194 604237 606430
59735 606430 608498 610464 612685 615046 616884 618064 619367 621297 623333 624942 626454 628169 629499 630036
59721 630036 630742 632849 636031 638861 640731 642117 643203 643594 643472 643765 644804 645765 645817 645010 643719 642034
59705 642034 640163 638866 638938 640571 643433 647072 651037 655060 659395 664716 671440 679429 688498 698925
59691F98925J2111J3193J2331Q963M016o36l619m907n250n102m572l995l852m183
59677G13423m663n118n462n432n096n294o669q497r493r585r698r898r181p332
59663F12005n481m328l172j478o7J87j52N5R40J902K859M155N575O415O374N741
59647F31530M860L901K922J769K11j587l138m382n813p493q624q597p903p363
59633E90293o943n979m247k278p55L8L44O92J235J341L01j541l099m020n032o467
59617E53883p487p367o683o454o674o543n729m657l722k868j803l29J443K925
59603D97935L466L074K358J652P53l47j065j009n09j9N01J233J992K470K624K576
59587E17685K516K723L128K882J177j345k942k868k207k266l032l782m293m741
$$ plain form
59691 698925 711036 724229 736560 745523 749539 748903 745284 740377 735127 730025 725453 721458 717606 713423
59677 713423 708760 703642 698180 692748 687652 682358 675689 667192 657699 648114 638416 628518 619337 612005
59663 612005 606524 602196 599024 597546 597479 597666 597514 597569 598509 600411 603270 607425 613000 619415 625789 631530
59647 631530 636390 640291 643213 644982 645193 643606 640468 636086 630273 622780 614156 605559 597656 590293
59633 590293 583350 577371 573124 570846 570091 570129 570473 571165 572400 573741 574042 572501 569402 565382 560350 553883
59617 553883 546396 539029 532346 525892 519218 512675 506946 502289 498567 495699 493896 493567 495010 497935
59603 497935 501401 504475 506833 508485 509238 508891 507826 506817 506308 506289 506790 508023 510015 512485 515109 517685
59587 517685 520201 522924 526052 528934 530111 528766 525824 522956 520749 518483 515451 511669 507376 502635
59573E02635n068n137n028m671l762k443j443j158j150r41o04k52K53P11N33k55
59557D72220q20p35m76l39P1P66J009P30J050K488L827L893L373L628M603N294
59541E00582N533N982O825P873R522J2423J6351K0273K2984K2902J8154Q617k445
59528F55576j0316j2743j1136q205n520l324j420K86J603K249K433K799L325K928
59514F18535Q86j950m200n596o683p480p706p808q495r428r565q721p634o671
59500E27484n602m552l965l551k431m73J436K670L421L896L841L151K228J487
59486E29040J098J255K071L157L976M577N447O693Q039R479J1238J3159J4857
59473F14086J6330J7684J8283J7012J3450Q233K400l037p087r179r611r036p659
$$ plain form
59573 502635 497567 492430 487402 482731 478969 476526 475083 473925 472775 471834 471230 470978 471231 471942 472475 472220
59557 472220 471400 470665 470189 469850 469921 470687 471696 472426 473476 475964 479791 483684 487057 490685 495288 500582
59541 500582 506115 512097 518922 526795 536317 548740 565091 585364 608348 631250 649404 658021 655576
59528 655576 645260 632517 621381 613176 607656 604332 602912 603198 604801 607050 609483 612282 615607 618535
59514 618535 619421 617471 613271 607675 600992 593512 585806 577998 569503 560075 550510 541789 534155 527484
59500 527484 521882 517330 513365 509814 507383 506910 508346 511016 514437 518333 522174 525325 527553 529040
59486 529040 530138 531393 533464 536621 540597 545174 550621 557314 565353 574832 586070 599229 614086
59473 614086 630416 648100 666383 683395 696845 705078 707478 704441 697354 688175 678564 669528 661869
59460F61869n493l009p00J682M611P673R969J1426J2727J4039J4864J5248J6024
59447G60930J7625J9449K0661K0851J9654J6498J1056L679m699j2663j8557k1324
59435H33160k1178j9082j5864j2429j0214j0332j2311j4578j6110j6777j6325
59424F67960j4213j0660o788l445n46K285N181Q262J1722J5482J9248K2814K5995
59411G43297K8780L2023L6831M1763M1546L0999J0942j1329k7913l5512l5116
59400H56311k9077j9785r400J155J2071K2020K6362K0190L674j6742l2963m0737
59388G93079m0911l6789l1232k5725k0819j6590j2765r088n815l580k489j752
59376E85524m99J257K811L612L593K956K181J915K343K883L028L140L843M955
$$ plain form
59460 661869 656376 653367 652667 654349 658960 666633 676602 688028 700755 714794 729658 744906 760930
59447 760930 778555 798004 818665 839516 859170 875668 886724 890403 885704 873041 854484 833160
59435 833160 811982 792900 777036 764607 754393 744061 731750 717172 701062 684285 667960
59424 667960 653747 643087 636299 632854 632308 634593 639774 648036 659758 675240 694488 717302 743297
59411 743297 772077 804100 840931 882694 924240 955239 966181 954852 926939 891427 856311
59400 856311 827234 807449 798049 799204 811275 833295 859657 879847 883521 866779 833816 793079
59388 793079 752168 715379 684147 658422 637603 621013 608248 599160 593345 589765 587276 585524
59376 585524 585025 586282 589093 592705 596298 599254 601435 603350 605693 608576 611604 614744 618587 623542
59362F23542N733N951O018O247O698P578Q945J0211J0745J0907J1602J2928J4114
59349G41219J4867J5745J7063J8259J8759J8784J8947J9473K0013J9917J8621
59338I41667J6154J3132R979O379J992k735p071j0923j4471j7209j8449j8508
59326H99937j8491j8873j9217j9186j8822j7888j5975j3469j1457j0438r831q933
59314G17357p699o497n709n561n751n401m057k475j642j343o21O93K045L418N292
59299F82049P411Q920R823J1133J3436J6300J8925K0073J7610R970j369j2264
59287H02017j9441k2632k3116k1770j9177j6240j3540j0892q161n745l756j653
59275F35894P47K849M429O241Q795J1382J3040J3745J4029J4034J3577J2585J1034
$$ plain form
59362 623542 629275 635226 641244 647491 654189 661767 670712 680923 691668 702575 714177 727105 741219
59349 741219 756086 771831 788894 807153 825912 844696 863643 883116 903129 923046 941667
59338 941667 957821 970953 980932 987311 989303 986568 979497 968574 954103 936894 918445 899937
59326 899937 881446 862573 843356 824170 805348 787460 771485 758016 746559 736121 726290 717357
59314 717357 709658 703161 697452 691891 686140 680739 676682 674207 672565 671222 670601 671294 673339 676757 682049
59299 682049 689460 698380 708203 719336 732772 749072 767997 788070 805680 815650 814281 802017
59287 802017 782576 759944 736828 715058 695881 679641 666101 655209 647048 641303 637547 635894
59275 635894 636641 639490 643919 650160 658955 670337 683377 697122 711151 725185 738762 751347 762381
59262G62381Q902O407L804Q68k666o115q331r308j0271j1876j3394j3958j3583
59249F92860j2592j1086r425q185p238n878m164k979k420j464K13J553J885K023
59235F33103K714L362L328L255L870M496M063K832J854J315O22l51j258k208l660
59220F57337n506p018p579p006n489l614k086j027k3R40J299J031J071K067L436
59205F27833M235M237L683K690J523P68O90R30J163J334J125J79q26n79Q76J789
59189F51650J034l67q69m14Q2K06P3k57m45J23J197J460L48q95r57j81L68N94
59171F52750R30J244J431K216M048O004P118Q042R939J2337J3563J2949J1271
59158G43842R285P147N009L112J325m97k054l250m730o836q616r031q510q197
$$ plain form
59262 762381 771283 777690 781494 782362 779696 773581 765250 755942 745671 733795 720401 706443 692860
59249 692860 680268 669182 659757 651572 644334 638456 634292 631313 628893 627429 627642 629195 631080 633103
59235 633103 635817 639179 642507 645762 649632 654128 658191 661023 662877 664192 664814 664463 663205 660997 657337
59220 657337 651831 644813 637234 630228 624739 621125 619039 618012 617989 618929 620228 621259 622330 624397 627833
59205 627833 632068 636305 639988 642678 644201 644969 645659 646589 647752 649086 650211 650390 649564 648985 649861 651650
59189 651650 652684 652317 651448 651034 651116 651322 651395 651138 650693 650816 652013 653473 653821 652926 651969 651788 652156 652750
59171 652750 653680 654924 656355 658571 662619 668623 675741 683783 693722 706059 719622 732571 743842
59158 743842 753127 760274 765283 768395 769720 769223 767169 763919 759189 752353 743737 734706 726196 717999
59144G17999q190p888p574q134r386j0120r817r176q831q624q316q009p726p242
59130E98966o507n650m710l795l185k732j649L97K511L682M154M840N887O805
59116E99014P536Q379R152R441R414R508R620R410R090Q955Q568P400N856M728
59102G16071L981L045J973J234O98j27j145j991k892m126n035m762l689k933k650
59087F97652k117j326j098j612k097k199k489l384m595n799o995p947q192p781
59073F40021p281o941o579o246o183o128n505m419l620l433l446l315l151k990
59059E70784k674k275k061j934j590j212j348k001k450k098j038K28J246J774
59045E53351J835J609J078J11j040j817k144k501k951k879k175j667j747j551
$$ plain form
59144 717999 709809 701921 694347 686213 676827 666707 656890 647714 638883 630259 621943 613934 606208 598966
59130 598966 592459 586809 582099 578304 575119 572387 570738 571135 573646 577328 581482 586322 592209 599014
59116 599014 606550 614929 624081 633522 642936 652444 662064 671474 680564 689519 698087 705487 711343 716071
59102 716071 720052 723097 725070 726304 727002 726875 725730 723739 720847 716721 711686 706924 703235 700302 697652
59087 697652 695535 694209 693111 691499 689402 687203 684714 681330 676735 670936 663941 655994 647802 640021
59073 640021 632740 625799 619220 612974 606791 600663 595158 590739 587119 583686 580240 576925 573774 570784
59059 570784 568110 565835 563774 561840 560250 559038 557690 555689 553239 551141 550103 550331 551577 553351
59045 553351 555186 556795 557873 557984 556944 555127 552983 550482 547531 544652 542477 540810 539063 537512
59031E37512m03R07J333J231J610K545L590N051P405R935J1437J1965J2485J3133
59017F19736J3183J2500J1637J0546Q666O277M539L962L811L108J429j154l953
59004F94287n748n876n007l974k377M73L790N934O557O671O772O314N103L772
58990G16691K767J936J290J001O67l36j727k611k841l030l300l127k356j263K64
58975G04025K445M661O036O877Q290J0496J2724J4649J6571J8209J8686J7900
58963H41569J6724J5749J4871J4049J3249J1781Q903N069J415j785m928p815j0089
58950I18762j2530j6102j9865k1739k1420k0586k0087j8981j6771j4510j2969
58939G23202j1483r513p690o453n125l353k033j863k138j907j365j239j652k285
$$ plain form
59031 537512 537109 538016 539349 540580 542190 544735 548325 553376 560781 570716 582153 594118 606603 619736
59017 619736 632919 645419 657056 667602 676268 682545 687084 691046 694857 697965 699394 698240 694287
59004 694287 688539 682663 677656 673682 671305 671778 675568 681502 688059 694730 701502 707816 712919 716691
58990 716691 719458 721394 722684 723685 724352 724016 722289 719678 716837 713807 710507 707380 705024 703761 704025
58975 704025 706470 711131 717167 724044 732334 742830 755554 770203 786774 804983 823669 841569
58963 841569 858293 874042 888913 902962 916211 927992 936895 941964 943379 941594 936666 928851 918762
58950 918762 906232 890130 870265 848526 827106 806520 786433 767452 750681 736171 723202
58939 723202 711719 702206 694516 688063 682938 679585 677552 675689 673551 671644 670279 669040 667388 665103
58925F65103k833k853k019q87m58o97n65K51Q86R26J043J544J675J049N15Q14
58909F63494J533K091K710L637M491N113O164Q129J0578J2947J5189J7183J8392
58896G71651J8624J8227J7227J5271J2811J1189J1072J1811J2779J4219J6310
58885I31191J8540K0446K1847K2028K0007J6199J2404R526O659L082l34k756n058
58872A073781q534j2927j6842j9446k0725k0729j9538j7549j5131j2451j0000
58861H99909q584q338q512q618q939r525r767r493r462j0141j0954j1339j1532
58848G74705j1692j1300j0186r221r138r444r294q701q201p939p773p691p555
58835F56570p065o345n964o104o303o256o021n414m115k546j490p44O12K434L422
$$ plain form
58925 665103 662270 659417 657398 656511 656053 655356 654791 655042 655928 656854 657897 659441 661116 662165 662680 663494
58909 663494 665027 667118 669828 673465 677956 683069 689233 697362 707940 720887 736076 753259 771651
58896 771651 790275 808502 825729 841000 853811 865000 876072 887883 900662 914881 931191
58885 931191 949731 970177 992024 1014052 1034059 1050258 1062662 1072188 1078847 1081929 1081595 1078839 1073781
58872 1073781 1065247 1052320 1035478 1016032 995307 974578 955040 937491 922360 909909 899909
58861 899909 891325 882987 874475 865857 856918 847393 837626 828133 818671 808530 797576 786237 774705
58848 774705 763013 751713 741527 732306 723168 713724 704430 695729 687528 679589 671816 664125 656570
58835 656570 649505 643160 637196 631092 624789 618533 612512 607098 602983 600437 598947 598203 598815 601249 604671
58820F04671L221L117M032N175N517N355N551O218O892P187O668N077L121K091
58806F73893K189K222J334j8j160k085k886l499m340n984p831q503p866p244p332
58791F20890p458p218p008o588m993k562j009p04J09K381M616N343N238N368N307
58776F11712M604M393N626P062O764M572J586j623m807p181q256q660q954q705
58762E98133p784p172p279o953n493m145m006m014k830j223o57p37j57Q26J022
58747E47531O28Q66J861K798L698N192O893P712P594P427P507P391O985O543N957
58732F26583N184M816N149N317M569L629L598M124M019L053J885Q43l2l19J91
58717F72609Q58J247K042L815N721O701P090P665P998P219N675M241K619j18l674
$$ plain form
58820 604671 607892 611009 615041 620216 625733 631088 636639 642857 649749 656936 663604 668681 671802 673893
58806 673893 676082 678304 679638 679620 678460 676375 673489 669990 665650 659666 651835 643332 635466 628222 620890
58791 620890 613432 606214 599206 592618 587625 585063 584054 583350 583459 585840 590456 595799 601037 606405 611712
58776 611712 616316 620709 626335 633397 640161 644733 646319 644696 639889 632708 624452 615792 606838 598133
58762 598133 590349 583177 575898 568945 563452 559307 555301 551287 548457 547234 546577 545840 545683 546509 547531
58747 547531 548159 549025 550886 553684 557382 562574 569467 577179 584773 592200 599707 607098 614083 620626 626583
58732 626583 631767 636583 641732 647049 651618 655247 658845 662969 666988 670041 671926 672769 672737 672418 672609
58717 672609 673467 674714 676756 680571 686292 692993 700083 707748 715746 722965 728640 732881 735500 735382 731708
58702G31708o725q695j0175j1822j3835j6077j7853j8196j7184j6151j5806j5193
58690E63996j3467j1423j0049q754o602m263l108l196l588l930m304m315l746
58677D83251l289l334k950j506k65o60j877j893k38J980M129O391Q532J0003J1034
58662E09308J2296J3658J4360J3952J2161Q579L499j648n674q637j0708j1298
58650E49848j0364r202q746q243o887n343m427l738k981k948l687l423j187J177
58636D79849J630Q91P05Q67L56j00P36K077K372K025K326K737J936N82L81J101
58620E00471J150M43J49K71Op6J211L304M708N580P023Q443Q254O707N465M759
58604E57868L531J953J190R68L7j274j480p36o61j580k325k626l260m000l789
$$ plain form
58702 731708 724983 716288 706113 694291 680456 664379 646526 628330 611146 594995 579189 563996
58690 563996 550529 539106 529057 520303 513701 509438 506330 503134 499546 495616 491312 486997 483251
58677 483251 479962 476628 473678 472172 471907 471247 469370 467477 467239 469219 473348 479739 488271 498274 509308
58662 509308 521604 535262 549622 563574 575735 584314 587813 586165 580491 571854 561146 549848
58650 549848 539484 530282 521536 513293 506406 501063 496636 492898 489917 486969 483282 479859 478672 479849
58636 479849 481479 482370 483075 483942 484298 484198 484934 487011 489383 491408 493734 496471 498407 498989 499370 500471
58620 500471 501621 502064 502213 502484 502490 502414 503625 506929 511637 517217 524240 532683 540937 547644 553109 557868
58604 557868 561399 563352 564542 565510 565547 564273 562793 562057 561396 559816 557491 554865 551605 547605 543816
58589E43816k750j736k66K720O372Q684R481J0205J1136J1307J0943J1279J2079
58576F33270J1871J0489R101P911O294M903N107O567P803Q796J0566J2738J4193
58563G49609J5657J8708K2688K5518K7158K9166L1142L0953K8343K4972K0928
58552A024842J4663O678j38m337p036q905r201q197p400o873n435l895m842q606
58538I71318j2651j5620j8815k2879k6225k7758k8128k7479k4877k0876j7694
58527G28316j5893j3761j0738q493p676o572m182j816n23L93J299J314M61J03
58513F62232L85j33j582k253j714j658k743l469l109k915l400l230j842m85K42
58498F34326J170K094J465n87j844j518j243j682j313M58K066K825M071O170P515
$$ plain form
58589 543816 541066 539330 539064 541784 548156 556840 566321 576526 587662 598969 609912 621191 633270
58576 633270 645141 655630 664731 672642 678936 683839 688946 695513 703316 712112 722678 735416 749609
58563 749609 765266 783974 806662 832180 859338 888504 919646 950599 978942 1003914 1024842
58552 1024842 1039505 1046183 1046045 1041708 1034672 1025767 1016566 1008369 1000969 994096 988661 984766 979924 971318
58538 971318 958667 943047 924232 901353 875128 847370 819242 791763 766886 746010 728316
58527 728316 712423 698662 687924 679431 671755 665183 661001 659185 658662 659055 660354 661668 662129 662232
58513 662232 662617 662484 660902 658649 656935 655277 652534 649065 645956 643041 639641 636411 634569 634084 634326
58498 634326 635496 637590 639055 638468 636624 635106 633863 632181 630868 631326 633392 636217 640288 646458 653973
58483F53973P694Q519J0641J2341J2978J4399J7415K0089K1080K1562K2146K1033
58471H43870J7088J1883O900J511m590r702j2629j4291j5302j4647j2200r789
58459G88102q180n778j837J883M155O186Q957J1423J2862J4137J5155J4022J0258
58446H71345N961K355j831p124j1590j3973j5462j6764j6518j4281j1924j0423
58434G59771q338n094k520j554n45J440L045L797N425Q358J0478J1022J1957J3788
58420H11030J3921J1215Q127O211L519j089n167o812p686r268j0020r098q853
58407G96030j0643j1941j0723r004q832q520o249l831l284k999r13J565K243J961
58393G24860K455L236L524M332N787N568K884P11J189K218J592Q21J670K551J863
$$ plain form
58483 653973 661667 670186 680827 693168 706146 720545 737960 758049 779129 800691 822837 843870
58471 843870 860958 872841 879741 881252 876662 866960 854331 840040 824738 810091 797891 788102
58459 788102 779922 774144 772307 774190 778345 784531 793488 804911 817773 831910 847065 861087 871345
58446 871345 877306 879661 877830 870706 859116 845143 829681 812917 796399 782118 770194 759771
58434 759771 751433 746339 743819 742265 741720 743160 746205 750002 755427 763785 774263 785285 797242 811030
58420 811030 824951 836166 844293 850504 854023 852934 847767 840955 833269 824001 813981 804883 796030
58407 796030 785387 773446 762723 753719 744887 736367 730118 726287 723003 720004 719091 720656 722899 724860
58393 724860 727315 730551 734075 738407 744194 749762 752646 753357 754546 756764 758356 759177 760847 763398 765261
58378G65261J364K686L965L380K671L677M871M787N300P791R718Q843P397Q150
58364H39861R810J0163J0330J1974J3651J3769J3875J5242J5732J3666J1237J0286
58352I89596Q738M993J726J244J263m30j513J92K055J526J176L809O870P154O724
58337A035123Q577J0645J0009R022J1148J4396J5133J4789J6548J8818J8350J6564
58325A199122J6429J6180J2609P633N149M231J751r73o69J357J528M60J098K780
58311A268685L145L409N883Q785R181Q413R126J0079R394R397J2361J5088J3988
58298A386934J1748J2654J5144J5510J5089J6840J8733J7670J6154J7889K0506
58287A564871J9945J8139J9006K0816K0061J8821K0560K2856K2179K1529K5225
$$ plain form
58378 765261 766625 769311 773276 776656 779327 783004 787875 792662 797962 805753 815471 824314 831711 839861
58364 839861 849671 859834 870164 882138 895789 909558 923433 938675 954407 968073 979310 989596
58352 989596 998334 1003327 1005053 1006297 1007560 1007130 1005617 1005809 1007864 1009390 1010566 1014375 1021245 1028399 1035123
58337 1035123 1043700 1054345 1064354 1073376 1084524 1098920 1114053 1128842 1145390 1164208 1182558 1199122
58325 1199122 1215551 1231731 1244340 1251973 1257122 1261353 1263104 1262131 1261462 1262819 1264347 1264807 1265905 1268685
58311 1268685 1271830 1275239 1281122 1289907 1299088 1307501 1316627 1326706 1336100 1345497 1357858 1372946 1386934
58298 1386934 1398682 1411336 1426480 1441990 1457079 1473919 1492652 1510322 1526476 1544365 1564871
58287 1564871 1584816 1602955 1621961 1642777 1662838 1681659 1702219 1725075 1747254 1768783 1794008
58276A794008L0552L2861L4292L8742M3089M2654M0607M2490M6079M6374M5768
58265B237516M9060N3266N2899N0842N3156N7711N8790N8238O0856O3669O1386
58254B857389N7622N8816O2026O1000N9009O2819O9248P1214P1725P7870Q6317
58243C595055Q9410R0362R7242J07106J11786J14248J22914J34890J41673J46350
58233D751036J57735J72597J81763J88616K02880K21401K34588K46390K67437
58224F624443K93933L14684L33393L61717L96022M24623M52117M91923N40712
58215A0233567N86177O33790O98464P76354Q53902R37815J045348J172893J307882
58206A8246192J463732J666947J918235K205477K545966K973637L495791M110675
$$ plain form
58276 1794008 1824560 1857421 1891713 1930455 1973544 2016198 2056805 2099295 2145374 2191748 2237516
58265 2237516 2286576 2339842 2392741 2443583 2496739 2554450 2613240 2671478 2732334 2796003 2857389
58254 2857389 2915011 2973827 3035853 3096853 3155862 3218681 3287929 3359143 3430868 3508738 3595055
58243 3595055 3684465 3774827 3872069 3979175 4090961 4205209 4328123 4463013 4604686 4751036
58233 4751036 4908771 5081368 5263131 5451747 5654627 5876028 6110616 6357006 6624443
58224 6624443 6918376 7233060 7566453 7928170 8324192 8748815 9200932 9692855 10233567
58215 10233567 10819744 11453534 12151998 12928352 13782254 14720069 15765417 16938310 18246192
58206 18246192 19709924 21376871 23295106 25500583 28046549 31020186 34515977 38626652
58198C8626652M857004N793327O941232Q310583R971264J2037337J4599092J7746755
58190A18883246K1630611K6376754L1905332L7818577M3238218M6447015M4867702
58183C71167455L6214845K0470520Q40843j7648358l0904675l7525078l8513595
58176C04101957l5965411l2022639k8311325k5565015k3576723k1704137j9537448
58169A17419259j7112125j4653371j2333164j0259883q510252p087288n921422
58162D1541754m952704m164531l533234l009397k563957k200512j910176j660311
58154A7546932j436795j254112j114551r96057q87675q00349p35288o75333o14496
58145I032276n64614n26639m84907m35677l93354l62775l31809k96525k68141
$$ plain form
58198 38626652 43483656 49276983 56218215 64528798 74500062 86537399 101136491 118883246
58190 118883246 140513857 166890611 198795943 236614520 279852738 326299753 371167455
58183 371167455 407382300 427852820 428693663 411045305 380140630 342615552 304101957
58176 304101957 268136546 236113907 207802582 182237567 158660844 136956707 117419259
58169 117419259 100307134 85653763 73320599 63060716 54550464 47463176 41541754
58162 41541754 36589050 32424519 28891285 25881888 23317931 21117419 19207243 17546932
58154 17546932 16110137 14856025 13741474 12745417 11857742 11057393 10322105 9646772 9032276
58145 9032276 8467662 7941023 7456116 7020439 6627085 6264310 5932501 5635976 5367835
58136E367835k49627k29807k06267j91067j87950j85398j77577j71709j69704
58127C598729j62547j48240j36602j31099j23555j11318j02377r9116r3775q4294
58117B405806p8437p8042p5019o7067o1943o2139o0354n4158n0426n1181m9505
58106A717535m3665m1088m4036m4997m0801l7933l9351l8986l4061l0401l0657
58095A291559k9189k3458j9144j9313j9364j7094j6987k0349k1781j9669j9632
58084A065579k3532k5389k2441k0003k1033k0982j7503j5444j7439j8921j7111
58073H45781j6011j7849j8460j5688j3822j5135j5448j2566j0803j2610j3737
58062F83652j1343r055r424r085o092m531p022r747r613r434j1401j2219r533
$$ plain form
58136 5367835 5118208 4888401 4682134 4491067 4303117 4117719 3940142 3768433 3598729
58127 3598729 3436182 3287942 3151340 3020241 2896686 2785368 2682991 2583875 2490100 2405806
58117 2405806 2327369 2249327 2174308 2107241 2045298 1983159 1922805 1868647 1818221 1767040 1717535
58106 1717535 1673870 1632782 1588746 1543749 1502948 1465015 1425664 1386678 1352617 1322216 1291559
58095 1291559 1262370 1238912 1219768 1200455 1181091 1163997 1147010 1126661 1104880 1085211 1065579
58084 1065579 1042047 1016658 994217 974214 953181 932199 914696 899252 881813 862892 845781
58073 845781 829770 811921 793461 777773 763951 748816 733368 720802 709999 697389 683652
58062 683652 672309 663254 653830 644745 638653 634122 627100 617353 607740 598306 586905 574686 565153
58049E65153o806p062p772o418n250o207o811n292m269n430o026m414l580n402
58035D84414o864n664m191m424m308k742k633n413p854p910q241j0423j1257q647
58021C93843n751n316n118l006j358k361l709l141k649m107n198l692j676j613
58007C45148k217j847j900l283l566j238J079J049L63R15J291L43J04J807K955
57992C41003J655J9P9K73q17j319J3Q10o43k049j386o44j857l279k974k444l227
57975C23213l628k230r97j480j637J22J483L72j142p36M7p32j438k14J142N93
57959C12738j18J160K716K065L35l05p85k737m687m542l374l004k320J87K683
57944C00012K649J172R29J976K972M358O875Q960R083Q803J0205J2259J2884J2632
$$ plain form
58049 565153 558347 551285 543513 537095 531845 525638 518827 513535 509266 503836 497810 493396 489816 484414
58035 484414 477550 471886 467695 463271 458963 456221 453588 448175 440321 432411 424170 413747 402490 393843
58021 393843 388092 382776 377658 374652 373294 370933 367224 364083 361434 357327 352129 348437 346761 345148
58007 345148 342931 341084 339184 335901 332335 331097 332176 333225 333588 334503 335794 336137 336241 338048 341003
57992 341003 342658 342677 342756 343029 342212 340893 340906 341716 341073 339024 337638 336994 335137 331858 328884 326440 323213
57975 323213 319585 317355 316358 314878 313241 313363 314846 315218 314076 313340 313387 312655 311217 311003 312145 312738
57959 312738 312620 313780 316496 318561 318896 318591 317806 315069 310382 305840 302466 299462 297142 297329 300012
57944 300012 302661 303833 304762 306738 309710 314068 320943 329903 338986 347789 357994 370253 383137 395769
57930C95769J3086J3508J2313J0108Q278O231K931n47k679m012n626o987p609
57917D34764q656j0626j1736j0924r982j0317j0371q760p056o720o159l845j496
57904C28116j095j536j393k075m772p087o418m226l303l224k221j074j318j707
57890B86667l31J683K241K090K991M172M234M388O034P263N788L367L054L923
57876C37564K899K47j197j187j945l717m605m328m378m844m563l846l834l907
57862B98359k860j708k087k918k028m5Q02P33J685L408L916L199K985L351K940
57847C09732K029K044K532J826J70q77j524l065m836n100m329m386n015m461k943
57832B81797k326k748k737k213k166k023n27J292J413N27J100L039L901L080K410
$$ plain form
57930 395769 408855 422363 434676 444784 453062 459293 462224 461677 458998 454986 449360 442373 434764
57917 434764 426108 415482 403746 392822 382840 372523 362152 353392 346336 339616 333457 329612 328116
57904 328116 327021 325485 324092 322017 317245 310158 303740 299514 296211 292987 290766 289692 288374 286667
57890 286667 286336 288019 290260 292350 295341 299513 303747 308135 314169 321432 327220 330587 333641 337564
57876 337564 340463 340710 339513 338326 336381 332664 328059 323731 319353 314509 309946 306100 302266 298359
57862 298359 295499 293791 291704 288786 286758 286713 287515 288248 289933 293341 297257 300456 303441 306792 309732
57847 309732 311761 313805 316337 318163 318333 317456 315932 312867 308031 302931 298602 294216 289201 284740 281797
57832 281797 279471 276723 273986 271773 269607 267584 267057 268349 269762 270289 271389 274428 278329 281409 283819
57817B83819K568K402J798K021K943L067K414K390K741J679q59l072m426n912
57803B93573p197o673m558k925k302j267L95J154P65Q37J767J949O78o84j085
57788B74427r42n65K73Q63P8j414j736p56o6K0Q13K492L693M156N114O596O951
57771B99997N604L909K677J218o09j678j592j418j870k572l335m366n141m971
57757B85853m522m839n227m290k653k103k343j412Q14K391K644K892L601L665
57743B74471K950K734L149K830J630R96J138N45j058j888j079M1M25O64J091R62
57727B89601K50O2M99L69l99l06J050K219K443K661L266L188K088J131Q24K60
57711C09206o88p56K96Q47k6j225j677j664j336j9K142L962N379P768J1318J4292
$$ plain form
57817 283819 286387 288789 290587 292608 295551 298618 301032 303422 306163 307842 306983 303911 299485 293573
57803 293573 286376 279703 275145 272220 269918 268651 269046 270200 270965 271802 273569 275518 276196 275512 274427
57788 274427 273485 272920 273193 274056 274134 272720 270984 270228 270162 270182 270995 273487 277180 281336 286450 293046 299997
57771 299997 305601 309510 312187 313405 312796 311118 309526 308108 306238 303666 300331 295965 290824 285853
57757 285853 281331 276492 271265 266975 264322 262219 259876 258464 259278 261669 264313 267205 270806 274471
57743 274471 277421 280155 283304 286134 287764 288760 289898 290443 289385 287497 286418 286459 286884 287548 288639 289601
57727 289601 289851 289913 290412 290781 290382 290076 291126 293345 295788 298449 301715 304903 306991 308122 308946 309206
57711 309206 308518 307762 308058 308905 308879 307654 305977 304313 302977 302958 305100 309062 314441 322209 333527 347819
57695C47819J5717J6623J7542J6969J3414P216n41q999j6595k1211k2323k1398
57683C44233j9527j6555j2940j0094q092n329j363K206M652P547J2120J7478K2764
57670C37100K8925L6908M6146N6131O7308P8508Q5031Q1142O3928L4634j662l6822
57658H77277o2693p5749p8202p4115o6052n5931m6280l8670l2422k6359k0663
57647C00141j5983j2289r659q591q596q046o416m945m269l391j970j383k192k687
57633B09724j525R3N46K96N50J067J005N89K93l08j423k094j750j369j766k188
57617B01740j897j628k048k257j389k98n2j37K88O47J11o70o63k15k62p10j003
57600A89557j313j843k022j587j378j950k595k798l265m254m492l277k123k575
$$ plain form
57695 347819 363536 380159 397701 414670 428084 435300 434759 425760 409165 387954 365631 344233
57683 344233 324706 308151 295211 285117 277025 271696 270333 272539 277191 284738 296858 314336 337100
57670 337100 366025 402933 449079 505210 572518 651026 736057 817199 881127 915761 914099 877277
57658 877277 814584 738835 660633 586518 520466 464535 418255 379585 347163 320804 300141
57647 300141 284158 271869 262210 253619 245023 236977 230561 225616 221347 217956 215986 214603 212411 209724
57633 209724 208199 208292 208838 209134 209684 210751 211756 212345 212638 212330 210907 208813 207063 205694 203928 201740
57617 201740 199843 198215 196167 193910 192521 192223 192171 192034 192322 192969 193080 192410 191747 191532 191270 190560 189557
57600 189557 188244 186401 184379 182792 181414 179464 176869 174071 170806 166552 162060 158783 156660 154085
57586A54085l755l875l000k425k351k072j680j728j875j504j100j477k193k197
57572A22853j512r92q96r31j098j364j206m21K74M18O56J407J777J021Qn6N09
57555A20447O24K26j0O4L00R50J986K480J836Q65N68P31P54Q53J324J562J086
57538A36646O37J096K087K715K734K061K44k418m353m505l651k881k014p40J15
57523A27773q8m64j91j14j155k357k327j611j679k454k779k578k585k545j638
57508A03208l21J56j65J9J230K656L488L515K619R48o11j216j080r04p95o24p40
57491A11383j363j875j713j297j200j201j083j297j930k132j622j540k507l255
57477H7368k608j555j622k430k631k238k133k227j969j827k410k914k307j279
$$ plain form
57586 154085 150330 146455 143455 141030 138679 136607 134927 133199 131324 129820 128720 127243 125050 122853
57572 122853 121341 120349 119453 118522 117424 116060 114854 114433 114707 115125 115781 117188 118965 119986 119994 119938 120447
57555 120447 121071 121297 121287 121351 121651 122601 124587 127067 128903 129768 130336 131067 131821 132674 133998 135560 136646
57538 136646 137283 138379 140466 143181 145915 147976 148220 145802 141449 136944 133293 130412 128398 127658 127773
57523 127773 127685 127221 127030 126916 125761 123404 121077 119466 117787 115333 112554 109976 107391 104846 103208
57508 103208 102887 103043 102878 102897 104127 106783 110271 113786 116405 117353 116742 115526 114446 113542 112747 112123 111383
57491 111383 110020 108145 106432 105135 103935 102734 101651 100354 98424 96292 94670 93130 90623 87368
57477 87368 84760 83205 81583 79153 76522 74284 72151 69924 67955 66128 63718 60804 58497 57218
57463E7218j094j279m97J001J846J970K448L306L536K982K403J888J032L31N58
57448G7649J088O62m37q51m41k45l62J31J227J873J828J886K228K189J680J242
57432I1347P81j82j138j085k42L24M78P85Q42k02j631j759o02K9p15j780k203
57415H3047k237k066j302k31J40k74l74K80Q46P31L49J9n12j092j163r44j278
57398G3939k072k280j638r17l40O79J897K068R35j83l85l00n31m43N83J875K420
57381G5307K162J625J029M69K89O86J351J869K039J733J005L41J70J91j91r44
57365H9131j622k193k755k739j535L02J468J507J063P26N29M03K57j36n58j45
57349H3703J293K533K533K004K092K390J919J162J222J634J125J43K70J323J390
$$ plain form
57463 57218 56124 54845 54348 55349 57195 59165 61613 64919 68455 71437 73840 75728 76760 77091 77649
57448 77649 78737 79399 78962 78111 77670 77425 77063 77194 78421 80294 82122 84008 86236 88425 90105 91347
57432 91347 92128 91946 90808 89723 89481 89805 90283 91068 91910 91708 90077 88318 87716 87745 87030 85250 83047
57415 83047 80810 78744 77442 77211 77351 77077 76703 76983 77829 78560 78909 78928 78416 77324 76161 75217 73939
57398 73939 71867 69587 67949 67032 66692 67371 69268 71336 72271 72088 71703 71403 70872 70429 71012 72887 75307
57381 75307 77469 79094 80123 80592 80881 81567 82918 84787 86826 88559 89564 89905 90075 90266 90075 89131
57365 89131 87509 85316 82561 79822 78287 78589 80057 81564 82627 83353 83882 84285 84542 84406 83848 83703
57349 83703 84996 87529 90062 92066 94158 96548 98467 99629 100851 102485 103610 103753 104023 105346 106736
57334A06736q2j505j793j634j635j312o19n51j367j922j539j026j127j414j481
57319H7729j727k231k155j067K71J069J374J360R24L70L01M81R7o49o27K11N30
57302H6261k29r67q44n02o09o46q0M98M12J3l3K73O74J180J557J238K41n95p14
57283H7128l48K47J091J836J920J631J841K537K786K389K179K450K458J870J349
57268A13364J278J227J087J395K075K175J360M20q0l84n58k70J23k73j256j616
57252A20067j187j189k071k686k277j530r71K8J673K820K631J845J413J210R32
57237A20708R75J477J730J411J248J722K293K554K807K992K487J633J730K854
57223A48621L380K541J687J899K294J958J699K334K906K449J999K926M469M927
$$ plain form
57334 106736 106654 105149 103356 101722 100087 98775 98156 97605 96238 94316 92777 91751 90624 89210 87729
57319 87729 86002 83771 81616 80549 80820 81889 83263 84623 85547 85917 86218 86699 86796 86147 85520 85731 86261
57302 86261 86032 85065 84221 83719 83110 82464 82384 82882 83294 83307 83274 83547 84221 85401 86958 88196 88437 87842 87128
57283 87128 86780 87027 88118 89954 91874 93505 95346 97883 100669 103058 105237 107687 110145 112015 113364
57268 113364 114642 115869 116956 118351 120426 122601 123961 124381 124301 123917 123359 123089 123212 122939 121683 120067
57252 120067 118880 117691 115620 112934 110657 109127 108156 108184 109857 112677 115308 117153 118566 119776 120708
57237 120708 121683 123160 124890 126301 127549 129271 131564 134118 136925 139917 142404 144037 145767 148621
57223 148621 152001 154542 156229 158128 160422 162380 164079 166413 169319 171768 173767 176693 181162 186089
57209A86089M348M051M202L866L057K835L493M127M122L795L588L656M175N236
57195B40640O414P125P261P096O862O826P265P992Q473Q647Q972R461R563R307
57181C51904R444J0117J0556J0578J1159J2793J4559J5554J6119J6817J7314J7143
57169E14057J6604J6112J5633J5381J5937J6974J7164J6112J5151J5385J6208
57158F90718J6644J6807J7059J7068J6843J7357J8951K0367K0613K0662K2018
57147H95107K4686K7722L0701L3381L4963L5101L4774L5081L5960L7111L8952
57136A263539M1606M4107M5931M8170N1886N6423O0709O5055P0135P5248P9121
57125A901930Q1537Q2767Q2494Q0906P9777Q0673Q2872Q4732Q6394Q9312R3769
$$ plain form
57209 186089 190437 194488 198690 202556 205613 208448 211941 216068 220190 223985 227573 231229 235404 240640
57195 240640 247054 254179 261440 268536 275398 282224 289489 297481 305954 314601 323573 333034 342597 351904
57181 351904 361348 371465 382021 392599 403758 416551 431110 446664 462783 479600 496914 514057
57169 514057 530661 546773 562406 577787 593724 610698 627862 643974 659125 674510 690718
57158 690718 707362 724169 741228 758296 775139 792496 811447 831814 852427 873089 895107
57147 895107 919793 947515 978216 1011597 1046560 1081661 1116435 1151516 1187476 1224587 1263539
57136 1263539 1305145 1349252 1395183 1443353 1495239 1551662 1612371 1677426 1747561 1822809 1901930
57125 1901930 1983467 2066234 2148728 2229634 2309411 2390084 2472956 2557688 2644082 2733394 2827163
57114B827163R8834J04424J11521J20337J29870J39550J50157J63033J79259J99538
57104D223686K24086K52914K87045L29286L83130M51155N34942O36071P56811
57095H079126R00375J070735J271035J501241J757483K033591K322648K617701
57087B1553935K912382L200465L472184L709239L881939L947781L851657L536925
57079E0066507K973719K187523J257886K83010o56794j507412k230303k800056
57071D9574080l212866l486457l645058l705222l674874l559854l368770l115490
57063B1805489k820023k505239k190727j890111j613145j367051j154827r75008
57055G289358q24474p00179n98191n13735m43296l85030l36761k95552k59650
$$ plain form
57114 2827163 2925997 3030421 3141942 3262279 3392149 3531699 3681856 3844889 4024148 4223686
57104 4223686 4447772 4700686 4987731 5317017 5700147 6151302 6686244 7322315 8079126
57095 8079126 8979501 10050236 11321271 12822512 14579995 16613586 18936234 21553935
57087 21553935 24466317 27666782 31138966 34848205 38730144 42677925 46529582 50066507
57079 50066507 53040226 55227749 56485635 56768645 56111851 54604439 52374136 49574080
57071 49574080 46361214 42874757 39229699 35524477 31849603 28289749 24920979 21805489
57063 21805489 18985466 16480227 14289500 12399389 10786244 9419193 8264366 7289358
57055 7289358 6464884 5764705 5166514 4652779 4209483 3824453 3487692 3192140 2932490
57046B932490k28837k02335j78321j55919j35848j18661j04107r2392q4050p8198
57036A553822p2706o6506n9952n2993m5054l6813k9791k3801j6929q348J045J1008
57024A152982K2531L5667M9234O2747P5172Q0788P0247L9184n459m9638q1887
57013A451568r8368j01273r5350q5347p4333o3558n3733m5539l8811l2720k7389
57002G35147k3894k1984j9620j5761j2082j0615j1002j1386j0852r636q006o313
56990E73996n384n529n657m437j881J030L771O408Q680R689Q412M311k142r400
56976E81867j5773k0439k3076k2990j9888j5368j2012j0641r748p980n727l762
56964D14463j860M78L017N417P915J0748J3803J7235K1247K4618K4587J9168R083
$$ plain form
57046 2932490 2703653 2501318 2322997 2167078 2031230 1912569 1808462 1716070 1632020 1553822
57036 1553822 1481116 1414610 1354658 1301665 1256611 1219798 1190007 1166206 1149277 1140929 1141974 1152982
57024 1152982 1175513 1211180 1260414 1323161 1398333 1479121 1549368 1588552 1583093 1533455 1451568
57013 1451568 1353200 1251927 1156577 1071230 996897 933339 879606 834067 795256 762536 735147
57002 735147 711253 689269 669649 653888 641806 631191 620189 608803 597951 588315 580309 573996
56990 573996 568612 563083 557426 552989 551108 552138 555909 562317 570997 580686 589098 593409 591267 581867
56976 581867 566094 545655 522579 499589 479701 464333 452321 441680 431932 423952 418225 414463
56964 414463 412603 413081 416098 421515 429430 440178 453981 471216 492463 517081 541668 560836 569919
56951E69919k953j4035k1914k5416k5095k2882k0459j8241j5949j3364j0332o841
56939C72438l365m33K165N031Q287J1894J6375K1958K7334L0755L1781L0336K4587
56926E79143J2540l951j9266k9086l3467l4386l2681k8843k4609k1643j9677j7437
56914C26637j4641j1916r637p900o904o475n960n237m975n303n266m262k972k235
56900B32954j942j670j347q52M6R90J426J955L868P046R949J2085J4676J8243
56886B97427K1504K3568K5114K6116K4360J8015Q384j431r334j4442j6074j4463
56874C88744j1558r254p430m912j618J700M995Q734J2729J6550K0640K5838L2164
56861D77322L9077M6424N3861N9543O0227N2947L6726J3724j0843l1024m3446
$$ plain form
56951 569919 566966 552931 531017 505601 480506 457624 437165 418924 402975 389611 379279 372438
56939 372438 369073 368640 370805 375836 384123 396017 412392 434350 461684 492439 524220 554556 579143
56926 579143 591683 587732 568466 539380 505913 471527 438846 410003 385394 363751 344074 326637
56914 326637 311996 300080 290443 282543 275639 269164 263204 257967 252992 247689 242423 238161 235189 232954
56900 232954 231012 229342 227995 227143 227189 228179 229605 231560 235428 242474 252423 264508 279184 297427
56886 297427 318931 342499 367613 393729 418089 436104 444488 443057 433723 419281 403207 388744
56874 388744 377186 367932 360502 355590 353972 355672 360667 369401 382130 398680 419320 445158 477322
56861 477322 516399 562823 616684 676227 736454 789401 826127 839851 829008 797984 754538
56850G54538m8276m7294m2306l5482k9131k3813j7950j0317j769O296J3858K1591
56838E39945K9630L8294M8712O1367P4890Q7238R6609R9802R1425O7450K9907
56827A265269j3018n1468p8379r1390r2585q6445p6842o5659n3934m2873l3032
56816E79644k3791j4714o347J207R161J8432K8422L8552M9489O1280P1199P4988
56804H87522O9498N3405K7202n373l7035o0577p3127p6184p2599o4971n5832m7046
56792E44883l8864l0807k3143j6486j0598m850P36O027J1670J8180K4839L0619
56780E12206L5334L8450L7697L0594J7184J67j7052l1458m0660m3954m2965m0095
56768D55448l6587l2798k9289k6372k3380j9752j6136j3301j0875q409o612o161
$$ plain form
56850 754538 706262 658968 616662 581180 552049 528236 510286 499969 498200 504496 518354 539945
56838 539945 569575 607869 656581 717948 792838 880076 976685 1076487 1167912 1235362 1265269
56827 1265269 1252251 1200783 1122404 1031014 938429 851984 775142 709483 655549 612676 579644
56816 579644 555853 541139 534792 535999 545160 563592 592014 630566 680055 741335 812534 887522
56804 887522 957020 1010425 1037627 1032254 995219 934642 861515 785331 712732 647761 591929 544883
56792 544883 506019 475212 452069 435583 424985 420135 420871 426898 438568 456748 481587 512206
56780 512206 547540 585990 623687 654281 671465 671632 654580 623122 582462 538508 495543 455448
56768 455448 418861 386063 356774 330402 307022 287270 271134 257833 246958 238549 231937 225776
56756B25776o190n505m409l835l620l118k690k889l071k476j737j708j764j038
56742A81726l11o85j344q57J86J16q04p94L82J137P92L41M83Q88J504K558L244
56725A88562K317J99j220j069j87O05J341J915J942J686J740J895J629J409J955
56710B04719K617K235J240J043J642J773J265J196J753J919J384R38Q13M60j8
56695B24979pP8p18j846j777o23j65j008j818j743j463j361p58L53P39j9o74l44
56677B11825J85K5m06m18k37l56p27j094j279r09R6Q07L55m10N5J410J709M27
56659B11058p52o13O1L30N19R83J061K66p43j252j434j562j499j465k062k998
56643A99898l023j689L5J256K057K495K189J432J222J658J607N82m52p41q20j285
$$ plain form
56756 225776 219586 214081 209672 205837 202217 199099 196409 193520 190449 187973 186236 184528 182764 181726
56742 181726 181415 180730 179386 178529 178715 178831 178027 177233 177615 178752 179544 179885 180368 181256 182760 185318 188562
56725 188562 190879 191078 189858 188789 188602 189207 190548 192463 194405 196091 197831 199726 201355 202764 204719
56710 204719 207336 209571 210811 211854 213496 215269 216534 217730 219483 221402 222786 223724 224537 224997 224979
56695 224979 224972 225050 224332 222486 220709 220086 219921 218913 217095 215352 213889 212528 211770 212123 212862 212843 212169 211825
56677 211825 212010 212035 211629 211211 210974 210618 209891 208797 207518 206609 206705 207512 207867 207457 207512 208922 210631 211058
56659 211058 210306 209693 209754 210084 210603 211586 212647 212913 212170 210918 209484 207922 206423 204958 202896 199898
56643 199898 196875 195186 195221 196477 198534 201029 203218 204650 205872 207530 209137 209719 209267 208526 207706 206421
56627B06421j743j791j778j932j835j469j650k643l463l239k378j714j360r91
56613A78435m88J91J055J738J828J617J680J811J368O02L77P35R98J226K022K880
56597A98075K475Q40l78j80O76J189J245R90M50N9K22K64o94j887j765n65p6o42
56579B00298p27K38Q42L14k15P8K93k32n83j3P63J196K050L703M934M723L852
56562B21514L518L753M260N421P350R162J0100J0168Q996N761J110k537l673l185
56548B81718k369j259L2K95r14k140k228k099k821l564l156k277k208k590k292
56533B52128j546j467k154k820l159l266k869j897j159j321j867j998j736j305
56519B23564m62O01Q08k06j205j190q99j307j796j344m86m65j204j568j106k59
$$ plain form
56627 206421 204678 202887 201109 199177 197342 195873 194223 191580 188117 184878 182500 180786 179426 178435
56613 178435 177947 178138 179193 180931 182759 184376 186056 187867 189235 189837 190214 190949 191947 193173 195195 198075
56597 198075 200550 201390 201012 200832 201508 202697 203942 204932 205382 205441 205663 205927 205233 203346 201581 201016 200940 200298
56579 200298 199571 199809 200651 200965 200750 200828 201121 200889 200306 200293 201056 202252 204302 208005 212939 217662 221514
56562 221514 225032 228785 233045 238466 245816 254978 265078 275246 284242 290003 291113 288576 284903 281718
56548 281718 279349 278090 278122 278417 277503 275363 273135 271036 268215 264651 261495 259218 257010 254420 252128
56533 252128 250582 249115 246961 244141 240982 237716 234847 232950 231791 230470 228603 226605 224869 223564
56519 223564 223102 223703 224511 224305 223100 221910 221011 219704 217908 216564 216078 215613 214409 212841 211735 211476
56503B11476O04J210J099L59K9P26J539J334M10j40p7O0Q9J91K68J11j58m10p22
56484B17998r06n80l5j16q36j214q73n36n57k90M62Q87O72O19J037J081M72K60
56466B17545J009J729J670J502J783J770R38Q3j06j13k26K53J374J889J356J055
56450B33511J618J720O05k17N61J810J985J557J509J270K40l64N50J682J300N8
56434B49395l83j82m69q58k60Q17J099Q44J038J255M87o50p99k37k45p49p78n48
56416B48777r97j777j839j449j607j976j449l14J38j57r1O42J357J777K065J887
56400B44987J016L33O48J266J171P90R82J250Q19M87J382K636K549J332O89J037
56384B63374J277R04M77K07j23j79L68Q47N62J73N06Q96L50n42p11o10j157j611
$$ plain form
56503 211476 212080 213290 214389 214748 214777 215503 217042 218376 218786 218646 218569 218629 218718 218909 219177 219288 219130 218720 217998
56484 217998 217092 216512 216477 216361 215525 214311 213438 212902 212345 212055 212517 213404 214076 214695 215732 216813 217285 217545
56466 217545 218554 220283 221953 223455 225238 227008 227946 228029 227923 227810 227584 227837 229211 231100 232456 233511
56450 233511 235129 236849 237454 237237 237798 239608 241593 243150 244659 245929 246169 245805 246355 248037 249337 249395
56434 249395 249012 248830 248361 247503 247243 248060 249159 250003 251041 252296 252783 252133 251334 251097 250852 250103 249325 248777
56416 248777 247780 246003 244164 242715 241108 239132 237683 237369 237507 237350 237259 237901 239258 241035 243100 244987
56400 244987 246003 246336 246984 248250 249421 250211 251193 252443 253262 253749 255131 257767 260316 261648 262337 263374
56384 263374 264651 265555 266032 266239 266116 265937 266305 267152 267714 267887 268393 269289 269639 269097 268386 267776 266619 265008
56366B65008o76J036J759J268P32N33J64k13p7J45j18k34M09Q50J34o10J01J470
56348B71681J776J386J812K678K371J085N49J143J792K238K913L083J719p6j77
56333B95973J348K507K574K551K798K732K589L051L423K573J313J371K422K669
56319C29894J967J775K288K304J715J526J616J083M98J108K199K049J197J796
56305C53015L849N147M958M841N645O630P701R574J1463J1348R007O161L580P19
56291D43638j822k377j087J59Q27K016L605M085L522L746N216O529P206Q154R189
56276D92606R152Q708R788J1981J2799J1901J1687J3043J4043J3792J4168J6436
56264F40104J9193K1081K2788K5089K7518L0067L3821L8819M3690M8159N3624
$$ plain form
56366 265008 264332 265368 267127 268395 269127 269660 269824 269611 269534 269679 269561 269327 269736 270586 270720 270110 270211 271681
56348 271681 273457 274843 276655 279333 281704 282789 283338 284481 286273 288511 291424 294507 296226 296150 295973
56333 295973 297321 299828 302402 304953 307751 310483 313072 316123 319546 322119 323432 324803 327225 329894
56319 329894 331861 333636 335924 338228 339943 341469 343085 344168 344666 345774 347973 350022 351219 353015
56305 353015 356864 362011 366969 371810 377455 384085 391786 401360 412823 424171 433178 439339 442919 443638
56291 443638 441816 439439 438352 438511 439338 441354 444959 449044 452566 456312 461528 468057 475263 483417 492606
56276 492606 501758 510466 520254 532235 545034 556935 568622 581665 595708 609500 623668 640104
56264 640104 659297 680378 703166 728255 755773 785840 819661 858480 902170 950329 1003953
56253A003953O0663O8362P6587Q6292R7170J07668J17740J28771J40452J50716
56243B038374J58991J66341J72113J73923J71452J66615J59266J46438J26909
56234C480422J02904P6317M6934J5617j4602m2132o8072r2410j12534j27130j38060
56223C127254j46681j51739j52639j51325j48997j44242j36485j28014j20557
56214A846575j12919j04067r5503q8512q1929p4738o8095o2813n7567n1586m6314
56203A002532m2603l9033l4774l1236k9113k6776k3430k0842j9959j8871j6144
56192F99751j3259j1654j0393q721p929q502q437o610m874m708m717l668k851
56179F03428l233l283k062j374k398l212k164p53o31o60M95J673J769K085L564
$$ plain form
56253 1003953 1064616 1132978 1209565 1295857 1393027 1500695 1618435 1747206 1887658 2038374
56243 2038374 2197365 2363706 2535819 2709742 2881194 3047809 3207075 3353513 3480422
56234 3480422 3583326 3659643 3706577 3722194 3707592 3665460 3597388 3504978 3392444 3265314 3127254
56223 3127254 2980573 2828834 2676195 2524870 2375873 2231631 2095146 1967132 1846575
56214 1846575 1733656 1629589 1534086 1445574 1363645 1288907 1220812 1157999 1100432 1048846 1002532
56203 1002532 959929 920896 886122 854886 825773 798997 775567 754725 734766 715895 699751
56192 699751 686492 674838 664445 655724 647795 639293 630856 624246 619372 614664 609947 606279 603428
56179 603428 600195 596912 594850 593476 591078 587866 585702 584949 584318 583658 584153 585826 587595 589680 593244
56164E93244M490L616K812L898N557O037O310P841R756J0822J1821J3485J4639
56151F94328J4653J5191J7294J9423K0546K2230K5600K9337L2813L7935M5610
56140I74960N3862O1762P1468Q3825R5684J04397J10993J15977J16026J08511
56130A897465R5801Q1840O8096N6133M9774N0424N3552N3724M9980M2993L1212
56119B530994J4370k887j5731k4806l3316m1803n0048o0652p5758r2724j07133
56108B040506j17455j23122j21742j12758j00612q9645p8884o6154n3687m4657
56098A131790l7567k9393k1395j6528j3855j0667p561o322n421k688J17M35o5
56085I80880J422L445L194K029K876M692M748L941M600N612M921M244O067Q560
$$ plain form
56164 593244 597734 601350 604162 608060 613617 619654 625964 633805 643561 654383 666204 679689 694328
56151 694328 708981 724172 741466 760889 781435 803665 829265 858602 891415 929350 974960
56140 974960 1028822 1090584 1162052 1245877 1341561 1445958 1556951 1672928 1788954 1897465
56130 1897465 1993266 2075106 2143202 2199335 2249109 2299533 2353085 2406809 2456789 2499782 2530994
56119 2530994 2545364 2542477 2526746 2501940 2468624 2426821 2376773 2316121 2240363 2147639 2040506
56108 2040506 1923051 1799929 1678187 1565429 1464817 1375172 1296288 1230134 1176447 1131790
56098 1131790 1094223 1064830 1043435 1026907 1013052 1002385 994824 988502 983081 980393 980510 980945 980880
56085 980880 982302 985747 988941 990970 993846 998538 1003286 1007227 1011827 1017439 1022360 1026604 1032671 1041231
56071A041231Q751Q031R264J1307J1709J1828J3778J5450J4281J2793J4354J6716
56059A189493J5990J3849J4240J6002J5454J3541J3605J4680J3727J1991J2484
56048A345056J3744J2728J1180J2438J4713J4342J2814J3695J5619J5414J5018
56037A496761J8006K2505K4970K7469L3443L9706M1024L9284L9782M1778M1366
56026A866094M0190M2234M5208M4416M2048M3269M6284M5947M3965M5644M9630
56015B354929N1056N1571N5871O1549O3169O3150O7489P4061P6564P6765Q0902
56004C077076Q7264Q9672R0040R4807J02171J05877J08372J16626J28115J34967
55994D134987J38822J47217J58648J66177J72376J84992K01303K13131K23699
$$ plain form
56071 1041231 1049982 1058013 1067277 1078584 1090293 1102121 1115899 1131349 1145630 1158423 1172777 1189493
56059 1189493 1205483 1219332 1233572 1249574 1265028 1278569 1292174 1306854 1320581 1332572 1345056
56048 1345056 1358800 1371528 1382708 1395146 1409859 1424201 1437015 1450710 1466329 1481743 1496761
56037 1496761 1514767 1537272 1562242 1589711 1623154 1662860 1703884 1743168 1782950 1824728 1866094
56026 1866094 1906284 1948518 1993726 2038142 2080190 2123459 2169743 2215690 2259655 2305299 2354929
56015 2354929 2405985 2457556 2513427 2574976 2638145 2701295 2768784 2842845 2919409 2996174 3077076
56004 3077076 3164340 3254012 3344052 3438859 3541030 3646907 3755279 3871905 4000020 4134987
55994 4134987 4273809 4421026 4579674 4745851 4918227 5103219 5304522 5517653 5741352
55985E741352K42407K66599K86469L04266L29694L60208L86009M10895M46913
55976H774812M91891N34453N77648O34249P02533P71654Q47027R43891J060032
55967A5338190J183608J323933J503931J726709J982834K285782K664560L128062
55959C1137609L678289M352706N207222O263241P524769R045085J0923301J3247266
55951I1379488J6108755J9656851K4029907K9193035L4834269M0220824M3843568
55944B99266697M3278768L6106925K1787696K878517j5919021l0328736l8493045
55937C18577801m0991007l9544195l5878838l1314935k6720420k2521828j8822903
55930A02783675j5616179j2896327j0633162q757646p214058n975235m996890
$$ plain form
55985 5741352 5983759 6250358 6536827 6841093 7170787 7530995 7917004 8327899 8774812
55976 8774812 9266703 9801156 10378804 11013053 11715586 12487240 13334267 14278158 15338190
55967 15338190 16521798 17845731 19349662 21076371 23059205 25344987 28009547 31137609
55959 31137609 34815898 39168604 44375826 50639067 58163836 67208921 78132222 91379488
55951 91379488 107488243 127145094 151175001 180368036 215202305 255423129 299266697
55944 299266697 342545465 378652390 400440086 403318603 387399582 357070846 318577801
55937 318577801 277586794 238042599 202163761 170848826 144128406 121606578 102783675
55930 102783675 87167496 74271169 63638007 54880361 47666303 41691068 36694178
55923C6694178m208789l561562l039514k621540k270378j966433j714447j509754
55915A5801761j330490j167717j031707r23102q26125p34715o58534n98716n42756
55906G987899m87366m42702m10020l77660l42760l15338k97141k77241k52598
55897D785073k33067k21814k09518j92393j78123j69498j59077j44484j33064
55888C144035j27017j19105j07209r8508r5122q9690p9272p0126o4740n7328m6340
55877B189578l8949l8835m1151m3290m9051n8393o4435o4677o4731o7199o7225
55866A591642o2611n8164n6262n2800m6053m0350l7529l3761k8051k4941k5657
55855A125463k5191k1295j7926j7018j5371j2514j3070j8147k2621k3946k5579
$$ plain form
55923 36694178 32485389 28923827 25884313 23262773 20992395 19025962 17311515 15801761
55915 15801761 14471271 13303554 12271847 11348745 10522620 9787905 9129371 8530655 7987899
55906 7987899 7500533 7057831 6647811 6270151 5927391 5612053 5314912 5037671 4785073
55897 4785073 4552006 4330192 4120674 3928281 3750158 3580660 3421583 3277099 3144035
55888 3144035 3017018 2897913 2790704 2692196 2597074 2507384 2428112 2357986 2293246 2235918 2189578
55877 2189578 2150629 2111794 2070643 2027353 1978302 1919909 1855474 1790797 1726066 1658867 1591642
55866 1591642 1529031 1470867 1414605 1361805 1315752 1275402 1237873 1204112 1176061 1151120 1125463
55855 1125463 1100272 1078977 1061051 1044033 1028662 1016148 1003078 984931 962310 938364 912785
55844I12785k8886k9906k7274k5231k5534k4189j9554j5936j5713j5344j2741
55833F72477j1196j2422j2802j0312q385r205r679p707o176p093p905p042p201
55820E55352r678j1338j0468r872j0996j0914q325o597p518p848n515l439l656
55807D49188l369o22J611R64P0J564L583M100M930P491R232Q136O441O158N196
55792E04673J627k325m301n747q264r924q929p203o759o074l543j034o57j370
55778D40170j944l729p131q876o308j315L298Q200J5108K2950K9550L4023L4581
55765E58577K7429J1619p467k2771l1634l4970l3652k8898k3583j9760j6714j3672
55753C64504j1967j2185j2087r956p450o540o326n405m723n367o050n399m333
$$ plain form
55844 912785 883899 853993 826719 801488 775954 751765 732211 716275 700562 685218 672477
55833 672477 661281 648859 636057 625745 617360 608155 598476 590769 584593 577500 569595 562553 555352
55820 555352 545674 534336 523868 513996 503000 492086 483761 477164 469646 461798 456283 452844 449188
55807 449188 445819 445197 446808 447772 447842 449406 452989 457089 462019 469510 478742 486878 493319 499477 504673
55792 504673 506300 503975 499674 493927 485663 475739 466810 459607 452848 446774 443231 442197 441540 440170
55778 440170 438226 434497 427366 418490 412182 410867 414165 422365 437473 460423 489973 523996 558577
55765 558577 586006 597625 590158 567387 535753 500783 467131 438233 414650 394890 378176 364504
55753 364504 352537 340352 328265 318309 310859 304319 297993 292588 287865 282498 276448 271049 266716
55740B66716l761k474K78K680L257L244L675K907l25l973n540n427n050m172k669
55725B49366k288l922n537n360m644m865m823l302j891k195k712j439P29K188
55711B09305L779O694R431J0081R572R526Q791N425M44l525o009q127r707r870
55697B35810r267r022q599p157n656n250m941l391j605j312j950j777p77q3M06
55682A75429J515K923L897M832O185P047O533N366M444L266J385j92o92r74j637
55667B19327j705p80m04j426k204j441m84p03q79L11J568J338P67J479K491K115
55651B19370J135J174J651J183M07N07N61p48k296k293j515j857l030l518l515
55636B07216m064m588m127l774m997o707o835n702n016m701l555j964j113n82
$$ plain form
55740 266716 262955 260481 260759 263439 266696 269940 273615 276522 276197 272224 266684 261257 256207 252035 249366
55725 249366 247078 243156 237619 232259 227615 222750 217927 214625 212734 210539 207827 206388 207117 209305
55711 209305 213084 219778 229209 239290 248862 258388 267179 272604 273048 269523 263514 255387 245680 235810
55697 235810 226543 217521 208922 201765 196109 190859 185918 182527 180922 179610 177660 175883 175106 175023 175429
55682 175429 176944 179867 183764 188596 194781 201828 208361 213727 218171 221437 222822 222630 221938 220964 219327
55667 219327 217622 216842 216438 215012 212808 211367 210883 210180 209301 209612 211180 212518 213285 214764 217255 219370
55651 219370 220505 221679 223330 224513 224920 225427 225988 225240 222944 220651 219136 217279 214249 210731 207216
55636 207216 203152 198564 194437 190663 185666 178959 172124 166422 161406 156705 153150 151186 150073 149491
55622A49491N81J520J082M09J074K005J312k8L18J802J790p2j697k303l008l967
55606A50309m006l108k448k084j229m45r43k018j862n53L09M74Q67J149K67r79
55590A33700p68O45J456J489K063L021K935K049K127L365M341M913O311Q386R653
55575A85686J0123J1369J3682J5939J8270K1916K6413K9800L1702L3218L3518
55564D31636K9807K1405J1067J558o501j2906j6962j9194k1371k3917k5445k5447
55552C43730k4991k4234k1934j8188j5112j3785j2845j1062q995p236n316l371
55540A76661k652l260l458k328j134r86j155p76l96n97q29o58o65j108j275j051
55524A54333j476k849l865l657l148l392l972m065l824l713l570l222l075l388
$$ plain form
55622 149491 150072 151592 152674 153083 154157 156162 157474 157446 157764 159566 161356 161284 159587 157284 154276 150309
55606 150309 146303 143195 140747 138663 137434 136989 136046 134028 132166 131613 131922 132396 133263 134412 134679 133700
55590 133700 132932 133577 135033 136522 138585 141606 144541 146590 148717 152082 156423 161336 167647 176033 185686
55575 185686 195809 207178 220860 236799 255069 276985 303398 333198 364900 398118 431636
55564 431636 461443 482848 493915 495473 488972 476066 459104 439910 418539 394622 369177 343730
55552 343730 318739 294505 272571 254383 239271 225486 212641 201579 192584 185348 180032 176661
55540 176661 174009 170749 167291 164963 163829 162843 161688 160912 160516 159919 159090 158432 157767 156659 155384 154333
55524 154333 152857 150008 146143 142486 139338 135946 131974 127909 124085 120372 116802 113580 110505 107117
55510A07117l809m026m045l677k749j780j321q19M72J827J975J266J013R86j11
55495I2319j788k036o60K44k31m54O73J863J819J247J204J371J213J058R68L31
55479I9141m71O5J922K880J716L1n35p62j831k840k496j633j784k399j801j44
55463H9059P60K77l21J9P98R75L30m74o66j31M16L26r6j12J89J67rL67R76P13
55443I3563k05k82O96R89l02j616j354k43J44j60m7O68J279J498J463J057L12
55426I7460j42Q0M17L08Q1J30J33p0K35J490K875L402L329L465L750L554K844
55409A23341K072J302K66r86k117k900l265l271l308l734m124l627k252r36k17
55394I6244K17M62O5q43j288q51k13J59P17J659K276K133J821J831J716J082L64
$$ plain form
55510 107117 103308 99282 95237 91560 88811 87031 85710 84891 85363 87190 89165 90431 91444 92430 92319
55495 92319 90531 88495 87835 88079 87848 87394 88067 89930 91749 92996 94200 95571 96784 97842 98810 99141
55479 99141 98670 98735 100657 103537 105253 105284 104749 103987 102156 99316 96820 95187 93403 91004 89203 89059
55463 89059 89819 90096 89775 89794 90592 91567 91897 91423 90757 90626 91042 91368 91272 91160 91349 91516 91507 91874 92850 93563
55443 93563 93358 93076 93772 94761 94459 92843 91489 91246 91390 91230 91183 91851 93130 94628 96091 97148 97460
55426 97460 97318 97398 97815 98123 98204 98334 98467 98397 98632 100122 102997 106399 109728 113193 116943 120497 123341
55409 123341 125413 126715 126981 125995 123878 120978 117713 114442 111134 107400 103276 99649 97397 96461 96244
55394 96244 96461 96923 96988 96145 94857 94006 93793 93952 94669 96328 98604 100737 102558 104389 106105 107187 107551
55377A07551m9m61j054j414j440j611j847j316lQ24N20J30O41J356J057j94j362
55360A01328j786j445o56j03l52r23q26k18j81o63l75P33R23m87j695j171N1K82
55342I2436k51n00p05j447j887r18P81J698J701J608J390N43l66l76J57J36m09
55325I3591o10m63p10j294j423r44l65K10R03J280R46M86N06L81o67j767j438
55308H8622k3O60J7o54l93J96L13J61K51N43Q34J157J430J345R43O80P96J058
55290I7936J260J452J681J843J848J618J125O22M74N62K53o55j564j924j848j620
55274A03063j283j082j412j928j709p35r2j02L64J888L160K876J661Q18K84n80
55258A05191j258q89r4j41q22q46n2M87L21M9l9k43n04m43l51q41j592j659j006
$$ plain form
55377 107551 107502 107041 105987 104573 103133 101522 99675 98359 98356 99180 99700 99830 100471 101827 102884 102690 101328
55360 101328 99542 98097 97441 97338 96986 96063 95237 95019 94838 94175 93800 94533 95456 94969 93274 92103 92154 92436
55342 92436 92185 91685 90980 89533 87646 86728 87509 89207 90908 92516 93906 94449 94083 93707 93864 94000 93591
55325 93591 92981 92518 91808 90514 89091 88147 87782 87992 88895 90175 91121 91607 92113 92494 91827 90060 88622
55308 88622 88599 89259 89276 88622 88229 88425 88738 88899 89150 89693 90527 91684 93114 94459 95402 96082 96878 97936
55290 97936 99196 100648 102329 104172 106020 107638 108763 109385 109859 110421 110674 110019 108455 106531 104683 103063
55274 103063 101780 100698 99286 97358 95649 94914 94822 94720 95084 96972 100132 103008 104669 105487 105771 105191
55258 105191 103933 103044 102950 102809 101987 101141 101089 101576 101897 101946 101907 101664 101160 100717 100366 99525 97933 96274 95268
55239I5268m86m30l25J08N87R59J197R80J93m98n65o05j280j887j421m81m19r86
55221H9909p35M06R23L48L3Q11J608J222P0p05p07j09R15J838J801P26l42o29
55203I7383n58p57r45n49K25O57M91J17l1J47M30M80K06j15k57m24p45p66p1P74
55183I5692P61j59r97j068o00m1M89Q52P41J87l08l87k12j23k36l67j57O10J496
55164I6173J624P69j67k24M89J243J721J927J673R63L69J90j57j061j706j262
55148A02564m05l34p71m68N92J068L76n89r85r48p95m92j98k13k23L91J329J573
55130A01472R18J77k11o00r86p29J54O75L41j53j83j25m50p89o14j21J51O5j32
55111I8860j50K04Q42J251J118R26J253J719J527Q04L76K89j90j059j358p14J03
$$ plain form
55239 95268 94782 94352 94027 94135 94722 95681 96878 97858 98051 97553 96988 96383 95103 93216 91795 91314 90895 89909
55221 89909 89174 89580 90503 90851 90884 91695 93303 94525 94595 93890 93183 93074 93989 95827 97628 98354 98012 97383
55203 97383 96825 96068 95123 94574 94799 95456 95947 96064 96033 96180 96610 97090 97296 97181 96924 96500 95755 94989 94918 95692
55183 95692 96453 96294 95297 94229 93629 93588 94077 94929 95670 95857 95549 95162 94950 94827 94591 94224 94067 94677 96173
55164 96173 97797 98566 98399 98175 98664 99907 101628 103555 105228 106191 106560 106750 106593 105532 103826 102564
55148 102564 102159 101825 101054 100586 101178 102246 102622 102033 101048 100100 99305 98813 98615 98402 98179 98570 99899 101472
55130 101472 102390 102567 102356 101756 100770 100041 100195 100870 101211 101058 100875 100750 100300 99511 98897 98776 98927 98992 98860
55111 98860 98710 98914 99756 101007 102125 103051 104304 106023 107550 108354 108730 109019 108829 107770 106412 105698 105801
55094A05801M78P27J172J510J531J465J261N34m58p69o8R13J549J867J724O82
55078A19919q29j420n58O18Q89L86j30m31n48k89K19L58Mj77N7k8p60j222o62
55059A15396J72J04p58j403j402j096p92o11o94q70o01J18M32r1n83j69N29K70
55041A07951q40j470r92j68J78K42O29J366J938K012J716J344R53M26j37l97l01
55024A14450l43q47j323j165p48r28j563j561o15J92m7q72j333j265j019o64j71
55007A00178J44O4l4L50J169K040K713L024K849K394K107J986J595Q96L78J32
54991A21985l08r02q76j07L65l9l63L32J272J058j53r49q00n32p25r03n77m0K67
54972A18005M24O46P46M24k04o62n50J63J087J630J493R94O74O33M78n4o37o48
$$ plain form
55094 105801 106279 107006 108178 109688 111219 112684 113945 114479 114021 113252 113184 114097 115646 117513 119237 119919
55078 119919 119090 117670 117112 117730 118619 119005 118875 118444 117896 117607 117826 118184 118188 118011 118068 118040 117280 116058 115396
55059 115396 115568 115672 114914 113511 112109 111013 110221 109610 108916 108046 107445 107563 107995 107904 107321 107152 107681 107951
55041 107951 107111 105641 104649 104481 104659 104901 105530 106896 108834 110846 112562 113906 114859 115285 115148 114751 114450
55024 114450 114107 113260 111937 110772 110024 109096 107533 105972 105357 105549 105502 104630 103297 102032 101013 100349 100178
55007 100178 100322 100386 100352 100702 101871 103911 106624 109648 112497 114891 116998 118984 120579 121475 121853 121985
54991 121985 121677 120775 119899 119792 120157 120118 119755 120087 121359 122417 122264 121315 120515 119983 119258 118355 117778 117738 118005
54972 118005 118429 119075 119821 120245 120041 119379 118829 118992 120079 121709 123202 124196 124870 125503 125981 125927 125290 124642
54954A24642J01J054J397Q39j71j024j485j602j464j247j168j064m48N87J044
54939A19991K49j004j360n91M69J333K131K676K465J699J147R29N12N4M27J559
54923A32686K210J922J928L273N215O483P133Q013R085R482Q792P259N037K128
54909B10646j077l907o001p329p835p567o897o215n593m976m360l597k507j440
54895A41345j159j811k576k639j977r53J69R59Q90J46k59L23J414K225K575K603
54879A41275K313J998K400L806N546O863P702Q222Q184P337N818L768J213j347
54865B05098l069l930m850o154o887o292m997l952l079j877n40L73O86L06j005
54850A59831k790l757l400k863l234l943l849l053k344j734q78k71n78j259j242
$$ plain form
54954 124642 124743 125797 127194 128033 127862 126838 125353 123751 122287 121040 119872 118808 118360 118947 119991
54939 119991 120240 119236 117876 117285 117754 119087 121218 123894 126359 128058 129205 130134 130646 130700 131127 132686
54923 132686 134896 136818 138746 142019 147234 153717 160850 168863 177948 187430 196222 203481 208518 210646
54909 210646 209569 205662 199661 192332 184497 176930 170033 163818 158225 153249 148889 145292 142785 141345
54895 141345 140186 138375 135799 133160 131183 130230 130399 131358 132248 132394 132135 132458 133872 136097 138672 141275
54879 141275 143588 145586 147986 151792 157338 164201 171903 180125 188309 195646 201464 205232 206445 205098
54865 205098 202029 198099 193249 187095 180208 173916 168919 164967 161888 160011 159471 159844 160530 160836 159831
54850 159831 157041 153284 149884 147021 143787 139844 135995 132942 130598 128864 127986 127715 127137 125878 124636
54835A24636o02k42l24k70o0j93n59o12n00p88j238j070l21K28M18P27J074Q62
54817A21166K73K41Q63J129N32q9J63R61J321R00K39M9N03J129J354J273J446
54800A33453J862J718P22j75j23K68j22j151j746j508r08k46M37O65J8q67r24
54783A31373j99L55M62P00J193J370J170J210J589J705J511J805K872L900M191
54768A55207M102M366N187O348P591Q656R441J0263J1364J2151J1650R777P341
54755B63444M752J567k483o730j0109j1958j2188j1249r997r073q395p648o981
54742A72952o662o326n411m036k744j687q37n99j202j823j433l50K38M7j41Q9
54726A40075M24Q40J648K571L039L478M832O799P889P505O495N453L963J951K60
$$ plain form
54835 124636 124034 123792 123468 123198 123138 122945 122386 121774 121274 120486 119248 118178 117857 118085 118503 119230 120304 121166
54817 121166 121439 121680 122543 123672 124204 124115 124278 125239 126560 127460 127699 127748 128251 129380 130734 132007 133453
54800 133453 135315 137033 137755 137580 137457 137725 137603 136452 134706 133198 132290 132044 132481 133146 133164 132297 131373
54783 131373 131174 131529 131991 132691 133884 135254 136424 137634 139223 140928 142439 144244 147116 151016 155207
54768 155207 159309 163675 168862 175210 182801 191457 200898 211161 222525 234676 246326 256103 263444
54755 263444 268196 269763 267280 260550 250441 238483 226295 215046 205049 195976 187581 179933 172952
54742 172952 166290 159964 154553 150517 147773 146086 145249 144650 143448 141625 140192 139842 140080 140127 139986 140075
54726 140075 140499 141339 142987 145558 148597 152075 156907 163706 171595 179100 185595 191048 195011 196962 197222
54711A97222p56j796l185m204m562n115o228o731n598l646k433k302k523k636
54697A45507k575k093j091k02j75r18j760k234k184j587p98m54p10j009r87r53
54681A25777j104j029n42k10m61p98n15L38J244J872J961J186j86j114q91M4P99
54664A26371J027P85J44n53p13l60l24j003j654j517q93m43j43K09K48k72o15
54647A20294J8J193J795J600J254J019N89P1L7M83O31K1q24j134p97k57Q3J46
54629A26222J11K30N71Q81Q17L25k65m88j96J82Op49j276r23j00L47M32Q24J489
54610A28440J548O85k95o31n07l04J25Q66J364J178P20N59N39J81m65r41j060
54593A32002r13o20m05n34q08o25Q9N88L98J0k6Ml16n43J5J108J771J498N77n23
$$ plain form
54711 197222 196466 194670 191485 187281 182719 177604 171376 164645 159047 155401 152968 150666 148143 145507
54697 145507 142932 140839 139748 139546 139371 138453 136693 134459 132275 130688 129890 129436 128726 127717 126730 125777
54681 125777 124673 123644 123102 122892 122431 121633 121118 121456 122700 124572 126533 127719 127533 126419 125528 125572 126371
54664 126371 127398 128183 128327 127774 127061 126701 126377 125374 123720 122203 121310 120867 120724 120933 121181 120909 120294
54647 120294 120312 121505 123300 124900 126154 127173 127762 127833 127870 128353 128984 129005 128181 127047 126250 125993 126076 126222
54629 126222 126333 126563 127134 128015 128832 129157 128892 128404 128208 128390 128396 127647 126371 125448 125348 125695 126127 126951 128440
54610 128440 129988 130673 130378 129747 129240 128936 129061 129927 131291 132469 133189 133748 134287 134468 134003 133062 132002
54593 132002 131089 130469 130064 129530 128722 128097 128186 128774 129172 129182 129156 129160 128844 128301 128316 129424 131195 132693 133270 132747
54573A32747j401j624j019K3Q78J219R79J76q17j288q88n9N66P94O60J76l14j84
54555A30624N69J035N64k86n95l25o8l8l4J7J16M34R26J081P00M04P66J372J526
54536A38788J350J375J498J220O46L01J55k57q53j061q56q76j398j878j754j095
54520A35305l56J38K75J58O2J78L95N04N14N48N84N19L27N6j69j10K33L30k55
54501A39236r60p52K50O90j61j399j929j893j912j785j002J66J067J607J902J646
54485A34771P54P8M04J210J459J124Q49O02j01r69j228r08o51m03L77J342J484
54468A40194P78L30N91Q12N14L50Q71J491J411P85L26K46K33P4j21j66OJ73j16
54449A48782r96j813j712p03K68L94k47j004j270p92J84J016J156O16k04r06j197
$$ plain form
54573 132747 131346 129722 128703 128726 129604 130823 131802 131978 131161 129873 128985 128926 129492 130286 130946 131122 130808 130624
54555 130624 131193 132228 132792 132506 131911 131586 131518 131480 131446 131463 131579 132013 132939 134020 134720 135124 135890 137262 138788
54536 138788 140138 141513 143011 144231 144877 145178 145333 145076 144223 143162 142306 141430 140032 138154 136400 135305
54520 135305 134949 135087 135362 135520 135582 135760 136155 136659 137173 137721 138305 138824 139151 139207 139038 138928 139161 139491 139236
54501 139236 138276 137524 137774 138464 138303 136904 134975 133082 131170 129385 128383 128549 129616 131223 133125 134771
54485 134771 135525 135603 136007 137217 138676 139800 140649 141251 141150 140181 138953 138045 137394 136991 137368 138710 140194
54468 140194 140972 141302 141893 142705 143219 143569 144440 145931 147342 148127 148453 148699 148932 149006 148885 148719 148725 148898 148782
54449 148782 147786 145973 144261 143558 143826 144220 143973 142969 141699 140907 141091 142107 143263 143879 143675 142769 141572
54432A41572r48m48j67%N89J420J435L05p60o69j6J08m8L39Q65N40j71J44J371
54413A45461J805P82l15l10J64M5n25p98o11j83M21R58R00L01L8O10J387J595
54395A51725J327J094J011J049J361J831J834J066J38j40K92Q12Q39J92q32j573
54379A62026j659j491j620j770j311n55m54r06o62O79J880J880J283J179J471
54364A59970J396R18N75M66L69M59J023J674J701J061L97K35O38J417K227K625
54348A77151K534K402K632L094L417L409K942J954P97O9k42q56k056l180l644
54333A90423l797m148m346l782k679j831j553j554j549j384q69p0M53L40n8k85
54317A63311n22j020j235m12J105J968J351j81j360j401n74O3l74j582k249j584
$$ plain form
54432 141572 140624 140176 140009 140009 140598 142018 143453 143758 142998 142329 142313 142421 142373 142712 143577 144117 143946 144090 145461
54413 145461 147266 148048 147733 147423 147587 147632 147107 146309 145698 145515 145936 146894 147794 148095 148133 148743 150130 151725
54395 151725 153052 154146 155157 156206 157567 159398 161232 162298 162436 162296 162588 163400 164239 164431 163599 162026
54379 162026 160367 158876 157256 155486 154175 153620 153166 152260 151598 152277 154157 156037 157320 158499 159970
54364 159970 161366 162284 162859 163325 163694 164153 165176 166850 168551 169612 170009 170244 170882 172299 174526 177151
54348 177151 179685 182087 184719 187813 191230 194639 197581 199535 200332 200401 200159 199303 197247 194067 190423
54333 190423 186626 182478 178132 174350 171671 169840 168287 166733 165184 163800 162931 162861 163314 163654 163596 163311
54317 163311 162789 161769 160534 160122 161227 163195 164546 164365 163005 161604 161030 161093 160719 159137 156888 155304
54301A55304k94L90J97k61n93q42q56l59L49O00L15R6K27K83p3n09n29j02M96
54282A53839J090J574J734J422P68R3l11l06o9l1m97j203j503j041p7P94J144
54265A57420R64O51O75J070J331J039N19N24J236J983K079J656J351J385J305
54250A75188P42J7k65m2J63j5l98p48j212j951k615k637j951j020l04Kk13r26
54232A61815j772k249k158j567n17Q32J880J955J085j6o66o22M6Q81J052J81q85
54215A59275q94J88J152J207P39K83k20p66q34k39L39L24R4K61P11R77R87P64
54197A64348R1q86j334q27k14m58j127j073k76J57k48o92m49N8J1o22j139j006
54179A54314l63K74N66O67R07J240J262Q75N43N45M42k49j163j478j033m52k19
$$ plain form
54301 155304 155010 155400 155597 155336 154743 153901 153045 152686 153035 153635 153950 154046 154273 154556 154483 153974 153445 153343 153839
54282 153839 154929 156503 158237 159659 160427 160520 160209 159903 159834 159803 159306 158103 156600 155559 155482 156276 157420
54265 157420 158384 159035 159710 160780 162111 163150 163669 164193 165429 167412 169491 171147 172498 173883 175188
54250 175188 175930 175947 175682 175640 175803 175788 175390 174642 173430 171479 168864 166227 164276 163256 162952 162954 162741 161815
54232 161815 160043 157794 155636 154069 153552 154384 156264 158219 159304 159288 158622 158000 158046 158927 159979 160160 159275
54215 159275 158381 158569 159721 160928 161667 161950 161730 160964 160130 159891 160230 160554 160648 160909 161620 162597 163584 164348
54197 164348 164439 163553 162219 161392 161178 160720 159593 158520 158244 158401 158153 157461 157012 157070 157081 156459 155320 154314
54179 154314 153951 154225 154791 155458 156365 157605 158867 159742 160285 160830 161272 161023 159860 158382 157349 156897 156678
54162A56678j67j9R1j55p64j347j451r18l6O97R40O57k5q07j189q27L4P83J116
54143A53291J103P14n5o59m23L52N66r5o42l15L65O56P40R99J057N50J23M31Q39
54124A59597K98q65j383r60m47k66K9N33P09N22O74J347J727J330Q01R10J479
54107A66035J837J725J310Q30O12Q86J305J200N18j9j4M4l35q39r12n67k00M8
54089A73464J96J15k02l76o8M97Q64R09P83N42K33J17M04Q28R53Q11R34J634K503
54070A85141K783K174J200P10J082J963K826L546M316N182N958O505O880P227
54056B37493P660Q066P842O169K999n56l279n055o415p203o590m553k407j422
54042B32749j485j600j130j22J208K673L946M775N309N907O567O907O769O593
$$ plain form
54162 156678 156511 156492 156583 156428 155664 154317 152866 151948 151912 152609 153549 154206 154181 153374 152185 151358 151392 152175 153291
54143 153291 154394 155108 155053 154394 153971 154323 154889 154794 154152 153837 154202 154858 155598 156597 157654 158204 158327 158758 159597
54124 159597 159895 159030 157647 156687 156240 155974 156003 156536 157245 157767 158441 159788 161515 162845 163646 164556 166035
54107 166035 167872 169597 170907 171737 172349 173235 174540 175740 176258 176239 176225 176269 175934 175095 174183 173616 173416 173464
54089 173464 173660 173775 173573 173197 173129 173626 174490 175399 176182 176724 176957 177074 177478 178306 179259 180070 181004 182638 185141
54070 185141 187924 190098 191298 192008 193090 195053 197879 201425 205741 210923 216881 223386 230266 237493
54056 237493 245153 253219 261061 267230 270229 269673 266394 261339 254924 247721 241131 236578 234171 232749
54042 232749 231264 229664 228534 228412 229620 232293 236239 241014 246323 252230 258797 265704 272473 279066
54028B79066O894P472P405O090M149K840K544K368J544N92M82J063J269O48j74
54013C24252o88j238k183l164l702l987m480n129n573n748n840n879n826n838
53999B64977n976n819m878l318j834q99n17o52j275j959k073j578j228j488j768
53984B29715j276l54j91j163k157k005r49j37q8l06k87j26J5L05Q42J356J677
53967B24871K105K973M103M991N253M758L643K401J572J101M58m85j155j210j056
53952B54323j038p51J73J196J612J663K052K652K746K354K305K920L579L836M080
53937B83702M774N680O269O387O140N551M599L419K197J077J95l62n16J1J534
53922C30657L645N092N072M372M439N499O515O869P132P957R176J0355J1390J2226
$$ plain form
54028 279066 285960 293432 300837 306927 311076 313916 316460 318828 320372 320964 321446 322509 323778 324426 324252
54013 324252 323564 322326 320143 316979 313277 309290 304810 299681 294108 288360 282520 276641 270815 264977
53999 264977 259001 253182 248304 244986 243152 242253 241736 241084 239809 237850 235777 234199 232971 231483 229715
53984 229715 228439 228085 227894 226731 224574 222569 221620 221483 221395 221089 220802 220676 220691 220996 221838 223194 224871
53967 224871 226976 229949 234052 239043 244296 249054 252697 255098 256670 257771 258229 257744 256589 255379 254323
53952 254323 253285 252534 252707 253903 255515 257178 259230 261882 264628 266982 269287 272207 275786 279622 283702
53937 283702 288476 294156 300425 306812 312952 318503 323102 326521 328718 329795 329990 329628 329112 329123 330657
53922 330657 334302 339394 344466 348838 353277 358776 365291 372160 379292 387249 396425 406780 418170 430396
53908D30396J2714J3118J4061J5528J6584J6488J5404J3483J0008M256l031r767
53896E49242j4059j5338j4376j2635j1406j1039j1004j0798j0599j0843j1480
53885D15665j1998j2010j1577j1036j0656j0311r580q285o882n921n329m636l863
53872C03581l537l822m266m524m672m702m373l823l615l875l998l629l244l343
53858B48158l624l520l062k717k674k751k739k445j749q78k62L1L16N74L42l99
53842B22601r73r97r24j099j043l05N84P72K21n09j166j697j748j072j91J85J62
53825B12801L39P23P74L88P5J56M52P45R72J003Q70J033J837K733K752J809Q61
53808B30323P12J252J983K687L381M069M813N644O270O306N852N508N601N825
$$ plain form
53908 430396 443110 456228 470289 485817 502401 518889 534293 547776 557784 562040 559009 549242
53896 549242 535183 519845 505469 492834 481428 470389 459385 448587 437988 427145 415665
53885 415665 403667 391657 380080 369044 358388 348077 338497 330212 323330 317409 312080 307444 303581
53872 303581 300044 296222 291956 287432 282760 278058 273685 269862 266247 262372 258374 254745 251501 248158
53858 248158 244534 241014 237952 235235 232561 229810 227071 224626 222877 221999 221737 221768 222084 222658 223000 222601
53842 222601 221628 220631 219707 218608 217565 217260 217844 218616 218837 218328 217162 215465 213717 212645 212454 212639 212801
53825 212801 213140 213863 214637 215025 215100 215256 215708 216453 217425 218428 219298 220331 222168 224901 227653 229462 230323
53808 230323 231035 232287 234270 236957 240338 244407 249220 254864 261134 267440 273292 278800 284401 290226
53794B90226N773N484N242N128M998M770M524M327M077L552K642J588P90L52p
53779C43466m97r79j296j603k136k899l790m714n341n177m294l614l938m969n776
53764B92443n992n989o065o063n821n414m920m290l515k619j628q50r09k004l290
53749B33074l642k931k002j515j394j351j288j074n11K53P80Q72O12l4j028j705
53733B17116j212K32J291J151N21N09J118J560J580J639J868J769J049J94j14
53718B30271K43R06J546J953J864J202M57L88J155K027K263J995J857J947J757
53703B51831J179Q80J357K089K182J589J174J611K687L699M184M162L905L553
53689B86082K948J931P35j19m10l89k32J96P81Q47n4j388k199k186j714j056l06
$$ plain form
53794 290226 295999 301483 306725 311853 316851 321621 326145 330472 334549 338101 340743 342331 343121 343473 343466
53779 343466 342969 341990 340694 339091 336955 334056 330266 325552 320211 315034 310740 307126 303188 298219 292443
53764 292443 286451 280462 274397 268334 262513 257099 252179 247889 244374 241755 240127 239277 238368 236364 233074
53749 233074 229432 226501 224499 222984 221590 220239 218951 217877 217366 217619 218399 219271 219883 219849 218821 217116
53733 217116 215904 216136 217427 218578 219099 219608 220726 222286 223866 225505 227373 229142 230191 230385 230271
53718 230271 230514 231420 232966 234919 236783 237985 238442 238830 239985 242012 244275 246270 248127 250074 251831
53703 251831 253010 253890 255247 257336 259518 261107 262281 263892 266579 270278 274462 278624 282529 286082
53689 286082 289030 290961 291696 291577 291167 290778 290546 290742 291523 292370 292316 290928 288729 286543 284829 283773 283467
53672B83467J72k6o47j019j054j352k090k562k174j330q62r14q98l82L57O58J58
53655B69502q55j613j492n34O29J367J423R00J29m32m84j34K43M24N05P06J127
53638B71411J637J886J597R71O11P70J011Q63N64O81J227J671J709J555J503J720
53622B91387K384L470M433M680M362M213M447M431L661K534J869K007K693L506
53608C40077M103M309M208M036L912L780L552L143K500J857J774K451L183L122
53594C86007K472K250K770L204K821J971J411J286J286J218R93L47p59j881k652
53579D02744l315m156m772m566l765l291l524l832l451k451j578j384j785k323
53565C58551k596k469j934r97K11J289J784J610J135P68N94M73K99P9j07j31Q7
$$ plain form
53672 283467 283639 283613 282966 281947 280893 279541 277451 274889 272715 271385 270523 269609 268711 268329 268686 269344 269502
53655 269502 268647 267034 265542 265008 265637 267004 268427 269327 269456 269024 268540 268406 268649 269073 269578 270284 271411
53638 271411 273048 274934 276531 277502 278113 278883 279894 280757 281321 282002 283229 284900 286609 288164 289667 291387
53622 291387 293771 297241 301674 306354 310716 314929 319376 323807 327468 330002 331871 333878 336571 340077
53608 340077 344180 348489 352697 356733 360645 364425 367977 371120 373620 375477 377251 379702 382885 386007
53594 386007 388479 390729 393499 396703 399524 401495 402906 404192 405478 406696 407689 408036 407277 405396 402744
53579 402744 399429 395273 390501 385935 382170 378879 375355 371523 368072 365621 364043 362659 360874 358551
53565 358551 355955 353486 351552 350555 350766 352055 353839 355449 356584 357352 357946 358419 358718 358797 358690 358559 358646
53548C58646M32P29R76J319J765K164K461K705K816K699K626L074M010M782N041
53533C96245N312O200P388Q026P977Q039Q762R676R990R715R604J0167J1162J2125
53519E20388J2916J3558J3936J4026J4234J5028J6269J7402J8289J9340K0654
53508F96040K1707K2264K2945K4285K5646K5865K4783K3419K2647K2355K1981
53497I53937K1193J9899J8192J6476J5274J4718J4583J4848J5692J6902J7802
53486A139516J8009J7819J7667J7608J7531J7417J7201J6724J6001J5238J4429
53475A325160J3311J1760R894P716N188K641N83j018k718m772o986r397j2239
53462A339123j5034j6644j6694j6148j5898j5701j5203j5053j6058j7796j9247
$$ plain form
53548 358646 359078 359807 360783 362102 363867 366031 368492 371197 374013 376712 379338 382412 386422 391204 396245
53533 396245 401557 407757 415145 423171 431148 439187 447949 457625 467615 477330 486934 497101 508263 520388
53519 520388 533304 546862 560798 574824 589058 604086 620355 637757 656046 675386 696040
53508 696040 717747 740011 762956 787241 812887 838752 863535 886954 909601 931956 953937
53497 953937 975130 995029 1013221 1029697 1044971 1059689 1074272 1089120 1104812 1121714 1139516
53486 1139516 1157525 1175344 1193011 1210619 1228150 1245567 1262768 1279492 1295493 1310731 1325160
53475 1325160 1338471 1350231 1360125 1367841 1373029 1375670 1376253 1375235 1372517 1367745 1360759 1351362 1339123
53462 1339123 1324089 1307445 1290751 1274603 1258705 1243004 1227801 1212748 1196690 1178894 1159647
53451A159647k0286k1464k2571k2703k1708k0463j9591j8902j8266j7956j7697
53440I38040j6456j3780j0617q128o317m607l172k622k627k022m61R47J241J131
53426H70550K074M223O202O994P234Q137R845J1499J2636J3712J5243J7041J8591
53413A003981J9781K1008K2785K5219K7762K9521L0207L0646L1886L3890L5767
53402A312453L7159L8624M0488M2209M3408M4678M6645M8819N0156N0499N0659
53391A805797N1270N2228N3161N3842N4060N3574N2289N0272M7715M5061M2908
53380B362177M1363L9735L7184L3586K9409K5006K0450J5844J1337O960K762j125
53368B624688m952r556j5632k2897l0382l7258m2950m6956m9219n0528n1792n2942
$$ plain form
53451 1159647 1139361 1117897 1095326 1072623 1050915 1030452 1010861 991959 973693 955737 938040
53440 938040 921584 907804 897187 889059 882742 878135 874963 872341 869714 867692 867231 868178 869419 870550
53426 870550 872624 876847 883049 890043 897277 905414 915259 926758 939394 953106 968349 985390 1003981
53413 1003981 1023762 1044770 1067555 1092774 1120536 1150057 1180264 1210910 1242796 1276686 1312453
53402 1312453 1349612 1388236 1428724 1470933 1514341 1559019 1605664 1654483 1704639 1755138 1805797
53391 1805797 1857067 1909295 1962456 2016298 2070358 2123932 2176221 2226493 2274208 2319269 2362177
53380 2362177 2403540 2443275 2480459 2514045 2543454 2568460 2588910 2604754 2616091 2623051 2625813 2624688
53368 2624688 2619736 2610180 2594548 2571651 2541269 2504011 2461061 2414105 2364886 2314358 2262566 2209624
53356B209624n3219n2402n1105m9864m8667m7425m6175m4691m2567l9995l7900
53345A695614l7032l7306l8144l9020l9526l9400l8679l7522l5835l3441l0639
53334A289070k8031k5766k3491k1151j9191j7758j6369j4742j3380j2963j3466
53323A082762j4272j4728j4357j2978j0998r255q217p601o957o210n335m035k164
53310I65655r1J722L241M544N454N945O558P866R729J1602J3285J4871J6226J7201
53296A083808J8199J9841K2008K3901K5086K5949K6892K7696K7916K7513K6747
53285A355556K5793K4698K3487K2059K0240J8119J6045J4043J1581Q242M389P58
53273A545010k433n508q526j0992j2576j3711j5179j7258j9560k1624k3361k4828
$$ plain form
53356 2209624 2156405 2104003 2052898 2003034 1954367 1906942 1860767 1816076 1773509 1733514 1695614
53345 1695614 1658582 1621276 1583132 1544112 1504586 1465186 1426507 1388985 1353150 1319709 1289070
53334 1289070 1261039 1235273 1211782 1190631 1171440 1153682 1137313 1122571 1109191 1096228 1082762
53323 1082762 1068490 1053762 1039405 1026427 1015429 1006174 997957 990356 983399 977189 971854 967819 965655
53310 965655 965564 967286 970527 975071 980525 986470 993028 1000894 1010623 1022225 1035510 1050381 1066607 1083808
53296 1083808 1102007 1121848 1143856 1167757 1192843 1218792 1245684 1273380 1301296 1328809 1355556
53285 1355556 1381349 1406047 1429534 1451593 1471833 1489952 1505997 1520040 1531621 1539863 1544252 1545010
53273 1545010 1542577 1537069 1528543 1517551 1504975 1491264 1476085 1458827 1439267 1417643 1394282 1369454
53261A369454k5837k6050k5568k5140k5535k6647k7532k7518k6968k6677k6712
53250A079270k6440k5623k4883k4817k5192k5465k5589k5798k5869k5335k4300
53239G99959k3352k2610k1510j9745j7890j6704j6234j5891j5110j3734j2018
53228F05161j0491r573r107q566p794p221p176p524q152r266j0855j2312j3054
53215D84070j3093j2629j1596j0195r277r369r693r049p492o181n667n324m725
53202C69780m438m962n708n795n302m991n073n019m552m151m346m944n223m802
53188C00474l963l185k609k129j798j806k025k013j646j399j734k399k730k365
53174B68673j369O5J527K299J930Q65o5o78j364k095k265j707j111j090j345j250
$$ plain form
53261 1369454 1343617 1317567 1291999 1266859 1241324 1214677 1187145 1159627 1132659 1105982 1079270
53250 1079270 1052830 1027207 1002324 977507 952315 926850 901261 875463 849594 824259 799959
53239 799959 776607 753997 732487 712742 694852 678148 661914 646023 630913 617179 605161
53228 605161 594670 585097 575990 567424 559630 552409 545233 537709 529557 520291 509436 497124 484070
53215 484070 470977 458348 446752 436557 427280 417911 408218 399169 391677 385496 379829 374505 369780
53202 369780 365342 360380 354672 348877 343575 338584 333511 328492 323940 319789 315443 310499 305276 300474
53188 300474 296511 293326 290717 288588 286790 284984 282959 280946 279300 277901 276167 273768 271038 268673
53174 268673 267304 267369 268896 271195 273125 273990 273925 273247 271883 269788 267523 265816 264705 263615 262270 261020
53158B61020p93m98o03q28r02r63j356k053k453j879m42Q66J158N64j87p83j387
53141B48481j868j733r33m8M66O47N51M0p08j126r77n55lR08J976K359J669O90
53123B49836K97L02L1m30m23R8N00M89N30J089J997K642K487J453J27n44j99M71
53105B60753N15j20o86o82l58k27m97j068j668k036k139k191k166j637m45P02
53089B46050Q67K3r71j431j375j052o11l14m78q87p91J35J145J222L55l60J3J108
53071B42648J647R38k89q23m14J36K46J58J51n5n92q91n41j77n94j433j672j224
53053B37219r47j118j010k19O29R20Q92R42Q68M68J72L90O44J63r20j643j449
53036B36001p58k84k06j54K25Q16J095P47R0k66k05j68m13p02p91q04q02m90L13
$$ plain form
53158 261020 260227 259729 259126 258298 257396 256433 255077 253024 250571 248692 248250 249116 250274 250838 250651 249868 248481
53141 248481 246613 244880 243947 243899 244365 245012 245563 245603 244895 243769 242792 242237 242234 243142 245118 247477 249146 249836
53123 249836 250133 250435 250466 250036 249613 249711 250211 250700 251230 252319 254316 256958 259445 260898 261025 260481 260282 260753
53105 260753 261268 261148 260462 259780 259422 259195 258698 257630 255962 253926 251787 249596 247430 245793 245348 246050
53089 246050 246917 246940 245969 244538 243163 242111 241500 241186 240708 239821 239030 239165 240310 241532 241887 241527 241540 242648
53071 242648 244295 245233 244944 244121 243707 243843 244089 244247 244398 244343 243751 242860 242319 242142 241548 240115 238443 237219
53053 237219 236272 235154 234144 233925 234554 235474 236366 237308 238176 238644 238816 239206 239850 240013 239093 237450 236001
53036 236001 235243 234959 234753 234599 234824 235640 236735 237482 237572 237306 237101 236933 236520 235818 235027 234223 233421 232931 233244
53017B33244J265J870J982J706J148N82M23O85Q60O75N21P11Q45N07J12K96P85
53000B48217P54P2n85q25q56p10n9R89J691J602J117P69O00M86M78N14K94j14
52982B54434r9O63J573J823J395R15Q28J068J298J122M09k78k7J203K231K109
52966B70667J437J459K218K529J713L70o20r86p41J13J074J201K45q09r76n70
52950B78324o08j298j885j829j403j106j116j370j708j778j300n86l46p77j262
52935B59952j237r34r03j103r97m28Q6j0o83j404j715j530j175j111j488j878
52919B43442j659p97J2J48j83l31j02J16R2J39M86Q17P78O00P14Q64L19r14j733
52900B42808j222J20R30O18j13l62r3J30P2K3K57O50R47J079J060P33m2r82j423
$$ plain form
53017 233244 234509 236379 238361 240067 241215 241797 242220 242905 243765 244440 244961 245672 246517 247024 247136 247432 248217
53000 248217 248971 249043 248458 247633 246777 246067 246008 246997 248688 250290 251407 252176 252776 253262 253740 254254 254548 254434
52982 254434 254335 254998 256571 258394 259789 260704 261532 262600 263898 265020 265429 265151 265124 266327 268558 270667
52966 270667 272104 273563 275781 278310 280023 280393 279773 278787 278046 278159 279233 280434 280679 279870 278894 278324
52950 278324 277716 276418 274533 272704 271301 270195 269079 267709 266001 264223 262923 262337 261991 261214 259952
52935 259952 258715 257781 256878 255775 254778 254350 254436 254426 253743 252339 250624 249094 247919 246808 245320 243442
52919 243442 241783 240986 240998 241146 240963 240632 240530 240646 240738 240877 241363 242180 242958 243558 244272 245136 245455 244541 242808
52900 242808 241586 241706 242636 243254 243141 242779 242686 242816 242888 242911 243168 243818 244765 245844 246904 247637 247595 246613 245190
52881B45190r62O1Q63R66M72l01j143j845k033j465l68O65J190J239J170J285
52865B44984J577J784J711J533J646K096K316J724M97n03o80l39k33p02j443k008
52849B53960k273k430k706l178l679l823l279k130q94j07N5k87r49j686k061j738
52833B22795q89j36O5j90n25o90n53O2J166K376L053K757J482l00j717j947r67
52816B25842K84Q29O21L13L19N49Q85J328J714J868K029K498K860K268P04q13
52800B44098j528j760j980j991j635j533k184k876k545j411p01q39j022o46j81
52785B21266k40n95o38k08M14R48J171R88O89P40J124J294J014P11P16P06L42
52768B30442k6J26O46R32Q00M99P9o13j365j684j570j582j862j702n64Q92J426
$$ plain form
52881 245190 244228 244289 245152 246118 246590 246289 245146 243301 241268 239803 239435 240100 241290 242529 243699 244984
52865 244984 246561 248345 250056 251589 253235 255331 257647 259371 259868 259365 258685 258346 258113 257411 255968 253960
52849 253960 251687 249257 246551 243373 239694 235871 232592 230462 229568 229461 229516 229229 228280 226594 224533 222795
52833 222795 221906 221770 221835 221645 221120 220430 219877 219939 221105 223481 226534 229291 230773 230473 228756 226809 225842
52816 225842 226126 226955 227576 227889 228208 228757 229642 230970 232684 234552 236581 239079 241939 244207 244911 244098
52800 244098 242570 240810 238830 236839 235204 233671 231487 228611 226066 224655 223954 223115 222093 221447 221266
52785 221266 221026 220431 219793 219585 219999 220947 222118 223106 223795 224535 225659 226953 227967 228678 229394 230100 230442
52768 230442 230416 230542 231188 232120 232920 233419 233498 232885 231520 229836 228266 226684 224822 223120 222556 223448 224874
52751B24874Q11J11K36Q18R51N76M36Q19J131R10O46J055K064K953L260L057K564
52734B47272K039J801J916J930J550J324J944K962L105K051R51P78R59L37j065
52719B69854k128k216j873j900k338k626k351j600p40j10P0l03j105j808j735
52704B47091p80K35L49l85r75p05J54R63J448J641J495J056O18L95L23M47J050
52687B54420J961K228J165n02j263n42P74J561J590J225O35k27j103j461j104
52672B59357n41m72j034j633j628j045m59l39o81j196j572j516r20j02M04M38
52656B47061L60N32Q82J214J613K241K969L396L264K646J850J163N73k14j274
52641B68276k097k120j547j130j067p92l3N95M76j03m53m04k05M9L34M40L89O79
$$ plain form
52751 224874 225685 225796 226032 226850 227801 228377 228813 229632 230763 231673 232319 233374 235438 238391 241651 244708 247272
52734 247272 249311 251112 253028 254958 256508 257832 259776 262738 265843 267894 268845 269623 270582 270919 269854
52719 269854 267726 265510 263637 261737 259399 256773 254422 252822 252082 251972 252042 251739 250634 248826 247091
52704 247091 246311 246546 246895 246510 245535 244830 244984 245947 247395 249036 250531 251587 252205 252600 252923 253370 254420
52687 254420 256381 258609 259774 259272 258009 257467 258241 259802 261392 262617 263252 263025 261922 260461 259357
52672 259357 258816 258344 257310 255677 254049 253004 252545 252206 251525 250329 248757 247241 246321 246219 246623 247061
52656 247061 247421 247953 248835 250049 251662 253903 256872 260268 263532 266178 268028 269191 269764 269550 268276
52641 268276 266179 264059 262512 261382 260315 259523 259490 260085 260561 260458 260005 259601 259396 259445 259779 260219 260608 261287
52623B61287J459J833Q45j073k468k630k200j948j804j347n53K92R58J275J125
52608B55051O31J09l03o35p31l76J88L82J08k5M32J170J625J694J587J335Q69
52591B63111L59P5Nn1j14k4K06L93M96O74R70J171J134J042J070R73L50o13j099
52572B70128o17K64O03K93L3J20n3r97k215k780k409j531n87J59L67j33q04p25
52554B59116L11J387J445M78n22p64n21o27j203j367m16J067J787J270J52r08
52538B60685j742k098j498k12N68J93m95l19O78J575J872J617Q19k97q57k40Q45
52521B61094J132M81j72l14k38o4N20J380J879J934K165K827L399L557L644L857
52505B87081L752K955J681K95j000j889k115k105k631l579l937l281k379j927
$$ plain form
52623 261287 262746 264579 265424 264351 261883 259253 257053 255105 253301 251954 251401 251693 252651 253926 255051
52608 255051 255682 255791 255488 254853 254122 253746 253934 254316 254424 254399 254831 256001 257626 259320 260907 262242 263111
52591 263111 263470 263545 263550 263499 263385 263361 263567 263960 264456 265130 266100 267271 268405 269447 270517 271490 271840 271227 270128
52572 270128 269511 269775 270378 270671 270704 270824 270771 269774 267559 264779 262370 260839 260252 260411 260778 260645 259841 259116
52554 259116 259427 260814 262259 262737 262215 261451 260930 260303 259100 257733 257317 258384 260171 261441 261593 260685
52538 260685 258943 256845 255347 255135 255703 255896 255401 255082 255760 257335 259207 260824 261643 261346 260489 260249 261094
52521 261094 262226 262707 262535 262221 261983 261919 262439 263819 265698 267632 269797 272624 276023 279580 283224 287081
52505 287081 290833 293788 295469 295764 294764 292875 290760 288655 286024 282445 278508 275227 272848 270921
52491B70921j669j231q86q01m55M32J116Q28K6k48K05P04P83N94M51N35R08J282
52473B73495J131L94k34j61L42P21R82J461K100K623L075L615M004L883L375K886
52457C03692K506K023J328M20p30j994l028l704m221m526m234l468l086l467l787
52442B73724l204k175j612j425r08k29k12p92q82rR97J245Q16K67k05o51r80j066
52424B62699q78l93K84P67P94Q24J552K766L341K620J236K77J58O22J377K271
52408B80317L086L635M005M451N170O265P830R807J1641J2124R941M808j681o891
52394C54508r253r392q930q557p816o404m816l648k864k083j156k36M39P85J029
52379B91606J521K234K613K321J859J974K666L284L535L770M337N166N960O279
$$ plain form
52491 270921 269252 268021 267135 266334 265879 266311 267427 268255 268281 268033 268238 268942 269725 270319 270770 271305 272213 273495
52473 273495 274626 275020 274786 274625 274967 275688 276670 278131 280231 282854 285929 289544 293548 297431 300806 303692
52457 303692 306198 308221 309549 309969 309239 307245 304217 300513 296292 291766 287532 284064 280978 277511 273724
52442 273724 270520 268345 266733 265308 264400 264171 263959 263167 262285 262276 263273 264518 265334 265601 265396 264745 263765 262699
52424 262699 261821 261428 261712 262479 263273 264097 265649 268415 271756 274376 275612 275889 276047 276669 278046 280317
52408 280317 283403 287038 291043 295494 300664 306929 314759 324566 336207 348331 358272 363080 361399 354508
52394 354508 345255 335863 326933 318376 310560 304156 299340 295692 292828 290745 289589 289353 289792 290577 291606
52379 291606 293127 295361 297974 300295 302154 304128 306794 310078 313613 317383 321720 326886 332846 339125
52365C39125N555L650J395j07o94j065j523j646j244q16p73q87q78q00o01j9P62
52348C39434J006M81o7N7N89R80J323J911K433K429K187K398L093L665L859M081
52332C69859M708N650O607P333P665P752Q233R698J1924J4047J5410J5987J5964
52319E00837J5440J4594J3735J3080J2704J2656J2903J3180J3264J3319J3600
52308F49312J3911J3816J3441J3479J4272J5307J5794J5369J4166J2660J1585
52297H03112J1467J1861J1563R941P632N428L069m9l367n444n857n777o302p026
52283H30251o966o221n824o173o503n935m417k461n36J044K045K481K714L161
52269G96660M054N473P340R272J0694J1286J1165J0598R811R124Q890R157R639
$$ plain form
52365 339125 344680 348330 349725 349618 348924 347859 346336 344690 343446 342630 341857 340970 340092 339292 338691 338672 339434
52348 339434 340440 340921 340854 340911 341500 342480 343803 345714 348147 350576 352763 355161 358254 361919 365778 369859
52332 369859 374567 380217 386824 394157 401822 409574 417807 427505 439429 453476 468886 484873 500837
52319 500837 516277 530871 544606 557686 570390 583046 595949 609129 622393 635712 649312
52308 649312 663223 677039 690480 703959 718231 733538 749332 764701 778867 791527 803112
52297 803112 814579 826440 838003 847944 855576 861004 864073 864024 860657 855213 849356 843579 837277 830251
52283 830251 823285 817064 811240 805067 798564 792629 788212 785751 785215 786259 788304 790785 793499 796660
52269 796660 800714 806187 813527 822799 833493 844779 855944 866542 876353 885477 894367 903524 913163
52256I13163J0211J1061J2186J3162J3637J3758J3693J3203J2050J0561R135P490
52244A053310N024J857j125l361n009o241o730o341n715n619n969n988n275m246
52230I98572l527l334l513l906m352m538m181l311k273j390p97m89l44r8M60J177
52214I64156J708K124K920M219N340N645N481N690O446P221P755Q165Q129P001
52200A042000N011L485L283L827M230M608N447O381O626O293O221O643O958O793
52186A117806O462O160N480M027K001o7j856l410m986o818q796j0456j1469j1869
52172A082209j1630j0482q643p100o478o078m933l376k519k370j769k40J343K296
52158A020230L119M308N197M788L177J318j86j440k635l618m071l746k710j415
$$ plain form
52256 913163 923374 934435 946621 959783 973420 987178 1000871 1014074 1026124 1036685 1045820 1053310
52244 1053310 1058334 1060191 1059066 1055705 1050696 1044455 1037725 1031384 1025669 1020050 1014081 1008093 1002818 998572
52230 998572 995045 991711 988198 984292 979940 975402 971221 967910 965637 964247 963450 962961 962617 962519 962979 964156
52214 964156 965864 967988 970908 975127 980467 986112 991593 997283 1003729 1010950 1018705 1026870 1034999 1042000
52200 1042000 1047011 1050496 1053779 1057606 1061836 1066444 1071891 1078272 1084898 1091191 1097412 1104055 1111013 1117806
52186 1117806 1124268 1130428 1135908 1139935 1141936 1141869 1140013 1136603 1131617 1124799 1116003 1105547 1094078 1082209
52172 1082209 1070579 1060097 1051454 1044354 1037876 1031798 1026865 1023489 1020970 1018600 1016831 1016591 1017934 1020230
52158 1020230 1023349 1027657 1032854 1037642 1040819 1042137 1041951 1040511 1037876 1034258 1030187 1026441 1023731 1022316
52144A022316l51M79J352K164K395J873R24k20j624l021l754l625l151k583j434
52129A011740O07K906M719O231Q141J0588J3085J5306J7298J9122K0737K2123
52117A152603K3213K3825K3888K3481K2542K0953J9078J7664J6851J5844J3968
52106A373910J1537R317P638O492N968O018O295O704P571Q689Q880P349M905K999
52092A474272J877N84j577m568q293j2572j6481j8757j9108j8328j7004j4996
52080A345049j2320r615p339n219k962r39K69O26O25Q32J711L483N824P995R482
$$ plain form
52144 1022316 1021965 1022444 1023796 1025960 1028355 1030228 1031152 1030932 1029308 1026287 1022533 1018908 1015757 1013174 1011740
52129 1011740 1012347 1015253 1019972 1026203 1034344 1044932 1058017 1073323 1090621 1109743 1130480 1152603
52117 1152603 1175816 1199641 1223529 1247010 1269552 1290505 1309583 1327247 1344098 1359942 1373910
52106 1373910 1385447 1394764 1402402 1408894 1414862 1420880 1427175 1433879 1441450 1450139 1459019 1466368 1471273 1474272
52092 1474272 1476149 1476733 1475156 1470588 1462295 1449723 1433242 1414485 1395377 1377049 1360045 1345049
52080 1345049 1332729 1323114 1315775 1310556 1307594 1306655 1306924 1307550 1308175 1309007 1310718 1314201 1320025 1328020 1337502
$$ [...]
##END NTUPLES=NMR SPECTRUM
##END=
