##TITLE=AC1419_SALAH12229_7764165_uKqkWjndTX
##JCAMPDX= 6.0         $$ Bruker NMR JCAMP-DX V2.0
##DATA TYPE= NMR SPECTRUM
##DATA CLASS= NTUPLES
##ORIGIN= BRUKER
##OWNER= Administrator
$$ 1.72 TOPSPIN		Version 2.1
$$ 2013-04-11 18:54:43.856 -0700  Administrator@X
$$ Compression mode = diff/dup
##.OBSERVE FREQUENCY= 400.02188249412
##.OBSERVE NUCLEUS= ^1H
##.ACQUISITION MODE= SIMULTANEOUS (DQD)
##.ACQUISITION SCHEME= undefined
##.AVERAGES= 8
##.DIGITISER RES= 22
##SPECTROMETER/DATA SYSTEM= spect
##.PULSE SEQUENCE= zg30
##.SOLVENT NAME= COFFEE_meoh
##.SHIFT REFERENCE= INTERNAL, COFFEE_meoh, 1, 14.98509
##AUDIT TRAIL= $$ (NUMBER, WHEN, WHO, WHERE, PROCESS, VERSION, WHAT)
$$ ##TITLE= Audit trail, TOPSPIN		Version 2.1
$$ ##JCAMPDX= 5.01
$$ ##ORIGIN= Bruker BioSpin GmbH
$$ ##OWNER= Administrator
$$ $$ E:\/data/COFFEE/nmr/AC1419_SALAH12229_7764165_uKqkWjndTX/10/pdata/1/auditp.txt
$$ ##AUDIT TRAIL=  $$ (NUMBER, WHEN, WHO, WHERE, PROCESS, VERSION, WHAT)
(   1,<2013-04-11 18:54:35.637 -0700>,<Administrator>,<X>,<go>,<TOPSPIN 2.1>,
      <created by zg
	started at 2013-04-11 18:53:30.599 -0700,
	POWCHK enabled, PULCHK disabled,
       configuration hash MD5:
       33 CF 6A 21 5C D3 B9 40 6C 15 AA 8D 27 A2 4F 13
       data hash MD5: 64K
       F1 BC 89 3A 89 AB B5 C7 E1 53 3D E6 25 88 7E 8B>)
(   2,<2013-04-11 18:54:38.715 -0700>,<Administrator>,<X>,<proc1d>,<TOPSPIN 2.1>,
      <Start of raw data processing
       efp LB = 0 FT_mod = 6 PKNL = 1 PHC0 = 0 PHC1 = 0 SI = 32K 
       data hash MD5: 32K
       16 47 79 FC 4B 5F 35 DD E1 6D DA 0B B4 E1 27 15>)
(   3,<2013-04-11 18:54:39.184 -0700>,<Administrator>,<X>,<proc1d>,<TOPSPIN 2.1>,
      <pk PHC0 = 96.12488 PHC1 = 0 
       data hash MD5: 32K
       A9 1E AB D5 2C C0 45 24 8A E8 1D 12 6C CF 7F 02>)
(   4,<2013-04-11 18:54:39.402 -0700>,<Administrator>,<X>,<proc1d>,<TOPSPIN 2.1>,
      <abs ABSG = 1 
       data hash MD5: 32K
       D2 44 3C 2C A5 50 0A FA 82 B3 DE 27 C3 62 94 D6>)
(   5,<2013-04-11 18:54:39.559 -0700>,<Administrator>,<X>,<proc1d>,<TOPSPIN 2.1>,
      <abs ABSG = 2 
       data hash MD5: 32K
       EB 5B 56 C7 23 E0 F4 38 6C 57 6E 1A 89 EF B9 EC>)
(   6,<2013-04-11 18:54:39.699 -0700>,<Administrator>,<X>,<proc1d>,<TOPSPIN 2.1>,
      <abs ABSG = 3 
       data hash MD5: 32K
       AD A8 94 34 C4 4A D9 77 50 1A B1 8E 97 FD 95 70>)
(   7,<2013-04-11 18:54:39.840 -0700>,<Administrator>,<X>,<proc1d>,<TOPSPIN 2.1>,
      <abs ABSG = 4 
       data hash MD5: 32K
       DF 70 27 0C FE 6F 77 63 37 C4 7C E4 BF 1B 93 D8>)
(   8,<2013-04-11 18:54:39.996 -0700>,<Administrator>,<X>,<proc1d>,<TOPSPIN 2.1>,
      <abs ABSG = 5 
       data hash MD5: 32K
       5F D3 53 FB C4 39 22 45 82 A6 F7 26 B3 5F 72 BC>)
$$ ##END=
$$ 
$$ $$ hash MD5
$$ $$ BB FB 26 35 7F 0B 3F 80 E7 71 C3 C0 0E 4A 23 E7
##$RELAX= 
##$RELAX= 
##$RELAX= 
##$RELAX= 
##$RELAX= 
##$RELAX= 
##$RELAX= 
$$ Bruker specific parameters
$$ --------------------------
##$DU= <E:\>
##$EXPNO= 10
##$NAME= <AC1419_SALAH12229_7764165_uKqkWjndTX>
$$ [...]
150 150 150 150 150 150 150 150
##$TP07= 0
##$TPNAME0= <>
##$TPNAME1= <>
##$TPNAME2= <>
##$TPNAME3= <>
##$TPNAME4= <>
##$TPNAME5= <>
##$TPNAME6= <>
##$TPNAME7= <>
##$TPOAL= (0..7)
0.5 0.5 0.5 0.5 0.5 0.5 0.5 0.5
##$TPOFFS= (0..7)
0 0 0 0 0 0 0 0
##$TUNHIN= 0
##$TUNHOUT= 0
##$TUNXOUT= 0
##$USERA1= <user>
##$USERA2= <user>
##$USERA3= <user>
##$USERA4= <user>
##$USERA5= <user>
##$V9= 5
##$VALIST= <valist>
##$VCLIST= <CCCCCCCCCCCCCCC>
##$VD= 0
##$VDLIST= <DDDDDDDDDDDDDDD>
##$VPLIST= <PPPPPPPPPPPPPPP>
##$VTLIST= <TTTTTTTTTTTTTTT>
##$WBST= 2048
##$WBSW= 25
##$XGAIN= (0..3)
0 0 0 0
##$XL= 0
##$YL= 0
##$YMAX_a= 651437
##$YMIN_a= -554183
##$ZGOPTNS= <>
##$ZL1= 120
##$ZL2= 120
##$ZL3= 120
##$ZL4= 120
##$ABSF1= 14.98509
##$ABSF2= -5.573092
##$ABSG= 5
##$ABSL= 3
##$ALPHA= 0
##$AQORDER= 0
##$ASSFAC= 0
##$ASSFACI= 0
##$ASSFACX= 0
##$ASSWID= 0
##$AUNMP= <proc_prof1d_extract_pilot.lims>
##$AXLEFT= 0
##$AXNAME= <>
##$AXNUC= <1H>
##$AXRIGHT= 0
##$AXTYPE= 0
##$AXUNIT= <>
##$AZFE= 0.1
##$AZFW= 0.1
##$BCFW= 0
##$BC_mod= 0
##$BYTORDP= 0
##$COROFFS= 0
##$CY= 15
##$DATMOD= 1
##$DC= 0
##$DFILT= <>
##$DTYPP= 0
##$F1P= 0
##$F2P= 0
##$FCOR= 0.5
##$FTSIZE= 32768
##$FT_mod= 6
##$GAMMA= 0
##$GB= 0
##$INTBC= 1
##$INTSCL= 1
##$ISEN= 128
##$LB= 0
##$LEV0= 0
##$LPBIN= 0
##$MAXI= 10000
##$MC2= 0
##$MEAN= 0
##$ME_mod= 0
##$MI= 0
##$NCOEF= 0
##$NC_proc= -8
##$NLEV= 6
##$NOISF1= 0
##$NOISF2= 0
##$NSP= 0
##$NTH_PI= 0
##$NZP= 0
##$OFFSET= 14.98509
##$PC= 1
##$PHC0= 96.12488
##$PHC1= 0
##$PH_mod= 1
##$PKNL= yes
##$PPARMOD= 0
##$PPDIAG= 0
##$PPIPTYP= 0
##$PPMPNUM= 2147483647
##$PPRESOL= 1
##$PSCAL= 4
##$PSIGN= 0
##$PYNMP= <proc.py>
##$REVERSE= no
##$SF= 400.02
##$SI= 32768
##$SIGF1= 0
##$SIGF2= 0
##$SINO= 400
##$SIOLD= 32768
##$SPECTYP= <>
##$SREGLST= <1H.CDCl3>
##$SSB= 0
##$STSI= 32768
##$STSR= 0
##$SW_p= 8223.68421052631
##$SYMM= 0
##$S_DEV= 0
##$TDeff= 65536
##$TDoff= 0
##$TI= <>
##$TILT= no
##$TM1= 0
##$TM2= 0
##$TOPLEV= 0
##$USERP1= <user>
##$USERP2= <user>
##$USERP3= <user>
##$USERP4= <user>
##$USERP5= <user>
##$WDW= 1
##$XDIM= 32768
##$YMAX_p= 461357024
##$YMIN_p= -773093
##$CURPLOT= <Network HP LaserJet P1505>
##$CURPRIN= <$Network HP LaserJet P1505>
##$DFORMAT= <normdp>
##$LAYOUT= <+/1D_H.xwp>
##$LFORMAT= <normlp>
##$PFORMAT= <normpl>
##$SURQMSG= 1
$$ End of Bruker specific parameters
$$ ---------------------------------
##NTUPLES= NMR SPECTRUM
##VAR_NAME=  FREQUENCY,     SPECTRUM/REAL,   SPECTRUM/IMAG
##SYMBOL=    X,             R,               I
##VAR_TYPE=  INDEPENDENT,   DEPENDENT,       DEPENDENT
##VAR_FORM=  AFFN,          ASDF,            ASDF
##VAR_DIM=   32768,         32768,           32768
##UNITS=     HZ,            ARBITRARY UNITS, ARBITRARY UNITS
##FACTOR=    0.250966925370066, 1,           1
##FIRST=     8223.43324360094, -181381,      13870
##LAST=      0,             -132500,         -246608
##MIN=       0,             -773093,         0
##MAX=       8223.43324360094, 461357024,    0
$$ Real data points
##PAGE= N=1
##DATA TABLE= (X++(R..R)), XYDATA
$$ [...]
19580B94669e2269k19587c8696j55196P32Q1098o7664h6638A10164a42101J2250
$$ 294669 -52269 -271856 -38696 -193892 -193160 -112062 -179726 -86638 110164 -142101 -129851
19569a29851A59077L225J64515b19561j58918a49045L5580D4670b25317e3983
$$ -129851 159077 162302 326817 -219561 -378479 -149045 -113465 44670 -225317 -53983
19558b12524D5434b57777j17194I3420a15493j08633B6031L5879A473b59138O8205
$$ -212524 45434 -257777 -374971 93420 -115493 -224126 26031 61910 1473 -259138 -190933
19547a90933A04708b23297a7190A94992M9996R5529I5165R3631C4895L9006j5412
$$ -190933 104708 -223297 -17190 194992 244988 340517 95165 188796 34895 73901 58489
19536E8489M7039a26655o3539k22403f8372F2639h5967B79522H3896J0953h533
$$ 58489 105528 -126655 -190194 -412597 -68372 62639 -85967 279522 83896 94849 -8533
19524c6895q8476d0459m3125B7059J04739E3182a38917C7023h4024l13596A05419
$$ -36895 -125371 -40459 -83584 27059 131798 53182 -138917 37023 -84024 -397620 105419
19512F8426J9434b70078A21340M4856a44747J8945k4955k81783J49098D1987K09426
$$ 68426 87860 -270078 121340 166196 -144747 -125802 -150757 -432540 -283442 41987 251413
19501B51413e25370G0935c8166a1538k12386A16222g0886b3079A01435l1213J99398
$$ 251413 -525370 70935 -38166 -11538 -223924 116222 -70886 -23079 101435 70222 269620
19490B69620j01356a20620k24354H2298j4465e3508a507A31584q331k4062i4558
$$ 269620 168264 -120620 -344974 82298 67833 -53508 -1507 131584 123253 99191 -94558
19478b35469c4956j7631k73367b1635k4693I8765J31216d5852m6965k54403C4188
$$ -235469 -34956 -52587 -325954 -21635 -46328 98765 229981 -45852 -92817 -347220 34188
19466b19134A33877k5559b25931C62282G2980b58270k08473c9181l06329J26738
$$ -219134 133877 108318 -225931 362282 72980 -258270 -466743 -39181 -345510 -218772
19456b18772h0501r0286C2294b8211j72402H809b88258c8959k1785J4762A51279
$$ -218772 -80501 -170787 32294 -28211 -200613 8809 -288258 -38959 -60744 -45982 151279
19444A69382k0084b5189j53213f7990k45266M4334l6153r6792F8723a21140M9248
$$ 169382 149298 -25189 -178402 -67990 -313256 -268922 -305075 -401867 68723 -121140 -71892
19433g1892H100L31912a61838C66275f1726A6972K7732f8166B39614h0797m1481
$$ -71892 8100 340012 -161838 366275 -61726 16972 44704 -68166 239614 -80797 -122278
19422a22278A75721c33325d4798l14017A970c22541c9329m05432a21284a3301
$$ -122278 175721 -333325 -44798 -358815 1970 -322541 -39329 -444761 -121284 -13301
19411h1659j30217c6335j76421G7286a69714I0875c9763j52956q4853K8672b4057
$$ -81659 -211876 -36335 -212756 77286 -169714 90875 -39763 -192719 -277572 -248900 -24057
19399b8556B4969a96614A37790b02900A09762e9563k79040A08286b24375i5086
$$ -28556 24969 -196614 137790 -202900 109762 -59563 -338603 108286 -224375 -95086
19388a34145f395D6206J13129a53730m8418A24392K02224a15150j34474K9234
$$ -134145 -6395 46206 159335 -153730 -202148 124392 326616 -115150 -249624 -220390
19378b20390A2402i308E5713b42069A83431a20544c4047A88339R9609a7873B7464
$$ -220390 12402 -9308 55713 -242069 183431 -120544 -34047 188339 287948 -17873 27464
19366a11979b247D5170d8970k05603G6454L3816d1795F7337a26478F5718b97058
$$ -111979 -2247 45170 -48970 -254573 76454 110270 -41795 67337 -126478 65718 -297058
19354A6271i2342j3515k02477e2822k10775b2628k35276J3646E6300j0115b66340
$$ 16271 -92342 -105857 -308334 -52822 -263597 -22628 -257904 -244258 56300 46185 -266340
19342D585J13437k4270K8099k616h5957l7091c3819C59795a98289k04368B07648
$$ 4585 118022 93752 121851 119235 -85957 -123048 -33819 359795 -198289 -402657 207648
19330i4295G1520o932e30872b54069i3725r229d7306b0816j29048r4780C27857
$$ -94295 71520 64588 -530872 -254069 -93725 -102954 -47306 -20816 -149864 -244644 327857
19318B6937J21800a99561B994R7090a31766L8636j52027G430a20240j64971C00965
$$ 26937 148737 -199561 2994 100084 -131766 -93130 -245157 7430 -120240 -285211 300965
19306H8927A0447c60285J34915j16510I2481a48584N8166A18175Q0040a65572
$$ 88927 10447 -360285 -225370 -341880 92481 -148584 -90418 118175 198215 -165572
19295a79561H8486b36730J4894c8054p2808d1506k6580B60600a50823e644C551
$$ -179561 88486 -236730 -221836 -38054 -110862 -41506 -68086 260600 -150823 -5644 3551
19283d50668b02735f7959j16139k9300d6333B8306R6358d58492a08045j39381
$$ -450668 -202735 -67959 -184098 -213398 -46333 28306 124664 -458492 -108045 -247426
19273b47426h8939b2720j23403B92353a36052o3331C5019c08761J48142d8181
$$ -247426 -88939 -22720 -146123 292353 -136052 -199383 35019 -308761 -160619 -48181
19262H6722A7709J51128b77986F4720i2434j17624A50035m0106i3803A826a79606
$$ 86722 17709 168837 -277986 64720 -92434 -210058 150035 109929 -93803 1826 -179606
19250a74522A22616D9313g746n0222F1875f6529A08442e33054A50202b0384m22789
$$ -174522 122616 49313 -7746 -57968 61875 -66529 108442 -533054 150202 -20384 -443173
19239d43173f0292j72790h3356j66433A66382b06693c9129r9929a3227C4216a3912
$$ -443173 -60292 -233082 -83356 -249789 166382 -206693 -39129 -139058 -13227 34216 -13912
19227a41425K4864p1928C34076E7165J153b84038Q9990E5208j5311g6516C4647
$$ -141425 -116561 -188489 334076 57165 58318 -284038 -194048 55208 39897 -76516 34647
19215A29401c22024G1135f4237b137k0530A8020R071J41328A946a27622p3323
$$ 129401 -322024 71135 -64237 -2137 -22667 18020 27091 168419 1946 -127622 -200945
19204b00945A71952j940N0223c9326E3794b43644a12188b111B701J52130c72377
$$ -200945 171952 170012 220235 -39326 53794 -243644 -112188 -2111 2701 154831 -372377
19192D0983a47102l3055P3891j30181l1203c1451A29818a08372k02358q9299e2484
$$ 40983 -147102 -180157 -106266 -236447 -267650 -31451 129818 -108372 -310730 -400029 -52484
19180D7847L8058l5452g4534m3694A5266D596h8660B1274a34642B96273b22360
$$ 47847 85905 50453 -74534 -118228 15266 4596 -88660 21274 -134642 296273 -222360
19168A55139h0852j24014B26164e1441k30029B50328F8663K03162a58515J8255
$$ 155139 -80852 -204866 226164 -51441 -281470 250328 68663 271825 -158515 -140260
19158a40260n6330c3217C77588A59437J18621A14675O584i5556n8859I6390d683
$$ -140260 -196590 -33217 377588 159437 278058 114675 121259 -95556 -154415 96390 -4683
19146b79574f0601j46579J3149O1069e5114m4523m05958J71090e6655k70857B86809
$$ -279574 -60601 -207180 -194031 -132962 -55114 -99637 -505595 -334505 -56655 -327512 286809
19134g6724E7626b53587A6692a8484n5402A75569a66034A36817a7508j76153K1236
$$ -76724 57626 -253587 16692 -18484 -73886 175569 -166034 136817 -17508 -193661 -172425
19123a72425I1522R1063a05789p1930G199a13871A3964J53144g9486B26520g4088
$$ -172425 91522 182585 -105789 -177719 7199 -113871 13964 167108 -79486 226520 -74088
19111A4638b53875I0071f4886L0701k15640i2034J4435j19155g393L019A6563
$$ 14638 -253875 90071 -64886 -34185 -249825 -92034 -77599 -196754 -7393 -4374 16563
19099a70588A72375i8776J2570I3731O654h7800k45371a47087F9066C2641a35376
$$ -170588 172375 -98776 -86206 93731 100385 -87800 -333171 -147087 69066 32641 -135376
19087B23437p0573e4870G7171K6763k7705e5897j15626O7736g478A48510j2083
$$ 223437 152864 -54870 77171 103934 76229 -55897 -171523 -103787 -7478 148510 136427
19076A36427a4891j55184o594Q3504B719d4893J7219k7594k02527a7138H1700
$$ 136427 -14891 -170075 -176669 -93165 2719 -44893 -27674 -55268 -257795 -17138 81700
19064H3673b2452j88258C8922a5330D6778a80861I6500P0000n2629B9055a4038
$$ 83673 -22452 -210710 38922 -15330 46778 -180861 96500 166500 113871 29055 -14038
19052H8933b1702j80459E5853a97736P7533j35325J10418A97249a17279B5243
$$ 88933 -21702 -202161 55853 -197736 -120203 -255528 -145110 197249 -117279 25243
19041a32948m0309k9132A1811b11799C2370R8748a03364k69199B7024a80968R0350
$$ -132948 -173257 -202389 11811 -211799 32370 131118 -103364 -372563 27024 -180968 -90618
19030i0618j99788H5006e7835j82731D9505j326B1430g3262A86431D224J71834
$$ -90618 -290406 85006 -57835 -240566 49505 48179 21430 -73262 186431 4224 176058
19019A76058K2908a57960g1141A83642E4122r180J05612a3900j1801a232l05837
$$ 176058 198966 -157960 -71141 183642 54122 44942 150554 -13900 -25701 -1232 -307069
19008c07069a8764j40686r3386N1166k68259a45437k0825A6376b84892a02677
$$ -307069 -18764 -159450 -252836 -201670 -469929 -145437 -166262 16376 -284892 -102677
18997h317o6204K5987l1314n9401M8672j87337d3550k7523A22704J14946e73306
$$ -8317 -74521 -48534 -79848 -139249 -90577 -277914 -43550 -71073 122704 237650 -573306
18985b32301J00366O139F3245f0906j05300B60800E4134j8110N0972a48981k89565
$$ -232301 -131935 -125796 63245 -60906 -166206 260800 54134 36024 86996 -148981 -438546
18974d38546e6649k1884b0451H448a86584A17623a25388j53714f9070F6304c00254
$$ -438546 -56649 -78533 -20451 8448 -186584 117623 -125388 -279102 -69070 66304 -300254
18962B50785A8057c5871C4274c54714J73369B49126k2971h5539E5893e9707B73016
$$ 250785 18057 -35871 34274 -354714 -181345 249126 226155 -85539 55893 -59707 273016
18950d7891j76180e7588l1718F3756d10333D0157e769j43169N2967M5036k4572
$$ -47891 -224071 -57588 -89306 63756 -410333 40157 -5769 -148938 -95971 -50935 -75507
18939g5507D8727e2778G6276a57654b3330B81957B0064a2326l17662J63592a7448
$$ -75507 48727 -52778 76276 -157654 -23330 281957 20064 -12326 -329988 -166396 -17448
18927f900j45811A86436b29923O4766E7655J487g5020A9263J1682d5814m14815
$$ -6900 -152711 186436 -229923 -165157 57655 59142 -75020 19263 30945 -45814 -460629
18916d60629C4053a72239D6694b05703J1006A45204d2804N145C6598a20433F0855
$$ -460629 34053 -172239 46694 -205703 -194697 145204 -42804 -37659 36598 -120433 60855
18904b39768N0196A9173o480a42628C01118a45140b0164A1787b46703B13765g8146
$$ -239768 -189572 19173 12693 -142628 301118 -145140 -20164 11787 -246703 213765 -78146
18892c7769j3743k38965A53435k7006b94097a44564N754k74568B9992Q7489a62933
$$ -37769 -51512 -290477 153435 126429 -294097 -144564 -138810 -413378 29992 117481 -162933
18880d5431B3845a47245J4260B33963a59260q1787f0673p2906A90443C5949J96494
$$ -45431 23845 -147245 -132985 233963 -159260 -241047 -60673 -133579 190443 35949 232443
18869B32443i9538H7998g5674q9515G3066a14692j01691j6013j98279b02333j33636
$$ 232443 -99538 87998 -75674 -165189 73066 -114692 -216383 -232396 -430675 -202333 -335969
18858c35969f6713A87633c4568p4773j0317m059G9867a14159j20338n8456B60507
$$ -335969 -66713 187633 -34568 -109341 -119658 -123717 79867 -114159 -234497 -292953 260507
18846A19377a87059B37340c856m458G8984f9619j54959F1167b960A27826a63200
$$ 119377 -187059 237340 -3856 -8314 78984 -69619 -224578 61167 -2960 127826 -163200
18834a46048F721L26007b03755P8751F457R0358i8741C7365a44262c6222C32602
$$ -146048 6721 332728 -203755 -125004 6457 96815 -98741 37365 -144262 -36222 332602
18822g1963o1386K8723G5457b49798C06406D4585K78858j01663a65369H756c74490
$$ -71963 -133349 -104626 75457 -249798 306406 44585 323443 221780 -165369 8756 -374490
18810C7060K3235J86883a44008A41252i472f49j54072j70997h9025m6546G1606
$$ 37060 60295 247178 -144008 141252 -9472 -649 -154721 -325718 -89025 -135571 71606
18798a87198c3534i443l6156D1196i0492K0745B3003b36276l0840i1630j31738
$$ -187198 -33534 -9443 -45599 41196 -90492 -69747 23003 -236276 -267116 -91630 -223368
18787b23368R2755b9230l03017B9726L36815M2436b28B17513H5894I131M7813
$$ -223368 -130613 -29230 -332247 29726 366541 408977 -228 217513 85894 9131 56944
18776E6944b28100M8752A64277d42278a12106A71P715N9616b70656d3554k06052
$$ 56944 -228100 -179348 164277 -442278 -112106 171 7886 67502 -270656 -43554 -249606
18765b49606H796J66110c27756a37558C47291j60551f5983p1152B4011L327J35429
$$ -249606 8796 174906 -327756 -137558 347291 186740 -65983 -137135 24011 27338 162767
18754A62767c73120B64623c7051A02369D0789a89887M8097A22009L7232a39481
$$ 162767 -373120 264623 -37051 102369 40789 -189887 -141790 122009 159241 -139481
18743a18574m9280a9901A42659r348g8171A50211d3831k69197H9881a82961l3444
$$ -118574 -167854 -19901 142659 133311 -78171 150211 -43831 -313028 89881 -182961 -216405
18732b16405L6804b104A23854a37328B4059n498J48550A1507L91550a56090j33942
$$ -216405 -179601 -2104 123854 -137328 24059 18561 167111 11507 403057 -156090 -290032
18721b90032K4981J18856A58703b31648C7514b24749q124j34977B1071c39454
$$ -290032 -265051 -146195 158703 -231648 37514 -224749 -232873 -367850 21071 -339454
18710a60812a8097j1171G1309J05750a344j16062A1960a65172A35372a27093F5361
$$ -160812 -18097 -29268 71309 177059 -1344 -117406 11960 -165172 135372 -127093 65361
18698I9820q246m0671a72100N6412o419A70908b50534a16346A2597c3553A09453
$$ 99820 91574 50903 -172100 -115688 -122107 170908 -250534 -116346 12597 -33553 109453
18686A45031d201k299r7537A72850a2000p1409K4676q0239j10052j2849O2855
$$ 145031 -4201 -6500 -104037 172850 -12000 -83409 -58733 -138972 -249024 -261873 -199018
18675a99018B21569A03493L26917b05277G092a03495I8872b16591p2471a3938
$$ -199018 221569 103493 430410 -205277 7092 -103495 98872 -216591 -289062 -13938
18664A67662a16735c0900j5522O358m14672G3335b7745j7997j45437p3554b5531
$$ 167662 -116735 -30900 -46422 -40064 -454736 73335 -27745 -45742 -191179 -264733 -25531
18652A07941a89409D4044c23112a1824k52786c9230A2468J7002a18295B19448
$$ 107941 -189409 44044 -323112 -11824 -264610 -39230 12468 29470 -118295 219448
18641b5399E246b51779A2827K1188p556Q3220b5005j71564A5034b53114C6097
$$ -25399 5246 -251779 12827 34015 26459 109679 -25005 -196569 15034 -253114 36097
18629a29135A56669A8043b1814j49139N9765c1149j71368i9545n4046h236r6779
$$ -129135 156669 18043 -21814 -170953 -111188 -31149 -202517 -99545 -153591 -8236 -105015
18618a05015H3986i3792a3352G8998f8111q6834K5078m3046F9118f0359n2497
$$ -105015 83986 -93792 -13352 78998 -68111 -154945 -129867 -172913 69118 -60359 -112856
18607a12856j17415f0972m7440j30240N0415A33476b42021J02001H78K01377a91074
$$ -112856 -230271 -60972 -108412 -238652 -188237 133476 -242021 -140020 878 202255 -191074
18595a8619j70283E6340a43537a158l57815f3365j34815K8880M5995G4286a80851
$$ -18619 -188902 56340 -143537 -1158 -358973 -63365 -198180 -169300 -123305 74286 -180851
18583i5406j7604b1486j25481H6017L2494K77579g9978L5334j15554m9416A45529
$$ -95406 -113010 -21486 -146967 86017 118511 396090 -79978 -44644 -160198 -209614 145529
18571a17305j39696f548o7013r907A61251o8779A9850N1504O2822G785b2406A8007
$$ -117305 -257001 -6548 -73561 -83468 161251 92472 19850 71354 134176 7785 -22406 18007
18558a04169m3678l0943A09861b01723o4733A1775g6885E38406a76331j29368
$$ -104169 -147847 -178790 109861 -201723 -266456 11775 -76885 538406 -176331 -305699
18548c05699A0858M9921a16310j019J1029c2413j44031b9053j29557p7076B33483
$$ -305699 10858 60779 -116310 -117329 -106300 -32413 -176444 -29053 -158610 -235686 233483
18536A54378p4157J02549G4356a02318B34236b48431f2289o2232A61517a69338
$$ 154378 80221 182770 74356 -102318 234236 -248431 -62289 -124521 161517 -169338
18525a96091J2694J1627b7760j38997F8598Q981e9836l92605B72862A3923g6277
$$ -196091 -183397 -171770 -27760 -166757 68598 77579 -59836 -452441 272862 13923 -76277
18513b52551A47787b02407h5653I4234Q330h5322k30555H3793O0623B03e3025
$$ -252551 147787 -202407 -85653 94234 102564 -85322 -315877 83793 144416 203 -53025
18501F5209a45983A15249b08449A3360a03719m9697A87527b17255J00187d040
$$ 65209 -145983 115249 -208449 13360 -103719 -153416 187527 -217255 -117068 -4040
18490b12759k49480i1638p5197L6089K0298a8627r5367K8576j59609C3058b58764
$$ -212759 -462239 -91638 -166835 -130746 -110448 -18627 -113994 -85418 -245027 33058 -258764
18478F4200h2318A48537J82619c38157N1145A71618a02910A11982a93832B76345
$$ 64200 -82318 148537 331156 -338157 -287012 171618 -102910 111982 -193832 276345
18467E2234p62b95214J25511E6547K03674g372m8059l63051F2152c08822M9800
$$ 52234 51472 -295214 -169703 56547 260221 -7372 -55431 -418482 62152 -308822 -259022
18456b59022f1751a9267d586B6669b4824k72648B16750d52786b5253k6063F0130
$$ -259022 -61751 -19267 -4586 26669 -24824 -297472 216750 -452786 -25253 -51316 60130
18444a04675H7025e2142a3295k640A45098a0136C8667Q0943h2067j87058G1282
$$ -104675 87025 -52142 -13295 -15935 145098 -10136 38667 119610 -82067 -269125 71282
18432c6232E7427b14428d290a207k09264B06612q3224N8404a32908k92946A48284
$$ -36232 57427 -214428 -4290 -1207 -210471 206612 123388 181792 -132908 -425854 148284
18420b52658b453B7806Q3122b59518i2772k2719c3639D4720a43458b6274A0228
$$ -252658 -2453 27806 110928 -259518 -92772 -115491 -33639 44720 -143458 -26274 10228
18408B8534f8065A72556P360c0929a3964k33070G9158K77188a72440n4430h5431
$$ 28534 -68065 172556 179916 -30929 -13964 -247034 79158 356346 -172440 -226870 -85431
18396C39445b14073I4569a41471H114L3329a21435M7106j43358E1565f6879a4240
$$ 339445 -214073 94569 -141471 8114 41443 -121435 -74329 -217687 51565 -66879 -14240
18384A9951M0214b77558f7616j66951a0419l47160J04635N0913F8934l703a21605
$$ 19951 60165 -277558 -67616 -234567 -10419 -357579 -252944 -202031 68934 65231 -121605
18372g753k58363c2102j84436A53149p2303J22036F2275A8559b02520A00006i4876
$$ -7753 -266116 -32102 -216538 153149 80846 202882 62275 18559 -202520 100006 -94876
18360A79414a52807f4996j15677K0801N7052C1639O4582Q9606e2895B2046a86663
$$ 179414 -152807 -64996 -180673 -159872 -102820 31639 96221 185827 -52895 22046 -186663
18348A43926b63164h3262c0584C19088b10830N3541A62653b82832d7486j24219
$$ 143926 -263164 -83262 -30584 319088 -210830 -157289 162653 -282832 -47486 -171705
18338a71705A1939d31407a62697I8032b16110c5763j13404K9244j40624a08108
$$ -171705 11939 -431407 -162697 98032 -216110 -35763 -149167 -119923 -260547 -108108
18327b66100A49456n6742a8264A43242d098A73762o4160b88590B9300d8016k733
$$ -266100 149456 92714 -18264 143242 -4098 173762 109602 -288590 29300 -48016 -50749
18316e0749k21057B60458A02023c891j0491k8127k74578A0727K8046h5317C03988
$$ -50749 -271806 260458 102023 -3891 -14382 -42509 -317087 10727 38773 -85317 303988
18304a00686A24178b62595m3277F7796J98925G626K2639K29420I8613Q477b33311
$$ -100686 124178 -262595 -305872 67796 266721 7626 30265 259685 98613 107090 -233311
18292i5208A65415C0991P0236N687J24041b01126B3265b018n5478j6723I5497
$$ -95208 165415 30991 101227 106914 230955 -201126 23265 -2018 -57496 -74219 95497
18280c45889d5809E6548B5604a08790J5596E2267b39399J15407i064j52123j87050
$$ -345889 -45809 56548 25604 -108790 -93194 52267 -239399 -123992 -9064 -161187 -348237
18269c48237A93731h1279H3773R9050B8810A2241J51425e9376a6672B7370a23568
$$ -348237 193731 -81279 83773 182823 28810 12241 163666 -59376 -16672 27370 -123568
18257a47107B09213G914J81435b73318A02872a28278o7306G4074a9486B46078
$$ -147107 209213 7914 189349 -273318 102872 -128278 -195584 74074 -19486 246078
18246a24121B77022a19843q8185h3537r7015N2558k84348L9327a17459d9662B5485
$$ -124121 277022 -119843 -208028 -83537 -180552 -127994 -412342 -373015 -117459 -49662 25485
18234A28688M3360g6157j7353A6800i074F3767b15836D8257a55947I0670c76226
$$ 128688 172048 -76157 -93510 16800 -9074 63767 -215836 48257 -155947 90670 -376226
18222A29600J50429h3771j94404b2134A20506a42631J0064A29534d53461A37046
$$ 129600 280029 -83771 -278175 -22134 120506 -142631 -132567 129534 -453461 137046
18211a04025j68197A3794d5002C6609a75269n3424a08770c3396q2143H9977R5407
$$ -104025 -272222 13794 -45002 36609 -175269 -228693 -108770 -33396 -115539 89977 185384
18200A85384R7293a66214G8131R0646c36977C0601i7908n6758n0544F1671A7738
$$ 185384 282677 -166214 78131 168777 -336977 30601 -97908 -154666 -205210 61671 17738
18188h0657j41494A06329a4598k65598f4303k3779k45269m3045B45189b9392A22618
$$ -80657 -222151 106329 -14598 -280196 -64303 -88082 -333351 -376396 245189 -29392 122618
18176D92818h4419A58188a81330j42698A55641c6577q852k23175A29409A0789
$$ 492818 -84419 158188 -181330 -324028 155641 -36577 -45429 -268604 129409 10789
18165A58454b3608l28153A92583a30290I7317g9570G1545a99177A15387a85631
$$ 158454 -23608 -351761 192583 -130290 97317 -79570 71545 -199177 115387 -185631
18154a50212j32365J37317j59508h046H9097O8474c92024I9390a22467J0447M3512
$$ -150212 -282577 -145260 -304768 -8046 89097 157571 -392024 99390 -122467 -112020 -68508
18143f8508B24375G553Q6622C2126r883a23870H7632d633j6595q4298j29502i621
$$ -68508 224375 7553 94175 32126 22243 -123870 87632 -4633 -21228 -105526 -235028 -9621
18130c36681O2082A86841l3061p4130f1064a6499l00851E6797b4046l06035a21695
$$ -336681 -274599 186841 153780 79650 -61064 -16499 -317350 56797 -24046 -330081 -121695
18118A79357E6903d14212b8555l9988B49808i3466m26086g0388C313J03558B5281
$$ 179357 56903 -414212 -28555 -68543 249808 -93466 -519552 -70388 3313 106871 25281
18106D5188K23152c3230B43810j14691D2275I068i0877j02053p846C3023a21175
$$ 45188 268340 -33230 243810 129119 42275 9068 -90877 -192930 -200776 33023 -121175
18094g5595A69174o6953l1661J29847L1592d3253k10942g6551j00467d3065A64559
$$ -75595 169174 102221 70560 200407 231999 -43253 -254195 -76551 -177018 -43065 164559
18082B24300m1573j8915f3178j31354F9811k5865N4866j9856b34701A34229e2862
$$ 224300 182727 163812 -63178 -194532 69811 43946 98812 78956 -234701 134229 -52862
18070a20213j0083j00350B00128c46287B464L18328A19520a00151q4428I1155
$$ -120213 -130296 -230646 200128 -346287 2464 320792 119520 -100151 -184579 91155
18059h4348j50479h6500A77802R939R2645b40873h6277p9756A23293c08349B7086
$$ -84348 -234827 -86500 177802 187741 280386 -240873 -86277 -166033 123293 -308349 27086
18047C7282a37465f6071k07477N9417G7274a91194A27710D2332A2778J16888r927
$$ 37282 -137465 -66071 -273548 -214131 77274 -191194 127710 42332 12778 129666 119739
18036A19739a90091A03780c01154R5726A76655a65676O8225d886j58467C9466
$$ 119739 -190091 103780 -301154 -205428 176655 -165676 -97451 -4886 -163353 39466
18025G981M781L8915a77538A45475a95286l479j77689d5063j37396A17996a02322
$$ 7981 12762 51677 -177538 145475 -195286 -198765 -376454 -45063 -182459 117996 -102322
18013d32618h6415k11885d3115k88117i5198A00956K5385e9954J4311m7996M4867
$$ -432618 -86415 -298300 -43115 -331232 -95198 100956 126341 -59954 -45643 -93639 -48772
18002d8772k60694a21864l981F1182c27603B21693d1779G145a30837B7979R0118
$$ -48772 -309466 -121864 -125845 61182 -327603 221693 -41779 7145 -130837 27979 118097
17991A18097e1890A4549c10379A7387b4787B41836b63959A58682c475j63225I0833
$$ 118097 -51890 14549 -310379 17387 -24787 241836 -263959 158682 -3475 -166700 90833
17979a9653H2768N1157J03637H1977a60537j0801C41253i3451K336m7607B849
$$ -19653 82768 133925 237562 81977 -160537 -171338 341253 -93451 -91115 -138722 2849
17967b27543D1033c51739A26234D2880g7309L1842a169A45766c15516H341b20048
$$ -227543 41033 -351739 126234 42880 -77309 -45467 -1169 145766 -315516 8341 -220048
17955a84391j8533c0092B29241a02364l39520a03459A82802D2627b3155B46892
$$ -184391 -202924 -30092 229241 -102364 -441884 -103459 182802 42627 -23155 246892
17944a59m56303A35769J3282b1671q7770G0121K55159k1988D6732J11927K01173
$$ -159 -456462 135769 149051 -21671 -109441 70121 325280 303292 46732 158659 359832
17933C59832c8619A89039a32202H4393d4039A51936c15465b7342p9949C1971a04190
$$ 359832 -38619 189039 -132202 84393 -44039 151936 -315465 -27342 -107291 31971 -104190
17921c4187k96558G1345J7166a10743a4922l1605a6813m5014K11B04553D4640
$$ -34187 -330745 71345 88511 -110743 -14922 -46527 -16813 -61827 -61616 204553 44640
17909b20587R9642B7225b46644A85978b21711a3735j74228A07906D5446O9618
$$ -220587 -120945 27225 -246644 185978 -221711 -13735 -187963 107906 45446 115064
17899A15064a7919E3068a4438j31519A2587J6666Q6888J43408m4755a00080N560
$$ 115064 -17919 53068 -14438 -145957 12587 29253 116141 259549 214794 -100080 -94520
17888i4520B30228a7249j93569j820N0147d6164I4284a60393C53761h899C8605
$$ -94520 230228 -17249 -210818 -212638 -162491 -46164 94284 -160393 353761 -8899 38605
17876F7916J63343c78811f8886j3943a5452q4615A10785i5699k02863B41227F9261
$$ 67916 231259 -378811 -68886 -82829 -15452 -100067 110785 -95699 -298562 241227 69261
17864H4210J58230D334J73137O649a84839C52183h7841L540o310B79355E4958
$$ 84210 242440 4334 177471 184120 -184839 352183 -87841 -84301 -90611 279355 54958
17852D4541b43796A75472g0444k59742I2790M2225m4834L8915c06977G7806i6107
$$ 44541 -243796 175472 -70444 -330186 92790 135015 90181 129096 -306977 77806 -96107
17840b10499A40104g3627c5096o3537B25401j00056h3655B60539D386b58814B01155
$$ -210499 140104 -73627 -35096 -98633 225401 125345 -83655 260539 4386 -258814 201155
17828b63901e4738A94830k3055c36655J27311i4885d5373q1059A25097c72207
$$ -263901 -54738 194830 171775 -336655 -209344 -94885 -45373 -126432 125097 -372207
17817B49465D6804d7751G3757a63084j52057A51897K651Q4053F4038J01428j9245
$$ 249465 46804 -47751 73757 -163084 -315141 151897 154548 238601 64038 165466 146221
17806A46221G1738l2553O7264i0119B25306c56932C16598N5481e5474G9763B4839
$$ 146221 71738 39185 106449 -90119 225306 -356932 316598 372079 -55474 79763 24839
17794b03700f2706L0802n7245k27675A8339O4790b05896f784j47163A02017M2629
$$ -203700 -62706 -31904 -89149 -316824 18339 83129 -205896 -6784 -153947 102017 144646
17783A44646M3637a30779B12178G5866a43563A81045a50065A68971J08759b58559
$$ 144646 188283 -130779 212178 75866 -143563 181045 -150065 168971 277730 -258559
17772A20687f784A4024b5225k41867h568j96063A15969B6741a27791q1530O1471
$$ 120687 -6784 14024 -25225 -267092 -8568 -204631 115969 26741 -127791 -209321 -147850
17761a47850j5617B2533J34964J75205a20208A15457c5444K441H3565D110j219
$$ -147850 -163467 22533 157497 332702 -120208 115457 -35444 -33003 83565 4110 2891
17750B891O2017C0318L00731F7672R7204B4088J63114h2672C04429B5878J36654
$$ 2891 64908 30318 331049 67672 164876 24088 187202 -82672 304429 25878 162532
17739A62532e2238g251H023M15056a47575M3084K4920n6400A28146a86649e757
$$ 162532 -52238 -7251 8023 423079 -147575 -104491 -79571 -135971 128146 -186649 -5757
17727B1625R8024e6287C37689A64516a12446A77187g2944B3978P520K8707M633
$$ 21625 119649 -56287 337689 164516 -112446 177187 -72944 23978 31498 60205 64838
17716F4838J9107a97799A82724O0410D4627h0292K6400B6550j1163K05749D0933
$$ 64838 83945 -197799 182724 243134 44627 -80292 -53892 26550 15387 221136 40933
17704g3924B51254a62503F618N5758a72243A436a57057m395N9765j92385d6845
$$ -73924 251254 -162503 6618 62376 -172243 1436 -157057 -161452 -101687 -294072 -46845
17692A84543p7315c3783C7459P0671G772a52256K6226A27881K04599r9193a86287
$$ 184543 107228 -33783 37459 108130 7772 -152256 -126030 127881 332480 233287 -186287
17680C7963i8870m6047D1436c41286A54613r620c4712l0731D04400j80006a85256
$$ 37963 -98870 -144917 41436 -341286 154613 144993 -34712 -65443 404400 224394 -185256
17668A92536a4465B1710a69044O3451J3707b7177j52906j97783J08766O2913C54570
$$ 192536 -14465 21710 -169044 -105593 -91886 -27177 -180083 -377866 -269100 -206187 354570
17656F4398e8429A84981B3505b1934E1130q509a78440A68e8668B25916B6817b11100
$$ 64398 -58429 184981 23505 -21934 51130 42621 -178440 168 -58668 225916 26817 -211100
17643a37658E47752a6364j0086p2698A1058g0670A45879a13643c6267A09750P2901
$$ -137658 547752 -16364 -26450 -99148 11058 -70670 145879 -113643 -36267 109750 182651
17632A82651c25661B7034c6274H6170k7717i7356B29106C6136J04152a34564E4932
$$ 182651 -325661 27034 -36274 86170 58453 -97356 229106 36136 140288 -134564 54932
17620H3422i271B14958b17466c3400k48004a3412B7240a0878A73900Q7079c03443
$$ 83422 -9271 214958 -217466 -33400 -281404 -13412 27240 -10878 173900 260979 -303443
17608C9102J55614a1603A12940a99268b8895j8042J0861A19284C1936b2774G3993
$$ 39102 194716 -11603 112940 -199268 -28895 -46937 -36076 119284 31936 -22774 73993
17596f759A96872h9463d0530A28431J36667a1206E5633a80895A0015K5195d6515
$$ -6759 196872 -89463 -40530 128431 265098 -11206 55633 -180895 10015 35210 -46515
17584a05547f5A1910a15979B14138a80886M3759A75894c1231m55A4895R8425m8647
$$ -105547 -65 11910 -115979 214138 -180886 -137127 175894 -31231 -31686 14895 113320 64673
17572F4673L2005L48339A56975h8346E0850J7518e5993A59270b44649a8319A1859
$$ 64673 96678 445017 156975 -88346 50850 68368 -55993 159270 -244649 -18319 11859
17560B12744N2788A13497K50552I5934J48581j2737L5053c62584B83870E4330
$$ 212744 265532 113497 364049 95934 244515 231778 266831 -362584 283870 54330
17549h3205B58289p4342D5616R8834a9337C0840J18552f2566B53758g4775B78202
$$ -83205 258289 183947 45616 144450 -19337 30840 149392 -62566 253758 -74775 278202
17537a82054n5606I5659a00392A62833c8402a7989r7874b7226C94413m2634j70552
$$ -182054 -237660 95659 -100392 162833 -38402 -17989 -115863 -27226 394413 351779 181227
17526A81227b58587B73831a86979A28007m0170J34142J12004L3370J44673F8202
$$ 181227 -258587 273831 -186979 128007 87837 221979 333983 367353 512026 68202
17515E4878M5274l0809M1652k5285K6179J6834L4874i002B68787H715K44976o8635
$$ 54878 100152 69343 110995 85710 111889 128723 163597 -9002 268787 8715 253691 185056
17503A85056n0722i9042A24953K49290a47546A61500a38022E6626b3032H4598
$$ 185056 134334 -99042 124953 374243 -147546 161500 -138022 56626 -23032 84598
17492a97480C05548A564L42322f7949C29517a8238b344q0478K8576k9292h230
$$ -197480 305548 1564 343886 -67949 329517 -18238 -2344 -82822 -54246 -83538 -8230
17480D4121J24499L4956d7086D9270K00994a76461C95839A56751J05501B6267
$$ 44121 168620 203576 -47086 49270 250264 -176461 395839 156751 262252 26267
17469A98942d7307I3145K91546b01178E45621a45492B38033H789L43108a56985
$$ 198942 -47307 93145 384691 -201178 545621 -145492 238033 8789 351897 -156985
17458D52999d55565c9234D48293a35946L4657a91D35999j08602J41045j61669
$$ 452999 -455565 -39234 448293 -135946 -101289 -191 435999 327397 468442 306773
17448C06773L1194e1906j11385g0610p2983j2297I522L80771A12631k8630l4645
$$ 306773 337967 -51906 -163291 -70610 -143593 -155890 9522 390293 112631 84001 49356
17437D9356J88797J62383j04341b9715B77402O9086J76833j97613R5162A40407
$$ 49356 238153 400536 296195 -29715 277402 346488 523321 325708 420870 140407
17426B49334A16452L28908G9806J21167m8762l5610R7016k2002J19942j12877
$$ 249334 116452 445360 79806 200973 152211 116601 213617 191615 311557 198680
17416A98680j3574J12946J03083A767K26013J56138k5631j62054f4494A39977
$$ 198680 185106 298052 401135 1767 227780 383918 358287 196233 -64494 139977
17405F0858J04698L36258A67381a52485I5176A123a14122B68773c00747B94159
$$ 60858 165556 501814 167381 -152485 95176 1123 -114122 268773 -300747 294159
17394C1192J14474d5986B25752l4541J5735b42913A76375D8614J30132G0870R1682
$$ 31192 145666 -45986 225752 191211 206946 -242913 176375 48614 178746 70870 162552
17383A62552K20961o0531I3152a33906B49290p2863P3939F7479J7774J10106d6820
$$ 162552 383513 322982 93152 -133906 249290 176427 250366 67479 85253 195359 -46820
17371D1860K75922j28655j6439k5628M00662q8226A68824P2121H0583l596c20804
$$ 41860 317782 189127 172688 147060 547722 459496 168824 240945 80583 76987 -320804
17359I8822N0949Q2499r4739K60194a8152I6249K27059c1075A91762o6127B998
$$ 98822 149771 232270 137531 397725 -18152 96249 323308 -31075 191762 125635 2998
17347B45357O4828a4275r6855G0501J06714P5287a02560C36348a09908M6342B31351
$$ 245357 310185 -14275 -111130 70501 177215 252502 -102560 336348 -109908 -63566 231351
17335A25114a77721b4084I9553L81298A93492J02125j13425m5279m8259c6021
$$ 125114 -177721 -24084 99553 480851 193492 295617 182192 136913 88654 -36021
17324A21013L2813J40284F9508p23J23210J3544Q5071J35690q9726I6090L18635
$$ 121013 153826 294110 69508 68785 191995 205539 290610 426300 336574 96090 414725
17313D14725c2938A6559J30979Q3068O0304N9409j35118M7016a22017C88794j56004
$$ 414725 -32938 16559 147538 230606 290910 350319 215201 262217 -122017 388794 232790
17302B32790e1231B12657L9335A1715f0459C76675G0455K68179J37707F9143k2748
$$ 232790 -51231 212657 251992 11715 -60459 376675 70455 338634 476341 69143 46395
17291D6395g2965A68483J53412L7552j17796J03234A14694M24458B20681o3027
$$ 46395 -72965 168483 321895 359447 241651 344885 114694 539152 220681 157654
17281A57654i939D70294D7324K5536K74661A02697K72223j04336b34321B89394
$$ 157654 -9939 470294 47324 72860 347521 102697 374920 270584 -234321 289394
17270C91182l4569k5401j20602K7109H6777l6274j850K48087J35515j51141H0876
$$ 391182 356613 331212 210610 237719 86777 50503 48653 296740 432255 281114 80876
17258A37594J56010o6561K00842k6603m7088b4549C12332J48378H624K02300M2279
$$ 137594 293604 227043 427885 401282 354194 -24549 312332 460710 8624 210924 253203
17247B53203J19966O0340Q8792A04215g0834B99449b01343B99942C5835K85256
$$ 253203 373169 433509 522301 104215 -70834 299449 -201343 299942 35835 321091
17237C21091J60354F012a20933A08355J08367K62713c5310C75744c13033B40685
$$ 321091 481445 6012 -120933 108355 216722 479435 -35310 375744 -313033 240685
17226A30482K01447C2266L4979j1713J13239F0403O64336C44412A11711K68117
$$ 130482 331929 32266 67245 55532 168771 60403 724739 344412 111711 379828
17216C79828j28019j25360L9573o175d4308C07580B7153L71056A61449o4439K22796
$$ 379828 251809 126449 166022 159847 -44308 307580 27153 398209 161449 97010 319806
17205C19806N9193k4217m0318o3304O6264j42648B806L67081a38178B51660P1418
$$ 319806 378999 354782 314464 251160 317424 174776 2806 369887 -138178 251660 323078
17194C23078O6175q387C7828J67130o5301a8267D68899b78928B66047E8177i8378
$$ 323078 389253 380866 37828 204958 139657 -18267 468899 -278928 266047 58177 -98378
17182D93209b57510F21217j47490B03958L44407j70793j6055A76118j9400J1757
$$ 493209 -257510 621217 473727 203958 548365 377572 361517 176118 156718 168475
17172A68475K26830A24896J24834O2739J78812j61404j05189l9811M46073A37100
$$ 168475 395305 124896 249730 312469 491281 329877 224688 184877 630950 137100
17161B18150J4854K58987j95464J06905M819p0192E3693J90900p764R4598K38516
$$ 218150 233004 491991 296527 403432 408251 338059 53693 244593 236829 331427 569943
17150E69943B20789M0441E0377R2318K67719A97580J45420n0816M15991A08430
$$ 569943 220789 261230 50377 142695 410414 197580 343000 292184 708175 108430
17139B07994n1812J90866l7301O1675j54259K06260K00087B66353L39056M0057
$$ 207994 156182 347048 309747 371422 217163 423423 623510 266353 605409 645466
17129F45466k70716j05474j15370j4339K15271k1744J0440n7336J37156j65939
$$ 645466 374750 269276 153906 139567 354838 333094 343534 286198 423354 257415
17119B57415K09978B19717M02281k22362E9623L8123K52503K86040k76634j53849
$$ 257415 467393 219717 621998 399636 59623 97746 350249 636289 359655 205806
17109B05806R2185O0531K41191B40321K34733a0299D22246j60739K88898M3530
$$ 205806 297991 358522 599713 240321 475054 -10299 422246 261507 550405 593935
17099E93935o8785j64636j41419L54968k42920M31444C44753K55026B67708K02331
$$ 593935 525150 360514 219095 574063 331143 762587 344753 599779 267708 470039
17089D70039A92293M66157A26917N16412B61054K7592M2181Q0049J31416K13576
$$ 470039 192293 658450 126917 643329 261054 288646 330827 410876 542292 755868
17079G55868B01557L08948B08231L98522k12010j72000L65383B44448L9396J94271
$$ 755868 201557 510505 208231 606753 394743 222743 588126 244448 283844 478115
17069D78115o0789m2113Q8560l5646K8849j91464J68015K0996k6329J77194j78310
$$ 478115 417326 375213 463773 428127 456976 265512 433527 454523 428194 605388 427078
17058D27078o7783p4088R2249L2813L22126C66141L9243M7683j84122L27166B85822
$$ 427078 359295 285207 377456 410269 732395 366141 405384 453067 268945 596111 285822
17046B37248L56643j51817K07242k49472L04334j03753B95233J64536m4812J30321
$$ 237248 593891 442074 649316 399844 704178 600425 295233 459769 414957 545278
17036E45278P1723k48368K84661C07402M46147j59465M6115l6683J58293l23499
$$ 545278 617001 368633 653294 307402 753549 594084 640199 603516 761809 438310
17026D38310K09116m0381J51735k36161J30094N5302J28106m17852J37322L13132
$$ 438310 647426 607045 758780 522619 652713 708015 836121 418269 555591 868723
17016H68723j38323J8706p1969B92124J20665O8798K8378L80319l43641N5723
$$ 868723 730400 749106 677137 292124 412789 481587 509965 890284 546643 602366
17006F02366M55620j29382j38108q8601k77095L72940k1762l5937l62330N09669
$$ 602366 1057986 928604 790496 701895 424800 797740 775978 740041 377711 887380
16996H87380k52004j14166L54708j12753j2298K44731l18803j07450K58067l627
$$ 887380 635376 521210 875918 763165 750867 995598 676795 569345 827412 823785
16986H23785k07336J48545M0576j15382J86160k5436l35210K71528P1422N64j30511
$$ 823785 616449 764994 805570 690188 876348 850912 515702 787230 858652 859216 728705
16975G28705K02562n655k31550J06611N8152q9377M64104k11388J8671k11046
$$ 728705 931267 925612 694062 800673 858825 769448 1233552 1022164 1040835 829789
16965H29789J05611j16142J80917j60402J70932Q3959K72560k68082j08093N2714
$$ 829789 935400 819258 1000175 839773 1010705 1094664 1367224 1099142 991049 1043763
16955A043763k1406k22364L27313K21952m71675L32486k48813J8142M56826k46087
$$ 1043763 1022357 799993 1127306 1349258 877583 1210069 961256 979398 1436224 1190137
16945A190137n9731L55609j63163j96750P1463j6670M8033J25490l33155L60744
$$ 1190137 1130406 1486015 1322852 1126102 1197565 1180895 1228928 1354418 1021263 1382007
16935A382007j66337l9984n2776N9151j5719r4411R9096k37272M67243m39219
$$ 1382007 1215670 1175686 1122910 1182061 1166342 1071931 1171027 933755 1400998 961779
16925I61779K61482M73290o93601N27843l42535Q4066J32904m89563O94110k4626
$$ 961779 1223261 1696551 1002950 1530793 1188258 1272324 1405228 915665 1609775 1585149
16915A585149J36999m06866O8950K18044l93728K02940J41819K82898n49438L56309
$$ 1585149 1722148 1315282 1384232 1602276 1208548 1411488 1553307 1836205 1286767 1643076
16905A643076k24879P7156Q0440L68111j65745k33047J67612M0999k2526J53292
$$ 1643076 1418197 1495353 1575793 1943904 1778159 1545112 1712724 1753723 1731197 1884489
16895A884489m41769K64841R545Q2677J39253J52814k73321J27730M7992l21927
$$ 1884489 1442720 1707561 1717106 1799783 1939036 2091850 1818529 1946259 1994251 1672324
16885A672324K31693J68663k03174K99030J13136O4445r5211k58125M69400n5304
$$ 1672324 1904017 2072680 1869506 2168536 2281672 2346117 2250906 1992781 2462181 2406877
16875B406877k43010m3316L77340J61139O4372n35575M97747m20275J43592L78943
$$ 2406877 2163867 2120551 2497891 2659030 2723402 2187827 2685574 2265299 2408891 2787834
16865B787834j51549m1612J61618O9481j93386L33163l69280J67145K49963k51986
$$ 2787834 2636285 2594673 2756291 2825772 2632386 2965549 2596269 2763414 3013377 2761391
16855B761391J24248J38868j00566O0997K54630k5642P7310J8777j13915K85334
$$ 2761391 2885639 3024507 2923941 2984938 3239568 3213926 3291236 3310013 3196098 3481432
16845C481432J19587J40712l07364J67165k62679N9818N09694l8668n5679j98796
$$ 3481432 3601019 3741731 3434367 3601532 3338853 3398671 3908365 3869697 3814018 3615222
16835C615222L45380M9348k8193L74293L51268l94396N3637L60913m69331K80383
$$ 3615222 3960602 4009950 3981757 4356050 4707318 4312922 4366559 4727472 4258141 4538524
16825D538524l9686P1566K62163L87211k59408J47440K74794k10380L38174M3823
$$ 4538524 4498838 4570404 4832567 5219778 4960370 5107810 5382604 5172224 5510398 5554221
16815E554221O3881J16282j36421K39273K70723Q2485p1567L02398J45698J56507
$$ 5554221 5618102 5734384 5597963 5837236 6107959 6190444 6118877 6421275 6566973 6723480
16805F723480Q1703K87903j83421O11834K19758j87623L65492J09796L59544j52172
$$ 6723480 6805183 7093086 6909665 7521499 7741257 7553634 7919126 8028922 8388466 8236294
16795H236294L02604o3549L82188M90278K83725J72810N64548l74413P91421k07850
$$ 8236294 8538898 8475349 8857537 9347815 9631540 9804350 10368898 9994485 10785906 10578056
16785A0578056K01056P00815R3422K93837L70519N60132L21526P3550Q51077J49985
$$ 10578056 10779112 11479927 11573349 11867186 12237705 12797837 13119363 13192913 14043990 14193975
16775A4193975P07504P7385P93899M33202P33733O54469N48915N09063Q72613
$$ 14193975 14901479 14978864 15772763 16205965 16939698 17594167 18143082 18652145 19524758
16766A9524758P35896Q81897L82075J023097J033790Q18616J004411J053901J338456
$$ 19524758 20260654 21142551 21524626 22547723 23581513 24400129 25404540 26458441 27796897
16757B7796897P65138J637231J077378J029222J609155J750883J771995J907016
$$ 27796897 28562035 30199266 31276644 32305866 33915021 35665904 37437899 39344915
16749C9344915K133135K145096K242842K520975K241373K712243L058033K960821
$$ 39344915 41478050 43623146 45865988 48386963 50628336 53340579 56398612 59359433
16741E9359433L819777L502657M222098M259166M862623M817546N517839N672248
$$ 59359433 63179210 66681867 70903965 75163131 80025754 84843300 90361139 96033387
16733I6033387N838136O585327O569738P653412P540058Q401207Q071229Q113283
$$ 96033387 101871523 108456850 115026588 122680000 130220058 138621265 146692494 154805777
16725A54805777Q384879Q381036P609655P464189O282778N766905M047543K822727
$$ 154805777 163190656 171571692 179181347 186645536 192928314 198695219 202742762 205565489
16717B05565489J278105k22038j793903l087693m922571n779315o491653p577963
$$ 205565489 206843594 206621556 204827653 201739960 196817389 191038074 184546421 176968458
16709A76968458q191191q203978q712690q322398q187386p750188q290022p383290
$$ 176968458 168777267 160573289 151860599 143538201 135350815 127600627 119310605 111927315
16701A11927315o976734o750379o094414n519361n522815m733176m817688m436791
$$ 111927315 104950581 98200202 92105788 86586427 81063612 76330436 71512748 67075957
16693F7075957l650334l282330l780722l064568l022649k675325k571152k391010
$$ 67075957 63425623 60143293 56362571 53298003 50275354 47600029 45028877 42637867
16685D2637867k185441k225299j840007j635590j762458j430614j569297j327475
$$ 42637867 40452426 38227127 36387120 34751530 32989072 31558458 29989161 28661686
16677B8661686j475157p86887j520038j023254r14605n02825r56054q34633j382749
$$ 28661686 27186529 26399642 24879604 23856350 22941745 22438920 21482866 20648233 19265484
16668A9265484q12036k86422q33656l07124n02466r14249l54948r57396l5438
$$ 19265484 18453448 18167026 17333370 17026246 16523780 15609531 15254583 14297187 14261749
16659A4261749n00644m86332m26268k54303n30421m90362k27141n63034j24476
$$ 14261749 13761105 13274773 12848505 12594202 12063781 11573419 11346278 10783244 10658768
16650A0658768j96273l66106k47684l10598j31052j92484n01614m12289J50675
$$ 10658768 10462495 10096389 9848705 9538107 9407055 9214571 8712957 8300668 8451343
16641H451343n48774J31647l84573L6197l93030k76201J09380j95886k51455j61797
$$ 8451343 7902569 8034216 7649643 7685840 7292810 7016609 7125989 6930103 6678648 6516851
16631F516851l55161l00754j54598L0653m16791J35068j44831j24624R403j90878
$$ 6516851 6161690 5860936 5706338 5736991 5320200 5455268 5310437 5185813 5195216 5004338
16621E004338m3603q8452j02318j8090r2601r8527n67114K54094R379n66572J56024
$$ 5004338 4960735 4872283 4769965 4751875 4659274 4560747 3993633 4247727 4257106 3690534 3846558
16610C846558J86927M5185l39852r0707J39301N7887k35593k54773j87730J22496
$$ 3846558 4033485 4078670 3738818 3648111 3787412 3845299 3609706 3354933 3167203 3289699
16600C289699M1073l04464L2443Q7770l50558L30545r0146l85063J3965j0559
$$ 3289699 3330772 3026308 3058751 3146521 2795963 3126508 3036362 2651299 2665264 2654705
16590B654705l4670j84450q2110L89946l72642M2010k32662j78517O4392M15986
$$ 2654705 2620035 2435585 2353475 2743421 2370779 2412789 2180127 2001610 2066002 2481988
16580B481988l39110M10543n2310l69316Q7822j85260Q6091q5270k4829j2525
$$ 2481988 2142878 2553421 2501111 2131795 2219617 2034357 2120448 2035178 2010349 1997824
16570A997824j03367n2672K45884k64649N907j44480R6254j07100K20125m31073
$$ 1997824 1894457 1841785 2087669 1823020 1828927 1684447 1780701 1673601 1893726 1462653
16560A462653L12223r7527Q494j71101K19061j13054j90878l6903K40268k33921
$$ 1462653 1774876 1677349 1685843 1514742 1733803 1620749 1429871 1392968 1633236 1399315
16550A399315l1464N9658k40300o8335q7068P38600k72577k93501L06355k64921
$$ 1399315 1367851 1427509 1187209 1118874 1031806 1770406 1497829 1204328 1510683 1245762
16540A245762Q762l67611M22940q5792J68554k46210l429J15999M4205j10873
$$ 1245762 1254524 886913 1309853 1224061 1392615 1146405 1142976 1258975 1303180 1192307
16530A192307l8139l4114j52756R2695J13756l50954K75842j41360L18603l27536
$$ 1192307 1154168 1120054 967298 1059993 1173749 822795 1098637 957277 1275880 948344
16520I48344J10604k0209j40805j32050K78794m00858K26040p0121j05480L13655
$$ 948344 1058948 1038739 897934 765884 1044678 643820 869860 799739 694259 1007914
16510A007914k61190m6954K26706J72443j34928j27819k91277J42879J475L3809
$$ 1007914 746724 699770 926476 1098919 963991 836172 544895 687774 689249 723058
16500G23058J19737p5987j12082J88883m7340j15912K46401Q8066k98939L4316
$$ 723058 842795 766808 654726 843609 796269 680357 926758 1014824 715885 750201
16490G50201l6753K59890l64634J55993n7944J29020j74299J62082k58727P421
$$ 750201 713448 973338 608704 764697 706753 835773 661474 823556 564829 572250
16480E72250k3572M36209m50436J87352J31780j45668j67174R5009N8403l21918
$$ 572250 548678 984887 534451 721803 853583 707915 540741 635750 694153 372235
16470C72235K50004K23600j63499k5844j68155N823K13942A16738J09655R7943
$$ 372235 622239 845839 682340 656496 488341 494164 708106 116738 226393 324336
16460C24336M0129J13753O8517j75596J27294q3116L0124O4548J52260k26772
$$ 324336 364465 478218 546735 371139 498433 415317 445441 509989 662249 435477
16450D35477K8290J8392M9940K47278j21958l02217J0902L54053k07096k56080
$$ 435477 463767 482159 532099 779377 657419 355202 366104 720157 513061 256981
16440B56981K31939p8525j7057I8292K91075K06929k64510J85597r2045J04180
$$ 256981 488920 410395 393338 98292 389367 596296 331786 517383 425338 529518
16430E29518j97922J92922k31130q0805c3248D22580J37105j88055K45351A13526
$$ 529518 331596 524518 293388 212583 -33248 422580 559685 371630 616981 113526
16419C11418J35151B21430g430A74946J92279q4891L66467k8429p2006A44178
$$ 311418 446569 221430 -7430 174946 367225 282334 648801 620372 548366 144178
16408B52661J11487r3640j09602J29295P8528q4634h1612A80438J7769Q6761A28206
$$ 252661 364148 270508 160906 290201 368729 284095 -81612 180438 198207 284968 128206
16396a8886B51692N6208P8404I5507L59022k15676e6315I5766J71141L71236k26527
$$ -18886 251692 307900 386304 95507 454529 238853 -56315 95766 266907 638143 411616
16385D11616A80580P5L3837o2370K82337A67587p9879D3293K39125I3256N0473
$$ 411616 180580 180655 214492 152122 434459 167587 87708 43293 282418 93256 143729
16374A43729K76289q5467R1961k04694i381B95410L93478j96795d5564B57632
$$ 143729 420018 334551 426512 221818 -9381 295410 688888 492093 -45564 257632
16363B15101J22083q6776D3650J65637m1339J24781A25312D2847M98212k13098
$$ 215101 337184 250408 43650 209287 167948 292729 125312 42847 541059 327961
16353C27961E9630K1236N6191P5225h8340C63975j39042J4116J93779j39468B0411
$$ 327961 59630 80866 137057 212282 -88340 363975 224933 239049 432828 293360 20411
16341A13446J96466A4179a10683E6899K02876B1843O8110l1607K51794A38021
$$ 113446 309912 14179 -110683 56899 259775 21843 89953 58346 310140 138021
16330A44761a75812B4044a42889B89652C5487J8044B0372K96250c4166G4541J36635
$$ 144761 -175812 24044 -142889 289652 35487 53531 20372 316622 -34166 74541 211176
16319B11176e1748p0292M7273A85131G3515J51385K05027c2738D0831K33327J56509
$$ 211176 -51748 -122040 -74767 185131 73515 224900 429927 -32738 40831 274158 430667
16308D30667j46772B5977M6218O6684L84Q2022r7846m8875J92135R4956j48524
$$ 430667 283895 25977 72195 138879 139263 221285 123439 74564 266699 361655 213131
16297B13131L8547r7635C8967Q7744K9288Q3997J02879A32985g490A04108m3418
$$ 213131 251678 154043 38967 126711 155999 239996 342875 132985 -7490 104108 60690
16286F0690K81879H7180Q1668g9083l6918N7753M682C37363f7119j02626A64903
$$ 60690 342569 87180 168848 -79083 -116001 -58248 -53566 337363 -67119 -169745 164903
16274C13477n7588b6496C73694G8439K92149A33784D9947K52934A45099b80204
$$ 313477 255889 -26496 373694 78439 370588 133784 49947 302881 145099 -280204
16263B71763J88236c0964k8947b6329A4791J2391c6219k0944A01561f7080b3996
$$ 271763 459999 -30964 -59911 -26329 14791 27182 -36219 -57163 101561 -67080 -23996
16251f2020B53247h0259B26902a73296O8190E7578a11410A3825c13889i0682L3603
$$ -62020 253247 -80259 226902 -173296 -105106 57578 -111410 13825 -313889 -90682 -57079
16240e7079B19529K6864J32927A46567a76648I8385m3660K37878o7052N4378a74296
$$ -57079 219529 246393 379320 146567 -176648 98385 54725 292603 225551 279929 -174296
16228b09665B63432L4419A22005b5834B36063A00064h0078F4575b4832A00264
$$ -209665 263432 297851 122005 -25834 236063 100064 -80078 64575 -24832 100264
16217B95909f9404i656B58050h529F6085B5744a89785B48907E636g0137k75459
$$ 295909 -69404 -9656 258050 -8529 66085 25744 -189785 248907 5636 -70137 -345596
16206c45596J33178A93046j7686l145h3355D7326K10010G0161J19776H7911a49993
$$ -345596 -212418 193046 175360 172215 -83355 47326 257336 70161 189937 87911 -149993
16194H419J94101n3425A9350a10148I0044k5756k1235Q8553a22706l2441L9162
$$ 8419 202520 149095 19350 -110148 90044 64288 43053 131606 -122706 -155147 -115985
16183a15985L5914B88178A03107j9421i3824b156A8981J589h1651j0907A59431
$$ -115985 -80071 288178 103107 83686 -93824 -2156 18981 20570 -81651 -92558 159431
16171A27802n0339b22988A33529A8522K1590C321K33550a55593j17400E1748P2776
$$ 127802 77463 -222988 133529 18522 40112 3321 236871 -155593 -272993 51748 124524
16160A24524a5557l5007C1131O4873a05504b3451H3852b6282A79838C7488J45675
$$ 124524 -15557 -50564 31131 96004 -105504 -23451 83852 -26282 179838 37488 183163
16149A83163p5444c11572c0056k02255C37050a64195f6102A64625d9884A99070
$$ 183163 107719 -311572 -30056 -232311 337050 -164195 -66102 164625 -49884 199070
16138G2694B8041d7531B16605i9233B64416b77212B84216n2927G375M00320I986
$$ 72694 28041 -47531 216605 -99233 264416 -277212 284216 231289 7375 407695 9986
16126a9827j24975J4058o2145l7580K8865B50439k6202c90669a03268L7155j20039
$$ -19827 -144802 -130744 -192889 -230469 -201604 250439 224237 -390669 -103268 -66113 -186152
16115a86152g0498j27345N5562f8835k87985H7103a6019j10186N0172E6467P625
$$ -186152 -70498 -197843 -142281 -68835 -356820 87103 -16019 -126205 -76033 56467 64092
16104F4092I69a65824A23683F790L03049a36076e6230C7796f6108b9473B20019
$$ 64092 969 -165824 123683 6790 309839 -136076 -56230 37796 -66108 -29473 220019
16092D4786a48165k69262A57197a35235C5514b93086D23646F9822a17164L5260
$$ 44786 -148165 -417427 157197 -135235 35514 -293086 423646 69822 -117164 -81904
16082h1904q6785O1490k1052A96974c9616q4075A2658c11081c0521A85139b35583
$$ -81904 -168689 -107199 -128251 196974 -39616 -123691 12658 -311081 -30521 185139 -235583
16070B96266f4690M816m6836M4572l01631a30323B9387b05012p6300i1106k60967
$$ 296266 -64690 -59874 -106710 -62138 -363769 -130323 29387 -205012 -281312 -91106 -352073
16059c52073A51351j4311a00874A53394c33780c1933j0517B90587I8805H207J0797
$$ -352073 151351 137040 -100874 153394 -333780 -31933 -42450 290587 98805 8207 19004
16048A9004J26428f0717A38161c3355n0871a6483j49081A42020c25302I5821h8941
$$ 19004 145432 -60717 138161 -33355 -84226 -16483 -165564 142020 -325302 95821 -88941
16036e7848K8314j73409f099l0776A1451a34509F0551b52738a24455G9799J47557
$$ -57848 -29534 -202943 -6099 -36875 11451 -134509 60551 -252738 -124455 79799 227356
16025B27356E2634f7374C4447J67910a35702E595b62525I8988e3375D34454A515
$$ 227356 52634 -67374 34447 202357 -135702 5595 -262525 98988 -53375 434454 1515
16013g1774B6077i9987H3656L0154b39378a08124F7391e58296a90713a0447j11050
$$ -71774 26077 -99987 83656 113810 -239378 -108124 67391 -558296 -190713 -10447 -121497
16002a21497i707m25503G5642O9303i4740A9502d1756J6467N733j62562f825m4029
$$ -121497 -9707 -435210 75642 144945 -94740 19502 -41756 -25289 -19556 -182118 -6825 -50854
15990e0854j04058D67889g2535A63348K16527I0163a3858A58232J23634Q1168
$$ -50854 -154912 467889 -72535 163348 379875 90163 -13858 158232 281866 363034
15980C63034R9263A0952h8644n5274D89417a53393P1845k34858l5847a69268d484
$$ 363034 462297 10952 -88644 -143918 489417 -153393 -81548 -316406 -352253 -169268 -4484
15968A66021c60108a58136A96655b5513l21699A15703J55937j02730j5775G3665
$$ 166021 -360108 -158136 196655 -25513 -347212 115703 271640 168910 153135 73665
15957a87733A24237a4034l82372J42939h7794A07640c48537a477A498a44088e3667
$$ -187733 124237 -14034 -396406 -253467 -87794 107640 -348537 -1477 1498 -144088 -53667
15945a18427D0391a52676j18464A72268q0467E022c8290j10428j60874e0971I1413
$$ -118427 40391 -152676 -271140 172268 91801 5022 -38290 -148718 -309592 -50971 91413
15933c22264j73675A22668a37617k81501a57809A29937J27275o0912h8275L4885
$$ -322264 -495939 122668 -137617 -419118 -157809 129937 257212 196300 -88275 -53390
15923e3390k44092a24614l6044B78435A08153K32791b51236A28630J03359j01577
$$ -53390 -297482 -124614 -160658 278435 108153 340944 -251236 128630 231989 130412
15913A30412a05008H527L20383b15439C16548D2214J80502d533j72586l97677
$$ 130412 -105008 8527 328910 -215439 316548 42214 222716 -4533 -177119 -574796
15903e74796g8381H4386O0055a24287b8602B52837J05839I0211a32693L9184a959
$$ -574796 -78381 84386 144441 -124287 -28602 252837 358676 90211 -132693 -93509 -1959
15891g438k4046m66166a85033A90530a36015m1594D0046J44391M4244b57459c4926
$$ -7438 -31484 -497650 -185033 190530 -136015 -177609 40046 184437 228681 -257459 -34926
15879b34731A9797i550m1349j23347B48036e5500p0304K8177A62134a24368L8752
$$ -234731 19797 -9550 -50899 -174246 248036 -55500 -125804 -97627 162134 -124368 -85616
15868h5616H9623J9387L05694c87652J09913h679p5499b674n2819a9117j0917
$$ -85616 89623 109010 414704 -387652 -277739 -8679 -84178 -2674 -55493 -19117 -30034
15857c0034D3765d19734a755k6701j30080A66503a25757k6663B8036b3442A08808
$$ -30034 43765 -419734 -1755 -28456 -158536 166503 -125757 -152420 28036 -23442 108808
15845b40093R0926O0864A02953d4646A77536e975k29028n492B61001E8467J8438
$$ -240093 -149167 -88303 102953 -44646 177536 -5975 -235003 -240495 261001 58467 76905
15834G6905k6384a93991A99250a59590e2616G4960l302J51771b57377A67965a81058
$$ 76905 50521 -193991 199250 -159590 -52616 74960 71658 223429 -257377 167965 -181058
15822a01153I0421b020k16280D1815K21317B1399a38157f3817l0127G111i7269
$$ -101153 90421 -2020 -218300 41815 263132 21399 -138157 -63817 -93944 7111 -97269
15810a3858j43409g1549f114j25430B04012c3667n2015A3522Q9764d15272a96153
$$ -13858 -157267 -71549 -6114 -131544 204012 -33667 -85682 13522 103286 -415272 -196153
15798D3176R8200f0305F1832k17b44628A16957e62436a07223k27772C4682f4299
$$ 43176 141376 -60305 61832 61615 -244628 116957 -562436 -107223 -334995 34682 -64299
15786a49015f1404o2297d1051n0347p6482K4570A51916a07105M7246I8870b50370
$$ -149015 -61404 -123701 -41051 -91398 -167880 -143310 151916 -107105 -59859 98870 -250370
15774A40944c4789A41723n5770g9084B95354j22271b47004J8390b2948k26187
$$ 140944 -34789 141723 85953 -79084 295354 173083 -247004 -228614 -22948 -249135
15764b49135G3283b00483J6679B73642f8660A33045l3025p924b22300A00388a66173
$$ -249135 73283 -200483 -183804 273642 -68660 133045 100020 92096 -222300 100388 -166173
15752C30178F2892a89310h6413j67434B0714K29609a93735B25916a88279A93786
$$ 330178 62892 -189310 -86413 -253847 20714 250323 -193735 225916 -188279 193786
15741A83514Q1125B5976a40361N1586C07782C1204K87591a90729o3970e0168j17532
$$ 183514 264639 25976 -140361 -88775 307782 31204 318795 -190729 -254699 -50168 -167700
15730a67700C8365N1988L5986E4836P7168J16796C1978K7008a00283c1368k21015
$$ -167700 38365 90353 126339 54836 132004 248800 31978 58986 -100283 -31368 -252383
15719b52383C1564a02083D57614a1585B74991B8355J70207a23774A87655b24655
$$ -252383 31564 -102083 457614 -11585 274991 28355 198562 -123774 187655 -224655
15708b06492J3118A33096m5089b34167j00915J40366p6937Q5914A57666c30403
$$ -206492 -193374 133096 88007 -234167 -335082 -194716 -271653 -185739 157666 -330403
15697d4225I254b78632C04087b9112j07417F4214J25949C4903N4791Q7999a56833
$$ -44225 9254 -278632 304087 -29112 -136529 64214 190163 34903 89694 177693 -156833
15685I5551J11238l8092B6320h0624l28559J16660L6693N0903A18510B2610b52475
$$ 95551 206789 168697 26320 -80624 -409183 -292523 -255830 -204927 118510 22610 -252475
15673a58125K0103l4752E7270h7548j51540B40391b2405B09165H5280e5441k4936
$$ -158125 -138022 -172774 57270 -87548 -239088 240391 -22405 209165 85280 -55441 -80377
15662h0377j62622I4038i8876d2607k6621D2973a51586k1259D6904b1570I0832
$$ -80377 -242999 94038 -98876 -42607 -69228 42973 -151586 -172845 46904 -21570 90832
15650E1342a79625E9289c48286B96409J1926Q1466a64876j8232m4120B99410N9470
$$ 51342 -179625 59289 -348286 296409 308335 389801 -164876 -183108 -227228 299410 358880
15639C58880A1732N1833c54192E3815a66089c8100k199D3698a41902A08709f4100
$$ 358880 11732 63565 -354192 53815 -166089 -38100 -40299 43698 -141902 108709 -64100
15627a27746q9666L8474f4861j33273C1408a36429b5842A51162a93293L6651B284
$$ -127746 -217412 -178938 -64861 -198134 31408 -136429 -25842 151162 -193293 -156642 2284
15615D353K17931M7691G8288a83420c4689D1201b48793a09173A88653A0067K7373
$$ 4353 222284 269975 78288 -183420 -34689 41201 -248793 -109173 188653 10067 37440
15604C7440K97207j58457e2132j29396K9469M1624A31111o44d0849A10644g0371
$$ 37440 334647 176190 -52132 -181528 -152059 -110435 131111 130467 -40849 110644 -70371
15592B95028b95493a3654A32627M8389k8661k5343b04250h3580C93311b21384
$$ 295028 -295493 -13654 132627 181016 152355 127012 -204250 -83580 393311 -221384
15581E8403J54772A2206a71192B90214g1898j7269K9288A16244a16906C54188
$$ 58403 213175 12206 -171192 290214 -71898 -89167 -59879 116244 -116906 354188
15570A61447h7708l1524r448K2085A24518m4860a01305j25188B0207J21141D571
$$ 161447 -87708 -119232 -128680 -106595 124518 79658 -101305 -226493 20207 141348 4571
15558a29683O0267H1606f7131q4702A64837o3214a75757c7743B46341n1924a46447
$$ -129683 -69416 81606 -67131 -151833 164837 101623 -175757 -37743 246341 194417 -146447
15546h0921a2125D15266h6337A42247A84L7944b5188A17275K41755C8b30840A68066
$$ -80921 -12125 415266 -86337 142247 184 38128 -25188 117275 359030 38 -230840 168066
15533B76132i6312D9296c5169a3319A16696b3184b521E1665M7959f034m4682b4883
$$ 276132 -96312 49296 -35169 -13319 116696 -23184 -2521 51665 99624 -6034 -50716 -24883
15520A26854b30542I9843e1754H054f6069E431b06622h5265H7555k6667M59289
$$ 126854 -230542 99843 -51754 8054 -66069 5431 -206622 -85265 87555 60888 520177
15509E20177b32828A33157a46579a2272D7431a81006g8813A37684j7441a91459
$$ 520177 -232828 133157 -146579 -12272 47431 -181006 -78813 137684 120243 -191459
15498a82215H9544e5063l4681q946L7913J5932H4531f0664j25335n2023m5159
$$ -182215 89544 -55063 -89744 -98690 -60777 -44845 84531 -60664 -185999 -238022 -283181
15487b83181C0461R7119i7445C13755K24747H1412l9623C05a77599p2513e9367
$$ -283181 30461 127580 -97445 313755 538502 81412 41789 305 -177599 -250112 -59367
15475B14951c10711J15268A46134d92663b12730A10529J4575b25912C07994r9455
$$ 214951 -310711 -195443 146134 -492663 -212730 110529 125104 -225912 307994 208539
15465B08539K1909b76789J10746F9215K13901a73721D3176c454C0982b72618A01586
$$ 208539 230448 -276789 -166043 69215 283116 -173721 43176 -3454 30982 -272618 101586
15453b27106l1302a0014l64001A58354c7833k03880C12242j36347g8673B4987
$$ -227106 -258408 -10014 -374015 158354 -37833 -241713 312242 175895 -78673 24987
15442I6053J72724C420Q0581C2116J36780b7739A57103P6410a02795j02594A4842
$$ 96053 268777 3420 84001 32116 168896 -27739 157103 233513 -102795 -205389 14842
15430E7762b65984m4703J39009C58439h1440H5874B7120R2596J1638d0196j52509
$$ 57762 -265984 -310687 -171678 358439 -81440 85874 27120 119716 131354 -40196 -192705
15419a92705D4501a33201e4128J7460C05169a64226E3483L0717M6033a80081g6978
$$ -192705 44501 -133201 -54128 -36668 305169 -164226 53483 84200 130233 -180081 -76978
15407e9361A97674J13641j14396o5915a72009b7343m25757B51224Q615b34513
$$ -59361 197674 311315 196919 131004 -172009 -27343 -453100 251224 259839 -234513
15396E0723M30643A30558c68118a5963C84296j05865A03319i3833B2014c5840
$$ 50723 481366 130558 -368118 -15963 384296 278431 103319 -93833 22014 -35840
15385I0521k1284i3278H0934a7071k65633M1983a04033j01230d5487l10620N2820
$$ 90521 69237 -93278 80934 -17071 -282704 -240721 -104033 -205263 -45487 -356107 -303287
15374c03287B04015I6539b4016j11541f5676J5943k52043J39808K6067k717B6753
$$ -303287 204015 96539 -24016 -135557 -65676 -49733 -301776 -161968 -135901 -138618 26753
15362A09528h6951A65372b12984R3552C3555q706a54084A34766b35857C069b54622
$$ 109528 -86951 165372 -212984 -119432 33555 24849 -154084 134766 -235857 3069 -254622
15350h5895A77366J14215j27713Q0497f5674o2795H8880D2063h056A76005b14778
$$ -85895 177366 291581 163868 244365 -65674 -128469 88880 42063 -8056 176005 -214778
15338A89818a05674c708C29688E1663a1403A23690J46779N5196a05526n016A49733
$$ 189818 -105674 -3708 329688 51663 -11403 123690 270469 325665 -105526 -110542 149733
15326A33295g5162j6490A39518D087M6955c2469A39589N2980Q1191K72439D5277
$$ 133295 -75162 -91652 139518 4087 51042 -32469 139589 192569 273760 546199 45277
15314B5567a22053G1506K41615m5051j01640b08037J01536B59832O3299j41873
$$ 25567 -122053 71506 313121 268070 166430 -208037 -106501 259832 323131 181258
15304A81258a64723I1436b12391h3594b4661m0791m2912q0843A17518a46876M0000
$$ 181258 -164723 91436 -212391 -83594 -24661 -65452 -108364 -189207 117518 -146876 -106876
15293a06876o1341A50683H371L47086I0415a47103C42687d033p5904A02604B773
$$ -106876 -168217 150683 8371 355457 90415 -147103 342687 -4033 -79937 102604 2773
15281C7260J22621f2095j92836A47841F147P9911Q8938c15277c3289A5606K9431
$$ 37260 159881 -62095 -254931 147841 6147 86058 174996 -315277 -33289 15606 45037
15270D5037f304C8463a11636A2061a82445M9015A0472b89342P6897C08457g0555
$$ 45037 -6304 38463 -111636 12061 -182445 -133430 10472 -289342 -212445 308457 -70555
15258A44163J57388r1697M6735e558C18308n6753E4883c5920E7696K32342L08179
$$ 144163 301551 209854 256589 -5558 318308 261555 54883 -35920 57696 290038 598217
15247E98217J102878j67202j75633O96170G24046B06956C2561K44376O2618j02697
$$ 598217 1701095 1533893 1358260 2054430 724046 206956 32561 276937 339555 236858
15237B36858b85259f8553E8076O3560a74997E9866J7229J24487l7077F9787b24210
$$ 236858 -285259 -68553 58076 121636 -174997 59866 77095 201582 164505 69787 -224210
15225D2688O2484J67557I391j624K0702J39745b1467j40856L8023A39494J255
$$ 42688 105172 272729 9391 7767 28469 168214 -21467 -162323 -124300 139494 140749
15214A40749a67554E3232A3725N5504n389L1552K4430a50519f6487l0190C32970
$$ 140749 -167554 53232 13725 69229 63840 95392 119822 -150519 -66487 -96677 332970
15202A40361B5666b4361C16779D8927Q5450e7417k66946A75016J747p8503N6437
$$ 140361 25666 -24361 316779 48927 134377 -57417 -324363 175016 176763 98260 154697
15191A54697K34862d3720D00872i3711d5017B10122J00093C9619b50683G9583
$$ 154697 389559 -43720 400872 -93711 -45017 210122 310215 39619 -250683 79583
15180b7215B81214p9518a2394C64781P2876C0174f000E4321d49084J79199B98973
$$ -27215 281214 201696 -12394 364781 437657 30174 -6000 54321 -449084 -269885 298973
15168A04284J06047e4287D0004a75698F469e0140A18285J04713a4980k5254F3732
$$ 104284 210331 -54287 40004 -175698 6469 -50140 118285 222998 -14980 -40234 63732
15156A94244J23795f763A09054i8549B78337q7213E0502A0724L218K35068F1527
$$ 194244 318039 -6763 109054 -98549 278337 191124 50502 10724 13942 249010 61527
15144D91359G7174b07961A44638R274f3251D07308A55195m7762k3343J69515G2378
$$ 491359 77174 -207961 144638 153912 -63251 407308 155195 107433 84090 253605 72378
15132A41687J43552p5313k6824B8130b1624k7741A25985j4752c860H703L04905
$$ 141687 285239 209926 183102 28130 -21624 -49365 125985 111233 -3860 8703 313608
15121C13608j45790J1275c9339B13419F7330k847K57149A09759J0863d9789B21871
$$ 313608 167818 179093 -39339 213419 67330 64483 321632 109759 120622 -49789 221871
15109D4097K35443C5836K70705e5252B95909E2721d7459j65072A19599J67585
$$ 44097 279540 35836 306541 -55252 295909 52721 -47459 -212531 119599 287184
15099B87184a52459g0721A4112M5431J92489f8503A05232c9542r6795C56337J43672
$$ 287184 -152459 -70721 14112 59543 252032 -68503 105232 -39542 -136337 356337 500009
15088E00009E2895L49507A17638J95900A01169G60M66671a06834F1162L62803
$$ 500009 52895 402402 117638 313538 101169 760 467431 -106834 61162 423965
15078D23965H6062B1523J05763R096K14082I7071R6798k3404M36527B97111a11135
$$ 423965 86062 21523 127286 136382 350464 97071 193869 170465 606992 297111 -111135
15066A24463E8375b88922B56449J11724o9181r4098K0283j07411j8630N6212a55412
$$ 124463 58375 -288922 256449 368173 298992 204894 225177 117766 99136 155348 -155412
15054E91030A36917L62986c3735J1348A80333d4373C55628C8912L96785j91177
$$ 591030 136917 499903 -33735 -22387 180333 -44373 355628 38912 435697 244520
15044B44520k1719a1054B86162O8125D018K43570p553M9787A42274M5950m9780
$$ 244520 222801 -11054 286162 354287 4018 247588 240035 289822 142274 188224 138444
15033A38444k1013h432C61622A47280K3016L06811A59595J15778J36609k05822
$$ 138444 117431 -8432 361622 147280 170296 477107 159595 275373 411982 206160
15023B06160m979N4772q4101K86631j66787k7769I4158K5999J62589r2141o9287
$$ 206160 201181 255953 171852 458483 291696 263927 94158 120157 282746 190605 121318
15012A21318J44713L1696D6193L080a9936A28056D62L86368n6919A53506K8769
$$ 121318 266031 297727 46193 49273 -19936 128056 462 386830 329911 153506 182275
15001A82275J55537a20392D55428A86527L05914B34212J3199j4626J19480J44004
$$ 182275 337812 -120392 455428 186527 492441 234212 247411 232785 352265 496269
14991D96269A39754R5728k5898A0448i3078B59937Q0349A54378L41880B05085
$$ 496269 139754 235482 209584 10448 -93078 259937 340286 154378 496258 205085
14980I2935R0248L01109B4306N07734k44169q4081H7181c0718A08556K3078J64671
$$ 92935 183183 484292 24306 532040 287871 203790 87181 -30718 108556 131634 296305
14969B96305O0021j27993K8915k6092K46074h1648D8547N205M98126A78259l8101
$$ 296305 356326 228333 257248 231156 477230 -81648 48547 53752 551878 178259 140158
14958A40158r032k4902K64039K0086j53638c5744B38078j4180J88279j25353G7718
$$ 140158 131126 106224 370263 390349 236711 -35744 238078 223898 412177 286824 77718
14946G2174J24838K57471p3649O0316A72571K36055A83243m169J26442A52367
$$ 72174 197012 454483 380834 441150 172571 408626 183243 179074 305516 152367
14935B96410K04116B38687O1409L7878A17836L90786a4312C33800j21067J60535
$$ 296410 500526 238687 300096 337974 117836 508622 -14312 333800 212733 373268
14925C73268k3219J2913j45451j8419J78705r819j5135j3175J24724J17436k10713
$$ 373268 350049 362962 217511 199092 377797 367978 352843 339668 464392 581828 371115
14914C71115A81715M2922K8250j11429h1219D93771B16445K71743B01621D8628
$$ 371115 181715 224637 252887 141458 -81219 493771 216445 488188 201621 48628
14903B63221n866H1814M04020A84264c805C11543n3720P6349m4041m0610M929
$$ 263221 257355 81814 485834 184264 -3805 311543 257823 334172 290131 249521 254450
14892B54450J32674J1535H7101K58303J43757j36441J43665A44348K86972A29211
$$ 254450 387124 398659 87101 345404 489161 352720 496385 144348 431320 129211
14881E74813A65753K50169j60590K24017q0454J85879k83365K72960B68646R0306
$$ 574813 165753 415922 255332 479349 398895 584774 301409 574369 268646 358952
14871C58952r1483q809j25840M22253k62321j11294M16602k01330P6932M629j13165
$$ 358952 267469 258660 132820 555073 292752 181458 598060 396730 473662 478291 365126
14860C65126L38862r1591r3067j06187n1092A19245J55136j6483J41457j08842
$$ 365126 703988 612397 519330 413143 362051 119245 274381 257898 399355 290513
14850B90513B8304N22488A80196K44281J33980j45155J54494k03391J51114M3829
$$ 290513 28304 550792 180196 424477 558457 413302 567796 364405 515519 559348
14840E59348H8768N63150B33004M58526j11272D7437L03321M3456p8554J41998
$$ 559348 88768 651918 233004 691530 580258 47437 350758 394214 315660 457658
14830D57658J34814p5584j31511M3125J11401p7967J12482J41293q7983k25248
$$ 457658 592472 516888 385377 428502 539903 461936 574418 715711 627728 402480
14820D02480L25216C22862Q7016L78848B34147M1979K39222n5131l9252J56304
$$ 402480 727696 322862 409878 788726 234147 276126 515348 460217 420965 577269
14810E77269k26378J51490K30018j03901k23148J06406J86100B17312L98237j76359
$$ 577269 350891 502381 732399 628498 405350 511756 697856 217312 615549 439190
14800D39190Q7554Q3730j26774L82602k65331K12078l30997P3393o0397j91327
$$ 439190 526744 610474 483700 866302 600971 813049 482052 555445 495048 303721
14790C03721r282p270K70994r9621J1969K65496j27596L09770k89883K66452l80317
$$ 303721 294439 287169 558163 458542 470511 736007 608411 918181 628298 894750 514433
14779E14433j35192K86160K7823k06318j738N56835m99873M6575B90348L44055
$$ 514433 379241 665401 693224 486906 485168 1042003 542130 588705 290348 634403
14769F34403N7412j85977K63212j29713j6787j08782N1519K1835P6951j93149
$$ 634403 691815 505838 769050 639337 622550 513768 565287 587122 664073 470924
14759D70924M16005B89411K84210J54807r0786J06201R2830r3787r0760j944L69511
$$ 470924 886929 289411 573621 728428 637642 743843 836673 742886 652126 650182 1019693
14748A019693l56875j78792J87715p0135J27380j99248j2376L16825j71492J32992
$$ 1019693 662818 484026 671741 601606 728986 529738 517362 834187 662695 795687
14738G95687O1484m14062O27880j00622k10112R2379L3382l62229K26691M1668
$$ 795687 857171 443109 1070989 970367 760255 852634 886016 523787 750478 792146
14728G92146L391j07377k2075K5899N9728K23504k81242j58426L43936m1030q6049
$$ 792146 795537 688160 666085 691984 751712 975216 693974 535548 879484 838454 752405
14717G52405K26633l23603L55637j80373M82796n33412J72664j43434N0306R4235
$$ 752405 979038 655435 1011072 830699 1313495 780083 952747 809313 859619 953854
14707I53854K72184k70745p5191j03073O00918o87579K24516k437k7058n605j12963
$$ 953854 1226038 955293 880102 777029 1377947 690368 914884 912447 885389 879784 766821
14696G66821J38240m03088O40935k38086K69821k74775o7377j8267n7562N0659
$$ 766821 905061 501973 1142908 904822 1174643 899868 832491 814224 756662 807321
14686H07321k98768N11451L5567o6815m2677Q7607n2874p4794R2627j44402j24341
$$ 807321 508553 1020004 1055571 988756 946079 1033686 980812 906018 998645 854243 729902
14675G29902L95620q4969K17778m79312K63818J38459k03132K41111k45208K44923
$$ 729902 1125522 1040553 1258331 779019 1042837 1181296 978164 1219275 974067 1218990
14665A218990l88876L10623J89286j02898j38791k52079K44089J73530l96153
$$ 1218990 830114 1140737 1330023 1227125 1088334 836255 1080344 1253874 857721
14656H57721L6511L36671j05698j77228L25324j3776j95386O8940N2989l73807
$$ 857721 894232 1230903 1125205 947977 1273301 1259525 1064139 1133079 1186068 812261
14646H12261K24565q4685L63878n1867r1205L16746j92809Q2870j53465J64231
$$ 812261 1036826 952141 1316019 1264152 1172947 1489693 1296884 1379754 1226289 1390520
14636A390520k29380L52910L5390k62304q9937K09191q9092j7933j286n2007J26915
$$ 1390520 1161140 1514050 1549440 1287136 1197199 1406390 1317298 1299365 1298079 1246072 1372987
14625A372987p7477P0892L4965J64920m31486O6572L16086m3681J23648k13924
$$ 1372987 1295510 1366402 1401367 1566287 1134801 1201373 1517459 1473778 1597426 1383502
14615A383502J03923J08751q2384L05883o76865M07268J74276J36455m17028M73750
$$ 1383502 1487425 1596176 1513792 1819675 1142810 1550078 1724354 1860809 1443781 1917531
14605A917531n43380N11838l17867M9945J20285m6993Q23r3761L17448k87153
$$ 1917531 1374151 1885989 1568122 1618067 1738352 1691359 1692182 1598421 1915869 1628716
14595A628716p316L50344k21777o3239K29221j86967J20777J22399j29105j0344
$$ 1628716 1621400 1971744 1749967 1686728 1915949 1728982 1849759 1972158 1843053 1832709
14585A832709l59221K60923O4609p2531K73342N3164K65551l29411R2698L07020
$$ 1832709 1473488 1734411 1799020 1726489 1999831 2052995 2318546 1989135 2081833 2388853
14575B388853m40863M05328j48812J08412k05790n1688J52066K81816k85656L10183
$$ 2388853 1947990 2353318 2204506 2312918 2107128 2055440 2207506 2489322 2203666 2513849
14565B513849n15317M40592K05189k74103M57918q6067k88995M75806k18201N25175
$$ 2513849 1998532 2439124 2644313 2370210 2828128 2742061 2453066 2928872 2710671 3235846
14555C235846m69116L37239N23199J86340N57427J170884J414777L584182O904344
$$ 3235846 2766730 3103969 3627168 3813508 4370935 5541819 6956596 10540778 17445122
14546A7445122J9136943J6072404B4377993j1827391n849453C326854n86433o95301
$$ 17445122 36582065 52654469 24377993 12550602 6701149 3326854 2740421 2045120
14538B045120J65825j89539N288K46107j65098J13184K0549K44056l1836k28872
$$ 2045120 2210945 2021406 2026694 2272801 2107703 2220887 2241436 2485492 2453656 2224784
14528B224784O1493k73877L61644L39708l72577j81613M68532k12482J81129k47205
$$ 2224784 2286277 2012400 2374044 2713752 2341175 2159562 2628094 2415612 2596741 2349536
14518B349536m5344N90095k68230o7808K44625N7285L824J6964j54094K12087
$$ 2349536 2304192 2894287 2626057 2558249 2802874 2860159 2863983 2880947 2726853 2938940
14508B938940J58938m7379l17336K37647J89999l7387K01379j44351J32495J41646
$$ 2938940 3097878 3050499 2733163 2970810 3160809 3123422 3324801 3180450 3312945 3454591
14498C454591m24698J50771L01085j98397M85610j65880n3195K55140l94452Q2337
$$ 3454591 3029893 3180664 3481749 3283352 3768962 3603082 3549887 3805027 3410575 3492912
14488C492912K50165n8777J5076K88930R2506k10822J48771j55169L7574P4714
$$ 3492912 3743077 3684300 3699376 3988306 4080812 3869990 4018761 3863592 3901166 3975880
14478C975880J74267J6251N9827L48122m33153J51898q6400K63880l26074J57867
$$ 3975880 4150147 4166398 4226225 4574347 4141194 4293092 4206692 4470572 4144498 4302365
14468D302365L38428N027j73884K40243K29722j45629O4028j04440J79625r3642
$$ 4302365 4640793 4645820 4471936 4712179 4941901 4796272 4860300 4755860 4935485 4841843
14458D841843M17136j54048K32831k32077L66495k19135O0558J20393J63238k03218
$$ 4841843 5258979 5104931 5337762 5105685 5472180 5253045 5313603 5433996 5597234 5394016
14448E394016O998J66244K62714R7587j20800J92815J1179L2591m0445L6088L18642
$$ 5394016 5401014 5567258 5829972 5927559 5806759 5999574 6010753 6043344 6002899 6038987 6357629
14437F357629K99737k64448L13255K00107o4739L67420l42613N3726J32290k88737
$$ 6357629 6657366 6392918 6706173 6906280 6841541 7208961 6866348 6920074 7052364 6763627
14427F763627M81457N8208J47762M21622K82232k30443J44773p508j5396M26417
$$ 6763627 7245084 7303292 7451054 7872676 8154908 7924465 8069238 8061730 8046334 8472751
14417H472751k2668K66949m9524L11654J29161k75312L97670l2753N4603J73248
$$ 8472751 8450083 8717032 8667508 8979162 9108323 8833011 9230681 9197928 9252531 9425779
14407I425779M4871J55250M38893K92004j09509R5584L12152K09760J50002K96860
$$ 9425779 9470650 9625900 10064793 10356797 10247288 10342872 10655024 10864784 11014786 11311646
14397A1311646L8986K70946r3336M12532K70894n230k9870N50312R7683K61754
$$ 11311646 11350632 11621578 11528242 11940774 12211668 12206438 12176568 12726880 12824563 13086317
14387A3086317L68127j89352O25194j84525O23781K16659K44929K04616M06887
$$ 13086317 13454444 13265092 13890286 13705761 14329542 14546201 14791130 14995746 15402633
14378A5402633J08848M44216K59106L49486M61729O0483K64093K38088P76236
$$ 15402633 15511481 15955697 16214803 16564289 17026018 17086501 17350594 17588682 18364918
14369A8364918J31864L27475K25528L09438O68727N47734J51562N07673K73963
$$ 18364918 18496782 18824257 19049785 19359223 20027950 20575684 20727246 21234919 21508882
14360B1508882M83986O91045L73599M44951R31428M66564K07292Q27174L61614
$$ 21508882 21992868 22683913 23057512 23502463 24433891 24900455 25107747 25934921 26296535
14351B6296535Q53322M63547P71153O33341R06175M43025J034718R52645O70022
$$ 26296535 27149857 27613404 28384557 29017898 29924073 30367098 31401816 32354461 33024483
14342C3024483R29575Q13635J071632Q28975R65694Q84135J082284J293635J269119
$$ 33024483 33954058 34767693 35839325 36668300 37633994 38518129 39600413 40894048 42163167
14333D2163167J457942J188594J575182J150876J593587J414412J771249J604074
$$ 42163167 43621109 44809703 46384885 47535761 49129348 50543760 52315009 53919083
14325E3919083J912793K249300J695845J723855J848515K523553K518707K651137
$$ 53919083 55831876 58081176 59777021 61500876 63349391 65872944 68391651 71042788
14317G1042788K462437K706099K971517L256386L054631L345457L514272L977247
$$ 71042788 73505225 76211324 79182841 82439227 85493858 88839315 92353587 96330834
14309I6330834M171491M174374M245401M964021M834282N279958N902233N833286
$$ 96330834 100502325 104676699 108922100 113886121 118720403 124000361 129902594 135735880
14301A35735880O096675O754261O839113P834563P572094Q761933Q801094R491487
$$ 135735880 141832555 148586816 155425929 163260492 170832586 179594519 188395613 197887100
14293A97887100J0205828J0529304J1294647J1775905J2245224J2385098J3756232
$$ 197887100 208092928 218622232 229916879 241692784 253938008 266323106 280079338
14286B80079338J3871899J4222957J4990432J4695399J5179411J5061282J5205201
$$ 280079338 293951237 308174194 323164626 337860025 353039436 368100718 383305919
14279C83305919J4428803J4210374J2906787J1773383J0175022Q157475M670262
$$ 383305919 397734722 411945096 424851883 436625266 446800288 454957763 459628025
14272D59628025J268658M60341n36533k223004k825017k991950n984273q684827
$$ 459628025 460896683 461357024 460820491 458597487 455772470 452780520 446796247 438111420
14264D38111420j0256505j1888754j3227043j3807629j4576996j4930567j5549610
$$ 438111420 427854915 415966161 402739118 388931489 374354493 359423926 343874316
14257C43874316j5372374j5259244j4932705j4315842j2444475j3380540j2636785
$$ 343874316 328501942 313242698 298309993 283994151 271549676 258169136 245532351
14250B45532351j2249940j1635303j0717399j0420471r702398r174191q231827
$$ 245532351 233282411 221647108 210929709 200509238 190806840 181632649 173400822
14243A73400822q138785p980760p080844p171389o265859n856062n470385n440663
$$ 173400822 165262037 157281277 150200433 143029044 136763185 130907123 125436738 119996075
14235A19996075n081207n220381l996717m614060l630353l476144l954780l417479
$$ 119996075 114914868 109694487 105697770 101083710 97453357 93977213 90022433 86604954
14227H6604954l824425k671080l464545k601862k401484k790254k374258j920881
$$ 86604954 82780529 80109449 76644904 74043042 71641558 68851304 66477046 64556165
14219F4556165k116473k162476k135260j831611j559834j651991j017513k043675
$$ 64556165 62439692 60277216 58141956 56310345 54750511 53098520 52081007 50037332
14211E0037332j455488j947675j281854p88402p76485j286501j395834j596473
$$ 50037332 48581844 46634169 45352315 44563913 43787428 42500927 41105093 39508620
14203C9508620q69360j069917q18051n85672r55051j201318q15213j037945p84422
$$ 39508620 38639260 37569343 36751292 36165620 35210569 34009251 33194038 32156093 31371671
14194C1371671p75321m19340j146587o60347q51674k50523n92279q28781o24169
$$ 31371671 30596350 30177010 29030423 28370076 27518402 27267879 26675600 25846819 25222650
14185B5222650o55903o18531m33492n17937o31597m51811j54221j043821J09710
$$ 25222650 24566747 23948216 23514724 22996787 22365190 21913379 21759158 20715337 20825047
14176B0825047p21064j73987p14921k95217J73942p45154m57344k20548l53258
$$ 20825047 20103983 19929996 19215075 18919858 19093800 18348646 17891302 17670754 17317496
14167A7317496j99623m69703m54944k23074l37647k23610j83116l68037r9723
$$ 17317496 17117873 16648170 16193226 15970152 15632505 15408895 15225779 14857742 14758019
14158A4758019j64037n92060P6180m44619j81339k82138j50479j17712k88416
$$ 14758019 14593982 14001922 14078102 13633483 13452144 13170006 13019527 12901815 12613399
14149A2613399l90326j94182J73081j7539q59788R8408j15295J35627m49669j73067
$$ 12613399 12223073 12028891 12201972 12184433 11324645 11423053 11307758 11443385 10993716 10820649
14139A0820649l90335j41586J32576l14175q9937k36085k10725n0197n8951m14720
$$ 10820649 10430314 10288728 10421304 10107129 10017192 9781107 9570382 9520185 9461234 9046514
14129I046514Q1149m1581R1667m04017k47559p8806o109l14312k84118J39866
$$ 9046514 9127663 9086082 9177749 8773732 8526173 8447367 8441258 8126946 7842828 7982694
14119G982694L4718j3962k85186J9710j56376N8921m88135M4487l3961j99692
$$ 7982694 8017412 8003450 7718264 7737974 7581598 7640519 7152384 7196871 7162910 6963218
14109F963218J24092m3646k72245Q9912k64477j03340k22965l235L08894k24647
$$ 6963218 7087310 7043664 6771419 6861331 6596854 6493514 6270549 6267314 6576208 6351561
14099F351561k82081K9541n5818O7691l84628L39649j39214n00523L83585l11502
$$ 6351561 6069480 6099021 6043203 6110894 5726266 6065915 5926701 5426178 5809763 5498261
14089E498261l4265k04274K86231q6701l1876j49085p7545j87816J78389k42113
$$ 5498261 5463996 5259722 5545953 5459252 5427376 5278291 5200746 5012930 5191319 4949206
14079D949206J41971j57384J72194m55658J58583L7372r0314k57453l9545l1989
$$ 4949206 5091177 4933793 5105987 4650329 4808912 4846284 4755970 4498517 4458972 4426983
14069D426983J07134m23601M96439L0829q97525L52419J68236l74467L25448j35381
$$ 4426983 4534117 4110516 4606955 4637784 3740259 4092678 4260914 3886447 4211895 4076514
14059D076514J08886L6848R2748J2950n90612K49981l7958J10733r76751M96910
$$ 4076514 4185400 4222248 4314996 4327946 3737334 3987315 3949357 4060090 3083339 3580249
14049C580249J46169r1384J0217p3937k75983J78043j52582j26775Q8181k70670
$$ 3580249 3726418 3635034 3645251 3571314 3295331 3473374 3320792 3194017 3282198 3011528
14039C011528M22669l34503Q7209R131k60078K48987Q4380k48393K12521k85685
$$ 3011528 3434197 3099694 3186903 3196034 2935956 3184943 3269323 3020930 3233451 2947766
14029B947766L00737j04970O2089k16831j06106P4024J2495m15218K71636Q994
$$ 2947766 3248503 3143533 3205622 2988791 2882685 2956709 2969204 2553986 2825622 2834616
14019B834616J20057l5697m37234K30956P4620N243k19575j7094j40040O0387
$$ 2834616 2954673 2918976 2481742 2712698 2787318 2792561 2572986 2555892 2415852 2476239
14009B476239j29425j1470o9861J64802j55048j97811J1349M24821m59635J65800
$$ 2476239 2346814 2335344 2265483 2430285 2275237 2077426 2088775 2513596 2053961 2219761
13999B219761k5168J54547p42226M76614k23234N31724j54089l24462q8724P61760
$$ 2219761 2194593 2349140 1606914 2083528 1860294 2392018 2237929 1913467 1824743 2586503
13989B586503N52272K463146N165971J7608098K3816113k1805849j4913461o365951
$$ 2586503 3138775 5601921 10767892 28375990 52192103 30386254 15472793 9106842
13981I106842k959751j508876o04650j92636l83943k0767o44025K23776l43541
$$ 9106842 6147091 4638215 4033565 3840929 3456986 3436219 2792194 3015970 2672429
13972B672429J37J67968n18275L09318j35038j03082m8905J03919l35603L65120
$$ 2672429 2672566 2840534 2322259 2631577 2496539 2393457 2344552 2448471 2112868 2477988
13962B477988j30642m05253N59372n4158j84857l00596o8900K47982o0723l47809
$$ 2477988 2347346 1942093 2501465 2447307 2262450 1961854 1892954 2140936 2080213 1732404
13952A732404L76603J54414l60643J95355j82689j92501L17358P4973k82640j05791
$$ 1732404 2109007 2263421 1902778 2098133 1915444 1722943 2040301 2115274 1832634 1726843
13942A726843L84350r1330k39164J08036J22363n45612O47254o86912M52692j09574
$$ 1726843 2111193 2019863 1780699 1888735 2011098 1465486 2112740 1425828 1878520 1768946
13932A768946j93885M97029o11347K47213J07380j74138L41545k48915l6152J4813
$$ 1768946 1575061 2072090 1460743 1707956 1815336 1641198 1982743 1733828 1697676 1712489
13922A712489j99249L06000L6218k56107L8612j30191j69622K31347L12451m32910
$$ 1712489 1513240 1819240 1855458 1599351 1637963 1507772 1338150 1569497 1881948 1449038
13912A449038p5395M2288k62283L50373l345n6939j14759j30014L28146J12587
$$ 1449038 1373643 1415931 1153648 1504021 1500676 1443737 1328978 1198964 1527110 1639697
13902A639697n22849M08025R6744j8l2078k34337K91779k6204l10166j48508L07573
$$ 1639697 1116848 1524873 1621617 1621599 1589521 1355184 1646963 1620759 1310593 1162085 1469658
13891A469658k42849J3616J85995p7759P5049m9798l11118M04315l05059N7218
$$ 1469658 1226809 1240425 1426420 1348661 1423710 1373912 1062794 1467109 1162050 1219268
13881A219268l2837K4323j60330K26398M1176k10711P5915q670k09177L7546L91320
$$ 1219268 1186431 1210754 1050424 1276822 1317998 1107287 1183202 1174532 965355 1002901 1394221
13870A394221P5869k11433l05553L01601k4510p0876M29672j64783m70151J03580
$$ 1394221 1470090 1258657 953104 1254705 1230195 1159319 1588991 1424208 954057 1057637
13860A057637K44640j31327J32932l02379O6786k07658L47736j26462j62719J0680
$$ 1057637 1302277 1170950 1303882 1001503 1068289 860631 1208367 1081905 919186 929866
13850I29866L739K34503l56310M81456l55520J84505l47933L57136Q267Q2536
$$ 929866 933605 1168108 811798 1293254 937734 1122239 774306 1131442 1139709 1222245
13840A222245J93983m55754k2461M7198J89974n8949j9957k31686K64932k96873
$$ 1222245 1416228 960474 938013 985211 1175185 1116236 1096279 864593 1129525 832652
13830H32652L18L92935k44409k58705J45385j37699j0309Q847J83708Q2868k74306
$$ 832652 832970 1225905 981496 722791 868176 730477 720168 729015 912723 995591 721285
13819G21285K44170l14717K30735K39425k35721K54411m33402l8045L54938j13872
$$ 721285 965455 650738 881473 1120898 885177 1139588 706186 668141 1023079 909207
13809I09207K20419k01837O3663k32100K58283p0223k53475J8218J5588o7931
$$ 909207 1129626 927789 991452 759352 1017635 947412 693937 712155 727743 659812
13799F59812L08689l96435N05836k78322j66469M28953l80278k2912J7632o4978
$$ 659812 968501 572066 1077902 799580 633111 1062064 681786 658874 676506 611528
13789F11528K41722K55076l74771k44833L05032j56913J86306K7760J31766l04757
$$ 611528 853250 1108326 733555 488722 793754 636841 823147 850907 982673 677916
13779F77916J67336J54951k51772L33555l09347K01472D57398M5777L01720J23104
$$ 677916 845252 1000203 748431 1081986 772639 974111 457398 503175 804895 927999
13769I27999D52923r516N20082l19712L4057l4787K10273R318B84894L20170J99756
$$ 927999 452923 443407 963489 643777 677834 643047 853320 862638 284894 605064 804820
13758H04820C54404J61776J19147N9383J4892k5394q6527J44848l67024L03302
$$ 804820 354404 516180 635327 694710 709602 684208 597681 742529 375505 678807
13748F78807j21151J16381j78621l4623K39918m0635r8855o4792J68720k84229
$$ 678807 557656 674037 495416 460793 700711 660076 561221 496429 665149 380920
13738C80920K64395k82914L1042K99860j91399L77755l59332l0616K831J21851
$$ 380920 645315 362401 393443 693303 501904 879659 520327 489711 492542 614393
13728F14393n7413J486B73663M94207k36001K71802P0151R7224O7284D63528K47110
$$ 614393 556980 558466 273663 767870 531869 803671 873822 971046 1038330 463528 710638
13717G10638C19962K92036j63365J08541j38079L37705B73005L40176L3581o9116
$$ 710638 319962 611998 448633 557174 419095 756800 273005 613181 646762 577646
13707E77646J65114J99297l37494o7135j44296J60892M1576K4660O9764C31566
$$ 577646 742760 942057 604563 537428 393132 554024 595600 620260 690024 331566
13696E63213k079k31351M25393j01553j72953J39787J7116r2399k05840j32009
$$ 563213 561134 329783 755176 653623 480670 620457 637573 545174 339334 207325
13686B07325L78192J09517q4546A94241K87676L9431j14341K11703D9111O82938
$$ 207325 585517 695034 610488 194241 481917 521348 407007 618710 49111 732049
13676G32049k54035J94797C35143Q4243J46892n7094j86769M23758n4526C27243
$$ 732049 478014 672811 335143 419386 566278 509184 322415 746173 691647 327243
13665A00920M25242j23937j91513P706N01925k54162Q2880P3533j90591A79671
$$ 100920 526162 402225 210712 218418 720343 466181 549061 622594 432003 179671
13654B65669K29722K7326N5083A01154L52268j00318j39738N9223l7319K34850
$$ 265669 495391 522717 577800 101154 453422 353104 213366 272589 235270 470120
13644D70120J15790j68194l907J19415k09703K95079l7595k72267L6193m4411
$$ 470120 585910 417716 413809 533224 323521 618600 581005 308738 344931 300520
13634C00520A38755K95803j36796O03461B21674J37487j20629J87522q9273L1928
$$ 300520 138755 434558 297762 901223 221674 359161 238532 426054 336781 368709
13624C68709j42868J34855J13782A9936K75288K07319j24739K4102A68040J51646
$$ 368709 225841 360696 474478 19936 295224 502543 377804 401906 168040 319686
13614C19686Q9020L7821O4475A45031K95393F1724M68642R8705o0756k62345J00980
$$ 319686 408706 446527 511002 145031 440424 61724 530366 629071 568315 305970 406950
13603D06950J18123m0801P6334B35636A04080L85428L4119K0608k51454J43704
$$ 406950 525073 484272 560606 235636 104080 489508 523627 544235 292781 436485
13593D36485P3252A78617K43332J14936j25754L2265A86279H3070L25674q5960
$$ 436485 509737 178617 421949 536885 411131 443396 186279 83070 408744 322784
13583C22784Q0338F1190N2648J93088P8837I5930J93921M61177o3385l15856j29547
$$ 322784 403122 61190 113838 306926 385763 95930 289851 751028 687643 371787 242240
13572B42240k591K32316k1442j62803O1675A68777O2189M4601K58003A65721J29063
$$ 242240 239649 471965 450523 287720 349395 168777 230966 275567 533570 165721 294784
13561B94784o7540J82887k2193F2667K88692j52210J45077J13016J59066j31636
$$ 294784 227244 410131 387938 62667 351359 199149 344226 457242 616308 484672
13551D84672L9856j33488l1725m7659G9197M49212B21653j03344N30991H2440
$$ 484672 524528 391040 359315 311656 79197 528409 221653 118309 649300 82440
13540E84062A94625K49024K8238J5511n7094Q793I5678J4724c4252D01009l0942
$$ 584062 194625 443649 471887 487398 430304 439097 95678 110402 -34252 401009 370067
13529C70067j37386L64863j31681j71411n9988J61060D5528M36819A64634J69535
$$ 370067 232681 597544 465863 294452 234464 395524 45528 482347 164634 334169
13519C34169R0676A56757R9657K55448j63698l544q1523D8745K54891L8231D8488
$$ 334169 424845 156757 256414 511862 348164 344620 263097 48745 303636 341867 48488
13507C57974A68798J73620A03039j3208a97625H3338B0617L693M13064B12951
$$ 357974 168798 342418 103039 89831 -197625 83338 20617 24310 437374 212951
13496c25330A98004R9733N5763k4687O4442j13042I7217L90739F0821L85941j31918
$$ -325330 198004 297737 353500 328813 393255 280213 97217 487956 60821 446762 314844
13485C14844L40589k89783K17667k48827h243B63453L27869j50976j99384Q6044
$$ 314844 655433 365650 583317 334490 -8243 263453 591322 440346 240962 327006
13475C27006q4973p7315j9333K57939j29891K47768f9671C95909k4381B9885J35124
$$ 327006 242033 164718 145385 403324 273433 521201 -69671 395909 371528 29885 165009
13464A65009K70759A52808J52260p7793M5629J2062D7286K2829O2184Q9625K92613
$$ 165009 435768 152808 305068 227275 272904 284966 47286 70115 132299 221924 514537
13453E14537A97858P6371r7745L0718J30034j20964B9969n422J93008O8909J13885
$$ 514537 197858 274229 176484 207202 337236 216272 29969 24547 217555 286464 400349
13442D00349J5280L8305B21652q9344k0754J70560D5172K17769A21947O5999j953
$$ 400349 415629 453934 221652 132308 111554 282114 45172 262941 121947 187946 185993
13431A85993L2780J09814I2453L39691e2303C23049A27889J52744k4323A13832
$$ 185993 218773 328587 92453 432144 -52303 323049 127889 280633 256310 113832
13420e155A62990P811E6082K79820A0219a05085B31692J76671A26164J94008f7063
$$ -5155 162990 170801 56082 335902 10219 -105085 231692 408363 126164 320172 -67063
13408A46713n39K0621j0788N4891J57879j79428O2185q7974L9468C6545K39378
$$ 146713 146174 166795 156007 210898 368777 189349 251534 163560 203028 36545 275923
13397B75923k8383c6898B03234c8445A58935K03681A10057J9773J57555D4221
$$ 275923 247540 -36898 203234 -38445 158935 362616 110057 129830 287385 44221
13386h3632A29208K19419b23A42854l2663K25848k3045E5193N6639J15199J8557
$$ -83632 129208 348627 -223 142854 110191 336039 312994 55193 111832 227031 245588
13375B45588H1127J27899J89632A27891P1870J49179j49455J6249P7948Q926l4099
$$ 245588 81127 209026 398658 127891 199761 348940 199485 215734 293682 302608 268509
13364B68509p9385o8035J52399r6982l6170e8467B90652K5291h7474h79G8177
$$ 268509 189124 121089 273488 176506 140336 -58467 290652 315943 -87474 -879 78177
13352B11960B6342b7231A23916K62282j56861n6601K35988L17321B51316o6902
$$ 211960 26342 -27231 123916 386198 229337 172736 408724 726045 251316 184414
13342A84414D9713j2769L97487C9465R6024K92244N646K3642G3996L31338j3818
$$ 184414 49713 36944 434431 39465 135489 427733 433379 457021 73996 405334 391516
13331C91516j84788O765I7516K76765j22784j00072M0429J22301I8679p326M83
$$ 391516 206728 213493 97516 374281 251497 151425 191854 314155 98679 91353 91836
13320I1836J08142K9648L33322A64356P6287K30732j20430A8764L20535j28756
$$ 91836 199978 229626 562948 164356 240643 471375 350945 18764 339299 210543
13310B10543L2248N7451c431n3009B91355c32427B77627q9903i314A16295J1493
$$ 210543 242791 300242 -3431 -56440 291355 -332427 277627 187724 -9314 116295 127788
13299A27788J32854H3347l9251J05540c31667A88366e1469b1576C8014L11001
$$ 127788 260642 83347 44096 149636 -331667 188366 -51469 -21576 38014 349015
13289C49015j35308J0435n7274J33489A32378b07187C4855a49425a952j53133
$$ 349015 213707 224142 166868 300357 132378 -207187 34855 -149425 -1952 -155085
13279a55085A46401c6459Q457j10492A40868J10979B6333L44145j2553A60108
$$ -155085 146401 -36459 -28002 -138494 140868 251847 26333 370478 357925 160108
13268c02506J37476A78490D8474L2555R7287C7297a71122C99660j00741O3j15819
$$ -302506 -165030 178490 48474 81029 178316 37297 -171122 399660 298919 298982 183163
13257A83163J11344Q3662A39755B0156d3394A8216K93184L19941A32734J30843
$$ 183163 294507 378169 139755 20156 -43394 18216 311400 631341 132734 263577
13247B63577Q0144j58004K14259c7197B16105p9970K2958N4584J3416e2816G25
$$ 263577 343721 185717 399976 -37197 216105 136135 159093 213677 227093 -52816 725
13235A16674K55000b9659o9699C4024J77712c6184J0280A04743D6444J95308c2759
$$ 116674 371674 -29659 -99358 34024 211736 -36184 -25904 104743 46444 241752 -32759
13223g0761C23088C8701J5856J29413b83342f0364j89454i082C10023a83461A793
$$ -70761 323088 38701 54557 183970 -283342 -60364 -249818 -9082 310023 -183461 1793
13211C20160F6299K01285q6573N0095M5590A13947e417G5114L29558A8446K9279
$$ 320160 66299 267584 181011 231106 276696 113947 -5417 75114 404672 18446 47725
13200D7725J0205J20848K10358q6001c2219A50616M27822B24615i1744A84987
$$ 47725 57930 178778 389136 303135 -32219 150616 578438 224615 -91744 184987
13189C28060A7297b1893j9214j129c145C6314J82728A5168a9318p7485C47819
$$ 328060 17297 -21893 -41107 -42236 -3145 36314 219042 15168 -19318 -96803 347819
13177B16663J8316K55182A90072J07416A29222f6819j25002C19464A29721J0000
$$ 216663 234979 490161 190072 297488 129222 -66819 -191821 319464 129721 139721
13167A39721c4911A48686g6204q7003A9525b1078I9040h1347j44803L4414A30686
$$ 139721 -34911 148686 -76204 -163207 19525 -21078 99040 -81347 -226150 -191736 130686
13155b1795A1788L3756a61308A72534J32758E1697J8376i5272n8010A81442P7748
$$ -21795 11788 45544 -161308 172534 305292 51697 70073 -95272 -153282 181442 259190
13144B59190f3002q8812b6327D9836J41004E2951R0029i7337k1642A62556J08301
$$ 259190 -63002 -151814 -26327 49836 190840 52951 142980 -97337 -118979 162556 270857
13133B70857a20700B32655J947j16935B4640b30312B12955B5598e1508B04020
$$ 270857 -120700 232655 234602 117667 24640 -230312 212955 25598 -51508 204020
13122E2330N1641J05497p8898a0128A21376b4744k50985B21226a39103J5688k7070
$$ 52330 103971 209468 130570 -10128 121376 -24744 -275729 221226 -139103 -123415 -150485
13111a50485B1959f1894A94357B6474Q2207L2258d149A14434J18201A04263K14475
$$ -150485 21959 -61894 194357 26474 108681 140939 -4149 114434 232635 104263 318738
13100C18738a11967A09416m7901J97503E8431M8981A0388K92047C7141L0489B5051
$$ 318738 -111967 109416 61515 259018 58431 107412 10388 302435 37141 67630 25051
13088a02598A38888a38529I4506o996P5815a01268a6667B89903i8262j42185J16389
$$ -102598 138888 -138529 94506 87510 163325 -101268 -16667 289903 -98262 -240447 -124058
13077a24058B10710a71656F9900J41819d4542p1313b4927n276E6102J43462a1463
$$ -124058 210710 -171656 69900 211719 -44542 -115855 -24927 -30203 56102 199564 -11463
13065d0652B62026G9167J02988O633K6141C747M41137A63835D1007j022Q5479
$$ -40652 262026 79167 182155 188788 214929 3747 444884 163835 41007 39985 125464
13054A25464O2009q4266a9623B73293r5999i9207A52463a4247j14991A64606J75721
$$ 125464 187473 103207 -19623 273293 177294 -99207 152463 -14247 -129238 164606 340327
13043C40327i2121n0358A86565D8236K94345H3668K5614O7557E4723h3569O455
$$ 340327 -92121 -142479 186565 48236 342581 83668 109282 176839 54723 -83569 -77114
13032g7114A11280L20222b51267A10798R0902a20931A40680E966K00029A02792
$$ -77114 111280 431502 -251267 110798 201700 -120931 140680 5966 205995 102792
13021a7287p0477B61544A30749C2694d319D24529J07060d6843B0290O7366K95085
$$ -17287 -87764 261544 130749 32694 -4319 424529 531589 -46843 20290 87656 382741
13010C82741K8726k2686A3728a16904d395j21858j0266B02356m7813Q4870e670
$$ 382741 411467 388781 13728 -116904 -4395 -126253 -136519 202356 154543 239413 -5670
12998h7248C46544f3722J3045j24658O8254E9852k1224e6964I3431J61912b4692
$$ -87248 346544 -63722 -50677 -175335 -107081 59852 38628 -56964 93431 255343 -24692
12986A17021K34095K5214b97073F5606a56893A01838J23936a09101D5104c9747
$$ 117021 351116 376330 -297073 65606 -156893 101838 225774 -109101 45104 -39747
12975D36214a12722K1856j69700B89084m4504o4797N1048A03257a07931C09405
$$ 436214 -112722 -90866 -260566 289084 244580 179783 230831 103257 -107931 309405
12964F8807c3075B6265J77837l4907C9187J2306J13053G4432K64773A32297p158
$$ 68807 -33075 26265 204102 169195 39187 51493 164546 74432 339205 132297 125139
12953A25139a65449A32460R2320E5732R2185Q9301e9753q2470K2090L8440A74098
$$ 125139 -165449 132460 224780 55732 147917 237218 -59753 -142223 -120133 -81693 174098
12941B54593M2961d4031J0544A4262Q8281A7699M6963J16879q072a95502B16558
$$ 254593 297554 -44031 -33487 14262 102543 17699 64662 181541 173469 -195502 216558
12929a02908B73443a3357B32989m202c27268B00707c14566B8296d7948B09456
$$ -102908 273443 -13357 232989 228787 -327268 200707 -314566 28296 -47948 209456
12918A44122a89828E2914R97A4602i6115B7230L19977b1865A31724J72285e0677
$$ 144122 -189828 52914 53911 14602 -96115 27230 347207 -21865 131724 304009 -50677
12906C4883a51962B30511R1581a88963j71155b1078j66340E1678J4283L8350K71292
$$ 34883 -151962 230511 322092 -188963 -360118 -21078 -187418 51678 65961 104311 375603
12895C75603a12586C4969J9957a87633M0218P0071D2896Q6954L3505k2725g1739
$$ 375603 -112586 34969 54926 -187633 -147415 -77344 42896 129850 163355 140630 -71739
12883c25794D27382A71674a40412e1901C6226b39470i3608b1784k40135a22902
$$ -325794 427382 171674 -140412 -51901 36226 -239470 -93608 -21784 -261919 -122902
12872G3124J15493h6456r4299E0118K64038a69380g3045H6319i0029d2569j87759
$$ 73124 188617 -86456 -180755 50118 314156 -169380 -73045 86319 -90029 -42569 -230328
12861b30328K3799a9311k69679P1255c6084A95887f69195C66742a00912A84735
$$ -230328 -206529 -19311 -288990 -217735 -36084 195887 -669195 366742 -100912 184735
12850a50856A59704M8305K7473K6229b97148g1961D5194j2904d2882J9495B03608
$$ -150856 159704 208009 235482 261711 -297148 -71961 45194 32290 -42882 -23387 203608
12838B422J69642e1526F1022L4137e5716B6094a31360E41409f1293j28932p1843
$$ 2422 172064 -51526 61022 95159 -55716 26094 -131360 541409 -61293 -190225 -262068
12827b62068J03997f7297D316e3375B9808i3838A24936a5629B81374a6723C0302
$$ -262068 -158071 -67297 4316 -53375 29808 -93838 124936 -15629 281374 -16723 30302
12815g3063B09804J65343l8302G9743K5880a98366n390c1822j16444B9050O2695
$$ -73063 209804 375147 336845 79743 105623 -198366 -203756 -31822 -148266 29050 91745
12804I1745K15982c21492A71828j5201G2238C0647J16657K0066o9409d14007e8162
$$ 91745 307727 -321492 171828 156627 72238 30647 147304 167370 97961 -414007 -58162
12792A48697B7165R6506J37618a1327q909C08185a32480I6756l7314e0427B7167
$$ 148697 27165 123671 261289 -11327 -20236 308185 -132480 96756 59442 -50427 27167
12780a76104A28265A1735g1390j21956j1099A73127b8477n5738C2801Q2486g0018
$$ -176104 128265 11735 -71390 -193346 -204445 173127 -28477 -84215 32801 115287 -70018
12768B68513Q1097A67173E391b91230K9777H9905f1975l13756a50983A02627a13496
$$ 268513 349610 167173 5391 -291230 -261453 89905 -61975 -375731 -150983 102627 -113496
12756a86256R0357B73032a09324J6788j63684C33348a46797B9037l414L90649
$$ -186256 -95899 273032 -109324 -92536 -256220 333348 -146797 29037 25623 416272
12746D16272F1369l133J55394g7001j54893B3321b3788A51041E4657A6007L30421
$$ 416272 61369 58236 213630 -77001 -231894 23321 -23788 151041 54657 16007 346428
12735C46428A28532a55488D23679k09695d3704K0460A25301n290R0727O024f1403
$$ 346428 128532 -155488 423679 213984 -43704 -23244 125301 120011 210738 216762 -61403
12723B93532N8901A12453Q9036F8840a0419D5733f1804o3032k26765a07634d3786
$$ 293532 352433 112453 201489 68840 -10419 45733 -61804 -124836 -351601 -107634 -43786
12711a595A47605Q2765p2215n9743M35645j92264J81498e5991E50276a28369h470
$$ -1595 147605 230370 158155 98412 534057 341793 523291 -55991 550276 -128369 -8470
12699F6000J26431A0655b95959B29213j547g1253F1637J33955I3458b1891k9252
$$ 66000 192431 10655 -295959 229213 227666 -71253 61637 195592 93458 -21891 -51143
12688e1143K5408a0052J545B86533B8616b00360B07703F3314d9444p8129E0641
$$ -51143 -25735 -10052 -8507 286533 28616 -200360 207703 63314 -49444 -127573 50641
12676D87372A26666m413f900B91993a27340A31095P2410L7587B1096i5111M2049
$$ 487372 126666 122253 -6900 291993 -127340 131095 203505 241092 21096 -95111 -53062
12665e3062B27398J12534j61584A2697J45635d3093C85999j48999a69002A87866
$$ -53062 227398 339932 178348 12697 158332 -43093 385999 237000 -169002 187866
12654A60298K55951E0435B1417J78180Q4499L7651A00064O6434a25888e4174A8485
$$ 160298 416249 50435 21417 199597 284096 321747 100064 166498 -125888 -54174 18485
12642a8349l03253a39943G0848K48675a00533L8272F3826K52139A17133J44567
$$ -18349 -321602 -139943 70848 319523 -100533 -62261 63826 315965 117133 261700
12632B61700A01180J181c3402I2178P1953p1712M04420b63666A09653J88038R7224
$$ 261700 101180 102361 -33402 92178 164131 92419 496839 -263666 109653 297691 394915
12621C94915j26817K2158m3319a49287G021K38479F1956J7569J6982l701a8851
$$ 394915 268098 290256 246937 -149287 7021 245500 61956 79525 96507 92806 -18851
12609a95515B63911o5909N6833A6380M01371e5818B0173J28658a7339l6007R080
$$ -195515 263911 198002 254835 16380 417751 -55818 20173 148831 -17339 -53346 -44266
12598d4266C11147b48533g1616B25624N2494n88i2961B12801a63107C47019j28309
$$ -44266 311147 -248533 -71616 225624 278118 277530 -92961 212801 -163107 347019 218710
12587B18710a05567K5999C45612a32678c8381I0926a78184b1303A15584a07204
$$ 218710 -105567 -79568 345612 -132678 -38381 90926 -178184 -21303 115584 -107204
12576A84428K94581A24552K57381A75825C0312J4963O5817J20624A15378a71639
$$ 184428 479009 124552 381933 175825 30312 45275 111092 231716 115378 -171639
12565h6849R307G2416a5922j13698d0295d531j8604G6856c2013E8109q019m06
$$ -86849 -77542 72416 -15922 -129620 -40295 -4531 -23135 76856 -32013 58109 50090 49684
12553D9684j5254b31012I7987l0678Q3121d003A87656b29101O3249A28902Q5966
$$ 49684 34430 -231012 97987 67309 150430 -4003 187656 -229101 -165852 128902 214868
12542B14868j01091f7841A21761b2902n8922K6439l10453G4339j3022Q6513d843
$$ 214868 113777 -67841 121761 -22902 -81824 -55385 -365838 74339 61317 147830 -4843
12530C11947A47002E8142K2203K32133J28499A81394E7463G257Q2802Q9730h6953
$$ 311947 147002 58142 80345 312478 440977 181394 57463 7257 90059 179789 -86953
12518c17903B4400f2684B69799b15829D7375p296a5295j74125D8121J42401A4856
$$ -317903 24400 -62684 269799 -215829 47375 40079 -15295 -189420 48121 190522 14856
12506a09516B38564o2321E200b44471A49300a51184F4397B5038a34965C1526j797
$$ -109516 238564 176243 5200 -244471 149300 -151184 64397 25038 -134965 31526 29729
12495B9729a10850p564N8283b3404r6983F0507E989R332J05976a6187q882D0930
$$ 29729 -110850 -118414 -60131 -23404 -120387 60507 5989 15321 121297 -16187 -25069 40930
12482C44764A42955a54282a6295j29360D02912j73722d281k26454i156m4612F2021
$$ 344764 142955 -154282 -16295 -145655 402912 229190 -4281 -230735 -9156 -53768 62021
12470c16596A12902n5652L32916b64191E9403P8576K42515a6544H3370J56449
$$ -316596 112902 57250 390166 -264191 59403 137979 380494 -16544 83370 239819
12460B39819b18764j15664I1651J094g3993j6164r0624A06555l189b98932J21891
$$ 239819 -218764 -334428 91651 92745 -73993 -90157 -180781 106555 103366 -298932 -177041
12449a77041A82472k3620F3574K46416b0176E35718c8659q6296b1491D9686a5277
$$ -177041 182472 158852 63574 309990 -20176 535718 -38659 -124955 -21491 49686 -15277
12437a2909A01434R5756j3095B8919b88896M8293I1005b4115A99720J29418D6782
$$ -12909 101434 197190 184095 28919 -288896 -240603 91005 -24115 199720 329138 46782
12425H5380L27422a23012J0379l9394c6032P95F240K24243G2339h1161n8255E9723
$$ 85380 412802 -123012 -112633 -152027 -36032 -35237 6240 230483 72339 -81161 -139416 59723
12412b47780b9528g631A56368D86P5404a43467d1771F9493a85156j1000d4635
$$ -247780 -29528 -7631 156368 486 75890 -143467 -41771 69493 -185156 -196156 -44635
12400D29038e8944l6812A27973d1795A09442d8929B68886f8636j67408A08817
$$ 429038 -58944 -95756 127973 -41795 109442 -48929 268886 -68636 -236044 108817
12389d7105C32791j19708d0396E2484b8298p0994I395L7075b73520A71408F8433
$$ -47105 332791 213083 -40396 52484 -28298 -99292 9395 46470 -273520 171408 68433
12377d4598k77710a27040B313M9907d10331J34567a4478j19310J877E9020k679
$$ -44598 -322308 -127040 2313 52220 -410331 -275764 -14478 -133788 -131911 59020 56341
12366E6341J09944a40450I5372J17733b46588B595J83093b20520A82727c39229
$$ 56341 166285 -140450 95372 213105 -246588 2595 185688 -220520 182727 -339229
12355a07623E7598a43556b5414D6651J5181f9332B4907d18701A36480N0347K03642
$$ -107623 57598 -143556 -25414 46651 61832 -69332 24907 -418701 136480 186827 390469
12344C90469a73251P0699b2287k91166a48397b090D6618K7108P5863L0185l2986
$$ 390469 -173251 -102552 -22287 -313453 -148397 -2090 46618 73726 149589 179774 146788
12333A46788A8046K72627b7816e116B60279i7558A98518a21844j75883C2359n075
$$ 146788 18046 290673 -27816 -5116 260279 -97558 198518 -121844 -297727 32359 27284
12322B7284j0421J02682A9944a04779c2379j87732D4358d3793j02298e7083A83746
$$ 27284 16863 119545 19944 -104779 -32379 -220111 44358 -43793 -146091 -57083 183746
12310a86595H8073k0118a73038j9097i1985A14429b70936C0172b5133A58352F3745
$$ -186595 88073 67955 -173038 -192135 -91985 114429 -270936 30172 -25133 158352 63745
12298b96573C839K11273k6467e2722m8735B19165d2942B44663R4375j31880J78944
$$ -296573 3839 215112 188645 -52722 -101457 219165 -42942 244663 339038 207158 386102
12287C86102A40989l0522J54443d8856A16565f6682F1751g4010p856A18873J55176
$$ 386102 140989 110467 264910 -48856 116565 -66682 61751 -74010 -81866 118873 274049
12276B74049a39488O2130C90966j79868J72006Q1854b26538A15674K65345l5641
$$ 274049 -139488 -77358 390966 211098 383104 464958 -226538 115674 381019 345378
12266C45378j15145a12205A82103J52014q728A33443a2777j62752A20120c8662
$$ 345378 230233 -112205 182103 334117 325389 133443 -12777 -175529 120120 -38662
12255B19771i9258C6726J65812r1869N4933Q154e4888A71966P7310k1096a9496
$$ 219771 -99258 36726 202538 110669 165602 173756 -54888 171966 249276 228180 -19496
12243A83270P1267o5864a66271d4415D9492K622B5792L12187A30791a26708b6402
$$ 183270 254537 188673 -166271 -44415 49492 52114 25792 337979 130791 -126708 -26402
12231D8369b9955C89426j81855a66771d5969D70423B0037J76632l3038k8497J89803
$$ 48369 -29955 389426 207571 -166771 -45969 470423 20037 196669 163631 135134 324937
12220C24937r1844J49613A20524k4993a54679A78065Q5335q5199c8546G3189e704
$$ 324937 233093 382706 120524 95531 -154679 178065 263400 178201 -38546 73189 -5704
12208A6758d5739B05079k0382m391A0516J42170A0043M11775A26240l6355k2914
$$ 16758 -45739 205079 184697 180306 10516 152686 10043 421818 126240 89885 66971
12197F6971Q4603a6848k8621B32252K30920A17512n330i6613l6835A89094E083
$$ 66971 151574 -16848 -45469 232252 463172 117512 112182 -96613 -133448 189094 5083
12185C93849o0746a37010f4850C31636d4540m4833I6052C7367K23335A22654b84221
$$ 393849 333103 -137010 -64850 331636 -44540 -89373 96052 37367 260702 122654 -284221
12173E4973a52333I712Q3647d2197q9951C26541j21174l90F2266N6538K13816
$$ 54973 -152333 9712 93359 -42197 -132148 326541 205367 204977 62266 118804 332620
12162C32620b7467D1149a18085G2580p736J66012a31593F5469B8041J07728f1875
$$ 332620 -27467 41149 -118085 72580 64844 230856 -131593 65469 28041 135769 -61875
12150B59600H5468a64009A83551n0625i2775j13972A40270a86378A22909R4322
$$ 259600 85468 -164009 183551 132926 -92775 -206747 140270 -186378 122909 217231
12140B17231M9191F5079K01840b0329C86529A5330O5634J30787a42517C30254
$$ 217231 266422 65079 266919 -20329 386529 15330 80964 211751 -142517 330254
12129b80806i0746j5133C28638a2051j29288I4609f8390E2270j6445J28891a5627
$$ -280806 -90746 -105879 328638 -12051 -141339 94609 -68390 52270 35825 164716 -15627
12117c30332I906a1371B49435a45321I0425i7238A75823o5195C2817b02444j33641
$$ -330332 9906 -11371 249435 -145321 90425 -97238 175823 110628 32817 -202444 -336085
12106c36085B1643K80366F8015L1012j0044b24898B60659d18342c3913A03783
$$ -336085 21643 302009 68015 99027 88983 -224898 260659 -418342 -33913 103783
12095a38104A92204p7924b991k80078J2031a31346b7722A35481m6423R7326a591
$$ -138104 192204 114280 -2991 -283069 -271038 -131346 -27722 135481 89058 186384 -1591
12083A41980a14128F0541d4950G9934a23324B74335a12259D73075J76602J903092
$$ 141980 -114128 60541 -44950 79934 -123324 274335 -112259 473075 649677 2552769
12073B552769j201434D04554j49037E2498M1788A4266e9811j15933i160B27687
$$ 2552769 1351335 404554 255517 52498 94286 14266 -59811 -175744 -9160 227687
12062C91213g9688A03049c9585A43794K1850e9016K5950j15369d2769l8559G6141
$$ 391213 -79688 103049 -39585 143794 165644 -59016 -33066 -148435 -42769 -81328 76141
12050b70311C05679L1028a10849A53202d1451A87069f7772a8142j141k29119O4576
$$ -270311 305679 336707 -110849 153202 -41451 187069 -67772 -18142 -19283 -248402 -183826
12039a83826C55594a95658f4717b909C12816F1434a07179k31687a16066K0272
$$ -183826 355594 -195658 -64717 -2909 312816 61434 -107179 -338866 -116066 -95794
12029i5794B20952a11745d3170a369j25822B4360a13326B33528J76885n6427F4317
$$ -95794 220952 -111745 -43170 -1369 -127191 24360 -113326 233528 410413 353986 64317
12017a00334A70602f3399A11046D9331d6462n023j31514c7229l0831A90425E5312
$$ -100334 170602 -63399 111046 49331 -46462 -51485 -182999 -37229 -68060 190425 55312
12005B12R2063J24840a99144G2596a45373E7857c3649m9215B48034A4611J8206
$$ 212 92275 217115 -199144 72596 -145373 57857 -33649 -82864 248034 14611 32817
11994C2817b73634B74253a16546h151j04495E3587c31671C27779d06758J51885
$$ 32817 -273634 274253 -116546 -8151 -112646 53587 -331671 327779 -406758 -254873
11984b54873A16983b51085B34339b0915l2670k27810A13671J81086i0883m8004
$$ -254873 116983 -251085 234339 -20915 -53585 -281395 113671 294757 -90883 -138887
11974a38887H3827K0449c4520j25918e7088K0462l1713a5864k72936J29549e3646
$$ -138887 83827 104276 -34520 -160438 -57088 -36626 -68339 -15864 -288800 -159251 -53646
11962i3156N869B865J32922M490J09214C822J23255k5113b3822A61357h9933B0118
$$ -93156 -87287 2865 135787 140277 249491 3822 127077 101964 -23822 161357 -89933 20118
11949A2071J01675b54685N0523l23810K57346A02649L0902a55663F2372k1281
$$ 12071 113746 -254685 -204162 -527972 -270626 102649 133551 -155663 62372 41091
11939D1091b3253j5790k9875A92238a07732d5226E5970c64365J60285d5626D079
$$ 41091 -23253 -39043 -68918 192238 -107732 -45226 55970 -364365 -204080 -45626 4079
11927d82015b31735n1672e8578D5095b29694A15548b621A48477a99990A04433
$$ -482015 -231735 -283407 -58578 45095 -229694 115548 -2621 148477 -199990 104433
11916a60155j6762A15143n3938a11094C27307a98983k6755L729d2905A73323D8634
$$ -160155 -176917 115143 61205 -111094 327307 -198983 -225738 -222009 -42905 173323 48634
11904A07354a04574J2167K1636E835h0121B2807a2895A8319K14951c97659J98495
$$ 107354 -104574 -92407 -70771 5835 -80121 22807 -12895 18319 233270 -397659 -199164
11893a99164K9432l3160A12747l0419O5072m7968m3384M0332C2261b55353R6652
$$ -199164 -169732 -202892 112747 82328 147400 99432 56048 96380 32261 -255353 -158701
11882a58701B47107a11347E0630c2245B14183B4510a69526B17114f6924I9749
$$ -158701 247107 -111347 50630 -32245 214183 24510 -169526 217114 -66924 99749
11871a10780C26481i6549q3491d5481k01039G7378b94556J28103d809m0360j23743
$$ -110780 326481 -96549 -180040 -45481 -246520 77378 -294556 -166453 -4809 -45169 -168912
11860a68912j5944O902P8401C9081K29517b70250j54652e292k99458A6648e4745
$$ -168912 -184856 -177954 -99553 39081 268598 -270250 -424902 -5292 -304750 16648 -54745
11848A18679l4613e8162m2341F0748a01192k16370d9080A09309j3780b55676C6148
$$ 118679 84066 -58162 -100503 60748 -101192 -317562 -49080 109309 95529 -255676 36148
11836C08418c77451A39875a04963j88553a21622H6038d2173r144j77618C1572
$$ 308418 -377451 139875 -104963 -293516 -121622 86038 -42173 -51317 -228935 31572
11825A21251N0265f1661C72427D6628b29652M4819n9978e9589A50500J34259a29388
$$ 121251 171516 -61661 372427 46628 -229652 -184833 -244811 -59589 150500 284759 -129388
11813C3188b24673A97412j9938h5352a8282B14716p854p0974J94357c31259a34377
$$ 33188 -224673 197412 177474 -85352 -18282 214716 206862 135888 330245 -331259 -134377
11801A48670O4530a66976P6980J9244A66540e7295p1545D4829b47196R3648O9001
$$ 148670 213200 -166976 -89996 -70752 166540 -57295 -128840 44829 -247196 -153548 -84547
11790h4547G9725B237a0151E5450a7107D56282b55180E1965O2835K1417a26151
$$ -84547 79725 2237 -10151 55450 -17107 456282 -255180 51965 114800 136217 -126151
11778A68126q1922n680f3164H8255C1382J06971K85171j67205C1760a74133l9811
$$ 168126 86204 80524 -63164 88255 31382 138353 423524 256319 31760 -174133 -213944
11767b13944f4100A86440e8982l5512q6193a8600A7841h5317l3406n1080H2251
$$ -213944 -64100 186440 -58982 -94494 -180687 -18600 17841 -85317 -118723 -169803 82251
11755b12198F7199N5011b16776I4246Q6233K0892K16179b63119a31248B48521
$$ -212198 67199 122210 -216776 94246 180479 201371 417550 -263119 -131248 248521
11744g077A85733A6950a83681A65826m1398C4241d7149p8769D16228E5216b83713
$$ -7077 185733 16950 -183681 165826 124428 34241 -47149 -125918 416228 55216 -283713
11732A11792N1487h4733j09899E1251J48725g2410G6965O2408N0803J74314A30960
$$ 111792 163279 -84733 -194632 51251 199976 -72410 76965 139373 190176 364490 130960
11720B39401g1726h034A25633j555R9606b9046C7874a88987M9514m4039A05212
$$ 239401 -71726 -8034 125633 124078 223684 -29046 37874 -188987 -139473 -183512 105212
11708C6033a48003j4983r7398k23816B08810q3964J40069E3682c8406l09068A29492
$$ 36033 -148003 -162986 -260384 -484200 208810 124846 264915 53682 -38406 -347474 129492
11696a21727j95637J19851b3305B4341h808j07010A68802f5202o5399j7184B18128
$$ -121727 -317364 -197513 -23305 24341 -8808 -115818 168802 -65202 -130601 -147785 218128
11684D342a99274A22740a33877D188N68389B1569A384L01965C9753R3226b20948
$$ 4342 -199274 122740 -133877 4188 572577 21569 1384 303349 39753 132979 -220948
11672g7050B3113b519C83219d5064l3735k4950D2159J95473j8892b43884C5158
$$ -77050 23113 -2519 383219 -45064 -78799 -103749 42159 237632 218740 -243884 35158
11660a3159L689r5664A95388b30357L5293A65365F6659c31213D6382J52620a54123
$$ -13159 -9470 -105134 195388 -230357 -195064 165365 66659 -331213 46382 199002 -154123
11648I8467K75016A52939R7527f6586A65982a76332G1143c1664b637p7627O680
$$ 98467 373483 152939 250466 -66586 165982 -176332 71143 -31664 -2637 -80264 -73584
11637g3584A36942c3323j72453j3329H266K90795m1274A04a40332f9489K6907
$$ -73584 136942 -33323 -205776 -219105 8266 299061 257787 104 -140332 -69489 -42582
11626d2582e879A07092n0242N9002J9003A6456b3526A39134a30677A10414L88250
$$ -42582 -5879 107092 56850 115852 134855 16456 -23526 139134 -130677 110414 498664
11615D98664g7393j37217g429m6478D3461c80755A67551D8900a57733B13792H1773
$$ 498664 -77393 -214610 -7429 -53907 43461 -380755 167551 48900 -157733 213792 81773
11603F0597a03055j23339R8676A31760e7654A34920D6034O3176k6700L6550b87132
$$ 60597 -103055 -226394 -127718 131760 -57654 134920 46034 109210 82510 119060 -287132
11591C43069a00402G2271J02739h1520G3921A3186d2714E7502J8150M90011I7659
$$ 343069 -100402 72271 175010 -81520 73921 13186 -42714 57502 75652 565663 97659
11579E6662B3547J42986i5877M0731A43855f4184A96933I5624a0370A37540K24431
$$ 56662 23547 166533 -95877 -55146 143855 -64184 196933 95624 -10370 137540 361971
11568C61971A41505a3741G9076K48682I7151a13973B84070q7322l080J13469l9364
$$ 361971 141505 -13741 79076 327758 97151 -113973 284070 196748 193668 307137 267773
11557B67773a92302f2719j14017J9813E2348O5949p81K48107H3893q625K82520
$$ 267773 -192302 -62719 -176736 -156923 52348 118297 117516 365623 83893 75268 357788
11546C57788c6846Q847C14807a76929Q3398A86605O3788g7936L2048a2415H1076
$$ 357788 -36846 -27999 314807 -176929 -93531 186605 250393 -77936 -45888 -12415 81076
11534B04303b35764A65701R1248H9664J17597R906j03179J92727k064A6908Q3027
$$ 204303 -235764 165701 256949 89664 207261 217167 113988 306715 304651 16908 99935
11523I9935d1109A07393a7186j39312B92872P4391G4304a56988c8020A59838m8405
$$ 99935 -41109 107393 -17186 -156498 292872 367263 74304 -156988 -38020 159838 111433
11512A11433i4840D91739k35288G7236l5925b34958A03556a78926M7088m0858
$$ 111433 -94840 491739 256451 77236 41311 -234958 103556 -178926 -131838 -172696
11502a72696c0568H9918a12736f991A08770J35806a75720E4113b30205F51900
$$ -172696 -30568 89918 -112736 -6991 108770 244576 -175720 54113 -230205 651900
11491I4296L06841a06290A93934m9200d0513B34445m2716b90276i23A22631D1336
$$ 94296 401137 -106290 193934 144734 -40513 234445 191729 -290276 -923 122631 41336
11479a00268B88745r8465J34141j56891P8109R1050a38842B29184c2870H4904
$$ -100268 288745 190280 324421 167530 245639 336689 -138842 229184 -32870 84904
11468C33774F7J46699F8008b1878F6591a0300G3052g472C01932e4876o6311M5286
$$ 333774 67 146766 68008 -21878 66591 -10300 73052 -7472 301932 -54876 -121187 -75901
11456g5901A84906D1950f402G489K33636B0492a8477n4617A05972b14040G0809
$$ -75901 184906 41950 -6402 7489 241125 20492 -18477 -73094 105972 -214040 70809
11444A11956K13639e6118j64748C51296C5081J89326R4022A7834J36904h5800
$$ 111956 325595 -56118 -220866 351296 35081 224407 318429 17834 154738 -85800
11433c52615E1276J32937H2849j8560i3450o080C02229f0914j80485f6954E5174
$$ -352615 51276 184213 82849 64289 -93450 -99530 302229 -60914 -241399 -66954 55174
11421A43085J4224a09073B2592j481b83665C86764A2578N4943R1140B0167M1100
$$ 143085 157309 -109073 22592 21111 -283665 386764 12578 67521 158661 20167 61267
11410F1267c31991B48320J31937p9888f5117A25738B9555a52659B59051a5456
$$ 61267 -331991 248320 380257 300369 -65117 125738 29555 -152659 259051 -15456
11399g3119j1592B60878E170Q2209J00391a19139A26194c67197g6861j02093P4321
$$ -73119 -84711 260878 5170 87379 187770 -119139 126194 -367197 -76861 -178954 -104633
11388a04633A60204C1391A044e0182L715j08607L3747A26108j0569J80893b70033
$$ -104633 160204 31391 1044 -50182 -46467 -155074 -121327 126108 115539 296432 -270033
11376a01852H2210g7771j2760j2362G265a16011r5628R1684l83574B11222j9612
$$ -101852 82210 -77771 -90531 -102893 7265 -116011 -211639 -119955 -503529 211222 191610
11365A91610a54737f8593A80170c25l6134j87767G8017d6668j2352A4425d1837
$$ 191610 -154737 -68593 180170 -325 -36459 -224226 78017 -46668 -59020 14425 -41837
11353A18638R270A8265R3906m8927l1543Q5703b53325D07229G4088b11601f9596
$$ 118638 127908 18265 112171 63244 31701 117404 -253325 407229 74088 -211601 -69596
11341A84027d5290l22735J32878i4194B41871e888j9477E702a13681B11079a09146
$$ 184027 -45290 -368025 -235147 -94194 241871 -5888 -25365 5702 -113681 211079 -109146
11329A2211b10544E768O7311Q6296J89164b04923M6719j56782g1261J2007n9288
$$ 12211 -210544 5768 73079 159375 348539 -204923 -158204 -314986 -71261 -59254 -118542
11318a18542B27597R7837C7609J53011h3311j4932j97491A25136g9737K050A38471
$$ -118542 227597 325434 37609 190620 -83311 -98243 -295734 125136 -79737 -77687 138471
11306a82750A16137K61535H8419a07127c8199A79746J9094b38088N6627B6801
$$ -182750 116137 377672 88419 -107127 -38199 179746 198840 -238088 -181461 26801
11295A82107K14165a78299B0982R6442b36138j9558o1791B89652a38841L1411
$$ 182107 396272 -178299 20982 117424 -236138 -255696 -317487 289652 -138841 -107430
11285a07430J2921B23737B7289b4995a882A0931M468a67060D5799i8100j39895
$$ -107430 -94509 223737 27289 -24995 -1882 10931 15399 -167060 45799 -98100 -237995
11274b37995J02393A58902l3022b23947L7447A8499c1200j39278P592B72886a2222
$$ -237995 -135602 158902 125880 -223947 -186500 18499 -31200 -170478 -162886 272886 -12222
11262C8034e4214j34249k7551A22681a68967f356l6304j07141c6430C41263C1589
$$ 38034 -54214 -188463 -216014 122681 -168967 -6356 -42660 -149801 -36430 341263 31589
11250a61868C00493h4378k53210E0136J44208k3380b28406R6967C06307d81250
$$ -161868 300493 -84378 -337588 50136 194344 170964 -228406 -131439 306307 -481250
11239C21589I8171c01489f3009E297c57918F2513b1525j20544N7745F0070a67358
$$ 321589 98171 -301489 -63009 5297 -357918 62513 -21525 -142069 -84324 60070 -167358
11227c29202i5251A02591a47077L6412A53221g4778D0040J74295G9005b43602
$$ -329202 -95251 102591 -147077 -110665 153221 -74778 40040 214335 79005 -243602
11216a7163C903J76030f32415K95936J8800A93901R0918a72638B84607a16961
$$ -17163 3903 179933 -632415 -336479 -317679 193901 284819 -172638 284607 -116961
11205a22305L3405K7162J6999b642A39645I622B195R5945j8181a01616A8306M9813
$$ -122305 -88900 -61738 -44739 -2642 139645 9622 2195 98140 79959 -101616 18306 68119
11193F8119L7033b78662A0217f9891H2037b20300l0233A08341I8a95665A68098
$$ 68119 105152 -278662 10217 -69891 82037 -220300 -250533 108341 98 -195665 168098
11181a6937E8550J35836a93174L8409A78950i4013g94j25860j31261b7489A70907
$$ -16937 58550 194386 -193174 -154765 178950 -94013 -794 -126654 -257915 -27489 170907
11169A03955b23206A25933o0790c7035H9844p245J45466F4390a96138g5944j03014
$$ 103955 -223206 125933 65143 -37035 89844 82599 228065 64390 -196138 -75944 -178958
11158a78958h1011m7604N52q0282k0205A22506f7856A06725h6859o2810A25102
$$ -178958 -81011 -128615 -128063 -208345 -228550 122506 -67856 106725 -86859 -149669 125102
11146I0344b23202q9048F4636J83870B2111b36661B28679K570b40215C2903J61346
$$ 90344 -223202 -312250 64636 248506 22111 -236661 228679 231249 -240215 32903 194249
11135A94249a45735C0130J61410E6395J5891J51001L31048F7215J64170B1252
$$ 194249 -145735 30130 191540 56395 72286 223287 554335 67215 231385 21252
11124A11556J2428j8149j9735b26856a0266r9144A68372N0318a80077K5090c3983
$$ 111556 123984 105835 86100 -226856 -10266 -109410 168372 218690 -180077 -154987 -33983
11112a34302B65036l8730a7446j65010P5410j456C4961J2167K79588f9169F0644
$$ -134302 265036 226306 -17446 -182456 -107046 -108502 34961 47128 326716 -69169 60644
11100A60336J23258A27851J43766J49864G7870K19285A29501g4891A35863l6222
$$ 160336 283594 127851 271617 421481 77870 297155 129501 -74891 135863 99641
11090I9641b17661B35043K2200L2804J81820A23927L8432L33298A26147l7524
$$ 99641 -217661 235043 257243 290047 471867 123927 162359 495657 126147 88623
11080H8623J37102h907E19465j75883m9882A09106J92572B684K19993M84866k51937
$$ 88623 225725 -8907 519465 343582 293700 109106 301678 2684 222677 707543 455606
11069D55606A80489K46661k03345N04610C44536L2544Q2431J6881J52333k65424
$$ 455606 180489 427150 223805 728415 344536 377080 459511 476392 628725 363301
11059C63301j15583K23507j89713N60916R1834l35404q2077M60495l28025L4591
$$ 363301 247718 471225 281512 842428 934262 598858 516781 977276 649251 683842
11049F83842K0161k30227J39789k37316J90501J28077j47204M67462n9519p5933
$$ 683842 704003 473776 613565 376249 566750 694827 547623 1015085 955566 879633
11039H79633l07333J52275J3808J9783J35136p4811j40030J81870l67113K23934
$$ 879633 572300 724575 738383 758166 893302 818491 678461 860331 493218 717152
11029G17152K60445m78724J03024M55194l57439J89588j39789C73854P6974J17167
$$ 717152 977597 498873 601897 1057091 699652 889240 749451 373854 450828 567995
11019E67995J41233K76812l99020J07377o8705n3819P536L34154j86894r8538
$$ 567995 709228 986040 587020 694397 625692 571873 579409 913563 726669 628131
11009F28131J01405k58393q7201K78520k12982P8316j03446O7162j41399K52369
$$ 628131 729536 471143 383942 662462 449480 527796 424350 491512 350113 602482
10999F02482A81004O49791m01331J21867J97152N7362k14297L7410k0450L47161
$$ 602482 181004 830795 429464 551331 748483 805845 591548 628958 608508 955669
10989I55669m48523L42108r7975P4661J21504J09331k40737J19288M80298R1907
$$ 955669 507146 849254 751279 825940 947444 1056775 816038 935326 1415624 1507531
10979A507531j40367k78118M72772K30835N7303K67341N36939M28272k44862K80527
$$ 1507531 1367164 1089046 1561818 1792653 1849956 2117297 2654236 3082508 2837646 3118173
10969C118173m52845L00426j70537n78011j03832j45514k71986k77284K47122
$$ 3118173 2665328 2965754 2795217 2217206 2113374 1967860 1695874 1418590 1665712
10960A665712p806P5253M3906J64336m68314M67008l36825m75227K42563n57761
$$ 1665712 1657906 1733159 1777065 1941401 1473087 1940095 1603270 1128043 1370606 812845
10950H12845j25669L09900l60417C10298N12882B79369J68315p7372j83855K38221
$$ 812845 687176 997076 636659 310298 823180 279369 447684 370312 186457 424678
10940D24678f7076C97265A73506L45091j91830k2061j41122K09246C1956J24608
$$ 424678 -67076 397265 173506 518597 326767 304706 163584 372830 31956 156564
10930A56564c3845G5854M86749a594A21524E0002a44058B53750b34317A20357
$$ 156564 -33845 75854 562603 -1594 121524 50002 -144058 253750 -234317 120357
10919C16229a25125A53068c06535c384B12389J33424g2860j27696A2610J91533
$$ 316229 -125125 153068 -306535 -3384 212389 345813 -72860 -200556 12610 204143
10909B04143F0798R0993h3373J4750B8516J89490I5314d4220j28725B62840j13764
$$ 204143 60798 151791 -83373 -68623 28516 218006 95314 -44220 -172945 262840 149076
10898A49076I737P8026i5760J2248B98317B9694b51179L7754R7031c0439A90137
$$ 149076 9737 87763 -95760 -83512 298317 29694 -251179 -213425 -116394 -30439 190137
10886A27639c13119A22i0335D3358K54970L0115g4179a0689I9848a38737A10042
$$ 127639 -313119 122 -90335 43358 298328 328443 -74179 -10689 99848 -138737 110042
10874a28175B0645a92614A47263a4442o7713A54806a63815e3636E3017N8283J65534
$$ -128175 20645 -192614 147263 -14442 -82155 154806 -163815 -53636 53017 111300 276834
10863B76834D5610d6253A0933c58483H0148a06356I038b74726K0308D0759C98
$$ 276834 45610 -46253 10933 -358483 80148 -106356 9038 -274726 -254418 40759 398
10851d26491a11622D17601I1884C0986d683j24415A57784J04790a8993j4543o400
$$ -426491 -111622 417601 91884 30986 -4683 -129098 157784 262574 -18993 -33536 -39936
10840c9936k99180b0569k28178B61189A21648b46549A9563b0128A87477a76078
$$ -39936 -339116 -20569 -248747 261189 121648 -246549 19563 -20128 187477 -176078
10829B00149a14428F9866M2770D5758a13728q0275B0355o180b8077k87445B20010
$$ 200149 -114428 69866 112636 45758 -113728 -194003 20355 14175 -28077 -315522 220010
10817f6920E1340K1947b36422A60479j9714m435c06843a9507k72705N0400f3716
$$ -66920 51340 73287 -236422 160479 140765 136330 -306843 -19507 -292212 -241812 -63716
10805b72845J03008K7699I361J40878a85078L9044l139e0414D669R5049e2177
$$ -272845 -169837 -142138 9361 150239 -185078 -146034 -149173 -50414 4669 99718 -52177
10793b15785R2891K1668A34895a02109A03889a72685k15272a50181r4475g0397
$$ -215785 -122894 -101226 134895 -102109 103889 -172685 -387957 -150181 -244656 -70397
10782g1450A23536P6143H6452b41964a03233j43571a1335C5246K18856a92299
$$ -71450 123536 199679 86452 -241964 -103233 -246804 -11335 35246 254102 -192299
10771B75434M5539B9159O6717c59929B08227l680b17866d2008j33830g15A71933
$$ 275434 320973 29159 95876 -359929 208227 204547 -217866 -42008 -175838 -715 171933
10759a53672e6011o189b7069A37428d4908B56054a96594h5339A08913a65589K9689
$$ -153672 -56011 -62200 -27069 137428 -44908 256054 -196594 -85339 108913 -165589 -135900
10748a35900F4886i6062b8246j75474P8484r6354A15025b52804h9099B6404L0418
$$ -135900 64886 -96062 -28246 -203720 -125236 -221590 115025 -252804 -89099 26404 56822
10737E6822c9828H6459a70969A32294m71h6187j64863B8554G874J5631a76111
$$ 56822 -39828 86459 -170969 132294 131823 -86187 -251050 28554 7874 23505 -176111
10725e4195l40918J50359L1139C1467J06042M6768a13211d0182l76469A83654
$$ -54195 -395113 -244754 -213615 31467 137509 184277 -113211 -40182 -416651 183654
10714b42935H5430J3510c8685l21651Q6734b8310p9811k38970J15864R6182C4370
$$ -242935 85430 98940 -38685 -360336 -273602 -28310 -108121 -347091 -231227 -135045 34370
10702A30814a59649C01224j39111a65062H9624b46362A57159o5657R5063b61305
$$ 130814 -159649 301224 162113 -165062 89624 -246362 157159 91502 186565 -261305
10691c05892p1018A9983g5424A51304D34M94J08344l5300c91120P9326f0531j45668
$$ -305892 -376910 19983 -75424 151304 434 928 109272 73972 -391120 -311794 -60531 -206199
10679b06199A22197J80959a58819p8962Q9862m615G470J25055d9155G5583J1106
$$ -206199 122197 303156 -158819 -237781 -147919 -152534 7470 132525 -49155 75583 86689
10668H6689O5269a83449C53562A25624a32801r4360B53772A11376a75824A42669
$$ 86689 151958 -183449 353562 125624 -132801 -227161 253772 111376 -175824 142669
10657c6109G9963b85848C8523h883B6440a78747A99037b21334A21195c70954A8454
$$ -36109 79963 -285848 38523 -8883 26440 -178747 199037 -221334 121195 -370954 18454
10645c67435D43016a39033O3870j33620A10537i411B09845H5112l6947b75014
$$ -367435 443016 -139033 -75163 -208783 110537 -9411 209845 85112 48165 -275014
10634A07501a47843g3412B92309j24193J19168b9631j57610D1571a45677k15874
$$ 107501 -147843 -73412 292309 168116 287284 -29631 -187241 41571 -145677 -361551
10624c61551I0997f454m37651J00669c2843j66469f4319k96237J57753g3365A10872
$$ -361551 90997 -6454 -444105 -343436 -32843 -199312 -64319 -360556 -202803 -73365 110872
10612a84331c3371B21500B9444d4186j64013A77011a59621A00300a26974j31865
$$ -184331 -33371 221500 29444 -44186 -208199 177011 -159621 100300 -126974 -258839
10602b58839Q8365A43495a03950j76930p9885C99170k4579A56034a1809d477k8024
$$ -258839 -170474 143495 -103950 -280880 -360765 399170 374591 156034 -11809 -4477 -32501
10591c2501B98944j42832b19237M7703k5302E5295b6719H7346a4822k27201p2766
$$ -32501 298944 156112 -219237 -171534 -196836 55295 -26719 87346 -14822 -242023 -314789
10580c14789b4179C3812P3446C3067a919j27575j95919A23558C0099a2078A02977
$$ -314789 -24179 33812 107258 33067 -1919 -129494 -325413 123558 30099 -12078 102977
10568B32224a67462b056j16764M2965K4700C2383L85245a27392D2520a11746I397
$$ 232224 -167462 -2056 -118820 -75855 -51155 32383 417628 -127392 42520 -111746 9397
10556b9547r1668C990e2538l13876C5048b97438C9560a0456l594a771k89951g5853
$$ -29547 -121215 3990 -52538 -366414 35048 -297438 39560 -10456 -14050 -1771 -291722 -75853
10543a3292B1365L95615b61703F8479b2411j53056C1106a4343A3021K77199b53578
$$ -13292 21365 416980 -261703 68479 -22411 -175467 31106 -14343 13021 290220 -253578
10531b59994N4670A19554d2920o7282j20925g3600B05119G4257L48672b06624
$$ -259994 -205324 119554 -42920 -110202 -231127 -73600 205119 74257 422929 -206624
10520a54606A89803i2728D9303R2242J09757r4296a79045M3983j79851g1787A77486
$$ -154606 189803 -92728 49303 141545 251302 157006 -179045 -135062 -314913 -71787 177486
10508A25628n8350f0800b0112m0129L634A3841a03740D2598K10423E3770d5291
$$ 125628 67278 -60800 -20112 -60241 -56607 13841 -103740 42598 253021 53770 -45291
10496A90294i6268l3387f1753C0523c00175j32463a62215J0283E0974a30294D0034
$$ 190294 -96268 -129655 -61753 30523 -300175 -432638 -162215 -151932 50974 -130294 40034
10484a66711a8194A24357d3753B16223L5721K60159A62203R240G6468l2099K8084
$$ -166711 -18194 124357 -43753 216223 251944 512103 162203 171443 76468 44369 72453
10473G2453l2316c958B47919a50950D3905a77396g1763B71906a49638k91C23813
$$ 72453 40137 -3958 247919 -150950 43905 -177396 -71763 271906 -149638 -149929 323813
10461A00949c88357a33922b4774A14742a29122A0451a26705F8999j340J15509
$$ 100949 -388357 -133922 -24774 114742 -129122 10451 -126705 68999 67659 183168
10451A83168o2300A7233a14935m8908A92517E9500b36335h2884c5898n0081j23359
$$ 183168 120868 17233 -114935 -163843 192517 59500 -236335 -82884 -35898 -85979 -209338
10440b09338A04995n0068J25376b18978A2806K13772E0459c09038a25640A27891
$$ -209338 104995 54927 180303 -218978 12806 226578 50459 -309038 -125640 127891
10429a017E7485K1000C793g5165k06149B96890K41379e23872g4754I8492a5871
$$ -1017 57485 78485 3793 -75165 -281314 296890 538269 -523872 -74754 98492 -15871
10417a48354K5431A40150h1606b3959A93987I332J35363F7868c4148N815j88962
$$ -148354 -122923 140150 -81606 -23959 193987 9332 144695 67868 -34148 -28333 -217295
10406b17295e2905l0336B8329O1754M3105a11231n0009g7071E31520b57694D3184
$$ -217295 -52905 -83241 28329 90083 133188 -111231 -161240 -77071 531520 -257694 43184
10394A24486g61j88261o0628B94590q8971M0418I8721Q7880r1174B8541e9080
$$ 124486 -761 -189022 -249650 294590 205619 246037 98721 186601 95427 28541 -59080
10382A19976a8348B36420G3336c41102B03146K17169j89858h5914E26851j91164
$$ 119976 -18348 236420 73336 -341102 203146 420315 230457 -85914 526851 335687
10372C35687L3378j78409N3937M884K33213r6671M29236m03176j30801J23958
$$ 335687 369065 190656 244593 249477 482690 386019 815255 412079 281278 405236
10362D05236j0613J76122A57564n0313J70776m2950a22390B61339Q1886p6159
$$ 405236 394623 570745 157564 107251 278027 235077 -122390 261339 343225 267066
10352B67066J66757r1660A56975K60101J21729H9777L1037J06843F8112l2763
$$ 267066 433823 342163 156975 417076 538805 89777 120814 227657 68112 35349
10342C5349M46713C9089J07347K25619A25896N1714o4494M3058J37808g6490j29071
$$ 35349 482062 39089 146436 372055 125896 177610 113116 156174 293982 -76490 -205561
10331b05561d755A54109b79660i2263r7305E6065K30860Q2366j30284K21935j63516
$$ -205561 -4755 154109 -279660 -92263 -189568 56065 286925 369291 239007 460942 297426
10320B97426J56888B2305J3842J14123C9139J2651b63959B20733O6330A11218
$$ 297426 454314 22305 36147 150270 39139 51790 -263959 220733 287063 111218
10309G5940a8511B12564C8229J00537c78420k2402a50987C92684g0329j58214
$$ 75940 -18511 212564 38229 138766 -378420 -400822 -150987 392684 -70329 -228543
10299b28543M569A03869b66344i204k8230E8319L1742a73802e2261j82089E5499
$$ -228543 -223974 103869 -266344 -9204 -37434 58319 90061 -173802 -52261 -234350 55499
10287a22396e8022j92185A10128a12452C28135R74a54520P3729A08710i6510r40
$$ -122396 -58022 -250207 110128 -112452 328135 329109 -154520 -80791 108710 -96510 -97450
10276i7450B2908b12947N024E5892R9094J14376H7052K80019g0062L991A93088
$$ -97450 22908 -212947 -207923 55892 154986 269362 87052 367071 -70062 -66071 193088
10264b04612R3692C12002a24048C46998p2189l7841n6464L23745A54653J27832
$$ -204612 -110920 312002 -124048 346998 274809 236968 180504 504249 154653 282485
10254B82485N1031j46819E6859K25111d2629C11551c54446a21935A00031D2009
$$ 282485 333516 186697 56859 281970 -42629 311551 -354446 -121935 100031 42009
10243E5431L62079h8590A70418a46044b6155A23841h600j97198k1524h1350A09266
$$ 55431 417510 -88590 170418 -146044 -26155 123841 -8600 -205798 -227322 -81350 109266
10231a09616l10070g0127j0190L6855o3660j1786B4693J70568a14986G0796J35787
$$ -109616 -419686 -70127 -80317 -43462 -107122 -118908 24693 195261 -114986 70796 206583
10220B06583D4617O1831J41310b54899o6004A9065a33517B85595h2522B996J98533
$$ 206583 44617 106448 247758 -254899 -320903 19065 -133517 285595 -82522 2996 201529
10209B01529f2718B93253c67795b9361n2242B7507F518a15197l1156b3310l9950
$$ 201529 -62718 293253 -367795 -29361 -81603 27507 6518 -115197 -146353 -23310 -63260
10198f3260k833k9060A91818a72792j380M2717A16251C2364N1124b39647B1638
$$ -63260 -66093 -95153 191818 -172792 -174172 -131455 116251 32364 83488 -239647 21638
10186e5373q2741A09857e8787p6947B18486a94749r291A62497c95746J8122h5110
$$ -55373 -138114 109857 -58787 -135734 218486 -194749 -204040 162497 -395746 -377624 -85110
10174H2190a59381j9957B06978a88490A6016Q491b50543a18479j04333b453A1052
$$ 82190 -159381 -179338 206978 -188490 16016 24507 -250543 -118479 -222812 -2453 11052
10162c39860b2554j0670j98330C02371a93241j27637N8210M6297N3422f2728a5753
$$ -339860 -22554 -33224 -231554 302371 -193241 -320878 -262668 -216371 -162949 -62728 -15753
10150b10002a01280A00644J38380a12350J9443m3298k9683D8491d790B38152j15268
$$ -210002 -101280 100644 239024 -112350 -92907 -136205 -165888 48491 -4790 238152 122884
10139A22884j9490P82b68428J07449K4428A67018E7903a44661e8040j18770d0702
$$ 122884 103394 104176 -268428 -160979 -136551 167018 57903 -144661 -58040 -176810 -40702
10127f3399A7666J605a26522f2924k98742N7779P2127g0641k48635a03661o8942
$$ -63399 17666 19271 -126522 -62924 -361666 -303887 -231760 -70641 -319276 -103661 -172603
10116a72603b6407q2248q4259o2270h9807o9079j56001a52960B1040c50492C5634
$$ -172603 -26407 -108655 -192914 -255184 -89807 -158886 -314887 -152960 21040 -350492 35634
10104a6689p5650j18430J5618B44811b87298B02081a71636A16280a97761g799
$$ -16689 -92339 -210769 -195151 244811 -287298 202081 -171636 116280 -197761 -7799
10093a57235M6280k5700I0056D5009a5567G7309Q0678b4736r9702A36235B4230
$$ -157235 -110955 -136655 90056 45009 -15567 77309 157987 -24736 -124438 136235 24230
10081b00123F5768g6136j586b0292k7764j0584b434k20009j52154J00990C23605
$$ -200123 65768 -76136 -77722 -20292 -48056 -58640 -2434 -222443 -374597 -273607 323605
10069B94915b4272j05774f0452j61900n5393f7010a987A3057b52139h7076D321
$$ 294915 -24272 -130046 -60452 -222352 -277745 -67010 -1987 13057 -252139 -87076 4321
10057I707L045K4621b3895n274A00702d2109j77898O7164b8792n8046A30362e6307
$$ 9707 12752 37373 -23895 -29169 100702 -42109 -220007 -152843 -28792 -86838 130362 -56307
10044b38276J1036E6545a86375G2618b97741O2913j35056F2657a00193A3370b49438
$$ -238276 -227240 56545 -186375 72618 -297741 -234828 -369884 62657 -100193 13370 -249438
10032h357E4951a35655F4009C961a81344B6482i5621E8193d3034j929A55576J4883
$$ -8357 54951 -135655 64009 3961 -181344 26482 -95621 58193 -43034 -44963 155576 170459
10020A70459R7465A5227b6042H0416d6293F7685a65197d2091p0777M053B10314
$$ 170459 267924 15227 -26042 80416 -46293 67685 -165197 -42091 -112868 -108815 210314
10008a18825G4937J32844b55065d0068J4445k76208K6252o2704a58533o3246d9793
$$ -118825 74937 207781 -255065 -40068 -25623 -301831 -275579 -338283 -158533 -221779 -49793
9996b12322G26b87978g4981C458a1851j78424m4268E9435f3456j99492c5879j53637
$$ -212322 726 -287978 -74981 3458 -11851 -190275 -234543 59435 -63456 -262948 -35879 -189516
9984a89516A06768b42922J19717A59747a02854n8505j10234g7808j33035l3950
$$ -189516 106768 -242922 -123205 159747 -102854 -161359 -271593 -77808 -210843 -244793
9974b44793B4345N7573f2351A60765a74625b3097B0301a0823j44864C91469A23710
$$ -244793 24345 81918 -62351 160765 -174625 -23097 20301 -10823 -155687 391469 123710
9962g9943c7272I7430O2712b3292j37508K8758A09344P695b10944k5544J17032
$$ -79943 -37272 97430 160142 -23292 -160800 -132042 109344 117039 -210944 -236488 -119456
9951a19456A16241P9568K8611a73264H2385b31091E2415a22867A66586a74951
$$ -119456 116241 195809 224420 -173264 82385 -231091 52415 -122867 166586 -174951
9940b51403R5875B53135i2699C6720a67213N1779B75504f2030A94663J60675E5839
$$ -251403 -155528 253135 -92699 36720 -167213 -115434 275504 -62030 194663 355338 55839
9928d0989l58159b65m35338c7824A75982M9145B7135b9866A45075B1827c055n4
$$ -40989 -399148 -265 -435603 -37824 175982 225127 27135 -29866 145075 21827 -3055 -3109
9916c109j48022e0084F2648a5333A7943a2348k59773e8337n1255J8696k49455
$$ -3109 -151131 -50084 62648 -15333 17943 -12348 -272121 -58337 -109592 -90896 -340351
9905c40351I7426a36488A9634c67697F8351b5293l2184E1817i8919R484A81181
$$ -340351 97426 -136488 19634 -367697 68351 -25293 -57477 51817 -98919 -89435 181181
9893A13819B3712f19936b69420J32426O5919r0897k4637j52498H8586c05875b9447
$$ 113819 23712 -619936 -269420 -136994 -71075 -161972 -186609 -339107 88586 -305875 -29447
9881D2567b41387A11651b39751i4194n8450B2158g6209D22868a67440d3844B75833
$$ 42567 -241387 111651 -239751 -94194 -152644 22158 -76209 422868 -167440 -43844 275833
9869B8018b46650l6421J28555N6122l51154a5849H6153K60281h6787C55941c5755
$$ 28018 -246650 -283071 -154516 -98394 -449548 -15849 86153 346434 -86787 355941 -35755
9857a5074p2061E9915d1654k2958K5242l1587J6089j20735P5270k84637a04766
$$ -15074 -87135 59915 -41654 -64612 -39370 -70957 -54868 -175603 -100333 -384970 -104766
9845B4021a68724J4144P101B15738A2633a12113j75708b9542k26005J19097L2015
$$ 24021 -168724 -154580 -147479 215738 12633 -112113 -287821 -29542 -255547 -136450 -104435
9834a04435I8301a01909H2505b56428E1263c71991B0489b21141C25558i6787o5423
$$ -104435 98301 -101909 82505 -256428 51263 -371991 20489 -221141 325558 -96787 -162210
9823a62210P288O2820d1540l4708C7176J97454b9515r7136H8536A4958R7705f5383
$$ -162210 -154922 -92102 -41540 -76248 37176 234630 -29515 -126651 88536 14958 112663 -65383
9810b26269B07777f0094j79390P6707A51647b26115f4799j81751A22542a52700
$$ -226269 207777 -60094 -239484 -162777 151647 -226115 -64799 -246550 122542 -152700
9799g5321A99972a17936L1896b2048B13104D7290A850a47224A17703a80187D7371
$$ -75321 199972 -117936 -86040 -22048 213104 47290 1850 -147224 117703 -180187 47371
9787c98574j4432J09567i2355A436J97209a01477j2283J3028L2240A30654R9157
$$ -398574 -413006 -303439 -92355 1436 198645 -101477 -113760 -100732 -68492 130654 229811
9776B29811q7191a1017l57964E1800b10340b9652p3016j35065J1496A21516b23943
$$ 229811 142620 -11017 -368981 51800 -210340 -29652 -102668 -237733 -226237 121516 -223943
9764A6382i4358A27069J1523h1234j98226H2835O7506c23991c7285m04077b594
$$ 16382 -94358 127069 138592 -81234 -279460 82835 150341 -323991 -37285 -441362 -2594
9752e2828l8121G3578c1651j82374C90504c83257C7804Q2736b04315A44906c21824
$$ -52828 -90949 73578 -31651 -214025 390504 -383257 37804 120540 -204315 144906 -321824
9740G5608a04973m9982j1427C00250C3069a86431R0693I2945g0739A68283A8699
$$ 75608 -104973 -154955 -166382 300250 33069 -186431 -95738 92945 -70739 168283 18699
9728A96299k6325g5929D2153q662a27521K5621D6305F123a57048f8620A19399
$$ 196299 169974 -75929 42153 33491 -127521 -101900 46305 6123 -157048 -68620 119399
9716B6403c3315j06943j92332J62384r5398D1958J43454K13534H8996a79046B2405
$$ 26403 -33315 -140258 -332590 -170206 -265604 41958 185412 398946 88996 -179046 22405
9704I8473a86637B25728c8279j47838k70976A10935c35654J54142A11082b83736
$$ 98473 -186637 225728 -38279 -186117 -457093 110935 -335654 -181512 111082 -283736
9693c7222A0132J03768J48175a60986B75918h998C5996b05058c218l97296a44027
$$ -37222 10132 113900 262075 -160986 275918 -8998 35996 -205058 -3218 -400514 -144027
9681c82125a27027L7324I5174d5455A16590b36273R7795K9950M1641A2779a49057
$$ -382125 -127027 -89703 95174 -45455 116590 -236273 -138478 -108528 -66887 12779 -149057
9669b26528A5877J41648F4888c74150A27701d44134H4660a82877g4242L771r8864
$$ -226528 15877 157525 64888 -374150 127701 -444134 84660 -182877 -74242 -70471 -169335
9658a69335j11121h8926j19871k57193H1714c7398j9391E4142J32093a19394k9761
$$ -169335 -280456 -88926 -208797 -465990 81714 -37398 -56789 54142 186235 -119394 -149155
9647a49155J4981G0118b8211k9719I3242B685a16833L2217j45694I6919b19715
$$ -149155 -134174 70118 -28211 -57930 93242 2685 -116833 -84616 -230310 96919 -219715
9635e0422D0022e7278j585o6343B86944a58439e6423p2240q0260G6598J98660
$$ -50422 40022 -57278 -58863 -125206 286944 -158439 -56423 -128663 -208923 76598 275258
9624B75258m8558i0794r2649m6955C03529C4474b15952A60888C5740f0083m5918
$$ 275258 226700 -90794 -183443 -230398 303529 34474 -215952 160888 35740 -60083 -106001
9613a06001L0446C234a90448A37511n1940A0958k085O8087c66448a02418r1259
$$ -106001 -75555 3234 -190448 137511 85571 10958 8873 76960 -366448 -102418 -193677
9602a93677j70148h4908A02833b81753J39045A73427b54835M7714A10972a47762
$$ -193677 -363825 -84908 102833 -281753 -142708 173427 -254835 -207121 110972 -147762
9591a38859A6409J84598h2102k90867a18934B06967M003q3196n161a42566e6403
$$ -138859 16409 201007 -82102 -372969 -118934 206967 210970 127774 122613 -142566 -56403
9579b96407a7667j94862B99322h9582G4894K58216A05485a131l23249A05168h1162
$$ -296407 -17667 -212529 299322 -89582 74894 333110 105485 -1131 -324380 105168 -81162
9567b27644q1525J16960B7155R1367b51501A41550K9958d38361A91478a07663
$$ -227644 -309169 -192209 27155 118522 -251501 141550 171508 -438361 191478 -107663
9556a94284k7463E3365a61348a9014j2785j71748A4533a36566k28181K4925N5010
$$ -194284 -221747 53365 -161348 -19014 -31799 -203547 14533 -136566 -364747 -339822 -284812
9545b84812O2675O1845P4822p7324H5903J57410b40712O2601j42637D1680b61206
$$ -284812 -222137 -160292 -85470 -162794 85903 243313 -240712 -178111 -320748 41680 -261206
9533c4902n4041E394P1431b72491A82505c35187i257D5950a53669E6993b64188
$$ -34902 -88943 5394 76825 -272491 182505 -335187 -9257 45950 -153669 56993 -264188
9521i619j78360J5580F4121B8919O0755b6347j61087e6232k31549B70428A28025
$$ -9619 -187979 -172399 64121 28919 89674 -26347 -187434 -56232 -287781 270428 128025
9509A23930c33462A19774b40953A19570a87280Q4557k0053D7822b7724A93812
$$ 123930 -333462 119774 -240953 119570 -187280 -102723 -122776 47822 -27724 193812
9498C29749a01198l09488F2261a68563B3926K9875j4717J05743d00565e0121k51727
$$ 329749 -101198 -410686 62261 -168563 23926 53801 39084 144827 -400565 -50121 -301848
9487c01848c2627h724l42262A17836i7432k00551a39539A21363M7749c63364e4257
$$ -301848 -32627 -8724 -350986 117836 -97432 -297983 -139539 121363 169112 -363364 -54257
9475a7423o9774J2020B76295A3604b57725A83055c6025j46632l08060a67080O4629
$$ -17423 -87197 -75177 276295 13604 -257725 183055 -36025 -182657 -490717 -167080 -102451
9464a02451F0863D474d2846j6436B2289h5925n8704O0556C6409a83757j0277A17980
$$ -102451 60863 4474 -42846 -59282 22289 -85925 -144629 -84073 36409 -183757 -194034 117980
9451A93516b51236a01397j47300j13752J46884J04615F6552d0675H1958f453H9081
$$ 193516 -251236 -101397 -248697 -362449 -215565 -110950 66552 -40675 81958 -6453 89081
9439a60199b8753j87482A1297g6175A80678m90e5353J3706o894B2820a96791A50359
$$ -160199 -28753 -216235 11297 -76175 180678 180188 -55353 -41647 -48541 22820 -196791 150359
9426a83321f9135L1827A08409m1330J17464g2311j01752P2722j09109N4783b9275
$$ -183321 -69135 -37308 108409 67079 184543 -72311 -174063 -101341 -210450 -155667 -29275
9414d2381m70338b46441A86817a18002n7945c4160H2469N0440b71565B34162a79948
$$ -42381 -512719 -246441 186817 -118002 -175947 -34160 82469 132909 -271565 234162 -179948
9402g1171A69972J47847a60586e7l0782k28097L3913A13a27651e0714n4525K6433
$$ -71171 169972 317819 -160586 -57 -30839 -258936 -225023 113 -127651 -50714 -105239 -78806
9390g8806j13438L3701A13946A293J40586b15316i2092I0109a65323j32165b3321
$$ -78806 -192244 -158543 113946 1293 141879 -215316 -92092 90109 -165323 -297488 -23321
9378A24425l3495m4065c86421A7910g8505b4932A75701K6000a66414g4107B58052
$$ 124425 90930 46865 -386421 17910 -78505 -24932 175701 201701 -166414 -74107 258052
9366b0035k08042l57936A61153B1678J96638f7975B0548b03899q7210h832B85599
$$ -20035 -228077 -586013 161153 21678 218316 -67975 20548 -203899 -291109 -8832 285599
9354A04721J24678c32657a39367l5320A19850a38582M6375B5571J83589a6408
$$ 104721 229399 -332657 -139367 -174687 119850 -138582 -92207 25571 209160 -16408
9343a42687P173a8732k62419i0878A07468c74379A80101c5263A56912o4577m3706
$$ -142687 -135514 -18732 -281151 -90878 107468 -374379 180101 -35263 156912 92335 48629
9332D8629a35667d1108j76732A88767i4758K2742l82527F3248d71108e1142j70052
$$ 48629 -135667 -41108 -217840 188767 -94758 -72016 -454543 63248 -471108 -51142 -221194
9321b21194p0537K5107A73520C0984K63767c75520a45944B10090c63l7011q2197
$$ -221194 -291731 -266624 173520 30984 294751 -375520 -145944 210090 -363 -37374 -119571
9310a19571L3419J7623A25712a83187A09452a70716a25k82280I6248i6863l2236
$$ -119571 -86152 -68529 125712 -183187 109452 -170716 -125 -282405 96248 -96863 -129099
9299a29099c3773C88842p7521h5755D950a76781B32536C1239i4445k80657O7134
$$ -129099 -33773 388842 311321 -85755 4950 -176781 232536 31239 -94445 -375102 -307968
9288c07968H8788f941j45663A27958E6642b91935n8401J57016M6588f0166m5387
$$ -307968 88788 -6941 -152604 127958 56642 -291935 -350336 -193320 -146732 -60166 -105553
9277a05553q829A4737M6809K68939f9532C1923N04279B02788g0848A94650a44291
$$ -105553 -114382 14737 61546 330485 -69532 31923 536202 202788 -70848 194650 -144291
9265a61193B79938g9441b1105j75169B09751r8057J16479E6003g7330k96781a50175
$$ -161193 279938 -79441 -21105 -196274 209751 111694 228173 56003 -77330 -374111 -150175
9253A58942a92025Q3573e484A2458J74905p3549b25774A93711F0809a59729A7718
$$ 158942 -192025 -108452 -5484 12458 187363 113814 -225774 193711 60809 -159729 17718
9241a26866j02483B93333b89185A22025b1673j7846H9234b96265a0459o0505o0012
$$ -126866 -229349 293333 -289185 122025 -21673 -39519 89234 -296265 -10459 -70964 -130976
9230a30976O175a2669C6632c65636f7964j60021b5224C3872o663i0372l17480
$$ -130976 -124801 -12669 36632 -365636 -67964 -227985 -25224 33872 27209 -90372 -407852
9219d07852J94491O9352k43490G5418d98098b08553F8235P7278b23145j05548
$$ -407852 -213361 -144009 -387499 75418 -498098 -208553 68235 145513 -223145 -328693
9209c28693A05626a22085E1006d04689B12592c67341a02359j95418e0373H9077
$$ -328693 105626 -122085 51006 -404689 212592 -367341 -102359 -297777 -50373 89077
9198a80301d9242C35741b15611O7379M5698g946m4259k79098g3123F6879A4866
$$ -180301 -49242 335741 -215611 -148232 -102534 -7946 -52205 -331303 -73123 66879 14866
9186B20177a17001H2806b85842a31862R296C375c4433j51629B24509i2918k46365
$$ 220177 -117001 82806 -285842 -131862 -122566 3375 -34433 -186062 224509 -92918 -339283
9175c39283A08786C138a27397F8806b31395I7151b37793j14579R5766J27544A1108
$$ -339283 108786 3138 -127397 68806 -231395 97151 -237793 -352372 -256606 -129062 11108
9163C8545L0127f7300j13958j60922a36806B80416j06463E5263O5428b4125k61973
$$ 38545 68672 -67300 -181258 -342180 -136806 280416 173953 55263 120691 -24125 -286098
9152b86098C96090a19205j66552B4876a33984k40888f6690c2909Q326D4820a32950
$$ -286098 396090 -119205 -285757 24876 -133984 -374872 -66690 -32909 -24583 44820 -132950
9140A2181a52670I5058f7145G7775b18485A11992a8968j40363N9883H0075A0040
$$ 12181 -152670 95058 -67145 77775 -218485 111992 -18968 -159331 -99448 80075 10040
9128B6668a44601A71765a24294A46787b5994j25304B56334B875K6222N5499O9171
$$ 26668 -144601 171765 -124294 146787 -25994 -151298 256334 2875 29097 84596 153767
9117A53767c17001j79654E026c75929A43298b3885A76203i1903A13047b46620
$$ 153767 -317001 -496655 5026 -375929 143298 -23885 176203 -91903 113047 -246620
9106i9574B7934a77529d7328F5802i829j27374p3925A37736d58721a11885B1460
$$ -99574 27934 -177529 -47328 65802 -9829 -137203 -211128 137736 -458721 -111885 21460
9094B94175a95859B57607G4044K55221h7792j07756B3592b93580h2866c2174p9033
$$ 294175 -195859 257607 74044 329265 -87792 -195548 23592 -293580 -82866 -32174 -111207
9083a11207k58554B30045c073A62965J50285C1600a32779A56354p3727a82681
$$ -111207 -369761 230045 -3073 162965 313250 31600 -132779 156354 82627 -182681
9072a26728j53168h8232C55607E411L8698a97309m14427b49992Q6169a6662A83477
$$ -126728 -279896 -88232 355607 5411 44109 -197309 -611736 -249992 -163823 -16662 183477
9060a50251d784r0726q5189D5999d7826E037c45669i3217K0159k6570B19356J95336
$$ -150251 -4784 -95510 -180699 45999 -47826 5037 -345669 -93217 -73058 -99628 219356 414692
9048D14692d904j75593p7176c94D8945b01751P5057d0455l19945J40241F468b4147
$$ 414692 -4904 -180497 -257673 -394 48945 -201751 -126694 -40455 -360400 -220159 6468 -24147
9035B64989b66920D7935h2364L733o1636I3113A0125K79115h1538q9517D3717
$$ 264989 -266920 47935 -82364 -78631 -140267 93113 10125 289240 -81538 -171055 43717
9023A00873C1568a38077B12547a10650k71321b0424l52602h5922j87762h4759
$$ 100873 31568 -138077 212547 -110650 -381971 -20424 -373026 -85922 -273684 -84759
9012A62563c6530B07172a9200r9995m17365e7742p4907e7053C2177J27531A0406
$$ 162563 -36530 207172 -19200 -119195 -536560 -57742 -132649 -57053 32177 159708 10406
9000G2313K41294E7757f0009j45780A98636K78603A5327i0319j54974F065c6536
$$ 72313 313607 57757 -60009 -205789 198636 477239 15327 -90319 -245293 6065 -36536
8988A08747J01495J18621c04948J51992O1102j68264D82227c90769B27764n3674
$$ 108747 210242 328863 -304948 -152956 -91854 -260118 482227 -390769 227764 174090
8978A74090a43899j7302B21879f2836m72926B01966i682k8340A66146a30311C0736
$$ 174090 -143899 -161201 221879 -62836 -535762 201966 -9682 -38022 166146 -130311 30736
8966a30023B77826a93497H8268e96225b01537g5769B34030C0215a07314j72975
$$ -130023 277826 -193497 88268 -596225 -201537 -75769 234030 30215 -107314 -280289
8956b80289L7626A79740C4631K14324g0545F156c7719C4271O8267l3131b03705
$$ -280289 -242663 179740 34631 248955 -70545 6156 -37719 34271 102538 69407 -203705
8944a53866A6592b46259N7181c1681m12593D6973a97620d2443n7179A29184M59144
$$ -153866 16592 -246259 -189078 -31681 -444274 46973 -197620 -42443 -99622 129184 588328
8933E88328a36113A2670J42478j4656a52601c3273l7072b2604D41344L8138N55411
$$ 588328 -136113 12670 155148 140492 -152601 -33273 -70345 -22604 441344 479482 1034893
8922A034893M217214M792204B026419F48032B00345E4600J44727J1352K58817
$$ 1034893 5252107 10044311 2026419 648032 200345 54600 199327 210679 469496
8913D69496C8006b3574l65015a52366A44249K94784A77303a90998A10937f0208
$$ 469496 38006 -23574 -388589 -152366 144249 439033 177303 -190998 110937 -60208
8902E7553K22046b12835R1257d0199C05804B185b74497a07268j80898a30318A27444
$$ 57553 279599 -212835 -121578 -40199 305804 2185 -274497 -107268 -288166 -130318 127444
8890a75588F4591g258j54046B2276e2435j37388G267a49871B06046J48900a05051
$$ -175588 64591 -7258 -161304 22276 -52435 -189823 7267 -149871 206046 354946 -105051
8878a37372O7888j9459C7388a10923m47898b53874J10388c7772C0837P9810C6058
$$ -137372 -69484 -88943 37388 -110923 -558821 -253874 -143486 -37772 30837 110647 36058
$$ [...]
##END NTUPLES=NMR SPECTRUM
##END=
