##TITLE=AC1419_SALAH12229_7764165_uKqkWjndTX
##JCAMPDX= 6.0         $$ Bruker NMR JCAMP-DX V2.0
##DATA TYPE= NMR SPECTRUM
##DATA CLASS= NTUPLES
##ORIGIN= BRUKER
##OWNER= Administrator
$$ 1.72 TOPSPIN		Version 2.1
$$ 2013-04-11 19:07:45.667 -0700  Administrator@X
$$ Compression mode = diff/dup
##.OBSERVE FREQUENCY= 400.02188249412
##.OBSERVE NUCLEUS= ^1H
##.ACQUISITION MODE= SIMULTANEOUS (DQD)
##.ACQUISITION SCHEME= undefined
##.AVERAGES= 64
##.DIGITISER RES= 22
##SPECTROMETER/DATA SYSTEM= spect
##.PULSE SEQUENCE= noesygpps1d.comp
##.SOLVENT NAME= COFFEE_meoh
##.SHIFT REFERENCE= INTERNAL, COFFEE_meoh, 1, 14.96101
##AUDIT TRAIL= $$ (NUMBER, WHEN, WHO, WHERE, PROCESS, VERSION, WHAT)
$$ ##TITLE= Audit trail, TOPSPIN		Version 2.1
$$ ##JCAMPDX= 5.01
$$ ##ORIGIN= Bruker BioSpin GmbH
$$ ##OWNER= Administrator
$$ $$ E:\/data/COFFEE/nmr/AC1419_SALAH12229_7764165_uKqkWjndTX/12/pdata/1/auditp.txt
$$ ##AUDIT TRAIL=  $$ (NUMBER, WHEN, WHO, WHERE, PROCESS, VERSION, WHAT)
(   1,<2013-04-11 19:07:40.390 -0700>,<Administrator>,<X>,<go>,<TOPSPIN 2.1>,
      <created by zg
	started at 2013-04-11 18:56:09.809 -0700,
	POWCHK enabled, PULCHK disabled,
       configuration hash MD5:
       33 CF 6A 21 5C D3 B9 40 6C 15 AA 8D 27 A2 4F 13
       data hash MD5: 64K
       D0 EB 9A FA 19 E3 F3 8B 4C B9 2C 3E C4 3B 7A 4C>)
(   2,<2013-04-11 19:07:43.147 -0700>,<Administrator>,<X>,<proc1d>,<TOPSPIN 2.1>,
      <Start of raw data processing
       efp LB = 0.3 FT_mod = 6 PKNL = 1 PHC0 = 0 PHC1 = 0 SI = 128K 
       data hash MD5: 128K
       48 E7 5E 02 20 D4 92 D8 3B 0A 57 F5 3E CB 53 30>)
(   3,<2013-04-11 19:07:44.066 -0700>,<Administrator>,<X>,<proc1d>,<TOPSPIN 2.1>,
      <pk PHC0 = -81.44165 PHC1 = 0 
       data hash MD5: 128K
       91 3B D7 FC 1E B9 70 3A 5E 97 F9 92 48 8B D1 3C>)
(   4,<2013-04-11 19:07:44.734 -0700>,<Administrator>,<X>,<proc1d>,<TOPSPIN 2.1>,
      <abs ABSG = 1 
       data hash MD5: 128K
       A3 1B 12 0E 0D 06 6D 7C 85 C1 0A CE 5F 91 19 AD>)
(   5,<2013-04-11 19:07:44.901 -0700>,<Administrator>,<X>,<proc1d>,<TOPSPIN 2.1>,
      <abs ABSG = 2 
       data hash MD5: 128K
       31 B2 71 DC 6C 30 D5 6D 95 9C 0F 40 E1 C4 FF F7>)
(   6,<2013-04-11 19:07:45.054 -0700>,<Administrator>,<X>,<proc1d>,<TOPSPIN 2.1>,
      <abs ABSG = 3 
       data hash MD5: 128K
       50 31 33 1C 1E 46 92 D5 35 2E 0E 83 90 89 C3 61>)
(   7,<2013-04-11 19:07:45.207 -0700>,<Administrator>,<X>,<proc1d>,<TOPSPIN 2.1>,
      <abs ABSG = 4 
       data hash MD5: 128K
       47 94 52 98 8B 1C D5 99 B2 5F B0 1F A1 9C 86 24>)
(   8,<2013-04-11 19:07:45.360 -0700>,<Administrator>,<X>,<proc1d>,<TOPSPIN 2.1>,
      <abs ABSG = 5 
       data hash MD5: 128K
       C0 F0 97 31 4F 40 A3 A2 E4 7B 27 4B 36 DB E3 22>)
$$ ##END=
$$ 
$$ $$ hash MD5
$$ $$ E5 4D 04 12 AE 70 90 B0 30 C2 C6 80 91 D9 BF 9E
##$RELAX= 
##$RELAX= 
##$RELAX= 
##$RELAX= 
##$RELAX= 
##$RELAX= 
##$RELAX= 
##$RELAX= 
$$ Bruker specific parameters
$$ --------------------------
##$DU= <E:\>
##$EXPNO= 12
$$ [...]
##$TP07= 0
##$TPNAME0= <>
##$TPNAME1= <>
##$TPNAME2= <>
##$TPNAME3= <>
##$TPNAME4= <>
##$TPNAME5= <>
##$TPNAME6= <>
##$TPNAME7= <>
##$TPOAL= (0..7)
0.5 0.5 0.5 0.5 0.5 0.5 0.5 0.5
##$TPOFFS= (0..7)
0 0 0 0 0 0 0 0
##$TUNHIN= 0
##$TUNHOUT= 0
##$TUNXOUT= 0
##$USERA1= <user>
##$USERA2= <user>
##$USERA3= <user>
##$USERA4= <user>
##$USERA5= <user>
##$V9= 5
##$VALIST= <valist>
##$VCLIST= <CCCCCCCCCCCCCCC>
##$VD= 0
##$VDLIST= <DDDDDDDDDDDDDDD>
##$VPLIST= <PPPPPPPPPPPPPPP>
##$VTLIST= <TTTTTTTTTTTTTTT>
##$WBST= 2048
##$WBSW= 25
##$XGAIN= (0..3)
0 0 0 0
##$XL= 0
##$YL= 0
##$YMAX_a= 6103937
##$YMIN_a= -12995856
##$ZGOPTNS= <>
##$ZL1= 120
##$ZL2= 120
##$ZL3= 120
##$ZL4= 120
##$ABSF1= 14.96101
##$ABSF2= -5.597172
##$ABSG= 5
##$ABSL= 3
##$ALPHA= 0
##$AQORDER= 0
##$ASSFAC= 0
##$ASSFACI= 0
##$ASSFACX= 0
##$ASSWID= 0
##$AUNMP= <proc_prof1d_extract.lims>
##$AXLEFT= 0
##$AXNAME= <>
##$AXNUC= <1H>
##$AXRIGHT= 0
##$AXTYPE= 0
##$AXUNIT= <>
##$AZFE= 0.1
##$AZFW= 0.1
##$BCFW= 0
##$BC_mod= 0
##$BYTORDP= 0
##$COROFFS= 0
##$CY= 15
##$DATMOD= 1
##$DC= 0
##$DFILT= <>
##$DTYPP= 0
##$F1P= 0
##$F2P= 0
##$FCOR= 0.5
##$FTSIZE= 131072
##$FT_mod= 6
##$GAMMA= 0
##$GB= 0
##$INTBC= 1
##$INTSCL= 1
##$ISEN= 128
##$LB= 0.3
##$LEV0= 0
##$LPBIN= 0
##$MAXI= 10000
##$MC2= 0
##$MEAN= 0
##$ME_mod= 0
##$MI= 0
##$NCOEF= 0
##$NC_proc= -2
##$NLEV= 6
##$NOISF1= 0
##$NOISF2= 0
##$NSP= 0
##$NTH_PI= 0
##$NZP= 0
##$OFFSET= 14.96101
##$PC= 1
##$PHC0= -81.44165
##$PHC1= 0
##$PH_mod= 1
##$PKNL= yes
##$PPARMOD= 0
##$PPDIAG= 0
##$PPIPTYP= 0
##$PPMPNUM= 2147483647
##$PPRESOL= 1
##$PSCAL= 4
##$PSIGN= 0
##$PYNMP= <proc.py>
##$REVERSE= no
##$SF= 400.020009633793
##$SI= 131072
##$SIGF1= 0
##$SIGF2= 0
##$SINO= 400
##$SIOLD= 131072
##$SPECTYP= <>
##$SREGLST= <1H.CDCl3>
##$SSB= 0
##$STSI= 131072
##$STSR= 0
##$SW_p= 8223.68421052631
##$SYMM= 0
##$S_DEV= 0
##$TDeff= 65536
##$TDoff= 0
##$TI= <>
##$TILT= no
##$TM1= 0
##$TM2= 0
##$TOPLEV= 0
##$USERP1= <user>
##$USERP2= <user>
##$USERP3= <user>
##$USERP4= <user>
##$USERP5= <user>
##$WDW= 1
##$XDIM= 131072
##$YMAX_p= 466864187
##$YMIN_p= -11025
##$CURPLOT= <Network HP LaserJet P1505>
##$CURPRIN= <$Network HP LaserJet P1505>
##$DFORMAT= <normdp>
##$LAYOUT= <+/1D_H.xwp>
##$LFORMAT= <normlp>
##$PFORMAT= <normpl>
##$SURQMSG= 1
$$ End of Bruker specific parameters
$$ ---------------------------------
##NTUPLES= NMR SPECTRUM
##VAR_NAME=  FREQUENCY,     SPECTRUM/REAL,   SPECTRUM/IMAG
##SYMBOL=    X,             R,               I
##VAR_TYPE=  INDEPENDENT,   DEPENDENT,       DEPENDENT
##VAR_FORM=  AFFN,          ASDF,            ASDF
##VAR_DIM=   131072,        131072,          131072
##UNITS=     HZ,            ARBITRARY UNITS, ARBITRARY UNITS
##FACTOR=    0.0627417313425164, 1,          1
##FIRST=     8223.62146879497, 2407,         -59165
##LAST=      0,             4003,            -58812
##MIN=       0,             -11025,          0
##MAX=       8223.62146879497, 466864187,    0
$$ Real data points
##PAGE= N=1
##DATA TABLE= (X++(R..R)), XYDATA
$$ [...]
61633D57186J176P94m18j788k108j504j143j444j730j534j180j063j148j273j416
$$ 457186 458362 459156 458738 456950 454842 453338 452195 450751 449021 447487 446307 445244 444096 442823 441407
61618D41407j634k012k503k687k090r84k49k63n64r15j741l079m056m152m083
$$ 441407 439773 437761 435258 432571 430481 429497 429248 428985 428421 427506 425765 422686 418630 414478 410395
61603D10395m645n494n810n511m890l840k360j172r28j337j895k762m022m783
$$ 410395 405750 400256 394446 388935 384045 380205 377845 376673 375745 374408 372513 369751 365729 360946
61589C60946m175k687j453p21j33N5o67j786k149j597j118j370k043k637k945
$$ 360946 356771 354084 352631 351910 351777 351832 351165 349379 347230 345633 344515 343145 341102 338465 335520
61574C35520k702j647j33R93J270R18M07J29L58R96J513J524J175O94J4o88p48
$$ 335520 332818 331171 331038 332031 333301 334219 334626 334755 335113 336109 337622 339146 340321 341015 341029 340341 339593
61557C39593J36J280J845J793J459Q70J33j58L00Q96J053J147J676K180J981J372
$$ 339593 339729 341009 342854 344647 346106 346976 347109 346951 347251 348147 349200 350347 352023 354203 356184 357556
61541C57556J082J074Q72O30Q09J208J351J498K225L400M397N010N219M592K896
$$ 357556 358638 359712 360584 361214 362023 363231 364582 366080 368305 371705 376102 381112 386331 390923 393819
61526C93819Q79n87j605k556k972k361j586j890l002l559l213k772k531j951j032
$$ 393819 394698 394111 392506 389950 386978 384617 383031 381141 378139 374580 371367 368595 366064 364113 363081
61511C63081m75l66l7N52O23K6m15k31M8k7k09k99n78j146j600j610j185l70O26
$$ 363081 362606 362240 362203 362755 363378 363404 362989 362758 362806 362779 362570 362271 361693 360547 358947 357337 356152 355782 356408
61492C56408J146Q14L08M81R25N80m18q21j73O47R47R83R87P09L25O02J697K771
$$ 356408 357554 358368 358676 359157 360082 360662 360244 359423 359250 359897 360844 361827 362814 363523 363848 364450 366147 368918
61474C68918L220L314L306K919K168J694J749J693R98K5o30r01r60p82m37k22
$$ 368918 372138 375452 378758 381677 383845 385539 387288 388981 389979 390004 389374 388473 387513 386731 386294 386072
61458C86072k25k41k49m40o58m58K13R24J436J896K358K696K889K825K132Q61
$$ 386072 385847 385606 385357 384917 384259 383801 384014 384938 386374 388270 390628 393324 396213 399038 401170 402031
61442D02031o4L1M72K97n7N67J988K840K666K348K389K346K156K380K809K337
$$ 402031 401967 401998 402470 402767 402710 403277 405265 408105 410771 413119 415508 417854 420010 422390 425199 427536
61426D27536Q14m85q20r39j420j529o28N66J172J444J856J951J182J49j45L05
$$ 427536 428350 427865 427045 426106 424686 423157 422529 423095 424267 425711 427567 429518 430700 430849 430704 431009
61410D31009P39P24K81n54j520k035j915j776k124k606k666k370k037j625j044
$$ 431009 431748 432472 432753 432199 430679 428644 426729 424953 422829 420223 417557 415187 413150 411525 410481
61395D10481n40l08j96j67m11o81l18O16J094N62k01k78R9K51L15Q59J723K176
$$ 410481 409941 409633 409437 409270 408859 408178 407860 408476 409570 410132 409931 409653 409752 410003 410318 411177 412900 415076
61377D15076K027J812J987K448K779K682K265K025K240K474K148J585J718K662
$$ 415076 417103 418915 420902 423350 426129 428811 431076 433101 435341 437815 439963 441548 443266 445928
61363D45928L423L219K290J198K83P6J136K912L840L276K448K757M010N140N896
$$ 445928 449351 452570 454860 456058 456341 456417 457553 460465 464305 467581 470029 472786 476796 481936 487832
61348D87832O803Q048R289J0228J0577R899Q186O270M986M271L701L400L729M465
$$ 487832 494635 502683 511972 522200 532777 542676 550862 557132 562118 566389 570090 573490 577219 581684
61334E81684M930M791M125K927J151q94k616l575l737l530l697m602n578n478
$$ 581684 586614 591405 595530 598457 599608 598714 596098 592523 588786 585256 581559 576957 571379 565901
61320E65901m054k277j146p91q44r43o82J60J083J377J306J903L406M931O072
$$ 565901 561847 559570 558424 557633 556789 555846 555164 555324 556407 557784 559090 560993 564399 569330 575402
61305E75402P525R595J1428J2471J3435J4715J5095J3321J0059O858L910L68l540
$$ 575402 582927 592522 603950 616421 629856 644571 659666 672987 683046 689904 693814 694182 690642
61292F90642o332p276p268p467q020q364q137p474o861o731p000p077o629n932
$$ 690642 684310 677034 669766 662299 654279 645915 637778 630304 623443 616712 609712 602635 596006 590074
61278E90074n195m036k165p9J506K586L612M697N601O236O558O337N514M530L804
$$ 590074 584879 580843 578678 578599 580105 582691 586303 591000 596601 602837 609395 615732 621246 625776 629580
61263F29580L211K533K031K143K916M170N811P592Q997R783J0115R866Q511O194
$$ 629580 632791 635324 637355 639498 642414 646584 652395 659987 668984 678767 688882 698748 707259 713453
61249G13453M134L173K619J341m85j727j965j907k318l289m451n293n438n064
$$ 713453 717587 720760 723379 724720 724235 722508 720543 718636 716318 713029 708578 703285 697847 692783
61235F92783m887n208n414m893m015l516l330k758j589l14O60J438K277L292M428
$$ 692783 687896 682688 677274 672381 668366 664850 661520 658762 657173 656859 657519 658957 661234 664526 668954
61220F68954N365N620N036M058L310L155L630M416M795M296L482L410M086M311
$$ 668954 674319 679939 684975 689033 692343 695498 699128 703544 708339 712635 716117 719527 723613 727924
61206G27924L314J716M68l18q88j081o48K84J593L367N382P141Q817J1146J4021
$$ 727924 731238 732954 733422 733104 732216 731135 730487 730771 732364 735731 741113 748254 757071 768217 782238
61191G82238J6293J7497J8461J9474J9193J6603J2829R656P277M910K746J657
$$ 782238 798531 816028 834489 853963 873156 889759 902588 912244 919521 924431 927177 928834
61179I28834J500J292P70M07R1q27k305l563m300m962n858o906q086r404j0537
$$ 928834 930334 931626 932396 932803 932894 932067 929762 926199 921899 916937 911079 904173 896087 886683 876146
61164H76146j1247j1856j2703j3459j3670j3560j3662j4052j4520j4892j4692
$$ 876146 864899 853043 840340 826881 813211 799651 785989 771937 757417 742525 727833
61153G27833j3251j0790q599p383o379m804l082j675LK222L628K826L60k304m804
$$ 727833 714582 703792 695193 687810 681431 676627 673545 671870 671873 674095 677723 680549 680909 678605 673801
61138F73801p309q968q829p671p001o669n393l248j652j021l01J144K894M680
$$ 673801 666492 657524 648695 641024 634023 627354 621961 618713 617061 616040 615739 616883 619777 624457
61124F24457O685Q544R615J0254J1489J3401J5185J6677J8416K0372K2014K3468
$$ 624457 631142 639686 649301 659555 671044 684445 699630 716307 734723 755095 777109 800577
61112H00577K5169K6636K7030K6692K6570K6506K5749K4731K4439K4254K2547
$$ 800577 825746 852382 879412 906104 932674 959180 984929 1009660 1034099 1058353 1080900
61101A080900J9417J6709J5129J3286R968N491M89m721r271j2154j3935j6274
$$ 1080900 1100317 1117026 1132155 1145441 1155409 1160900 1161389 1156668 1147397 1135243 1121308 1105034
61089A105034j9388k1742k2582k2839k3114k2853k2065k1789k2030k1303j9091
$$ 1105034 1085646 1063904 1041322 1018483 995369 972516 950451 928662 906632 885329 866238
61078H66238j6941j6055j5598j4421j2810j1386r854p984o472n723m970l567j957
$$ 866238 849297 833242 817644 803223 790413 779027 769173 761189 754717 748994 744024 740457 738500
61065G38500n55J038K919M313M874N329O117O734P059P895R488J0922J1698J2475
$$ 738500 737945 738983 741902 746215 751089 756418 762535 769269 776328 784223 793711 804633 816331 828806
61051H28806J3648J4733J5728J7382J9522K0913K1467K2679K5106K7423K8846
$$ 828806 842454 857187 872915 890297 909819 930732 952199 974878 999984 1027407 1056253
61040A056253L0302L2222L3413L3420L3729L5248L6768L7372L8138L9852M1276
$$ 1056253 1086555 1118777 1152190 1185610 1219339 1254587 1291355 1328727 1366865 1406717 1447993
61029A447993M1503M1803M3310M5099M6453M8600N2107N4988N5826N6165N7264
$$ 1447993 1489496 1531299 1574609 1619708 1666161 1714761 1766868 1821856 1877682 1933847 1991111
61018A991111N7215N4561N2268N4321O0477O8069P6912Q8180J00253J10292J18955
$$ 1991111 2048326 2102887 2155155 2209476 2269953 2338022 2414934 2503114 2603367 2713659 2832614
61007B832614J29379J43094J61371J88690K29172K80907L39873M08333M92621
$$ 2832614 2961993 3105087 3266458 3455148 3684320 3965227 4305100 4713433 5206054
60998E206054N94574P14654Q63446J058950J311402J623517K001647K429218K797751
$$ 5206054 5800628 6515282 7378728 8437678 9749080 11372597 13374244 15803462 18601213
60989A8601213K890985K510788J669157O43830j94002o22139o45555l79491O9235
$$ 18601213 21492198 24002986 25672143 26315973 26121971 25499832 24854277 24474786 24544021
60980B4544021N75577R17959Q36862K31528p17328j655568k295648k559991k535493
$$ 24544021 25119598 26037557 26874419 27105947 26388619 24733051 22437403 19877412 17341919
60971A7341919k347102k085704j807424j546292j314655j109077r25953p67700
$$ 17341919 14994817 12909113 11101689 9555397 8240742 7131665 6205712 5438012
60963E438012o35268n24121m30264l53936k95062k50053k15114j88484j67880
$$ 5438012 4802744 4278623 3848359 3494423 3199361 2949308 2734194 2545710 2377830
60954B377830j49755j32823j18814j08128r8022q6697p5719o6580n8025m9220
$$ 2377830 2228075 2095252 1976438 1868310 1770288 1683591 1607872 1541292 1483267 1434047
60944A434047m2613m0799m2409m3834m3610m2672m1567l9889l7771l5777l3706
$$ 1434047 1391434 1350635 1308226 1264392 1220782 1178110 1136543 1096654 1058883 1023106 989400
60933I89400l1144k8732k7253k6063k3992k1284j9164j7887j6755j5649j4905
$$ 989400 958256 929524 902271 876208 852216 830932 811768 793881 777126 761477 746572
60922G46572j4010j2031r360p532p129p192o849o230n584m737l785l266l200k955
$$ 746572 732562 720531 711171 703639 696510 689318 682469 676239 670655 665918 662133 658867 655667 652712
60908F52712k288j647j118j53J214J893J158k32j063j184j279j646j973k105k296
$$ 652712 650424 648777 647659 647506 648720 650613 651771 651539 650476 649292 648013 646367 644394 642289 639993
60893F39993k700l130l348l423l639m146m644m602m034l783m608o100p138p347
$$ 639993 637293 634163 630815 627392 623753 619607 614963 610361 606327 602544 597936 591836 584698 577351
60879E77351p370p612p606o971o257o150o527o769o670o385n872n001m028l387
$$ 577351 569981 562369 554763 547792 541535 535385 528858 522089 515419 509034 503162 498161 494133 490746
60865D90746l096k721j917p29M66J192J307J322J937L140M293N132N988O747O488
$$ 490746 487650 484929 483012 482283 482749 483941 485248 486570 488507 491647 495940 501072 507060 513807 520295
60850E20295M833K893K057K380K943L316L709M121M224L930L232J758o17k993
$$ 520295 525128 528021 530078 532458 535401 538717 542426 546547 550771 554701 557933 559691 559074 556081
60836E56081m202m295m337m804n180n084m806m547m084l456l131l195l175k892
$$ 556081 551879 547584 543247 538443 533263 528179 523373 518826 514742 511286 508155 504960 501785 498893
60822D98893k722k773k567j953j517j753k440l171l860m371m335l771l317l402
$$ 498893 496171 493398 490831 488878 487361 485608 483168 479997 476137 471766 467431 463660 460343 456941
60808D56941l751m021m311m666m754m486m341m495m286l185j807j193j457j832
$$ 456941 453190 449169 444858 440192 435438 430952 426611 422116 417830 414645 412838 411645 410188 408356
60794D08356j804j529j247r47n98l08j72l00p76j400j596j013m1O09P35P09Q56
$$ 408356 406552 405023 403776 402829 402231 401923 401751 401451 400675 399275 397679 396666 396625 397234 397969 398678 399534
60777C99534J110J239J203J196J439J923K341K425K252K100K007J871J865K302
$$ 399534 400644 401883 403086 404282 405721 407644 409985 412410 414662 416762 418769 420640 422505 424807
60763D24807K995L234K649J672R27N14J30m32j052j327q37L29J266J048j37j180
$$ 424807 427802 431036 433685 435357 436284 436798 436928 436496 435444 434117 433280 433609 434875 435923 435786 434606
60747D34606j424j248j073o50K74J221J512J094K92q27k325l960n312o157o367
$$ 434606 433182 431934 430861 430211 430485 431706 433218 434312 434604 433777 431452 427492 422180 416023 409656
60732D09656n814m697l670l220l151k968k538k056j716j626j760j812j412o92
$$ 409656 403842 399145 395475 392255 389104 386136 383598 381542 379826 378200 376440 374628 373216 372524
60718C72524j34J98O65J151R99J98k06M46J335J379Q42Q14J555K339K691K815
$$ 372524 372390 372588 373253 374404 375403 375601 375395 375841 377176 378555 379397 380211 381766 384105 386796 389611
60702C89611K828K521J973J641J636J522J010L82J12L88J089J864K202J819J032
$$ 389611 392439 394960 396933 398574 400210 401732 402742 403124 403236 403624 404713 406577 408779 410598 411630
60687D11630M77M41O12O13M52M92J004J775K179J788R11K90K32L86L76K28J02
$$ 411630 412107 412548 413160 413773 414225 414717 415721 417496 419675 421463 422374 422664 422896 423282 423658 423886 423988
60670D23988J02M89J448K436K364Q53j183k631l327l732l985l904l460k810k080
$$ 423988 424090 424579 426027 428463 430827 431680 430497 427866 424539 420807 416822 412918 409458 406648 404568
60655D04568j541j531j852j708p74K43O02O10J028J868K537K754K659K253J443
$$ 404568 403027 401496 399644 397936 397162 397405 398007 398617 399645 401513 404050 406804 409463 411716 413159
60640D13159M53m33j311k311l070l222l044l030l098k877k485k234j811o50R43
$$ 413159 413612 413179 411868 409557 406487 403265 400221 397191 394093 391216 388731 386497 384686 384036 384979
60625C84979J906J776J245J157J543J808J537Q59K53Qj46o54j313j272j98J093
$$ 384979 386885 388661 389906 391063 392606 394414 395951 396810 397063 397071 396925 396271 394958 393686 393488 394581
60609C94581J680J636J529J290M67o80j225p12M17J456J907J484L55o86q57k48
$$ 394581 396261 397897 399426 400716 401183 400503 399278 398566 398983 400439 402346 403830 404185 403499 402642 402394
60593D02394M79J029J630K303K720K797K837L003L056K723K035J276Q17Q33J018
$$ 402394 402873 403902 405532 407835 410555 413352 416189 419192 422248 424971 427006 428282 429099 429932 430950
60578D30950Q71M06J87L60L59n2j54O70J945K967L968N486P136Q157Q781R802
$$ 430950 431821 432227 432414 432774 433133 433081 432927 433597 435542 438509 442477 447963 455099 463256 472037 481839
60562D81839J1026J1467J1078J0962J1508J1496R614O053K097j290l957o035p408
$$ 481839 492865 504332 515410 526372 537880 549376 558990 565043 567140 565850 561893 555858 548450
60549E48450p688o692m956l445k520j576j12J414K394L141M324N778O943Q069
$$ 548450 540762 534070 529114 525669 523149 521573 521461 522875 525269 528410 532734 538512 545455 553524
60535E53524R907J2322J4421J6063J8124K0976K3685K4944K4038K0857J5890J0426
$$ 553524 563431 575753 590174 606237 624361 645337 669022 693966 718004 738861 754751 765177
60523G65177N775J994j908o279j0137j2435j3212j3205j2934j2546j1901j0606
$$ 765177 770952 772946 771038 764759 754622 742187 728975 715770 702836 690290 678389 667783
60511F67783q488o142m494l714l193k506j694o30J017K990M592N847P695J0723
$$ 667783 659295 653153 648659 644945 641752 639246 637552 636922 637939 640929 645521 651368 659063 669786
60497F69786J4507J8542K3022K8182L3563L8389M2248M5037M6693M7200M6416
$$ 669786 684293 702835 725857 754039 787602 825991 868239 913276 959969 1007169 1053585
60486A053585M3774L8773L2023K5180J9540J5183J1527Q037M124j004p815j6103
$$ 1053585 1097359 1136132 1168155 1193335 1212875 1228058 1239585 1247622 1251746 1250742 1242927 1226824
60474A226824k5254l4451m2611m8719n2419n3874n3154n0364m6339m2233l8336
$$ 1226824 1201570 1167119 1124508 1075789 1023370 969496 916342 865978 819639 777406 739070
60463G39070l4113k9571k5677k2989k0791j8151j5207j2795j1297j0354r422q247
$$ 739070 704957 675386 649709 626720 605929 587778 572571 559776 548479 538125 528703 520456
60451E20456o994o094n698n342m561l703l485l831l923l415k740k147j356m19
$$ 520456 513462 507368 501670 496328 491767 488064 484579 480748 476825 473410 470670 468523 467167 466748
60437D66748P5mkL03J16j100k528k936k278j518j229j087p17l98p21j735k665
$$ 466748 466823 466819 466817 467120 467236 466136 463608 460672 458394 456876 455647 454560 453843 453445 452724 450989 448324
60420D48324k607j502j46Q42J641K485K918K440J404N29n8m49k26Q53J879J856
$$ 448324 445717 444215 444069 444911 446552 449037 451955 454395 455799 456328 456270 455821 455595 456448 458327 460183
60404D60183J362J680K550K458J266O61J517K636K843K657K872K963K225J406
$$ 460183 461545 463225 465775 468233 469499 470160 471677 474313 477156 479813 482685 485648 487873 489279
60390D89279J747L120M277M532M202L802L580L536L282K356J065M62J038K125
$$ 489279 491026 494146 498423 502955 507157 510959 514539 518075 521357 523713 524778 525240 526278 528403
60376E28403K953L498L800L498K701K382L032L702L302K084J019M30J94M85J279
$$ 528403 531356 534854 538654 542152 544853 547235 550267 553969 557271 559355 560374 560804 560998 561483 562762
60361E62762J710J059K5n7J071K532L621M235M270L684L078L420M987P110Q930
$$ 562762 564472 565531 565556 565499 566570 569102 572723 576958 581228 584912 587990 591410 596397 603507 612437
60346F12437R943R972R131P749O076M183K237M82j203l150n098o273o538o736
$$ 612437 622380 632352 641483 649232 655308 659491 661728 662210 661007 657857 652759 646486 639948 633212
60332F33212p352p645o816n348m414m354m520m251l483k695k632l650n005n413
$$ 633212 625860 618215 611399 606051 601637 597283 592763 588512 585029 582334 579702 576052 571047 565634
60318E65634m624l694l275k660j145O18J594J968K697M034N442O708Q220J0330
$$ 565634 561010 557316 554041 551381 550236 550854 552448 554416 557113 561147 566589 573297 581517 591847
60304E91847J3051J6070J8674K0194K0917K1814K2843K2419J9369J4519R325L818
$$ 591847 604898 620968 639642 659836 680753 702567 725410 747829 767198 781717 791042 794860
60292G94860k904j0624j7720k2649k4805k4249k1697j8496j5710j3308j0885q679
$$ 794860 791956 781332 763612 740963 716158 691909 670212 651716 636006 622698 611813 603134
60280F03134p078n694l948k233j478j885k931m293n750o557o034m646l558l211
$$ 603134 596056 590362 586414 584181 582703 580818 577887 573594 567844 561287 555253 550607 547049 543838
60266E43838l181l212l438l743l740l387k941k436j825j383j342j389j204j007
$$ 543838 540657 537445 534007 530264 526524 523137 520196 517760 515935 514552 513210 511821 510617 509610
60252E09610r79o83J37P48M16l20l81L49J248K154L111L455K526J044L80N40L41
$$ 509610 508631 507948 508085 508833 509249 508929 508548 508897 510145 512299 515410 518865 521391 522435 522815 523355 523696
60235E23696n26j025n70J03K81L05P12J349J840K219K638L013L230L296L136K765
$$ 523696 523170 522145 521575 521678 521959 522264 522976 524325 526165 528384 531022 534035 537265 540561 543697 546462
60219E46462K601L011L652L948M029M488N312N898O138O549P368Q278R126J0102
$$ 546462 549063 552074 555726 559674 563703 568191 573503 579401 585539 592088 599456 607734 616860 626962
60205F26962J1103J1671J1646J1218J0400R179Q108P848Q044P577O068M404L498
$$ 626962 638065 649736 661382 672600 683000 692179 700287 708135 716179 723756 729824 734228 737726
60192G37726L234K893K028P42n44j408j835k297l124m100m911n638o351o800p011
$$ 737726 740960 743853 745881 746623 746079 744671 742836 740539 737415 733315 728404 722766 716415 709615 702604
60177G02604p514q257q107o466m647m315n171n544m893m083l438k305p15J56l11
$$ 702604 695090 686833 678726 672260 667613 663298 658127 652583 647690 643607 640169 637864 637149 637305 636994
60162F36994j366k138k585k702k115r88k75m20o93l36M75J224J802K160K015J454
$$ 636994 635628 633490 630905 628203 626088 625100 624825 624405 623712 623376 623851 625075 626877 629037 631052 632506
60146F32506J080J225J518J619J758K212K878L580M250M685M785N017N949P274
$$ 632506 633586 634811 636329 637948 639706 641918 644796 648376 652626 657311 662096 667113 673062 680336
60132F80336Q122Q371Q780R644J0314J0259R577Q271O039L218J006J76K97N85
$$ 680336 688458 696829 705609 715253 725567 735826 745403 753674 759713 762931 763937 764113 764410 764995
60118G64995Q44J178J551K023K766L560L897L784L641L298K080J73j129j092n63
$$ 764995 765839 767017 768568 770591 773357 776917 780814 784598 788239 791537 793617 793790 792661 791569 791006
60103G91006p82j942l481n019o392p319p733p911p939p436o265m917l930l354
$$ 791006 790224 788282 784801 779782 773390 766071 758338 750427 742488 735052 728787 723870 719940 716586
60089G16586l074l022k809j888l82Q36J226J120R62P49N36O97J225J471J063M20
$$ 716586 713512 710490 707681 705793 705411 706247 707473 708593 709555 710304 710840 711537 712762 714233 715296 715716
60073G15716p6p77k123l896n611p138q472r352r552r195q559p930p710q070q366
$$ 715716 715640 714863 712740 708844 703233 696095 687623 678271 668719 659524 650965 643035 635325 627255 618889
60058F18889p696o173m914m518m397l950l379k978k431j535p21l16R1Q72J659
$$ 618889 611193 605020 600106 595588 591191 587241 583862 580884 578453 576918 576197 575881 575972 576844 578503
60043E78503K087K638L965N859P540Q587Q998Q774Q024P193O639O176N470M488
$$ 578503 580590 583228 587193 593052 600592 609179 618177 626951 634975 642168 648807 654983 660453 664941
60029F64941L332J984N85n51j456k628m217n673o579p255q107q881r213r400r980
$$ 664941 668273 670257 670842 670291 668835 666207 661990 656317 649738 642483 634376 625495 616282 606882 596902
60014E96902j0775j1062j0529r600q831q298p672o672n479m582m094l438k127
$$ 596902 586127 575065 564536 554936 546105 537807 530135 523463 517984 513402 509308 505870 503743
60001E03743o76k3j57j13N47J085Q16K13K23R82J805K144K115K184K643L347L953
$$ 503743 503067 503044 502887 502774 503321 504406 505222 505435 505658 506640 508445 510589 512704 514888 517531 520878 524831
59984E24831M436N191O313P120O857N647M107K395L83j486k522k838l191l764
$$ 524831 529267 534458 540771 547891 554748 560395 564502 566897 567280 565794 563272 560434 557243 553479
59970E53479m055l911l652l252k404j507j334j579r52J010L261M684N123M774
$$ 553479 549424 545513 541861 538609 536205 534698 533364 531785 530833 531843 535104 539788 544911 549685
59956E49685L874L238L797N037N182L507J245l66j488k458k658j798j016j351
$$ 549685 553559 556797 560594 565631 570813 574320 575565 575199 573711 571253 568595 566797 565781 564430
59942E64430k090j943j088o75q94r74p46r35j898l059l620l250k133q33J15Q48
$$ 564430 562340 560397 559309 558634 557740 556766 556020 555085 553187 550128 546508 543258 541125 540292 540407 541255
59926E41255K049L837N356N881N745N648N761N991O447O907O551M972K989J676
$$ 541255 543304 547141 552497 558378 564123 569771 575532 581523 587970 594877 601428 606400 609389 611065
59912F11065J106O87K88K99R29K086L618N167O140O287N923N209L896K192J140
$$ 611065 612171 612858 613146 613445 614374 616460 620078 625245 631385 637672 643595 648804 652700 654892 656032
59897F56032J405K273K537J954J212Q99J126J776K534L007L236L708M594N422
$$ 656032 657437 659710 662247 664201 665413 666312 667438 669214 671748 674755 677991 681699 686293 691715
59883F91715N814N919N888N592N212N255N662N676N090M690M896M842L578J435
$$ 691715 697529 703448 709336 714928 720140 725395 731057 736733 741823 746513 751409 756251 759829 761264
59869G61264m95j631k075k164k387l187m343n155n473n741n835m977l240j940
$$ 761264 760769 759138 757063 754899 752512 749325 744982 739827 734354 728613 722778 717801 714561 712621
59855G12621j867k341k618k973l495l220j579L59J352J804K952N055P559J0206
$$ 712621 710754 708413 705795 702822 699327 696107 694528 694887 696239 698043 700995 706050 713609 723815
59841G23815J2776J4261J3561J0606O146J039l455n704n026k479M76L212N190
$$ 723815 736591 750852 764413 775019 781165 782204 778749 773045 768019 765540 766016 769228 774418
59828G74418N180K563j469n134p729r182r133p793o705p141q406r022q780q336
$$ 774418 779598 782161 780692 775558 767829 758647 749514 741721 735016 727875 719469 710447 701667 693331
59814F93331p709o635n635n110m215k251m96q56l136n360o324o256n369l632j788
$$ 693331 685622 678987 673352 668242 664027 661776 661280 660424 657288 651928 645604 639348 633979 630347 628559
59799F28559q95q08n40k2n8p18j297j663k184k422j506J05Q55K61n44o60m91o69
$$ 628559 627664 626856 626316 626294 626236 625518 624221 622558 620374 617952 616446 616551 617406 617667 617123 616463 615972 615303
59781F15303j128j643k249k773k836k484k152j951j646j216p39J9J123J945K000
$$ 615303 614175 612532 610283 607510 604674 602190 600038 598087 596441 595225 594486 594505 595628 597573 599573
59766E99573J861K357L263L806L981M299M671M705M660M993N415N564O020P414
$$ 599573 601434 603791 607054 610860 614841 619140 623811 628516 633176 638169 643584 649148 655168 662582
59752F62582R045R765R782J0167J1088J1957J2760J3675J3829J2260R857Q532
$$ 662582 671627 681392 691174 701341 712429 724386 737146 750821 764650 776910 786767 795299
59740G95299Q530Q276O825M746K617L44j816l179l791m340m789m553l885l649
$$ 795299 803829 812105 818930 823676 826293 826637 824821 821642 817851 813511 808722 804169 800284 796635
59726G96635l784l510l066l428m300m180k722j259o76n03n13j392l187m611m734
$$ 796635 792851 789341 786275 782847 778547 774367 771645 770386 769710 769207 768694 767302 764115 759504 754770
59711G54770m083l526l220l110l287l371k623j080M23J508K420L000K827K420
$$ 754770 750687 747161 743941 740831 737544 734173 731550 730470 730893 732401 734821 737821 740648 743068
59697G43068K897M238N342N948P034R068J1433J3646J5540J5930J3067P124P02
$$ 743068 745965 750203 755545 761493 768527 777595 789028 802674 818214 834144 847211 854335 855037
59684H55037l847o349p688q339q585q668q138o413m473m420o676r221j0264j0220
$$ 855037 851190 844841 837153 828814 820229 811561 803423 797010 792537 788117 781441 772220 761956 751736
59670G51736j0226j0266r803q955q032o896n641m885m659m148l088k276k023j349
$$ 751736 741510 731244 721441 712486 704454 697558 691917 687032 682373 678225 675137 672861 670838 669489
59656F69489L87K305L266L396L514L965M680N538O077N745M854M282L882K417
$$ 669489 669876 672181 675447 678843 682357 686322 691002 696540 702617 708362 713216 717498 721380 723797
59642G23797m87l602n866p525q917r456q749p581o830o391n768m887l681j894
$$ 723797 723310 719708 713842 706317 697400 687944 679195 671614 664784 658393 652625 647738 644057 642163
59628F42163J49J496J732J263K71j398l130l803l481l411l916l991l456l592m872
$$ 642163 642312 643808 645540 646803 647074 645676 642546 638743 635262 631851 627935 623944 620488 616896 612024
59613F12024n930n713n002m679m216l103k106j747j047O97K295K384J564J239
$$ 612024 606094 600381 595379 590700 586484 583381 581275 579528 578481 579178 581473 583857 585421 586660
59599E86660J388J134N77M26M67ko64n11N88J789K528K960L398L903M200L699
$$ 586660 588048 589182 589759 590185 590652 590650 589986 589475 590063 591852 594380 597340 600738 604641 608841 612540
59583F12540K149M16l49m29j222k954m261m488m722n711o468o053n209m980m975
$$ 612540 614689 615105 614756 614327 613105 610151 605890 601402 596680 590969 584501 578448 573239 568259 563284
59568E63284m370l429k763k164j324o54l81Q6Q92J085K37n61m55j61m02m45M58
$$ 563284 558914 555485 552722 550558 549234 548580 548199 548285 549177 550262 550499 549938 549483 549322 548920 548475 548933
59551E48933J544J882J908K215K209J466J027J766K772L035L304M533N979O708
$$ 548933 550477 552359 554267 556482 558691 560157 561184 562950 565722 568757 572061 576594 582573 589281
59537E89281P638R982J3128J6231K0256K5461K8175K3681J2377J44p707j0463
$$ 589281 596919 606901 620029 636260 656516 681977 710152 733833 746210 746354 738647 728184
59525G28184j0074q136n623l328j298R16K915L622K998K181J647P31q15k274l331
$$ 728184 718110 709974 704351 701023 699725 700641 703556 707178 710176 712357 714004 714735 713920 711646 708315
59510G08315m595o352q010r128r906j0354j0019q869p475o156m846l859l753m268
$$ 708315 703720 697368 689358 680230 670324 659970 649951 641082 633607 627451 622605 618746 614993 610725
59496F10725m385l637k518j508n13N99J596K154K029J118p6n10K69J473K274L079
$$ 610725 606340 602703 600185 598677 598164 598763 600359 602513 604542 605660 605584 605074 605343 606816 609090 612169
59480F12169M705O872Q603R646J0439J1178J1942J3264J5332J7029J6971J5166
$$ 612169 616874 623746 632349 641995 652434 663612 675554 688818 704150 721179 738150 753316
59468G53316J2477Q982M240j050n213p445q241q072o881m904k783o77J782M537
$$ 753316 765793 774775 779015 777965 772752 765307 757066 748994 742113 737209 734426 733749 735531 740068
59454G40068O980Q818J0340J1788J3077J4028J4453J4345J4355J5318J6799J7045
$$ 740068 747048 755866 766206 777994 791071 805099 819552 833897 848252 863570 880369 897414
59442H97414J5071J1699P715K384m737j1793j6162j7233j6167j3865j0938q691
$$ 897414 912485 924184 931899 934283 929546 917753 901591 884358 868191 854326 843388 834697
59430H34697q156q636r013r735j1582j3284j2751j0144p338m741j215L119O731
$$ 834697 826541 817905 808892 799157 787575 774291 761540 751396 744058 739317 738102 741221 747952
59417G47952R504J2886J6870J9668K0954K2689K5848K9357L3361L9931M7941N0175
$$ 747952 757456 770342 787212 806880 827834 850523 876371 905728 939089 979020 1026961 1077136
59405A077136L9497J7264p163k4806l2718l2421k6426j7377p676K213J3644K5842
$$ 1077136 1116633 1133897 1126734 1101928 1069210 1036789 1010363 992986 985310 987523 1001167 1027009
59393A027009L2894K7542R037j4237l1514l8408l8137l5424l1741k6659k0977
$$ 1027009 1059903 1087445 1096482 1082245 1050731 1012323 974186 938762 907021 880362 859385
59382H59385j6451j3572j1472r480p512n482l512k326k228k279j564p19q95j824
$$ 859385 842934 829362 817890 808410 800898 795416 791904 789578 787350 785071 783507 782788 781893 780069
59368G80069k355k392k736l293l057j852o02J72P90J349J531J553K103L270M596
$$ 780069 777714 775322 772586 769293 766236 764384 763782 763954 764744 766093 767624 769177 771280 774550 779146
59353G79146O086Q068J0164J1572J2361J3301J4587J5809J7056J8793K0758K2138
$$ 779146 785232 793300 803464 815036 827397 840698 855285 871094 888150 906943 927701 949839
59341I49839K2711K2759K2072K0319J8041J5991J3635R771M480q85n502r535j2957
$$ 949839 972550 995309 1017381 1037700 1055741 1071732 1085367 1095138 1099618 1098733 1093231 1083696 1070739
59328A070739j5358j6928j8353j9658k0382k0642k0843k0669j9689j8541j8013
$$ 1070739 1055381 1038453 1020100 1000442 980060 959418 938575 917906 898217 879676 861663
59317H61663j7448j5696j3251j1636j0998j0232r229q904r103q618p430o800o938
$$ 861663 844215 828519 815268 803632 792634 782402 773173 764269 755166 746548 739118 732318 725380
59304G25380o620n422m214l153j225J631M057N500O942Q866J0612J2344J5329
$$ 725380 718760 713338 709124 705971 704746 706377 710434 715934 722876 731742 742354 754698 770027
59291G70027J9083K0269J6035P215k868j1373j6863j8898j8209j6442j4583j2298
$$ 770027 789110 809379 825414 832629 829761 818388 801525 782627 764418 747976 733393 721095
59279G21095r240n962l040l80K057M013N776Q112J0878J3070J4518J6218J8492
$$ 721095 711855 705893 702853 702473 704530 708543 714319 722431 733309 746379 760897 777115 795607
59266G95607K0273K0669J9893J8173J5280J1590Q203N403K385j088m219o673q970
$$ 795607 815880 836549 856442 874615 889895 901485 909688 915091 917476 916388 912169 905496 896526
59253H96526j0950j1598j0886j0021r336p891n707m286m094l593j900l00J67O61
$$ 896526 885576 873978 863092 853071 843735 835844 830137 825851 821757 818164 816264 815964 816131 816792
59239H16792K474M741N874N961O123O617P060P460P681O880M796K620J456P14
$$ 816792 819266 824007 829881 835842 841965 848582 855642 863102 870783 877663 882459 885079 886535 887249
59225H87249q69l564o859j0324j3298j4793j4694j4147j3913j3401j2032j0373
$$ 887249 886380 882816 875957 865633 852335 837542 822848 808701 794788 781387 769355 758982
59213G58982r039p797o560n981o136n942m861l883l784l802l101k218j822j440
$$ 758982 749943 742146 735586 729605 723469 717527 712666 708783 704999 701197 698096 695878 694056 692616
59199F92616n60K34M77R28K137L178L098K499K390K558K430K452L235M283M848
$$ 692616 692056 692290 692767 693695 695832 699010 702108 704607 706997 709555 711985 714437 717672 721955 726803
59184G26803N132N484N444M749M207M394M485L717K780K451K016O30q10q24L38
$$ 726803 731935 737419 742863 747612 751819 756213 760698 764415 767195 769646 771662 772292 771482 770658 770996
59169G70996J097P58m1n39k90R87K878M151M123L523L181K762J718L99q05k389
$$ 770996 772093 772851 772810 772271 771981 772968 775846 779997 784120 787643 790824 793586 795304 795703 794898 792509
59153G92509m676o888q420r882j1742j3012j2764j1815j1446j1339j0396q736
$$ 792509 787833 780945 772525 762643 750901 737889 725125 713310 701864 690525 680129 671393
59141F71393p421o750o307o041o017n669m600l488l147l269l138k759k318j465
$$ 671393 663972 657222 650915 644874 638857 633188 628588 625100 621953 618684 615546 612787 610469 609004
59127F09004k00N52L91M60J717L344M213M830O273Q165R394J0005J0807J1758
$$ 609004 608804 609356 609747 610207 611924 615268 619481 624311 630584 638749 648143 658148 668955 680713
59113F80713J2274J2521J2944J3201J2865J2497J2580J2245J0496Q044O405N824
$$ 680713 692987 705508 718452 731653 744518 757015 769595 781840 792336 800380 806785 812609
59101H12609N483N014M419L205J143p98j699k177l164m065l746k650k109k140
$$ 812609 818092 823106 827525 830730 831873 831075 829376 827199 824035 819970 816224 813574 811465 809325
59087H09325j636m22N81R32Q95L50j046k844m257n369o732q190r149r621r811
$$ 809325 807689 807267 807848 808780 809675 810025 808979 806135 801878 796509 789777 781587 772438 762817 753006
59072G53006r355q099o983o870p127o730n974n769n878n393m470m035m146l968
$$ 753006 743651 735552 728569 721699 714572 707842 701868 696099 690221 684828 680358 676323 672177 668209
59058F68209l068j691k03P43K81j365k470j808l13L35k29j456l076m547m628l120
$$ 668209 665141 663450 663247 663990 664271 662906 660436 658628 658315 658650 658421 656965 653889 649342 644714 641594
59042F41594j815k133l031k985k537k881l201j916M13J901K350L068M262N010
$$ 641594 639779 637646 634615 631630 629093 626212 623011 621095 621508 623409 625759 628827 633089 638099
59028F38099N398O340P567Q047Q195R451J1808J3845J5167J6737J8760K0152K0161
$$ 638099 643497 649837 657404 665451 673646 683097 694905 708750 723917 740654 759414 779566 799727
59015G99727J8858J6210J2318Q365N576L570J325q55k233l653o368r312j0097
$$ 799727 818585 834795 847113 855478 861054 864624 865949 865094 862861 859208 852840 843528 833431
59002H33431q524o608n142k867O58L801N213N378N170M620L716K895K195J253
$$ 833431 824907 818299 813157 810290 810948 814749 819962 825340 830510 835130 838846 841741 843936 845189
58988H45189L08n5k06j117k761m260n369o314o536n364l560k419j646q1J884K811
$$ 845189 845497 845442 845236 844119 841358 837098 831729 825415 818879 813515 809955 807536 805890 805809 807693 810504
58972H10504K899L822N876P673Q839J0639J3366J5446J5842J5417J5218J5066
$$ 810504 813403 817225 823101 830774 839613 850252 863618 879064 894906 910323 925541 940607
58960I40607J4534J3676J2272R792O570L592Q40k658o955j0894j3939j6619j8982
$$ 940607 955141 968817 981089 990881 997451 1001043 1001883 999225 992270 981376 967437 950818 931836
58947I31836k0146j9839j8870j7835j6647j5448j4613j3722j1948r460p150n167
$$ 931836 911690 891851 872981 855146 838499 823051 808438 794716 782768 773308 766158 760991
58935G60991l118j375o57o19n01o46j548k040o72J520K015M89r70j287j544k472
$$ 760991 757873 756498 755841 755222 754721 754075 752527 750487 749815 751335 753350 753839 752869 751582 750038 747566
58919G47566l269l421l517l689l239k273j778j767j324m93j40K01J888M390N518
$$ 747566 744297 740876 737359 733670 730431 728158 726380 724613 723289 722796 722656 722857 724745 729135 734653
58904G34653M963N095P429J0667J3115J4849J6454J7657J8334J9123J9999J9742
$$ 734653 739616 744711 752140 762807 775922 790771 807225 824882 843216 862339 882338 902080
58892I02080J7658J4519J1376Q975Q486J0853J4952J8221J9617K0262K0937K0860
$$ 902080 919738 934257 945633 954608 963094 973947 988899 1007120 1026737 1046999 1067936 1088796
58880A088796J9399J6942J3651R286M658J241j084l944p792j1354j4050j6622
$$ 1088796 1108195 1125137 1138788 1148074 1152732 1153973 1152889 1148945 1141153 1129799 1115749 1099127
58868A099127j8955j9668j8501j6863j5413j3414j1055r944j0447j0950j0616
$$ 1099127 1080172 1060504 1042003 1025140 1009727 996313 985258 975314 964867 953917 943301
58857I43301j0562j1343j1746j1169j0903j1744j2444j1799j0374r006p424n495
$$ 943301 932739 921396 909650 898481 887578 875834 863390 851591 841217 832211 824787 819292
58845H19292m029l443l235l503n051p391q791q948r421j0710j1295j0492r706
$$ 819292 815263 811820 808585 805082 800031 792640 783849 774901 765480 754770 743475 732983 723277
58832G23277r752r416q010o890o947o847n318l230j893j082k32K48J64L74J297
$$ 723277 713525 704109 696099 689209 682262 675415 670097 666867 664974 663892 663660 663908 664072 664446 665743
58817F65743K201K907M241N930O184M489K668K098J968J400J028J251J175N09
$$ 665743 667944 670851 675092 681022 687206 691695 694363 696461 698429 699829 700857 702108 703283 703792
58803G03792L70R15N47j194k447k190k104l547n115n176m602m830n215m552l526
$$ 703792 704162 705077 705624 704430 701983 699793 697689 694142 689027 683851 679249 674419 669204 664652 661126
58788F61126l451l912l599k412j086J84J467K552L676N440P293P750O886O571
$$ 661126 657675 653763 650164 647752 646666 646850 648317 650869 654545 659985 667278 675028 681914 688485
58774F88485P466Q011P210O006M830K408j582n242p246q449r336q682o436m995
$$ 688485 695951 703962 711172 717178 722008 724416 722834 717592 710346 701897 692561 683879 677443 672448
58760F72448n554n921m218k100j747k176j280M97J378J361J528J684J194P87J290
$$ 672448 666894 660973 656755 654655 652908 650732 649452 649949 651327 652688 654216 655900 657094 657881 659171
58745F59171J813J212J19k29K38J333L557O460P965P145N886O015O689O416N627
$$ 659171 660984 662196 662315 662086 662324 663657 667214 673674 681639 688784 694670 700685 707374 713790 719417
58730G19417N277M910M102L871M700N132M279L592M156M475L101J289P34Q24N40
$$ 719417 724694 729604 733706 737577 742277 747409 751688 755280 759436 763911 767012 768301 769035 769859 770399
58715G70399Q80K866N112N909N894O251O261M994L532K952K106j42k493l557m602
$$ 770399 771279 774145 779257 785166 791060 797311 803572 808566 812098 815050 817156 817014 814521 810964 806362
58700H06362p280j0567j2684j4159j6252j8186j8685j8478j8568j7896j5439j2685
$$ 806362 799082 788515 775831 761672 745420 727234 708549 690071 671503 653607 638168 625483
58688F25483j1291j0176p844n576n273n987n719m889m929n149m222l131l475m328
$$ 625483 614192 604016 596172 590596 585323 579336 573617 568728 563799 558650 554428 551297 547822 543494
58674E43494l873k609j957j288N27K247K219J646K741N033O671P874R905J2093
$$ 543494 539621 537012 535055 533767 534294 536541 538760 540406 543147 548180 554851 562725 572630 584723
58660E84723J2970J2877J2381R952M612q27k809j918j343j953k509l164m932o772
$$ 584723 597693 610570 622951 632903 637515 636688 633879 631961 630618 628665 626156 622992 618060 611288
58646F11288o927o166o398p159o819n882n756n670m300k897l160l605j900Q21
$$ 611288 604361 598195 591797 584638 577819 571937 566181 560511 556211 553314 550154 546549 544649 545470
58632E45470J973K267M103O598O821M996L984M221L623J948R79O96n63k367k559
$$ 545470 547443 549710 553813 560411 567232 572228 576212 580433 584056 586004 586983 587679 587116 584749 582190
58617E82190j077K75J348L257N204N503N092O168Q020Q194O930O373O207M446
$$ 582190 581113 581388 582736 585993 591197 596700 601792 607960 615980 624174 631104 637477 643684 648130
58603F48130J912J283K193J783o9p21J35n9j874l003k578k246k497j934n72k5
$$ 648130 650042 651325 653518 655301 655232 654511 654646 654587 652713 649710 647132 644886 642389 640455 639883 639858
58587F39858q2J241L995O219P564R364J1316J1842J1531J2369J3743J3190J0865
$$ 639858 639776 641017 645012 651231 658795 668159 679475 691317 702848 715217 728960 742150 753015
58574G53015R266Q784P623N973N906P287Q011Q211R946J2909J4816J6044J9163
$$ 753015 762281 771065 778688 784661 790567 797854 805865 814076 824022 836931 851747 867791 886954
58561H86954K3867K7048K8129K9654L2152L3132L1674K9432K6440K0555J1975
$$ 886954 910821 937869 965998 995652 1027804 1060936 1092610 1122042 1148482 1169037 1181012
58550A181012M008j509n682q972j0326j0204j0326j0170p894m846m641p615j0801
$$ 1181012 1185020 1183511 1177829 1168857 1158531 1148327 1138001 1127831 1119937 1115091 1110450 1102835 1092034
58537A092034j3484j7760k3296k6734k7212k7416k8278k7537k4547k1679j9771
$$ 1092034 1078550 1060790 1037494 1010760 983548 956132 927854 900317 875770 854091 834320
58526H34320j6939j2961j0224r252p794n342m049m310l989k795k768l802l442
$$ 834320 817381 804420 794196 784944 777150 771808 767759 763449 759460 756665 753897 750095 746653
58513G46653j828j775l303l262j128J14k80J83J623J000j766k727n90J217P75
$$ 746653 744825 743050 739747 736485 735357 735471 735191 735374 736997 737997 736231 733504 732914 734131 734906
58498G34906L35R57L34j966k729q80L90m78p60J007K227J493J386L468N489O094
$$ 734906 735241 736198 736532 734566 731837 730957 731347 730869 730109 731116 733343 734836 736222 739690 745179 751273
58482G51273P361J0218J2337J2928J4695J8618K1765K2614K3422K4978K4235J9769
$$ 751273 758634 768852 781189 794117 808812 827430 849195 871809 895231 920209 944444 964213
58470I64213J4517J0443N537j330p540j1356j4379j7032j6775j3338j0494r950
$$ 964213 978730 989173 994710 993380 985840 974484 960105 943073 926298 912960 902466 892516
58458H92516q695m955j395L20K624O870J0470J2200J4784J9066K1059J8119J2908
$$ 892516 883821 878866 877471 877791 880415 887285 897755 909955 924739 943805 964864 982983 995891
58445I95891Q108K479m667j0380j2845j4240j5864j5606j3048j1480j1901j0680
$$ 995891 1003999 1006478 1001811 991431 978586 964346 948482 932876 919828 908348 896447 885767
58433H85767o301k524j662p85K081M103L655L963O838Q982Q486Q899J2503J5627
$$ 885767 879466 876942 875280 874495 876576 880679 884334 888297 895135 904117 912603 921502 934005 949632
58419I49632J5021J2953J1661Q779K868k476m716o791j0860j3674j2856j1786
$$ 949632 964653 977606 989267 998046 1000914 998438 993722 986931 976071 962397 949541 937755
58407I37755j3286j4363j2266r852r821r506o561m013m368m462j523J369J223
$$ 937755 924469 910106 897840 887988 878167 868661 862100 858087 853719 849257 847734 849103 850326
58394H50326P40K712M646M255M389P069Q586O097L094K818K433n66k614q00J108
$$ 850326 851066 853778 858424 862679 867068 874137 882723 888820 891914 894732 897165 896599 893985 893185 894293
58379H94293l96j916J07K455J571O39L282O320N870M708O474Q454P284N955P959
$$ 894293 893897 891981 892088 894543 896114 896753 900035 906355 912225 916933 923407 931861 939145 945100 953059
58364I53059J0265R311Q138J0361J2965J2462J2109J5509J8990J8026J5237J4446
$$ 953059 963324 972635 980773 991134 1004099 1016561 1028670 1044179 1063169 1081195 1096432 1110878
58352A110878J3017P936L161K749K999l64l544j753J548J317M20L407P114O824
$$ 1110878 1123895 1131831 1134992 1137741 1140740 1140376 1136832 1135079 1136627 1137944 1138364 1141771 1148885 1155709
58338A155709N723Q727J2801J2967J2027J4699J7988J7159J5363J7453K0129J8299
$$ 1155709 1161432 1170159 1182960 1195927 1207954 1222653 1240641 1257800 1273163 1290616 1310745 1329044
58326A329044J5227J6152J7749J4454R335Q028P825L673r09j01K826J668q48J215
$$ 1329044 1344271 1360423 1378172 1392626 1401961 1409989 1417814 1421487 1420578 1420477 1423303 1424971 1424123 1425338
58312A425338N151N000L200N302Q646P931O409R738J4410J4177J2029J3961J7016
$$ 1425338 1430489 1435489 1438689 1443991 1452637 1460568 1466977 1476715 1491125 1505302 1517331 1531292 1548308
58299A548308J5838J4443J8655K3498K1458J6659J7171J9995J7906J4401J7016
$$ 1548308 1564146 1578589 1597244 1620742 1642200 1658859 1676030 1696025 1713931 1728332 1745348
58288A745348K2175K1865J9160K1788K6579K5892K3150K6057L0723K8957K4878
$$ 1745348 1767523 1789388 1808548 1830336 1856915 1882807 1905957 1932014 1962737 1991694 2016572
58277B016572K7402L2694L1506K7512L0341L6554L6146L2026L4203M0255M0749
$$ 2016572 2043974 2076668 2108174 2135686 2166027 2202581 2238727 2270753 2304956 2345211 2385960
58266B385960L8318M2059M8723M9163M7407N3123O1497O1492N7681O1995P0275
$$ 2385960 2424278 2466337 2515060 2564223 2611630 2664753 2726250 2787742 2845423 2907418 2977693
58255B977693O9700O3311O3725O8624O6609O1414O5279P4039P4370P0055P4947
$$ 2977693 3047393 3110704 3174429 3243053 3309662 3371076 3436355 3510394 3584764 3654819 3729766
58244C729766Q5750Q8860Q8120R7481J12131J16409J14574J23267J39137J45617
$$ 3729766 3815516 3904376 3992496 4089977 4202108 4318517 4433091 4556358 4695495 4841112
58234D841112J46065J57183J75172J82690J84137J98340K21457K34206K40494
$$ 4841112 4987177 5144360 5319532 5502222 5686359 5884699 6106156 6340362 6580856
58225F580856K60237K89175L06494L17036L43337L81020M07027M26853M66262
$$ 6580856 6841093 7130268 7436762 7753798 8097135 8478155 8885182 9312035 9778297
58216I778297N21232N65965O05371O66740P44952Q12658Q79420R80250J110949
$$ 9778297 10299529 10865494 11470865 12137605 12882557 13695215 14574635 15554885 16665834
58207A6665834J239858J378045J567999J809343K073124K384163K805876L349698
$$ 16665834 17905692 19283737 20851736 22661079 24734203 27118366 29924242 33273940
58199C3273940L989387M753152N697311O804440Q035000R472697J1281785J3539855
$$ 33273940 37263327 42016479 47713790 54518230 62553230 72025927 83307712 96847567
58191I6847567J6285534J9710867K4088730K9518287L5948823M3200230N0162779
$$ 96847567 113133101 132843968 156932698 186450985 222399808 265600038 315762817
58184C15762817N3712626M9459450L5012690J2916604j0255357k8182439l8266315
$$ 315762817 369475443 418934893 453947583 466864187 456608830 428426391 390160076
58177C90160076m1472091m0028458l5962874l1073964k6915669k4209751k2588250
$$ 390160076 348687985 308659527 272696653 241622689 214707020 190497269 167909019
58170A67909019k1203219j9504786j7435759j5185241j2977715j0990113r291206
$$ 167909019 146705800 127201014 109765255 94580014 81602299 70612186 61320980
58163F1320980p845457o607834n574503m730806m024119l419688k924593k532634
$$ 61320980 53475523 46867689 41293186 36562380 32538261 29118573 26193980 23661346
58155B3661346k201614j905967j659067j465022j298017j145157j021766r29344
$$ 23661346 21459732 19553765 17894698 16429676 15131659 13986502 12964736 12035392
58147A2035392q43581p57057o89870o45506n98747n39436m87199m50819m12720
$$ 12035392 11191811 10434754 9744884 9099378 8500631 7961195 7473996 7023177 6610457
58138F610457l65873l27824l05275k80720k46902k20707k10647k02614j89194
$$ 6610457 6244584 5916760 5611485 5330765 5083863 4863156 4652509 4449895 4260701
58129D260701j82020j84013j79504j63098j49780j46033j38784j22898j12040
$$ 4260701 4078681 3894668 3715164 3552066 3402286 3256253 3117469 2994571 2882531
58120B882531j11876j09076r7288q8479q8297q5070p3596o5811o7393o6919n8454
$$ 2882531 2770655 2661579 2564291 2475812 2387515 2302445 2228849 2163038 2095645 2028726 1970272
58109A970272n2541n4609n4337m6585m1875m5782m8126m2758l8711m1781m3769
$$ 1970272 1917731 1863122 1808785 1762200 1720325 1674543 1626417 1583659 1544948 1503167 1459398
58098A459398l9633l7239m0703m1724l6426l3486l6802l7213l0163k4663k5989
$$ 1459398 1419765 1382526 1341823 1300099 1263673 1230187 1193385 1156172 1126009 1101346 1075357
58087A075357k6128k0183j5890j7917j8715j3945j1425j5661j8691j5354j2852
$$ 1075357 1049229 1029046 1013156 995239 976524 962579 951154 935493 916802 901448 888596
58076H88596j6179j8502j5201j3213j7176j9905j6022j1974j3327j4763j1740
$$ 888596 872417 853915 838714 825501 808325 788420 772398 760424 747097 732334 720594
58065G20594r729j2719j4564j0600o561p313q045m905l182o558r306p383o410
$$ 720594 710865 698146 683582 672982 666421 659108 651063 646158 642976 636418 627112 619729 613319
58052F13319j0426j3528j0997q135r717j0998p620m329n417o272k895k22k603
$$ 613319 602893 589365 578368 570233 560516 549518 541898 537569 532152 525880 522985 522763 520160
58039E20160n216l286r71k834n203m038k956n436p394n362l855o857j0038r054
$$ 520160 514944 511658 510687 507853 502650 498612 495656 490220 482826 477464 473609 466752 456714 447660
58025D47660p594r578j1286q952o365p359q266n473k896m438o328m487k241l291
$$ 447660 440066 430488 419202 410250 403885 396526 388260 382787 379891 375453 369125 364638 362397 359106
58011C59106m261j734M73j370l414j621M20j339l293j112J784O80j753j063O51
$$ 359106 354845 353111 353584 352214 348800 347179 347599 346260 342967 341855 343639 344319 342566 341503 342154
57996C42154k49j380N78K811J871O56K620M551K466o68n58M56j494m005l290j786
$$ 342154 341905 340525 341103 343914 345785 346441 349061 353612 356078 355410 354852 355308 353814 349809 346519 344733
57980C44733l301n343l905j341j988m153l828k306k910m033k564m44j013k423
$$ 344733 341432 336089 332184 330843 328855 324702 320874 318568 315658 311625 309061 308617 307604 305181
57966C05181j327N87J66q80M08K140J382K53J857L968L032P43L67L78j907m192
$$ 305181 303854 304441 304607 303727 304135 306275 307657 307910 309767 313735 316767 317510 317877 318255 316348 312156
57950C12156l193j096j654l368k874j519k137k869o67K368K620J670L059N587
$$ 312156 308963 307867 306213 302845 299971 298452 296315 293446 292779 295147 297767 299437 302496 308083
57936C08083O179O235Q664J1680J1950J1000J2123J3779J2361Q808O300M204L71
$$ 308083 314262 320497 329161 340841 352791 363791 375914 389693 402054 410862 417162 421366 421737
57923D21737l390m315m350o693r549r484q109q998j0809r967p645p432q421p201
$$ 421737 418347 414032 409682 402989 393440 383956 375847 366849 356040 346073 338428 330996 322575 315374
57909C15374m573l793m132k532K28J192J092K422L690J904j168j516J65L16n73
$$ 315374 310801 307008 302876 300344 300572 301764 302856 305278 308968 310872 309704 308188 308353 308669 308096
57894C08096O23L019L069J331J495L641M623M178M671N644M570K275J880L072
$$ 308096 308719 311738 314807 316138 317633 321274 325897 330075 334746 340390 344960 347235 349115 352187
57880C52187K888J314P26P43r56l615m520m159n018o393n729l940m024n470n440
$$ 352187 355075 356389 357115 357858 356902 353287 348767 344608 339590 333197 327468 323528 319504 314034 308594
57865C08594m274m415n069l557q47j07p56L73K932L906L609M993P727Q747Q173
$$ 308594 304320 299905 294836 291279 290432 290325 289569 289942 292874 296780 300389 305382 313109 321856 330029
57850C30029Q864J0533J0087P563O121O245N481L677L015L043J131k178l621k955
$$ 330029 338893 349426 359513 367076 373197 379442 384923 388600 391615 394658 395789 393611 389990 387035
57836C87035k978m108m181l453m353o268o117m078l387m344m038k199j738l045
$$ 387035 384057 379949 375768 372315 367962 361694 355577 351499 348112 343768 339730 337531 335793 332748
57822C32748l193j463l82p17m87M30j52k010k317q39l11j059l60K078K998R64
$$ 332748 329555 328092 327710 326993 326506 326936 326784 324774 322457 321618 321307 320248 319888 321966 324964 325928
57806C25928j833m002o525r133r777q711q577r606r142o598m484l794k868j518
$$ 325928 324095 320093 313568 304435 294658 285947 277370 267764 258622 252024 247540 243746 240878 239360
57792B39360j652l106l259j664o14n93L01J895J766K25N42L274N189M922M803
$$ 239360 237708 234602 231343 229679 229065 228472 228773 230668 232434 232659 233201 236475 241664 246586 251389
57777B51389N949O403N587N794P611Q437P142N873N714M942L094K359L302L496
$$ 251389 257338 263741 269328 275122 282733 291170 298312 304185 309899 314841 317935 320294 323596 327092
57763C27092K031J113J549J001j464l384l352l361m687n463m472l496l786l794
$$ 327092 329123 330236 331785 332786 331322 327938 324586 321225 316538 311075 306603 303107 299321 295527
57749B95527k548j727k352k763j823r30r60n11J074K080J624J344K311L270L422
$$ 295527 292979 291252 288900 286137 284314 283384 282424 281913 282987 285067 286691 288035 290346 293616 297038
57734B97038L772M384L569J264p4N83J266P06J98N34M88j90J66J661J945M27k90
$$ 297038 300810 305194 308763 310027 309953 310536 311802 312508 312706 313240 313728 313538 313704 315365 317310 317737 317447
57717C17447J246L146M038N452Q312J0601J0699R804R040P293M030J091l25j544
$$ 317447 318693 321839 325877 331329 339641 350242 360941 370745 379785 387078 391108 392199 391874 390330
57703C90330l416m394l538k388j989r35J648M164N469O843R121J0553R485O536
$$ 390330 386914 382520 378982 376594 374605 373670 375318 379482 384951 391794 400915 411468 420953 427489
57689D27489K554k839r036j3681j5793j6948j7890j7033j3887j0775r292p970
$$ 427489 430043 427204 418168 404487 388694 371746 353856 336823 322936 312161 302869 294899
57677B94899n302k123P72M422R234J3640J7018K1162K7171L3822M0728N0030O2880
$$ 294899 289597 287474 288246 292668 301902 315542 332560 353722 380893 414715 455443 505473 568353
57664E68353P6493Q5897Q5996P1817M1575J790l4650n8483o9804p2978p0361o3423
$$ 568353 644846 730743 816739 888556 930131 931921 897271 838788 768984 696006 625645 562222
57652E62222n5379m8614m2177l4859k8171k3654k0059j5944j2403j0538q917o239
$$ 562222 506843 458229 416052 381193 353022 329368 309309 293365 280962 270424 261507 255268
57640B55268l892l292l252k503k118k885l037j327L62J39p13m12J59l26q46l10
$$ 255268 251376 248084 244832 242329 240211 237326 234289 232962 233324 233463 232750 232338 232497 232171 231325 231015
57624B31015j04j453k703k122j047j340k121j939j857l285m897m777l686l307
$$ 231015 230911 229458 226755 224633 223586 222246 220125 218186 216329 213044 208147 203370 199684 196377
57610A96377l164k200j423k021k716j796q1P21Q65J242J147m9r48l63M01k6n12
$$ 196377 193213 191013 189590 187569 184853 183057 182976 183697 184562 185804 186951 186902 185954 185591 185992 185966 185454
57593A85454J75O15q49l026l929l895m045l764k443j586k328k973j811k34j93
$$ 185454 185629 186244 185395 182369 178440 174545 170500 166736 164293 162707 160379 157406 155595 155361 155168
57578A55168p45k14M96p6q12j68N49n27k123j911n46k20p98p41l86r35j632j253
$$ 155168 154423 154209 154705 154629 153817 153649 154198 153671 151548 149637 149091 148871 148073 147332 146946 146011 144379 143126
57560A43126q81k030l454l172k117k462l751m034l471l386l178j629L1o7q49r6
$$ 143126 142245 140215 136761 133589 131472 129010 125259 121225 117754 114368 111190 109561 109592 109525 108676 108580
57544A08580J340Q75j182k077j059J51Q50J945L486M604N482O609O774M708J845
$$ 108580 109920 110795 109613 107536 106477 106628 107478 109423 112909 117513 122995 129604 136378 141086 142931
57529A42931O14Q74R22Q53J753K734K136Q17Q47J773J569N37O87J888K186J532
$$ 142931 143545 144419 145341 146194 147947 150681 152817 153634 154481 156254 157823 158360 159047 160935 163121 164653
57513A64653J681K607K480J130L13N43O51M10O96J180O85l48m67M3l27j481k137
$$ 164653 166334 168941 171421 172551 172864 173407 174058 174468 175164 176344 177029 176681 176214 176257 175930 174449 172312
57496A72312k470l583m895m953m288m527n247m698l152k431k641k383j759k065
$$ 172312 169842 166259 161364 156411 152123 147596 142349 137651 134499 132068 129427 127044 125285 123220
57482A23220k943k970k556l145m068l535k139j968k656k027l64k41j967k972k103
$$ 123220 120277 117307 114751 111606 107538 104003 101864 99896 97240 95213 94849 94608 92641 89669 87566
57467H7566j011p52l58N90J064R13J184J723J247R8M7J114J463O83J94K16n78
$$ 87566 86555 85803 85445 86035 87099 88012 89196 90919 92166 92264 92311 93425 94888 95571 95765 95981 95403
57450I5403k069k458j467q12j025p82K16O32K19K37P13K98p51m86J219K109J250
$$ 95403 93334 90876 89409 88597 87572 86790 87006 87638 87857 88094 88807 89105 88354 87868 89087 91196 92446
57433I2446K93L48M60J06K86J239J641J052P14J086J029J95k03L25P77P33R08
$$ 92446 92739 93087 93547 93653 93939 95178 96819 97871 98585 99671 100700 100895 100692 101017 101794 102527 103435
57416A03435J206N93o98j219q38p74r97k87R76J030L8J64J798K763J942O94k5
$$ 103435 104641 105234 104536 103317 102479 101705 100708 100421 101397 102427 102465 102629 104427 107190 109132 109826 109801
57399A09801r90k324k701j947j637k203k145r78k13m95n52R9K52k72J40J761K567
$$ 109801 108811 106487 103786 101839 100202 97999 95854 94876 94663 94168 93616 93715 93967 93695 93835 95596 98163
57382I8163J665R29J758K796K389J090J92j09R2J071K200J965K28j445k286l026
$$ 98163 99828 100757 102515 105311 107700 108790 108982 108873 108965 110036 112236 114201 114429 112984 110698 107672
57366A07672l665l091j539q59j453j598o16j20j056k142k230j809j264j01J228
$$ 107672 104007 100916 99377 98518 97065 95467 94851 94731 93675 91533 89303 87494 86230 86129 87357
57351H7357J351N78Q39K235K602J367P04J737K705K336J930K497K784J902J133
$$ 87357 88708 89286 90125 92360 94962 96329 97033 98770 101475 103811 105741 108238 111022 112924 114057
57336A14057J401J504O17k4L80N84j91o66j22M1r25j391l11O54%j100j144q27
$$ 114057 115458 116962 117579 117555 117935 118519 118328 117662 117540 117581 116656 115265 114954 115608 115608 114508 113364 112537
57318A12537j165j394q07n99j738k969k897k192j894j482m72O2n62j061m12K75
$$ 112537 111372 109978 109171 108572 106834 103865 100968 98776 96882 95400 94928 94990 94428 93367 92955 93230
57302I3230k24j205j645j845j970j138M96R99k09r28L82K103K394K058K415K645
$$ 93230 93006 91801 90156 88311 86341 85203 85699 86698 86489 85561 85943 88046 90440 92498 94913 97558
57286I7558J729Q31J277K164K261K306L101L434K316J246J699K302J222m80o98
$$ 97558 99287 100118 101395 103559 105820 108126 111227 114661 116977 118223 119922 122224 123446 122966 122268
57271A22268J63L00k58k59J36k2l17O7L12o80k023k177j477j117q14J84R73K99
$$ 122268 122431 122731 122473 122214 122350 122328 122011 122078 122390 121710 119687 117510 116033 114916 114102 114286 115259 115558
57253A15558j001j241o30n06p09q0J078J380O82R1L7R2J85N19Q03Q40J106J645
$$ 115558 114557 113316 112686 112180 111471 111391 112469 113849 114531 114622 114659 114751 114936 115455 116258 117098 118204 119849
57235A19849J557O15M8N00Q75M75M46J532K331J666P58J061J742J473R43J326
$$ 119849 121406 122021 122069 122569 123444 123919 124365 125897 128228 129894 130652 131713 133455 134928 135871 137197
57219A37197J878J428P54J137J956K037J924K481K816K028J467K609M071L557
$$ 137197 139075 140503 141257 142394 144350 146387 148311 150792 153608 155636 157103 159712 163783 167340
57205A67340J644P96J636K820L728M610M838L616J852J070J147J225J761L442
$$ 167340 168984 169780 171416 174236 177964 182574 187412 191028 192880 193950 195097 196322 198083 201525
57191B01525N073N081M153M034M682N001N333O593Q012Q386Q592J0109J2056J2627
$$ 201525 206598 211679 215832 219866 224548 229549 234882 241475 249487 257873 266465 276574 288630 301257
57177C01257J2547J3908J6177J6700J4962J3208J2690J2390J1720J1647J2624
$$ 301257 313804 327712 343889 360589 375551 388759 401449 413839 425559 437206 449830
57166D49830J3811J4878J6449J8372J9562J9756J9721J9629J9075J8572J9040
$$ 449830 463641 478519 494968 513340 532902 552658 572379 592008 611083 629655 648695
57155F48695K0045K0403K0389K1281K2849K3490K2860K2348K2799K3653K4435
$$ 648695 668740 689143 709532 730813 753662 777152 800012 822360 845159 868812 893247
57144H93247K5340K6260K6909K7799K9558L1454L2268L2331L2868L3774L3930
$$ 893247 918587 944847 971756 999555 1029113 1060567 1092835 1125166 1158034 1191808 1225738
57133A225738L3524L3896L5114L5792L5525L5650L7247M0040M3547M7802N2626
$$ 1225738 1259262 1293158 1328272 1364064 1399589 1435239 1472486 1512526 1556073 1603875 1656501
57122A656501N7486O2268O7084P1449P4823P7788Q1442Q5879R0584R6039J03428
$$ 1656501 1713987 1776255 1843339 1914788 1989611 2067399 2148841 2234720 2325304 2421343 2524771
57111B524771J12917J23700J35933J51261J71254J96178K25238K57087K90565
$$ 2524771 2637688 2761388 2897321 3048582 3219836 3416014 3641252 3898339 4188904
57102D188904L26589L70087M29266N12262O24305P67307R40539J140411J360475
$$ 4188904 4515493 4885580 5314846 5827108 6451413 7218720 8159259 9299670 10660145
57093A0660145J594715J843675K116943K426670K777227L161512L564487L964767
$$ 10660145 12254860 14098535 16215478 18642148 21419375 24580887 28145374 32110141
57085C2110141M333363M637928M845996M906395M719236M152694L137816J769589
$$ 32110141 36443504 41081432 45927428 50833823 55553059 59705753 62843569 64613158
57077F4613158K97859j006986j993345k656609l069697l311717l444340l511736
$$ 64613158 64911017 63904031 61910686 59254077 56184380 52872663 49428323 45916587
57069D5916587l537565l526104l473592l376592l231594l037187k801324k541108
$$ 45916587 42379022 38852918 35379326 32002734 28771140 25733953 22932629 20391521
57061B0391521k272980k007680j754603j523498j319171j140091r84418q52584
$$ 20391521 18118541 16110861 14356258 12832760 11513589 10373498 9389080 8536496
57053H536496p42759o49655n70131n05077m53810m11402l73588l39859l10029
$$ 8536496 7793737 7144082 6573951 6068874 5615064 5203662 4830074 4490215 4180186
57044D180186k82360k56880k35962k19565k04129j87908j72995j60362j47572
$$ 4180186 3897826 3640946 3404984 3185419 2981290 2793382 2620387 2460025 2312453
57035B312453j33601j21237j12171j03911r4214q4467p6058o7361n7074m6744
$$ 2312453 2178852 2057615 1945444 1841533 1747319 1662852 1586794 1519433 1462359 1415615
57025A415615l7220k6290j2679J493J5365L1999N1578O4838N8922K9997j2603
$$ 1415615 1378395 1352105 1339426 1340919 1356284 1388283 1439861 1504699 1563621 1593618 1581015
57014A581015n3889q2854r6598r8851r5340q9386q1481p2178o3081n4824m6712
$$ 1581015 1527126 1444272 1347674 1248823 1153483 1064097 982616 910438 847357 792533 745821
57003G45821l9145l3831l0686k7295k2589j8359j5896j3933j1377r343q759q513
$$ 745821 706676 672845 642159 614864 592275 573916 558020 544087 532710 523367 514608 506095
56991E06095p589o749o489n734l953k289j144R82M825Q771J1091J1336Q692K025
$$ 506095 498506 491757 485268 479534 475581 473292 472148 473130 477955 486726 497817 509153 517845 519870
56977E19870p116j4508j7966j9344k0475k0303j7853j4789j2805j1113q681o383
$$ 519870 512754 498246 480280 460936 440461 420158 402305 387516 374711 363598 354917 348534
56965C48534m804k555J124M578O626Q679J1973J5446J8448K2641K8331L1531K7871
$$ 348534 343730 341175 342299 346877 353503 362182 374155 389601 408049 430690 459021 490552 518423
56952E18423J7750N078p167j7540k4344k6523k5463k3545k1559j9119j6322j3372
$$ 518423 536173 541251 534084 516544 492200 465677 440214 416669 395110 375991 359669 346297
56940C46297r832n819k523k84K310O206J0581J4873K0072K6694L3360L8343M0362
$$ 346297 336465 330646 328123 327839 330149 336355 346936 361809 381881 408575 441935 480278 520640
56927E20640L7093K6102Q957q366k1016k8835l3232l3959l1231k7784k5896k4599
$$ 520640 557733 583835 592792 584426 563410 534575 501343 467384 436153 408369 382473 357874
56915C57874k2270j9558j7484j5125j1839r363r092r476q591p122o331n400l460
$$ 357874 335604 316046 298562 283437 271598 262235 253143 243667 235076 227954 221623 216223 212763
56902B12763j944k204k876k251j188r47m87J345L091L157K928M376O609P972R560
$$ 212763 210819 208615 205739 203488 202300 201353 200866 202211 205302 208459 211387 215763 222372 230344 239904
56887B39904J3366J8560K2872K6032K8441K7978K1908J1297M25p730j2894j5421
$$ 239904 253270 271830 294702 320734 349175 377153 399061 410358 410783 403053 390159 374738
56875C74738j5638j4622j3172j0676o830l185r68J180N055R996J4454J8825K4278
$$ 374738 359100 344478 331306 320630 313800 310615 309647 310827 315882 325878 340332 359157 383435
56862C83435L0417L6659M4307N4380O4431O9922O7553N5735L4361P051j8547l6111
$$ 383435 413852 450511 494818 549198 613629 683551 751104 806839 841200 848251 829704 793593
56850G93593m5341m9134m8519m3427l6073k9381k3234j5816p543k46O379J4059
$$ 793593 748252 699118 650599 607172 571099 541718 518484 502668 495125 494879 501258 515317
56838E15317K2766L1555M1472N4330O9506Q5091J00427J13417J16603J01099O5660
$$ 515317 538083 569638 611110 665440 734946 820037 920464 1033881 1150484 1251583 1317243
56827A317243J9064k6525o2229q4015r2361r1497q6247p8566o8466n7151m6646
$$ 1317243 1336307 1309782 1247553 1163538 1071177 979680 893433 814867 746401 689250 642604
56816F42604l7119k7416j7786r306j163Q634K0201L1978M3669N6307O9514Q0500
$$ 642604 605485 578069 560283 550977 549814 558448 578649 610627 654296 710603 780117 860617
56804H60617Q5064P8185N6039K0862j7389m7708o6028p4711p6425p2453o5308
$$ 860617 945681 1023866 1079905 1100767 1083378 1035670 969642 894931 818506 746053 680745
56793F80745n8180n1533m3800l5302k8117k2301j5834q239j008N524J2501J9912
$$ 680745 622565 571032 527232 491930 463813 441512 425678 417439 416431 421955 434456 454368
56781D54368K6776L3608M1150M6555M4435L2509J3761o869k5213l7884m3304m3427
$$ 454368 481144 514752 555902 602457 646892 679401 693162 686293 661080 623196 579892 536465
56769E36465m1815l9748l6426l2295k8971k6299k2786j8851j6431j5422j3808
$$ 536465 494650 454902 418476 386181 357210 330911 308125 289274 272843 257421 243613
56758B43613j1296r574q906p800o202n641n981n346l647k873l448l533k511j941
$$ 243613 232317 222743 213837 206037 199835 194194 188213 182867 179220 176347 172899 169366 166855 164914
56744A64914k409k537j830j569k124k187j396r67j157p58L05N94j29m13J82N02
$$ 164914 162505 159968 158138 156569 154445 152258 150862 149895 148738 147980 148285 148879 148750 148337 148519 149021
56728A49021L15O87J476J198j30o92N7P07O61R22J654J662Q60O81J484K022J916
$$ 149021 149336 150023 151499 152697 152567 151875 151932 152639 153300 154222 155876 157538 158398 159079 160563 162585 164501
56711A64501K118K574J996M12n19j60M83R22J630K221J756P97O78R54K36p90k70
$$ 164501 166619 169193 171189 171601 171082 170922 171405 172327 173957 176178 177934 178731 179409 180363 180599 179809 179539
56694A79539J185J116n28j215r8Q98P42O36J155J268Q59J152J999J782N26O2P14
$$ 179539 180724 181840 181312 180097 179999 180897 181639 182275 183430 184698 185557 186709 188708 190490 191016 191078 191792
56677A91792Q54J99L15J337J478M16p4N16O19k13n21R4L65K73J290L152L731K708
$$ 191792 192646 192845 193160 194497 195975 196391 196317 196833 197452 197239 196718 196812 197177 197450 198740 201892 205623 208331
56659B08331K034K263J926J075J655L553M182K925K268L354M165L397K440K115
$$ 208331 210365 212628 214554 215629 217284 220837 225019 227944 230212 233566 237731 241128 243568 245683
56645B45683J109r26k204k192k720m321m923l623k317k136j734o74q49k816m164
$$ 245683 246792 245866 243662 241470 238750 234429 229506 225883 223566 221430 219696 219022 218173 215357 211193
56630B11193l418k276k212k199j580j831l472m392l350k118k251k667k269k020
$$ 211193 207775 205499 203287 201088 199508 197677 194205 189813 186463 184345 182094 179427 177158 175138
56616A75138k556k620j635j040j393j081M95J456P68M4M61R23Q14J370K702K796
$$ 175138 172582 169962 168327 167287 165894 164813 165308 166764 167532 167576 168037 168960 169774 171144 173846 176642
56600A76642J130L0O59J080J03l95R21K320K180J550J471R99j48k20J187J722
$$ 176642 177772 177802 178461 179541 179644 179249 180170 182490 184670 186220 187691 188690 188542 188322 189509 191231
56584A91231K23j150p68j16m82n80L64O62l99p47O03J397L52k89R79J900O10p76
$$ 191231 191454 190304 189536 189420 188938 188358 188722 189384 188985 188238 188841 190238 190590 190301 191280 193180 193790 193014
56566A93014J24J972K653L007M484O088O789Q061J0955J3557J4172J4041J3978
$$ 193014 193138 195110 197763 200770 205254 211342 218131 226192 237147 250704 264876 278917 292895
56553B92895J1676N668j037m746n760o159n839m193k888l435m302l710k834l267
$$ 292895 304571 310239 309202 304456 298696 292537 286698 282505 279617 276182 271880 268170 265336 262069
56539B62069l894l328k783l412l582j884j34k10p49j34J88j232k480j575k07n87
$$ 262069 258175 254847 252064 248652 245070 243186 243052 242842 242093 241959 242147 240915 238435 236860 236653 236066
56523B36066j321k37J345J084j01l3O54K20o98p80r70k272l067k087j446l067
$$ 236066 234745 234508 235853 236937 236836 236803 237457 237677 236979 236199 235229 232957 229890 227803 226357 223290
56507B23290m762l758j526j082j890j614o33p03j120k89Q44P00M05J456K301J023
$$ 223290 218528 214770 213244 212162 210272 208658 208025 207322 206202 205913 206757 207457 207862 209318 211619 212642
56491B12642q34r01k29r18j969j458n22r88j483r7J476Q87k22R01K890K738J279
$$ 212642 211808 210907 210678 209760 207791 206333 205811 204823 203340 203243 204719 205606 205384 206285 209175 211913 213192
56474B13192J292K100J158o41m53J143J221k31q68o72j343k211j328L45M09m41
$$ 213192 214484 216584 217742 217101 216648 217791 219012 218781 217913 217241 215898 213687 212359 212704 213113 212672
56458B12672K65K025K416J731K143L278L075J963J853K089P98q97m71J260J462
$$ 212672 212937 214962 217378 219109 221252 224530 227605 229568 231421 233510 234308 233411 232940 234200 235662
56443B35662K87J77J179J342P77J016J409L52r97n05P32J77j545k096j932k863
$$ 235662 235949 236126 237305 238647 239424 240440 241849 242201 241204 240699 241431 241608 240063 237967 236035 233172
56427B33172l817k708r04j021j910q74Q42J08k054k038J8J095J249L008N693O102
$$ 233172 229355 226647 225743 224722 222812 221938 222780 222888 220834 218796 218814 219909 221158 224166 229859 235961
56411B35961M320L362L599K905J583J648J976j58l384l843j866j237k369k253
$$ 235961 240281 243643 247242 250147 251730 253378 255354 255196 251812 247969 246103 244866 242497 240244
56397B40244q32j140l095l331j489p03j356l91K628M553M369M379N085M413K562
$$ 240244 239412 238272 235177 231846 230357 229654 228298 227907 230535 235088 239457 243836 248921 253334 255896
56382B55896K158L076K502N55K37J514J222o75p35J354J860k80j692p17L20K43
$$ 255896 258054 261130 263632 264187 264424 265938 267160 266485 265750 267104 268964 268684 266992 266275 266595 266838
56366B66838Q77K470K635J231J093K716L320K216J901K879K658R22L84J470J517
$$ 266838 267715 270185 272820 274051 275144 277860 281180 283396 285297 288176 290834 291756 292140 293610 295127
56351B95127J91K84K088K490P68j49P18J030K65O41J964J328j018j419N18J107
$$ 295127 295318 295602 297690 300180 300948 300799 301517 302547 302812 303453 305417 306745 305727 304308 304826 305933
56335C05933m42n34J861L176J966J346K775L516K399K079L393L470J621J063K661
$$ 305933 305491 304957 306818 309994 311960 313306 316081 319597 321996 324075 327468 330938 332559 333622 336283
56320C36283K988R87K43K162L109J163m41M55J236J61j81J687K880J621N63J501
$$ 336283 339271 340258 340501 342663 345772 346935 346494 346949 348185 348346 348165 349852 352732 354353 354916 356417
56304C56417K206J534K166N094O972O289O599J0002J2892J1955R132O920L956
$$ 356417 358623 360157 362323 367417 374389 380678 387277 397279 410171 422126 431258 438178 442134
56291D42134o94l899l336j568j320j017J260L641M048L894M762N270M478M421
$$ 442134 441440 437541 434205 432637 431317 430300 431560 435201 439249 443143 447905 453175 457653 462074
56277D62074O194P495O912O548P748Q545P994Q470J0967J2718J2314J2403J4531
$$ 462074 468268 475763 482675 489223 496971 505516 513510 521980 532947 545665 557979 570382 584913
56264E84913J6165J5808J6148J8983K1784K2542K3329K6006K8936L1067L4664
$$ 584913 601078 616886 633034 652017 673801 696343 719672 745678 774614 805681 840345
56253H40345M0887M7223N2181N7991O6011P4139Q1343Q9742R9725J08226J14307
$$ 840345 881232 928455 980636 1038627 1104638 1178777 1260120 1349862 1449587 1557813 1672120
56242A672120J20994J29050J34578J35534J34601J32741J26199J13211R7458Q1463
$$ 1672120 1793114 1922164 2056742 2192276 2326877 2459618 2585817 2699028 2796486 2877949
56232B877949O2672L9806J6739l740k3927m5016o3198p5974q6371r6721j04263
$$ 2877949 2940621 2980427 2997166 2993426 2969499 2924483 2861285 2785311 2698940 2602219 2497956
56221B497956j07034j07940j08919j07293j02121r7706r6348r4094q8147q1950
$$ 2497956 2390922 2282982 2174063 2066770 1964649 1866943 1770595 1676501 1588354 1506404
56211A506404p8221p3853o6728o0696n8363n5745m9762m4341m3070m2377l8204
$$ 1506404 1428183 1354330 1287602 1226906 1168543 1112798 1063036 1018695 975625 933248 895044
56200H95044l3183l0844k8796k4211k0099j9582j9520j6333j2683j1995j1865
$$ 895044 861861 831017 802221 778010 757911 738329 718809 702476 689793 677798 665933
56189F65933r265o792p326p950n524k893l209l704j438M22j362l489k195k56j314
$$ 665933 656668 649876 642550 634600 629076 626183 622974 619270 617832 618254 616892 613403 611208 610952 609638
56174F09638k864j627j82j378k014R25L654K336N21K501N195M338K840N062Q309
$$ 609638 606774 605147 604965 603587 601573 602498 606152 608488 609009 611510 616705 621043 623883 628945 637254
56159F37254Q174O891Q371J0201Q794P208R657J3278J3573J2962J5820K0025K1633
$$ 637254 645428 652319 660690 670891 679685 686893 696550 709828 723401 736363 752183 772208 793841
56146G93841K2869K7318L2264L4181L6679M4659N5488O4269P2693Q4415R6855
$$ 793841 816710 844028 876292 910473 947152 991811 1047299 1111568 1184261 1268676 1365531
56135A365531J06014J13918J22629J26489J19404J04816Q9889P5488O0701N0874
$$ 1365531 1471545 1585463 1708092 1834581 1953985 2058801 2148690 2224178 2284879 2335753
56125B335753N0975N5942N7185N3649M7763L6843J8714j2j1646j8383k6146l3931
$$ 2335753 2386728 2442670 2499855 2553504 2601267 2638110 2656824 2656812 2645166 2626783 2600637 2566706
56113B566706l9450m8494o6977q9294j05928j16988j26946j32222j26642j13998
$$ 2566706 2527256 2478762 2411785 2322491 2216563 2099575 1972629 1840407 1713765 1599767
56103A599767j02694r2490p8606o3889n4476m8037l8690k8994k4752k2822j6722
$$ 1599767 1497073 1404583 1325977 1262088 1207612 1159575 1120885 1091891 1067139 1044317 1027595
56092A027595r494q111r845p335k459j918l611r77L648L592J358L771Q200P501
$$ 1027595 1018101 1009990 1000145 992810 990351 988433 984822 983845 987493 991085 992443 996214 1004414 1011915
56078A011915M271N914R979Q892N005O178J0587J0670Q088R796J3468J2087Q784
$$ 1011915 1016186 1022100 1032079 1040971 1045976 1052154 1062741 1073411 1081499 1091295 1104763 1116850 1125634
56065A125634J1503J7187J7048J3333J4652J8974J7903J3734J5209K0270K0076
$$ 1125634 1137137 1154324 1171372 1184705 1199357 1218331 1236234 1249968 1265177 1285447 1305523
56054A305523J6292J7059J9903J6476J0141J0644J5379J4528J0513J3049J9184
$$ 1305523 1321815 1338874 1358777 1375253 1385394 1396038 1411417 1425945 1436458 1449507 1468691
56043A468691J8454J3830J6695K4518K5061J9662K0471K7081K8071K3708K4724
$$ 1468691 1487145 1500975 1517670 1542188 1567249 1586911 1607382 1634463 1662534 1686242 1710966
56032A710966L0371L0136K5586K7884L5332L6250L2255L5293M3507M4261L9176
$$ 1710966 1741337 1771473 1797059 1824943 1860275 1896525 1928780 1964073 2007580 2051841 2091017
56021B091017M1299M9143M9150M2474M3137N0807N2150M8065N1987O2210O4137
$$ 2091017 2132316 2181459 2230609 2273083 2316220 2367027 2419177 2467242 2519229 2581439 2645576
56010B645576N9332O3286P5027P8708P4749P8611Q9260R0895Q5645R1313J06441
$$ 2645576 2704908 2768194 2843221 2921929 2996678 3075289 3164549 3255444 3341089 3432402 3538843
55999C538843J11993J08244J14402J30675J37717J35255J43046J61334J69758
$$ 3538843 3650836 3759080 3873482 4004157 4141874 4277129 4420175 4581509 4751267
55990D751267J68120J77624J98750K10011K11670K26780K55319K73177K80410
$$ 4751267 4919387 5097011 5295761 5505772 5717442 5944222 6199541 6472718 6753128
55981F753128L02560L39852L65725L80610M13786M66313N08378N39529N91870
$$ 6753128 7055688 7395540 7761265 8141875 8555661 9021974 9530352 10069881 10661751
55972A0661751O66489P30495P85562Q71607R92817J112455J232118J398605J620083
$$ 10661751 11328240 12058735 12844297 13715904 14708721 15821176 17053294 18451899 20071982
55963B0071982J860289K131001K499805K989683L568443M251840N105199O127642
$$ 20071982 21932271 24063272 26563077 29552760 33121203 37373043 42478242 48605884
55955D8605884P267487Q579301J0223123J2287460J4791593J7894364K1882575
$$ 48605884 55873371 64452672 74675795 86963255 101754848 119649212 141531787
55948A41531787K6902104L2922821L9840767M6864949N1358440M9084571L7028298
$$ 141531787 168433891 201356712 241197479 288062428 339420868 388505439 425533737
55941D25533737J6593024o437046k5588711l7477746m2435751m2554193l9846473
$$ 425533737 442126761 435689715 410101004 372623258 330187507 287633314 247786841
55934B47786841l5764073l1307178k7014924k3032137j9400396j6219675j3534466
$$ 247786841 212022768 180715590 153700666 130668529 111268133 95048458 81513992
55927H1513992j1266404r343198p769001o521440n502124m639039l937148l389360
$$ 81513992 70247588 60904390 53135389 46613949 41111825 36472786 32535638 29146278
55919B9146278k931956k524652k189022j932768j712473j501942j325573j194429
$$ 29146278 26214322 23689670 21500648 19567880 17855407 16353465 15027892 13833463
55911A3833463j075192r49758q43841p70130p00703o20584n54150n14258m76312
$$ 13833463 12758271 11808513 10964672 10194542 9493839 8873255 8319105 7804847 7328535
55902G328535m26072l84923l64906l44250l09612k79887k66825k52443k25995
$$ 7328535 6902463 6517540 6152634 5808384 5498772 5218885 4952060 4699617 4473622
55893D473622k04762j98405j89308j67512j50093j47378j43304j27422j14199
$$ 4473622 4268860 4070455 3881147 3713635 3563542 3416164 3272860 3145438 3031239
55884C031239j13010j09775r5544q3858q3117p9906o5805n3548n1377m8127l8539
$$ 3031239 2918229 2808454 2712910 2629052 2545935 2466029 2400224 2346676 2295299 2247172 2208633
55873B208633l6842m9860o1985o1990o0493o6276o9440o2916n7438o0229o0713
$$ 2208633 2171791 2121931 2059946 1997956 1937463 1871187 1801747 1738831 1681393 1621164 1560451
55862A560451n1832m4097m4564m3010l3029k6201l1005l7303l5674l3209l6428
$$ 1560451 1508619 1464522 1419958 1376948 1343919 1317718 1286713 1249410 1213736 1180527 1144099
55851A144099l7327l0245k4694k7623l0149k5083k0737k4238k7671k3909k0112
$$ 1144099 1106772 1076527 1051833 1024210 994061 968978 948241 924003 896332 872423 852311
55840H52311k2548k3672j7306j1500j3413j5997j2294q651j1192j3248q784m770
$$ 852311 829763 806091 788785 777285 763872 747875 735581 726930 715738 702490 693706 688936
55828F88936p720j1030q009m740p662j0856p948m684p538j1244r592p472j0494
$$ 688936 681216 670186 662177 657437 649775 638919 630971 626287 618749 607505 597913 590441 579947
55815E79947j3456j0746p635r855j2220q832m563n302o609l065P37n55k216J387
$$ 579947 566491 555745 548110 538255 526035 517203 512640 507338 500729 497664 498401 497846 495630 497017
55801D97017N889N732M925Q515J2129J0373P219P731P950L164k070k405k017o292
$$ 497017 502906 508638 513563 522078 534207 544580 551799 559530 567480 570644 568574 566169 564152 557860
55787E57860j1185j1051r292j0958j2282p920j638L76M5J590K072k286o856n553
$$ 557860 546675 535624 526332 515374 503092 495172 493534 493910 493955 495545 497617 495331 488475 482922
55773D82922j009J612M762J3131K4086L2617L9664M6294M5816L1785R058j2112
$$ 482922 481913 483525 488287 501418 525504 558121 597785 644079 689895 721680 730738 718626
55761G18626k8072l9718m4650m0981l4120l0465k8460k3875j8876j7580j7588
$$ 718626 690554 650836 606186 565205 531085 500620 472160 448285 429409 411829 394241
55750C94241j4614j0914j0668j1582r422o432o901q670p284m481m379n241k987
$$ 394241 379627 368713 358045 346463 337041 330609 323708 315038 307754 303273 298894 293653 290666
55737B90666Q90K543K973M616M881O76m602o041n272o379q031p095n721p278r176
$$ 290666 291556 294099 297072 301688 306569 307245 302643 296602 291330 284951 276920 269825 264104 256826 247650
55722B47650p421m351m252n239l208K9L74m87J495M693N096M398O962J1574J3744
$$ 247650 240229 235878 231626 226387 223179 223208 223582 223095 224590 229283 234379 238777 245739 257313 271057
55707B71057J3455J3384J2267P443J290k015l552o745j0312j0966j0131j1075
$$ 271057 284512 297896 310163 317606 318896 316881 313329 306584 296272 285306 275175 264100
55695B64100j2297j0650p980p750q115n489j918j628l158k237L22Q45J59J340
$$ 264100 251803 241153 233173 225423 217308 211819 209901 208273 205115 202878 203200 204045 204204 205544
55681B05544K878J596j39K130O656Q142O561N751N405K366j801k487k12L64j417
$$ 205544 208422 210018 209879 212009 218665 226807 233368 239119 244524 246890 245089 242602 242390 242754 241337
55666B41337k119j263j507k609j975l05l29j071L71K638K188Q0J42J860J774N02
$$ 241337 239218 237955 236448 233839 231864 231559 231230 230159 230530 233168 235356 235436 235578 237438 239212 239714
55650B39714J470L804L549J035J71J122N09j737k449j627k145l626l094j349k154
$$ 239714 241184 244988 248537 249572 249743 250865 251374 249637 247188 245561 243416 239790 236696 235347 233193
55635B33193n355p175o983p493q619p576m904m080n098m596k321j334j882j145
$$ 233193 227838 220663 213680 206187 197568 189992 185088 181008 175910 171314 168993 167659 165777 164632
55621A64632Q98J284j19m98K97j57j343m25J689J124j977l388k064j341k355k399
$$ 164632 165530 166814 166695 166197 166494 166337 164994 164569 166258 167382 165405 162017 159953 158612 156257 153858
55605A53858o84J31q31j310o91r91k295k301r97q30j765j290M02M00j349j818
$$ 153858 153174 153305 152474 151164 150473 149482 147187 144886 143889 143059 141294 140004 140406 140806 139457 137639
55589A37639n95m35j704j650J29Q90J14M42K446L630L414M021N779O561O538Q277
$$ 137639 137044 136609 134905 133255 133384 134274 134388 134830 137276 140906 144320 148341 154120 160681 167219 175496
55573A75496J1446J2861J2470J3829J7696K0714K1596K2963K5461K5628K1577
$$ 175496 186942 199803 212273 226102 243798 264512 286108 309071 334532 360160 381737
55562C81737J5735J0097L604l818r405j1953j3803j6454j8274j8326j8394j9393
$$ 381737 397472 407569 411173 407355 397950 385997 372194 355740 337466 319140 300746 281353
55550B81353j9554j7884j5826j4157j1841r015p463p077n710l418k779m118m586
$$ 281353 261799 243915 228089 213932 202091 193076 185613 178536 172826 169408 166629 162511 157925
55537A57925l021j569j378q82M40P44m87j378j371k033l258k887j052n85j992
$$ 157925 154904 153335 151957 151075 151515 152259 151772 150394 149023 146990 143732 140845 139793 139208 137216
55522A37216k456j032k87j445k367j967k098l370l485j644m26j258k115j601j379
$$ 137216 134760 133728 133441 131996 129629 127662 125564 122194 118709 117065 116639 115381 113266 111665 110286
55507A10286k575l554l255l075l574k994p82J014J522K538M610N531M391L324
$$ 110286 107711 104157 100902 97827 94253 91259 90477 91491 93013 95551 100161 105692 110083 113407
55493A13407L423K839P94m67K19P12m37j480j121r63k076k722j783j034j661j957
$$ 113407 116830 119669 120463 119996 120215 120927 120490 119010 117889 116926 114850 112128 110345 109311 107650 105693
55477A05693o55P02R87J760M038N977N984N111M266K342q08k803k413j698k248
$$ 105693 105038 105740 106727 108487 112525 118502 124486 129597 133863 136205 135397 132594 130181 128483 126235
55462A26235k511j209j02p53j558p18N98O16l2j47l58j362k076j664j120j029
$$ 126235 123724 122515 122413 121660 120102 119384 119982 120598 120566 120419 120061 118699 116623 114959 113839 112810
55446A12810k24J479J988L33j292j002o3k19p73n15j07l78m82K74R34Q22P55R43
$$ 112810 112586 114065 116053 116386 115094 114092 114029 113810 113037 112522 112415 112037 111555 111829 112763 113585 114340 115283
55428A15283K57j097j013R49K402K032J447J641J072q00j596J7J750J497N94P94
$$ 115283 115540 114443 113430 114379 116781 118813 120260 121901 122973 122173 120577 120594 122344 123841 124435 125229
55412A25229J175O96P49K318L426K279L80k42l44j284k123j747j459k610l861
$$ 125229 126404 127100 127849 130167 133593 135872 136252 136010 135666 134382 132259 130512 129053 126443 122582
55397A22582l571k702k689k624j312L2j26q18m94J70q7n81k26K92J76L58J458
$$ 122582 119011 116309 113620 110996 109684 109716 109590 108772 108278 108448 108361 107780 107554 107846 108022 108380 109838
55380A09838J988R00k80r7K68n59j510j339j158k099k763j735m27o00j229n84
$$ 109838 111826 112726 112446 112349 112617 112058 110548 109209 108051 105952 103189 101454 101027 100427 99198 98614
55364I8614N47N87J61N27R27L28r3R41K054J412%k05M01L40N1O73J358O87n37
$$ 98614 99161 99748 99909 100436 101363 101691 101598 102539 104593 106005 106005 105800 106201 106541 106592 107265 108623 109310 108773
55345A08773o71p6o2l80k62m47j623k342j098R13J642J304J237J275P58N53J387
$$ 108773 108102 108026 107964 107584 107322 106875 105252 102910 101812 102725 104367 105671 106908 108183 108941 109494 110881
55328A10881J821N28j010p42N06O38j65l34O0j00n28l49j36o61r37K8J071Q58
$$ 110881 112702 113230 112220 111478 111984 112622 112457 112123 112183 112083 111555 111206 111070 110409 109472 109500 110571 111429
55310A11429M22J071J593L61j408j548n82m46r73p23j8p7l06N25J593J379N39
$$ 111429 111851 112922 114515 114876 113468 111920 111338 110892 109919 109196 109178 109101 108795 109320 110913 112292 112831
55293A12831N81R20K88l90M64J873J924J249J684K620K180R09P46J263N07j173
$$ 112831 113412 114332 114620 114230 114694 116567 118491 119740 121424 124044 126224 127133 127879 129142 129649 128476
55277A28476j729j201j304j794q86R50J296j54j302j440j952l012k930j319J19
$$ 128476 126747 125546 124242 122448 121562 122512 123808 123654 122352 120912 118960 115948 113018 111699 111818
55262A11818M89O54R43N41l75m21N61J075L83o40j200j323r00J11P64K43n42l13
$$ 111818 112307 112961 113904 114445 114070 113649 114210 115285 115668 115028 113828 112505 111605 111716 112480 112723 112181 111868
55244A11868L48J53l49J63J052O23q52j614j445j502j747j141o6J38l51l41j20
$$ 111868 112216 112369 112020 112183 113235 113858 113006 111392 109947 108445 106698 105557 105491 105629 105278 104937 104817
55227A04817p90j613q98Q47J548J000Q56J341J082Q0j26N78O34k09m93J82N79
$$ 104817 104027 102414 101516 102363 103911 104911 105767 107108 108190 108270 108144 108722 109356 109147 108654 108836 109415
55210A09415L38M79J138J207N19J16J43k37q12n02N13R93Q25P60M28r42k281j894
$$ 109415 109753 110232 111370 112577 113096 113212 113355 113118 112306 111804 112317 113310 114135 114895 115323 114381 112100 110206
55192A10206m13J39j55L60J322P62j057j669o09k3o92q20L71J216P48K25M14K36
$$ 110206 109793 109932 109777 110137 111459 112221 111164 109495 108886 108863 108171 107351 107722 108938 109686 109911 110325 110561
55174A10561p88j323o41J79L99O13Q67K91p04m36J071J728Q49K36Q68J287N58
$$ 110561 109773 108450 107809 107988 108387 109000 109867 110158 109454 109018 110089 111817 112666 112902 113770 115057 115615
55157A15615J22J113K227J945Q24M3n06j213j491r15k34j01j32n6l53j012j155
$$ 115615 115737 116850 119077 121022 121846 121889 121383 120170 118679 117764 117530 117429 117297 117241 116888 115876 114721
55140A14721o15l99r74j500j309o19L61J535K033J055l59m06O16P46k60n73L67
$$ 114721 114106 113707 112733 111233 109924 109305 109666 111201 113234 114289 113930 113524 114140 114886 114626 114053 114420
55123A14420Q59k5r86r99q56j170j068m1R13R80O10J86n28j058l78J062J532P88
$$ 114420 115279 115254 114268 113269 112413 111243 110175 110134 111047 112027 112637 112823 112295 111237 110859 111921 113453 114241
55105A14241M01R26J167P91J028J986J980N44n19k10J78k04j94Q07J308L85n80
$$ 114241 114642 115568 116735 117526 118554 120540 122520 123064 122545 122335 122513 122309 122115 122922 124230 124615 124035
55088A24035l80M0k50l51M29R37L57o1O56J239M38o73o55j45l17o21j29L76k08
$$ 124035 123655 123695 123445 123094 123523 124460 124817 124756 125412 126651 127089 126416 125761 125616 125299 124678 124549 124925 124717
55069A24717j102q74K06Q38P73N40R0p05j164p97k83k15j3P32J083L35n33m33
$$ 124717 123615 122741 122947 123785 124558 125098 125188 124483 123319 122522 122239 122024 122011 122743 123826 124161 123628 123195
55051A23195Qk95q97o86J91P09N45J9p79j672j956j362o91n92n42Q8R04J189R37
$$ 123195 123203 122908 122011 121325 121516 122225 122770 122789 122010 120338 118382 117020 116329 115737 115195 115283 116187 117376 118313
55032A18313M51j31m21jN68K39o56n67P23J550J005K65M52R81J108J296J826J901
$$ 118313 118764 118633 118212 118211 118779 119018 118362 117795 118518 120068 121073 121338 121790 122771 123879 125175 127001 128902
55014A28902J256R97J621J887R50j21k62q5l50m18K27O54J62k69K17O86J44o41
$$ 128902 130158 131155 132776 134663 135613 135492 135230 135145 134795 134377 134604 135258 135420 135151 135368 136054 136198 135557
54996A35557o29l06l81k24O83J231M44o19n45J47K60J72Q11J577J330M85J88J78
$$ 135557 134928 134622 134241 134017 134700 135931 136375 135756 135211 135358 135618 135790 136601 138178 139508 139993 140181 140359
54978A40359n32j549j508k22J171J763J402K08j169j580p58O5n3m23j77J62j50
$$ 140359 139827 138278 136770 136548 137719 139482 140884 141092 139923 138343 137585 137650 137597 137174 136997 137159 137009
54961A37009n41k35K47R7l52n12p38j257j200j49O20J03n39J97J612K005J332
$$ 137009 136468 136233 136480 136577 136225 135713 134975 133718 132518 132369 132989 133092 132553 132750 134362 136367 137699
54944A37699P29K94o50j705j829j101m39N7Q90J800K071J745J304P11k3j75N84
$$ 137699 138428 138722 138072 136367 134538 133437 132998 133055 133945 135745 137816 139561 140865 141576 141553 141378 141962
54927A41962J313J290J340K281L168K804J939K210L603M808N430O127P062P725
$$ 141962 143275 144565 145905 148186 151354 154158 156097 158307 161910 166718 172148 178275 185337 193062
54913A93062P869P344N641K829J72j460k824m712o273o490o102o278o449n395
$$ 193062 200931 208275 213916 216745 216917 215457 212633 207921 201648 195158 189056 182778 176329 170934
54899A70934l626k664k644k512k046j816j672j055l55l06n62l91j50m50o74L1
$$ 170934 167308 164644 162000 159488 157442 155626 153954 152899 152544 152238 151676 151285 151135 150685 150011 150042
54883A50042R59Q84K85O79K237L779M668N089M990M361M062M760N698N903N787
$$ 150042 151001 151885 152170 152849 155086 158865 163533 168622 173612 177973 182035 186795 192493 198396 204183
54868B04183N964N577L699J321j44j316l547o027o779n905n224n074m175k509
$$ 204183 210147 215724 219423 220744 220600 219284 215737 209710 202931 197026 191802 186728 182553 180044
54854A80044j670k059k212j355n41o79j388k212l218m072m093l557l416l607l180
$$ 180044 178374 176315 174103 172748 172207 171528 170140 167928 164710 160638 156545 152988 149572 145965 142785
54839A42785k094j307j092q17m16m34n84N9J326J963J458M81m10j126j323q24
$$ 142785 140691 139384 138292 137475 137059 136625 136041 136100 137426 139389 140847 141328 140918 139792 138469 137645
54823A37645m68j050j791j491o99p83j336p06J037K047J692J366J860K152J435
$$ 137645 137177 136127 134336 132845 132146 131363 130027 129321 130358 132405 134097 135463 137323 139475 140910
54808A40910N22M20J008J669K035J760Q11N9L60J121J123N37M49P29K24r73j464
$$ 140910 141432 141852 142860 144529 146564 148324 149135 149194 149554 150675 151798 152335 152784 153513 153737 152764 151300
54791A51300q82l83n20n22K6M56M18L89N32M70L81P90J315J147O83Q91J296O70
$$ 151300 150418 150035 149515 148993 149019 149475 149893 150282 150814 151284 151665 152455 153770 154917 155600 156491 157787 158457
54773A58457m43j33J740L226L399L493M306M963N038N692P531R256R698R465R549
$$ 158457 158014 157881 159621 162847 166246 169739 174045 179008 184046 189738 197269 206525 216223 225688 235237
54758B35237R712R275Q124O093K711j594n331p647q980r650r312q279p755q047
$$ 235237 244949 254224 262348 268441 271152 269558 264227 256580 247600 237950 228638 220359 212604 204557
54744B04557q063p204o206n539m575l121k088j854j524o35n8l67q47r39j144j563
$$ 204557 196494 189290 183084 177545 172970 169849 167761 165907 164383 163748 163690 163323 162476 161537 160393 158830
54728A58830j145N32K153K468J953J700J872K305L362N111O669P282P204O798
$$ 158830 157685 158217 160370 162838 164791 166491 168363 170668 174030 179141 185810 193092 200296 207094
54714B07094N785M090K348Q69q82l121n176o508p229p218o147m705m221m572m196
$$ 207094 212879 216969 219317 220186 219304 216183 211007 204499 197270 190052 183905 179200 174979 170407 166211
54699A66211k725j743k028k189j174j57m05j029p42l08j190k784l126j807k78
$$ 166211 163486 161743 159715 157526 156352 156195 155790 154761 154019 153711 152521 149737 146611 144804 144526
54684A44526L53L35K05J2k79o09r92j309j150m00M16P79P61O49N91P58J135J001
$$ 144526 144879 145214 145419 145431 145152 144543 143551 142242 141092 140692 141108 141887 142648 143297 143888 144646 145781 146782
54666A46782l04j924k080n50P92N58l97o05p5K88K17Ok99o45o10j33J43j58n57
$$ 146782 146478 144554 142474 141924 142716 143274 142877 142272 142197 142485 142702 142708 142409 141764 141154 141021 141164 141006 140449
54647A40449n91m30j78M31J126J093L79J41Q19J355R57K92J52K18K2p0J59M7o96
$$ 140449 139858 139428 139250 139681 140807 141900 142279 142420 143239 144594 145551 145843 145995 146213 146235 146165 146324 146371 145675
54628A45675j164o56K18P29J116J498J028n80j958j832q23k68k36j00k8m25p52
$$ 145675 144511 143855 144073 144802 145918 147416 148444 147864 145906 144074 143251 142983 142747 142647 142619 142194 141442
54611A41442l33L16L08r4k2M57O81P11J069J561J491Q22J56j12%L12L48l68j354
$$ 141442 141109 141425 141733 141639 141617 142074 142755 143466 144535 146096 147587 148409 148565 148453 148453 148765 149113 148745 147391
54592A47391j413l87L55m9o67m64K5m5j53N33J371J137M5o48n22j48K12O69Q85
$$ 147391 145978 145591 145946 145897 145230 144766 144791 144746 144593 145126 146497 147634 147679 147031 146509 146361 146573 147242 148127
54573A48127M98j1N4L75J96l44n10k59j41k30j23J97L83L67K40l6k48K07J314
$$ 148127 148625 148614 148668 149043 149239 148895 148385 148126 147985 147755 147632 147829 148212 148579 148819 148783 148535 148742 150056
54554A50056K044J643O27k23r20j511j337j66R22R96O97R92J402J023L84O75J665
$$ 150056 152100 153743 154370 154147 153227 151716 150379 150213 151135 152131 152828 153820 155222 156245 156629 157304 158969
54537A58969K067J605J139R87O50Q9j85k31n95j134j134o38m85r59j435j445j131
$$ 158969 161036 162641 163780 164767 165417 165506 165321 165090 164495 163361 162227 161589 161104 160145 158710 157265 156134
54520A56134o66o4M00L86P5r0j04k46m39m60m55o03o05j60M25P98J187J807K121
$$ 156134 155468 155404 155804 156190 156265 156175 156071 155825 155386 154926 154471 153868 153263 153103 153528 154326 155513 157320 159441
54501A59441J559M93k81n33m58m4N65P20J44m74n51n82j161j753j536q06m56n67
$$ 159441 161000 161493 161212 160679 160221 160177 160742 161462 161606 161132 160581 159999 158838 157085 155549 154743 154287 153720
54483A53720n83l71p0N50J522K039J489N58K06J95j99n90o6J109J800J743J675
$$ 153720 153137 152766 152696 153246 154768 156807 158296 158854 159060 159255 159056 158466 158400 159509 161309 163052 164727
54466A64727J842J722J173P12O22P04Q78J180J319R98M67Q4l12q92j244j001n21
$$ 164727 166569 168291 169464 170176 170798 171502 172380 173560 174879 175877 176344 176428 176116 175224 173980 172979 172458
54449A72458j84K07O43L85p46j586j273p21j061j596r74M51J164R14P09P96M23
$$ 172458 172274 172481 173124 173509 172763 171177 169904 169183 168122 166526 165552 166003 167167 168081 168790 169586 170009
54432A70009m38q37m13K42Q41J627K292K035Q70k41o73o24l61K1K25Q3M9N51J135
$$ 170009 169571 168734 168321 168563 169404 171031 173323 175358 176228 175987 175314 174690 174329 174350 174575 174658 174707 175258 176393
54413A76393J169Q74P53N34k42j162j530j418j134m61N02P35r8n67M42J693J520
$$ 176393 177562 178436 179189 179723 179481 178319 176789 175371 174237 173776 174278 175013 174915 174348 174790 176483 178003
54396A78003O92J109K528L027K228J570J576J350P47O48R12L86p92j136m35j97
$$ 178003 178695 179804 182332 185359 187587 189157 190733 192083 192830 193478 194390 194776 193984 192848 192413 192216
54380A92216j096k020k121j899j714j229p25j038j773j536l89N2o24q94pR13J213
$$ 192216 191120 189100 186979 185080 183366 182137 181412 180374 178601 177065 176676 176728 176104 175210 175203 176116 177329
54363A77329J945L567M605L983K920L016L991M596M438L654K144K80q34q85r57
$$ 177329 179274 182841 187446 191429 194349 197365 201356 205952 210390 214044 216188 216468 215634 214749 213792
54348B13792j739k486k637k975l989m629l952k808k462k648k392j716j235q73
$$ 213792 212053 209567 206930 203955 199966 195337 191385 188577 186115 183467 181075 179359 178124 177251
54334A77251k69K13P6l04l06o8j0j2J45J69j23k77M9N25R19J505K124J867M72
$$ 177251 176982 177195 177271 176967 176661 176593 176583 176571 176716 176885 176762 176485 176534 177059 177978 179483 181607 183474 183946
54315A83946r05j163o36k56k54m20p48j048p91o4K63n6j79K27J95q06j665j298
$$ 183946 183041 181878 181242 180986 180732 180312 179564 178516 177725 177661 177924 177868 177689 177916 178111 177305 175640 174342
54297A74342l53Km0L69J018J036M23j22l94o08o29l29j53l72l38M66J325J288
$$ 174342 173989 173991 173951 174320 175338 176374 176797 176675 176281 175673 175044 174715 174562 174190 173852 174318 175643 176931
54279A76931O61L06J04n99j428j265O2J493K110J902J231M42n9p5N8j4r4J37M31
$$ 176931 177592 177898 178002 177403 175975 174710 174772 176265 178375 180277 181508 181950 181891 181816 181874 181860 181766 181903 182334
54260A82334L53N1kK97P24J148J380J123N34L03O65R36O43M19R50J666J448K30
$$ 182334 182687 182738 182736 183033 183757 184905 186285 187408 187942 188245 188910 189846 190489 190908 191858 193524 194972 195202
54242A95202r45j285q87k71L8k86j059j637j668j458j318j155j043j367j924j711
$$ 195202 194257 192972 192085 191814 191852 191566 190507 188870 187202 185744 184426 183271 182228 180861 178937 177226
54226A77226l60R85J132M75K42O98J170J311J321J179P50M40P44J225Q83m09j606
$$ 177226 176866 177851 178983 179458 179700 180398 181568 182879 184200 185379 186129 186569 187313 188538 189421 189012 187406
54209A87406j758r95j61M4n19j435k082k141j782j310r24p16n59l6R81J738J362
$$ 187406 185648 184653 184492 184536 184017 182582 180500 178359 176577 175267 174343 173627 173068 173032 174013 175751 177113
54192A77113K59k16L35R03P89N84Q35R38K56o65j000q95q77p28m2Q13J243J442
$$ 177113 177372 177156 177491 178394 179183 179767 180602 181540 181796 181131 180131 179236 178359 177631 177589 178402 179645 181087
54174A81087J851K119J615N46l24p53r16p34j44L54K62r6j86j99n80j092j214
$$ 181087 182938 185057 186672 187218 186894 186141 185225 184491 184347 184701 184963 184867 184681 184482 183902 182810 181596
54157A81596j129j337j649j509r54m12J99J239K374K827K463J860J387R37N08
$$ 181596 180467 179130 177481 175972 175018 174606 174805 176044 178418 181245 183708 185568 186955 187892 188400
54142A88400L47M80O33N27l3j082k134k344j471l07K75K05j72o38p98l6J467K434
$$ 188400 188747 189227 189860 190387 190354 189272 187138 184794 183323 183016 183291 183496 183324 182686 181888 181852 183319 185753
54124A85753J930N34o35j261j467j046o8N43K49k1P12J699J517L67k58O2L24J00
$$ 185753 187683 188217 187582 186321 184854 183808 183740 184283 184532 184511 185223 186922 188439 188806 188548 188610 188934 189034
54106A89034K24J138J937J726R13M90P16J108J216R89O58O01J114K185L531M755
$$ 189034 189258 190396 192333 194059 194972 195462 196178 197286 198502 199491 200149 200750 201864 204049 207580 212335
54090B12335N493N701N838O287O415N003J906j471l826n209o099o186n083l460
$$ 212335 217828 223529 229367 235654 242069 247072 248978 247507 243681 238472 232373 226187 221104 217644
54076B17644k387k039j908j786j673j251m16K02R3k35o0M57Q72J383K192K664
$$ 217644 215257 213218 211310 209524 207851 206600 206184 206386 206479 206244 206184 206641 207513 208896 211088 213752
54060B13752K357K066K593L158K608J533J560K783L621L082J740M02p27j435j368
$$ 213752 216109 218175 220768 223926 226534 228067 229627 232410 236031 239113 240853 241255 240528 239093 237725
54045B37725p20j10K90O07O40L76O70K099L650L984L564L938N176N901N689N525
$$ 237725 237005 236895 237185 237792 238432 238808 239478 241577 245227 249211 252775 256713 261889 267790 273479 279004
54029B79004N765N681N257N509O433O564N281L832L164K540J352N69J049J672
$$ 279004 284769 290450 295707 301216 307649 314213 319494 323326 326490 329030 330382 330951 332000 333672
54015C33672Q64r57j962j507p67r97k190l506m271m446m450m665n038n343n594
$$ 333672 334536 333579 331617 330110 329343 328346 326156 322650 318379 313933 309483 304818 299780 294437 288843
54000B88843n804n575m622l522l039k916k267j120m43n74q99j154j766k526k405
$$ 288843 283039 277464 272842 269320 266281 263365 261098 259978 259535 258961 258062 256908 255142 252616 250211
53985B50211j288n22r52j634j442q13p60j059p51J69P62O28K86J56N0k44n25m43
$$ 250211 248923 248401 247449 245815 244373 243560 242800 241741 240990 241159 241921 242549 242835 242991 243041 242797 242272 241829
53967B41829R5Q25J302J259Q85N43K76l0r7N09J590K453K893L351L991M478M832
$$ 241829 241924 242749 244051 245310 246195 246738 247014 246984 246887 247396 248986 251439 254332 257683 261674 266152 270984
53950B70984N598O856P929Q607R773J2144J4976J6657J6027J2761P233P44m589
$$ 270984 276582 283438 291367 299974 309747 321891 336867 353524 369551 382312 389545 390289 385700
53937C85700p106o816n112l541k921l126l299k687j554q84j059j405j225o50j20
$$ 385700 378594 371778 366666 363125 360204 357078 353779 351092 349538 348654 347595 346190 344965 344315 344195
53922C44195L05P21J069J493K404L788M981N588O022O716P393P676P804Q159Q486
$$ 344195 344500 345221 346290 347783 350187 353975 358956 364544 370566 377282 384675 392351 400155 408314 416800
53907D16800Q298P650O961O282N324L975K396P68o67j608k055k454l117l828m284
$$ 416800 425098 432748 439709 445991 451315 455290 457686 458454 457787 456179 454124 451670 448553 444725 440441
53892D40441m581m932n259n421n607o087o802p446p783p746p439p183p270p507
$$ 440441 435860 430928 425669 420248 414641 408554 401752 394306 386523 378777 371338 364155 356885 349378
53878C49378p363o632n612m631l819l401l571l994m018l628l556m141m723m553
$$ 349378 342015 335383 329771 325140 321321 317920 314349 310355 306337 302709 299153 295012 290289 285736
53864B85736l726k861k284k022k114k481k826l015l232l531l592l206k599j982
$$ 285736 282010 279149 276865 274843 272729 270248 267422 264407 261175 257644 254052 250846 248247 246265
53850B46265j228l20L10L12o3l23l82m92p23q64p58n21m85q75j413j415n65N39
$$ 246265 245037 244717 245027 245339 245276 244953 244571 244079 243356 242492 241734 241213 240728 239853 238440 237025 236460 236999
53832B36999R89N71j72p01p74l26L71O13J02l82P3J124J679J564J519J677J319
$$ 236999 237988 238559 238387 237686 236912 236586 236957 237570 237672 237290 237363 238487 240166 241730 243249 244926 246245
53815B46245L78j98O1N41Q62J489K474K849K141J324J375J930K321K934M317N747
$$ 246245 246623 246425 246486 247027 247889 249378 251852 254701 256842 258166 259541 261471 263792 266726 271043 276790
53799B76790O055N353M785M846N068N091M999M683L927L180L331M510N745N989
$$ 276790 282845 288198 292983 297829 302897 307988 312987 317670 321597 324777 328108 332618 338363 344352
53785C44352N069L579K294J683J680J744J392N47o17j955l260m184m503m325l982
$$ 344352 349421 353000 355294 356977 358657 360401 361793 362340 361723 359768 356508 352324 347821 343496 339514
53770C39514l868m297n119n601n177m304l934m210m390m098l737l537l221k864
$$ 339514 335646 331349 326230 320629 315452 311148 307214 303004 298614 294516 290779 287242 284021 281157
53756B81157l048l735l928l115k050j522j267q51p09j321k157k426k322k467k676
$$ 281157 278109 274374 270446 267331 265281 263759 262492 261641 260932 259611 257454 255028 252706 250239 247563
53741B47563k286j401p64n81m31j58j3M0L61R39J294J182Q87P69Q55R50Q63O28
$$ 247563 245277 243876 243112 242531 242100 241942 241929 241969 242330 243269 244563 245745 246632 247401 248256 249206 250069 250697
53723B50697N67R60J562J825J688J669K022K337K222J844J529J349J329J530J708
$$ 250697 251264 252224 253786 255611 257299 258968 260990 263327 265549 267393 268922 270271 271600 273130 274838
53708B74838J518J236J564K473L091K954K499K077J546J184J741L024L680L191
$$ 274838 276356 277592 279156 281629 284720 287674 290173 292250 293796 294980 296721 299745 303425 306616
53694C06616K809L615M781M926M098L145K132P91k56k45L02K47m24q53q68r72
$$ 306616 309425 313040 317821 322747 326845 329990 332122 332913 332657 332412 332714 332961 332537 331684 330816 329844
53678C29844j165j034p94r76j341j290j035j173j377q19K95R61J010J146J394
$$ 329844 328679 327645 326851 325875 324534 323244 322209 321036 319659 318840 319135 320096 321106 322252 323646
53663C23646R02m65j605j666r68k40J84J03o06j508j829j428q59m49o7J92j3m92
$$ 323646 324548 324083 322478 320812 319844 319604 319788 319891 319285 317777 315948 314520 313661 313212 313145 313337 313324 312832
53645C12832n46oN35O41M93L50K88N76J518K743L364L018K256J691J419J275J186
$$ 312832 312286 312280 312815 313456 313949 314299 314587 315163 316681 319424 322788 325806 328062 329753 331172 332447 333633
53628C33633J152J305J868K669L053K782K637L309M222M358L885L813M304M635
$$ 333633 334785 336090 337958 340627 343680 346462 349099 352408 356630 360988 364873 368686 372990 377625
53614C77625M688N191O244O951O858O544O381N799M458L091K458K211J605P44
$$ 377625 382313 387504 393748 400699 407557 414101 420482 426281 430739 433830 436288 438499 440104 440848
53600D40848M03Q73J632K006J841J537J592K009K193J618M45p77j756k386k428
$$ 440848 441251 442124 443756 445762 447603 449140 450732 452741 454934 456552 456997 456220 454464 452078 449650
53585D49650j909j506j814k445k589k207j907j839j731j774k479l545l933l264
$$ 449650 447741 446235 444421 441976 439387 437180 435273 433434 431703 429929 427450 423905 419972 416708
53571D16708k256j642j496j682k076k241j750j048j031j639j783r33K11Q85J107
$$ 416708 414452 412810 411314 409632 407556 405315 403565 402517 401486 399847 398064 397131 397342 398227 399334
53556C99334J068O27m4k46L00R47J057Q04O63P56J080J699K348K519K278K303
$$ 399334 400402 401029 400985 400739 401039 401986 403043 403847 404510 405266 406346 408045 410393 412912 415190 417493
53540D17493K806L159L029L052L795M790N233N153N240N948P218Q716R902J0310
$$ 417493 420299 423458 426487 429539 433334 438124 443357 448510 453750 459698 466916 475632 485534 495844
53526D95844J0142J0205J0931J1877J2483J2848J3371J4151J5074J6095J6995
$$ 495844 505986 516191 527122 538999 551482 564330 577701 591852 606926 623021 640016
53515F40016J7364J7206J7257J8278K0274K2575K4468K5603K6181K6906K8277
$$ 640016 657380 674586 691843 710121 730395 752970 777438 803041 829222 856128 884405
53504H84405K9888L0777L0560K9689K8635K7469K6317K5487K4868K3950K2638
$$ 884405 914293 945070 975630 1005319 1033954 1061423 1087740 1113227 1138095 1162045 1184683
53493A184683K1452K0625J9732J8538J7554J7350J7869J8753J9743K0530K0730
$$ 1184683 1206135 1226760 1246492 1265030 1282584 1299934 1317803 1336556 1356299 1376829 1397559
53482A397559K0407K0059J9905J9726J9516J9483J9217J7842J5347J2823J0912
$$ 1397559 1417966 1438025 1457930 1477656 1497172 1516655 1535872 1553714 1569061 1581884 1592796
53471A592796Q974O419L799J692o00m034q133j1503j3725j5563j7351j8413j8247
$$ 1592796 1601770 1608189 1611988 1613680 1613080 1609046 1600913 1589410 1575685 1560122 1542771 1524358 1506111
53458A506111j7457j7018j7213j7741j8478j9712k1628k3807k5436k6005k5730
$$ 1506111 1488654 1471636 1454423 1436682 1418204 1398492 1376864 1353057 1327621 1301616 1275886
53447A275886k5141k4428k3484k2464k1818k1634k1367k0393j8520j5882j2706
$$ 1275886 1250745 1226317 1202833 1180369 1158551 1136917 1115550 1095157 1076637 1060755 1048049
53436A048049r459o824n255m597m240l549k242o00Q51K055L544N527P306Q220
$$ 1048049 1038590 1031766 1026511 1021914 1017674 1014125 1011883 1011283 1012134 1014189 1017733 1023260 1030566 1038786
53422A038786Q769R977J1891J3635J4833J6009J7576J9393K1378K3616K5716K7087
$$ 1038786 1047555 1057532 1069423 1083058 1097891 1113900 1131476 1150869 1172247 1195863 1221579 1248666
53410A248666K8055K9704L2370L5207L7461L9182M0453M1094M1522M2791M5245
$$ 1248666 1276721 1306425 1338795 1374002 1411463 1450645 1491098 1532192 1573714 1616505 1661750
53399A661750M8096N0737N3374N5893N7423N7789N8153N9380O0775O1434O1740
$$ 1661750 1709846 1760583 1813957 1869850 1927273 1985062 2043215 2102595 2163370 2224804 2286544
53388B286544O2483O3366O3588O3141O2290O0578N7516N3762N0383M7400M4166
$$ 2286544 2349027 2412393 2475981 2539122 2601412 2661990 2719506 2773268 2823651 2871051 2915217
53377B915217M0694L7360L3733K8997K3433J8199J3740R407M653n37o389j3489
$$ 2915217 2955911 2993271 3027004 3056001 3079434 3097633 3111373 3120780 3125433 3124896 3118507 3105018
53365C105018k1872l0732l9216m6842n3130n7558o0134o1457o2085o2262o2185
$$ 3105018 3083146 3052414 3013198 2966356 2913226 2855668 2795534 2734077 2671992 2609730 2547545
53354B547545o1995o1494o0432n9005n7628n6204n4213n1587m9063m7512m7152
$$ 2547545 2485550 2424056 2363624 2304619 2246991 2190787 2136574 2084987 2035924 1988412 1941260
53343A941260m7481m7777m7656m7168m6319m4658m1894l8740l6427l5059l3351
$$ 1941260 1893779 1846002 1798346 1751178 1704859 1660201 1618307 1579567 1543140 1508081 1474730
53332A474730l0393k6890k3974k1626j9161j6661j4916j4204j4035j3986j4014
$$ 1474730 1444337 1417447 1393473 1371847 1352686 1336025 1321109 1306905 1292870 1278884 1264870
53321A264870j4116j4203j4190j3700j2149r685p587o925p156o838n409l483j602
$$ 1264870 1250754 1236551 1222361 1208661 1196512 1186827 1179240 1172315 1165159 1158321 1152912 1149429 1147827
53308A147827K98K288M153N838P489R072J0462J1902J3780J6006J8042J9549K0612
$$ 1147827 1148125 1150413 1154566 1160404 1167893 1176965 1187427 1199329 1213109 1229115 1247157 1266706 1287318
53295A287318K1487K2481K3896K5762K7834L0078L2561L4666L5167L3682L1343
$$ 1287318 1308805 1331286 1355182 1380944 1408778 1438856 1471417 1506083 1541250 1574932 1606275
53284A606275K9335K7499K5236K2891K1120J9449J6812J3220R674O567L366k59
$$ 1606275 1635610 1663109 1688345 1711236 1732356 1751805 1768617 1781837 1791511 1798078 1801444 1801185
53272A801185m037p731j1201j3998j5902j7685k0238k3142k5240k6430k7600k8937
$$ 1801185 1797148 1789417 1778216 1764218 1748316 1730631 1710393 1687251 1662011 1635581 1607981 1579044
53260A579044k9783l0245l1376l3358l4932l5246l4977l4985l4984l4384l3347
$$ 1579044 1549261 1519016 1487640 1454282 1419350 1384104 1349127 1314142 1279158 1244774 1211427
53249A211427l2262l0991k9458k8215k7676k7431k7060k6958k7533k8173k7858
$$ 1211427 1179165 1148174 1118716 1090501 1062825 1035394 1008334 981376 953843 925670 897812
53238H97812k6533k5063k4072k3448k2843k2012k0684j8663j6137j3652j1651
$$ 897812 871279 846216 822144 798696 775853 753841 733157 714494 698357 684705 673054
53227F73054j0205r044p899o956o836p849r322j0171j0143r970j0342j1210j2224
$$ 673054 662849 653805 645906 638950 632114 624265 614943 604772 594629 584659 574317 563107 550883
53214E50883j3114j3511j3075j2082j1287j0886j0263r109q070p798p880p431
$$ 550883 537769 524258 511183 499101 487814 476928 466665 457556 449486 441688 433808 426377
53202D26377o315n175m507m322m603n433o609p550p762p203o222n260m601m186
$$ 426377 420062 414887 410380 406058 401455 396022 389413 381863 374101 366898 360676 355416 350815 346629
53188C46629l731l081k445k208k561l315l989m159l791l210k698k281j994k017
$$ 346629 342898 339817 337372 335164 332603 329288 325299 321140 317349 314139 311441 309160 307166 305149
53174C05149k286k354k036j809k076k356j938j064o62r23j106q13n80q59j224
$$ 305149 302863 300509 298473 296664 294588 292232 290294 289230 288568 287645 286539 285726 285146 284287 283063
53159B83063j145q07o76o84m34J01N49O04J71o64j532j909j670j268j131j153
$$ 283063 281918 281111 280435 279751 279317 279418 279967 280571 280742 280078 278546 276637 274967 273699 272568 271415
53143B71415j081r60q72n47K74J265J750J510R88O52M59J24l11l67L29J523K448
$$ 271415 270334 269374 268502 267955 268229 269494 271244 272754 273742 274394 274853 274977 274666 274299 274628 276151 278599
53126B78599K510J799Q94L64M55R38J196P81R7J68J275K382K412J721J516K059
$$ 278599 281109 282908 283802 284166 284621 285559 286755 287536 287633 287801 289076 291458 293870 295591 297107 299166
53110B99166K360J732O55j25o32j272k015k499k604k524k443k438k536k601k408
$$ 299166 301526 303258 303913 303788 303156 301884 299869 297370 294766 292242 289799 287361 284825 282224 279816
53095B79816j960j557j431j475j422j140o82k59j79n07q69p96l23Q8J47l1k16
$$ 279816 277856 276299 274868 273393 271971 270831 270149 269890 269711 269204 268335 267539 267216 267304 267451 267420 267204
53078B67204k65n3L66O02L21k70o55o94n63k10M85J104R26l8r45j208j129j206
$$ 267204 266939 266886 267252 267854 268175 267905 267250 266556 265993 265783 266268 267372 268298 268260 267315 266107 264978 263772
53060B63772j431j610j811k035j889j097k0P29J052J382J942K369K137J294N63
$$ 263772 262341 260731 258920 256885 254996 253899 253879 254608 255660 257042 258984 261353 263490 264784 265347
53045B65347N99J162J374Q84L23L32O26N58J75l5j09n12j166j412r95l78l9j03
$$ 265347 265946 267108 268482 269366 269689 270021 270647 271205 271380 271345 271236 270724 269558 268146 267151 266773 266734 266631
53027B66631n89j353j725j089J09P60N92L83N64N67on04j86O33J086Q87M64K51
$$ 266631 266042 264689 262964 261875 261984 262744 263336 263719 264283 264850 264844 264340 264154 264787 265873 266760 267224 267475
53009B67475L51O32Q72R42R95J144J090N32j29j88L03O20M94K88j8q51j829j726
$$ 267475 267826 268458 269330 270272 271267 272411 273501 274033 273904 273716 274019 274639 275133 275421 275403 274552 272723 270997
52991B70997k18J339J664J082O11M09P2k19L5O57J003R79J057J513K214K863K997
$$ 270997 270779 272118 273782 274864 275475 275884 275956 275737 275772 276429 277432 278411 279468 280981 283195 286058 289055
52974B89055K132N12p47q31j77L45O47J124J573J401O85K20N05J301K074K387
$$ 289055 291187 291699 290952 290121 289944 290289 290936 292060 293633 295034 295719 295939 296444 297745 299819 302206
52958C02206J970R15k29r66j216r84j61Q32Q72n63k357k881j978r70q56j368j778
$$ 302206 304176 305091 304862 303896 302680 301696 301535 302367 303239 302676 300319 297438 295460 294490 293634 292266 290488
52941B90488j796j458q89l69j61j49j8J71K5n28j141j526j657j503j014m27q1
$$ 290488 288692 287234 286345 285976 285815 285666 285648 285819 285844 285316 284175 282649 280992 279489 278475 278048 277967
52924B77967J4Q1R2j36m14l00J59L80P5l16l09n8n4l28l83J18P28N40p64k284
$$ 277967 277981 278062 278154 278018 277604 277304 277463 277843 277918 277602 277293 277235 277181 276853 276470 276588 277316 277856 277092 274808
52904B74808k645j481J39R44P81M22L62L99K01j70m43m29j32K48L60M8l58l46
$$ 274808 272163 270682 270821 271765 272546 272968 273330 273729 273930 273760 273317 272888 272756 273004 273364 273412 273054 272708
52886B72708J11M56K07m40p90m76Q1J58k95n36m7O00M40m26q02O4J464K150J884
$$ 272708 272819 273275 273482 273042 272252 271776 271857 272015 271720 271184 271137 271737 272177 271751 270949 271013 272477 274627 276511
52867B76511J556J964K844L195K463J286Q87J617K434K193J063Q9l43p27j325
$$ 276511 278067 280031 282875 286070 288533 289819 290706 292323 294757 296950 298013 298102 297759 297032 295707
52852B95707j810k098k525l011l021k678k839l659m132l597k659k056j575r33
$$ 295707 293897 291799 289274 286263 283242 280564 277725 274066 269934 266337 263678 261622 260047 259114
52838B59114n93q31r28m03p1p05j495j229l35j41o17n04N06J434J875K507L361
$$ 259114 258521 257690 256762 256359 256288 255583 254088 252859 252524 252383 251766 251262 251768 253202 255077 257584 260945
52821B60945L282J820K66j13J49k65j409k134j804r98m85k57J88J031J844K093
$$ 260945 264227 266047 266313 266200 266349 266084 264675 262541 260737 259739 259254 258997 259185 260216 262060 264153
52805B64153J819J599J797J997J471K3j807l234l671k990j734q70q66j170r59
$$ 264153 265972 267571 269368 271365 272836 272859 271052 267818 264147 261157 259423 258553 257687 256517 255558
52790B55558k58K17Q5l15n06l76r0M9j86n99n72J72J054J340J109R63J059J042
$$ 255558 255300 255517 255602 255287 254781 254405 254315 254364 254178 253579 253007 253179 254233 255573 256682 257645 258704 259746
52772B59746Q04N97M54J34l22n37m21l16n25j039j691k182k091j358n88m06o12
$$ 259746 260550 261147 261601 261735 261413 260876 260455 260139 259614 258575 256884 254702 252611 251253 250665 250259 249647
52755B49647n39l2M95Q70J289J687J688J312J077J264J565J601J381J137J119
$$ 249647 249108 249076 249571 250441 251730 253417 255105 256417 257494 258758 260323 261924 263305 264442 265561
52740B65561J478K082K443K276J978K112K592K823K540J993J427R09N82O18R66
$$ 265561 267039 269121 271564 273840 275818 277930 280522 283345 285885 287878 289305 290214 290796 291414 292380
52725B92380J479K091K527K251J201J28m43j045k267l466l519k569j883k083k593
$$ 292380 293859 295950 298477 300728 301929 302057 301614 300569 298302 294836 291317 288748 286865 284782 282189
52710B82189k791k643k106j079q5N0n17o31K20J184J326P33Nn80q87o61Q0Q70
$$ 282189 279398 276755 274649 273570 273485 273535 273018 272387 272607 273791 275117 275850 275855 275275 274388 273727 273807 274677
52692B74677J322J388J042L21k13J63J262J990J709R04L54K96O47J255J638J214
$$ 274677 275999 277387 278429 278750 278537 278700 279962 281952 283661 284565 284919 285215 285862 287117 288755 289969
52676B89969P5r97j558j844j974j640q47j94j05l79p37j103j174n44M48Q83N43
$$ 289969 290044 289047 287489 285645 283671 282031 281184 280990 280885 280506 279769 278666 277492 276948 277396 278279 278822
52659B78822J84K65L05q0m34j82O48J835L228M328M524M156M262M850M531K570
$$ 278822 279006 279271 279576 279496 279062 278880 279528 281363 284591 288919 293443 297599 301861 306711 311242 313812
52643C13812Q2j520k223k677k824k405j897j836j821j312p48q27j258j298r98
$$ 313812 313894 312374 310151 307474 304650 302245 300348 298512 296691 295379 294631 293804 292546 291248 290250
52628B90250q31n89J98J245J981K611L526M037L068Q49j236k435l042l153k331
$$ 290250 289419 288830 289028 290273 292254 294865 298391 302428 305496 306345 305109 302674 299632 296479 294148
52613B94148q01K91J86o56j342j400p22N22J631J768R58J22j07rj02m43p86r19
$$ 294148 293347 293638 293824 293168 291826 290426 289704 290226 291857 293625 294583 294705 294598 294589 294487 294044 293258 292339
52595B92339o56k2M54K34l38k87O40J543J566R80O20P53R53Q55N79M88P56J179
$$ 292339 291683 291661 292115 292349 292011 291724 292364 293907 295473 296453 297073 297826 298779 299634 300213 300701 301457 302636
52577C02636J351J037L97k29o26o62k33M44P15J69p65j341j463j590j754j475
$$ 302636 303987 305024 305421 305192 304566 303904 303671 304115 304830 304999 304234 302893 301430 299840 298086 296611
52561B96611p21k24m76r82r87n19k42m42p18o11j76J48N2l65p58q78p62n86l90
$$ 296611 295890 295666 295190 294208 293221 292702 292460 292018 291300 290689 290513 290661 290713 290348 289590 288712 287950 287364 286974
52542B86974l6N62J239J635J402M69p65j574j378k20J203K032J895J220Q01R55
$$ 286974 286938 287500 288739 290374 291776 292245 291480 289906 288528 288308 289511 291543 293438 294658 295459 296414
52526B96414J215J064P58R94J821K430K169J296M93P9k3N2J37M8n2L08J242K164
$$ 296414 297629 298693 299451 300445 302266 304696 306865 308161 308654 308733 308710 308762 308899 308947 308895 309203 310445 312609
52508C12609K580K833L565M662N293M866L468J461q18k913m334m911m840m381
$$ 312609 315189 318022 321587 326249 331542 336408 339876 341337 340519 337606 333272 328361 323521 319140
52494C19140l760l235k950k719k295j771j403j153p51k44k0k06m34l79j79q8L6
$$ 319140 315380 312145 309195 306476 304181 302410 301007 299854 299103 298859 298839 298633 298199 297820 297641 297553 297589
52477B97589N59J494K335K598K321J907J653J529J411J299J224J231J445J939
$$ 297589 298148 299642 301977 304575 306896 308803 310456 311985 313396 314695 315919 317150 318595 320534
52463C20534K435K509K310K564L532M345M061K906J749P19o97k353l382l628l967
$$ 320534 322969 325478 327788 330352 333884 338229 342290 345196 346945 347664 346967 344614 341232 337604 333637
52448C33637m792n251m532l119k097j868k215k886l449l181j896m91Q3n5k13k84
$$ 333637 328845 323594 319062 315943 313846 311978 309763 306877 303428 300247 298351 297860 297943 297888 297675 297391
52432B97391n84j007j067o70j40L04N81N15J49k2L19P61P74M82K78J29o4P1P89
$$ 297391 296807 295800 294733 294063 293923 294227 294808 295323 295472 295450 295769 296530 297304 297786 298064 298193 298129 298200 298989
52413B98989J500J563J397J798K477K451J815J901L428N593P380Q933J1003J3566
$$ 298989 300489 302052 303449 305247 307724 310175 311990 313891 317319 322912 330292 339225 350228 363794
52399C63794J5491J5365J2436P121Q85m615q362j0158j0366r772r250q952q130
$$ 363794 379285 394650 407086 414207 415092 410477 402115 391957 381591 371819 362569 353617 345487
52386C45487o274m073k615j932j178l2R67J405J437J205P05L54Q52K199L485L956
$$ 345487 339213 335140 332525 330593 329415 329383 330350 331755 333192 334397 335102 335456 336308 338507 341992 345948
52370C45948L826L829M412N411O173O002M913L713K888J789k83k566l543l042
$$ 345948 349774 353603 358015 363426 369599 375601 380514 384227 387115 388904 388621 386055 382512 379470
52356C79470k429k529k585j719k91P73J197J171P35O1k34K00Q38R70O45M14N19
$$ 379470 377041 374512 371927 370208 369917 370690 371887 373058 373793 373854 373620 373820 374658 375628 376273 376687 377206
52339C77206Q56J436K309L224L868M278M715N226N635N846N975O320P216Q727
$$ 377206 378062 379498 381807 385031 388899 393177 397892 403118 408753 414599 420574 426894 434110 442837
52325D42837J0374J1594J2468J3613J5230J6738J7465J7279J6361J4918J3394
$$ 442837 453211 464805 477273 490886 506116 522854 540319 557598 573959 588877 602271
52314F02271J2495J2576J3283J4008J4435J4494J4276J4272J5118J6714J7920
$$ 602271 614766 627342 640625 654633 669068 683562 697838 712110 727228 743942 761862
52303G61862J7696J6287J4960J4639J5057J5249J4627J3549J2789J2453J1653
$$ 761862 779558 795845 810805 825444 840501 855750 870377 883926 896715 909168 920821
52292I20821R514O282K971J37k387m619o063o455o245o100o298o747p142p012
$$ 920821 930335 936617 939588 939725 937338 932719 926656 920201 913956 907856 901558 894811 887669 880657
52278H80657o124m905l931k993j417O64K231K794L017L593M354N068O166P954
$$ 880657 874533 869628 865697 862704 861287 861951 864182 866976 869993 873586 877940 883008 889174 897128
52264H97128R731J0507J0213R565R104R030R522J0560J1689J2529J3196J3830
$$ 897128 906859 917366 927579 937144 946248 955278 964800 975360 987049 999578 1012774 1026604
52252A026604J4105J3847J3593J3812J3961J3109J1261R193P159M639J372j989
$$ 1026604 1040709 1054556 1068149 1081961 1095922 1109031 1120292 1129485 1136644 1141283 1142655 1140666
52240A140666m497n661n677n367n772p179q614q878q006p130o980p241p439p569
$$ 1140666 1136169 1130508 1124831 1119464 1113692 1106513 1097899 1089021 1081015 1073885 1066905 1059664 1052225 1044656
52226A044656p627p293o535n884n635n289m370l413l349m052m239l022r67O67
$$ 1044656 1037029 1029736 1023201 1017317 1011682 1006393 1002023 998610 995261 991209 986970 983948 982981 983648
52212I83648J382J715K289L068L693M165M886O060P310P965P653O552N153L910
$$ 983648 985030 986745 989034 992102 995795 999960 1004846 1010906 1018216 1026181 1033834 1040386 1045539 1049449
52198A049449L136L085L860N106O043O174N859N783N999N958N614N713O598P409
$$ 1049449 1052585 1055670 1059530 1064636 1070679 1076853 1082712 1088495 1094494 1100452 1106066 1111779 1118377 1125786
52184A125786P064N592L798K023P5j951l676n234p127r193j0595j0952j0706j0217
$$ 1125786 1132850 1138442 1142240 1144263 1144338 1142387 1138711 1133477 1126350 1117157 1106562 1095610 1084904 1074687
52170A074687r340q132p152o623o091n254m392l568k260l76J236K037K790M396
$$ 1074687 1065347 1057215 1050063 1043440 1037349 1032095 1027703 1024135 1021875 1021499 1022735 1024772 1027562 1031958
52156A031958O241O713N203K692M91q67j502j708j708j515r38l7O55P26N43P65
$$ 1031958 1038199 1044912 1050115 1052807 1053298 1052431 1050929 1049221 1047513 1045998 1045060 1045023 1045678 1046404 1046947 1047712
52140A047712J392J743J341L88o11j304j599j543j160l16J116K838M277N353O673
$$ 1047712 1049104 1050847 1052188 1052576 1051965 1050661 1049062 1047519 1046359 1046043 1047159 1049997 1054274 1059627 1066300
52125A066300Q659J0929J3002J5083J7583K0237K2370K3844K5056K6076K6511
$$ 1066300 1074959 1085888 1098890 1113973 1131556 1151793 1174163 1198007 1223063 1249139 1275650
52114A275650K6144K5199K3912K2376K0770J9209J7411J5010J2258R902Q332P372
$$ 1275650 1301794 1326993 1350905 1373281 1394051 1413260 1430671 1445681 1457939 1467841 1476173 1483545
52102A483545O872O975P615Q296Q623Q650Q532Q140P217N685L665J386r27l322
$$ 1483545 1490417 1497392 1505007 1513303 1521926 1530576 1539108 1547248 1554465 1560150 1563815 1565201 1564274 1560952
52088A560952o268j0126j4415j8012k0160k0980k0896k0000j8271j6031j3725
$$ 1560952 1554684 1544558 1530143 1512131 1491971 1470991 1450095 1430095 1411824 1395793 1382068
52077A382068j1430q983o562m760l884l475k709j230O69K626M642O783Q706R873
$$ 1382068 1370638 1361655 1355093 1350333 1346449 1342974 1340265 1339035 1339704 1342330 1346972 1353755 1362461 1372334
52063A372334J0177J0112J0236J0768J1595J2413J2799J2497J1736J1026J0595
$$ 1372334 1382511 1392623 1402859 1413627 1425222 1437635 1450434 1462931 1474667 1485693 1496288
52052A496288J0222R668Q923Q010O833N318L361P71k438n705q459j0894j3557
$$ 1496288 1506510 1516178 1525101 1533111 1539944 1545262 1548623 1549394 1546956 1541251 1532792 1521898 1508341
52039A508341j6169j7713j7907j7696j7832j7873j7107j5722j4281j2782j1090
$$ 1508341 1492172 1474459 1456552 1438856 1421024 1403151 1386044 1370322 1356041 1343259 1332169
52028A332169r656q966q630q014p331p154p177o537n318m601m945n728o226o447
$$ 1332169 1322513 1313547 1304917 1296903 1289572 1282418 1275241 1268704 1263386 1258785 1253840 1248112 1241886 1235439
52014A235439o638o653o238n389m279l182k641l160m634o544q710j1302j4049
$$ 1235439 1228801 1222148 1215910 1210521 1206242 1203060 1200419 1197259 1192625 1186081 1177371 1166069 1152020
52001A152020j6207j7598j8978k0974k3097k4261k4003k2817k1487k0355j9121
$$ 1152020 1135813 1118215 1099237 1078263 1055166 1030905 1006902 984085 962598 942243 923122
51990I23122j7237j4663j2247j1134j1680j3135j4439j5059j5091j4846j4533
$$ 923122 905885 891222 878975 867841 856161 843026 828587 813528 798437 783591 769058
51979G69058j4152j3679j3335j3450j3967j4404j4593j4980j5679j5715j4043
$$ 769058 754906 741227 727892 714442 700475 686071 671478 656498 640819 625104 611061
51968F11061j1103q353o312m067r76K177M339N674P103Q754R756R456Q214O810
$$ 611061 599958 591605 585293 581226 580250 582427 586766 592440 599543 608297 618053 627509 635723 642533
51954F42533N469L726J171j866m493o083o762o942o650n659m055k164n4K444N145
$$ 642533 648002 651728 652899 651033 646540 640457 633695 626753 620103 614444 610389 608225 608171 610615 615760
51939F15760P540R552J1730J4412J7078J8861J9479J9392J9230J9218J9030J8062
$$ 615760 623300 632852 644582 658994 676072 694933 714412 733804 753034 772252 791282 809344
51927H09344J5970J2960R611O480M002K329Q13k100p706j5489k3260k8920l1822
$$ 809344 825314 838274 847885 854365 858367 860696 861509 859409 851703 836214 812954 784034 752212
51914G52212l2396l1223k8831k5928k3120k0468j7598j4331j1036q323o383m658
$$ 752212 719816 688593 659762 633834 610714 590246 572648 558317 547281 538958 532575 527917
51902E27917k326P23L659N640O711P413P844P644O681N030K414j526o277j0484
$$ 527917 525591 526314 529973 535613 542324 549737 557581 565225 571906 576936 579350 577824 571547 561063
51888E61063j3209j4542j4842j3990j1879r022o245m054k536j496l85J391L681
$$ 561063 547854 533312 518470 504480 492601 483579 477334 473280 470744 469248 468863 470254 473935
51875D73935N542O330O598P485R411J1657J3007J2661J0744Q138N605L067R7k913
$$ 473935 479477 485807 492405 499890 509301 520958 533965 546626 557370 565508 571113 574180 574277 571364
51861E71364m822n184n012n533o682p329o648m780k376r0J611K565K923K879K495
$$ 571364 566542 561358 556346 550813 544131 536802 530154 525374 522998 522908 524519 527084 530007 532886 535381
51846E35381J838R83k77k260m697o649p490p535p449p408p253o939o399n370l966
$$ 535381 537219 538202 537925 535665 530968 524319 516829 509294 501845 494437 487184 480245 473846 468476 464510
51831D64510k894k510k069o91J261K632L026K939K499J154j110l244m265m231
$$ 464510 461616 459106 457037 456346 457607 460239 463265 466204 468703 469857 468747 465503 461238 457007
51817D57007l713k934j971j162p17k55O87J917K870L431L925M393M409L685K500
$$ 457007 453294 450360 448389 447227 446510 446255 446942 448859 451729 455160 459085 463478 467887 471572 474072
51802D74072J337L52o48j811k893l334k766j531m50R5N66J465K309J978O3k543
$$ 474072 475409 475761 475113 473302 470409 467075 464309 462778 462328 462423 462989 464454 466763 468741 468804 466261
51786D66261m491n041m208k443n74M46L22k18k45K95P24O88M86M01L59M48J251
$$ 466261 461770 456729 452521 450078 449504 449950 450272 450054 449809 450104 450828 451516 452002 452403 452762 453210 454461
51769D54461L151N648P715Q837R387J0063J1055J1836J1779J0940R986R102P385
$$ 454461 457612 463260 470975 479812 489199 499262 510317 522153 533932 544872 554858 563960 571345
51756E71345L904q24n143q117j0254j2170j3399j3160j1677j0000q848q217p835
$$ 571345 575249 574425 569282 561165 550911 538741 525342 512182 500505 490505 481657 473440 465605
51743D65605p391o509n034l244j447L85K269L875N003O006P347R062J0986J2896
$$ 465605 458214 451705 446671 443427 441980 442365 444634 448509 453512 459518 466865 475927 486913 499809
51729D99809J3955J2868R437N361K436O53p74j134J242O034J0215J0807P404J715
$$ 499809 513764 526632 536069 541430 543866 544519 543745 542611 543853 549887 560102 570909 578313 580028
51715E80028m156q492j0278r708p865n561l106j346j678m340p592r439r472q388
$$ 580028 575872 567380 557102 547394 539529 533968 530862 529516 527838 523498 515906 506467 496995 488607
51701D88607o497l652j78L022N093N498M067J402j155k587k970k872k378j293
$$ 488607 482110 478458 478280 481302 486395 491893 495960 497362 496207 493620 490650 487778 485400 484107
51687D84107K20J687K637K513Q16k019m490n508n526n551n492m405k120L31J943
$$ 484107 484327 486014 488651 491164 491980 489961 485471 479963 474437 468886 463394 458989 456869 457200 459143
51672D59143K709L258M061N044N671N514N024N525Q021J2243J7081K1465K4370
$$ 459143 461852 465110 469171 474215 479886 485400 490424 495949 503970 516213 533294 554759 579129
51659E79129K4600K1406J5230P304j208r189j5302j8616j9309j8031j4925j0092
$$ 579129 603729 625135 640365 647669 646461 637272 621970 603354 584045 566014 551089 540997
51647E40997m602N6L336N392N605K812k619q251j1869j3367j3792j3460j2074
$$ 540997 536395 536451 539787 545179 550784 553596 550977 542726 530857 517490 503698 490238 478164
51634D78164j0005q161o738n162l351k096j812j704p69Q47K117K587K811L206
$$ 478164 468159 459998 453260 448098 444747 442651 440839 439135 438366 439213 441330 443917 446728 449934
51620D49934L156J756q71l519n064n244m371k915j569j122j744k654k914k431
$$ 449934 453090 454846 453975 450456 445392 440148 435777 432862 431293 430171 428427 425773 422859 420428
51606D20428j914j975k528k974k766j872q40k79j70J05J009K400L918N475P191
$$ 420428 418514 416539 414011 411037 408271 406399 405559 405280 405110 405215 406224 408624 412542 418017 425208
51591D25208R218J1676J4292J5822J4503R770L262k485o155q069q849q483o735
$$ 425208 434426 446102 460394 476216 490719 500489 503751 501266 495111 487042 478193 469710 462975
51578D62975l868o89J929L559M566N942Q441J1798J4930J6868J7415J7163J7115
$$ 462975 459107 458418 460347 463906 468472 474414 482855 494653 509583 526451 543866 561029 578144
51565E78144J8093K0150K2436K3818K3628K1973J9792J8685K0111K4203K9581
$$ 578144 596237 616387 638823 662641 686269 708242 728034 746719 766830 791033 820614
51554H20614L4614L8508M0922M1038L7757L0740K0772R242k393j2926k1774k8992
$$ 820614 855228 893736 934658 975696 1013453 1044193 1064965 1074207 1071814 1058888 1037114 1008122
51542A008122l4698l8667m0812m1643m1670m0697l8240l4469l0109k5612k1041
$$ 1008122 973424 934757 893945 852302 810632 769935 731695 697226 667117 641505 620464
51531F20464j6711j3180j0640q751p163n681m025k000nJ132Q97o27l075n864q102
$$ 620464 603753 590573 579933 571182 564019 558338 554313 552313 552308 553440 554337 553710 550635 544771 536669
51516E36669r024q695p810o811n656m438l617l436l593l707l774m041m630n435
$$ 536669 527645 518950 511140 504329 498673 494235 490618 487182 483589 479882 476108 472067 467437 462002
51502D62002o116o166n275l696k098r64l16Q8M49P72R06P85O79Q48J010O45o1
$$ 462002 455886 449720 444445 440749 438651 437687 437371 437459 437908 438680 439586 440371 441050 441898 442908 443553 443492
51485D43492j94N41J212R03p6r36j646k426k674j645k0N77l05j440j769j672j976
$$ 443492 443298 443839 445051 445954 445878 444942 443296 440870 438196 436551 436531 437108 436803 435363 433594 431922 429946
51468D29946k701l315l593l636l464l042k481j941j554j458j655j876j945k076
$$ 429946 427245 423930 420337 416701 413237 410195 407714 405773 404219 402761 401106 399230 397285 395209
51454C95209k385k388j638o06j44j98Q8J038K080K820L541M506N611O966R015
$$ 395209 392824 390436 388798 388192 388048 387850 387938 388976 391056 393876 397417 401923 407534 414500 423515
51439D23515J1829J4830J7311J8568J7642J4018Q708L673J2k283k897j137K103
$$ 423515 435344 450174 467485 486053 503695 517713 526421 530094 530106 527823 524926 523789 525892
51426E25892L888K047k387o505q554q768q079p207o647o390n830m651l538l266
$$ 525892 529780 531827 529440 522935 514381 505613 497534 490327 483680 477290 471460 466809 463271 460005
51412D60005l445l075j995r43l42Q6M85N23P0m51n70l12LJ94L80Q32J657K522
$$ 460005 456560 453485 451490 450547 450205 450291 450776 451299 451369 450918 450348 450036 450039 450233 450613 451445 453102 455624
51394D55624K949K938L025L509M056M351M707N652P187Q925J0692J2639J4968
$$ 455624 458573 461511 464536 468045 472101 476452 481159 486811 493998 502923 513615 526254 541222
51381E41222J7871K1532K5979L1118L6939M3228M9067N3372N6364N9599O3715
$$ 541222 559093 580625 606604 637722 674661 717889 766956 820328 876692 936291 1000006
51370A000006O6553O4386N5021L9495K1194L796j0531k1860l1552m0314m7439
$$ 1000006 1066559 1130945 1185966 1225461 1246655 1250451 1239920 1218060 1186508 1146194 1098755
51359A098755n2156n4861n6345n6517n4868n1737m8045m4070l9498l4547k9954
$$ 1098755 1046599 991738 935393 878876 824008 772271 724226 680156 640658 606111 576157
51348E76157k5815k1573j7257j3838j1921j0946r977q702p340o174n459n174m768
$$ 576157 550342 528769 511512 497674 485753 474807 464830 456128 448788 442614 437155 431981 427213
51335D27213l735k561k304k988l337k564j508j274j551j218j56O98R22J152J897
$$ 427213 423478 420917 418613 415625 412288 409724 408216 406942 405391 404173 404017 404715 405637 406789 408686
51320D08686K659K643J802P64Q1j13j7j1m18j109j569j505j196r84p40k28K65
$$ 408686 411345 413988 415790 416554 416635 416522 416505 416494 416076 414967 413398 411893 410697 409713 408973 408745 409010
51303D09010K05l44p18o03m18o01j007j364j744k191k324j925j537j832k548k772
$$ 409010 409215 408871 408153 407550 407132 406531 405524 404160 402416 400225 397901 395976 394439 392607 390059 387287
51287C87287k204j414q24j47R35K195L222L896M260M395M696N735P455Q846Q830
$$ 387287 385083 383669 382845 382698 383633 385828 389050 392946 397206 401601 406297 412032 419487 428333 437163
51272D37163P228M677J992j65j353j579j310r93o46JJ232L168N502P240P256N343
$$ 437163 444391 449068 451060 450895 449542 447963 446653 445660 445014 445015 446247 449415 454917 462157 469413 474756
51256D74756K439l36k474l848m374m358m577n436o436o863o725o533o512o480
$$ 474756 477195 476859 474385 470537 466163 461805 457228 451792 445356 438493 431768 425235 418723 412243
51242D12243o211n455l943j845q9L99k81j108j221o29L1J18m80j197j306o71J93
$$ 412243 406032 400577 396634 394789 394700 395099 394818 393710 392489 391860 391891 392009 391529 390332 389026 388355 388548
51225C88548Q78J503K156K490K235J701J363J282J330J564J970K134J742J078
$$ 388548 389426 390929 393085 395575 397810 399511 400874 402156 403486 405050 407020 409154 410896 411974
51211D11974O73O45Q29J164J545J639J297Q90P97R02J009J362K221L288M122M690
$$ 411974 412647 413292 414121 415285 416830 418469 419766 420656 421453 422355 423364 424726 426947 430235 434357 439047
51195D39047M992M605L333J882J031M77o00k035k766k410j752j492j362q29j8
$$ 439047 444039 448644 451977 453859 454890 455367 454767 452732 449966 447556 445804 444312 442950 442121 442103
51180D42103M76K93m15j128j332j054r61j542k334k411j614p15m14o14p43l43
$$ 442103 442579 442872 442457 441329 439997 438943 437982 436440 434106 431695 430081 429366 428952 428338 427595 427252
51164D27252O55J843K573K652K725L492M708N434N136M054K616J079k93j319k172
$$ 427252 427907 429750 432323 434975 437700 441192 445900 451334 456470 460524 463140 464219 463926 462607 460435
51149D60435l144m125m745m856m494l620k426j553j452j789k087k521l234l431
$$ 460435 457291 453166 448421 443565 439071 435451 433025 431472 430020 428231 426144 423623 420389 416958
51135D16958k282m27P23J056J718K889L223J994M49J44J045K152L028L782M216
$$ 416958 414676 414249 414972 416028 417746 420635 423858 425852 426301 426445 427490 429642 432670 436452 440668
51120D40668M062L595L193K607J432l2j060j323r24J8J204K003K101K004K262
$$ 440668 444730 448325 451518 454125 455557 455525 454465 453142 452218 452236 453440 455443 457544 459548 461810
51105D61810K522K115J293R91J439J799J369M71j08j05J45K54J62M3N2J00r2o10
$$ 461810 464332 466447 467740 468731 470170 471969 473338 473809 473701 473596 473741 473995 474157 474200 474252 474352 474260 473650
51087D73650j095j082n75j34l03j008j607j529q08P8Q15J462J938J773Q04j75
$$ 473650 472555 471473 470898 470764 470461 469453 467846 466317 465509 465587 466402 467864 469802 471575 472379 472204
51071D72204m5J300K863L843M395M911N236N068M671M681N454O995R317J2482
$$ 472204 472159 473459 476322 480165 484560 489471 494707 499775 504446 509127 514581 521576 530893 543375
51057E43375J6427K0917K5302K8105K7500K2975J6356J0586P490P195R248J3106
$$ 543375 559802 580719 606021 634126 661626 684601 700957 711543 719033 726228 735476 748582
51045G48582J7181J8672J5714R597L846P21q44l461q185j3637j7737j9136j7171
$$ 748582 765763 784435 800149 809746 813592 814313 813469 810008 801823 788186 770449 751313 734142
51032G34142j1827m699P93J495k842r437j4959j7754j7948j6387j3978j1520r470
$$ 734142 722315 717616 718409 719904 717062 707625 692666 674912 656964 640577 626599 615079 605609
51019F05609p722n781l345p49J233K205K771M004O235Q705J0581J1827J2746J3260
$$ 605609 597887 592106 588761 588012 589245 591450 594221 598225 604460 613165 623746 635573 648319 661579
51005F61579J3214J2898J2579J1901J0515Q961Q026P401O021L725J475j35j606
$$ 661579 674793 687691 700270 712171 722686 731647 739673 747074 753095 756820 758295 758160 756554
50992G56554l372m915n570n452n042m491l908l745m198m569l748j267K426O482
$$ 756554 753182 748267 742697 737245 732203 727712 723804 720059 715861 711292 707544 706277 708703 715185
50978G15185J0215J3402J6237J8745K0271J9942J7777J4892J2583J1589J2259
$$ 715185 725400 738802 755039 773784 794055 813997 831774 846666 859249 870838 883097
50967H83097J4694J8499K2890K7376L1874L6199M0048M3571M7206N0805N3673
$$ 883097 897791 916290 939180 966556 998430 1034629 1074677 1118248 1165454 1216259 1269932
50956A269932N5640N7264N8653N9008N7712N5075N1560M7189M2274L7701L3768
$$ 1269932 1325572 1382836 1441489 1500497 1558209 1613284 1664844 1712033 1754307 1792008 1825776
50945A825776K9637K4763K0057J6654J4389J2683J2218J4129J7642J9921J8667
$$ 1825776 1855413 1880176 1900233 1916887 1931276 1943959 1956177 1970306 1987948 2007869 2026536
50934B026536J4093Q182K830j073l610n538p764j0825j4789j9416k4303k9052
$$ 2026536 2040629 2048811 2051641 2050568 2046958 2041420 2033656 2022831 2008042 1988626 1964323 1935271
50922A935271l3664l8514m3671m8573n2574n5490n7302n7828n7075n5415n2971
$$ 1935271 1901607 1863093 1819422 1770849 1718275 1662785 1605483 1547655 1490580 1435165 1382194
50911A382194m9361m4652l9880l5990l2711k9282k5811k3006k0937j9054j7240
$$ 1382194 1332833 1288181 1248301 1212311 1179600 1150318 1124507 1101501 1080564 1061510 1044270
50900A044270j5906j5104j4414j3629j2822j1824j0411q910p804o850n414l547
$$ 1044270 1028364 1013260 998846 985217 972395 960571 950160 941250 933446 926596 921182 917635
50888I17635j880n68O69J554J473P96P36J543K013J375O00J010K395L474L700
$$ 917635 915755 915187 915856 917410 918883 919679 920415 921958 923971 925346 925946 926956 929351 932825 936525
50873I36525L699M162N094O097O803P046P086P628R212J1482J3427J4385J4697
$$ 936525 940224 944386 949480 955577 962380 969426 976512 984140 993352 1004834 1018261 1032646 1047343
50860A047343J5309J6897J9457K2517K5619K8561L1420L4576L8654M4009N0238
$$ 1047343 1062652 1079549 1099006 1121523 1147142 1175703 1207123 1241699 1280353 1324362 1374600
50849A374600N6564O2852O9785P7747Q6135R4167J01811J09229J15849J20888
$$ 1374600 1431164 1494016 1563801 1641548 1727683 1821850 1923661 2032890 2148739 2269627
50839B269627J24513J27533J29955J30728J28898J24047J15697J03389Q7826P0992
$$ 2269627 2394140 2521673 2651628 2782356 2911254 3035301 3150998 3254387 3342213 3413205
50829C413205N4603L9138K4711J1998J717o113j1642j4442j3993j0493m556L448
$$ 3413205 3467808 3506946 3531657 3543655 3545372 3539259 3527617 3513175 3499182 3488689 3484133 3487581
50817C487581J2975K2442K9598L2767L1322K5166J4521K30j6331l3949n1896o9570
$$ 3487581 3500556 3522998 3552596 3585363 3616685 3641851 3656372 3656602 3640271 3606322 3554426 3484856
50805C484856q6298j01586j15223j26845j35646j40718j41723j39032j33335j25152
$$ 3484856 3398558 3296972 3181749 3054904 2919258 2778540 2636817 2497785 2364450 2239298
50795B239298j14813j02927r0656p9271o9278o0154n1060m1712l2525k4184j7254
$$ 2239298 2124485 2021558 1930902 1851631 1782353 1722199 1671139 1629427 1596902 1572718 1555464
50784A555464j1913p722l913k38K541L506K895K064J937J982J145n87k182l010
$$ 1555464 1543551 1535829 1531916 1531678 1534219 1537725 1540620 1542684 1544621 1546603 1547748 1547161 1544979 1541969
50770A541969l630m865o697q508j0118j1967j4289j6695j8701k0251k1491k2433
$$ 1541969 1538339 1533474 1526777 1518269 1508151 1496184 1481895 1465200 1446499 1426248 1404757 1382324
50758A382324k2988k3145k2871k2064k0807j9494j8478j7743j7023j6002j4344
$$ 1382324 1359336 1336191 1313320 1291256 1270449 1250955 1232477 1214734 1197711 1181709 1167365
50747A167365j1844q781n747k898L16M368Q952J3476J7897K2559K7418L1952L5816
$$ 1167365 1155521 1146740 1140993 1138095 1138411 1142779 1151731 1165207 1183104 1205663 1233081 1265033 1300849
50734A300849L9126M2112M4992M8091N1575N5055N7831N9682O0936O1766O1802
$$ 1300849 1339975 1382087 1427079 1475170 1526745 1581800 1639631 1699313 1760249 1822015 1883817
50723A883817O0769N9109N7700N6986N6530N5317N2420M7466M0550L1819K1386
$$ 1883817 1944586 2003695 2061395 2118381 2174911 2230228 2282648 2330114 2370664 2402483 2423869
50712B423869R677k340j3465k2675k9158l2344l2210k9325k4351j7711r977k155
$$ 2423869 2433546 2431206 2417741 2395066 2365908 2333564 2301354 2272029 2247678 2229967 2219990 2217835
50700B217835M871J0877J5856J9361K0755J9819J6443J0012p9j3203k7458m1006
$$ 2217835 2222706 2233583 2249439 2268800 2289555 2309374 2325817 2335829 2335750 2322547 2295089 2254083
50688B254083n3019o3243p1287p6575p8670p7464p3398o7475o0789n3899m6898
$$ 2254083 2201064 2137821 2066534 1989959 1911289 1833825 1760427 1692952 1632163 1578264 1531366
50677A531366l9811l2579k4888j6611q347q62N917J2689J9499K5440K9774L2695
$$ 1531366 1491555 1458976 1434088 1417477 1409130 1408268 1414185 1426874 1446373 1471813 1501587 1534282
50665A534282L4670L5617L5122L3123L0051K6524K3131K0238J7929J6304J5784
$$ 1534282 1568952 1604569 1639691 1672814 1702865 1729389 1752520 1772758 1790687 1806991 1822775
50654A822775J6648J8379J9994K1047K1799K2411K2575K2264K2179K3185K5558
$$ 1822775 1839423 1857802 1877796 1898843 1920642 1943053 1965628 1987892 2010071 2033256 2058814
50643B058814K8988L2989L7179M1415M5702M9730N2704N4170N4718N5252N5628
$$ 2058814 2087802 2120791 2157970 2199385 2245087 2294817 2347521 2401691 2456409 2511661 2567289
50632B567289N4829N2405M8882M4750M0087L5339L1556K9512K9320L0743L2352
$$ 2567289 2622118 2674523 2723405 2768155 2808242 2843581 2875137 2904649 2933969 2964712 2997064
50621B997064L0091J8842k735k9447n2935o7585p2652p0056o2060n0906l8693
$$ 2997064 3027155 3045997 3043262 3013815 2960880 2893295 2820643 2750587 2688527 2637621 2598928
50610B598928k6705j5393n218L127R338J3497J5264J3760Q456l47j1956k5520
$$ 2598928 2572223 2556830 2551612 2554739 2564077 2577574 2592838 2606598 2615054 2614707 2602751 2577231
50598B577231l9669n2729o3718p2683p9770q4423q5951q4520q1151p6883p2295
$$ 2577231 2537562 2484833 2421115 2348432 2268662 2184239 2098288 2013768 1932617 1855734 1783439
50587A783439o7666o3240n9189n5473n1845m8023m3990m0150l7033l4728l2647
$$ 1783439 1715773 1652533 1593344 1537871 1486026 1438003 1394013 1353863 1316830 1282102 1249455
50576A249455k9939k6159k1582j6940j2900r632o747l644o2L542O313P888Q929
$$ 1249455 1219516 1193357 1171775 1154835 1141935 1132303 1125556 1121912 1121850 1125392 1131705 1139593 1148522
50563A148522J0472J2736J4930J6432J7651J9413K1827K4356K6701K8933L0946
$$ 1148522 1158994 1171730 1186660 1203092 1220743 1240156 1261983 1286339 1313040 1341973 1372919
50552A372919L2398L3276L3869L4114L3654L2663L2019L2289L2973L3075L2156
$$ 1372919 1405317 1438593 1472462 1506576 1540230 1572893 1604912 1637201 1670174 1703249 1735405
50541A735405L0731L0001L1153L4453L8973M3646M8521N4340O1094O7981P4837
$$ 1735405 1766136 1796137 1827290 1861743 1900716 1944362 1992883 2047223 2108317 2176298 2251135
50530B251135Q2405R0792R8859J05862J12617J20167J28063J35106J41127J46805
$$ 2251135 2333540 2424332 2523191 2629053 2741670 2861837 2989900 3125006 3266133 3412938
50520C412938J52036J55628J56549J54551J49523J41077J28936J13242R4326P2607
$$ 3412938 3564974 3720602 3877151 4031702 4181225 4322302 4451238 4564480 4658806 4731413
50510D731413M8655K3010l907l1289n7708q1852j03220j21489j35535j43839j45833
$$ 4731413 4780068 4803078 4799171 4767882 4710174 4628322 4525102 4403613 4268078 4124239 3978406
50499C978406j42249j34089j21776j05258q4564o0345l4264q587J5039L6129N4268
$$ 3978406 3836157 3702068 3580292 3475034 3390470 3330125 3295861 3287274 3302313 3338442 3392710
50488C392710O7941P5111P4560O5882M8629K2805r639m4787p8574j08160j31711
$$ 3392710 3460651 3535762 3610322 3676204 3724833 3747638 3737999 3693212 3614638 3506478 3374767
50477C374767j48089j57338j60774j59969j55838j48844j39638j29089j17971
$$ 3374767 3226678 3069340 2908566 2748597 2592759 2443915 2304277 2175188 2057217
50468B057217j06709r5349q3836p2632o2917n5697n0832m7390m4666m2253l9456
$$ 2057217 1950508 1855159 1771323 1698691 1635774 1580077 1529245 1481855 1437189 1394936 1355480
50457A355480l5643l1129k6772k2656j8140j3337r375o729m396j386J866M406
$$ 1355480 1319837 1288708 1261936 1239280 1221140 1207803 1198428 1191699 1187303 1185917 1187783 1192189
50445A192189O371Q666J1558J4565J7467K0497K3490K5603K6049K4686K1840J7981
$$ 1192189 1198560 1207226 1218784 1233349 1250816 1271313 1294803 1320406 1346455 1371141 1392981 1410962
50433A410962J3741R912P233O073O189O790P106P109P364Q109Q881R278R607J0403
$$ 1410962 1424703 1434615 1441848 1447921 1454110 1460900 1468006 1475115 1482479 1490588 1499469 1508747 1518354 1528757
50419A528757J1741J3495J5872J9104K2944K7130L2073L8367M5692N2976N9645
$$ 1528757 1540498 1553993 1569865 1588969 1611913 1639043 1671116 1709483 1755175 1808151 1867796
50408A867796O5948P1946P6991Q0561Q2863Q4092Q3748Q1352P7402P2846O7796
$$ 1867796 1933744 2005690 2082681 2163242 2246105 2330197 2413945 2495297 2572699 2645545 2713341
50397B713341O1497N3467M3888L2786J9679M407j2281k9360m6317o2711p7393
$$ 2713341 2774838 2828305 2872193 2904979 2924658 2929065 2916784 2887424 2841107 2778396 2701003
50386B701003q8771r5874r8566r6950r1177q1922p0442n7816m4559l1113j8235
$$ 2701003 2612232 2516358 2417792 2320842 2229665 2147743 2077301 2019485 1974926 1943813 1925578
50375A925578o493M286J4438K3493L0155L3254L2366K7499J8612N882r656k5964
$$ 1925578 1919085 1923371 1937809 1961302 1991457 2024711 2057077 2084576 2103188 2109070 2099414 2073450
50363B073450m0839n2970o2206o8828p2823p3988p2510o8999o4114n8453n2763
$$ 2073450 2032611 1979641 1917435 1848607 1775784 1701796 1629286 1560287 1496173 1437720 1384957
50352A384957m7792m3741m0116l6257l1732k6386k0346j4110q330l521m05k71
$$ 1384957 1337165 1293424 1253308 1217051 1185319 1158933 1138587 1124477 1116147 1112626 1112221 1111950
50340A111950m083j0887j7890k2602k4467k4191k2311j9130j5469j2390j0248
$$ 1111950 1107867 1096980 1079090 1056488 1032021 1007830 985519 966389 950920 938530 928282
50329I28282q563o781m757k642p79N08J331K239L507M737N507N997O515O890O911
$$ 928282 919719 912938 908181 905539 904760 905268 906599 908838 912345 917082 922589 928586 935101 941991 948902
50314I48902O881P066O983O047M610L595L327L439L709M189M680M969N372O273
$$ 948902 955783 962849 969832 975879 980489 984084 987411 990850 994559 998748 1003428 1008397 1013769 1020042
50300A020042P249P531P237P171P504P779Q227R793J2528J5083J6471J7301J8553
$$ 1020042 1027291 1034822 1042059 1049230 1056734 1064513 1072740 1082533 1095061 1110144 1126615 1143916 1162469
50287A162469J9694J8803J4289O235l429j1751j6446j7329j5936j3652j0754p302
$$ 1162469 1182163 1200966 1215255 1221490 1218061 1206310 1189864 1172535 1156599 1142947 1132193 1124891
50275A124891l966j423L51J584K164K106K056K604L511M193M589N026N548N953
$$ 1124891 1120925 1119502 1119853 1121437 1123601 1125707 1127763 1130367 1133878 1138071 1142660 1147686 1153234 1159187
50261A159187O251O529O666O690P249R214J2868J7741K2968K7561L0681L2118
$$ 1159187 1165438 1171967 1178633 1185323 1192572 1201786 1214654 1232395 1255363 1282924 1313605 1345723
50249A345723L2263L1356K9166K5829K2453K0279J9480J9378J9570K0033K0296
$$ 1345723 1377986 1409342 1438508 1464337 1486790 1507069 1526549 1545927 1565497 1585530 1605826
50238A605826J9270J6162J1021M309l574j2057k0113k6623l1000l3269l3618l2092
$$ 1605826 1625096 1641258 1652279 1656588 1653014 1640957 1620844 1594221 1563221 1529952 1496334 1464242
50226A464242k8833k4478k0004j6159j3353j2380j4615k0696k9041l6513m0896
$$ 1464242 1435409 1410931 1390927 1374768 1361415 1349035 1334420 1313724 1284683 1248170 1207274
50215A207274m2203m1543l9555l6426l2648k8838k5162k1527j8180j5505j3471
$$ 1207274 1165071 1123528 1083973 1047547 1014899 986061 960899 939372 921192 905687 892216
50204H92216j1798j0492r668r039q160p123o447o288o193n699m798l781l001k723
$$ 892216 880418 869926 860258 851219 843059 835936 829489 823201 817008 811309 806511 802730 799729 797006
50190G97006k881l041k881k654k792l207l419l276l103l078l005k839k924l443
$$ 797006 794125 791084 788203 785549 782757 779550 776131 772855 769752 766674 763669 760830 757906 754463
50176G54463m004m095l729l288k863k132r64K43J039J527K085K607K533J866J617
$$ 754463 750459 746364 742635 739347 736484 734352 733388 733631 734670 736197 738282 740889 743422 745288 746905
50161G46905K690M602N997O291O149O273O550O719P081Q035R395J0737J2095J3786
$$ 746905 749595 754197 760194 766485 772634 778907 785457 792176 799257 807292 816687 827424 839519 853305
50147H53305J5797J7767J9356K0302K0505K0511K1570K4580K9121L4085L9000
$$ 853305 869102 886869 906225 926527 947032 967543 989113 1013693 1042814 1076899 1115899
50136A115899M4165M9657N4901N9259O2330O3629O2583N9402N5530N2783N1956
$$ 1115899 1160064 1209721 1264622 1323881 1386211 1449840 1512423 1571825 1627355 1680138 1732094
50125A732094N2359N2588N1596M9022M4583L7476K6754J2451l931k0228l4763
$$ 1732094 1784453 1837041 1888637 1937659 1982242 2019718 2046472 2058923 2054992 2034764 2000001
50114B000001m6777n6161o3147o7910p0233o9770o6884o2774n8361n3459m7503
$$ 2000001 1953224 1897063 1833916 1766006 1695773 1626003 1559119 1496345 1437984 1384525 1337022
50103A337022m0826l4645l0008k7261k6200k6118k5850k4572k2636k1075k0333
$$ 1337022 1296196 1261551 1231543 1204282 1178082 1151964 1126114 1101542 1078906 1057831 1037498
50092A037498j9971j9513j8786j7458j5084j1902q948o870n218l211q03J451L185
$$ 1037498 1017527 998014 979228 961770 946686 934784 925836 918966 913748 910537 909734 911185 914370
50079I14370M387N069N191M848M230L509K908K712K935L212L209L003K803K606
$$ 914370 918757 923826 929017 933865 938095 941604 944512 947224 950159 953371 956580 959583 962386 964992
50065I64992K360K211K240K073J226k23j665k721l554m392n109n512n688n800
$$ 964992 967352 969563 971803 973876 975102 974879 973214 970493 966939 962547 957438 951926 946238 940438
50051I40438n786n587n398n338m933l503j130J212K712L513M271N361O832Q738
$$ 940438 934652 929065 923667 918329 913396 909893 908763 909975 912687 916200 920471 925832 932664 941402
50037I41402J0963J2934J4076J4472J4674J5010J5551J6496J7893J9049J9041
$$ 941402 952365 965299 979375 993847 1008521 1023531 1039082 1055578 1073471 1092520 1111561
50026A111561J7984J7126J7410J8485J9358J9488J9039J8752J9818K3089K7922
$$ 1111561 1129545 1146671 1164081 1182566 1201924 1221412 1240451 1259203 1279021 1302110 1330032
50015A330032L2383L5097L6310L6580L5212L0936K3795J5651Q896N153M711O453
$$ 1330032 1362415 1397512 1433822 1470402 1505614 1536550 1560345 1575996 1584892 1590045 1594756 1601209
50003A601209Q438R152Q122N163k72q229j7434k6199l3781l9997m4070m5254m4377
$$ 1601209 1609647 1618799 1626921 1632084 1631812 1623583 1606149 1579950 1546169 1506172 1462102 1416848 1372471
49990A372471m3353m2983m2300m0321l7227l3588k9644k5904k3400k2596k2815
$$ 1372471 1329118 1286135 1243835 1203514 1166287 1132699 1103055 1077151 1053751 1031155 1008340
49979A008340k3270k3830k4203k3412k1061j8377j6873j6419j5635j3921j1983
$$ 1008340 985070 961240 937037 913625 892564 874187 857314 840895 825260 811339 799356
49968G99356j0457r102p629o423n916n818n526n000m727m912n092m706l769k804
$$ 799356 788899 779797 772168 765745 759829 754011 748485 743485 738758 733846 728754 724048 720279 717475
49954G17475k146j549n52J033L191N895Q897J1456J2862J3220J3178J2812J1457
$$ 717475 715329 713780 713228 714261 717452 723347 732244 743700 756562 769782 782960 795772 807229
49941H07229Q893O091M228L417K884K058R68k59j664l379n618q691j2469j5954
$$ 807229 816122 822213 826441 829858 832742 834800 835768 835509 833845 830466 824848 816157 803688 787734
49927G87734j7878j7827j6437j4568j2690j1024r700q583p319n771m118k491q50
$$ 787734 769856 752029 735592 721024 708334 697310 687610 679027 671708 665937 661819 659328 658478
49914F58478O23J455J507J340J574K176K685K960L271L790M451N345O740Q530
$$ 658478 659101 660556 662063 663403 664977 667153 669838 672798 676069 679859 684310 689655 696395 704925
$$ [...]
##END NTUPLES=NMR SPECTRUM
##END=
