##TITLE=AC1420_PERAH12230_7764121_X5woPd1n38
##JCAMPDX= 6.0         $$ Bruker NMR JCAMP-DX V2.0
##DATA TYPE= NMR SPECTRUM
##DATA CLASS= NTUPLES
##ORIGIN= BRUKER
##OWNER= Administrator
$$ 1.72 TOPSPIN		Version 2.1
$$ 2013-04-17 00:51:05.991 -0700  Administrator@X
$$ Compression mode = diff/dup
##.OBSERVE FREQUENCY= 400.02188249412
##.OBSERVE NUCLEUS= ^1H
##.ACQUISITION MODE= SIMULTANEOUS (DQD)
##.ACQUISITION SCHEME= undefined
##.AVERAGES= 64
##.DIGITISER RES= 22
##SPECTROMETER/DATA SYSTEM= spect
##.PULSE SEQUENCE= noesygpps1d.comp
##.SOLVENT NAME= COFFEE_meoh
##.SHIFT REFERENCE= INTERNAL, COFFEE_meoh, 1, 14.96092
##AUDIT TRAIL= $$ (NUMBER, WHEN, WHO, WHERE, PROCESS, VERSION, WHAT)
$$ ##TITLE= Audit trail, TOPSPIN		Version 2.1
$$ ##JCAMPDX= 5.01
$$ ##ORIGIN= Bruker BioSpin GmbH
$$ ##OWNER= Administrator
$$ $$ E:\/data/COFFEE/nmr/AC1420_PERAH12230_7764121_X5woPd1n38/12/pdata/1/auditp.txt
$$ ##AUDIT TRAIL=  $$ (NUMBER, WHEN, WHO, WHERE, PROCESS, VERSION, WHAT)
(   1,<2013-04-17 00:51:00.788 -0700>,<Administrator>,<X>,<go>,<TOPSPIN 2.1>,
      <created by zg
	started at 2013-04-17 00:39:30.677 -0700,
	POWCHK enabled, PULCHK disabled,
       configuration hash MD5:
       33 CF 6A 21 5C D3 B9 40 6C 15 AA 8D 27 A2 4F 13
       data hash MD5: 64K
       FE 3E B2 3E 7C EA 94 56 AC 68 33 BA 07 01 1B 3A>)
(   2,<2013-04-17 00:51:03.741 -0700>,<Administrator>,<X>,<proc1d>,<TOPSPIN 2.1>,
      <Start of raw data processing
       efp LB = 0.3 FT_mod = 6 PKNL = 1 PHC0 = 0 PHC1 = 0 SI = 128K 
       data hash MD5: 128K
       1F 47 D4 54 19 95 56 BF 37 33 F9 0D 9B 6B EE 49>)
(   3,<2013-04-17 00:51:04.772 -0700>,<Administrator>,<X>,<proc1d>,<TOPSPIN 2.1>,
      <pk PHC0 = -77.21191 PHC1 = 0 
       data hash MD5: 128K
       72 FE 0E A7 32 C9 4B D0 89 E7 02 D0 99 37 6D 2E>)
(   4,<2013-04-17 00:51:05.288 -0700>,<Administrator>,<X>,<proc1d>,<TOPSPIN 2.1>,
      <abs ABSG = 1 
       data hash MD5: 128K
       13 29 2F 82 BC 0F 71 56 6A 83 19 EB 53 B6 13 74>)
(   5,<2013-04-17 00:51:05.429 -0700>,<Administrator>,<X>,<proc1d>,<TOPSPIN 2.1>,
      <abs ABSG = 2 
       data hash MD5: 128K
       43 30 19 E3 9A 72 20 76 7F 0C D5 EB BA BF 4F 57>)
(   6,<2013-04-17 00:51:05.538 -0700>,<Administrator>,<X>,<proc1d>,<TOPSPIN 2.1>,
      <abs ABSG = 3 
       data hash MD5: 128K
       90 38 1B 9D 15 89 DB 36 91 23 6D 32 68 3B CF 10>)
(   7,<2013-04-17 00:51:05.632 -0700>,<Administrator>,<X>,<proc1d>,<TOPSPIN 2.1>,
      <abs ABSG = 4 
       data hash MD5: 128K
       99 AE 95 22 34 B5 61 A6 CF 12 D3 C8 3E 42 D8 BD>)
(   8,<2013-04-17 00:51:05.725 -0700>,<Administrator>,<X>,<proc1d>,<TOPSPIN 2.1>,
      <abs ABSG = 5 
       data hash MD5: 128K
       B3 94 0D 3A C6 66 60 16 F2 3D 46 04 50 1D 20 85>)
$$ ##END=
$$ 
$$ $$ hash MD5
$$ $$ 3F 83 0B BD A8 42 62 DD E1 D1 2F C4 1F 15 0B E4
##$RELAX= 
##$RELAX= 
##$RELAX= 
##$RELAX= 
##$RELAX= 
##$RELAX= 
##$RELAX= 
##$RELAX= 
$$ Bruker specific parameters
$$ --------------------------
##$DU= <E:\>
##$EXPNO= 12
$$ [...]
##$TP07= 0
##$TPNAME0= <>
##$TPNAME1= <>
##$TPNAME2= <>
##$TPNAME3= <>
##$TPNAME4= <>
##$TPNAME5= <>
##$TPNAME6= <>
##$TPNAME7= <>
##$TPOAL= (0..7)
0.5 0.5 0.5 0.5 0.5 0.5 0.5 0.5
##$TPOFFS= (0..7)
0 0 0 0 0 0 0 0
##$TUNHIN= 0
##$TUNHOUT= 0
##$TUNXOUT= 0
##$USERA1= <user>
##$USERA2= <user>
##$USERA3= <user>
##$USERA4= <user>
##$USERA5= <user>
##$V9= 5
##$VALIST= <valist>
##$VCLIST= <CCCCCCCCCCCCCCC>
##$VD= 0
##$VDLIST= <DDDDDDDDDDDDDDD>
##$VPLIST= <PPPPPPPPPPPPPPP>
##$VTLIST= <TTTTTTTTTTTTTTT>
##$WBST= 2048
##$WBSW= 25
##$XGAIN= (0..3)
0 0 0 0
##$XL= 0
##$YL= 0
##$YMAX_a= 6039469
##$YMIN_a= -13508754
##$ZGOPTNS= <>
##$ZL1= 120
##$ZL2= 120
##$ZL3= 120
##$ZL4= 120
##$ABSF1= 14.96092
##$ABSF2= -5.597261
##$ABSG= 5
##$ABSL= 3
##$ALPHA= 0
##$AQORDER= 0
##$ASSFAC= 0
##$ASSFACI= 0
##$ASSFACX= 0
##$ASSWID= 0
##$AUNMP= <proc_prof1d_extract.lims>
##$AXLEFT= 0
##$AXNAME= <>
##$AXNUC= <1H>
##$AXRIGHT= 0
##$AXTYPE= 0
##$AXUNIT= <>
##$AZFE= 0.1
##$AZFW= 0.1
##$BCFW= 0
##$BC_mod= 0
##$BYTORDP= 0
##$COROFFS= 0
##$CY= 15
##$DATMOD= 1
##$DC= 0
##$DFILT= <>
##$DTYPP= 0
##$F1P= 0
##$F2P= 0
##$FCOR= 0.5
##$FTSIZE= 131072
##$FT_mod= 6
##$GAMMA= 0
##$GB= 0
##$INTBC= 1
##$INTSCL= 1
##$ISEN= 128
##$LB= 0.3
##$LEV0= 0
##$LPBIN= 0
##$MAXI= 10000
##$MC2= 0
##$MEAN= 0
##$ME_mod= 0
##$MI= 0
##$NCOEF= 0
##$NC_proc= -2
##$NLEV= 6
##$NOISF1= 0
##$NOISF2= 0
##$NSP= 0
##$NTH_PI= 0
##$NZP= 0
##$OFFSET= 14.96092
##$PC= 1
##$PHC0= -77.21191
##$PHC1= 0
##$PH_mod= 1
##$PKNL= yes
##$PPARMOD= 0
##$PPDIAG= 0
##$PPIPTYP= 0
##$PPMPNUM= 2147483647
##$PPRESOL= 1
##$PSCAL= 4
##$PSIGN= 0
##$PYNMP= <proc.py>
##$REVERSE= no
##$SF= 400.020009667615
##$SI= 131072
##$SIGF1= 0
##$SIGF2= 0
##$SINO= 400
##$SIOLD= 131072
##$SPECTYP= <>
##$SREGLST= <1H.CDCl3>
##$SSB= 0
##$STSI= 131072
##$STSR= 0
##$SW_p= 8223.68421052631
##$SYMM= 0
##$S_DEV= 0
##$TDeff= 65536
##$TDoff= 0
##$TI= <>
##$TILT= no
##$TM1= 0
##$TM2= 0
##$TOPLEV= 0
##$USERP1= <user>
##$USERP2= <user>
##$USERP3= <user>
##$USERP4= <user>
##$USERP5= <user>
##$WDW= 1
##$XDIM= 131072
##$YMAX_p= 424086150
##$YMIN_p= -10886
##$CURPLOT= <Network HP LaserJet P1505>
##$CURPRIN= <$Network HP LaserJet P1505>
##$DFORMAT= <normdp>
##$LAYOUT= <+/1D_H.xwp>
##$LFORMAT= <normlp>
##$PFORMAT= <normpl>
##$SURQMSG= 1
$$ End of Bruker specific parameters
$$ ---------------------------------
##NTUPLES= NMR SPECTRUM
##VAR_NAME=  FREQUENCY,     SPECTRUM/REAL,   SPECTRUM/IMAG
##SYMBOL=    X,             R,               I
##VAR_TYPE=  INDEPENDENT,   DEPENDENT,       DEPENDENT
##VAR_FORM=  AFFN,          ASDF,            ASDF
##VAR_DIM=   131072,        131072,          131072
##UNITS=     HZ,            ARBITRARY UNITS, ARBITRARY UNITS
##FACTOR=    0.0627417313425164, 1,          1
##FIRST=     8223.62146879497, -2854,        -55914
##LAST=      0,             -1175,           -57258
##MIN=       0,             -10886,          0
##MAX=       8223.62146879497, 424086150,    0
$$ Real data points
##PAGE= N=1
##DATA TABLE= (X++(R..R)), XYDATA
$$ [...]
61627D97585j999k147k007k173k899l497l221k544k623l489l889l170k212k030
$$ 497585 495586 493439 491432 489259 486360 482863 479642 477098 474475 470986 467097 463927 461715 459685
61613D59685k418k591k437k383k638l154l897m616m825m477m210m480m905m915
$$ 459685 457267 454676 452239 449856 447218 444064 440167 435551 430726 426249 422039 417559 412654 407739
61599D07739m536m040l385k545j919j831j967j897j717j711j746j617j553j801
$$ 407739 403203 399163 395778 393233 391314 389483 387516 385619 383902 382191 380445 378828 377275 375474
61585C75474k033j831j417j223j086o29j75m26j258j752j537j274j512j818j485
$$ 375474 373441 371610 370193 368970 367884 367255 367080 366654 365396 363644 362107 360833 359321 357503 356018
61570C56018n77K66P23Q93P92L55k6L45J505K462K304J364P76R50J241J150J073
$$ 356018 355441 355707 356430 357323 358115 358470 358444 358789 360294 362756 365060 366424 367200 368150 369391 370541 371614
61553C71614J396J637J185L92N0J32n6o15q55m06L89J239K151K738K370J336R01
$$ 371614 373010 374647 375832 376224 376274 376406 376350 375735 374880 374474 374863 376102 378253 380991 383361 384697 385598
61536C85598J646K568K499J676J201J450J893K053J887J383N46l33r32j345j828
$$ 385598 387244 389812 392311 393987 395188 396638 398531 400584 402471 403854 404400 404067 403135 401790 399962
61521C99962k228k115j463p63m95o93j036j156q96m14O7N29J036J368J175N11
$$ 399962 397734 395619 394156 393393 392898 392205 391169 390013 389117 388703 388770 389299 390335 391703 392878 393389
61505C93389j33m28l51R7P74J048L42q15j155l08P45J198J386J694J596O62l12
$$ 393389 393256 392828 392477 392574 393348 394396 394738 393923 392768 392460 393205 394403 395789 397483 399079 399741 399429
61488C99429l01L84N73k3o07o16k67J56P48J575K471L241L623L236K172J428J971
$$ 399429 399128 399512 400085 400062 399455 398839 398572 398728 399476 401051 403522 406763 410386 413622 415794 417222 419193
61471D19193L437M366L767J966l6j411j797j374p69n25o08p11p87q80p20j01N30
$$ 419193 422630 426996 430763 432729 432693 431282 429485 428111 427342 426817 426209 425498 424711 423831 423111 423010 423540
61454D23540N39L5l00j73J43N31J194K007K429K239J843J666J675J619J367R16
$$ 423540 424079 424114 423814 423641 423784 424315 425509 427516 429945 432184 434027 435693 437368 438987 440354 441270
61438D41270M67M04Q02J070O22j23j50P64J724J958J683J458J280Q12O1o66j160
$$ 441270 441737 442141 442943 444013 444635 444512 444362 445126 446850 448808 450491 451949 453229 454041 454102 453436 452276
61421D52276j299q70J42J240J796J771J697J910K086J738R65L46R5k75j200k269
$$ 452276 450977 450107 450249 451489 453285 455056 456753 458663 460749 462487 463452 463798 463893 463618 462418 460149
61405D60149k667k247j632j306j227j337j770k265k155j343o37n67n34K39J457
$$ 460149 457482 455235 453603 452297 451070 449733 447963 445698 443543 442200 441563 440996 440462 440701 442158
61390D42158K202K186J775J171M53Q6M73J154J307R84R99J627K308K676L043L658
$$ 442158 444360 446546 448321 449492 449945 450031 450504 451658 452965 453949 454948 456575 458883 461559 464602 468260
61374D68260M246M469M280L669K708J869J719K113K336K104J815J697J483J061
$$ 468260 472506 476975 481255 484924 487632 489501 491220 493333 495669 497773 499588 501285 502768 503829
61360E03829Q40J140J797K559L326L910M151M378N155O421P531Q196Q727R179
$$ 503829 504669 505809 507606 510165 513491 517401 521552 525930 531085 537506 545037 553233 561960 571139
61346E71139R139Q529P735O707M903K616J226J383J921J522O35N83J344J566O40
$$ 571139 580278 588807 596542 603249 608152 610768 611994 613377 615298 616820 617455 618038 619382 620948 621588
61331F21588n03r30r38j343k273l249l933m262m094l286k181j588j989k842k952
$$ 621588 621085 620155 619217 617874 615601 612352 608419 604157 600063 596777 594596 593008 591019 588177 585225
61316E85225j712K43J786K585L231M217N342O258P070Q060R175J0197J1165J2229
$$ 585225 583513 583756 585542 588127 591358 595575 600917 607175 614245 622305 631480 641677 652842 665071
61302F65071J3177J3471J2730J0997Q589N866L046J98k556m834o296p166q003
$$ 665071 678248 691719 704449 715446 724035 729901 732947 733145 730589 725755 719459 712293 704290
61289G04290q843r041q237p071o436o407o356n951n428m935m146k779j124K49
$$ 704290 695447 686406 678169 671098 664662 658255 651899 645948 640520 635585 631439 628660 627536 627785
61275F27785J134J861K754L654M092L992L895M314M965N080M401L485K937K835
$$ 627785 628919 630780 633534 637188 641280 645272 649167 653481 658446 663526 667927 671412 674349 677184
61261F77184L069L789N130O826Q422R636J0221R822Q385O503M858L521K167P91
$$ 677184 680253 684042 689172 695998 704420 714056 724277 734099 742484 748987 753845 757366 759533 760324
61247G60324k88j008j593k067k348k770l881n454o393o053n163m900n302n285
$$ 760324 760036 759028 757435 755368 753020 750250 746369 740915 734522 728469 723306 718406 713104 707819
61233G07819m135k449j357j267j592j507o77O27J871K685L084L403L971M821N654
$$ 707819 703684 701235 699878 698611 697019 695512 694835 695462 697333 700018 703102 706505 710476 715297 720951
61218G20951N998N505M290L023K434K626L039L270L565M243M914M780L654K134
$$ 720951 726949 732454 736744 739767 742201 744827 747866 751136 754701 758944 763858 768638 772292 774426
61204G74426Q24p9k92P12K891N218O654P355Q338J0173J2463J4585J6362J7880
$$ 774426 775250 775171 774879 775591 778482 783700 790354 797709 806047 816220 828683 843268 859630 877510
61190H77510J9000J9279J8242J5745J2183Q369N108K815J488P37n1j201k207k291
$$ 877510 896510 915789 934031 949776 961959 970328 975436 978251 979739 980476 980425 979224 977017 974726
61176I74726j652j600k980n083o726p836r109j0527j1325j1332j1327j1901j2846
$$ 974726 973074 971474 968494 963411 956685 948849 939740 929213 917888 906556 895229 883328 870482
61163H70482j3786j4602j5001j4569j3590j3005j3163j3314j2749j1671j0446
$$ 870482 856696 842094 827093 812524 798934 785929 772766 759452 746703 735032 724586
61152G24586q753o229l382j053N39J594J925J284J99m42o75j567l792o678q828
$$ 724586 715833 709604 706222 705169 705708 707302 709227 710511 710710 710268 709593 708026 704234 697556 688728
61137F88728r346q299o441m697l624l091k551j634l32J321L396N828Q278J0417
$$ 688728 679382 671083 664642 659945 656321 653230 650679 649045 648713 650034 653430 659258 667536 677953
61123F77953J2242J3909J5431J6710J7828J9096K0663K2209K3215K3647K4104
$$ 677953 690195 704104 719535 736245 754073 773169 793832 816041 839256 862903 887007
61112H87007K5116K6450K7369K7433K6719K5408K3645K1859K0640J9977J8977
$$ 887007 912123 938573 965942 993375 1020094 1045502 1069147 1091006 1111646 1131623 1150600
61101A150600J6726J3241R283N426J618k451o871j1363j5406j8519k0568k1852
$$ 1150600 1167326 1180567 1189850 1195276 1196894 1194443 1187572 1176209 1160803 1142284 1121716 1099864
61089A099864k2780k3529k4010k4092k3737k3060k2244k1344k0175j8574j6762
$$ 1099864 1077084 1053555 1029545 1005453 981716 958656 936412 915068 894893 876319 859557
61078H59557j5182j4010j3035j1992j0737r129p143n131l570k461j368j02J107
$$ 859557 844375 830365 817330 805338 794601 785472 778329 773198 769628 767167 765799 765697 766804
61065G66804K224L573N122O280O832P462Q777J0341J1383J1972J2694J3546J4137
$$ 766804 769028 772601 777723 784003 790835 798297 807074 817415 828798 840770 853464 867010 881147
61052H81147J4823J6505J9097K1268K2192K2732K4262K6802K9148L0500L1315
$$ 881147 895970 912475 931572 952840 975032 997764 1022026 1048828 1077976 1108476 1139791
61041A139791L2506L4241L5810L6554L6818L7780M0013M2468M3503M2976M2578
$$ 1139791 1172297 1206538 1242348 1278902 1315720 1353500 1393513 1435981 1479484 1522460 1565038
61030A565038M3680M5690M7232M8244M9840N2442N5267N7746O0206O2830O4933
$$ 1565038 1608718 1654408 1701640 1749884 1799724 1852166 1907433 1965179 2025385 2088215 2153148
61019B153148O5974O6532O7684P0013P3732P9205Q6631R5663J06044J18125J32268
$$ 2153148 2219122 2285654 2353338 2423351 2497083 2576288 2662919 2758582 2864626 2982751 3115019
61008C115019J48406J66977J89800K19253K57151L05297L66215M42073N33533
$$ 3115019 3263425 3430402 3620202 3839455 4096606 4401903 4768118 5210191 5743724
60999E743724O40935P65660R09091J072110J257887J471309J707462J938335K117080
$$ 5743724 6384659 7150319 8059410 9131520 10389407 11860716 13568178 15506513 17623593
60990A7623593K199357K156430J967232J615061J116197N56251P6006k05825k67683
$$ 17623593 19822950 21979380 23946612 25561673 26677870 27234121 27310127 27104302 26836619
60981B6836619j86375p2847j5698p5872k99771p01840j227292j751709k140075
$$ 26836619 26650244 26577397 26561699 26485827 26186056 25484216 24256924 22505215 20365140
60972B0365140k318641k297868k138617j905490j645515j390164j159637r62358
$$ 20365140 18046499 15748631 13610014 11704524 10059009 8668845 7509208 6546850
60964F546850p96890o58553n44078m50923l75723l15185k67098k29386j99334
$$ 6546850 5749960 5091407 4547329 4096406 3720683 3405498 3138400 2909014 2709680
60955B709680j74585j54010j36970j22544j09967r8890q8671p8352o8011n9233
$$ 2709680 2535095 2381085 2244115 2121571 2011604 1912714 1824043 1745691 1677680 1618447
60945A618447n3425n0252m8353m6920m5927m5341m4921m4457m3678m2234m0165
$$ 1618447 1565022 1514770 1466417 1419497 1373570 1328229 1283308 1238851 1195173 1152939 1112774
60934A112774l8021l6112l4155l1931k9747k7774k5539k2731j9891j7730j6125
$$ 1112774 1074753 1038641 1004486 972555 942808 915034 889495 866764 846873 829143 813018
60923H13018j4474j2612j0782r060p495o497o385o697o574n778m778l993l352
$$ 813018 798544 785932 775150 766090 758595 752098 745713 739016 732442 726664 721886 717893 714541
60910G14541k623j764r38m00k66k36J60R35J527J508J012L15n67j538k232k540
$$ 714541 711918 710154 709216 708816 708550 708314 708474 709409 710936 712444 713456 713771 713204 711666 709434 706894
60894G06894k909l703m620n254n822o799q010q684q364p385o565o568p456q648
$$ 706894 703985 700282 695662 690408 684586 677787 669777 661093 652729 645344 638779 632211 624755 616107
60880F16107r437r631r500r196q678q149p907p681o862n579m774m832m922m176
$$ 616107 606670 597039 587539 578343 569665 561516 553609 545928 539066 533487 528713 523881 518959 514783
60866E14783k844j714j027n32jQ59K389M269N436N384M935N082N606N685N263
$$ 514783 511939 510225 509198 508666 508665 509524 511913 516182 521618 527002 531937 537019 542625 548310 553573
60851E53573M930M775M335L512K821K710L160L828M204L886K967J869O01j206
$$ 553573 558503 563278 567613 571125 573946 576656 579816 583644 587848 591734 594701 596570 597171 595965
60837E95965l293m727n228n641o407o679n803m694m583n193n333m607l437k091
$$ 595965 592672 587945 582717 577076 570669 563990 558187 553493 548910 543717 538384 533777 530340 528249
60823E28249r05p00j606k217j450n15j257l188m165l773l695m687n449n078m528
$$ 528249 527344 526644 525038 522821 521371 520856 519599 516411 512246 508473 504778 500091 494642 489564 485036
60808D85036m778n279n299n187n286m927l717k646k711l380l529l067k574k100
$$ 485036 480258 474979 469680 464493 459207 454280 450563 447917 445206 441826 438297 435230 432656 430556
60794D30556j476j135j505k051j911j151m41J27R34J877K390K281J815J112K20
$$ 430556 429080 427945 426440 424389 422478 421327 420886 421013 421947 423824 426214 428495 430310 431422 431642
60779D31642m42m41k1J88J82O19J805L149L738L163J823O61M85J229K033K294
$$ 431642 431200 430759 430738 430926 431108 431727 433532 436681 440419 443582 445405 446066 446551 447780 449813 452107
60763D52107K296K535K728K147P86m41p39k68K29K72o6n22j048j745k439k595
$$ 452107 454403 456938 459666 461813 462599 462158 461419 461151 461380 461652 461586 461064 460016 458271 455832 453237
60747D53237j922r74o78j191j670j469j082j424k514l439l615l489l793m492m924
$$ 453237 451315 450341 449663 448472 446802 445333 444251 442827 440313 436874 433259 429770 425977 421485 416561
60732D16561m715m188l726l179k204j029l48m66r96j466j748j676r18K91R60N50
$$ 416561 411846 407658 403932 400753 398549 397520 397172 396706 395710 394244 392496 390820 389902 390193 391153 391703
60716C91703p3K30J139J361O90L81J205K299K497J915J489J590J939K375K912
$$ 391703 391630 391860 392999 394360 395050 395431 396636 398935 401432 403347 404836 406426 408365 410740 413652
60701D13652L253L039K491K235K439K672K618K474K438K276J708R58N91Q01J135
$$ 413652 416905 419944 422435 424670 427109 429781 432399 434873 437311 439587 441295 442253 442844 443645 444780
60686D44780J035M79r7l83m57m13j06N57J288J628J428R07M35L44P59J419J850
$$ 444780 445815 446294 446197 445814 445357 444944 444838 445395 446683 448311 449739 450646 451081 451425 452184 453603 455453
60669D55453J829J499Q61l76k155l720m404m408m318m176l611k703j993j747j673
$$ 455453 457282 458781 459642 459266 457111 453391 448987 444579 440261 436085 432474 429771 427778 426031 424358
60654D24358j366o75K82J088J246Q38O17J068J713J896J763J760J643Q74l20j216
$$ 424358 422992 422317 422599 423687 424933 425771 426388 427456 429169 431065 432828 434588 436231 437105 436785 435569
60638D35569j681k109k477k487k402k669k856k152q99l11n82o12J32Q27Q41P03
$$ 435569 433888 431779 429302 426815 424413 421744 418888 416736 415837 415526 414944 414332 414464 415291 416132 416835
60622D16835Q85Q41J61l90L9R76J291O87k26q90j089p37l1N46Q00R97J164Q74
$$ 416835 417720 418561 418722 418332 418371 419347 420638 421325 421099 420209 419120 418383 418352 418898 419698 420695 421859 422733
60604D22733J55j72L57J063J143Q56R12J322J610J707J816J842J691J741K256
$$ 422733 422888 422716 423073 424136 425279 426135 427047 428369 429979 431686 433502 435344 437035 438776 441032
60589D41032K771K714K268J876J397N90J8L57J107J078J67m38KP56P98K72K54
$$ 441032 443803 446517 448785 450661 452058 452648 452666 453023 454130 455208 455375 454937 454939 455695 456493 456765 457019
60572D57019J439L485N460O672P154P491Q144R012R771J0467J1390J2430J2921
$$ 457019 458458 461943 467403 474075 481229 488720 496864 505876 515647 526114 537504 549934 562855
60559E62855J2295J0608Q260N443K180j109l532m555m693m925n357n082l569j522
$$ 562855 575150 585758 594018 599461 601641 600532 597000 592445 587752 582827 577470 572388 568819 567297
60545E67297J22J389K734L979M802N881Q187J1194J3166J3530J3696J5061J7325
$$ 567297 567419 568808 571542 575521 580323 586204 594391 605585 618751 632281 645977 661038 678363
60532F78363J9400K0897K1861K1847K0263J7184J3118Q386L336j393n422q985
$$ 678363 697763 718660 740521 762368 782631 799815 812933 821319 824655 823262 817840 808855
60520H08855j2180j4326j4763j3852j2543j1327j0137q852p428n805m181k970
$$ 808855 796675 782349 767586 753734 741191 729864 719727 710875 703447 697642 693461 690491
60508F90491k151j160K13J493K557M203P025J0455J3704J7031K1091K5634K9854
$$ 690491 688340 687180 687393 688886 691443 695646 702671 713126 726830 743861 764952 790586 820440
60495H20440L3659L7482M1100M3657M4904M5475M5779M5370M3536M0041L5180
$$ 820440 854099 891581 932681 976338 1021242 1066717 1112496 1157866 1201402 1241443 1276623
60484A276623K9555K3738J7830J1439M332l155j0697j8488k6740l5016m2565m8905
$$ 1276623 1306178 1329916 1347746 1359185 1363517 1360362 1349665 1331177 1304437 1269421 1226856 1177951
60472A177951n3602n5939n5625n3413n0364m6766m2447l7849l3855l0656k7538
$$ 1177951 1124349 1068410 1012785 959372 909008 862242 819795 781946 748091 717435 689897
60461F89897k3934k0092j6724j4384j3159j2543j1728j0379q998q197p872p432
$$ 689897 665963 645871 629147 614763 601604 589061 577333 566954 557956 549759 541887 534455
60449E34455o594n554m611l968l572k988j831n21k2n22j097j051p43o47n14k42
$$ 534455 527861 522307 517696 513728 510156 507168 505337 504816 504794 504272 503175 502124 501381 500734 500220 499978
60433D99978n18j619k462k052j097r07j279j007r2J39q12j836j873j127l24L00
$$ 499978 499460 497841 495379 493327 492230 491323 490044 489037 488945 489084 488272 486436 484563 483436 483112 483412
60417D83412Q48J366J870K264K204J601J100J384K122K355J794J021N52M75R00
$$ 483412 484260 485626 487496 489760 491964 493565 494665 496049 498171 500526 502320 503341 503893 504368 505268
60402E05268J853K866L369L393L204K649J731J355K239L416L234J830J104J991
$$ 505268 507121 509987 513356 516749 519953 522602 524333 525688 527927 531343 534577 536407 537511 539502
60388E39502L253L494L013K869L177L380L416L686M148M252L697K810K222K329
$$ 539502 542755 546249 549262 552131 555308 558688 562104 565790 569938 574190 577887 580697 582919 585248
60374E85248K939L446L473L236L031K706K116J655J698J765J114l4o61k76P06
$$ 585248 588187 591633 595106 598342 601373 604079 606195 607850 609548 611313 612427 612393 611732 611456 612162
60359F12162J804K851L634M024M447N352O351O753O887P775R454J0798J1132J0912
$$ 612162 613966 616817 620451 624475 628922 634274 640625 647378 654265 662040 671494 682292 693424 704336
60345G04336J0578R787Q198O009L354J12l244n668o862p735q960r925r712q438
$$ 704336 714914 724701 732899 738908 742262 742374 739130 733462 726600 718865 709905 699980 690268 681830
60331F81830p015o175o171o828p432p152o049n120n019n292n238m819m286l513
$$ 681830 674815 668640 662469 655641 648209 641057 635008 629888 624869 619577 614339 609520 605234 601721
60317F01721k303q42O00K033L449M618N545O665Q273J0160J2073J4027J5903J7260
$$ 601721 599418 598576 599176 601209 604658 609276 614821 621486 629759 639919 651992 666019 681922 699182
60303F99182J7864J7936J7693J7074J6097J4793J2664Q903L547k206p225j1403
$$ 699182 717046 734982 752675 769749 785846 800639 813303 822206 825753 823547 816322 804919
60291H04919j5094j8161k0166k0971k0678j9232j6598j3165r676o842n014m032
$$ 804919 789825 771664 751498 730527 709849 690617 674019 660854 651178 644336 639322 635290
60279F35290l387k828k660l145l907m414m772n319n781n662n236n157n266m849
$$ 635290 631903 629075 626415 623270 619363 614949 610177 604858 599077 593415 588179 583022 577756 572907
60265E72907m028l681l966m079l691l354l209k598j437o81p94r08k52O79J133
$$ 572907 568879 565198 561232 557153 553462 550108 546899 544301 542864 542183 541389 540481 540229 540908 542041
60250E42041J327J757K169K102J833J908K277K556K629K469J871R14P4m58r28
$$ 542041 543368 545125 547294 549396 551229 553137 555414 557970 560599 563068 564939 565853 565927 565469 564541
60235E64541j155m92R14J785J413P41R43J787K258K100J839J892K437L564M770
$$ 564541 563386 562894 563808 565593 567006 567747 568690 570477 572735 574835 576674 578566 581003 584567 589337
60220E89337N044M195L496M082N498O647P450Q422R319R476R134R209R901J0538
$$ 589337 594381 598576 602072 606154 611652 618299 625749 634171 643490 652966 662100 671309 681210 691748
60206F91748J0693J0531J0186R640R158R033Q997Q551P714O833N896M756L762
$$ 691748 702441 712972 723158 732798 741956 750989 759986 768537 776251 783084 788980 793736 797498
60193G97498L361L213K479R75o62j899k891m042n473o929p855p855p302p134p695
$$ 797498 800859 804072 806551 807526 806864 804965 802074 798032 792559 785630 777775 769920 762618 755484 747789
60178G47789q174p750o753o104n984n811n212m347l429k580j973j658j386j066
$$ 747789 739615 731865 725112 719008 713024 707213 702001 697654 694225 691645 689672 688014 686628 685562
60164F85562j026j423j810j800j730k003k253j881j080n63m87l58R7O51J032J194
$$ 685562 684536 683113 681303 679503 677773 675770 673517 671636 670556 669993 669506 669148 669245 669896 670928 672122
60148F72122J210J250J503J803J702J272J277K067K903K961K576K818M181O257
$$ 672122 673332 674582 676085 677888 679590 680862 682139 684206 687109 690070 692646 695464 699645 705902
60134G05902Q300R517R392Q293P308O958O679O068N689N857N596M087K322J927
$$ 705902 714202 723719 733111 741404 748712 755670 762349 768417 774106 779963 785559 789646 791968 793895
60120G93895K803L458L324L249L727M190M302M567N227N610N056L711K098O58
$$ 793895 796698 800156 803480 806729 810456 814646 818948 823515 828742 834352 839408 843119 845217 845875
60106H45875j79k64k53j108k879m635n608n719n065l905l114l501m427m194k315
$$ 845875 845696 845432 845179 844071 841192 836557 830949 825230 820165 816260 813146 809645 805218 801024 798709
60091G98709l56J01o12j083q26n22o66r47r46p78q55j400k262l112l708m109m545
$$ 798709 798353 798454 797842 796759 795933 795411 794745 793798 792852 792074 791219 789819 787557 784445 780737 776628 772083
60074G72083n122n731o233o691p402q608j0061j0906j0428r011p889p757q041
$$ 772083 766961 761230 754997 748306 740904 732296 722235 711329 700901 691890 684001 676244 668203
60061F68203p855p168o510o071n656n222m793m111k998j830j082n82J22R43J463
$$ 668203 660348 653180 646670 640599 634943 629721 624928 620817 617819 615989 614907 614325 614447 615390 616853
60046F16853J829K687M203N791O848P301P401P501P917Q556Q767Q010O577N204
$$ 616853 618682 621369 625572 631363 638211 645512 652913 660414 668331 676887 685654 693664 700241 705445
60032G05445M137L090J904O77o35k207m003n796p405q525q688p977p405p910r201
$$ 705445 709582 712672 714576 715253 714618 712411 708408 702612 695207 686682 677994 670017 662612 654702 645501
60017F45501j0240j0561j0456j0133r521q778q179p516o356m849l614k850k206
$$ 645501 635261 624700 614244 604111 594590 585812 577633 570117 563761 558912 555298 552448 550242
60004E50242j458p22j09K64Q0o46j142p57KK00NM07J404J831J231P87J703L616
$$ 550242 548784 548062 547953 548217 548297 547651 546509 545752 545754 545954 545959 546366 547770 549601 550832 551619 553322 556938
59986E56938N237N927N934N577M956M298L907L701L103J585p15k972m355m724
$$ 556938 562175 568102 574036 579613 584569 588867 592774 596475 599578 601163 600448 597476 593121 588397
59972E88397m557m213l629k826k198k035k131k160k057j738r68J28J001J471J969
$$ 588397 583840 579627 575998 573172 570974 568939 566808 564648 562591 560853 559885 560013 561014 562485 564454
59957E64454K563K607J969J696K467L258K699J151J37J34L05J56Q2L08N07N57
$$ 564454 567017 569624 571593 573289 575756 579014 581713 582864 583001 583135 583440 583596 583678 583986 584493 585050
59941E85050O43N76N7n38o54o97j453k494k548j480m85r0O33K300M027M720M590
$$ 585050 585693 586269 586326 585788 585134 584437 582984 580490 577942 576462 575977 575887 576520 578820 582847 587567 592157
59924E92157M574N016N561N848N781N461N161M952M426L251J932J253J142R54
$$ 592157 596731 601747 607308 613156 618937 624398 629559 634511 638937 642188 644120 645373 646515 647469
59910F47469P48J207K228K795K532K289K716L309L340K905K432J900J105K21l27
$$ 647469 648217 649424 651652 654447 656979 659268 661984 665293 668633 671538 673970 675870 676975 677196 676869
59895F76869k18O60K009L120L585L935M855O062O828P284Q092Q958Q874P896P261
$$ 676869 676651 677311 679320 682440 686025 689960 694815 700877 707705 714989 723081 732039 740913 748809 756070
59880G56070P442P449O553N405M784M502M148L867L621K664N67j938l838m927
$$ 756070 763512 770961 777514 782919 787703 792205 796353 800220 803841 806505 807072 805134 801296 796369
59866G96369n552o007o561p386p982p540o184n007m527m117l329k662k418j945
$$ 796369 790817 784810 778249 770863 762881 755341 749157 744150 739623 735506 732177 729515 727097 725152
59852G25152p98L90R86J398K237L323M300N447O972Q345R180R972J1011J1366
$$ 725152 724354 724744 725730 727128 729365 732688 736988 742435 749407 757752 766932 776904 787915 799281
59838G99281J0011P418M923K964J060p47j559p99R95K650L124J914p73m130p261
$$ 799281 809292 816710 821633 824597 825657 824910 823351 822552 823547 826197 829321 831235 830462 826332 819071
59823H19071r551j0669j0676j0167r800r535q864p899p426p724q075p773o872
$$ 819071 809520 798851 788175 778008 768208 758673 749809 741910 734484 726760 718685 710912 704040
59810G04040n721m507l578l370l640l552k858k229k115k168k126k212k277j667
$$ 704040 698319 693812 690234 686864 683224 679672 676814 674585 672470 670302 668176 665964 663687 662020
59796F62020m79J20m38j203j186p33o20p53o21l06r4J03K33j66j039j495j219
$$ 662020 661541 661661 661223 660020 658834 658101 657481 656728 656107 655801 655707 655810 656043 655877 654838 653343 652124
59779F52124j157j918k615k323j653j499j294p1J481J733N93l30M0J235K387L192
$$ 652124 650967 649049 646434 644111 642458 640959 639665 639594 641075 642808 643401 643071 643111 644346 646733 649925
59763F49925L586L570L532L939M599M924M912N157N997P300Q863J0354J1065J0604
$$ 649925 653511 657081 660613 664552 669151 674075 678987 684144 690141 697441 706304 716658 727723 738327
59749G38327R718R697J0834J2087J2308J1262R528P857O674N850M957L870K837
$$ 738327 748045 757742 768576 780663 792971 804233 813761 821618 828292 834142 839099 842969 845806
59736H45806J915Q64k32q48q60r05j477k275k833l146l251k944k424k400l050
$$ 845806 847721 848585 848353 847505 846645 845740 844263 841988 839155 836009 832758 829814 827390 824990 821940
59721H21940l556l342k877k693k500k087k071k804l386k908j915j529j745j719
$$ 821940 818384 815042 812165 809472 806972 804885 802814 800010 796624 793716 791801 790272 788527 786808
59707G86808j243p48l04L58J181K091L453N278O542O430N733N885O990P996Q415
$$ 786808 785565 784817 784513 784871 786052 788143 791596 796874 803416 809846 815579 821464 828454 836450 844865
59692H44865Q587Q514P721O240M611K898O97j811l745m554m503m204m261n090
$$ 844865 853452 861966 869687 875927 880538 883436 884133 882322 878577 874023 869520 865316 861055 855965
59678H55965o454p384p236o518o126o288o823p759q844r156q192o761n792m960
$$ 855965 849511 842127 834891 828373 822247 815959 809136 801377 792533 783377 775185 768424 762632 757672
59664G57672l570k108j529j540j020J96J357K290L447M641N226N423O053O908
$$ 757672 754102 751994 750465 748925 747905 748101 749458 751748 755195 759836 765062 770485 776538 783446
59650G83446O841N641M475M089L783K548L27k248m569o278p394q351r348r866
$$ 783446 790287 795928 800403 804492 808275 810823 811150 808902 804333 798055 790661 782310 772962 763096
59636G63096r446q621q204q050p458o453n617m934m003l167l228m104m948n469
$$ 763096 753650 745029 736825 728775 721317 714864 709247 704313 700310 697143 693915 689811 684863 679394
59622F79394o053o566o366n522m910m937n152n179n025m551l694l080l302l647
$$ 679394 673341 666775 660409 654887 649977 645040 639888 634709 629684 625133 621439 618359 615057 611410
59608F11410k832j005K98L54R8N31J468K231K595K611K357K103K053J889J292
$$ 611410 608578 607573 607871 608225 608323 608854 610322 612553 615148 617759 620116 622219 624272 626161 627453
59593F27453P63R57J432J192K87l25l61l78n02l62l13j145k507l098k702k501
$$ 627453 628216 629173 630605 631797 632084 631759 631398 631020 630518 630156 629843 628698 626191 623093 620391 617890
59577F17890l024l432l223l107l426l306k258j287j388j984j946j254o64m07j81
$$ 617890 614866 611434 608211 605104 601678 598372 596114 594827 593439 591455 589509 588255 587591 587184 587003
59562E87003Q6K68M39O30N65P6n11p49m93J42P87Q86L56L1P47K060K835K986L498
$$ 587003 587089 587357 587796 588426 588991 589067 588556 587807 587314 587456 588243 589129 589485 589516 590263 592323 595158 598144 601642
59543F01642M761O045O895P832R322J1064J2708J4304J5811J6955J7755J8075
$$ 601642 606403 612448 619343 627175 636497 647561 660269 674573 690384 707339 725094 743169
59531G43169J6651J1910M281l419q475j0237r450o977l823j224K10Q92J348J572
$$ 743169 759820 771730 776011 772592 764117 753880 744430 737453 733630 732406 732616 733508 734856 736428
59517G36428J537J421J012k67k363m491o212p744r122r971j0300j0412j0024q647
$$ 736428 737965 739386 740398 740131 737768 733277 727065 719321 710199 700228 689928 679516 669492 660845
59503F60845o922o126o241o045n313n112n496m823k321M32J717J825J823J681
$$ 660845 653923 647797 641556 635511 630198 625086 619590 614767 612446 612878 614595 616420 618243 619924
59489F19924J024N25R62J839K247K448L284M666N828O566P188P645P694P536P536
$$ 619924 620948 621473 622435 624274 626521 628969 632253 636919 642747 649313 656501 664146 671840 679376 686912
59474F86912P723Q076Q692R151Q441O162L196O60j101k132k375k069j778j523
$$ 686912 694635 702711 711403 720554 728995 735157 738353 739013 737912 735780 733405 731336 729558 728035
59460G28035q78o8K18M47K003M830P068P892Q773J0709J2159J1544J0066R872
$$ 728035 727157 727089 727307 727754 729757 734587 741655 749547 758320 769029 781188 792732 802798 812670
59446H12670J0645J0331Q399O107L954J108k660o328r098j1052j2211j2300j1535
$$ 812670 823315 833646 842045 848152 852106 853214 850554 844226 835128 824076 811865 799565 788030
59433G88030j0510r316p748o214n354m986m394l490k661j754k71J770M147P166
$$ 788030 777520 768204 760456 754242 748888 743902 739508 736018 733357 731603 731332 733102 737249 744415
59419G44415J1061J5105J8439K1346K4430K7193K8787K9691L0956L2161L1815
$$ 744415 755476 770581 789020 810366 834796 861989 890776 920467 951423 983584 1015399
59408A015399K9504K5722J9746J0031k590j4112k0757k1847j8685j2474m547K847
$$ 1015399 1044903 1070625 1090371 1100402 1097812 1083700 1062943 1041096 1022411 1009937 1005390 1008237
59396A008237P794J0116J0202P114m72j1499k2130k8615k9945k7566k3427j8843
$$ 1008237 1016031 1026147 1036349 1043463 1042991 1031492 1009362 980747 950802 923236 899809 880966
59384H80966j4623j1243q635o278l887j831n98n1L99R31J161R35O72P14Q25P30
$$ 880966 866343 855100 846465 840187 836300 834469 833871 833820 834219 835150 836311 837246 837918 838632 839457 840187
59368H40187O17O74N35j97j200j755j575q99K5J080K052K848L780N188O879Q368
$$ 840187 840804 841478 842013 841816 840616 838861 837286 836387 836412 837492 839544 842392 846172 851360 858239 866607
59352H66607R597J0941J2558J4144J5460J6681J8049J9355K0047J9881J9342J9111
$$ 866607 876204 887145 899703 913847 929307 945988 964037 983392 1003439 1023320 1042662 1061773
59340A061773J9114J8448J6537J3895J1289Q623N359J731j485m262p338j0847
$$ 1061773 1080887 1099335 1115872 1129767 1141056 1149679 1155038 1156769 1155284 1151022 1143684 1132837
59328A132837j3968j6164j7713j8734j8797j7989j7351j7586j8140j8162j7598
$$ 1132837 1118869 1102705 1084992 1066258 1047461 1029472 1012121 994535 976395 958233 940635
59317I40635j6785j5795j4785j4216j4024j3387j1945j0513r882r636q968p971
$$ 940635 923850 908055 893270 879054 865030 851643 839698 829185 819303 809667 800699 792728
59305G92728p258o851o289n367m121k493o24J059K534M385O799R056J0589J1779
$$ 792728 785470 778619 772330 766963 762842 760349 759725 760784 763318 767703 774502 783558 794147 805926
59291H05926J2969J3389J1935Q393L198l266j0203j5882j8657j8315j5783j2001
$$ 805926 818895 832284 844219 852612 855810 852544 842341 826459 807802 789487 773704 761703
59279G61703p738l902j042J198L534O113Q606J0713J2203J3008J3617J4717J6061
$$ 761703 753965 750063 749021 750219 753753 759866 768472 779185 791388 804396 818013 832730 848791
59266H48791J6557J5820J4672J3590J1862R002N821L064J95l360o716q596r133
$$ 848791 865348 881168 895840 909430 921292 930294 936115 939179 939374 936014 929298 920702 911569
59253I11569r403r729r595q761p415n687l863k583k041j606q47j33L78J308K801
$$ 911569 902166 892437 882842 874081 866666 860979 857116 854533 852492 850886 850039 849906 850284 851592 854393
59238H54393L895M121M475N766P201P838Q120Q567Q203O032K982O73q61k588m530
$$ 854393 858288 862409 866884 872650 879851 887689 895809 904376 912579 918611 921593 922266 921405 918817 914287
59223I14287o167p912j0270j2344j3003j2837j3071j3369j2691j1559j1238j1200
$$ 914287 908120 900208 889938 877594 864591 851754 838683 825314 812623 801064 789826 778626
59211G78626r847p456n961n885n738m663l458k761k134j402j007p78j7R98J295
$$ 778626 768779 761323 755362 749477 743739 739076 735618 732857 730723 729321 728314 727536 727519 728517 729812
59196G29812J098J622K890L591L368L363M133M902N283N904O884P434P490P976
$$ 729812 730910 732532 735422 739013 742381 745744 749877 754779 760062 765966 772850 780284 787774 795750
59182G95750Q927R059P872O531N933N498M573L545K744J743M84k46k15l20r95
$$ 795750 804677 813736 821608 828139 834072 839570 844143 847688 850432 852175 852659 852413 852198 851878 850883
59167H50883j384q41k2K87L17M92N90L63J0n87k000m048n643o412p314q952j0556
$$ 850883 849499 848658 848636 848923 849240 849732 850322 850685 850695 850108 848108 844060 838417 832005 824691 815739 805183
59150H05183j1334j1741j2430j2991j2725j1869j1101j0472r580q371p113n966
$$ 805183 793849 782108 769678 756687 743962 732093 720992 710520 700940 692569 685456 679490
59138F79490n074m558m219l713l178l060l267l213k719k103j398l83O88J403K156
$$ 679490 674416 669858 665639 661926 658748 655688 652421 649208 646489 644386 642988 642605 643293 644696 646852
59123F46852L644N512O716P228Q051R404J0371J0551J0641J1068J1453J1755J2427
$$ 646852 650496 656008 662724 669952 678003 687407 697778 708329 718970 730038 741491 753246 765673
59110G65673J3128J2815J1617J1014J1461J1424R734P396O052N759N429M500L165
$$ 765673 778801 791616 803233 814247 825708 837132 846866 854262 860314 866073 871502 876002 879167
59097H79167J647J66j010j987l138m223m453l795l136k896k469j557q66r47j461
$$ 879167 880814 880980 879970 877983 874845 870622 866169 862374 859238 856342 853873 852316 851450 850503 849042
59082H49042k088l094m488n734o812q405j0433j1598j1059r512p974o675n752
$$ 849042 846954 843860 839372 833638 826826 818421 807988 796390 785331 775819 767845 761170 755418
59069G55418n769o616p027o185m917m460m808n129n050m714m243l784l546l344
$$ 755418 749649 743033 736006 729821 724904 720444 715636 710507 705457 700743 696500 692716 689170 685826
59055F85826k730j891j589j948k190j920j632j626j514j162j022j163j064p04
$$ 685826 683096 681205 679616 677668 675478 673558 671926 670300 668786 667624 666602 665439 664375 663671
59041F63671p19j116j051l13L04M33O10R07O39k5K10J750L347M207N199P089R083
$$ 663671 662952 661836 660785 660472 660776 661209 661819 662726 663365 663340 663550 665300 668647 672854 678053 685142 694225
59024F94225J0379J1607J3522J5459J6429J6700J6974J6945J5887J3903J1494
$$ 694225 704604 716211 729733 745192 761621 778321 795295 812240 828127 842030 853524
59013H53524Q628N217J826r25l003m458n136n385n933o573o141m406k531j068
$$ 853524 862152 867369 869195 868270 865267 860809 855673 850288 844355 837782 831641 827235 824704 823636
58999H23636R01L655N583N425M248L778L885L309J834K60j045k191k975l195l267
$$ 823636 824537 828192 833775 839200 843448 847226 851111 854420 856254 856514 855469 853278 850303 847108 843841
58984H43841l569l785l563l074k300q92O68J085K93J20J863M531O577P967R326
$$ 843841 840272 836487 832924 829850 827550 826658 827326 828411 828704 828824 830687 835218 841795 849762 859088
58969H59088J0392J0817J1306J2494J3606J3687J3110J2605J1806J0136Q130O500
$$ 859088 869480 880297 891603 904097 917703 931390 944500 957105 968911 979047 987177 993677
58957I93677M837K526j1k344n137q826j2331j4529j5945j7445j8440j8073j7132
$$ 993677 998514 1001040 1001029 998685 993548 984722 972391 957862 941917 924472 906032 887959 870827
58944H70827j6858j6751j5509j3331j1428r882p967n979m807l999k274J53J611
$$ 870827 853969 837218 821709 808378 796950 787068 779101 773122 768315 764316 762042 762195 763806
58931G63806J404N98K56K63O2m90j257j941k185k109k362l098l566l343l035k996
$$ 763806 765210 765808 766064 766327 766389 765899 764642 762701 760516 758407 756045 752947 749381 746038 743003 740007
58915G40007k449r44M70Q24Q68J779L238M266N027O194P440Q154Q840J0256J1976
$$ 740007 737558 736614 737084 737908 738776 740555 743793 748059 753086 759280 766720 774874 783714 793970 805946
58900H05946J3322J4802J6923J8535J8247J6702J5533J4782J3476J2053J2006
$$ 805946 819268 834070 850993 869528 887775 904477 920010 934792 948268 960321 972327
58889I72327J3402J4888J6014J7520J9354K0392K0237J9520J8334J6026J2694
$$ 972327 985729 1000617 1016631 1034151 1053505 1073897 1094134 1113654 1131988 1148014 1160708
58878A160708R314O261L113q1k735m911p230r599j1419j2871j4579j6104j6177
$$ 1160708 1170022 1176283 1179396 1179315 1176580 1171669 1164439 1154840 1143421 1130550 1115971 1099867 1083690
58865A083690j4523j2217j0346r325r332j0136j0869j1054j1455j2689j3689j3092
$$ 1083690 1069167 1056950 1046604 1037279 1027947 1017811 1006942 995888 984433 971744 958055 944963
58853I44963j1585j1110j2085j3146j3369j3022j2229j0736r062q321q630r029
$$ 944963 933378 922268 910183 897037 883668 870646 858417 847681 838619 830298 821668 812639
58841H12639r015q960r096r316r733j0267j0045q541o833o287o476o017n044m897
$$ 812639 803624 794664 785568 776252 766519 756252 746207 737666 730833 724546 718070 712053 707009 702112
58827G02112n566n390l492q90J078K031K213K144K633L904M890M524L408K881
$$ 702112 696546 691156 687664 686774 687852 689883 692096 694240 696873 700777 705667 710191 713599 716480
58813G16480K939K593J787J263R28O6r69j145o33o00j240j711j948k674l677l833
$$ 716480 719419 722012 723799 725062 725990 726056 725087 723942 723309 722709 721469 719758 717810 715136 711459 707626
58797G07626l023k405k601l149l765m597n174m596k954j258NJ065J893K394L227
$$ 707626 704603 702198 699597 696448 692683 688086 682912 678316 675362 674104 674109 675174 677067 679461 682688
58782F82688M925O636P279P427Q310R525R648Q751Q138P842O530L867R34j773
$$ 682688 687613 694249 701528 708955 717265 726790 736438 745189 753327 761169 767699 771566 772500 770727
58768G70727m722p700r724j0734j1567j2208j1902j0935j0375j0016q627o258
$$ 770727 766005 758305 748581 737847 726280 714072 702170 691235 680860 670844 662217 655959
58756F55959m301l189k002n16M48Q06J369K053J935J242J266K152K803L035L723
$$ 655959 651658 648469 646467 645951 646399 647205 648574 650627 652562 653804 655070 657222 660025 663060 666783
58741F66783M672M679L983M349O221P913Q221P763P346O926O613O814P006O276
$$ 666783 671455 676134 680117 684466 690687 698600 706821 714584 721930 728856 735469 742283 749289 755565
58727G55565N209N254O103O008M863M420N177N600N037M855N868P049P671Q446
$$ 755565 760774 766028 772131 778139 783002 787422 792599 798199 803236 808091 813959 821008 828679 837125
58713H37125R588R931Q917P499O309M795K805R75r74m134q082j0972j2511j4444
$$ 837125 846713 856644 865561 873060 879369 884164 886969 887944 886970 882836 874754 863782 851271 836827
58699H36827j7314j9383j9655j9430j9715j9591j8391j7138j6507j5543j3704
$$ 836827 819513 800130 780475 761045 741330 721739 703348 686210 669703 654160 640456
58688F40456j2038j1092r775p591n926n705n825n234m564m435m125l236k727k970
$$ 640456 628418 617326 607551 599960 594034 588329 582504 577270 572706 568271 564146 560910 558183 555213
58674E55213k729j359k7M96J225K785M001M142M569O494Q967J0688J1906J3018
$$ 555213 552484 551125 551098 551594 552819 555604 559605 563747 568316 574810 583777 594465 606371 619389
58660F19389J3030J1147Q295N457K120k088n827p700q191q454q557q174p709p431
$$ 619389 632419 643566 651861 657318 659438 657350 651523 643823 635632 627178 618621 610447 602738 595307
58646E95307o824n788n137n033m567l570l002k755j370J150K598J913Q33Q02P40
$$ 595307 588483 582695 577558 572525 567958 564388 561386 558631 557261 558411 561009 562922 563755 564557 565297
58631E65297l90j189k36J221J233J12o40q44j111j211q43p39j241j216J45J822
$$ 565297 564907 563718 563482 564703 565936 566048 565408 564564 563453 562242 561399 560660 559419 558203 558348 560170
58615E60170K794L755N496P166P775P883Q203Q110P058N929N393M592K958J669
$$ 560170 562964 566719 572215 579381 587156 595039 603242 611352 618410 624339 629732 634324 637282 638951
58601F38951J635J765Q75l73j027j611k615k989j942o03j89p2O49J429J814K878
$$ 638951 640586 642351 643226 642853 641826 640215 637600 634611 632669 632066 631877 631805 632454 633883 635697 638575
58585F38575N273P679Q995J0273J2530J4481J4549J3448J2735J2314J1505J0963
$$ 638575 643848 651527 660522 670795 683325 697806 712355 725803 738538 750852 762357 773320
58573G73320J1470J2154J1914J1350J1468J1996J2606J4221J7299K0465K2655
$$ 773320 784790 796944 808858 820208 831676 843672 856278 870499 887798 908263 930918
58562I30918K4870K8074L1155L2806L3555L3912L2542K8411K2904J7654J2054
$$ 930918 955788 983862 1015017 1047823 1081378 1115290 1147832 1176243 1199147 1216801 1228855
58551A228855N200j589o440r490j1614j2445j1767j1006j1142j1042j0033j0037
$$ 1228855 1234055 1232466 1226026 1216536 1204922 1192477 1180710 1169704 1158562 1147520 1137487 1127450
58539A127450j2769j6864k0298k3500k7375l0443l0973l0017k9303k7942k4386
$$ 1127450 1114681 1097817 1077519 1054019 1026644 996201 965228 935211 905908 877966 853580
58528H53580j9869j6690j4581j1984r443q481q332p109n148m162m080l690l330
$$ 853580 833711 817021 802440 790456 781013 772532 764200 757091 751943 747781 743701 740011 736681
58515G36681l968m659l820k119j343j397j113q29j414j930j103P5n4q32o36P9
$$ 736681 732713 728054 724234 722115 720772 719375 718262 717433 716019 714089 712986 713061 713007 712175 711539 711618
58499G11618o8m86J50J081P70j70k35J54n7J31K058M459N350N530O988R271J0689
$$ 711618 711550 711064 711214 712295 713065 712895 712660 712814 712757 712888 714946 719405 724755 730285 737273 746544 757233
58482G57233J1774J4026J6593J7647J7896J9212K0978K1252K0417J9974J8931
$$ 757233 769007 783033 799626 817273 835169 854381 875359 896611 917028 937002 955933
58471I55933J5173R452M231l76n795j1066j3762j4074j4138j3922j1722q081n293
$$ 955933 971106 980558 984789 984413 978618 967552 953790 939716 925578 911656 899934 891853 886560
58458H86560l409n67L111N766P500J0059J3090J4513J4354J4445J4448J1989O740
$$ 886560 883151 882584 885695 891461 898961 909020 922110 936623 950977 965422 979870 991859 998599
58445I98599Q81m435r728j4411j6890j7382j7467j7114j5133j2143r850p954n031
$$ 998599 999480 995045 985317 970906 954016 936634 919167 902053 886920 874777 864927 856973 851942
58432H51942j798j05N63K129M165M818M684O039Q709J0491J1135J2154J3165J2139
$$ 851942 850144 850039 850602 852731 856896 861714 866398 872437 881146 891637 902772 914926 928091 940230
58418I40230Q986N423J839k359o115q046r364j1845j4060j3545j1421j0672j1137
$$ 940230 949216 954639 956478 954119 948004 939958 930594 918749 904689 891144 879723 869051 857914
58405H57914j0541r229r189r494p640m524l112l029j456J359K652K514L483N275
$$ 857914 847373 838144 828955 819461 811821 807297 804185 801156 799700 801059 803711 806225 809708 814983
58391H14983N277L870L847M897M064J445L1Q6q21k454k256r37j807m494n127l004
$$ 814983 820260 824130 827977 832874 836938 838383 838414 838500 837679 835225 832969 832032 830225 825731 820604 817600
58375H17600j262o10J544N277P495P833R272J2132J3307J2309J2261J3906J4459
$$ 817600 816338 815728 817272 822549 830044 837877 847149 859281 872588 884897 897158 911064 925523
58362I25523J3362J3476J5511J6865J6812J7298J7987J6271J2777J0850J0194
$$ 925523 938885 952361 967872 984737 1001549 1018847 1036834 1053105 1065882 1076732 1086926
58351A086926P261K428L7O18O3k450k856J18K777L563N287Q517R864Q814R318
$$ 1086926 1094187 1096615 1096652 1097270 1097333 1094883 1092027 1092145 1094922 1098485 1103772 1112289 1122153 1130967 1140285
58336A140285J2434J4307J3619J4041J6954J8741J7786J7259J8387J7876J4718
$$ 1140285 1152719 1167026 1180645 1194686 1211640 1230381 1248167 1265426 1283813 1301689 1316407
58325A316407J2602J2826J1611P251L246J589k65l079l461n88J528J253J937M785
$$ 1316407 1329009 1341835 1353446 1360697 1363943 1365532 1365267 1362188 1358727 1358139 1359667 1360920 1362857 1367642
58311A367642O299N493O256R721J1746J0827J0919J3500J4614J2946J2689J5164
$$ 1367642 1373941 1379434 1385690 1395411 1407157 1417984 1428903 1442403 1457017 1469963 1482652 1497816
58299A497816J5877J3429J2906J6504J9251J8187J7384J9528K0954J9534J9133
$$ 1497816 1513693 1527122 1540028 1556532 1575783 1593970 1611354 1630882 1651836 1671370 1690503
58288A690503K1585K2632K0514K0066K3607K6285K5322K5115K8202L0110K8416
$$ 1690503 1712088 1734720 1755234 1775300 1798907 1825192 1850514 1875629 1903831 1933941 1962357
58277A962357K7982L1731L5034L4750L4839L7668L9019L7213L7678M2686M6341
$$ 1962357 1990339 2022070 2057104 2091854 2126693 2164361 2203380 2240593 2278271 2320957 2367298
58266B367298M5598M6208N1632N6384N6811N7859O2435O4948O2525O1580O5760
$$ 2367298 2412896 2459104 2510736 2567120 2623931 2681790 2744225 2809173 2871698 2933278 2999038
58255B999038O8534O5542O2906O5199O6891O4239O3805P0152P6901P9180Q2879
$$ 2999038 3067572 3133114 3196020 3261219 3328110 3392349 3456154 3526306 3603207 3682387 3765266
58244C765266R2118J00128J02429J06319J16984J27190J31398J36687J48624J60110
$$ 3765266 3857384 3957512 4059941 4166260 4283244 4410434 4541832 4678519 4827143 4987253
58234D987253J65811J73501J88946K04167K13276K24805K45109K65290K78532
$$ 4987253 5153064 5326565 5515511 5719678 5932954 6157759 6402868 6668158 6946690
58225F946690K94156L19866L47030L68905L95641M34835M75826N10781N51996
$$ 6946690 7240846 7560712 7907742 8276647 8672288 9107123 9582949 10093730 10645726
58216A0645726O09684O73038P33273Q03988Q97296J002494J111673J242717J411867
$$ 10645726 11255410 11928448 12661721 13465709 14363005 15365499 16477172 17719889 19131756
58207A9131756J608937J827411K092614K430809K840071L325327L931145M701899
$$ 19131756 20740693 22568104 24660718 27091527 29931598 33256925 37188070 41889969
58199D1889969N641533O753526Q085411R687921J1567102J3724143J6197865J9019273
$$ 41889969 47531502 54285028 62370439 72058360 83625462 97349605 113547470 132566743
58191A32566743K2187779K5739531K9691278L3721238L6951657L8253920L6790756
$$ 132566743 154754522 180494053 210185331 243906569 280858226 319112146 355902902
58184C55902902L2122534K3925939J2134775k277134j6881665k8682548l5717888
$$ 355902902 388025436 411951375 424086150 421809016 404927351 376244803 340526915
58177C40526915l7891653l6453209l2943207k8586784k4247692k0514994j7696569
$$ 340526915 302635262 266182053 233238846 204652062 180404370 159889376 142192807
58170A42192807j5794289j4546524j3554128j2476515j1196516r809188q456376
$$ 142192807 126398518 111851994 98297866 85821351 74624835 64815647 56359271
58163E6359271p206901o083064n115401m319717l665183l111374k650331k282057
$$ 56359271 49152370 43069306 37953905 33634188 29969005 26857631 24207300 21925243
58155B1925243j980292j716026j489652j309550j161527j027260r11681q24937
$$ 21925243 19944951 18228925 16739273 15429723 14268196 13240936 12329255 11504318
58147A1504318p55787o87951o25651n79073n40409m96951m53312m19170l88620
$$ 11504318 10748531 10060580 9434929 8855856 8315447 7818496 7365184 6946014 6557394
58138F557394l51973l15350k88944k67802k42609k18154k03323j93710j81216
$$ 6557394 6205421 5890071 5601127 5333325 5090716 4872562 4669239 4475529 4294313
58129D294313j70312j68043j67938j60195j48512j41234j35125j23319j10542
$$ 4294313 4124001 3955958 3788020 3627825 3479313 3338079 3202954 3079635 2969093
58120B969093j04908j02571r5330q5988q1797p9982p3840o6440o4434o4649o0194
$$ 2969093 2864185 2761614 2666284 2580296 2498499 2418517 2344677 2278237 2213803 2149154 2088960
58109B088960n3936n2818n4490n2309m8232m8355n0570m8794m4757m3994m4671
$$ 2088960 2035024 1982206 1927716 1875407 1827175 1778820 1728250 1679456 1634699 1590705 1546034
58098A546034m1589l6894l5851l6349l3286k9028k8866l0342k7644k2662k1176
$$ 1546034 1504445 1467551 1431700 1395351 1362065 1333037 1304171 1273829 1246185 1223523 1202347
58087A202347k1876j9516j5418j4699j6280j5563j3830j5355j8200j7588j5409
$$ 1202347 1180471 1160955 1145537 1130838 1114558 1098995 1085165 1069810 1051610 1034022 1018613
58076A018613j6832k0294k0342j7813j7711j9421j8398j5452j5107j6502j5025
$$ 1018613 1001781 981487 961145 943332 925621 906200 887802 872350 857243 840741 825716
58065H25716j1356j0132j1087j0038p363p066q652q166o252p060j0033j0749r182
$$ 825716 814360 804228 793141 783103 775740 768674 760022 751856 745604 738544 728511 717762 708580
58052G08580r406j1557j1730r502q343q723p723n330m555n431n126l695l763n005
$$ 708580 699174 687617 675887 666385 658042 649319 641596 636266 631711 626280 621154 617459 613696 608691
58038F08691m769l567m111n770n713m591n302p145p146o055o973r097q996p230
$$ 608691 603922 600355 596244 590474 584761 580170 574868 567723 560577 554522 547549 538452 529456 522226
58024E22226p397r302r371p300o191o403n396l404l243m594m332k510k226l513
$$ 522226 514829 505527 496156 488856 482665 476262 470866 467462 464219 459625 455293 452783 450557 447044
58010D47044l144p18O70J48J47J381J882J432J973L385L549K774L407N054M957
$$ 447044 443900 443182 443852 444000 444147 445528 447410 448842 450815 454200 457749 460523 463930 468984 473941
57995D73941L101K091K052N03k583m557n032o246q245q548o907n870o200o119
$$ 473941 477042 479133 481185 481688 479105 474548 469516 463270 455025 446477 439570 433700 427500 421381
57981D21381n297n224n617m800l594m310o075n787l519k198k078o53J905K570
$$ 421381 416084 410860 405243 400443 396849 392539 386464 380677 377158 374960 372882 372229 374134 376704
57967C76704J163R41K651L188J270m64l75j50q12p81M74R52k28j364j621k339
$$ 376704 377867 378808 381459 384647 385917 385453 385078 384928 384116 383335 383809 384761 384533 383169 381548 379209
57951C79209l839m439l658k965k621j284O33J016J8J90K011L198L180M140O644
$$ 379209 375370 370931 367273 364308 361687 360403 361036 362052 362070 362260 364271 367469 370649 374789 381433
57936C81433Q383Q456Q907J0674J1760J0986R952R720Q880O461L683J456r83l784
$$ 381433 389816 398272 407179 417853 429613 440599 450551 460271 469151 475612 479295 480751 479768 475984
57922D75984n782o968q766j1045j1863j0874r933r686q817p241o611o932o173
$$ 475984 470202 463234 454468 443423 431560 420686 410753 401067 392250 385009 378398 371466 365293
57909C65293m032k557k298j461L18J117N67O76J769J585k92j117K90J552J171
$$ 365293 361261 358704 356406 354945 355263 356380 356947 357623 359392 360977 360685 359568 359858 361410 362581
57894C62581J051K467L432K507J753L219N490O336O103N957N344L681K243K024
$$ 362581 363632 366099 369531 372038 373791 377010 382500 388836 394939 400896 406240 409921 412164 414188
57880D14188J778L29j218j607j734k866m373n121n414n861n973n364m697m244
$$ 414188 415966 416295 415077 413470 411736 408870 404497 399376 393962 388101 382128 376764 372067 367823
57866C67823l280j888j321j600j036P93K001J644J455K875M699N427N655O435
$$ 367823 364543 362655 361334 359734 358698 359491 361492 363136 364591 367466 372165 377592 383247 389682
57852C89682P144O886O187N830N503M890M415L954K620P39q5K82n3j798l146k856
$$ 389682 396826 403712 409899 415729 421232 426122 430537 434491 437111 437850 437765 438047 437994 436196 433050 430194
57836D30194k170k320k559k171k094k874l280k552j958k467l005k546j944k053
$$ 430194 428024 425704 423145 420974 418880 416006 412726 410174 408216 405749 402744 400198 398254 396201
57822C96201k075j388j025j770k624k717k848l651m206l878l600l924l788k709
$$ 396201 394126 392738 391713 389943 387319 384602 381754 378103 373897 370019 366419 362495 358707 355998
57808C55998k111l020m390n241o265p860q718q000o851o199n224l500k344k352
$$ 355998 353887 350867 346477 341236 334971 327111 318393 310393 303542 297343 292119 288619 286275 283923
57794B83923k014n81J78q60j798p39J159K097K751M310N571M979L741L973N202
$$ 283923 281909 281328 281506 280646 278848 278109 279268 281365 284116 288426 293997 298976 302717 306690 311892
57779C11892N625N532O496Q152Q731Q102P629P493O620M913L359K269J254N02
$$ 311892 317517 323049 329545 337697 346428 354530 362159 369652 376272 381185 384544 386813 388067 388569
57765C88569L24l6j362k863l266k866k829l149k957k290j962k050j908j323n74
$$ 388569 388893 388857 387495 384632 381366 378500 375671 372522 369565 367275 365313 363263 361355 360032 359458
57750C59458Q8K57m83j507j453l86n5j070j597l08J239R10r00k359k997l453l650
$$ 359458 359546 359803 359320 357813 356360 355974 355919 354849 353252 352944 354183 355093 354193 351834 348837 345384 341734
57733C41734l143k320j647p15N49J061M23J28J231K419K229J629K232L368L351
$$ 341734 338591 336271 334624 333909 334458 335519 335942 336070 337301 339720 341949 343578 345810 349178 352529
57718C52529K431K195K824L214L061K810K228R71j85m94p51j940l296l602l358
$$ 352529 354960 357155 359979 363193 366254 369064 371292 372263 372078 371584 370833 368893 365597 361995 358637
57703C58637l730m373m300l938m200m498l740k496k014k009j500r30j300k045
$$ 358637 354907 350534 346234 342296 338096 333598 329858 327362 325348 323339 321839 320909 319609 317564
57689C17564k060j977l043m518m662l607k778k083l22K061L382L753N085Q031
$$ 317564 315504 313527 310484 305966 301304 297697 294919 292836 292514 294575 297957 301710 306795 314826
57675C14826J1358J4518J8429K3400K8533L3608L9537M6480N3159N8323O1289
$$ 314826 326184 340702 359131 382531 411064 444672 484209 530689 583848 642171 703460
57664G03460O0905N5507M4138K6808M202k1124m4027n9591o6817o7897o4522n7187
$$ 703460 764365 819872 864010 890818 895020 873896 829869 770278 703461 635564 571042 513855
57652E13855m7659l9033l2642k7184k1552j6541j3060j0611q412o495m954l442
$$ 513855 466196 427163 394521 367337 345785 329244 316184 305573 297161 290666 285712 282270
57640B82270k067j475j619j600j065n98n52p06j110j984k686k243j026n29j205
$$ 282270 280203 278728 277109 275509 274444 273846 273294 272588 271478 269494 266808 264565 263539 263010 261805
57625B61805j953j954j676j694j828j802j729j656j502j490j774j769r47po1r02
$$ 261805 259852 257898 256222 254528 252700 250898 249169 247513 246011 244521 242747 240978 240031 240024 239963 239061
57609B39061j390j357j685k615l336l350k881k005o72M73N43l11j168j704k159
$$ 239061 237671 236314 234629 232014 228678 225328 222447 220442 219770 220243 220786 220475 219307 217603 215444
57594B15444k281j686r59j006j612j955k140k688l027k233r11m50p13l61O36Q87
$$ 215444 213163 211477 210518 209512 207900 205945 203805 201117 198090 195857 194946 194496 193783 193422 194058 194945
57578A94945m5j062j492j765j946j548j052j665l197m034l597l030k989k668j633
$$ 194945 194900 193838 192346 190581 188635 187087 186035 184370 181173 177139 173542 170512 167523 164855 163222
57563A63222q15q97j253j249j182j310j267r79r32r93l56R62J885J981K117K955
$$ 163222 162407 161510 160257 159008 157826 156516 155249 154270 153338 152345 151989 152951 154836 156817 158934 161889
57547A61889M085M954N418N099L606J661O34O92Q02O69J061K057K686K696K856
$$ 161889 165974 170928 176346 181445 185051 186712 187346 188038 188840 189509 190570 192627 195313 198009 200865
57532B00865L157K539J023J46M98P13k05j239j229o68n01m94j17J63k62r20j001
$$ 200865 204022 206561 207584 207730 208228 208941 208736 207497 206268 205600 205099 204605 204488 204651 204389 203469 202468
57515B02468n57j10J40k1r83k419l184k855k424k795l468l510k984k634k810l341
$$ 202468 201911 201801 201941 201920 200937 198518 195334 192479 190055 187260 183792 180282 177298 174664 171854 168513
57499A68513l871l954l389k698k537k611k104j186q87j428j966k147k459k859
$$ 168513 164642 160688 157299 154601 152064 149453 147349 146163 145276 143848 141882 139735 137276 134417
57485A34417k579j688j276j548j335j64P32L59m88o28k24j80p86j693k448k517
$$ 134417 131838 130150 128874 127326 125991 125827 126559 126918 126430 125802 125578 125398 124612 122919 120471 117954
57469A17954j720r46j324k381k417j035K63M53L08O16Q32M85L03R09J608J612
$$ 117954 116234 115288 113964 111583 109166 108131 108394 108847 109155 109771 110603 111088 111391 112300 113908 115520
57453A15520J188P69J39n89n60L18P97K39k58K35Q66N27k52k92M17J087J401J350
$$ 115520 116708 117477 117616 117027 116467 116785 117582 117821 117563 117798 118664 119191 118939 118647 119064 120151 121552 122902
57435A22902P81J14M33J792K594J775L91n0L12N92Q61J416J462K33j293j433j58
$$ 122902 123683 123797 124230 126022 128616 130391 130782 130732 131044 131636 132497 133913 135375 135608 134315 132882 132724
57418A32724J032J171N40l01j036j396j332j121p55J58J399J943J464R70J150
$$ 132724 133756 134927 135467 135166 134130 132734 131402 130281 129526 129684 131083 133026 134490 135460 136610
57403A36610J224L78p32j113j042j356j994k377k447k230j291L14J483J548J355
$$ 136610 137834 138212 137480 136367 135325 133969 131975 129598 127151 124921 123630 123944 125427 126975 128330
57388A28330J771K237K045J870K552L446L549L313L652L987L150J537N24K46k66
$$ 128330 130101 132338 134383 136253 138805 142251 145800 149113 152765 156752 159902 161439 161963 162209 161943
57373A61943j070j288r05q83j471j936j964j961j971j669j349j647k363k665k465
$$ 161943 160873 159585 158680 157797 156326 154390 152426 150465 148494 146825 145476 143829 141466 138801 136336
57358A36336k321k121j176L33J226R50K53M4M28J019J531J839J972K082K094J631
$$ 136336 134015 131894 130718 131051 132277 133227 133480 133524 133952 134971 136502 138341 140313 142395 144489 146120
57342A46120P00o7k96l96p17q68n54k76m65o95n90n77r52j082n56j24l53m71J67
$$ 146120 146820 146753 146457 146061 145344 144476 143922 143646 143181 142486 141896 141319 140367 139285 138729 138605 138252 137781 137948
57323A37948O41k6r30o77J66lj048j357n18L02N42Q42J392J500J063Q34R70P62
$$ 137948 138589 138563 137633 136956 137122 137119 136071 134714 134196 134498 135040 135882 137274 138774 139837 140671 141641 142403
57305A42403R0l28k89l41n60l80J47K83l7q6K47L70L77J074K315K758J800M55
$$ 142403 142493 142165 141876 141535 140975 140595 140742 141025 140988 140902 141149 141519 141896 142970 145285 148043 149843 150298
57287A50298j70o8M57J473K685L142K436J383Q53P29M86J62R4L33P55J314J888
$$ 150298 150128 150060 150517 151990 154675 157817 160253 161636 162489 163218 163704 163866 163960 164293 165048 166362 168250
57270A68250K270K514K839L170L263L208L252L246K891K439K400K694K760K405
$$ 168250 170520 173034 175873 179043 182306 185514 188766 192012 194903 197342 199742 202436 205196 207601
57256B07601J856J154L09j63K82J331K195K687L090L213K539J203pn10p4J436
$$ 207601 209457 210611 210920 210757 211039 212370 214565 217252 220342 223555 226094 227297 227290 226780 226706 228142
57240B28142L545M896M637L703L502L843L564K820K965M178N033M711M062L977
$$ 228142 231687 236583 241220 244923 248425 252268 255832 258652 261617 265795 270828 275539 279601 283578
57226B83578M186M233M340M657M813M771N080N721N804N041M443M859N771O202
$$ 283578 287764 291997 296337 300994 305807 310578 315658 321379 327183 332224 336667 341526 347297 353499
57212C53499O051N756N374M809M500N066O433P807Q461Q330P986Q092Q671R070
$$ 353499 359550 365306 370680 375489 379989 385055 391488 399295 407756 416086 424072 432164 440835 449905
57198D49905Q856Q502Q678R257R668R927J0519J1468J2328J2927J3394J3606J3447
$$ 449905 458761 467263 475941 485198 494866 504793 515312 526780 539108 552035 565429 579035 592482
57185E92482J3471J4431J6218J8005J9310K0145K0427K0106J9626J9457J9380
$$ 592482 605953 620384 636602 654607 673917 694062 714489 734595 754221 773678 793058
57174G93058J9096J9125K0109K1640K2889K3990K5598K7443K8657K9321L0244
$$ 793058 812154 831279 851388 873028 895917 919907 945505 972948 1001605 1030926 1061170
57163A061170L1443L2253L2793L3719L4737L4904L4535L4994L6379L7128L6494
$$ 1061170 1092613 1124866 1157659 1191378 1226115 1261019 1295554 1330548 1366927 1404055 1440549
57152A440549L5743L6186L7388L8092L7832L6956L6099L6154L7780M0287M1934
$$ 1440549 1476292 1512478 1549866 1587958 1625790 1662746 1698845 1734999 1772779 1813066 1855000
57141A855000M1887M1059M0643M0645M0426L9941L9819M0657M2446M4452M5693
$$ 1855000 1896887 1937946 1978589 2019234 2059660 2099601 2139420 2180077 2222523 2266975 2312668
57130B312668M5973M6137M6790M7315M7055M6737M7569M9429N1327N3255N6044
$$ 2312668 2358641 2404778 2451568 2498883 2545938 2592675 2640244 2689673 2741000 2794255 2850299
57119B850299N9681O3307O6847P1119P6399Q2296Q9032R7436J07685J19522J33638
$$ 2850299 2909980 2973287 3040134 3111253 3187652 3269948 3358980 3456416 3564101 3683623 3817261
57108C817261J51451J73592K00044K31711K70423L17472L73533M40084N19675
$$ 3817261 3968712 4142304 4342348 4574059 4844482 5161954 5535487 5975571 6495246
57099F495246O15044P28791Q62864J016700J186624J368694J561610J765694J980260
$$ 6495246 7110290 7839081 8701945 9718645 10905269 12273963 13835573 15601267 17581527
57090A7581527K202665K426653K638597K817638K942603K996913K965941K837716
$$ 17581527 19784192 22210845 24849442 27667080 30609683 33606596 36572537 39410253
57082C9410253K614748K320157J979941J598816J163980O73169J46021l95932
$$ 39410253 42025001 44345158 46325099 47923915 49087895 49761064 49907085 49511153
57074D9511153r44935j490874k000214k427660k747872k964742l091112l131828
$$ 49511153 48566218 47075344 45075130 42647470 39899598 36934856 33843744 30711916
57066C0711916l088718k970826k793185k571221k320927k059997j803901j562525
$$ 30711916 27623198 24652372 21859187 19287966 16967039 14907042 13103141 11540616
57058A1540616j342413j149066r84709q46579p30183o32659n51748m84000m26047
$$ 11540616 10198203 9049137 8064428 7217849 6487666 5855007 5303259 4819259 4393212
57049D393212l76115l32952k94867k60917k31471k06508j84847j65829j49945
$$ 4393212 4017097 3684145 3389278 3128361 2896890 2690382 2505535 2339706 2189761
57040B189761j36993j25381j14182j04150r5707q7735p9318p1072o3534n5817
$$ 2189761 2052768 1927387 1813205 1709055 1613348 1525613 1446295 1375223 1311689 1255872
57030A255872m7200l8595l1076k4016j6052o916K945J3775K5968L8491M9140N6342
$$ 1255872 1208672 1170077 1139001 1114985 1098933 1092017 1094962 1108737 1134705 1173196 1222336 1278678
57018A278678N9527N7359M6670K4527p857m3605p3608r2180r9359r8177r1280
$$ 1278678 1338205 1395564 1442234 1466761 1458904 1415299 1341691 1249511 1150152 1051975 960695
57007I60695q0699o9028n8613m9951m2313l5600l0315k6200k2420j8963j6424
$$ 960695 879996 810968 752355 702404 660091 624491 594176 567976 545556 526593 510169
56996E10169j4637j2852j1039r673q438o580m351k651j269R59M270P628J0283
$$ 510169 495532 482680 471641 461968 453530 446950 442599 439948 438679 439638 443908 451536 461819
56983D61819J2250J3186J2240R131M309j938r150j5706j9732k1058k0933j9857
$$ 461819 474069 487255 499495 508626 512935 510997 501847 486141 466409 445351 424418 404561
56971D04561j7331j3633j0132p475n061k545l39J652M200P347J0381J3402J7258
$$ 404561 387230 373597 363465 355990 350929 348384 348045 349697 353897 361244 371625 385027 402285
56958D02285K1512K4249K4498K3102K0478J5297O565m353j4845k3144k8436l0134
$$ 402285 423797 448046 472544 495646 516124 531421 537986 533633 518788 495644 467208 437074
56946D37074k8374k4507k0069j5679j1414p516m049n55L309P287J1127J5042J9177
$$ 437074 408700 384193 364124 348445 337031 329515 325466 324911 328220 335507 346634 361676 380853
56933C80853K3307K7166L0496L2428L1643K7385J9755R037m097j7584k8400l4706
$$ 380853 404160 431326 461822 494250 525893 553278 573033 582070 577973 560389 531989 497283
56921D97283l6912l6407l4087l0510k6446k2625j9310j6471j3932j1397q856o910
$$ 497283 460371 423964 389877 359367 332921 310296 290986 274515 260583 249186 240330 233420
56909B33420n999n555m705l576k877k488j633k66R09J779K869M143N085N952P536
$$ 233420 227421 221866 217161 213585 210708 208220 206587 206321 207230 209009 211878 216021 221106 227058 234594
56894B34594R620J1160J2138J3754J6491J9431K1828K3905K5687K6406K5507K3012
$$ 234594 244214 255374 267512 281266 297757 317188 339016 362921 388608 415014 440521 463533
56882D63533J8569J1546K515o617j4220j9576k1983k0959j7672j4314j1552q054
$$ 463533 482102 493648 496163 489546 475326 455750 433767 412808 395136 380822 369270 361216
56870C61216l038K498P666J2927J8661K4231K9481L5505M2798N0011N5546N8988
$$ 361216 358178 360676 368342 381269 399930 424161 453642 489147 531945 581956 637502 696490
56858F96490N9864N6416M6908L1364J1339j0727l1162m5776n2449n2366m7983
$$ 696490 756354 812770 859678 891042 902381 891654 860492 814716 762267 709901 661918
56847F61918m0878l2114k2887j3567l435P527J7852K6697L5299M5153N6125O7564
$$ 661918 621040 588926 566039 552472 549037 556564 574416 601113 636412 681565 737690 805254
56835H05254P9526R1188R9472J01140R5145Q1218N7780K4141j5524n2904q0799
$$ 805254 884780 975968 1075440 1176580 1271725 1352943 1410723 1434864 1419340 1366436 1285637
56824A285637r6649j01626r8386q9913p8669o5838n1873l7680k4455j2550j428
$$ 1285637 1188988 1087362 988976 899063 820394 754556 702683 665003 640548 627998 626570
56813F26570R288J9663L0092M1108N2398O2597P0062P3278P0735O1095M3744J9207
$$ 626570 635858 655521 685613 726721 779119 841716 911778 985056 1055791 1116886 1160630 1179837
56801A179837j0266m0278o5287q1188q7132q4939p7359o7084n6231m5824l6003
$$ 1179837 1169571 1129293 1064006 982818 895686 810747 733388 666304 610073 564249 528246
56790E28246k6936j8959j1721m305L392J0469J6635K2812K9347L4887L7816L7657
$$ 528246 501310 482351 470630 466325 469717 480186 496821 519633 548980 583867 621683 659340
56778F59340L4132K6100J2914l823k0926l5571m5936n1077n1395m8680m4683m0063
$$ 659340 693472 719572 732486 728663 707737 672166 626230 575153 523758 475078 430395 390332
56766C90332l5130l0543k6480k2258j7763j4189j2289j1032r236p405o585o405
$$ 390332 355202 324659 298179 275921 258158 243969 231680 220648 211412 204007 197422 191017
56754A91017n742m600l791l380k880k427k403k407j915j485j936k759k686j543
$$ 191017 185275 180675 176884 173504 170624 168197 165794 163387 161472 159987 158051 155292 152606 151063
56740A51063l11L26M42J75l22n08q5L39N6o25q50m45J44O06P84M97Nl6L88N85
$$ 151063 150752 151078 151520 151695 151373 150865 150780 151119 151175 150550 149700 149255 149399 150005 150789 151286 151291 151255 151643 152228
56720A52228N42J154K329K485R77n27m73K42Qq48r87m59j55J41J080J979J769
$$ 152228 152770 153924 156253 158738 159715 159188 158715 158957 158965 158117 157130 156671 156516 156657 157737 159716 161485
56703A61485J063J203J875J699P07K04M27M33M4J4L30K44j23N6O82R02P79J029
$$ 161485 162548 163751 165626 167325 168032 168236 168663 169096 169140 169154 169484 169728 169605 169661 170343 171245 172024 173053
56685A73053J414J133O13J031K230K931K932L219L862L772K690J655J249J036
$$ 173053 174467 175600 176213 177244 179474 182405 185337 188556 192418 196190 198880 200535 201784 202820
56671B02820Q50J007J157N92k39j90N73P09p6o87o33o09q96r14n28k71j22K90
$$ 202820 203670 204677 205834 206426 206187 205997 206570 207279 207203 206516 205883 205274 204378 203464 202936 202665 202543 202833
56653B02833L87o33j862j610l50l91k314m089m306l978m162m153l228k230j976
$$ 202833 203220 202587 200725 199115 198765 198374 196060 191971 187665 183687 179525 175372 172144 169914 167938
56638A67938j763q43O3P1l25k99j54m99r20o83J0M89O10N28K01k22k50J06J69
$$ 167938 166175 165332 165395 165466 165141 164842 164688 164189 163269 162586 162596 163085 163695 164223 164424 164202 163952 164058 164227
56619A64227j57P2J335K664K923K260J538J017L85m06r73r99n13K2k3o20q06O6
$$ 164227 164070 164142 165477 168141 171064 173324 174862 175879 176264 175858 174885 173886 173373 173395 173372 172752 171946 172012
56601A72012J136J092J27m50k90k59n64l16P57J655J733J595J764J789J246N64
$$ 172012 173148 174240 174367 173917 173627 173368 172804 172488 173245 174900 176633 178228 179992 181781 183027 183591
56585A83591J97j1j60P7O47R32Q21R57J584K080K029J825J880K100K373K772L143
$$ 183591 183788 183777 183617 183694 184341 185273 186094 187051 188635 190715 192744 194569 196449 198549 200922 203694 206837
56568B06837L378M030N583P334Q199Q495R502J1356J2975J4092J5582J7547J8718
$$ 206837 210215 214245 219828 227162 235361 243856 253358 264714 277689 291781 307363 324910 343628
56555C43628J8161J6053J2555P686K703l73j230j637k734l674l612l274l563m199
$$ 343628 361789 377842 390397 398083 400786 400413 399183 397546 394812 391138 387526 384252 380689 376490
56541C76490m684n255n944o078n579n419o004o388n962n527n846o441o649o664
$$ 376490 371806 366551 360607 354529 348950 343531 337527 331139 325177 319650 313804 307363 300714 294050
56527B94050o646o096m977m247m436m849m872m894n205n264m800m359m149l534
$$ 294050 287404 281308 276331 272084 267648 262799 257927 253033 247828 242564 237764 233405 229256 225722
56513B25722k394j630j662j785j659j961k836l225k599j879j820j898j639j568
$$ 225722 223328 221698 220036 218251 216592 214631 211795 208570 205971 204092 202272 200374 198735 197167
56499A97167j967k179j936j878j961j062Q60K044J492N63P05J288J102M46K28
$$ 197167 195200 193021 191085 189207 187246 186184 187044 189088 190580 191143 191848 193136 194238 194684 194912
56484A94912L16K60M94J363K092J924J255N77m17j585j701k39J451K015J811J684
$$ 194912 195228 195488 195982 197345 199437 201361 202616 203193 202776 201191 199490 199251 200702 202717 204528 206212
56468B06212J451Q87P14J296J682J246Q47J077R83n6p83r6R10P21j41k20M68R48
$$ 206212 207663 208550 209264 210560 212242 213488 214335 215412 216395 216339 215556 215460 216370 217091 216950 216730 217198 218146
56450B18146J086J230J099O36Q25K063K929K207R26O20Q06J17j203j869j754j549
$$ 218146 219232 220462 221561 222197 223022 225085 228014 230221 231147 231767 232573 232690 231487 229618 227864 226315
56434B26315j140j69N56J39o73o08l2k38j184j701j429r73o45m28n68r36o50M82
$$ 226315 225175 225006 225562 225701 225028 224420 224388 224150 222966 221265 219836 218863 218218 217790 217222 216286 215636 216118
56416B16118J185O36q3J22M20k03p50J92J817K313J699J304J243O91k3J80J030
$$ 216118 217303 217939 217856 217978 218398 218195 217445 217637 219454 221767 223466 224770 226013 226704 226681 226861 227891
56399B27891J364J233J580K220K071J121L53lm23p23l89J39J04o7N16J588K274
$$ 227891 229255 230488 232068 234288 236359 237480 237833 237830 237407 236684 236295 236434 236538 236471 236987 238575 240849
56382B40849K628L035K861J486p6l42M08Q80R75J477K165K198J855K011K335J868
$$ 240849 243477 246512 249373 250859 250783 250441 250849 251729 252704 254181 256346 258544 260399 262410 264745 266613
56366B66613R44P06J136J199O42N5l74o92m10O57J546J570J567K268K654J748
$$ 266613 267557 268263 269399 270598 271240 271295 270921 270229 269819 270476 272022 273592 275159 277427 280081 281829
56350B81829O90R13J553J002j25j36N66K89p04n78Q08J727J624J782K882M141
$$ 281829 282519 283432 284985 285987 285862 285726 286292 286581 285877 285299 286107 287834 289458 291240 294122 298263
56334B98263M945N473N677N424N335N864O030M847L188K428K178J437R26J790
$$ 298263 303208 308681 314358 319782 325117 330981 337011 341858 345046 347474 349652 351089 352015 353805
56320C53805K965K492P35l73o31j324k318k261j335r21q70Q0J433J484N68Q16
$$ 353805 356770 359262 359997 359624 358993 357669 355351 353090 351755 350834 349964 350044 351477 352961 353529 354345
56304C54345K579M027M401M845N741O093N955O716Q412R216Q132O021L699J305
$$ 354345 356924 360951 365352 370197 375938 382031 387986 394702 403114 412330 420462 426483 430182 431487
56290D31487l09L9J784L045L292L555M106M245M243N098O440P075P336Q456R847
$$ 431487 431178 431217 433001 436046 439338 442893 446999 451244 455487 460585 467025 474100 481436 489892 499739
56275D99739R765Q530Q277R499J0652J1212J2259J3881J4923J5519J7113J9639
$$ 499739 509504 518034 526311 535810 546462 557674 569933 583814 598737 614256 631369 651008
56263F51008K1444K2305K3791K6427K9195L2037L6106M1298M6247N1012N7083
$$ 651008 672452 694757 718548 744975 774170 806207 842313 883611 929858 980870 1037953
56252A037953O4601P2216P9702Q7926R6338J03455J09734J16795J23919J28551
$$ 1037953 1102554 1174770 1254472 1342398 1438736 1542191 1651925 1768720 1892639 2021190
56242B021190J30290J30840J30015J25471J16753J05828R3190P7191N7871L7692
$$ 2021190 2151480 2282320 2412335 2537806 2654559 2760387 2853577 2930768 2988639 3026331
56232C026331J7707l303k5040m4758o1138p5523q8337r7890j03800j08016j11238
$$ 3026331 3044038 3040735 3015695 2970937 2909799 2834276 2745939 2648049 2544249 2436233 2324995
56221B324995j11917j09838j07122j04465j00035r3416q7040q2320p7836p2738
$$ 2324995 2213078 2103240 1996118 1891653 1791618 1698202 1611162 1528842 1451006 1378268
56211A378268o8402o5284o1632n6859n2734m9831m6272m1459l7462l5140l2555
$$ 1378268 1309866 1244582 1182950 1126091 1073357 1023526 977254 935795 898333 863193 830638
56200H30638k8804k5700k3955k1508j7579j4654j4188j3940j1836r197p902p408
$$ 830638 801834 776134 752179 730671 713092 698438 684250 670310 658474 649277 641375 633967
56188F33967o758o460o396m970k227p33j546k445j839j062j091n61J043J790R35
$$ 633967 627209 620749 614353 609383 607156 606423 604877 602432 600593 599531 598440 597879 598922 600712 601647
56173F01647O39K088L381L275L356M454M723L479L119M856O354O053N954P613
$$ 601647 602286 604374 607755 611030 614386 618840 623563 627042 630161 635017 641371 647424 653378 660991
56159F60991R185R235R594J1664J3629J4226J5526J8932K2198K3547K5081K8899
$$ 660991 670176 679411 689005 700669 714298 728524 744050 762982 785180 808727 833808 862707
56147H62707L3407L6833M0907M7606N5526O2807P0538Q0041Q9904R8700J07338
$$ 862707 896114 932947 973854 1021460 1076986 1139793 1210331 1290372 1380276 1478976 1586314
56136A586314J15753J20763J20325J16493J11059J02163Q8635P3995O2346N3616
$$ 1586314 1702067 1822830 1943155 2059648 2170707 2272870 2361505 2435500 2497846 2551462
56126B551462M6195M0596L6725L1151K1244R023k530j3693k5134l4708m1145m7593
$$ 2551462 2597657 2638253 2674978 2706129 2727373 2736396 2733866 2720173 2695039 2660331 2619186 2571593
56114B571593n7461o9815q2403r5630j09527j20432j24926j24058j19907j11543
$$ 2571593 2514132 2444317 2361914 2266284 2156757 2036325 1911399 1787341 1667434 1555891
56104A555891r8360q3825p1605o1063n0474m1158l4485k8468k1548j6092j4030
$$ 1555891 1457531 1373706 1302101 1241038 1190564 1149406 1114921 1086453 1064905 1048813 1034783
56093A034783j2785r723o765o151n662k803K54P21L94J959L886L892L717N602
$$ 1034783 1021998 1012275 1005510 999359 993697 990894 991148 991869 992263 994222 998108 1002000 1005717 1011319
56079A011319P698P818P820R558J0640R128Q063J0153J2462J1756J0536J2096
$$ 1011319 1019017 1026835 1034655 1044213 1054853 1063981 1072044 1082197 1094659 1106415 1116951 1129047
56067A129047J4243J3856J3075J4888J7023J6491J5625J7331J8992J7542J5799
$$ 1129047 1143290 1157146 1170221 1185109 1202132 1218623 1234248 1251579 1270571 1288113 1303912
56056A303912J7031J8184J5660J2788J4036J6666J5998J4224J5802J8640J8259
$$ 1303912 1320943 1339127 1354787 1367575 1381611 1398277 1414275 1428499 1444301 1462941 1481200
56045A481200J6489J7572J9783J9382J8750K1899K6000K6176K4742K6800L0638
$$ 1481200 1497689 1515261 1535044 1554426 1573176 1595075 1621075 1647251 1671993 1698793 1729431
56034A729431L1537L1114L3686L7334L7770L7129L9643M2795M2171M0686M3198
$$ 1729431 1760968 1792082 1825768 1863102 1900872 1938001 1977644 2020439 2062610 2103296 2146494
56023B146494M6579M5330M2374M3838M7708M8489M8326N2315N7590N8687N8829
$$ 2146494 2193073 2238403 2280777 2324615 2372323 2420812 2469138 2521453 2579043 2637730 2696559
56012B696559O3984P0699P2320P2225P7799Q6268R0048R1243R6828J04295J06732
$$ 2696559 2760543 2831242 2903562 2975787 3053586 3139854 3229902 3321145 3417973 3522268 3629000
56001C629000J07408J14297J24697J30585J34480J44126J56381J63029J67686
$$ 3629000 3736408 3850705 3975402 4105987 4240467 4384593 4540974 4704003 4871689
55992D871689J79661J95856K06708K15148K31007K51544K67044K80789L03132
$$ 4871689 5051350 5247206 5453914 5669062 5900069 6151613 6418657 6699446 7002578
55983G002578L30810L53410L75191M08198M49050M86007N23600N75346O37791
$$ 7002578 7333388 7686798 8061989 8470187 8919237 9405244 9928844 10504190 11141981
55974A1141981O98385P63273Q49012R52551J059869J178758J330842J516998J725782
$$ 11141981 11840366 12603639 13452651 14405202 15465071 16643829 17974671 19491669 21217451
55965B1217451J970674K282065K668852L129322L694171M413645N306918O372229
$$ 21217451 23188125 25470190 28139042 31268364 34962535 39376180 44683098 51055327
55957E1055327P641233R169882J0980905J3071145J5465532J8203439K1296849
$$ 51055327 58696560 67866442 78847347 91918492 107384024 125587463 146884312
55950A46884312K4772123K8667181L2774308L6342307L8226152L7439455L3441689
$$ 146884312 171656435 200323616 233097924 269440231 307666383 345105838 378547527
55943C78547527K5908015J4670472L68669j4911362k8165640l7026274m0891543
$$ 378547527 404455542 419126014 419494683 404583321 376417681 339391407 298499864
55936B98499864m0686844l7846443l3610010k8898410k4345597k0275807j6767654
$$ 298499864 257813020 219966577 186356567 157458157 133112560 112836753 96069099
55929I6069099j3814809j1399088r453024p866941o563300n511513m670819l978186
$$ 96069099 82254290 70855202 61402178 53535237 46971937 41460424 36789605 32811419
55921C2811419l396539k922213k539290k211733j923782j685584j494072j325854
$$ 32811419 29414880 26492667 23953377 21741644 19817862 18132278 16638206 15312352
55913A5312352j171883j043652r41167q47201p56805o82230o25015n71252n17497
$$ 15312352 14140469 13096817 12155650 11308449 10551644 9869414 9244399 8673147 8155650
55904H155650m74794m43916m11849l75745l46530l25871l02518k74412k52415
$$ 8155650 7680856 7236940 6825091 6449346 6102816 5776945 5474427 5200015 4947600
55895D947600k38844k23262k02806j86764j77597j66496j51215j40103j34952
$$ 4947600 4708756 4485494 4282688 4095924 3918327 3751831 3600616 3460513 3325561
55886C325561j27171j14471j04806j00380r3739q2945p5173p2046o6369n6713
$$ 3325561 3198390 3083919 2979113 2878733 2784994 2702049 2626876 2554830 2488461 2431748
55876B431748n0742n0780n0119m6988m8371n6265o3261o5448o7307p0443o9636
$$ 2431748 2381006 2330226 2280107 2233119 2184748 2128483 2065222 1999774 1932467 1862024 1792388
55865A792388o3789n9127n7845n4594m7574m2303m1079l9196l4842l2598l3916
$$ 1792388 1728599 1669472 1611627 1557033 1509459 1467156 1426077 1386881 1352039 1319441 1285525
55854A285525l3943l0866k8950k9533k8408k4779k3427k5380k5603k2643k1355
$$ 1285525 1251582 1220716 1191766 1162233 1133825 1109046 1085619 1060239 1034636 1011993 990638
55843I90638k3344k3784k0667j8379j9061j8936j6230j4586j5554j5495j2839
$$ 990638 967294 943510 922843 904464 885403 866467 850237 835651 820097 804602 791763
55832G91763j0952j1241j0768q933q975j0879j0342o929n492p559r037q469r399
$$ 791763 780811 769570 758802 749869 740894 730015 719673 712744 707252 699693 690656 682187 672788
55819F72788j2416j3082j0391r127j0968j1294p975n353o022o381m022k148k715
$$ 672788 660372 647290 636899 627772 616804 605510 597535 592182 586160 579779 575757 573609 570894
55806E70894k337R71L709L553L687O510R150R158Q808R853R677O520L110J543
$$ 570894 568557 569528 573237 576790 580477 586987 596137 605295 614103 623956 633633 640153 643263 644806
55792F44806k91l823o602p269q349j0942j1990j0089q623r686j0216p797n115
$$ 644806 644515 640692 634090 626821 618472 607530 595540 585451 576828 567142 556926 549129 544014
55779E44014m938n622n225n292o797o901l536J001M393P972J2725J6097J6203
$$ 544014 539076 533454 528229 522937 516140 509239 505703 506704 511097 519069 531794 547891 564094
55766E64094J5010J3945J0525K976n825j2437j7091k0686k1588j8958j5684j4485
$$ 564094 579104 593049 603574 606550 600725 588288 571197 550511 528923 509965 494281 479796
55754D79796j4352j3671j3386j4241j4501j3343j2913j4201j4617j2452r961r079
$$ 479796 465444 451773 438387 424146 409645 396302 383389 369188 354571 342119 332158 323079
55742C23079p996n093k420j903j765j71J118J79j286j098m48j224k446k624k800
$$ 323079 315083 309990 307570 305667 303902 303731 304849 305028 303742 302644 302196 300972 298526 295902 293102
55727B93102m141n238m842m481n460o103m872l378l311l285j721m1Q9l7J316L122
$$ 293102 288961 283723 278881 274400 268940 262837 257965 254587 251276 247991 246270 246229 246318 246281 247597 250719
55711B50719L913M672O613Q452Q694Q187P826O268K600j272l470m892o683p711
$$ 250719 254632 259304 265917 274369 283063 291250 299076 305344 307944 306672 303202 298310 291627 283916
55697B83916p063o329o759o902n599m492m901n115l569j819j534j419m3J150P73
$$ 283916 276853 270524 263765 256863 251264 246772 241871 236756 233187 231368 229834 228415 228372 229522 230295
55682B30295N45K245M322M754M636N627O373M966K564J212K88j533l005k474j220
$$ 230295 230840 233085 237407 242161 246797 252424 258797 263763 266327 267539 267827 266294 263289 260815 259595
55667B59595j280j876j293l78q30j781j400j94L59P72K110L320L046K421L055
$$ 259595 258315 256439 255146 254768 253938 252157 250757 250563 250922 251694 253804 257124 260170 262591 265646
55652B65646L963L421K176J836J846R48j26l32p91k647m344m159l534m714o907
$$ 265646 269609 273030 275206 277042 278888 279836 279710 279378 278587 275940 271596 267437 263903 259189 252282
55637B52282p992q182q691q632o772m656m430n054m223k580k356l164k916j773
$$ 252282 244290 236108 227417 218785 212013 207357 202927 197873 193650 191070 188714 185550 182634 180861
55623A80861j508j883j216J52M33l09o18o39j494k527k330j676k246l285k837
$$ 180861 179353 177470 176254 176406 176839 176530 175912 175273 173779 171252 168922 167246 165000 161715 158878
55608A58878j398j086j823j772r06q11j373j036k6q2j144j403n08J77K85O05Q29
$$ 158878 157480 156394 154571 152799 151893 151082 149709 148673 148647 148565 147421 146018 145510 145687 145972 146577 147406
55591A47406j0j167j029j08l00j539j975j315j046j432j107K45J460K109K744
$$ 147406 147396 146229 145200 145092 144792 143253 141278 139963 138917 137485 136378 136623 138083 140192 142936
55576A42936L062K296J274J641L139M068M168M595N387N439M825M613M554L437
$$ 142936 145998 148294 149568 151209 154348 158416 162584 167179 172566 178005 182830 187443 191997 195434
55562A95434J541L31r5q77j977k347k226k786l730l753l121l250l967l789k731
$$ 195434 196975 197306 197211 196334 194357 192010 189784 186998 183268 179515 176394 173144 169177 165388 162657
55547A62657k182k165j391o0J30j005j691j059j11L87P35Q55K23o39o18k2n7n60
$$ 162657 160475 158310 156919 156859 156989 155984 154293 153234 153123 153510 154245 155100 155323 154684 154066 154044 153987 153427
55529A53427l32M71N53j89q02j371k617l701l105j406o30r38o74M22Q58L20J18
$$ 153427 153095 153566 154119 153930 153128 151757 149140 145439 142334 140928 140298 139360 138686 139108 139966 140286 140404
55512A40404M44o0j614k681k475j777j003J45J041O06m13k14R32R33n44j555j234
$$ 140404 140848 140788 139174 136493 134018 132241 131238 131383 132424 133030 132617 132403 133335 134268 133724 132169 130935
55495A30935q40r99p81j27l76j514j712n18J38q00j815j523o89l17Q8J071J967
$$ 130935 130095 129096 128315 128188 127812 126298 124586 124068 124206 123406 121591 120068 119379 119062 119150 120221 122188
55478A22188K162J979J478K44j086j065J67P64R7m90l67o85j790k115q83L47J45
$$ 122188 124350 126329 127807 128051 126965 125900 126067 126831 126928 126438 126071 125386 123596 121481 120598 120945 121090
55461A21090p21j041r93j048p78j01j5q78j539j240q35j018j045l12M00L90K83
$$ 121090 120369 119328 118335 117287 116509 116408 116393 115515 113976 112736 111901 110883 109838 109526 109926 110316 110599
55444A10599O99J047P26K83L27N13M59M64O14M32RJ55Q77J152O74L19M01J56n03
$$ 110599 111298 112345 113071 113354 113681 114194 114653 115117 115731 116163 116172 116327 117204 118356 119030 119349 119750 119906 119403
55425A19403n41K59P61M99M10P85N09p39j507q98%J26J32P84J365J030L52K07
$$ 119403 118862 119121 119882 120381 120791 121576 122085 121346 119839 118941 118941 119067 119199 119983 121348 122378 122730 122937
55407A22937L84L90L73L07m34j689k133j231k20j78n00k76J99L05K02M3n59j421
$$ 122937 123321 123711 124084 124391 123957 122268 120135 118904 118684 118506 118006 117730 117929 118234 118436 118479 117920 116499
55389A16499j433k46R71J251R81O40l3q37p02N40J512J361R63J097J090L39m12
$$ 116499 115066 114820 115791 117042 118023 118663 118630 117793 117091 117631 119143 120504 121467 122564 123654 123993 123581
55372A23581m55k79k65J94J158J316l7j660k251k185k230k064j378r86j403j718
$$ 123581 123126 122847 122582 122776 123934 125250 125213 123553 121302 119117 116887 114823 113445 112459 111056 109338
55356A09338j142m09l11l10J52L90j54o38l27N1k11m52j44j34q85j116O5J287
$$ 109338 108196 107787 107476 107166 107318 107708 107554 106916 106589 106640 106429 105977 105833 105699 104814 103698 103763 105050
55338A05050J102M87J071K171J959N66l20k65k30m31k00K81Q7p14j099p74l27
$$ 105050 106152 106639 107710 109881 111840 112406 112086 111821 111591 111160 110960 111241 111328 110614 109515 108741 108414
55321A08414L4N36Q71M99k56o36o19o16m79P5N51L90N1K30O01M89J21K1j38p82
$$ 108414 108448 108984 109855 110354 110098 109462 108843 108227 107748 107823 108374 108764 108815 109045 109646 110135 110256 110277 110139 109357
55301A09357j246p60M6N6m66m40Q4J36l24l90J24M25J64m8L28J200K184K735K277
$$ 109357 108111 107351 107397 107453 106987 106547 106631 106767 106443 106053 106177 106602 106766 106718 107046 108246 110430 113165 115442
55282A15442R33k33o07j001k310l806l961k468l87J291K123J848P53n0J74P17
$$ 115442 116375 116142 115535 114534 112224 108418 104457 101989 101602 102893 105016 106864 107617 107567 107741 108458
55266A08458N76P0J29O06O24J78l8Oj85l99n4M85K62n95q91p5J121J865J965J481
$$ 108458 109034 109104 109233 109839 110463 110641 110603 110609 110424 110025 109971 110456 110718 110123 109232 109157 110278 112143 114108 115589
55246A15589N26l94o82l66O0L37M31J48m57p73m41j41o47j534j702r17%L36O1
$$ 115589 116115 115721 115039 114673 114733 115070 115501 115649 115192 114419 113978 113837 113190 111656 109954 109037 109037 109373 109434
55227A09434m53o32J1J157J735J253M55P3j96p07q14K9R70Q34q6o18m61j76J34
$$ 109434 108981 108349 108360 109517 111252 112505 112960 113033 112837 112130 111316 111345 112315 113149 113063 112445 111984 111808 111942
55208A11942P57J306J061K02l55k59O7K31Q0n15j204j092K3R71Q03K37L66P54
$$ 111942 112699 114005 115066 115268 114913 114654 114721 114952 115032 114517 113313 112221 112244 113215 114018 114255 114621 115375
55190A15375L34m90m04N67J137R20Q31J178J031j29j463j944j571r80o43o27o13
$$ 115375 115709 115219 114815 115382 116519 117439 118270 119448 120479 120350 118887 116943 115372 114392 113749 113122 112509
55173A12509j77N29O88M2m51L0Q00Q09M11O95J514J623O67m29r68j057p23K30
$$ 112509 112332 112861 113549 113591 113140 113170 113970 114779 115190 115885 117399 119022 119689 119260 118292 117235 116512 116742
55155A16742J326J556O43p09j773k241j874p52L00M86J41J58N82P47M65J08k37
$$ 116742 118068 119624 120267 119558 117785 115544 113670 112918 113218 113704 113845 114003 114585 115332 115797 115905 115668
55138A15668o34o54l0N35L00j40K48J062R94j0o76l85K40O81J070J240P27j38
$$ 115668 115034 114380 114350 114885 115185 115045 115293 116355 117349 117339 116663 116278 116518 117199 118269 119509 120236 120098
55120A20098m47j60r2l89k75M96J211J404J317J046M40j04N4O23P66O33J118K023
$$ 120098 119651 119491 119399 119010 118735 119231 120442 121846 123163 124209 124649 124545 124599 125222 125988 126621 127739 129762
55102A29762K024P96l90o01m25o16r07q26n83m57k35J76M27M17M85O41M70O7M1
$$ 129762 131786 132582 132192 131591 131166 130550 129643 128817 128234 127777 127542 127718 128145 128562 129047 129688 130158 130225 130266
55083A30266L74K52n57j254j237q61n57k12K42M81M84O72J031R73L83n9Q9M40
$$ 130266 130640 130892 130335 129081 127844 126983 126426 126214 126456 126937 127421 128093 129124 130097 130480 130421 130510 130950
55065A30950N13K82j62o77p77j73L84j16j318j821j240o17n69m29K81R05Q76O48
$$ 130950 131463 131745 131583 130906 130129 129956 130340 130224 128906 127085 125845 125228 124659 124230 124511 125416 126292 126940
55047A26940O89N46k10r98r71j35Q30J312J046K30l06J19R49R23j20r99j010p77
$$ 126940 127629 128175 127965 126967 125996 125861 126691 128003 129049 129279 128973 129092 130041 130964 130844 129845 128835 128058
55029A28058r45j108o67J87R80J546J691J090J1p76j127j611k140j755k85R80
$$ 128058 127113 126005 125338 125525 126505 128051 129742 130832 130843 130067 128940 127329 125189 123434 123149 124129
55013A24129J014L66j0j39l79l89J58O44L49l17l72L71J253J720J660J227Q09
$$ 124129 125143 125509 125499 125360 124981 124592 124750 125394 125743 125426 125054 125425 126678 128398 130058 131285 132094
54996A32094P96J001Q87O07R62J935K258J179l13q70o33o09r26p44K34J273J560
$$ 132094 132890 133891 134778 135385 136347 138282 140540 141719 141406 140536 139903 139294 138368 137624 137858 139131 140691
54979A40691J022J64l98l52O1L06K15O9j7k71o51o95k94%j78m06j33N61J195J507
$$ 140691 141713 141877 141479 141127 141188 141494 141709 141778 141761 141490 140839 140144 139850 139850 139672 139266 139133 139694 140889 142396
54959A42396J479J238J068J078P92k65j546j877j092l55n10j030j020m80RJ02
$$ 142396 143875 145113 146181 147259 148051 147786 146240 144363 143271 142916 142406 141376 140356 139876 139885 139987
54943A39987k14p65j025n13L61O39K27P1N62Q74L72l12l41J55O89J315K125K716
$$ 139987 139773 139008 137983 137470 137831 138470 138697 138768 139330 140204 140576 140264 139923 140078 140767 142082 144207 146923
54925A46923K927L355M333N114M927M208L943M402N254O265P038O736N012K777
$$ 146923 149850 153205 157538 162652 167579 171787 175730 180132 185386 191651 198689 205425 210437 213214
54911B13214J111j55j921m232o152o959o747o005n219m707m374l798k930k306
$$ 213214 214325 214170 212249 208017 201865 194906 188159 182154 176935 172228 167854 164056 161126 158820
54897A58820k219k204j724q56Q8R59J394Q47m29j230r11k51p8Q3J076K523L344
$$ 158820 156601 154397 152673 151817 151905 152864 154258 155105 154676 153446 152535 152284 152206 152289 153365 155888 159232
54880A59232L381L389L738M121M423M885N495N965O254O401N996M533K237o9j836
$$ 159232 162613 166002 169740 173861 178284 183169 188664 194629 200883 207284 213280 217813 220050 219981 218145
54865B18145l104m133n125o116o794o683n863n051m647m225l443k748k623k694
$$ 218145 215041 210908 205783 199667 192873 186190 180327 175276 170629 166404 162961 160213 157590 154896
54851A54896k384j866j619j490j000l02J6j88n89r61j169r43l29m8o50j638k098
$$ 154896 152512 150646 149027 147537 146537 146235 146251 146063 145474 144513 143344 142401 142072 142024 141374 139736 137638
54834A37638j918j653j498j128m30L30R11J137P48j61q43o29K11Q62R72P25K49
$$ 137638 135720 134067 132569 131441 131011 131341 132252 133389 134137 133976 133133 132504 132715 133577 134549 135274 135523
54817A35523m05r37j038p82l54L35J241J824J673J153Q85R01Q94Q96J093J308
$$ 135523 135118 134181 133143 132361 132007 132342 133583 135407 137080 138233 139118 140019 140913 141809 142902 144210
54801A44210J339J402J603J441N67l93n82j56P1o6n1K37L60J40j04j86k48l26
$$ 144210 145549 146951 148554 149995 150562 150169 149587 149431 149502 149436 149385 149622 149982 150122 150018 149832 149584 149258
54783A49258l44m22o45o21R6J267K220K605K445J681M82l17J31J600L116M196
$$ 149258 148914 148492 147847 147226 147322 148589 150809 153414 155859 157540 158022 157705 157836 159436 162552 166748
54767A66748N106N936O348O320O382O831P271P142O321N027L475J777n3k117m408
$$ 166748 171854 177790 184138 190458 196840 203671 210942 218084 224405 229432 232907 234684 234631 232514 228106
54752B28106o588q111q581p935o562n184m322l765l008k173j819j803j273j64
$$ 228106 221518 213407 204826 196891 190329 185145 180823 177058 174050 171877 170058 168255 166982 166818
54738A66818M06k11j089j126o22m32m13R5Q34J042R07J314K330L174L619M152
$$ 166818 167224 167013 165924 164798 164176 163744 163331 163426 164260 165302 166209 167523 169853 173027 176646 180798
54722A80798M786M925M625M784N609N980M888K770Q15m73j465k566l760m816n642
$$ 180798 185584 190509 195134 199918 205527 211507 216395 219165 219980 219507 218042 215476 211716 206900 201258
54707B01258o267o637o494n650m397l311k614k046j512j305j450j500j257j113
$$ 201258 194991 188354 181860 176210 171813 168502 165888 163842 162330 161025 159575 158075 156818 155705
54693A55705j199r71j94M21K83q0K5K20k15r63j166r40j130j784k051j600j028
$$ 155705 154506 153535 153341 153762 154045 153965 153990 154210 153995 153032 151866 150926 149796 148012 145961 144361 143333
54676A43333p88n91j53L19O00P52Q74R68J036R11K42q51j539j246m94p0J48P10
$$ 143333 142545 141954 141801 142120 142720 143472 144346 145314 146350 147261 147503 146652 145113 143867 143373 143303 143451 144161
54658A44161J351J279M26m64q56o62J20J111J298J16j388j704q52q2J22M01R11
$$ 144161 145512 146791 147217 146753 145897 145235 145355 146466 147764 147880 146492 144788 143936 143854 143976 144377 145288
54641A45288R32L28O5O85J333R64k90j437j789j371p13m52o98p89j12R43J443
$$ 145288 146220 146548 146613 147298 148631 149595 149305 147868 146079 144708 143995 143543 142845 142056 141944 142887 144330
54624A44330J125N03k4l50k25M16R02N46k63o17n04n57o18J10J433K086J482L95
$$ 144330 145455 145958 145934 145584 145359 145775 146677 147223 146960 146343 145839 145282 144664 144774 146207 148293 149775 150170
54606A50170l52p37q55m95J79N11L09K4j06k62l00J08N47K58m58m93K42N77ko18
$$ 150170 149818 149081 148226 147731 147910 148421 148730 148754 148648 148386 148086 148194 148741 148999 148541 148048 148290 148867 148865 148247
54586A48247o28n00n22r0R20J416P07l26o41n40p40r67o36j12r2l41j31N06R31
$$ 148247 147619 147119 146597 146507 147427 148843 149550 149224 148583 148043 147303 146336 145700 145588 145496 145155 145024 145530 146461
54567A46461R46P96M91l2l98j85L89Q18R88J024Q96O97Q67J443J610P56l79m94
$$ 146461 147407 148203 148694 148662 148264 148079 148468 149286 150274 151298 152194 152891 153758 155201 156811 157567 157188 156694
54549A56694N76J633J658Q62J64O9L38N23O13R42J453J428M28p87j031k96K24
$$ 156694 157270 158903 160561 161423 161587 161656 161994 162517 163130 164072 165525 166953 167381 166594 165563 165267 165491
54532A65491k01r34j038m47K39N65M08p3m41l55j20k70o34n54j08j83j062j920
$$ 165491 165290 164356 163318 162871 163110 163675 164083 164010 163569 163214 163094 162824 162190 161636 161528 161345 160283 158363
54514A58363k041j608r31J33J406J962J247j6o68l81L76R89R37L2j113j514r91
$$ 158363 156322 154714 153783 153916 155322 157284 158531 158515 157847 157466 157842 158831 159768 159800 158687 157173 156182
54497A56182l31J7M31J066J341J006O60O38L83l83q86n85j65l89q40p94m58l10
$$ 156182 155851 155868 156299 157365 158706 159712 160372 161010 161393 161010 160124 159539 159374 158985 158145 157351 156893 156583
54479A56583r1N04Q82N68L97J401L030L796L361K609K009J233L87K19Q85J510
$$ 156583 156492 156996 157878 158446 158843 160244 163274 167070 170431 173040 175049 176282 176669 176888 177773 179283
54463A79283J285L22p43j370j317q19m99o73q50m98P2J91j39m41o82j100j390
$$ 179283 180568 180890 180147 178777 177460 176641 176142 175469 174619 174121 174193 174384 174245 173804 173122 172022 170632
54446A70632r76r3L40L7l03q9M05O39N82N49O57P24N41J46j68j53M4O4j01j87
$$ 170632 169656 169563 169903 169940 169637 169548 169953 170592 171174 171723 172380 173104 173645 173791 173623 173470 173514 173578 173477 173290
54426A73290k74p44j415j493p57JK08L93J100J718J380M33k8K56N88N46L67K82
$$ 173290 173016 172272 170857 169364 168607 168608 168816 169209 170309 172027 173407 173840 173812 174068 174656 175202 175569 175851
54408A75851K77M60Q41R51M27j94p9O37R95N32k76p77o86P1J201J890J546O94
$$ 175851 176128 176588 177429 178380 178807 178613 178534 179171 180166 180698 180422 179645 178959 179030 180231 182121 183667 184361
54390A84361L87Q04J207J176J028R94Q19L82l1l12p05j243j578j484j082m62L34
$$ 184361 184748 185552 186759 187935 188963 189957 190776 191158 191127 190815 190110 188867 187289 185805 184723 184261 184595
54373A84595R71J003N79L97Q37J588K214K573K588K134J316N42K17N51J537K726
$$ 184595 185566 186569 187148 187545 188382 189970 192184 194757 197345 199479 200795 201337 201554 202105 203642 206368
54357B06368L266K648J297j6j080k066k815l063l087l268l174k118o28j80j194
$$ 206368 209634 212282 213579 213563 212483 210417 207602 204539 201452 198184 195010 192892 192264 192084 190890
54342A90890k290k127j123n71p67q61l06L81M19k44r89j264j070p07k88L15R99
$$ 190890 188600 186473 185350 184779 184012 183151 182845 183226 183645 183401 182412 181148 180078 179371 179083 179398 180397
54325A80397J238O46m73j380j627j290o98k01p2k60l41m0L95N61M65L64K67J0
$$ 180397 181635 182281 181808 180428 178801 177511 176813 176612 176540 176280 175939 175899 176294 176855 177320 177684 177951 177961
54307A77961l41o25r49j433j763j509p98j96N6K14M65O65O62M95J71l35q92j241
$$ 177961 177620 176995 176046 174613 172850 171341 170543 170347 170403 170617 171082 171747 172409 172904 173075 172740 171848 170607
54289A70607j213p09L78J818K896L038K496J952J556Q51l48j480j778j004L60
$$ 170607 169394 168685 169063 170881 173777 176815 179311 181263 182819 183670 183322 181842 180064 179060 179420
54274A79420J464J707J239P32N45L86o2n53p40p40p87o87j83M06O01N26O69J034
$$ 179420 180884 182591 183830 184562 185107 185493 185431 184878 184138 183398 182611 181924 181741 182147 182748 183274 183943 184977
54256A84977J215J136J159J438J748J908J869J528Q87L00M4j88q16j586j848j507
$$ 184977 186192 187328 188487 189925 191673 193581 195450 196978 197865 198165 198209 198021 197205 195619 193771 192264
54240A92264j060q18o75n59m72k16L40P61M81l86j180j551j566j134j10J104J801
$$ 192264 191204 190386 189711 189152 188680 188464 188804 189565 190046 189660 188480 186929 185363 184229 184119 185223 187024
54223A87024J876J745J470P31k60o81k38M25O37M39Q5m64j209j817k047k054j958
$$ 187024 188900 190645 192115 192846 192586 191905 191667 192092 192729 193168 193253 192789 191580 189763 187716 185662 183704
54206A83704j559q06j87j84n81o68n8R06J573J599J172O70K63L2K08Q95J535J273
$$ 183704 182145 181339 181152 180968 180387 179719 179661 180567 182140 183739 184911 185581 185844 185876 186084 186979 188514 189787
54188A89787J50p33n15M34J233J572J576J221O22K62L13K19k86m03N39J745J900
$$ 189787 189937 189204 188689 189123 190356 191928 193504 194725 195347 195609 195922 196141 195855 195452 195991 197736 199636
54171A99636R95J13k61m74n31r8M78L76l10o69m92n50j143j615j563j366j213
$$ 199636 200631 200744 200483 200009 199478 199380 199858 200234 199924 199255 198763 198213 197070 195455 193892 192526 191313
54154A91313p37J2K94j68p06q18q68j192j438j220p51l48o4l3m42q83n65M65J179
$$ 191313 190576 190588 190882 190714 190008 189190 188322 187130 185692 184472 183721 183373 183309 183276 182834 181951 181386 181851 183030
54135A83030R42K47k70o06q92r56p94o39k56Q45K231K586J491J47k36J64N53P27
$$ 183030 183972 184219 183949 183343 182451 181495 180701 180062 179806 180651 182882 185468 186959 187106 186870 187034 187587 188314
54117A88314Q28P66N83O22Q10O04J73N42J920K939K521J446J031J217J200J132
$$ 188314 189142 189908 190491 191113 191923 192527 192700 193242 195162 198101 200622 202068 203099 204316 205516 206648
54101B06648J778K941L565L287K772K651K994L648M205L899K419O05n08j050j848
$$ 206648 208426 211367 214932 218219 220991 223642 226636 230284 234489 238388 240807 241412 240904 239854 238006
54086B38006k903l388l078k721k815k955k657k022j326n78K08P47Q34O34M74O16
$$ 238006 235103 231715 228637 225916 223101 220146 217489 215467 214141 213563 213771 214518 215352 215986 216460 217076
54070B17076J257K390L589M232M113L617L182K760J901L94j287k260k116j401
$$ 217076 218333 220723 224312 228544 232657 236274 239456 242216 244117 244511 243224 240964 238848 237447
54056B37447j040j407k197k904l024k104l24J106J073R8k05P31J837K237K439
$$ 237447 236407 235000 232803 229899 226875 224771 224447 225553 226626 226724 226519 227250 229087 231324 233763
54041B33763L102L815M018M212N101O202O470N907N477N646N986O142O290O594
$$ 233763 236865 240680 244698 248910 254011 260213 266683 272590 278067 283713 289699 295841 302131 308725
54027C08725O825O613N728M277K951K643L317L730K844J184P5l1K36K07l56j565
$$ 308725 315550 322163 327891 332168 335119 337762 341079 344809 347653 348837 348912 348881 349117 349324 348968 347403
54011C47403l230m562m824m292l880l982m322m715n187n451n110m382l918l835
$$ 347403 344173 339611 334787 330495 326615 322633 318311 313596 308409 302958 297848 293466 289548 285713
53997B85713l578k874k152j898k129k604l085l297l074k623k286k075j773j359
$$ 285713 282135 279261 277109 275211 273082 270478 267393 264096 261022 258399 256113 254038 252265 250906
53983B50906r44m82m9j50j078k157k288j362m13l43r94j621j688j098r2Q40J318
$$ 250906 249962 249480 249431 249281 248203 246046 243758 242396 241983 241640 240646 239025 237337 236239 236147 236987 238305
53966B38305J477J744K245K636K597K216J962K438L887N718O858O968O944P679
$$ 238305 239782 241526 243771 246407 249004 251220 253182 255620 259507 265225 272083 279051 285995 293674
53952B93674Q833R475R474R337Q835P019L713M7k857m831n955n814m213j963k32
$$ 293674 302507 311982 321456 330793 339628 346647 350360 350407 347550 342719 336764 330950 326737 324774 324542
53937C24542O68J218J649J654J080L11j84l11j28M81J530K547K832K305J713J848
$$ 324542 325210 326428 328077 329731 330811 331122 330938 330627 330499 330980 332510 335057 337889 340194 341907 343755
53921C43755K714L793M807N806O645O972O808O575O513O546O853P774Q956R309
$$ 343755 346469 350262 355069 360875 367520 374492 381300 387875 394388 400934 407787 415561 424517 433826
53907D33826Q301O687N456M600L583K380J327L38q74k028k560k495k399k573k945
$$ 433826 442127 448814 454270 458870 462453 464833 466160 466498 465624 463596 461036 458541 456142 453569 450624
53892D50624l590m641n761o434o770p322q102q508q315q078q265q546q261p232
$$ 450624 447034 442393 436632 430198 423428 416106 408004 399496 391181 383103 374838 366292 358031 350799
53878C50799n871m754m231m183m109l674l130k974l231l476l518l688m378n470
$$ 350799 344928 340174 335943 331760 327651 323977 320847 317873 314642 311166 307648 303960 299582 294112
53864B94112o326o216m943l146j844j477j592j606j483j437j361j037n43j46k2
$$ 294112 287786 281570 276627 273481 271637 270160 268568 266962 265479 264042 262681 261644 261101 260955 260933
53849B60933m18j556l007l637k829j330k99L0J21Q4k58o26n63l32n87j236j484
$$ 260933 260515 258959 255952 252315 249486 248156 247857 247887 248008 248092 247834 247208 246645 246313 245726 244490 243006
53832B43006j051m94k29o3K11M34M91M71L71J08q8J17O05R47J043J027P60J77
$$ 243006 241955 241461 241232 241169 241380 241814 242305 242776 243147 243255 243167 243284 243889 244836 245879 246906 247666 247843
53814B47843j05N53J581J692P29L7O79K201L540M288M593M586M506M832N687O520
$$ 247843 247738 248291 249872 251564 252293 252330 253009 255210 258750 263038 267631 272217 276723 281555 287242 293762
53798B93762O749O413N881N409N226N536O066O060N222M138L420K861J970R86
$$ 293762 300511 306924 312805 318214 323440 328976 335042 341102 346324 350462 353882 356743 358713 359699
53784C59699O60J151J642J240j24j744k928l581m007m358m547m657n017n681o138
$$ 359699 360359 361510 363152 364392 364268 362524 359596 356015 352008 347650 343103 338446 333429 327748 321610
53769C21610n953n314m607l820k909k389k806l774m298m073l729l807m065l993
$$ 321610 315657 310343 305736 301916 299007 296618 293812 290038 285740 281667 277938 274131 270066 266073
53755B66073l413k551j931k123l016l493k549o80O06O87L76N17Q83Q25K41m98
$$ 266073 262660 260109 258178 256055 253039 249546 246997 246317 246923 247610 247986 248503 249386 250211 250452 249954
53739B49954j003r27j25R16J360R96M75L89N75O24M71K82J70L07P97J301J269
$$ 249954 248951 248024 247899 248815 250175 251171 251646 252035 252610 253234 253705 253987 254157 254464 255261 256562 257831
53722B57831P14K70L61Q25J416K034K333J858Q15J00J80O17R13J264K036L020
$$ 257831 258545 258815 259176 260001 261417 263451 265784 267642 268457 268557 268737 269354 270267 271531 273567 276587
53706B76587L615L416K478J353Q74J421K329K721K732L150L929M159L721L684
$$ 276587 280202 283618 286096 287449 288323 289744 292073 294794 297526 300676 304605 308764 312485 316169
53692C16169M537N180M442K718J207L23l00p64q49o65o24r02j329j603j335m23
$$ 316169 320706 325886 330328 333046 334253 334576 334276 333512 332663 331998 331374 330472 329143 327540 326205 325782
53676C25782M65M04m72r46m36J80L9l93l42j09m12j030j297j341j693j994j443
$$ 325782 326247 326651 326179 325233 324797 324977 325016 324623 324281 324172 323760 322730 321433 320092 318399 316405 314962
53659C14962k73L99K59J03L69M85k7p29j034j013r15n20M71J662K186J658O49
$$ 314962 314689 315088 315347 315450 315819 316304 316277 315548 314514 313501 312586 312066 312537 314199 316385 318043 318692
53642C18692J26M80J187J465J221J071J412J926K177K256K409K478K239K008K328
$$ 318692 318818 319298 320485 321950 323171 324242 325654 327580 329757 332013 334422 336900 339139 341147 343475
53627C43475L118L644L347K454J726J858K946M313N028M791M120L640L554L908
$$ 343475 346593 350237 353584 356038 357764 359622 362568 366881 371909 376700 380820 384460 388014 391922
53613C91922M723N518N396M221L162L345M353M812M153K958J845R09K94L82J120
$$ 391922 396645 402163 407559 411780 414942 418287 422640 427452 431605 434563 436408 437317 437611 437993 439113
53598D39113J838K024J784J377Q17J59k93l89m51q11j295j481j283j010q67p42
$$ 439113 440951 442975 444759 446136 446953 447112 446819 446430 445979 445168 443873 442392 441109 440099 439232 438490
53582D38490o10q74j909l278l875l197k084j724k189k581k484k417k701k866k512
$$ 438490 437880 437006 435097 431819 427944 424747 422663 420939 418750 416169 413685 411268 408567 405701 403189
53567D03189k009j761j452o63K69O97N88L74K23P2N1K71M85N05O82J341K066K226
$$ 403189 401180 399419 397967 397304 397573 398270 398858 399232 399455 399527 399578 399849 400334 400839 401521 402862 404928 407154
53549D07154J925J775J909J958J836J812J896J843J799K210L017L624L820M098
$$ 407154 409079 410854 412763 414721 416557 418369 420265 422108 423907 426117 429134 432758 436578 440676
53535D40676M856N795O426O754P151P807Q553R161R636J0219J1104J2109J2840
$$ 440676 445532 451327 457753 464507 471658 479465 488018 497179 506815 517034 528138 540247 553087
53522E53087J3234J3685J4409J5084J5345J5364J5580J6162J7078J8408K0131
$$ 553087 566321 580006 594415 609499 624844 640208 655788 671950 689028 707436 727567
53511G27567K1889K3388K4774K6172K7220K7538K7414K7394K7495K7399K7197
$$ 727567 749456 772844 797618 823790 851010 878548 905962 933356 960851 988250 1015447
53500A015447K7186K7038K6013K4021K1874K0319J9413J8976J8956J9177J9193
$$ 1015447 1042633 1069671 1095684 1119705 1141579 1161898 1181311 1200287 1219243 1238420 1257613
53489A257613J8809J8404J8464J9014J9635J9878J9568J8864J8123J7618J7407
$$ 1257613 1276422 1294826 1313290 1332304 1351939 1371817 1391385 1410249 1428372 1445990 1463397
53478A463397J7426J7498J7226J6165J4260J1822Q987N660K173o92k747m839p606
$$ 1463397 1480823 1498321 1515547 1531712 1545972 1557794 1566781 1572441 1574614 1573922 1571175 1566336 1558730
53465A558730j0391j2134j2917j3752j5121j6616j7849j8776j9234j9033j8566
$$ 1558730 1548339 1536205 1523288 1509536 1494415 1477799 1459950 1441174 1421940 1402907 1384341
53454A384341j8590j9246j9991k0529k1102k1782k2144k1881k1153k0286j9482
$$ 1384341 1365751 1346505 1326514 1305985 1284883 1263101 1240957 1219076 1197923 1177637 1158155
53443A158155j8860j8220j6920j4637j2132j0521r746q627o522m098k276j182
$$ 1158155 1139295 1121075 1104155 1089518 1077386 1066865 1057119 1048492 1041970 1037872 1035596 1034414
53431A034414m49J95J060K554M633O569P715Q174Q552R436J1149J3510J5674J6769
$$ 1034414 1033965 1034160 1035220 1037774 1042407 1048976 1056691 1064865 1073417 1082853 1094002 1107512 1123186 1139955
53417A139955J6966J7441J9046K1473K3929K6010K7743K9241L0745L2501L4370
$$ 1139955 1156921 1174362 1193408 1214881 1238810 1264820 1292563 1321804 1352549 1385050 1419420
53406A419420L5866L6872L7847L9198M0905M2944M5446M8203N0573N2266N3646
$$ 1419420 1455286 1492158 1530005 1569203 1610108 1653052 1698498 1746701 1797274 1849540 1903186
53395A903186N4937N5765N6010N6474N7940N9968O1300O1296O0334N8930N7156
$$ 1903186 1958123 2013888 2069898 2126372 2184312 2244280 2305580 2366876 2427210 2486140 2543296
53384B543296N5046N2927N1046M9106M6470M2893L8878L5188L1982K8522K3934
$$ 2543296 2598342 2651269 2702315 2751421 2797891 2840784 2879662 2914850 2946832 2975354 2999288
53373B999288J8199J2137O499J326l835r401j5485k1873k8217l4418m0593m6482
$$ 2999288 3017487 3029624 3036123 3037449 3033614 3024213 3008728 2986855 2958638 2924220 2883627 2837145
53361B837145n1188n4089n5750n7236n8611n8926n7839n6244n4984n3775n2019
$$ 2837145 2785957 2731868 2676118 2618882 2560271 2501345 2443506 2387262 2332278 2278503 2226484
53350B226484m9945m8254m7024m5781m4423m3338m2744m2410m2124m1846m1379
$$ 2226484 2176539 2128285 2081261 2035480 1991057 1947719 1904975 1862565 1820441 1778595 1737216
53339A737216m0303l8398l5935l3376l0937k8529k6045k3593k1351j9256j7033
$$ 1737216 1696913 1658515 1622580 1589204 1558267 1529738 1503693 1480100 1458749 1439493 1422460
53328A422460j4681j2771j1916j2081j2717j3469j4361j5270j5754j5486j4530
$$ 1422460 1407779 1395008 1383092 1371011 1358294 1344825 1330464 1315194 1299440 1283954 1269424
53317A269424j3126j1607j0448r900r409q063n765l436j767m20J162K772L887
$$ 1269424 1256298 1244691 1234243 1224343 1214934 1206871 1201106 1197670 1195903 1195483 1196645 1199417 1203304
53304A203304M653N709P297R148J1127J3349J5672J7727J9479K1283K3223K4910
$$ 1203304 1207957 1213666 1220963 1230111 1241238 1254587 1270259 1287986 1307465 1328748 1351971 1376881
53292A376881K6107K7112K8172K8889K8701K7804K7024K6689K6115K4487K1921
$$ 1376881 1402988 1430100 1458272 1487161 1515862 1543666 1570690 1597379 1623494 1647981 1669902
53281A669902J9234J6855J4459J1676Q638N645K766l3k744n537q757j2403j5851
$$ 1669902 1689136 1705991 1720450 1732126 1740764 1746409 1749175 1749142 1746398 1740861 1732104 1719701 1703850
53268A703850j8473k0210k1407k2473k3918k6111k8575l0082l0111k9653k9968
$$ 1703850 1685377 1665167 1643760 1621287 1597369 1571258 1542683 1512601 1482490 1452837 1422869
53257A422869l0999l1821l2140l2319l2307l1685l0698l0081k9743k8777k6923
$$ 1422869 1391870 1360049 1327909 1295590 1263283 1231598 1200900 1170819 1141076 1112299 1085376
53246A085376k5086k4075k3781k3861k4276k4766k4681k3852k2878k2103k1061
$$ 1085376 1060290 1036215 1012434 988573 964297 939531 914850 890998 868120 846017 824956
53235H24956j9423j7735j6642j5946j4959j3315j1162r059p933q338r519r950
$$ 824956 805533 787798 771156 755210 740251 726936 715774 706715 698782 690444 680925 670975
53223F70975r276q783r444j0548j1022j1163j1941j3231j4024j3993j3812j3941
$$ 670975 661699 652916 643472 632924 621902 610739 598798 585567 571543 557550 543738 529797
53211E29797j4035j3592j2480j0869r196q096p839p881p479o617n895n686n896
$$ 529797 515762 502170 489690 478821 469625 461529 453690 445809 438330 431713 425818 420132 414236
53198D14236o323o746o843o500o031n719n415n038n051n801o661o622n603m478
$$ 414236 407913 401167 394324 387824 381793 376074 370659 365621 360570 354769 348108 341486 335883 331405
53184C31405l849l479k980k484k318k556l011l403l436k945k122j371j008j126
$$ 331405 327556 324077 321097 318613 316295 313739 310728 307325 303889 300944 298822 297451 296443 295317
53170B95317j621k130k181j643r37n20l89k95j79q2R8M20O60N58J47l92r81j506
$$ 295317 293696 291566 289385 287742 286805 286285 285896 285601 285422 285340 285438 285858 286518 287076 287223 286831 285850 284344
53152B84344j791j859j942j934j399l91K55K4m23j38P01J105O96J03l9J92L76
$$ 284344 282553 280694 278752 276818 275419 275028 275283 275307 274884 274746 275447 276552 277248 277351 277312 277504 277880
53135B77880K73l8k45RO21R19M29m32q11m15L60J108J663J902J779J544J514J710
$$ 277880 278153 278115 277870 277879 278500 279419 279848 279416 278605 278190 278550 279658 281321 283223 285002 286546 288060 289770
53117B89770K008K449K959L134K746K177J836J507Q60K81L05N01j36j694l116
$$ 289770 291778 294227 297186 300320 303066 305243 307079 308586 309446 309727 310032 310533 310397 308703 305587
53102C05587l578l315k854k292j697j500j901k343k122j249l51R0P3j75m51o25
$$ 305587 302009 298694 295840 293548 291851 290351 288450 286107 283985 282736 282385 282475 282548 282373 281922 281297
53086B81297o16m37k30k27n76j125j515j535j252p20L0O74O26j97j045j163o66
$$ 281297 280681 280244 280014 279787 279211 278086 276571 275036 273784 273064 273094 273768 274394 274197 273152 271989 271323
53069B71323j69R9K47J44m74j306j583r57J01Q38Q68L13k95m03OL69K67m3j21
$$ 271323 271154 271253 271500 271644 271170 269864 268281 267324 267425 268263 269131 269444 269149 268746 268752 269121 269388 269345 269224
53050B69224M9L39Q83J645J959J288J76k84J33O40N67j2o63r61n82K86Q08L66
$$ 269224 269273 269612 270495 272140 274099 275387 275563 275279 275412 276052 276619 276607 275944 274983 274401 274687 275495 275861
53032B75861n33r89j019j247j554j144k4P87P67M67L48P7n03p31j29P44J100R34
$$ 275861 275328 274339 273320 272073 270519 269375 269351 270138 270905 271372 271720 271797 271294 270563 270434 271178 272278 273212
53014B73212O81M27J65K22Q74J786K414K548K134J104j97r47q16m77n97q06l63
$$ 273212 273893 274320 274485 274707 275581 277367 279781 282329 284463 285567 285370 284423 283607 283130 282533 281727 281364
52997B81364N31R22M43l09o42m26J91J033J774K002J650J127Q53Q95J089J350
$$ 281364 281895 282817 283260 282951 282309 281883 282074 283107 284881 286883 288533 289660 290513 291408 292497 293847
52981B93847J703K123K474K608K511K282J911J153r6j444k179j900q06N95J757
$$ 293847 295550 297673 300147 302755 305266 307548 309459 310612 310516 309072 306893 304993 304187 304782 306539
52966C06539K171J650O37q2j18K87P50J138J327J081L88l96r83j431j778j768
$$ 306539 308710 310360 310997 310915 310797 311084 311834 312972 314299 315380 315768 315372 314389 312958 311180 309412
52950C09412j244n98m57r40j473j443q98n61j004j844k061j298m28m17r69r95
$$ 309412 308168 307570 307113 306173 304700 303257 302359 301798 300794 298950 296889 295591 295163 294746 293777 292782
52934B92782k52L38J03n22q19q04q52r36p76m74m53q93j541j908j557m40Q20J292
$$ 292782 292530 292868 292971 292449 291630 290826 289974 289038 288262 287788 287335 286442 284901 282993 281436 280996 281816 283108
52916B83108O48n21j371j488q13N10J889K467J895P38k58q85j167q83K0Q75Q40
$$ 283108 283756 283235 281864 280376 279563 280073 281962 284429 286324 287062 286804 285919 284752 283869 283889 284764 285604
52899B85604n7r46j160q37m57j77K15Q86J570J651P17q06j869j794r41j61J58
$$ 285604 285547 284601 283441 282604 282147 281970 282185 283071 284641 286292 287009 286203 284334 282540 281599 281438 281596
52882B81596L11O67J198J586J577J233R11J003J531K050K005J259L32L8P26J805
$$ 281596 281907 282574 283772 285358 286935 288168 289079 290082 291613 293663 295668 296927 297259 297297 298023 299828
52866B99828K297K001J670J797J761Q19n17j024n35j70o76j540k025k194k430
$$ 299828 302125 304126 305796 307593 309354 310173 309656 308632 308097 307927 307251 305711 303686 301492 299062
52851B99062k684k760k764k787k656k433k550l008l081k345j428j107j242j288
$$ 299062 296378 293618 290854 288067 285411 282978 280428 277420 274339 271994 270566 269459 268217 266929
52837B66929j314j703k270k526k467k303j738l93J174J866J541J246J786K746
$$ 266929 265615 263912 261642 259116 256649 254346 252608 252215 253389 255255 256796 258042 259828 262574
52823B62574L150K564J270j41j122j406j170q77q02q65p73k65O78J624J922J430
$$ 262574 265724 268288 269558 269417 268295 266889 265719 264842 264040 263175 262402 262137 262815 264439 266361 267791
52807B67791P93O75R55J034O45Po28j062j098q13p36j237j903k004j471q74n90
$$ 267791 268584 269259 270214 271248 271893 271900 271272 270210 269112 268299 267563 266326 264423 262419 260948 260074 259484
52790B59484n26n23m85k21L07O47L30l97q45q02n36p6P22J476J499Q80M61N33
$$ 259484 258958 258435 257950 257729 258036 258683 259013 258616 257771 256969 256433 256357 257079 258555 260054 260934 261395 261928
52772B61928L98l29q72l90P03J267R18K41k52p01j371k084k371j910p64O46J762
$$ 261928 262326 261997 261125 260735 261438 262705 263623 263864 263612 262911 261540 259456 257085 255175 254411 255057 256819
52755B56819K219J973J250M57R0L66Q68R10M17J42P34J865K619K559K075J712
$$ 256819 259038 261011 262261 262718 262808 263174 264042 264952 265369 265511 266245 268110 270729 273288 275363 277075
52739B77075J547J366J163J211J706K438K946K870K124Q71m61j190q33K95J249
$$ 277075 278622 279988 281151 282362 284068 286506 289452 292322 294446 295317 294856 293666 292833 293128 294377
52724B94377J449J181Q78L96n30j462j695j344j253j743k229k152j624r19j15
$$ 294377 295826 297007 297885 298281 297751 296289 294594 293250 291997 290254 288025 285873 284249 283330 283215
52709B83215M64K86m63p33q9M01m12j902k317j029Q53K080K440K216J501N11j42
$$ 283215 283679 283965 283502 282769 282680 283081 282669 280767 278450 277421 278274 280354 282794 285010 286511 287022 286880
52692B86880j43O5m5l05k34J71N24O70P38P36N76L86L25K06k81r63j295j125r40
$$ 286880 286737 286802 286757 286452 286218 286389 286913 287583 288321 289057 289633 290019 290344 290550 290269 289306 288011 286886 285946
52673B85946j173j604j629r58J12R77J201Q70M62K62L7m89r66p06L93J600K191
$$ 285946 284773 283169 281540 280582 280694 281671 282872 283742 284204 284466 284503 284014 283048 282342 282735 284335 286526
52656B86526K151J917J870K217K949L636L728L245K764K460J721J76j491k316
$$ 286526 288677 290594 292464 294681 297630 301266 304994 308239 311003 313463 315184 315360 313869 311553
52642C11553k245j852j330n53P1j59j122j844j768j291q77l70M47J261J640J610
$$ 311553 309308 307456 306126 305573 305644 305485 304363 302519 300751 299460 298583 298213 298660 299921 301561 303171
52626C03171J469J405J529J854J927J032q57k712l487l197k597k111j590r31l26
$$ 303171 304640 306045 307574 309428 311355 312387 311530 308818 305331 302134 299537 297426 295836 294905 294579
52611B94579K1P4j06l08j62M58J016P41m26j548j596n82M42N83Q4j27K44N54L25
$$ 294579 294600 294674 294568 294260 294098 294556 295572 296313 295887 294339 292743 292161 292603 293186 293270 293143 293387 293941 294266
52592B94266L6K85P08N02k27n35J0Q32J296J354J134O84L84P36J441J490O22j45
$$ 294266 294302 294587 295295 295797 295570 295035 295045 295877 297173 298527 299661 300345 300729 301465 302906 304396 305018 304873
52574C04873J9O09P22L53k2m61j205j814j618q50l74m37m31P9P75J047N25o98
$$ 304873 304892 305501 306223 306576 306554 306093 304888 303074 301456 300606 300232 299795 299364 299443 300218 301265 301790 301092
52556C01092j946k274j446m60m60j355k029j788q95P0P19P31N2p14o95K33J288
$$ 301092 299146 296872 295426 294966 294506 293151 291122 289334 288439 288509 289228 289959 290011 289297 288602 288835 290123
52539B90123J671J260M71j40j38M38R56P95J36k72p7L77O63P77R80J387J796J783
$$ 290123 291794 293054 293525 293385 293247 293685 294641 295436 295572 295300 295223 295600 296263 297040 298020 299407 301203 302986
52521C02986J144L23J11O47J215J279J222J587K163K454K556K845L182L240L231
$$ 302986 304130 304453 304564 305211 306426 307705 308927 310514 312677 315131 317687 320532 323714 326954 330185
52506C30185L465L562K973J945J014j04j927l871m752m592m504m754m379l081
$$ 330185 333650 337212 340185 342130 343144 343040 341113 337242 332490 327898 323394 318640 314261 311180
52492C11180j995j958k240j863j045n21l60l02n05r55r50j14O78L97n40q52k27
$$ 311180 309185 307227 304987 303124 302079 301558 301198 300896 300391 299436 298486 298372 299050 299447 298907 298055 297828
52475B97828M91P99J171J999K839L080K801K550K688L174L789M212M094L332K310
$$ 297828 298319 299118 300289 302288 305127 308207 311008 313558 316246 319420 323209 327421 331515 334847 337157
52460C37157J691J746J974J604N44m91r98j422k428l784m566m387l684k956k350
$$ 337157 338848 340594 342568 344172 344716 344225 343227 341805 339377 335593 331027 326640 322956 320000 317650
52445C17650k101k498l167l175k246j228r27j084r97n64j91JJ98L99L20k24j128
$$ 317650 315549 313051 309884 306709 304463 303235 302308 301224 300227 299663 299472 299473 299671 300070 300390 300166 299038
52428B99038j982k195j436j08R99J619K069K364K027J070L86N83J109J141Q15
$$ 299038 297056 294861 293425 293317 294316 295935 298004 300368 302395 303465 303851 304434 305543 306684 307499
52413C07499Q88J538K258K689K924L144L535M385N765P213Q135Q426Q356Q040
$$ 307499 308387 309925 312183 314872 317796 320940 324475 328860 334625 341838 349973 358399 366755 374795
52399C74795P364O226M515K163n22k908m730o329p760q245p141n092l461k843
$$ 374795 382159 388385 392900 395063 394541 391633 386903 380574 372814 364569 357428 352336 348875 346032
52385C46032k756k575k094j312m07J61J48J33R31K445L705M129M084M131M347
$$ 346032 343276 340701 338607 337295 336888 337049 337197 337330 338261 340706 344411 348540 352624 356755 361102
52370C61102M642N091N557N475M474K973J793J257J006O23J37k13m41q10j311
$$ 361102 365744 370835 376392 381867 386341 389314 391107 392364 393370 393993 394130 393917 393476 392666 391355
52355C91355j539j267q88q49r07m52M18R35Q42Q28J343J806J543R27Q64J586K624
$$ 391355 389816 388549 387661 386812 385905 385453 385871 386806 387648 388476 389819 391625 393168 394095 394959 396545 399169
52338C99169L634M511N037N143N261N765O303O481O808Q069R936J1223J1602J1981
$$ 399169 402803 407314 412351 417494 422755 428520 434823 441304 448112 456181 466117 477340 488942 500923
52324E00923J3000J4155J4806J5157J5706J6379J6788J6814J6465J5602J4385
$$ 500923 513923 528078 542884 558041 573747 590126 606914 623728 640193 655795 670180
52313F70180J3560J3736J4607J5400J5947J6797J8261J9819K0705K0782K0626
$$ 670180 683740 697476 712083 727483 743430 760227 778488 798307 819012 839794 860420
52302H60420K0749K0942K0604J9591J8374J7328J6257J4917J3491J2066J0040
$$ 860420 881169 902111 922715 942306 960680 978008 994265 1009182 1022673 1034739 1044779
52291A044779O886L220K93j598l265n107o382o453n882n629n786n802n491n111
$$ 1044779 1051665 1054885 1055178 1053580 1050315 1045208 1038826 1032373 1026491 1020862 1015076 1009274 1003783 998672
52277I98672m706m064l173k099o15J405L225L717K825J979K637M732O967Q355
$$ 998672 993966 989902 986729 984630 984015 985420 988645 992362 995187 997166 999803 1004535 1011502 1019857
52263A019857R037R654J0464J1261J1951J2785J3995J5414J6603J7258J7447J7409
$$ 1019857 1028894 1038548 1049012 1060273 1072224 1085009 1099004 1114418 1131021 1148279 1165726 1183135
52251A183135J7267J6872J5959J4471J2698J0901Q866O182L061M42j113k208l785
$$ 1183135 1200402 1217274 1233233 1247704 1260402 1271303 1280169 1286351 1289412 1289854 1288741 1286533 1282748
52238A282748n689o874o987o995p853r282j0398j1028j1647j2237j2083j0906
$$ 1282748 1277059 1270185 1263198 1256203 1248350 1239068 1228670 1217642 1205995 1193758 1181675 1170769
52226A170769r590r283j0074j0942j0885r783q133o371m702l351k558k230j943
$$ 1170769 1161179 1151896 1141822 1130880 1119995 1110212 1102079 1095708 1091006 1087655 1085097 1082867 1080924
52213A080924j472j088j029r01K5J842L746M856N088N010N027N005M673M139L886
$$ 1080924 1079452 1078364 1077335 1076434 1076459 1078301 1082047 1086903 1091991 1097001 1102028 1107033 1111706 1115845 1119731
52198A119731M261N075N756N937N794N752N992O383O822P332P765P730O952N606
$$ 1119731 1123992 1129067 1134823 1140760 1146554 1152306 1158298 1164681 1171503 1178835 1186600 1194330 1201282 1206888
52184A206888M115K694J200o24k862n272p349q658r263r707j0404j1131j1314
$$ 1206888 1211003 1213697 1214897 1214273 1211411 1206139 1198790 1190132 1180869 1171162 1160758 1149627 1138313
52171A138313j0762r812q779p581o082m475l039j726l45R67J938K725L774N008
$$ 1138313 1127551 1117739 1108960 1101379 1095297 1090822 1087783 1086057 1085712 1086679 1088617 1091342 1095116 1100124
52157A100124N659N214M073K905J806O19l74p57p78j052j441j105J91J515J922
$$ 1100124 1105783 1110997 1115070 1117975 1119781 1120400 1120026 1119269 1118491 1117439 1115998 1114893 1115084 1116599 1118521
52142A118521J527J067R07R41J042J063P37L5n85o60k24N62J930M075O528Q583
$$ 1118521 1120048 1121115 1122022 1122963 1124005 1125068 1125805 1125840 1125255 1124595 1124371 1124933 1126863 1130938 1137466 1146049
52126A146049J0296J2423J5310J8396K0940K2827K4430K5979K7298K8017K7940
$$ 1146049 1156345 1168768 1184078 1202474 1223414 1246241 1270671 1296650 1323948 1351965 1379905
52115A379905K7293K6518K5762K4703K3094K1223J9570J8154J6674J5168J4073
$$ 1379905 1407198 1433716 1459478 1484181 1507275 1528498 1548068 1566222 1582896 1598064 1612137
52104A612137J3523J3089J2396J1693J1466J1693J1751J1043R610P951O280M170
$$ 1612137 1625660 1638749 1651145 1662838 1674304 1685997 1697748 1708791 1718401 1726352 1732632 1736802
52092A736802J107k697o434r688j2812j6127j9187k1241k2093k2072k1393k0063
$$ 1736802 1737909 1735212 1728778 1719090 1706278 1690151 1670964 1649723 1627630 1605558 1584165 1564102
52080A564102j8285j6419j4579j2643j0668q873p261n554l588j500M17J913K971
$$ 1564102 1545817 1529398 1514819 1502176 1491508 1482635 1475374 1469820 1466232 1464732 1465149 1467062 1470033
52067A470033M006N629P875R993J1356J2240J3230J4185J4547J4408J4477J4918
$$ 1470033 1474039 1479668 1487543 1497536 1508892 1521132 1534362 1548547 1563094 1577502 1591979 1606897
52055A606897J5075J4529J3718J3146J2539J1235R085O593M285K191j91l334o940
$$ 1606897 1621972 1636501 1650219 1663365 1675904 1687139 1696224 1702817 1707102 1709293 1709102 1705768 1698828
52042A698828r955j1674j2718j4323j6722j8828j9610j9160j8184j7078j5947
$$ 1698828 1688873 1677199 1664481 1650158 1633436 1614608 1594998 1575838 1557654 1540576 1524629
52031A524629j5037j4611j4523j4269j3450j2106j0772j0136j0399j1030j1306
$$ 1524629 1509592 1494981 1480458 1466189 1452739 1440633 1429861 1419725 1409326 1398296 1386990
52020A386990j1095j0746j0405r942r465r228r036q386p324o539o425o762p469
$$ 1386990 1375895 1365149 1354744 1344802 1335337 1326109 1317073 1308687 1301363 1294824 1288399 1281637 1274168
52007A274168q963j1279j3586j5154j6308j7844j9872k1813k3200k3867k3684
$$ 1274168 1265205 1253926 1240340 1225186 1208878 1191034 1171162 1149349 1126149 1102282 1078598
51996A078598k2655k1256k0066j9161j8179j6989j5880j5148j4770j4507j4229
$$ 1078598 1055943 1034687 1014621 995460 977281 960292 944412 929264 914494 899987 885758
51985H85758j4137j4683j5955j7171j7293j6352j5640j6181j7443j8098j7666
$$ 885758 871621 856938 840983 823812 806519 790167 774527 758346 740903 722805 705139
51974G05139j6783j6049j5295j4031j2019r299o110k971m69J279K753M413O157
$$ 705139 688356 672307 657012 642981 630962 621663 615553 612582 612113 613392 616145 620558 626715
51961F26715P493Q131Q143P613O440M623K624J054o8j391l335n391o647o768o055
$$ 626715 634208 642339 650482 658095 664535 669158 671782 672836 672768 671377 668042 662651 656004 649236 643181
51946F43181m714k665MK875N631Q179J0383J2133J3742J5664J7776J9487K0610
$$ 643181 638467 635802 635806 638681 644312 652491 662874 675007 688749 704413 722189 741676 762286
51933G62286K1423K1795K1070J9221J7253J5903J4632J2467R181N008k22o687
$$ 762286 783709 805504 826574 845795 863048 878951 893583 906050 915231 920239 920017 913330
51921I13330j3771k0458k6294l1144l4355l5159l3886l1824k9659k6869k2960
$$ 913330 899559 879101 852807 821663 787308 752149 718263 686439 656780 629911 606951
51910F06951j8536j4671j1622q811n809k875m31J502L161M575N561O137O488O372
$$ 606951 588415 573744 562122 553311 547502 544627 544196 545698 548859 553434 558995 565132 571620 577992
51896E77992N119K652Lj869l469n978r283j1829j2619j2242j1506j0307q474o616
$$ 577992 583111 585763 585766 583897 580428 574450 565167 553338 540719 528477 516971 506664 498190 491574
51882D91574n133l356p68J753L106L771N047O996Q582R530J0492J1308J0754Q460
$$ 491574 486441 483085 482317 484070 487176 490947 495994 502990 511572 521102 531594 542902 553656 562116
51868E62116N728L779K265L19j849l259l604l609m040m865n303m599k883j182
$$ 562116 567844 571623 573888 574207 572358 569099 565495 561886 557846 552981 547678 543079 540196 539014
51854E39014k44L59J387K534K750J871Q16Qj233l243n132o068o560p532q758r189
$$ 539014 538770 539129 540516 543050 545800 547671 548487 548495 547262 544019 538887 532819 526259 518727 509969 500780
51838E00780q447p158n990n081m310l541k647j707r62l11P66K324L460L308K181
$$ 500780 492333 485175 479185 474104 469794 466253 463606 461899 460937 460626 461392 463716 467176 470484 472665
51823D72665J030R1j128k624l581l401k370j157k26J37j35n14j86R59K087K551
$$ 472665 473695 473786 472658 470034 466453 463052 460682 459525 459299 459436 459301 458787 458601 459560 461647 464198
51807D64198K703L086L252K252J76j597j943j219n59m13l10K06R85J620J858J499
$$ 464198 466901 469987 473239 475491 475667 474070 472127 470908 470349 469936 469626 469832 470817 472437 474295 475794
51791D75794M24j040k208k757l035l309l169k192q75j47r7Q2P97J402J145K42
$$ 475794 476218 475178 472970 470213 467178 463869 460700 458508 457633 457486 457389 457471 458268 459670 460815 461057
51775D61057m02j33J066K849M768O367P349P650P444P161P421Q501R833J0433
$$ 461057 460655 460522 461588 464437 469205 475572 482921 490571 498015 505176 512597 521098 530931 541364
51761E41364R801Q100N507K101j568m519o388p792r294j0562j1014j0712j0086
$$ 541364 551165 559265 564772 566873 565305 560786 554398 546606 537312 526750 515736 505024 494938
51748D94938r256q242p395o947o474n429l923k326n06J777M006N400O096O955
$$ 494938 485682 477440 470045 463098 456624 451195 447272 444946 444440 446217 450223 455623 461719 468674
51734D68674Q218R246R667R807R766R037P393N440L779K425J393J144J838K760
$$ 468674 476892 486138 495805 505612 515378 524415 531808 537248 541027 543452 544845 545989 547827 550587
51720E50587L116K861K195P77j773m871p266q139p476n668l449j979k087l396
$$ 550587 553703 556564 558759 559536 557763 552892 545626 537487 530011 524343 520894 518915 516828 513432
51706E13432m728n355n291m538k949q98P55J635K104K273J597j04j885k666k534
$$ 513432 508704 503349 498058 493520 490571 489673 490428 492063 494167 496440 498037 497933 496048 493382 490848
51691D90848k318k181j475RJ341J377m1k049l669m579n054n361n239m136k010
$$ 490848 488530 486349 484874 484883 486224 487601 487560 485511 481842 477263 472209 466848 461609 457473 455463
51676D55463K84J658J901J846K433L721M951N499N638O317Q167J0782J3117J4490
$$ 455463 455747 457405 459306 461152 463585 467306 472257 477756 483394 489711 497878 508660 521777 536267
51662E36267J4985J4882J4028J2028Q751M385p21n992j0495j3344j4243j3424
$$ 536267 551252 566134 580162 592190 600941 605326 604605 598613 588118 574774 560531 547107
51650E47107j1178p875m251j229P92K055K719K335L54k967o476q982j0148j0463
$$ 547107 535929 528054 523803 522574 523366 525421 528140 530475 530829 527862 521386 512404 502256 491793
51636D91793j0427r900q449o231m062k501j293j00P40P53L42L99R83J194N34m08
$$ 491793 481366 471466 463017 456786 452724 450223 448930 448830 449570 450323 450665 451064 452047 453241 453775 453367
51620D53367r28j186j713k441k820k585j962j384j304k024l292m329m588m261
$$ 453367 452439 451253 449540 447099 444279 441694 439732 438348 437044 435020 431728 427399 422811 418550
51606D18550l734k970j884r08n42m80J21J539L184M431N279O089P085Q230R310
$$ 418550 414816 411846 409962 409054 408512 408032 408153 409692 412876 417307 422586 428675 435760 443990 453300
51591D53300J0014J0185R919R151P349M041k71m162o399o746n774m222k662j254
$$ 453300 463314 473499 483418 492569 499918 503959 503688 499526 493127 486381 480607 476385 473723 472469
51577D72469M20K960O362R796J2366J3987J5315J6917J8689K0068K0707K0875
$$ 472469 472889 475849 482211 492007 504373 518360 533675 550592 569281 589349 610056 630931
51565F30931K1122K1646K2122K2220K1946K1528K1339K2189K5023K9681L4240
$$ 630931 652053 673699 695821 718041 739987 761515 782854 805043 830066 859747 893987
51554H93987L6390L5529L2785K9051K3791J6124O400l855j3173k0845k6828l1548
$$ 893987 930377 965906 998691 1027742 1051533 1067657 1074057 1070202 1057029 1036184 1009356 977808
51542I77808l5632l9258m1676m1836l9579l5947l2181k8648k4897k0618j6227
$$ 977808 942176 902918 861242 819406 779827 743880 711699 683051 658154 637536 621309
51531F21309j2437r448o891m559k897k477l123l938m249m234m559n560o990q343
$$ 621309 608872 599424 592533 587974 585077 582600 579477 575539 571290 567056 562497 556937 549947 541604
51517E41604r222r417q892p829o644n798n461n350n093m701m560m801m988m590
$$ 541604 532382 522965 514073 506244 499600 493802 488341 482991 477898 473197 468637 463836 458848 454258
51503D54258l688k914k786l228l691l565k586j005N92J686K014J559P07L53J230
$$ 454258 450570 447656 444870 441642 437951 434386 431800 430795 431387 433073 435087 436646 437353 437706 438936
51488D38936K810L491K398N21n15m24k67p86j635k191k239j755p82J86L93l39
$$ 438936 441746 445237 447635 448156 447641 447217 446950 446164 444529 442338 440099 438344 437562 437748 438141 437802
51472D37802j447k427l222l717l601l042k760k997l097k552j873j782k129k268
$$ 437802 436355 433928 430706 426989 423388 420346 417586 414589 411492 408940 407067 405285 403156 400888
51458D00888k136k153k311k067j159K0R00J199J020P93J078K047L291M438N765
$$ 400888 398752 396599 394288 392221 391062 391082 391982 393181 394201 394994 396072 398119 401410 405848 411613
51443D11613P803J0369J2522J3518J3540J3346J3327J3003J1462Q423M858K219
$$ 411613 419416 429785 442307 455825 469365 482711 496038 509041 520503 528926 533784 536003
51431E36003J002M36k93j092j583k102l352n276o931p509p027o124n521n636o218
$$ 536003 537005 537441 537148 536056 534473 532371 529019 523743 516812 509303 502276 496152 490631 484995 478777
51416D78777o505o059n317m897m591l709k194p29K71R92J423J098K4q39o05M35
$$ 478777 472272 466213 460896 455999 451408 447699 445505 444776 445047 446039 447462 448560 448584 447745 447140 447575
51400D47575J287J549J712K278L069L528L438L316L990N719P741R069R675J0488
$$ 447575 448862 450411 452123 454401 457470 460998 464436 467752 471742 477461 485202 494271 503946 514434
51386E14434J2086J4013J5774J7867K1150K5536L0114L4432L8907M3864M8874
$$ 514434 526520 540533 556307 574174 595324 620860 650974 685406 724313 768177 817051
51375H17051N3267N6566N8192N7373N3884M8292M0916L1078J8238L621j0203k1583
$$ 817051 870318 926884 985076 1042449 1096333 1144625 1185541 1216619 1234857 1238478 1228275 1206692
51363A206692l0862l8979m5827n0551n2987n3985n4352n3979n2217m8761m4059
$$ 1206692 1175830 1136851 1091024 1040473 987486 933501 879149 825170 772953 724192 680133
51352F80133l8980l4182k9764k5525k1481j7965j5118j2697j0498q756p780p323
$$ 680133 641153 606971 577207 551682 530201 512236 497118 484421 473923 465167 457387 450064
51340D50064o758n782m664l773l201k876k748k742k695k465j998j349o97l01j99
$$ 450064 443306 437524 432860 429087 425886 423010 420262 417520 414825 412360 410362 409013 408316 408015 407816
51325D07816n5N29J503K418K879K768K128J094l5q95j272j141o30j25j20p28j411
$$ 407816 407761 408290 409793 412211 415090 417858 419986 421080 421045 420150 418878 417737 417107 416982 416862 416134 414723
51308D14723j585j249p97m31k12l88j025j528j239m93l01r25j580j737j817k243
$$ 414723 413138 411889 411092 410661 410449 410061 409036 407508 406269 405776 405475 404550 402970 401233 399416 397173
51292C97173k594k309j644j216j028n62L73J489K484L222L572L585L673M260N282
$$ 397173 394579 392270 390626 389410 388382 387820 388193 389682 392166 395388 398960 402545 406218 410478 415760
51277D15760O318O989P028O128M216J740n24j958k283j608m84M32J104K121L725
$$ 415760 422078 429067 436095 442223 446439 448179 447655 445697 443414 441806 441322 441754 442858 444979 448704
51262D48704N157N512M854L927K974J525o37k926m503n032m787m361m275m648
$$ 448704 453861 459373 464227 468154 471128 472653 472016 469090 464587 459555 454768 450407 446132 441484
51248D41484n119n241m900m243l417k610k157k215k461k383j863j206o80l19q5
$$ 441484 436365 431124 426224 421981 418564 415954 413797 411582 409121 406738 404875 403669 402989 402670 402585
51233D02585N9J71K37J20j83l88j99L49J011J636K148K396K278J858J273O72L04
$$ 402585 402644 402815 403052 403172 402989 402601 402402 402751 403762 405398 407546 409942 412220 414078 415351 416023 416327
51216D16327L46M82J62n50q39k17Q33J581J914J987J670J091J102K270L684L872
$$ 416327 416673 417155 417317 416767 415928 415711 416544 418125 420039 422026 423696 424787 425889 428159 431843 435715
51200D35715K803J930K158K783K701J822P49j87j032j632j643r69l4M76J91m55
$$ 435715 438518 440448 442606 445389 448090 449912 450661 450474 449442 447810 446167 445198 445164 445640 445831 445376
51184D45376n42K18R38O00m97j076o01R0N3n87j068j022o63l07j71l63p22p64
$$ 445376 444834 445052 445990 446590 446093 445017 444416 444506 444559 443972 442904 441882 441219 440912 440741 440378 439656 438892
51166D38892j21J001J943K225J998J891K259K630K247J167L39K60K21n49j633
$$ 438892 438771 439772 441715 443940 445938 447829 450088 452718 454965 456132 456471 456731 456952 456403 454770
51151D54770k133k125k267k333j519k01P3j142k308j974o97k8m44j263j885k120
$$ 454770 452637 450512 448245 445912 444393 444192 444265 443123 440815 438841 438144 438116 437672 436409 434524 432404
51135D32404j711n58P75J560J761J809J777J511J296J560K025J977J464J403K294
$$ 432404 430693 430135 430910 432470 434231 436040 437817 439328 440624 442184 444209 446186 447650 449053 451347
51120D51347L459L857L240K200J390R65O43J15n06o73j0J126K015K376K485K489
$$ 451347 454806 458663 461903 464103 465493 466458 467101 467216 466710 466037 466027 467153 469168 471544 474029 476518
51104D76518K113J260N31O59J570K389K447J905J326Q81L31m17j056j298j177
$$ 476518 478631 479891 480422 481081 482651 485040 487487 489392 490718 491599 491930 491513 490457 489159 487982
51089D87982q76m89j23Q4K36O31J177J291P58K47L97P95O40J12J46Q53J304J053
$$ 487982 487106 486617 486494 486578 486814 487445 488622 489913 490671 490918 491315 492110 492750 492862 493008 493861 495165 496218
51071D96218Q49J407K368L075L601M320N117N784O664Q171J0125J2214J4645J7613
$$ 496218 497067 498474 500842 503917 507518 511838 516955 522739 529403 537574 547699 559913 574558 592171
51057E92171K0535K2590K3657K3836K2487J9019J4442J0863R219Q588Q029P914
$$ 592171 612706 635296 658953 682789 705276 724295 738737 749600 758819 767407 775436 783350
51045G83350Q713R429Q381N201J161k374n144p617r994j1872j2617j1917j0100
$$ 783350 792063 801492 809873 815074 816235 813861 808717 801100 791106 779234 766617 754700 744600
51032G44600p928o081m965n018o787j0286j4345j7049j7090j4695j1215p922n305
$$ 744600 736672 730591 725626 720608 713821 703535 689190 672141 655051 640356 629141 621219 615914
51019F15914l266j672m75N66J877L669N694P551R114J0482J1613J2325J2580J2530
$$ 615914 612648 610976 610501 611067 612944 616613 622307 629858 638972 649454 661067 673392 685972 698502
51005F98502J2181J1315R908Q432P488P129O741N643L713J393p82k536l775m408
$$ 698502 710683 721998 731906 740338 747826 754955 761696 767339 771052 772445 771663 769127 765352 760944
50991G60944m445m161l907l721l301k385r88Q16L055N679Q405J0999J3520J6112
$$ 760944 756499 752338 748431 744710 741409 739024 738036 738852 741907 747586 755991 766990 780510 796622
50977G96622J8656K0855K2548K3595K3658K2651K1425K1511K3712K7284L0930
$$ 796622 815278 836133 858681 882276 905934 928585 950010 971521 995233 1022517 1053447
50966A053447L4412L8596M3910M9432N3940N7350O0503O3725O6345O7745O8122
$$ 1053447 1087859 1126455 1170365 1219797 1273737 1331087 1391590 1455315 1521660 1589405 1657527
50955A657527O7842O6644O4088O0400N6075N0927M4400L6875K9780K4039J9104
$$ 1657527 1725369 1792013 1856101 1916501 1972576 2023503 2067903 2104778 2134558 2158597 2177701
50944B177701J4128R478O291M892M407M030L758L673L127J259j932n567q983j2343
$$ 2177701 2191829 2201307 2207598 2212490 2216897 2220927 2224685 2228358 2231485 2232744 2230812 2225245 2216262 2203919
50930B203919j6102k0185k4088k7614l1111l4935l8981m2958m6879n0954n5066
$$ 2203919 2187817 2167632 2143544 2115930 2084819 2049884 2010903 1967945 1921066 1870112 1815046
50919A815046n8607o0932o1811o1412n9933n7410n3887m9797m5896m2592l9380
$$ 1815046 1756439 1695507 1633696 1572284 1512351 1454941 1401054 1351257 1305361 1262769 1223389
50908A223389l5477l1026k7245k5066k4070k3154k1784k0099j8253j6402j5022
$$ 1223389 1187912 1156886 1129641 1104575 1080505 1057351 1035567 1015468 997215 980813 965791
50897I65791j4392j3857j2448j0200q099o582n058l127j368m80l45m56o33p75
$$ 965791 951399 937542 925094 914894 906795 900213 895155 892028 890660 890180 889835 889379 888746 887971
50883H87971n02L72J440K263L003M010N230O433P572Q533R067R432J0486J2522
$$ 887971 887469 887841 889281 891544 894547 898557 903787 910220 917792 926325 935392 944824 955310 967832
50869I67832J4534J5414J5440J5778J6956J8687K0802K3363K6039K8482L1204
$$ 967832 982366 997780 1013220 1028998 1045954 1064641 1085443 1108806 1134845 1163327 1194531
50858A194531L5049L9739M4034M7664N1983N8169O5697P3251Q0514Q8237R6948
$$ 1194531 1229580 1269319 1313353 1361017 1413000 1471169 1536866 1610117 1690631 1778868 1875816
50847A875816J06382J15945J25101J33327J40196J45672J49989J53143J54636
$$ 1875816 1982198 2098143 2223244 2356571 2496767 2642439 2792428 2945571 3100207
50838C100207J53714J49774J42616J32379J19259J03315Q4795O4691M4691K6304
$$ 3100207 3253921 3403695 3546311 3678690 3797949 3901264 3986059 4050750 4095441 4121745
50828D121745J0084m095j6205k5686l1878l4549l3886l0214k4016j6289q559k241
$$ 4121745 4131829 4127734 4111529 4085843 4053965 4019416 3985530 3955316 3931300 3915011 3906452 3904211
50816C904211J875L345J405m857j5534k9448m4991o1130p7404r3322j08148j21276
$$ 3904211 3906086 3909431 3910836 3905979 3890445 3860997 3816006 3754876 3677472 3584150 3476002 3354726
50804C354726j32342j41011j46835j49351j48320j43989j37192j28791j18994
$$ 3354726 3222384 3081373 2934538 2785187 2636867 2492878 2355686 2226895 2107901
50795B107901j07580r5044q2868p2202o2690n3243m3666l4836k7462k1414j6311
$$ 2107901 2000321 1905277 1822409 1750207 1687517 1634274 1590608 1555772 1528310 1506896 1490585
50784A490585j2031q577n914m126l297l146l242l560m411n819p370q753r940j0840
$$ 1490585 1478554 1469977 1464063 1459937 1456640 1453494 1450252 1446692 1442281 1436462 1429092 1420339 1410399 1399559
50770A399559j1347j1748j2576j3881j5202j6375j7752j9363k0507k0557j9762
$$ 1399559 1388212 1376464 1363888 1350007 1334805 1318430 1300678 1281315 1260808 1240251 1220489
50759A220489j8851j8153j7457j6395j4716j2472j0168q393p015n154k268J158
$$ 1220489 1201638 1183485 1166028 1149633 1134917 1122445 1112277 1103884 1096869 1091715 1089447 1090605
50747A090605M352P267J0350J3688J7033K0474K4423K8874L3250L7233M1242M5896
$$ 1090605 1094957 1102224 1112574 1126262 1143295 1163769 1188192 1217066 1250316 1287549 1328791 1374687
50735A374687N1168N6410O0974O4714O7851P0613P3054P5096P6645P7547P7576
$$ 1374687 1425855 1482265 1543239 1607953 1675804 1746417 1819471 1894567 1971212 2048759 2126335
50724B126335P6600P4760P2341O9426O5851O1409N5905M8933L9927K8658J5665
$$ 2126335 2202935 2277695 2350036 2419462 2485313 2546722 2602627 2651560 2691487 2720145 2735810
50713B735810K075j0976k2675l2472l9786m3789m3671l9409l2304k4401j7144
$$ 2735810 2737885 2726909 2704234 2671762 2631976 2588187 2544516 2505107 2472803 2448402 2431258
50702B431258j0774n069k20L296N289N696L958p54q472j8094k8475l9445n1221
$$ 2431258 2420484 2415415 2415195 2418491 2423780 2429476 2433434 2432680 2424208 2406114 2377639 2338194 2286973
50689B286973o3006p2853p9191q2007q2295q0716p7222p1751o4724n6815m8642
$$ 2286973 2223967 2151114 2071923 1989916 1907621 1826905 1749683 1677932 1613208 1556393 1507751
50678A507751m0619l2790k4775j6317p930m88N780J1406J6730K1440K5269K8348
$$ 1507751 1467132 1434342 1409567 1393250 1385320 1384832 1390612 1402018 1418748 1440188 1465457 1493805
50666A493805L0484L0873K9250K6704K4538K2720K0343J7328J4671J3112J2561
$$ 1493805 1524289 1555162 1584412 1611116 1635654 1658374 1678717 1696045 1710716 1723828 1736389
50655A736389J2762J3652J4817J5566J5937J6828J8715K0909K2631K4164K6399
$$ 1736389 1749151 1762803 1777620 1793186 1809123 1825951 1844666 1865575 1888206 1912370 1938769
50644A938769K9616L3297L6886M0187M3129M5633M7711M9385N0554N1024N0603
$$ 1938769 1968385 2001682 2038568 2078755 2121884 2167517 2215228 2264613 2315167 2366191 2416794
50633B416794M9101M6511M3294M0153L7365L4625L1733K9028K6781K4479K1114
$$ 2416794 2465895 2512406 2555700 2595853 2633218 2667843 2699576 2728604 2755385 2779864 2800978
50622B800978J5976Q736r52j3191k6872l9397m7826n0445m7322l9798k9845j9618
$$ 2800978 2816954 2825690 2824738 2811547 2784675 2745278 2697452 2647007 2599685 2559887 2530042 2510424
50610B510424j0929m531q9K914M360L797J119l645j0894k0901l2597m3888n3620
$$ 2510424 2499495 2494964 2494875 2497789 2502149 2505946 2507065 2503420 2492526 2471625 2439028 2395140 2341520
50597B341520o2229p0022p5794p8257p7961p6549p4548p1273o6673o1844n7503
$$ 2341520 2279291 2209269 2133475 2055218 1977257 1900708 1826160 1754887 1688214 1626370 1568867
50586A568867n3283m8957m5171m2407m0098l7338l3915l0187k6569k3392k0715
$$ 1568867 1515584 1466627 1421456 1379049 1338951 1301613 1267698 1237511 1210942 1187550 1166835
50575A166835j7987j4546j0586o949l819o39K524M739N837P115R580J2484J4511
$$ 1166835 1148848 1134302 1123716 1116767 1112948 1112309 1114833 1119572 1125409 1132524 1142104 1154588 1169099
50562A169099J5652J6863J8589K0638K2975K5589K7952K9644L1142L3017L4641
$$ 1169099 1184751 1201614 1220203 1240841 1263816 1289405 1317357 1347001 1378143 1411160 1445801
50551A445801L4870L3826L2910L2927L3243L3027L2385L1915L1890L2310L3268
$$ 1445801 1480671 1514497 1547407 1580334 1613577 1646604 1678989 1710904 1742794 1775104 1808372
50540A808372L4873L7132M0173M4299M9585N5689O2194O8960P5997Q3140R0048
$$ 1808372 1843245 1880377 1920550 1964849 2014434 2070123 2132317 2201277 2277274 2360414 2450462
50529B450462R6471J02481J08309J13898J18831J22899J26453J29632J31561J31095
$$ 2450462 2546933 2649414 2757723 2871621 2990452 3113351 3239804 3369436 3500997 3632092
50519C632092J28226J23779J17514J07897R4282P8150O1174M3146K3017J250k0384
$$ 3632092 3760318 3884097 4001611 4109508 4203790 4281940 4343114 4386260 4409277 4410527 4390143
50508D390143m0880o0396p8672r4364j06250j14033j17782j17459j13126j04894
$$ 4390143 4349263 4288867 4210195 4115831 4009581 3895548 3777766 3660307 3547181 3442287
50498C442287r2635p6584n8159l9179k0272j166J7392L3145M4192N0262N1614
$$ 3442287 3349652 3273068 3214909 3175730 3155458 3154292 3171684 3204829 3249021 3299283 3350897
50487C350897M7763L8025K2606K420k1519m7749p3899r7412j16616j30787j39617
$$ 3350897 3398660 3436685 3459291 3461711 3440192 3392443 3318544 3221132 3104516 2973729 2834112
50476B834112j43222j42427j38327j31665j22972j13074j02948r3095q3441p3971
$$ 2834112 2690890 2548463 2410136 2278471 2155499 2042425 1939477 1846382 1762941 1688970
50466A688970o5190n7816n2115m7606m3591l9914l6853l4168l0773k5926k0394
$$ 1688970 1623780 1565964 1513849 1466243 1422652 1382738 1345885 1311717 1280944 1255018 1234624
50455A234624j5629j1982q588m955j666Q66L243O118R059J1190J2541J4056J6420
$$ 1234624 1218995 1207013 1198425 1193470 1191804 1192670 1195913 1202031 1211090 1222280 1234821 1248877 1265297
50442A265297J9441K2408K4659K5856K6044K5387K3738K0724J6429J1681P454
$$ 1265297 1284738 1307146 1331805 1357661 1383705 1409092 1432830 1453554 1469983 1481664 1489118
50431A489118M273K323J646J994K888M184O131Q527J0411J1191J1681J3315J6480
$$ 1489118 1493391 1495714 1497360 1499354 1502242 1506426 1512557 1521084 1531495 1542686 1554367 1567682 1584162
50418A584162K0237K3643K6758L0295L4790M0234M6130N1759N6615O0680O4181
$$ 1584162 1604399 1628042 1654800 1685095 1719885 1760119 1806249 1858008 1914623 1975303 2039484
50407B039484O7126O9219P0195O9905O8175O4896O0220N4523M7993M0502L1917
$$ 2039484 2106610 2175829 2246024 2315929 2384104 2449000 2509220 2563743 2611736 2652238 2684155
50396B684155K2372J2102J115j0805k3640l6713m8899n9316o7736p4201p8475
$$ 2684155 2706527 2718629 2719744 2708939 2685299 2648586 2599687 2540371 2472635 2398434 2319959
50385B319959q0045p8523p3826o6205n6455m5905l5653k5768j5710n514L928J1744
$$ 2319959 2239914 2161391 2087565 2021360 1964905 1919000 1883347 1857579 1841869 1836355 1840283 1852027
50373A852027J7559K1014K1460J8583J2902N270l702j3545k3705l3746m3382n2004
$$ 1852027 1869586 1890600 1912060 1930643 1943545 1948815 1945113 1931568 1907863 1874117 1830735 1778731
50361A778731n8578o2384o3501o2343n9251n4825m9956m5045l9740l3969k8625
$$ 1778731 1720153 1657769 1594268 1531925 1472674 1417849 1367893 1322848 1283108 1249139 1220514
50350A220514k4463k0970j7262j3615j1119j0054r788j0176j1850j4853j8011
$$ 1220514 1196051 1175081 1157819 1144204 1133085 1123031 1113243 1103067 1091217 1076364 1058353
50339A058353k0100k0874k0500j8821j5784j2095q751o162m177k701j796j335
$$ 1058353 1038253 1017379 996879 978058 962274 950179 941428 935266 931089 928388 926592 925257
50327I25257r62l86M79J579K800M077N449O830P767P844P330P044P318P605P350
$$ 925257 924295 923909 924388 925967 928767 932844 938293 945123 952890 960734 968064 975108 982426 990031 997381
50312I97381O812O616O869P150P201P207P554Q580J0363J2340J3453J3200J2456
$$ 997381 1004193 1010809 1017678 1024828 1032029 1039236 1046790 1055370 1065733 1078073 1091526 1104726 1117182
50299A117182J2706J4528J7222J9957K2646K5677K9382L3976L9320M4376M7355
$$ 1117182 1129888 1144416 1161638 1181595 1204241 1229918 1259300 1293276 1332596 1376972 1424327
50288A424327M6959M3046L5604K3699O620j3757l2836m6144n2068n1676m6782
$$ 1424327 1471286 1514332 1549936 1573635 1580255 1566498 1533662 1487518 1435450 1383774 1336992
50277A336992l9088l0584k3298j8041j4049j0316o812m030j917qJ728K877L472
$$ 1336992 1297904 1267320 1244022 1225981 1211932 1201616 1194804 1190774 1188857 1188849 1190577 1193454 1196926
50264A196926M128N126N990O272O371P030Q456J0286J2262J4419J6767J9160K1378
$$ 1196926 1201054 1206180 1212170 1218442 1224813 1231843 1240299 1250585 1262847 1277266 1294033 1313193 1334571
50251A334571K2892K2785K0591J7316J4864J4086J4034J3474J2526J2018J1771
$$ 1334571 1357463 1380248 1400839 1418155 1433019 1447105 1461139 1474613 1487139 1499157 1510928
50240A510928J0550P730L950n9m442r451j4441j8356k0805k1982k1790j9885j6645
$$ 1510928 1521478 1529208 1533158 1533099 1528657 1519206 1504765 1486409 1465604 1443622 1421832 1401947 1385302
50227A385302j3432j1505j1056j1478j2429j4406j8224k3906l0040l4494l6018
$$ 1385302 1371870 1360365 1349309 1337831 1325402 1310996 1292772 1268866 1238826 1204332 1168314
50216A168314l5063l2862l0090k6875k3669k1245j9672j8127j6037j3830j2085
$$ 1168314 1133251 1100389 1070299 1043424 1019755 998510 978838 960711 944674 930844 918759
50205I18759j0670r250q210q142q644q519p358o142n881o240o068m985l802l383
$$ 918759 908089 898839 890629 882487 873843 865324 857966 851824 845943 839703 833635 828650 824848 821465
50191H21465l659l987m041l972l893l734l567l674m096m440m289l717l081k630
$$ 821465 817806 813819 809778 805806 801913 798179 794612 790938 786842 782402 778113 774396 771315 768685
50177G68685k493k888l831m786m973m163k830j475j45J189K244K658K510K281
$$ 768685 766192 763304 759473 754687 749714 745551 742721 741246 741101 742290 744534 747192 749702 751983
50163G51983K400K952L735M402M673M603M646N252O409P690Q707R444J0227J1429
$$ 751983 754383 757335 761070 765472 770145 774748 779394 784646 791055 798745 807452 816896 827123 838552
50149H38552J3171J5224J7189J8817K0108K1145K1996K2919K4474K7178L0880
$$ 838552 851723 866947 884136 902953 923061 944206 966202 989121 1013595 1040773 1071653
50138A071653L4699L7795M0190M2521M4931M6504M6255M4486M2613M1546M0839
$$ 1071653 1106352 1144147 1184337 1226858 1271789 1318293 1364548 1409034 1451647 1493193 1534032
50127A534032L9586L7589L5114L2023K7724K1789J4021M333o761j7791k7292l5095
$$ 1534032 1573618 1611207 1646321 1678344 1706068 1727857 1741878 1746211 1739450 1721659 1694367 1659272
50115A659272m1874m7524n0956n1596n0126m7464m3919l9785l5712l1912k7849
$$ 1659272 1617398 1569874 1518918 1467322 1417196 1369732 1325813 1286028 1250316 1218404 1190555
50104A190555k3450j9792j7778j6934j6413j6371j7121j7677j6768j5064j4603
$$ 1190555 1167105 1147313 1129535 1112601 1096188 1079817 1062696 1045019 1028251 1013187 998584
50093I98584j5771j6466j4962j2141r940q659p157n020l057j788o96P15K102K924
$$ 998584 982813 966347 951385 939244 929304 920645 913488 908468 905411 903623 902927 903642 905744 908668
50079I08668L284L597L855L791L590L867M919O304P318P697P612P239O537N524
$$ 908668 911952 915549 919404 923195 926785 930652 935571 941875 949193 956890 964502 971741 978278 983802
50065I83802M477L731L327K997K437J534L22j139k804m516n897o497o223n546
$$ 983802 988279 992010 995337 998334 1000771 1002305 1002627 1001488 998684 994168 988271 981774 975551 970005
50051I70005n049m711l966k543j011j71j34k25K89J644L646N945Q212J0247J2022
$$ 970005 964956 960245 956279 953736 952725 952554 952420 952195 952484 954128 957774 963719 971931 982178 994200
50036I94200J3504J4583J5259J5821J6567J7433J8173J8824J9663K0641K1265
$$ 994200 1007704 1022287 1037546 1053367 1069934 1087367 1105540 1124364 1144027 1164668 1185933
50025A185933K1155K0602K0258K0442K0898K1265K1595K2301K3549K4806K5181
$$ 1185933 1207088 1227690 1247948 1268390 1289288 1310553 1332148 1354449 1377998 1402804 1427985
50014A427985K4247K2359K0022J7116J3088P939K798p29j909j598j686l641p535
$$ 1427985 1452232 1474591 1494613 1511729 1524817 1532756 1535554 1534825 1532916 1531318 1529632 1525991 1518456
50001A518456j2375j7245k1950k6605l0984l4445l6278l6078l4160l1694k9992
$$ 1518456 1506081 1488836 1466886 1440281 1409297 1374852 1338574 1302496 1268336 1236642 1206650
49990A206650k9245k8270k6003k2950k0662j9909k0008j9962j9624j9513j9948
$$ 1206650 1177405 1149135 1123132 1100182 1079520 1059611 1039603 1019641 1000017 980504 960556
49979I60556k0646k0918k0126j8211j5931j4256j3401j2773j1866j0766r616q167
$$ 960556 939910 918992 898866 880655 864724 850468 837067 824294 812428 801662 792046 783879
49967G83879o314m679m025m217m355m011l729m031m378l686j772K75J394J867
$$ 783879 777565 772886 768861 764644 760289 756278 752549 748518 744140 740454 738682 738957 740351 742218
49953G42218K898M990P275Q631R009R280R964J0644J0589R572P955O275M876L708
$$ 742218 745116 750106 757381 766012 775021 784301 794265 804909 815498 825070 833025 839300 844176 847884
49939H47884K434Q27r22k499l959n591p337q823j0044j1524j3517j5397j6205
$$ 847884 850318 851145 850223 847724 843765 838174 830837 822014 811970 800446 786929 771532 755327
49926G55327j5541j3680j1151q570o656n796n580n135m022k540j145J16J465K910
$$ 755327 739786 726106 714955 706385 699729 693933 688353 683218 679196 676656 675511 675627 677092 680002
49912F80002M091M553M167L415L157L891N271O518P360Q266R675J1327J2534J2958
$$ 680002 684093 688646 692813 696228 699385 703276 708547 715065 722425 730691 740366 751693 764227 777185
$$ [...]
##END NTUPLES=NMR SPECTRUM
##END=
