##TITLE=AC1421_GUAAH12231_7764224_7nlsLHRoiK
##JCAMPDX= 6.0         $$ Bruker NMR JCAMP-DX V2.0
##DATA TYPE= NMR SPECTRUM
##DATA CLASS= NTUPLES
##ORIGIN= BRUKER
##OWNER= Administrator
$$ 1.72 TOPSPIN		Version 2.1
$$ 2013-04-16 21:53:25.638 -0700  Administrator@X
$$ Compression mode = diff/dup
##.OBSERVE FREQUENCY= 400.02188249412
##.OBSERVE NUCLEUS= ^1H
##.ACQUISITION MODE= SIMULTANEOUS (DQD)
##.ACQUISITION SCHEME= undefined
##.AVERAGES= 8
##.DIGITISER RES= 22
##SPECTROMETER/DATA SYSTEM= spect
##.PULSE SEQUENCE= zg30
##.SOLVENT NAME= COFFEE_meoh
##.SHIFT REFERENCE= INTERNAL, COFFEE_meoh, 1, 14.98509
##AUDIT TRAIL= $$ (NUMBER, WHEN, WHO, WHERE, PROCESS, VERSION, WHAT)
$$ ##TITLE= Audit trail, TOPSPIN		Version 2.1
$$ ##JCAMPDX= 5.01
$$ ##ORIGIN= Bruker BioSpin GmbH
$$ ##OWNER= Administrator
$$ $$ E:\/data/COFFEE/nmr/AC1421_GUAAH12231_7764224_7nlsLHRoiK/10/pdata/1/auditp.txt
$$ ##AUDIT TRAIL=  $$ (NUMBER, WHEN, WHO, WHERE, PROCESS, VERSION, WHAT)
(   1,<2013-04-16 21:53:18.557 -0700>,<Administrator>,<X>,<go>,<TOPSPIN 2.1>,
      <created by zg
	started at 2013-04-16 21:52:12.120 -0700,
	POWCHK enabled, PULCHK disabled,
       configuration hash MD5:
       33 CF 6A 21 5C D3 B9 40 6C 15 AA 8D 27 A2 4F 13
       data hash MD5: 64K
       B8 49 B8 00 55 66 E9 A9 50 DB 50 DD 43 E9 88 B1>)
(   2,<2013-04-16 21:53:21.573 -0700>,<Administrator>,<X>,<proc1d>,<TOPSPIN 2.1>,
      <Start of raw data processing
       efp LB = 0 FT_mod = 6 PKNL = 1 PHC0 = 0 PHC1 = 0 SI = 32K 
       data hash MD5: 32K
       6C 82 B6 A1 BB A9 8A E1 5A B7 AA E7 89 23 43 D9>)
(   3,<2013-04-16 21:53:21.932 -0700>,<Administrator>,<X>,<proc1d>,<TOPSPIN 2.1>,
      <pk PHC0 = 98.54736 PHC1 = 0 
       data hash MD5: 32K
       0A 9E 3F 51 62 8B 6B 4B 5C DE 4E 2B 8C 57 2D DE>)
(   4,<2013-04-16 21:53:22.041 -0700>,<Administrator>,<X>,<proc1d>,<TOPSPIN 2.1>,
      <abs ABSG = 1 
       data hash MD5: 32K
       15 9B 9E 3D C2 6B 79 F2 A2 70 D1 B8 AD 8B C6 D5>)
(   5,<2013-04-16 21:53:22.104 -0700>,<Administrator>,<X>,<proc1d>,<TOPSPIN 2.1>,
      <abs ABSG = 2 
       data hash MD5: 32K
       42 28 97 56 C0 E6 6D CF 1F C2 10 0A 21 B3 7D F4>)
(   6,<2013-04-16 21:53:22.198 -0700>,<Administrator>,<X>,<proc1d>,<TOPSPIN 2.1>,
      <abs ABSG = 3 
       data hash MD5: 32K
       5C 1B 6B A5 49 D6 3A B2 0C CC 7A A8 6C C6 1B BA>)
(   7,<2013-04-16 21:53:22.260 -0700>,<Administrator>,<X>,<proc1d>,<TOPSPIN 2.1>,
      <abs ABSG = 4 
       data hash MD5: 32K
       45 1A 1D 80 9F F6 C2 7C F2 A6 BD 90 54 A0 54 68>)
(   8,<2013-04-16 21:53:22.323 -0700>,<Administrator>,<X>,<proc1d>,<TOPSPIN 2.1>,
      <abs ABSG = 5 
       data hash MD5: 32K
       53 6D E1 50 EA B0 BD 66 FA 1A 59 C4 BC 8C 21 08>)
$$ ##END=
$$ 
$$ $$ hash MD5
$$ $$ A2 7A 81 93 C5 21 69 C0 73 B3 1B 77 97 C0 70 9D
##$RELAX= 
##$RELAX= 
##$RELAX= 
##$RELAX= 
##$RELAX= 
##$RELAX= 
##$RELAX= 
$$ Bruker specific parameters
$$ --------------------------
##$DU= <E:\>
##$EXPNO= 10
##$NAME= <AC1421_GUAAH12231_7764224_7nlsLHRoiK>
$$ [...]
150 150 150 150 150 150 150 150
##$TP07= 0
##$TPNAME0= <>
##$TPNAME1= <>
##$TPNAME2= <>
##$TPNAME3= <>
##$TPNAME4= <>
##$TPNAME5= <>
##$TPNAME6= <>
##$TPNAME7= <>
##$TPOAL= (0..7)
0.5 0.5 0.5 0.5 0.5 0.5 0.5 0.5
##$TPOFFS= (0..7)
0 0 0 0 0 0 0 0
##$TUNHIN= 0
##$TUNHOUT= 0
##$TUNXOUT= 0
##$USERA1= <user>
##$USERA2= <user>
##$USERA3= <user>
##$USERA4= <user>
##$USERA5= <user>
##$V9= 5
##$VALIST= <valist>
##$VCLIST= <CCCCCCCCCCCCCCC>
##$VD= 0
##$VDLIST= <DDDDDDDDDDDDDDD>
##$VPLIST= <PPPPPPPPPPPPPPP>
##$VTLIST= <TTTTTTTTTTTTTTT>
##$WBST= 2048
##$WBSW= 25
##$XGAIN= (0..3)
0 0 0 0
##$XL= 0
##$YL= 0
##$YMAX_a= 612558
##$YMIN_a= -522057
##$ZGOPTNS= <>
##$ZL1= 120
##$ZL2= 120
##$ZL3= 120
##$ZL4= 120
##$ABSF1= 14.98509
##$ABSF2= -5.573092
##$ABSG= 5
##$ABSL= 3
##$ALPHA= 0
##$AQORDER= 0
##$ASSFAC= 0
##$ASSFACI= 0
##$ASSFACX= 0
##$ASSWID= 0
##$AUNMP= <proc_prof1d_extract_pilot.lims>
##$AXLEFT= 0
##$AXNAME= <>
##$AXNUC= <1H>
##$AXRIGHT= 0
##$AXTYPE= 0
##$AXUNIT= <>
##$AZFE= 0.1
##$AZFW= 0.1
##$BCFW= 0
##$BC_mod= 0
##$BYTORDP= 0
##$COROFFS= 0
##$CY= 15
##$DATMOD= 1
##$DC= 0
##$DFILT= <>
##$DTYPP= 0
##$F1P= 0
##$F2P= 0
##$FCOR= 0.5
##$FTSIZE= 32768
##$FT_mod= 6
##$GAMMA= 0
##$GB= 0
##$INTBC= 1
##$INTSCL= 1
##$ISEN= 128
##$LB= 0
##$LEV0= 0
##$LPBIN= 0
##$MAXI= 10000
##$MC2= 0
##$MEAN= 0
##$ME_mod= 0
##$MI= 0
##$NCOEF= 0
##$NC_proc= -8
##$NLEV= 6
##$NOISF1= 0
##$NOISF2= 0
##$NSP= 0
##$NTH_PI= 0
##$NZP= 0
##$OFFSET= 14.98509
##$PC= 1
##$PHC0= 98.54736
##$PHC1= 0
##$PH_mod= 1
##$PKNL= yes
##$PPARMOD= 0
##$PPDIAG= 0
##$PPIPTYP= 0
##$PPMPNUM= 2147483647
##$PPRESOL= 1
##$PSCAL= 4
##$PSIGN= 0
##$PYNMP= <proc.py>
##$REVERSE= no
##$SF= 400.02
##$SI= 32768
##$SIGF1= 0
##$SIGF2= 0
##$SINO= 400
##$SIOLD= 32768
##$SPECTYP= <>
##$SREGLST= <1H.CDCl3>
##$SSB= 0
##$STSI= 32768
##$STSR= 0
##$SW_p= 8223.68421052631
##$SYMM= 0
##$S_DEV= 0
##$TDeff= 65536
##$TDoff= 0
##$TI= <>
##$TILT= no
##$TM1= 0
##$TM2= 0
##$TOPLEV= 0
##$USERP1= <user>
##$USERP2= <user>
##$USERP3= <user>
##$USERP4= <user>
##$USERP5= <user>
##$WDW= 1
##$XDIM= 32768
##$YMAX_p= 464778221
##$YMIN_p= -743009
##$CURPLOT= <Network HP LaserJet P1505>
##$CURPRIN= <$Network HP LaserJet P1505>
##$DFORMAT= <normdp>
##$LAYOUT= <+/1D_H.xwp>
##$LFORMAT= <normlp>
##$PFORMAT= <normpl>
##$SURQMSG= 1
$$ End of Bruker specific parameters
$$ ---------------------------------
##NTUPLES= NMR SPECTRUM
##VAR_NAME=  FREQUENCY,     SPECTRUM/REAL,   SPECTRUM/IMAG
##SYMBOL=    X,             R,               I
##VAR_TYPE=  INDEPENDENT,   DEPENDENT,       DEPENDENT
##VAR_FORM=  AFFN,          ASDF,            ASDF
##VAR_DIM=   32768,         32768,           32768
##UNITS=     HZ,            ARBITRARY UNITS, ARBITRARY UNITS
##FACTOR=    0.250966925370066, 1,           1
##FIRST=     8223.43324360094, -252723,      -85219
##LAST=      0,             -71236,          -52030
##MIN=       0,             -743009,         0
##MAX=       8223.43324360094, 464778221,    0
$$ Real data points
##PAGE= N=1
##DATA TABLE= (X++(R..R)), XYDATA
$$ [...]
$$ plain form
19529 -214847 -260266 128146 175036 60156 -273189 -7689 343542 19617 96587 -73592 60424
19517 123286 -154200 127345 -62454 -63839 -203341 34531 -29759 -19416 -83718 -163148 77906
19505 -11468 5569 -126730 -95360 -308683 -238151 608730 -167852 -39480 -175612 -213810 10129
19493 -114537 -119558 164353 518869 -33394 40168 -104086 -166114 234214 -85507 17008 286119
19482 286119 -679813 208469 10094 -90213 -80820 -220732 -140970 169361 -321275 -15784 -148060
19471 -148060 -134986 -267500 -197861 -67823 -479929 3606 41611 147291 -10575 -114154 177946
19459 43548 -28474 -143628 -316256 187461 62756 -208736 -241044 163982 -127850 -169793
19449 -169793 -106629 174886 -92188 95152 -13377 114542 -23045 -44248 -108438 56602 231483
$$ packed form
19529b14847m5419A28146M6890F0156b73189g689C43542A9617P6970g3592F0424
19517A23286a54200A27345f2454j385j39502C4531b9759J0343o4302p9430G7906
19505a1468E569a26730L1370k13323P0532F08730a67852c9480j36132l8198A0129
19493a14537n021A64353L54516c3394D0168a04086o2028B34214h5507A7008K69111
19482B86119f79813B08469A0094i0213R393j39912P9762A69361c21275a5784j32276
19471a48060J3074j32514O9639f7823m12106C606L8005J05680a0575j03579A77946
19459D3548b8474j15154j72628A87461F2756b08736l2308A63982a27850m1943
19449a69793O3164A74886i2188I5152a3377A14542b3045k1203o4190E6602J74881
$$ plain form
19438 231483 -265731 -213160 -249787 141049 201395 -344331 -23855 69878 271020 -14535 -293616
19427 -293616 297072 -81819 -410504 -108466 -134951 -364871 -98103 -30690 -79656 31084 -62835
19415 -17484 267509 -154867 -265267 -140058 -243800 -324749 -311383 -291351 -123571 -27792
19404 23992 -17682 119195 173610 -117975 -52863 -57006 -76736 -163538 -83758 -134693 -386359
19393 -386359 -123796 -189012 -166074 -159514 -67061 -116634 -75938 -8162 -118100 -225125 -314720
19382 -314720 80300 -275304 -162839 178 99237 -84406 62425 67810 -179983 -290275 2548
19370 -124347 147552 -362978 -148721 -18543 -35680 -163931 -318503 96111 118350 -227920
19359 -294675 228203 103308 -87003 -134353 -119578 -190169 -64081 59335 72027 -166424 -50765
$$ packed form
19438B31483b65731N2571l6627A41049O0346c44331b3855F9878K01142a4535k79081
19427b93616B97072h1819l28685a08466k6485k29920i8103c0690m8966C1084f2835
19415a7484B67509a54867j10400J25209j03742q0949J3366K0032a23571b7792
19404B3992a7682A19195N4415a17975e2863m143j9730q6802P9780n0935k51666
19393c86359a23796o5216K2938O560f7061m9573M0696h162j09938j07025q9595
19382c14720H0300b75304J12465A78R9059h4406F2425N385a79983j10292B548
19370a24347A47552c62978a48721a8543j7137j28251j54572I6111K2239b27920
19359b94675B28203A03308h7003m7350J4775p0591f4081E9335J2692a66424e0765
$$ plain form
19347 -191644 -179135 -27198 106592 -179222 43073 -13967 -134823 -110498 -482850 -222777
19336 -272744 119645 -109380 -119778 -137447 -244127 5314 252211 156079 -183442 -272901 -197980
19325 -197980 461702 315891 -306168 161035 16510 -108353 99569 45641 -172124 -117686
19315 -117686 305230 198840 -380887 -11316 -322267 -226484 79 -243799 16084 -199353 -337475
19304 -337475 -12464 -78564 -11717 -133630 121412 -75984 -496499 -380191 190323 210770
19294 210770 -72585 99675 -155041 235002 -55566 86244 -76381 -61984 -162341 -212731 -60294
19282 -44448 66083 -172131 -69200 233419 -245982 178549 -37579 295293 -211169 -172546
19272 -172546 106167 385745 -191538 263916 -13622 -242907 16300 85528 310067 -242728
$$ packed form
19347a91644J2509b7198A06592a79222D3073a3967j20856K4325l72352b22777
19336b72744A19645a09380j0398j7669j06680E314K46897r6132a83442q9459P4921
19325a97980D61702j45811c06168A61035A6510a08353I9569D5641a72124N4438
19315a17686C05230j06390c80887a1316l10951R5783G9b43799A6084a99353j38122
19304c37475a2464o6100a1717j21913A21412g5984m20515J16308A90323K0447
19294B10770g2585I9675a55041B35002e5566H6244g6381J4397j00357n0390f0294
19282d4448F6083a72131f9200B33419b45982A78549c7579B95293b11169L8623
19272a72546A06167K79578a91538B63916a3622k29285A6300O9228K24539b42728
$$ plain form
19261 189596 80338 -130438 -91514 -137067 64960 307840 22949 -362157 55623 -140794 -201031
19250 -201031 221190 -193912 73968 108269 40594 -398825 -141533 -297149 111193 316388
19240 316388 65715 19832 -84056 199574 -69704 19016 -227546 -78777 -279378 -54393 -225618
19229 -225618 -306382 93272 220905 -221900 -8577 -60069 -88562 -86805 -311329 -116183 -158780
19218 -158780 -75850 -12425 -167627 265900 74432 162106 -175549 139649 180825 -123270
19207 33774 7170 212562 -125130 136006 -125355 149410 220548 222772 -67775 -102369 -51314
19196 -51314 -268164 44833 -38636 -190370 -305789 -141193 -249535 -13842 16286 257139
19186 257139 -374510 -146393 53237 -74081 73796 -17400 -340410 58324 -245568 -143833
$$ packed form
19261A89596H0338a30438L8924m5553F4960K42880B2949c62157E5623a40794o0237
19250b01031B21190a93912G3968L4301D0594c98825a41533j55616A11193K05195
19240C16388F5715A9832h4056A99574f9704A9016b27546g8777k00601e4393j71225
19229b25618q0764I3272J27633b21900h577n1492k8493J757k24524a16183m2597
19218a58780g5850a2425j55202B65900G4432Q7674a75549A39649M1176a23270
19207C3774G170K05392a25130A36006a25355A49410P1138K224f7775l4594N1055
19196e1314k16850D4833c8636j51734j15419a41193j08342a3842A6286K40853
19186B57139c74510a46393E3237g4081G3796a7400l23010E8324b45568J01735
$$ plain form
19176 -143833 28113 120876 -141855 -133293 -353576 -111961 -118402 -98593 -71372 231513 -332258
19164 -199303 -269258 -198511 -79408 -77160 -50834 160840 -3961 44509 186844 207044 468689
19153 468689 -255072 184155 -154835 -367151 -100173 42205 -28312 339003 -594212 -179485
19142 45187 -17533 -98359 -206026 94435 44628 172238 160724 125053 150873 -201369 -124975
19131 -124975 354491 -180936 24259 9034 199101 -82225 -67779 -307425 -78423 401259 821
19119 150269 18884 -103814 -366687 269363 -299859 -142428 -112507 172952 79457 -130380
19108 137851 32338 -79126 96803 -205431 -341236 287953 -295498 -97140 139078 -223661
19097 13692 -219035 108771 -40309 38874 -3430 -37357 166563 -103204 -65135 -181673 -84143
$$ packed form
19176a43833B8113R2763a41855Q562k20283a11961o441J9809K7221B31513c32258
19164a99303o9955P0747g9408K248K6326A60840c961D4509J42335K0200K61645
19153D68689b55072A84155a54835k12316a00173D2205b8312C39003e94212a79485
19142D5187a7533q0826j07667I4435D4628J27610j1514l5671K5820b01369P6394
19131a24975C54491a80936B4259I034J90067h2225J4446k39646g8423D01259H21
19119A50269A8884a03814k62873B69363b99859a42428K9921A72952G9457a30380
19108A37851C2338g9126I6803b05431j35805B87953b95498i7140A39078b23661
19097A3692b19035A08771d0309C8874c430l3927A66563a03204L8069j16538h4143
$$ plain form
19085 -214903 -33330 -139654 27365 -158790 26064 270407 -50936 -385781 -67349 -124728 -39433
19073 -236510 129962 -333483 -29633 -17569 -78782 20084 -46650 383764 183995 -20751 -460974
19062 -460974 -135822 -145136 59548 -100219 -221654 -70194 -10909 -270474 -404923 5175 -30140
19050 82010 -281692 -100838 58311 85774 -17330 11565 215990 -267169 80596 60185 -312829
19038 -112133 -383105 -259133 290014 401034 -386891 178351 97735 -134529 21340 4357
19027 63512 228980 212692 372611 -8814 -348501 103821 112839 -233813 -52605 98562 20767
19015 377917 -70897 -262896 -193492 -148384 -211284 -135492 61558 -251335 197555 19786 97067
19004 97067 -329987 -78546 -203641 7227 -143084 138184 -263497 135454 -70003 -24908 389705
$$ packed form
19085b14903c3330j06324B7365a58790B6064K44343e0936l34845f7349n7379c9433
19073b36510A29962c33483b9633J2064o1213B0084d6650C83764A83995b0751m40223
19062d60974a35822r314E9548a00219j21435g0194a0909k59565j34449E175c0140
19050H2010b81692a00838E8311K7463a7330A1565K04425b67169H0596k0411c12829
19038a12133k70972J23972B90014J11020c86891A78351q0616a34529B1340D357
19027F3512J65468j6288J59919h814l39687A03821R018b33813e2605I8562B0767
19015C77917g0897j91999O9404M5108o2900P5792F1558b51335A97555A9786P7281
19004I7067c29987g8546j25095G227a43084A38184b63497A35454g0003b4908C89705
$$ plain form
18992 -77022 -96119 79604 206670 -37831 -113795 -135866 33974 255163 -242967 12012 -58434
18980 -140514 -100979 241836 43923 -192796 -179405 -137513 -81549 -25669 -219616 34051 136121
18969 136121 -71748 38622 31068 -125758 -41881 67024 -51467 -95657 18975 -22891 19657
18957 -120942 -275479 357441 10173 109651 -178816 201537 -1440 -292363 156805 46915
18946 -43209 314405 198037 -29072 -150712 68486 -306411 -285028 216511 -32165 -178468
18936 -178468 -186201 -146196 233787 108967 -302093 -75070 -212448 -514484 -133596 -183406
18926 -183406 45718 -117496 262070 -44646 183049 -325604 -293167 -154523 -19886 50384
18915 20059 119822 106999 -55321 157006 -251850 -206911 180126 64305 -104609 225585 162376
$$ packed form
18992g7022j9097G9604J27066c7831p5964k2071C3974K21189b42967A2012e8434
18980a40514L9535B41836D3923a92796J3391M1892N5964b5669j93947C4051J02070
18969A36121g1748C8622p554a25758d1881F7024e1467m4190A8975b2891A9657
18957a20942j54537C57441A0173R9478a78816B01537a440k90923A56805D6915
18946d3209C14405j16368b9072j21640F8486c06411K1383B16511c2165j46303
18936a78468p733M0005B33787A08967c02093g5070j37378l02036a33596m9810
18926a83406D5718a17496B62070d4646A83049c25604L2437J38644a9886E0384
18915B0059R9763j2823e5321A57006b51850M4939A80126F4305a04609B25585o3209
$$ plain form
18904 162376 328 -3544 162513 -258370 163696 49315 -391284 -57624 122900 -103033 192676
18892 -38112 -16425 -48742 47206 -63151 -397664 256204 -170242 -5552 83991 -113977 219987
18880 -145504 85416 -397804 38005 36145 -251858 -125166 -42136 -405074 -678926 -12625 86340
18868 75926 66141 -175301 92707 162532 113886 -13715 46064 129208 -63705 35193 -194827
18856 32639 -196582 90155 -40274 -25422 326407 439329 -301931 143249 364561 -104204
18845 373906 25874 -84535 -65001 -46506 3356 -180375 270691 101633 -142389 -183724 60654
18833 -85617 -144540 -20322 177382 -87797 -184739 71857 -62345 -639623 266305 180218 16095
18821 166561 45263 -119254 -231905 137810 -57775 93960 -137985 95008 108391 -70927 142579
$$ packed form
18904A62376C28c544A62513b58370A63696D9315c91284e7624A22900a03033A92676
18892c8112a6425l2317D7206f3151l34513B56204a70242e552H3991a13977B19987
18880a45504H5416c97804C8005j860b51858a25166d2136l62938k73852a2625H6340
18868G5926r785a75301I2707O9825m8646a3715D6064Q3144f3705C5193a94827
18856C2639a96582I0155d0274J4852C26407J12922c01931A43249K21312a04204
18845C73906B5874h4535J9534J8495C356a80375B70691A01633a42389m1335F0654
18833h5617n8923b0322A77382h7797r6942G1857f2345n77278B66305q6087A6095
18821A66561D5263a19254j12651A37810e7775I3960a37985I5008J3383g0927A42579
$$ plain form
18809 311608 77299 24598 81274 496189 44957 125189 -189391 285542 -96831 24736 -159315
18797 -111458 85189 -91834 -84061 -82682 31239 203126 -57921 -235003 71553 -267532 -51653
18785 -130403 71736 84027 -125969 -79556 31053 -112940 -216513 53446 6877 -324313 -129178
18773 -178837 -217714 169062 62578 -139534 -262071 -21493 1729 29740 -288948 22871 -134638
18761 124086 -299213 68793 344209 -155386 -65632 185488 -116705 18121 -322137 -225600
18751 -225600 -114042 25306 224113 44474 336761 -127436 69722 176586 17389 48922
18741 48922 179448 -31270 -89061 -218648 146126 59647 244093 -152827 -237426 -65780 184407
18729 -308800 -275308 -173360 -148615 201041 -176995 227576 -1164 -112794 2901 35961 -390032
$$ packed form
18809C11608G7299B4598N6676M14915D4957Q0232a89391B85542i6831B4736a59315
18797a11458H5189i1834P773J379C1239J71887e7921j77082G1553b67532e1653
18785a30403G1736J2291a25969M6413C1053a12940j03573E3446F877c24313a29178
18773a78837l8877A69062F2578a39534j22537b1493A729K8011b88948B2871a34638
18761A24086b99213F8793K75416a55386f5632A85488a16705A8121c22137R6537
18751b25600J11558B5306J98807D4474K92287a27436F9722J06864A7389L1533
18741D8922J30526c1270n7791j29587A46126E9647J84446a52827q4599f5780A84407
18729c08800L3492J01948K4745B01041a76995B27576a164j11630B901L3060c90032
$$ plain form
18717 220324 73669 -325683 -177709 -72462 -161264 67385 -234187 -510765 -53645 -12146 51921
18705 -254392 -289089 177073 -80190 4669 -48684 -35729 -58350 -81099 134185 39252 187649
18694 187649 -109211 -202689 98391 186036 -155623 -69360 -167890 -339069 -9116 -246145 98758
18682 -92082 -40570 -183866 37032 69559 148641 -455494 -439982 -203316 4246 -35925 1594
18670 -93936 -215973 20998 -196329 -375888 114841 288737 182945 91217 272551 -169311
18659 66521 150809 -52632 -280433 204238 -254666 165063 330074 -129633 168111 70277
18648 161718 -62144 72757 -2798 -171220 -223544 127128 -49684 15776 -159597 -37006 -5900
18636 -381794 -83866 -203727 12944 -176255 131664 27835 -126807 174618 -217354 13006
$$ packed form
18717B20324G3669c25683J47974g2462q8802F7385b34187k76578e3645a2146E1921
18705b54392l4697A77073h0190D669d8684J2955k2621k2749A34185C9252J48397
18694A87649a09211r3478I8391Q7645a55623f9360r8530j71179i116k37029I8758
18682i2082d0570j43296C7032L2527P9082d55494J5512b03316D246c5925A594
18670i3936j22037B0998a96329j79559A14841J73896j05792I1217J81334a69311
18659F6521Q4288e2632k27801B04238b54666A65063J65011a29633A68111G0277
18648A61718f2144G2757b798j68422n2324A27128d9684A5776a59597c7006e900
18636c81794h3866j19861A2944a76255A31664B7835a26807A74618b17354A3006
$$ plain form
18625 291752 234324 -83330 -104733 -192281 -155616 -65118 128967 -78903 143369 -107586 -157970
18614 -157970 351717 123075 13882 29497 -2598 208877 -287862 97523 328365 -419258
18603 -43513 112887 443075 -164291 -30848 -335627 224498 236925 197909 -21144 -320417
18593 -320417 -51555 21441 -169080 -84156 86371 -223998 -98698 133034 -114495 -452893
18583 -452893 -54382 47535 -186458 -277804 -32082 -81571 26183 -92143 -40474 92551 27424
18571 -41245 163336 -221238 -61566 -46847 -85998 -446787 -121339 -349887 275871 220131
18561 220131 -4620 -79905 106897 52461 -113009 -42087 251956 -18910 -274433 -143080 -337927
18550 -337927 -301927 -221511 -34515 -67517 138671 81190 -112031 -65632 188026 -285305 11185
$$ packed form
18625B91752n7428h3330k1403q7548L6665f5118A28967g8903A43369a07586n0384
18614a57970C51717A23075A3882J5615b598B08877b87862I7523K30842d19258
18603d3513A12887L30188a64291c0848l04779B24498J2427l9016b1144k99273
18593c20417e1555B1441a69080h4156H6371b23998i8698A33034a14495l38398
18583d52893e4382D7535a86458r1346c2082m9489B6183i2143d0474I2551B7424
18571d1245A63336b21238f1566J4719l9151l60789a21339k28548B75871n5740
18561B20131d620p5285A06897E2461a13009d2087B51956a8910k55523J31353j94847
18550c37927L6000Q0416c4515l3002A38671n7481a12031M6399A88026b85305A1185
$$ plain form
18538 -146654 103956 -335429 -86820 -194655 95877 89546 230298 44170 7039 68912 214786
18527 214786 101180 52051 30352 147097 -533995 -56054 -145958 -20482 269107 -5523 195968
18515 -133479 21235 58056 -346783 -174713 -352733 -266037 146760 -195296 -53701 -123137
18505 -123137 -299619 41602 -224244 -313938 -16905 47499 -36341 -159626 -134436 45034 -1275
18493 -121566 -76111 -124275 -216303 -47657 -100322 -133630 -255012 -107538 -171558 -130408 297810
18481 -108541 64377 -269685 -35543 67929 -123898 12683 68597 24583 -133156 -28965 -248717
18470 -248717 -78170 -85266 -209150 -131998 -39404 239787 169429 105653 157511 61991 -297007
18458 -61836 -284797 -266977 -152784 147125 123151 -60336 14834 -180583 313545 -36202 -103893
$$ packed form
18538a46654A03956c35429h6820j07835I5877o331J40752D4170G039O1873J45874
18527B14786A01180m9129k1699J16745e33995e6054q9904b0482B69107e523A95968
18515a33479B1235L6821c46783J72070j78020Q6696A46760a95296e3701o9436
18505a23137j76482D1602b24244q9694a6905D7499c6341j23285K5190D5034a275
18493a21566M5455m8164r2028d7657n2665l3308j21382a07538o4020M1150B97810
18481a08541F4377b69685c5543F7929a23898A2683N5914B4583a33156b8965k19752
18470b48717g8170p096j23884P7152c9404B39787p0358o3776N1858F1991b97007
18458f1836k22961J7820J14193A47125k3974f0336A4834a80583C13545c6202o7691
$$ plain form
18447 -103893 -344333 267912 -100285 295985 65332 164986 124728 15027 238584 15061
18436 814 -228905 -107830 -156447 -389876 150238 197404 25876 -339526 -165550 203399 -342633
18424 -170394 -206218 -199559 -77011 99015 109935 -78429 -185484 -281146 120003 72034 285448
18413 285448 65547 -59287 -211679 -84481 -109093 333287 88920 193710 73270 195822 -136683
18401 -176040 195305 132090 -240046 -253495 -76445 203847 123380 -334322 120418 96153
18391 96153 43323 -46566 22229 232675 -39002 -7438 68982 -112920 193325 -311502 143312
18379 -115295 34883 80074 58675 -231196 -83512 -186137 81279 184605 -296587 -29026 -128580
18368 -128580 7999 182791 -30058 -38341 -52450 -364717 9183 126123 -155812 495553 162936
$$ packed form
18447a03893k40440B67912a00285B95985F5332R9654m0258A5027K23557A5061
18436H14b28905a07830m8617k33429A50238M7166B5876c39526a65550B03399c42633
18424a70394l5824O659g7011I9015J0920g8429j07055r5662A20003m7969K13414
18413B85448F5547e9287j52392h4481k4612C33287H8920J04790G3270J22552a36683
18401a76040A95305o3215b40046j3449g6445B03847q0467c34322A20418k4265
18391I6153D3323d6566B2229K10446c9002g438F8982a12920A93325c11502A43312
18379a15295C4883M5191k1399b31196h3512j02625H1279J03326b96587b9026r9554
18368a28580G999J74792c0058q283j4109l12267I183J16940a55812D95553A62936
$$ plain form
18356 185541 243945 -147415 -404042 88121 390169 3704 -313390 -183051 -33451 -79878 -188541
18345 -188541 111467 9563 -166351 237984 -218728 -79556 -19670 -97449 -80997 284901 -192060
18333 -24539 -195933 41348 144975 146291 230677 51602 67563 81567 -41273 144449 98282
18322 98282 -158074 -297501 132523 -161113 -272244 117193 81567 231049 150635 44121
18311 -388453 -162764 218416 -14592 52034 -405719 304855 -210853 62689 -49878 -206087
18301 -206087 -133874 -23953 -36919 -159506 -316297 17731 -211450 -148642 -35355 54677 -216100
18289 -168036 261287 -83893 -221618 280820 -42530 51182 -85529 -122375 -33269 -13485 -328714
18278 -328714 11953 -152187 51736 -118698 -143310 77803 -46271 -31234 200738 -5221 158261
$$ packed form
18356A85541N8404a47415k56627H8121L02048C704c13390J30339c3451m6427j08663
18345a88541A11467I563a66351B37984b18728g9556a9670p7779J6452B84901a92060
18333b4539j71394D1348J03627J316Q4386E1602J5961J4004d1273A44449m6167
18322I8282a58074j39427A32523a61113j11131A17193l5626J49482q0414D4121
18311c88453a62764B18416a4592E2034d05719C04855b10853F2689d9878j56209
18301b06087P2213b3953j2966j22587j56791A7731b11450O2808c5355E4677b16100
18289a68036B61287h3893j37725B80820d2530E1182h5529l6846c3269a3485l15229
18278c28714A1953a52187E1736a18698k4612G7803d6271J5037B00738e221A58261
$$ plain form
18266 -135938 -155705 -152792 -158208 -1619 -296749 -2952 42617 47100 -184535 79718 -362293 -70895
18253 27503 317735 -68403 -22770 -108024 304975 -115218 -170379 -220685 94757 91207 -41299
18241 283454 -140416 65808 -46332 -102208 40053 -226916 189893 -185711 -108755 245424
18230 288293 -104148 163426 -220758 -220535 -212960 51142 109806 139721 -67053 -347369 270412
18218 53736 -160807 -30149 -92753 -279264 -45634 9586 45623 -16213 41919 -168857 -438691
18207 -438691 115311 -198275 -62456 -497026 -323115 100537 290928 -158873 78446 -37375
18196 -75978 -58631 -151873 175714 11568 161761 -130918 331390 -118483 151755 -147197
18185 -427760 -146569 -338651 163822 -32071 -170928 479040 -482002 -241016 -156517 -217898
$$ packed form
18266a35938j9767K913n416a619k95130b952D2617M483a84535G9718c62293g0895
18253B7503K90232f8403b2770q5254C04975a15218n5161n0306I4757l550d1299
18241B83454a40416F5808d6332n5876D0053b26916A89893a85711P6956B45424
18230B88293a04148A63426b20758K23P575E1142N8664K9915f7053k80316B70412
18218E3736a60807c0149o2604j86511d5634I586L6037a6213D1919a68857k69834
18207d38691A15311a98275f2456m34570J73911A00537J90391a58873G8446c7375
18196g5978J7347r3242A75714A1568J50193a30918C31390a18483A51755a47197
18185d27760a46569j92082A63822c2071j38857D79040d82002K40986Q4499o1381
$$ plain form
18175 -217898 97985 2169 98003 35897 -338726 220391 17928 -30114 -229445 -226258 42546
18163 -325064 237211 -122753 -25585 65014 -417575 723 -307708 -38754 -78037 -152453 183638
18151 171806 -39568 -152380 36910 -274261 45122 96616 -278903 13392 -138497 -160763 -8812
18139 144187 -236736 -41665 145903 -52465 -22117 65153 192417 -14809 -40569 -431776 65854
18127 117068 67245 187532 34630 -53317 -129501 259552 -2138 -253871 -216245 -59627 -276455
18116 -276455 169953 -142119 -240855 445521 -70662 11926 369171 -86378 -133454 -112286 105162
18104 -134084 -139493 133449 29871 -86171 -147744 -115573 125449 36097 -42459 -83974 -6060
18092 213468 155693 8111 -100638 -250483 161197 -61515 208737 84524 -39204 -35763 101578
$$ packed form
18175b17898I7985B169R5834C5897c38726B20391A7928c0114j99331L187D2546
18163c25064B37211a22753b5585F5014d17575G23c07708c8754l9283p4416A83638
18151A71806c9568j12812C6910b74261D5122N1494b78903A3392a38497k2266h812
18139A44187b36736d1665A45903e2465b2117F5153J27264a4809k5760l91207F5854
18127A17068m9823J20287C4630e3317p6184B59552b138k51733L7626e9627k16828
18116b76455A69953a42119r8736D45521g0662A1926L57245h6378m7076K1168A05162
18104a34084n409A33449B9871h6171o1573L2171A25449C6097d2459m1515f060
18092B13468n7775H111a00638j49845A61197f1515B08737H4524c9204L441A01578
$$ plain form
18080 -308729 -28990 -119821 -165903 -531192 61990 19899 -145077 -273939 164087 -169079
18069 244714 84702 -26752 -34582 47200 136246 -142092 217142 -93206 -322811 -141774 -79434
18058 -79434 261755 -77064 -130766 -220132 5567 -134689 133105 -287089 113664 -9819 115220
18046 -228749 72649 180413 101804 87482 353267 114012 260545 -338786 -92987 61647
18035 12972 182300 -140871 -42391 144099 3153 -184566 -197945 39179 136555 -235627 -58837
18023 -240951 -5939 201156 -295772 -261457 139160 212822 97426 -79507 -473294 -115558 -194649
18012 -194649 244030 -246173 112720 118117 81075 316809 -154455 -136592 -254824 269968
18001 -186677 -31881 -37974 -198711 -156625 -9163 -106837 29080 -15188 113358 59920 156023
$$ packed form
18080c08729b8990r0831m6082l65289F1990A9899a45077j28862A64087a69079
18069B44714H4702b6752p830D7200Q9046a42092B17142i3206k29605a41774O2340
18058g9434B61755g7064n3702q9366E567a34689A33105b87089A13664i819A15220
18046b28749G2649J07764p8609j4322K65785A14012J46533c38786i2987F1647
18035A2972J69328a40871d2391A44099C153a84566j3379C9179R7376b35627e8837
18023b40951e939B01156b95772L4315A39160P3662I7426g9507l93787a15558p9091
18012a94649B44030b46173A12720N397l7042K35734a54455J7863j18232B69968
18001a86677c1881o093j60737M2086i163r7674B9080a5188A13358n3438R6103
$$ plain form
17990 156023 -289462 -161662 155958 -8056 56077 34025 -42706 -146037 59270 -278769 -114341
17978 156859 309823 -14826 65937 48455 199552 -63583 -93921 -88186 -163414 -168528 -189237
17967 -189237 -20496 -259095 147064 135272 -4871 324209 -107342 268543 -3326 143971 66071
17955 153939 -162572 92897 -4253 -169598 -67656 313980 -221991 45443 63300 -59490 94222
17943 -69283 10614 96563 48163 -45385 -97385 -413079 45731 -43215 -181903 204039 -299861
17931 -233374 99753 -35104 255877 -233139 -90970 -23547 125801 -70838 256383 -126222
17920 -187302 29332 -164747 80008 -184861 -51074 -22786 -131024 -173714 97760 -185652 169636
17908 -76741 109029 -114724 -143427 41138 259767 -259296 15772 -157096 -8878 283446 -190673
$$ packed form
17990A56023b89462J27800A55958h056E6077k2052d2706j03331E9270b78769a14341
17978A56859J52964a4826F5937j7482J51097f3583l0338N735p5228n114k0709
17967a89237b0496k38599A47064j1792d871C24209a07342B68543c326A43971F6071
17955A53939a62572I2897d253j65345f7656C13980b21991D5443J7857e9490I4222
17943f9283A0614Q5949D8163d5385n2000l15694D5731d3215j38688B04039b99861
17931b33374I9753c5104B55877b33139i0970b3547A25801g0838B56383a26222
17920a87302B9332a64747H0008a84861e1074b2786j08238m2690I7760a85652A69636
17908g6741A09029a14724k8703D1138K18629b59296A5772a57096h878B83446a90673
$$ plain form
17896 -186111 88152 -191376 40376 174358 10959 79637 -58969 144481 -48820 -75409 -191976
17885 -191976 -157430 -231290 248670 28627 -101319 -281464 -105218 -71254 13161 255865
17875 255865 227602 -61921 -155745 65348 13432 247483 66978 -125736 127376 342587 118887
17863 206094 220512 -69729 -10693 32480 -106151 -225035 -138694 -171063 256847 -19588 51239
17851 -138191 17310 -122870 141719 10179 -45270 -38605 -235209 -103350 94733 56644 61349
17840 61349 -53478 82895 332811 58281 -36351 -193324 -160638 -100216 -103107 -204063 -433371
17829 -433371 -122066 -99961 -414881 -238465 98003 -70332 224012 148622 295844 -9782 172857
17817 -211615 477624 231833 162498 -339688 17015 -63641 91556 -128300 431093 -58410
$$ packed form
17896a86111H8152a91376D0376J33982A0959O8678e8969A44481d8820k6589j16567
17885a91976L4546p3860B48670B8627a01319j80145a05218L3964A3161K42704
17875B55865k8263f1921r3824F5348A3432K34051F6978a25736A27376K15211A18887
17863B06094J4418f9729a0693C2480a06151j18884Q6341l2369B56847a9588E1239
17851a38191A7310a22870A41719A0179d5270O665j96604a03350I4733l8089M705
17840F1349e3478H2895K49916E8281c6351j56973L2686O0422k891j00956k29308
17829d33371a22066K2105l14920J76416I8003g0332B24012p5390J47222i782A72857
17817b11615D77624B31833o9335c39688A7015f3641I1556a28300D31093e8410
$$ plain form
17806 -56028 -167169 -26577 -228546 -258936 -105248 -49074 -256781 108616 -109724 -134689
17796 -134689 126373 -135562 121433 -69237 -31815 69172 15425 -61360 -28916 110287 68355
17785 68355 -278339 -113568 99787 -18258 -156718 -76312 -48160 135777 -17587 -73477 -79906
17774 -79906 -70742 -24691 -146588 23113 -262859 21974 286445 68097 376296 -59753 10430
17762 305492 -177686 82561 145122 -45322 -134590 170253 185856 -82569 -117994 -116236 -178088
17751 -178088 136430 146315 279296 -51096 -102207 -197476 -132528 -210978 -180344 -114133 -189796
17740 -189796 -363056 -10930 -81409 -169509 -177127 -196153 54727 332549 130414 -100682 14964
17728 -100424 -3882 81098 484667 54749 45477 244295 -30357 116070 201370 -136761 162471
$$ packed form
17806e6028j11141b6577k01969l0390a05248d9074k07707A08616a09724k4965
17796a34689A26373a35562A21433f9237c1815F9172A5425f1360b8916A10287m1932
17785F8355b78339a13568I9787a8258j38460g6312K8152A35777a7587n5890o429
17774g9906R164b4691j21897B3113b62859B1974K64471F8097L08199e9753A0430
17762C05492a77686H2561O2561d5322q9268A70253J5603h2569l5425J758o1852
17751a78088A36430R885J32981e1096n1111r5269O4948p8450L0634O6211p5663
17740a89796j73260a0930p0479q8100p618j9026E4727K77822A30414a00682A4964
17728a00424c882H1098M03569E4749r272J98818c0357A16070Q5300a36761A62471
$$ plain form
17716 906 -214789 -404940 -187619 -79352 -183543 465406 307257 -246365 216414 -188953
17705 -21729 290973 189870 -64416 39821 -86045 93723 -162416 169136 -34615 -264304 160514
17693 14088 -225021 226922 -190595 -242402 163768 50671 136118 -353488 24852 -65093 10271
17681 -248584 155932 30247 -208088 150825 292332 -14207 -33016 42440 -63852 125756
17670 -593471 30399 107696 -289482 -72978 -23254 -348262 148913 -63803 -314781 58783 -269872
17658 359262 -169857 108910 -243355 37939 -106157 64859 194708 135815 219672 17732
17647 -182887 244499 1571 83240 24452 55239 -145434 403213 -130645 -84595 21461 319377
17636 319377 -15901 16107 -117537 43325 345593 -131476 -22480 143386 17342 -19154 -80150
$$ packed form
17716I06b14789j90151a87619g9352j04191D65406j58149b46365B16414a88953
17705b1729B90973j01103f4416C9821h6045I3723a62416A69136c4615k29689A60514
17693A4088b25021B26922a90595n1807A63768E0671Q5447c53488B4852f5093A0271
17681b48584A55932C0247b08088A50825J41507a4207j8809D2440f3852A25756
17670e93471C0399P7297b89482g2978b3254l25008A48913f3803k50978E8783b69872
17658C59262a69857A08910b43355C7939a06157F4859J29849n8893Q3857A7732
17647a82887B44499A571Q1669B4452L0787a45434D03213a30645M6050B1461K97916
17636C19377a5901A6107a17537D3325L02268a31476b2480A43386A7342a9154o0996
$$ plain form
17625 -80150 -128101 -291078 -96629 54066 143076 109675 165717 59411 366346 76988 -133958
17613 -115623 -45571 -295605 203036 11077 -286798 -124830 74511 -15025 -213879 264313
17602 -13790 -118529 148364 236517 249113 -150991 70561 107013 -6390 -70246 315170 90051
17590 -17529 78321 100360 329551 124840 148664 133845 -78521 83734 57760 200511 222972
17579 222972 203235 -61312 -112486 -234375 9689 -9029 -19950 39342 126900 181812 171379 -208115
17566 30661 -92639 -103402 373374 169896 106834 -233672 172705 125956 9033 111962 -479269
17554 47809 136205 122139 -182420 224583 181610 -90627 135404 8651 353738 158239 38560
17542 25615 120181 -44044 15990 9165 -176795 -218586 176081 377864 106000 27165 -1775
$$ packed form
17625h0150m7951j62977i6629E4066Q9010l3401N6042E9411L06935G6988a33958
17613a15623d5571k50034B03036A1077b86798a24830G4511a5025j98854B64313
17602a3790j04739A48364Q8153J2596a50991G0561L6452f390o3856C15170I0051
17590a7529G8321K2039K29191A24840K3824j4819g8521H3734k5974J42751K2461
17579B22972j9737f1312n1174j21889I689i029j0921C9342Q7558N4912j0433b08115
17566C0661i2639j0763C73374A69896o3062b33672A72705m6749I033J02929d79269
17554D7809Q8396j4066a82420B24583m2973i0627A35404H651L45087A58239C8560
17542B5615R4566d4044A5990o825a76795m1791A76081K01783A06000B7165a775
$$ plain form
17530 53209 -346581 -156566 -151883 89616 8978 117632 9101 -139379 325552 326836 27251
17518 124946 247283 -178985 -216934 170034 -208621 -287730 251300 -318463 -51268 66273
17507 160991 -126709 9057 41067 -186914 87149 -112759 -97634 120123 258892 -165429
17496 -251313 91559 117558 -67266 16042 17600 273108 150376 -166854 -85488 -308716 -7762
17484 78219 -20960 40908 32501 -353460 195420 22229 206240 95127 138562 107191 -130040
17472 86905 135159 129630 527544 448845 441605 88594 -20369 116877 39348 155561 4316 335868
17460 335868 22501 252146 692012 110534 378898 210958 334479 286911 413306 269667
17450 269667 87929 154366 106686 783378 473068 253807 144478 314175 199581 122348
$$ packed form
17530E3209c46581a56566M683H9616H978J08654I101a39379C25552J284B7251
17518A24946J22337a78985l7949A70034b08621p9109B51300c18463e1268F6273
17507A60991a26709I057L2010a86914H7149a12759J5125A20123J38769a65429
17496b51313I1559K5999f7266A6042J558K55508j22732a66854Q1366k23228g762
17484G8219b0960D0908q407c53460A95420B2229J84011I5127M3435l1371a30040
17472H6905M8254n529L97914p8699p240H8594b0369A16877C9348J16213D316L31552
17460C35868B2501K29645M39866A10534K68364j67940J23521m7568J26395j43639
17450B69667H7929O6437m7680O76692l10310k19261j09329J69697j14594p7233
$$ plain form
17440 122348 305071 241053 321302 58825 268061 384549 104261 -106544 200370 304024
17430 304024 -179255 237635 325616 83534 582045 318045 352655 140875 235710 -227808
17419 330528 111234 474457 225658 50505 322109 308749 228834 249693 112103 148668
17409 148668 237319 358174 204056 -85022 17540 22856 223911 126934 316556 -152037 -80677
17398 -80677 102380 98593 -22396 114603 -146072 295197 199841 69249 106857 326208 350820
17387 350820 115956 71293 -231587 53894 54429 -124969 225725 227943 6871 349414 -53835
17375 -130318 -95705 81282 21013 141524 454228 218593 188071 226002 98364 144882 -120010
17363 388093 150305 189815 179158 301572 225427 -254657 64612 281872 204993 21695 242005
$$ packed form
17440A22348J82723o4018Q0249E8825K09236J16488A04261a06544B00370J03654
17430C04024a79255B37635Q7981H3534M98511k64000L4610A40875R4835b27808
17419C30528A11234L63223B25658E0505K71604j3360p9915K0859A12103L6565
17409A48668Q8651J20855j54118h5022A7540N316K01055r6977J89622a52037P1360
17398h0677A02380l787b2396A14603a46072B95197r5356F9249L7608K19351K4612
17387C50820A15956m4663b31587E3894N35a24969B25725K218F871L42543e3835
17375a30318L4613H1282B1013J20511L12704B18593l0522L7931I8364M6518a20010
17363C88093A50305L9510j0657J22414p6145b54657F4612K17260p6879B1695K20310
$$ plain form
17352 242005 32267 64247 123895 66466 247335 174562 -166478 179781 138026 318523 -131624
17340 217156 287808 157605 439291 -41039 -124146 -45482 357243 130553 113287 -237736
17329 11061 -8850 123675 37273 419564 235611 328378 247453 189093 -230029 171097 131819
17318 131819 521405 339852 111408 70120 390177 -155394 146555 342519 249600 166809
17308 166809 66803 310145 176456 88862 -257677 323924 227696 179388 375819 -243046
17297 -70337 245063 167451 259243 281747 305587 211377 -192846 6955 59216 198833 145835
17286 145835 -13153 -102928 -12678 235411 7528 -25958 230910 221346 107504 83778 391390
17275 391390 370479 244590 152643 -133644 92570 83896 156178 16992 281674 219230 -11364
$$ packed form
17352B42005C2267L1980N9648n7429J80869p2773a66478A79781m1755J80497a31624
17340B17156P0652j30203K81686d1039q3107d5482C57243A30553j7266b37736
17329A1061h850A23675C7273L82291j83953R2767q0925n8360b30029A71097l9278
17318A31819L89586j81553A11408m1288L20057a55394A46555J95964r2919q2791
17308A66809F6803K43342j33689q7594b57677C23924r6228m8308J96431b43046
17297g0337B45063p7612R1792K2504K3840r4210a92846F955N2261J39617n2998
17286A45835a3153q9775a2678B35411G528b5958B30910r564A07504k3726L07612
17275C91390k0911j25889r1947a33644I2570q674P2282A6992K64682o2444a1364
$$ plain form
17263 315305 44265 275274 -92903 203003 216487 87501 -181462 227573 -198423 360558
17252 -18391 437186 318454 256808 59937 108440 232507 -135884 184688 210342 129074 37906
17240 -24903 361759 216547 -203681 249596 -81729 546417 135352 164697 140557 172809
17230 172809 279534 154113 29345 173149 83082 353757 80078 439248 637213 36545
17219 225966 236602 -60268 342971 79367 198903 559885 103323 390357 85128 192496
17209 192496 16424 -153913 -15672 439067 -46561 106804 338296 -150048 36616 39978 233793
17198 233793 -87866 86388 157068 56438 240764 10311 323529 140672 323061 114330
17187 237923 246964 53798 135148 106665 29153 4552 106324 102679 176958 28720 104239 295958
$$ packed form
17263C15305D4265K31009i2903B03003J3484H7501a81462B27573a98423C60558
17252a8391D37186j18732o1646E9937M8503J24067a35884A84688K5654q1268C7906
17240b4903C61759j45212b03681B49596h1729E46417A35352K9345k4140L2252
17230A72809J06725j25421B9345J43804H3082K70675H0078L59170J97965C6545
17219B25966J0636f0268C42971G9367J19536L60982A03323K87034H5128J07368
17209A92496A6424a53913a5672D39067d6561A06804K31492a50048C6616L362J93815
17198B33793h7866H6388P0680E6438J84326A0311L13218A40672J82389A14330
17187B37923R041E3798Q1350k8483B9153D552J01772l645P4279B8720P5519J91719
$$ plain form
17175 295958 639566 -21637 346883 355283 -21578 142635 177520 169209 509686 486730 64008
17163 441622 258467 124159 63164 379247 -185880 328414 205485 83281 -13228 306686
17152 58946 272624 456370 335508 563250 110633 427599 282065 262773 82142 572885
17142 572885 274087 527907 241223 442622 221862 246930 339654 140936 155854 162150
17132 162150 591774 199033 267749 192439 246529 163847 219290 -103751 503417 290627
17122 290627 190002 265559 527389 299644 206687 43144 336460 371607 346581 154148
17111 298798 136704 196991 308078 118648 57223 471211 348631 338125 583843 318504
17101 318504 359362 459039 482066 415797 589434 284940 466083 328532 275387 636729
$$ packed form
17175B95958L43608b1637C46883Q400b1578A42635L4885q311L40477k2956F4008
17163D41622j83155A24159o0995L16083a85880C28414j22929H3281a3228C06686
17152E8946K13678J83746j20862K27742A10633L16966j45534j9292H2142M90743
17142E72885B74087K53820B41223K01399k20760K5068R2724A40936J4918O296
17132A62150M29624A99033O8716p5310N4090q2682N5443a03751E03417k12790
17122B90627j00625P5557K61830k27745r2957D3144K93316L5147k5026A54148
17111B98798A36704O0287J11087A18648E7223M13988j22580j0506K45718k65339
17101C18504M0858R9677K3027o6269J73637B84940J81143j37551n3145L61342
$$ plain form
17091 636729 499634 431815 331901 364051 312615 170145 466092 309524 259014 297128 151190
17080 151190 709710 107937 504933 661978 496870 469392 691719 296060 454734 169671
17069 624328 596463 371424 243867 640193 98609 590497 213508 357335 473714 441669
17059 441669 445148 718604 415782 692725 212862 267041 663631 356159 523403 456736
17049 456736 912064 545364 483597 626891 536092 502040 437110 706771 658339 657082 537070
17038 537070 250592 709742 604994 334016 366575 19423 657633 635334 477945 961740
17028 961740 584350 713276 14651 429588 581381 401708 655491 706261 536818 651473
17018 651473 851489 426078 572128 414648 771674 455605 818599 625459 641144 485744
$$ packed form
17091F36729j37095o7819r9914L2150n1436j42470K95947j56568n0510L8114j45938
17080A51190N58520A07937L96996J57045j65108k7478K22327B96060J58674A69671
17069F24328k7865k25039j27557L96326I8609M91888B13508J43827J16379l2045
17059D41669L479K73456l02822K76943B12862N4179L96590l07472J67244o6667
17049D56736M55328l66700o1767J43294r0799l4052o4930K69661m8432j257j20012
17038E37070B50592M59150j04748k70978L2559A9423O38210k2299j57389M83795
17028I61740l77390J28926A4651M14937J51793j79673K53783N0770j69443J14655
17018F51473K00016m25411J46050j57480L57026l16069L62994j93140J5685j55400
$$ plain form
17008 485744 977067 705322 394580 978899 1040389 836867 647044 787182 673842 806724
16998 806724 574978 498641 698352 935444 774255 768932 932777 829293 562345 765248
16988 765248 916373 685671 902997 696942 1024545 744093 596884 873915 831402 869484
16978 869484 1183713 706975 1090324 826006 600842 631447 855391 827922 819502 679831
16968 679831 698037 908201 772661 459624 1089572 545439 825689 687364 732910 1189625
16958 1189625 957070 893671 992833 821811 1153779 1114635 1106270 894511 935553 554030
16948 554030 1044596 786107 962577 1083086 1210311 727118 725831 829545 1301827 1254897
16938 1254897 1269081 889492 1115568 919771 1204091 1258211 1297780 1108229 1127536 1180728
$$ packed form
17008D85744M91323k71745l10742N84319O1490k03522j89823J40138j13340J32882
16998H06724k31746p6337J99711K37092j61189n323J63845j03484k66948K02903
16988G65248J51125k30702K17326k06055L27603k80452j47209K77031m2513L8082
16978H69484L14229m76738L83349k64318k25164L0605K23944k7469q420j39671
16968F79831J8206K10164j35540l13037O29948n44133K80250j38325M5546M56715
16958A189625k32555o3399R9162j71022L31968l9144q365k11759M1042l81523
16948E54030M90566k58489J76470J20509J27225m83193j287J03714M72282m6930
16938A254897J4184l79589K26076j95797K84320N4120L9569j89551J9307N3192
$$ plain form
16928 1180728 1276486 1061384 1205452 1230682 945713 1302059 1056083 1326889 1267191 1516407
16918 1516407 1123414 1037590 1199504 1484940 1379755 1354030 1303095 1154337 1373627 1527581
16908 1527581 1319340 1460122 1385954 1192434 1553317 1611572 1553161 1674026 1588492 1537210
16898 1537210 1814718 1520521 1639663 1746860 2093436 1962733 1531066 1669837 1645242 1988338
16888 1988338 1893145 1621223 2046920 1735828 1684627 1750989 1589998 1823432 2254476 2332525
16878 2332525 2334163 1980993 1932266 1931614 2299192 2058648 2125498 2682558 2189947 2425906 1972816
16867 1972816 2573575 2297628 2711484 2299812 2538510 2428705 2672036 2453809 2278200
16858 2278200 2711894 2732131 2495388 2510313 2762124 2822436 3008645 2788880 2585110 2754763
$$ packed form
16928A180728R5758k15102J44068K5230k84969L56346k45976K70806n9698K49216
16918A516407l92993q5824J61914K85436j05185k5725n0935j48758K19290J53954
16908A527581k08241J40782p4168j93520L60883N8255n8411J20865q5534n1282
16898A537210K77508k94197J19142J07197L46576j30703m31667J38771k4595L43096
16888A988338r5193k71922M25697l11092n1201O6362j60991K33434M31044P8049
16878B332525J638l53170m8727o52L67578k40544O6850N57060m92611K35959m53090
16867A972816O00759k75947M13856m11672K38698j09805K43331k18227j75609
16858B278200M33694K0237k36743J4925K51811O0312J86209k19765k03770J69653
$$ plain form
16848 2754763 2737704 3055152 2731324 3170323 3242574 3134503 2976361 3685229 3478702 3113620
16838 3113620 3299764 3427551 3782540 3899938 3817797 3565139 3757618 3980403 4266103 3929924
16828 3929924 4285115 4433472 4270220 4179654 4406298 4555954 4446895 4746404 4653339 4794320
16818 4794320 4804420 4690640 5303865 4782659 5400775 5733206 5317688 5350244 5443145 5553254
16808 5553254 5844512 6021208 6008225 6067122 6663741 6489779 6738063 6748701 7007316 7005945
16798 7005945 7328684 7294372 7340658 7966987 8206397 7937501 8525512 8400534 8554052 8875170
16788 8875170 9266920 9367817 9765587 9949584 10364992 10659789 10962783 10901379 11368879 11986852
16778 11986852 12388330 12545442 13018591 13246078 13823693 14060700 14838985 15371780 15710862
$$ packed form
16848B754763j7059L17448l23828M38999P2251j08071j58142P08868k06527l65082
16838C113620J86144J27787L54989J17398q2141k52658J92479K22785K85700l36179
16828C929924L55191J48357j63252r0566K26644J49656j09059K99509r3065J40981
16818D794320J0100j13780O13225n21206O18116L32431m15518L2556R2901J10109
16808E553254K91258J76696j2983N8897N96619j73962K48284J0638K58615j371
16798G005945L22739l4312M6286O26329K39410k68896N88011j24978J53518L21118
16788H875170L91750J00897L97770J83997M15408K94797L02994o1404M67500O17973
16778A1986852M01478J57112M73149K27487N77615K37007P78285N32795L39082
$$ plain form
16769 15710862 16267678 16806032 17482190 17909666 18975399 19505105 20160505 21117966 21842793
16760 21842793 22772045 23430058 24824943 25578356 26841347 27789419 29076377 30754725 31844743
16751 31844743 33126842 34679733 36692392 38431606 40309730 42522796 44876335 47295185
16743 47295185 49739670 52344160 55809651 58902700 62315258 65676038 69731581 74171688
16735 74171688 78793787 83718288 89264316 94620780 100958668 107307739 114005041 121213895
16727 121213895 128386104 136216207 143808696 151776831 159308387 166741317 173559445 179516459
16719 179516459 184713799 188812391 191368992 193139250 193031425 191790284 188737767 184600802
16711 184600802 179477484 173268340 165868396 158770492 151304482 143284919 135177112 127498481
$$ packed form
16769A5710862N56816N38354O76158M27476J065733N29706O55400R57461P24827
16760B1842793R29252O58013J394885P53413J262991R48072J286958J678348J090018
16751C1844743J282099J552891K012659J739214J878124K213066K353539K418850
16743D7295185K444485K604490L465491L093049L412558L360780M055543M440107
16735G4171688M622099M924501N546028N356464O337888O349071O697302P208854
16727A21213895P172209P830103P592489P968135P531556P432930O818128N957014
16719A79516459N197340M098592K556601J770258j07825j241141l052517m136965
16711A84600802n123318o209144p399944p097904p466010q019563q107807p678631
$$ plain form
16703 127498481 120056765 112708361 105882416 99422945 93087267 87371881 81827371 77190504
16695 77190504 72446078 67597361 63901404 60074143 56579469 53294257 50129988 47573840
16687 47573840 45176640 42920518 40447496 38356787 36454141 34460020 32870569 31298602
16679 31298602 29966010 28767221 27038443 25878437 24943771 23686288 22919981 21912376
16671 21912376 21063178 20103010 19307698 18951184 18172890 16781726 16868279 15885179 15385639
16662 15385639 14948091 14398083 13842615 13453951 13242353 12499267 11933291 11778517 11604488
16653 11604488 11051566 10576099 10415374 10230423 9711755 9319779 9192307 9135780 8716328
16644 8716328 8607918 8111996 7685621 7815932 7585110 7257008 7231382 6972898 6647584 6448530
$$ packed form
16703A27498481p441716p348404o825945o459471o335678n715386n544510m636867
16695G7190504m744426m848717l695957l827261l494674l285212l164269k556148
16687D7573840k397200k256122k473022k090709j902646j994121j589451j571967
16679C1298602j332592j198789j728778j160006r34666j257483p66307j007605
16671B1912376q49198r60168p95312l56514p78294j391164Q6553r83100m99540
16662A5385639m37548n50008n55468l88664k11598p43086n65976j54774j74029
16653A1604488n52922m75467j60725j84951n18668l91976j27472n6527m19452
16644H716328j08410m95922m26375J30311k30822l28102k5626k58484l25314j99054
$$ plain form
16634 6448530 6428718 6408617 6130552 6293092 5721197 5880161 5920010 5556541 5688902 5058310
16624 5058310 5272077 4788020 4824854 4630260 4761029 4679232 4411538 4287527 4123447 3973623
16614 3973623 3913909 3873001 3881474 3826890 3691803 3712865 3584163 3635688 3322680 3108351 3215690
16603 3215690 3390915 3346357 3244102 3410765 3330472 3102872 2673811 2630488 2970082 2738959
16593 2738959 2749914 2540895 2669746 2717120 2864717 2645726 2216388 2141247 2381946 2274433
16583 2274433 2479277 2167402 2191629 2094373 2396604 2046460 1702521 2139305 1966496 2033966
16573 2033966 2160578 2071305 1872195 1862773 1918163 1830446 1513161 1734962 1670276 1416386
16563 1416386 1577578 1609742 1560080 1423434 1613465 1543608 1504061 1500026 1564116 1573146 1409352
$$ packed form
16634F448530j9812k0101k78065J62540n71895J58964L9849l63469J32361o30592
16624E058310K13767m84057L6834j94594J30769q1797k67694j24011j64080j49824
16614C973623n9714m0908Q473n4584j35087K1062j28702N1525l13008k14329J07339
16603C215690J75225m4558j02255J66663q0293k27600m29061m3323L39594k31123
16593B738959J0955k09019J28851M7374J47597k18991m29338p5141K40699j07513
16583B274433K04844l11875K4227r7256L02231l50144l43939M36784j72809O7470
16573B033966J26612q9273j99110r422N5390q7717l17285K21801o4686k53890
16563A416386J61192L2164m9662j36646J90031o9857l9547m035O4090R030j63794
$$ plain form
16552 1409352 1710696 1578621 1306227 1472482 1083169 1266346 1601861 916027 852976 1138509
16542 1138509 1225202 1025517 1141582 1500329 1307992 1296023 1193488 1218043 1000550 1704876
16532 1704876 1107928 1400614 1185289 839867 1282873 990145 960685 1124434 1163682 1013774
16522 1013774 915110 1125195 1033979 901493 1291021 799407 676567 825013 798806 928462
16512 928462 1066718 971475 742288 963049 968838 851790 731534 916506 909538 940491 542857
16501 542857 936035 752966 622020 771940 585215 892587 861502 912463 484370 678151
16491 678151 592877 638719 995588 576072 635841 769182 800536 823727 520815 581836 459092
16480 459092 725208 641725 590031 420432 415798 496584 649176 370779 289752 518104 517170
$$ packed form
16552A409352L01344j32075k72394J66255l89313J83177L35515o85834o3051K85533
16542A138509Q6693j99685J16065L58747j92337j1969j02535K4555k17493P04326
16532A704876n96948K92686k15325l45422M43006k92728k9460J63749L9248j49908
16522A013774r8664K10085r1216j32486L89528m91614j22840J48446k6207J29656
16512I28462J38256r5243k29187K20761N789j17048j20256J84972o968L0953l97634
16501E42857L93178j83069j30946J49920j86725L07372l1085N0961m28093J93781
16491F78151q5274M5842L56869m19516N9769J33341L1354K3191l02912O1021j22744
16480D59092K66116q3483n1694j69599m634Q0786J52592k78397q1027K28352r34
$$ plain form
16469 517170 466333 273823 360501 295924 696122 652937 528043 779610 337522 657149
16459 657149 468109 444058 631385 420943 535608 417810 192577 603453 649859 341901
16449 341901 540440 454785 555981 321242 579300 322040 415801 363026 521614 910390
16439 910390 416954 390610 266847 406964 298017 546411 344018 527751 353492 245441
16429 245441 340517 507338 48853 134440 326285 593274 635087 411125 474249 324424
16419 324424 582116 371949 438556 282885 274407 119070 451590 425875 -3537 267950 506836
16408 506836 421683 214400 471263 151229 679245 462778 249149 274521 10974 399528
16398 399528 70428 559274 -17354 293095 93787 670026 244135 365296 108028 261333
$$ packed form
16469E17170n0837j92510Q6678o4577M00198m3185j24894K51567C37522L19627
16459F57149j89040k4051J87327k10442J14665j17798A92577M10876M6406l07958
16449C41901J98539q5655J01196k34739K58058k57260R3761n2775J58588L88776
16439I10390D16954k6344j23763J40117j08947K48394k02393J83733j74259j08051
16429B45441R5076J66821D8853Q5587J91845K66989M1813k23962O3124j49825
16419C24424K57692k10167O6607j55671q478A19070L32520k5715c537B67950K38886
16408E06836q5153k07283K56863A51229N28016k16467k13629K5372A0974L88554
16398C99528G0428M88846a7354B93095I3787N76239B44135J21161A08028J53305
$$ plain form
16388 261333 85207 289633 12680 205622 337696 247970 275476 710143 -70978 397683
16377 106754 200880 40240 125069 330066 388619 391950 168925 291706 -122060 118701 504417
16366 504417 499 16839 161065 127832 305707 147054 204935 259099 -160668 370823 109966
16354 76714 248793 296802 243972 246182 207518 -61219 -280395 155187 6418 364540 472324
16343 472324 313270 108164 -178977 422025 298586 210138 182060 139133 328444 165262
16333 165262 -139697 -16683 76230 -22877 408557 274381 709644 -26956 71448 398348
16323 398348 377258 203011 279524 -39678 354087 87510 403633 51260 -17291 170310 235603
16312 235603 -112656 222696 124066 100744 105043 293120 54887 279342 269144 -226872 -273732
$$ packed form
16388B61333H5207K04426A2680J92942J32074q9726K7506M34667g0978C97683
16377A06754R4126D0240Q4829K04997N8553L331A68925J22781a22060A18701L85716
16366E04417D99J6340J44226l3233J77875A47054N7881N4164a60668C70823A09966
16354G6714J72079M8009n2830K210l8664f1219k19176A55187F418L58122J07784
16343D72324j59054A08164a78977D22025j23439q8448k8078m2927J89311j63182
16333A65262a39697a6683G6230b2877D08557j34176M35263b6956G1448L26900
16323C98348k1090j74247P6513c9678C54087H7510L16123E1260a7291A70310O5293
16312B35603a12656B22696r8630k3322M299J88077E4887K24455j0198b26872m6860
$$ plain form
16301 -273732 104581 221614 217473 105210 209178 232616 -210894 426246 -276810 253352
16290 286671 132569 261072 188466 367902 -128460 241109 166827 271429 154096 -172216
16279 27814 -88687 -61230 269314 242298 266847 -61623 63813 321438 171473 40437 99860
16268 99860 450833 258194 -49218 104128 -283784 327480 339948 68970 -139667 239983
16257 299403 82620 145107 57498 380278 -43062 174747 371685 -293130 -167042 9660 -149199
16245 -21832 4321 148496 187924 273994 225555 41476 -47862 120809 4936 145002 178826
16234 178826 -100305 -57945 117382 322350 64133 -340674 -34308 248721 -314316 138898
16223 -65928 -72635 133625 261739 74525 -107725 -49373 -270864 197146 152998 -29964 372710
$$ packed form
16301b73732A04581J17033m141A05210J03968K3438b10894D26246b76810B53352
16290B86671A32569J28503p2606J79436a28460B41109p4282J04602j17333a72216
16279B7814h8687K7457B69314k7016K4549f1623F3813K57625j49965D0437N9423
16268I9860L50973j92639d9218A04128b83784C27480J2468F8970a39667B39983
16257B99403H2620O2487E7498L22780d3062A74747J96938b93130J26088I660a49199
16245b1832D321J44175L9428Q6070m8439D1476d7862A20809D936J40066L3824
16234A78826a00305M2360A17382K04968F4133c40674c4308B48721c14316A38898
16223f5928o707A33625J28114G4525a07725d9373k21491A97146m4148b9964C72710
$$ plain form
16211 -166977 95477 284079 -263450 4738 306942 274922 19520 32802 -98188 231459 14826
16199 -363062 104361 -187511 -62373 9753 93806 341329 -206123 -72371 -102151 -229544 4092
16187 48566 66984 -83646 -298285 93183 42351 94508 389844 -363087 47316 -166916 106814
16175 58397 63285 -49711 74261 -174921 10262 -152228 202278 -188658 -200746 187466 -314892
16163 30130 -326831 169740 -204388 -32254 143595 42584 32449 76817 -250769 -42809 -168992
16152 -168992 88043 -43079 104694 118576 7336 254571 -69872 -28729 -16635 12270 12996 178205
16140 178205 169381 176609 40076 -99039 140710 -64564 -297252 -22645 159127 166662 -43495
16128 38197 652638 -223640 -81177 18028 -15346 53995 53161 380261 157966 199032 223523
$$ packed form
16211a66977I5477J88602b63450D738L02204l2020A9520J3282i8188B31459A4826
16199c63062A04361a87511f2373I753Q4053K47523b06123g2371k9780j27393D092
16187D8566J8418h3646k14639I3183D2351N2157K95336c63087D7316a66916A06814
16175E8397M888d9711G4261a74921A0262a52228B02278a88658j2088A87466c14892
16163C0130c26831A69740b04388c2254A43595D2584j0135M4368b50769d2809j26183
16152a68992H8043d3079A04694J3882G336K47235f9872b8729J2094A2270P26J65209
16140A78205q824P228D0076i9039A40710f4564k32688b2645A59127P535d3495
16128C8197O14441b23640h1177A8028a5346E3995q34L27100A57966M1066K4491
$$ plain form
16117 223523 -40 105272 4768 319206 3630 272525 142308 248821 40536 41477 -381746 -14373
16104 309930 129185 212678 -17834 231758 90882 52256 123282 58864 -422432 33113 191031
16093 191031 394 149526 168339 63209 -21286 192690 -186764 246351 -213168 -51235 96580
16081 54479 -481237 -50421 -261115 114253 -186840 -61666 -184838 42582 -78880 -167927 118449
16069 -4209 -107320 -295094 -75085 -357673 124478 -185397 -23794 -50756 90999 -38010 -561966
16058 -561966 425162 162153 36964 -211609 7908 160661 -27 -238772 -239247 263936 -81052
16046 -113240 173316 -82542 -97465 -262398 -95316 -15266 -155994 105173 62090 29692 90421
16035 90421 -123646 -158769 -126586 -223562 -23653 -115115 99753 -66947 62349 -44761 -119630
$$ packed form
16117B23523d0A05272D768L14438C630K68895j30217J06513D0536R41c81746a4373
16104C09930A29185Q3493a7834B31758I0882l8626P1026E8864d22432C3113J57918
16093A91031C94J49132J8813F3209b1286A92690a86764B46351b13168e1235I6580
16081E4479d81237e0421k10694A14253a86840f1666j23172D2582g8880q9047A18449
16069d209j03111j87774g5085k82588A24478a85397b3794k6962I0999c8010n23956
16058e61966D25162A62153C6964b11609G908J52753b7k38745m75B63936h1052
16046a13240A73316h2542j4923j64933i5316a5266j40728A05173m3083B9692O0729
16035I0421a23646l5123L2183r6976b3653r1462I9753f6947F2349d4761p4869
$$ plain form
16024 -119630 -375619 -174611 -56633 90976 58032 -314279 32991 -55840 -116081 -376849 133583
16012 139828 -148876 67043 267278 -161308 198064 -24251 34965 -266903 -168023 42635
16001 -245613 78335 90268 170800 -308094 505883 -196755 -174391 -79483 -51937 121176 -70730
15989 80352 -49631 -116977 -2587 -42292 238084 91129 434365 102370 479167 178591 367321
15978 367321 -273085 48473 80399 127758 -73050 -118811 -147304 -181695 84902 -170639 -230491
15967 -230491 295676 -57965 8189 369017 140406 88779 37089 124157 127866 -18065 184312
15955 -3840 67237 141901 -274729 243144 -132142 94088 -174371 -190474 166909 -207095 36580
15943 29517 -277719 -55735 -130517 150463 -327360 42218 -223187 14765 -175198 -320596
$$ packed form
16024a19630k55989a74611e6633I0976l2944c14279C2991e5840o0241k60768A33583
16012A39828a48876F7043K00235a61308A98064b4251C4965b66903R8880D2635
16001b45613G8335J1933Q0532c08094E05883a96755K2364g9483K7546A21176g0730
15989H0352d9631o7346b587l9705B38084I1129L43236A02370L76797A78591J88730
15978C67321b73085D8473L1926M7359g3050m5761k8493l4391H4902a70639n9852
15967b30491B95676e7965H189L60828A40406n1627C7089Q7068L709a8065A84312
15955c840F7237P4664b74729B43144a32142I4088a74371j6103A66909b07095C6580
15943B9517b77719e5735p4782A50463c27360D2218b23187A4765a75198j45398
$$ plain form
15933 -320596 -79486 -137457 185304 -311678 -48598 -113187 -105624 -22331 -28461 -109293 144681
15921 -258025 -90321 5515 120653 -156459 -5877 -135652 -105109 -128720 174951 -3497 -108644
15910 -108644 -12151 142636 -161956 301640 -239659 -148392 -105674 -43038 -220770 -217824 221806
15898 -3537 -30635 -7409 376 -419532 109230 231073 -85923 69536 -111969 40604 121565 160522
15886 160522 387771 -117708 7101 -85002 -16238 42008 189035 -71873 81767 48889 -21529
15874 14592 87016 -16695 -72285 -205738 -97004 -151766 203535 42685 -152060 26555 -110770
15862 -32085 -158200 -31564 -52300 154086 -172642 -67601 -306127 245814 -232981 -72207
15851 -25808 255575 254129 -6308 62824 -180629 -76779 55295 -295656 -43393 -320967 -45271
$$ packed form
15933c20596g9486n7971A85304c11678d8598o4589P563b2331o130q0832A44681
15921b58025i0321E515J15138a56459e877j29775L0543k3611A74951c497j05147
15910a08644a2151A42636a61956C01640b39659R1267M2718d3038j77732K946B21806
15898c537k7098g409C76d19532A09230J21843h5923F9536a11969D0604Q0961L8957
15886A60522K27249a17708G101h5002a6238D2008J47027g1873H1767l2878b1529
15874A4592P2424a6695n5590j33453i7004n4762B03535D2685a52060B6555a10770
15862c2085j26115c1564k0736A54086a72642f7601k38526B45814b32981g2207
15851b5808B55575j446f308F2824a80629g6779E5295b95656d3393k77574d5271
$$ plain form
15839 28937 -167589 112812 -188052 -137977 -214071 133738 116592 -128265 112990 281875
15829 281875 29414 -54738 129216 -77377 219300 -151230 37313 -231807 -200773 101740
15818 -214392 96921 40476 -19382 -35158 -361741 -360478 -62514 11148 -101817 -48157 75669
15806 29294 234630 -25537 93126 17564 -353078 144831 54867 285754 -340543 2420 -312157
15794 71983 -27749 -53232 -238932 -37220 81038 158964 18417 -48305 134830 134488 -27677 -112898
15782 -112898 -108497 -92179 -56751 62527 -128929 45623 -101200 -172078 91211 115092 -124628
15770 38082 -38769 -121964 -288318 -156132 185990 -137889 1425 -134037 -103527 -23642 -357879
15759 -357879 18936 370327 -183667 -51637 83845 -150647 -51053 -48512 302870 130908 233672
$$ packed form
15839B8937a67589A12812a88052N0075p6094A33738j7146a28265A12990J68885
15829B81875B9414e4738A29216g7377B19300a51230C7313b31807L1034A01740
15818b14392I6921D0476a9382j5776l26583J263f2514A1148a01817d8157G5669
15806B9294K05336b5537I3126A7564c53078A44831E4867K30887c40543B420c12157
15794G1983b7749k5483j85700c7220H1038P7926A8417d8305A34830l42b7677q5221
15782a12898M401J6318L5428F2527a28929D5623a01200p0878I1211K3881a24628
15770C8082c8769q3195j66354J32186A85990a37889A425a34037L0510b3642l34237
15759c57879A8936L51391a83667e1637H3845a50647e1053K541C02870A30908J02764
$$ plain form
15748 233672 -53096 33753 -90374 -53698 -107949 262635 148178 -91511 18081 -429461 212085
15736 -163925 320938 94988 -385985 146641 449298 -96261 -20589 -234749 -33676 209823
15725 155836 62529 -151131 95292 246264 -74517 71236 50841 -195168 34394 -104201 -174340
15714 -174340 -87580 -156053 -339338 -408366 -267623 127056 -338537 754 -15760 -4146 -267814
15703 -267814 -114032 189797 -175325 53981 74783 -8647 277467 -54827 30070 -93078 -26342
15691 168612 -142844 -6040 70082 292192 266744 105356 63162 -97565 -20234 29914 -334022
15679 78542 238872 117946 -274047 -42728 -274264 79716 178783 389654 99442 289155
15669 289155 134824 -89319 53287 -38131 70416 -5577 -31805 -215643 -350362 -52050 -138413
$$ packed form
15748B33672e3096C3753i0374L6676n4251B62635j14457i1511A8081d29461B12085
15736a63925C20938I4988c85985A46641L02657i6261b0589k14160c3676B09823
15725A55836F2529a51131I5292J50972g4517G1236k0395a95168C4394a04201p0139
15714a74340Q6760o8473j83285o9028J40743A27056c38537G54a5760d146k63668
15703b67814a14032A89797a75325E3981K0802h647B77467e4827C0070i3078b6342
15691A68612a42844f040G0082K22110k5448A05356m2194i7565b0234B9914c34022
15679G8542J60330A17946b74047d2728k31536G9716R9067K10871I9442J89713
15669B89155A34824h9319E3287c8131G0416e577k6228j83838j34719e2050q6363
$$ plain form
15658 -138413 -38846 30127 -71029 57345 239660 -175155 167460 133714 -230954 -317510 -40947
15646 -86612 498252 -53616 -226143 -59307 282654 -70358 25605 252580 -191315 -49561 158497
15634 148326 -184512 -393721 245604 -192472 188660 174494 175743 -58487 208400 179980
15624 179980 -214720 -5007 -65432 -76436 -100269 126525 134519 137963 66257 -151614 186072
15612 175386 -121729 -208457 15661 126213 -168705 146614 19770 -204833 -58114 -196900
15602 -196900 -251029 -84092 -134599 -57054 -10276 147943 -247785 -82144 -56249 -177032 45319
15590 -31547 140482 -42219 172022 3211 -14863 27211 154629 206360 127594 -15941 -107700
15579 -107700 123352 203221 -124410 162174 -30958 -457399 -305988 -274827 -50028 25785
$$ packed form
15658a38413c8846C0127g1029E7345J82315a75155A67460l3746b30954q6556d0947
15646h6612D98252e3616j72527e9307B82654g0358B5605K26975a91315d9561A58497
15634A48326a84512k09209B45604a92472A88660j4166J249e8487B08400k8420
15624A79980b14720e007o0425j1004k3833A26525P994L444F6257a51614A86072
15612A75386a21729q6728A5661J10552a68705A46614A9770b04833e8114j38786
15602a96900n4129h4092n0507e7054a0276A47943b47785h2144K5895j20783D5319
15590c1547A40482d2219A72022C211a4863B7211J27418N1731p8766a5941r1759
15579a07700A23352P9869a24410A62174c0958m26441J51411L1161e0028B5785
$$ plain form
15568 27642 -102441 53034 -312967 -186726 152274 175249 76797 -78898 92149 -94239 263455
15556 310948 -79422 220988 64327 -214945 -68418 208107 213173 -72716 -59750 101253 236066
15545 236066 161836 113855 -292141 218175 85485 118952 -120272 106545 -79274 400434
15534 137857 -99487 -156353 -144397 -207967 25384 16938 169351 -3184 88396 -125247 164812
15522 -51633 -56916 87314 -337972 69339 -24678 99922 108135 115682 -46168 15656 -41836 -342854
15510 -342854 150406 -22475 239724 98057 -361995 201689 291374 268228 1631 37380 217107
15499 217107 -233835 -40490 -42907 -228140 -353692 265063 -260194 -33422 -145550 227948
15488 -5319 87471 276599 -221902 -26669 57556 97633 108752 122182 -32885 -7808 -146679
$$ packed form
15568B7642a02441E3034c12967J26241A52274K2975G6797g8898I2149i4239B63455
15556C10948g9422B20988F4327b14945f8418B08107N066g2716J2966A01253J34813
15545B36066p4230m7981b92141B18175H5485L3467a20272A06545g9274D00434
15534A37857i9487n6866J1956o3570B5384q446J52413c184H8396a25247A64812
15522e1633n283H7314c37972F9339b4678I9922Q213P547d6168A5656d1836l01018
15510c42854A50406b2475B39724I8057c61995B01689Q9685k3146A631L5749J79727
15499B17107b33835d0490k417j85233j25552B65063b60194c3422j12128B27948
15488e319H7471J89128b21902b6669E7556M0077J1119J3430c2885g808j38871
$$ plain form
15477 -146679 -147870 -47670 -302195 10696 -57159 -289901 267550 -23925 4613 132909 54963
15465 -19523 -93316 -26628 71889 -193951 -170696 52773 -74718 -31369 117423 54956 201436
15454 201436 207324 -139229 74590 -63068 -349133 -73975 -34875 33832 10109 23402 64839
15443 64839 -208351 -51355 -214774 -133090 -105273 -544 -160814 169433 82259 -29215 -37392
15432 -37392 -193527 -210853 -9455 36414 -69219 75409 -54116 -63807 984 -229318 -321519 -134767
15419 -65846 31425 -103812 -96704 -63297 -1632 -345682 358568 -61725 21103 9790 -186592
15407 37198 62102 -68978 -137995 124887 -120490 -68781 -321799 236 152390 -60725 -239100
15396 -239100 -5081 46661 -137772 144707 -74463 -103163 -324382 40955 228143 -105784 5232
$$ packed form
15477a46679j191d7670k54525A0696e7159k32742B67550b3925D613J28296E4963
15465a9523p3793b6628G1889a93951K3255E2773g4718c1369A17423E4956J46480
15454B01436N888a39229G4590f3068k86065g3975c4875C3832A0109J3293M1437
15443F4839b08351e1355j63419Q1684K7817e44j60270A69433H2259b9215q177
15432c7392j56135j7326i455C6414f9219G5409e4116r691I84b29318r2201a34767
15419f5846C1425a03812P108L3407a632l44050C58568f1725B1103I790a86592
15407C7198K4904f8978o9017A24887a20490N1709k53018B36J52154f0725j78375
15396b39100e081D6661a37772A44707g4463k8700k21219D0955J87188a05784E232
$$ plain form
15384 53697 -13542 -144237 363915 -434907 157996 -71279 279953 47740 315522 11470
15373 200749 -292581 130589 -101717 -50332 -93612 -98251 243024 43779 15396 210046 217055
15362 217055 -131823 -251519 -131365 50743 -79580 -48094 -85128 147151 -245239 -229283
15352 -229283 145637 94920 -97708 -183305 -13741 87624 198894 -162325 23511 217333 -202836
15340 -4258 199766 11516 -233075 125154 -38196 -43978 537523 112984 -226293 66536 -37823
15328 42418 82794 -243354 233430 -28932 61167 74522 -54568 68157 210469 41520 432648
15317 432648 271410 251981 -310679 -3810 -24828 194469 20432 -1506 8745 51905 398606
15306 398606 -39491 316993 277724 -105360 47534 158941 231404 51451 293399 145540
$$ packed form
15384E3697a3542j30695C63915d34907A57996g1279B79953D7740K67782A1470
15373B00749b92581A30589a01717e0332m3280m639B43024D3779A5396J94650P009
15362B17055a31823j19696J20154E0743g9580L1486l7034A47151b45239J5956
15352b29283A45637n0717i7708q5597a3741H7624J11270a62325B3511J93822b02836
15340d258A99766A1516b33075A25154c8196n782E37523A12984b26293F6536c7823
15328D2418M0376b43354B33430b8932F1167J3355e4568F8157J42312D1520L91128
15317D32648j61238j9429c10679c810k1018A94469B0432a506H745M3160L46701
15306C98606c9491C16993l9269a05360D7534J11407P2463E1451K41948A45540
$$ plain form
15295 -204681 178843 173049 -74545 -95526 108398 62340 -8775 442518 -172923 144017 249965
15284 249965 41881 136697 30011 -71728 246732 -44677 -50084 79718 186405 77461 188851
15273 188851 97445 -82848 -157793 79641 219044 239871 310915 -61717 -219678 -131543 -127872
15262 -127872 -31547 -81171 62013 -106362 286839 124641 65634 -181853 110673 279877
15252 279877 291645 -156024 84755 526903 547483 1304027 1697691 1329973 1773521 978432
15242 978432 639026 204853 -215533 -445509 424112 130516 -151866 -131019 -207790 252084
15231 -196116 -182774 -98214 257713 41112 -185392 51878 256845 317615 -117248 68546 -278520
15219 -228613 77891 78965 79843 210644 -2360 -198111 -344529 7934 -6436 -90412 111138 -321638
$$ packed form
15295b04681A78843n794g4545k0981A08398m6058h775D42518a72923A44017J05948
15284B49965D1881R4816C0011g1728B46732d4677n407G9718J06687G7461J11390
15273A88851r1406h2848p4945G9641J39403K0827P1044f1717j57961Q8135L671
15262a27872c1547m9624F2013a06362B86839A24641n9007a81853A10673J69204
15252B79877J1768a56024H4755M42148K0580P56544L93664l67718M43548p95089
15242I78432l39406B04853b15533k29976D24112A30516a51866K0847p6771B52084
15231a96116J3342Q4560B57713D1112a85392E1878K04967O0770a17248F8546b78520
15219b28613G7891J074Q78J30801b360j95751j46418G934f436q3976A11138c21638
$$ plain form
15206 359377 -51651 20371 -360694 204188 128303 77329 316781 -84553 162800 9858 94984
15195 94984 84435 -213901 -34007 -26418 -203602 112881 253765 321958 283585 6644 41831
15184 41831 -98079 -127252 342327 -184053 284407 120630 296637 -1581 105117 188702 -46765
15172 105186 -292515 36753 240774 393460 146085 -326828 42249 64749 -38695 180831
15161 295934 -149585 312452 -43403 385058 399857 -39236 194965 394426 -100344 -30678
15150 -134841 -166199 287831 -153700 -282421 -16892 128442 -37637 193911 -9149 15420 52522
15139 52522 -228384 138038 330323 22801 248741 5650 200282 327482 -14523 232523
15128 349982 187430 38100 21058 131099 103681 21104 196822 202417 280290 193883 24601
$$ packed form
15206C59377e1651B0371c60694B04188p5885n0974K39452h4553A62800I858Q5126
15195I4984j0549b13901c4007P589j77184A12881J40884O8193l8373F644L5187
15184D1831i8079k9173C42327a84053B84407A20630J76007a581A05117Q3585d6765
15172A05186b92515C6753K04021J52686A46085c26828D2249K2500c8695A80831
15161B95934a49585C12452d3403C85058J4799c9236A94965J99461a00344c0678
15150a34841l1358B87831a53700j28721a6892A28442c7637A93911i149A5420L7102
15139E2522b28384A38038J92285B2801K25940E650J94632J27200a4523B32523
15128C49982j62552C8100j7042J10041k7418B1104J75718N595P7873q6407B4601
$$ plain form
15116 86344 119879 121526 -205849 -50315 -50698 393075 136281 392431 198142 328203 28283
15104 -27553 169702 -36210 323356 -18574 218102 -9727 -42556 283562 -38234 11554 199757
15093 199757 174441 -108770 221381 98443 300573 -299703 -90540 212017 116276 170276
15083 170276 -133088 54882 545249 -68936 -18402 365258 -66860 484026 -265810 105091
15072 251707 50917 46809 228578 71555 154024 185473 237170 270993 306173 248347 48957
15060 92253 175336 454415 -68261 267555 365216 -17146 137175 -41866 65604 -41150 221008
15048 320734 97333 198696 98832 66275 192352 -129160 149961 -247785 121240 310058
15038 310058 437185 159952 185080 204502 81200 89202 48084 124282 -171588 211534 252591
$$ packed form
15116H6344L3535J647b05849e0315l83C93075A36281K56150j94289J30061B8283
15104b7553A69702c6210C23356a8574B18102i727l2829B83562c8234A1554J88203
15093A99757k5316a08770B21381I8443K02130b99703i0540B12017r5741N4000
15083A70276a33088E4882M90367f8936a8402C65258f6860D84026b65810A05091
15072B51707E0917m108J81769G1555Q2469L1449N1697L3823L5180n7826D8957
15060I2253Q3083K79079f8261B67555R7661a7146A37175d1866F5604d1150B21008
15048C20734I7333J01363I8832l2557J26077a29160A49961b47785A21240J88818
15038C10058J27127A59952K5128J9422H1200Q002m1118P6198a71588B11534M1057
$$ plain form
15027 252591 323009 140884 -234265 38184 157320 239872 50776 137928 72618 179221 446932
15016 446932 184981 188508 298117 165944 389796 167341 -95467 148742 276424 -228467
15005 119749 -104237 116775 337935 219382 314888 128565 309258 332651 99220 380009
14995 380009 338517 306161 341780 -54207 4692 103233 306619 7326 196828 5958 294283
14984 294283 284230 64421 313632 184470 152914 42599 206455 252016 490896 476770 92555
14972 131546 347888 271667 -6331 445733 1176 286260 244822 300618 246235 263190 420848
14961 420848 202661 130228 219142 76472 567683 207875 250652 224609 383256 -102485
14950 176520 440963 395434 402903 99439 160392 115584 -49013 -64890 348777 -33588 139264
$$ packed form
15027B52591P0418A40884b34265C8184J19136Q2552E0776Q7152o5310J06603K67711
15016D46932A84981L527J09609j32173K23852A67341i5467A48742J27682b28467
15005A19749a04237A16775K21160j18553R5506A28565J80693K3393I9220K80789
14995C80009m1492l2356L5619e4207D692R8541K03386G326J89502E958K88325
14984B94283j0053F4421K49211j29162l1556D2599J63856M5561K38880j4126I2555
14972A31546K16342p6221f331D45733A176K85084m1438N5796n4383J6955J57658
14961D20848B02661p2433Q8914G6472M91211B07875M2777k6043J58647a02485
14950A76520K64443m5529P469I9439O0953m4808d9013j5877C48777c3588A39264
$$ plain form
14938 127106 331809 43961 132609 220953 345694 453369 154503 88259 430033 301956
14928 301956 372780 176078 211321 -46682 459625 358440 171470 258524 324560 364205 405497
14917 405497 242633 252638 745153 -29114 341590 171922 278956 569098 60918 28276
14906 392546 24015 299965 278486 371598 249270 3258 263261 564608 446194 410840 377581
14895 377581 109811 378227 333684 272967 589050 356792 215626 62483 111578 432359
14885 432359 268274 352375 377789 205046 336813 72745 312165 501730 384176 160146
14874 375336 307319 372207 530970 276487 665207 404978 156664 -147933 172286 466273
14864 466273 209459 181421 179997 409545 387455 664911 493429 350952 500253 202081
$$ packed form
14938A27106K04703D3961Q8648Q8344J24741J07675A54503o6244L41774j28077
14928C01956P0824A76078L5243d6682D59625j01185A71470Q7054O6036L9645M1292
14917D05497j62864J0005M92515b9114C41590j69668J07034K90142F0918B8276
14906C92546B4015K75950k1479R3112j22328C258K60003L01347j18414l5354l3259
14895C77581A09811K68416m4543o0717L16083k32258j41166F2483M9095L20781
14885D32359j64085Q4101K5414j72743J31767G2745K39420J89565j17554A60146
14874C75336o8017O4888J58763k54483L88720k60229A56664a47933A72286K93987
14864D66273B09459k8038j424K29548k2090K77456j71482j42477J49301B02081
$$ plain form
14853 197228 143264 318803 398084 410838 155204 461399 455471 335112 230384 453734
14843 453734 536235 787193 389195 580008 254007 446014 252171 432537 88977 494157
14833 494157 222428 412464 234887 690336 453653 543206 667619 681967 398784 667424
14823 667424 533144 383415 169264 300360 472602 578828 216255 475076 448596 505170
14813 505170 252734 368483 459992 537809 313773 898754 344077 528734 557560 462017
14803 462017 647813 757018 342679 242407 525523 285337 350484 405294 246652 461602
14793 461602 599724 572181 540293 626891 404029 578290 497379 586374 367714 312238 345087
14782 345087 520437 547012 644492 335198 456869 368095 607078 629593 426319 608754
$$ packed form
14853A97228n3964J75539P9281J2754A55204L06195n928j20359j04728K23350
14843D53734Q2501K50958C89195J90813B54007J92007j93843J80366H8977M05180
14833D94157B22428J90036j77577M55449k36683Q9553J24413J4348k83183K68640
14823F67424j34280j49729A69264J31096J72242J06226B16255K58821k6480N6574
14813E05170k52436J15749R1509P7817k24036N84981C44077J84657K8826r5543
14803D62017J85796J09205C42679j00272K83116k40186O5147N4810j58642K14950
14793D61602J38122k7543l1888Q6598k22862J74261q0911Q8995k18660n5476L2849
14782C45087J75350K6575R7480l09294J21671q8774K38983K2515k03274J82435
$$ plain form
14772 608754 485924 512553 430231 612593 454708 334595 221552 334211 487190 531578
14762 531578 454675 496894 267422 737174 656936 255506 429575 661939 577903 1002134
14752 1002134 561333 743940 719553 374398 811070 798909 554884 776605 632871 842197
14742 842197 533306 716877 670951 327206 860410 287938 540356 569366 676598 910240
14732 910240 475103 595258 604996 521278 854334 683993 760035 752418 734377 611486 566727
14721 566727 698005 594297 748825 747534 722276 619142 547492 625845 894657 838399 646693
14710 646693 653785 788894 787993 378689 682388 425274 950417 553330 533861 756909 723983
14699 723983 724262 770182 971055 790832 669039 984273 925663 892829 666383 795579 818349
$$ packed form
14772F08754j22830K6629q2322J82362j57885j20113j13043J12659J52979M4388
14762E31578p6903M2219k29472M69752q0238B55506J74069K32364q4036M24231
14752A002134m40801J82607k4387l45155M36672j2161k44025K21721j43734K09326
14742H42197l08891J83571m5926C27206N33204B87938K52418K9010J07232K33642
14732I10240m35137J20155R738q3718L33056j70341P6042p617j8041j22891m4759
14721E66727J31278j03708J54528j291k5258j03134p1650P8353K68812n6258j91706
14710F46693P092J35109r01C78689L03699k57114N25143l97087j9469K23048l2926
14699G23983K79M5920K00873j80223j21793L15234n8610l2834k26446J29196K2770
$$ plain form
14688 818349 869522 657356 659903 1083392 1060252 858093 698885 1110280 838004 1213439
14678 1213439 698513 1142971 903195 1361605 613367 1267862 990837 725715 835919
14669 835919 1148312 706984 663814 892858 676533 932520 1055893 783792 1147754 977860
14659 977860 818647 986325 973821 826811 740963 1149783 1014907 997640 1050423 908409
14649 908409 1156582 852616 1021551 1244272 952694 902608 1141068 745695 1016166 990281
14639 990281 917301 1141195 1114066 989262 1134402 1271156 1306439 1189777 1174967 1139583
14629 1139583 1152027 1000757 1163891 1009172 1181039 1592192 934129 1110229 1230765 1002678
14619 1002678 1441049 1407542 1261827 1196720 1147018 1277202 1360974 1354798 1132461 1494157
$$ packed form
14688H18349N1173k12166K547M23489k3140k02159j59208M11395k72276L75435
14678A213439n14926M44458k39776M58410F13367O54495k77025k65122J10204
14669H35919L12393m41328m3170K29044k16325K55987J23373k72101L63962j69894
14659I77860j59213J67678j2504j47010q5848M08820j34876j7267N2783j42014
14649I08409K48173l03966J68935K22721k91578n0086K38460l95373K70471k5885
14639I90281p2980K23894k7129j24804J45140J36754L5283j16662j4810l5384
14629A139583J2444j51270J63134j54719J71867M11153o58063J76100J20536k28087
14619A002678M38371l3507j45715o5107m9702J30184Q3772o176k22337L61696
$$ plain form
14609 1494157 1404326 1162034 1580067 1293575 1039837 1273073 1506579 1681330 1252671 1366173
14599 1366173 1465472 1639862 1790771 1249750 951300 1429535 1596477 1409778 1735681 1462881
14589 1462881 1458033 1769132 1750045 1551844 1314061 1500212 1771393 1749820 1604616 1336821
14579 1336821 1802263 1693080 1549458 1962438 1894363 1904312 2084245 1846979 2181258 1964360
14569 1964360 2127782 1799676 1909879 2261303 1776392 2270800 2250250 2197192 2206898 2543042
14559 2543042 2373469 2494411 3008881 2625757 2175081 2961573 3128038 3343634 4021193
14550 4021193 4642306 6816503 10193772 19254304 38339691 45639123 19515079 10386554
14542 10386554 6051371 3343652 2088054 2077491 1615726 1711331 1775478 1714759 1766650 1905274
$$ packed form
14609A494157q9831k42292M18033k86492k53738K33236K33506J74751m28659J13502
14599A366173R9299J74390J50909n41021k98450M78235J66942j86699L25903k72800
14589A462881m848L11099j9087j98201k37783J86151K71181k1573j45204k67795
14579A336821M65442j09183j43622M12980o8075R949J79933k37266L34279k16898
14569A964360J63422l28106J10203L51424m84911M94408k0550n3058R706L36144
14559B543042j69573J20942N14470l83124m50676P86492J66465K15596O77559
14550D021193O21113K174197L377269R060532J9085387P299432A9515079r128525
14542A0386554m335183k707719j255598j0563m61765R5605O4147o0719N1891J38624
$$ plain form
14532 1905274 1784693 2018536 2040756 2126155 2100617 1636977 2155473 2036160 1946147 2064445
14522 2064445 2388826 2259257 2677157 2223688 2461618 2439504 2476249 2058209 2470318 2178091
14512 2178091 2460027 2569612 2430602 2452139 2539204 2442132 2595820 2560064 2816963 2616506
14502 2616506 2519502 2920465 2882080 2576996 2791628 2594667 2976273 2825825 2756730 2878142
14492 2878142 2886975 3114660 3003421 3484550 3108194 3355408 3277263 3336616 3425869 3103115
14482 3103115 3389158 3427541 3646297 3698707 3411555 3444939 3161397 3413108 3825793 3569868
14472 3569868 3608617 3631588 3336842 3706712 3735112 3746271 4046619 3756401 4134155 4519288
14462 4519288 4211865 4276924 4028832 4660231 4185198 4439911 4464156 4425882 4790491 4555900
$$ packed form
14532A905274j20581K33843K2220Q5399k5538m63640N18496j19313r0013J18298
14522B064445L24381j29569M17900m53469K37930k2114L6745m18040M12109k92227
14512B178091K81936J09585j39010K1537Q7065r7072J53688l5756K56899k00457
14502B616506r7004M00963l8385l05084K14632j96961L81606j50448o9095J21412
14492B878142Q833K27685j11239M81129l76356K47214p8145N9353Q9253l22754
14482C103115K86043L8383K18756N2410k87152L3384k83542K51711M12685k55925
14472C569868L8749K2971k94746L69870K8400J1159L00348k90218L77754L85133
14462D519288l07423O5059k48092O31399m75033K54713K4245l8274L64609k34591
$$ plain form
14452 4555900 4401932 4645805 4684221 4640562 4727448 4775061 5186883 5246075 5105716 5204662
14442 5204662 5331234 5248947 5455279 5416137 5611161 5437901 5797532 5843992 5709814 5454399
14432 5454399 6048167 6121853 5891196 6304114 6150991 6141447 6659661 6488764 6512887 6654671
14422 6654671 7044828 6922979 7104326 7421697 6962323 7359983 7315604 7611440 7691644 7859465
14412 7859465 7674908 7723016 7784244 8096264 8537179 8312032 8548260 8576252 8588493 9129741
14402 9129741 9064656 9123438 9705935 9558535 9576955 9537253 10023639 10075169 10048564 10437675
14392 10437675 10480049 10566580 10784738 11119490 11261499 11411268 11860651 11954010 12220082 12498002
14382 12498002 12552138 12834955 12894722 12913904 13743484 13572632 13663728 14006905 14535392 14595952
$$ packed form
14452D555900j53968K43873L8416m3659Q6886M7613M11822N9192j40359R8946
14442E204662J26572q2287K06332l9142J95024j73260L59631M6460j34178k55415
14432E454399N93768P3686k30657M12918j53123r544N18214j70897K4123J41784
14422F654671L90157j21849J81347L17371m59374L97660m4379K95836Q0204J67821
14412G859465j84557M8108O1228L12020M40915k25147K36228K7992J2241N41248
14402I129741o5085N8782N82497j47400J8420l9702M86386N1530k6605L89111
14392A0437675M2374Q6531K18158L34752J42009J49769M49383R3359K66072K77920
14382A2498002N4136K82817N9767J9182Q29580j70852R1096L43177N28487O0560
$$ plain form
14372 14595952 15091321 15250489 15628429 15947426 16184627 16621765 17136237 17507769 17594112
14363 17594112 17942827 18542872 18572886 19003206 19406321 19932443 20203364 20747493 21230257
14354 21230257 22023878 22376494 23075294 23897200 23944341 24574155 25303187 25720287 26747320
14345 26747320 27222421 27853120 28499878 29572531 29888277 30685867 31719205 32683415 33836996
14336 33836996 34744408 35570603 36428461 37897869 38890726 40156845 41392549 42908014 44291078
14327 44291078 45340721 46795537 48711463 50326018 51780237 53773685 55819921 57707141
14319 57707141 59815133 61853710 64532849 67065713 69503010 72207759 74961706 78514123
14311 78514123 81717004 84859402 88566318 92265229 96866127 100914603 105518635 110234463
$$ packed form
14372A4595952M95369J59168L77940L18997K37201M37138N14472L71532Q6343
14363A7594112L48715O00045L0014M30320M03115N26122K70921N44129M82764
14354B1230257P93621L52616O98800Q21906M7141O29814P29032M17100J027033
14345B6747320M75101O30699O46758J072653L15746P97590J033338R64210J153581
14336C3836996R07412Q26195Q57858J469408R92857J266119J235704J515465J383064
14327D4291078J049643J454816J915926J614555J454219J993448K046236J887220
14319E7707141K107992K038577K679139K532864K437297K704749K753947L552417
14311G8514123L202881L142398L706916L698911M600898M048476M604032M715828
$$ plain form
14303 110234463 115846048 120853489 127090561 133226186 140259517 147066323 154871372 162769057
14295 162769057 171111979 180819626 190220910 200552256 211614102 223182863 235680403
14288 235680403 248506170 262006584 276875746 291565857 307195129 323339193 339484909
14281 339484909 356333485 373120496 389658822 405438361 420487719 433901136 446525245
14274 446525245 456038937 462255075 464438142 464778221 462464470 463508723 461061383 457229962
14266 457229962 452216925 442613968 429889911 416191785 401113811 384595656 367919487
14259 367919487 351067085 334253953 317592558 301225750 285695393 270815210 258023304
14252 258023304 244310601 230934564 218785068 207153049 196415108 185918125 176576339
$$ packed form
14303A10234463N611585N007441O237072O135625P033331O806806P805049P897685
14295A62769057Q342922R707647R401284J0331346J1061846J1568761J2497540
14288B35680403J2825767J3500414J4869162J4690111J5629272J6144064J6145716
14281C39484909J6848576J6787011J6538326J5779539J5049358J3413417J2624109
14274D46525245R513692O216138K183067L40079k313751J044253k447340l831421
14266D57229962n013037r602957j2724057j3698126j5077974j6518155j6676169
14259C67919487j6852402j6813132j6661395j6366808j5530357j4880183j2791906
14252B58023304j3712703j3376037j2149496j1632019j0737941j0496983r341786
$$ plain form
14245 176576339 167423243 159716524 151553978 144084735 137122612 130223959 124192947 118773834
14237 118773834 113540773 108330727 103136768 98677161 94387926 90786227 87452836 83530287
14229 83530287 80285326 77004890 73889506 70721320 68284348 65588784 63363106 60964951
14221 60964951 58970214 56890353 55384579 53193116 51352518 49654996 48059895 46948531
14213 46948531 45606769 43899210 42395609 41089237 39916316 38954863 38584357 37454729
14205 37454729 35874704 34544067 33875088 32688349 32001402 31937507 30639677 29260372 28831849
14196 28831849 28222799 27916889 26681132 26390086 25332378 24850292 23935991 23848197 22825275
14187 22825275 22082672 21907678 21437040 20837387 20584182 20026879 19515370 19248007 18734328
$$ packed form
14245A76576339r153096p706719q162546p469243o962123o898653o031012n419113
14237A18773834n233061n210046n193959m459607m289235l601699l333391l922549
14229H3530287l244961l280436l115384l168186k436972k695564k225678k398155
14221F0964951j994737k079861j505774k191463j840598j697522j595101j111364
14213D6948531j341762j707559j503601j306372j172921r61453l70506j129628
14205C7454729j580025j330637o68979j186739o86947o3895j297830j379305m28523
14196B8831849o09050l05910j235757k91046j057708m82086r14301q7794j022922
14187B2825275p42603j74994m70638n99653k53205n57303n11509k67363n13679
$$ plain form
14178 18734328 18070627 18101082 17236908 17145860 16803913 16509364 16403708 15890059 15615453 15293252
14168 15293252 15144674 14635658 14271558 14257293 13800933 13293382 13351429 13366873 12678339 12575929
14158 12575929 12379300 12048996 12115121 11318066 11441202 11265415 10811820 10937288 10478226
14149 10478226 10592050 10605047 10508298 10131936 10068770 9923225 9703111 9415100 8994690 9197185
14139 9197185 9029189 8864668 8646096 8603694 8296362 8490057 7975935 8180951 8012630 7913492
14129 7913492 7669459 7918942 7798974 7809380 7274425 7122374 7248045 7086888 6700908 7051560
14119 7051560 6763016 6760371 6588040 6421242 6190811 6561070 6451236 6033840 6415142 5959026
14109 5959026 5944535 5907358 6014629 5909217 5976512 6078715 5637654 5353688 5366621 5457054
$$ packed form
14178A8734328o63701L0455q64174r1048l41947k94549j05656n13649k74606l22201
14168A5293252j48578n09016l64100j4265m56360n07551N8047J5444o88534j02410
14158A2575929j96629l30304O6125p97055J23136j75787m53595J25468m59062
14149A0478226J13824J2997r6749l76362o3166j45545k20114k88011m20410K02495
14139I197185j67996j64521k18572m2402l07332J93695n14122K05016j68321r9138
14129G913492k44033K49483j19968J0406n34955j52051J25671j61157l85980L50652
14119G051560k88544k645j72331j66798k30431L70259j09834m17396L81302m56116
14109E959026j4491l7177J07271j05412O7295J02203m41061k83966J2933R0433
$$ plain form
14099 5457054 5383994 5189286 5215891 4897540 4952067 5000434 5064579 4837986 4815432 5113857
14089 5113857 4750876 4476501 4499473 4621504 4478298 4687723 4684931 4478119 4309064 4462306
14079 4462306 4258986 4193876 4341729 4497511 3698838 4272150 4047014 3928284 3740725 3979689
14069 3979689 3950325 3833190 3653471 3694797 3456221 3501812 3874171 3486659 3340814 3760822
14059 3760822 3529828 3453968 3612288 3677041 3523293 3466496 3517216 2947710 3104045 3241343
14049 3241343 3320262 3149510 3127749 3107306 3183136 2849946 3108426 2841954 2850059 2740684
14039 2740684 2971224 2898753 2807419 3014453 2522245 2744612 2977414 2896905 2653491 2939652
14029 2939652 2718015 2536091 2789244 2767642 2730420 2495554 2478317 2423582 2617799 2285007
$$ packed form
14099E457054p3060j94708K6605l18351N4527M8367O4145k26593k2554K98425
14089E113857l62981k74375K2972J22031j43206K09425k792k06812j69055J53242
14079D462306k03320o5110J47853J55782p98673N73312k25136j18730j87559K38964
14069C979689k9364j17135j79719M1326k38576M5591L72359l87512j45845M20008
14059C760822k30994p5860J58320O4753j53748n6797N0720n69506J56335J37298
14049C241343P8919j70752k1761k0443P5830l33190K58480k66472Q105j09375
14039B740684K30540p2471r1334K07034m92208K22367K32802q0509k43414K86161
14029B939652k21637j81924K53153k1602l7222k34866j7237n4735J94217l32792
$$ plain form
14019 2285007 2275148 2473042 2592594 2323611 2527560 2256575 2392560 2069385 2138186 1781708
14009 1781708 2195469 2016230 2074829 2338564 1689908 2095070 2155451 1919443 2056963 1691545
13999 1691545 1930645 1847323 2195629 2016664 1798623 1791986 1530742 1664153 1942115 2120727
13989 2120727 2684498 5639469 12448675 32188620 47475349 24643863 12628677 7092985
13981 7092985 4932000 4024205 3794097 2860224 2941005 2737878 2795145 2763739 2755870 2512106
13971 2512106 2302957 2183254 2365608 2228340 2149494 1929452 2170917 1995016 1898096 1970394
13961 1970394 1808916 1633851 1868001 1698043 1794244 1909824 1644852 1703360 1822115 1835487
13951 1835487 1899943 1638832 1773933 1879228 1645925 1426531 1768420 1756205 1655825 1603714
$$ packed form
14019B285007r859J97894J19552k68983K03949k70985J35985l23175O8801l56478
14009A781708M13761j79239N8599K63735o48656M05162O0381k36008J37520l65418
13999A691545K39100q3322L48306j78965k18041o637k61244J33411K77962J78612
13989B120727N63771K954971O809206J9739945J5286729k2831486j2015186n535692
13981G092985k160985r07795k30108r33873Q0781k03127N7267l1406p869k43764
13971B512106k09149j19703J82354j37268p8846k20042K41465j75901r6920P2298
13961A970394j61478j75065K34150j69958R6201J15580k64972N8508J18755J3372
13951A835487O4456k61111J35101J05295k33303k19394L41889j2215j00380n2111
$$ plain form
13941 1603714 1564073 1710271 1847600 1317999 1303520 1492028 1679026 1507845 1265060 1645608
13931 1645608 1666037 1470555 1433216 1281255 1297285 1308885 1342933 1300488 1338350 1199975 1430550
13920 1430550 1204117 1443616 1168606 1288999 1385585 1595065 1272264 1362058 1427537 1505331
13910 1505331 1218732 1560156 1182117 1434207 829535 1125885 956202 1307906 1217566 1519607
13900 1519607 1239385 1215711 1225728 1094707 1168436 971829 1170661 957984 1476597 1364924
13890 1364924 1206880 1231209 891235 1053586 1213881 987829 1194367 843545 1020739 989168
13880 989168 896521 961591 1377939 806966 870632 1120112 1124043 890697 981276 749039 867275
13869 867275 942728 1019534 796239 928440 703126 861379 964203 867061 963875 1106958
$$ packed form
13941A603714l9641J46198J37329n29601j4479J88508J86998j71181k42785L80548
13931A645608K0429j95482l7339j51961J6030J1600L4048m2445L7862j38375K30575
13920A430550k26433K39499k75010J20393R6586K09480l22801Q9794O5479P7794
13910A505331k86599L41424l78039K52090o04672K96350j69683L51704r0340L02041
13900A519607k80222k3674J0017j31021P3729j96607J98832k12677N18613j11673
13890A364924j58044K4329l39974J62351J60295k26052K06538l50822J77194l1571
13880I89168r2647O5070M16348n70973O3666K49480L931k33346R0579k32237J18236
13869H67275P5453P6806k23295J32201k25314J58253J02824r7142R6814J43083
$$ plain form
13859 1106958 920614 1211358 1014376 1085738 1040043 820590 873099 1037189 1001045 913550
13849 913550 1023973 1103498 1022188 1126917 1119571 1035979 819399 853729 724794 832314 982087
13838 982087 1092875 942406 952301 700386 705547 669390 694675 898972 981665 895362 685185
13827 685185 739889 921423 396203 610076 701839 847884 804569 856620 994480 440496
13816 901869 932090 826228 949298 755187 820477 543719 643696 617896 1022928 618178
13806 618178 732218 706597 941034 683909 629071 906747 686925 722684 349768 701554
13796 701554 520691 559679 586149 814399 625462 702083 650023 965277 652318 603648
13786 603648 773486 368188 534088 669444 498036 659331 645499 760723 318805 745182
$$ packed form
13859A106958j86344K90744j96982P1362m5695k19453N2509J64090l6144q7495
13849I13550J10423P9525q1310J04729p346q3592k16580L4330j28935J07520J49773
13838I82087J10788j50469R895k51915N161l6157K5285K04297Q2693q6303k10177
13827F85185N4704J81534C96203K13873R1763J46045m3315N2051J37860D40496
13816I01869L0221j05862J23070j94111O5290k76758R9977k5800M05032m04750
13806F18178J14040k5621K34437k57125n4838K77676k19822L5759C49768L51786
13796G01554j80863L8988K6470K28250j88937P6621n2060L15254l12959m8670
13786F03648J69838C68188J65900J35356j71408J61295j3832J15224C18805M26377
$$ plain form
13776 745182 869142 673833 969811 842541 867470 449935 331475 649369 681706 513507
13766 513507 647715 362587 387918 641216 653592 564446 742524 599366 702988 602609
13756 602609 792936 344393 670099 643829 590934 408446 546412 665596 611994 409006
13746 409006 666908 635304 524342 654163 779974 424810 484348 531429 360546 953542
13736 953542 524582 75776 536635 624330 760621 536116 410406 493552 515680 405885
13726 405885 385531 514230 615697 475677 744199 480001 215678 310231 600751 308639
13716 308639 321944 477053 757941 290758 272650 324517 581863 770594 175465 488176
13706 488176 485943 179992 602413 518226 195079 509200 477419 583884 399737 701748
$$ packed form
13776G45182J23960j95309K95978j27270K4929m17535j18460L17894L2337j68199
13766E13507J34208k85128K5331K53298J2376q9146J78078j43158J03622j00379
13756F02609J90327C44393L25706k6270n2895j82488J37966J19184n3602k02988
13746D09006K57902l1604j10962J29821J25811l55164N9538M7081j70883N92996
13736I53542m28960G5776M60859Q7695J36291k24505j25710Q3146K2128j09795
13726D05885k0354J28699J01467j40020K68522k64198B15678R4553K90520k92112
13716C08639J3305J55109K80888B90758j8108N1867K57346J88731A75465L12711
13706D88176k233A79992M22421q4187A95079L14121l1781J06465j84147L02011
$$ plain form
13696 701748 464345 402601 744342 510389 334427 813687 397856 532740 320865 420555
13686 420555 169962 500639 403399 437907 512600 447100 430452 493404 505361 525526 583634
13675 583634 273186 318045 741272 361915 612710 277538 324188 661973 487904 340210
13665 340210 299341 399618 463073 485792 614130 416480 410838 61184 705486 585141 268156
13653 238175 402070 382676 302098 248223 397626 219681 265830 167823 350475 92716 455087
13642 455087 503380 354234 404805 54458 -6671 472947 375756 541765 263316 580210 376760
13631 376760 369910 361058 305874 595727 -2715 401403 333283 428866 184973 75978 149693
13620 149693 519585 230284 291133 404264 370608 143969 92276 431551 683411 173333
$$ packed form
13696G01748k37403o1744L41741k33953j75962M79260C97856J34884k11875R9690
13686D20555A69962L30677r7240L4508P4693o5500j6648O2952J1957K0165N8108
13675E83634B73186M4859M23227C61915K50795B77538M6650L37785j74069j47694
13665C40210m0869J00277O3455K2719J28338j97650n642F1184O44302j20345B68156
13653B38175J63895j9394q0578n3875J49403j77945M6149r8007J82652I2716L62371
13642D55087M8293j49146N0571E4458f671D72947r7191J66009B63316L16894k03450
13631C76760o850q852n5184K89853b715D01403o8120R5583A84973G5978P3715
13620A49693L69892B30284O0849J13131l3656A43969n1693L39275K51860A73333
$$ plain form
13609 234094 553227 333372 194601 193082 356689 -91267 552189 322899 200231 480120
13599 480120 471639 101170 545286 208899 427315 396837 159761 277269 378897 127982
13588 575454 479090 267535 533437 467804 389401 224342 259083 369898 -141507 339188
13577 344213 394911 369894 896 58249 -31528 254875 346738 505459 302456 332316 544564
13566 544564 449510 290778 242892 169996 449342 557890 327800 66112 236001 419857
13556 419857 450335 220100 -10938 334947 324164 122912 -74801 484775 240671 108179
13545 267887 173332 227652 330084 57485 135350 314255 123295 247649 214167 377091
13535 377091 64301 392285 137468 313330 502643 191339 113020 280646 330237 39779
$$ packed form
13609B34094L19133k19855j38771j519J63607i1267E52189k29290j22668K79889
13599D80120q481A01170M44116B08899K18416l0478A59761J17508J01628A27982
13588E75454r6364k11555K65902o5633p8403j65059L4741J10815a41507C39188
13577C44213N0698k5017H96N7353c1528B54875R1863J58721k03003K9860K12248
13566E44564r5054j58732m7886p2896K79346J08548k30090F6112J69889J83856
13556D19857L0478B20100a0938C34947j0783A22912g4801D84775B40671A08179
13545B67887r4555N4320J02432E7485P7865J78905A23295J24354l3482J62924
13535C77091F4301L27984A37468J75862J89313A91339p8319J67626M9591C9779
$$ plain form
13524 339395 584226 -153954 210424 572073 -52818 28302 304204 451396 485534 146804
13513 429917 103328 252847 -84918 370266 220631 434105 132171 -122918 329334 377121
13503 377121 444431 183903 56340 199921 133563 340352 460601 129325 -220530 304354
13492 146147 169920 57539 66320 174054 -16791 130441 219020 44169 254607 216104 212296
13481 212296 476062 318854 170696 419589 -14232 126139 118567 512092 338518 104661
13470 335672 137180 34721 131098 277006 190562 190322 180063 415772 639568 329971 -21270
13458 323631 80004 193153 -44746 313349 235661 294137 -50634 -49707 408882 -63221 242880
13446 197595 393909 320693 375637 411542 212654 292309 156118 165198 -7295 445339 106388
$$ packed form
13524C39395K44831a53954B10424L61649e2818B8302K75902J47192L4138A46804
13513D29917A03328J49519h4918C70266j49635K13474A32171a22918C29334M7787
13503C77121O7310A83903E6340J43581o6358K06789J20249A29325b20530C04354
13492A46147K3773E7539Q781J07734a6791A30441Q8579D4169K10438l8503l808
13481B12296K63766j57208j48158K48893a4232A26139p572L93525j73574A04661
13470C35672A37180C4721R6377J45908q6444k40j0259K35709K23796l09597b1270
13458C23631H0004J13149d4746C13349p7688N8476e0634R27D08882f3221B42880
13446A97595J96314p3216N4944L5905j98888P9655j36191R080g295D45339A06388
$$ plain form
13434 347197 223959 269103 375363 216613 136453 -346009 271975 112207 398004 -42526
13423 204801 5041 148341 48328 179128 368325 1991 256673 251203 147612 -19228 124844
13411 443 160541 456429 -73258 -447260 -78924 4624 106488 30550 -37266 290253 158923
13400 158923 281037 102848 107064 28519 -108010 70409 53880 154619 308161 113626
13389 413831 -21672 77802 -167221 193264 72025 210622 -66611 174461 262128 30032 292764
13378 292764 -166015 93018 220394 326340 274042 287616 184545 158847 -107985 618634
13367 336379 184260 313840 202384 208566 -99728 59404 343467 -134592 237848 193593
13357 193593 271391 255330 56222 63266 372833 69117 7864 17401 10914 256282 -50923 181875
$$ packed form
13434C47197j23238M5144J06260j58750q0160c46009B71975A12207K85797d2526
13423B04801E041J43300D8328J30800J89197A991K54682n470j03591a9228A24844
13411D43J60098K95888g3258l74002g8924D624J01864C0550c7266B90253j31330
13400A58923J22114A02848M216B8519a08010G0409j6529J00739J53542A13626
13389D13831b1672G7802a67221A93264G2025J38597f6611A74461Q7667C0032K62732
13378B92764a66015I3018J27376J05946n2298J3574j03071k5698a07985F18634
13367C36379j52119J29580j11456O182i9728E9404K84063a34592B37848m4255
13357A93593P7798j6061E6222P044L09567F9117G864R537o487K45368e0923A81875
$$ plain form
13344 400590 -212445 527706 107667 285129 62327 289760 202607 312039 304740 60789
13333 394440 598662 309200 182465 198908 259297 -60869 -160681 -47590 170420 -61472 410960
13321 186152 86208 135347 281204 273641 411189 128284 86759 353785 247205 191843 92787
13309 379445 9164 41008 155399 50360 26688 24918 59833 435802 35843 248378 -213658
13297 -123552 79498 449286 55385 112825 -34623 207409 168738 122595 147713 116849 206153
13286 206153 -71440 -63846 262762 130752 -162690 75818 84968 132892 215743 151792 336619
13275 336619 190776 144807 240405 223393 160857 -167986 162395 -26001 195694 80113 441056
13264 441056 91193 -28432 -196539 -157528 168257 247289 42021 -224501 18897 267733 298219
$$ packed form
13344D00590b12445E27706A07667J77462F2327K27433q7153J09432p299F0789
13333C94440K04222k89462j26735J6443O0389f0869r9812d7590A70420f1472D10960
13321A86152H6208M9139J45857p563J37548A28284m1525K67026j06580n5362I2787
13309C79445I164L1844J14391E0360k3672j770L4915L75969C5843K12535b13658
13297a23552G9498L69788E5385N7440c4623B07409l8671m6143K5118l0864Q9304
13286B06153g1440P594B62762A30752a62690G5818R150M7924Q2851o3951J84827
13275C36619j45843m5969R5598j7012o2536a67986A62395b6001A95694H0113L60943
13264D41056I1193b8432j68107L9011A68257P9032D2021b24501A8897K48836L0486
$$ plain form
13253 298219 378956 139368 210274 71461 -250808 25344 326805 206406 -275874 180704
13242 13661 123775 145719 -5327 93577 11429 -15652 432776 -9687 139935 27361 -346544
13230 -56205 408264 418376 212871 -208806 177203 112767 169742 25864 254086 109334
13219 288022 550479 153375 64637 60323 373258 -113596 -68550 66460 -309100 -36667 187707
13207 244532 -297543 264778 207831 213728 186953 36914 194334 -281922 -95163 242647 283417
13196 283417 -49803 -169079 410307 209387 57381 -729 180392 259205 524605 -171410 191494
13184 32275 -136145 133670 118360 -42515 181268 302023 3026 -91474 -58722 166396 -11074
13172 59972 8382 -307581 -9710 61293 165911 -324200 382511 -50526 -200068 -54897 -69229
$$ packed form
13253B98219Q0737A39368P0906G1461b50808B5344L01461j20399b75874A80704
13242A3661J10114K1944e327I3577A1429a5652D32776i687A39935B7361c46544
13230e6205D08264J0112k05505b08806A77203o4436N6975B5864K28222A09334
13219B88022K62457A53375F4637m314L12935a13596M5046F6460c09100c6667A87707
13207B44532b97543B64778n6947N897k6775C6914J57420b81922i5163B42647M0770
13196B83417d9803j19276D10307k00920E7381g29A80392P8813K65400a71410A91494
13184C2275a36145A33670j5310d2515A81268J20755C026i1474L2752A66396a1074
13172E9972H382c07581i710F1293J04618c24200C82511e0526j49542e4897j4332
$$ plain form
13161 -69229 356607 271284 -44352 119214 5264 149669 94790 -22248 -22502 220727 -79065
13149 -14192 -2261 121840 154476 21744 -73122 41484 169242 331625 75119 291535 189761
13138 189761 257912 -55333 48518 -157189 -223871 180142 -35364 278908 227892 -2473 89038
13126 -53903 275247 -163392 193062 227257 110568 151500 136734 198538 187541 -48046 -81418
13115 -81418 53707 164500 55187 66098 -27315 159655 311815 541213 -107850 125267
13104 -13726 261670 294007 106762 204219 151416 200763 -122480 267130 -34848 -215708 -266822
13093 -266822 82761 -16692 134440 142591 212568 -104165 447664 -148239 112760 206069 -94164
13081 103557 135864 -51797 -145626 -148005 -102728 -142677 276809 107357 218046 -125221 5018
$$ packed form
13161f9229C56607q5323d4352A19214E264J44405n4879b2248k54B20727g9065
13149a4192b261A21840L2636B1744g3122D1484J27758J62383G5119K16416j01774
13138A89761O8151e5333D8518a57189o6682A80142c5364B78908n1016b473H9038
13126e3903B75247a63392A93062L4195A10568M0932j4766O1804j0997d8046l3372
13115h1418E3707J10793E5187J0911b7315A59655J52160K29398a07850A25267
13104a3726B61670L2337A06762R7457n2803M9347a22480B67130c4848j80860n1114
13093b66822H2761a6692A34440Q151O9977a04165D47664a48239A12760R3309i4164
13081A03557L2307e1797r3829k379M5277l9949B76809A07357J10689a25221E018
$$ plain form
13069 284146 45471 -156483 239809 52852 -15864 -44165 -152087 289244 147371 101076
13059 101076 -198235 -76658 147331 -38121 117831 367298 106412 103665 -72739 65477 239612
13048 239612 120282 195715 -25105 46967 89086 -141602 -77261 76458 -158914 -221349 -172246
13037 -172246 -222696 157308 388046 46927 257179 348514 153072 68999 269667 146809
13027 146809 131553 287401 189716 164554 423918 124850 71322 91321 76451 383735 -2826
13015 104616 155897 4387 154157 297211 235192 164637 -20075 -35054 -98613 -8703 58862
13003 247948 174907 -47615 53631 84023 18647 182419 -199101 14077 209626 955 301436
12992 301436 175171 139241 -58574 -418639 22069 39642 -9774 81421 356395 -200905 -313769
$$ packed form
13069B84146D5471a56483B39809E2852a5864k8301j07922B89244j41873m6295
13059A01076a98235g6658A47331c8121A17831K49467A06412k747g2739F5477J74135
13048B39612j19330P5433b5105D6967M2119a41602O4341G6458a58914o2435M9103
13037a72246n0450A57308K30738D6927K10252R1335A53072F8999K00668j22858
13027A46809j5256J55848r7685k5162K59364A24850n3528J9999j4870L07284b826
13015A04616N1281D387J49770J43054o2019p0555b0075j4979o3559h703E8862
13003B47948p3041d7615E3631L0392A8647J63772a99101A4077J95549I55L00481
12992C01436j26265l5930e8574l60065B2069J7573i774H1421K74974b00905j12864
$$ plain form
12981 -313769 -284089 9888 -19527 193886 294636 84097 -93498 -63670 -174195 168072 -6450
12969 -35875 -121544 223078 72744 181535 -220207 177389 -264549 -242431 23266 -148953
12958 73389 10125 144615 -244831 191427 5150 179937 118128 -259014 -22188 341732 46966
12946 -137372 220543 -134381 391607 -56098 -34307 299640 -85972 -112047 118826 -122644
12935 200402 185598 230348 -205816 -70640 -108603 -60199 291208 -125875 -87749 299844 -119767
12923 131670 94479 -117434 106160 -303957 -126147 -218837 201243 -111219 -134337 206077
12912 67049 8674 129362 156697 47225 326731 68062 -62545 153442 -33945 39447 80451
12901 80451 -90818 2855 321567 160278 87279 214318 22829 124768 -110168 123615 -46128
$$ packed form
12981c13769K9680I888a9527A93886J00750H4097i3498K9828j10525A68072f450
12969c5875q5669B23078G2744J08791b20207A77389b64549K2118B3266a48953
12958G3389A0125J34490b44831A91427E150J74787o1809b59014b2188C41732D6966
12946a37372B20543a34381C91607e6098K1791B99640h5972k6075A18826a22644
12935B00402j4804M4750b05816g0640l7963M8404B91208a25875L8126B99844a19767
12923A31670l7191a17434A06160c03957a26147r2690B01243a11219k3118B06077
12912F7049H674J20688K7335D7225K79506F8062f2545A53442c3945C9447M1004
12901H0451i0818B855L18712A60278p2999J27039B2829J01939a10168A23615d6128
$$ plain form
12889 151017 10206 338996 -187017 333081 -261689 13329 -183951 -19091 157370 47783
12878 -71155 124343 140720 -63813 179157 1336 314001 -13292 60482 -276885 132371 -144229
12866 -102160 -83844 -239708 -29533 45319 150552 -263320 -45272 42468 -31786 -276816 391444
12854 -86320 61542 83450 216414 -117453 287499 -155582 -44385 18648 133952 -170908
12843 -62585 22227 234064 201313 45776 -68167 180254 -20029 156289 101364 343124 -133777
12831 -41169 89212 -141842 8895 123606 -64664 151106 50085 -319915 79484 100729 -182236
12819 -146301 -35428 244600 -342084 51627 215140 -251422 126449 55028 426352 -71571
12808 123787 98674 -69549 67677 48925 19204 39032 -310596 -170628 161720 -249591 196263
$$ packed form
12889A51017A0206L28790a87017C33081b61689A3329a83951a9091A57370D7783
12878g1155A24343J6377f3813A79157A336L12665a3292F0482b76885A32371a44229
12866a02160J8316j55864b9533D5319J05233b63320d5272D2468c1786k45030C91444
12854h6320F1542K1908J32964a17453B87499a55582d4385A8648J15304a70908
12843f2585B2227K11837l2751D5776f8167A80254b0029A56289n4925K41760a33777
12831d1169H9212a41842H895J14711f4664A51106E0085c19915G9484K1245a82236
12819a46301c5428B44600c42084E1627J63513b51422A26449E5028L71324g1571
12808A23787k5113f9549F7677j8752A9204J9828c10596J39968A61720b49591A96263
$$ plain form
12796 307121 -105245 202266 263731 -29032 288275 170326 322028 98433 109520 157284
12786 157284 -39727 -154937 165371 -184341 -94085 135565 120179 -82809 57077 113525 114965
12775 114965 243190 -222910 -49199 -42942 211927 -135925 -126244 -123391 107396 -124953 66860
12763 -182462 -244010 -215304 -300553 217845 -97388 102573 124870 346600 -166942 -122673 -30143
12751 -246020 29943 94447 -464891 148507 127108 -97515 -164829 74712 157018 10968 70721
12740 70721 -130487 89757 -29146 148011 128761 111377 -22508 -11641 431567 234929 130208
12729 130208 -123120 -99298 130577 -109703 -58920 203888 -227605 -269094 94247 -261202
12718 332702 -64005 -133592 296472 336756 96971 -58864 -172029 124489 358085 252152
$$ packed form
12796C07121a05245B02266O1465b9032B88275j17949J51702I8433J1087M7764
12786A57284c9727j15210A65371a84341R0256A35565j5386h2809E7077N6448J440
12775A14965J28225b22910d9199O257B11927a35925R681K853A07396a24953F6860
12763a82462o1548K8706q5249B17845i7388A02573K2297K21730a66942M4269c0143
12751b46020B9943O4504d64891A48507k1399i7515o7314G4712Q2306A0968N9753
12740G0721a30487H9757b9146A48011j9250j7384b2508J0867D31567j96638j04721
12729A30208a23120K3822A30577a09703N0783B03888b27605m1489I4247b61202
12718C32702f4005o9587B96472M0284I6971e8864j13165A24489K33596j05933
$$ plain form
12708 252152 110003 224834 206585 -35547 338378 215397 108824 99301 129761 246157
12698 246157 -234378 -204204 32915 -13811 212838 202032 -41540 29654 97208 33013 287300
12687 287300 257040 228633 13485 102024 28367 180886 -158053 163659 235643 224741 91710
12675 451736 101919 -146564 112923 -123846 -79615 -559 -14923 18777 -231247 -335555 -119188
12663 111180 190740 73043 69827 -81551 163168 150548 264826 -79739 159961 45211 377102
12652 377102 -40387 -19579 157240 -43738 196972 -30947 -176883 -143409 67410 -258246 -28431
12640 365182 2689 367303 309974 49771 -228226 -149475 141975 -10787 -103554 91615 319026
12629 319026 312306 319004 222952 219453 -3628 34890 64931 328507 241693 115910 391295 -31785
$$ packed form
12708B52152A10003J14831j8249c5547C38378j22981j06573r523L0460J16396
12698B46157b34378L0174C2915a3811B12838j0806d1540B9654O7554C3013K54287
12687B87300l0260k8407A3485Q8539B8367J52519a58053A63659P1984j0902I1710
12675D51736A01919a46564A12923a23846M4231e59j4364A8777b31247j04308a19188
12663A11180P9560G3043l216h1551A63168j2620J14278g9739A59961D5211L31891
12652C77102d0387a9579A57240d3738A96972c0947j45936L3474F7410b58246b8431
12640C65182B689L64614n7329D9771b28226P8751A41975a0787r2767I1615K27411
12629C19026o720O698r6052l499c628C4890L0041K63576q6814A15910K75385c1785
$$ plain form
12616 -42545 -274547 -282683 202714 103017 173015 388176 -135124 -28132 30314 -105061 -114788
12605 -114788 -16118 -260171 355050 12214 11338 -298758 173930 113712 -23618 51075 46850
12594 46850 -4377 199692 81196 -53095 309307 -163057 42759 11629 -222731 135081 -280623
12582 106915 -90832 43831 -8030 19739 -208969 -159835 -174985 32637 -244054 -369541 -69235
12570 136787 98997 -41831 261808 -55685 -42320 -69125 1331 124021 318547 -43623 72167
12558 193241 398213 -50223 164552 -37797 21743 -25300 -96058 137756 139447 278642 -69869
12546 150225 9882 108730 -131632 275960 166534 58137 -31145 143515 -198587 -48206 306469
12534 119749 -172230 -107212 -75628 407847 -4666 -135731 42744 -46024 -65892 56460 222930
$$ packed form
12616d2545k32002q136B02714r9697O9998K15161a35124b8132C0314a05061r727
12605a14788a6118k44053C55050A2214q76b98758A73930o0218b3618E1075m225
12594D6850d377A99692H1196e3095C09307a63057D2759A1629b22731A35081b80623
12582A06915i0832D3831h030A9739b08969M9134j5150C2637b44054j25487f9235
12570A36787l7790d1831B61808e5685J3365k6805A331J22690J94526d3623G2167
12558A93241K04972e0223A64552c7797B1743b5300p0758A37756J691J39195f9869
12546A50225I882R8848a31632B75960j09426E8137c1145A43515a98587d8206C06469
12534A19749a72230O5018L1584D07847d666j31065D2744d6024j9868E6460J66470
$$ plain form
12523 222930 277444 13389 248003 186407 19045 192164 49216 -123385 53252 -242779 -60704
12511 207143 -300340 -72025 353574 256737 148281 39058 -59958 213813 -82077 254858
12500 493724 566 145514 36862 372063 62996 -182253 -258474 -321253 -146094 -5200 208635
12488 -17714 151587 432933 164825 -7604 247140 101795 -266995 52365 132355 -3689 -48961
12477 -48961 -257649 -175274 -14815 -197197 206061 155127 -115378 37043 -170704 -218482 118439
12465 -62479 -14334 -275193 399518 -252076 37721 45295 46057 -202953 -139 165432 481343
12454 481343 197358 -178670 9000 -70319 -185072 88584 -76775 11573 25789 -130782 -250987
12443 -250987 28787 39617 -232269 -25963 83179 -194238 -249964 120469 -109634 106566
$$ packed form
12523B22930N4514A3389K34614o1596A9045J73119D9216a23385E3252b42779f0704
12511B07143c00340g2025C53574r6837j08456C9058e9958B13813h2077B54858
12500D93724E66J44948C6862L35201F2996a82253p6221o2779a46094e200B08635
12488a7714A51587K81346A64825g604B47140A01795b66995E2365P9990c689m5272
12477d8961k08688Q2375a4815j82382B06061n0934a15378C7043a70704m7778A18439
12465f2479a4334k60859C99518b52076C7721P574P62b02953a39A65432L15911
12454D81343A97358a78670I000g0319j14753H8584g6775A1573J4216a30782j20205
12443b50987B8787J0830b32269b5963H3179a94238n5726A20469a09634A06566
$$ plain form
12432 -348245 -233386 -79627 303269 84695 -61415 -245897 91803 156584 121233 -221256 -144462
12421 -144462 -290123 -249463 49991 -132937 100394 -250228 -32082 -51850 110567 -110056
12410 -22590 -111992 -143074 -170356 -87083 -56855 175288 -128344 195548 89120 -235652 -177590
12399 -177590 -2643 171252 -10036 -312343 18693 204656 -138913 -237691 -172922 254712 -44282
12387 -18411 136757 321201 -217619 -172422 -64586 128565 4020 64029 69702 44362 239873
12376 239873 -129646 75093 -281734 -30537 552152 -359608 -70632 -21445 -171516 253589
12365 13234 -70610 108396 -124613 -196870 334837 3113 126294 127564 137592 -112865 123947
12353 287295 -97391 5292 866 -60740 132418 -178600 154711 75741 -6052 134929 -52043
$$ packed form
12432c48245J14859g9627C03269H4695f1415j84482I1803O4781l5351b21256P6794
12421a44462j45661M0660D9991a32937A00394b50228c2082j9768A10567a10056
12410b2590q9402l1082k7282Q3273L0228A75288a28344A95548H9120b35652N8062
12399a77590b643A71252a0036l02307A8693J85963a38913r8778O4769B54712d4282
12387a8411A36757J84444b17619M5197f4586A28565D020O0009N673k5340J95511
12376B39873a29646G5093b81734c0537E52152c59608g0632b1445j50071B53589
12365A3234g0610A08396a24613p2257C34837C113J23181J270J0028a12865A23947
12353B87295i7391E292H66f0740A32418a78600A54711G5741f052A34929e2043
$$ plain form
12341 296913 -65035 338394 82484 -82329 264282 15199 70110 -52663 245071 -207560 -47903
12329 33397 -320 -40752 -214540 -39210 91398 -39981 -355302 354066 49395 -144488 51136
12317 12776 82971 -42404 -2826 -87785 167356 -81989 411212 12582 -5817 25216 -19852 -1331
12304 16487 -116144 421347 -25750 160684 -43180 -166020 114274 138158 65895 -39601 -210400
12293 -210400 87818 165422 164522 -124784 60339 9879 35646 92311 350612 -148924 148141
12281 74716 -35170 395689 80303 43696 71016 -105058 243477 267855 549455 355082 99922
12269 208558 -50257 -68476 50850 221582 185915 467374 107812 378683 59881 157226 -309353
12257 -53514 184234 -100893 33765 43305 -26770 542663 33905 25333 219895 221539 75577
$$ packed form
12341B96913f5035C38394H2484h2329B64282A5199N4911e2663B45071b07560d7903
12329C3397c20m0432j73788c9210I1398c9981l15321C54066D9395a44488E1136
12317A2776P0195d2404b826q4959A67356h1989D11212A2582e817B5216a9852a331
12304A6487a16144D21347b5750A60684d3180j22840A14274K3884F5895c9601j70799
12293b10400H7818P7604r00a24784F0339I879K5767N6665K58301a48924A48141
12281G4716c5170C95689H0303l6607K7320a05058B43477K4378K81600j94373I9922
12269B08558e0257j8219E0850J70732l5667K81459A07812K70871E9881R7345c09353
12257e3514A84234a00893C3765R540b6770E42663C3905q572J94562J644G5577
$$ plain form
12245 94741 185190 454514 30687 -50438 206666 -88476 -178406 -155108 -199535 -67194 303050
12233 -804 -24435 133089 229265 161327 -230227 70133 362388 264355 243316 369075 332987
12222 332987 313387 212480 133762 137500 139627 52618 516831 -189762 371740 180429 120346
12211 120346 -16589 -82412 209981 73208 -215991 219875 309049 96559 149267 138110 271890
12200 271890 44543 207990 122750 300238 -20869 306468 6221 209876 58253 254219 90625
12188 302962 -4213 -129807 -70616 -118836 -30893 92779 -90334 46424 483057 40277 -252726
12176 78429 71332 -166584 -48272 428927 172181 507435 -275131 12699 388473 245411
12166 245411 181935 562208 287809 -142249 39410 52322 63289 205211 68542 238705
$$ packed form
12245I4741R0449K69324C0687e0438B06666h8476q9930K3298m4427f7194C03050
12233h04k3631A33089R6176o7938b30227G0133K92255r8033k1039J25759l6088
12222C32987j9600j00907p8718L738K127E2618M64213a89762C71740A80429o0083
12211A20346a6589o5823B09981G3208b15991B19875Q9174I6559N2708j1157J33780
12200B71890D4543J63447q5240J77488b0869C06468F221K03655E8253J95966I0625
12188C02962d213j25594N9191m8220c0893I2779i0334D6424M36633D0277b52726
12176G8429p097a66584d8272D28927A72181L35254b75131A2699L75774j43062
12166B45411o3476L80273k74399a42249C9410J2912J0967J41922F8542J70163
$$ plain form
12156 238705 293452 14920 198985 -60018 16392 -142283 326592 491303 -173413 443327
12145 -225526 86438 177217 -47863 -236544 -21795 -228898 -13838 -197048 251309 -101984
12134 20678 14142 102453 -86785 -120781 189357 138306 -271761 244929 243381 -248254 -77187
12122 142976 49935 -9610 -116620 192448 200976 -69412 120077 -274276 -130798 57918 -245804
12110 126076 -64488 -174305 -142183 -221436 -10345 -61816 42264 53868 67010 130455 -65649
12098 87832 225681 -169301 140842 -37120 -28286 112759 293322 -125527 10474 -28578 -255060
12087 -255060 113491 90426 -204915 74096 5358 323841 -89320 53551 -463599 375386 198039
12076 198039 511576 1047581 2179973 1243569 511763 -123440 86859 117624 3648 -80137
$$ packed form
12156B38705N4747A4920J84065f0018A6392a42283C26592J64711a73413D43327
12145b25526H6438R0779d7863j88681b1795k07103a3838j83210B51309a01984
12134B0678o536Q8311h6785l3996A89357n1051b71761B44929j548b48254g7187
12122A42976D9935i610j07010A92448Q528f9412A20077b74276a30798E7918b45804
12110A26076f4488j09817L2122p9253a0345n1471D2264J1604J3142O3445f5649
12098H7832J37849a69301A40842c7120Q834A12759J80563a25527A0474b8578k26482
12087b55060A13491k3065b04915G4096E358L18483h9320E3551d63599C75386j77347
12076A98039L13537N36005J132392r36404E11763a23440H6859L0765C648h0137
$$ plain form
12065 445414 -59626 19951 -212312 222327 -88742 77671 -20097 -281624 -104955 -185807 -44738
12053 95754 273947 -79712 87931 237849 94995 124718 -477227 141055 -34319 -1564 15469
12041 75725 163968 -84242 -341969 -300769 25430 -194106 379 -209885 84411 131760 -240295
12029 -360280 568 -96831 -6001 -168605 25371 -126129 8062 189846 56241 486463 255361
12018 255361 -13965 11109 74135 206354 156646 -42533 155408 385607 -109723 151977
12007 104352 142369 -169777 -158027 1422 270355 117480 -335711 -210148 -31556 -271778
11997 -271778 183175 -14407 124766 232557 57577 -208707 145502 204661 -274605 4454
11986 128410 -223369 -173748 -28048 155489 -524022 15514 -239986 -328281 370353 107221
$$ packed form
12065D45414e9626A9951b12312B22327h8742G7671b0097k61527a04955q0852d4738
12053I5754J78193g9712H7931J49918I4995K9723d77227A41055c4319a564A5469
12041G5725Q8243h4242k57727M1200B5430a94106C79b09885H4411M7349b40295
12029c60280E68i6831f001j62604B5371a26129H062J81784E6241M30222k31102
12018B55361a3965A1109O3026J32219m9708d2533A55408K30199a09723A51977
12007A04352L8017a69777J1750A422K68933A17480c35711J25563c1556k40222
11997b71778A83175a4407A24766J07791E7577b08707A45502N9159b74605D454
11986A28410b23369M9621b8048A55489e24022A5514b39986q8295C70353A07221
$$ plain form
11975 130237 -199983 26807 161788 177046 -153991 -46743 248214 199207 -24601 194459
11964 -224827 264006 215841 22812 -179313 71171 -31436 166343 31269 -18934 -179962 -40384
11952 -76756 108996 -26696 191629 -13496 137350 -52942 -140214 115233 67192 296176 -63665
11940 -36338 -232520 128932 -28329 -89519 -180261 368897 17858 25571 -6100 25216 -94815
11928 56446 -12403 191876 -247072 16912 122040 222679 -331088 -24389 -40266 326772
11917 -154624 -143709 -260864 -114460 69143 -119653 -231865 -106204 289911 150085 -156954
11906 46856 88125 343473 -153897 -96072 351053 -108362 61115 -161174 -71739 -76243 -438256
11895 -438256 -265743 -98551 -131583 -111322 212805 85790 -120045 45294 254905 42177 112353
$$ packed form
11975A30237a99983B6807J34981J5258a53991d6743B48214m9007b4601A94459
11964b24827B64006m8165B2812a79313G1171c1436A66343C1269a8934j61028d0384
11952g6756A08996b6696A91629a3496A37350e2942q7272A15233m8041K28984f3665
11940c6338j96182A28932b8329o1190r0742C68897A7858P713f100B5216i4815
11928E6446a2403A91876b47072A6912J05128J00639c31088b4389j5877C26772
11917a54624J0915j17155a14460F9143a19653j12212a06204B89911j39826a56954
11906D6856M1269K55348a53897N7825C51053a08362F1115a61174g1739m504l62013
11895d38256J72513i8551l3032K0261B12805H5790a20045D5294K09611D2177P0176
$$ plain form
11884 112353 174080 69164 -219369 -264261 -154645 30184 -15069 -200000 87810 170810 -144081
11872 96599 -356388 -134586 169484 -230628 -137140 172463 -521132 100804 -59472 14532
11861 320 -281867 34332 -199742 -96514 51271 216729 -118861 -241447 29407 -246929 -66241
11849 8721 -63165 -64303 22231 -7928 269748 8739 89167 -136564 28728 4252 -161475 -119014
11837 -119014 -390642 -190384 -174174 -8591 -375127 9652 -106837 176966 68107 -240219 -223451
11826 -223451 90716 -244833 -29510 -206737 -170914 172411 68140 98725 36461 -161628 -329331
11815 -329331 27465 5267 55908 -146660 -215414 39072 -140683 115884 55531 52280 120902
11804 120902 7538 -311576 -377148 105903 64313 89710 -24892 -233810 -127230 -139156 -45097
$$ packed form
11884A12353O1727F9164b19369m4892J09616C0184a5069j84931H7810Q3000a44081
11872I6599c56388a34586A69484b30628R3488A72463e21132A00804e9472A4532
11861C20b81867C4332a99742i6514E1271J65458a18861j22586B9407b46929f6241
11849H721f3165j138B2231g928B69748H739Q0428a36564B8728D252a61475M2461
11837a19014k71628a90384J6210h591l66536I652a06837A76966F8107b40219J6768
11826b23451I0716b44833b9510j77227L5823A72411F8140L0585C6461a61628j67703
11815c29331B7465E267N0641a46660o8754C9072a40683A15884E5531l251O8622
11804A20902G538c11576o5572A05903m1590K5397b4892k08918J06580j1926d5097
$$ plain form
11792 57195 -317838 -33820 -83218 182883 272994 -162292 27168 -143274 -90472 93517 112314
11781 112314 -174699 -144745 -340513 319380 138020 -16457 -66042 -38715 -85274 -107018 91431
11769 150971 -115099 -161742 -200611 -73154 64475 -104802 102723 37854 -51877 -106797 -108846
11758 -108846 -740 88583 195745 -98353 85083 132413 171464 162610 -19204 -39731 57634 -42566
11745 77956 -131783 -192377 -130845 107905 -188791 -163231 148130 -124240 -285023 -116245
11734 54767 -328383 174338 -10822 -286233 -22325 -2808 112548 286285 -35657 -13449 -108900
11723 -108900 208484 266766 -48680 -157047 -71530 195115 176792 160013 -50469 26879 -24599
11711 314578 12121 -118737 78489 -522423 -58694 135832 -84114 -157408 -108277 25022 208882
$$ packed form
11792E7195c17838c3820m9398A82883R0111a62292B7168a43274N2802I3517J8797
11781A12314a74699K9954j95768C19380A38020a6457m9585K7327m6559k1744I1431
11769A50971a15099m6643l8869g3154F4475a04802A02723C7854e1877n4920k049
11758a08846g40H8583J07162i8353H5083M7330L9051q854a9204k0527E7634d2566
11745G7956a31783o0594O1532A07905a88791K5560A48130a24240j60783a16245
11734E4767c28383A74338a0822k75411b2325b808A12548J73737c5657a3449r5451
11723a08900B08484N8282d8680j08367g1530A95115j8323j6779e0469B6879b4599
11711C14578A2121a18737G8489e22423e8694A35832h4114p3294M9131B5022J83860
$$ plain form
11700 208882 204038 -404960 10857 251824 -288943 -34528 -347093 -209850 108931 123423
11690 123423 8061 15595 -231488 -34734 -199556 -27099 -28645 27961 96163 -193509 -170441
11679 -170441 185190 207833 215367 -44298 233782 162182 29907 155535 342787 -322310 -195005
11668 -195005 271818 -338873 -326015 -68403 59676 88507 -62562 -173098 -75584 24467 -62713
11656 186848 -37986 -198202 -28679 -78047 -63400 343470 247072 56175 335736 -4273 344227
11644 -10882 128429 -59152 82718 110620 58522 -317044 156393 170347 -90259 50294 -75131
11632 97576 -35400 -235878 112713 -12250 -22658 -143849 -48437 -177372 -33377 -126893 -136853
11621 -136853 285095 102664 -19871 87652 8634 -40314 -143483 133622 -190148 -9321 -275926
$$ packed form
11700B08882m844d04960A0857K40967b88943c4528l12565J37243A08931J4492
11690A23423H061P534b31488c4734j64822b7099j546B7961O8202a93509K3068
11679a70441A85190K2643P534d4298B33782p1600B9907J25628J87252c22310J27305
11668a95005B71818c38873J2858f8403E9676K8831f2562j10536g5584B4467f2713
11656A86848c7986j60216b8679m9368J4647C43470r6398E6175K79561d273C44227
11644a0882A28429e9152H2718K7902n2098c17044A56393J3954i0259E0294g5131
11632I7576c5400k00478A12713a2250j0408j21191d8437j28935c3377r3516r960
11621a36853B85095A02664a9871H7652H634d0314j03169A33622a90148i321k66605
$$ plain form
11610 -275926 135273 49111 -120494 180223 42336 -151065 102951 163276 278905 45903
11599 19115 -72546 -52783 268334 21712 -182384 197808 244793 257786 52760 101890 375384
11588 375384 180472 291745 262598 -177435 4333 122359 121588 14225 95842 -2438 55063
11576 350177 16303 66099 127459 -260864 170109 -9938 241535 420927 129912 -87277 -56408
11565 -56408 130798 359991 -117457 304287 219805 126570 187626 -5230 -120419 321186 -160661
11553 55758 54148 137695 160388 -127745 508135 77651 -78798 -44854 -73411 293853 164210
11542 164210 34733 323868 181958 108339 28658 244110 110909 147015 -212050 361056
11531 337886 142369 69893 122770 -111762 157939 182238 18107 -182711 290692 187936
$$ packed form
11610b75926A35273D9111a20494A80223D2336a51065A02951O0325J15629D5903
11599A9115g2546J9763B68334B1712a82384A97808M6985J2993E2760M9130K73494
11588C75384A80472J11273k9147a77435D333J18026p71A4225Q1617b438E5063
11576C50177A6303M9796O1360b60864A70109i938B41535J79392A29912h7277L0869
11565e6408A30798K29193a17457C04287q4482r3235O1056e230j15189C21186a60661
11553E5758j610Q3547K2693a27745E08135G7651g8798L3944k8557B93853j29643
11542A64210C4733K89135j41910p3619B8658K15452A10909L6106b12050C61056
11531C37886A42369F9893N2877a11762A57939K4299A8107a82711B90692j02756
$$ plain form
11521 187936 -133945 48010 -255392 39123 19765 161329 -26690 92116 254606 558180
11511 558180 70185 177667 239050 -77533 205628 16139 -96576 334285 243981 446712 -40057
11499 155616 -27313 -92775 95859 113092 -173770 7833 167957 -43745 -76050 -51821 -20286
11487 207316 171128 -186258 -25229 350856 -45465 209124 168677 410652 458934 68024 -59848
11475 182392 21473 143767 295536 671510 -136445 -48918 -232376 -142704 272066 -98795
11464 -229151 242 646950 108803 -93993 -5382 236339 -133604 -4236 -180110 97686 -13564
11452 -68128 162708 25996 160784 83201 31693 20085 51244 -29016 -169539 47914 220980
11441 220980 161356 141327 -68133 215709 25094 -180032 251516 -23259 -170646 98436 -31958
$$ packed form
11521A87936a33945D8010b55392C9123j9358J41564b6690I2116J62490L03574
11511E58180G0185J07482O1383g7533B05628A6139i6576C34285r0304K02731d0057
11499A55616b7313o5462I5859J7233a73770G833J60124d3745l2305K4229b0286
11487B07316l6188a86258b5229C50856d5465B09124m0447K41975M8282F8024e9848
11475A82392B1473J22294J51769L75974a36445d8918j83458Q9672B72066i8795
11464b29151B42O46708A08803i3993e382B36339a33604d236j75874I7686a3564
11452f8128A62708B5996J34788p7583C1693j1608L1159b9016j40523D7914J73066
11441B20980n9624k0029f8133B15709B5094a80032B51516b3259j47387I8436c1958
$$ plain form
11429 90895 -72097 -64559 137244 -112475 -300318 -173555 136556 -79657 -63548 306680 5255
11417 -238417 -25060 -12280 -10709 300327 -232879 -250572 213779 -142906 15017 37331 -159506
11405 -676347 98250 201900 152887 49744 -17821 188834 155058 -42418 -146557 -249291 -144831
11394 -144831 139122 -134412 326281 -80945 106743 31611 170384 323260 -124189 52035
11383 109133 -33077 -20108 -438857 107777 20055 -29530 -125878 72292 50908 -36809 38287
11371 -192924 143464 18079 174537 -228960 -263865 -427546 25793 77460 -30959 33248 -176032
11359 96052 -155960 -43183 44765 -189534 -150920 220902 -114123 -132495 -133690 82725 -20714
11347 269973 -28591 98120 151987 144 -241059 109407 -92823 173313 -77674 -78525 -1394 89655
$$ packed form
11429I0895g2097P538A37244a12475j87843J26763A36556g9657J6109C06680E255
11417b38417b5060a2280J571C00327b32879j7693B13779a42906A5017K2314a59506
11405f76347I8250J03650m9013D9744a7821A88834l3776d2418j04139j02734J04460
11394a44831A39122a34412C26281h0945A06743C1611J38773J52876a24189E2035
11383A09133c3077J2969m18749A07777B0055b9530r6348G2292k1384c6809C8287
11371a92924A43464A8079J56458b28960l4905j63681B5793N1667c0959C3248a76032
11359I6052a55960d3183D4765a89534L8614B20902a14123j8372j195H2725b0714
11347B69973b8591I8120N3867A44b41059A09407i2823A73313g7674q51a394H9655
$$ plain form
11334 76468 -197297 -240386 58932 -205619 57103 -264121 -117191 97698 -243866 -275166 18663
11322 119671 48827 -166381 6179 -382599 80158 129390 -54234 51024 -69464 46586 68717
11311 68717 93851 88618 67921 -99195 -158928 -3861 -53429 73819 193690 97673 -73701 -31300
11298 33887 -209685 116025 43111 102787 -123271 -342153 -121274 -278800 77755 47711
11288 47711 -290004 -284096 -124725 -220221 132264 257681 -5979 -279791 -233185 -48170 -81462
11277 -81462 -153150 -30114 13772 181358 22185 75245 -176238 -243518 -117237 -27920 -96782
11266 -96782 72276 160214 -18220 59129 -12752 -171994 -85990 114779 -82021 -201721 -298144
11255 -298144 -11490 -269255 16997 -229599 -90668 46010 109272 154672 -146255 417570 13884
$$ packed form
11334G6468a97297m3089E8932b05619E7103b64121a17191I7698b43866l1300A8663
11322A19671D8827a66381F179c82599H0158M9232e4234E1024f9464D6586K2131
11311F8717K5134n233k0697i9195n9733c861m9568G3819J19871r6017g3701c1300
11298C3887b09685A16025D3111N9676a23271k18882a21274j57526G7755l0044
11288D7711b90004N908a24725r5496A32264J25417e979k73812M6606d8170l3292
11277h1462p1688c0114A3772J67586B2185N3060a76238o7280a17237b7920o8862
11266i6782G2276Q7938a8220E9129a2752j59242h5990A14779h2021j19700r6423
11255b98144a1490k57765A6997b29599i0668D6010O3262M5400a46255D17570A3884
$$ plain form
11243 4817 46859 120058 104239 285396 117983 -188006 -117744 -219851 405132 -158300 -79363
11232 -79363 -120291 -251925 -15350 39295 172738 56316 211845 -241419 -18844 -84245 -239178
11221 -239178 -251819 101138 -348953 29924 -75633 -20937 184201 -163238 -33661 241996
11210 -224533 22028 -160474 241640 -28010 -151966 -162900 -101679 -288699 -121574 -64016
11200 -64016 -34827 544580 -142517 -66764 -175730 58752 9423 -44728 -340292 -82301 -306722
11189 -306722 -96352 -181637 -170885 -87127 72815 -268099 -146011 149252 12228 -114584 -256526
11178 -256526 119021 -256730 -89669 -38322 106544 -87587 -252491 57136 -431948 402051
11167 13495 321983 -87193 -236911 361711 122566 223243 53682 268208 54505 187656
$$ packed form
11243D817M2042P3199j5819J81157A17983a88006P0262j02107D05132a58300P8937
11232g9363m0928j31634a5350C9295J33443E6316J55529b41419a8844o5401j54933
11221b39178j2641A01138c48953B9924g5633b0937A84201a63238c3661B41996
11210b24533B2028a60474B41640b8010j23956j0934O1221j87020a21574N7558
11200f4016K9189E44580a42517f6764j08966E8752I423d4728k95564h2301k24421
11189c06722i6352q5285J0752Q3758G2815b68099J22088A49252A2228a14584j41942
11178b56526A19021b56730h9669c8322A06544h7587j64904E7136d31948D02051
11167A3495L08488h7193j49718C61711A22566J00677E3682K14526E4505J33151
$$ plain form
11157 187656 -237158 -56155 -283492 24602 245897 -327888 -246845 -85913 -39124 133920
11146 -299117 3768 345424 130462 112620 123244 -280162 -129586 -139882 347323 162117
11135 -14999 -107224 -232672 -195103 -212570 130330 -68646 -57037 9127 63737 240422 319790
11124 319790 -185645 294990 78450 -147848 89424 162554 -361510 -106939 -140164 -318895
11114 -318895 -264024 46482 -82255 183895 114558 181219 -3262 116022 146005 91858 -110346
11102 -23243 313817 169451 85681 331766 490930 160039 385192 309352 281288 54417
11091 297999 275815 122045 363147 -25794 274474 438173 148231 368760 2422 292206
11081 292206 53911 -256316 496211 134423 385264 405225 405387 -179448 238226 342709
$$ packed form
11157A87656b37158e6155k27337B4602K21295c27888Q1043h5913c9124A33920
11146b99117C768L41656A30462j7842J0624b80162a29586j0296C47323A62117
11135a4999r2225j25448L7569j7467A30330f8646J1609I127N4610J76685P9368
11124C19790a85645B94990G8450a47848H9424P3130c61510a06939l3225j78731
11114c18895N4871D6482h2255A83895o9337O6661c262A16022K9983n4147a10346
11102b3243C13817j44366q3770K46085J59164A60039K25153p5840k8064E4417
11091B97999k2184A22045K41102b5794B74474J63699A48231K20529B422K89784
11081B92206E3911b56316D96211A34423K50841J9961J62a79448B38226J04483
$$ plain form
11071 342709 -53391 24058 548223 649235 -95646 -4233 477132 601298 348472 476080
11061 476080 231289 270119 712071 262030 614614 900089 300186 761767 947558 497849
11051 497849 813405 512182 771399 539073 755431 491076 612335 772645 869903 870154
11041 870154 895985 1256770 758998 560086 482837 325829 434824 1080941 631601 798451
11031 798451 667169 750165 730937 297066 777261 542873 635479 685059 800393 599786
11021 599786 563606 956176 534674 602771 340001 340036 876075 357691 572049 765663 422219
11010 422219 686583 694644 432491 370101 520161 575439 258181 531088 483242 613496
11000 613496 769329 708685 733685 766586 532088 527604 695758 776746 533119 598946 853057
$$ packed form
11071C42709e3391B4058N24165J01012i5646d233D77132J24166k52826J27608
11061D76080B31289L8830M41952B62030L52584K85475C00186M61581J85791m49709
11051D97849L15556l01223K59217k32326K16358k64355J21259J60310R7258K51
11041H70154K5831L60785m97772j98912p7249j57008J08995O46117m49340J66850
11031G98451j31282Q2996j9228B97066M80195k34388R2606M9580J15334k00607
11021E99786l6180L92570m21502O8097k62770L5N36039C57691K14358J93614l43444
11010D22219K64364Q061k62153o2390J50060N5278B58181K72907m7846J30254
11000F13496J55833o0644K5000L2901k34498m484J68154Q0988k43627O5827K54111
$$ plain form
10989 853057 587367 981030 762416 984622 862826 1094034 757909 1293769 1172232 1128672
10979 1128672 1128714 1210403 1092775 1550174 2132356 2445267 2370740 2862324 2901472 2778521 2624623
10968 2624623 2342055 1975132 1896954 1756069 1576865 1872995 1650927 1754978 1260992 1473314
10958 1473314 1659882 1829104 1439973 1641083 1123939 1034630 1291173 1024912 795286 291460
10947 248240 -103371 320581 237088 218912 349154 131380 158449 396772 322206 34420
10936 188170 12373 -76524 163533 115693 -17762 47232 -144904 196196 -175967 134777
10925 -14971 -36877 -35704 -93447 80545 -127811 -52718 134023 -121033 -12379 -272523 43186
10913 222758 171919 -93355 -4606 -371080 121255 -17974 8410 449930 145662 1404 97944
$$ packed form
10989H53057k65690L93663k18614K22206j21796K31208l36125N35860j21537m3560
10979A128672M2Q1689j17628M57399N82182L12911p4527M91584L9148j22951j53898
10968B624623k82568l66923p8178j40885j79204K96130k22068J04051m93986K12322
10958A473314J86568J69222l89131K01110n17144q9309K56543k66261k29626B91460
10947B48240a03371C20581q3493j8176J30242A31380K7069K38323p4566C4420
10936A88170A2373g6524A63533m7840a7762D7232a44904A96196a75967A34777
10925a4971k1906J173n7743H0545a27811e2718A34023a21033a2379k60144D3186
10913B22758n0839i3355d606l66474A21255a7974H410M41520A45662A404R6540
$$ plain form
10902 97944 227429 -69763 80967 -313902 121187 -47110 -84691 271176 -297167 17449 -203331
10890 -221844 -60568 92349 -179257 -52825 -142519 362786 -918 -346570 -123848 184129 13973
10878 -220290 318763 -101749 -146666 266265 -246 -13021 -55469 77287 -41599 65525 -215991
10866 -69225 -190463 -96702 -13220 -416476 -87713 54165 280411 102363 -108154 -45814 108618
10854 69763 -64255 248416 -82479 -145498 176496 -288869 134543 206872 274538 -124139 -109049
10843 -109049 80698 65402 92073 298482 343880 -158127 338519 -138231 89954 -22263 142126
10831 166082 287864 44391 199014 -63912 -56354 2159 -241558 110742 -314535 367103 413041
10820 413041 -63341 195099 -193494 231795 -197870 -80822 14610 -53855 -477308 189758
$$ packed form
10902I7944J29485f9763H0967c13902A21187d7110l7581B71176b97167A7449b03331
10890b21844f0568I2349a79257e2825q9694C62786i18l45652a23848A84129A3973
10878b20290C18763a01749m4917B66265b46j2775m2448G7287d1599F5525b15991
10866f9225j21238R3761a3220m03256h7713E4165K26246A02363a08154d5814A08618
10854F9763f4255B48416h2479o3019A76496b88869A34543P2329O7666a24139J5090
10843a09049H0698j5296K6671K06409M5398a58127C38519a38231H9954b2263A42126
10831A66082J21782D4391J54623f3912P558B159b41558A10742c14535C67103M5938
10820D13041f3341A95099a93494B31795a97870h0822A4610e3855m23453A89758
$$ plain form
10809 147227 28203 -394311 121575 10325 -71886 -271585 -181636 24689 -40455 3353 -142986
10797 119294 -100087 367793 -130410 -691050 32607 -62501 -281979 47735 -75746 -159851
10787 -159851 -107254 -86447 -240190 174727 -165370 -18089 -115575 -166869 -33348 75936 -150678
10775 -31108 38148 -356121 -92368 -62054 36590 -192 205735 124224 -53207 1602 69979 156983
10763 156983 234775 282296 77760 -64275 -63600 -107510 -149704 -240852 -58613 -3925 -325386 -55611
10750 -257516 -14392 49434 51270 -323280 -119145 259502 -210927 15257 67043 130404 -301122
10738 312434 -205833 57355 269831 36142 -74344 221698 -394270 217537 -43698 -296328
10728 -296328 52807 -487 -82801 82102 22931 151835 66499 280602 70498 -134030 247801
$$ packed form
10809A47227B8203c94311A21575A0325g1886j99699Q9949B4689d0455C353a42986
10797A19294a00087C67793a30410n60640C2607f2501k19478D7735g5746q4105
10787a59851N2597K0807j53743A74727a65370a8089r7486n1294c3348G5936a50678
10775c1108C8148c56121i2368L0314C6590a92B05735q1511e3207A602O8377Q7004
10763A56983P7792M7521G7760f4275O75m3910m2194r1148e8613c925l21461e5611
10750b57516a4392D9434J836c23280a19145B59502b10927A5257N1786O3361c01122
10738C12434b05833E7355K12476C6142g4344B21698c94270B17537d3698k52630
10728b96328E2807d87q2314H2102B2931J28904F6499K14103G0498a34030B47801
$$ plain form
10716 -19152 106363 -301774 -160997 -221578 36511 41955 -343013 37361 -106573 20172 -327946
10704 212066 -181163 134559 245276 -86592 25464 -34391 36174 -19621 217826 -16855 -34851
10693 -34851 -206537 -78388 -103448 -211004 -60506 82928 -237178 10715 -109193 -146759 194098
10681 -444311 111797 35109 32393 239958 -38334 -33158 -220961 -204050 -330322 -59039 129024
10669 -131161 152935 79602 -8145 -205240 -79969 -231746 -102861 21958 -178429 -74378 -336737
10658 -336737 -87249 -82673 71582 221997 73643 -247348 -250862 186918 -105635 -178118 160918
10646 -47804 -161100 -55637 -127338 -168344 -80038 -109437 -16103 -17762 50380 31764 -300944
10634 266988 -507613 -257880 161896 -225010 311576 -194375 -175278 -207739 -347027 -97926
$$ packed form
10716a9152A06363c01774J40777o0581C6511N444c43013C7361a06573B0172c27946
10704B12066a81163A34559J10717h6592B5464c4391C6174a9621B17826a6855j7996
10693c4851j71686g8388k5060j07556f0506H2928b37178A0715a09193l7566A94098
10681d44311A11797C5109k716K07565c8334N176j87803J6911j26272e9039A29024
10669a31161A52935p3333h145j97095g9969j51777a02861B1958a78429g4378k62359
10658c36737h7249M576G1582J50415G3643b47348l514A86918a05635p2483A60918
10646d7804j13296e5637p1701m1006h0038k9399a6103j659E0380j8616c00944
10634B66988e07613K49733A61896b25010C11576a94375J9097l2461j39288i7926
$$ plain form
10623 -253849 74454 -138773 64071 -266917 -99937 303534 163094 -65599 -172018 -59439
10612 -84703 -43553 106659 159394 -67034 -13253 -105822 -363420 -87475 -303056 11681 -32002
10600 -220614 21507 21778 17004 208672 105781 134933 -69704 -290403 -204556 -297420 16083
10588 -93855 356436 56790 22468 -22786 -8542 -11496 -44971 -202841 52148 64054 136838 -139137
10575 -118273 98593 -64299 27881 -544133 113707 -273449 157304 -297217 -82084 96651
10564 150686 -13657 -180935 -126626 82526 -169647 204811 -196698 -101444 499012 38717
10553 160983 115150 -237513 103560 336566 182488 20654 -79323 -72114 -29677 -149652 38413
10541 39317 -246133 84134 -343921 -66641 -8488 -415987 -331207 89259 55566 186898 -126636
$$ packed form
10623b53849G4454a38773F4071b66917i9937C03534j40440f5599j06419e9439
10612h4703M1150A06659N2735f7034a3253r2569k57598h7475k15581A1681c2002
10600b20614B1507K71m774J91668j02891K9152f9704k20699Q5847r2864A6083
10588i3855C56436E6790B2468b2786h542k954l3475j57870E2148J1906P2784a39137
10575a18273I8593f4299B7881e44133A13707b73449A57304b97217h2084I6651
10564A50686a3657j67278N4309H2526a69647B04811a96698R5254D99012C8717
10553A60983m5833b37513A03560K33006j54078B0654g9323P209b9677j19975C8413
10541C9317b46133H4134c43921f6641h488m07499Q4780H9259l3693J31332a26636
$$ plain form
10529 -153537 91194 21577 -187951 -84424 -26284 -62267 -241512 389 71798 -128016 -47681
10517 101901 27422 228455 -266518 -230904 63379 -32813 48247 37771 -104447 162971 29821
10505 -232175 32265 50201 23454 -455965 -109646 37126 261472 -82938 68721 -247156 232471
10493 -120107 -131427 1871 -227484 34301 87368 136521 -2592 -12467 262830 70153 186632
10482 186632 -103236 688444 593171 373792 313713 218789 348271 240171 -65583 -36166
10472 -36166 132912 42207 81588 23409 -73868 123733 59769 57541 294391 -144596 -55680
10460 -16134 -125722 95144 -207921 107580 -87624 5890 -52397 79585 156840 -141939 40337
10448 123170 166685 220489 -142406 1187 288129 -144451 -104085 -146966 -119091 -165494 -337398
$$ packed form
10529a53537I1194B1577a87951h4424b6284l5983j79245C89P1409a28016d7681
10517A01901B7422K01033b66518L5614F3379c2813D8247j0476a04447A62971B9821
10505b32175C2265J7936B3454d55965a09646C7126K24346h2938F8721b47156B32471
10493a20107j1320A871b27484C4301N3067M9153b592r875B62830G0153J16479
10482A86632a03236F88444r5273k19379o0079r4924J29482j08100f5583K9417
10472c6166A32912D2207L9381B3409g3868A23733E9769k228K36850a44596e5680
10460a6134j09588I5144b07921A07580h7624E890e2397G9585P7255a41939D0337
10448A23170M3515N3804a42406A187K86942a44451M0366m2881K7875m6403j71904
$$ plain form
10437 -337398 7238 -33981 247274 -344541 -385616 94304 -104552 196949 -28680 128312 56113
10425 -140577 -68849 233716 -152020 225681 151600 -152710 -25542 -24013 -147174 -27893 359762
10413 -430159 28060 239155 120683 -5376 -36238 -124424 -23461 34025 78038 9998 -84871
10401 -67700 -17172 -389930 108595 -198665 -150349 -12557 -405759 116191 -53765 227724
10390 313866 -120500 -319590 224860 166842 120591 50483 97513 -45179 47699 118481 154275
10379 154275 173490 -20047 310531 231100 300140 127021 -74588 230392 273153 362470 355059
10368 355059 161183 729835 369214 80326 537834 474682 112617 391165 81955 219959
10358 219959 171779 403248 -141641 173415 371215 246983 371755 585248 527588 746770
$$ packed form
10437c37398G238c3981B47274c44541m1075I4304a04552A96949b8680A28312E6113
10425a40577f8849B33716a52020B25681p4081a52710b5542J529j23161b7893C59762
10413d30159B8060K11095j18472e376l0862q8186b3461C4025M4013I998h4871
10401f7700a7172l72758A08595a98665M8316a2557l93202A16191e3765B27724
10390C13866a20500j99090B24860n8018m6251E0483M7030d5179D7699P0782L5794
10379A54275J9215b0047C10531p9431O9040A27021g4588B30392M2761Q9317p411
10368C55059A61183N68652l60621H0326M57508o3152A12617K78548H1955J38004
10358B19959m8180K31469a41641A73415J97800j24232J24772K13493n7660K19182
$$ plain form
10348 746770 556746 521973 283271 172718 300970 284571 220781 278928 429537 469939
10338 469939 123613 250031 236206 278911 220285 68715 204306 153276 154638 114103 -62131
10326 31077 185827 -28117 -64754 -82600 396864 308488 335714 193266 167406 -105970 85909
10314 -37083 -50214 81245 277683 -35866 181422 140326 -12984 -209217 -142493 16912 -140219
10302 315720 25788 -35274 178431 -104524 -36702 133547 -140499 57322 -149380 50178
10291 -44629 43787 -182044 99715 198588 -65225 -214022 -185722 -52979 -121299 82854 -92675
10279 -64374 -445646 143351 3569 -206151 -252664 -171977 12276 -425949 -98571 256805 -154990
10267 -257866 -107263 -96667 197479 159593 -55701 18308 75570 141630 67540 286344 235653
$$ packed form
10348G46770j90024l4773k38702j10553J28252j6399o3790N8147J50609M0402
10338D69939A23613J26418j3825M2705n8626F8715J35591n1030J362m0535f2131
10326C1077J54750b8117l6637j7846C96864q8376K7226j42448k5860a05970H5909
10314c7083j3131H1245J96438c5866A81422m1096a2984j96233O6724A6912a40219
10302C15720B5788c5274A78431a04524c6702A33547a40499E7322a49380E0178
10291d4629D3787a82044I9715R8873f5225j48797K8300e2979o8320H2854i2675
10279f4374l81272A43351C569b06151m6513Q0687A2276d25949i8571B56805a54990
10267b57866a07263J0596A97479l7886e5701A8308N7262O6060F7540K18804n0691
$$ plain form
10256 235653 464347 188232 173028 -226086 141388 132166 113502 75814 -84798 -37489 68945
10244 -317087 -50192 -282495 25732 -146293 167776 -106134 -86529 339350 -83431 33861
10233 77506 17808 -184578 -131663 -249235 -62085 -216680 15924 207086 17340 264927 212682
10222 212682 -26359 -203576 573125 49025 -435775 -135814 41348 -134878 -59039 77125
10211 78656 -23143 16058 -14013 46101 -14898 203851 -259726 42941 13526 76408 251507
10200 251507 -231713 209723 -25313 -105416 -165414 167520 -209840 -167661 78507 102147 -133437
10188 137996 -168194 -86479 -102943 -71598 -154104 -153544 -214547 68281 -75939 -236195 -323062
10177 -323062 -32851 -274647 87458 51878 -145359 -72934 -276396 -240122 -318935 -230810 16654
$$ packed form
10256B35653K28694A88232j5204b26086A41388r222j8664l7688h4798c7489F8945
10244c17087e0192k32303B5732a46293A67776a06134J9605C39350h3431C3861
10233G7506A7808a84578N2915j17572f2085j54595A5924J91162A7340K47587n2245
10222B12682b6359j77217E73125D9025d35775a35814D1348a34878e9039G7125
10211G8656b3143A6058a4013D6101a4898B03851b59726D2941A3526O2882J75099
10200B51507b31713B09723b5313q0103n9998A67520b09840M2179G8507K3640a33437
10188A37996a68194Q1715j6464L1345q2506N60o1003F8281g5939j60256q6867
10177c23062c2851k41796H7458l5580a45359P2425k03462L6274p8813Q8125A6654
$$ plain form
10165 27119 36199 -266603 -343977 -113982 -478476 356854 146974 40884 119171 34 -28007
10153 -316271 76637 -132769 228194 -213371 -12815 21966 -65435 20767 -150555 -217260 -150015
10142 -150015 -111887 -68705 -67873 -35477 11745 -126765 -28064 42496 72395 -393800 166704
10130 -31114 -71205 -80010 -170169 159720 -27325 -17154 261205 -171433 125743 -120019 -316577
10119 -316577 -143684 150529 -179722 -132926 175710 -350381 -142503 -59884 140735 16153
10108 -191875 -276881 -203143 -188481 125784 -33406 51804 -228661 -140792 -109837 25434 -107773
10096 10826 -380395 -63091 -304047 -47614 226206 -78324 -319782 -161716 -346418 -97130
10085 -350021 -154414 96495 147704 -289825 -388692 117419 -296938 352840 93889 -73787
$$ packed form
10165B7119R080b66603p7374a13982l64494C56854A46974D0884P8287C4b8007
10153c16271G6637a32769B28194b13371a2815B1966f5435B0767a50555o6705O7245
10142a50015L8128M3182Q32L2396A1745a26765b8064D2496K9899c93800A66704
10130c1114m0091q805r0159A59720b7325J0171B61205a71433A25743a20019j96558
10119c16577a43684A50529a79722M6796A75710c50381a42503e9884A40735A6153
10108a91875q5006P3738J4662A25784c3406E1804b28661Q7869L0955B5434a07773
10096A0826c80395f3091k40956d7614B26206g8324k41458J58066j84702i7130
10085c50021a54414I6495N1209b89825r8867A17419b96938C52840I3889g3787
$$ plain form
10074 -25987 -8766 10208 -41119 4869 -76697 -122632 38824 241791 -46343 -135232 331993 -110083
10061 88508 -141606 215686 -110351 -158045 96036 24719 -217753 -23394 226298 -226583
10050 -85404 68992 -102890 -216826 -399007 -76135 175917 80974 -269511 74741 -147993
10039 -189025 104012 145421 -270156 -154063 29672 -323251 -172446 -401334 -66321 -107442
10029 -107442 -165814 146155 55992 -62512 -115733 -142431 -145562 15044 -40855 -151753 -83419
10018 -83419 238848 -169917 -48367 208277 -94331 -28868 -85764 -298593 34502 309105 23486
10006 -85219 142912 249086 -88477 -45174 135628 -49076 -27525 62511 -144248 -141783 -222003
9995 -222003 -107720 -293811 -295718 -47833 -73008 139400 -240839 60991 -47380 -71043 -262973
$$ packed form
10074b5987h766A0208d1119D869g6697m5935C8824K02967d6343q8889C31993a10083
10061H8508a41606B15686a10351m7694I6036B4719b17753b3394B26298b26583
10050h5404F8992a02890j13936j82181g6135A75917H0974b69511G4741a47993
10039a89025A04012M1409b70156J16093B9672c23251J50805k28888f6321m1121
10029a07442n8372A46155E5992f2512n3221k6698l131A5044d0855j10898O8334
10018h3419B38848a69917d8367B08277i4331b8868n6896k12829C4502K74603B3486
10006h5219A42912J06174h8477M3303A35628d9076K1551F2511a44248K465q0220
9995b22003a07720j86091j907d7833k5175A39400b40839F0991d7380k3663j91930
$$ plain form
9984 -262973 -232193 -282758 -191489 72870 -45260 -90011 -195748 -5811 -255572 -115777 -332817
9973 -332817 -219112 193283 -42118 66974 -127040 -39139 -327354 50686 -81270 -107713 240009
9961 136461 -165885 -262842 -96393 272944 41568 -41775 -113294 -306344 -94701 -290306 -82704
9949 17138 -142409 222622 -34988 249273 166119 -52067 145494 147741 65647 -38995 268735
9937 -7263 96213 -145731 31699 -79303 -199721 -95190 296100 259031 222491 258221 -66259
9925 -264820 -140224 -172517 222255 15536 41139 -65224 -90509 251102 -156997 -88821 232122
9913 -18728 -187973 -235844 125573 26601 -6703 166191 4426 17323 -199250 -301517 -47830
9901 -72052 -145699 56534 43605 -129988 -123163 -277162 -28785 132774 -606 -190534 -245864 -112056
$$ packed form
9984b62973L0780n0565R1269G2870d5260m4751j05737e811k49761a15777k17040
9973c32817J13705A93283d2118F6974a27040c9139k88215E0686h1270k6443B40009
9961A36461a65885r6957i6393B72944D1568d1775p1519j93050i4701j95605h2704
9949A7138a42409B22622c4988B49273q3154e2067A45494K247F5647c8995B68735
9937g263I6213a45731C1699g9303j20418i5190B96100l7069l6540L5730f6259
9925b64820J24596l2293B22255A5536K5603f5224k5285B51102a56997O8176B32122
9913a8728j69245m7871A25573B6601f703A66191D426J2897a99250j02267d7830
9901g2052p3647E6534j2929a29988O825j53999b8785A32774f06j89928n5330a12056
$$ plain form
9888 -297406 -133002 74522 -200476 -119998 -109238 -196592 74537 -283003 -34046 -18259 -544574
9877 -544574 -232363 -99248 72286 253765 37510 -267260 -6789 -275284 -287624 46545 79018
9866 79018 62577 -161577 -85387 -138874 12116 -150771 -134031 -100019 174122 -182213 11492
9854 201714 -337525 -37480 -47405 -221363 -134416 268495 -139843 -249628 -121079 45972 -179529
9842 -141669 162999 -37027 -159349 -135127 2925 80871 4134 -180927 322183 -67158 -147679
9831 -147679 110273 -55652 4967 -384380 58917 -87028 379773 100481 -71246 64409 -151198
9819 -188290 56359 91009 -225427 120719 -301577 -389144 284998 216331 -367693 9451 -170861
9807 -312066 -257445 117604 267622 -16950 -336409 307746 131059 -77303 28020 -102007
$$ packed form
9888b97406a33002G4522b00476Q0478J0760q7354G4537b83003c4046J5787n26315
9877e44574b32363i9248G2286J81479C7510b67260f789k68495j2340D6545L2473
9866G9018j6441a61577P6190n3487A2116a50771J6740L4012A74122a82213A1492
9854B01714c37525c7480r925j73958Q6947B68495a39843j09785a21079D5972a79529
9842a41669A62999c7027j22322K4222B925P7946D134a80927C22183f7158q0521
9831a47679A10273e5652D967c84380E8917h7028C79773A00481g1246F4409a51198
9819a88290E6359L4650b25427A20719c01577q7567B84998o8667c67693I451a70861
9807c12066N4621A17604J50018a6950l19459C07746A31059g7303B8020a02007
$$ plain form
9796 -152280 251968 -167781 -328472 30590 -3355 -239609 -216891 266483 -40207 203912 -52899
9784 -203754 -91172 -52918 -53436 31524 6829 -458785 -355340 -32237 65102 -20137 41343 -442237
9771 -120254 -153795 69720 -265721 184788 -224192 -189497 -119920 -14492 61026 -483354 72853
9759 74522 234547 -30443 -150652 -79140 -81685 -245174 -174367 95055 -139411 -112843 86870
9747 138023 -108160 297598 356114 -138028 -2203 -313734 -48630 -245585 177051 128251 -60121
9735 -366566 -236348 176335 -276505 70956 149224 -439662 -53462 -63126 -23869 22686 -44020
9723 -6158 1315 54931 -49175 -275838 -150612 14990 -7955 56017 -134325 -19733 -35714 83126
9710 144980 -276622 38725 -300540 -34126 -128578 -54836 -65797 20287 -140105 -367841 -213242
$$ packed form
9796a52280B51968a67781j60691C0590c355k36254K2718B66483d0207B03912e2899
9784b03754i1172L8254n18C1524F829d58785J03445c2237F5102b0137D1343d42237
9771a20254l3541F9720b65721A84788b24192L4695O9577a4492F1026d83354G2853
9759G4522J60025c0443j20209P1512k545j63489P0807I5055a39411K6568H6870
9747A38023a08160B97598N8516a38028b203l11531d8630j96955A77051m8800f0121
9735c66566J30218A76335b76505G0956P8268d39662e3462r664b3869B2686d4020
9723f158A315N3616d9175k26663J25226A4990g955E6017a34325a9733j5981H3126
9710A44980b76622C8725c00540c4126r4452e4836j0961B0287a40105k27736J54599
$$ plain form
9699 -213242 196240 -341381 -199514 -264496 237059 -2749 -320879 -35688 64771 6906 -146639
9687 -135679 -69454 -229058 32735 262354 3008 56673 93944 196176 -65222 -203510 -349003
9676 -349003 101494 -101124 111912 92294 219422 -133801 -46609 71472 153464 141055 3134
9664 30621 -250130 -184538 -483026 -168567 -187885 -68495 126566 162028 -245915 -3817 -144779
9653 -144779 151775 -100646 33374 -205789 110483 138683 136080 -246390 331313 -175700
9642 -175857 -62464 13819 -11527 -116758 -111539 -104755 -111400 36472 -150271 -368884 40249 -148142
9629 -48223 127126 53636 112715 -126906 -234459 -318663 -333827 -372201 -311480 7867 -205492
9617 -244186 -286421 216749 -106049 228249 26601 -190295 105005 -120920 -283269 120133
$$ packed form
9699b13242A96240c41381J41867o4982B37059b749l18130c5688F4771F906a46639
9687a35679O6225j59604C2735K29619C008N3665L7271J02232f5222j38288j45493
9676c49003A01494a01124A11912j9618J27128a33801d6609G1472Q1992j2409C134
9664C0621b50130O5592k98488a68567j9318f8495A26566L5462b45915c817j40962
9653a44779A51775a00646C3374b05789A10483K8200k603b46390C31313a75700
9642a75857f2464A3819a1527j05231N219O784o645C6472a50271k18613D0249a48142
9629d8223A27126E3636N9079a26906j07553q4204j5164l8374O0721G867b05492
9617b44186m2235B16749a06049B28249B6601a90295A05005a20920j62349A20133
$$ plain form
9606 33406 -183500 -197359 -10742 223489 95673 -174950 -67542 -62490 -48296 126268 110418
9595 110418 -210645 -273364 146875 102831 -218541 -49534 -339729 -106420 -174766 -537020
9585 -537020 111014 -257810 -39434 -151391 -35909 115498 -118515 58803 -47553 -106920 102234
9573 -250066 -66915 166187 -54000 -174765 -147400 55943 137684 113755 -389634 -441815 70572
9561 -207886 40160 -48060 -26892 95737 -271253 -175008 -73686 20669 33016 163160 -2495
9549 15531 -309624 -210476 -123302 142699 18474 -65438 -13981 -273330 -259968 -77916 -76039
9538 -76039 192551 -183460 193846 273680 -108403 -159051 239757 113092 1533 -287531 -61337
9526 -98885 -221016 -210897 233164 -8866 272985 -84840 -54155 -324463 -265347 -43372 -149737
$$ packed form
9606C3406a83500j3859a0742B23489I5673a74950f7542N052J4194A26268j5850
9595A10418b10645o2719A46875m4044b18541d9534k90195a06420o8346l62254
9585e37020A11014b57810c9434j11957c5909A15498a18515E8803d7553n9367A02234
9573b50066f6915A66187e4000j20765K7365E5943Q1741k3929c89634n2181G0572
9561b07886D0160d8060K1168I5737b71253R6245g3686B0669J2347J30144b495
9549A5531c09624R9148Q7174A42699A8474f5438a3981k59349J3362g7916J877
9538g6039A92551a83460A93846P9834a08403n0648B39757A13092A533b87531f1337
9526i8885j22131J0119B33164h866B72985h4840L0685k70308N9116d3372j06365
$$ plain form
9515 -149737 -408766 -79968 392988 -209776 -7063 19401 -14667 148520 27431 51938 -1600
9503 214597 -269949 56050 -55488 -5039 -172691 201466 94809 279425 177470 -167716 -343363
9492 -343363 -245543 -56780 -182688 -50050 -285244 -380810 -89834 31486 -17392 -179869 -196219
9481 -196219 1170 -29074 -126246 114961 23696 -2891 -120499 -90644 -19366 64988 261015
9470 261015 -350788 -141613 -200806 122473 211210 -135893 19149 -38303 -276161 -201564 3355
9458 54703 452867 42528 37688 -38651 21838 -217796 -95758 -170630 -263849 176524 306667
9447 306667 -12796 -212256 78875 -94965 -59451 136801 19910 179909 40562 -13783 142681
9435 -182232 -202308 -316582 -140233 -25345 21318 141973 -341549 -151468 -122714 53545 -146316
$$ packed form
9515a49737k59029g9968C92988b09776g063A9401a4667A48520B7431K4507a600
9503B14597b69949E6050e5488e039j67652B01466I4809J84616j01955a67716j75647
9492c43363R7820e6780j25908e0050k35194r5566h9834C1486a7392j62477j6350
9481a96219A170b9074r7172A14961B3696b891j17608K9855a9366F4988J96027
9470B61015c50788a41613n9193A22473Q8737a35893A9149c8303k37858P4597C355
9458E4703L98164D2528m840c8651B1838b17796i5758p4872r3219A76524J30143
9447C06667a2796j99460G8875i4965L5514A36801A9910J59999D0562a3783A42681
9435a82232k0076j14274a40233b5345B1318J20655c41549a51468K8754E3545a46316
$$ plain form
9423 259468 62822 -2737 -18502 -394552 63214 -125362 -564242 -244474 -199131 161003 -199061
9411 58517 -64352 144908 -69285 306120 -79579 9860 -289167 -221549 -66603 141518 -15816
9399 -160660 -123436 -71169 -57069 -20014 -40938 137995 -432498 -42327 -339387 109560 91645
9388 91645 177958 269177 -13772 94441 101564 234249 -412665 -136900 -368574 326429 137238
9376 -127370 -160936 72822 -240177 35008 -218931 -150101 -39454 -26529 -27265 -235656 120576
9364 80292 -76293 -156341 -217519 -54647 -26201 98652 -26629 129227 -140821 329229 -69899
9352 -278773 -4227 -345199 -212132 130497 93516 -55695 -261378 -40910 -116203 -284651 -212518
9341 -212518 45194 309777 6336 -291370 -66092 -316410 -268520 -27404 -100708 -35060 -121176
$$ packed form
9423B59468F2822b737j5765l76050F3214a25362m38880b44474M5343A61003a99061
9411E8517f4352A44908f9285C06120g9579I860b89167O7618f6603A41518a5816
9399a60660L7224N2267J4100b0014k0924A37995d32498d2327k97060A09560j7915
9388I1645Q6313R1219a3772I4441P123J32685d12665a36900k31674C26429A37238
9376a27370l3566G2822b40177C5008b18931O8830c9454J2925p36k08391A20576
9364H0292g6293q0048o1178e4647b6201I8652b6629A29227a40821C29229f9899
9352b78773d227l40972J33067A30497l6981e5695k05683d0910p5293j68448P2133
9341b12518D5194K64583F336b91370f6092k50318M7890b7404p3304c5060q6116
$$ plain form
9330 -121176 -299649 -192468 121862 309766 52548 -225349 -192093 188107 -215441 4532
9319 -152397 129629 -243663 -5114 -90608 18385 -37117 -31343 -32641 18815 -112150 236724
9307 -303313 86411 -215541 -170429 93601 -254909 -44704 -115606 -81118 231822 -31597 14824
9295 178582 365204 -294604 -119861 -275245 -73403 46126 244148 -179532 45311 85789
9285 85789 -15752 -13419 9489 -27104 -91231 116079 27365 6629 210769 -8035 -121253 37793
9272 -206868 4425 -61111 -36036 -80658 117712 -186710 20262 -117650 -189173 75991 206864
9261 206864 -86780 -138954 -373474 -247407 62966 71108 -324810 -57738 -96300 43397 110701
9250 110701 -23330 155709 -237468 -46269 -91803 289413 -158929 -77986 -148933 -421458 -209840
$$ packed form
9330a21176j78473J07181A21862J87904E2548b25349L3256A88107b15441D532
9319a52397A29629b43663e114q5494A8385c7117N774j298A8815a12150B36724
9307c03313H6411b15541M5112I3601b54909d4704p0902L4488B31822c1597A4824
9295A78582J86622b94604a19861j55384g3403D6126J98022a79532D5311M0478
9285H5789a5752K333I489b7104o4127A16079B7365F629K04140h035j13218C7793
9272b06868D425f1111K5075m4622A17712a86710B0262a17650p1523G5991J30873
9261B06864h6780n2174k34520J26067F2966Q142c24810e7738l8562D3397O7304
9250A10701b3330A55709b37468d6269m5534B89413a58929g7986p0947k72525b09840
$$ plain form
9238 -159500 -4240 -123962 168168 -287292 179126 246402 300687 182155 12052 55190 182578
9227 182578 -127384 -87641 41201 -79910 -29831 25417 -69617 -111234 -409501 -89477 -136637
9216 -136637 -23441 112280 -4612 252976 29353 263787 -86546 -150040 -189835 -295010 -107882
9204 -121133 -43911 -170807 -35697 125078 -233451 6586 332776 18291 -331617 96338 -181023
9192 15585 401 -88369 -110782 -10926 236819 -145139 -283754 -262368 207043 -18062 103514
9180 53246 57985 -187025 -41465 95056 205081 -156092 49755 -339175 -90839 83108 -53554
9168 -6665 -240246 -106311 -148331 -23531 60967 -42262 -365748 -210832 -313570 -378100 -280377
9157 -280377 -47119 -7905 40070 -118278 181068 3054 -1914 34619 8592 -170470 -49797 -60761
$$ packed form
9238a59500d240j19722A68168b87292A79126O7276N4285j18532A2052M3138J27388
9227A82578a27384L9743D1201g9910b9831B5417f9617m1617k98267h9477m7160
9216a36637b3441A12280d612B52976B9353K34434h6546o3494l9795j05175a07882
9204a21133d3911j26896c5697A25078b33451F586L26190A8291c31617I6338a81023
9192A5585D01h8369k2413a0926B36819a45139j38615K1386B07043a8062A03514
9180E3246M739a87025d1465I5056J10025a56092D9755c39175i0839H3108e3554
9168f665k33581a06311m2020b3531F0967d2262l23486J54916j02738o4530R7723
9157b80377d7119g905D0070a18278A81068C054a914C4619H592a70470d9797j0964
$$ plain form
9145 -60761 -83351 -221052 -41245 -166952 -7046 192901 -365803 -195953 -150959 -206083 -241576
9134 -241576 -15709 -125835 -163365 142268 158576 -65974 -2535 -57359 -20707 11394 -335719
9122 -373955 -196322 113940 142474 -169212 291069 -235682 139236 54249 63090 -241107
9111 -392104 -125197 -331546 -20983 -284207 45269 71493 -173067 63994 -287235 248645
9100 -22990 380 172666 183817 59403 -139264 153878 11726 125226 -101678 -16516 32664
9088 -150758 -126298 -229826 66463 81661 260266 -36721 27511 -20528 9099 -146360 -233393
9077 -233393 -250680 -337351 -51006 67778 339202 -337 -153686 238433 6599 -49446 16759 -85416
9064 -397090 145023 -146760 -141502 -15146 -150176 -40285 80269 223284 -4391 -126015 -87520
$$ packed form
9145f0761k2590j37701d1245j25707g046A92901c65803J69850M4994n5124l5493
9134b41576a5709j10126l7530A42268J6308f5974b535n4824b0707A1394c35719
9122c73955J77633A13940K8534a69212B91069b35682A39236E4249Q841b41107
9111c92104a25197k06349b0983k63224D5269K6224a73067F3994b87235B48645
9100b2990C80J72286J1151E9403a39264A53878A1726J13500a01678a6516C2664
9088a50758K4460j03528F6463J5198J78605c6721B7511b0528I099a46360q7033
9077b33393j7287q6671e1006F7778K71424c37j53349B38433F599d9446A6759h5416
9064c97090A45023a46760N258a5146j35030d0285H0269J43015d391j21624L8495
$$ plain form
9053 -87520 -55988 -85894 -34931 -171505 34496 -61135 -121788 -147170 184767 109646 3456 -123594
9040 -107458 -182803 169816 124601 -104516 -160846 286327 -237878 -13593 -213445 -107720
9030 -107720 -304926 -55690 -74556 98070 -126635 -22902 151505 -274584 -3135 -435227 -346708
9019 -346708 73868 -24444 56945 -95565 134283 -190581 -122131 209748 112156 351880 207996
9008 207996 110596 7507 178051 -41675 -78418 -78965 -68972 -44387 16788 -175237 -6285 44774
8995 -139610 -38118 -154969 15809 89956 -180856 -145347 -250774 253520 -97430 -121217 -105641
8984 -105641 -272217 129577 182540 37802 100909 273554 -66963 70416 -384160 -65142 205360
8972 -97903 88187 8878 169363 -73824 -150731 45504 -189768 -90856 -155393 -17190 99625 -212552
$$ packed form
9053h7520L1532k9906c4931j36574C4496f1135o0653k5382A84767p5121C456a23594
9040a07458p5345A69816m5215a04516n6330B86327b37878a3593j99852J05725
9030a07720j97206e5690j8866I8070a26635b2902A51505b74584c135m32092Q8519
9019c46708G3868b4444E6945i5565A34283a90581O8450B09748r7592K39724j43884
9008B07996r7400G507J70544d1675l6743n47R993K4585A6788a75237f285D4774
8995a39610c8118j16851A5809P4147a80856L5509j05427B53520i7430k3787J5576
8984a05641j66576A29577N2963C7802O3107J72645f6963G0416c84160f5142B05360
8972i7903H8187H878J60485g3824p6907D5504a89768i0856o4537a7190I9625b12552
$$ plain form
8959 -265348 129355 -22126 122764 -152021 -119293 -357313 -96903 -107416 -56929 194120 -57136
8947 -273170 -46702 35286 -87663 -99698 33840 -357070 -54428 -74913 28341 51694 66261
8936 66261 -92608 120273 -105348 82524 -167373 83932 -279344 -300821 75517 130349 -25339
8924 32692 69900 433620 1954017 1755679 803297 250487 252693 130324 -136492 -124348
8914 -124348 639 -306535 -99833 -144288 -196771 305274 -226945 372899 -76104 -14043 -21766
8903 -21766 44405 -277835 -258614 -198724 87670 -94034 2182 83774 318352 -174531 57076
8891 69059 -230023 -82681 153459 -135198 46305 137107 -27287 -314155 -248710 32217 51305
8880 51305 98428 -375468 24628 -323331 -62121 -150396 -87373 33132 -16823 -78525 -216243
$$ packed form
8959b65348A29355b2126A22764a52021L2728k38020i6903j0513N0487A94120e7136
8947b73170d6702C5286h7663j2035C3840c57070e4428k0485B8341K3353J4567
8936F6261i2608A20273a05348H2524a67373H3932b79344k1477G5517N4832b5339
8924C2692L7208L63720J520397j98338H03297B50487K206j22369a36492J2144
8914a24348F39c06535i9833m4455n2483C05274b26945C72899g6104a4043p723
8903b1766D4405b77835J9221N9890H7670i4034B182Q1592K34578a74531E7076
8891F9059b30023h2681A53459a35198D6305R0802b7287k86868O5445C2217J9088
8880E1305M7123c75468B4628c23331f2121q8275O3023C3132a6823o1702j37718
$$ plain form
8869 -216243 -96135 101713 -272948 -79751 -136352 -196246 -147685 -206837 -126453 47151 334595
8858 334595 -212197 -46535 -34905 -38918 65188 -237442 -85428 40815 181316 4845 -107792
8846 -343593 135895 57698 37618 -314093 21818 -97843 -150038 243628 79333 151260 -237845
8834 225476 98006 -283995 -95225 -306598 -142466 308069 -431365 -59012 -55176 34627 221221
$$ packed form
8869b16243i6135A01713b72948g9751n6601n9894M8561n9152Q0384D7151K87444
8858C34595b12197d6535J1630m013F5188b37442h5428D0815J40501D845a07792
8846c43593A35895E7698k0080c14093B1818i7843n2195B43628G9333P1927b37845
8834B25476I8006b83995i5225k11373a42466C08069d31365e9012L836C4627J86594
$$ [...]
##END NTUPLES=NMR SPECTRUM
##END=
