##TITLE=AC1422_MEXAH12232_7764400_sQMqy75a5n
##JCAMPDX= 6.0         $$ Bruker NMR JCAMP-DX V2.0
##DATA TYPE= NMR SPECTRUM
##DATA CLASS= NTUPLES
##ORIGIN= BRUKER
##OWNER= Administrator
$$ 1.72 TOPSPIN		Version 2.1
$$ 2013-04-11 19:27:18.144 -0700  Administrator@X
$$ Compression mode = diff/dup
##.OBSERVE FREQUENCY= 400.02188249412
##.OBSERVE NUCLEUS= ^1H
##.ACQUISITION MODE= SIMULTANEOUS (DQD)
##.ACQUISITION SCHEME= undefined
##.AVERAGES= 8
##.DIGITISER RES= 22
##SPECTROMETER/DATA SYSTEM= spect
##.PULSE SEQUENCE= zg30
##.SOLVENT NAME= COFFEE_meoh
##.SHIFT REFERENCE= INTERNAL, COFFEE_meoh, 1, 14.98509
##AUDIT TRAIL= $$ (NUMBER, WHEN, WHO, WHERE, PROCESS, VERSION, WHAT)
$$ ##TITLE= Audit trail, TOPSPIN		Version 2.1
$$ ##JCAMPDX= 5.01
$$ ##ORIGIN= Bruker BioSpin GmbH
$$ ##OWNER= Administrator
$$ $$ E:\/data/COFFEE/nmr/AC1422_MEXAH12232_7764400_sQMqy75a5n/10/pdata/1/auditp.txt
$$ ##AUDIT TRAIL=  $$ (NUMBER, WHEN, WHO, WHERE, PROCESS, VERSION, WHAT)
(   1,<2013-04-11 19:27:08.566 -0700>,<Administrator>,<X>,<go>,<TOPSPIN 2.1>,
      <created by zg
	started at 2013-04-11 19:26:02.894 -0700,
	POWCHK enabled, PULCHK disabled,
       configuration hash MD5:
       33 CF 6A 21 5C D3 B9 40 6C 15 AA 8D 27 A2 4F 13
       data hash MD5: 64K
       5E A0 8F 37 0C CE C0 00 0A 35 12 82 5F 02 27 D2>)
(   2,<2013-04-11 19:27:11.691 -0700>,<Administrator>,<X>,<proc1d>,<TOPSPIN 2.1>,
      <Start of raw data processing
       efp LB = 0 FT_mod = 6 PKNL = 1 PHC0 = 0 PHC1 = 0 SI = 32K 
       data hash MD5: 32K
       4D 63 01 DA 66 FD 2C 7A CD D1 5C 07 A4 83 A1 AF>)
(   3,<2013-04-11 19:27:12.159 -0700>,<Administrator>,<X>,<proc1d>,<TOPSPIN 2.1>,
      <pk PHC0 = 96.78955 PHC1 = 0 
       data hash MD5: 32K
       C0 AB C3 F9 87 11 79 7E E6 04 8D C2 55 AB 13 5A>)
(   4,<2013-04-11 19:27:12.394 -0700>,<Administrator>,<X>,<proc1d>,<TOPSPIN 2.1>,
      <abs ABSG = 1 
       data hash MD5: 32K
       B5 BC 37 25 30 ED 36 B7 AA D1 CA 43 DF 07 F6 EB>)
(   5,<2013-04-11 19:27:12.534 -0700>,<Administrator>,<X>,<proc1d>,<TOPSPIN 2.1>,
      <abs ABSG = 2 
       data hash MD5: 32K
       5C AA 2A BB BD EA 7B 2C 72 07 BC 87 F6 F3 6A 1F>)
(   6,<2013-04-11 19:27:12.675 -0700>,<Administrator>,<X>,<proc1d>,<TOPSPIN 2.1>,
      <abs ABSG = 3 
       data hash MD5: 32K
       9B 6D 88 27 6C 2F B2 A1 FE 6F 06 73 79 97 F5 7F>)
(   7,<2013-04-11 19:27:12.816 -0700>,<Administrator>,<X>,<proc1d>,<TOPSPIN 2.1>,
      <abs ABSG = 4 
       data hash MD5: 32K
       C6 4B 00 05 4F 92 44 EE E1 F8 DC 46 8A A0 90 A1>)
(   8,<2013-04-11 19:27:12.956 -0700>,<Administrator>,<X>,<proc1d>,<TOPSPIN 2.1>,
      <abs ABSG = 5 
       data hash MD5: 32K
       13 12 F4 E4 4E 17 2F 39 08 42 02 0E 62 6C A9 EF>)
$$ ##END=
$$ 
$$ $$ hash MD5
$$ $$ F3 4D 6D 58 11 35 8E 39 74 D7 2F D4 A1 FA AD 92
##$RELAX= 
##$RELAX= 
##$RELAX= 
##$RELAX= 
##$RELAX= 
##$RELAX= 
##$RELAX= 
$$ Bruker specific parameters
$$ --------------------------
##$DU= <E:\>
##$EXPNO= 10
##$NAME= <AC1422_MEXAH12232_7764400_sQMqy75a5n>
$$ [...]
150 150 150 150 150 150 150 150
##$TP07= 0
##$TPNAME0= <>
##$TPNAME1= <>
##$TPNAME2= <>
##$TPNAME3= <>
##$TPNAME4= <>
##$TPNAME5= <>
##$TPNAME6= <>
##$TPNAME7= <>
##$TPOAL= (0..7)
0.5 0.5 0.5 0.5 0.5 0.5 0.5 0.5
##$TPOFFS= (0..7)
0 0 0 0 0 0 0 0
##$TUNHIN= 0
##$TUNHOUT= 0
##$TUNXOUT= 0
##$USERA1= <user>
##$USERA2= <user>
##$USERA3= <user>
##$USERA4= <user>
##$USERA5= <user>
##$V9= 5
##$VALIST= <valist>
##$VCLIST= <CCCCCCCCCCCCCCC>
##$VD= 0
##$VDLIST= <DDDDDDDDDDDDDDD>
##$VPLIST= <PPPPPPPPPPPPPPP>
##$VTLIST= <TTTTTTTTTTTTTTT>
##$WBST= 2048
##$WBSW= 25
##$XGAIN= (0..3)
0 0 0 0
##$XL= 0
##$YL= 0
##$YMAX_a= 601809
##$YMIN_a= -513194
##$ZGOPTNS= <>
##$ZL1= 120
##$ZL2= 120
##$ZL3= 120
##$ZL4= 120
##$ABSF1= 14.98509
##$ABSF2= -5.573092
##$ABSG= 5
##$ABSL= 3
##$ALPHA= 0
##$AQORDER= 0
##$ASSFAC= 0
##$ASSFACI= 0
##$ASSFACX= 0
##$ASSWID= 0
##$AUNMP= <proc_prof1d_extract_pilot.lims>
##$AXLEFT= 0
##$AXNAME= <>
##$AXNUC= <1H>
##$AXRIGHT= 0
##$AXTYPE= 0
##$AXUNIT= <>
##$AZFE= 0.1
##$AZFW= 0.1
##$BCFW= 0
##$BC_mod= 0
##$BYTORDP= 0
##$COROFFS= 0
##$CY= 15
##$DATMOD= 1
##$DC= 0
##$DFILT= <>
##$DTYPP= 0
##$F1P= 0
##$F2P= 0
##$FCOR= 0.5
##$FTSIZE= 32768
##$FT_mod= 6
##$GAMMA= 0
##$GB= 0
##$INTBC= 1
##$INTSCL= 1
##$ISEN= 128
##$LB= 0
##$LEV0= 0
##$LPBIN= 0
##$MAXI= 10000
##$MC2= 0
##$MEAN= 0
##$ME_mod= 0
##$MI= 0
##$NCOEF= 0
##$NC_proc= -8
##$NLEV= 6
##$NOISF1= 0
##$NOISF2= 0
##$NSP= 0
##$NTH_PI= 0
##$NZP= 0
##$OFFSET= 14.98509
##$PC= 1
##$PHC0= 96.78955
##$PHC1= 0
##$PH_mod= 1
##$PKNL= yes
##$PPARMOD= 0
##$PPDIAG= 0
##$PPIPTYP= 0
##$PPMPNUM= 2147483647
##$PPRESOL= 1
##$PSCAL= 4
##$PSIGN= 0
##$PYNMP= <proc.py>
##$REVERSE= no
##$SF= 400.02
##$SI= 32768
##$SIGF1= 0
##$SIGF2= 0
##$SINO= 400
##$SIOLD= 32768
##$SPECTYP= <>
##$SREGLST= <1H.CDCl3>
##$SSB= 0
##$STSI= 32768
##$STSR= 0
##$SW_p= 8223.68421052631
##$SYMM= 0
##$S_DEV= 0
##$TDeff= 65536
##$TDoff= 0
##$TI= <>
##$TILT= no
##$TM1= 0
##$TM2= 0
##$TOPLEV= 0
##$USERP1= <user>
##$USERP2= <user>
##$USERP3= <user>
##$USERP4= <user>
##$USERP5= <user>
##$WDW= 1
##$XDIM= 32768
##$YMAX_p= 462534071
##$YMIN_p= -700242
##$CURPLOT= <Network HP LaserJet P1505>
##$CURPRIN= <$Network HP LaserJet P1505>
##$DFORMAT= <normdp>
##$LAYOUT= <+/1D_H.xwp>
##$LFORMAT= <normlp>
##$PFORMAT= <normpl>
##$SURQMSG= 1
$$ End of Bruker specific parameters
$$ ---------------------------------
##NTUPLES= NMR SPECTRUM
##VAR_NAME=  FREQUENCY,     SPECTRUM/REAL,   SPECTRUM/IMAG
##SYMBOL=    X,             R,               I
##VAR_TYPE=  INDEPENDENT,   DEPENDENT,       DEPENDENT
##VAR_FORM=  AFFN,          ASDF,            ASDF
##VAR_DIM=   32768,         32768,           32768
##UNITS=     HZ,            ARBITRARY UNITS, ARBITRARY UNITS
##FACTOR=    0.250966925370066, 1,           1
##FIRST=     8223.43324360094, 59494,        -103829
##LAST=      0,             -71808,          27372
##MIN=       0,             -700242,         0
##MAX=       8223.43324360094, 462534071,    0
$$ Real data points
##PAGE= N=1
##DATA TABLE= (X++(R..R)), XYDATA
$$ [...]
19573b44539A6658n777a79964L946G5993j8998r165a91916o4829A31255b16956
19561a58459k34104h671E2694Q0296k5692c3181q9966B88893q2157a86760A7951
19549b02830a5288k45932J02535G5682N1811a40613j2639L0232q3626B45656b6131
19537B03639a02757A39772F0942a12941n3430B18928D2886J81619E7070Q6495
19527A43565a88948A40484i1111D3549J46680b45056K9816C01068a95842i282
19516b66805a22241A75721E7975A274d2126k71207k7643B22514q8884a53460i652
19504a03029D2436c25533a47686o4239q768d9242k80308A83273i7249j54720C3822
19492A76598a03856j3381G5486a61773a4075E0606n7a24365l08695B04803a71154
$$ y = [-244539, 16658, 10881, -179964, -176018, 75993, 56995, 47830, -191916, -256745, 131255, -216956, -158459, -392563, -8671, 52694, 132990, 107298, -33181, -123147, 288893, 206736, -186760, 17951, -202830, -15288, -261220, -158685, 75682, 127493, -140613, -153252, -123020, -206646, 245656, -26131, 203639, -102757, 139772, 60942, -112941, -166371, 218928, 42886, 224505, 57070, 143565, -188948, 140484, -91111, 43549, 190229, -245056, -215240, 301068, -195842, -9282, -266805, -122241, 175721, 57975, 1274, -42126, -313333, -340976, 222514, 133630, -153460, -9652, -103029, 42436, -325533, -147686, -211925, -220693, -49242, -329550, 183273, -97249, -251969, 33822, 176598, -103856, -117237, 75486, -161773, -14075, 50606, 50549, -124365, -433060, 204803, -171154]
19480f8220H8447Q7997l4314c8779A67557A3967J9272J4027a56842J4281j3324
19469a55885A68250a85625h5782B3636a95726B04936a06330j54074c6034k68838
19459c04872A7217e3991A29431b32649d2141m54054d1128H744b03746i8105b0567
19447e0776j91627f688o8148j73230E0161d1119j15248B3959h5505k1494B12465
19435g8957k16850e0298j78680P0419j35090J45710r6239L7691A0009K64284F3371
19423a41936d3112j4519k78214C8530a76245P5365B31549b26155A31704g0345
19412i5454A92033a84052p0260A24172f7267j81932m8165B00305B0821c13404
19401a77775j20815B7763b01223A0827J8920J58549a05401k790I9859m2322d81908
$$ y = [-68220, 88447, 176444, 142130, -38779, 167557, 13967, 33239, 47266, -156842, -142561, -155885, 168250, -185625, -85782, 23636, -195726, 204936, -106330, -260404, -36034, -304872, 17217, -53991, 129431, -232649, -42141, -496195, -41128, 8744, -203746, -98105, -20567, -50776, -242403, -6688, -74836, -248066, 50161, -41119, -156367, 23959, -85505, -106999, 212465, -78957, -295807, -50298, -228978, -158559, -293649, -147939, -244178, -206487, 10009, 274293, 63371, -141936, -43112, -57631, -335845, 38530, -176245, -100880, 231549, -226155, 131704, -70345, -95454, 192033, -184052, -254312, 124172, -67267, -249199, -297364, 200305, 20821, -313404, -177775, -298590, 27763, -201223, 10827, 29747, 188296, -105401, -108191, 99859, 57537, -481908]
19389b80495J02113b4677B16130B0045h0223a8858A61671i842j28241k5655D439
19377D6385c80039i0183B4970a67660a8833F6015c23690L5761C266a81576F356
19365a77955A80634E3949i936k08345r6855A00420P8556a59263k39345b7327M519
19354b2808F7673N5517k1550h1673B82786a55457G6761b9600A62487K6454b17176
19342b3572C3309K708Q603b16480B48051j14588l6395R0279b1242j48947F7211
19330a01714A25811a45340e5884H6039c5349k57471j15934A03388c68041a40390
19319B72548A20196J05603a10897j44199h5136j01352O8583I7466j468f0614j86043
19308b46657N2013F8198D099f3967A85051f8661H3345d8814j099o4577e0221A7483
$$ y = [-280495, -178382, -24677, 216130, 20045, -80223, -18858, 161671, -9842, -138083, -163738, 4439, 46385, -380039, -90183, 24970, -167660, -18833, 66015, -323690, -287929, 3266, -181576, 6356, -177955, 180634, 53949, -9936, -218281, -315136, 100420, 178976, -159263, -398608, -27327, -22808, 67673, 123190, 101640, -81673, 282786, -155457, 76761, -29600, 162487, 188941, -217176, -23572, 33309, 36017, 44620, -216480, 248051, 133463, 97068, 187347, -21242, -170189, 67211, -101714, 125811, -145340, -55884, 86039, -35349, -292820, -408754, 103388, -368041, -140390, 272548, 120196, 225799, -110897, -255096, -85136, -186488, -117905, 97466, 95998, -60614, -246657, -194644, 68198, 4099, -63967, 185051, -68661, 83345, -48814, -49913, -114490, -50221, 17483]
19295a24601K2447j2323j23271j31962H5844r363d3026I3314K23170a14245c2324
19283A10697g8917A12392a9485D1771L5618p937J99770A07642a89961A87867b9517
19271A54332c06062c9897j47132j04216g2824J3749p1442K7861c9021e087q3230
19260h8317l4613M0543q257l41013J50585a0904q0317B3591f8021m0930k5491
19249a34442d8092j35387A28464J22300b60226b482j63770B78377a6202j35348
19239a51550n2782i2787A8542K19388H0513J06599f1589A35396k4825b9302A68643
19227d05938a7138n2333A89928b35772e1101B23181a72430k95917b2428A00154
19216b18694r9820b024H8936h4945k56763I0077a18417C210a98125H2409a65986
$$ y = [-124601, -102154, -114477, -237748, -369710, 85844, 76481, -43026, 93314, 316484, -114245, -32324, 110697, -78917, 112392, -19485, 41771, 77389, 69452, 269222, 107642, -189961, 187867, -29517, 154332, -306062, -39897, -187029, -291245, -72824, -59075, -130517, -102656, -39021, -5087, -88317, -122930, -82387, -90644, -431657, -281072, -10904, -91221, 23591, -68021, -108951, -134442, -48092, -183479, 128464, 250764, -260226, -2482, -166252, 278377, -16202, -151550, -204332, -92787, 18542, 237930, 80513, 187112, -61589, 135396, 110571, -29302, 168643, -405938, -17138, -69471, 189928, -235772, -51101, 223181, -172430, -468347, -22428, 100154, -218694, -318514, -2024, 88936, -84945, -341708, 90077, -118417, 3210, -198125, 82409, -165986]
19204a19608r5502Q320b8555E8699e319F6159h8292j26099b6106A77286c6373
19192A3444c08066k2314G4185J74293o9560M4669G1284A2582a41918N5705a3780
19180c38999C22937b83843A06604C8314c05051a2370p0460o9948m2848d7094B14264
19168a67841b9837n1202l0887I4281e1653j23896e4990J4376A97415C5144c10823
19156c15795A49557c15742j36808H6203c08737j54530J68242A12535b43376j07526
19146c50902I6295a16906j69723D4881K40481A24900c5537i662C4429a01013j95266
19135b96279A13641c28721p3110J22873A34525R989a61872Q0899l9477E5726c90436
19123b60555d7796A55578a40241o2981f8422A18299g6893m62A6361b33305C05318
$$ y = [-119608, -215110, -206790, -28555, 58699, -5319, 66159, -88292, -214391, -26106, 177286, -36373, 13444, -308066, -330380, 74185, 248478, 178918, 223587, 71284, 12582, -141918, -86213, -13780, -338999, 322937, -283843, 106604, 38314, -305051, -12370, -82830, -152778, -195626, -47094, 214264, -167841, -29837, -81039, -111926, 94281, -51653, -175549, -54990, -40614, 197415, 35144, -310823, -315795, 149557, -315742, -452550, 86203, -308737, -463267, -295025, 112535, -243376, -350902, 96295, -116906, -286629, 44881, 285362, 124900, -35537, -9662, 34429, -101013, -296279, 113641, -328721, -401831, -278958, 134525, 144514, -161872, -80973, -120450, 55726, -390436, -260555, -47796, 155578, -140241, -203222, -68422, 118299, -76893, -77355, 16361, -233305, 305318]
19111A5450d9324b116k10894J01398n4840I6718d40795a70995J2568d1890m6603
19100h8493m7678B04906I7751a02271q5386o4512a07032o5011c1368o8178G8702
19088a48429m8192B03088g2478k01920j30020G4534g8012A81256a59267A24288
19077i839j22539c0974k79300a47521A29205g0563n781B2519b97126k03313e2552
19065c7436i86n2953j1405h675G4086j4367a54901j01320B482J63239c04912A31557
19052e8274j7547C69954A20957C5351i0128j45196L0761G7231J41631A0609L8415
19041D9024a13638C1455d5521A76707E882d1680l23710a34576r5226c0243A28189
19029B0313b10553B6792A0863P3373D1976A4113h1615F104J39854H450J34005
$$ y = [15450, -49324, -2116, -213010, -111612, -166452, 96718, -440795, -170995, -158427, -41890, -88493, -136171, 204906, 97751, -102271, -187657, -252169, -107032, -172043, -31368, -99546, 78702, -148429, -196621, 203088, -72478, -274398, -404418, 74534, -78012, 181256, -159267, 124288, -9839, -132378, -30974, -310274, -147521, 129205, -70563, -76344, 22519, -297126, -500439, -52552, -37436, -986, -53939, -65344, -8675, 74086, 59719, -154901, -256221, 2482, 165721, -304912, 131557, -58274, -75821, 369954, 120957, 35351, -90128, -235324, -204563, 77231, 218862, 10609, 49024, -113638, 31455, -45521, 176707, 5882, -41680, -365390, -134576, -229802, -30243, 128189, 20313, -210553, 26792, 10863, 84236, 41976, 14113, -81615, 6104, 145958, 8450, 142455]
19018A42455a52591F7813b41201A97555p6204J48542N314F2733l839a5511k43423
19007b58934b8825j14746C37746r2679D3508J15620c63230A13281J11725a90753
18996a80684F7105b0822k1610n9956A7952M8716a15410L7118n405o8850A81042
18984A08075a67005k47502H435R5998L3574a74142f653F2613M5074b29638b2274
18972b837H3470J2031J49563h1711F5321A5970J68776i4908A85197D0234b43338
18960H905d6584k46003a19793n15C8891i3432B07808b31882Q8461d3580j14172
18949a57752A8520c86889a62721b4934I5477k0702a4570q021A61641b22875C14815
18937d7078A15609C2876b19291A86507a373o1279m10439c7290k35258I4767a53832
$$ y = [142455, -152591, 67813, -241201, 197555, 121351, 269893, 275207, 62733, 58894, -15511, -258934, -28825, -143571, 337746, 245067, 43508, 159128, -363230, 113281, 225006, -190753, -180684, 67105, -20822, -42432, -102388, 17952, 66668, -115410, -78292, -83697, -152547, 181042, 108075, -167005, -414507, 8435, 104433, 138007, -174142, -6653, 62613, 107687, -229638, -22274, -2837, 83470, 95501, 245064, -81711, 65321, 15970, 184746, -94908, 185197, 40234, -243338, 8905, -46584, -292587, -119793, -120308, 38891, -93432, 207808, -231882, -143421, -43580, -157752, 18520, -386889, -162721, -24934, 95477, 74775, -14570, -22591, 161641, -222875, 314815, -47078, 115609, 32876, -219291, 186507, -1373, -62652, -473091, -37290, -272548, 94767, -153832]
18925A74148a16129j2646N4267F360M7033b60458J28601A34114a80182P3020r2233
18914a99395A0356b94060B18169K20820a95690K8325c7229j69413A75396K1299
18904A96695d0006C25633a3075k1764A73534b07381o7a3469j62306E3058g4479
18892C4777a21368A10954J4556i8486j61277A16154R6064a68140G594a45722g2023
18880A19882h2844G0347K42104a5203k47015h7311A22415a26503E524d25713b1198
18868A95648O3969b29148Q3904C743i275k48897a08969B6210L12250A31717c2155
18856b74098a14845A04586a37915O5040b5387j11903H929K10356N61A4254b37282
18844I7295C4566c01105H4858a26801j7119j78039B14662o6749l2224b5312F2436
$$ y = [174148, -116129, -128775, -74508, 6360, 53393, -260458, -131857, 134114, -180182, -107162, -199395, 10356, -294060, 218169, 438989, -195690, -167365, -37229, -206642, 175396, 196695, -40006, 325633, -13075, -34839, 173534, -207381, -207448, -13469, -175775, 53058, -74479, 34777, -121368, 110954, 125510, -98486, -259763, 116154, 212218, -168140, 7594, -145722, -72023, 119882, -82844, 70347, 312451, -15203, -262218, -87311, 122415, -126503, 5524, -425713, -21198, 195648, 259617, -229148, -145244, 3743, -9275, -258172, -108969, 26210, 338460, 131717, -32155, -274098, -114845, 104586, -137915, -72875, -25387, -137290, 8929, 219285, 219846, 14254, -237282, 97295, 34566, -301105, 84858, -126801, -143920, -321959, 214662, 147913, 115689, -25312, 62436]
18832H7987g5175j52571M6870Q9795j5872o0045P4857A14544b9504p6541C57105
18820A438Q6640K73185m6151b1607k10637H0836M3164f48709A3121K21598a77721
18808G9906B6298J92761a13334M7868B07403b06095H9869A3267a9345h418r2893
18797a01311k83442a02981l46151a0809k3578j24808c1522l1893f619A12297a04936
18785b55032A63539n1613b92638a9260e025k95853D6436a55079K7753O0511E0479
18773h5095j2147l6723m7882g1258C4691L08750a71304f8332r1350m042L9208
18762a24516q180e8048G2886J1010J8641g5540k96404a45621j35389A21047N4779
18751A75826B1145J76038c25099h4720K6988j4397n9640f4537c422A33431c9276
$$ y = [87987, -75175, -227746, -180876, -91081, -106953, -166998, -92141, 114544, -29504, -106045, 357105, 1438, 88078, 361263, 315112, -21607, -232244, 80836, 124000, -648709, 13121, 234719, -177721, 79906, 26298, 219059, -113334, -65466, 207403, -206095, 89869, 13267, -19345, -8418, -101311, -384753, -102981, -449132, -10809, -34387, -159195, -31522, -63415, -6619, 112297, -104936, -255032, 163539, 111926, -292638, -19260, -5025, -300878, 46436, -155079, -127326, -66815, 50479, -85095, -97242, -133965, -181847, -71258, 34691, 343441, -171304, -68332, -159682, -163724, -124516, -132696, -58048, 72886, 83896, 102537, -75540, -371944, -145621, -281010, 121047, 175826, 21145, 197183, -325099, -84720, -57732, -72129, -131769, -64537, -3422, 133431, -39276]
18739a79593A20071g6693j50093k4884M5533d1944k76426a39415B15090C9003
18728c02885c2104H1582a99693a7782m9838L2820H9721G945b91178a21476E616
18716A82329b18940M6464A61868b52324A25842K48209a70384q6858P2990A18545
18705A46758d26402M3541N3437m6589C6805f4382f880L228j28668n6645g5677
18693I2801a59672i73B12528g5704k32770g7068C4499c73303a27529l9833A01107
18681a25044B21262c33638C16731c1436k6906E6547a93336B40892b6803q3284
18671a10087A52900K0004D3371c36951a10509g115n9253A79732J2430J8614i1724
18659c59098O7356C6313b39418A57521c14194J55427k03217a21872N5583j01350
$$ y = [-179593, 120071, -76693, -226786, -251670, -206137, -41944, -318370, -139415, 215090, 39003, -302885, -32104, 81582, -199693, -17782, -67620, -34800, 89721, 7945, -291178, -121476, 5616, 182329, -218940, -172476, 161868, -252324, 125842, 374051, -170384, -257242, -184252, 118545, 146758, -426402, -382861, -329424, -376013, 36805, -64382, -6880, -3652, -132320, -188965, -75677, 92801, -159672, -973, 212528, -75704, -308474, -77068, 34499, -373303, -127529, -167362, 101107, -125044, 221262, -333638, 316731, -31436, -58342, 56547, -193336, 240892, -26803, -110087, 152900, 172904, 43371, -336951, -110509, -7115, -66368, 179732, 192162, 210776, -91724, -359098, -291742, 36313, -239418, 157521, -314194, -158767, -361984, -121872, -66289, -167639]
18649a67639A89245b50889A98888d30981B84173g9550j84658Q613E3588A4734
18638A40761L2383a85325C0645J48411p3851k6056a14978B75773b24442A09341
18627G63b4299e204j43605A09860c66131B0047a61875f2887B5535J18815a07618
18615a66543A33761O829K9903b74641J00485h2423A31847a87455C6937g3146j79065
18604b52211O5035j01392i7834j9542B35007q2202b70225D6919K1482e1309I8079
18592a16754a0104A55643J55277a6452j42769a6080B29905a35523A3495b64501
18581a83761A2282a48659I14L49526a45708A15845h8276k64500Q2981a03748B66470
18569C10554f0256j59617P4292B3348b37514Q2891M4792k37991e1144K5541j24009
$$ y = [-167639, 189245, -250889, 198888, -430981, 284173, -79550, -264208, -255595, 53588, 14734, 140761, 173144, -185325, 30645, 179056, 105205, 79149, -114978, 275773, -224442, 109341, 763, -24299, -5204, -148809, 109860, -366131, 20047, -161875, -62887, 25535, 144350, -107618, -166543, 133761, 140590, 170493, -274641, -174156, -82423, 131847, -187455, 36937, -73146, -252211, -187176, -288568, -97834, -117376, 235007, 152805, -270225, 46919, 68401, -51309, 98079, -116754, -10104, 155643, 310920, -16452, -159221, -16080, 229905, -135523, 13495, -264501, -183761, 12282, -148659, 914, 350440, -145708, 115845, -88276, -352776, -269795, -103748, 266470, 310554, -60256, -219873, -145581, 23348, -237514, -154623, -109831, -347822, -51144, -25603, -149612]
18558a49612k5648B73441d2423C9164a71317c4314l0074J3566j09605Q357B783
18546b31920f7768q4537d6072B07809k6610E9616L2609g5109K1982o6595o349
18535a26071j91135d8557q6160j15208i5982k54967a64575j95834b1031A08951
18524E3882J55153b74840g1502j88446h9775C9654g9656C8366M277g1155k53989
18513c25144k7006f6089j59097j2028A11278a95982B68950c05999J6430c4522
18502H5940b02207m5909A58173m9380c392o3872k33314f6668D7952J8334b883
18490a70531c9017A64824J90705E4846a79104j025j30897J29439B03976b2684
18479D2515J07644a77021E2085a66187B70049k1947i5912H8674J41994c86144
$$ y = [-149612, -175260, 273441, -42423, 39164, -171317, -34314, -64388, -50822, -160427, -152070, 2783, -231920, -67768, -152305, -46072, 207809, 181199, 59616, 92225, -75109, -53127, -119722, -126071, -317206, -48557, -134717, -249925, -95982, -350949, -164575, -360409, -21031, 108951, 53882, 209035, -274840, -71502, -259948, -89775, 39654, -79656, 38366, 42643, -71155, -325144, -352150, -66089, -225186, -237214, 111278, -195982, 268950, -305999, -289569, -34522, 85940, -202207, -248116, 158173, 108793, -3392, -67264, -300578, -66668, 47952, 66286, -2883, -170531, -39017, 164824, 355529, 54846, -179104, -180129, -311026, -181587, 203976, -22684, 42515, 150159, -177021, 52085, -166187, 270049, 248102, -95912, 88674, 230668, -386144]
18468a08313M94j68838A42507b8579j83225B01424a18627M0021A40577h9271p9198
18457a68469a1671j65844J977e2148A06055b73008R2202j19382A9301b55647B4343
18445h4217H844a43513A06697l8508j7294c22482J49520O359b2171A87949c48980
18433a38827A15646b91584J02955R661r7172A16541i6822b9348N784k52410C67907
18421b36891A13082b7699q2921E4228g6101B0683e5383n1600j30993Q1707k3771
18410a80040b5247k24757L7091A98445q8931d5437j86841a01102C5486K32721
18400B68207F6850h4004L7948A19746a22868j04553B91268a32581K9035A16443
18389d06178h6715J9737A54019D1154b22522B09239b28128A15831m7083b22858
$$ y = [-108313, -107819, -276657, 142507, -28579, -211804, 201424, -118627, -78606, 140577, -89271, -168469, -11671, -177515, -175538, -52148, 106055, -273008, -180806, -300188, 19301, -255647, 24343, -84217, 8844, -143513, 106697, 68189, 50895, -322482, -172962, -166603, -22171, 187949, -348980, -138827, 115646, -291584, -188629, -178968, -276140, 116541, -96822, -29348, -23564, -275974, 367907, -236891, 113082, -27699, -110620, 54228, -76101, 20683, -55383, -106983, -237976, -156269, -180040, -25247, -250004, -212913, 198445, 109514, -45437, -232278, -101102, 35486, 268207, 66850, -84004, -46056, 119746, -122868, -227421, 291268, -132581, -103546, 116443, -406178, -86715, -66978, 154019, 41154, -222522, 209239, -228128, 115831, 68748, -222858]
18378a37613j7116m1861h005j58848D0242i768D3093a7860A99315a10389C499
18366A47534m4215D1295a50208f2954A4359O9054d10602A23916f4870o6041E596
18354B609a84652A49133A8794P0094a53159g4247b3631j2602j30805E291J02685
18343A07976j5200a61231J668e5202D4269e0753C047e4094F899c55426g1897k07564
18331b79461f1540q6006I2465d04116B78145H6194J37111i2178M4318A12721c04958
18319a22720j07382O175a3080j84059L9640I1432j9511b497j47526B39112o4180
18308A74932E0836L3579h2479E1132J21978o1873R301c0716k92309i4703j21496
18297b16199B6119d51300J82714D2840J01960a41267b0749B60364i4638k25051
$$ y = [-137613, -154729, -196590, -8005, -166853, 40242, -9768, 43093, -17860, 199315, -110389, 3499, 147534, 103319, 41295, -150208, -62954, 14359, 83413, -410602, 123916, -64870, -130911, 5596, 2609, -184652, 149133, 18794, 88888, -153159, -74247, -23631, -36233, -167038, 5291, 107976, 92776, -161231, -159563, -55202, 44269, -50753, 3047, -54094, 6899, -355426, -71897, -279461, -61540, -147546, 92465, -404116, 278145, 86194, 223305, -92178, -47860, 112721, -304958, -122720, -230102, -223927, -13080, -197139, -157499, 91432, 71921, -2497, -150023, 239112, 174932, 50836, 84415, -82479, 51132, 173110, 111237, 120538, -30716, -323025, -94703, -216199, 26119, -451300, -268586, 42840, 144800, -141267, -20749, 260364, -94638, -319689]
18287c19689C83157a49550b6286k76815j3663a00269B33201h9274G9622l4909
18277D4713M38463D8227j8780c20135J1878F5852J05301c45341g8976k7063C193
18265a00673K0628B09217h2288K994o7322m6093Q143f0838A96508H2953J52336
18254B35289a56645k018c1734A6165g3334j51651N2136O7421A80548d7335A47122
18242a09111B38129g0125h580B0373a47209A69240E9147b77750A49338c9380l23790
18231c63170J65186A10862e5475n3793B06138a26488d1341n0802c2290A59668
18220F559P0720a57045L9036l7491J2953D0265Q8128J58045c2751l19889J29358
18209b23282A1864P4676M3940N6314b16769l5737p4313i7822q1436j20790g0852
$$ y = [-319689, 383157, -149550, -26286, -303101, -316764, -100269, 233201, -89274, 79622, 44713, 483176, 48227, 29447, -320135, -308257, 65852, 171153, -345341, -78976, -106039, 3193, -100673, -80045, 209217, -82288, -79294, -146616, -192709, -184566, -60838, 196508, 82953, 235289, -156645, -158663, -31734, 16165, -73334, -224985, -172849, -105428, 180548, -47335, 147122, -109111, 238129, -70125, -8580, 20373, -147209, 169240, 59147, -277750, 149338, -39380, -363170, -197984, 110862, -55475, -109268, 206138, -126488, -41341, -92143, -32290, 159668, 6559, 77279, -157045, -118009, -155500, -142547, 40265, 128393, 286438, -32751, -352640, -223282, 11864, 86540, 130480, 186794, -216769, -252506, -326819, -97822, -179258, -300048, -70852]
18197I9305b19005A21400m3098f4502r3678l3140L4959E81J81550h8274m5144
18186a33418j26197a18214B74293c9960H134a43121K0089M5786A38216F6156J50945
18175B17101c31452C5059O943K00938b50500a9997k99487h7031m1381L0498j28856
18164b26770j93519E6515b23286F4900A84L62138A6809a89597A4511J87198d5945
18152d2675C27837b39968f4083D2568J55080K8618C7599b44916C58152B6625j1691
18141A4934a20867L457n8132l4521c6268j8469J9262A41945a43816B21227a27311
18129d4121k06478m997a09413H4250a20935o2876b222j01810G7486B7451b25862
18117A08212a04952r2742F6919b51507d9389J5992B39913F8835a91365B44308
$$ y = [99305, -219005, 121400, 78302, -64502, -158180, -191320, -156361, 581, 182131, -88274, -133418, -259615, -118214, 274293, -39960, 8134, -143121, -123032, -77246, 138216, 66156, 217101, -331452, 35059, 42002, 242940, -250500, -19997, -319484, -87031, -128412, -97914, -226770, -420289, 56515, -223286, 64900, 184, 362322, 16809, -189597, 14511, 201709, -45945, -42675, 327837, -239968, -64083, 42568, 197648, 226266, 37599, -244916, 358152, 26625, 14934, -120867, -117410, -175542, -210063, -36268, -54737, -35475, 141945, -143816, 221227, -127311, -44121, -250599, -255596, -109413, 84250, -120935, -183811, -2222, -104032, 77486, 27451, -225862, 108212, -104952, -197694, 66919, -251507, -49389, -33397, 239913, 68835, -191365, 244308]
18106F9195J52662d16965J18520Q6459C15254O8514r6532Q1983C2521J09797a27700
18094b51388c6154j22156D2458a73272A24125g9975a8493A25052B9123b23299
18083C22277a04736G5158a1439j18925H0321B4848a05664k10528e7913j19610
18073a77523L2457C13795h2726j11176C55687e854p5805j24904Q1587i390B00760
18061A83836k6176K13073E0431b11182k99644h6866j57619e4530a6706m0963b1043
18049f6213m3965A43517J0927a4646A26735a1198j13418Q241A32374a49995N1242
18038i8753j73782J23972f4076j29767J0481A25940J35095B8045J75171D4311
18027c510j16066D5637d8443B84828a05952a8398k85469a21078Q804k1925q2492
$$ y = [69195, 221857, -416965, -298445, -211986, 315254, 383768, 287236, 369219, 32521, 142318, -127700, -251388, -36154, -158310, 42458, -173272, 124125, -79975, -18493, 125052, 29123, -223299, 322277, -104736, 75158, -11439, -130364, 80321, 24848, -105664, -316192, -57913, -177523, -145066, 313795, -82726, -193902, 355687, -5854, -81659, -206563, -124976, -9390, 200760, 183836, 157660, 370733, 50431, -211182, -510826, -86866, -244485, -54530, -16706, -57669, -21043, -66213, -110178, 143517, 154444, -14646, 126735, -11198, -124616, -116375, 132374, -149995, -98753, -272535, -148563, -64076, -193843, -183362, 125940, 261035, 28045, 203216, 44311, -3510, -119576, 45637, -48443, 284828, -105952, -18398, -303867, -121078, -112274, -134199, -216691]
18016b16691l1793A6715J43255c5811o1108c9345E1836b08864I391P3627a15287
18004a59564J8627j15400G3256d4767o2450A72377b80906l1784C22351b44977
17993A82565C0042E698b64325J21036H8975d4335a9192o7032A44105k294b17467
17981a25022B16155G2837K14959m3062a27900B18472j04153m0465b71823e5244
17970A18077A3564R1050a21057G2202i5865A26082c96456J54404A39526g0546
17959a79000j7053A84243a86367C8222b4769F3132N1270b70085G9874a31153E1246
17947G6972k8499J6557I661J7148K17473r0114K56740c37866d093r0155k0452
17936a14700E1130i0574A35698a84190M6152G3857f1458j13334o7979B3598J66016
$$ y = [-216691, -248484, 16715, 159970, -35811, -96919, -39345, 51836, -208864, 9391, 83018, -115287, -159564, -140937, -256337, 73256, -44767, -107217, 172377, -280906, -312690, 322351, -244977, 182565, 30042, 5698, -264325, -143289, 88975, -44335, -19192, -86224, 144105, 141811, -217467, -125022, 216155, 72837, 287796, 244734, -127900, 218472, 114319, 73854, -271823, -55244, 118077, 13564, 104614, -121057, 72202, -95865, 126082, -396456, -242052, 139526, -70546, -179000, -196053, 184243, -186367, 38222, -24769, 63132, 114402, -270085, 79874, -131153, 51246, 76972, 48473, 65030, 9661, 26809, 244282, 154168, 410908, -337866, -4093, -94248, -114700, 51130, -90574, 135698, -184190, -138038, 73857, -61458, -174792, -242771, 23598, 189614]
17925A89614c8467k03133C57745g5135G4811a0526k58745e6700k72288I9581c17507
17913C27277H0269O1731b1465j54132B3598d2668j54509A73652G360a19141H6481
17901F6805J40447D5693J77681N0869D0235i8549l865q6470L6036k2396e3548
17889b0559l64019h1349k1298q0524N359E033b40368A73137b40930A73953k2906
17878A51047b74151A21809b91219c7891j65960b4846a1541D7273g0333B50406
17867A90405b78021a20399b4981E7642c23116i2448A73944J69692b1137j23106
17857a44243A42277b55647B15641b16116d1666p2006B91709a82761f021j98869
17847b04890P6604D1464b96050R2943A17962J05285a04733l01746A56679b93526
$$ y = [189614, -38467, -241600, 357745, -75135, 74811, -10526, -269271, -56700, -328988, 99581, -317507, 327277, 80269, 142000, -21465, -175597, 23598, -42668, -197177, 173652, 7360, -119141, 86481, 66805, 207252, 45693, 223374, 274243, 40235, -98549, -102414, -188884, -152848, -175244, -53548, -20559, -384578, -81349, -102647, -183171, -177812, 5033, -240368, 173137, -240930, 173953, 151047, -274151, 121809, -291219, -37891, -203851, -24846, -11541, 47273, -70333, 250406, 190405, -278021, -120399, -24981, 57642, -323116, -92448, 173944, 343636, -21137, -144243, 142277, -255647, 215641, -216116, -41666, -113672, 291709, -182761, -6021, -204890, -128286, 41464, -296050, -203107, 117962, 223247, -104733, -406479, 156679, -293526]
17836B6997c67752A6315a19167A55635E1683B2145a70367B54396d03580J80591
17826b22989f5570I6073b14037B4448K165L9142a26544k03404B6061h0310K8259
17815e2051J7381G1830B0391M6952a20735g799B14898r5123B1072L3732K77256
17804C32060A8203a2230D1064J51378a65915b4316C19010A16253a72797A45064
17793a76960A39107O5201D0525d1520O16n7439f386A04806k8998P1876R0021G1950
17780A85757E9435a15965J634G0842O4127d8449F4710f7466A32527Q1227a05098
17768a57691K5137p671f0752M852C5612a92914C16804c1095G4321a53519O4471
17757h9048a6144A80962a90247A13476P4578m1971Q0673A07884d7354A27500J73738
$$ y = [26997, -367752, 16315, -119167, 155635, 51683, 22145, -170367, 254396, -403580, -222989, -65570, 96073, -214037, 24448, 26613, 65755, -126544, -329948, 26061, -80310, -52051, -34670, 71830, 20391, 67343, -120735, -7799, 214898, 119775, 21072, 54804, 332060, 18203, -12230, 41064, 192442, -165915, -24316, 319010, 116253, -172797, 145064, -176960, 139107, 204308, 40525, -41520, -40904, -98343, -6386, 104806, 75808, 147684, 237705, 71950, 185757, 59435, -115965, -114331, 70842, 134969, -48449, 64710, -67466, 132527, 213754, -105098, -157691, -132554, -140225, -60752, -55900, 35612, -192914, 316804, -31095, 74321, -153519, -89048, -16144, 180962, -190247, 113476, 188054, 146083, 226756, 107884, -47354, 127500, 301238]
17746C01238B8343b59310J4984f4624E8043J07287b89048R2777A07614d0643F6645
17734d0015l0374n1159c1872A44346C9851N3197Q1748D1574a0149B76487b97508
17722c803G2029Q3449P6778a48195j4637B51979C163f2031j74016R1479a7081
17710i1021l4983N6588B00036a08391j0525k18500o4638A48873k4860a30497e0895
17698G603f3350B02886a47974g754a227A31852L1980J5019a30398B4425b38836
17686a9291m6128j32156L5846A33971P1857b4724E8280a99323A65071a80952A87482
17674b66372d1780B38435b7818n9971K7589A57064a48700A37408a6550B39248
17663f1075a5505G9855P3894M9581a23935A58387j9932a12682a2456k89069E2587
$$ y = [301238, 28343, -259310, -244326, -64624, 58043, 165330, -289048, -196271, 107614, -40643, 66645, -40015, -70389, -121548, -31872, 144346, 39851, 93048, 174796, 41574, -10149, 276487, -297508, -3803, 72029, 155478, 232256, -148195, -162832, 251979, 3163, -62031, -236047, -144568, -17081, -91021, -126004, -69416, 200036, -108391, -118916, -337416, -402054, 148873, 124013, -130497, -50895, 7603, -63350, 202886, -147974, -7754, -1227, 131852, 163832, 178851, -130398, 24425, -238836, -19291, -65419, -197575, -161729, 133971, 205828, -24724, 58280, -199323, 165071, -180952, 187482, -266372, -41780, 238435, -27818, -87789, -60200, 157064, -148700, 137408, -16550, 239248, -61075, -15505, 79855, 153749, 203330, -123935, 158387, 138455, -112682, -12456, -301525, 52587]
17651a10785B98475b12920A16826Q6952b15069J02100B45144F8181a27375M8795
17641g8580p4169j16278C35225F229c9130J5372k21986C0992e5277B81585b87224
17629C02951d79332A93464I2570e14q4760r5450B33548A05242L0825L7250c93358
17617a16650C63600A33342E3160J21268L7773J88564b13074p1377J04733A69354
17606E8582a00968j13537A06480J62353A7103Q949O8560a21954F3412g1107L2703
17595c8404H493J8993Q9940d09876B4820a90m8719n3233b2791r2925H6267b38414
17582B1609J57680M0223H6345b0454j86093A30192A19a23443d9343k387l6074
17571h7804K5886B53397j7771d5946C19507a59900A10102m2296a20079I2545D5471
$$ y = [-110785, 298475, -212920, 116826, 203778, -215069, -112969, 245144, 68181, -127375, -78580, -152749, -269027, 335225, 6229, -39130, -23758, -245744, 30992, -55277, 281585, -287224, 302951, -479332, 193464, 92570, -514, -85274, -180724, 233548, 105242, 136067, 173317, -393358, -116650, 363600, 133342, 53160, 174428, 212201, 400765, -213074, -284451, -179718, 169354, 58582, -100968, -214505, 106480, 268833, 17103, 26052, 94612, -121954, 63412, -71107, -38404, 8493, 27486, 117426, -409876, 24820, -190, -48909, -102142, -22791, -115716, 86267, -238414, 21609, 179289, 219512, 86345, -20454, -206547, 130192, 119, -123443, -49343, -51730, -87804, -61918, 253397, 235626, -45946, 319507, -159900, 110102, 67806, -120079, 92545, 45471]
17559C10365a66205O5105k8546k2656b7775I6520h8618A3417P6743a48345c6737
17547A76283L46225a34546C10518j50889b02790h8819B51901b08257I8643Q196
17537A06839J70861q6977F1688k9664L2219a2963A99300r3681L54712c45818H1048
17525i8122D26833H8500a24392B35424n1975d9973j40093l3455j16637k5978B43589
17513I3562L97436I5682Q730c52685F2149A7629J79094J74409D4191a53495A51714
17501C61009c8154A90765b6455q909o8597B94449j20531N5304b49493a8620A01697
17489E9620K4275N4887a3251I3943a94603C29512a1049D2144K50196H1994a37693
17477H8023c49538H7754L10301j01390j20132g4995A76128m7807J41257B2404
$$ y = [310365, -166205, -101100, -129646, -152302, -27775, 96520, -88618, 13417, 90160, -148345, -36737, 176283, 522508, -134546, 310518, 159629, -202790, -88819, 251901, -208257, 98643, 106839, 277700, 190723, 61688, 32024, 64243, -12963, 199300, 105619, 460331, -345818, 81048, -98122, 426833, 88500, -124392, 235424, 183449, -49973, -190066, -223521, -340158, -366136, 243589, 93562, 490998, 95682, 104412, -352685, 62149, 17629, 196723, 371132, 44191, -153495, 151714, 361009, -38154, 190765, -26455, -35364, -103961, 294449, 173918, 229222, -249493, -18620, 101697, 59620, 83895, 138782, -13251, 93943, -194603, 329512, -11049, 42144, 292340, 81994, -137693, 88023, -349538, 87754, 398055, 296665, 176533, -74995, 176128, 128321, 269578, 22404]
17466a39911E3192M2504Q0018k1715i6436r9525A49788F6259K12399D7737h9063
17454A16809L18193A38113J60976l3578C8523N22248H3220J17729c4558B39404
17443B04360J59917j02325r6910k0131J76702r9171F8976N55819k07949A74121
17432e8248B14053k7882k4857P366D3174K80693J7167j03285d3940A66721L7218
17421B03939J43880A34304R1995J02323a11194A31096K00240A32250l9199K35085
17411C28136A50079C3910g2212I7497L11521a30130A47835K0975o1731J93182
17401C00261H8991M12882c421A09752B8713A918f2578A92562k6568L7867P0553
17390B74414a11502A48664a0676H9315g7449k35218A73861b94722J26623B67476
$$ y = [-139911, 53192, 95696, 175714, 153999, -96436, -195961, 149788, 66259, 278658, 47737, -89063, 116809, 435002, 138113, 299089, 265511, 38523, 560771, 83220, 200949, -34558, 239404, 204360, 364277, 261952, 165042, 144911, 321613, 222442, 68976, 624795, 416846, 174121, -58248, 214053, 186171, 161314, 168680, 43174, 323867, 341034, 237749, -43940, 166721, 203939, 347819, 134304, 226299, 328622, -111194, 131096, 331336, 132250, 93051, 328136, 150079, 33910, -72212, 97497, 409018, -130130, 147835, 168810, 107079, 300261, 88991, 501873, -3421, 109752, 28713, 1918, -62578, 192562, 165994, 203861, 274414, -111502, 148664, -10676, 89315, -77449, -312667, 173861, -294722, -168099, 267476]
17379G9390e8460C69596A10764K63140o3696H8383J23489l2212O5853j06324j0931
17368A28258f6840G1761a23000b774A43157m6992J62455R8343j48245e6825A01772
17356g4473a3240B76686a35850A51650J53525e9250B20730l9213K8236p2952d41104
17344C29192k8849A06700K82451A89913H3150j4487e8216j87412f4258B02866
17333A16247J44853i2000I2577J43321F5200J0427L33109G2632J83426A15379
17322D6849a1107R89A58519O7445q1171a83516j04213D05043k2392Q7158A07074
17310a9966I2240J65818M1313j48434K4456H0547j8783K10782H5367N0885Q4296
17299B20548N5809G1991R5528D0148K6435a97724A67125Q4687G0222N986c76707
$$ y = [79390, -58460, 369596, 110764, 373904, 310208, 88383, 211872, 179660, 245513, 139189, 128258, -66840, 71761, -123000, -2774, 143157, 96165, 258620, 356963, 208718, -56825, 101772, -74473, -13240, 276686, -135850, 151650, 305175, -59250, 220730, 181517, 209753, 136801, -441104, 329192, 300343, 106700, 389151, 189913, 83150, 68663, -58216, -245628, -64258, 202866, 116247, 261100, -92000, 92577, 235898, 65200, 75627, 408736, 72632, 256058, 115379, 46849, -11107, -10118, 158519, 225964, 144793, -183516, -287729, 405043, 382651, 469809, 107074, -19966, 92240, 258058, 299371, 150937, 175393, 80547, 61764, 272546, 85367, 136252, 220548, 276357, 71991, 167519, 40148, 66583, -197724, 167125, 251812, 70222, 76208, -376707]
17287F7406Q6228e2830n2707F9973J85694F1047b46944a15922A14229J11247K9924
17276B55400F6645e1566A12083l4967J47033J29908k0588r6838n7813J73754A04011
17264A81005K19712A70136Q5147j309A8958J41216a22566A82321h2025E7067L39894
17253C96961l5068l4152i9047E1461J28924a25853A76502C8470L76664E3880J60415
17242B14295A01992A1971h3958j8514A0040L1193L13247A40106K85818b27000
17231G4381e8615B23181R0765j34428a6271A87943f3910A47893J4610R3475E507
17219A97243l6603n9245J37636j06147m0616b5075A52362A391K20731N2532m1795
17208B32859F6452K40279P7114j04144N3753j17646r7438J38447l2986q2141C5652
$$ y = [67406, 153634, -52830, -105537, 69973, 255667, 61047, -246944, -115922, 114229, 225476, 255400, 66645, -51566, 112083, 77116, 224149, 354057, 333469, 236631, 178818, 352572, 104011, 181005, 400717, 170136, 255283, 253974, 18958, 160174, -122566, 182321, -82025, 57067, 396961, 361893, 327741, -99047, 51461, 180385, -125853, 176502, 38470, 415134, 53880, 214295, 101992, 11971, -83958, -102472, 10040, 41233, 354480, 140106, 425924, -227000, 74381, -58615, 223181, 313946, 179518, -16271, 187943, -63910, 147893, 162503, 255978, 5507, 197243, 160640, 101395, 239031, 132884, 92268, -25075, 152362, 1391, 222122, 274654, 232859, 66452, 306731, 383845, 279701, 333454, 215808, 118370, 256817, 223831, 141690, 35652]
17196B32505g6307F0218K79714j67678N1701i408L907H406c7821A94961E4625
17184B63460A14037J44391a15666A33884F2146J34277J89407A69054J53010J4345
17174C36409b85882G8343f6276A4306J38416K93835j40376j03866O9521K70979
17164E42815j68317A74397O5058f1971A84902L03189k6459c3527B84056j4858
17154B69198J46844p3083K12950k58023j10922I935L55997j34441K48109H6102
17143B25984r9307K26406n525j47895L7440j04123N3080g0086B09678n9560M3181
17132A93299R1491m9538J79526B01292L69035j83772R2685q1167M3731l7727K66284
17121F70361G585M33196L241j34101J5908D693J75787L0368I0487L82125c8811
$$ y = [232505, -76307, 60218, 339932, 172254, 223955, -9408, -5501, 8406, -37821, 194961, 54625, 263460, 114037, 258428, -115666, 133884, 62146, 196423, 385830, 169054, 322064, 336409, -285882, 78343, -66276, 14306, 152722, 446557, 306181, 202315, 271836, 542815, 374498, 174397, 239455, -61971, 184902, 488091, 461632, -33527, 284056, 269198, 416042, 342959, 555909, 297886, 186964, 9935, 365932, 231491, 479600, 86102, 225984, 126677, 353083, 347558, 199663, 237103, 132980, 186060, -70086, 209678, 150118, 193299, 284790, 235252, 414778, 201292, 570327, 386555, 479240, 398073, 441804, 404077, 670361, 7585, 440781, 444022, 309921, 325829, 4693, 180480, 210848, 90487, 472612, -38811]
17109B69518J34134j77332K23354j19408p53b03995C70763J01103j38681I1116
17098d9147C33141j41766l6031K09846k9722l2271Q2401e1998C68649j05690J44202
17087D07161A64580B0529M20967K73974B12119K94807p3886J54086k78132J67962
17077D76956j4768k20670N4408r0956J57576r36A7730h3147C57698J0569o6317
17066C01950K45786q2344o5455q7829K32097j48604j10398J95818J5310j46454
17056C49877j04811R3684K02681j59948A79614L28535k04488J1682J08483j60363
17046B63463L12479C7611L03959J77500r483N9008k23106J98830R3678k61010
17036C76987o4669J35713k6005K1959J40022j72798K66433C14431j03529M28437
$$ y = [269518, 403652, 226320, 449674, 330266, 329513, -203995, 370763, 471866, 333185, 91116, -49147, 333141, 191375, 155344, 365190, 335468, 303197, 385598, -51998, 368649, 262959, 407161, 164580, 20529, 441496, 715470, 212119, 506926, 433040, 587126, 308994, 476956, 462188, 241518, 295926, 204970, 362546, 361610, 17730, -83147, 357698, 368267, 301950, 547736, 465392, 399937, 312108, 544205, 395601, 285203, 481021, 496331, 349877, 245066, 338750, 541431, 381483, 179614, 508149, 303661, 315343, 423826, 263463, 575942, 37611, 341570, 519070, 509587, 568595, 345489, 544319, 637997, 376987, 312318, 448031, 422026, 443985, 584007, 411209, 677642, 314431, 210902, 639339]
17026F39339k50539n7311M02084B56646N30065j91581L4567j96569J44316J58187
17016G35631j82068N9696j04300J12856L4687K28555j01740j27124C05066M26921
17006G31987m7269q9961j96197M0587J98146K2599k02508M1220P336k23762L58829
16995F41007K18315l65709L56232m23144K9905K47771j60951j0121J6138k7879
16985E21564J68850k16241J71681j57097m9236K47828n5037K16362q0572N6653
16975H24755j26562k13454K78615j81099l0507K7778q0094L05231K3844L6831
16965H65338l6104N9194j67749N01220l68457J45834r629j12903J00253D53473
16954I23625D29556N27179l90218K65847n5042L31123j04158l0502K65926n17295
$$ y = [639339, 388800, 331489, 733573, 256646, 786711, 595130, 629697, 433128, 577444, 735631, 553563, 613259, 508959, 621815, 656502, 885057, 783317, 656193, 305066, 731987, 684718, 594757, 398560, 439147, 637293, 659892, 457384, 498604, 505940, 282178, 641007, 859322, 493613, 849845, 426701, 456606, 704377, 543426, 533305, 549443, 521564, 690414, 474173, 645854, 488757, 439521, 687349, 632312, 848674, 768102, 824755, 698193, 484739, 763354, 582255, 551748, 579526, 499432, 804663, 828507, 865338, 829234, 888428, 720679, 1221899, 853442, 999276, 989647, 876744, 976997, 453473, 923625, 429556, 956735, 566517, 832364, 777322, 1108445, 1004287, 973785, 1239711, 722416]
16944G22416m4004O47886j25979q4160j26249N0950R4982l01479M29803k39754
16934A024412k36745K89444j35253K53205j46516j60003q1191L05967J94583l49940
16924I57963M35696j24991j43657K08191Q0399k7230k83602L47619k72280L93317
16914A571425j38751k25467M39383j29623r6300J21100k07108J00676k3922o7126
16904A344287m5716K67992j27714j40228K00341K2834K15903k49779m2724J6235
16894A461431K6665M24530k36473q7638k84483K16365K7560j1125L53719k10066
16884A680485l9199L27958J23816n39997l0411J38610J6877J35139J85840j05746
16874A893372J15716J11813m3495j04899L32135j32334k19504L4570K72496j11578
$$ y = [722416, 678412, 1326298, 1200319, 1116159, 989910, 1040860, 1135842, 834363, 1264166, 1024412, 787667, 1077111, 941858, 1195063, 1048547, 888544, 807353, 1113320, 1307903, 957963, 1393659, 1268668, 1125011, 1333202, 1413601, 1386371, 1102769, 1450388, 1178108, 1571425, 1432674, 1207207, 1646590, 1516967, 1420667, 1541767, 1334659, 1435335, 1411413, 1344287, 1298571, 1566563, 1438849, 1298621, 1498962, 1521796, 1737699, 1487920, 1445196, 1461431, 1488096, 1912626, 1676153, 1588515, 1304032, 1520397, 1547957, 1536832, 1890551, 1680485, 1641286, 1969244, 2093060, 1553063, 1522652, 1661262, 1678139, 1813278, 1999118, 1893372, 2009088, 2120901, 2077406, 1972507, 2304642, 2172308, 1952804, 1987374, 2259870, 2148292]
16864B148292R7005j96185J96265R6680J46020R3341j74860J21559L987k42626
16854B289478Q4830L13622j15906Q0091k33609L22773l16167J16685M60572r7175
16844B905194N5127p0907J6241O7451J8641J04609N856L06253k30263K87875r7590
16833C368487J24432O6881J66124j72013K01706q682N7344J33684J78579R0597
16823D207139j9159L48375R088m3960K3304M6040L74440l01563L52318m32530
16813D563492L83700j14895M44217k21099J07147L60108N6366L01454P9319M5714
16803F005523R4976L93482K7296K5884J45776L81559P8540J33012K46568K51110
16793G783726R7761k41098L57173P02738j26348M05767M29357J83437M80607Q1143
$$ y = [2148292, 2245297, 2049112, 2245377, 2342057, 2488077, 2581418, 2406558, 2528117, 2532104, 2289478, 2374308, 2687930, 2572024, 2652115, 2418506, 2741279, 2425112, 2541797, 3002369, 2905194, 2960321, 2889414, 2905655, 2973106, 2991747, 3096356, 3102212, 3408465, 3178202, 3466077, 3368487, 3492919, 3559800, 3725924, 3553911, 3755617, 3746935, 3804279, 3937963, 4116542, 4207139, 4187980, 4536355, 4545443, 4501483, 4524787, 4570827, 4945267, 4643704, 4996022, 4563492, 4947192, 4832297, 5276514, 5055415, 5162562, 5522670, 5579036, 5880490, 5959809, 6005523, 6100499, 6493981, 6521277, 6547161, 6692937, 7074496, 7153036, 7286048, 7532616, 7783726, 7881487, 7640389, 7997562, 8700300, 8573952, 8979719, 9409076, 9592513, 10073120, 10154263]
16783A0154263J59118K54106L08885M62761K87568M07725L74014N545L75170N07959
16773A3297114J99726J066580N80927m7255O18962R51841N85261M74018L82704
16764A8109878O12076R13954J091611L23607J281406O38853J122158J045744J383597
16755B6522884P07812J301855J436567J625363J235065J618934J545215J747076
16747C7740771K252767K034670K044930K312892K902922L120107K975334L142598
16739E8526991L603303L715153M672021M218892M672216N292889N820584N474764
16731I5996813O780022P070973P163972P570210P936433Q174361Q721329P981134
16723A57395247Q164599P529079P132520O164822N069136L630768K387618M31643
$$ y = [10154263, 10313381, 10567487, 10876372, 11339133, 11626701, 12034426, 12408440, 12413985, 12789155, 13297114, 13496840, 14563420, 15144347, 15097092, 15716054, 16667895, 17253156, 17727174, 18109878, 18721954, 19635908, 20727519, 21051126, 22332532, 22971385, 24093543, 25139287, 26522884, 27230696, 28532551, 29969118, 31594481, 32829546, 34448480, 35993695, 37740771, 39993538, 42028208, 44073138, 46386030, 49288952, 52409059, 55384393, 58526991, 62130294, 65845447, 70517468, 74736360, 79408576, 84701465, 90522049, 95996813, 102776835, 109847808, 117011780, 124581990, 132518423, 140692784, 149414113, 157395247, 165559846, 173088925, 180221445, 186386267, 191455403, 195086171, 197473789, 197905432]
16715A97905432j135240k209796l521933n590684o038240p272269p587278q516857
16707A56033135q420523q038085q711086q126610p717944p299608o577150p142782
16699I3999347n868539n805134n125491m932550m387968m587079l733075l478854
16691E6080657l379163l464612k427307k737614k326879k120745j957806k166275
16683C5500256j616507j780219j963364p41091k075231p89933j906749m84893
16675B4142269j471048o73248q19342r82696j041164l44561r93709q50695n45602
16666A6420204p03742m01386m40137n56287o01076m07932l40213p52963m42633
16657A1773835j41528l28080l92986k66603n04403l33892m09397k82616j24393
$$ y = [197905432, 196770192, 194560396, 191038463, 185447779, 179409539, 172137270, 164549992, 156033135, 147612612, 139574527, 130863441, 122736831, 115018887, 107719279, 101142129, 93999347, 88130808, 82325674, 77200183, 72267633, 67879665, 63292586, 59559511, 56080657, 52701494, 49236882, 46809575, 44071961, 41745082, 39624337, 37666531, 35500256, 33883749, 32103530, 30140166, 29399075, 27323844, 26533911, 24627162, 24142269, 22671221, 21997973, 21178631, 20195935, 19154771, 18810210, 17816501, 16965806, 16420204, 15716462, 15315076, 14874939, 14318652, 13717576, 13309644, 12969431, 12216468, 11773835, 11632307, 11304227, 10911241, 10644638, 10140235, 9806343, 9396946, 9114330, 8989937]
16648H989937m59371m44241J43424j51931m87807J143l04254k88500K04339j59339
16638G043400k91753k30585k84806j48869J37307n4042o29886k04723K29306q4102
16628E481247m11596k13212J40080k32721N6262k38691k15048p8634L22757l46431
16618D264013M8311m5827n53753K01198j07011o1792k28071J61331j36171j54907
16608C387321j70258J97882n2203l48301Q9844O5138j71942j12361k51495J29475
16598B763100K78274k69857j50384L3833n7662l36166L8137M36469n56637K589
16588B181696L63371r7200j03226j16076J90613P076k79523k59003N3717J68573
16578B110018l19611M05418j26119k9609k26740K25513m0165n68311K27832K14140
$$ y = [8989937, 8530566, 8086325, 8229749, 8077818, 7590011, 7591154, 7286900, 6998400, 7202739, 7043400, 6751647, 6521062, 6236256, 6087387, 6224694, 6170652, 5540766, 5336043, 5565349, 5481247, 5069651, 4856439, 4996519, 4763798, 4820060, 4581369, 4366321, 4287687, 4610444, 4264013, 4312324, 4266497, 3712744, 3913942, 3806931, 3745139, 3517068, 3678399, 3542228, 3387321, 3217063, 3414945, 3362742, 3014441, 3104285, 3169423, 2997481, 2885120, 2633625, 2763100, 3041374, 2771517, 2621133, 2654966, 2597304, 2261138, 2299275, 2735744, 2179107, 2181696, 2545067, 2447867, 2344641, 2228565, 2419178, 2426254, 2146731, 1887728, 1941445, 2110018, 1790407, 2195825, 2069706, 2040097, 1813357, 2038870, 1998705, 1430394, 1658226, 1872366]
16568A872366J06120m57900L53159j06385m03728L01245k98057o210J73215k2346
16558A511479j81781K00554k5028l21420M6565L18857q9879j70798o6785Q6450
16548A308214j17402j51893p151J05025n9135r0230J71333K44806j63733L9122
16538A278956m24297K07875j67983J00134J01246k50402M3499K08163R0709k16683
16528I71217l8738J69829q2085k20994P7411L4007o5868K02700l832K2080j79886
16517H85841M4790k05901J59917P197C71873M09317j54406K81095l09123r4408
16507E04348L48827j97327L0474j90966J32643n9027M7202J01658N4721M465K1906
16496G98924p1715N3466L3010l16560O2903l8868J17268j80036K81964l3187k36450
$$ y = [1872366, 1978486, 1520586, 1873745, 1767360, 1363632, 1664877, 1366820, 1360610, 1533825, 1511479, 1329698, 1530252, 1505224, 1183804, 1230369, 1549226, 1459347, 1288549, 1221764, 1308214, 1190812, 1038919, 1031768, 1136793, 1077658, 987428, 1158761, 1403567, 1239834, 1278956, 854659, 1062534, 894551, 994685, 1095931, 845529, 889028, 1097191, 1187900, 971217, 932479, 1102308, 1020223, 799229, 876640, 910647, 844779, 1047479, 1043647, 1065727, 885841, 930631, 724730, 884647, 891844, 371873, 781190, 626784, 907879, 598756, 504348, 853175, 655848, 686322, 495356, 627999, 568972, 616174, 717832, 772553, 777018, 798924, 727209, 780675, 813685, 497125, 560028, 521160, 638428, 458392, 740356, 707169, 470719]
16485D70719L2988j76763L34927k74488m2037K20771O6752p9752q6009j12145
16475C54963L53791k06341K71148k61256j99419J64624K11745j71609o708q4943
16465D25995o3085K94090p1178L9133j2504r3265B10918J13186p9530M46523B24845
16453C67724I1805J38168K95650j43847L7783M8561j29487Q5725K11217l08730
16443C26845l321o8627M6944K44448j58194J46935B57841m4957H1684K41002J77568
16432E00254P3666k72363P702q1941J74833j07602O9812L0550n6645P7020j07017
16421C08269A44011J43044N7560J92510B54986H0808K75710J25875j83808J78056
16411D76641B09624p0675P0655Q4885q5640M89276l39582A49282N3937m7929D2269
$$ y = [470719, 503707, 326944, 661871, 387383, 345346, 566117, 632869, 553117, 467108, 354963, 708754, 502413, 773561, 512305, 312886, 477510, 689255, 517646, 510938, 425995, 362910, 657000, 585822, 624955, 612451, 519186, 210918, 324104, 244574, 691097, 224845, 367724, 91805, 229973, 525623, 381776, 419559, 468120, 338633, 424358, 635575, 326845, 323524, 254897, 301841, 546289, 388095, 535030, 257841, 212884, 81684, 322686, 500254, 573920, 301557, 309259, 227318, 402151, 294549, 364361, 394911, 338266, 415286, 308269, 144011, 287055, 344615, 537125, 254986, 80808, 356518, 482393, 298585, 476641, 209624, 138949, 209604, 294489, 208849, 698125, 358543, 149282, 203219, 155290, 42269]
16399F6841L62807B9016N4431j7648L31698m1789j63925N4664R4q6490J13243
16388B73294j09028N2839K1497p5399J1813J21428o6410J51785j64482K39942
16378D57279A24311l0518B1193J45520K14862j51734J74000E8749J9909Q1464
16368A60122A7075J3699j4284J16942Q3531K66288j77648A38477h2444j1350B21637
16356D124J99045A01123a65313E4132N6438R690K19115A2721a000A29880M5411
16345A75291a0316A00305J36639r2984o4689J05129G2884M11994B15063K0333
16335B35396G8166C2743K13126K23877I7163J20531C7239K48155A15431h6817
16324a4490E07169a04895G6583K33383K25405j18932k3827j39360K23204A51903
$$ y = [66841, 429648, 29016, 83447, 65799, 397497, 355708, 191783, 246447, 246541, 160051, 273294, 164266, 217105, 238602, 163203, 175016, 296444, 230034, 381819, 217337, 457279, 124311, 93793, 21193, 166713, 381575, 229841, 403841, 58749, 78658, 160122, 17075, 30774, 16490, 133432, 216963, 483251, 305603, 138477, -82444, -93794, 221637, 4124, 203169, 101123, -165313, 54132, 110570, 120260, 339375, 12721, -1000, 129880, 175291, -10316, 100305, 236944, 143960, 79271, 184400, 72884, 484878, 215063, 235396, 78166, 32743, 245869, 469746, 97163, 217694, 37239, 285394, 115431, -86817, -14490, 507169, -104895, 76583, 309966, 535371, 416439, 392612, 253252, 476456, 151903]
16313B11512m4147i929D21918A06278N8603p2048J44478B6137K43523D9687J44679
16302A94366G8821i6478B19287i9596n9098A09828l13J33475A1481J24513O2336
16291A98330J9701a92684A48265m9665a7291I4270e7874A03352a4237B08172e8722
16279b03312D13840A42365d8849H9039J47188r9879L7000a96573A26887h3234
16268A06812A5375J2996b04294A82576b3948A3470R7709a27468j81628J44759
16258a64337O9776j06896k2394B25272D1357J34325j5854b93909A88756J12955
16248C01711F1194c372C8243a30357A82536L8849c3647C82995A6543d3035I5818
16236f6415o021H0988J2570a0303D33661C3567a96686E7192a47915j75392A90716
$$ y = [211512, 167365, -9929, 421918, 106278, 164881, 92833, 237311, 26137, 269660, 49687, 194366, 78821, -96478, 219287, -99596, -158694, 109828, 109515, 242990, 11481, 135994, 198330, 218031, -192684, 148265, 98600, -17291, 94270, -57874, 103352, -14237, 208172, -58722, -203312, 413840, 142365, -48849, 89039, 236227, 136348, 173348, -196573, 126887, -83234, 106812, 15375, 28371, -204294, 182576, -23948, 13470, 111179, -127468, -309096, -164337, -94561, -201457, -223851, 225272, 41357, 175682, 159828, -293909, 188756, 301711, 61194, -3372, 38243, -130357, 182536, 221385, -33647, 382995, 16543, -43035, 95818, -66415, -72436, 80988, 93558, -10303, 433661, 33567, -196686, 57192, -147915, -323307, 190716]
16224b91648a20938b8054A50265m9952J52874J29024b59893E405c2356l71352
16214d03708A35486b98600A88422N1414J61584a86113A18818J013a28699A80125
16203B06143d5747j62801d5399A8294c3409A22767k2551a97231i3700A04981R3754
16192A98735G6711A5203K66528E9287L83607G9683a26518A47536P8927a02201
16181H2688a66548D17094j87026d8107C3366b89583M3228A4678K05583b8244n0651
16170g8895j08239J6177M215j0926B34491M9594a33270L3207K4669C6337J25719
16159A62056n2944e8314A10136Q3291e265C67092c42843F3318b62630A67900q1984
16148H5916g4579n6380l0790P9496l64959b18445c6210H1938M027d5772E8415
$$ y = [-291648, -120938, -28054, 150265, 100313, 253187, 382211, -259893, 5405, -32356, -403708, 135486, -298600, 188422, 239836, 401420, -186113, 118818, 119831, -128699, 180125, 206143, -45747, -208548, -45399, 18294, -33409, 122767, 100216, -197231, -93700, 104981, 198735, 76711, 15203, 281731, 59287, 442894, 79683, -126518, 147536, 226463, -102201, 82688, -166548, 417094, 230068, -48107, 33366, -289583, -246355, 14678, 220261, -28244, -78895, -187134, -170957, -166742, -177668, 234491, 284085, -133270, -100063, -75394, 36337, 162056, 109112, -58314, 110136, 193427, -5265, 367092, -342843, 63318, -262630, 167900, 85916, -74579, -130959, -161749, -82253, -447212, -218445, -36210, 81938, 85965, -45772, 58415]
16136D69003a2633j28335k55966c4590B77265j7070i0228A7440J77909F9497c56430
16124A97291H2740k16O4719d8893D50893A50181b4599k9309K1007k37968a08659
16112B7191b11940f0151A72492F9615q076e4293p7374B10369k8304a58535K0629
16101a37906A64125N2905n258j2434a62728n0299A08361c24422f9952k09782O5643
16090b14091a03246L6135j00117C05718c08528g6647A47365A1048N8733J48505
16080B18286E6027K20504B0479a67054P5094A51138J9863K22916a20060j7158
16070a37218e7640B64856I9933a79416j06324G7841J49245G4885b2903A95269
16059b16416N8900n3975C13326b29503P4982G5177f8906G1177A5079a55642d0294
$$ y = [469003, -12633, -140968, -396934, -34590, 277265, 260195, -90228, 17440, 195349, 69497, -356430, 197291, 82740, 82524, 147243, -48893, 450893, 150181, -24599, -53908, -32901, -270869, -108659, 27191, -211940, -60151, 172492, 69615, 61539, -54293, -131667, 210369, 182065, -158535, -137906, 164125, 217030, 211772, 199338, -162728, -213027, 108361, -324422, -69952, -279734, -214091, -103246, -67111, -167228, 305718, -308528, -76647, 147365, 11048, 69781, 218286, 56027, 276531, 20479, -167054, -91960, 151138, 171001, 393917, -120060, -137218, -57640, 264856, 99933, -179416, -285740, 77841, 227086, 74885, -22903, 195269, -216416, -157516, -211491, 313326, -229503, -154521, 75177, -68906, 71177, 15079, -155642, -40294]
16047i2126o7029A9814J36186p6440a5170l06609B97426a36273N958M3040K1668
16036f5607L0406D3132K46084a33681L4511m3475I6900B2285c47426A27524O7350
16025A94874n7933n4723b42403a13809F3471c50779C26110a95152i2391A36512
16014c60505a2372m56412f8304A6162J16683E4456J0020a10021A59449m8209k5430
16003H5810O5654e8104p7461d4485n7632A17550b69989A69971L7022a17358l1546
15992a48904j87969i4757C26674a87025r3665C5394p930J04634J41405J07724
15982C81227K6825A79549J6308J3454J38923B361J28973k5626E1138b90202E4394
15970i7478B3485g0815D9787J5433d4542A84369D2944a51894C3612J551a19846
$$ y = [-92126, -159155, 19814, 156000, 79560, -15170, -321779, 297426, -136273, -130315, -87275, -65607, -35201, 43132, 289216, -133681, -99170, -142645, 96900, 22285, -347426, 127524, 194874, 136941, 82218, -242403, -113809, 63471, -350779, 326110, -195152, -92391, 136512, -360505, -12372, -468784, -68304, 16162, 132845, 54456, 64476, -110021, 159449, 111240, 85810, 151464, -58104, -135565, -44485, -102117, 117550, -269989, 169971, 206993, -117358, -148904, -336873, -94757, 326674, -187025, -280690, 35394, 27464, 132098, 273503, 381227, 408052, 179549, 195857, 209311, 348234, 2361, 131334, 105708, 51138, -290202, 54394, -97478, 23485, -70815, 49787, 65220, -44542, 184369, 42944, -151894, 33612, 35163, -119846]
15958B31955i4535c5644I0811e2651A76460a16588r1414A5763b70196f0458B2090
15946a00048B2468M616J32501a31037l7770m5246R2068k46283J52685r7009c3662
15934d0123j62137Q2657H3422b9776A67287q1347a1630j48958A7941a2501A1854
15922D5382a10484j51976B9455L2872K70668r9710b6080j84520b9704j12582B15801
15910f7482J60o1696k33909J67844j36726A2420a07918A40706J27496D0665A5090
15898B03858i0044E177f7433c2172B63135B8509J44481a56088k53569g3696O699
15887f6997m3539A25270n5671A071J3933i2818o142K079E2671a53704d1703q4068
15875a25771A95738c06118J38481j64167e1384k04649c9561k73088D9504P759
$$ y = [231955, -94535, -35644, 90811, -52651, 176460, -116588, -208002, 15763, -270196, -60458, 22090, -100048, 22468, 27084, 159585, -131037, -168807, -214053, -121985, -368268, -215583, -312592, -33662, -40123, -202260, -119603, 83422, -29776, 167287, 85940, -11630, -160588, 17941, -12501, 11854, 45382, -110484, -262460, 29455, 62327, 332995, 233285, -26080, -210600, -29704, -142286, 215801, -67482, -67322, -129018, -362927, -195083, -331809, 12420, -107918, 140706, 268202, 40665, 15090, 203858, -90044, 5177, -67433, -32172, 263135, 28509, 172990, -156088, -409657, -73696, -66997, -110536, 125270, 69599, 1071, 15004, -92818, -98960, -96881, 52671, -153704, -41703, -125771, 195738, -306118, -167637, -331804, -51384, -256033, -39561, -312649, 49504, 57263]
15865E7263J34250d9324b0576h9q1237A01640B8348b67158k7669b4626F3787J85354
15853B49141B2671a68865A19464b67379G0582a63360G3249P3897c60349a38183
15842D5629a61580E6154i7704C1824b6510A49287c2286j77493o2975g3309G9717
15830b50032c4134q9303B50006a06183B73439j36160g2341A33358a27321d6804
15819h8076c4604J4770j71270A0010b77564j9718e0538A6548L4313K5904c03408
15807b44103n938G4753b04722A24185J6151d8434B67809d05667G701a96215m4399
15796b40614c2768H3327i6204n4847o7188D8563Q9710J10021H7697h4123A51685
15784b31237J05126A93908d4393A36624J02912i2016c2450p7598B1571e1273A25229
$$ y = [57263, 191513, -49324, -20576, -89, -81326, 101640, 28348, -267158, -294827, -24626, 63787, 249141, 22671, -168865, 119464, -267379, 70582, -163360, 73249, 147146, -360349, -138183, 45629, -161580, 56154, -97704, 31824, -26510, 149287, -32286, -209779, -272754, -73309, 79717, -250032, -34134, -123437, 250006, -106183, 273439, 137279, -72341, 133358, -127321, -46804, -88076, -34604, -19834, -191104, 10010, -277564, -297282, -50538, 16548, 50861, 76765, -303408, -244103, -250041, 74753, -204722, 124185, 140336, -48434, 267809, -405667, 7701, -196215, -240614, -32768, 83327, -96204, -151051, -218239, 48563, 138273, 248294, 87697, -84123, 151685, -231237, -126111, 193908, -44393, 136624, 239536, -92016, -32450, -110048, 21571, -51273, 125229]
15772B48424c6070r742a5970q446j48655j42156H2307a08096b9376D2208M6042
15761H8250C2394a23168A97362f5330D8804J03858G3594a70267M2094E5062b25728
15749B31389O4032b47467h2795k5356G6677L05292e8602A01923b75330I1118a63418
15737a34011m6959D98J22664E9778M3938b87410l0789J49031e3554j66829F5194
15725a99749j6460m8134b314G2288Q5774a09095H750b73875c584A9300e00700
15713c10041B27091m8756b60314G5561h240j50463A41284A5041b82575F6066a76385
15701A7796J92286a70093n8526R6107D802a00897j08448O6620D33015c1014k85021
15690c16035i0178A16453n7804b28077C11679I2286q748K98032A2374J13235h65
$$ y = [248424, -36070, -45812, -15970, -24416, -173071, -315227, 82307, -108096, -29376, 42208, 88250, 32394, -123168, 197362, -65330, 48804, 152662, 73594, -170267, -128173, 55062, -225728, 231389, 295421, -247467, -82795, -108151, 76677, 381969, -58602, 101923, -275330, 91118, -163418, -134011, -180970, 498, 123162, 59778, 103716, -287410, -318199, -169168, -53554, -220383, 65194, -199749, -216209, -264343, -2314, 72288, 158062, -109095, 8750, -273875, -3584, 19300, -500700, -310041, 227091, 178335, -260314, 75561, -8240, -158703, 141284, 15041, -282575, 66066, -176385, 17796, 210082, -170093, -228619, -132512, 4802, -100897, -209345, -142725, 433015, -31014, -316035, -90178, 116453, 58649, -228077, 311679, 92286, 83538, 381570, 12374, 125609, -865]
15678A32818i1736k1174B05118A0068J48987a58951b6123G0482j5298d4618B46293
15666e1870F5880h7930j26436A63606J760B2094E406b98575M1899B89342h4256
15654a45305l2944A5997a06742d1663A50969J16444b24313B06538e374p7863B1309
15642C61621C0044b00339f1720j77528F6184M6473a35721C4784e9456o7127I1557
15630a09485M8277p3613j24465J04932A6145h5759B04180A8681J9728J84252f243
15618e1335A10455j7812c42976a38305m3929A97229b62951R4872f4466B46502
15607A6172o809N8732a0468D1172M55L2455b28309j66291d2441C08321D6674P7973
15595A24647f7632n6639l4736d577A90395K3830d48108A19314Q27b21917G8720
$$ y = [132818, -91736, -112910, 205118, 10068, 159055, -158951, -26123, 70482, 55184, -44618, 246293, -51870, 65880, -87930, -214366, 163606, 165366, 22094, 5406, -298575, -256676, 289342, -84256, -145305, -178249, 15997, -106742, -41663, 150969, 267413, -224313, 206538, -5374, -83237, 21309, 361621, 30044, -200339, -61720, -239248, 66184, 112657, -135721, 34784, -59456, -126583, 91557, -109485, -61208, -134821, -259286, -154354, 16145, -85759, 204180, 18681, 38409, 222661, -6243, -51335, 110455, 92643, -342976, -138305, -182234, 197229, -262951, -168079, -64466, 246502, 16172, 9363, 68095, -10468, 41172, 41627, 74082, -228309, -394600, -42441, 308321, 46674, 124647, -67632, -124271, -159007, -4577, 190395, 214225, -448108, 119314, 120141, -221917, 78720]
15583b04019C66700b18576D07079f0560j95888J4400k5229C55358H2455N2147
15573A34602a99293c1956k84183B64196b08740a9906k91257F3300B8470e18482
15562a26564A39786J8708e8334A18788O8696a12663B04127b8527m7426D7532r094
15551C8438a4486n7578o7412A1294L43567A49109a52107B5049b86458F003d176
15539d540j82351F1815L31316F7658b6182I7344a21626A76057a55224j28174A7346
15527h6366k7137A39342B2839a63400B1782d7156B46039g0757a7794F0978a032
15515G1571a33948B16130c83194C50088G5715e8142j32266a3027B38365a08829
15504A71854b3189H0307e31106g623r690C47460j50591p3763N7856D8960L13300
$$ y = [-204019, 366700, -218576, 407079, -60560, -256448, -242048, -267277, 355358, 82455, 134602, -199293, -31956, -316139, 264196, -208740, -19906, -311163, 63300, 28470, -518482, -126564, 139786, 158494, -58334, 118788, 187484, -112663, 204127, -28527, -75953, 47532, 38438, -14486, -72064, -139476, 11294, 354861, 149109, -152107, 25049, -286458, 6003, -4176, -4540, -186891, 61815, 393131, 67658, -26182, 97344, -121626, 176057, -155224, -283398, 17346, -86366, -113503, 139342, 22839, -163400, 21782, -47156, 246039, -70757, -17794, 60978, -1032, 71571, -133948, 216130, -383194, 350088, 75715, -58142, -190408, -13027, 238365, -108829, 171854, -23189, 80307, -531106, -7623, -17313, 347460, 196869, 123106, 180962, 48960, 362260]
15493C62260e35782b4778k28133F447i6433j8109D4684a83941B15862r14a4099
15481a31159I2034J65821a28249M0501C66424d1445k4635b6287j21854F3753P4436
15470A38189q300b21069f3828C47589j49700p9923i7683a637A36425d1496j0902
15459e2398k20175C16115b9205m0563j32026C63090c11393j46823C04451d5602
15448A08783D3306L8588O3315B6680L0786K077a95343L9978B21270a56963A16684
15436C5313d27174a09772d3958j45283o2731D6273I005f6699B87524j41674f4845
15424f7365j20246K1663I9666h9410b7177E5174d5792k29821I5663d4813A8198
15412i789k08023A3153a28032A2176c6253k91966l8434A37051k4700p881b02837
$$ y = [362260, -535782, -24778, -252911, 6447, -96433, -114542, 44684, -183941, 215862, 214948, -14099, -131159, 92034, 257855, -128249, -87748, 366424, -41445, -66080, -26287, -148141, 63753, 138189, 129889, -221069, -63828, 347589, 197889, 117966, -97683, -1637, 136425, -41496, -52398, -272573, 316115, -29205, -69768, -201794, 363090, -311393, -458216, 304451, -45602, 108783, 43306, 81894, 145209, 26680, 57466, 59543, -195343, -155365, 221270, -156963, 116684, 35313, -427174, -109772, -43958, -189241, -251972, 46273, 9005, -66699, 287524, 145850, -64845, -67365, -187611, -165948, 99666, -89410, -27177, 55174, -45792, -275613, 95663, -44813, 18198, -9789, -217812, 13153, -128032, 12176, -36253, -328219, -366653, 137051, 112351, 104470, -202837]
15400E1658K63156b40739g8230j64734D3815g9966k47984A59724o9793K28346
15390C18277A00617D8204Q8533D5339J86476j12223C8617K16162b0332j54419
15380a74751i294A12901J69259A20123e7827G5331a04451c7113k1003A55637a53638
15368a16760A00857C4739P5254b27681Q9762L3404B27205j1511E0550b80500F2503
15356e782j1994K520k99204H1539b44253e6191A67092d41106a78247B74955F8837
15344B25922c45350e8740j41414i8728E2968Q2541D8207K24458D0175M9403J13071
15333B02649c9991A95463C0684K22831a37485O7177q0874C18216B6673N1666e4427
15321A06858J4722f9799A20166a4732M37B48608a43169c7592q1320j68679C58418
$$ y = [51658, 314814, -240739, -78230, -242964, 43815, -79966, -327950, 159724, 89931, 318277, 100617, 48204, 136737, 45339, 231815, 119592, 38617, 254779, -20332, -174751, -9294, 112901, 282160, 120123, -57827, 75331, -104451, -37113, -58116, 155637, -153638, -116760, 100857, 34739, 109993, -227681, -137919, -104515, 227205, 215694, 50550, -280500, 62503, -5782, -17776, -15256, -314460, 81539, -244253, -56191, 167092, -441106, -178247, 274955, 68837, 225922, -345350, -58740, -200154, -98728, 52968, 135509, 48207, 272665, 40175, 89578, 202649, -39991, 195463, 30684, 253515, -137485, -70308, -151182, 318216, 26673, 78339, -54427, 106858, 121580, -69799, 120166, -14732, -14295, 248608, -143169, -37592, -118912, -287591, 358418]
15309B2536b02392A01761P8647C5711c37989a42404p328A05594k6364B1916c06904
15297E9484b12486F5192f9935q9153J1887j03898A19839B8233b86679A17817a25247
15285A77230c4380q6095E0849b97030i7056A98276G6642L3824O7520l1602j6068
15274A30316m7922P3847f195A45587A6014a52487e2825C71643A63785J9742a06949
15262b0559B3474P8546J56677a4778D0933J7440M1514J31793C8399K52630Q878
15251B99907M5122A23723M84441P53033k79222O7453P4050l56880l18129k16289
15241C32180f0629m6865B56753J76904b77879A01849h2912A40412o8059b6165
15230B19625I8234N3015p4321M3490e0364E2713K2063K86672g4728B68976E6518
$$ y = [22536, -202392, 101761, 180408, 35711, -337989, -142404, -149732, 105594, 79230, 21916, -306904, 59484, -212486, 65192, -69935, -159088, -147201, -251099, 119839, 28233, -286679, 117817, -125247, 177230, -34380, -120475, 50849, -297030, -97056, 198276, 76642, 110466, 177986, 146384, 130316, 82394, 156241, -6195, 145587, 16014, -152487, -52825, 371643, 163785, 183527, -106949, -20559, 23474, 102020, 258697, -14778, 40933, 58373, 99887, 231680, 38399, 291029, 299907, 345029, 123723, 608164, 1361197, 1081975, 1149428, 1223478, 866598, 548469, 332180, -60629, -107494, 256753, 433657, -277879, 101849, -82912, 140412, 72353, -26165, 219625, 98234, 151249, 76928, 120418, -50364, 52713, 74776, 361448, -74728, 268976, 56518]
15218A35048g4046H274R5399d6454k1313C09914h1780k40111A67893a82170k05281
15207c87451i4474I8166g1368G1339J07914a18881C79774a89772C1073R1681K2143
15196A44897o4556R2951p7188J9899f7942c3695D5139K71577j24010d8093B14163
15184B08535b5840G6213a6153A24748a41167B08836h3857k01076B93648A14691
15173b55279R3884F1420N0067B5823h9971c5674A57055q682l1812a72458A01028
15161C4249L65693A10610C9075a09376C51573a36058D47824f1679o5899A34692
15150C00009F7933O6253m8293a25525d5196n484r3405A3680O4753L2962L45501
15139D56896b13780A55706O9229q3366L0369Q4683j1779F8587A0026Q8923J73119
$$ y = [135048, -74046, 8274, 103673, -46454, -67767, 309914, -81780, -321891, 167893, -182170, -387451, -94474, 98166, -71368, 71339, 179253, -118881, 379774, -189772, 31073, 122754, 144897, 80341, 173292, 96104, 116003, -67942, -33695, 45139, 316716, 192706, -48093, 214163, 208535, -25840, 76213, -16153, 124748, -141167, 208836, -83857, -284933, 293648, 114691, -255279, -161395, 61420, 111487, 25823, -89971, -35674, 157055, 148373, 116561, -172458, 101028, 34249, 399942, 110610, 39075, -109376, 351573, -136058, 447824, -61679, -127578, 134692, 300009, 67933, 134186, 85893, -125525, -45196, -50680, -144085, 13680, 78433, 111395, 456896, -213780, 155706, 224935, 141569, 171938, 256621, 244842, 68587, 10026, 98949, 272068]
15128B72068k9627D8802L0797J65942J16595p1988b01761I4735J2463B4931b10232
15116C3033J35993j2516a97607A76724O9639J08055J3170D353K61158A16679L28209
15105D44888A86126H6953a22025B93513k4045a34117A78941P8738J90134G2774
15094a66352N0526H9058K99212A57628c585C95430A12821c828C51077b16453I984
15082G5606J48352C1849K15610c2381B54758q9293R6619e8094E2737K60014E0421
15070A22776J25262K02952e32l1456j6691A15149K12953d6521k07363B77961K9361
15059C07322c0482C946a6617A56902h1297B77090m8951H0648J32748F3083J3402
15048G6485P7685J51069h1153q351E1942f5861L0830k4772D34131H5462Q5419
$$ y = [272068, 242441, 48802, 79599, 245541, 362136, 290148, -201761, 94735, 107198, 24931, -210232, 33033, 169026, 156510, -197607, 176724, 246363, 354418, 367588, 4353, 265511, 116679, 444888, 186126, 86953, -122025, 293513, 269468, -134117, 178941, 257679, 447813, 72774, -166352, -115826, 89058, 388270, 157628, -3585, 395430, 112821, -3828, 351077, -216453, 9984, 75606, 223958, 31849, 247459, -32381, 254758, 165465, 262084, -58094, 52737, 312751, 50421, 122776, 248038, 450990, -532, -31988, -48679, 115149, 328102, -46521, -253884, 277961, 307322, -30482, 3946, -16617, 156902, -81297, 277090, 228139, 80648, 213396, 63083, 76485, 154170, 305239, -81153, -89504, 51942, -65861, -35031, -59803, 434131, 85462, 170881]
15037A70881C3564J91823M9852Q5124E9414J97943H4890Q504L4609l0528K20970
15026C18445J8378j18718K66015A75775P3627c06867A84263M3088A00541M7094
15016A47635J6953a08336B53681e0959G9329K8529J15379a8287A34898m9349C2948
15004B22101b08103O7989A4595L53737Q9982R6488B08627F9688O574K88019j44599
14993B19682r3057A565J20077J26485A6421J57929D4488J21470N4978L02343q4254
14982D39025a09510r372a7456q7071B37082q3588L6503R2976J067G7634J10056
14971A87690K65124A80189p7005J75314A0866a42969B24010N5105k9099F9827
14960D6065L21702b51510D70210B10788K10530F8709K58866G0181J7998K2629
$$ y = [170881, 33564, 225387, 275239, 360363, 59414, 257357, 84890, 93394, 128003, 97475, 318445, 336823, 218105, 484120, 175775, 249402, -306867, 184263, 227351, 100541, 147635, 164588, -108336, 253681, -50959, 79329, 107858, 223237, -18287, 134898, 85549, 32948, 222101, -208103, -140114, 14595, 368332, 458314, 554802, 208627, 69688, 76262, 364281, 219682, 126625, 1565, 121642, 248127, 16421, 174350, 44488, 165958, 220936, 523279, 439025, -109510, -118882, -17456, -104527, 237082, 153494, 189997, 282973, 284040, 77634, 187690, 452814, 180189, 103184, 278498, 10866, -142969, 224010, 279115, 250016, 69827, 46065, 367767, -251510, 470210, 210788, 421318, 68709, 327575, 70181, 88179, 110808]
14950A10808J38579d07j00378K4958D2528M2782n539c4216B22951G5069J65980
14939B41049j08106J10544A20893J55702r9249D2048L00060A53018K74122j45167
14929B81973d3465C94902p100j69324J26744Q6173Q7698B09064K9530J78963B499
14917H8026L59453A20808J88727J11370J21455J86838D2843R3514K44976A59992
14906C64386k2731O7950r8690A45090J14570K42395k50054Q0230o4274P4301A35051
14894a0015C35682l7891j17253K15798m028j64334J5503A15283J14393o2154K49462
14883D16984C6728K11385j6785L14973k50450j00257N38566H79K14243K48861
14873D63983j42920J12359j9129A88128J87939o6106k5k7170n7587K73160N3710
$$ y = [110808, 249387, -407, -100785, -75827, 42528, 85310, 79771, -34216, 222951, 75069, 241049, 132943, 243487, 120893, 276595, 177346, 42048, 342108, 153018, 427140, 281973, -43465, 394902, 387802, 218478, 345222, 431395, 519093, 209064, 238594, 417557, 2499, 88026, 447479, 120808, 309535, 420905, 542360, 729198, 42843, 136357, 381333, 159992, 364386, 341655, 409605, 310915, 145090, 259660, 502055, 252001, 332231, 267957, 342258, 135051, -10015, 335682, 297791, 180538, 396336, 392308, 227974, 243477, 115283, 229676, 167522, 416984, 36728, 248113, 231328, 546301, 295851, 195594, 734160, 879, 215122, 463983, 321063, 433422, 414293, 188128, 376067, 309961, 309936, 282766, 225179, 498339, 552049]
14862E52049H9315M53946A92825L7362J12189j43432N6189P3136j00233l5439
14852A92597K27264L039J6937A74995Q1125r2123M31799B64191G2593K60845J85475
14841E18913k13674L25319j68790o1586j9024j55875M34315k23576j24654N6663
14831C68031n0044k534J08762l3654p1749o0057O9763J55509J20098j55492p206
14820D41427K59630C21068J04672J20343E5055B0670J86657n0986M69981q5646
14810E40676A80399N20617k59754G2868L13740j9806r2640o3324K44690K1304
14800D76832L31933k70306j64482j16417P5155J07581j65479J36270J52623B64888
14789D39002P6582J48270B82306J42768j32803J70520r6397J57912J27276j55457
$$ y = [552049, 89315, 543261, 192825, 230187, 342376, 198944, 255133, 328269, 228036, 192597, 419861, 422900, 439837, 174995, 256120, 163997, 595796, 264191, 72593, 333438, 518913, 305239, 630558, 461768, 400182, 381158, 225283, 659598, 436022, 311368, 368031, 317987, 315453, 424215, 390561, 318812, 258755, 328518, 484027, 604125, 448633, 441427, 701057, 321068, 425740, 546083, 55055, 20670, 207327, 156341, 626322, 540676, 180399, 701016, 441262, 72868, 386608, 366802, 274162, 210838, 455528, 476832, 808765, 538459, 373977, 257560, 332715, 440296, 274817, 411087, 563710, 264888, 439002, 515584, 663854, 282306, 425074, 292271, 462791, 366394, 524306, 651582, 496125]
14779D96125Q8321B73862J00870J09295j51806K61896j40808r4946J90535O7561
14769F16459B70067K57692N63763E08313k49185M78595k96547M5168J50206j97094
14759D39456k8504O2696J03139L690B18162M16685M5229l9672C11256L32580r8934
14748E44902J58796k21205O2727L91625m32331L5838j5375k44231K57433R4390
14738F32569P3003J22528L1839j22192j21571j00012L0072B00760K26969M1771
14728D69500O913J74898N9147J86148k28960j80706L80167Q9395k35021p0695
14718F50786O9903L6302L63874l93105k50920L47479l73627J3585n2368L74978
14708G86887j14208N2254k4013L138K5321J79904l50071q3700J44835q5500P6606
$$ y = [496125, 584446, 273862, 374732, 484027, 332221, 594117, 453309, 358363, 548898, 616459, 270067, 527759, 1091522, 508313, 259128, 737723, 441176, 486344, 636550, 439456, 410952, 473648, 576787, 580477, 218162, 634847, 680076, 640404, 311256, 643836, 544902, 703698, 482493, 545220, 936845, 504514, 540352, 524977, 280746, 538179, 632569, 705572, 828100, 859939, 737747, 616176, 516164, 546236, 200760, 427729, 469500, 476413, 651311, 710458, 896606, 667646, 486940, 867107, 956502, 721481, 650786, 720689, 756991, 1120865, 727760, 476840, 824319, 450692, 464277, 411909, 786887, 672679, 724933, 700920, 704058, 729379, 909283, 559212, 475512, 620347, 534847, 611453]
14697F11453J82609j39862J07785M0189J82746K91385m42997L6608J1469l61062
14687E20323K57801j05954K66934k37149j21330K42620m9620J61265j56978K53925
14677A031837k63170O0299K64813k82053J67782K38340k83893P8628j56840r228
14667H46515k04189J77304K69522L0563n20071L46449o9372K3297l5989O8384
14657I32413K21752q8439j74711J39442J44093l09874j43118N23046j81032K2608
14647A086180K66481m24354J55830n8114p0323O3406l4685K01303q3623j13843
14637I88258K28803j68123k8195J44809l07863M09770j79091q6628L1187j6688
14627A016239q6122J38570k60249L47821K4894J95300l85463K20384j62454q3646
$$ y = [611453, 794062, 654200, 761985, 802174, 984920, 1276305, 833308, 869916, 881385, 520323, 778124, 672170, 939104, 701955, 580625, 823245, 773625, 934890, 777912, 1031837, 768667, 828966, 1093779, 811726, 979508, 1217848, 933955, 1012583, 855743, 846515, 642326, 819630, 1089152, 1119715, 599644, 946093, 876721, 900018, 864029, 932413, 1154165, 1065726, 891015, 1030457, 1174550, 864676, 721558, 1244604, 1063572, 1086180, 1352661, 928307, 1084137, 1026023, 955700, 1019106, 984421, 1185724, 1102101, 988258, 1217061, 1048938, 1020743, 1165552, 857689, 1267459, 1088368, 1001740, 1032927, 1016239, 930117, 1068687, 808438, 1156259, 1181153, 1376453, 990990, 1211374, 1048920, 965274]
14617I65274J98900j71820M45458k87836J68930J51427k45069k28101K97850l5465
14607A259548L3927k0270j55986L21274k29161N3806p5678J42942K0344r1510
14597A259236K81839l35909n1202M69718j57329N4051M7447p2021L95044j56100
14587A734774J1201k50531n1146M5662L81534n55138N45741j65233J50268l92418
14577A454714J38031K88010k2813n2234J27227j26666J87K20491K5837j47899
14567A904885j29851J56221j8511J06057j23293M32998j45868J21123j89239P2922
14557B187444K79394L61251K0264J4750M8723L70566M97788O82658J267296L442923
14547I173057J0633316J7367953K076495j6715386r920705o263810k958510r87994
$$ y = [965274, 1164174, 992354, 1437812, 1149976, 1318906, 1470333, 1225264, 997163, 1295013, 1259548, 1293475, 1273205, 1117219, 1438493, 1209332, 1263138, 1187460, 1330402, 1350746, 1259236, 1541075, 1205166, 1153964, 1623682, 1466353, 1520404, 1567851, 1495830, 1890874, 1734774, 1745975, 1495444, 1444298, 1489960, 1871494, 1316356, 1862097, 1696864, 1847132, 1454714, 1592745, 1880755, 1857942, 1805708, 1932935, 1806269, 1806456, 2026947, 2052784, 1904885, 1775034, 1931255, 1912744, 2018801, 1895508, 2328506, 2182638, 2303761, 2114522, 2187444, 2466838, 2828089, 2848353, 2863103, 2911826, 3282392, 3780180, 4462838, 5730134, 9173057, 19806373, 37174326, 39250821, 22535435, 12614730, 6350920, 3392410, 2404416]
14539B404416n94019j2963j3824m3957O8827r7219L72824k37860n5855J13151
14529A903521q5243o9864J32519L6677J92537k16443M57346m81434J16963K36532
14519B223111j51193K38675j15827M797j926P7612O4656j6421K80985j55364j85197
14508B263908J8900j39505J24397K56570k4877J29308O704j36861K95284k2582
14498B771246j31840J44018o0569M8616j27402M88543q0256J53405n22881L07061
14488B989941Q1344J81020k49128P4517J22769N0258R2697J36127j75904j50265
14478C153376L8213J00394N58542j91023k57801N01393r2184j85770J937j04710
14468C522367N05729j21919j43193J43132K88985k38582l1820K29081J40743k66129
$$ y = [2404416, 1810397, 1797434, 1783610, 1739653, 1808480, 1711261, 2084085, 1846225, 1790370, 1903521, 1818278, 1748414, 1880933, 1917610, 2110147, 1893704, 2351050, 1869616, 1986579, 2223111, 2071918, 2310593, 2194766, 2199563, 2197637, 2275249, 2339905, 2323484, 2604469, 2449105, 2263908, 2282808, 2143303, 2267700, 2524270, 2499393, 2628701, 2635405, 2498544, 2793828, 2771246, 2639406, 2783424, 2722855, 2771471, 2644069, 3132612, 3052356, 3205761, 2682880, 2989941, 3071285, 3252305, 3003177, 3077694, 3200463, 3250721, 3343418, 3479545, 3303641, 3153376, 3191589, 3291983, 3850525, 3659502, 3401701, 3903094, 3810910, 3625140, 3627077, 3522367, 4028096, 3906177, 3762984, 3906116, 4195101, 3956519, 3924699, 4153780, 4294523, 4028394]
14458D028394K81262j64544J17128l2087L60770J65433j31314N2718J10660J06948
14448D895368k02305M9990j50613M22195j72171M79628l98381J70439p5516M58876
14438E477510L2899N2202K66688p1588m54682M48916J13898m7891J31527r560
14428E939919M50950l07793K25839l2500K98483l39438P58678j55635J04778J97479
14418G140760n5142J06730J20999j88051N39939O2681k05989L61955J82793K79407
14408H346082k1399j91890K47398K2472K51618O4036K10021j00612M13983K09409
14398I451118J1533J24957J06318q551M66424k08127L34205K84163n3667N03569
14388A1011942J31727J37362M1610N56524L7984K26884N4914L95113J42621L44819
$$ y = [4028394, 4309656, 4145112, 4262240, 4230153, 4590923, 4756356, 4625042, 4677760, 4788420, 4895368, 4693063, 4743053, 4592440, 5014635, 4842464, 5322092, 4923711, 5094150, 5018634, 5477510, 5510409, 5562611, 5829299, 5757711, 5303029, 5751945, 5865843, 5817952, 5949479, 5939919, 6390869, 6083076, 6308915, 6276415, 6574898, 6235460, 6994138, 6838503, 6943281, 7140760, 7085618, 7192348, 7313347, 7125296, 7665235, 7727916, 7521927, 7883882, 8066675, 8346082, 8324683, 8132793, 8380191, 8402663, 8654281, 8718317, 8928338, 8827726, 9241709, 9451118, 9462651, 9587608, 9693926, 9685375, 10151799, 9943672, 10277877, 10562040, 10508373, 11011942, 11143669, 11281031, 11322641, 11879165, 11917149, 12144033, 12198947, 12594060, 12736681, 13081500]
14378A3081500K62148P6453J95852L93298L43689L59682P6528J70128O98740J82315
14368A5840333l8188N10343M41827J58166P11963O2890L97594N91615L48013L04548
14358A9329104L44801O03630L99977L65370O07420N02528L73863Q35685L88604
14349B3750982J012902J80872M99502Q93359O35252P71306O76051R00135O53085
14340B9973446P13881R47824R08357Q32064J268350O15060J113729P32947K061357
14331C9167015R06795J362629J194010J153697J786208J191109J634964J429583
14323D9826010J992439J764262J805771J941610K237501K438349K148348K487774
14315F6642064K623212K581619K889400K980413L032735L707886L238636L885568
$$ y = [13081500, 13343648, 13420101, 13615953, 14009251, 14352940, 14712622, 14789150, 14959278, 15658018, 15840333, 15802145, 16312488, 16754315, 16912481, 17624444, 17687334, 18084928, 18676543, 19024556, 19329104, 19673905, 20277535, 20677512, 21042882, 21650302, 22152830, 22526693, 23362378, 23750982, 24763884, 24944756, 25444258, 26337617, 26972869, 27744175, 28420226, 29320361, 29973446, 30687327, 31635151, 32543508, 33375572, 34643922, 35258982, 36372711, 37105658, 39167015, 40073810, 41436439, 42630449, 43784146, 45570354, 46761463, 48396427, 49826010, 51818449, 53582711, 55388482, 57330092, 59567593, 62005942, 64154290, 66642064, 69265276, 71846895, 74736295, 77716708, 80749443, 84457329, 87695965, 91581533]
14307I1581533M234228M149234M497146M700024N356433N559611N602254O079895
14299A31760358O469860P252910P477401Q096348Q511410Q848868R548276J0265010
14291A98230441J0795876J1688239J2070533J2980472J3542377J4230901J4580873
14284B88119712J5015610J5820000J6302028J6575245J6278990J6192650J5463979
14277C99768214J5216684J3726860J2041821J0298742P770080L711670k482628
14270D60051443m214105l444255m605086m348303l557774n777491r715968j2841105
14262D11547356j5070060j5912789j6512448j6563981j6888602j6262013j6050224
14255B98287239j5420513j3961194j3883576j3912461j2482892j2428632j1441737
$$ y = [91581533, 95815761, 99964995, 104462141, 109162165, 114518598, 120078209, 125680463, 131760358, 138230218, 145483128, 152960529, 161056877, 169568287, 178417155, 187965431, 198230441, 209026317, 220714556, 232785089, 245765561, 259307938, 273538839, 288119712, 303135322, 318955322, 335257350, 351832595, 368111585, 384304235, 399768214, 414984898, 428711758, 440753579, 451052321, 458822401, 462534071, 460051443, 455837338, 452393083, 447787997, 443439694, 439881920, 434104429, 424388461, 411547356, 396477296, 380564507, 364052059, 347488078, 330599476, 314337463, 298287239, 282866726, 268905532, 255021956, 241109495, 228626603, 216197971, 204756234]
14248B04756234j1070419r907955r507876q554996q251503q068698p217004p345421
14240A34832362o201521o034576n755068m929936n229920m919895m520453m473962
14232I2767031l518614l202133l653781l630652l127116k920700k683485k800205
14224F7230345k287219k445728k460286j990568j851299j904953j927526k217935
14216E0144831j470575j481509j177852j033305j574111j327611j665823j224991
14208C9189054r67017l20952r97020j555383j024063j104317p98577p40615n41898
14199C1139212j186167q21442n35759j046257n18961l94323q59809q83280l93723
14190B4499491m44435j033260k97068k82591p63139o10395m58631n11041j85727
$$ y = [204756234, 193685815, 183777860, 174269984, 165714988, 157463485, 149394787, 142177783, 134832362, 128630841, 122596265, 116841197, 111911261, 106681341, 101761446, 97240993, 92767031, 89248417, 86046284, 82392503, 78761851, 75634735, 72714035, 70030550, 67230345, 64943126, 62497398, 60037112, 58046544, 56195245, 54290292, 52362766, 50144831, 48674256, 47192747, 46014895, 44981590, 43407479, 42079868, 40414045, 39189054, 38222037, 37901085, 36904065, 35348682, 34324619, 33220302, 32421725, 31681110, 31139212, 29953045, 29131603, 28595844, 27549587, 27030626, 26636303, 25776494, 24893214, 24499491, 24055056, 23021796, 22724728, 22442137, 21678998, 21068603, 20609972, 20098931, 19913204]
14181A9913204k97746r68712R0701p30998j73209l24170l51953l47579n73756
14172A6235782j41366l00159n8167l64844p01308j40431l81365r4170k07635j6610
14162A3829727n28227k61986m64172k4309N1638m16223m86951P3052l70921k4293
14152A1377335j96666m52286q2640k48632P7057J49781l96316m16706J67491m56359
14142I522059J1776Q935k54600j08816j44241Q5110m32712j07175j72598K05954
14132H613692m56856j15888q4436J8035k5439l27022j74031J16330j76871k12678
14122G174836n9454N0726k89881j30925J29698k64058r1073k07l84192L77413
14112F512883m71446K68070p8288k48223k12858m2953p7299Q129l13013M88293
$$ y = [19913204, 19615458, 18646746, 18737447, 18006449, 17833240, 17509070, 17157117, 16809538, 16235782, 16094416, 15794257, 15736090, 15371246, 14669938, 14529507, 14148142, 14053972, 13846337, 13829727, 13301500, 13039514, 12575342, 12551033, 12602671, 12186448, 11699497, 11772549, 11401628, 11377335, 11180669, 10728383, 10645743, 10397111, 10474168, 10623949, 10227633, 9810927, 9978418, 9522059, 9533835, 9542770, 9288170, 9179354, 9035113, 9120223, 8687511, 8580336, 8407738, 8613692, 8156836, 8040948, 7956512, 7974547, 7949108, 7622086, 7448055, 7564385, 7387514, 7174836, 7115382, 7166108, 6876227, 6745302, 6875000, 6610942, 6519869, 6519662, 6135470, 6512883, 6041437, 6309507, 6231219, 5982996, 5770138, 5727185, 5649886, 5658015, 5345002, 5833295]
14102E833295j98409o88663K39833Q2119K22045q9877k53930m9196o7084k12003
14092D818130N9113l01659K0052L77481q974l01967J08794k25677j29451J81058
14082D596900m22232M2688o7610O4554J10394q9843k7807k99191l78892M25623
14072C954584J80561j41992l0841O8660m04715L28537k43205l54618K98762J93947
14062C849680j55498q4087j20974O9869R39j2645J60316j4788m59531p8969M6065
14051C200377K00993k87215J46148j74797j78202L27649n72395R5787K28914n24145
14041B463114K69838L35021l54298n3010Q064K24038l23612L29956k44982K63040
14031B917169L5222k77107J54036j31156q8051L31582m98503J94137r2483j32234
$$ y = [5833295, 5634886, 4946223, 5186056, 5268175, 5490220, 5400343, 5146413, 5097217, 5030133, 4818130, 4877243, 4575584, 4595636, 4973117, 4964143, 4662176, 4770970, 4545293, 4415842, 4596900, 4174668, 4217356, 4149746, 4214300, 4324694, 4234851, 4207044, 3907853, 3528961, 3954584, 4135145, 3993153, 3962312, 4030972, 3626257, 3954794, 3711589, 3356971, 3655733, 3849680, 3694182, 3610095, 3489121, 3558990, 3559929, 3547284, 3707600, 3692812, 3233281, 3154312, 3200377, 3401370, 3114155, 3260303, 3085506, 2907304, 3234953, 2662558, 2758345, 2987259, 2463114, 2732952, 3067973, 2713675, 2660665, 2668729, 2892767, 2569155, 2899111, 2654129, 2917169, 2952391, 2675284, 2829320, 2698164, 2610113, 2941695, 2443192, 2637329, 2544846, 2412612]
14021B412612j55336J64615n9372R070J93983k92451j3088k98591J62297J70180
14011B293919k42865K40034j75435J00252k3814m24496O8059M3025M43733k93923
14001B028489k06633J69715j04610j26057J60212m41056N66643l55244m7247J15653
13991A759865K63980J0408P20555J884372Q431460J8588549Q472148j4877024
13983B5254313j0247745n733516l300567j729529n76837o69245N8244l01878k90043
13974B463197J70047r4482q7513k36247p475K15174j35945r7707K32879n33128
13964A888800N0640j211J81636l21464M919j66558K62341j18635K05794k3762
13954A962500k3510n23965L00767Q534j19068M14970m82320J67036J11795j49654
$$ y = [2412612, 2257276, 2421891, 2362519, 2371589, 2565572, 2273121, 2260033, 1961442, 2123739, 2293919, 2051054, 2291088, 2115653, 2215905, 2192091, 1767595, 1835654, 1878679, 2322412, 2028489, 1821856, 1991571, 1886961, 1760904, 1921116, 1480060, 2046703, 1691459, 1644212, 1759865, 2023845, 2034253, 2754808, 4639180, 13070640, 31659189, 40131337, 25254313, 15006568, 9273052, 5972485, 4242956, 3666119, 2996874, 3055118, 2753240, 2463197, 2633244, 2538762, 2451249, 2215002, 2207527, 2422701, 2286756, 2189049, 2421928, 1888800, 1939440, 1938229, 2119865, 1798401, 1803320, 1636762, 1899103, 1780468, 1986262, 1962500, 1938990, 1415025, 1715792, 1724326, 1605258, 2020228, 1537908, 1704944, 1816739, 1667085]
13944A667085K353J39791r1224j08703r4021M3389k73965K00485K58021m32019
13934A311192J37157O9125j5677J23633n3972n7429j09386q8852J61767l73851
13924A103707L65249k56711L51108o19142K09700L30649m52263L22362O8494j47273
13914A275880J91980J29220k8481q632n23463L97297j62667K38760k21620l67797
13904I20477L80393k05455K61883j11972j02569j71438K57766J17329j65445J17962
13894A298931K45263m42966J10101k08798K31587n6460o7888J14173j02933L47139
13884A468149j5687j55267j24435P1922k4629p6303k82389J0034o565K90390j9769
13873A135451j64986L06688p3976k09011q3113J31205o0347k89739N9097M11512
$$ y = [1667085, 1669438, 1809229, 1718005, 1609302, 1515281, 1558670, 1284705, 1485190, 1743211, 1311192, 1448349, 1517474, 1501797, 1625430, 1571458, 1514029, 1404643, 1315791, 1477558, 1103707, 1468956, 1212245, 1563353, 944211, 1153911, 1484560, 1032297, 1354659, 1423153, 1275880, 1467860, 1597080, 1568599, 1559967, 1036504, 1433801, 1271134, 1509894, 1288274, 920477, 1300870, 1095415, 1357298, 1245326, 1142757, 971319, 1229085, 1346414, 1180969, 1298931, 1544194, 1101228, 1211329, 1002531, 1234118, 1177658, 1109770, 1223943, 1121010, 1468149, 1452462, 1297195, 1172760, 1244682, 1220053, 1143750, 861361, 871395, 864830, 1155220, 1135451, 970465, 1277153, 1203177, 994166, 911053, 1042258, 981911, 692172, 751269, 1162781]
13863A162781l82403J89451K14179o0621J09260J55835m08629o241p1138N4023
13853I56497k79471L23905l42656L10816j9330k2312k93528M6664M28845l91186
13843G18244J38489j48390J9439M73498k00168k05886J56902k82285L63815k97298
13833G36360J08528k65069N7177j60774L51671O0996j58376K44170k86314J14215
13823H02584P336j11600k941J52303l2892B90221M83548K88616m13942L20571
13813I69014D41466L05546k60380K60073K44398M6548k44373k6892j3322k6092
13803G26972k3393r92r9683J77523k21781K65202Q5913k99978j88103K30124K41591
13792H93395m19266K67781J3700j66372k79743M24936j94928J56049L5274K6150
$$ y = [1162781, 780378, 969829, 1184008, 1123387, 1232647, 1388482, 979853, 973612, 902474, 956497, 677026, 1000931, 658275, 969091, 949761, 927449, 633921, 680585, 1109430, 718244, 856733, 708343, 727782, 1201280, 1001112, 795226, 952128, 669843, 1033658, 736360, 844888, 579819, 636996, 476222, 827893, 888889, 730513, 974683, 688369, 802584, 809920, 698320, 695379, 847682, 814790, 290221, 773769, 1062385, 648443, 969014, 441466, 747012, 486632, 746705, 991103, 1037651, 793278, 766386, 753064, 726972, 703579, 702587, 602904, 780427, 558646, 823848, 909761, 609783, 421680, 651804, 893395, 474129, 741910, 755610, 589238, 309495, 734431, 539503, 695552, 730826, 756976]
13782G56976J57501k43555K37865l40951j96107L78502l37066O80515j29674j92342
13772G71664k61289M3541R2362j56767Q5292A59028O75306L13735D95701K2312
13762E18013O9228J49962j36272k11727J98699N1321N1891q4366k52278J87462
13752E41933j97067J44513J90040j83156P5368j62914M3866o8715Q7076j85112
13742B85832J69000L37888j44745C10167L52733j29575P659k5474k18199J67958
13732D65269P0995k62541N23708k41191J7865j42850j29855L98177j86284k02627
13722C10666L1121L78389k03173M2161p62B71859K59182A69201J76862K98701
13712F44764k03779p2674K81597l18584K20355j66057J51594k2543J02824l3534
$$ y = [756976, 914477, 670922, 908787, 567836, 371729, 750231, 413165, 1093680, 964006, 771664, 510375, 553916, 646278, 489511, 574803, 159028, 834334, 1148069, 495701, 518013, 587241, 737203, 600931, 389204, 587903, 639224, 691115, 606749, 354471, 541933, 344866, 489379, 679419, 496263, 571631, 408717, 452583, 383868, 470944, 285832, 454832, 792720, 647975, 310167, 662900, 533325, 540984, 515510, 297311, 465269, 536264, 273723, 797431, 556240, 574105, 431255, 301400, 699577, 513293, 310666, 341787, 720176, 517003, 559164, 558402, 271859, 531041, 169201, 346063, 644764, 440985, 368311, 649908, 331324, 551679, 385622, 537216, 514673, 617497, 583963]
13702E83963J75664k51365B28603L99238q9297j40072p0475K21256n8974J54532
13692F44811A18296k4684M72648r8435j97090K54761r1804j01396p0093K40381
13682E02584j66017L78577A68636K40902M7617J93061B66082K34319j69635j31436
13672A99330p912N03705B75505L10846B73397L11133K9045B81640p8744J61367
13662C64263J00769J21199k27419j40729P9456R5619R4430O0357j03964O2333
13652E06314P8717G0292L5910M78895Q4768p7876m7980d0115C88647a6164E33689
13640C47415A13753J70778K62453A44599J21378N2750L79680C01858K65938k8005
13630E39791k24484l0389J83254k8121L5328N3746B42300K25900o6603K8492o293
$$ y = [583963, 759627, 508262, 228603, 627841, 538544, 398472, 327997, 549253, 490279, 644811, 118296, 93612, 566260, 467825, 270735, 525496, 433692, 332296, 262203, 502584, 336567, 715144, 168636, 409538, 457155, 650216, 266082, 500401, 330766, 199330, 191418, 695123, 275505, 586351, 273397, 584530, 613575, 281640, 202896, 364263, 465032, 586231, 358812, 218083, 297539, 393158, 487588, 547945, 443981, 506314, 585031, 70292, 106202, 585097, 669865, 591989, 544009, -40115, 388647, -16164, 533689, 347415, 113753, 284531, 546984, 144599, 265977, 318727, 698407, 301858, 567796, 539791, 315307, 284918, 468172, 440051, 475379, 529125, 242300, 468200, 401597, 430089, 423796]
13619D23796K33856B34121N5733J2949Q0719A63179L668m6021K53098A16955M05947
13608E22902O2654B7062K65774K4811M8880r2010J2802j13581J34437M7384m4980
13597C10579m3413M68976A74202J22289j36952J28326M3797J4094j26612j1244
13587B07900L68039B22719L05381j25235J8946M2442r8905b080H5241L9049q604
13576A15686O9956J80118j41674J53778j28849j8625K18832B09719p5145L19709
13566D54283j49166J71430j53282D1173A9492M31512L8401j98485A36239K23961
13556C60200J73209j83187A47259L28119o0326a45590B84216o5852A4925M48849
13546D63774k1925k13517e7536C43337j02200L53612k51712Q7565j42736P322
$$ y = [423796, 657652, 234121, 289854, 302803, 383522, 163179, 166847, 120826, 373924, 116955, 522902, 585556, 27062, 292836, 317647, 366527, 274517, 287319, 173738, 308175, 355559, 310579, 267166, 736142, 174202, 296491, 159539, 287865, 331662, 345756, 219144, 207900, 575939, 222719, 528100, 402865, 421811, 464253, 365348, -2080, 85241, 124290, 115686, 185642, 365760, 224086, 377864, 249015, 230390, 449222, 209719, 134574, 454283, 305117, 476547, 323265, 41173, 19492, 451004, 489405, 290920, 136239, 360200, 533409, 350222, 147259, 475378, 415052, -145590, 284216, 218364, 14925, 463774, 441849, 228332, -57536, 343337, 241137, 594749, 343037, 430602, 287866, 295188]
13536B95188K16414A68855O5887n7956J58309g0895B36661J0962J8589r0051R7434
13525B73595o6969E7065J52341J93524n1365j51320J70326j0271A59683J98871
13515C58554H8798L1644j408J14883j5182J27595h3800C02372o6453J32416A55724
13503A74465L403K97609j09767D2753M02535H9531L07789H5086J48554E0720L06111
13492C56831A32914d7445A43493J51658A30047Q3625J00110k6453c5207E5397
13481g0696B94781F380L7452K28622C5885K49899d3300A35723K09054j23418J85716
13470D07075I4336K23763F8367K38457g1422B65414a8763A84001E464J43847a15732
13458E11524A950L13872n4178p1246q0669n3955h7431A37677K91376A51218L23632
$$ y = [295188, 511602, 168855, 234742, 176786, 335095, -70895, 236661, 247623, 266212, 176161, 273595, 206626, 57065, 209406, 402930, 351565, 200245, 370571, 360300, 159683, 358554, 88798, 120442, 119034, 233917, 218735, 346330, -83800, 302372, 235919, 368335, 155724, 174465, 177868, 475477, 365710, 42753, 445288, 89531, 397320, 85086, 233640, 50720, 356831, 132914, -47445, 143493, 295151, 130047, 213672, 313782, 287329, -35207, 55397, -70696, 294781, 6380, 43832, 272454, 35885, 285784, -43300, 135723, 344777, 221359, 407075, 94336, 318099, 68367, 306824, -71422, 265414, -18763, 184001, 5464, 149311, -115732, 511524, 1950, 315822, 261644, 190398, 109729, 55774, -87431, 137677, 429053, 151218, 474850]
13447D74850i3978A04724L7431K15758J6804A84495h9617n172H995K92258b71584
13435a05412B02859J22673E6930L92686B14856I5975K05158e547j1137D53051
13424C10800q7418l189K2622q1241k6132C7602P6145c8091B59770C3797P5599
13413A09396A7975a56150A83644k4068b59296C05368M928o0805m0878N800H4212
13401A04514J63048j05842J12417m6325J56028j38027q3739J59031J13038M1824
13391D75967A12026J35754M2171a31665B33399A04602m3703M33130k18732j10764
13381A64533P5977m0682J25713A25490B5788a6866A47357j5732J3933C8096a29695
13369A15863L7235g5649C53889A64066B410K0622K91489p104H065K06100A05949
$$ y = [474850, -93978, 104724, 142155, 357913, 374717, 184495, -89617, -94789, 8995, 301253, -271584, -105412, 202859, 325532, 56930, 449616, 214856, 95975, 301133, -5547, -16684, 453051, 310800, 223382, 220193, 242815, 161574, 135442, 37602, 113747, -38091, 259770, 33797, 109396, 17975, -156150, 183644, 159576, -259296, 305368, 310296, 249491, 208613, 214413, 84212, 104514, 267562, 161720, 274137, 227812, 383840, 245813, 162074, 321105, 434143, 475967, 112026, 247780, 289951, -131665, 233399, 104602, 60899, 494029, 275297, 164533, 240510, 199828, 325541, 125490, 25788, -16866, 147357, 131625, 145558, 38096, -129695, 115863, 153098, -75649, 353889, 164066, 2410, 23032, 314521, 307417, 8065, 214165, 105949]
13357C11464Q152q9081i9732C07058L8857E030J66520a43432A7990c08478A91158
13345D57852A30067P6071r5632l922J54397J96476A11616K24329q0635P0988n9884
13334B66414J3355K22592A75275K81583A80225A9311J92509k0334r414L25415
13324E07487j28014j85899J48702P0398J59138a51606A51749J85532A1693K87264
13314B98957L1125N9622G219J77696A6919J88114E7307N9547a39099B61789e9469
13302a20055P3A28727a60283C7306b62785D70354B02471j6744A508J27135J23400
13291B52043J06744F6862a0492l1750B06061B5507J49855L34717B37695I890Q249
13280A8139L9620c3721k9264l5580i132A66730p1839J65005a56010B42709b11693
$$ y = [311464, 319616, 230535, -99732, 307058, 345915, 5030, 171550, -143432, 17990, -308478, 191158, 457852, 130067, 206138, 110506, 106584, 260981, 457457, 111616, 335945, 255310, 326298, 266414, 279769, 502361, 175275, 456858, 180225, 19311, 211820, 191486, 182072, 507487, 379473, 193574, 342276, 412674, 571812, -151606, 151749, 337281, 11693, 298957, 330082, 389704, 7219, 184915, 16919, 205033, 57307, 116854, -139099, 261789, -59469, -120055, -119982, 128727, -160283, 37306, -262785, 470354, 202471, 185727, 1508, 128643, 252043, 358787, 66862, -10492, -42242, 206061, 25507, 175362, 510079, 237695, 9890, 18139, 57759, -33721, -62985, -98565, -9132, 166730, 94891, 259896, -156010, 242709, -211693]
13268A11165d072H092J74829b5920E9357L22201r7739J8632f5775I5382J2618
13257A08000L0577a4669k76811b8502l9466D68234C0190Q3336J6783f168A59784
13245C68210h969o9259q4514e4652D1402J85167Q7530e496l920B96095e9053B4678
13232b61596A46432K34432a2982A66522J34550c07826B43570K97658A10052j7515
13222I2537J19354H1371a11205A45331M7377m963J49499D2664c61993B78362J67022
13211D45384a00619G0346J26489B7917P5090C2885K04271m4411b9486l520j56035
13200a89041B13396J20840J0746a8529B93155B7436P3349e7587F9164J0538a14295
13188f2507B44876I076K04415f0392J5201j76282A8785N9355A6705b44183A76828
$$ y = [111165, -4072, 8092, 182921, -25920, 59357, 381558, 283819, 302451, -65775, 95382, 108000, 138577, -14669, -291480, -28502, -67968, 468234, 30190, 113526, 130309, -6168, 159784, 368210, -8969, -78228, -162742, -54652, 41402, 226569, 314099, -5496, -9416, 296095, -59053, 24678, -261596, 146432, 380864, -12982, 166522, 301072, -307826, 243570, 541228, 110052, 92537, 211891, 81371, -111205, 145331, 192708, 187745, 337244, 42664, -361993, 278362, 445384, -100619, 70346, 196835, 27917, 103007, 32885, 237156, 192745, -29486, -33006, -189041, 213396, 334236, 344982, -18529, 293155, 27436, 100785, -57587, 69164, 79702, -114295, -62507, 244876, 9076, 213491, -60392, -45191, -221473, 18785, 78140, 16705, -244183, 176828]
13176E3434a01834B8871e3806j39031B54425d2261C76289l6476E6834q228J45281
13165A93887H0136J63241j14409J29707b04394E5626O8726a44294N4720c5298
13154A5380J33602b34083h0994A68312B557b51929A80503q2470a77391J1092B25047
13142A24726g24j82888D79070k15932a9093B54866m5176K79981A22515C2205l064
13131B9141M9911h8873H5127c8633D33187a06288C12284n3757I828a48127A80224
13119i7535C08818P2852A13699R2972K6733F3656K6346m0168K15113i786A28423
13107b58692N0606A10262c07616h7539r2778M0960O1636G6190a21371K7830A69195
13095a29168A59401F7771R0611D0919J50798P388J15666H4419J242B1431a86395
$$ y = [53434, -101834, 28871, -53806, -192837, 254425, -42261, 376289, 339813, 56834, 48606, 193887, 80136, 243377, 128968, 258675, -204394, 55626, 124352, -144294, -89574, -35298, 15380, 148982, -234083, -80994, 168312, 2557, -251929, 180503, 98033, -177391, -166299, 225047, 124726, -724, -183612, 479070, 263138, -19093, 254866, 209690, 489671, 122515, 32205, 29141, 79052, -88873, 85127, -38633, 433187, -106288, 312284, 258527, 9828, -148127, 180224, -97535, 308818, 381670, 113699, 206671, 233404, 63656, 90002, 49834, 264947, -9786, 128423, -258692, -208086, 110262, -307616, -87539, -180317, -139357, -77721, 76190, -121371, -93541, 169195, -129168, 159401, 67771, 158382, 40919, 191717, 199105, 314771, 84419, 85661, 21431, -186395]
13083b04142H0577K48142a65079E4473f454C32638f6894B16985a11221B31167
13072B20208B2668L17440A32282J31952p9062F5694J55713j06015c4045e157A40740
13060a86473B40355q8337J32443A22968g8199a7272A34972b7700l9637I6357l6181
13049F0176L62a12125B05464a94026A0136a00796B02267A0137O5520J5882a74722
13037b32983C58835j11006L2576a46029A11480b4311C2466Q9771a10219l6438
13027a46657K0400A06980h7347L8337B75273H4025J15945q7209O8657n9457N09341
13016F31302H1003O9376c4767C7315J47129a9511F2496b82009A20722f0594D8192
13004H1119l4752J77752G4794k570a43283r1700A71867A5105N1003J05278N606
$$ y = [-204142, 80577, 328719, -165079, 54473, -6454, 332638, -66894, 216985, -111221, 231167, 220208, 22668, 340108, 132282, 264234, 185172, 65694, 221407, 115392, -34045, -5157, 140740, -186473, 240355, 152018, 284461, 122968, -78199, -17272, 134972, -27700, -67337, 96357, 60176, 60538, -112125, 205464, -194026, 10136, -100796, 202267, 10137, 75657, 91539, -174722, -232983, 358835, 247829, 280405, -146029, 111480, -24311, 32466, 122237, -110219, -146657, -126257, 106980, -87347, -49010, 275273, 84025, 199970, 112761, 181418, 121961, 631302, 81003, 150379, -34767, 37315, 184444, -19511, 62496, -282009, 120722, -60594, 48192, 81119, 46367, 224119, 74794, 72224, -143283, -234983, 171867, 15105, 66108, 171386, 176992]
12993A76992p5180I74L26474E2217J62206h7655A54180K27069j77418d5860E3507
12981h3686A2248a38186A27985J60958I1691c6504A08576m2014J92660f5612B64979
12969a9740A23446R3398l7365f4446q5029I4058J71350I0160P976a15318j9055
12958a34373C69325A26343L5671j8888L3700p7274L9979m6826f5776G8594b77298
12946i2775A834b73802a8214B37340f8611q3768B332R814K31033n3872N155D8489
12933a75610c4652H7626c10733C58316h9425G6003l3171K5810b48147h136A44230
12921E905Q6000d3121A96665a18348j54D7088c27544B47200c8218I8246b19473
12909A43274a95228A9585b26269j9653A04314m5928h3684A70975n9233i8194O232
$$ y = [176992, 101812, 974, 327448, 52217, 214423, -87655, 154180, 381249, 203831, -45860, 53507, -83686, 12248, -138186, 127985, 288943, 91691, -36504, 108576, 66562, 259222, -65612, 264979, -19740, 123446, 216844, 179479, -64446, -149475, 94058, 265408, 90160, 98136, -115318, -134373, 369325, 126343, 162014, 143126, 176826, 99552, 139531, 92705, -65776, 78594, -277298, -92775, 1834, -273802, -18214, 237340, -68611, -152379, 2332, 12146, 243179, 189307, 194462, 48489, -175610, -34652, 87626, -310733, 358316, -89425, 76003, 42832, 68642, -248147, -8136, 144230, 5905, 91905, -43121, 196665, -118348, -118502, 47088, -327544, 247200, -38218, 98246, -219473, 143274, -195228, 19585, -226269, -245922, 104314, 58386, -83684, 170975, 111742, -98194, -91962]
12898i1962A40357h5449b6317H427J9557a6835F4882a0945F9666b15161a2043
12886a08829D9419J07725b16650c1715A07725o746m1726L52795H5406A1303J84654
12875A95957R9965a41080j23242A94099C1844b06452j09389J57304B36410E1271
12864A390L00187C8389g9310B15965a92848A54265n1482Q9707c1559A00120b67866
12852c63977A60164J45154A01650a65195B70227o6091P4969b5698A48405o8480
12842G9925K36842A20104R4835e4291j72756A85274b06774D4018b93726a45371
12831I4188h1748C16336j53974e6697B44602d2730E8593R481e1885A78298a09506
12819b0752C3177L9251a08122j39972a06108A31627b4936B5438c9168j34517H3245
$$ y = [-91962, 140357, -85449, -26317, 8427, 27984, -16835, 64882, -10945, 69666, -215161, -12043, -108829, 49419, 157144, -216650, -31715, 107725, 100979, 59253, 412048, 85406, 11303, 195957, 295922, -141080, -264322, 194099, 31844, -206452, -315841, -158537, 236410, 51271, 1390, 301577, 38389, -79310, 215965, -192848, 154265, 102783, 192490, -31559, 100120, -267866, -363977, 160164, 305318, 101650, -165195, 270227, 204136, 279105, -25698, 148405, 79925, 316767, 120104, 214939, -54291, -227047, 185274, -206774, 44018, -293726, -145371, 94188, -81748, 316336, 162362, -56697, 244602, -42730, 58593, 68074, -51885, 178298, -109506, -20752, 33177, 72428, -108122, -248094, -106108, 131627, -24936, 25438, -39168, -173685, 83245]
12807D1571K39979e4831j6592A23985J83312j44268a80563B37972C1070a42766
12796H3951e7670B15264c04022J22768j09973A3751J456c1983H9044e8688j27394
12785a86082F6425O758a21324e2297G0255Q2165n4079b55834A03757c9573A05593
12773I0316a43586O8972B57681G0705d1536o5532J6035A68689A7310J05855c6272
12761g2582B6570P3027C6469d95689a01971B55627o1170A1807a21004A81117m6804
12750A34313b16121D9213j5665a23423B69487O1781a57031A27457J6962b0030
12739a15292D01527H2004c158B13645m1185B6702a66416h345D0754O136J63801
12728B10691a65842A80495e9748A45219E7658a4786A28066l400a82065A61524
$$ y = [41571, 281550, -54831, -71423, 123985, 307297, 163029, -180563, 237972, 31070, -142766, 83951, -57670, 215264, -304022, -181254, -291227, 13751, 15207, -31983, 89044, -58688, -186082, 66425, 73183, -121324, -52297, 70255, 152420, 98341, -255834, 103757, -39573, 105593, 90316, -143586, -74614, 257681, 70705, -41536, -107068, -91033, 168689, 17310, 123165, -36272, -72582, 26570, 99597, 36469, -495689, -101971, 255627, 194457, 11807, -121004, 181117, 134313, -216121, 49213, 33548, -123423, 269487, 331268, -157031, 127457, 144419, -20030, -115292, 401527, 82004, -3158, 213645, 172460, 26702, -166416, -8345, 40754, 46890, 210691, -165842, 180495, -59748, 145219, 57658, -14786, 128066, 124666, -182065, 161524]
12717C26539a58618g6347A19202m2291h1614A28936J36369C9116K63405m4242
12707B58279j3406R8287j38445e0583C33650b5842H8671L24824a82505O3631A43997
12695A19392E6068j7665J72421F4145c9266A6716f8147C37275a33766M8509k4825
12684a10082N2362e037B25650A04208c3800A44918J13270K1325J05316c11945
12673A10031J2952J28939C8976a83539F4354K47483a8477A5487e8456n1609A0649
12661b05265C08594A40435a45931B03418g8992A24180R795K50114b14173O7735
12651a46438O3568C14807C1142a06761I4451a35900M2767A82936r0872b9946k23729
12640b53675D20224F4365k9620K4738A167a19347B78127j16302h0736D41048a38018
$$ y = [326539, -158618, -76347, 119202, 76911, -81614, 128936, 265305, 39116, 302521, 258279, 244873, 343160, 204715, -50583, 333650, -25842, 88671, 413495, -182505, -118874, 143997, 119392, 56068, 38403, 210824, 64145, -39266, 16716, -68147, 337275, -133766, -85257, -110082, -57720, -5037, 225650, 104208, -33800, 144918, 258188, 279513, 384829, -311945, 110031, 122983, 251922, 38976, -183539, 64354, 311837, -18477, 15487, -58456, -110065, 10649, -205265, 308594, 140435, -145931, 203418, -78992, 124180, 133975, 384089, -214173, -146438, -82870, 314807, 31142, -106761, 94451, -135900, -93133, 182936, 92064, -29946, -253675, 420224, 64365, 34745, 59483, 1167, -119347, 278127, 161825, -80736, 441048, -138018]
12628G6668P9072K9500P0683P960Q6777E1007L28720H700J41620L03948A61727
12616f3360E9784J88220i9499B69282a72262B57807C8477i4816B33575c5257I9089
12604a02889d5479G3348J75766D3279j4201a6659A52681C8846L31753b71343i2966
12592C59794J21623a3474j62538B30121H9628k7697A5688a2134A40396i9297p9491
12581a78788Q8988L2570B22307a80249A81102F6104J51021a34234q4679I5480
12570a33681C8022c0678D99250c31461B58511a23134P089M3242j27525B55938
12559A32900a3840C13645j8441D4729b28682j0594a1145m9246A73750E6919J15723
12548A72642K8998a39660j4932f3627G723K34535J2447K0629A33487j7882R904
$$ y = [76668, 155740, 185240, 255923, 263883, 350660, 51007, 379727, 8700, 150320, 454268, 161727, -63360, 59784, 248004, -99499, 269282, -172262, 257807, 38477, -94816, 233575, -35257, 99089, -102889, -45479, 73348, 249114, 43279, 29078, -16659, 152681, 38846, 370599, -271343, -92966, 359794, 481417, -13474, -176012, 230121, 89628, 61931, 15688, -12134, 140396, -99297, -178788, -89800, -57230, 222307, -180249, 181102, 66104, 217125, -134234, -218913, 95480, -133681, 38022, -30678, 499250, -331461, 258511, -123134, -116045, -72803, -200328, 255938, 132900, -13840, 313645, 295204, 44729, -228682, -239276, -11145, -60391, 173750, 56919, 172642, 201640, -139660, -154592, -63627, 7723, 242258, 254705, 275334, 133487, 115605, 125509]
12537A25509c10761b3839B89880e3138n8740r4583C167J11974j4703M1409f5999
12525i808l20821A3990K82999a92610D1428c39687k5176g4891P620K8276m3487
12514h2482K8161j55347A53743K6051B2405J04293c6727m0620A28687A2117a4486
12502B19152H7283O1889a48215B42404a44117D4199J11480b93788g3815G5285
12491G0142J09308p9023f9605a7490j70336B35516a1258k52829R2784F3841a75730
12479a10847C50262i6644A35225m4201j3815P4413b52790J22398A8153O8906J78378
12468B65437n5024g8329G0276f1146B29075c53550D7776J34366l6839a16709m4273
12457a60982A14221h8695i43m2919o6520M4708B64791g9182r3709e9614j69893
$$ y = [125509, -310761, -23839, 289880, -53138, -111878, -206461, 3167, 115141, 100438, 141847, -65999, -9808, -330629, 13990, 296989, -192610, 41428, -339687, -364863, -74891, -67271, -38995, -82482, -54321, -209668, 153743, 179794, 22405, 126698, -36727, -77347, 128687, 12117, -14486, 219152, 87283, 149172, -148215, 242404, -144117, 44199, 155679, -293788, -73815, 75285, 70142, 179450, 100427, -69605, -17490, -187826, 235516, -11258, -264087, -171303, 63841, -175730, -110847, 350262, -96644, 135225, 91024, 77209, 151622, -252790, -130392, 18153, 87059, 265437, 210413, -78329, 70276, -61146, 229075, -353550, 47776, 182142, 145303, -116709, -160982, 114221, -88695, -943, -43862, -110382, -65674, 264791, -79182, -172891, -59614, -229507]
12446b29507j39536a34336m559l12951C01731M5107b10431A25041J3306j1228
12436A27119a17005B14625J54828A37614B9997L03201D415N9621c847H2144g0072
12424A99735a93172C2842a95137b1459j02756D4235J09384a49146K8140L8849
12414h2157A68403b28867C12547F2206h0850o9897b3501F8524b51679B6994b42808
12402A18162D819a32034B49166Q8270I4540k4798L27498j70306A6185K6102b83843
12390c9914A9908L61764H3931a03165K5503A34995Q5035b31849P537J07932N4064
12379f2316B62595F0102f7225A53465E1076J85932o4327j4540b40646A7319c4674
12367a10029j42722b9394j65892P397e9425h43m9417l41527A57825N6387O3786
$$ y = [-229507, -369043, -134336, -138895, -451846, 301731, 346838, -210431, 125041, 138347, 127119, -117005, 214625, 369453, 137614, 29997, 333198, 4415, 64036, -3847, 82144, -70072, 199735, -193172, 32842, -195137, -21459, -124215, 44235, 153619, -149146, -121006, -82157, 168403, -228867, 312547, 62206, -80850, -150747, -23501, 68524, -251679, 26994, -242808, 118162, 4819, -132034, 249166, 337436, 94540, 69742, 397240, 226934, 16185, 42287, -283843, -39914, 19908, 381672, 83931, -103165, -77662, 134995, 220030, -231849, -224312, -116380, -62316, 262595, 60102, -67225, 153465, 51076, 237008, 172681, 158141, -240646, 17319, -34674, -110029, -252751, -29394, -195286, -187889, -59425, -843, -50260, -391787, 157825, 214212, 277998]
12356B77998g8208H5118J80040D2211J35356m2193c363j07711B1466L1176K11138
12345B63780b13558e8154J6345I944A180K07079g2997E1362a2863F8116R6497
12334A64613l6492R2147d3614l5643c4454q1085b2722p7488C9846J70503o4604
12323A45745k4118a05155k0919p6962j93649J32542A57982d0680j01149j93628
12313c35457A44834i7035C2254A5460J01425d0118j12055c5268B28501G6250g800
12301A53748D6754o172a59543B69456a20562r3921A14769a32589B8268d04n3520
12290e3924K0115j17356A1671a08566k4685G2918J79253i0029B16196g1277D4313
12278E42137e8152C72877j83212a4070C47181i3342D66054k01597I7990a17899
$$ y = [277998, -78208, 85118, 265158, 42211, 177567, 135374, -3363, -111074, 21466, 52642, 263780, -213558, -58154, -41809, 9944, 1180, 208259, -72997, 51362, -12863, 68116, 164613, 128121, 220268, -43614, -79257, -34454, -115539, -22722, -100210, 39846, 210349, 145745, 121627, -105155, -126074, -203036, -396685, -264143, 157982, -40680, -141829, -335457, 144834, -97035, 32254, 15460, 116885, -40118, -152173, -35268, 228501, 76250, -7800, 153748, 46754, 40582, -159543, 269456, -120562, -214483, 114769, -132589, 28268, -404, -53924, -33809, -151165, 11671, -108566, -133251, 72918, 252171, -90029, 216196, -71277, 44313, 542137, -58152, 372877, 189665, -14070, 347181, -93342, 466054, 264457, 97990, -117899]
12267g8812A95437F0856K58230J40952b95248a14233k045A10828J40906A5348
12256a93899Q5024B51207b05461A96515F3823J32432d654l158A94035a5662G276
12244B66726c9638A01887K81007r7333I9447J02093a04597D99805j98416J3913
12234C15302F5927J62075G4707a1213E7556J09742E7991G501J72017P0408p0129
12223A79797m2881J54905J72660A98372b5921D231K89692J58749A71871b51918
12212E4359K12143a15086B03265C460L42159C8360N9979a36444B14221a11842
12201E2895b791E6441J73360Q7807j3161j9126j35329J84178N276H3648L35123
12190D18771k02560A2155J12430Q4240L0158L52593k66060m7953a38137A42073
$$ y = [-78812, 195437, 60856, 319086, 460038, -295248, -114233, -116278, 110828, 251734, 15348, -193899, -108875, 251207, -205461, 196515, 63823, 196255, -4654, -7812, 194035, -15662, 7276, 266726, -39638, 101887, 382894, 285561, 99447, 201540, -104597, 499805, 301389, 315302, 65927, 228002, 74707, -11213, 57556, 167298, 57991, 7501, 179518, 249926, 179797, 136916, 291821, 464481, 198372, -25921, 4231, 293923, 452672, 171871, -251918, 54359, 266502, -115086, 203265, 3460, 345619, 38360, 98339, -136444, 214221, -111842, 52895, -2791, 56441, 229801, 317608, 304447, 285321, 149992, 334170, 339446, 83648, 418771, 216211, 12155, 124585, 208825, 238983, 591576, 325516, 277563, -138137, 142073]
12179A73581m1270n1141L60118A10090h6661D6067k0108b85094A21012k0666A4235
12167A61742o0599J84100a65857E11668j84119j54755A9759J396P1868J83886
12157B76909g9287q813A1372M36295b34706D38089A74571a31286A96470e22277
12146B27561L7656A21427f9122q9984b8130B87335b3984E487Q9623J10870a14579
12134a30931H3162b9488A19373Q1492b62011J25417A21167b57267B00713j9965
12124A80748L472F5359L0678c29061M8446D2695N2958a0160A12633a18403A98654
12112b01048H307a73680q4789P0064F5261J001j0847d6473E5493K08800a13432
12100F5062O027b52762D099f6092F4373b7594j7164q6876m0134L9710p741A04848
$$ y = [173581, 132311, 81170, 441288, 110090, -86661, 46067, 25959, -285094, 121012, 100346, 14235, 161742, 101143, 285243, -165857, 511668, 327549, 172794, 19759, 21155, 93023, 276909, -79287, -88100, 11372, 447667, -234706, 438089, 174571, -131286, 196470, -522277, 227561, 265217, 121427, -69122, -159106, -28130, 287335, -23984, 5487, 95110, 205980, -114579, -130931, 83162, -29488, 119373, 200865, -262011, -136594, 121167, -257267, 200713, 180748, 184220, 65359, 96037, -329061, -280615, 42695, 95653, -10160, 112633, -118403, 198654, -201048, 8307, -173680, -258469, -188405, 65261, 66262, 55415, -46473, 55493, 264293, -113432, 65062, 71089, -252762, 4099, -66092, 64373, -27594, -44758, -131634, -171768, -132058, -139799, 104848]
12087A69960J09585A09969P0989i3588B1246a90110h4320j56050L7244B12486
12076C84164K31835J098667j16259o83192B5533P7164J28952d63p4882A71923
12065G0279j4933a99650P5077A77251l2546a62895b5012k08890k1123G0664a82131
12053G1042b2011A5098b41474A28918g4322m1466A00045p027k3671b0898m05698
12042d26596A27384a20763o584k6807I6343C3712f7516n5710B32510j7362a08977
12030I8375L01797b36265f125j53679K0895E7922g0873D36559f1695A3571a12068
12018B6017c3198A10727M5788Q246e4014A66460b02047k8130n3852A65367j1354
12007A54013J3959c8147B58583b05438A5137J19873P8032K7985a23306R142E3880
$$ y = [169960, 279545, 109969, 180958, -93588, 21246, -190110, -84320, -240370, -203126, 212486, 384164, 615999, 1714666, 1598407, 915215, 25533, 102697, 231649, -463, -75345, 171923, 70279, 55346, -199650, -124573, 177251, 144705, -162895, -25012, -233902, -255025, 70664, -182131, 71042, -22011, 15098, -241474, 128918, -74322, -115788, 100045, 93018, 69347, -20898, -426596, 127384, -120763, -127347, -154154, 96343, 33712, -67516, -123226, 232510, 215148, -108977, 98375, 400172, -236265, -6125, -159804, -138909, 57922, -70873, 436559, -61695, 13571, -112068, 26017, -33198, 110727, 156515, 164761, -54014, 166460, -202047, -230177, -284029, 165367, 154013, 167972, -38147, 258583, -205438, 15137, 135010, 213042, 241027, -123306, -114164, 53880]
11995C311J00200a70757P8738L5947l1045L9347n2791A76791g2025a0318B5813
11983g5596F6632b51602A46270a3837k03756A86377A809c46451A87956f4810A39758
11971b8259A77972L2832k7396f736A75534J47244A17463a53621A81479m1859O8583
11960B08203a14516A83684d26418a18399o2270N7122c1829j40663G2418a26950
11949D14800A04604a31918j3674A92428P1853p2983c67625a66234A86722b9994
11938b10751l3323G5330f6016j52469f896G7042h1896B9886b5264o8149A37626
11926g8457b7062H4591i673k46162A53128k5206a063k38365a629j01119D16171
11914i3800B72415A27825A8830a03912A87610a31957L8670b1493B13959H6643
$$ y = [3311, 103511, -170757, -92019, -56072, -87117, -47770, -100561, 176791, -72025, -10318, 25813, -75596, 66632, -251602, 146270, -13837, -217593, 186377, 1809, -346451, 187956, -64810, 139758, -28259, 177972, 210804, 183408, -6736, 175534, 322778, 117463, -153621, 181479, 139620, 208203, -114516, 183684, -426418, -118399, -180669, -123547, -31829, -172492, 72418, -126950, 414800, 104604, -131918, -145592, 192428, 264281, 191298, -367625, -166234, 186722, -29994, -210751, -244074, 75330, -66016, -218485, -6896, 77042, -81896, 29886, -25264, -93413, 137626, -78457, -27062, 84591, -9673, -255835, 153128, 127922, -1063, -239428, -1629, -102748, 416171, -93800, 272415, 127825, 18830, -103912, 187610, -131957, -93287, -21493, 213959, 86643]
11903b15822I7896a57916l63G7035N490a17157A07586K47430a83605f7819k46283
11892c14102f7823e75F4942j5685c00287D7890K33136A57R454a70406O6914A4995
11879d9488J9068j37843C68410j20498a66630A49678F1662a44545K1111B8731
11868b0109A50796N174c31671A00999m6764g1295p4489G2688l1185R4497F2732
11856a65173k64452B57697L70504b45121a10246l69137d0980k05001h2764J6482
11846f6282C6780K9459J22361b11669h1371L7250o1091q3351c795l83730D6038
11834a67013P6389B48519l3289g5249j3333A22287a32288j34944c7970A76590
11823a0623j25265A39475M0372f9901A5807K8256a82273e6202G0755L9321b43191
$$ y = [-215822, 97896, -157916, -158279, 77035, 82525, -117157, 107586, 355016, -183605, -67819, -314102, -67823, -575, 64942, 49257, -300287, 47890, 281026, 157, 9611, -170406, -103492, 14995, -49488, -30420, -168263, 368410, 247912, -166630, 149678, 61662, -144545, -123434, 28731, -20109, 150796, 155970, -331671, 100999, 54235, -71295, -145784, 72688, 41503, 136000, 62732, -165173, -429625, 257697, 628201, -245121, -110246, -479383, -40980, -245981, -82764, -66282, 36780, 66239, 188600, -211669, -81371, -44121, -105212, -188563, -3795, -387525, 46038, -167013, -90624, 248519, 215230, -75249, -88582, 122287, -132288, -267232, -37970, 176590, -10623, -135888, 139475, 179847, -69901, 15807, 44063, -182273, -56202, 70755, 110076, -243191]
11811A86892F2588b97486a19977F7814b03499k1040D66K40198A09600P2399p6482
11800A05517R6562a55391p7735M7092B86537e5746K331A78692j2632Q4695f1482
11788G5731l3101a06398I0996b5132r9352B16514M3816e05531I5476a72549A49557
11776f5661q1679c5459A35952a59028f990k82040J24949A56511f8015A81694e4273
11764B5147N0080c61554A86256c28567i4573r7138P1625B39553D8160g6759K1650
11753e5109J4652A69039F0103J51102a36851K9127O896p4723j5759C68410B1740
11741B76439a9025n3674j94800J31598n5943j87418a52319l16630G402O6534J0836
11730H4772b65142d1148C8420n528O5244a26304G9524B0035a36904d0015A21559
$$ y = [186892, 62588, -297486, -119977, 67814, -203499, -224539, 466, 240664, 109600, 181999, 105517, 202079, -155391, -233126, -186034, 286537, -55746, -53415, 178692, 166060, 250755, -61482, 75731, 42630, -106398, 90996, -25132, -124484, 216514, 260330, -505531, 95476, -172549, 149557, -65661, -147340, -35459, 135952, -159028, -6990, -289030, -164081, 156511, -68015, 181694, -54273, 25147, 75227, -361554, 186256, -328567, -94573, -191711, -120086, 239553, 48160, -76759, -55109, -40457, 169039, 60103, 211205, -136851, -107724, -100828, -175551, -191310, 368410, 21740, 276439, -19025, -72699, -267499, -135901, -191844, -379262, -152319, -468949, 7402, 73936, 84772, -265142, -41148, 38420, 32892, 98136, -126304, 79524, 20035, -136904, -40015, 121559]
11718a37914o559A9283L59585C4326L3293h9285b8541J542A1977P4231f414I0651
11705A50292J96450A07003I34J64926a32497A31033a84671C33742C9250b8351
11694B61647A23639J14826a85093B97072A42998N1068q5805J19889j11588m2297
11684G4265p766b60097g4239j45831N5317o4793G1060a83676c5698G5401b90010
11672C00606r8398a41755d3788A18745j0980J9906M6691J20681d4808k9974m6996
11661a21778m6024A44798c5511B16872P1948B775a02488M2001j8562D9431K7132
11650G6563E947f3069O879C2155N4562O7584D420J16582h7073A45467a89936A90836
11637F786J50204M106B0840E145a24995j21458F6183a72689B11190F5419a17770
$$ y = [-137914, -144473, 19283, 378868, 34326, 67619, -89285, -28541, -26999, 11977, 86208, -6414, 90651, 150292, 346742, 107003, 934, 165860, -132497, 131033, -184671, 333742, 39250, -28351, 261647, 123639, 238465, -185093, 297072, 142998, 194066, 108261, 228150, 116562, 74265, 66499, -260097, -74239, -220070, -164753, -229546, 71060, -183676, -35698, 75401, -290010, 300606, 202208, -141755, -43788, 118745, 107765, 127671, 174362, 295043, -44808, -74782, -121778, -167802, 144798, -35511, 216872, 288820, 2775, -102488, -60487, -79049, 49431, 76563, 5947, -63069, -56190, 32155, 86717, 154301, 4420, 121002, -87073, 145467, -189936, 190836, 6786, 156990, 161096, 20840, 5145, -124995, -246453, 66183, -172689, 211190, 65419, -117770]
11625h6086A85104q7586K98440d7631l6654D6094j3185a1946k73267A77095h9026
11613E54134A20665a29877L0229k50524b9843A6066b49893e6036A60888a84567
11602b18469F1165O5981J57094Q6256F2610J24035I1020R9665a29860j03919B0516
11590A09727l6515b01622B7726K94659O7025e978k5960j56771I2212A5371M68699
11579D84070A25800n3656a03431A91307c1879I8403J4673B67M44527B16782r6807
11568A19975E6605J13878R6431o3753a89846B24845M7550q7334J2584q83J9015
11557B15777J42508r0582C5423O5155B5817h1554E5300Q5366A5582L7531J39439
11546A92552r6187J02718a11702H8908a86137C15209H5005K9633a03304A90824
$$ y = [-86086, 185104, 97518, 395958, -47631, -84285, 46094, 32909, -11946, -285213, 177095, -89026, 554134, 120665, -129877, -99648, -350172, -29843, 16066, -249893, -56036, 160888, -184567, -218469, 61165, 127146, 284240, 370496, 62610, 186645, 91020, 190685, -129860, -233779, 20516, 109727, 73212, -201622, 27726, 322385, 389410, -5978, -31938, -188709, 92212, 15371, 484070, 125800, 72144, -103431, 191307, -31879, 98403, 113076, 267, 444794, 216782, 119975, 56605, 170483, 266914, 203161, -189846, 224845, 272395, 185061, 197645, 196762, 215777, 358285, 267703, 35423, 100578, 25817, -81554, 55300, 140666, 15582, 53113, 192552, 96365, 199083, -111702, 88908, -186137, 315209, 85005, 114638, -103304, 190824]
11535A07060C6818J24502B068J24432d20343H1743k7337p731b4482l4350A11966
11523F0450J40099i9703G7307b73291j1076A43384p479b20108C02855K5320a27042
11511A20102N2007J60647h9994E2609Q9714A9673a7601A49405a7884A98478N0887
11500B49365f2708A35103J20210p1922j6387M72541A8350a14743A71193O7092
11490B38285b2196r4552E2798K04417l1155G9090c5364A33175M6639A3356L0840
11479D4196L29962a04672A75307L2590o8428L89279B00180L34178H5327a87018
11468D2643R2313Q6993B9463J56590q2979J34392P0357A19883L10752F3924b51902
11456B6718c0361A29035L75816A6142c833A79470J21326H4147J55077a77033Q8349
$$ y = [107060, 36818, 161320, 2068, 126500, -420343, 81743, 54406, 46675, -24482, -58832, 111966, 60450, 200549, -99703, 77307, -273291, -284367, 143384, 135905, -220108, 302855, 328175, -127042, 120102, 172109, 332756, -89994, 52609, 142323, 19673, -17601, 149405, -17884, 198478, 249365, -62708, 135103, 255313, 183391, 167004, 639545, 18350, -114743, 171193, 238285, -22196, -116748, 52798, 257215, 226060, 79090, -35364, 133175, 179814, 13356, 44196, 374158, -104672, 175307, 207897, 139469, 528748, 200180, 534358, 85327, -187018, 42643, 134956, 221949, 29463, 186053, 103074, 237466, 307823, 119883, 430635, 63924, -251902, 26718, -30361, 129035, 504851, 16142, -3833, 179470, 300796, 84147, 239224, -177033, -88684]
11445h8684j57998E7211m419J19285E3704K5796O0458r976O5847D2275b18666
11433b32468M5221A08322L4095b29136e4683B45752l7645c9323a5788I8528e2684
11421B75071a444r502I285J01566a25910j32432Q4141d8825A70873j3594O1721
11410B19000q6766c91302J34421A9119J315L2379N6938c9657j4330B52085q8969
11399A63116a29086B01579i2661A28977d61069G2b43595E25J14522A7945d4952
11387A06495c11j22271j53324C8306J15630b52039E1942K87399I5094b68217A19023
11375B17027K5218r7636b75168h7335B38291a00009B78906a88475A32917d1428
11364d1972J1680B65479a04029k2965C12543b85247j4792G1793N5428m6000a7941
$$ y = [-88684, -246682, 57211, 52792, 172077, 53704, 79500, 139958, 129982, 195829, 42275, -218666, -232468, -187247, 108322, 142417, -229136, -54683, 245752, 208107, -39323, -15788, 98528, -52684, 275071, -1444, -10946, 9285, 110851, -125910, -258342, -174201, -48825, 170873, 157279, 219000, 132234, -391302, -256881, 19119, 20434, 52813, 109751, -39657, -53987, 252085, 163116, -129086, 201579, -92661, 128977, -461069, 72, -243595, 525, 115047, 17945, -44952, 106495, -311, -122582, -275906, 38306, 153936, -252039, 51942, 339341, 95094, -268217, 119023, 217027, 242245, 144609, -275168, -87335, 238291, -100009, 278906, -188475, 132917, -41428, -41972, -30292, 265479, -104029, -126994, 312543, -285247, -300039, 71793, 127221, 81221, -17941]
11352c9201G125K27222N158L2151a82167B9307h8796A4684a20089E4419L0694
11341H5113a32912h78l1052j36723b5139r0539A36212b04259A30921i1847j9574
11330a11421p1554j5633M9267C7350b26566j10209h8604g994k102A36650n2116
11319H4534J8791b94568C6722K66035e3980m4041k6689o8982e5786K6098j37202
11308a66890B43462F258B921E65M3305b83944o484J02670D215P6531a23571D616
11295B16674D8411a58477d8441m9692I2775a11738a0199G3319d9357F044i9845
11283a08183A0635P8963K6809c4487G0068J1952K14919d09073G9173b3975J787
11272b2188k66349D453e3703A8688a17716m0746m6029j40303G8895J3169a34723
$$ y = [-39201, 7125, 234347, 239505, 271656, -182167, 29307, -88796, 14684, -120089, 54419, 85113, -132912, -878, -31930, -168653, -25139, -115678, 136212, -204259, 130921, -91847, -111421, -182975, -198608, -149341, 37350, -226566, -336775, -88604, -7994, -10096, 136650, 84534, 103325, -294568, 36722, 302757, -53980, -98021, -124710, -193692, -55786, -29688, -166890, 243462, 6258, 2921, 565, 43870, -283944, -290428, -187758, 4215, 80746, -123571, 4616, 216674, 48411, -158477, -48441, -98133, 92775, -111738, -10199, 73319, -49357, 6044, -99845, -108183, 10635, 89598, 116407, -34487, 70068, 82020, 296939, -409073, 79173, -23975, -22188, -288537, 4453, -53703, 18688, -117716, -158462, -204491, -344794, 78895, 92064, -134723]
11260G6871a88260A64489o9880J4707a05398p8622L6300F7609a87824D768M2318
11249D7086J91841A06751R3929C8369b5788G9879A0743a09093k12028B03897c6816
11237e4048A53413J45387b13554p1144Q9007I2627b0686k91819c8209B51686b67346
11225i3165d0416j63689A71619j2514K3072e8270A87611R6675A12831b19882A48284
11213a81487G599g5588j63678a5886B67645C6081a98689j8565N7660g382l00064
11202c07446N4381a7224A84383a50909o5400K7133A74730a89431A73096C3369
11191a21621F9336a13650r4358O4822q252e2977A27469J19387a7318E220b10093
11179b98949d5707j20289G2845i7613B71463F7125b315k3227E9807K9925b32170
$$ y = [76871, -188260, 164489, 94609, 109316, -105398, -184020, -147720, 67609, -187824, 4768, 47086, 238927, 106751, 200680, 38369, -25788, 79879, 10743, -109093, -321121, 203897, -36816, -54048, 153413, 298800, -213554, -284698, -195691, 92627, -20686, -312505, -38209, 251686, -267346, -93165, -40416, -204105, 171619, 159105, 182177, -58270, 187611, 284286, 112831, -219882, 148284, -181487, 7599, -75588, -239266, -15886, 267645, 36081, -198689, -217254, -159594, -7382, -307446, -253065, -17224, 184383, -150909, -216309, -189176, 174730, -189431, 173096, 33369, -121621, 69336, -113650, -208008, -143186, -151438, -52977, 127469, 246856, -17318, 5220, -210093, -298949, -45707, -165996, 72845, -97613, 271463, 67125, -2315, -25542, 59807, 89732, -232170]
11167B7311c3203Q066F7126c8579k276j1079A9989c14469F2062J18006a29042
11155c73066J16082f3301A81857a05494K6715b7107o7841A24635O7698a10941
11144a9901q1942K6334j65212Q7494f7715A29607R5767b42995B45514b3132A45588
11132B73941f3571C07806j2551h8358O358L499A33587a6119A44993k9375a73064
11120a93758A25709O6079p9400k1008b84545D357N3346N796N4505p243a1381D51399
11107A71356B1547O7099a25774A02815b93687E21106G3350b9895C82027c5886
11096A76704Q4404J29450b3487E7127a06147J4046B49318A05789K58338j69229
11086A94898C2904i2964b59E08471A42564E7614L79174Q1717G2175f9518C53990
$$ y = [27311, -33203, -25137, 67126, -38579, -40855, -51934, 19989, -314469, 62062, 180068, -129042, -373066, -256984, -63301, 181857, -105494, -78779, -27107, -94948, 124635, 192333, -110941, -19901, -101843, -75509, -240721, -153227, -67715, 129607, 225374, -242995, 245514, -23132, 145588, 273941, -63571, 307806, 295255, -88358, -82000, -78501, 133587, -16119, 144993, 115618, -173064, -193758, 125709, 191788, 112388, 91380, -284545, 4357, 57703, 63499, 118004, 110761, -11381, 451399, 171356, 21547, 88646, -125774, 102815, -293687, 521106, 73350, -29895, 382027, -35886, 176704, 261108, 390558, -23487, 57127, -106147, -92101, 249318, 105789, 364127, 194898, 32904, -92964, -259, 508471, 142564, 57614, 436788, 518505, 72175, -69518, 353990]
11074C99578F7397i03D77398J0274j40591p8694q5118J65395R9171k04297L29081
11063E72619k09316J38678k3096k3954K78096B36547N59484j34842k18492L01842
11053G44539K78303E05070L09668P35k34666K27592C23875L37869J11089l10820
11043D62013J55970j55224q8146K28742K96319D49378N5691N61116l96119K1992
11033F92058q4040J56755m5288j36264j10078J80179M0485j6358k58507L24653
11023G43595r7205k7640J83762C30428L80871j2568j86782k3777Q0121A70086
11012H78385j71138R02m9423N51736E36589J29537J47513j05261j45765j26939
11002D35674r2191L87534j57321J13890m1064j00830j36010J65996j45155L71845
$$ y = [399578, 67397, -903, 477398, 487672, 347081, 268387, 183269, 348664, 447835, 243538, 572619, 363303, 501981, 478885, 454931, 733027, 236547, 796031, 661189, 442697, 744539, 1022842, 505070, 814738, 815473, 580807, 808399, 323875, 661744, 772833, 462013, 617983, 462759, 374613, 603355, 899674, 449378, 505069, 1066185, 670066, 692058, 608018, 764773, 719485, 583221, 473143, 653322, 693807, 677449, 418942, 743595, 646390, 618750, 802512, 330428, 711299, 698731, 511949, 488172, 568293, 170086, 878385, 707247, 708149, 658726, 1210462, 536589, 666126, 813639, 708378, 562613, 435674, 343483, 731017, 573696, 687586, 646522, 545692, 409682, 575678, 430523, 802368]
10992H02368l04251j76512L81685j43327M85782l79691K24202p658N6873l0022
10982I09449J62515N6015J05311J28851j05292K75555L4324Q85101k12117K12513
10972B452225K27252k23569L00037j2540p4166n98785K67895n42965l30675K32869
10962A697578k2712J3086N8500l95040M92539m48874L0601O2669j04600j20753
10952A262994P5983l76471J8975j0385l68619j65033j90168I9719K23131n1457
10942B71393J50419j35844n3993J53055A76530M4729A03973O9344n501a30434
10931B42265a61083B00031A8810N3768K69290b73860A37274e6033j83828a2070
10920f9383A31825b0862r6541A99736a96190B22232d374k32211F5020B3258a85543
$$ y = [802368, 498117, 321605, 703290, 559963, 1045745, 666054, 890256, 882598, 939471, 909449, 1071964, 1127979, 1233290, 1362141, 1256849, 1532404, 1566728, 2451829, 2239712, 2452225, 2679477, 2455908, 2755945, 2743405, 2669239, 2070454, 2338349, 1795384, 1464709, 1697578, 1674866, 1687952, 1746452, 1351412, 1843951, 1395077, 1425678, 1488347, 1383747, 1262994, 1338977, 962506, 981481, 971096, 602477, 437444, 247276, 99719, 322850, 271393, 421812, 285968, 231975, 385030, 176530, 221259, 103973, 173317, 167816, -130434, 242265, -161083, 200031, 18810, 72578, 341868, -273860, 137274, -56033, -239861, -12070, -69383, 131825, -20862, -117403, 199736, -196190, 222232, -4374, -236585, 65020, 23258, -185543]
10908A67194N123q1115K2996j8670C5514M4849d4215F6317J55325q353o9670p152
10896A36467J4105c9279B64445b58699B53202b03225R8694c198A48296b62422
10885A12158d58122b28698k9166D6136h6583I9057f7241j36436D5142i7474a250
10873d6850k12095P2872H906b01526D4369L9882c47763A06344G919a5860m3990
10862e9850m9360A73267c24557B48076b28229B35955D2673J2166L34658A15438
10851B13201G8674K57945a40612n6042E9531b93729E073J63992a93176G1615a86530
10839a70726K5629j58719D3882d50907J83701A84309B6671g2464J3975l1433k51512
10828c41434h5132k8404B30110L5741F7947f4417B11836a60325r9723A67222q3315
$$ y = [167194, 172317, 91202, 114198, 95528, 35514, 80363, -44215, 66317, 221642, 213289, 143619, 136467, 150572, -39279, 264445, -258699, 253202, -203225, -104531, -3198, 148296, -262422, 112158, -458122, -228698, -257864, 46136, -86583, 99057, -67241, -203677, 45142, -97474, -1250, -46850, -258945, -186073, 8906, -201526, 44369, 84251, -347763, 106344, 7919, -15860, -59850, -109210, 173267, -324557, 248076, -228229, 235955, 42673, 54839, 389497, 115438, 213201, 78674, 336619, -140612, -196654, 59531, -293729, 5073, 169065, -193176, 71615, -186530, -170726, -145097, -303816, 43882, -450907, -267206, 184309, 26671, -72464, -58489, -89922, -341434, -85132, -113536, 230110, 265851, 67947, -64417, 211836, -160325, -260048, 167222, 83907]
10817H3907a55779p6306A26645h890j20942F65a2171g4k66479B57107a90509H0664
10804C71160I9896a24185n6034C1216J13099e6717A8081g5115B11761b71160J20620
10793a50540K8236A00401B9019c7720m4986F9448A4250b21051j03230g9173C07485
10781h8263j88587c446k47385A12565l1756l4699a44757A15268a93405A48003
10770C20480c04894B12000c16017I2611J53944d9257A45128O8680I6271a06518
10759c30522H9425a47449j480d8671k17107B68420a31752j12896J01622A06504
10748b09696j45192J08922E48185A2040a9173C00379a35004G8846c22681B10151
10737D8282J56017d1624i171A4492J68743E5676P9408E9339K65915b76800B55483
$$ y = [83907, -155779, -232085, 126645, -8890, -129832, 665, -12171, -74, -266553, 257107, -190509, 80664, 371160, 99896, -124185, -180219, 31216, 144315, -56717, 18081, -75115, 211761, -271160, -150540, -122304, 100401, 29019, -37720, -82706, 69448, 14250, -221051, -324281, -79173, 307485, -88263, -276850, -3446, -250831, 112565, 80809, 46110, -144757, 115268, -193405, 148003, 320480, -304894, 212000, -316017, 92611, 246555, -49257, 145128, 213808, 96271, -106518, -330522, 89425, -147449, -148929, -48671, -265778, 268420, -131752, -244648, -143026, 106504, -209696, -354888, -245966, 548185, 12040, -19173, 300379, -135004, 78846, -322681, 210151, 48282, 204299, -41624, -9171, 14492, 183235, 55676, 135084, 59339, 325254, -276800, 255483]
10725a9196k97521Q5391A99103c02385f2881k5693B41866G7280J33849b72627
10714b0239A2380J14973b9717j50543B49573b63688E5785e5620I6999K92857D5015
10702A36053o397a81281j87822A09166c36423J43708j73983J52447m124A11707
10691f9592r7583e692j1545q6841j57300h3721A03283a05110j39617C75979b36649
10679f3013A10676e4780b4894l00129A78536f07G159K18692R9223a12122j19031
10668b31153N7017p3580H6979R232b42277N2951N4750B1982N2234h0510j98165
10657b78675A2621i3260k55203f9410F889J19855b5484A35431a86691A02979b8826
10645A66109J52189d00460B64642i7064a3797j31674o6767B01072d07934p8986
$$ y = [-19196, -316717, -231326, 199103, -302385, -62881, -88574, 241866, 77280, 211129, -272627, -20239, 12380, 127353, -29717, -180260, 249573, -263688, 55785, -55620, 96999, 389856, 45015, 136053, 129656, -181281, -369103, 109166, -336423, -192715, -366698, -214251, -218375, 111707, -69592, -167175, -5692, -17237, -104078, -261378, -83721, 103283, -105110, -244727, 375979, -236649, -63013, 110676, -54780, -24894, -325023, 178536, -607, 7159, 225851, 325074, -112122, -231153, -174136, -247716, 86979, 96211, -242277, -189326, -134576, 21982, 74216, -80510, -278675, 12621, -93260, -348463, -69410, 6889, 126744, -25484, 135431, -186691, 102979, -28826, 166109, 318298, -400460, 264642, -97064, -13797, -145471, -212238, 201072, -407934, -486920]
10635d86920A66693b33858A32241b03775d2039j56039A32769b25732e7911B53614
10624C13423G4046b9587j05050L3376J6223j58291F1961L1467a10890j31846c6333
10612C2927f4915r567p3728A27520f7205K5264j22110j57851A6631a11120K1332
10601h9788B14123a50263j05821i1691A09117c22709J41404g2022J4331B26959
10590I5050k6605c81111B17362n1715a89497B2236N7011i4783I3170J01669i2681
10578e3130B07234c3548I1920a76414O3572D3355b08026G1194a5054l2383l9876
10567h7313L1771n0256a3697E1246e5151A04430b13172D1899c1941j22936L7223
10556a17654e5353C2586J80874a9290k11153B6219a14908l05600B16564g3842
$$ y = [-486920, 166693, -233858, 132241, -203775, -42039, -198078, 132769, -225732, -57911, 253614, 313423, 74046, -29587, -134637, -101261, -85038, -243329, 61961, 93428, -110890, -242736, -36333, 32927, -64915, -74482, -148210, 127520, -67205, -41941, -164051, -321902, 16631, -111120, -89788, 214123, -150263, -256084, -91691, 109117, -322709, -181305, -72022, -57691, 226959, 95050, 68445, -381111, 217362, 165647, -189497, 22236, 79247, -94783, 93170, 194839, -92681, -53130, 207234, -33548, 91920, -176414, -112842, 43355, -208026, 71194, -15054, -47437, -87313, -55542, -105798, -13697, 51246, -55151, 104430, -213172, 41899, -31941, -154877, -117654, -55353, 32586, 213460, -19290, -230443, 26219, -114908, -420508, 216564, -73842]
10545A42539a8431C049L75960a49854p4595l6152O7566d0425a8088A36341J92679
10534C29020b17989J5633I3651A8817p197N8102a67357A63541e2400A96021c217
10522a23125a9652r1196A14016B1089a13256D0051a3378J5B7474a23348j78842
10511c02190F1300K36542D2232h119j3543j70134E0667O0703N7577a80098A95359
10499F4386a00245H6382J9860e1922K2997J0459p9345B68893f7898j00508A2629
10487f1278C2593a43309A4969K49154f4916A03423K75703o784J97695B55943F3923
10475a75974B95118a01094A93451f4927b4107j06374j53521k2729A36837L5957
10465A72794i1080j19077o3887h0816m6568M0824K9957j03499B34054A9516b88612
$$ y = [142539, -18431, 3049, 379009, -149854, -224449, -260601, -193035, -40425, -18088, 136341, 329020, -217989, -202356, 93651, 18817, 11620, 69722, -167357, 163541, -52400, 196021, -3217, -123125, -19652, -110848, 114016, 21089, -113256, 40051, -13378, -13363, 27474, -123348, -302190, 61300, 297842, 42232, -8119, -21662, -191796, 50667, 111370, 168947, -180098, 195359, 64386, -100245, 86382, 106242, -51922, -28925, -18466, -97811, 268893, -67898, -168406, 12629, -61278, 32593, -143309, 14969, 264123, -64916, 103423, 379126, 372342, 570037, 255943, 63923, -175974, 295118, -101094, 193451, -64927, -24107, -130481, -284002, -306731, 136837, 172794, -91080, -210157, -274044, -80816, -127384, -86560, -56603, -160102, 234054, 19516, -288612]
10453C91132A53073a23743G1178P6535l3385J75040A03843J71657r6809f829G3984
10441b53203m6858A8108J06960i9681C90044a02522A6515O8364A1737J84637b0574
10429D2304J19267A827a18171A36253F0031K33111A02525B5562a22701g12B88548
10417a91258B34503N413k5255I8539c4680j88050a9355n1827A06095c86001a39774
10405E9737f6089j91927l726p7912I0001b97066b9574k4508A78416a3446a451
10393B11253i6312G7076R2753h4403m1790H914J8804K40171h9165j21854A60277
10381a59953N6524H925J89610G4770M5983K84039A76727L1833J83372l5704A21282
10369B55709M3193n3642K5052K47646K2706m0353N3727B19884K8915K0230C2312
$$ y = [391132, 153073, -123743, 71178, 147713, 114328, 289368, 103843, 275500, 178691, -6829, 73984, -253203, -300061, 18108, 125068, -99681, 390044, -102522, 16515, 84879, 11737, 196374, -20574, 42304, 161571, 1827, -118171, 136253, 60031, 293142, 102525, 25562, -122701, -712, 288548, -191258, 234503, 239916, 214661, 98539, -34680, -222730, -19355, -71182, 106095, -386001, -139774, 59737, -66089, -258016, -261742, -339654, 90001, -297066, -29574, -54082, 178416, -13446, -1451, 211253, -96312, 77076, 169829, -84403, -126193, 8914, 27718, 267889, -89165, -211019, 160277, -159953, -103429, 8925, 198535, 74770, 120753, 404792, 176727, 208560, 391932, 356228, 121282, 255709, 298902, 245260, 270312, 517958, 540664, 500311, 554038, 219884, 248799, 269029, 32312]
10357F2932K28119K19125k04553A39769L01381K77259k84614K91350k87949m5935
10347C91261O3702j43155J15495d7586A12889D2372L75462A06338N50578f6593
10336B30003O7349G0762J86848h2838F8969h616B89974B1360b40842c2596B39279
10324A09242A0195K93380I7350J90456b9438A62526E9374K24462J36879A59363
10313d0246k3379B47704D09a13057A12515A5602b8923l3224g556r6671k16693
10302c20920g4125l2490A0295a09873B19650B2717c121I5843A56a25863d1877
10290c47653Q6965K9893A19011c53134O2320A17752a66433B25369b18338B05576
10279c08545C103b56874j87897e8602k00466B236K31406B6478K12510g4320G0083
$$ y = [62932, 291051, 510176, 305623, 139769, 441150, 718409, 433795, 725145, 437196, 391261, 454963, 311808, 427303, -47586, 112889, 42372, 417834, 106338, 656916, -66593, 230003, 297352, 70762, 257610, -82838, 68969, -8616, 289974, 21360, -240842, -32596, 239279, 109242, 10195, 303575, 97350, 287806, -29438, 162526, 59374, 283836, 420715, 159363, -40246, -63625, 247704, 409, -113057, 112515, 15602, -28923, -62147, -7556, -104227, -320920, -74125, -106615, 10295, -109873, 219650, 22717, -3121, 95843, 156, -125863, -41877, -347653, -260688, -230795, 119011, -353134, -290814, 117752, -166433, 225369, -218338, 205576, -308545, 3103, -256874, -444771, -58602, -259068, 2236, 233642, 26478, 238988, -74320, 70083]
10267c0160j39760A50078b49380a06098D6418j9212K08022J00455G1736K4268
10257I6004K04599j46652J48590c273D34187A79209A220J70756f16r0070C44196
10245a81164L8887O0001j79745A21179L0587c19224a2908A93112O4865b96363
10234A97976d25631a0672C43216g9169B58741E8566R1609D4180b05620R4721l1383
10223a42282b1094p3331B84734a00158n8998D1816a16873B43561e06747b01941
10212F3467a24839j24136e9627j03479A51978b27550H2096h0698D7335Q7001b7422
10200A4996O6870g4299K3698A25097a5894A0328f6934F838b90356R6567N3222
10189a40567A6513e4119h922I732K92304a37077G9868K19977a10804k35821i5008
$$ y = [-30160, -169920, 150078, -249380, -106098, 46418, 27206, 235228, 335683, 71736, 96004, 300603, 153951, 302541, -3273, 434187, 179209, 1220, 171976, -616, -90686, 344196, -181164, -142277, -82276, -262021, 121179, 151766, -319224, -12908, 193112, 257977, -296363, 197976, -425631, -10672, 343216, -79169, 258741, 58566, 150175, 44180, -205620, -110899, -142282, -21094, -94425, 284734, -100158, -159156, 41816, -116873, 243561, -506747, -201941, 63467, -124839, -248975, -59627, -163106, 151978, -227550, 82096, -80698, 47335, 134336, -27422, 14996, 81866, -74299, -50601, 125097, -15894, 10328, -66934, 6838, -290356, -193789, -140567, 16513, -54119, -8922, 9732, 302036, -137077, 79868, 299845, -110804, -346625, -95008]
10177a4296k859F7918d17263B30684b06348J138Q9514B55052J3913j1932p7053
10166A79980b09458A99442a920E3409a75343m0997e955n2062A95485Q4857c22369
10154C7705b14006N2467j13401l292F0091L2500m2834K77109b51111R6513d5100
10142d1534D5240e83116b37611A51904i0050A67927a84795A88820e4493A5403
10131a90420g1489k18813b0510n1651q9225I6265J22545G2961a82452j79865R9750
10120b62567c7744q0386d2945A31631O8712F9835J6526i581l2805j57922B10334
10108a39129A75504c6588A45079b31378g8927o9848j2418j64823J37554F7621
10097a61240d5893A07465d14486A0743J3236J54131K6533a31070d0973E0923a22108
$$ y = [-14296, -17155, 67918, -417263, 230684, -206348, -205210, -115696, 255052, 268965, 257033, 179980, -209458, 199442, -1920, 53409, -175343, -216340, -5955, -58017, 195485, 280342, -322369, 37705, -214006, -161539, -274940, -278232, 60091, 92591, 49757, 326866, -251111, -154598, -45100, -41534, 45240, -583116, -237611, 151904, -90050, 167927, -184795, 188820, -54493, 15403, -190420, -71489, -290302, -20510, -72161, -161386, 96265, 218810, 72961, -182452, -362317, -262567, -37744, -118130, -42945, 131631, 200343, 69835, 86361, -9581, -42386, -200308, 210334, -139129, 175504, -36588, 145079, -231378, -78927, -148775, -161193, -326016, -188462, 67621, -161240, -45893, 107465, -414486, 10743, 23979, 178110, 204643, -131070, -40973, 50923, -122108]
10085b45k41746A77977c30924J53696C9042M2793b98860b2899D6372O1701a47363
10073C13255o9167A12468m7707a58204b2567B76325G5632a38750D7692N8259a68637
10061A58246k9182a05623l7540A51194a33782b9049B3271a31608I7183c8159j32836
10050a70995j96599h0305k41326k1206a13832M861j20241g5501j35648p1041K8585
10039b53605a03484L5164G2901B4814K9536b30659B31719b73349a23040j57327
10029b80367J00312h5128j32067Q3343K9328I8524C2340O9828a68691g8462E4378
10017b25265A31107b5433A07308d6149D374J49227a76992A92456q1183J31749
10007B43022b16520A29109D3617A7891i2128j76644e296F3599a20980C8345A6754
$$ y = [-245, -241991, 177977, -330924, -177228, 39042, 81835, -298860, -22899, 46372, 108073, -147363, 313255, 244088, 112468, 64761, -158204, -22567, 276325, 75632, -138750, 47692, 105951, -168637, 158246, 129064, -105623, -143163, 151194, -133782, -29049, 23271, -131608, 97183, -38159, -170995, -367594, -80305, -321631, -342837, -113832, -108971, -229212, -75501, -211149, -282190, -253605, -103484, -68320, 72901, 24814, 54350, -230659, 231719, -273349, -123040, -280367, -180055, -85128, -217195, -133852, -104524, 98524, 32340, 102168, -168691, -78462, 54378, -225265, 131107, -25433, 107308, -46149, 4374, 153601, -176992, 192456, 111273, 243022, -216520, 129109, 43617, 17891, -92128, -268772, -5296, 63599, -120980, 38345, 16754]
9995G114J89428o8992J5727b7258A0430b38433j81988A06301m6690a37727j58600
9984b96327A37204b68660d3026l53943J01659a37243f3499j2995N793J2695a1879
9972F4148e8105m8392j39423R5528d9324A26510b52284J14992j73587e1612m0578
9961i2190m251j6760B38055D181R5461h455A4905a09085j60765N4486C03746b58183
9948b53853C72342a50834O4390B17052c4293j65015O7385G2838d9277q143j69877
9937b27297k3412C5968b67366f9868o8539l61335H6938C5867J16146A9777f4684
9925d6782j20458B18246G1365a32451j02331K9963B595L14952b08045h3963I6038
9913a00353L6448k16865F3589K14584c81832J55495A63963j8559a48933j09079
$$ y = [7114, 196542, 127550, 143277, -27258, 10430, -238433, -420421, 106301, 59611, -137727, -296327, 137204, -268660, -43026, -396969, -295310, -137243, -63499, -76494, -70701, -58006, -11879, 64148, -58105, -106497, -245920, -150392, -49324, 126510, -252284, -137292, -310879, -51612, -92190, -96441, -113201, 238055, 4181, 99642, -8455, 14905, -109085, -269850, -215364, 303746, -258183, -253853, 372342, -150834, -86444, 217052, -34293, -199308, -131923, 72838, -49277, -57420, -227297, -250709, 35968, -267366, -69868, -138407, -499742, 86938, 35867, 152013, 19777, -64684, -46782, -167240, 218246, 71365, -132451, -234782, -204819, 2595, 317547, -208045, -83963, 96038, -100353, -63905, -280770, 63589, 278173, -381832, -226337, 163963, 145404, -148933, -258012]
9903b58012D1410h395A24624b11861i6630n1499B77796b29920Q744k11784G5558
9891i1935K3423B00928r9119b1887G5539a53014e4725j38344e0547l03779A09491
9879b15099j52912a76881E9617c99876a26681k59643Q6841B9916c80929f3640
9868D971a4571j59062k9428c4512B09550b08662M5838j7631B02862Q0694A19036
9856D08225j95244b42000L6091q672A00098c20286c2650E0714j5390M588g6333
9844B2874b49395O2064A16507J85690f0297D2940M2761a13651d6894j08883j48825
9833c04602k00522K18541H5624l2144b89100L8549q8611a58150G5477k4284b09332
9821C8160d22684D7042D815f991p6748M1459k6610q4173K8017C35072h0373I6363
$$ y = [-258012, 41410, -8395, 124624, -211861, -96630, -148129, 277796, -229920, -221176, -432960, 75558, -91935, -68512, 200928, 101809, -21887, 75539, -153014, -54725, -193069, -50547, -354326, 109491, -215099, -368011, -176881, 59617, -399876, -126681, -386324, -299483, 29916, -380929, -63640, 4971, -14571, -173633, -203061, -34512, 209550, -208662, -162824, -180455, 202862, 283556, 119036, 408225, 212981, -242000, -205909, -214581, 100098, -320286, -32650, 50714, 35324, 39912, -76333, 22874, -249395, -187331, 116507, 302197, -60297, 42940, 85701, -113651, -46894, -155777, -304602, -505124, -286583, 85624, 53480, -289100, -250551, -339162, -158150, 75477, 51193, -209332, 38160, -422684, 47042, 4815, -6991, -83739, -42280, -68890, -153063, -125046, 335072, -80373, 96363]
9808G1893a63970C60692j29379b1963G9574C5646d2714J8785j56184C2935b82777
9796c3245C13389a03104j97917A54490a88730I0966C2905A1697a96697P6269m1208
9785a61636A61127e2990G297d4461A4893a78892A6620b41305J11707e8963b6860
9773B779P5969b13465A44324b90794j5181A15754a9701D8735d54453N3402d4754
9761e4334j37889K8584e9040j47577R6246n1043N3697J9256J0388r3781l83l8976
9749b11213f7378K5147c426n57A16111a24441A40651J19271B4451b35316E0766
9737i695I5718c02470B9329e860k66754J2905C8324c50809J02834h2900n5607
9726a38507A40659G179g6494G2768a35303J0157f917E1230a8277K349j39140k25814
$$ y = [71893, -163970, 360692, 231313, -21963, 79574, 35646, -42714, -23929, -180113, 32935, -282777, -33245, 313389, -103104, -301021, 154490, -188730, 90966, 32905, 11697, -196697, -120428, -161636, 161127, -52990, 7297, -44461, 14893, -178892, 16620, -241305, -129598, -58963, -26860, 2779, 78748, -213465, 144324, -290794, -305975, 115754, -19701, 48735, -454453, -401051, -44754, -54334, -192223, -163639, -59040, -206617, -110371, -161414, -107717, -88461, -78073, -171854, -172237, -211213, -67378, -42231, -3426, -3983, 116111, -124441, 140651, 259922, 24451, -235316, 50766, -9695, 95718, -302470, 29329, -5860, -272614, -259709, 38324, -350809, -247975, -82900, -138507, 140659, 7179, -76494, 72768, -135303, -125146, -6917, 51230, -18277, -15928, -155068, -380882]
9714c80882c0568j50726Q6043E3826L2131K33614b39322C4368b69261B89759E6594
9702a76522n8804l786c9485k3925a0549A09057A0447a10731m3734j85462B6135
9690e6377A3624N33143e2390k0884G5589f3341k89601J18504d286G0617M3301
9679A13918C7493d8758G3806e9277a5553F9675a53906f5128Q615K0221B2437J7724
9667D0161K4276A7983b00439A59540c05387e408k14619l3295b922C6230j6002
9656B0228b61883b3789c630B63275b14665e7036A71440b70228E3652a45287F3633
9644A60748a09011b4475B03589D9868f70q1766B4178g9942J0699A12597a31689
9632B4338d14494J41713A52352B2504R9985b5770A55928c45623A12417a1125A03304
$$ y = [-380882, -30568, -181294, -95251, 53826, 85957, 319571, -239322, 34368, -269261, 289759, 56594, -176522, -235326, -239112, -39485, -63410, -10549, 109057, 10447, -110731, -154465, -339927, 26135, -56377, 13624, 546767, -52390, -73274, 75589, -63341, -352942, -234438, -4286, 70617, 113918, 37493, -48758, 73806, -59277, -15553, 69675, -153906, -65128, -56513, -36292, 22437, 40161, 64437, 17983, -200439, 159540, -305387, -5408, -220027, -253322, -2922, 36230, 20228, -261883, -23789, -3630, 263275, -214665, -57036, 171440, -270228, 53652, -145287, 63633, 160748, -109011, -24475, 203589, 49868, -670, -82436, 24178, -79942, -69243, 112597, -131689, 24338, -414494, -272781, 152352, 22504, 122489, -25770, 155928, -345623, 112417, -11125, 103304]
9620F5548c74784b1144p8615j05993j1868B97710A15900b13757A77248d45252
9609b02194N8540k598k31123G5928a62739J6957k42404d6954j86295l3600a7753
9597C04420B8219O6146j6734O6040a2324j70105A28088L6148f9691l17760F6317
9585A62090a17460n9799j08551q640a22693J8549A41913a75352k0320O2150A49322
9573b35379a3082m434n6062F2592l0463K23882H3336L9678b16430Q0231B19461
9561h6080Q566A20299M351a78156g2882A67469b27787G2275a12344I0955a04159
9549d29543C041b34916j46097g3036a7830j48981G1339a11296B87184c6750j10751
9538a47501C6808Q3952a81263A08601g3266p2j99385n8530B77856a21625D7852
$$ y = [65548, -374784, -21144, -99759, -205752, -217620, 297710, 115900, -213757, 177248, -445252, -202194, -143654, -146252, -377375, 75928, -162739, -145782, -388186, -46954, -233249, -266849, -17753, 304420, 28219, 94365, 77631, 143671, -12324, -182429, 128088, 164236, -69691, -387451, 66317, 162090, -117460, -177259, -285810, -294450, -122693, -104144, 141913, -175352, -195672, -133522, 149322, -235379, -13082, -17516, -73578, 62592, 32129, 256011, 83336, 123014, -216430, -136199, 219461, -86080, -77514, 120299, 124650, -178156, -72882, 167469, -227787, 72275, -112344, 90955, -104159, -429543, 3041, -234916, -381013, -73036, -17830, -166811, 71339, -111296, 287184, -36750, -147501, 36808, 120760, -181263, 108601, -73266, -73338, -272723, -331253, 277856, -121625, 47852]
9526b00197j27304f1730r1041j41595B7779J08453E5933q279b08033h1908C06578
9514c96352a6552C31491a17246K6349B5839d42936a29182C8921M4185f1564g322
9502A05362b0279n8349k39661j01171f4245q7371a9772m03648J92286B36637a61693
9490e6582k20768B33509a930n1881j09092p3733q471Q0045j28081E4419B355i1551
9477B4957h1328A37442a70523b4824j07896I9770a42446O44M7809b0152q4611
9466a04763C14716A41221a29387f4634B1684D472J01580f1345q4261I0108f0656
9454E0234d3694j23096r4092f6145C16868j39726J4300q6953B9283d58226A68569
9442b11766A77253F4655b43754a16267j12160f5615k19304a06418a2069j76923
$$ y = [-200197, -327501, -61730, -152771, -294366, 27779, 136232, 55933, 47654, -208033, -81908, 306578, -396352, -16552, 331491, -117246, -90897, 25839, -442936, -129182, 38921, 83106, -61564, -7322, 105362, -20279, -78628, -318289, -419460, -64245, -151616, -19772, -423420, -231134, 236637, -161693, -56582, -277350, 233509, -1930, -53811, -162903, -236636, -245107, -165062, -293143, 54419, 2355, -91551, 24957, -81328, 137442, -170523, -24824, -132720, 99770, -142446, -141802, -93993, -20152, -104763, 314716, 141221, -129387, -64634, 21684, 4472, 106052, -61345, -145606, 90108, -60656, 50234, -43694, -166790, -260882, -66145, 316868, 177142, 191442, 104489, 29283, -458226, 168569, -211766, 177253, 64655, -243754, -116267, -228427, -65615, -284919, -106418, -12069, -188992]
9432a88992k3232B02202a21667J3571K7125N459r5104D7010b33697j18245A48771
9420a70891h1204c2042C0307a91534A56628b97535e7883j7428j26151B14529c60594
9408A15216a18608B9071K3755d7515o8349F1770K67997a54736J8145D7316f7739
9396g0003e212j29305e4144B38613q1624a61895p0516a1489k07120M7702b1397
9384A14940J22343N9045b89073a03627A22719K8759d6126m7287l17750a83096
9373A3213e6212I2406a21530j74512J11963n5000o0839A14098b33947i6519N713
9362i0806M678E9555a95654O1956p044B5140h6898E0315b35477F7617a35261C43589
9349a80696p335R3090m24862a26252k7924L5942A17324C8380j5070K367a48099
$$ y = [-188992, -212224, 202202, -121667, -108096, -80971, -75512, -170616, 47010, -233697, -351942, 148771, -170891, -81204, -32042, 30307, -191534, 156628, -297535, -57883, -75311, -201462, 214529, -360594, 115216, -118608, 29071, 52826, -47515, -115864, 61770, 329767, -154736, -136591, 47316, -67739, -70003, -5212, -134517, -54144, 238613, 156989, -161895, -232411, -11489, -218609, -170907, -21397, 114940, 237283, 296328, -289073, -103627, 122719, 151478, -46126, -93413, -411163, -183096, 13213, -56212, 92406, -121530, -296042, -184079, -239079, -299918, 114098, -233947, -96519, -90806, -86128, 59555, -195654, -133698, -140742, 25140, -86898, 50315, -235477, 67617, -135261, 343589, -180696, -188031, -94941, -519803, -126252, -154176, -118234, 117324, 38380, 23310, 25677, -148099]
9337g6664C1513J02042e7320o42922b1146r0184a155A99069a57433p7208a8714
9325E4894a57128I4166A0566O558a87004j24058b5777B6084b77443A6978K48632
9314B65610g3208j17788F6820b23495I011K13478a07448j08872B42397c9105A19235
9302B31063j02657c73780B26294A07076b22995d8064A5787b03431i7988j11553
9292b09541B70146A30922L415b97750M2992B52271A13246n6056G834P2526O1322
9281A41682a24138F9099J56869d8567A14827i79D9505a9066k27525B9299b58880
9269c16913J14776N0031A8766M7066b29237A57033h8317E640e3456C401f5546
9257i7784k09444J07239i5486l26284J94019j6698C36895a88222E3296Q17i9363
$$ y = [-76664, 31513, 133555, -57320, -700242, -21146, -111330, -1155, 199069, -157433, -234641, -18714, 54894, -157128, 94166, 10566, 17124, -187004, -311062, -25777, 26084, -277443, 16978, 265610, -73208, -190996, 66820, -223495, 9011, 222489, -107448, -216320, 242397, -39105, 119235, 231063, 128406, -373780, 226294, 107076, -222995, -48064, 15787, -203431, -97988, -209541, 270146, 130922, 134337, -297750, -254758, 252271, 113246, 57190, 7834, 80360, 141682, -124138, 69099, 225968, -48567, 114827, -979, 49505, -19066, -246591, 29299, -258880, -316913, -202137, -152106, 18766, 65832, -229237, 157033, -88317, 5640, -53456, 3401, -65546, -97784, -307228, -199989, -95486, -421770, -227751, -244449, 336895, -188222, 53296, 54113, -99363]
9245G9345a75485j7233L959b7393k0920F329a65418C4186L0584G096c07327N0890
9233b56437R1816B7191b12327B81891a54465B62061q9322c38807a47833K1024
9223a26809A908b11185c2720k3674G4538A3764i2406k9505j30711a20433G8558
9211a12502k27960a62658L664a6250m4048l9776j54818q4757K0582m6965G6816
9199b8072j7368A58709a52741B51851a86669q2648d325m0356B61366a12519b8332
9187A47414b02981g4844j6570c2800A88599b91071I697J58362C0074a76086Q6614
9176h9472k18627a46831M7773p8995A35486b07101B48258a97685g6665E0146a18593
9164A2373a77689b7983j34256r1473O9565H78a0187l37312A34806A0301b9471
$$ y = [79345, -175485, -192718, -188759, -27393, -48313, 6329, -165418, 34186, 64770, 7096, -307327, -256437, -164621, 27191, -212327, 281891, -154465, 262061, 172739, -338807, -147833, -126809, 1908, -211185, -32720, -56394, 74538, 13764, -92406, -121911, -252622, -120433, 78558, -112502, -340462, -162658, -158994, -16250, -60298, -100074, -254892, -339649, -319067, -366032, 76816, -28072, -45440, 158709, -152741, 251851, -186669, -269317, -4325, -44681, 261366, -112519, -28332, 147414, -202981, -74844, -91414, -32800, 188599, -291071, 9697, 168059, 30074, -176086, -89472, -308099, -146831, -99058, -178053, 135486, -207101, 248258, -197685, -76665, 50146, -118593, 12373, -177689, -27983, -162239, -253712, -184147, 878, -10187, -347499, 134806, 10301, -29471]
9152D72549a53644l89106A6908K91016a01459B0516a75495f6757m2190H8665K42897
9141C31562A46706l1276P041f4662B03957A00574a33170L6137H6825c63188J50541
9130b12647F4729k237j8958b5156C4911R4152b50402g2647B01L8118c9752k8392
9118f8144J1005r1275D2870Q2767c11548B63538a5359j38490B49823a96713A23231
9106A61178a97453d5648A43317b04037g8845n7230O2845B80131d8030M09l8308
9095h5929b9887j51851c6639l21030J74098A3652L33908b0933D2649b55395j4564
9084b69959B13325c06361a28025B31479b25910a02600A35481P0713o890I5225
9073a19004e4265A86914b38139I1735c12147C2764Q9228K9255N3161a69661B57342
$$ y = [472549, -153644, -542750, 16908, 307924, -101459, 20516, -175495, -66757, -108947, 88665, 331562, 146706, 115430, 122471, -64662, 203957, 100574, -133170, -97033, 86825, -363188, -212647, 64729, 62492, 43534, -25156, 34911, 129063, -250402, -72647, 201, 38319, -39752, -68144, -57139, -148414, 42870, 125637, -311548, 263538, -15359, -153849, 249823, -196713, 123231, 161178, -197453, -45648, 143317, -204037, -78845, -136075, -73230, 280131, -48030, -47621, -85929, -29887, -181738, -36639, -357669, -183571, 13652, 347560, -20933, 42649, -255395, -269959, 213325, -306361, -128025, 231479, -225910, -102600, 135481, 206194, 199304, 95225, -119004, -54265, 186914, -238139, 91735, -312147, 32764, 121992, 151247, 204408, -169661, 257342]
9061b26702h0975A5806a51492B4264J25902b48205N4416d4287l06252c8117A2932
9049F1801c59923a45390J5113o8109j19714a34431A01816O705i9126m4408H316
9037d1904j0955D04367c10382L173G4630M5428a46249d0407A217a02925j41528
9026b44453e4072k27602d6656k36645h2956a3343G2227M9575B3970b227k24098
9015b26325j4558j76243B7468a74106H1661b73523a24841j63941f5204m3479j42125
9004b50808A47448b17587j6877G8197L2854Q9267g1433C51508A46552F7073a98652
8992A0829a99687q7195J24166j14358B4149a73688C61871g5534R233B05018a1450
8980F8122m792a59793f2247H3916a01630K8253b4721j5861C4804H770J51463H182
$$ y = [-226702, -80975, 15806, -151492, 24264, 150166, -248205, -193789, -44287, -350539, -38117, 12932, 61801, -359923, -145390, -130277, -198386, -318100, -134431, 101816, 108521, -99126, -143534, 8316, -41904, -52859, 404367, -310382, -307209, 74630, 120058, -146249, -40407, 1217, -102925, -244453, -54072, -281674, -46656, -283301, -82956, -13343, 72227, 121802, 23970, -2227, -226325, -240883, -417126, 27468, -174106, 81661, -273523, -124841, -288782, -65204, -108683, -250808, 147448, -217587, -234464, 78197, 111051, 200318, -71433, 351508, 146552, 67073, -198652, 10829, -199687, -286882, -162716, -277074, 24149, -173688, 361871, -75534, -66301, 205018, -11450, 68122, 63330, -159793, -62247, 83916, -101630, -73377, -24721, -40582, 34804, 8770, 160233, 8182]
8967c94727B49682a99894H4680b28128R5365l55486b02570B19512Q965F0621L3206
8956I3827c2819A42445J26690c8057j72237A976b65022B11411b07169H4424d8996
8944H3811b76351A33953h2406j95819d8597j57279G7431a86135B32170m4157I2339
8932h4407d2183B08065a4939B91603a87173C40177g6141A58792M85019L081217
8922C725028M683668l039866B109253G00117j44791B03056j5185m0357N3951e6585
8911c81810a05398C7879Q3777J76374E8955a37305C47821A22372N0259k7081M9811
8900A95361a39216H126J34738g8360j10659d6495G8027b31630B0728b25739f0670
8888a94179d740k3998l95386a21128g26l54784B1154b58727A25160f4851K3007
$$ y = [-394727, 249682, -199894, 84680, -228128, -132763, -488249, -202570, 219512, 228477, 60621, 93827, -32819, 142445, 269135, -38057, -210294, 1976, -265022, 211411, -207169, 84424, -48996, 83811, -276351, 133953, -82406, -278225, -48597, -205876, 77431, -186135, 232170, 188013, 92339, -84407, -42183, 208065, -14939, 291603, -187173, 340177, -76141, 158792, 643811, 3725028, 8408696, 5368830, 2109253, 700117, 555326, 203056, 187871, 147514, 201465, -56585, -381810, -105398, 37879, 121656, 298030, 58955, -137305, 347821, 122372, 172631, 145550, 195361, -139216, 8126, 142864, -78360, -189019, -46495, 78027, -231630, 20728, -225739, -60670, -194179, -4740, -28738, -424124, -121128, -726, -355510, 21154, -258727, 125160, -64851, -41844]
8877d1844B71206h2806I0603a60533e7200k58986C0190c33286L3456B21339a82081
8865e4129j41931m7332J13112j45064a26998A21364a88690P4814B0093K54568
8855B74661b43494K745M042a03664E8835j4884i1226q402j35588A25710E8731
8843h5532j03619j234C65292j18022h2378o9481A47293d4367m26798b626A9443
$$ y = [-41844, 271206, -82806, 90603, -160533, -57200, -316186, 30190, -333286, -299830, 221339, -182081, -54129, -196060, -243392, -130280, -275344, -126998, 121364, -188690, -113876, 20093, 274661, -243494, -240749, -236707, -103664, 58835, 43951, -91226, -99628, -235216, 125710, 58731, -85532, -189151, -190385, 365292, 247270, -82378, -151859, 147293, -44367, -471165, -2626, 19443]
$$ [...]
##END NTUPLES=NMR SPECTRUM
##END=
