##TITLE=AC1423_MEXR_12233_7764356_ZsiqsYwX4C
##JCAMPDX= 6.0         $$ Bruker NMR JCAMP-DX V2.0
##DATA TYPE= NMR SPECTRUM
##DATA CLASS= NTUPLES
##ORIGIN= BRUKER
##OWNER= Administrator
$$ 1.72 TOPSPIN		Version 2.1
$$ 2013-04-11 19:59:25.919 -0700  Administrator@X
$$ Compression mode = diff/dup
##.OBSERVE FREQUENCY= 400.02188249412
##.OBSERVE NUCLEUS= ^1H
##.ACQUISITION MODE= SIMULTANEOUS (DQD)
##.ACQUISITION SCHEME= undefined
##.AVERAGES= 8
##.DIGITISER RES= 22
##SPECTROMETER/DATA SYSTEM= spect
##.PULSE SEQUENCE= zg30
##.SOLVENT NAME= COFFEE_meoh
##.SHIFT REFERENCE= INTERNAL, COFFEE_meoh, 1, 14.98509
##AUDIT TRAIL= $$ (NUMBER, WHEN, WHO, WHERE, PROCESS, VERSION, WHAT)
$$ ##TITLE= Audit trail, TOPSPIN		Version 2.1
$$ ##JCAMPDX= 5.01
$$ ##ORIGIN= Bruker BioSpin GmbH
$$ ##OWNER= Administrator
$$ $$ E:\/data/COFFEE/nmr/AC1423_MEXR_12233_7764356_ZsiqsYwX4C/10/pdata/1/auditp.txt
$$ ##AUDIT TRAIL=  $$ (NUMBER, WHEN, WHO, WHERE, PROCESS, VERSION, WHAT)
(   1,<2013-04-11 19:59:17.258 -0700>,<Administrator>,<X>,<go>,<TOPSPIN 2.1>,
      <created by zg
	started at 2013-04-11 19:58:10.649 -0700,
	POWCHK enabled, PULCHK disabled,
       configuration hash MD5:
       33 CF 6A 21 5C D3 B9 40 6C 15 AA 8D 27 A2 4F 13
       data hash MD5: 64K
       6D 88 29 49 03 B5 34 A7 C3 A7 83 69 AE 42 48 54>)
(   2,<2013-04-11 19:59:20.430 -0700>,<Administrator>,<X>,<proc1d>,<TOPSPIN 2.1>,
      <Start of raw data processing
       efp LB = 0 FT_mod = 6 PKNL = 1 PHC0 = 0 PHC1 = 0 SI = 32K 
       data hash MD5: 32K
       F0 CB 17 E9 DB C0 31 EB E1 6B E7 EA 20 4E 7B CB>)
(   3,<2013-04-11 19:59:20.899 -0700>,<Administrator>,<X>,<proc1d>,<TOPSPIN 2.1>,
      <pk PHC0 = 98.72314 PHC1 = 0 
       data hash MD5: 32K
       7D 6A 4C D0 C8 47 22 79 A0 63 52 FF FE 04 64 18>)
(   4,<2013-04-11 19:59:21.133 -0700>,<Administrator>,<X>,<proc1d>,<TOPSPIN 2.1>,
      <abs ABSG = 1 
       data hash MD5: 32K
       BE EE CD 99 6B 25 BB 4E 79 39 6E 01 E1 2A E1 21>)
(   5,<2013-04-11 19:59:21.290 -0700>,<Administrator>,<X>,<proc1d>,<TOPSPIN 2.1>,
      <abs ABSG = 2 
       data hash MD5: 32K
       96 FE E2 7E 23 3A 45 64 2F 66 E8 44 B6 5A 65 98>)
(   6,<2013-04-11 19:59:21.430 -0700>,<Administrator>,<X>,<proc1d>,<TOPSPIN 2.1>,
      <abs ABSG = 3 
       data hash MD5: 32K
       5F E6 44 A5 1E 0B F0 1E D2 12 72 B4 EB 38 62 4A>)
(   7,<2013-04-11 19:59:21.571 -0700>,<Administrator>,<X>,<proc1d>,<TOPSPIN 2.1>,
      <abs ABSG = 4 
       data hash MD5: 32K
       96 AA B7 16 C8 15 D6 F7 61 C5 A6 AA C2 19 8B 87>)
(   8,<2013-04-11 19:59:21.711 -0700>,<Administrator>,<X>,<proc1d>,<TOPSPIN 2.1>,
      <abs ABSG = 5 
       data hash MD5: 32K
       7C AD 41 E5 C8 28 71 76 77 33 36 C5 63 EB EF 18>)
$$ ##END=
$$ 
$$ $$ hash MD5
$$ $$ 79 BB 4D 94 07 F7 17 B4 E5 DD 74 90 51 CB 09 5C
##$RELAX= 
##$RELAX= 
##$RELAX= 
##$RELAX= 
##$RELAX= 
##$RELAX= 
##$RELAX= 
$$ Bruker specific parameters
$$ --------------------------
##$DU= <E:\>
##$EXPNO= 10
##$NAME= <AC1423_MEXR_12233_7764356_ZsiqsYwX4C>
$$ [...]
150 150 150 150 150 150 150 150
##$TP07= 0
##$TPNAME0= <>
##$TPNAME1= <>
##$TPNAME2= <>
##$TPNAME3= <>
##$TPNAME4= <>
##$TPNAME5= <>
##$TPNAME6= <>
##$TPNAME7= <>
##$TPOAL= (0..7)
0.5 0.5 0.5 0.5 0.5 0.5 0.5 0.5
##$TPOFFS= (0..7)
0 0 0 0 0 0 0 0
##$TUNHIN= 0
##$TUNHOUT= 0
##$TUNXOUT= 0
##$USERA1= <user>
##$USERA2= <user>
##$USERA3= <user>
##$USERA4= <user>
##$USERA5= <user>
##$V9= 5
##$VALIST= <valist>
##$VCLIST= <CCCCCCCCCCCCCCC>
##$VD= 0
##$VDLIST= <DDDDDDDDDDDDDDD>
##$VPLIST= <PPPPPPPPPPPPPPP>
##$VTLIST= <TTTTTTTTTTTTTTT>
##$WBST= 2048
##$WBSW= 25
##$XGAIN= (0..3)
0 0 0 0
##$XL= 0
##$YL= 0
##$YMAX_a= 652111
##$YMIN_a= -555123
##$ZGOPTNS= <>
##$ZL1= 120
##$ZL2= 120
##$ZL3= 120
##$ZL4= 120
##$ABSF1= 14.98509
##$ABSF2= -5.573092
##$ABSG= 5
##$ABSL= 3
##$ALPHA= 0
##$AQORDER= 0
##$ASSFAC= 0
##$ASSFACI= 0
##$ASSFACX= 0
##$ASSWID= 0
##$AUNMP= <proc_prof1d_extract_pilot.lims>
##$AXLEFT= 0
##$AXNAME= <>
##$AXNUC= <1H>
##$AXRIGHT= 0
##$AXTYPE= 0
##$AXUNIT= <>
##$AZFE= 0.1
##$AZFW= 0.1
##$BCFW= 0
##$BC_mod= 0
##$BYTORDP= 0
##$COROFFS= 0
##$CY= 15
##$DATMOD= 1
##$DC= 0
##$DFILT= <>
##$DTYPP= 0
##$F1P= 0
##$F2P= 0
##$FCOR= 0.5
##$FTSIZE= 32768
##$FT_mod= 6
##$GAMMA= 0
##$GB= 0
##$INTBC= 1
##$INTSCL= 1
##$ISEN= 128
##$LB= 0
##$LEV0= 0
##$LPBIN= 0
##$MAXI= 10000
##$MC2= 0
##$MEAN= 0
##$ME_mod= 0
##$MI= 0
##$NCOEF= 0
##$NC_proc= -8
##$NLEV= 6
##$NOISF1= 0
##$NOISF2= 0
##$NSP= 0
##$NTH_PI= 0
##$NZP= 0
##$OFFSET= 14.98509
##$PC= 1
##$PHC0= 98.72314
##$PHC1= 0
##$PH_mod= 1
##$PKNL= yes
##$PPARMOD= 0
##$PPDIAG= 0
##$PPIPTYP= 0
##$PPMPNUM= 2147483647
##$PPRESOL= 1
##$PSCAL= 4
##$PSIGN= 0
##$PYNMP= <proc.py>
##$REVERSE= no
##$SF= 400.02
##$SI= 32768
##$SIGF1= 0
##$SIGF2= 0
##$SINO= 400
##$SIOLD= 32768
##$SPECTYP= <>
##$SREGLST= <1H.CDCl3>
##$SSB= 0
##$STSI= 32768
##$STSR= 0
##$SW_p= 8223.68421052631
##$SYMM= 0
##$S_DEV= 0
##$TDeff= 65536
##$TDoff= 0
##$TI= <>
##$TILT= no
##$TM1= 0
##$TM2= 0
##$TOPLEV= 0
##$USERP1= <user>
##$USERP2= <user>
##$USERP3= <user>
##$USERP4= <user>
##$USERP5= <user>
##$WDW= 1
##$XDIM= 32768
##$YMAX_p= 456761185
##$YMIN_p= -658148
##$CURPLOT= <Network HP LaserJet P1505>
##$CURPRIN= <$Network HP LaserJet P1505>
##$DFORMAT= <normdp>
##$LAYOUT= <+/1D_H.xwp>
##$LFORMAT= <normlp>
##$PFORMAT= <normpl>
##$SURQMSG= 1
$$ End of Bruker specific parameters
$$ ---------------------------------
##NTUPLES= NMR SPECTRUM
##VAR_NAME=  FREQUENCY,     SPECTRUM/REAL,   SPECTRUM/IMAG
##SYMBOL=    X,             R,               I
##VAR_TYPE=  INDEPENDENT,   DEPENDENT,       DEPENDENT
##VAR_FORM=  AFFN,          ASDF,            ASDF
##VAR_DIM=   32768,         32768,           32768
##UNITS=     HZ,            ARBITRARY UNITS, ARBITRARY UNITS
##FACTOR=    0.250966925370066, 1,           1
##FIRST=     8223.43324360094, -157894,      102629
##LAST=      0,             -45843,          -54412
##MIN=       0,             -658148,         0
##MAX=       8223.43324360094, 456761185,    0
$$ Real data points
##PAGE= N=1
##DATA TABLE= (X++(R..R)), XYDATA
$$ [...]
19561E6160a99639A67592c85845J84721A60894a33921a0765l2574L935D21043
19550I9713a12777e001A7208i7435D5960b36837A75291b7271a375j65499e4227
19538b06525R3528A23610b44919D24510e9597k13786a22173B1728f4328m8588
19528a12916p9346B02159b03055K1121e7054H8850P1273b59595E2181K04332c8376
19516g2293b7986G4372a48135j83732J33200l2904k0306j21c2558o06j86978J04296
19504a15846A92031a3854C27762j57002a62189G2812b11443I8315m5645a78882
19493E5505P2934g5360K0993j20658O0584r7484d2641H7961M9775b35364A152
19481b88206f271q1386a4458A33302E5959J14033c23926k0897h1288j79709A88066
$$ plain form
19561 56160 -199639 167592 -385845 -201124 160894 -133921 -10765 -43339 -39404 421043
19550 99713 -112777 -5001 17208 -97435 45960 -236837 175291 -27271 -1375 -166874 -54227
19538 -206525 -112997 123610 -244919 424510 -59597 -273383 -122173 21728 -64328 -112916
19528 -112916 -192262 202159 -203055 -181934 -57054 88850 160123 -259595 52181 256513 -38376
19516 -72293 -27986 74372 -148135 -331867 -198667 -231571 -251877 -251998 -32558 -33164 -220142 -115846
19504 -115846 192031 -13854 327762 170760 -162189 72812 -211443 98315 52670 -178882
19493 55505 128439 -75360 -54367 -175025 -114441 -211925 -42641 87961 137736 -235364 1152
19481 -288206 -6271 -87657 -14458 133302 55959 169992 -323926 -344823 -81288 -260997 188066
19469B59894d52773a40459D0888K15958a73590A55257d4162j55262C0678c18565
19458a73428Q4740k00000A69277J06359a55286J3684p4955A45014b25861j14259
19448c40120c8498A63298e4857B37380a83867j42591b0631m0980j43831J0280
19438a95162f9071K7525r1985A82003a50763e2112H5620b7171B27487b35707L8255
19427a97452A83748a17866F2160D353b13372E2911L8643a20194M864j15593J02580
19416a28343e4956A91721b61554A91123b11563a01258g968n6326A07200b913B21026
19404I7212K6040d7952E8953m343N9203K66724b10460A05243c9021k20852a3210
19392c25893B6372a62478B13202G6511a27526E215b01661A24057b71322J22868
$$ plain form
19469 259894 -452773 -140459 40888 256846 -173590 155257 -44162 -199424 30678 -318565
19458 -173428 -88688 -288688 169277 275636 -155286 -141602 -216557 145014 -225861 -340120
19448 -340120 -38498 163298 -54857 237380 -183867 -326458 -20631 -61611 -205442 -195162
19438 -195162 -69071 -41546 -133531 182003 -150763 -52112 85620 -27171 227487 -235707 -197452
19427 -197452 183748 -117866 62160 4353 -213372 52911 91554 -120194 -115330 -230923 -128343
19416 -128343 -54956 191721 -261554 191123 -211563 -101258 -7968 -64294 107200 -2913 221026
19404 97212 123252 -47952 58953 54610 113813 380537 -210460 105243 -39021 -259873 -13210
19392 -325893 26372 -162478 213202 76511 -127526 5215 -201661 124057 -271322 -148454
19382a48454L0501r1893h9250j18613A51621b14326J8324B7161a33098K0337r6342
19371b09103b4470D9553E000M027J55917e5347r1417L1887j73140J08402c0853
19359a46257j36570E8384a80687q099A69222C8641K39452a49079O5314A66961
19348a07497d277j7990C39626a36883H9744a19753A1807a98870f7009E6342b14650
19336B1204d43955g3993H9334a61226D9557a66467p7978K7598J00614D8396b7335
19324a57014C0564O7121e16045K47151J15413e5252I235b21927j78702g7098p5598
19313a52696N2427E2416n441P4107b03057C07289i8879G3734d04422L1854a67873
19301g6668B3494Q1145J7854b97993A58922J06959c20406A11448h283A71242c14142
$$ plain form
19382 -148454 -117953 -209846 -89250 -207863 151621 -214326 -196002 27161 -133098 -112761 -209103
19371 -209103 -24470 49553 5000 9027 164944 -55347 -146764 -114877 -288017 -179615 -30853
19359 -146257 -282827 58384 -180687 -188786 169222 38641 278093 -149079 -83765 166961
19348 -107497 -4277 -22267 339626 -136883 89744 -119753 11807 -198870 -67009 56342 -214650
19336 21204 -443955 -73993 89334 -161226 49557 -166467 -244445 -216847 -116233 48396 -27335
19324 -157014 30564 97685 -516045 -268894 -153481 -55252 9235 -221927 -400629 -77098 -152696
19313 -152696 -100269 52416 46975 121082 -203057 307289 -98879 73734 -404422 -372568 -167873
19301 -76668 23494 104639 122493 -297993 158922 265881 -320406 111448 -8283 171242 -314142
19289F8118b37902A19600a52847j05695G3962b78223D4493M6372c648j41725K6765
19278a18608A89660H5655J76289b36465A23105d6191l05586I627a05794D07756
19267h2704l82302C17175B1264a91507H4081A4561J81811c28923A34446m7934
19257H6512M75691F3498B4515a05838r3450A24251b28192B4206r50K8978b62320
19245E0956R9639g0895B45203a47921j5300d7436H845J03505b41428H1069c84036
19233b05445G3516e3333p9913a3095C16554b23985b3700j61018C8772c65856e5141
19221a73120b0090j91694l6012L2337C24115c9256d349k66034l844g7372G4662
19209h9121j17369R4444p6231B56701a47758P0040C3337K02788c8619k96869C0909
$$ plain form
19289 68118 -237902 119600 -152847 -258542 73962 -278223 44493 90865 -3648 -145373 -118608
19278 -118608 189660 85655 261944 -236465 123105 -46191 -351777 9627 -105794 407756
19267 -82704 -465006 317175 21264 -191507 84081 14561 196372 -328923 134446 86512
19257 86512 562203 63498 24515 -105838 -199288 124251 -228192 24206 23256 52234 -262320
19245 50956 150595 -70895 245203 -147921 -163221 -47436 8845 112350 -241428 81069 -384036
19233 -205445 73516 -53333 -133246 -13095 316554 -223985 -23700 -184718 38772 -365856 -55141
19221 -173120 -20090 -211784 -247796 -215459 324115 -39256 -4349 -270383 -274227 -77372 74662
19209 -89121 -206490 -112046 -188277 256701 -147758 -77718 33337 236125 -38619 -335488 30909
19197G312a56121q3641g7815K19d367l10744d8592E4682J9028J61341h4433H9456
19184A20044k7267J40529H9835A3521J9290a96779B08915G1229a26560r6122J2313
19173b10369J00775j0494A2125J77309a36646j91764a34138j57436A81257i7533
19162A09892h248k15311j7739A09109h3310K2273k18922J0402m8945r2139i4396
19150A71389f9749B95765h7711k08054J09762r529d7872I8421e5639J7606A8729
19138A90767a31441e5256A91833H5488c25128g5340k8379r3307P1873n1011A08923
19126F0263b5053k48414a07293K8976C996J97029e3633k33972q1959d4595j37289
19115a81884j2788a6181j34487j50997a23391N9215B36134a12166o6171a2705
$$ plain form
19197 7312 -156121 -239762 -77815 -77596 -4367 -315111 -48592 54682 73710 235051 -84433 89456
19184 120044 92777 233306 89835 13521 32811 -196779 208915 71229 -126560 -222682 -210369
19173 -210369 -109594 -120088 12125 189434 -136646 -328410 -134138 -291574 181257 -97533
19162 109892 -8248 -223559 -241298 109109 -83310 -61037 -279959 -269557 -318502 -410641 -94396
19150 171389 -69749 295765 -87711 -295765 -186003 -195532 -47872 98421 -55639 -38033 18729
19138 190767 -131441 -55256 191833 85488 -325128 -75340 -103719 -197026 -125153 -176164 108923
19126 60263 -25053 -273467 -107293 -78317 3996 201025 -53633 -287605 -369564 -44595 -181884
19115 -181884 -194672 -16181 -150668 -301665 -123391 -64176 236134 -112166 -178337 -12705
19104D1365a98413F3601b9779o6116A81821b69089A63180D0646a87700D3179J4855
19093E8034c1538C4292j5985a96058c7989B24006b5587j62224D0869M37662C3637
19081A45621b61976a12543l3510l33461d4475j79863j10965J55560N5351I6340
19070a04403d3945j17259O1626d545p3883l86434a56891A19441a01113D6707I217
19058e9071a8203B94215E2353b59207a4013B24507B9497J28237F7835A7161b9210
19046C8353c01372J05233i1346A63901c6906H9065J59260r3658a02399B52906
19035a74381r9962C11934A1606J1102c9324q0486A17163c47019I8157m8485k0647
19024B9025J15726E5391b5009j74723C55487B0792a62764j45132J32586H8393
$$ plain form
19104 41365 -198413 63601 -29779 -95895 181821 -269089 163180 40646 -187700 43179 58034
19093 58034 -31538 34292 18307 -196058 -37989 224006 -25587 -187811 40869 478531 33637
19081 145621 -261976 -112543 -146053 -479514 -44475 -224338 -335303 -179743 -124392 96340
19070 -104403 -43945 -161204 -99578 -4545 -78428 -464862 -156891 119441 -101113 46707 9217
19058 -59071 -18203 294215 52353 -259207 -14013 224507 29497 157734 67835 17161 -29210
19046 38353 -301372 -196139 -91346 163901 -36906 89065 248325 154667 -102399 252906
19035 -174381 -274343 311934 11606 22708 -39324 -119810 117163 -347019 98157 49672 29025
19024 29025 144751 55391 -25009 -199732 355487 20792 -162764 -307896 -175310 88393
19013F8325b9846n7320j77806f8920K9473B05261a49889b8358p9271A14506a69485
19001a6471r0749l30665A23451k251a54321O2979A9973a4923k14578G6878b7237
18989A43488b03078b1041H005f9523B07674L2079k2908b78787i0980j29044M6761
18978a73263G5625K17a32386m4145c4160D7231b10745O0043A41638b79604P2708
18967b06896o6912c9662n4058K9828J7729k28656H820K13195d97100d2681B46289
18955c5217A4240J02458b30502I9925J6404c10046D4485i6880e197A3465a16497
18943A95236D4506b5656g365j0533n7265A31146C4130b04370N4380k3682O9388
18932a04284B52502J52845G7812J810e6363p9391M8323H3141Q4757b22774J01169
$$ plain form
19013 68325 -29846 -87166 -264972 -68920 -39447 205261 -149889 -28358 -107629 114506 -169485
19001 -16471 -107220 -437885 123451 121200 -154321 -91342 19973 -14923 -229501 76878 -27237
18989 143488 -203078 -21041 8005 -69523 207674 239753 216845 -278787 -90980 -220024 -173263
18978 -173263 75625 75842 -132386 -176531 -34160 47231 -210745 -150702 141638 -279604 -206896
18967 -206896 -273808 -39662 -93720 -63892 -46163 -274819 8820 222015 -497100 -42681 246289
18955 -35217 14240 116698 -230502 99925 116329 -310046 44485 -96880 -5197 13465 -116497
18943 195236 44506 -25656 -7365 -17898 -75163 131146 34130 -204370 -149990 -173672 -104284
18932 -104284 252502 405347 77812 79622 -56363 -135754 -87431 83141 167898 -222774 -121605
18921a21605o0456Q1825j1937B03380a44729e7914H1953b31316h4031c6611G0893
18909A36421a52539K5969J4245A54647m3288f0535A68046i3208C74828f8250B9155
18897A55202C4912J33532c15231A60599a40454A42820J9356a92005G7048h5867
18886a91332I2183J24211g5341j59736c765H5578A1250e9503o7672A25025a40362
18874c02141a36708K7434d2093j03594A32563m8877h4853A63986g0212A15163
18863A63932J88985b19552Q1639A3734f8731j39750p3578a20352A90855i6035
18852h0294r2774l3319E7272a39603j31926g4988j09140E7101b24853C4655O7251
18841A01906B9266b23124i2276m9925A40310a08465B07134b60819A8013d4184
$$ plain form
18921 -121605 -182061 -100236 -112173 203380 -144729 -57914 81953 -231316 -84031 -36611 70893
18909 136421 -152539 -126570 -112325 154647 111359 -60535 168046 -93208 374828 -68250 29155
18897 155202 34912 168444 -315231 160599 -140454 142820 162176 -192005 77048 -85867
18886 -191332 92183 216394 -75341 -235077 -3765 85578 11250 -59503 -127175 125025 -140362
18874 -302141 -136708 -109274 -42093 -145687 132563 83686 -84853 163986 -70212 115163
18863 163932 352917 -219552 -137913 13734 -68731 -208481 -282059 -120352 190855 -96035
18852 -80294 -173068 -206387 57272 -139603 -271529 -74988 -184128 57101 -224853 34655 101906
18841 101906 29266 -223124 -92276 -142201 140310 -108465 207134 -260819 18013 -44184
18830c77089h1146k81392A05975a42794B06366g7553j51784A19094j3043b29276
18819A7617f2095C85763j00657H8574m1780J37398N209c4850k09127C34228j30527
18808B03701a40095A9386a48366E0937b35955A06331i1933p5134A69013J3830
18798A82843g2334C34262h611j21802K2884m28782K24575a26313A76602d3265
18787b47961d6553A67394E5247M3165L2828a15450A66517a74956E0185a06232
18776a12576r9239j6448c6686j82739C4920a26376e9555J5304o719j23819b002
18764b7343b295A81971p7200D5857d5587H8554B7860a11368n2783G2988c3116
18752B43708g6628C8675e66933b8683j27438B64515B9159b09425Q3628k64238
$$ plain form
18830 -377089 -81146 -362538 105975 -142794 206366 -77553 -229337 119094 106051 -229276
18819 17617 -62095 385763 285106 88574 46794 184192 189401 -34850 -243977 334228 203701
18808 203701 -140095 19386 -148366 50937 -235955 106331 -91933 -167067 169013 182843
18798 182843 -72334 334262 -8611 -130413 -107529 -536311 -311736 -126313 176602 -43265
18787 -247961 -46553 167394 55247 98412 131240 -115450 166517 -174956 50185 -106232
18776 -112576 -211815 -228263 -36686 -219425 34920 -126376 -59555 -44251 -50970 -174789 -2002
18764 -27343 -2295 181971 104771 45857 -45587 88554 27860 -111368 -164151 72988 -33116
18752 243708 -76628 38675 -566933 -28683 -156121 264515 29159 -209425 -125797 -390035
18742c90035a30093m366A1148a718A06854M4733b0562A23418a12961A77653G8629
18730a30739M2164A38310b17286D0946b84233h2284k23758b5975j53209g9069
18719i59k54458M0877P1137l6527l6643C3555j5220M0041P2051d3172H8457d7515
18706A61816j1118a47533B39265c30691M4567B23328j10715a26124E8807d26047
18695h8306B01777C849a32930A47019a31731C44734a52537D1517d0931B22209
18684H320J52730b47906M139A31196n6980a87062C2315O5685b76930B69110c0398
18672b91230M0781A84971m0110b47193k84G4276B9418e9947m0274I9022a18609
18660d5260k25442H3854C4055f7810I4769a6730l3104k39633l7315b6960A25114
$$ plain form
18742 -390035 -130093 -134459 11148 -1718 106854 151587 -20562 123418 -112961 177653 78629
18730 -130739 -88575 138310 -217286 40946 -284233 -82284 -306042 -25975 -179184 -79069
18719 -959 -255417 -214540 -143403 -179930 -216573 33555 18335 58376 130427 -43172 88457 -47515
18706 161816 150698 -147533 239265 -330691 -286124 223328 112613 -126124 58807 -426047
18695 -88306 201777 3849 -132930 147019 -131731 344734 -152537 41517 -40931 222209
18684 8320 161050 -247906 -243767 131196 74216 -187062 32315 98000 -276930 269110 -30398
18672 -291230 -250449 184971 144861 -247193 -247477 74276 29418 -59947 -100221 99022 -118609
18660 -45260 -270702 83854 34055 -67810 94769 -16730 -49834 -289467 -326782 -26960 125114
18648a77306L870B28604A05017R525l9883a32598l2862n4386D5886N9377K08515
18637C13778n6718c6888H1071e6622j8481k3787m96689a86731j83917a7280E7916
18625B66256a86443C5563J10312a79003M4167M860k63265F8077a17172e4546n24496
18614e79042b00664o7498A8448N18772A72496B2410d6501o4398B70125a66741
18603D2264h6134A20184a96253R6516L1618p9228B33008A10774b41805j8975K8071
18592b32709q9233O2365C16184b0413F6889B3598J66659a71291A6369a35488E9210
18580a19618j52804b089r5359A21989C6737b93319Q3417R9268B3269b61115F7405
18568b03953j28092c31B0744d5022A86504C8078d1693A53985a80815M4356j17334
$$ plain form
18648 -177306 -173436 228604 105017 114542 74659 -132598 -165460 -219846 45886 105263 313778
18637 313778 257060 -36888 81071 -56622 -75103 -98890 -595579 -186731 -370648 -17280 57916
18625 266256 -186443 35563 145875 -179003 -134836 -129976 -393241 68077 -117172 -54546 -579042
18614 -579042 -200664 -268162 18448 537220 172496 22410 -46501 -110899 270125 -166741
18603 42264 -86134 120184 -196253 -99737 -68119 -147347 233008 110774 -241805 -260780 -232709
18592 -232709 -321942 -259577 316184 -20413 66889 23598 190257 -171291 16369 -135488 59210
18580 -119618 -272422 -2089 -97448 121989 36737 -293319 -209902 -110634 23269 -261115 67405
18568 -203953 -332045 -331 20744 -45022 186504 38078 -41693 153985 -180815 -136459 -253793
18557b53793c8766k28002K4089J17264p6557R6081k50142i2912L5836A32883b94459
18545a67722j2848E9209J6454J797c34724h6655A03292g4145p9199f9617A92235
18533D2874R7029i7847I6800a67617a3782l9478A62598b34313F3004a11083c2180
18521a12532H8172M9716c34916j13503B30670a80638K3301B11812E7455c54340
18510b61462R9493K4525E8938h7139D6727d3811C17482C5383a91387Q2718m3025
18499a51694l8998f0859B01709H0782g5261B90115a8580A3841a71993E9770a69685
18487D346a56324c6839j8406q9948j14801A87253o3445k7939J13696K0274a227
18475E613b10682g0068j98490P8404E0937b1435k37345J16562k41324a18948K2947
$$ plain form
18557 -253793 -38766 -266768 -242679 -125415 -201972 -105891 -356033 -92912 -57076 132883 -294459
18545 -167722 -180570 59209 75663 77460 -334724 -86655 103292 -74145 -153344 -69617 192235
18533 42874 139903 -97847 96800 -167617 -13782 -53260 162598 -234313 63004 -111083 -32180
18521 -112532 88172 137888 -334916 -448419 230670 -180638 -157337 211812 57455 -354340
18510 -261462 -161969 -137444 58938 -87139 46727 -43811 317482 35383 -191387 -108669 -151694
18499 -151694 -190692 -60859 201709 80782 -75261 290115 -18580 13841 -171993 59770 -169685
18487 4346 -156324 -36839 -55245 -145193 -259994 187253 123808 95869 209565 229839 -1227
18475 5613 -210682 -70068 -268558 -190154 50937 -21435 -258780 -142218 -383542 -118948 -96001
18464i6001B17374a68927h1388A2221g2107j31346A85436D5584N4784J296C570
18452c1695j31365k25898a32246j00449A80058B7895a34740k1225b0000l2934
18442e2934B52811c58897a07236C20047A59604a40284O7423k06609A1340a25439
18431g2557b5540j9356B55202e2999F8191b70705J22186j10700c3968A03582f9056
18419D888b80038O2818e141j42033o1379H7534A6084c66621e523k10015A461b21389
18406F0897J14931f9251A71719a02935A44841a35709A8284b21648R8390j09631
18396b32889Q8554k2388H5017a53029m25A93865i1004A87849C6502b33121B70720
18384a11917g755j55033N4936l6325N6453p4258C3218b63710I1445a3893o4777
$$ plain form
18464 -96001 217374 -168927 -81388 12221 -72107 -203453 185436 45584 100368 101664 3570
18452 -31695 -163060 -388958 -132246 -232695 180058 27895 -134740 -155965 -20000 -52934
18442 -52934 252811 -358897 -107236 320047 159604 -140284 -72861 -279470 11340 -125439
18431 -72557 -25540 -44896 255202 -52999 68191 -270705 -148519 -259219 -33968 103582 -69056
18419 4888 -280038 -217220 -5141 -147174 -208553 87534 16084 -366621 -5523 -215538 1461 -221389
18406 60897 175828 -69251 171719 -102935 144841 -135709 18284 -221648 -123258 -232889
18396 -232889 -144335 -166723 85017 -153029 -153454 193865 -91004 187849 36502 -233121 270720
18384 -111917 -7755 -162788 -107852 -144177 -87724 -161982 33218 -263710 91445 -13893 -78670
18373g8670C19049a08131C8005h1575j77230B74218h518p3883B104J81858b07841
18361G9672a08460j24296b2760j72545A51779M2997D6533O4353K04282b57425
18350A47252a08693d2021j49825j33296A89543a99105L3089B30952j08513d7645
18339a50028c8859l4994B76356B1193K00442b81599H4398a77869B73290j06479
18329A66811a00311n9613A8363c14276N6159d144l45206J49701B97197a6678A86166
18317b68236B86008A32042B2102b06213B1423a62919L6646Q485B04208i0676j75225
18306b65901J09366A64680G1514b1694j10495E7039J36496f3134A26386e30013
18295I1014K03464d8688B47762m6435d11353A24023a5551k31339I5965R3906D4085
$$ plain form
18373 -78670 319049 -108131 38005 -81575 -258805 274218 -8518 -82401 2104 183962 -207841
18361 79672 -108460 -232756 -22760 -195305 151779 194776 46533 110886 315168 -257425
18350 147252 -108693 -42021 -191846 -325142 189543 -199105 -166016 230952 122439 -47645
18339 -150028 -38859 -73853 276356 21193 221635 -281599 84398 -177869 273290 166811
18329 166811 -100311 -159924 18363 -314276 -258117 -4144 -349350 -199649 297197 -16678 186166
18317 -268236 286008 132042 22102 -206213 21423 -162919 -126273 -117788 204208 -90676 -265901
18306 -265901 -156535 164680 71514 -21694 -132189 57039 193535 -63134 126386 -530013
18295 91014 294478 -48688 247762 201327 -411353 124023 -15551 -246890 95965 189871 44085
18283a22739m217R961e4831l3767G503a92871A46158A1291K5253M4715h5296j72091
18271b57387A22246a71343H2122J02340d87063J04640G980a95341A23321g1808
18260c03863R3973M9319D14839B04025c19800A32575a91868E1063f6160o4398
18250a30558a1122l06586D0980d2263l6359A49318b33400B10328B9767a29212
18239B5807D242Q3670f5251K8778r1379C72876a24308A91986E7340P3878c53451
18227c34679f6045k2765k04578f8594B94696a50320G8961O8542F3003R2648Q6498
18216B42149R0192d15382A61326C1141q196f6164l8994A553L57688h8245j27768
18205b16013N8116C34608g7201B74785b1364A77476P2346c17402K1689A34540
$$ plain form
18283 -122739 -126956 -116995 -54831 -88598 7503 -192871 146158 11291 36544 81259 -85296 -257387
18271 -257387 122246 -171343 82122 184462 -487063 -382423 7980 -195341 123321 -71808
18260 -303863 -209890 -160571 414839 204025 -319800 132575 -191868 51063 -66160 -130558
18250 -130558 -11122 -317708 40980 -42263 -78622 149318 -233400 210328 29767 -129212
18239 25807 4242 87912 -65251 -36473 -127852 372876 -124308 191986 57340 131218 -353451
18227 -334679 -66045 -88810 -293388 -68594 294696 -150320 78961 147503 63003 155651 242149
18216 242149 332341 -415382 161326 31141 22945 -66164 -105158 1553 359241 -88245 -216013
18205 -216013 -157897 334608 -77201 274785 -21364 177476 249822 -317402 -295713 134540
18194a9167F6097J59162c3631j52784A83810c61933D40290g8615B03709I2987
18183B58327h4190k6300A06518B3845a76300J8025B6404b56930q483l3509D61246
18171D4058J45165i8479B22280f6419k08341d8394C40494A1036a29022j20908
18161b49930M0462n8518B28186I5079a6182B60208a93440k6379k0569j7169i960
18149d918j88186E967a40490l1314K178B6438K23696J59614h2320j31109J03640
18138a09789N1465b6642A56269a26540o7458l9285f6052D6183P3119I613M2121
18127E1734Q9490g8263A23454j7697a86974a0142k34862g5368P004a453B1862
18115a75782q496O4981o3665G9392K18566j02056h6926j0245j51079B2731P7909
$$ plain form
18194 -19167 66097 225259 -33631 -186415 183810 -361933 440290 -78615 203709 92987
18183 258327 -84190 -110490 106518 23845 -176300 -158275 26404 -256930 -265413 -298922 461246
18171 44058 189223 -98479 222280 -66419 -274760 -48394 340494 11036 -129022 -249930
18161 -249930 -209468 -267986 228186 95079 -16182 260208 -193440 -219819 -240388 -257557 -9960
18149 -4918 -193104 5967 -140490 -171804 -169626 26438 250134 409748 -82320 -213429 -109789
18138 -109789 -58324 -26642 156269 -126540 -193998 -233283 -66052 46183 119302 9613 51734
18127 51734 141224 -78263 123454 105757 -186974 -10142 -245004 -75368 -68364 -1453 21862
18115 -175782 -184278 -119297 -182962 79392 297958 195902 -86926 -97171 -248250 22731 100640
18104A00640A7428f4064C56167a0583k576C1931N432a28539O0268A97808n7196
18093A40612J8959f29035a24442I7961K4461b05100i504A75000a64215P6753E7855
18081d24157f0680j1356b7901j09791f6942A44131A1584L82291C9680a22443e8543
18069g564l19891a05401A54665j2967d45047A85295a25145e2782l3519A14036
18058B65310e090j92710B19513A3417J37757P9072c07603c9725E2259M252a0646
18046c28359J32874A77483q6408b00058i3076k02294h3658q1280M0039A18129
18035a97894f8782j6677j06564E2187b10385C82742g0319k1158C23039e1780j649
18024e3429K5034C5985Q2412J27930p3472n562b72160b0566l12474J27945m8558
$$ plain form
18104 100640 17428 -64064 356167 -10583 -13159 31931 37363 -128539 -68271 197808 140612
18093 140612 159571 -629035 -124442 97961 122422 -205100 -9504 175000 -164215 -87462 57855
18081 -424157 -60680 -72036 -27901 -137692 -66942 144131 11584 393875 39680 -122443 -58543
18069 -7564 -327455 -105401 154665 141698 -445047 185295 -125145 -52782 -86301 114036
18058 265310 -5090 -197800 219513 13417 151174 230246 -307603 -39725 52259 56511 -10646
18046 -328359 -195485 177483 91075 -200058 -93076 -295370 -83658 -164938 -124899 118129
18035 -197894 -68782 -85459 -192023 52187 -210385 382742 -70319 -91477 323039 -51780 -53429
18024 -53429 -28395 35985 118397 246327 172855 167293 -272160 -20566 -333040 -205095 -253653
18013b53653C4568c2652A81060o9514j0247i933G5711j9514C56b402l53148h7328
18000D1396a5120j9314c429n9122I7842J92103H1533c01099a35314j68773a10881
17988A6779a36345G3413a10258l6872A43651J23726e6502b7980E7585A417a08899
17976B3492c53058a74443K9137j8300p4565d6686B50372b37374f2939o1103A04810
17964h5725B05755a44947o7448K1396C3844a52494a4301A42417a23843B48884
17953A91902L8232G1383K5559f7184A0842i6123G9628M3632P2272b16682c5525
17941G190K07850c242k63763B4325a77363I8606m1041a46381O1654j50396C34993
17929b08171K0662D34381a17332B23141D0420b6708B31742g8800k44909E5888
$$ plain form
18013 -253653 34568 -32652 181060 111546 101299 -9933 75711 56197 356 -2402 -355550 -87328
18000 41396 -15120 -34434 -3429 -62551 97842 289945 81533 -301099 -135314 -304087 -110881
17988 16779 -136345 73413 -110258 -147130 143651 267377 -56502 -27980 57585 1417 -108899
17976 23492 -353058 -174443 -145306 -163606 -238171 -46686 250372 -237374 -62939 -124042 104810
17964 -85725 205755 -144947 -212395 -190999 33844 -152494 -14301 142417 -123843 248884
17953 191902 230134 71383 96942 -67184 10842 -96123 79628 123260 195532 -216682 -35525
17941 7190 215040 -3242 -267005 24325 -177363 98606 57565 -146381 -84727 -235123 334993
17929 -208171 -187509 434381 -117332 223141 40420 -26708 231742 -78800 -323709 55888
17918A11765O3856H3989o030a89101A32226L7597b14691a1904A08822b15186H6798
17906a43896j16556B31956a91896d983n2402n1486a2218j14317A62187n8422a22403
17894b1511k61518e4880A94656E9937L6590O7775a32710D243P88Q2755a4841A5180
17881e51n2521o5563A45451E4948a64830h426o7334A44098N1081H4758j1772b33461
17868b1310A42567O3611J2750I6961g8352j58711A10140A3070i317q2068A08150
17856A2821a12888F9551a01634a7991k45665L4590B74603J20392k0422a40061
17845E4617b00765i8204H2772e019m8475o1844A26012e1134A69173q4534a14116
17833B0667a61724B75423g433H9210b52310D8553n634a03296j23779A21537b29682
$$ plain form
17918 111765 175621 83989 77959 -189101 132226 169823 -214691 -11904 108822 -215186 86798
17906 -143896 -260452 231956 -191896 -4983 -57385 -108871 -12218 -126535 162187 103765 -122403
17894 -21511 -283029 -54880 194656 59937 96527 164302 -132710 4243 5031 87786 -14841 15180
17881 -551 -53072 -118635 145451 54948 -164830 -8426 -75760 144098 195179 84758 72986 -233461
17868 -21310 142567 206178 218928 96961 -78352 -237063 110140 13070 -9317 -91385 108150
17856 12821 -112888 69551 -101634 -17991 -263656 -229066 274603 394995 374573 -140061
17845 54617 -200765 -98204 82772 -5019 -53494 -115338 126012 -51134 169173 84639 -114116
17833 20667 -161724 275423 -7433 89210 -252310 48553 42919 -103296 -227075 121537 -229682
17821a48159A32551j2143J44160A16610J00138h844k34644f9318j7338I3212J29930
17810B23142I1843L5026d3727f86A28147a09192c9337j56706P6410A15595b9388
17798b63766f5051B96912a80114B4300O7374k5912a7162B03229m9994a15920L6480
17787g9440j39769C29161a52211M1996J4509H830a9418E4447O4003a07204F343
17775C76439F4485J56393a38550A09754h101j39525j71447A45481a7670A08387
17764a61229O7929n4012I4019L4717k6811M0739Q1320q3353M4887d082p7376A09352
17751a11568A1193b16562L1904D6349e3213j41233A53607E452K62035b8684j90224
17740b18908A151Q7296K03212A18316m8476J77256m6629a58242j2612o1763I6931
$$ plain form
17821 -148159 132551 120408 264568 116610 216748 -8844 -243488 -69318 -86656 93212 223142
17810 223142 91843 126869 -43727 -686 128147 -109192 -39337 -196043 -119633 115595 -29388
17798 -263766 -65051 296912 -180114 24300 91674 65762 -17162 203229 153235 -115920 -79440
17787 -79440 -219209 329161 -152211 -110215 -95706 8830 -19418 54447 118450 -107204 6343
17775 376439 64485 220878 -138550 109754 -8101 -147626 -319073 145481 -17670 108387
17764 -161229 -93300 -147312 94019 128736 101925 142664 223984 140631 185518 -4082 -81458 109352
17751 -111568 11193 -216562 -184658 46349 -53213 -194446 153607 5452 267487 -28684 -218908
17740 -218908 1151 88447 291659 118316 69840 247096 200467 -158242 -170854 -232617 96931
17728A14797k113a03595K2496A76668b097D4677b3482j26199A44110d4215H2177
17716A4153J3442o65g2678c2997A67239m4756c3505j03839b0410n0685E375b80260
17703H4646g0963k93514k0364b1535A09237c83851c4380E9859f5734k78483E0981
17691d7980G8290d22849a34046e1944B49163b04317A41030j3485D5880b5213p1278
17680i6491E0578Q0645h2844c2241j87163A80086Q0973C5808R4556c36614a46921
17668A39626J07627i3654q5843b9393j20522B35083o0779J06709c25804B34376
17657A98464o2233a90906B65985d2719A66509a8356D2933L03286A22040B5258
17646A64788O7994a2656q2921A25767b28057D9436h6907A22456K7298J65975F3299
$$ plain form
17728 114797 112684 -103595 -81099 176668 -2097 44677 -23482 -149681 144110 -44215 82177
17716 14153 27595 26930 -72678 -32997 167239 122483 -33505 -137344 -20410 -71095 5375 -280260
17703 84646 -70963 -364477 -384841 -21535 109237 -383851 -34380 59859 -65734 -344217 50981
17691 -47980 78290 -422849 -134046 -51944 249163 -204317 141030 127545 45880 -25213 -96491
17680 -96491 50578 131223 -82844 -32241 -219404 180086 261059 35808 130364 -336614 -146921
17668 139626 247253 -93654 -179497 -29393 -149915 235083 174304 281013 -325804 234376
17657 198464 136231 -190906 265985 -42719 166509 -18356 42933 346219 122040 25258
17646 164788 232782 -12656 -95577 125767 -228057 49436 -86907 122456 149754 315729 63299
17634A15650a83598H2041K0307b50263J05402H7479c00491h5251B24492a57818
17623D29681a09614A27718b22585C0954f6502D6698K38876E506f8823B58419a24683
17611b45339a21581A39297a47659F1628P6732i0780j36887B85111A02726M63M93242
17600E96431C7577K9069M1940C5195J27740b53461N5205h3502A27710o1618b2306
17588B1731a68458A72734h6219j09615Q6101d5010A29572J5765J60628e3920j47725
17577b01645Q2338A86732N2948l4507N5548B707K51886A05710K48C2426a23911
17565A23179k7086J05650F5755i5528A23781J5747P877J16142A11450f5720A77707
17553A4865a20181A9014a97993B84214a50831p5540A915M2863J07087g764B46066
$$ plain form
17634 115650 -183598 82041 102348 -250263 -144861 87479 -300491 -85251 224492 -157818
17623 429681 -109614 127718 -222585 30954 -66502 46698 285574 5506 -68823 258419 -124683
17611 -245339 -121581 139297 -147659 61628 138360 -90780 -227667 285111 102726 103189 596431
17600 596431 37577 66646 108586 35195 162935 -253461 -198256 -83502 127710 66092 -22306
17588 21731 -168458 172734 -86219 -195834 -109733 -45010 129572 145337 305965 -53920 -201645
17577 -201645 -119307 186732 239680 205173 260721 2707 254593 105710 105958 32426 -123911
17565 123179 96093 201743 65755 -95528 123781 139528 147405 263547 111450 -65720 177707
17553 14865 -120181 19014 -197993 284214 -150831 -226371 1915 44778 151865 -7764 246066
17541f7149A677a28678A84729O9178J84740a12567j67546B47667c5104j10798
17531a45902b685j80495A18343C1293Q8406J12471K9906a30319B7929L6869J25620
17520A90418a77581j131A4726B946L4075J83482o3012J34361A28858c867m9274
17509e3141A35116J7930e2155B79497j31023O3507J45965b5670A03462N7949a66411
17497A85503E01a86380a7069A74480l2528P870d2943D16438c8203A70413c4575
17485H026L56409A37378o0032k8991K52711j271m1291M3090H1644l2333J36646
17474A85957E8163L79630k13928G8085L9777D8638M2268L5210h3165A31111E472
17462c13097a08726A88355l2656R457q073D2811J09294J64702N5710A5242K06363
$$ plain form
17541 -67149 1677 -128678 184729 253907 438647 -112567 -280113 247667 -35104 -145902
17531 -145902 -2685 -183180 118343 31293 119699 232170 262076 -130319 27929 64798 190418
17520 190418 -177581 -178712 14726 2946 37021 220503 157491 291852 128858 -3867 -53141
17509 -53141 135116 153046 -52155 279497 148474 211981 357946 -25670 103462 161411 -166411
17497 185503 501 -186380 -17069 174480 141952 149822 -42943 416438 -38203 170413 -34575
17485 8026 364435 137378 77346 48355 301066 299795 258504 301594 81644 49311 185957
17474 185957 58163 437793 223865 78085 117862 48638 90906 126116 -83165 131111 5472
17462 -313097 -108726 188355 155699 165156 157083 42811 152105 316807 372517 15242 221605
17451B21605K36516k21626f3308B75107R9313p6842j16660J96165a45462B38875
17440A72785P8521n1466N8966H4693J2308O1865J64915Q891Q553A35240h6502
17428C05181n2682l6855K01596N5066A49875J53213j22849K25466K2483j11587
17418C16601l9098M2865L1746n0149r6362K42059k13995L3912A5080P6857a88311
17406E6511J46309f3652A32382P2353o9997a7619E1995L15901A27595i2143A10732
17394c21221C2394J85207K6561e1165o9259o591F650J98169n644E6855J52728
17383B09583O0779p8189H000L69482o8675M9010j51661E7962J18235b36228A47058
17371C87519j66465F9398B0120a60248B61222d8376l2507I7783O5917J01891D059
$$ plain form
17451 221605 458121 236495 -63308 275107 374420 297578 180918 377083 -145462 238875
17440 172785 251306 199840 258806 84693 97001 158866 323781 332672 341225 135240 -86502
17428 305181 252499 215644 417240 472306 149875 303088 180239 405705 428188 316601
17418 316601 277503 320368 352114 301965 205603 447662 233667 267579 15080 91937 -188311
17406 56511 202820 -63652 132382 204735 134738 -17619 51995 367896 127595 -92143 110732
17394 -321221 32394 217601 244162 -51165 -120424 -127015 6650 204819 199175 56855 209583
17383 209583 270362 192173 8000 377482 308807 357817 206156 57962 176197 -236228 147058
17371 387519 221054 69398 20120 -160248 261222 -48376 -80883 97783 163700 265591 4059
17359b22717i5015B15792h69B66712I0171l4684a42483n1952B25246q7555m9039
17348H8652L23135j92948c46763b9740l8403I2264H004M36586R5659A08671O9993
17337A78664a767D65761A94579M2236L8352l3688L7951I1427j4108A4035K58533
17326B72568K89228B08708J19472I5074N67603C9306a2889B43209n6501L9882
17316B26590A0585Q9261J35060D2940K33510p6178L2969L72014B85900A02141
17305H1634C7362N7456a47560P0398A39523E5999a13544M4347I9429c637A83473
17293B48392r6470J05336a19262b3088D07197D0275J51058J7868a19559C65105
17282i5162B72278K6538P1156G9936J20746a9868A55106M2600A5007K86405J86230
$$ plain form
17359 -222717 -95015 215792 -869 266712 90171 55487 -142483 -194435 225246 137691 88652
17348 88652 411787 218839 -346763 -29740 -68143 92264 8004 444590 540249 108671 178664
17337 178664 -1767 465761 194579 236815 275167 241479 279430 91427 77319 14035 272568
17326 272568 561796 208708 328180 95074 662677 39306 -12889 243209 186708 226590
17316 226590 10585 99846 234906 42940 276450 200272 233241 605255 285900 102141
17305 81634 37362 94818 -147560 -77162 139523 55999 -113544 -69197 99429 -3637 183473
17293 248392 151922 257258 -119262 -23088 407197 40275 191333 209201 -119559 365105
17282 -95162 272278 298816 369972 79936 200682 -19868 155106 197706 15007 301412 487642
17271D87642A02896c1006A21445M7472N9565J60244j0415n5586Q7682b2651D92132
17259a47831C97695k900J81435A28026D6142K36660J72405J004A45082j3533K73798
17248D05347d9163F7329R8980a01674B29272I2158K38878j49757L67358A78416
17237A76911J01758A19960J20071C1571b26410C54869J36207A14121K12382j06722
17227B19781G4999L02637j68046L927a29874E85664B01044g3394j77311D34767
17216C79130A87905J55707j42694J31512A01147L17626j08994H8251l316h0896
17205D53203c4123G0383N0616f8099E16674j31915j4743j05412A30457b58913
17194a9537B81660J38279o2729A24563K11724a79745D27405K76851j68073F1231
$$ plain form
17271 487642 102896 -31006 121445 168917 228482 388726 378311 322725 410407 -22651 492132
17259 -147831 397695 394795 576230 128026 46142 282802 455207 456211 145082 131549 405347
17248 405347 -49163 67329 166309 -101674 229272 92158 331036 181279 548637 178416
17237 176911 278669 119960 240031 31571 -226410 354869 491076 114121 326503 219781
17227 219781 74999 377636 209590 213517 -129874 585664 201044 -73394 -250705 434767
17216 379130 187905 343612 200918 332430 101147 418773 309779 88251 84935 -80896
17205 453203 -34123 70383 120999 -68099 516674 384759 370016 264604 130457 -258913
17194 -19537 281660 419939 357210 124563 336287 -179745 427405 704256 536183 61231
17183g392C79631A66250F681R7077J41377o4249J18118i0879C93160A61351J82213
17172C43564r7799J35475a0917D19765j41103p4927K60725n889J70922B65389
17161C10873m7047A29967N3287B7654L53712R0907k28636J17473j29381J17207
17151C48936m2564A982J82934J98266j25250K57405k09376N1933N9573J2078j7275
17140D12270j1048J31451j13318F4794L19217A78980L25947j78954J80452j62137
17130C44288K21748j47334P832j07142N413L1841n015k19J32043q2696J4533R4200
17118E09492B32085K86684q344l7144O2460A68562K59058j05502J31451J21544
17108E75113j49257O3710j15709m1470M9928M7025m7959Q8416Q7220j19745n5529
$$ plain form
17183 -7392 379631 166250 6681 103758 245135 180886 299004 -90879 393160 161351 343564
17172 343564 245765 381240 -10917 419765 278662 203735 464460 458571 629493 265389
17161 310873 263826 129967 183254 27654 381366 472273 243637 361110 231729 348936
17151 348936 306372 1982 184916 383182 257932 515337 305961 357894 417467 429545 412270
17140 412270 401222 532673 419355 64794 384011 178980 504927 325973 506425 344288
17130 344288 566036 418702 426534 319392 324805 356646 351631 351412 483455 400759 415292 509492
17118 509492 232085 518769 510425 473281 535741 168562 427620 322118 453569 575113
17108 575113 425856 489566 373857 332387 382315 429340 381381 469797 557017 437272 381743
17097C81743m7933m8498M5615j49063L44559B23604M9142J07422j3870L80615
17087G46913C23431L3824A73569L26225m3706l3231J03023k40321J46322J96868
17077F28749j58604J85319n2195m7217o9560J78942k30325j98681J06471K22062
17067E64961j00000j59708M89526j53672j18235q5514k5758K14341k37116A24497
17056D56230j59627q0268N16077r8568B63767m552L41502O7886p3657k77981Q089
17045C25054K38231k47511J9984M02014j72138j64934M33571C48180K54767j65958
17035D36989r3380K1738K11161O3574J92115k01275R4736l3701j18081Q0303k21477
17024D32702k4915L05066M3929l41462L29277j73777J43163j79324m0193N07350
$$ plain form
17097 381743 333810 285312 330927 181864 526423 223604 272746 380168 366298 746913
17087 746913 323431 357255 173569 499794 456088 422857 525880 285559 431881 628749
17077 628749 470145 655464 603269 556052 486492 665434 435109 236428 342899 564961
17067 564961 464961 305253 794779 641107 522872 437358 411600 625941 388825 124497
17056 456230 296603 216335 732412 633844 263767 259215 600717 668603 594946 316965 325054
17045 325054 563285 315774 335758 737772 565634 400700 834271 348180 602947 436989
17035 436989 343609 365347 576508 640082 832197 630922 725658 691957 573876 654179 432702
17024 432702 407787 712853 756782 415320 744597 570820 713983 534659 494466 1001816
17014A001816m73521R081M06618j34061k18397J21288r9382j95499K44108J504
17004F63555K82202l75906n8425K08254Q2955B48204Q94977n16934M5270J88298
16994H59815q4297K36060k32518k1087L15615l83812J68954k62762L73775D83691
16983I05223k5724j24682J23001m1715J73931m97185R8630K57261J10502N5276
16973A034518m18068L7825O55222n45416J74534r9790K41363N7607l17202m0148
16963G80445J51977j48386L43944l25832J79698J22082K64733o59667J83752L37414
16953A230160q4838k28784O4020K95974l3091k47165J01506L6100J54541l08950
16943I79473L52779l82165L56189j7484R9846j73232P0014k61759L30957k07449
$$ plain form
17014 1001816 528295 537376 943994 809933 591536 712824 613442 417943 662051 663555
17004 663555 945757 569851 511426 719680 802635 248204 1143181 626247 671517 859815
16994 859815 775518 1011578 779060 757973 1073588 689776 858730 595968 969743 483691
16983 905223 879499 754817 877818 836103 1010034 512849 611479 868740 979242 1034518
16973 1034518 616450 654275 1309497 764081 938615 838825 1080188 1137795 820593 780445
16963 780445 932422 784036 1127980 802148 981846 1103928 1368661 708994 892746 1230160
16953 1230160 1145322 916538 980558 1276532 1243441 996276 1097782 1133882 1288423 979473
16943 979473 1332252 950087 1306276 1288792 1388638 1215406 1285420 1023661 1354618 1147169
16933A147169K04724R1344r1782p752l04050L3585M87611k93888k18134J35245
16923A184072J86276k44480P11193k28670L29295n31343P0193k33811l9522L7358
16913A240561L70725k42947o136p9721M17188k9726Q6302j63433j5530j08011
16903A469272L07057J04162j03650J50066j06670r6729N2082j85951M04180p114
16893A986705L3257k54412n2011K05504J47116k46835J12242l1544M4585K59490
16883B204097J12326p22408M53024j84106K08486M20201l15808J98136M9275k38203
16873B185020J53560k08558K04464Q2603K87468k61738J58841k45233J84921K00783
16863B742131L7898P6494l86919K99163k29912L31663J06342m49382O29871j69227
$$ plain form
16933 1147169 1351893 1443237 1351455 1343703 1039653 1073238 1560849 1266961 1048827 1184072
16923 1184072 1370348 1125868 1837061 1608391 1937686 1406343 1476536 1242725 1203203 1240561
16913 1240561 1611286 1368339 1362203 1282482 1699670 1669944 1756246 1592813 1577283 1469272
16903 1469272 1776329 1880491 1776841 1926907 1820237 1723508 1775590 1589639 1993819 1986705
16893 1986705 2019962 1765550 1713539 1919043 2066159 1819324 1931566 1900022 1944607 2204097
16883 2204097 2316423 1594015 2047039 1862933 2071419 2491620 2175812 2373948 2423223 2185020
16873 2185020 2338580 2130022 2334486 2417089 2704557 2442819 2601660 2356427 2541348 2742131
16863 2742131 2780029 2856523 2469604 2768767 2538855 2870518 2976860 2527478 3157349 2988122
16853B988122R0710K01761k39868L25187k09948N3415N3061J21380q6264J85891
16843C483447k92057L70770k8120P623k477J49365k9634K96917J62645k59724
16833C858755M0445L56105j60447L57948j44388Q8895k01406J60858K64754R2402
16823D713921J76970N3289J41385J19437o6707q58J75372M93778l58286L38936
16813E787237N4574L10771p6987K36912l8569L49640K45594J48877p6560K47900
16803G189389K90213k5895K08129j34110L04956M48762K71586k27994K27161M77257
16793I029454Q2806L85046m1713J42140J68398L32216O04890J16637K75955M62573
16783A1558402L2112N49796J06771M54981L59760L62924O45355M49511N63280
$$ plain form
16853 2988122 3078832 3280593 3040725 3365912 3155964 3209379 3262440 3383820 3297556 3483447
16843 3483447 3191390 3562160 3534040 3541663 3539186 3688551 3658917 3955834 4118479 3858755
16833 3858755 3899200 4255305 4094858 4452806 4308418 4397313 4195907 4356765 4621519 4713921
16823 4713921 4890891 4944180 5085565 5205002 5138295 5137437 5312809 5806587 5448301 5787237
16813 5787237 5841811 6152582 6075595 6312507 6273938 6623578 6869172 7018049 6941489 7189389
16803 7189389 7479602 7453707 7661836 7527726 7832682 8281444 8553030 8325036 8552197 9029454
16793 9029454 9112260 9497306 9455593 9597733 9766131 10098347 10703237 10819874 11095829 11558402
16783 11558402 11590514 12140310 12247081 12702062 13061822 13424746 14070101 14519612 15082892
16774A5082892L283O09761P62598K93131P01527J02111R79415Q90530N73939Q80971
16764B0880158O00472P53619R30325J104585Q74148R96275J037105J219161O55000
16755B9050848J654697J509172J327108J608759J502498J901010J799872K113904
16747D2467868K181721J658188L089882K201476K913419L378997L102877L162585
16739F4157013L694609L782803M673939M286194N365598N188353N586525O236264
16731A02971298O035012O659018O895357P266929P678003P212971Q240097P483193
16723A60441878P515106P018895O609197N979133M597348L544632K396620J056673
16715A99159482m70183j701741l257043m346271n478777o333850p247014p555771
$$ plain form
16774 15082892 15086175 15695936 16458534 16751665 17453192 17555303 18534718 19425248 19999187 20880158
16764 20880158 21480630 22234249 23164574 24269159 25143307 26139582 27176687 28395848 29050848
16755 29050848 30705545 32214717 33541825 35150584 36653082 38554092 40353964 42467868
16747 42467868 44649589 46307777 49397659 51599135 54512554 57891551 60994428 64157013
16739 64157013 67851622 71634425 76308364 80594558 85960156 91148509 96735034 102971298
16731 102971298 109006310 115665328 122560685 129827614 137505617 144718588 152958685 160441878
16723 160441878 167956984 174975879 181585076 187564209 192161557 195706189 198102809 199159482
16715 199159482 198689299 196987558 193730515 189384244 183905467 177571617 170324603 162768832
16707A62768832p772470p639942q103474q114402p528772p032139p134460o552286
16699A02890887o663459n625937n363878n018143n158155m179517l984941l807973
16691F3088884l571362l465811l250749k613406k470469k650481k328878k138410
16683D0599318k180631j629800j944476j716754j435424j189994j458304j185637
16675B7858298j252426j238697j155903r60342p75719p46558r38818p71623j032056
16666A8986156m32146o84168r09136k97826r31066l30181k95719m68966m82138
16657A4154810p59458l13377n02656l83322l7817p72270k17828n95564o4448j65500
16647A0342570l66859m51031r7890n95429j86321j12852j59994l2684m07944J6313
$$ plain form
16707 162768832 154996362 147356420 139252946 131138544 123609772 116577633 109443173 102890887
16699 102890887 96227428 90601491 85237613 80219470 75061315 70881798 66896857 63088884
16691 63088884 59517522 56051711 52800962 50187556 47717087 45066606 42737728 40599318
16683 40599318 38418687 36788887 34844411 33127657 31692233 30502239 29043935 27858298
16675 27858298 26605872 25367175 24211272 23250930 22475211 21728653 20789835 20018212 18986156
16666 18986156 18554010 17869842 16960706 16662880 15731814 15401633 15105914 14636948 14154810
16657 14154810 13395352 13081975 12579319 12195997 12158180 11385910 11168082 10572518 10508070 10342570
16647 10342570 9975711 9524680 9426790 8831361 8645040 8532188 8372194 8339510 7931566 7947879
16637G947879p23533r5054k87767L57712k70905k91856k48087L1727j34375m40302
16627E845439J63545k58278j75451R4907k61782j66214R914Q7893m93995L1324
16617D877302j43055Q733m78841R8719L07105n27104K06709n2564k14167l48979
16607C733858K99827j97954j80356J59565j69155J65602l39618J39538l36951
16598C274356K99089k92015l7618l069k73553M9902J63014l50820K28617K896
16588C060799j92705K9067l23669J4383l13924L84596k3068L8818j42603m4578
16578B487116k6383k92565K70500p9888k49429L3704r0130L02883Q6013j86992
16568B254829K62440k76480m86581M93126l72258j21390k04827L28481J31534
$$ plain form
16637 7947879 7224346 7129292 6841525 7199237 6928332 6636476 6388389 6420116 6285741 5845439
16627 5845439 6008984 5750706 5575255 5670162 5408380 5242166 5252080 5339973 4845978 4877302
16617 4877302 4734247 4742980 4264139 4362858 4669963 4142859 4349568 4297004 4082837 3733858
16607 3733858 4033685 3835731 3655375 3814940 3645785 3811387 3471769 3611307 3274356
16598 3274356 3573445 3281430 3243812 3240743 2967190 3017092 3180106 2829286 3057903 3060799
16588 3060799 2868094 2897161 2573492 2587875 2273951 2658547 2635479 2674297 2531694 2487116
16578 2487116 2460733 2168168 2438668 2358780 2109351 2143055 2052925 2355808 2441821 2254829
16568 2254829 2517269 2240789 1754208 2247334 1875076 1753686 1548859 1877340 2008874
16559B008874j24334m1474k14512K15016K01172J5947m07391n3551K1481P9452
16549A700680j76389R6442k139k6260k57671J62147l1985K84441l73299K94779
16539A670746k40764j67216j7198K69284j10341m3644k36868j10687q0160O28926
16529A562078l21209j20231j18556J76420l3623N1676l83273M10989j6540j43792
16519A063939J300j19079L77819j42871l86759K03095o3298M8000j48124L71674
16509A205696j12896r7842j78464K12132J3753j48262L9853l14965L55696l46980
16499F27721L93551k13319L47286k36968k24462J03044j69556O4473M23123l61295
16489G53598K13322l82806J44141Q1807k81916K18794r6924r9489N42939j85841
$$ plain form
16559 2008874 1884540 1843066 1628554 1843570 2044742 2060689 1653298 1599747 1621228 1700680
16549 1700680 1524291 1620733 1618594 1592334 1334663 1496810 1464825 1749266 1375967 1670746
16539 1670746 1429982 1262766 1245568 1514852 1404511 1360867 1123999 1013312 933152 1562078
16529 1562078 1240869 1120638 1002082 1178502 1144879 1196555 813282 1224271 1207731 1063939
16519 1063939 1065239 946160 1323979 1181108 794349 997444 934146 982146 834022 1205696
16509 1205696 1092800 994958 816494 1028626 1042379 894117 933970 619005 974701 627721
16499 627721 1021272 807953 1155239 918271 693809 796853 627297 691770 1114893 753598
16489 753598 966920 584114 728255 810062 528146 746940 650016 550527 1093466 907625
16479I07625k10118J55345J0628j11382n1753M6479J10282k76814P3040o0210
16469E93122J59018l75920J28185L02215k26190k33939K90835Q621j27503K88285
16459H06729k83289j18353J32706k14118J87339J81055A78972M44792o2934j23423
16449D37407J53080o2758j53499K78935j43290j40025j38436K03411J16494L8314
16439E89633k5413J69733j58664j62646j66260L08081O1779j30606B02906K91717
16429D94623J03036j58365A74513K85852r2659L46948J473B59439J39362j59378
16419B39423N4870K00420B21376M25302B03748K95335B37139n0906J25026K69095
16409E80354A28387J61178L02416q6451o5963B4888M70171j4325j21975J43990
$$ plain form
16479 907625 697507 852852 863480 752098 700345 746824 857106 580292 653332 593122
16469 593122 752140 376220 504405 806620 580430 346491 637326 645947 518444 806729
16459 806729 523440 405087 537793 323675 511014 692069 178972 623764 560830 437407
16449 437407 590487 527729 374230 653165 509875 369850 231414 434825 551319 589633
16439 589633 564220 733953 575289 412643 246383 554464 616243 485637 202906 494623
16429 494623 597659 439294 174513 460365 367706 714654 716127 259439 398801 239423
16419 239423 294293 494713 221376 646678 203748 499083 237139 186233 311259 580354
16409 580354 128387 289565 591981 505530 439567 24888 495059 480734 358759 502749
16399E02749B03938J91365J45597B53894n4490M8892J51583j64209L13778A45187
16388D60827j03161j47917J20022j39714O0517m669o2653n3860m1234N6617K3444
16377A68219b7104B86411K5837a13346B81651J1749J90567l4642J2161P320q4274
16366C84532L44835l39890k7396F0853J03174C9701J85708c49556C22304j0962
16356C11342O1292j69870G4078A5407K33965I2675K00574n4070J58451A06754
16345C07909A41639F8625J02560E1641L2352g052E13736B31990G6481M00091A26941
16333A29774B4013J9647K29198M1343j11721K84118j57272L3185b34871a13096
16322A64647M3131l4709C5526J10795J62742o8651j5175Q4227j09127R838G4328
$$ plain form
16399 502749 203938 395303 540900 253894 199404 248296 399879 235670 549448 145187
16388 460827 357666 209749 329771 190057 250574 245905 183252 129392 88158 144775 168219
16377 168219 -27104 286411 312248 -113346 281651 293400 483967 449325 461486 468806 384532
16366 384532 729367 389477 362081 60853 164027 39701 225409 -349556 322304 311342
16356 311342 372634 202764 74078 15407 249372 92675 293249 239179 397630 106754
16345 307909 141639 68625 171185 51641 83993 -7052 513736 231990 76481 476572 126941
16333 129774 24013 43660 272858 314201 202480 486598 329326 362511 -234871 -113096
16322 164647 207778 173069 35526 146321 309063 240412 225237 309464 200337 210175 74328
16310B81078a74956Q4548A47592e8977C76644B262b0382B49481m0006B2535d6540
16298B27596K82681B01365f0415E5401A3520J44353F637J8961K4364L6336B2161
16286E25931B03983D4656K81037A07246C812P000A492P5142J25285k2439F4099
16274B39826q3855Q4633B5372J66947a09190j2822I9337J54748D3887K5299M81959
16263E51145k44447b12646B42550H7220a2345I9159d014A52744N3516I2034a88546
16251B5429b14910B23551R1099G9721l7123J78488l2947H6168B0503a73011B73785
16239A45727a67957N1876L5796L7518l3986A37551M2368J0069a43336B92709B6747
16227D391M0694F737J99764G0196N7339a9910A1493P1167f04j10167n156A93672
$$ plain form
16310 281078 -174956 -90408 147592 -58977 376644 2262 -20382 249481 209475 22535 -46540
16298 227596 510277 201365 -60415 55401 13520 157873 6637 25598 49962 86298 22161
16286 525931 203983 44656 325693 107246 3812 10812 1492 76634 201919 179480 64099
16274 239826 155971 240604 25372 192319 -109190 -122012 99337 254085 43887 69186 551145
16263 551145 306698 -212646 242550 87220 -12345 99159 -4014 152744 206260 92034 -188546
16251 25429 -214910 223551 314650 79721 42598 221086 188139 86168 20503 -173011 273785
16239 145727 -167957 -116081 -80285 -42767 -76753 137551 179919 189988 -143336 292709 26747
16227 4391 45085 6737 206501 70196 127535 -19910 11493 82660 -604 -110771 -115927 193672
16214B6171N5584a7499A80040C1170R5959a370j89853B26160A8750a07756N2491
16203e5265C06494a83488c1739j22904A07986d6137G0915a03481k6345B68807
16192A99544i3337B03671P093L3068j08150b36590C1260a18122J0044G4255L6049
16181A10304f442A75080p3357J11563b43126G2985L17035B0189J59121a31815
16170d63606l1054B8256J02676J03001q2794o0950a59718j09894B056K36599e6622
16158F1432K79021g2964a1557D7917L1061O5371R4655R2920r7474a77283N5801
16147a21482B99715a00555r2267A46881k6369b03296f664B31100G8722N7032C2156
16135G209f3631B09344a25752B28965a75629K414C030L2651a38862A01607a48442
$$ plain form
16214 26171 81755 -17499 180040 31170 127129 -1370 -191223 226160 18750 -107756 -55265
16203 -55265 306494 -183488 -31739 -154643 107986 -46137 70915 -103481 -129826 268807
16192 199544 -93337 203671 210764 243832 135682 -236590 31260 -118122 -108078 74255 110304
16181 110304 -6442 175080 101723 213286 -243126 72985 390020 20189 179310 -131815
16170 -463606 -494660 28256 130932 233933 151139 90189 -159718 -269612 2056 238655 -56622
16158 61432 340453 -72964 -11557 47917 78978 144349 239004 331924 234450 -177283 -121482
16147 -121482 299715 -100555 -192822 146881 120512 -203296 -6664 231100 78722 135754 32156
16135 7209 -63631 209344 -125752 228965 -175629 -173215 3030 35681 -138862 101607 -148442
16123A77434b90884f2735k35509a3967n9723K8432B2280c7122m7429D6926g9932
16111A27989f5809j03074c9441J4600B02073N3126D2678a05965A95331J46013
16101C41344n6623D0740Q8805C3723M840b41828c3471B46750o5613a41171j10693
16090b51864A93003C6291a45870B50247j20608M59395G6018J5092q20a40922k00024
16079c40946A67545C0617a8719B7862R5642a44487I6112b01237j86203a30116
16068A68336p0039a79544h4196j97439o8326o3083K9088a35220B68044a06878
16057b3614r4504G9034a57239M8330A17181a2291A3786h0160p331a7499j72086
16046a89585K2312g5142H7149J06929a91000L6294B40345h3763C0899a25183K0485
$$ plain form
16123 177434 -290884 -62735 -298244 -13967 -73690 -45258 22280 -37122 -84551 46926 -79932
16111 127989 -65809 -168883 -39441 -24841 202073 255199 42678 -105965 195331 341344
16101 341344 284721 40740 129545 33723 38563 -241828 -33471 246750 181137 -141171 -251864
16090 -251864 193003 36291 -145870 250247 129639 589034 76018 91110 90290 -140922 -340946
16079 -340946 167545 30617 -18719 27862 123504 -144487 96112 -201237 -387440 -130116
16068 168336 98297 -179544 -84196 -281635 -349961 -413044 -383956 -135220 268044 -106878
16057 -23614 -118118 79034 -157239 -108909 117181 -12291 13786 -80160 -87491 -17499 -189585
16046 -189585 -167273 -75142 87149 194078 -191000 -154706 240345 -83763 30899 -125183 -104698
16035a04698c7468A69900o739C3995a37723K2482M4581A6890J47023i0690r3943
16024a84633A9252a0135m9622G8218h9465k63673B30803D2485R8013a41261r0729
16013b31990j13794A13084c65275h0250a7459B4078a68714H0711J08913a23707
16002C5024a49705f6763C38958E811c2927J2158m6693D3336d4446B76577b71078
15990I2985C7729i1093A48096E1994i3313n6918N0983A42946c14614E6446K81559
15979C38005r6060O5685B1012b46078A98436b02934B03130a5134G2445R5012g7751
15967h1354j03046p9468P4987G5799b01632F8247c6644n7375A28384J82144A12281
15955b73795b8261B07420a34097A66314g2916p9017D6697b34791I5031b31398
$$ plain form
16035 -104698 -37468 169900 163161 33995 -137723 -115241 -70660 16890 163913 -90690 -184633
16024 -184633 19252 -10135 -59757 78218 -89465 -353138 230803 42485 140498 -141261 -231990
16013 -231990 -345784 113084 -365275 -80250 -17459 24078 -168714 80711 189624 -123707
16002 35024 -149705 -66763 338958 5811 -32927 -20769 -67462 43336 -44446 276577 -271078
15990 92985 37729 -91093 148096 51994 -93313 -150231 -99248 142946 -314614 56446 338005
15979 338005 241945 307630 21012 -246078 198436 -202934 203130 -15134 72445 167457 -77751
15967 -81354 -184400 -263868 -188881 75799 -201632 68247 -36644 -94019 128384 310528 112281
15955 -273795 -28261 207420 -134097 166314 -72916 -151933 46697 -234791 95031 -231398
15944B30580C4690J37509d3210K0226l9137B31434f966A58629F5092K12405E2626
15932a61447e6606A16147d710K131o3303J4945l50713B53045b07879J02249B24185
15920b1567A77316B7689c10393a43978A70771i6988D6426c3902m64171a16580
15909c3665I579a68753I9230O5538G0376c11593A66711g8692r909A4986K3911
15898C8897a10259A59950E8720a72962L0282M9026C94041b89351d8894G6171K78011
15887C54182I5816a28924D9611N3371J3537j9462C6317J21324m5575i1029J0686
15876h0343A75849a34552j37598g1513R241B73201F6397a12245j4318A00082p859
15865I2223e3236l1893k71071F6071b02114e9220I2752a38235L3423B37793O9807
$$ plain form
15944 230580 34690 172199 -43210 -22984 -62121 231434 -6966 158629 65092 277497 52626
15932 -161447 -56606 116147 -4710 -2579 -65882 -50937 -401650 253045 -207879 -105630 224185
15920 -21567 177316 27689 -310393 -143978 170771 -96988 46426 -33902 -498073 -116580
15909 -33665 9579 -168753 99230 164768 70376 -311593 166711 -78692 -88601 14986 38897
15898 38897 -110259 159950 58720 -172962 -142680 -93654 394041 -289351 -48894 76171 354182
15887 354182 95816 -128924 49611 102982 116519 97057 36317 157641 112066 -91029 -80343
15876 -80343 175849 -134552 -272150 -71513 -62272 273201 66397 -112245 -126563 100082 92223
15865 92223 -53236 -85129 -356200 66071 -202114 -59220 92752 -138235 -104812 237793 307600
15854C07600a53619I1596e4165B42858b83219d9943o4940d8265j21941B0612b39621
15842A11144a24968j74754A31841f4164k14082B21603b92356A06772K15966c52474
15831C6876c63549I3871a14178B276J45621f07D7693a52518I5071N0847b84032
15819c0665A61704b23808j30376e7850O772A61481b55943B12334a78381A60720
15808a40997I0120K0569Q3545b05658m0109F0519C845b08334a4840C16f7090G7224
15795H536K19206c0410q3094A07485h4737C87779D0753a45774p257F8544p663
15784F0881A7927b42124Q0848B97523A8859a88737c8745l95119J95828C8642a41866
15772b31099A24558J67644a25030H2159I27d39599A90565n6030h1623A79150H9071
$$ plain form
15854 307600 -153619 91596 -54165 242858 -283219 -49943 -114883 -48265 -170206 20612 -239621
15842 111144 -124968 -299722 131841 -64164 -278246 221603 -292356 106772 322738 -352474
15831 36876 -363549 93871 -114178 2276 147897 -607 47693 -152518 95071 145918 -284032
15819 -30665 161704 -223808 -354184 -57850 -51078 161481 -255943 212334 -178381 160720
15808 -140997 90120 110689 194234 -205658 -245767 60519 3845 -208334 -14840 316 -67090 77224
15795 8536 227742 -30410 -113504 107485 -84737 387779 40753 -145774 -153031 68544 60881
15784 60881 17927 -242124 -161276 297523 18859 -188737 -38745 -433864 -238036 38642 -141866
15772 -231099 124558 292202 -125030 82159 927 -439599 190565 134535 -81623 179150 89071
15760A53866f5158K1565C6355a79425A4200K52387B8903i6593E1632K34508a8338
15748b94880j25073i3035C65664a61515j2445j61223a34412A32848i7123A35726
15737C14069b33015p6430F1293b88240D10781A87845D4549L5339a27828l1216
15727a59044A87629b9322j12571j7242g64j32489j75814C4190C0b8764H0183h8586
15714a09896C03261f9951D9146a10330o9318l398G7374b38622C06573e3938a389
15702B7247J7841B2465d19765A2280J28361e6419F9642a74979L2648N5283J5543
15691g1505d745D20L43033f9048k71996M0909a44049D158J83622b96976c1031
15679a03702A3372b17742L6435d5006A23199C3911b09323A13049a28844j58290
$$ plain form
15760 153866 -65158 -43593 36355 -179425 14200 266587 28903 -96593 51632 286140 -18338
15748 -294880 -419953 -93035 365664 -161515 -173960 -335183 -134412 132848 -97123 135726
15737 314069 -233015 -309445 61293 -288240 410781 187845 44549 79888 -127828 -159044
15727 -159044 187629 -29322 -141893 -159135 -764 -133253 -309067 34190 30 -28764 80183 -88586
15714 -109896 303261 -69951 49146 -110330 -179648 -183046 77374 -238622 306573 -53938 -1389
15702 27247 45088 22465 -419765 12280 140641 -56419 69642 -174979 -142331 -87048 -71505
15691 -71505 -4745 420 343453 -69048 -341044 -300135 -144049 4158 187780 -296976 -31031
15679 -103702 13372 -217742 -181307 -45006 123199 33911 -209323 113049 -128844 -287134
15669b87134A3343J53341K49199I2967P6992p0230C6997a48324E5132A3002a17531
15657a04779f68k20665H9996A9155a52112F6938J55910a68091k829P3626G3093
15645d1937A54719C3305h9362A7350N0903b12740J02928a991j61153b1030H2684
15633A72814a80151g6540E164a30462I8926f6187B58618I8024b20423H6902g2754
15621a54281A15229b76470g0734E7832a5559q2721A84407d8160k48609J26630
15611a70139E518a13277B23888j0091O3301p2167c17180B1253a47855B70037h1177
15599b3740G6674d64021g8027B33845B3641a02931A59531a26182A35999D6565
15588a65806e177k67789a35863C2559L7188m366e8103B17576b46963A54214P4102
$$ plain form
15669 -287134 13343 166684 415883 92967 169959 99729 36997 -148324 55132 13002 -117531
15657 -104779 -668 -221333 89996 19155 -152112 66938 222848 -168091 -170920 -97294 73093
15645 -41937 154719 33305 -89362 17350 68253 -212740 -109812 -1991 -163144 -21030 82684
15633 172814 -180151 -76540 5164 -130462 98926 -66187 258618 98024 -220423 86902 -72754
15621 -154281 115229 -276470 -70734 57832 -15559 -98280 184407 -48160 -296769 -170139
15611 -170139 5518 -113277 223888 213797 277098 204931 -317180 21253 -147855 270037 -81177
15599 -23740 76674 -464021 -78027 233845 23641 -102931 159531 -126182 135999 46565
15588 -165806 -5177 -272966 -135863 32559 69747 65381 -58103 217576 -246963 154214 228316
15577B28316D8292K07196b18116e4922A8881O205J18448b5118D2389P4437m8842
15566F7984K26155f7084B19877l4036j9309M6520J2036a05611k54125D5551a10344
15554A59468a55645j1555g3817B71349q4556q6752a26790k52192h1479m9169j67488
15543b98136a9007q4583B78889a03664F2734J71296B0288N7037A3807a07346K0303
15532h7043n727k4974j77837c0077n9382a7512F7324J23472a32469A25128b79707
15520a87694E8654k8743d7265p6308A53510a98441e7560a514H1860K07435a64410
15508H9746a26956A45899a89333A33398a29256j08177b1680C10503a52268B61331
15497c47655k8763a30390r7762b6232E2833a2152B90121a90615M7292c3803j12370
$$ plain form
15577 228316 48292 255488 -218116 -54922 18881 25086 143534 -25118 42389 116826 67984
15566 67984 294139 -67084 219877 185841 166532 213052 225088 -105611 -359736 45551 -110344
15554 159468 -155645 -167200 -73817 271349 186793 100041 -126790 -378982 -81479 -130648 -298136
15543 -298136 -19007 -103590 278889 -103664 62734 234030 20288 77325 13807 -107346 -87043
15532 -87043 -92770 -117744 -295581 -30077 -89459 -17512 67324 190796 -132469 125128 -279707
15520 -187694 58654 29911 -47265 -123573 153510 -198441 -57560 -1514 81860 289295 -164410
15508 89746 -126956 145899 -189333 133398 -129256 -237433 -21680 310503 -152268 261331
15497 -347655 -376418 -130390 -228152 -26232 52833 -12152 290121 -190615 -143323 -33803 -146173
15486a46173j5020O6916k0235K7449K0522j51288A10716C7111L20097c27517B23195
15474b0510A03524D3812k332N5902J18441b23346B98448A15336a44852M7152A50670
15462A14429f2352B55558g6811m4384C2183K97990A08700l3600c5500B42656l0401
15451B12255a08235B15299a26774K7289g459l53567a17739j61378E0247M6406
15441I6653d43722A58453c59552g3097G0701B3180K03381H6192b6521A07801J02735
15430B10536a34161N2730k22834F9001J78688a86807J3069C23765A47947G0438
15419c0469l4414H4940b00231A595a56979A58964o0247J53027a30621c669k38381
15408b42050N7659n9737A97671c9600j53071D11060j46009G979b32679R0481a1846
$$ plain form
15486 -146173 -161193 -94277 -114512 -87063 -66541 -217829 110716 37111 357208 -327517 223195
15474 -20510 103524 43812 41480 97382 215823 -223346 298448 115336 -144852 -97700 150670
15462 114429 -62352 255558 -76811 -121195 32183 330173 108700 75100 -35500 242656 212255
15451 212255 -108235 215299 -126774 -99485 -7459 -361026 -117739 -279117 50247 96653
15441 96653 -443722 158453 -359552 -73097 70701 23180 226561 86192 -26521 107801 210536
15430 210536 -134161 -81431 -304265 69001 247689 -186807 -173738 323765 147947 70438
15419 -30469 -64883 84940 -200231 1595 -156979 158964 98717 251744 -130621 -3669 -242050
15408 -242050 -184391 -244128 197671 -39600 -192671 411060 265051 7979 -232679 -142198 -11846
15396G6622O2338h8778j24872P4347l7894I1345D0209b47889A13223A9340e3851
15384a17049l610F4404d7172B06797e5117A83626G3800a10440C0737J76759c2484
15372b3142C12731a09356A05443J74423k4116h2721c3294H8492P4863c905F3792
15360a31525l52736e4362K3424a2352B0302O6692R1438a60367B2941O7191e1390
15348b14839J07289A13043j9403K02149a14805f289j10841c6247B33368e7847
15337c21596B47605D2171J46793r3057a04498a1725n02902F7943a6407q3192B17361
15325d2069B5103M09458D8592J99802b84240A59030J83581n6982c5660k23936
15315b59596C41050d35117B35941A10442O9863b04094A98929C2304K54249j41508
$$ plain form
15396 76622 138960 -88778 -213650 -139303 -177197 91345 40209 -247889 113223 19340 -53851
15384 -117049 -120659 64404 -47172 206797 -55117 183626 73800 -110440 30737 207496 -32484
15372 -23142 312731 -109356 105443 279866 255750 -82721 -33294 88492 163355 -3905 63792
15360 -131525 -484261 -54362 -30938 -12352 20302 86994 178432 -160367 22941 90132 -51390
15348 -214839 -107550 113043 93640 295789 -114805 -6289 -117130 -36247 233368 -57847
15337 -321596 247605 42171 188964 95907 -104498 -11725 -514627 67943 -16407 -99599 217361
15325 -42069 25103 434561 48592 248394 -284240 159030 342611 285629 -35660 -259596
15315 -259596 341050 -435117 235941 110442 180305 -204094 198929 32304 286553 145045
15305A45045a10824j5459B22545b20296H215b14956B82991C7065b29020A62898
15294A03384J47836D3662L19818a44180c6767a4538G5854M9613j158j2560a96390
15282A92082L4777b06818j06139A55582k4576q034D7643R9481d4179A69568F0617
15270C28455j36109a0821j54811B66338B3661J56852L8370j3226c4866B92405
15259A36362A9742a2683B74151J42399j31551C595a5561A07090R9462G1914J01447
15248A73361K36394J36987J22517J642892o04175J60495K08582A011402C20836
15238b23597A4343a80107D6406j9991J69250K58273k00760H3491Q802l0964h0845
15226I7419f157p6364D70371c601H7260d1250B96185a74918A80339b4328B13642
$$ plain form
15305 145045 -110824 -126283 222545 -220296 8215 -214956 282991 37065 -229020 162898
15294 103384 251220 43662 363480 -144180 -36767 -14538 75854 125467 124309 111749 -196390
15282 192082 226859 -206818 -312957 155582 131006 122972 47643 147124 -44179 169568 60617
15270 328455 192346 -10821 -165632 266338 23661 180513 218883 205657 -34866 292405
15259 136362 19742 -12683 274151 416550 284999 3595 -15561 107090 206552 71914 173361
15248 173361 409755 546742 669259 2312151 1707976 1868471 2077053 1011402 320836
15238 -223597 14343 -180107 46406 26415 195665 453938 253178 83491 92293 61329 -80845
15226 97419 -6157 -82521 470371 -3601 87260 -41250 296185 -174918 180339 -24328 213642
15214I1498L8302b58791A20525M1294B3361K10281b14892A68213Q2579b360l4362
15203c6722m4952A29584A434J15540L1675a35499N9238K2751C56004G4952d9561
15191a26401F4213Q6987a06872A50932B5418h6665A94781M7358p1671J60950d8925
15179A46675a09735A58146d6057A84804b03025A19818e6757A59261J88447A01509
15168b15640C53811C4504d905r8837j29203C28397a34543B43434A3370L35542
15158C48912b2470A1998g2119B03750J02959l6922f1864H6237K23905A30205J3139
15147A43344O2647C7225M6936h5597A94096K1553b7275A78940J24554l1631h5827
15135B46831C6444i8776A665K57612b2650C8238L28760D5503J31726J1230R1550
$$ plain form
15214 91498 129800 -258791 120525 161819 23361 233642 -214892 168213 250792 -2360 -36722
15203 -36722 -81674 129584 1434 116974 148649 -135499 -76261 -53510 356004 74952 -49561
15191 -126401 64213 151200 -106872 150932 25418 -86665 194781 242139 170468 331418 -48925
15179 146675 -109735 158146 -46057 184804 -203025 119818 -56757 159261 347708 101509
15168 -215640 353811 34504 -4905 -103742 -232945 328397 -134543 243434 13370 348912
15158 348912 -22470 11998 -72119 203750 306709 269787 -61864 86237 310142 130205 143344
15147 143344 205991 37225 84161 -85597 194096 215649 -27275 178940 303494 271863 -85827
15135 246831 36444 -98776 1665 259277 -22650 38238 366998 45503 177229 188459 280009
15124B80009F2009L03262A66259F0966J97956F7229N9893C9171a25765k5938G9319
15112b88631A06625J48910g4701B34370q9158b60796A75207B5382L8058J6155
15102G9595K04957c2190A45167L1590q5470a34646B76164j23115L481L49181E7226
15090G231a05092B64724j29680K27583A37109h0430c5323B86755O0054n8554E6613
15078a05773c7397B35707G3432P9510K8806J34192H7714K3375k0319J31922J53468
15067C76160b8877A45092E2547J73987F3985b56408C34436j2752A1142J00922
15057A12064O3488j2824b1782A52839J42909h0194B20647m6579J29373q3561J2203
15046B32083J59011q4852A08553J71730E9826B509L63808L628A48685J14915g8246
$$ plain form
15124 280009 62009 365271 166259 60966 258922 67229 127122 39171 -125765 -151703 79319
15112 -288631 106625 255535 -74701 234370 145212 -260796 175207 25382 63440 79595
15102 79595 284552 -32190 145167 176757 91287 -134646 276164 153049 156530 505711 57226
15090 7231 -105092 264724 135044 362627 137109 -80430 -35323 286755 346809 288255 56613
15078 -105773 -37397 235707 73432 152942 181748 315940 87714 111089 90770 222692 376160
15067 376160 -28877 145092 52547 226534 63985 -256408 334436 321684 11142 112064
15057 112064 175552 162728 -21782 152839 295748 -80194 220647 174068 303441 219880 232083
15046 232083 391094 306242 108553 280283 59826 2509 366317 369945 148685 263600 -78246
15034A53463Q6857A07927J30040L24742B58729j15664J54266A32840K95776a28524
15023A70554J11792r2901n4578J67154A05142g0593B58501m988I6955L01339A29827
15011B17413J12606o8386j10386J71134M054j21595K08672j43405A05281J03297
15001B08578b21234G0294J37137o2855n070o9386K17153J42227A20618L275e0403
14989A51087J14625j12374K22257A00571K63133A59967F5650J52097J49627J72303
14979E39677k05169j58797R0890p3223J60043B7901M04632j87089k8587K11860
14969D28717R7537l0860B39129j0779K43287j74169N4402L2421I4618N7026L61896
14958E13540M2640j70965A75453J14433A31904K55931I4189L00278I1570O7459
$$ plain form
15034 153463 240320 107927 237967 562709 258729 143065 297331 132840 428616 -128524
15023 170554 282346 189445 134867 302021 105142 -70593 258501 253513 96955 398294 129827
15011 217413 330019 261633 151247 322381 326435 204840 413512 270107 105281 208578
15001 208578 -221234 70294 207431 144576 139506 70120 287273 429500 120618 123893 -50403
14989 151087 265712 153338 375595 100571 363704 159967 65650 217747 367374 539677
14979 539677 334508 175711 266601 193378 353421 27901 432533 245444 216857 428717
14969 428717 526254 495394 239129 228350 471637 297468 351870 384291 94618 151644 513540
14958 513540 556180 385215 175453 289886 131904 387835 94189 394467 91570 159029
14948A59029L51450A73954K12764J96697B57956L51391l04668F5734K57766K47116
14938E70616L3613j63275A05251K53202J01453j39242K02838I3498J57124K69487
14928E20109j23866R6362B35932p4187R7255J20501j47627l5237K21332A90286
14917A15382N98530A29108O9379M01984A45244L40416B21340L7942j2622K06388
14907D53048a03161B21622J12961L62024C22179j01966K2567K08641j228A12725
14896D34968A10671J1294N28859l04721j0260A49586K64081n2400q1082p7469
14886B02716J26174j11296K29459A96512c0857D59746O2566r8645L48474l55276
14876D16865Q9532j6067K69834j09644l07313J69757j82663A14543K45322J08352
$$ plain form
14948 159029 510479 173954 386718 583415 257956 609347 304679 65734 323500 570616
14938 570616 604229 440954 105251 358453 459906 320664 523502 93498 250622 520109
14928 520109 396243 492605 235932 161745 259000 379501 231874 196637 417969 190286
14917 115382 713912 129108 198487 600471 145244 485660 221340 259282 246660 453048
14907 453048 -103161 221622 334583 696607 322179 220213 242780 451421 450193 112725
14896 434968 110671 121965 650824 346103 335843 149586 413667 361267 280185 202716
14886 202716 328890 217594 447053 196512 -30857 459746 522312 423667 772141 416865
14876 416865 506397 490330 760164 650520 343207 512964 330301 114543 359865 468217
14866D68217J1280O2757N2017j03075j4996m6518q4250K43866k71928M37292B14701
14854G55114A79531J83972l551O36684D33942j56510M12268A68608M48611k62971
14844C54248L21826m7473A70339K37988k1338J06547j56730K79432j38018K27906
14834G06126k53380p3147J60425p3121A98959K23155M3275k07964A5089P21785
14824G36874B65873J80018M1302j54915K82008N359B79665F4198N04024J45283
14814G13505l32761J63135k5388k32434L95185j35594M6880J04825j89077K38327
14804G46603j66337q4037P5763j41131m6654o0962J88239N1m6931j0961n0299
14793D03344L88714J26540A96132N39473n5280K3658r3245J0540J39564l19837
$$ plain form
14866 468217 479497 542254 594271 491196 476200 429682 345432 589298 317370 754662 214701
14854 755114 179531 363503 359952 996636 433942 277432 689700 168608 617219 354248
14844 354248 676074 628601 170339 408327 386989 493536 336806 616238 478220 706126
14834 706126 452746 379599 540024 466903 198959 422114 465389 257425 15089 736874
14824 736874 265873 445891 487193 332278 614286 619645 279665 64198 568222 713505
14814 713505 380744 543879 518491 286057 681242 545648 592528 697353 508276 746603
14804 746603 580266 496229 571992 430861 384207 323245 511484 511535 464604 453643 403344
14793 403344 792058 918598 196132 735605 680325 703983 610738 621278 760842 441005
14783D41005J28960K69157Q2548l76707K85741k84130K33491k92009Q1655Q4684
14773F54395J66656k36148j13643k10814L41543o4108j40914J77618m5915J30203
14763F58873k809m1239k23506N50813l82289k79573L42301J40387J88635j44911
14753H06682j38731N8570M51863l40452q3533M85905k85606l32336J86505K8609
14743H37476j35991J33894k5416l61111k1036K30923N3071k5322L36624E04945
14732F38944j7548J84755J20457j64697k00208K7201L78716L2946m34428O18204
14722A184342l75510K54421D21382K05500J69683K40635l35099J1745j11666L19253
14712I21433l35345K00995K01130m3797k6600L88201l33167l70119N30222R1396
$$ plain form
14783 441005 569965 839122 921670 544963 830704 546574 780065 488056 569711 654395
14773 654395 821051 584903 471260 260446 601989 537881 396967 574585 528670 658873
14763 658873 656064 614825 391319 942132 559843 280270 622571 762958 951593 806682
14753 806682 667951 726521 1178384 837932 754399 1240304 954698 622362 808867 837476
14743 837476 701485 835379 809963 448852 427816 658739 711810 686488 1023112 504945
14732 638944 621396 806151 926608 761911 561703 588904 967620 1000566 566138 1184342
14722 1184342 808832 1063253 421382 626882 796565 1037200 702101 713846 602180 921433
14712 921433 586088 787083 988213 944416 917816 1306017 972850 602731 1132953 1224349
14702A224349j71440D12649L88766L77021m08501N67r142K45860j1962k87123
14692G08135J66054L53250k40410P8614K01339j78003j03265l35650M63570k36904
14682H76730q1733L16667N4895o072p4459M0401L3490k27856J82091l09907Q3587
14671H87834L18047l8298K7455p6358k27416j56347L04291L54671m34055L07991
14661A267815k17310K37736j76586Q9294J24130k3196j24198O647M4325j54648
14651A074009R0849k3823J89995j35826M2678J47517k05499O693l10326N65669
14641A441936j24906J02290q2450k88711J99897K51415k99980L59426k41782J90129
14631A507264L04453m35994O2452m484l15275O08102k09678k15793o4317L98004
$$ plain form
14702 1224349 1052909 412649 801415 1178436 769935 770502 761360 1007220 995258 708135
14692 708135 874189 1227439 987029 1065643 1266982 1088979 985714 650064 1113634 876730
14682 876730 794997 1111664 1166559 1160487 1086028 1126429 1159919 932063 1114154 804247 887834
14671 887834 1205881 1167583 1195038 1118680 891264 734917 1039208 1393879 959824 1267815
14661 1267815 1050505 1288241 1111655 1200949 1325079 1301883 1177685 1184332 1228657 1074009
14651 1074009 1164858 1141035 1331030 1195204 1237882 1385399 1179900 1186593 876267 1441936
14641 1441936 1317030 1419320 1336870 1048159 1248056 1499471 1199491 1558917 1317135 1507264
14631 1507264 1811717 1375723 1438175 1433691 1118416 1726518 1516840 1301047 1236730 1634734
14621A634734l66819p8279L52659J04540j66507j5031J42625l58797K65907N7558
14611A572590j31370Q7728P8010j97804j7312M97998p9935M7206j12320k48946
14601A495845L76431k0739k28739K72344L2732j69135j08166L22032l02552q1099
14591A588954M57707j25884N5263r6687j12741J2074K89196j02939r2653r4530
14581A777760L6276N85778l65345J17143O9231l78670J28098K31463J78295l58053
14571B021976L61037l50148M95683n8492j41258L51274m29251L69215q354m160
14561B607522k44227M41067l0182j9475K34259Q801M15395N69048k47655L18312
14551D052865P43631Q35724K194107M599932R611831K0805607J084423A8412171
$$ plain form
14621 1634734 1267915 1189636 1542295 1646835 1480328 1465297 1607922 1249125 1515032 1572590
14611 1572590 1441220 1528948 1606958 1409154 1391842 1889840 1809905 1857111 1744791 1495845
14601 1495845 1872276 1851537 1622798 1895142 1927874 1758739 1650573 1972605 1670053 1588954
14591 1588954 2046661 1920777 1976040 1879353 1766612 1778686 2067882 1964943 1872290 1777760
14581 1777760 1814036 2399814 2034469 2151612 2220843 1842173 1970271 2201734 2380029 2021976
14571 2021976 2383013 2032865 2528548 2470056 2328798 2680072 2250821 2620036 2611682 2607522
14561 2607522 2363295 2804362 2774180 2754705 2988964 2997765 3413160 3982208 3734553 4052865
14551 4052865 4796496 5632220 7826327 12426259 22038090 42843697 43928120 18412171
14542G557747k118284J384451j970169k074995o27956k15558J0619j33655K54068
14533B066268O0929k53302L83893j25243M21727n52893J47355J42893P3122K26631
14523B591380l22528M0091J39203J49343j42037Q6092j9088Q6694J90407k09892
14513B589665q3896L72149j52402J63729p2957J08956J52021K6154l48933L62479
14503C116965k12625J73488L02094j15630l73889N58183m34491L26137J36009
14494C476241j46745K07422R9146j65136J77873p5482K57786L5541k69588K1522
14484C618580Q4003J54451n9822O8401K61753k05455J01257R2198R0141q2256
14474D123251J55115K43443r1836J76852j86226n0252M8083J87283J519P9346
$$ plain form
14542 7557747 5439463 6823914 4853745 2778750 2150794 1935236 1945855 1812200 2066268
14533 2066268 2127197 1873895 2257788 2132545 2554272 2001379 2148734 2291627 2364749 2591380
14523 2591380 2268852 2308943 2448146 2597489 2455452 2541544 2522456 2609150 2799557 2589665
14513 2589665 2505769 2877918 2725516 2889245 2816288 2925244 3077265 3103419 2754486 3116965
14503 3116965 2904340 3077828 3379922 3264292 2890403 3448586 3014095 3340232 3476241
14494 3476241 3329496 3536918 3636064 3470928 3648801 3573319 3831105 3866646 3597058 3618580
14484 3618580 3702583 3857034 3797212 3865613 4127366 3921911 4023168 4115366 4205507 4123251
14474 4123251 4278366 4521809 4429973 4606825 4420599 4370347 4418430 4605713 4607232 4686578
14464D686578l04121L73907L16389j10274L93779n89382n4594M95474J63459k41416
14454E129799L6769L36K72798K13956q0820j71412K29789N0339R653J14399k1921
14443E783685J77234j2880j65969N13676m3408k42023M25401J79666l9192j03590
14433F472600J45191O20602m32167L8689O07062l42671Q3470J12773o1096j71063
14423G073390Q21681k56935L7478J42717L10039m30950M26761K94474K06675K30098
14413H855428j69602L72891k73852N37350k53264L87949j8062K54728k5501J93430
14403I861495M1633L94127o641N41444l0746M14375j32664L2686K34943K05453
14393A1556105K05567J18918M55706O3166K93669L15240K98503K24207J63297
$$ plain form
14464 4686578 4382457 4756364 5072753 4962479 5356258 4766876 4712282 5207756 5371215 5129799
14454 5129799 5166568 5166904 5439702 5653658 5572838 5401426 5631215 5681554 5691207 5805606 5783685
14443 5783685 5960919 5948039 5782070 6295746 6252338 6010315 6435716 6615382 6576190 6472600
14433 6472600 6617791 7238393 6806226 6844915 7451977 7109306 7192776 7305549 7244453 7073390
14423 7073390 7895071 7638136 7675614 7818331 8128370 7697420 8124181 8418655 8625330 8855428
14413 8855428 8685826 9058717 8784865 9322215 9068951 9456900 9438838 9693566 9668065 9861495
14403 9861495 9903128 10297255 10290614 10832058 10801312 11215687 11083023 11115709 11350652 11556105
14393 11556105 11761672 11880590 12336296 12399462 12693131 13008371 13306874 13531081 13694378
14384A3694378L8341L91251O7889K05649O56884M5878M27830L85337K07167M08364
14374A6528968K41975l446K32279Q33080L27891o5306N89952O61161R6382N56758
14364A9999694K63248K59173Q63715M24471J7562J025553L21622N19754J85928
14355B3880720J046365J84772R05112N05341P23388K88794O18970P62100O14910
14346B9530472J168156N36822O70206J189139N74734J058366Q24191J092239J192944
14337C7837269J016976Q39404J136335J282611J190344J460721J687662J145515
14329D7596837J283618J850781J310317J888172J735944J743829J845408K297086
14321F1551992K116015K160747K165700K602853K830160K457036K966725L005738
$$ plain form
14384 13694378 13732719 14123970 14191859 14397508 15054392 15100270 15528100 15913437 16120604 16528968
14374 16528968 16770943 16767497 16999776 17832856 18160747 18095441 18685393 19346554 19442936 19999694
14364 19999694 20262942 20522115 21385830 21810301 21827863 22853416 23175038 23694792 23880720
14355 23880720 24927085 25111857 26016969 26522310 27245698 27534492 28153462 28915562 29530472
14346 29530472 30698628 31235450 31905656 33094795 33669529 34727895 35552086 36644325 37837269
14337 37837269 38854245 39693649 40829984 42112595 43302939 44763660 46451322 47596837
14329 47596837 48880455 50731236 52041553 53929725 55665669 57409498 59254906 61551992
14321 61551992 63668007 65828754 67994454 70597307 73427467 75884503 78851228 81856966
14313H1856966L331772L139838L502786L991747M232714L714815M683543M601141
14305A13055322M866428N192288N749841N755365O078075O633350P195214P022112
14297A61547995Q013517Q059805Q906364R501474R421508J0738885J0353720J1558730
14289B38101998J1750313J2700221J3031583J3631257J3889320J4312751J4596988
14282C32014431J4817949J4634466J4827776J4290994J4008209J2646251J2138288
14275D29378364J0351498Q479010M724418J424305J351081J052509j537287j077294
14267D54146604k258945n570690q317836j0395311j1517041j2487640j3944899
14260C89654242j4763334j5017762j5326854j5473787j5025874j4743577j4439023
$$ plain form
14313 81856966 85188738 88328576 91831362 95823109 100055823 103770638 108454181 113055322
14305 113055322 117921750 123114038 128863879 134619244 140697319 147330669 154525883 161547995
14297 161547995 169561512 177621317 186527681 196029155 205450663 216189548 226543268 238101998
14289 238101998 249852311 262552532 275584115 289215372 303104692 317417443 332014431
14282 332014431 346832380 361466846 376294622 390585616 404593825 417240076 429378364
14275 429378364 439729862 448208872 452933290 454357595 455708676 456761185 455223898 454146604
14267 454146604 451887659 446316969 437999133 427603822 416086781 403599141 389654242
14260 389654242 374890908 359873146 344546292 329072505 314046631 299303054 284864031
14253B84864031j4094623j2623624j1383110j2211561j1700400j1257996j0197153
14246B01395564r404877r364169q162195q518202p783977p577069o937128o234590
14238A37413357n822962n394846o007010m930386m989615m320546m147166l635469
14230I8165357m076440l788575l690452l341120k773962l395239k922036k370957
14222G1806576k691118k239692k295679k145197k334550k041652j418182j910683
14214E4729823j389274j782976j599618j641184j861900r29761j396521n48517
14206D3580072j172511j411630j514163j323685o80674p10522q33782r38876j242773
14197C3751456q86540r99964o03549m51460r66404q37384j047620n47099n45714
$$ plain form
14253 284864031 270769408 258145784 246762674 234551113 222850713 211592717 201395564
14246 201395564 191990687 182626518 174464323 165946121 158162144 150585075 143647947 137413357
14238 137413357 131590395 126195549 120188539 115258153 110268538 105947992 101800826 98165357
14230 98165357 94088917 90300342 86609890 83268770 80494808 77099569 74177533 71806576
14222 71806576 69115458 66875766 64580087 62434890 60100340 58058688 56640506 54729823
14214 54729823 53340549 51557573 49957955 48316771 46454871 45525110 44128589 43580072
14206 43580072 42407561 40995931 39481768 38158083 37477409 36766887 35933105 34994229 33751456
14197 33751456 32864916 31864952 31261403 30809943 29843539 29006155 27958535 27411436 26865722
14188B6865722n19835r63738r7947m97375q60917m43798n13499q61204l94162
14179B1713247l86202q5613j096539K66362k90923p67363o28961k19630l85575
14170A8118803K6255p78527j22675m75898K581n93351j84582J73566p12040k95661
14160A5158471l85023l6776k05938o36901J22271l57542j31973n30759R924P8577
14150A3084331l95319q5725m06403j72172N6265m69078l51350L46556m06262m36109
14140A0764734J98864k59723k60240l78919J46828J9800n23472j69669M5794K87528
14130I871525k64032l06958j81878q3655k82804J32630j89614l3412j37025j82102
14120H342675J3050L2849k97902r3288j85647k71471K33616m79222J35059j23586
$$ plain form
14188 26865722 26345887 25382149 25284202 24786827 23925910 23482112 22968613 22107409 21713247
14179 21713247 21327045 21241432 20144893 20411255 20120332 19352969 18724008 18504378 18118803
14170 18118803 18145058 17366531 17243856 16767958 16770539 16177188 15992606 16166172 15454132 15158471
14160 15158471 14773448 14736672 14530734 13893833 14016104 13658562 13526589 12995830 13005754 13084331
14150 13084331 12689012 12603287 12196884 12024712 12080977 11611899 11260549 11607105 11200843 10764734
14140 10764734 10963598 10703875 10443635 10064716 10211544 10231344 9707872 9538203 9583997 9871525
14130 9871525 9607493 9300535 9118657 9035002 8752198 8884828 8695214 8661802 8524777 8342675
14120 8342675 8355725 8388574 8090672 7997384 7811737 7540266 7773882 7294660 7429719 7306133
14110G306133p8274k33986m7464N9394j89932L37675l52999j43764k78607k72536
14100F105640L58596R6977m37824l52472K86066k14671P1299O2897J47397l62400
14090E761505p2871l37215J08594n22141O31394k48614k28570J95186j61766l31805
14080D793697L93945j9275j29705k7366l80091M7657j15246q5553Q0751J27407
14070D686221J0002L09170o20378K26987l02941j13443j21612K88853k34864K08309
14060D336304j43466n62080M11538o7451p2457k33298K48214n5353q3863o1192
14050C716896j13815O9642k51664K26948J93079j34216j71737o6101O6758P5081
14040C610871l73922J04004l46378M57141j42293k74150J08466j03965J75790
$$ plain form
14110 7306133 7227859 6993873 6946409 7005803 6815871 7153546 6800547 6656783 6378176 6105640
14100 6105640 6464236 6561213 6123389 5770917 6056983 5842312 5913611 5976508 6123905 5761505
14090 5761505 5688634 5351419 5460013 4937872 5569266 5320652 5092082 5287268 5125502 4793697
14080 4793697 5187642 5168367 5038662 5011296 4631205 4678862 4563616 4478063 4558814 4686221
14070 4686221 4696223 5005393 4385015 4612002 4309061 4195618 4074006 4362859 4127995 4336304
14060 4336304 4192838 3630758 4042296 3974845 3902388 3669090 3917304 3861951 3778088 3716896
14050 3716896 3603081 3672723 3421059 3648007 3841086 3706870 3535133 3469032 3535790 3610871
14040 3610871 3236949 3340953 2994575 3451716 3309423 3035273 3143739 3039774 3215564
14031C215564p4818K5364l42704K39579k33770N2503L91331m28436K1503p3139
14021B792977p3773k76998R9556p4243J67166J93122m19096O5255k03952N49289
14011B819303l59545p3185N5555j61189J06053N1410j52015L73897k39191l48573
14001B072520J9397K63750m02270L33497k78943K19037K54032j45685j48696N1113
13991B237752J51391M24072J004541L289776P965163K1595283J0452182k1762237
13983B5357923A2301910m279611k480086j027513m13361l51266n02308l99604
13975B848161K07716k40866l8750j79837l0908K77332k98511O4304l72463K31865
13965B468043m0529j71784L69235n59157r0310M2270k31874K48220P6504P1459
$$ plain form
14031 3215564 3140746 3166110 2823406 3062985 2829215 2881718 3273049 2844613 2866116 2792977
14021 2792977 2719204 2442206 2541762 2467519 2634685 2827807 2408711 2473966 2270014 2819303
14011 2819303 2459758 2386573 2442128 2280939 2386992 2438402 2286387 2660284 2421093 2072520
14001 2072520 2091917 2355667 1953397 2286894 2007951 2226988 2481020 2335335 2186639 2237752
13991 2237752 2389143 2813215 3817756 7107532 15072695 36667978 47120160 25357923
13983 25357923 12301910 8022299 5542213 4514700 4101339 3750073 3247765 2848161
13975 2848161 3055877 2815011 2776261 2596424 2565516 2842848 2544337 2608641 2236178 2468043
13965 2468043 2427514 2255730 2624965 2065808 1975498 2017768 1785894 2034114 2110618 2182077
13955B182077k45133J45666m41963K56543J8420J9958K00004k7532n52318J89502
13945A745224L68649l34608J91459j62004j34877J60602K15498k02893l51909
13936A495141M96611k17691N8083K1698o1254k93003M03439k56768K27179q342
13926A865093J8369o94688L39653L42048m48342J84676K44298j72513k11355K29901
13916A697140l51100K71847l39108L68954J45496l87733j58498K21902j36323
13907A332577P9225n0046j77070J15662J71380k11458J5282l5162J70282l01372
13897A109300k5414J95087j86076L69335k23262p31L46538n05276M71391l97094
13887A153798j66287R9729K03499j51134J64198k32134K57304k69207r2460L48651
$$ plain form
13955 2182077 1936944 2082610 1640647 1897190 1915610 1935568 2135572 2108040 1555722 1745224
13945 1745224 2113873 1779265 1970724 1808720 1673843 1834445 2049943 1847050 1495141
13936 1495141 1991752 1774061 1832144 1853842 1792588 1499585 1903024 1646256 1873435 1865093
13926 1865093 1883462 1188774 1528427 1870475 1422133 1606809 1851107 1678594 1467239 1697140
13916 1697140 1346040 1617887 1278779 1647733 1793229 1405496 1246998 1468900 1332577
13907 1332577 1411802 1361756 1184686 1300348 1471728 1260270 1275552 1240390 1410672 1109300
13897 1109300 1083886 1278973 1092897 1462232 1238970 1238239 1584777 1079501 1550892 1153798
13887 1153798 987511 1087240 1290739 1139605 1303803 1071669 1328973 1059766 967306 1315957
13877A315957O717J23311j88452K4246p4248R7090j19938R8549J74448q506l91806
13866A057368k13050K87167j90809P6693J74304k69360K20126J93229n16420L42338
13856A161586k13658J09539J43605k99492M99702k42609r0396q29k29574K40159
13846A078033j81287R1932K78706k13885k81533J29896j50973m6574N61041m73908
13836G91448N64683l08994l08191K82516k60082M3461K80499k34891j16574J48345
13826H82220M89868l15160j44303k18088L66429R3698l19357J65867M3704k35502
13816H09376J16645j90118M63110m08474K31433k96219P6134j1893j52322L92031
13806A029703k00127j5732M1618Q2974k39396J22939J04860j87240K83954l4504
$$ plain form
13877 1315957 1322674 1445985 1257533 1281779 1207531 1304621 1184683 1283232 1457680 1449174 1057368
13866 1057368 844318 1131485 940676 1017369 1191673 922313 1142439 1335668 819248 1161586
13856 1161586 947928 1057467 1201072 901580 1401282 1158673 1068277 1067448 837874 1078033
13846 1078033 896746 988678 1267384 1053499 771966 901862 750889 704315 1265356 791448
13836 791448 1356131 1047137 738946 1021462 761380 804841 1085340 850449 733875 882220
13826 882220 1372088 1056928 912625 694537 1060966 1154664 835307 1001174 1044878 809376
13816 809376 926021 735903 1199013 790539 1021972 725753 801887 789994 637672 1029703
13806 1029703 829576 813844 855462 938436 699040 821979 926839 739599 1023553 989049
13796I89049l10991n1919K88306j24500k6353K06720k6860k66973o4422J22534
13786G34591K67433D99274R2193M72431k94558q4532P9224k24377K29476K77298
13776A046429j84024m7341m1159J77371j84126M2336k8989N6591l69451K53523
13766G21160j56764N1351p5040K69595m0820P1712l8290r4674p8560k78057K21032
13755E72645J04625K35085l52078L54677m9270C78579M26859l61028L50313j85616
13745F09107J9468r7300k6809J34982j24700K6855Q2982j1549J12678k92602K11154
13734F44266B44450K68846n026q1927k851J10247R0491m2752j48405j65907L73887
13723F41053j74533L4884J99586k34122L0880K25829k06466j11021J89879o1309
$$ plain form
13796 989049 678058 626139 914445 789945 763592 970312 943452 676479 612057 734591
13786 734591 1002024 499274 591467 1063898 769340 684808 764032 539655 769131 1046429
13776 1046429 862405 815064 773905 951276 767150 809486 780497 837088 467637 721160
13766 721160 564396 615747 540707 810302 769482 841194 802904 708230 629670 351613 572645
13755 572645 677270 912355 560277 914954 865684 378579 805438 444410 794723 609107
13745 609107 628575 531275 504466 639448 514748 541603 624585 613036 725714 433112 644266
13734 644266 244450 513296 508270 426343 423492 533739 624230 581478 433073 267166 641053
13723 641053 466520 501404 700990 466868 497748 723577 517111 406090 595969 534660
13713E34660K91826D05565K30311m6970k14627K34608M4042k49777A07351M17833
13703E25184J62354C41183j2658j12931L53185k38367K92915k62646p2616P36118
13693A024183C73902J7441l2474j03222L47635j25270K75476l75188L32219l0041
13683F80478Q9646B25201J60738K52677m1230k00999O4485K12702k99475J21993
13673D96092K8216L51249D23366j54558n2053J48774K79711r7356n3008l8187
13663D56689B28001Q7610p2338M84253a93253C53348N8015o368M0792Q5594o3094
13652D68287j47743L4123j71135J85466o8456J26968k12486K88931k39061M87926
13642G52820k36112A63203J69626m2615K02221j78213P2426J6120o7854k2855
$$ plain form
13713 534660 826486 405565 635876 588906 374279 608887 652929 403152 107351 525184
13703 525184 687538 341183 328525 215594 568779 330412 623327 360681 288065 1024183
13693 1024183 373902 391343 358869 255647 603282 478012 753488 378300 710519 680478
13683 680478 770124 225201 385939 638616 597386 396387 460872 673574 374099 496092
13673 496092 524308 875557 423366 268808 216755 365529 645240 547884 494876 456689
13663 456689 228001 315611 243273 727526 -193253 353348 411363 404995 445787 531381 468287
13652 468287 320544 354667 183532 368998 300542 427510 215024 503955 264894 752820
13642 752820 516708 163203 332829 290214 492435 314222 386648 402768 334914 312059
13632C12059K25206q2022J7994k33289R9164j171M8649K39528k29381Q0571o5761
13621D11547L7203K0110j58016A41599N94035k88878p3147A67674L22761j35467
13611C54968j09445K11030j54763K27652K8141l0552A45128N42355k03344j40087
13601C44052M4939k738K45318o3302B70717q1726F6552K11865j28340P187L22746
13590D80010A83067K70282q1043m9995M8260j77741J45050j35892M1560M5029
13580B88577J79119A72766M8494C0642K74442P6646K8518F6791K93807J37617
13570D98215k36027k3083K00108D4246J55091Q2696M2195Q2547l3382K42510B35404
13558C75285A16491J18804J57575c6804B89942e1256D70992j78238j22410O4703
$$ plain form
13632 312059 537265 455243 473237 239948 339112 337941 386590 626118 396737 477308 411547
13621 411547 448750 468860 310844 141599 735634 446756 373609 167674 490435 354968
13611 354968 245523 456553 301790 529442 557583 527031 145128 687483 484139 344052
13601 344052 388991 386253 631571 568269 270717 188991 66552 278417 150077 157264 480010
13590 480010 183067 453349 372306 322311 370571 192830 337880 201988 243548 288577
13580 288577 467696 172766 221260 30642 305084 381730 410248 66791 360598 498215
13570 498215 262188 239105 439213 44246 199337 282033 324228 406775 373393 615903 235404
13558 375285 116491 235295 392870 -36804 289942 -51256 470992 292754 170344 235047
13548B35047K26919A52965K20349J43074k44199q814J54357A57754Q7314J93175
13538D38243A91553K1648L39212j49400j85306G9971J72573G3450J5048L48802
13528D37300K04613l08999J96309L8309A90235K18073k7994A22824a1609C08003
13517D12703G0352l3218P4875m4872K07914O7905k7561r4410J84806B5809M74551
13506E00360C3007J71970K14368j26790K37495B08282K41512B18273Q9089j8995
13496B88367j13347K26170A73259R57j1598o7803K92056A52582C6256j5063N11911
13485E33104n5546A62155M2596J33701A38298l0601a4129C10417a7403A84729
13474A64575K84397j94575O999r0345D8936L72459j65935J04592A5853K97706
$$ plain form
13548 235047 461966 152965 373314 516388 272189 263375 417732 157754 245068 438243
13538 438243 191553 213201 552413 403013 217707 79971 252544 73450 88498 437300
13528 437300 641913 332914 529223 567532 190235 408308 380314 122824 -11609 308003
13517 412703 70352 37134 112009 67137 275051 342956 315395 220985 405791 25809 500360
13506 500360 33007 204977 419345 292555 530050 208282 449794 218273 307362 288367
13496 288367 175020 401190 173259 174216 162618 94815 386871 152582 36256 21193 533104
13485 533104 477558 162155 204751 338452 138298 107697 -14129 310417 -17403 184729
13474 164575 448972 254397 261396 171051 48936 421395 255460 360052 15853 313559
13464C13559p951J05266j10726J83720A62112J74394J9436C4575M70965B18331
13453A90349n0205B0947K50710D9028L04201F2434K98090M9229e9919C75607h8094
13441B53634B3944K21860l6071K52365A69136K3204K15453A99976J25573f3187
13430C91785A67660M00M0461F0639M13690J26487B50966J59821q2613d6406C57789
13418C30671A7216o688L51033A78197f3667J55A95050L01959j74605j41008b77849
13406A33263O4624a51697A13159J05801I8533l6631j2176Q4849K30685G8691a08208
13394A06096r766K40514l1282J31349E4501J79764f1537B36872J12050A25041
13383f1785B91995l3975A16648K25325F1914K57103k5968p2845r4733J86168A16048
$$ plain form
13464 313559 305608 410874 300148 483868 162112 336506 355942 34575 505540 218331
13453 190349 140144 20947 271657 49028 353229 62434 360524 409753 -59919 375607 -88094
13441 253634 23944 245804 209733 462098 169136 192340 407793 199976 325549 -63187
13430 391785 167660 168060 208521 60639 474329 600816 250966 410787 328174 -46406 357789
13418 330671 17216 10528 361561 178197 -63667 -63512 195050 497009 322404 181396 -277849
13406 133263 197887 -151697 113159 218960 98533 61902 49726 134575 365260 78691 -108208
13394 106096 96330 336844 305562 436911 54501 234265 -61537 236872 348922 125041
13383 -61785 291995 258020 116648 341973 61914 319017 293049 220204 125471 311639 116048
13371f5983C99486A68093J49534I4231Q3003B8290h1761A38147J93585e8827B30224
13359g3053A54935a29350I3030l1933Q7654K82602a61327C30791m7027j17977
13349A65787J01435J58046A71249n9885L65072k1825k0697M0246A05566L78757
13339D84323D5780J00374L39035A33574J00644f2237B36911P8863D720J91335
13329A96055G6884L24689j1206B7487N09183B5578C397K08364K07558I9165J12775
13318B11940P9695J07300j30597K21748a67711C31734D7193K80053j4417a41759
13307A82757k413F7538M35241k37478p0636m4249o2416J45416D2248J03854C4534
13295B63895l6356B2831K57316d7813A09673K44129k4324G5804P1689G2836J70925
$$ plain form
13371 -65983 399486 168093 317627 94231 177234 28290 -81761 138147 331732 -58827 230224
13359 -73053 154935 -129350 93030 61097 148751 431353 -161327 330791 283764 165787
13349 165787 267222 425268 171249 111364 476436 454611 433914 474160 105566 484323
13339 484323 45780 146154 485189 133574 234218 -62237 236911 315774 4720 196055
13329 196055 76884 401573 390367 27487 536670 25578 3397 211761 419319 99165 211940
13318 211940 291635 398935 268338 490086 -167711 331734 47193 327246 312829 -141759
13307 182757 180344 67538 502779 265301 194665 150416 88000 233416 42248 146102 34534
13295 263895 227539 22831 280147 -47813 109673 353802 329478 75804 147493 72836 243761
13284B43761B5621P3285J598K23146a53068B10324B4828e4445J4917B56771B1954
13272f7548B17202R3937r7223p7825g2077A1131K42448l9265d3293j9180B98321
13260C56934A5495L39836m1849A3707a05741B19902b36798E70069B75733E8706
13249g9149B5337P1762B1713J56217o8166K15646m8983b70612a33537A44659J92395
13238C37054A26205d8449E466g925B74007a41817E8338J38904a74466I1658d9930
13226a68479C33997n2951G1824a15435J5728a9530A88203J16058A20289a99712
13215A85943J43371d7940q6808c8794B73483L7872a84709B20366c0631B39668
13204A207K04127h853D66690J10275H27L44672a33434A85390q107o3664J79809
$$ plain form
13284 243761 25621 98906 100504 323650 -153068 210324 24828 -54445 -39528 256771 21954
13272 -67548 217202 311139 213916 136091 -72077 11131 253579 214314 -43293 -62473 298321
13260 356934 15495 355331 313482 13707 -105741 219902 -236798 570069 275733 58706
13249 -79149 25337 97099 21713 177930 109764 325410 276427 -270612 -133537 144659 337054
13238 337054 126205 -48449 5466 -7925 274007 -141817 58338 197242 -174466 91658 -49930
13226 -168479 333997 281046 71824 -115435 -99707 -19530 188203 304261 120289 -199712
13215 185943 329314 -47940 -134748 -38794 273483 311355 -184709 220366 -30631 239668
13204 1207 205334 -8853 466690 576965 827 345499 -133434 185390 177283 113619 293428
13193B93428Q9716d1978F5564M5545D8267a17216A38908a73917D4906L02172D6131
13181I8853j3173i9156m4913B08248J77156h5340A93257c37370H4177k24e3598
13169C98976A78121D1736b2923B38242m0545C5151O3650l3306A7461P7457O5983
13158A60901G1424C536L06522o0802m5516H8433A4820M63098h540q8446B54532
13146F8633K33284j22487d1370O059C5037K71875o2833A6375Q822L768L2293L14528
13134C75786a17712B19527r2257K39508A80588J74928D383f0637C8821J38981
13124A77802c359j11667r062B98478a95650O1316m7365E0785a85759D5975O245
13113E2220b08311O1163B21751G2031K8598l0136P3947a51790K6461E2785K43077
$$ plain form
13193 293428 383144 -41978 65564 111109 48267 -117216 138908 -173917 44906 347078 46131
13181 98853 85680 -99156 -144069 208248 385404 -85340 193257 -337370 84177 83953 -53598
13169 398976 178121 41736 -22923 238242 197697 35151 98801 65495 17461 94918 160901
13158 160901 71424 3536 310058 249256 203740 88433 14820 477918 -8540 -96986 254532
13146 68633 301917 179430 -41370 -35311 35037 306912 244079 16375 25197 28965 61258 375786
13134 375786 -117712 219527 127270 366778 180588 355516 4383 -60637 38821 177802
13124 177802 -3359 -115026 -124088 298478 -195650 -134334 -181699 50785 -185759 45975 52220
13113 52220 -208311 -147148 221751 72031 100629 70493 144440 -151790 -125329 52785 295862
13102B95862n5931A06032J25926A08452k7016h379C2281a02338A46814c9438P293
13091c2145B47119D4113O0136A6370K41225a9322F7297R5875Q3402B6106J37340
13080A63446e9523D07918c46627A21917k6378L5740h2641C59092c0650I5019P0249
13069A65268K260c6736A01082j1455J24337o1810D7792J71873a08386j1709e6702
13057E4941J8674L6317a55092B04895B7948b2185F2477B428N4374b06569A7724
13045a37997A5230B648a11838A73445M0882F4301b087C07554j42186L3609J40453
13034C39430G4113J1662l2013J06538a42225c2697C7931K05349B1414e4372I3671
13022d2110F8379k7826J3383J00677a07290l2259H7818L38627B9651J80773K11053
$$ plain form
13102 295862 239931 106032 231958 108452 81436 -8379 32281 -102338 146814 -39438 -32145
13091 -32145 247119 44113 104249 16370 257595 -19322 67297 163172 246574 26106 163446
13080 163446 -59523 407918 -346627 121917 95539 131279 -82641 359092 -30650 95019 165268
13069 165268 167528 -36736 101082 89627 213964 152154 47792 219665 -108386 -120095 -56702
13057 54941 73615 109932 -155092 204895 27948 -22185 62477 2428 56802 -206569 17724
13045 -137997 15230 2648 -111838 173445 214327 64301 -2087 307554 165368 198977 339430
13034 339430 74113 85775 53762 160300 -142225 -32697 37931 243280 21414 -54372 93671
13022 -42110 68379 40553 53936 154613 -107290 -139549 87818 426445 29651 210424 421477
13011D21477a1359j93396K2457B74183C2991b03086C11714a4983A71824h4980
13000B18560d0349A14962l441L4087J45604c7705j65329i2606H3139R8479q3400
12989I8218j703f4927A6322J25934M189A1140a931C0849L80224k01884D9963J84713
12977B34676j901B8221b5858j06218A08292J20688a97417C8758J55213b289n6115
12966e8404j20427C0002O9531N5554a39303L2975B9323J50635C7861K10612D7885
12954d04413a93502A81723d4690C2785j1708A810J76367E2089J62338b9133m1073
12943g0206p0412H6203a7749A17225n1306B0249K43056F0345a2449B1525K26087
12932B47612i6075B70653D4787L6210k0860a46549A68395a22216A94131H7874
$$ plain form
13011 421477 -11359 -204755 -182298 274183 32991 -203086 311714 -14983 171824 -84980
13000 218560 -40349 114962 111521 145608 291212 -37705 -203034 -92606 83139 181618 98218
12989 98218 96515 -64927 16322 142256 146445 11140 -1931 30849 411073 209189 49963 234676
12977 234676 232775 28221 -25858 -132076 108292 228980 -197417 38758 193971 -2289 -58404
12966 -58404 -178831 30002 99533 155087 -139303 -106328 29323 179958 37861 248473 47885
12954 -404413 -193502 181723 -44690 32785 21077 1810 178177 52089 214427 -29133 -70206
12943 -70206 -140618 86203 -17749 117225 65919 20249 263305 60345 -12449 21525 247612
12932 247612 -96075 270653 44787 80997 60137 -146549 168395 -122216 194131 87874
12921d2556I9810i393C42766j30424j8598f4358m6098j18015B32513J4820C581
12909I5771m6678K23343A7623b11915C48159c35127B00339C442c8681n4856b2026
12897A39956K14994A19443b16762d0121j09212r7251A54417A534K08062N9239
12887B68835b59625C7281c5965I2197P71P5325J78976H8130a55341l4638B03272
12875b7957A3382K47567E1173f1287D1700M9552b60655o215B09691J3681A6774
12863h8066j00372r4242B52206d8029B61571F2931g4952k8749B86219b41304i7993
12851C86432b8755h080j73831F2393J1405j5273N8536L9159J13163m2278l7197
12840A89908D4578J23817g6441C53861A5774a51344A89726E1732J45761I2J9289
$$ plain form
12921 -42556 99810 -9393 342766 212342 193744 -64358 -110456 -228471 232513 247333 3581
12909 95771 49093 272436 17623 -211915 348159 -335127 200339 3442 -38681 -93537 -22026
12897 139956 354950 119443 -216762 -40121 -149333 -246584 154417 1534 209596 268835
12887 268835 -259625 37281 -35965 92197 92968 168293 347269 88130 -155341 -189979 203272
12875 -27957 13382 260949 51173 -61287 41700 91252 -260655 -266870 209691 223372 16774
12863 -88066 -188438 -282680 252206 -48029 261571 62931 -74952 -103701 286219 -241304 -97993
12851 386432 -28755 -8080 -181911 62393 73798 58525 117061 156220 269383 227105 189908
12840 189908 44578 168395 -76441 353861 15774 -151344 189726 51732 197493 92 19381
12829A9381b45392G7175l7698L35731b11604o2171D5950J29498a52719e4797a7762
12817g2639k67051D23756d7284j56032g0416A85072f436r7718m9082D4275Q0983
12806A25258a4426j84175M6700j77441g5406j78463A66472l8059L3050R4291c08891
12794a88787A156J76836a90132Q8322b2838j06248B1206a44714B26583a56406
12783c4796E9857i6708k33833C68601E4786K77502a50021B13638K10677j7900
12773D06415j72944f6458E0635a74078M6040O2407j32206M2657b6943j22436C97350
12761a89051E627a62108E7936c8660A88077K23566d9178k12038f3727C56816F3637
12749d20346J00542B6188a96460A01671C6777K06275c45539N9360H4500a31961
$$ plain form
12829 19381 -245392 77175 39477 375208 -211604 -273775 45950 175448 -152719 -54797 -17762
12817 -72639 -339690 423756 -47284 -203316 -70416 185072 -6436 -104154 -153236 44275 125258
12806 125258 -14426 -198601 -151901 -329342 -75406 -253869 166472 128413 161463 255754 -308891
12794 -188787 1156 177992 -190132 -101810 -22838 -129086 21206 -144714 226583 -156406
12783 -34796 59857 -96708 -330541 368601 54786 332288 -150021 213638 424315 406415
12773 406415 233471 -66458 50635 -174078 -128038 -65631 -197837 -155180 -26943 -149379 397350
12761 -189051 5627 -162108 57936 -38660 188077 411643 -49178 -261216 -63727 356816 63637
12749 -420346 -319804 26188 -196460 101671 36777 243052 -345539 -286179 84500 -131961
12738a11635C23449a7182k57382I5735K74865i5563B33051C4851J65289j8368
12728A81772K61334a90290C30748d0748C6185c3564q4200A08903a60433M3639
12718a16794C24405c32638A33758C1946J31016G5113J29469E1543R4480h8010
12707a62336g9092I2465a2538B8902K6272K52009F7941J59902j00800M5824d3034
12695D51029b0143F3273K59743a29255c8873A85963G043O7741a3055B9706L37163
12684C66869A48689D1396J5492K9725B6526J21621b4870A51637J00503D5162L5039
12673H0201J8989J39744o3503m4005a14082C3944J55528J45319D2149a7565N221
12662a2344k70316C94010j80931b6017I6463N2367L62348q9471a2765j10714A40713
$$ plain form
12738 -111635 323449 -17182 -274564 95735 370600 -95563 233051 34851 200140 181772
12728 181772 443106 -190290 330748 -40748 36185 -33564 -117764 108903 -160433 -116794
12718 -116794 324405 -332638 133758 31946 162962 75113 204582 51543 146023 -88010
12707 -162336 -79092 92465 -12538 28902 55174 307183 67941 227843 127043 172867 -43034
12695 451029 -20143 63273 323016 -129255 -38873 185963 7043 74784 -13055 29706 366869
12684 366869 148689 41396 56888 86613 26526 148147 -24870 151637 252140 45162 80201
12673 80201 99190 238934 175431 131426 -114082 33944 189472 334791 42149 -17565 -12344
12662 -12344 -282660 394010 213079 -26017 96463 148830 511178 421707 -12765 -123479 140713
12650E7577J33056G9872J90621a36366d7826D4726f9147E9582b1655C80317A859
12638d7047o685A66902i1195l9354C11355a07023C3330K2572j0710P1256K56850
12627C73298l3119A36071K16255p8674b8908A65729c1672q5771A98648o231J61854
12616C54271N9065I7800N5255K8219d9462b2449k03623G4817a51998f8691G6281
12604f3660A442a14148L3797j3510c121H5359a0191B32K73715a77279B85104a12454
12591h4596B9770b28735C18274b02315A19495a00483I1773a41217a8914j15474
12581a34388n1553A09005h3562q213a2145l9398q1270A38463J0291h0349j80393
12570b60742e6372A10211i6573C3586R4459m4118b18353B52881i1037J4466H0222
$$ plain form
12650 57577 190633 79872 270493 -136366 -47826 44726 -69147 59582 -21655 380317 1859
12638 -47047 -53732 166902 -91195 -130549 311355 -107023 33330 55902 45192 116448 373298
12627 373298 340179 136071 352326 273652 -28908 165729 -31672 -117443 198648 192417 354271
12616 354271 413336 97800 153055 181274 -49462 -22449 -226072 74817 -151998 -68691 76281
12604 -63660 1442 -114148 -80351 -93861 -3121 85359 -10191 232 273947 -177279 285104 -112454
12591 -84596 29770 -228735 318274 -202315 119495 -100483 91773 -141217 -18914 -134388
12581 -134388 -185941 109005 -83562 -91775 -12145 -51543 -132813 138463 148754 -80349 -260742
12570 -260742 -56372 110211 -96573 33586 128045 83927 -218353 252881 -91037 -76571 80222
12558A61347m3454d4711C23685A36749a14322B6393a28673q8426d9109a9223A49698
12546B84094i4741A84227a8846G7524B2731d606E976J29650b27705d4298C6243
12534A67646h3291A59794c26934B03137M9312R3888h7978G1246a16966r4205j7881
12523b29052A76086a98301B26502D6781J01916o5838J63744d517A47331J28204
12513B75535j07397E7049a8276B0932g7322B78986J1957j19037O7741P146A1531
12501B10067b73532d9145o6569B51811b62480e1870o5591B33045a69114A935i6425
12489h255C7794A5032K94322c29576K9847b7881j191A3371J31842a27704B97793
12477D9110J35721b33419M6127j23238E5277J80651d25j23162N969k04764e3731
$$ plain form
12558 161347 117893 -44711 323685 136749 -114322 26393 -128673 -217099 -49109 -19223 149698
12546 284094 -94741 184227 -18846 77524 22731 -4606 5976 135626 -227705 -44298 36243
12534 167646 -83291 159794 -326934 203137 252449 346337 -87978 71246 -116966 -211171 -229052
12523 -229052 176086 -198301 226502 46781 148697 82859 246603 -4517 147331 275535
12513 275535 168138 57049 -18276 20932 -77322 278986 290943 171906 239647 246793 11531
12501 210067 -273532 -49145 -115714 251811 -262480 -51870 -117461 233045 -169114 1935 -96425
12489 -8255 37794 15032 309354 -329576 -299729 -27881 -29072 13371 145213 -127704 297793
12477 49110 184831 -233419 -187292 -310530 55277 235928 -425 -123587 -117618 -322382 -53731
12465a53367j2525m6884C14721K0748A3386J26106M6963r270a73783p6142B0975
12453b14887C6264O8472B4380N300b73542J06896F4323C0322J17495a65648I1825
12441A30726a22877B91977j25489p7886a19436c4236j22108D26214d4577l16637
12431c61214a32015D4025a26456e8063A08524L3976l3389c15209A77832B6478
12420a13608E2557K92603a38056E3758h361I9393L7679c37270A15495a72679M4912
12409a27767A86101q884a1580j24434A39519a02841C2007e5294j5220B00707f4582
12397a16803K6911H4781K1021g5924I82a40247A20629B7170d9691A96104a10000
12385C45175j39738c3530B01413a09746n3220o904C5366b0555j04711k19523R5483
$$ plain form
12465 -153367 -165892 -212776 314721 335469 13386 139492 186455 177185 -173783 -249925 20975
12453 -214887 36264 104736 24380 29680 -273542 -166646 64323 30322 147817 -165648 91825
12441 130726 -122877 291977 166488 88602 -119436 -34236 -156344 426214 -44577 -361214
12431 -361214 -132015 44025 -126456 -58063 108524 142500 109111 -315209 177832 26478
12420 -113608 52557 345160 -138056 53758 -8361 99393 137072 -337270 115495 -172679 -127767
12409 -127767 186101 177217 -11580 -136014 139519 -102841 32007 -55294 -70514 200707 -64582
12397 -116803 -89892 84781 105802 -75924 982 -140247 120629 27170 -49691 196104 -110000
12385 345175 205437 -33530 201413 -109746 -162966 -169870 35366 -20555 -125266 -344789 -249306
12374b49306A73507f9681o6882p1238F1483E79J15891d1236r4939B50749a04604
12362A22574a26979r9911A08902P6233Q7216f7309A08478b5700A8076b82585g8243
12350a16860A35625e1548A15382b2847A71618k611a28164o7060E09959b28514
12339a59233A08359a91118a6655n0423A3927b12384C39268c44665A04930i7355
12328d0597r7697B77226H8407J40115d95135A07833a95990C1091K32305a10120
12317A25278b12525a7713j62305K2775C09957A32452b81133A38522O2826b60915
12306c2721C8665Q5274i0486A65149G3118P3461b7015B9870A141J49277i3344
12294A23131J96105j02588i3118H7896J72880j16045p2191a27074k44059H7838
$$ plain form
12374 -249306 173507 -69681 -136563 -207801 61483 579 116470 -41236 -136175 250749 -104604
12362 122574 -126979 -226890 108902 185135 272351 -67309 108478 -25700 18076 -282585 -78243
12350 -116860 135625 -51548 115382 -22847 171618 169007 -128164 -195224 509959 -228514
12339 -159233 108359 -191118 -16655 -67078 13927 -212384 339268 -344665 104930 -97355
12328 -40597 -138294 277226 88407 228522 -495135 107833 -195990 31091 263396 -110120
12317 125278 -212525 -17713 -180018 -157243 309957 132452 -281133 138522 201348 -260915
12306 -32721 38665 123939 -90486 165149 73118 146579 -27015 29870 1141 150418 -93344
12294 123131 319236 216648 -93118 87896 260776 144731 72540 -127074 -371133 87838
12283A89168H5514f812B08339f574r2189j5818J1556C64497A75689d3629E41380
12271A31488a9522E0120P7414c4121F669c5558D8353J245K64851A29105i3594
12259d3486B43651A5845O3246b03398A47953b26263A24446k0461L17315h2775
12248I5244J36847a11173A30968a09826A95130b0780D93240h2358r88B78182I2125
12236i8111j3512A56291N4416J25169A16394J61599j6994m0560K40654f5581B54408
12224C63776i0162A9809J06910K75334j82352L0890G1066j4158L2009P0782e7326
12212I2720Q1585J17862b46022I6227B5390O2201Q1884A0461d5790A8793a4828
12200A53233f2375I3950G110J04318k5568M6497l5531J40287J24716M924A350
$$ plain form
12283 189168 85514 -6812 208339 -6574 -98763 -114581 -103025 364497 175689 -43629 541380
12271 131488 -19522 50120 127534 -34121 6669 -35558 48353 49598 314449 129105 -93594
12259 -43486 243651 15845 79091 -203398 147953 -226263 124446 103985 421300 -82775
12248 95244 232091 -111173 130968 -109826 195130 -20780 493240 -82358 -83346 278182 92125
12236 -98111 -111623 156291 210707 335876 116394 277993 260999 220439 461093 -65581 254408
12224 363776 -90162 19809 126719 402053 219701 250591 71066 56908 88917 159699 -57326
12212 92720 174305 292167 -246022 96227 25390 87591 169475 10461 -45790 18793 -14828
12200 153233 -62375 93950 7110 111428 85860 132357 96826 237113 361829 366753 1350
12188B11134o0724Q6109o0379b01819C9474J55082J91010C6300c45991D2190J81503
12177B23693J27904A325J73616a13294F1889O1784K34756b64545A16098K30171
12167C46269j66857d4964C90730e1267A84431R9874H6868l8526a44629F6408J27221
12156A93629J03711a67981L8374G4245d7239C50873A10517b7743j20912N0763
12146i7892r426B85564A05097R3409C6592e9170A43237P1861q9609a16862a3962
12134A76624b3174B01981H3102m0237O898d8038q4565A14765a94140D106J46597
12123A50703m9584a88381C63816I3479h5743k64516B50375m6942H7538b22331
12112F1757b445C81124A79449d9060K4255j38127B06689l1107F0496J5414o336
$$ plain form
12188 211134 150410 236519 176140 -201819 39474 194556 385566 36300 -345991 42190 223693
12177 223693 351597 1325 174941 -113294 61889 123673 358429 -264545 116098 346269
12167 346269 179412 -44964 390730 -51267 184431 284305 86868 48342 -144629 66408 193629
12156 193629 297340 -167981 -129607 74245 -47239 350873 110517 -27743 -148655 -97892
12146 -97892 -107318 285564 105097 198506 36592 -59170 143237 215098 125489 -116862 -13962
12134 176624 -23174 201981 83102 42865 49763 -48038 -132603 114765 -194140 4106 150703
12123 150703 101119 -188381 363816 93479 -85743 -350259 250375 203433 87538 -222331
12112 61757 -2445 381124 179449 -49060 -24805 -162932 206689 175582 60496 75910 69574
12101F9574j0196J09785G5505a74650A54442a65818f1569J1085m20073f1685o0885
12090a22570C23547A14538B0979K67375a8077A80602a64924I135M5103a79063
12079G979b86253B72808j31644B4771a07330j10405E6019i3467j4988d9056H0926
12067B26721b33741l3391A55452b53599B45835l6213O66974R44305q78936D63455
12056b12466B87245E501N783L2640K6678J25795L27639B11006D3860a04324G9844
12044g0313K3046B525Q8092l2577Q5247A8527M4860a12760A00534f9556A92907
12032a99567O7752e8195B92288j39221a27116A53010P2813c02048B15558n4764
12022A60794b36706A44062m778a00419A63222O1754a24827q6169A54852a60849
$$ plain form
12101 69574 59378 169163 75505 -174650 154442 -165818 -61569 -50484 -470557 -61685 -122570
12090 -122570 323547 114538 20979 288354 -18077 180602 -164924 9135 54238 -179063
12079 7979 -286253 272808 141164 24771 -107330 -217735 56019 -93467 -108455 -49056 80926
12067 226721 -233741 -267132 155452 -253599 245835 209622 876596 1820901 941965 463455
12056 -212466 287245 5501 11284 43924 70602 196397 524036 211006 43860 -104324 79844
12044 -70313 -47267 2525 90617 58040 143287 18527 63387 -112760 100534 -69556 192907
12032 -199567 -131815 -58195 292288 153067 -127116 153010 225823 -302048 215558 160794
12022 160794 -236706 144062 139284 -100419 163222 224976 -124827 -210996 154852 -160849
12011I3660i372o0061A73297a56057g2034K7351I6490b26504F6290J6289d8375
11999I3414g1350A31570a54914H2008C7324a19942j02695A27490n1155i0102j96424
11988b86526g3075j61443P304C701i6432A41601b99766g2347q2042R172O4131
11977h1086K0764j04218A121J85422o5829K13351I3463J5002K857a4054I904J57991
11965A67895b2946A6294d07m00881E1036J57724f0852k98097A31173H578L08321
11954C16899a4894q6451A91074Q5276h1069j18314A1205m447c0169I495M02567
11943D12062A48198c22788g2936C73919d61183C51391e45364b54431F2322f4819
11932e0108F1821a4167l15532J07447B57076c02430H6880j4729J2104h9518I0431
$$ plain form
12011 93660 -9372 -69433 173297 -156057 -72034 -44683 96490 -226504 66290 82579 -48375
11999 93414 -71350 131570 -154914 82008 37324 -119942 -222637 127490 76335 -90102 -286526
11988 -286526 -73075 -234518 -227214 3701 -96432 141601 -299766 -72347 -154389 -145217 -81086
11977 -81086 -60322 -164540 1121 186543 120714 334065 93463 108465 111322 -14054 9904 167895
11965 167895 -22946 16294 -407 -401288 51036 208760 -60852 -358949 131173 8578 316899
11954 316899 -14894 -101345 191074 276350 -81069 -199383 11205 6758 -30169 9495 412062
11943 412062 148198 -322788 -72936 373919 -461183 351391 -545364 -254431 62322 -64819
11932 -50108 61821 -14167 -329699 -222252 257076 -302430 86880 72151 84255 -89518 90431
11920C6797L664N869L01314I4531a69649a875j3040A88408D0590M04G183L47196
11908C54379c57702A2255J602c0553A14903f5110j52994B924P5892b51637a06435
11896a19846M9664B9975g3292D4064N5464J4272G122J13712C8356K0367b59009
11884F6584g8500j34731O0325a0333B59132j24575a62993H1966g7406F5478d385
11872a92751h3702k45829h5838A56068c0792m88300b20193d6516j05971L1514
11862a20973M7169B4300R6334a23656p1805A37815J8561k479J73486j55251J49598
11851C21730A50329b45270H2886a44197C7455M459g787A08919c571l63916a32104
11839B26916d63B3494a23843m2117A6659a07059C1928a61220A10534b0712i744
$$ plain form
11920 36797 40461 46330 347644 94531 -169649 -1875 -14915 188408 40590 40994 7183 354379
11908 354379 -357702 12255 13857 -30553 114903 -65110 -218104 2924 78816 -251637 -106435
11896 -119846 -70182 29975 -73292 44064 99528 113800 7122 120834 38356 58723 -259009
11884 66584 -78500 -213231 -152906 -10333 259132 134557 -162993 81966 -77406 65478 -4385
11872 -192751 -83702 -329531 -85838 156068 -30792 -519092 -220193 -46516 -152487 -120973
11862 -120973 -73804 24300 120634 -123656 -195461 137815 156376 153897 327383 172132 321730
11851 321730 150329 -245270 82886 -144197 37455 41914 -7787 108919 -3571 -367487 -132104
11839 226916 -463 23494 -123843 -165960 16659 -107059 31928 -161220 110534 -20712 -9744
11827F2236a7032G6099K9378O8889a000l6462j67675d374A0799a32485o2370D4332
11814A63103a10728c9691j69349C4918d02316e4501J3416o0058M1222k0070k2573
11803a02564A17899a22787L6896j01806A50926h7788E3292J46570a43253k77834
11793d21087J92313c4332B345e8413B08334c13132A02444M2601A8352a68958B3786
11781b20212L6542E885e5117A39849k1652h2338K6777B94004A7922P7477N4644
11770A50043b4890C35333c64031c0826C11496D4671P7290a8620A16598m2573H316
11758E1169J22056m7740m0123j2066a43770J5485B24465a7421r0928l980D2651
11746A10545b68405h8393B0203a33871L8004k6994j11639k2505p5796E0814b29793
$$ plain form
11827 62236 -17032 76099 105477 174366 -1000 -37462 -205137 -4374 10799 -132485 -194855 44332
11814 163103 -110728 -39691 -209040 34918 -402316 -54501 -41085 -101143 -59921 -79991 -102564
11803 -102564 117899 -122787 -85891 -187697 150926 -87788 53292 199862 -143253 -421087
11793 -421087 -228774 -34332 2345 -58413 208334 -313132 102444 145045 18352 -168958 23786
11781 -220212 -183670 5885 -55117 139849 118197 -82338 -55561 294004 17922 95399 150043
11770 150043 -24890 335333 -364031 -30826 311496 44671 121961 -18620 116598 74025 8316
11758 51169 173225 125485 85362 73296 -143770 -128285 224465 -17421 -108349 -112329 42651
11746 110545 -268405 -88393 20203 -133871 -95867 -122861 -234500 -257005 -332801 50814 -229793
11734a55333D8171g0586L3584d11I850c91115H56c31273A00740J17951c16758
11722a97668e1734I5200c5294J6787j07981G3307b85495J17883g2228k21538C22004
11710a00278l4770a8600l5680m8913j35231B8164K04902g722A16432K22204d0669
11698a15897C01474F8162f9705B12538B8723a98643A9740a67851A41164b97281
11687b41959C6406j6153b02411C3340L1091n616f8651A18991D7358N8867K7615
11676A33840c56903c5386B93974A35088a19904l9370h087j31066N8295A53072
11665d68514C49001a03008C02084a92536j29533A9809P7215a93057A098i3326
11654D5471A2827J21308k5659A5284a11454q6743D2026b94739R3197E7943a85760
$$ plain form
11734 -155333 48171 -70586 -37002 -411 9850 -391115 856 -331273 100740 218691 -316758
11722 -197668 -51734 95200 -35294 -18507 -126488 73307 -285495 -167612 -72228 -293766 322004
11710 -100278 -135048 -18600 -54280 -103193 -238424 28164 233066 -7722 116432 338636 -40669
11698 -115897 301474 68162 -69705 212538 28723 -198643 19740 -167851 141164 -297281
11687 -241959 36406 20253 -202411 33340 64431 58815 -68651 118991 47358 106225 133840
11676 133840 -356903 -35386 293974 135088 -119904 -159274 -8087 -139153 -80858 153072
11665 -468514 349001 -103008 302084 -192536 -322069 19809 97024 -193057 1098 -93326
11654 45471 12827 134135 108476 15284 -111454 -198197 42026 -294739 -201542 57943 -185760
11642A13920A6495R7781b90683a8691r1882i756A8996a18159m4842B38242c22973
11630e1215m9678A686b72858B25552j2062j04552E2418c05327A22008a50947L8160
11619a12787k21995B71742F5976a19868p3237f3446a0255A2594a33504M0996d0870
11607A02254a26590D1620a94170B43833j20634B9858r914L17980a75155b5615
11596a85355B45a03373A5686b12110H5111a40431e9643A04030J97065M2726G1599
11584b72493A16457A528M9803J370e8846C4876a24334B45270e08766E3558J1916
11573F5474a6658k74933Q1117i5004A13009c29564a14804C65992j23369F2555
11562B5210a67691E8937Q2114b82562J32720J701l551B49021a72644C1126K24196
$$ plain form
11642 113920 16495 114276 -290683 -18691 -110573 -9756 18996 -118159 -163001 238242 -322973
11630 -51215 -100893 1686 -272858 225552 213490 108938 52418 -305327 122008 -150947 -112787
11619 -112787 -334782 271742 65976 -119868 -193105 -63446 -10255 12594 -133504 -92508 -40870
11607 102254 -126590 41620 -194170 243833 123199 29858 19944 337924 -175155 -25615
11596 -185355 245 -103373 15686 -212110 85111 -140431 -59643 104030 301095 343821 71599
11584 -272493 116457 1528 51331 52701 -58846 34876 -124334 245270 -508766 53558 65474
11573 65474 -16658 -291591 -210474 -95004 113009 -329564 -114804 365992 242623 62555
11562 25210 -167691 58937 141051 -282562 -149842 -148141 -151692 249021 -172644 31126 255322
11551B55322h6091A35690e5051C7530e7405H2875a11908A47348A8479K30750a36349
11539C31K43532r2512p1691d1241n046F3410B6722g6288C8247O927K81619C0935
11526D3736N7825d5355I5280R764R527J15951r1127a35532A88487P2493a51023
11514B4554h0732B3752K76558i5881C53757H6456a32850B21026b5273G9243B7260
11502D4353J65359L6159p3390p3653J40926j05176e1110B07813o7640P7274I6705
11490b96007B28861e7814j2899B37299A6859J25066i0928A07290K20672d652n4563
11479e9215c284B46706e0525p5924A85665m2279c1642B3576J41252K77691D9247
11467A18204i8838D61726A15439a45831a4282j70610A42003B3664J7920a43388
$$ plain form
11551 255322 -86091 135690 -55051 37530 -57405 82875 -111908 147348 18479 249229 -136349
11539 331 243863 151351 79660 -41241 -46287 63410 26722 -76288 38247 45174 326793 30935
11526 43736 101561 -45355 95280 105044 114571 230522 139395 -135532 188487 260980 -151023
11514 24554 -80732 23752 300310 -95881 353757 86456 -132850 221026 -25273 79243 27260
11502 44353 209712 245871 172481 98828 239754 134578 -51110 207813 140173 217447 96705
11490 -296007 228861 -57814 -70713 237299 16859 141925 -90928 107290 327962 -4652 -59215
11479 -59215 -3284 246706 -50525 -126449 185665 143386 -31642 23576 164828 442519 49247
11467 118204 -98838 461726 115439 -145831 -14282 -184892 142003 23664 41584 -143388
11456A5661N9572a62669C07005j08558a17901I1142j9098L37616G2499A2760g8320
11444A67385J24165J00360E1148i1521d5602j75651P1118C92663b72707A14607
11433A95571n7086A4211K57638j13944E0226J91638b12527C2157i7833j7955l2914
11422a48702B0920a20849A38302l4935o626a00167A8396g4206A45179m4566H878
11410a56749A78818l301c27949F4905b75058m9322I5599j9110J59692I9217i9400
11398b9614k79401B735J32670a64066G1698l0287a73344H6912J86798c11493a53565
11386f9697E7224Q8364a25792r9920B11927A7569J21373e3394A3502J80254J55241
11375C48997e1404k27741B36806b9764j24291P5032A37178a42289f0207r4346
$$ plain form
11456 15661 75233 -162669 307005 198447 -117901 91142 72044 409660 72499 12760 -78320
11444 167385 291550 391910 51148 -91521 -45602 -221253 -150135 392663 -272707 114607
11433 195571 138485 14211 271849 157905 50226 241864 -212527 32157 -97833 -115788 -148702
11422 -148702 20920 -120849 138302 103367 96741 -100167 18396 -74206 145179 100613 8878
11410 -156749 178818 175517 -327949 64905 -275058 -324380 95599 76489 236181 99217 -99400
11398 -29614 -309015 2735 135405 -164066 71698 41411 -173344 86912 273710 -311493 -153565
11386 -69697 57224 145588 -125792 -225712 211927 17569 138942 -53394 13502 193756 348997
11375 348997 -51404 -279145 236806 -29764 -154055 -79023 137178 -142289 -60207 -154553
11365a54553J1463p2826e8803q065q0364b2613B49606H1274B4350P6520K20274
11354C21144c33917c00k29509R9114j52544b2914m2618H9353J74018c13900Q7299
11343b26601B57311a47201A7046h7861B8941b24812g4283k19710J02511a0110
11332c22908J47242I6991a14817C2542N9242f8177A87614c4881j01825B08290
11321d8516o1073j94281h3336K3707j64906B34842a21944B448d2830l06279C7332
11309a69291N2636j39840a12876E9004J51921b61954h1699q6165F8462a57680
11298B65426b24864h9545j64884E6595N0457J28760m6787A6650a3032B2676K19184
11287B41860e9211C7189j5306m526a59428I3464i1075j37142A13393a05003l40342
$$ plain form
11365 -154553 -143090 -215916 -58803 -66868 -147232 -22613 249606 81274 24350 100870 321144
11354 321144 -333917 -300 -229809 -130695 -283239 -22914 -65532 89353 263371 -313900 -226601
11343 -226601 257311 -147201 17046 -87861 28941 -224812 -74283 -293993 -191482 -10110
11332 -322908 -175666 96991 -114817 32542 91784 -68177 187614 -34881 -136706 208290
11321 -48516 -109589 -303870 -83336 -59629 -224535 234842 -121944 2448 -42830 -349109 37332
11309 -169291 -116655 -256495 -112876 59004 210925 -261954 -81699 -167864 68462 -157680
11298 265426 -224864 -89545 -254429 56595 107052 235812 189025 16650 -13032 22676 241860
11287 241860 -59211 37189 21883 17357 -159428 93464 -91075 -228217 113393 -105003 -445345
11276d45345A37180b3173H4298c0869m3431m9797o8185K27B36876a62247N6590
11265a05657l6884A294K58748a80005Q9834k35177B7292A908K22429E2478h4186
11253d6549r0053P101A7790L4949a3449A06598f5066A70869a74043L372K5252
11242a45419E4363H181J70531a24728A85610d21037a56494n656j43043e5499A77155
11230b61706P4304L4338N9683c1305j90381m1801f7384k53983B92667a07224A591
11218a04767j18540i2300A67381h1458m4565e5607j69460E5860J92589i4958I3733
11206G1017h5561q4038G7248l850c70020H2254b11018h2916A1827a13594j28297
11195b41891A45309N3996b17096A9390b45800i7847G9479b66452e3622C52857
$$ plain form
11276 -445345 137180 -23173 84298 -30869 -74300 -124097 -192282 -192055 236876 -162247 -105657
11265 -105657 -142541 1294 260042 -180005 -90171 -325348 27292 1908 224337 52478 -84186
11253 -46549 -136602 -129501 17790 52739 -13449 106598 -65066 170869 -174043 -170671 -145419
11242 -145419 54363 8181 178712 -124728 185610 -421037 -156494 -162150 -305193 -55499 177155
11230 -261706 -187402 -153064 -93381 -31305 -221686 -263487 -67384 -321367 292667 -107224 1591
11218 -104767 -223307 -92300 167381 -81458 -126023 -55607 -225067 55860 248449 -94958 93733
11206 71017 -85561 -169599 77248 73398 -370020 82254 -211018 -82916 11827 -113594 -241891
11195 -241891 145309 199305 -217096 19390 -245800 -97847 79479 -266452 -53622 352857
11184b47704d2776B89057i7560K3944D3340N3521c13652A21456g4801A84771b01639
11172F9336b3941H9058A351f9612D880L00997A14307n4820J25576a41193p0009
11161b11202P7937C90L7523J18891C9424j6135N8658K23358B6625a10587K1731
11150h8856K2695m7542c1623m3393p6706g5127P391j28811g2790b4639a0045j18766
11138a28811e4967E6738K17216a93442B19669h658D5594N4396N6355M8426E7246
11126f1440C74302j80394o3678C9239O6021a616j71219e1984o7593B38096C6767
11114B19201N6350h9360F8231f9569B64082B1788J71413J29867a4904l97064A21820
11102B27686a50274B44284l6209F9975J32170K43527A85943m3213P2343L478g0494
$$ plain form
11184 -247704 -42776 289057 -97560 -73616 43340 96861 -313652 121456 -74801 184771 -201639
11172 69336 -23941 89058 1351 -69612 4880 305877 114307 59487 185063 -141193 -211202
11161 -211202 -133265 390 37913 156804 39424 23289 81947 305305 26625 -110587 -88856
11150 -88856 -66161 -113703 -31623 -75016 -151722 -75127 -67736 -196547 -72790 -24639 -10045 -128811
11138 -128811 -54967 56738 273954 -193442 219669 -8658 45594 99990 156345 204771 57246
11126 -61440 374302 193908 130230 39239 105260 -1616 -172835 -51984 -119577 238096 36767
11114 219201 275551 -89360 68231 -69569 264082 21788 193201 323068 -14904 -411968 121820
11102 227686 -150274 244284 208075 69975 202145 445672 185943 142730 215073 218551 -70494
11090C09770d07898B73741j26357c22912B92193e9013C7693L71837a7979E34884
11079A38416L24079q9083j84158K88934a9833C23270M486G4742O1336J97854J07022
11068D40954l1444j25320p0777J82330D147M87875B38434L30380j88928J44178
11058E24064J7202J68207r0799o2119m0173K77942j96679L2312j59887J77835
11048F47905r8090Q5856J46575j97336J50164o5911k02367K38176k68097J25623
11038E62498J11466Q107j57940m1589P7012J39916J1181j16170L21311k90330
11028F25462J7363j45931j10250Q8221M62030l50368j30991J02355o5240J5590
11018E08241l4852B26828M20792k75456n0842K18212R2159q5006B63927K18383
$$ plain form
11090 309770 -407898 273741 147384 -322912 292193 -59013 37693 409530 -17979 534884
11079 138416 462495 373412 189254 478188 -19833 323270 327756 74742 136078 333932 440954
11068 440954 409510 284190 213413 395743 4147 492022 238434 568814 379886 524064
11058 524064 541266 709473 618674 556555 516382 794324 597645 629957 470070 647905
11048 647905 549815 635671 782246 584910 735074 669163 466796 704972 436875 562498
11038 562498 673964 682071 524131 482542 559554 699470 710651 594481 915792 625462
11028 625462 642825 496894 386644 474865 936895 586527 455536 557891 492651 508241
11018 508241 473389 226828 647620 372164 321322 539534 631693 546687 263927 482310
11008D82310n8235R3206J81080B44709M33589j65862j26420J91190J48865k30341
10998D95730M2564n5373J98824J68335j37617k74309J90275Q8214j01429L50010
10988I65224l07455L23501j63236k1357p298J82161k46319N14395l22925K83147
10978A199838K26992m4596K5631O19821L09518K49886K42604l7363l74925m5034
10968B372372K5919k22382l05195j84989j8384j88411j69889l9703L1549j11514
10958A189373L0380E39002L63337K24110j59566k82176j11573B53863J64858b8879
10947B76161O5643o873A20825J19674g0357D13653j82927e8761A3280L03150N2578
10936C69008b5721C24268q2524b7069l5062B59524l3688L6225o1163H0169i7075
$$ plain form
11008 482310 424075 517281 698361 244709 678298 512436 386016 577206 726071 495730
10998 495730 538294 482921 681745 850080 712463 438154 628429 716643 615214 965224
10988 965224 657769 981270 818034 796677 789379 971540 725221 1239616 916691 1199838
10978 1199838 1426830 1382234 1407865 2027686 2337204 2587090 2829694 2792331 2417406 2372372
10968 2372372 2398291 2175909 1870714 1685725 1667341 1478930 1309041 1269338 1300887 1189373
10958 1189373 1219753 539002 902339 1126449 966883 684707 573134 253863 418721 -28879
10947 276161 341804 334931 120825 240499 -70357 413653 230726 -58761 13280 316430 369008
10936 369008 -25721 324268 241744 -27069 -62131 259524 225836 262061 200898 80169 -97075
10924A24225P8454C1630a30388l0805C5606J95971I215R031a71207o1213C4668
10912a64802A91002p166a37689I5657k9726b57859a9321J979l0052k02735A77377
10900B47043A3474R1677a73714j89176A4970K29784B2025i7993m6391e6905E0045
10888B02967a24028d7303m9691j5029C65a11116A73835c33983i8730j24954A7760
10876C20540r5554b50218j13702E375d7943H725K59614a4843A6217b7208j38350
10865a65558G6222d6733A45521b20958q5655B87243A42264c5326n3976A17993
10854G5010B3063n536i3752j60736g0468C4039a91664A3385Q1712O6022c2390
10842A27875C3699d605k38789b3980j50815F1893a56693A61439F0433a5169D7276
$$ plain form
10924 124225 202679 31630 -130388 -161193 35606 231577 9215 18246 -171207 -232420 34668
10912 -164802 191002 183836 -137689 95657 65931 -257859 -19321 -17342 -47394 -250129 177377
10900 247043 13474 105151 -173714 -362890 14970 244754 22025 -97993 -144384 -56905 50045
10888 202967 -124028 -47303 -96994 -112023 365 -111116 173835 -333983 -98730 -223684 17760
10876 320540 224986 -250218 -363920 5375 -47943 8725 268339 -14843 16217 -27208 -165558
10865 -165558 76222 -46733 145521 -220958 -306613 287243 142264 -35326 -89302 117993
10854 75010 23063 17527 -93752 -254488 -70468 34039 -191664 13385 95097 161119 -32390
10842 127875 33699 -4605 -243394 -23980 -174795 61893 -156693 161439 60433 -15169 47276
10830b2391o2863A52994a89413F3566K56705a8705D4535a87394M0228k55928E487
10818c8578m1359H2943K10677b18396i7830M8163K0737j54903F7073J16669b2983
10806G9767J06691c73779E2194a37673J7300A5841J60820b54078e6276B33695
10795i8722l2192d5534j7486A35166j8412b23379R1386H6456c2457A97269h7254
10783a02466n5412p6074B34622B6881h4688B146a43344A51780K5670b15949b9568
10771C82540F8242b84439A21465b38115i2359n8630B0081b13942B28948H1509
10760A18670B7493Q5553a95513o1496f4693A46162F9966N2163J71796L6429h8278
10748c2671A07858c25391B18337g3926G4899L74331a88677C53714a27081B08224
$$ plain form
10830 -22391 -85254 152994 -189413 63566 320271 -18705 44535 -187394 -147166 -403094 5487
10818 -38578 -79937 82943 293620 -218396 -97830 -49667 -28930 -183833 67073 183742 -22983
10806 79767 186458 -373779 52194 -137673 -120373 15841 176661 -254078 -56276 233695
10795 -98722 -130914 -45534 -63020 135166 116754 -223379 -131993 86456 -32457 197269 -87254
10783 -102466 -157878 -233952 234622 26881 -84688 2146 -143344 151780 177450 -215949 -29568
10771 382540 68242 -284439 121465 -238115 -92359 -150989 20081 -213942 228948 81509
10760 118670 27493 113046 -195513 -257009 -64693 146162 69966 122129 293925 330354 -88278
10748 -32671 107858 -325391 218337 -73926 74899 449230 -188677 353714 -127081 208224
10737a87228j78801J41091B2312h429A10831b22709A27300E4048J24193a81401
10726B7049h4672A49872k0305f3672l50886A02670b07775c5958B29146b76614
10715b87075e0065b1594m55062a40057l2890e1667A88363a50903B33897A07408
10704A3112J23388R9408a7974l16599e5554m2241B10371a62705j08018A23755
10693a49858n9279C1697b11602D3775c9964j9758j65320B95367o1937a62621k20708
10682c83329A72126Q7124a33114J9716A55156K6153a75353A07689B5978b1704
10671a35789m0952B10222f8177J0138j38310L9055o8065p3782Q6591E7502J90970
10660B48472J9789A5251e4232j4389j85436e8791A32645e6366j17067B2289a73906
$$ plain form
10737 -187228 -366029 -224938 22312 -8429 110831 -222709 127300 54048 178241 -181401
10726 27049 -84672 149872 129567 -63672 -414558 102670 -207775 -35958 229146 -276614
10715 -287075 -50065 -21594 -476656 -140057 -172947 -51667 188363 -150903 233897 107408
10704 13112 136500 235908 -17974 -334573 -55554 -97795 210371 -162705 -270723 123755
10693 -149858 -209137 31697 -211602 43775 -39964 -59722 -225042 295367 233430 -162621 -383329
10682 -383329 172126 259250 -133114 -113398 155156 181309 -175353 107689 25978 -21704
10671 -135789 -176741 210222 -68177 -58039 -196349 -157294 -225359 -299141 -212550 57502 248472
10660 248472 268261 15251 -54232 -68621 -254057 -58791 132645 -56366 -173433 22289 -173906
10648F5271J4480a29793d3951I9516K5010a90973q5889c6559A2008L4465b83892
10636a84475j83069N6789J00443I5883l2960b19508i1032c3620l13636e1866C20529
10624A37016E4909d8184A45087G1588b26347J12355j82676K9105L634L5269A44431
10612D1123R907J94884f0685a9686m3760q0455O3165c2785H3523f136A29146K04147
10600C33293b48946A76751k6380P1199c54300r642c9101j5514b3726B61463j28922
10589A32541K6431b23341a07798k01985a05971A84282C6696a23717A06781a44599
10578h4723j44489J08236A03504e8811A40801a10989a9926G5207l1180a47044
10567d5212A81591a07174b5827B2773f7288q244A9L6603J12555b13560P602q5587
$$ plain form
10648 65271 79751 -129793 -43951 99516 124526 -190973 -276862 -36559 12008 46473 -283892
10636 -184475 -367544 -310755 -210312 95883 62923 -219508 -91032 -33620 -347256 -51866 320529
10624 137016 54909 -48184 145087 71588 -226347 -113992 -296668 -267563 -263929 -228660 144431
10612 41123 51030 245914 -60685 -19686 -63446 -143901 -80736 -32785 83523 -6136 129146 333293
10600 333293 -248946 176751 150371 221570 -354300 -363942 -39101 -54615 -23726 261463 132541
10589 132541 158972 -223341 -107798 -309783 -105971 184282 36696 -123717 106781 -144599
10578 -84723 -229212 -120976 103504 -58811 140801 -110989 -19926 75207 44027 -147044
10567 -45212 181591 -107174 -25827 22773 -67288 -75532 19 36622 149177 -213560 -205958 -291545
10555b91545B537d3662k21610a5411C436Q2432c65851a71273n622J8436j15194
10544b73653Q1425j46427J07145O1225J079a9719m2034A894O7759e6855j67906
10533b24761A0616h9976m6657N8469j71663j32618A69707a12416A4854a40823
10522e94938D18136A75667b48487A48357i1870k23915a13016J3421o1390B02186
10511a1703A46751K1169o7966R2784E014b01153B13605E26J53185c11893B14440
10499E6096K22189b49191A02642m6300e8787q0673B29101i7523J4701C33765j29216
10488B04549e4750I5248a48350M1739n645k2153H653f7514j24454j61899g3320
10476a56462H0185J28372b27125A12730a02634a6241p5863A0281N6263a57411
$$ plain form
10555 -291545 2537 -43662 -265272 -15411 3436 85868 -365851 -171273 -176895 -158459 -273653
10544 -273653 -192228 -338655 -231510 -170285 -169206 -19719 -61753 1894 69653 -56855 -224761
10533 -224761 10616 -89976 -136633 -78164 -249827 -382445 169707 -112416 14854 -140823
10522 -594938 418136 175667 -248487 148357 -91870 -315785 -113016 -99595 -160985 202186
10511 -11703 146751 167920 99954 192738 5014 -201153 213605 526 153711 -311893 214440
10499 56096 278285 -249191 102642 56342 -58787 -139460 229101 -97523 -82822 333765 204549
10488 204549 -54750 95248 -148350 -106611 -112256 -134409 8653 -67514 -191968 -353867 -73320
10476 -156462 80185 208557 -227125 112730 -102634 -16241 -92104 10281 66544 -157411
10465A54844a70475G0074a04897A56753a44652I4651c67428E0139k0725A3082
10454a55829A72252J7517b4548B39515I6158d8817b429j11887b9298E2656g8987
10442B15735a90978O7336m6765a3719A55626a20541p6687D277J36779a78396F2967
10430a6957A6904K03840q8533a19961a0441r8484K6352j692j93113B69122a35960
10418b5696o9084m8486A61682c8179j66359M7056N8109J8738A1585a12941A99971
10406e940B3343J63042F3972g1231B2723J35625F9592f348B00633j0705F2792
10394I8015K35692e4453B13845K24493D0115g3189q552D0160R0456f8774D2087
10382G9619K6026A2262J64365l3856n4970c1884B85625L2056j38208n9919J42313
$$ plain form
10465 154844 -170475 70074 -104897 156753 -144652 94651 -367428 50139 29414 13082
10454 -155829 172252 189769 -24548 239515 96158 -48817 -2429 -114316 -29298 52656 -78987
10442 215735 -190978 -123642 -170407 -13719 155626 -120541 -197228 4277 141056 -178396 62967
10430 -16957 16904 220744 132211 -119961 -10441 -108925 -82573 -84265 -277378 269122 -135960
10418 -25696 -94780 -143266 161682 -38179 -204538 -157482 -99373 -80635 11585 -112941 199971
10406 -5940 23343 186385 63972 -71231 22723 158348 69592 -6348 200633 189928 62792
10394 98015 333707 -54453 213845 438338 40115 -73189 -81741 40160 130616 -68774 42087
10382 79619 105645 12262 176627 142771 87801 -31884 285625 317681 179473 119554 261867
10371B61867Q3970j58264k1718P8156k2824K47893m0644p0502K51777B04894K42068
10360D46962B22948J4078r6230a494C91268m4311J4151e891D60258l5120O7906
10349D93044G0368J07435F3252J06210J34785E5499M4265m4865K57479J30712
10339D43090D9072M67997j63481I5111k2588B3508a7985m3608h471B74570m2319
10328B32251j03219b08719A38104j1860P7802J35665L393N3266i6915a018r2098
10317i3116c1507A31119O4694C5503g1318L4551j01632n1174D3654K239R3793
10306A39686K43951j54736f7651J4483j65755b4260j22234D6597b63871A76419
10295B44580b19028j00541b7647n9105j86288a10850M2457j98024d1536j22236
$$ plain form
10371 261867 345837 187573 165855 244011 221187 469080 428436 357934 609711 204894 446962
10360 446962 222948 237026 140796 -1494 391268 346957 361108 -5891 460258 425138 493044
10349 493044 70368 177803 63252 169462 304247 55499 99764 54899 312378 443090
10339 443090 49072 517069 353588 95111 72523 23508 -17985 -61593 -8471 274570 232251
10328 232251 129032 -208719 138104 126244 204046 339711 343104 396370 -96915 -1018 -93116
10317 -93116 -31507 131119 195813 35503 -71318 -36767 -138399 -189573 43654 45893 139686
10306 139686 383637 228901 -67651 -53168 -218923 -24260 -146494 46597 -263871 176419
10295 244580 -219028 -319569 -27647 -86752 -273040 -110850 -68393 -266417 -41536 -163772
10285a63772E9874N5457c02132J40453j92294R6206i927r5940A20826O2790a7505
10273i9293L7255A30058B1985p144L23955F4049a49954C44944a2098k0213A407
10261i8248B55154A25091B7174g7519G8242L58696b30870A36733M8935J69860
10251C55528F0100H181K8474Q0719D3270b66374R936A16674a81218B96517C7135
10239g1217I9109Q3601I824b82994J03042c7996q4j96626j37079C7344f1207A9667
10226A02230a65081a9056B51517b66464d4053N292a982F9094J19837q5144b27153
10214F2852Q5140a11762N380p5048f6531C7029L2674R4023a04882l70322D3972
10202e8391A17025d1632B09033q2016b13167K2943A67504G1932k6677d2339j3621
$$ plain form
10285 -163772 59874 115331 -302132 -161679 -353973 -257767 -9927 -105867 120826 183616 -17505
10273 -99293 -62038 130058 21985 14841 338796 64049 -149954 344944 -12098 -32311 1407
10261 -98248 255154 125091 27174 -77519 78242 436938 -230870 136733 185668 355528
10251 355528 60100 8181 36655 117374 43270 -266374 -256438 116674 -181218 296517 37135
10239 -71217 99109 182710 9824 -282994 -179952 -37996 -38080 -234706 -371785 37344 -61207 19667
10226 102230 -165081 -19056 251517 -266464 -44053 -38761 -1982 69094 188931 103787 -227153
10214 62852 147992 -111762 -106382 -181430 -66531 37029 69703 163726 -104882 -475204 43972
10202 -58391 117025 -41632 209033 127017 -213167 -190224 167504 71932 45255 -42339 -55960
10191e5960l6391A28901i4259k7811J3591c1554j34557c7850j65319H7554J6489
10180A04043a9130B9427a77002j81071C4830a09139B6276h8637g46r8289p9687
10169a78722d6403k39520a35081L1033k5882L5586j78885a2051j97088b9807q3674
10158a13481k29256a47510A77870E0669c3387j62480A52441n414J69765a12940
10147h3705m3102G2124M5863f857k0884B35334a44571P0983b9942n5649L1864
10136e3727A74881b70097I3221l4112A7925d3928l95971d4809l43172h6805K335
10125h4470A53087b67804J15663g4877k4684k9841D0207e4930C4194e9026a6859
10113a34815B4771c07592A32701a98236B9193O5273l6511J22748D2463P4095b6514
$$ plain form
10191 -55960 -92351 128901 -94259 -122070 -108479 -31554 -166111 -37850 -203169 87554 104043
10180 104043 -19130 29427 -177002 -358073 34830 -109139 26276 -88637 -746 -99035 -178722
10169 -178722 -46403 -285923 -135081 -104048 -129930 -94344 -273229 -12051 -209139 -29807 -113481
10158 -113481 -342737 -147510 177870 50669 -33387 -195867 152441 147027 316792 -112940
10147 -83705 -126807 72124 117987 -6857 -27741 235334 -144571 -73588 -29942 -85591 -53727
10136 -53727 174881 -270097 93221 59109 17925 -43928 -439899 -44809 -387981 -86805 -84470
10125 -84470 153087 -267804 -152141 -74877 -99561 -129402 40207 -54930 34194 -59026 -16859
10113 -134815 24771 -307592 132701 -198236 29193 94466 57955 180703 42463 116558 -26514
10101b91564B63105f725k37799F3773i9502l4874A32504a36572A94697C4139a71098
10089a19131a5598j63277A92701c76780a29538O2162j30919p1673a15025N4401
10079f0624A83217i080n6865j72518I3438b21831j87200J59088B6507f5503j1153
10068g6656a1636l6904q8335c5764A0861J25818B081c92988a80111Q0627q7067
10057a86551C50944A39690F7587J28978b36085N6325d8761O550n10998G9001j8140
10046F0861A9608K25284J1745A04499b21163m5590J11833d8112A01928a15977
10035B77735F8919R7933j0313G5317L3079c9732j34347m0949k6281g439j06503
10024a13942d3226B7812d7292a4223N634l00550J4983H775J3571b06455B33747
$$ plain form
10101 -291564 263105 -6725 -244524 63773 -99502 -134376 132504 -136572 194697 34139 -171098
10089 -119131 -15598 -178875 192701 -376780 -129538 -67376 -198295 -269968 -115025 -60624
10079 -60624 183217 -9080 -65945 -238463 93438 -221831 -409031 -249943 26507 -65503 -76656
10068 -76656 -11636 -48540 -136875 -35764 10861 136679 2081 -392988 -180111 -99484 -186551
10057 -186551 350944 139690 67587 196565 -236085 -179760 -48761 -42211 -553209 79001 60861
10046 60861 19608 244892 256637 104499 -221163 -266753 -154920 -48112 101928 -115977
10035 277735 68919 166852 156539 75317 108396 -39732 -174079 -215028 -241309 -7439 -113942
10024 -113942 -43226 27812 -47292 -14223 -8589 -309139 -294156 8775 22346 -206455 233747
10012A07777a59392I654K26901b88451a01926r7161j85529A0294a31816A1785
10001C7359a7428C6981Q0212g751k48894D09481i784l5151j16936j4570j67699
9990c44140N8615a28434I735J7115M3676P5860d31267J94751A71196d2909J2051
9979c0858A26368F0631K5301a24185k4912F2032b89217O3325G1231b64352a31881
9967i3725q5405c5244k8621j68939a01097A16515E0899P6082F1176c4612F9372
9955F9591a37888F8918B2399a01367k73581A21763b1886j24759C08216g1085j81176
9944b52261j07261i5324D7186h0537H8316L4029a214k13745A68029a34154O2726
9933g1428P681o2987K7389A31485k0368c5939B11669A03310d3406I5823l1549
$$ plain form
10012 107777 -159392 9654 236555 -288451 -101926 -199087 -384616 10294 -131816 11785
10001 37359 -17428 36981 117193 -7751 -256645 409481 -9784 -44935 -161871 -176441 -344140
9990 -344140 -285525 -128434 9735 26850 70526 146386 -431267 -236516 171196 -42909 -30858
9979 -30858 126368 60631 85932 -124185 -149097 62032 -289217 -225892 71231 -264352 -131881
9967 -93725 -179130 -35244 -63865 -232804 -101097 116515 50899 126981 61176 -34612 69372
9955 69591 -137888 68918 22399 -101367 -374948 121763 -21886 -146645 308216 -71085 -252261
9944 -252261 -359522 -95324 47186 -80537 88316 122345 -1214 -214959 168029 -134154 -71428
9933 -71428 -63747 -126734 -99345 131485 111117 -35939 211669 103310 -43406 95823 64274
9922F4274c4671n4857C4972P2605l5951B2011a00435j53875c4481J2889C74617
9910F8853O2387b93658a9252q8589j34433B32211b74131l7828C6100f7111k42005
9899c09116J25078b5788J0991A70137c638j62980g002j06919K2769j33645J10939
9888a13858H0166N1537g5075e452A53848E5096i2653h279k4735B3227a89660c7498
9875A16727m3924l0998a38692E476d1360e757l43369I0601A684Q8280I745L3748
9863D3493J20430d055j14487K0408r4254f9670k55220D298b56708D5601b1650
9851b18510h5660p4659k39426a53216n6474A61904b35239B5056J22296o7698i7007
9839B22595B3152a16125D9447R528k6820c36074B06811H994a30396A38615J50670
$$ plain form
9922 64274 -34671 -89528 34972 107577 71626 22011 -100435 -254310 -34481 -21592 374617
9910 68853 131240 -293658 -19252 -107841 -242274 232211 -274131 -311959 36100 -67111 -309116
9899 -309116 -184038 -25788 -14797 170137 -3638 -166618 -7002 -113921 -91152 -224797 -113858
9888 -113858 80166 131703 -75075 -5452 153848 55096 -92653 -8279 -33014 23227 -189660 -37498
9875 116727 72803 41805 -138692 5476 -41360 -5757 -349126 90601 1684 89964 9745 43493
9863 43493 163923 -4055 -118542 -98134 -192388 -69670 -324890 4298 -256708 45601 -21650
9851 -218510 -85660 -160319 -399745 -153216 -209690 161904 -235239 25056 147352 79654 -97007
9839 222595 23152 -116125 49447 58975 32155 -336074 206811 8994 -130396 138615 289285
9828B89285A5062h8317E153c02435F7498P7084a37309r0467g4998a5387C6844
9816a32637A03111f8647b9227j64479B81918b15597k0613k09489a4517m1225p7526
9805a33268H5811a87108f9865F9926c6067j48262P8081A6177a84220j81582A950
9793A51393b154C5174R345K0944K19506a35793j3761P2380F6862b96137a6751
9781C23481I0937b72901N7578c3845e921A6780J6986a06057B7416a0014j35546
9770a45560n2476e5269n4170j44327f0123K9043o3670e911k55709H1666c2704
9758a17900k06589C8172b41655I9589f6538A13143a53357c6510A4561f3504G9395
9746b58635J24337j05644d7079J5021A18865J79753c86304d6156F9948b3776B8895
$$ plain form
9828 289285 15062 -88317 5153 -302435 67498 144582 -137309 -227776 -74998 -15387 36844
9816 -132637 103111 -68647 -29227 -193706 281918 -215597 -236210 -445699 -14517 -55742 -133268
9805 -133268 85811 -187108 -69865 69926 -36067 -184329 -106248 16177 -184220 -365802 1950
9793 151393 -2154 35174 44519 65463 284969 -135793 -149554 -77174 66862 -296137 -16751
9781 323481 90937 -272901 -215323 -33845 -5921 16780 33766 -106057 27416 -10014 -145560
9770 -145560 -198036 -55269 -109439 -253766 -60123 -31080 -94750 -5911 -261620 81666 -32704
9758 -117900 -324489 38172 -241655 99589 -66538 113143 -153357 -36510 14561 -63504 79395
9746 -258635 -134298 -239942 -47079 -32058 118865 298618 -386304 -46156 69948 -23776 28895
9734a6531H3847B6360J4955i2063L4569D078b87826c7809A84618G7935J8175f836
9721H133b03645J3277A499J56325D9095b07242J03009A05845b13951A66827a7210
9709G2321c15338A72381H6124G143c74670J35975d2009A21427h2241E3133e2040
9697A52361a50562C301a3905k2369j9326G275J37220e5047j40061m5861e0024
9685C80010j26411A0794m576d69492K26303R0139j11174E5244a04066A70036h632
9673c4507a0868A59174c2769k45148a25343j9911D9180b55298a00662A07155a13234
9661a70566b7352l08851J10454A0247b18854g3982A9674P6658c09973a10435k42554
9650c52989A5037b19584C47358G116a478B67607E5530a20203j15494j3363J14436
$$ plain form
9734 -16531 83847 26360 41315 -92063 -57494 4078 -287826 -37809 184618 77935 96110 -6836
9721 8133 -203645 -190368 1499 157824 49095 -207242 -104233 105845 -213951 166827 -17210
9709 72321 -315338 172381 86124 7143 -374670 -238695 -42009 121427 -82241 53133 -52040
9697 152361 -150562 3301 -13905 -36274 -55600 7275 144495 -55047 -195108 -240969 -50024
9685 380010 253599 10794 6218 -469492 -243189 -153050 -264224 55244 -104066 170036 -8632
9673 -34507 -10868 159174 -32769 -277917 -125343 -145254 49180 -255298 -100662 107155 -113234
9661 -170566 -27352 -336203 -225749 10247 -218854 -73982 19674 96332 -309973 -110435 -352989
9650 -352989 15037 -219584 347358 7116 -1478 267607 55530 -120203 -235697 -249060 -134624
9639a34624C937e2703n9489Q467p8398A01306A4140J75708H4258c73448a79020
9627b43294B67412a20731o721l31752J64681i50k38092A59585N0757f1322L533
9616e7789A90120Q7550j24680b88027A34791a27158l9063K5531e8937r2163k45822
9605c96922a66534j49255p0161f9519n1559C9604c1069A71129e1761d663k80011
9594b84674B73028a18065B40437J32326A49559a39106A81486j0911A8660a11032
9583A21259D1864M4944K08102c5682k98274a61041L8233j43133n3720i8482B59065
9571A041a30774o2200M1562j64192A72136a32647j6358O9558j26444A763Q2186
9560H3949b84311a0192r1464j42299B8166e7873j26785I5200J856a22850K5806
$$ plain form
9639 -134624 3937 -52703 -112192 -103725 -182123 101306 14140 189848 84258 -373448 -179020
9627 -243294 267412 -120731 -127452 -459204 -294523 -950 -239042 159585 210342 -61322 -57789
9616 -57789 190120 277670 152990 -288027 134791 -127158 -166221 -140690 -58937 -151100 -396922
9605 -396922 -166534 -315789 -385950 -69519 -121078 39604 -31069 171129 -51761 -4663 -284674
9594 -284674 273028 -118065 240437 372763 149559 -139106 181486 170575 18660 -111032
9583 121259 41864 86808 294910 -35682 -333956 -161041 -122808 -265941 -319661 -98482 259065
9571 1041 -130774 -192974 -151412 -315604 172136 -132647 -149005 -79447 -205891 1763 83949
9560 83949 -284311 -10192 -101656 -243955 28166 -57873 -184658 95200 97056 -122850 -97044
9549i7044j17588g6380n7768A16458f0577j66647J06362j73613b4119A34846D2141
9537g5218l75472b8586B61067b37842P8473b0910C7169c3661n5214l6966j33109
9526b58950F4910J07495C9722a78414C002i7200H7634J0836c58203j7681J35328
9515b40556N284O1359p0088f5336p2812A43358R2793r7611a6142l360A71082A85
9502A79269a99698A1594a64148a4592E674J48348g0665b5184A6042b7401k2610
9491e0011K1919C0940P5772b56890i6773q2849G9098g9363o4538A01471a44519
9479D15512C8806c01643A51423C4616M5250F462J68420J76967e4928D8593a03635
9467D6752c57953A0019J26689D5483M3871a11748j03893G3915c8595L443m9830
$$ plain form
9549 -97044 -214632 -76380 -134148 116458 -60577 -227224 -120862 -294475 -24119 134846 42141
9537 -75218 -450690 -28586 261067 -237842 -159369 -20910 37169 -33661 -88875 -125841 -258950
9526 -258950 64910 172405 39722 -178414 3002 -97200 87634 98470 -358203 -375884 -240556
9515 -240556 -235272 -173913 -244001 -65336 -138148 143358 236151 138540 -16142 -19502 171082 185
9502 179269 -199698 11594 -164148 -14592 5674 154022 -70665 -25184 16042 -27401 -50011
9491 -50011 -28092 30940 106712 -256890 -96773 -179622 79098 -79363 -143901 101471 -144519
9479 415512 38806 -301643 151423 34616 79866 6462 174882 351849 -54928 48593 -103635
9467 46752 -357953 10019 136708 45483 89354 -111748 -215641 73915 -38595 -35152 -84982
9456h4982j94227I0759J72828a22079A89764a55849c005k13950B14111a34785
9445A02995h7758m3532E4603a55022p7995O3496f3469r4284G615a46651a7447
9433A61560p5484h4333B12979b23294D9399K04979i9878k7435A01034m9390a79716
9421G8373J67297h7871l11150a6125B3834J03086c41673a22495C069c5404A75990
9409A90169a47188F6454c992k20911e9180j00978A43269K3603b01900f8441o8872
9398a37313M4447l7043k34058A79813J7340c45502a55046b3847B21195a71553
9387A05563g4263G0583a03669A28897e4932N096j2954B70460A30195b07073j4080
9376b21153P4459L8502k28083i1826H706c75341J75267n800F5571L6640a5312
$$ plain form
9456 -84982 -279209 90759 263587 -122079 189764 -155849 -3005 -216955 214111 -134785
9445 102995 -87758 -131290 54603 -155022 -233017 -169521 -63469 -157753 7615 -146651 -17447
9433 161560 86076 -84333 212979 -223294 49399 254378 -99878 -127313 101034 51644 -179716
9421 78373 245670 -87871 -399021 -16125 23834 126920 -341673 -122495 3069 -35404 175990
9409 190169 -147188 66454 -3992 -224903 -59180 -160158 143269 166872 -201900 -68441 -137313
9398 -137313 -92866 -129909 -363967 179813 197153 -345502 -155046 -23847 221195 -171553
9387 105563 -74263 70583 -103669 128897 -54932 -49836 -62790 270460 130195 -207073 -221153
9376 -221153 -146694 -108192 -336275 -91826 8706 -375341 -200074 -205874 65571 102211 -15312
9364c66473a06378B6580J01115J9215E6687J74774c3857l2385E9969a50029p3364
9353b23393k428c0102p3596j32474H9114b60269J6143E2152J36431g8253m0414
9342a18667j8770k08971d6591l7459E0849L41262c8581j32754C960i116A25892
9330c41828a30223A01085K15258I9844a12853a6838j64916O6470j11259o6562
9320b93105B45929I0851b48272c7083b933r6642m6273f3600A09813b36106j70659
9309d06765g8170A90022J19808d0927j40836C0244K9527d1797f733j21415H0281
9297b34442a05877j04487p3691R6147j9762O0549k53308J81800Q3362C4038b44231
9285A07703d6762o3405k17734a09166k95806a60334A04405J62892B8383Q1649
$$ plain form
9364 -366473 -106378 26580 127695 146910 56687 231461 -33857 -66242 59969 -150029 -223393
9353 -223393 -225821 -30102 -103698 -236172 89114 -260269 -244126 52152 188583 -78253 -118667
9342 -118667 -137437 -346408 -46591 -84050 50849 392111 -38581 -171335 3960 -9116 125892
9330 -341828 -130223 101085 316343 99844 -112853 -16838 -181754 -115284 -226543 -293105
9320 -293105 245929 90851 -248272 -37083 -2933 -99575 -145848 -63600 109813 -236106 -406765
9309 -406765 -78170 190022 309830 -40927 -181763 30244 59771 -41797 -6733 -128148 80281
9297 -234442 -105877 -210364 -284055 -187908 -207670 -147121 -400429 -218629 -135267 34038 -244231
9285 107703 -46762 -110167 -327901 -109166 -404972 -160334 104405 267297 28383 110032
9275A10032a47363G8869P5185c3903B5957f9912o6793F9254J57378E4123J546
9264E5669k6805a20161k48703a06055F7163b8284m4825A10909E0966b52708N0747
9253b01961A07122J06867a85524e6151B352a20457j90602a22605F7444a12039
9242g2543A11786a4650B70369b12809M9633P5493p6855A44244C164J52433D3928
9230g3826A18826e4350G9579b95037d2686A2709c14238A49933n9957a77056Q3680
9219i3376j70225a02035p7802A65737a92869O4848j17904G7132O1815a97339E8202
9207D15389h8008j63628J04590N160k1549B26041a43914B775J37348a81699J7620
9196a64079o890l02062B22490a03165B9671Q3426b1629k03863D3176a64250d6323
$$ plain form
9275 110032 -147363 78869 154054 -33903 25957 -69912 -136705 69254 226632 54123 55669
9264 55669 28864 -120161 -368864 -106055 67163 -28284 -73109 110909 50966 -252708 -201961
9253 -201961 107122 213989 -185524 -56151 2352 -120457 -311059 -122605 67444 -112039
9242 -72543 111786 -14650 270369 -212809 -163176 -87683 -164538 144244 3164 155597 43928
9230 -73826 118826 -54350 79579 -295037 -42686 12709 -314238 149933 89976 -177056 -93376
9219 -93376 -263601 -102035 -179837 165737 -192869 -128021 -245925 77132 138947 -197339 58202
9207 415389 -88008 -251636 -147046 -141886 -163435 226041 -143914 2775 140123 -181699 -164079
9196 -164079 -170969 -473031 222490 -103165 29671 113097 -21629 -225492 43176 -164250 -46323
9184A05053h0753l3233d4432b78o4066A23312D3522a84480Q7922b5689B07334
9172h9076c5083r5981K0652j76374D3130e6655K3796D6390a68002E4875a39571
9160c3072M259A2368p26J46870a30228M2530n9788l5377F2316c82767G2155a82160
9147a46262Q645A23281M7375a77043e3649k44307a46196g2441B4666J7209K00854
9136B42729d5627l23432N2343A69687J09185F7151b13685N7252A18561R2458a87172
9124a61149A8662K51073q2097a14038m3893A85907G3670b4056j65527F803a52364
9112a85894E7495g622l0151o2509C87816a27745D015f5626k54668D4399b36841
9100d1896B10544a30667l5988j90789m2328i1690g780k89238B10406b35785j5517
$$ plain form
9184 105053 -80753 -113986 -44432 -278 -64344 123312 43522 -184480 -96558 -25689 207334
9172 -89076 -35083 -131064 -110412 -286786 43130 -56655 -32859 46390 -168002 54875 -139571
9160 -33072 -28813 12368 11642 158512 -130228 -87698 -147486 -182863 62316 -382767 72155 -182160
9147 -146262 -137617 123281 170656 -177043 -53649 -297956 -146196 -72441 24666 41875 242729
9136 242729 -45627 -369059 -316716 169687 278872 67151 -213685 -156433 118561 211019 -187172
9124 -161149 18662 269735 187638 -114038 -157931 185907 73670 -24056 -189583 6803 -152364
9112 -185894 57495 -7622 -37773 -100282 387816 -127745 4015 -65626 -320294 44399 -236841
9100 -41896 210544 -130667 -166655 -357444 -399772 -91690 -7780 -297018 210406 -235785 -251302
9089b51302D22064b34586B01700d6475k42336A15274a87745J1467A04821d9536
9078b67207C4474a14936b1583j08302N6109D7560b70813B66152j31393J1236n9092
9067H6903q821C2916a23863N7201o4782e2671a6645l59745h425A87492f7238J7837
9055d9401q3922B68005i2897l3472c6873J7117B3189h893m7142q9529F1212b85759
9042A0308b76552Q1006E6132A0651h1215A77067b58151p0044E0269i7041k16345
9031c13386J29028A95850o2850e2805K4820r8249p9056p8499A40024k5907a49870
9019a82823H4687K7617A5593a06576J6848C1112K0j3033D443h6244D9328i3697
9006A77480i5594l81249d8823k10539D1414d26886A00454j4967g2910k02934n752
$$ plain form
9089 -251302 422064 -234586 201700 -46475 -288811 115274 -187745 -176278 104821 -49536
9078 -267207 34474 -114936 -21583 -129885 -73776 47560 -270813 266152 134759 145995 86903
9067 86903 78082 32916 -123863 -66662 -131444 -52671 -16645 -376390 -8425 187492 -67238 -49401
9055 -49401 -133323 268005 -92897 -126369 -36873 -19756 23189 -8893 -56035 -145564 61212 -285759
9042 10308 -276552 -195546 56132 10651 -81215 177067 -258151 -328195 50269 -97041 -313386
9031 -313386 -184358 195850 133000 -52805 -27985 -126234 -205290 -283789 140024 114117 -149870
9019 -182823 84687 112304 15593 -106576 -89728 31112 31132 18099 4443 -86244 49328 -93697
9006 177480 -95594 -476843 -48823 -259362 41414 -426886 100454 85487 -72910 -275844 -281596
8995b81596f7211p3735K0266C5560K21677b3354j95827g2816C3091h7339j41059
8984b28398b9710A11774a52227o3386g481j39922j23541d6845D7396i0639C9054
8972A45266b28249B9899a80363A8509b70119J30068A46110c05981F2441a61282
8961c65139g0296K0247m8889c21j11825m2159B30239b80281c3380a1166l36890
8950c48056A88157a27855I2596b26369B1706d0743C0057d8300A0037K3388b1026
8938E5359g4126G8353d3497B90071b237A15691c31649g9373j24785g0644G650
8926E2016J3955M04427L38113R38868M527898K432723B287625F33305k97051H0119
8915g1744k8021C5383J2867b950j39870m9448A75331D1192a42227J4374q1822
$$ plain form
8995 -281596 -67211 -140946 -120680 35560 257237 -23354 -219181 -72816 33091 -87339 -228398
8984 -228398 -29710 111774 -152227 -215613 -7481 -147403 -270944 -46845 47396 -90639 39054
8972 145266 -228249 29899 -180363 18509 -270119 -140051 146110 -305981 62441 -161282
8961 -365139 -70296 -50049 -98938 -321 -112146 -154305 230239 -280281 -33380 -11166 -348056
8950 -348056 188157 -127855 92596 -226369 21706 -40743 30057 -48300 10037 33425 -21026
8938 55359 -74126 78353 -43497 290071 -2237 115691 -331649 -79373 -204158 -70644 7650
8926 52016 65971 470398 808511 1747379 6275277 8708000 2287625 633305 336254 80119
8915 -71744 -99765 35383 48250 -2950 -142820 -192268 175331 41192 -142227 -127853 -209675
8904b09675a7380j07135D8531C791K18317a29696j12660A7036P8236a10829r4466
8893b05295J01250G2025K37145j19159c68931f125l5485k0918q8381J7515k5628
8882a59022P5541A77416c3360k06763h4978B9900K4139e9652B07373I9394B9330
8870b71907D77813C7323J35250a89572f6861n6647j20740i8215A16898n1493a33847
8858a76997k2883a6357m9735m08699A43850b62751D5261a34625L9698K6958a9747
$$ plain form
8904 -209675 -17380 -124515 48531 3791 222108 -129696 -242356 17036 95272 -110829 -205295
8893 -205295 -104045 72025 309170 190011 -368931 -6125 -41610 -62528 -150909 -133394 -159022
8882 -159022 -83481 177416 -33360 -240123 -84978 29900 54039 -59652 207373 99394 29330
8870 -271907 477813 37323 172573 -189572 -66861 -123508 -244248 -98215 116898 65405 -133847
8858 -176997 -199880 -16357 -66092 -474791 143850 -262751 45261 -134625 -94927 -67969 -19747
$$ [...]
##END NTUPLES=NMR SPECTRUM
##END=
