##TITLE=AC1423_MEXR_12233_7764356_ZsiqsYwX4C
##JCAMPDX= 6.0         $$ Bruker NMR JCAMP-DX V2.0
##DATA TYPE= NMR SPECTRUM
##DATA CLASS= NTUPLES
##ORIGIN= BRUKER
##OWNER= Administrator
$$ 1.72 TOPSPIN		Version 2.1
$$ 2013-04-11 20:12:27.623 -0700  Administrator@X
$$ Compression mode = diff/dup
##.OBSERVE FREQUENCY= 400.02188249412
##.OBSERVE NUCLEUS= ^1H
##.ACQUISITION MODE= SIMULTANEOUS (DQD)
##.ACQUISITION SCHEME= undefined
##.AVERAGES= 64
##.DIGITISER RES= 22
##SPECTROMETER/DATA SYSTEM= spect
##.PULSE SEQUENCE= noesygpps1d.comp
##.SOLVENT NAME= COFFEE_meoh
##.SHIFT REFERENCE= INTERNAL, COFFEE_meoh, 1, 14.96099
##AUDIT TRAIL= $$ (NUMBER, WHEN, WHO, WHERE, PROCESS, VERSION, WHAT)
$$ ##TITLE= Audit trail, TOPSPIN		Version 2.1
$$ ##JCAMPDX= 5.01
$$ ##ORIGIN= Bruker BioSpin GmbH
$$ ##OWNER= Administrator
$$ $$ E:\/data/COFFEE/nmr/AC1423_MEXR_12233_7764356_ZsiqsYwX4C/12/pdata/1/auditp.txt
$$ ##AUDIT TRAIL=  $$ (NUMBER, WHEN, WHO, WHERE, PROCESS, VERSION, WHAT)
(   1,<2013-04-11 20:12:21.685 -0700>,<Administrator>,<X>,<go>,<TOPSPIN 2.1>,
      <created by zg
	started at 2013-04-11 20:00:51.916 -0700,
	POWCHK enabled, PULCHK disabled,
       configuration hash MD5:
       33 CF 6A 21 5C D3 B9 40 6C 15 AA 8D 27 A2 4F 13
       data hash MD5: 64K
       CB 0B 01 81 8B 3D F0 49 2B 73 0E CB FC C7 CF 21>)
(   2,<2013-04-11 20:12:24.779 -0700>,<Administrator>,<X>,<proc1d>,<TOPSPIN 2.1>,
      <Start of raw data processing
       efp LB = 0.3 FT_mod = 6 PKNL = 1 PHC0 = 0 PHC1 = 0 SI = 128K 
       data hash MD5: 128K
       08 5C 16 67 2B A9 AF A3 AE 05 0E 09 41 A8 E8 31>)
(   3,<2013-04-11 20:12:25.795 -0700>,<Administrator>,<X>,<proc1d>,<TOPSPIN 2.1>,
      <pk PHC0 = -78.92578 PHC1 = 0 
       data hash MD5: 128K
       5F B3 F2 91 02 03 9B 12 1D EC E1 3A CD 19 21 43>)
(   4,<2013-04-11 20:12:26.529 -0700>,<Administrator>,<X>,<proc1d>,<TOPSPIN 2.1>,
      <abs ABSG = 1 
       data hash MD5: 128K
       81 74 79 E6 18 25 00 48 A1 B9 EC 7B 78 B5 66 E9>)
(   5,<2013-04-11 20:12:26.701 -0700>,<Administrator>,<X>,<proc1d>,<TOPSPIN 2.1>,
      <abs ABSG = 2 
       data hash MD5: 128K
       8E 19 29 D6 1C 8E 29 15 76 FD 29 8C 45 14 81 3D>)
(   6,<2013-04-11 20:12:26.888 -0700>,<Administrator>,<X>,<proc1d>,<TOPSPIN 2.1>,
      <abs ABSG = 3 
       data hash MD5: 128K
       66 9A E0 4D 81 69 5C F2 F9 27 11 78 40 2E 33 52>)
(   7,<2013-04-11 20:12:27.076 -0700>,<Administrator>,<X>,<proc1d>,<TOPSPIN 2.1>,
      <abs ABSG = 4 
       data hash MD5: 128K
       73 C6 96 51 BD B3 F3 3A 67 EA E0 28 B6 7E CB C8>)
(   8,<2013-04-11 20:12:27.279 -0700>,<Administrator>,<X>,<proc1d>,<TOPSPIN 2.1>,
      <abs ABSG = 5 
       data hash MD5: 128K
       26 5A 8A DF BE 6A A6 6C 37 79 54 54 76 5C E7 9C>)
$$ ##END=
$$ 
$$ $$ hash MD5
$$ $$ 7F 5B 0C 2F 2A B4 53 F3 6C 8D 95 28 97 52 C3 8B
##$RELAX= 
##$RELAX= 
##$RELAX= 
##$RELAX= 
##$RELAX= 
##$RELAX= 
##$RELAX= 
##$RELAX= 
$$ Bruker specific parameters
$$ --------------------------
##$DU= <E:\>
##$EXPNO= 12
$$ [...]
##$TP07= 0
##$TPNAME0= <>
##$TPNAME1= <>
##$TPNAME2= <>
##$TPNAME3= <>
##$TPNAME4= <>
##$TPNAME5= <>
##$TPNAME6= <>
##$TPNAME7= <>
##$TPOAL= (0..7)
0.5 0.5 0.5 0.5 0.5 0.5 0.5 0.5
##$TPOFFS= (0..7)
0 0 0 0 0 0 0 0
##$TUNHIN= 0
##$TUNHOUT= 0
##$TUNXOUT= 0
##$USERA1= <user>
##$USERA2= <user>
##$USERA3= <user>
##$USERA4= <user>
##$USERA5= <user>
##$V9= 5
##$VALIST= <valist>
##$VCLIST= <CCCCCCCCCCCCCCC>
##$VD= 0
##$VDLIST= <DDDDDDDDDDDDDDD>
##$VPLIST= <PPPPPPPPPPPPPPP>
##$VTLIST= <TTTTTTTTTTTTTTT>
##$WBST= 2048
##$WBSW= 25
##$XGAIN= (0..3)
0 0 0 0
##$XL= 0
##$YL= 0
##$YMAX_a= 5662369
##$YMIN_a= -12721588
##$ZGOPTNS= <>
##$ZL1= 120
##$ZL2= 120
##$ZL3= 120
##$ZL4= 120
##$ABSF1= 14.96099
##$ABSF2= -5.597192
##$ABSG= 5
##$ABSL= 3
##$ALPHA= 0
##$AQORDER= 0
##$ASSFAC= 0
##$ASSFACI= 0
##$ASSFACX= 0
##$ASSWID= 0
##$AUNMP= <proc_prof1d_extract.lims>
##$AXLEFT= 0
##$AXNAME= <>
##$AXNUC= <1H>
##$AXRIGHT= 0
##$AXTYPE= 0
##$AXUNIT= <>
##$AZFE= 0.1
##$AZFW= 0.1
##$BCFW= 0
##$BC_mod= 0
##$BYTORDP= 0
##$COROFFS= 0
##$CY= 15
##$DATMOD= 1
##$DC= 0
##$DFILT= <>
##$DTYPP= 0
##$F1P= 0
##$F2P= 0
##$FCOR= 0.5
##$FTSIZE= 131072
##$FT_mod= 6
##$GAMMA= 0
##$GB= 0
##$INTBC= 1
##$INTSCL= 1
##$ISEN= 128
##$LB= 0.3
##$LEV0= 0
##$LPBIN= 0
##$MAXI= 10000
##$MC2= 0
##$MEAN= 0
##$ME_mod= 0
##$MI= 0
##$NCOEF= 0
##$NC_proc= -2
##$NLEV= 6
##$NOISF1= 0
##$NOISF2= 0
##$NSP= 0
##$NTH_PI= 0
##$NZP= 0
##$OFFSET= 14.96099
##$PC= 1
##$PHC0= -78.92578
##$PHC1= 0
##$PH_mod= 1
##$PKNL= yes
##$PPARMOD= 0
##$PPDIAG= 0
##$PPIPTYP= 0
##$PPMPNUM= 2147483647
##$PPRESOL= 1
##$PSCAL= 4
##$PSIGN= 0
##$PYNMP= <proc.py>
##$REVERSE= no
##$SF= 400.020009642616
##$SI= 131072
##$SIGF1= 0
##$SIGF2= 0
##$SINO= 400
##$SIOLD= 131072
##$SPECTYP= <>
##$SREGLST= <1H.CDCl3>
##$SSB= 0
##$STSI= 131072
##$STSR= 0
##$SW_p= 8223.68421052631
##$SYMM= 0
##$S_DEV= 0
##$TDeff= 65536
##$TDoff= 0
##$TI= <>
##$TILT= no
##$TM1= 0
##$TM2= 0
##$TOPLEV= 0
##$USERP1= <user>
##$USERP2= <user>
##$USERP3= <user>
##$USERP4= <user>
##$USERP5= <user>
##$WDW= 1
##$XDIM= 131072
##$YMAX_p= 428628235
##$YMIN_p= -12245
##$CURPLOT= <Network HP LaserJet P1505>
##$CURPRIN= <$Network HP LaserJet P1505>
##$DFORMAT= <normdp>
##$LAYOUT= <+/1D_H.xwp>
##$LFORMAT= <normlp>
##$PFORMAT= <normpl>
##$SURQMSG= 1
$$ End of Bruker specific parameters
$$ ---------------------------------
##NTUPLES= NMR SPECTRUM
##VAR_NAME=  FREQUENCY,     SPECTRUM/REAL,   SPECTRUM/IMAG
##SYMBOL=    X,             R,               I
##VAR_TYPE=  INDEPENDENT,   DEPENDENT,       DEPENDENT
##VAR_FORM=  AFFN,          ASDF,            ASDF
##VAR_DIM=   131072,        131072,          131072
##UNITS=     HZ,            ARBITRARY UNITS, ARBITRARY UNITS
##FACTOR=    0.0627417313425164, 1,          1
##FIRST=     8223.62146879497, 4944,         -54488
##LAST=      0,             6354,            -53478
##MIN=       0,             -12245,          0
##MAX=       8223.62146879497, 428628235,    0
$$ Real data points
##PAGE= N=1
##DATA TABLE= (X++(R..R)), XYDATA
$$ [...]
$$ plain form
63819 1183354 1129979 1076333 1023197 971228 920956 872939 827492 784645 744690 708322 675777
63808 675777 646219 618561 592666 569281 548913 531193 515234 500274 486075 473011 461733
63797 461733 452505 444876 437995 431072 423611 415629 407738 400565 393971 387330 380670 374798 370023 365591
63783 365591 360914 356592 353374 350709 347323 342984 338736 335410 332726 329991 326995 324030 321476 319533
63769 319533 318034 316478 314576 312694 311416 310685 309756 308009 305501 302777 300407 298676 297431 296236 294880
63754 294880 293617 292722 292056 291387 290890 290930 291498 292307 293314 294706 296360 297781 298653 299204 299951 301242 303030
63737 303030 304925 306595 308187 310195 312792 315646 318579 321976 326062 330179 333421 335902 338747 342775
63723 342775 347724 352950 358372 364405 371149 378022 384197 389266 393362 396698 399244 400911 401839 402151 401640
$$ packed form
63819A183354n3375n3646n3136n1969n0272m8017m5447m2847l9955l6368l2545
63808F75777k9558k7658k5895k3385k0368j7720j5959j4960j4199j3064j1278
63797D61733r228p629o881o923p461p982p891p173o594o641o660n872m775m432
63783C65591m677m322l218k665l386m339m248l326k684k735k996k965k554j943
63769C19533j499j556j902j882j278p31r29j747k508k724k370j731j245j195j356
63754B94880j263q95o66o69m97M0N68Q09J007J392J654J421Q72N51P47J291J788
63737C03030J895J670J592K008K597K854K933L397M086M117L242K481K845M028
63723C42775M949N226N422O033O744O873O175N069M096L336K546J667R28L12n11
$$ plain form
63708 401640 400138 398061 395973 393651 390311 385947 381696 378568 376478 375003 374319 374731 375836 376877 377600
63693 377600 378169 378660 379315 380896 383959 387928 391577 394250 396066 397148 397403 396921 395909 394309 392087
63678 392087 389871 388599 388501 388988 389597 390534 392238 394863 398295 402333 406827 411858 417621 423890 429883
63663 429883 435003 439345 443057 445642 446494 445779 444088 441599 438323 434831 431740 428603 424316 418698 412745
63648 412745 407227 401947 396696 392018 388563 386296 384853 384234 384755 386556 389440 392909 396296 399189 401872
63633 401872 405010 408849 413055 417317 421716 426461 431666 437362 443405 449499 455706 462750 471238 480787
63619 480787 490580 500620 511680 524092 537530 552064 568472 587175 607671 629447 652775 678258
63607 678258 706243 737016 770815 807069 844234 880883 916392 949958 979529 1002592 1017926
$$ packed form
63708D01640j502k077k088k322l340m364m251l128k090j475o84M12J105J041P23
63693C77600N69M91O55J581L063L969L649K673J816J082K55m82j012j600k222
63678C92087k216j272r8M87O09R37J704K625L432M038M494N031N763O269N993
63663D29883N120M342L712K585Q52p15j691k489l276l492l091l137m287n618n953
63648D12745n518n280n251m678l455k267j443o19N21J801K884L469L387K893K683
63633D01872L138L839M206M262M399M745N205N696O043O094O207P044Q488R549
63619D80787R793J0040J1060J2412J3438J4534J6408J8703K0496K1776K3328K5483
63607F78258K7985L0773L3799L6254L7165L6649L5509L3566K9571K3063J5334
$$ plain form
63596 1017926 1025994 1027891 1024549 1016922 1006249 993847 980790 967734 954725 941166 926253 909553
63584 909553 891113 871171 850022 828201 806529 785835 766636 749105 733295 719283 707099
63573 707099 696684 688109 681755 678040 676960 678202 681632 687168 694050 700909 707017 712946 719434 726100
63559 726100 732011 737120 742275 747985 754093 760756 768843 779122 791737 806817 825100 847621 875056
63546 875056 907517 944787 986847 1034530 1089236 1151003 1216524 1279544 1333346 1372671 1394038
63535 1394038 1396097 1380701 1352885 1318718 1282957 1248530 1217253 1190038 1166579 1145451 1124724
63524 1124724 1102543 1077666 1049950 1020162 989033 956638 922891 888330 854091 821303 790773
63513 790773 763024 738291 716425 697048 679842 664693 651624 640625 631468 623682 616748 610248
$$ packed form
63596A017926Q068J897l342p627j0673j2402j3057j3056j3009j3559j4913j6700
63584I09553j8440j9942k1149k1821k1672k0694j9199j7531j5810j4012j2184
63573G07099j0415q575o354l715j080J242L430N536O882O859O108N929O488O666
63559G26100N911N109N155N710O108O663Q087J0279J2615J5080J8283K2521K7435
63546H75056L2461L7270M2060M7683N4706O1767O5521O3020N3802L9325K1367
63535A394038K059j5396k7816l4167l5761l4427l1277k7215k3459k1128k0727
63524A124724k2181k4877k7716k9788l1129l2395l3747l4561l4239l2788l0530
63513G90773k7749k4733k1866j9377j7206j5149j3069j0999r157p786o934o500
$$ plain form
63501 610248 603815 597197 590568 584521 579526 575565 572450 570044 567819 564768 560408 555543 551339 547950
63487 547950 544746 541569 538810 536395 533819 531360 530256 531268 533762 536579 539218 541888 544992 548846
63473 548846 553409 558071 562082 565236 567627 568806 567986 565185 561387 557379 553124 548460 543553 538381
63459 538381 532626 526563 521262 517383 514362 511256 507846 504440 501234 498437 496556 495966 496480 497730 499684
63444 499684 502542 506539 512052 519418 528464 538719 550313 564000 580109 598295 618820 643494
63432 643494 674874 714921 764469 822857 887130 951999 1011405 1060275 1095135 1114357 1118864 1112196
63420 1112196 1099064 1083720 1069592 1059576 1055873 1059786 1071971 1092344 1119365 1150119 1181714 1212180
63408 1212180 1239680 1261660 1275675 1280783 1277662 1267879 1253518 1236817 1219197 1200743 1181062 1160262
$$ packed form
63501F10248o433o618o629o047m995l961l115k406k225l051m360m865m204l389
63487E47950l204l177k759k415k576k459j104J012K494K817K639K670L104L854
63473E48846M563M662M011L154K391J179q20k801l798m008m255m664m907n172
63459E38381n755o063n301l879l021l106l410l406l206k797j881n90N14J250J954
63444D99684K858L997N513P366R046J0255J1594J3687J6109J8186K0525K4674
63432F43494L1380M0047M9548N8388O4273O4869N9406M8870L4860J9222M507o668
63420A112196j3132j5344j4128j0016l703L913J2185K0373K7021L0754L1595L0466
63408A212180K7500K1980J4015N108l121r783j4361j6701j7620j8454j9681k0800
$$ plain form
63396 1160262 1138677 1116132 1092084 1066080 1037668 1006525 973324 939954 908130 878233 850049
63385 850049 824006 800855 780675 763140 748322 736277 726119 716590 707576 700312 696045 695056 696831
63372 696831 700475 705020 709961 715573 722400 730660 740471 752186 765878 780874 796528 813207 831871
63359 831871 852927 876236 902035 931048 963656 999554 1038209 1079131 1121637 1164682 1206733
63348 1206733 1245451 1277917 1301862 1316701 1323086 1321822 1313721 1300134 1282893 1263729 1244039 1224786
63336 1224786 1206044 1186906 1166348 1143995 1119715 1093058 1063726 1032217 999469 966306 933800
63325 933800 903563 876856 853815 834249 818685 807921 802238 802042 808618 822735 842485 863400
63313 863400 880577 889930 888214 873785 847957 814647 778196 741918 708222 678710 653674 632328
$$ packed form
63396A160262k1585k2545k4048k6004k8412l1143l3201l3370l1824k9897k8184
63385H50049k6043k3151k0180j7535j4818j2045j0158r529r014p264m267r89J775
63372F96831L644M545M941N612O827Q260R811J1715J3692J4996J5654J6679J8664
63359H31871K1056K3309K5799K9013L2608L5898L8655M0922M2506M3045M2051
63348A206733L8718L2466K3945J4839O385j264q101j3587j7241j9164j9690j9253
63336A224786j8742j9138k0558k2353k4280k6657k9332l1509l2748l3163l2506
63325I33800l0237k6707k3041j9566j5564j0764n683j96O576J4117J9750K0915
63313H63400J7177R353j716j4429k5828l3310l6451l6278l3696k9512k5036k1346
$$ plain form
63301 632328 613901 598020 584220 571951 561063 551397 541975 531614 520463 509945 501016 493385
63289 493385 486526 480355 474590 468523 461962 455590 449916 444606 439293 434344 430315 427218 424758 422741
63275 422741 420862 418570 415622 412430 409605 407423 405843 404695 403746 402976 402751 403302 404159 404621 404596 404315
63259 404315 403402 401176 397924 394990 393458 393435 394621 396624 398638 399826 400375 401291 402906 404386 405034 405154
63243 405154 405280 405508 405987 407166 409001 410771 412213 414027 416658 419332 421028 421761 422261 422981 424078 425771
63227 425771 428050 430518 433118 436515 441119 446255 450974 455181 459278 463181 466520 469496 472692 476176
63213 476176 479580 482962 486883 491474 495998 499479 501514 502504 503334 504758 506799 508712 509661 509312 507811
63198 507811 505564 503224 501481 500529 499980 499489 499216 499495 500453 502177 504870 508574 513187 519004 526751 536625
$$ packed form
63301F32328j8427j5881j3800j2269j0888r666r422j0361j1151j0518q929p631
63289D93385o859o171n765o067o561o372n674n310n313m949m029l097k460k017
63275D22741j879k292k948l192k825k182j580j148r49p70k25N51Q57M62k5k81
63259D04315r13k226l252k934j532k3J186K003K014J188N49R16J615J480O48J20
63243D05154J26K28M79J179J835J770J442J814K631K674J696P33N00P20J097J693
63227D25771K279K468K600L397M604N136M719M207M097L903L339K976L196L484
63213D76176L404L382L921M591M524L481K035R90Q30J424K041J913R49l49j501
63198E07811k247k340j743r52n49m91k73K79R58J724K693L704M613N817P747R874
$$ plain form
63182 536625 547729 558938 570088 581887 594888 608990 623727 638637 653395 667838 681772
63171 681772 694621 705582 714350 721390 727263 732037 735590 738027 739310 738860 736077 731103 724562 716635
63157 716635 706847 694860 681103 666445 651374 635687 619072 601966 585539 570601 556827 543499
63145 543499 530779 519553 510098 501697 493771 486602 480573 475437 470893 467290 465113 464149 463805 463961
63131 463961 464971 467049 470115 474024 478418 482547 485777 488242 490608 493331 496506 500294 504983 510544
63117 510544 516535 522549 528587 534827 541130 546883 551444 554804 557685 560788 564128 567400 570781 574839
63103 574839 579688 584830 589811 594462 598424 601273 603411 606139 610349 615656 621254 627061 633555 640980
63089 640980 649262 658321 667858 677166 685616 693062 699278 703379 704464 702703 699282 695377 691471 687383
$$ packed form
63182E36625J1104J1209J1150J1799J3001J4102J4737J4910J4758J4443J3934
63171F81772J2849J0961Q768P040N873M774L553K437J283m50k783m974o541p927
63157G16635r788j1987j3757j4658j5071j5687j6615j7106j6427j4938j3774j3328
63145E43499j2720j1226r455q401p926p169o029n136m544l603k177r64l44J56
63131D63961J010K078L066L909M394M129L230K465K366K723L175L788M689N561
63117E10544N991O014O038O240O303N753M561L360K881L103L340L272L381M058
63103E74839M849N142M981M651L962K849K138K728M210N307N598N807O494P425
63089F40980Q282R059R537R308Q450P446O216M101J085j761l421l905l906m088
$$ plain form
63075 687383 682466 675988 667859 658903 650076 641581 633149 624925 617513 611232 605823 600999 596887 593788
63061 593788 591771 590599 590037 590217 591653 594768 599473 605440 612691 621443 631385 641699 651942 662361
63047 662361 673196 684398 696300 709724 724771 740185 754685 768416 782338 796591 810390
63036 810390 823350 836008 848996 862361 875722 888537 900206 910480 919825 928837 937220 943771
63024 943771 947455 948070 945871 941016 933600 923865 912158 898871 884493 869573 854578 839921 826188
63011 826188 814165 804521 797432 792560 789518 788428 789869 794133 800883 809914 821873 837444 855978
62998 855978 875814 896049 917004 938689 959896 979448 997463 1014666 1031202 1046949 1062320
62987 1062320 1077738 1092790 1106790 1119775 1132010 1142837 1151042 1156212 1158876 1159424 1157666 1153222 1145494
$$ packed form
63075F87383m917o478q129q956q827q495q432q224p412o281n409m824m112l099
63061E93788k017j172n62J80J436L115M705N967P251Q752R942J0314J0243J0419
63047F62361J0835J1202J1902J3424J5047J5414J4500J3731J3922J4253J3799
63036H10390J2960J2658J2988J3365J3361J2815J1669J0274R345R012Q383O551
63024I43771L684O15k199m855p416r735j1707j3287j4378j4920j4995j4657j3733
63011H26188j2023r644p089m872l042j090J441M264O750R031J1959J5571J8534
62998H55978J9836K0235K0955K1685K1207J9552J8015J7203J6536J5747J5371
62987A062320J5418J5052J4000J2985J2235J0827Q205N170K664N48j758m444p728
$$ plain form
62974 1145494 1133476 1116592 1095735 1072523 1047619 1020700 992000 962751 933916 905596 878036
62963 878036 852137 828417 806302 785085 764892 746196 728984 713046 698480 685254 672677
62952 672677 660040 647485 635616 624472 613473 602251 590894 579381 567481 555408 544105
62941 544105 534433 526277 518802 511468 504502 498313 492813 487579 482440 477597 473197 469179 465500 462123
62927 462123 458696 454730 450323 446284 443332 441542 440874 441573 443441 445157 445217 443551 441543 440434 440305
62912 440305 440687 441466 442800 444565 446357 448003 449874 452654 456736 461765 466801 471060 474431 477223 479688
62897 479688 482017 484625 488071 492749 498742 505799 513286 520439 526875 532639 537627 541422 544025 546224
62883 546224 548714 551234 553116 554371 555559 556872 558004 558738 558948 558094 555429 550774 544611 537450 529646
$$ packed form
62974A145494j2018j6884k0857k3212k4904k6919k8700k9249k8835k8320k7560
62963H78036k5899k3720k2115k1217k0193j8696j7212j5938j4566j3226j2577
62952F72677j2637j2555j1869j1144j0999j1222j1357j1513j1900j2073j1303
62941E44105r672q156p475p334o966o189n500n234n139m843m400m018l679l377
62927D62123l427l966m407m039k952j790o68O99J868J716O0j666k008j109j29
62912D40305L82P79J334J765J792J646J871K780M082N029N036M259L371K792K465
62897D79688K329K608L446M678N993P057P487P153O436N764M988L795K603K199
62883E46224K490K520J882J255J188J313J132P34K10q54k665m655o163p161p804
$$ plain form
62868 529646 521729 514233 507208 500503 494497 489841 486435 483379 480080 476772 473737 470698 467371 464106
62854 464106 461610 460289 460055 460441 460829 460919 461033 461627 462531 463179 463573 464342 465693 466964 467525 467545 467545 467705 468012
62835 468012 468627 469639 470711 471416 471717 471853 471952 472066 472360 472966 473781 474652 475662 477086 479157 481934 485181
62818 485181 488295 490621 491993 492770 493188 492911 491414 488699 485520 482865 481209 480149 478885 477165 475562
62803 475562 474611 474039 473315 472686 472899 473968 475045 475770 476995 479614 483172 486229 487891 488517 489065 490201
62787 490201 492053 494467 497378 501046 505995 512739 521608 532708 545775 560071 574764 589592 604901
62774 604901 620927 637292 653391 669008 684228 698838 712161 723579 733059 741070 748054 753995
62762 753995 758448 760875 760927 758486 753573 746224 736422 724263 710293 695435 680266 664474 647519
$$ packed form
62868E29646p917p496p025o705o006m656l406l056l299l308l035l039l327l265
62854D64106k496j321k34L86L88R0J14N94R04O48L94P69J351J271N61K0%J60L07
62835D68012O15J012J072P05L01J36R9J14K94O06Q15Q71J010J424K071K777L247
62818D85181L114K326J372P77M18k77j497k715l179k655j656j060j264j720j603
62803D75562r51n72p24o29K13J069J077P25J225K619L558L057J662O26N48J136
62787D90201J852K414K911L668M949O744Q869J1100J3067J4296J4693J4828J5309
62774F04901J6026J6365J6099J5617J5220J4610J3323J1418R480Q011O984N941
62762G53995M453K427N2k441m913p349r802j2159j3970j4858j5169j5792j6955
$$ plain form
62749 647519 629743 612282 595833 580156 564968 550539 537038 524063 511429 499771 489644
62738 489644 480642 472249 464987 459671 455859 452185 448163 444596 442145 440548 439394 438704 438420 438165 437911
62723 437911 438138 438944 439678 439861 439920 440623 442320 445018 448697 453112 457766 462482 467683 473866 481125 489390
62707 489390 498768 509430 521507 535242 550794 567774 585492 603900 623827 646067 670661 697251
62695 697251 725573 755335 786157 817994 851190 885801 921257 956944 992598 1027733 1061105
62684 1061105 1091202 1116993 1137840 1153022 1161790 1163755 1158948 1147636 1130249 1107304 1079240 1046572
62672 1046572 1010298 971823 932409 893007 854594 818104 783756 750973 719307 689163 661407
62661 661407 636594 614770 595596 578445 562754 548568 536380 526269 517578 509655 502448 496103
$$ packed form
62749F47519j7776j7461j6449j5677j5188j4429j3501j2975j2634j1658j0127
62738D89644r002q393p262n316l812l674m022l567k451j597j154o90k84k55k54
62723D37911K27Q06P34J83N9P03J697K698L679M415M654M716N201O183P259Q265
62707D89390R378J0662J2077J3735J5552J6980J7718J8408J9927K2240K4594K6590
62695F97251K8322K9762L0822L1837L3196L4611L5456L5687L5654L5135L3372
62684A061105L0097K5791K0847J5182Q768J965m807j1312j7387k2945k8064l2668
62672A046572l6274l8475l9414l9402l8413l6490l4348l2783l1666l0144k7756
62661F61407k4813k1824j9174j7151j5691j4186j2188j0111q691p923p207o345
$$ plain form
62649 496103 490416 485006 479657 474186 468368 462332 456729 452130 448491 445437 442808 440703 439243 438528
62635 438528 438589 439285 440438 442103 444317 446623 448311 449134 449273 448605 446786 444157 441747 440006 438274 435891
62619 435891 433106 430427 427812 425124 422774 421255 420527 420442 421229 422910 424791 426330 428101 430998 434732
62604 434732 437949 439808 440693 441451 442576 444193 446208 448305 450253 452405 455606 460508 467123 474943 483244
62589 483244 491334 498799 505630 512139 518827 526164 534052 541477 547219 551118 554147 556981 558993 559068 556890
62574 556890 553023 548186 542894 537368 531257 523819 514929 505614 497131 489808 483205 476946 470822 464540
62560 464540 458158 452463 448118 444583 440715 436437 433033 431623 431906 432638 432840 432316 431369 430313 429179
62545 429179 427781 426123 424630 423829 423892 424602 425614 426603 427387 428170 429504 431790 434873 438161 440929 442568
$$ packed form
62649D96103n687n410n349n471n818o036n603m599l639l054k629k105j460p15
62635D38528O1O96J153J665K214K306J688Q23J39o68j819k629k410j741j732k383
62619D35891k785k679k615k688k350j519p28q5P87J681J881J539J771K897L734
62604D34732L217J859Q85P58J125J617K015K097J948K152L201M902O615P820Q301
62589D83244Q090P465O831O509O688P337P888P425N742L899L029K834K012P5k178
62574E56890l867m837n292n526o111p438q890r315q483p323o603o259o124o282
62560D64540o382n695m345l535l868m278l404j410K83P32K02n24r47j056j134
62545D29179j398j658j493q01O3P10J012R89P84P83J334K286L083L288K768J639
$$ plain form
62529 442568 443023 443139 444049 445992 448234 450363 453041 457044 462215 467921 474035 480828 488400 496909 506969
62514 506969 519075 532916 547998 564648 583676 605161 628303 652378 677201 702727 728822
62503 728822 755392 782144 808263 832853 855560 876222 894104 908223 918497 925965 931860 937036
62491 937036 942305 948675 957063 968239 983042 1002084 1025099 1051138 1079662 1111128 1146334 1185430
62479 1185430 1227545 1270932 1313188 1351527 1383185 1405967 1418997 1423104 1419912 1409925 1391738 1363572
62467 1363572 1325309 1278595 1225422 1167466 1106594 1044916 983945 924275 866371 811232 760071
62456 760071 713764 672823 637548 607895 583365 563230 546859 533828 523777 516122 509917 504269
62444 504269 498982 494444 490817 487772 485210 483587 483071 482988 482720 482583 483037 483521 483063 481838 481034 481121 481189
$$ packed form
62529D42568M55J16R10J943K242K129K678M003N171N706O114O793P572Q509J0060
62514E06969J2106J3841J5082J6650J9028K1485K3142K4075K4823K5526K6095
62503G28822K6570K6752K6119K4590K2707K0662J7882J4119J0274P468N895N176
62491I37036N269O370Q388J1176J4803J9042K3015K6039K8524L1466L5206L9096
62479A185430M2115M3387M2256L8339L1658K2782J3030M107l192r987j8187k8166
62467A363572l8263m6714n3173n7956o0872o1678o0971n9670n7904n5139n1161
62456G60071m6307m0941l5275k9653k4530k0135j6371j3031j0051p655o205n648
62444E04269n287m538l627l045k562j623n16q3k68j37M54M84m58j225q04Q7O8
$$ plain form
62427 481189 480202 478201 475954 473974 472184 470214 467905 465680 464278 463795 463342 462175 460814 460301 460577
62412 460577 460496 459326 457386 455139 452623 450015 447906 446637 445945 445596 445798 446738 448232 450054 452114 454075
62396 454075 455373 455952 456592 458249 461303 465534 470384 475180 479479 483400 487357 491519 495858 500508 505541
62381 505541 510557 515231 520204 526672 534973 544240 553522 562581 571610 581045 591755 604499 618845
62368 618845 633509 648122 663835 681767 701806 723565 747685 775338 806995 842524 882127
62357 882127 926405 975697 1029969 1089114 1152769 1219981 1289464 1359826 1428969 1493569 1549970
62346 1549970 1595730 1629982 1652581 1663612 1663778 1654582 1637689 1614204 1584650 1549358 1508704 1463134
62334 1463134 1413238 1360030 1305244 1251158 1199775 1151970 1107488 1065704 1026237 988925 953694
$$ packed form
62427D81189r87k001k247j980j790j970k309k225j402m83m53j167j361n13K76
62412D60577q1j170j940k247k516k608k109j269o92l49K02R40J494J822K060J961
62396D54075J298N79O40J657L054M231M850M796M299L921L957M162M339M650N033
62381E05541N016M674M973O468Q301R267R282R059R029R435J0710J2744J4346
62368F18845J4664J4613J5713J7932K0039K1759K4120K7653L1657L5529L9603
62357H82127M4278M9292N4272N9145O3655O7212O9483P0362O9143O4600N6401
62346A549970M5760L4252K2599J1031J66r196j6893k3485k9554l5292m0654m5570
62334A463134m9896n3208n4786n4086n1383m7805m4482m1784l9467l7312l5231
$$ plain form
62323 953694 920650 889990 861593 834903 809424 785158 762386 741121 720936 701250 681770
62312 681770 662839 645398 630337 617725 606762 596568 586940 578368 571486 566473 562769 559424 555913
62299 555913 552559 549949 548139 546760 545746 545406 545773 546440 547189 548339 550210 552571 554884 556946 559126
62284 559126 562032 565896 570158 573854 576675 579474 583330 588292 593515 598468 603390 608597 614038 619734
62270 619734 626071 633423 641973 652123 664632 680089 698596 720146 744937 773155 804823 840046
62258 840046 879080 922146 969581 1022146 1080552 1144409 1212118 1281996 1352925 1423572 1491488
62247 1491488 1553407 1606246 1647664 1676273 1691831 1695038 1686831 1668027 1639715 1603446 1560585 1511736
62235 1511736 1457244 1398170 1336483 1274367 1213503 1154838 1098850 1046068 997334 953445 914563
$$ packed form
62323I53694l3044l0660k8397k6690k5479k4266k2772k1265k0185j9686j9480
62312F81770j8931j7441j5061j2612j0963j0194r628q572o882n013l704l345l511
62299E55913l354k610j810j379j014l40L67O67P49J150J871K361K313K062K180
62284E59126K906L864M262L696K821K799L856M962N223M953M922N207N441N696
62270F19734O337P352Q550J0150J2509J5457J8507K1550K4791K8218L1668L5223
62258H40046L9034M3066M7435N2565N8406O3857O7709O9878P0929P0647O7916
62247A491488O1919N2839M1418K8609J5558L207q207j8804k8312l6269m2861m8849
62235A511736n4492n9074o1687o2116o0864n8665n5988n2782m8734m3889l8882
$$ plain form
62224 914563 880208 849782 822809 798705 776762 756522 737915 720997 705735 692000 679491
62213 679491 667718 656380 645643 635765 626665 618237 610733 604264 598277 592290 586865 582898 580078
62200 580078 577152 573794 571159 570340 571299 573607 577152 581619 586324 591253 597473 605769 615594 626014
62186 626014 636962 648718 660861 672729 684614 697520 711813 726751 741304 754890 767369
62175 767369 778767 789095 798315 806635 814929 824543 836641 852076 871845 896939 927515 962903
62163 962903 1002720 1047334 1096855 1150312 1206054 1262122 1315817 1363915 1404172 1436154 1460143
62152 1460143 1476026 1483922 1484965 1480429 1470564 1455194 1434903 1410690 1382934 1351710 1317791 1282374
62140 1282374 1246094 1209313 1173097 1138810 1106779 1076342 1047280 1020237 995600 972736 950615
$$ packed form
62224I14563l4355l0426k6973k4104k1943k0240j8607j6918j5262j3735j2509
62213F79491j1773j1338j0737r878r100q428p504o469n987n987n425l967k820
62200E80078k926l358k635q19R59K308L545M467M705M929O220Q296R825J0420
62186F26014J0948J1756J2143J1868J1885J2906J4293J4938J4553J3586J2479
62175G67369J1398J0328R220Q320Q294R614J2098J5435J9769K5094L0576L5388
62163I62903L9817M4614M9521N3457N5742N6068N3695M8098M0257L1982K3989
62152A460143J5883P896J043m536r865j5370k0291k4213k7756l1224l3919l5417
62140A282374l6280l6781l6216l4287l2031l0437k9062k7043k4637k2864k2121
$$ plain form
62129 950615 928609 906546 884539 862963 842258 822750 804825 788940 775035 762300 750138
62118 750138 739035 729866 722776 717527 714518 714365 716593 719905 723889 729456 737437 747705 759934 774204
62104 774204 790208 806479 820959 831985 838674 841148 840918 840431 841605 844866 849713 855548 861516 866117
62090 866117 867826 866172 861932 856429 850953 846652 844459 844946 848394 854973 864757 877641 893437 912097
62076 912097 933734 958383 985766 1015301 1046379 1078634 1111885 1145827 1179893 1213497 1246311
62065 1246311 1278273 1309553 1340637 1372251 1404986 1439010 1474038 1509157 1542520 1571641 1594549
62054 1594549 1610637 1620228 1623555 1620487 1611040 1595678 1575119 1550094 1521232 1488861 1452955 1413544
62042 1413544 1371174 1326788 1281274 1235314 1189574 1144739 1101367 1059943 1021003 984999 951972
$$ packed form
62129I50615k2006k2063k2007k1576k0705j9508j7925j5885j3905j2735j2162
62118G50138j1103r169p090n249l009j53K228L312L984N567P981J0268J2229J4270
62104G74204J6004J6271J4480J1026O689K474k30m87J174L261M847N835N968M601
62090H66117J709j654m240n503n476m301k193M87L448O579R784J2884J5796J8660
62076I12097K1637K4649K7383K9535L1078L2255L3251L3942L4066L3604L2814
62065A246311L1962L1280L1084L1614L2735L4024L5028L5119L3363K9121K2908
62054A594549J6088R591L327l068r447j5362k0559k5025k8862l2371l5906l9411
62042A413544m2370m4386m5514m5960m5740m4835m3372m1424l8940l6004l3027
$$ plain form
62031 951972 921489 892995 866300 841786 820057 801242 784733 769828 756437 744750 734388
62020 734388 724544 714949 706020 697807 689497 680302 670261 659796 649132 638677 629387 622072 616633
62007 616633 612493 609456 607689 607210 607951 610042 613551 618222 623823 630386 637646 644710 650821 656042 660624
61992 660624 664073 665563 664937 662723 659367 655062 650023 644261 637331 628941 619624 610244 601095 592013
61978 592013 583073 574548 566544 559385 554025 551220 550437 550344 550241 550276 550482 550482 550119 549624 549174 548952 549562 551571
61960 551571 554654 557897 560871 563705 566193 567747 568282 568351 568270 567907 567557 568247 570820 575213 580785 586928
61944 586928 593376 600587 609835 622286 637795 655190 673733 693624 715022 737368 759952 782511
61932 782511 804972 827104 848618 869191 888294 905506 920929 934610 945602 952430 954715 953539
$$ packed form
62031I51972l0483k8494k6695k4514k1729j8815j6509j4905j3391j1687j0362
62020G34388r844r595q929q213q310r195j0041j0465j0664j0455r290p315n439
62007F16633m140l037j767m79P41K091L509M671N601O563P260P064O111N221M582
61992F60624L449J490o26k214l356m305n039n762o930q390r317r380r149r082
61978E92013q940q525q004p159n360k805p83r3j03L5K06%l63m95m50k22O10K009
61960E51571L083L243K974K834K488J554N35O9q1l63l50O90K573M393N572O143
61944E86928O448P211R248J2451J5509J7395J8543J9891K1398K2346K2584K2559
61932G82511K2461K2132K1514K0573J9103J7212J5423J3681J0992O828K285j176
$$ plain form
61920 953539 949968 944004 935365 924524 912437 899832 887403 876285 867720 862341 860101 860816 864632
61907 864632 872118 883875 899705 918201 937583 956893 975879 993684 1008423 1018416 1023322 1023811
61895 1023811 1020495 1013504 1002752 988356 971077 952392 933814 915985 898773 882173 866664 852630
61883 852630 840006 828647 818519 809347 800486 791302 781386 770439 758509 746360 734990 724653
61871 724653 714932 705843 698160 692383 688077 684587 681901 680385 680182 681265 683687 687418 692250 698238
61857 698238 705969 716097 728849 744230 762509 784226 809813 839253 871970 907110 944158 983122
61845 983122 1023758 1064807 1104499 1141706 1176078 1207182 1234221 1256619 1274185 1286542 1293023 1293389
61833 1293389 1288153 1278191 1264662 1249456 1235023 1223373 1215518 1211906 1212785 1218040 1227270 1240200 1256438
$$ packed form
61920I53539l571n964q639j0841j2087j2605j2429j1118q565n379k240P15L816
61907H64632P486J1757J5830J8496J9382J9310J8986J7805J4739R993M906M89
61895A023811l316o991j0752j4396j7279j8685j8578j7829j7212j6600j5509j4034
61883H52630j2624j1359j0128r172q861r184r916j0947j1930j2149j1370j0337
61871G24653r721r089p683n777m306l490k686j516k03J083K422L731M832N988
61857F98238P731J0128J2752J5381J8279K1717K5587K9440L2717L5140L7048L8964
61845I83122M0636M1049L9692L7207L4372L1104K7039K2398J7566J2357O481L66
61833A293389n236r962j3529j5206j4433j1650p855l612Q79N255R230J2930J6238
$$ plain form
61820 1256438 1274671 1292724 1308614 1321024 1328723 1330349 1325045 1312695 1293353 1267126 1234858 1198180
61808 1198180 1158564 1116958 1074544 1033017 993628 956669 922327 891369 864428 841208 820910
61797 820910 802900 786523 770886 755514 740844 727607 716060 706141 697879 691130 685325 679997
61785 679997 675285 671515 668590 666015 663248 659816 655578 651050 647025 643641 640420 637397 635459 635175
61771 635175 635912 636575 636676 636256 635425 634510 634186 634881 636403 638499 641275 644749 648560 652536 657001 662105
61755 662105 667466 672907 678768 684940 690381 694442 698073 702766 708613 714266 718620 721828 724720 727882
61741 727882 731316 734564 737162 739125 740831 742362 743455 744196 745119 746327 747232 747603 748103 749277 750698
61726 750698 751746 752516 753196 753299 752434 751310 750977 751460 752021 752438 753092 754064 755116 756445 758496 760968 762771
$$ packed form
61820A256438J8233J8053J5890J2410P699J626n304j2350j9342k6227l2268l6678
61808A198180l9616m1606m2414m1527l9389l6959l4342l0958k6941k3220k0298
61797H20910j8010j6377j5637j5372j4670j3237j1547r919q262o749n805n328
61785F79997m712l770k925k575k767l432m238m528m025l384l221l023j938k84
61771F35175P37O63J01m20q31r15l24O95J522K096K776L474L811L976M465N104
61755F62105N361N441N861O172N441M061L631M693N847N653M354L208K892L162
61741G27882L434L248K598J963J706J531J093P41R23J208R05L71N00J174J421
61726G50698J048P70O80J03q65j124l33M83N61M17O54R72J052J329K051K472J803
$$ plain form
61709 762771 763012 761540 758594 754541 749850 744774 739139 732945 726895 721724 717223 712623 707769 703180
61695 703180 699092 695230 691570 688615 686703 685486 684206 682206 679311 676060 673361 671534 669986 668234
61681 668234 666793 666357 666510 666152 665031 663923 663339 662985 662664 662769 663510 664323 664487 663911 662988 662052 661286 660822
61663 660822 660648 660554 660295 659741 658929 658237 658396 659906 662369 664801 666692 668461 670723 673455 676115 678373
61647 678373 680451 682735 685287 687862 690348 692921 695629 698117 700037 701525 702831 703632 703256 701572 699041
61632 699041 695882 691849 686999 681943 677088 672304 667653 663636 660302 656886 652931 649094 646200 644119
61618 644119 642292 640802 640087 640022 640018 639720 638917 637178 634267 630627 626724 622249 616633 609979 602732 594781
61602 594781 585826 576432 567834 560716 554861 549905 545702 541976 538326 534705 531397 528492 525739 522835
$$ packed form
61709G62771K41j472k946m053m691n076n635o194o050n171m501m600m854m589
61695G03180m088l862l660k955j912j217j280k000k895l251k699j827j548j752
61681F68234j441m36J53l58j121j108n84l54l21J05P41Q13J64n76r23r36p66m64
61663F60822j74r4k59n54q12o92J59J510K463K432J891J769K262K732K660K258
61647F78373K078K284K552K575K486K573K708K488J920J488J306Q01l76j684k531
61632F99041l159m033m850n056m855m784m651m017l334l416l955l837k894k081
61618F44119j827j490p15o5mk98q03j739k911l640l903m475n616o654p247p951
61602E94781q955r394q598p118n855m956m203l726l650l621l308k905k753k904
$$ plain form
61588 522835 519573 515901 512158 508851 505869 502439 498308 494322 491190 488360 485032 481685 479450 478239
61574 478239 476658 473725 469745 465496 461534 458341 456242 454960 453861 452739 451805 451048 450231 449398 448721
61559 448721 448029 447201 446774 447302 448292 448692 448317 447842 447443 446556 445119 444007 443899 444516 445246 445838 446262 446595
61541 446595 447264 448747 450803 452672 454173 455966 458532 461573 464644 467703 470703 473289 475254 476887
61527 476887 478481 479773 480055 478675 475484 471139 466912 463836 461989 460831 459949 459159 458285 457403 456948 456905
61511 456905 456280 454127 450877 447851 445696 444087 442658 441308 439764 437823 435981 434859 434098 432767 430791
61496 430791 428971 427656 426486 425474 425175 425537 425689 425206 424611 424368 424315 424389 424965 426079 427113 427609 427673 427405
61478 427405 426730 426020 425984 426730 427754 428969 430752 432805 434091 434300 434306 434740 435102 434803 434106 433478 432876 432213
$$ packed form
61588E22835l262l672l743l307k982l430m131l986l132k830l328l347k235j211
61574D78239j581k933l980m249l962l193k099j282j099j122r34p57q17q33o77
61559D48721o92q28m27N28R90M00l75m75l99q87j437j112j08O17P30N92M24L33
61541D46595O69J483K056J869J501J793K566L041L071L059L000K586J965J633
61527D76887J594J292K82j380l191m345m227l076j847j158q82p90q74q82m55m3
61511D56905o25k153l250l026k155j609j429j350j544j941j842j122p61j331j976
61496D30791j820j315j170j012k99L62J52m83n95k43n3P4N76J114J034M96O4k68
61478D27405o75p10l6P46J024J215J783K053J286K09OM34L62k99o97o28o02o63
$$ plain form
61460 432213 431705 431264 430429 429346 428877 429197 429338 428761 428362 429049 430293 431037 431270 431622 432027 431919 431466 431562
61442 431562 432690 434463 436277 437942 439812 442567 446579 451304 455736 459624 463540 467524 470566 472050
61428 472050 472915 474627 477535 480947 484255 487217 489620 491515 493514 496146 499033 501283 502620 503729
61414 503729 505543 508400 511598 513729 513942 512966 512290 512257 511790 510199 508119 506101 503411 499177 493934 488990
61398 488990 484871 481350 478477 476489 475011 473359 471580 470388 470175 470711 471706 472990 474228 474967 474920 473933
61382 473933 472086 470184 469546 470676 472617 474233 475595 477380 479462 481113 482250 483419 484701 485662 486424
61367 486424 487797 490084 492538 494358 495653 497090 498968 500966 502655 504114 506015 508970 512793 516791
61353 516791 520923 526078 532800 540326 547596 554771 562955 572595 583055 593775 605047 617440 631071
$$ packed form
61460D32213n08m41q35j083m69L20J41n77l99O87J244P44K33L52M05j08m53R6
61442D31562J128J773J814J665J870K755M012M725M432L888L916L984L042J484
61428D72050Q65J712K908L412L308K962K403J895J999K632K887K250J337J109
61414E03729J814K857L198K131K13r76o76l3m67j591k080k018k690m234n243m944
61398D88990m119l521k873j988j478j652j779j192k13N36R95J284J238P39m7r87
61382D73933j847j902o38J130J941J616J362J785K082J651J137J169J282R61P62
61367D86424J373K287K454J820J295J437J878J998J689J459J901K955L823L998
61353E16791M132N155O722P526P270P175Q184R640J0460J0720J1272J2393J3631
$$ plain form
61340 631071 645670 660889 676270 691183 704991 717053 726585 732813 735442 734824 731620 726439 719811
61327 719811 712272 704260 695905 687002 677405 667599 658648 651347 645567 640757 636845 634054 632047 630079
61313 630079 628136 627034 627080 627399 627143 626731 627292 629327 632441 636039 639780 643680 648215 654061 661406 669857
61297 669857 679213 689745 701313 712812 723069 731774 738922 743823 745405 743278 737905 730005 720366
61284 720366 710079 700301 691748 684634 678910 674286 670384 667274 665558 665507 666507 667770 669293 671619
61270 671619 675032 679485 685048 691862 699805 708649 718389 729074 740491 752300 764227 775852 786704
61257 786704 796964 807743 820108 834082 848980 864491 880982 898839 917783 936619 953431
61246 953431 966322 974230 976958 974541 967106 955309 940224 922638 903158 883136 864500 848196
$$ packed form
61340F31071J4599J5219J5381J4913J3808J2062R532O228K629o18l204n181o628
61327G19811p539q012q355q903r597r806q951p301n780m810l912k791k007j968
61313F30079j943j102M6L19k56m12N61K035L114L598L741L900M535N846P345Q451
61297F69857R356J0532J1568J1499J0257Q705P148M901J582k127n373p900r639
61284G20366j0287r778q553p114n724m624l902l110j716n1J000J263J523K326
61270F71619L413M453N563O814P943Q844R740J0685J1417J1809J1927J1625J0852
61257G86704J0260J0779J2365J3974J4898J5511J6491J7857J8944J8836J6812
61246I53431J2891P908K728k417p435j1797j5085j7586j9480k0022j8636j6304
$$ plain form
61234 848196 833613 820044 807923 798003 790130 783611 778305 774618 772790 772666 773706 774900 775350 775386
61220 775386 776338 778826 782062 785306 788928 793266 797515 800702 802924 804618 805477 805173 804357 803760 802996 801480
61204 801480 799951 799824 801405 803954 807080 810896 815132 819387 824042 829934 837330 846197 857115 870860
61190 870860 887353 906039 926915 950119 974949 1000454 1026703 1054205 1082293 1109320 1134220
61179 1134220 1156656 1175865 1190790 1201447 1208972 1214208 1217289 1218551 1218629 1217477 1214288 1208498 1200006
61166 1200006 1188516 1173695 1155989 1136317 1114979 1091758 1066932 1041219 1014967 988508 963011
61155 963011 939706 918412 898161 879228 863104 850420 840285 831862 825237 820418 816815 814154
61143 814154 812801 812842 813939 816446 821497 829425 838916 848055 855402 859957 861095 858984 854408 848088 840900
$$ packed form
61234H48196j4583j3569j2121r920p873o519n306l687j828j24J040J194M50L6
61220G75386R52K488L236L244L622M338M249L187K222J694Q59l04q16n97p64j516
61204H01480j529j27J581K549L126L816M236M255M655N892P396Q867J0918J3745
61190H70860J6493J8686K0876K3204K4830K5505K6249K7502K8088K7027K4900
61179A134220K2436J9209J4925J0657P525N236L081J262P8j152l189n790q492
61166A200006j1490j4821j7706j9672k1338k3221k4826k5713k6252k6459k5497
61155I63011k3305k1294k0251j8933j6124j2684j0135q423o625m819l603k661
61143H14154j353M1J097K507N051P928R491R139P347M555J138k111m576o320p188
$$ plain form
61128 840900 834439 830180 828134 827500 828614 832901 840866 851582 864413 879778 897872 918038 939968
61115 939968 964197 990801 1018804 1047486 1077169 1108106 1139590 1170706 1200974 1229805 1256326
61104 1256326 1280232 1301858 1321005 1336700 1348483 1356923 1362537 1365337 1365755 1364697 1362136 1356833 1347883
61091 1347883 1335348 1318959 1297697 1271404 1241493 1209290 1174934 1138780 1102552 1068027 1035521
61080 1035521 1004592 975306 947927 922309 898523 877321 859158 843517 829877 818498 809564
61069 809564 802362 795991 790166 784895 780242 776746 775056 774750 774713 774908 776362 779073 781686 783806 786778
61054 786778 791324 796409 801557 808253 817548 828095 838414 849476 863169 879548 897613 917544
61042 917544 940036 964415 989541 1015816 1044268 1074262 1104088 1133320 1162701 1192203 1221098
$$ packed form
61128H40900o461m259k046o34J114M287P965J0716J2831J5365J8094K0166K1930
61115I39968K4229K6604K8003K8682K9683L0937L1484L1116L0268K8831K6521
61104A256326K3906K1626J9147J5695J1783Q440N614K800M18j058k561n303q950
61091A347883j2535j6389k1262k6293k9911l2203l4356l6154l6228l4525l2506
61080A035521l0929k9286k7379k5618k3786k1202j8163j5641j3640j1379q934
61069H09564p202o371n825n271m653l496j690l06l7J95J454K711K613K120K972
61054G86778M546N085N148O696R295J0547J0319J1062J3693J6379J8065J9931
61042I17544K2492K4379K5126K6275K8452K9994K9826K9232K9381K9502K8895
$$ plain form
61031 1221098 1249563 1278442 1307711 1336813 1366035 1395818 1425199 1452818 1479259 1506685 1536388
61020 1536388 1568385 1603041 1641238 1683049 1727857 1775618 1826503 1879733 1934480 1991550 2052616
61009 2052616 2118559 2190574 2272261 2368362 2481809 2613999 2766957 2942563 3140715 3362146
60999 3362146 3613324 3905699 4250756 4659762 5147811 5732497 6427702 7244975 8203832
60990 8203832 9335492 10675688 12265528 14167608 16464346 19203832 22318451 25589771
60982 25589771 28698428 31319541 33202215 34221361 34423793 34053088 33494916 33126221 33148816
60973 33148816 33518494 33998215 34266563 34010511 32997858 31148441 28577144 25556825 22406297
60964 22406297 19380283 16628815 14218452 12164251 10446724 9024569 7851594 6887890
$$ packed form
61031A221098K8465K8879K9269K9102K9222K9783K9381K7619K6441K7426K9703
61020A536388L1997L4656L8197M1811M4808M7761N0885N3230N4747N7070O1066
61009B052616O5943P2015Q1687R6101J13447J32190J52958J75606J98152K21431
60999C362146K51178K92375L45057M09006M88049N84686O95205Q17273R58857
60990H203832J131660J340196J589840J902080K296738K739486L114619L271320
60982B5589771L108657K621113J882674J019146K02432l70705n58172l68695K2595
60973C3148816L69678M79721K68348k56052j012653j849417k571297l020319l150528
60964B2406297l026014k751468k410363k054201j717527j422155j172975r63704
$$ plain form
60956 6887890 6099065 5452814 4920761 4480854 4115051 3806520 3540982 3308798 3103625
60947 3103625 2920140 2754300 2603987 2467534 2342497 2227132 2121808 2027321 1942478 1864491
60937 1864491 1790847 1719553 1648516 1576444 1504145 1433659 1366284 1302426 1242913 1189005 1140993
60926 1140993 1097891 1058729 1023363 991873 963945 939140 917253 898214 881867 867862 855481
60915 855481 843812 832599 822693 815135 809931 806244 803624 802370 802735 804505 807429 811401 815969 820234
60901 820234 823558 825997 827784 828708 828112 825309 819949 812365 803528 794226 784229 772692 759443 745339
60887 745339 731272 717493 704164 691906 681260 671956 663197 654456 645701 637097 628800 620771 612643
60874 612643 604119 595725 588634 583378 579251 575441 572284 570755 571105 572655 574679 576864 579096 581545
$$ packed form
60956F887890p88825o46251n32053m39907l65803l08531k65538k32184k05173
60947C103625j83485j65840j50313j36453j25037j15365j05324r4487q4843p7987
60937A864491p3644p1294p1037p2072p2299p0486o7375o3858n9513n3908m8012
60926A140993m3102l9162l5366l1490k7928k4805k1887j9039j6347j4005j2381
60915H55481j1669j1213r906p558n204l687k620j254L65J770K924L972M568M265
60901H20234L324K439J787R24n96k803n360p584q837r302r997j1537j3249j4104
60887G45339j4067j3779j3329j2258j0646r304q759q741q755q604q297q029q128
60874F12643q524q394p091n256m127l810l157j529L50J550K024K185K232K449
$$ plain form
60860 581545 584872 589734 596063 603272 611006 619141 627295 635039 642509 650075 657430 663799 669075 673956
60846 673956 678829 683293 687029 690401 693860 697425 701056 704827 708239 709984 708985 705399 700208 694210
60832 694210 687676 680552 672570 663518 653769 644217 635393 627022 618765 610911 603852 597310 590618 583583
60818 583583 576632 570254 564621 559595 554834 550100 545593 541668 538106 534210 529939 526376 524503 523991
60804 523991 523788 523491 523450 523743 523918 523828 524119 525629 528616 532681 537246 542035 547181 552885 558986 565131
60788 565131 571353 578129 585773 594158 603144 612711 622500 631901 641021 650842 661826 673012 683311
60775 683311 693121 703646 714993 726103 736517 747035 758384 770212 781871 793403 805164 817125
60763 817125 829245 842161 856766 873099 890157 906981 923631 940978 959720 979793 1000696
$$ packed form
60860E81545L327M862O329P209P734Q135Q154P744P470P566P355O369N276M881
60846F73956M873M464L736L372L459L565L631L771L412J745r99l586n191n998
60832F94210o534p124p982r052r749r552q824q371q257p854p059o542o692p035
60818E83583o951o378n633n026m761m734m507l925l562l896m271l563j873n12
60804E23991k03k97m1K93J75r0K91J510K987M065M565M789N146N704O101O145
60788E65131O222O776P644Q385Q986R567R789R401R120R821J0984J1186J0299
60775F83311R810J0525J1347J1110J0414J0518J1349J1828J1659J1532J1761J1961
60763H17125J2120J2916J4605J6333J7058J6824J6650J7347J8742K0073K0903
$$ plain form
60752 1000696 1022144 1044200 1066846 1089730 1112489 1135190 1158249 1181921 1205825 1228843 1249497
60741 1249497 1266675 1280077 1289794 1295449 1296064 1290808 1279594 1262855 1241210 1215561 1187161 1157230
60729 1157230 1126608 1095840 1065222 1034710 1004292 974644 946866 921287 897174 874027 852516
60718 852516 833499 816723 801336 787218 774813 763854 753368 743077 733854 726385 720045 713569
60706 713569 706326 698479 690219 681398 671833 661605 650990 640301 629783 619488 609128 598254
60694 598254 586853 575775 566264 558865 553037 547983 543477 539502 535533 530964 526079 521788 518418 515562
60680 515562 513173 511813 511574 511784 512219 513687 516669 520227 522991 524594 525435 525724 525696 526175 527900 530535
60664 530535 533123 535182 536581 536838 535525 533194 530977 529429 528456 528090 528430 529086 529704 530912 533761 538235
$$ packed form
60752A000696K1448K2056K2646K2884K2759K2701K3059K3672K3904K3018K0654
60741A249497J7178J3402R717N655O15n256j1214j6739k1645k5649k8400k9931
60729A157230l0622l0768l0618l0512l0418k9648k7778k5579k4113k3147k1511
60718H52516j9017j6776j5387j4118j2405j0959j0486j0291r223p469o340o476
60706G13569p243p847q260q821r565j0228j0615j0689j0518j0295j0360j0874
60694E98254j1401j1078r511p399n828n054m506l975l969m569m885m291l370k856
60680E15562k389j360k39K10M35J468K982L558K764J603Q41K89k8M79J725K635
60664E30535K588K059J399K57j313k331k217j548r73l66L40O56O18J208K849M474
$$ plain form
60648 538235 543313 548562 554659 562021 569835 576905 582837 587966 592594 596652 599871 602066 603425 604487
60634 604487 605633 606775 607784 608855 609983 610501 609803 608246 606638 605127 603317 601211 599097 596699 593436
60619 593436 589490 585705 582425 579343 576504 574346 572540 569903 565950 561662 558255 555940 554341 553388
60605 553388 553104 553071 552720 551892 550728 549309 547758 546384 545400 544635 543648 541967 539323 536060 533261 531994
60589 531994 532380 533817 535967 538844 541991 544437 545790 546715 547965 549522 550978 552258 553537 554851 556198
60574 556198 557848 560306 564034 569205 575443 581969 588445 595590 604469 615306 627558 641068 656374
60561 656374 673829 693196 714237 736884 760378 782909 802562 818222 829270 834997 834869 829185
60549 829185 819201 806747 793780 781891 771956 764328 759273 757007 757552 761002 767733 777819 790592
$$ packed form
60648E38235N078N249O097P362P814P070N932N129M628M058L219K195J359J062
60634F04487J146J142J009J071J128N18o98j557j608j511j810k106k114k398l263
60619E93436l946l785l280l082k839k158j806k637l953m288l407k315j599r53
60605E53388k84l3l51q28j164j419j551j374r84p65r87j681k644l263k799j267
60589E31994L86J437K150K877L147K446J353R25J250J557J456J280J279J314J347
60574E56198J650K458L728N171O238O526O476P145Q879J0837J2252J3510J5306
60561F56374J7455J9367K1041K2647K3494K2531J9653J5660J1048N727j28n684
60549H29185r984j2454j2967j1889r935p628n055k266N45L450O731J0086J2773
$$ plain form
60536 790592 805548 823505 845912 872923 902987 934304 965579 995064 1020081 1038380 1049516
60525 1049516 1054331 1053594 1047670 1037147 1023326 1008143 993651 981167 970827 962330 955866 951639 948695
60512 948695 945362 941145 937261 934992 934487 935545 938465 943367 949519 956300 964278 974626 987905 1004155
60498 1004155 1023725 1047317 1075553 1109233 1149706 1198240 1255105 1319799 1391956 1471347 1556983
60487 1556983 1646704 1737660 1826687 1910006 1982845 2039748 2075729 2087674 2075005 2039125 1982465
60476 1982465 1908185 1820353 1723619 1622479 1521049 1423215 1332156 1249491 1175341 1109276 1050807
60465 1050807 999204 953703 914021 879962 850578 824582 801650 782273 766084 751452 737225
60454 737225 723836 712056 701621 691915 683157 675952 670152 665019 660106 655245 650148 644816 639997
$$ packed form
60536G90592J4956J7957K2407K7011L0064L1317L1275K9485K5017J8299J1136
60525A049516M815p37n924j0523j3821j5183j4492j2484j0340q497o464m227k944
60512I48695l333m217l884k269n05J058K920M902O152O781P978J0348J3279J6250
60498A004155J9570K3592K8236L3680M0473M8534N6865O4694P2157P9391Q5636
60487A556983Q9721R0956Q9027Q3319P2839N6903L5981J1945j2669l5880n6660
60476A982465p4280q7832r6734j01140j01430r7834r1059q2665p4150o6065n8469
60465A050807n1603m5501l9682l4059k9384k5996k2932j9377j6189j4632j4227
60454G37225j3389j1780j0435r706q758p205n800n133m913m861n097n332m819
$$ plain form
60441 639997 636453 633953 631661 629278 627131 625300 623384 621133 618776 616710 615242 614565 614585 614799 614604
60426 614604 613718 612160 610040 607543 604914 602255 599523 596872 594763 593546 593204 593595 594661 596220 597821
60411 597821 598938 599227 598720 598080 598365 599998 602104 603510 604256 605396 607417 609744 611834 613768 615581
60396 615581 616943 617828 618625 619317 619448 619249 619807 621682 624224 626703 629165 631694 633834 635401 636977 638832
60380 638832 640216 640507 640373 641018 642807 645255 647720 649502 650041 649766 650169 652407 656316 661135 666287 670935
60364 670935 673988 675470 676931 679504 682462 684754 686966 690329 694492 697815 699544 700345 700845 700938 700527
60349 700527 699908 699318 698877 698915 699687 701008 702811 705653 709869 714710 719247 723674 728668 733822 737896 740437
60333 740437 742010 742880 742541 740627 737371 733122 728296 723792 720600 718789 717595 716473 715414 714414 713519
$$ packed form
60441F39997l544k500k292k383k147j831j916k251k357k066j468o77K0K14j95
60426F14604q86j558k120k497k629k659k732k651k109j217l42L91J066J559J601
60411E97821J117K89n07o40K85J633K106J406P46J140K021K327K090J934J813
60396F15581J362Q85P97O92J31j99N58J875K542K479K462K529K140J567J576J855
60380F38832J384K91j34O45J789K448K465J782N39k75M03K238L909M819N152M648
60364F70935L053J482J461K573K958K292K212L363M163L323J729Q01N00R3m11
60349G00527o19n90m41L8P72J321J803K842M216M841M537M427M994N154M074K541
60333G40437J573Q70l39j914l256m249m826m504l192j811j194j122j059j000q95
$$ plain form
60318 713519 713425 715068 718363 722024 724918 727099 729421 732643 737042 742469 748684 755829 764543 775404
60304 775404 788544 804058 822447 844391 870484 901449 937812 978662 1021179 1061855 1097589
60293 1097589 1125209 1141186 1143227 1131863 1109658 1079428 1044086 1007215 972086 940088 911186
60282 911186 885573 863698 845040 828300 812771 798386 784671 771110 758493 748370 740841 734215
60270 734215 727166 720020 713502 707452 701425 695603 690481 686331 683450 682216 682449 683290 684026 684488 684553 683976
60254 683976 682997 682312 682119 681865 681241 680754 680959 681754 682789 684034 685507 686886 687761 687991 687551 686390 684641
60237 684641 682784 681437 681038 681556 682328 682488 681948 681633 682375 684027 686197 689198 693425 698282 702771 706869
60221 706869 711182 715417 718434 719895 720708 721651 722632 723598 725164 727873 731637 736280 741876 748166 754358
$$ packed form
60318G13519r4J643L295L661K894K181K322L222M399N427O215P145Q714J0861
60304G75404J3140J5514J8389K1944K6093L0965L6363M0850M2517M0676L5734
60293A097589K7620J5977K041j1364k2205l0230l5342l6871l5129l1998k8902
60282I11186k5613k1875j8658j6740j5529j4385j3715j3561j2617j0123p529o626
60270G34215p049p146o518o050o027n822n122m150k881j234K33Q41P36M62O5n77
60254F83976r79o85j93k54o24m87K05P95J035J245J473J379Q75K30m40j161j749
60237F84641j857j347l99N18P72J60n40l15P42J652K170L001M227M857M489M098
60221G06869M313M235L017J461Q13R43R81R66J566K709L764M643N596O290O192
$$ plain form
60206 754358 760012 765532 771430 777555 783401 788735 793665 798404 803071 807412 810735 812524 813056 813003 812621
60191 812621 811792 810576 809057 806942 804070 801055 798525 795918 792071 786912 781564 776749 772121 767311
60177 767311 762625 758437 754784 751752 749439 747315 744515 741034 737876 735862 735032 735259 736551 738515 740441
60162 740441 742201 744265 746628 748589 749849 750970 752430 754011 755380 756541 757505 758317 759634 762407 766703
60147 766703 771618 776540 781705 787364 793412 800111 808129 817399 826840 835675 844256 853211 862630 872522
60133 872522 883180 894589 906182 917586 928795 939195 947276 951849 952852 950622 945333 937737 929470
60120 929470 921829 914835 908140 902191 897810 895196 894023 894061 895042 896364 897540 898687 900110 901691 903057
60105 903057 904018 904532 904525 903937 902588 899979 895777 890551 885359 880487 875291 869509 863913 859332 855745 852720
$$ packed form
60206G54358N654N520N898O125N846N334M930M739M667M341L323J789N32n3l82
60191H12621q29j216j519k115k872l015k530k607l847n159n348m815m628m810
60177G67311m686m188l653l032k313k124k800l481l158k014q30K27J292J964J926
60162G40441J760K064K363J961J260J121J460J581J369J161R64Q12J317K773M296
60147G66703M915M922N165N659O048O699Q018R270R441Q835Q581Q955R419R892
60133H72522J0658J1409J1593J1404J1209J0400Q081M573J003k230n289p596q267
60120I29470p641o994o695n949m381k614j173L8R81J322J176J147J423J581J366
60105I03057R61N14pn88j349k609m202n226n192m872n196n782n596m581l587l025
$$ plain form
60089 852720 850210 848533 848062 849154 851960 856192 861538 868142 876062 884472 892298 899463 906429 912655
60075 912655 916823 918636 918954 917891 914286 907603 898892 889100 877783 864422 849967 836063 823609
60062 823609 812865 804039 796912 790584 784383 778344 772356 765854 758970 752807 747743 742608 736529 730509
60048 730509 725984 722818 720047 717775 716789 716853 716903 716791 717563 719999 723903 728790 734337 740065 745336 749790
60032 749790 753330 755751 756818 756554 755166 752918 750237 747420 743955 738754 731410 722611 712978 702361
60018 702361 690770 679161 668527 658925 650071 642206 635657 630193 625557 621951 619366 617184 615190
60005 615190 614179 614711 616131 617778 620313 624600 629929 634715 638581 642529 647208 652223 657116 661967
59991 661967 666924 671903 676849 681755 686528 691271 696421 702084 707607 712331 716315 719804 722553 724369
$$ packed form
60089H52720k510j677m71J092K806M232N346O604P920Q410P826P165O966O226
60075I12655M168J813L18j063l605o683q711r792j1317j3361j4455j3904j2454
60062H23609j0744q826p127o328o201o039n988o502o884o163n064n135o079o020
60048G30509m525l166k771k272r86O4N0j12P72K436L904M887N547N728N271M454
60032G49790L540K421J067k64j388k248k681k817l465n201p344q799r633j0617
60018G02361j1591j1609j0634r602q854p865o549n464m636l606k585k182j994
60005F15190j011N32J420J647K535M287N329M786L866L948M679N015M893M851
59991F61967M957M979M946M906M773M743N150N663N523M724L984L489K749J816
$$ plain form
59977 724369 725708 726871 727105 725390 721798 717251 712322 707160 702245 698250 695265 692931 691191 690220 689835
59962 689835 689612 689488 689709 690469 692041 694813 698613 702442 705496 707989 710370 712299 713176 713179 713000 712931 712940 713170
59944 713170 713594 713635 712945 712109 711774 711491 710269 707861 704773 701399 697954 694819 692122 689382 686325 683577
59928 683577 681748 680436 679027 677854 677503 677542 677170 676785 677639 680059 683101 685912 688478 691051 693708 696508
59912 696508 699439 702340 705347 708997 713343 717546 721016 724279 727911 731389 734038 736377 739328 742782
59898 742782 746204 749958 754576 759382 763506 767808 773906 781367 787731 791575 793899 796214 798916 802097
59884 802097 806370 811979 818118 823962 829652 835650 841824 847673 852916 857469 861280 864341 866427 866821
59870 866821 864872 860826 855553 849536 842736 835207 827080 818168 808436 798692 789961 782390 775650 770149
$$ packed form
59977G24369J339J163K34j715l592m547m929n162m915l995k985k334j740r71l85
59962F89835k23j24K21P60J572K772L800L829L054K493K381J929Q77Lj79o9RK30
59944G13170M24M1o90q36l35k83j222k408l088l374l445l135k697k740l057k748
59928F83577j829j312j409j173l51L9l72l85Q54K420L042K811K566K573K657K800
59912F96508K931K901L007L650M346M203L470L263L632L478K649K339K951L454
59898G42782L422L754M618M806M124M302O098P461O364L844K324K315K702L181
59884H02097M273N609O139N844N690N998O174N849N243M553L811L061K086L94
59870H66821j949m046n273o017o800p529q127q912r732r744q731p571o740n501
$$ plain form
59856 770149 766706 765115 764179 763185 762269 761350 759934 758224 757285 757771 759375 761757 765083 769332 773983 778790
59840 778790 784177 790676 798658 808731 821511 836725 853191 869839 886092 901184 913974 923737
59828 923737 930653 935467 939169 942834 946874 950369 951702 949731 943728 932694 916010 894808 871560
59815 871560 848159 825295 803693 784650 768975 756317 745978 737615 730867 725120 719987 715484
59803 715484 711567 708102 705252 703197 701473 699338 696717 694030 691206 687818 684148 681090 678942 677174
59789 677174 675459 673936 672412 670303 667513 664381 660720 655928 650275 645005 640927 637833 635478 634093
59775 634093 633600 633273 632661 632141 632238 633038 634379 635901 636899 636928 636581 636878 637958 639298 640992 643635 647002
59758 647002 650179 653180 657135 662538 668572 674541 680810 687787 695033 701986 708717 715515 722416 729411
$$ packed form
59856G70149l443j591r36r94r16r19j416j710r39M86J604K382L326M249M651M807
59840G78790N387O499P982J0073J2780J5214J6466J6648J6253J5092J2790R763
59828I23737O916M814L702L665M040L495J333j971o003j1034j6684k1202k3248
59815H71560k3401k2864k1602j9043j5675j2658j0339q363o748n747n133m503
59803G15484l917l465k850k055j724k135k621k687k824l388l670l058k148j768
59789F77174j715j523j524k109k790l132l661m792n653n270m078l094k355j385
59775F34093m93l27o12n20R7Q00J341J522R98K9l47K97J080J340J694K643L367
59758F47002L177L001L955N403O034N969O269O977P246O953O731O798O901O995
$$ plain form
59744 729411 736394 742730 747715 751503 754672 756896 757251 755899 754178 752781 751158 749047 747232 746249 745542
59729 745542 744511 743321 742127 740595 738740 737278 736582 736233 736000 736243 736902 737218 736923 736670 736849 737050 737145
59712 737145 737695 738814 739826 740634 742177 744857 747756 750154 752612 755733 759028 761926 764810 768062 771069
59697 771069 773225 775033 777316 780178 783666 788515 795094 802278 808339 812433 814417 813908 810582 805041
59683 805041 798616 792575 787882 785124 784136 784261 785329 787623 790630 792840 793301 792366 790400 786961 782005
59668 782005 776659 771749 766554 760073 752659 745356 738442 731770 725878 721628 719125 717873 717514 717700 717937
59653 717937 718366 720021 723434 727663 731584 735429 740018 745068 749294 751775 752351 751092 748290 744644 740672
59638 740672 736250 731246 726106 721251 716586 712267 709207 708028 708187 709014 710931 714646 719631 724302 727387
$$ packed form
59744G29411O983O336M985L788L169K224L55j352j721j397j623k111j815r83p07
59729G45542j031j190j194j532j855j462o96l49k33K43O59L16k95k53J79K01R5
59712G37145N50J119J012Q08J543K680K899K398K458L121L295K898K884L252L007
59697G71069K156J808K283K862L488M849O579P184O061M094J984n09l326n541
59683H05041o425o041m693k758r88J25J068K294L007K210M61r35j966l439m956
59668G82005n346m910n195o481p414p303o914o672n892m250k503j252l59J86K37
59653G17937M29J655L413M229L921L845M589N050M226K481N76j259k802l646l972
59638G40672m422n004n140m855m665m319l060j179J59Q27J917L715M985M671L085
$$ plain form
59623 727387 728539 728239 727814 728833 731604 734764 737036 738673 740351 741499 740835 738007 733651 728377 722755
59608 722755 717823 714524 712898 712639 713975 717062 721016 724594 727457 729783 731067 730484 728350 726107 724812
59593 724812 724372 724233 724080 723867 723715 723840 724261 724865 725886 727707 729763 730456 728816 725583 721944 717968
59577 717968 713208 708130 703733 700115 696505 692536 688553 684828 681299 678009 675129 672608 670353 668598
59563 668598 667609 667252 667237 667489 667920 668291 668655 669409 670540 671441 671888 672526 673946 675969 678282 680942 683782
59546 683782 686251 688441 691291 695065 698694 701533 704734 709857 717044 725769 736548 750550 767997
59533 767997 787957 809178 829954 847656 859646 864752 863514 857692 850140 844112 841423 841676 843925
59520 843925 848217 854620 861835 868183 873375 878050 882055 884287 883774 880047 873092 863870 854146 844881
$$ packed form
59623G27387J152l00m25J019K771L160K272J637J678J148o64k828m356n274n622
59608G22755m932l299j626k59J336L087L954L578K863K326J284n83k134k243j295
59593G24812m40j39j53k13j52J25M21O04J021J821K056O93j640l233l639l976
59577G17968m760n078m397l618l610l969l983l725l529l290k880k521k255j755
59563F68598r89l57j5K52M31L71L64P54J131R01M47O38J420K023K313K660K840
59546F83782K469K190K850L774L629K839L201N123P187Q725J0779J4002J7447
59533G67997J9960K1221K0776J7702J1990N106j238n822p552o028k689K53K249
59520H43925M292O403P215O348N192M675M005K232n13l727o955r222r724r265
$$ plain form
59506 844881 835578 826042 817547 811040 805440 799262 792863 787349 782353 776912 771838 769031 768796 769848
59492 769848 771683 774918 779353 783678 787361 791141 795455 800005 805097 811931 821201 832653 846201 862280
59478 862280 880970 901934 925322 951575 980368 1010786 1042332 1074391 1104780 1130204 1148337
59467 1148337 1158474 1160439 1154326 1141431 1124230 1105315 1087206 1072774 1064410 1062736 1067231 1077782
59455 1077782 1094416 1116062 1141243 1169764 1202081 1237370 1274133 1312714 1355262 1402883 1454334
59444 1454334 1507359 1559067 1604515 1637061 1651330 1645070 1618412 1573520 1515572 1451854 1388306
59433 1388306 1327753 1271606 1221265 1176861 1136514 1098454 1062872 1030654 1001607 975355 952941
59422 952941 936033 925079 919426 918729 923107 932345 946057 964302 987037 1013174 1041242 1071087
$$ packed form
59506H44881r303r536q495o507n600o178o399n514m996n441n074k807k35J052
59492G69848J835L235M435M325L683L780M314M550N092O834R270J1452J3548J6079
59478H62280J8690K0964K3388K6253K8793L0418L1546L2059L0389K5424J8133
59467A148337J0137J965o113j2895j7201j8915j8109j4432q364j674M495J0551
59455A077782J6634K1646K5181K8521L2317L5289L6763L8581M2548M7621N1451
59444A454334N3025N1708M5448L2546J4269o260k6658m4892n7948o3718o3548
59433A388306o0553n6147n0341m4404m0347l8060l5582l2218k9047k6252k2414
59422I52941j6908j0954n653o97M378R238J3712J8245K2735K6137K8068K9845
$$ plain form
59410 1071087 1104060 1141094 1180707 1218662 1249049 1265897 1265073 1246237 1213709 1174926 1137028 1104519
59398 1104519 1080081 1066491 1065785 1076066 1090714 1101866 1103989 1093950 1070055 1033401 989239 944509
59386 944509 903672 867877 837268 812005 791308 773760 759038 747909 740304 734881 730667 727685
59374 727685 725726 724004 722377 721553 721739 722222 722549 722946 723500 724183 725667 728765 732987 737138 741378 747051
59358 747051 754280 761550 768101 775014 783266 792437 802196 813598 827841 844848 863923 884813 907440
59345 907440 931483 956849 983592 1011011 1037831 1063643 1088997 1113665 1135990 1154372 1168152
59334 1168152 1176715 1179221 1175912 1168258 1157114 1142089 1123483 1103296 1083161 1062550 1040362 1017306
59322 1017306 995394 975748 958099 941959 927209 913743 901349 889886 879220 869287 860390 852951
$$ packed form
59410A071087L2973L7034L9613L7955L0387J6848q24j8836l2528l8783l7898l2509
59398A104519k4438j3590p06J0281J4648J1152K123j0039k3895l6654m4162m4730
59386I44509m0837l5795l0609k5263k0697j7548j4722j1129p605n423m214k982
59374G27685j959j722j627q24J86M83L27L97N54O83J484L098M222M151M240N673
59358G47051P229P270O551O913Q252R171R759J1402J4243J7007J9075K0890K2627
59345I07440K4043K5366K6743K7419K6820K5812K5354K4668K2325J8382J3780
59334A168152Q563K506l309p654j1144j5025j8606k0187k0135k0611k2188k3056
59322A017306k1912j9646j7649j6140j4750j3466j2394j1463j0666r933q897p439
$$ plain form
59310 852951 846819 841443 836783 833249 830628 828067 825385 823432 822778 822970 823428 824203 825497 827304 829885
59295 829885 833775 839026 845206 852271 860628 870378 881558 895141 912569 934087 958557 984787 1011493
59282 1011493 1035831 1053735 1062588 1062607 1055462 1042991 1027637 1012437 999589 989923 984120 983121 986908
59269 986908 994261 1004243 1016620 1030376 1043379 1054224 1063035 1069804 1073363 1072780 1068339 1060372 1048478
59256 1048478 1032735 1014389 994592 973720 952584 932750 914764 897527 880421 864720 851878
59245 851878 841780 833651 827389 822897 819430 816777 815971 817763 821539 826698 833792 843133 853478 863353
59231 863353 872618 881605 889762 896322 901286 904615 905400 902957 897762 890323 880247 867585 853941 840921
59217 840921 828446 815830 803648 793133 784479 776969 770203 764119 758396 752849 747931 744127 741475
$$ packed form
59310H52951o132n376m660l534k621k561k682j953o54J92M58P75J294J807K581
59295H29885L890N251O180P065Q357R750J1180J3583J7428K1518K4470K6230K6706
59282A011493K4338J7904Q853J9p145j2471j5354j5200j2848r666n803r99L787
59269I86908P353R982J2377J3756J3003J0845Q811O769L559n83m441p967j1894
59256A048478j5743j8346j9797k0872k1136j9834j7986j7237j7106j5701j2842
59245H51878j0098q129o262m492l467k653q06J792L776N159P094R341J0345R875
59231H63353R265Q987Q157O560M964L329P85k443n195p439j0076j2662j3644j3020
59217H40921j2475j2616j2182j0515q654p510o766o084n723n547m918l804k652
$$ plain form
59204 741475 740147 740566 742368 744353 746079 748332 751419 754456 757100 760416 765020 769880 774153 778682
59190 778682 784387 790625 796583 802883 810266 817930 824736 830920 837103 842742 847156 851012 855226 859509
59176 859509 863509 868247 874633 881587 887413 892232 897418 903522 910423 918638 928617 939466 950124 961135
59162 961135 973521 986590 998598 1008885 1017546 1023591 1025510 1023444 1019023 1013129 1005359 995471 983923
59149 983923 971061 957068 942529 927997 913428 899063 886152 875561 866329 857006 847777 839922
59137 839922 833861 829124 825618 823401 821792 820170 819116 819432 820663 821995 823843 827029 831159 835460
59123 835460 840499 847304 855381 863396 871364 880375 890569 901091 911765 923088 934854 946339 957522
59110 957522 968611 978830 987327 994911 1003161 1012072 1020218 1026947 1032824 1038170 1042804 1046987 1050998 1053911
$$ packed form
59204G41475j328M19J802J985J726K253L087L037K644L316M604M860M273M529
59190G78682N705O238N958O300P383P664O806O184O183N639M414L856M214M283
59176H59509M000M738O386O954N826M819N186O104O901Q215R979J0849J0658J1011
59162I61135J2386J3069J2008J0287Q661O045J919k066m421n894p770r888j1548
59149I83923j2862j3993j4539j4532j4569j4365j2911j0591r232r323r229p855
59137H39922o061m737l506k217j609j622j054L16J231J332J848L186M130M301
59123H35460N039O805Q077Q015P968R011J0194J0522J0674J1323J1766J1485J1183
59110I57522J1089J0219Q497P584Q250Q911Q146O729N877N346M634M183M011K913
$$ plain form
59096 1053911 1054269 1051797 1047252 1041149 1034135 1027948 1024163 1022316 1020863 1019475 1018650 1017660 1014949 1010275 1004512
59081 1004512 997558 988412 977237 965355 953202 940147 926314 912776 899909 887331 875466 865321
59069 865321 856741 848642 840989 834765 830057 826066 822963 821731 822029 822210 821749 821711 822535 823301 823627 824381
59053 824381 825880 827043 826976 825894 824047 821235 817880 815097 813209 811565 810222 810363 812610 816317 821020
59038 821020 827251 835301 844281 852906 860315 865893 869260 870700 870860 870158 869302 869863 873087 878574 885379
59023 885379 893888 905068 918509 933022 948651 965960 983668 999293 1012155 1023420 1032963 1038598
59011 1038598 1039106 1035955 1031274 1025979 1020577 1015978 1012497 1009468 1006629 1004712 1004277 1005306 1008305 1014306
58997 1014306 1023240 1033665 1044530 1055954 1068018 1080171 1092048 1103494 1113584 1121028 1125604 1127704
$$ packed form
59096A053911L58k472m545o103p014o187l785j847j453j388q25r90k711m674n763
59081A004512o954r146j1175j1882j2153j3055j3833j3538j2867j2578j1865j0145
59069H65321q580q099p653o224m708l991l103j232K98J81m61l8Q24P66L26P54
59053H24381J499J163o7j082j847k812l355k783j888j644j343J41K247L707M703
59038H21020O231Q050Q980Q625P409N578L367J440J60p02q56N61L224N487O805
59023H85379Q509J1180J3441J4513J5629J7309J7708J5625J2862J1265R543N635
59011A038598N08l151m681n295n402m599l481l029k839j917m35J029K999O001
58997A014306Q934J0425J0865J1424J2064J2153J1877J1446J0090P444M576K100
$$ plain form
58985 1127704 1126528 1120467 1109426 1095031 1078492 1060175 1041332 1024078 1009144 995594 983235 973340
58973 973340 966576 962268 960368 962052 967632 975864 986125 999257 1015320 1032541 1049705 1067811 1088045
58960 1088045 1109593 1130620 1150016 1167005 1180276 1188646 1191619 1188630 1178953 1163081 1142961 1120177
58948 1120177 1095139 1068594 1042462 1018313 996260 976033 957921 942073 928224 916732 908591
58937 908591 903827 901053 899027 897347 895393 892250 888085 883982 879893 874469 867393 860067 853350 846477
58923 846477 838958 831726 825534 819952 814777 810728 807931 805478 803372 803154 805639 809753 814497 820278
58909 820278 827337 834801 842457 851679 863293 876246 889645 904488 922036 942056 964015 988419
58897 988419 1015469 1043655 1071108 1097266 1122171 1145529 1167649 1190028 1213899 1239482 1267557
$$ packed form
58985A127704j176o061j1041j4395j6539j8317j8843j7254j4934j3550j2359r895
58973I73340o764m308j900J684N580Q232J0261J3132J6063J7221J7164J8106K0234
58960A088045K1548K1027J9396J6989J3271Q370K973k989r677j5872k0120k2784
58948A120177k5038k6545k6132k4149k2053k0227j8112j5848j3849j1492q141
58937I08591m764k774k026j680j954l143m165m103m089n424p076p326o717o873
58923H46477p519p232o192n582n175m049k797k453k106k18K485M114M744N781
58909H20278P059P464P656R222J1614J2953J3399J4843J7548K0020K1959K4404
58897I88419K7050K8186K7453K6158K4905K3358K2120K2379K3871K5583K8075
$$ plain form
58886 1267557 1300083 1337937 1379414 1422083 1464600 1505455 1541754 1571036 1593118 1608744 1617540
58875 1617540 1618575 1611623 1596542 1572739 1540715 1502949 1461931 1418597 1373961 1330757 1291701 1257166
58863 1257166 1226059 1197862 1172276 1148092 1124220 1101056 1079306 1058264 1036724 1014883 993919
58852 993919 974337 955948 938786 922899 907949 894065 882238 872881 864845 856799 848629 840598
58840 840598 832269 823348 814451 805933 797019 787217 777468 768798 760900 753156 745912 739659 734124 729263
58826 729263 725891 724082 722243 719154 715800 713878 713648 714570 716884 720954 725998 730916 735667 740615 745409
58811 745409 749628 753606 757438 760118 760779 759922 758421 756378 753903 751787 750309 748526 745842 743109 741165
58796 741165 739607 738095 737359 737694 737857 736869 735561 735030 735001 735088 736283 739602 744554 750433 757776 767013
$$ packed form
58886A267557L2526L7854M1477M2669M2517M0855L6299K9282K2082J5626Q796
58875A617540J035o952j5081k3803l2024l7766m1018m3334m4636m3204l9056l4535
58863A257166l1107k8197k5586k4184k3872k3164k1750k1042k1540k1841k0964
58852I93919j9582j8389j7162j5887j4950j3884j1827r357q036q046q170q031
58840H40598q329q921q897q518q914r802r749q670p898p744p244o253n535m861
58826G29263l372j809j839l089l354j922k30R22K314M070N044M918M751M948M794
58811G45409M219L978L832K680O61q57j501k043k475k116j478j783k684k733j944
58796G41165j558j512p36L35J63r88j308n31k9Q7J195L319M952N879P343R237
$$ plain form
58780 767013 776976 786383 795657 805700 816012 825503 833925 841023 845549 846735 845602 843337 839645 834164
58766 834164 828035 822357 816369 808965 800738 792851 785208 777569 771211 767549 766199 766148 767644 771137 775545
58751 775545 779487 783128 787022 790371 792370 794067 796881 800390 803602 807269 812733 819501 826077 832393
58737 832393 839336 846719 853779 860904 868896 877279 885310 893843 904320 916600 929610 943254 957840
58724 957840 972520 986280 999683 1013745 1027979 1041509 1055263 1070935 1088381 1105927 1122703
58713 1122703 1138877 1154225 1168131 1180370 1190424 1196826 1198593 1196340 1190622 1180558 1165617 1147230
58701 1147230 1126795 1103565 1076433 1046284 1014585 981315 946598 912795 882410 855192 829717
58690 829717 806394 786349 768766 752213 737451 726072 717277 708721 699633 690556 681149 671079
$$ packed form
58780G67013R963R407R274J0043J0312R491Q422P098M526J186j133k265l692n481
58766H34164o129n678n988p404q227p887p643p639o358l662j350n1J496L493M408
58751G75545L942L641L894L349J999J697K814L509L212L667N464O768O576O316
58737H32393O943P383P060P125P992Q383Q031Q533J0477J2280J3010J3644J4586
58724I57840J4680J3760J3403J4062J4234J3530J3754J5672J7446J7546J6776
58713A122703J6174J5348J3906J2239J0054O402J767k253n718j0064j4941j8387
58701A147230k0435k3230k7132l0149l1699l3270l4717l3803l0385k7218k5475
58690H29717k3323k0045j7583j6553j4762j1379q795q556r088r077r407j0070
$$ plain form
58678 671079 661994 655673 651129 646452 642495 641603 643536 645906 648058 651327 655996 661300 668181 678741
58664 678741 692922 708613 724951 742624 760920 777320 790174 799341 804362 804619 801276 796547 791151
58651 791151 784637 777745 771852 766488 759976 752191 744284 736339 727957 720477 715711 712999 710410 708344
58637 708344 708893 712116 716057 720130 725316 731338 736797 741875 747635 752815 754649 752876 749757 746236
58623 746236 741429 735968 732246 730900 730296 730034 731978 737370 745789 757195 772043 789149 806356 823435
58609 823435 841306 858453 871461 879272 883540 884649 881098 873333 864461 856140 847097 836612 826187
58596 826187 816671 806889 796361 786564 778408 771146 764728 760692 759822 761356 765108 771903 781453 792408
58582 792408 804887 820266 838191 856567 874692 893359 911699 927207 939368 950066 960017 968209
$$ packed form
58678F71079r085o321m544m677l957q92J933K370K152L269M669N304O881J0560
58664F78741J4181J5691J6338J7673J8296J6400J2854R167N021K57l343m729n396
58651G91151o514o892n893n364o512p785p907p945q382p480m766k712k589k066
58637G08344N49L223L941M073N186O022N459N078N760N180J834j773l119l521
58623G46236m807n461l722j346o04k62J944N392Q419J1406J4848J7106J7207J7079
58609H23435J7871J7147J3008P811M268J109l551p765q872q321r043j0485j0425
58596H26187r516r782j0528r797q156p262o418m036q70J534L752O795R550J0955
58582G92408J2479J5379J7925J8376J8125J8667J8340J5508J2161J0698R951Q192
$$ plain form
58570 968209 975356 984311 996191 1009499 1023906 1041455 1063043 1087066 1112580 1140456 1170254 1199275
58558 1199275 1225913 1250840 1273691 1291775 1303341 1309183 1309971 1305101 1295227 1282801 1268895 1252433
58546 1252433 1233536 1214495 1196496 1178626 1161065 1145784 1132787 1119030 1102479 1084135 1064902
58535 1064902 1043842 1020913 998172 976825 956124 936368 919740 907016 896710 888580 884392 884011
58523 884011 884506 884670 886742 892022 898474 904363 910514 917061 921755 923710 925377 928539 931619 933041 933934
58508 933934 935337 936000 935267 935017 936379 937482 936644 934924 933502 931471 928278 925383 923466 920865 916659
58493 916659 912319 908540 903696 897312 891741 888323 885246 881323 878567 878740 880693 883460 888702 897642
58479 897642 908717 920678 934923 952336 970880 988596 1005818 1022083 1034152 1039763 1040391 1037861
$$ packed form
58570I68209P147Q955J1880J3308J4407J7549K1588K4023K5514K7876K9798K9021
58558A199275K6638K4927K2851J8084J1566N842P88m870r874j2426j3906j6462
58546A252433j8897j9041j7999j7870j7561j5281j2997j3757j6551j8344j9233
58535A064902k1060k2929k2741k1347k0701j9756j6628j2724j0306q130m188l81
58523H84011M95J64K072N280O452N889O151O547M694J955J667L162L080J422Q93
58508I33934J403O63p33k50J362J103q38j720j422k031l193k895j917k601m206
58493I16659m340l779m844o384n571l418l077l923k756J73J953K767N242Q940
58479H97642J1075J1961J4245J7413J8544J7716J7222J6265J2069N611O28k530
$$ plain form
58467 1037861 1031285 1019832 1005538 990852 976173 961936 950023 940817 932002 922553 914870 910872
58455 910872 909319 909136 911796 918056 925848 933771 943009 953394 961406 964689 964805 963009 957450 947467
58441 947467 936555 927764 919947 911694 905069 902024 900869 899832 900484 904230 909049 913185 918455 926444
58427 926444 935132 942862 951929 964477 978497 991598 1005042 1020160 1034434 1045146 1053402 1060640
58415 1060640 1064866 1064497 1062396 1061785 1061401 1058730 1054575 1050262 1043836 1033440 1021312 1010212 999076 986257
58401 986257 973716 963887 955719 947864 942197 940057 938767 936153 934747 937042 940481 941678 941712 942463 941810
58386 941810 937592 932505 929825 927988 924547 921639 922049 923608 923128 922326 924227 927292 928822 930666 935703
58371 935703 942119 947044 952378 961079 971133 979316 987466 998831 1011546 1022160 1032294 1045423 1060208
$$ packed form
58467A037861o576j1453j4294j4686j4679j4237j1913r206q815r449p683l998
58455I10872j553j83K660O260P792P923R238J0385Q012L283J16j796n559r983
58441I47467j0912q791p817q253o625l045j155j037O52L746M819M136N270P989
58427I26444Q688P730R067J2548J4020J3101J3444J5118J4274J0712Q256P238
58415A060640M226l69k101o11l84k671m155m313o426j0396j2128j1100j1136j2819
58401I86257j2541r829q168p855n667k140j290k614j406K295L439J197L4P51o53
58386I41810m218n087k680j837l441k908M10J559m80q02J901L065J530J844N037
58371I35703O416M925N334Q701J0054Q183Q150J1365J2715J0614J0134J3129J4785
$$ plain form
58358 1060208 1073508 1086747 1102637 1118659 1130474 1138820 1146547 1152103 1152800 1151317 1151939 1153394 1152451
58345 1152451 1151361 1154365 1159873 1163713 1167230 1174566 1184648 1193687 1202953 1216217 1231965 1246056 1259727
58332 1259727 1277034 1296669 1314280 1330672 1349625 1369643 1385869 1398162 1409512 1418715 1422724 1424020
58320 1424020 1427483 1432009 1433315 1432691 1434725 1438744 1440982 1442824 1448264 1455614 1460605 1465350 1475247 1489299
58306 1489299 1502570 1515719 1532720 1551680 1567642 1582151 1600196 1620076 1636444 1650947 1669234
58295 1669234 1689623 1705689 1718208 1733508 1751707 1767784 1782721 1802213 1825608 1847406 1868417
58284 1868417 1894026 1922832 1948618 1972242 1999800 2030423 2058009 2083663 2113954 2148141 2179793
58273 2179793 2209795 2244695 2283469 2319421 2354173 2395900 2444427 2492081 2538607 2590975 2649079
$$ packed form
58358A060208J3300J3239J5890J6022J1815Q346P727N556O97j483O22J455r43
58345A152451j090L004N508L840L517P336J0082R039R266J3264J5748J4091J3671
58332A259727J7307J9635J7611J6392J8953K0018J6226J2293J1350R203M009J296
58320A424020L463M526J306o24K034M019K238J842N440P350M991M745R897J4052
58306A489299J3271J3149J7001J8960J5962J4509J8045J9880J6368J4503J8287
58295A669234K0389J6066J2519J5300J8199J6077J4937J9492K3395K1798K1011
58284A868417K5609K8806K5786K3624K7558L0623K7586K5654L0291L4187L1652
58273B179793L0002L4900L8774L5952L4752M1727M8527M7654M6526N2368N8104
$$ plain form
58262 2649079 2706294 2763661 2828517 2899445 2967804 3033635 3104335 3178173 3245690 3307228 3372192
58251 3372192 3441082 3505822 3567952 3638210 3717444 3796506 3875852 3966052 4067940 4171981 4278560
58240 4278560 4398528 4532124 4668347 4806929 4959264 5125736 5294945 5467715 5658287
58231 5658287 5868831 6087236 6313322 6561756 6835213 7120998 7418609 7743525 8099269
58222 8099269 8474238 8871051 9309133 9793136 10310519 10866074 11485153 12176415 12927571
58213 12927571 13745533 14662513 15694241 16833810 18097320 19532092 21169485 23018660
58205 23018660 25121540 27563752 30418674 33741010 37636527 42276895 47824864 54413836
58197 54413836 62223041 71490038 82423492 95212231 110176172 127810652 148655767
$$ packed form
58262B649079N7215N7367O4856P0928O8359O5831P0700P3838O7517O1538O4964
58251C372192O8890O4740O2130P0258P9234P9062P9346R0200J01888J04041J06579
58240D278560J19968J33596J36223J38582J52335J66472J69209J72770J90572
58231E658287K10544K18405K26086K48434K73457K85785K97611L24916L55744
58222H099269L74969L96813M38082M84003N17383N55555O19079O91262P51156
58213A2927571Q17962R16980J031728J139569J263510J434772J637393J849175
58205B3018660K102880K442212K854922L322336L895517M640368N547969O588972
58197E4413836P809205R266997J0933454J2788739J4963941J7634480K0845115
$$ plain form
58190 148655767 173300261 202566287 237279991 277249644 320189924 361738020 396636282
58183 396636282 420083943 428628235 420881724 398183676 364494319 325039860 284507631
58176 284507631 246080121 211572132 181888957 157242653 137318679 121625805 109779464
58169 109779464 101434356 96036283 92742442 90559631 88510897 85749844 81689887 76150009
58161 76150009 69400204 62025491 54669025 47806409 41671842 36328924 31767720 27935757
58153 27935757 24733004 22040658 19767490 17851261 16227472 14829401 13616296 12571071
58145 12571071 11668522 10871686 10159226 9528570 8968716 8455034 7974270 7530361 7121269
58136 7121269 6733130 6361945 6018673 5707220 5417769 5146832 4903615 4690824 4498163
$$ packed form
58190A48655767K4644494K9266026L4713704L9969653M2940280M1548096L4898262
58183C96636282K3447661Q544292p746511k2698048l3689357l9454459m0532229
58176B84507631l8427510l4507989k9683175k4646304j9923974j5692874j1846341
58169A09779464q345108n398073l293841k182811k048734k761053m059957n539878
58161G6150009o749805p374713p356466o862616o134567n342918m561204l831963
58153B7935757l202753k692346k273168j916229j623789j398071j213105j045225
58145A2571071r02549p96836p12460o30656n59854n13682m80764m43909m09092
58136G121269l88139l71185l43272l11453k89451k70937k43217k12791j92661
$$ plain form
58127 4498163 4320247 4162425 4023259 3889166 3752502 3618421 3488802 3356418 3220699
58118 3220699 3092559 2977103 2866808 2757722 2657141 2569043 2486590 2405569 2331335 2266161
58108 2266161 2203185 2139156 2080219 2028937 1978233 1924253 1872872 1827397 1781991 1733442 1687540
58097 1687540 1647402 1606881 1562085 1518573 1480757 1444664 1407560 1374481 1348728 1325496 1301224
58086 1301224 1279994 1264650 1250595 1234308 1219164 1207035 1192833 1173235 1152521 1134147 1114779
58075 1114779 1092126 1070425 1052431 1033948 1012035 990947 974338 958990 941796 925714 913314
58064 913314 901442 887665 875277 866754 858907 849443 841547 836952 831186 820850 809204 799631 789973
58051 789973 778270 767686 760628 754059 745542 737972 733555 729117 722143 715554 711760 707848 701407 695227
$$ packed form
58127D498163j77916j57822j39166j34093j36664j34081j29619j32384j35719
58118C220699j28140j15456j10295j09086j00581q8098q2453q1021p4234o5174
58108B266161o2976o4029n8937n1282n0704n3980n1381m5475m5406m8549m5902
58097A687540m0138m0521m4796m3512l7816l6093l7104l3079k5753k3232k4272
58086A301224k1230j5344j4055j6287j5144j2129j4202j9598k0714j8374j9368
58075A114779k2653k1701j7994j8483k1913k1088j6609j5348j7194j6082j2400
58064I13314j1872j3777j2388q523p847r464p896m595n766j0336j1646r573r658
58051G89973j1703j0584p058o569q517p570m417m438o974o589l794l912o441o180
$$ plain form
58037 695227 691494 687193 680063 673293 669417 665223 657615 648980 641833 633725 622431 610782 601352 591690
58023 591690 579828 569195 562882 558086 551370 544514 540116 536388 531377 527418 526193 524226 518596 512409
58009 512409 509319 507329 503436 499800 499516 500503 499426 497803 498592 500375 500527 500562 502900 505707 506402 506921
57993 506921 510158 514392 516563 517963 521300 525125 526569 526863 528842 531514 532192 531569 531755 531696 529380 526217
57977 526217 524576 523437 521044 519185 520065 521545 520444 518141 517953 519261 519220 518202 518492 519508 519243 518740
57961 518740 520335 522997 524104 524336 526270 529454 531243 531220 530664 529055 525245 520697 517576 514971 510848
57946 510848 506218 503480 502242 500639 499154 499235 499776 498962 497999 499024 500991 501669 502143 505133 510339 515567
57930 515567 521018 528167 535683 540803 543820 547189 551154 554203 556859 561092 566804 572541 578649 586011
$$ packed form
58037F95227l733m301p130o770l876m194p608q635p147q108j1294j1649r430r662
58023E91690j1862j0633o313m796o716o856m398l728n011l959j225j967n630o187
58009E12409l090j990l893l636k84R87j077j623P89J783J52L5K338K807O95N19
57993E06921L237M234K171J400L337L825J444K94J979K672O78o23J86n9k316l163
57977E26217j641j139k393j859Q80J480j101k303j88J308m1j018K90J016k65n03
57961E18740J595K662J107K32J934L184J789k3n56j609l810m548l121k605m123
57946E10848m630k738j238j603j485Q1N41q14r63J025J967O78M74K990N206N228
57930E15567N451P149P516N120L017L369L965L049K656M233N712N737O108P362
$$ plain form
57916 586011 592821 596396 597207 597437 596780 593491 588385 583745 579206 572711 564693 557354 550648 542863 534361
57901 534361 526739 519005 508701 496285 484448 473551 461687 448932 437547 428005 418587 408916
57889 408916 400477 393670 387671 383022 381097 381182 381267 381406 383157 386135 388376 389696 391458 393533 394747
57874 394747 395770 398054 400418 400279 397980 396339 396120 395423 393329 390684 387394 382507 376937 372732 369637
57859 369637 365735 361332 358744 358348 358378 358654 360828 364746 368218 370875 374752 380614 387092 393983 402929
57844 402929 414060 425211 435318 445566 456463 466739 475962 485297 494826 502830 508557 513099 516832
57831 516832 518520 517692 515449 512289 507489 501187 494679 488195 480716 472352 464497 457406 450109 442975
57817 442975 437702 434439 431568 428791 427728 428840 430382 431119 431653 432437 432849 432853 433296 433939 433392 431489 429522
$$ packed form
57916E86011O810L575Q11K30o57l289n106m640m539o495q018p339o706p785q502
57901E34361p622p734j0304j2416j1837j0897j1864j2755j1385r542r418r671
57889D08916q439o807n999m649j925Q5Q5J39J751K978K241J320J762K075J214
57874C94747J023K284K364j39k299j641k19o97k094k645l290m887n570m205l095
57859C69637l902m403k588l96L0K76K174L918L472K657L877N862O478O891Q946
57844D02929J1131J1151J0107J0248J0897J0276R223R335R529Q004N727M542L733
57831E16832J688q28k243l160m800o302o508o484p479q364p855p091p297p134
57817D42975n273l263k871k777j063J112J542P37N34P84M12MM43O43n47j903j967
$$ plain form
57800 429522 427755 424945 420656 415748 410254 403157 394737 386775 380037 373808 368230 364639 363177 362410
57786 362410 361762 362033 363171 363905 363977 364406 365255 365514 365452 366516 368590 369922 370125 370647 371932 372897 373685 376093
57768 376093 380546 385333 389571 394246 399582 404158 407534 411089 415252 418434 419692 419966 419699 417727 413478
57753 413478 407809 400731 390900 378517 366239 355966 347065 338815 332057 327087 322340 316756 311392
57740 311392 307313 303856 300248 297023 294613 292392 290154 288662 287821 286341 284161 283005 283621 284691 285496
57725 285496 287206 290294 293120 294574 295903 298324 300958 302755 304473 307069 309904 312172 314420 317097
57711 317097 319184 319774 319506 319098 317981 315744 313445 312281 312347 313699 316952 321765 326474 330372 334681
57696 334681 340206 345920 350993 356260 362309 367862 371444 372949 372374 368904 362662 355500 348567 340870
$$ packed form
57800D29522j767k810m289m908n494p097q420p962o738o229n578l591j462p67
57786C62410o48K71J138P34P2M29Q49K59o2J064K074J332K03N22J285R65P88K408
57768C76093M453M787M238M675N336M576L376L555M163L182J258K74k67j972m249
57753D13478n669p078r831j2383j2278j0273q901q250o758m970m747n584n364
57740C11392m079l457l608l225k410k221k238j492q41j480k180j156O16J070Q05
57725B85496J710L088K826J454J329K421K634J797J718K596K835K268K248K677
57711C17097K087N90k68m08j117k237k299j164O6J352L253M813M709L898M309
57696C34681N525N714N073N267O049N553L582J505n75l470o242p162o933p697
$$ plain form
57682 340870 331713 322761 316064 311683 308951 308563 311716 318483 328506 342052 359131 379100 402559
57669 402559 432221 470550 517690 572526 633699 697821 758171 806808 837246 844878 827581 787969
57657 787969 733453 672144 609485 549301 495356 449710 411402 378903 352487 332500 317062
57646 317062 303742 292221 283362 276812 271446 266991 263412 259779 255492 251565 249129 247820 247099 247702
57632 247702 250106 252982 254974 256645 258831 260470 260130 258472 257178 256420 255254 253483 251311 248278 244421
57617 244421 241398 240606 241148 241461 241762 242966 244435 244934 244812 245069 245140 243787 241400 239342 237639 235351
57601 235351 232599 230299 228478 226682 225384 225173 225234 224411 223049 222053 221040 219266 217505 216918 216840 215714
57585 215714 213550 211424 209294 206476 203621 201880 200556 197830 193600 189549 186589 184168 181834 179528
$$ packed form
57682C40870r157q952o697m381k732l88L153O767J0023J3546J7079J9969K3459
57669D02559K9662L8329M7140N4836O1173O4122O0350M8637L0438P632j7297l9612
57657G87969n4516o1309o2659o0184n3945m5646l8308l2499k6416j9987j5438
57646C17062j3320j1521q859o550n366m455l579l633m287l927k436j309p21O03
57632B47702K404K876J992J671K186J639l40j658j294p58j166j771k172l033l857
57617B44421l023p92N42L13L01J204J469M99j22K57P1j353k387k058j703k288
57601B35351k752k300j821j796j298k11O1q23j362r96j013j774j761n87p8j126
57585B15714k164k126k130k818k855j741j324k726m230m051k960k421k334k306
$$ plain form
57571 179528 176633 172656 168677 166262 165157 163765 161570 159254 156878 153982 151277 150166 150570 151034 150909
57556 150909 150722 150589 150041 149336 149193 149406 149337 149535 151096 153651 155752 157021 158203 159450 160447 161925 165041
57539 165041 169377 173514 177410 182200 187734 192388 195312 196785 196428 193394 188632 184716 182797 181583
57525 181583 179770 177524 175067 171776 167572 163573 160581 158308 156639 156187 156944 157774 157897 157724 157677 157369
57509 157369 156496 155494 154858 154632 154804 155361 155871 155963 156086 156781 157502 157376 156798 156817 157216 156792 155348 153748
57491 153748 152165 150059 147940 147230 148061 148943 148967 148653 148336 147412 145711 143996 142535 140645 138124 135785
57475 135785 134087 132586 131097 130041 129293 128130 126704 126129 126714 127527 128167 129470 131852 134362 136035
57460 136035 136987 137683 138266 139085 140652 142665 144197 145199 146545 148293 149309 149078 148555 148659 149142 149512
$$ packed form
57571A79528k895l977l979k415j105j392k195k316k376k896k705j111M04M64j25
57556A50909j87j33n48p05j43K13o9J98J561K555K101J269J182J247R97J478L116
57539A65041M336M137L896M790N534M654K924J473l57l034m762l916j919j214
57525A81583j813k246k457l291m204l999k992k273j669m52P57Q30J23j73m7l08
57509A57369q73j002o36k26J72N57N10R2J23O95P21j26n78J9L99m24j444j600
57491A53748j583k106k119p10Q31Q82K4l14l17r24j701j715j461j890k521k339
57475A35785j698j501j489j056p48j163j426n75N85Q13O40J303K382K510J673
57460A36035R52O96N83Q19J567K013J532J002J346J748J016k31n23J04M83L70
$$ plain form
57444 149512 149967 150841 152018 153267 154317 154585 153809 152849 152641 152608 151581 150094 149887 151094 151931 151528 151117
57427 151117 151814 153058 153974 154581 154889 154424 153392 152804 152761 152155 150673 149483 149239 149086 148430 147942 147926 147405
57409 147405 145905 144518 144101 143944 143394 143246 144191 145292 145307 144423 143453 142504 141576 141275 141771 142202 142229 142927
57391 142927 144881 146688 146806 145798 145243 145382 145376 145137 145308 145944 146568 147226 148369 150000 151831 153872 156061
57374 156061 157871 159033 160021 161134 161783 161464 160715 160343 160396 160593 160976 161453 161516 161117 161026 161654 162428 162907 163441
57355 163441 164095 164200 163836 164436 166847 169954 172283 173831 175197 176203 176771 178000 180787 184239 186900
57340 186900 188739 190495 191914 192293 192070 192286 192873 193051 192992 193578 194774 195632 195721 195352 194651 193683 193212 194036
57322 194036 195683 196916 197437 198053 199335 201133 203172 205147 206448 206834 207177 208536 210625 212137 212438
$$ packed form
57444A49512M55Q74J177J249J050K68p76r60k08l3j027j487k07J207Q37m03m11
57427A51117O97J244R16O07L08m65j032n88m3o06j482j190k44j53o56m88j6n21
57409A47405j500j387m17j57n50j48R45J101J5q84r70r49r28l01M96M31K7O98
57391A42927J954J807J18j008n55J39ok39J71O36O24O58J143J631J831K041K189
57374A56061J810J162R88J113O49l19p49l72N3J97L83M77O3l99r1O28P74M79N34
57355A63441O54J05l64O00K411L107K329J548J366J006N68J229K787L452K661
57340A86900J839J756J419L79k23K16N87J78n9N86J196Q58Q9l69p01r68m71Q24
57322A94036J647J233N21O16J282J798K039J975J301L86L43J359K089J512L01
$$ plain form
57307 212438 212108 212041 212815 214651 217088 218989 219798 220507 222519 225852 229321 232109 234191 235659 236777 238458
57291 238458 241514 245449 248937 251445 253587 256078 259253 263396 268538 273921 278507 282064 285048 287641
57277 287641 289772 291976 295372 300615 307451 315176 322973 329984 335841 341123 346775 353093 359638 365888
57263 365888 371607 376945 382597 389425 397482 405902 414160 422628 431462 439909 447621 455747 465534 476526
57249 476526 487335 497632 508110 518929 529565 539977 550654 561529 571988 582012 592302
57238 592302 603252 614684 626584 639295 652962 667528 683183 700103 717903 736054 754691
57227 754691 774311 794828 815511 835625 854543 871698 887102 901470 915134 927470 938278
57216 938278 948988 961316 975165 989150 1002865 1017324 1033260 1050229 1067484 1084730 1102018
$$ packed form
57307B12438l30o7P74J836K437J901Q09P09K012L333L469K788K082J468J118J681
57291B38458L056L935L488K508K142K491L175M143N142N383M586L557K984K593
57277B87641K131K204L396N243O836P725P797P011N857N282N652O318O545O250
57263C65888N719N338N652O828Q057Q420Q258Q468Q834Q447P712Q126R787J0992
57249D76526J0809J0297J0478J0819J0636J0412J0677J0875J0459J0024J0290
57238E92302J0950J1432J1900J2711J3667J4566J5655J6920J7800J8151J8637
57227G54691J9620K0517K0683K0114J8918J7155J5404J4368J3664J2336J0808
57216I38278J0710J2328J3849J3985J3715J4459J5936J6969J7255J7246J7288
$$ plain form
57205 1102018 1119728 1138590 1158858 1179633 1199841 1219577 1239567 1259650 1278919 1297108 1314660
57194 1314660 1331686 1348121 1364865 1383406 1404204 1426539 1450036 1475176 1502107 1530095 1558448
57183 1558448 1587096 1616088 1645391 1675343 1706450 1738605 1771277 1804422 1838310 1872502 1905971
57172 1905971 1938241 1969506 1999732 2028740 2057176 2086208 2116092 2146084 2175873 2205912 2236137
57161 2236137 2265579 2293684 2320973 2348040 2374922 2401821 2429394 2457803 2486378 2514713 2543161
57150 2543161 2571807 2599826 2626570 2652553 2678774 2705700 2733422 2762164 2792091 2823179 2855753
57139 2855753 2890599 2927931 2966549 3004346 3039299 3069879 3095304 3116040 3133806 3150670 3168229
57128 3168229 3187484 3208802 3231853 3256309 3283034 3313974 3350549 3392706 3439911 3492453 3551307
$$ packed form
57205A102018J7710J8862K0268K0775K0208J9736J9990K0083J9269J8189J7552
57194A314660J7026J6435J6744J8541K0798K2335K3497K5140K6931K7988K8353
57183A558448K8648K8992K9303K9952L1107L2155L2672L3145L3888L4192L3469
57172A905971L2270L1265L0226K9008K8436K9032K9884K9992K9789L0039L0225
57161B236137K9442K8105K7289K7067K6882K6899K7573K8409K8575K8335K8448
57150B543161K8646K8019K6744K5983K6221K6926K7722K8742K9927L1088L2574
57139B855753L4846L7332L8618L7797L4953L0580K5425K0736J7766J6864J7559
57128C168229J9255K1318K3051K4456K6725L0940L6575M2157M7205N2542N8854
$$ plain form
57117 3551307 3617346 3691282 3773926 3865867 3967222 4078357 4200677 4336233 4486922 4654882
57107 4654882 4843894 5060124 5311725 5608203 5959962 6377673 6871957 7454333 8138761
57098 8138761 8941934 9882268 10979734 12257200 13741287 15461868 17452083 19748930
57090 19748930 22390216 25406162 28811816 32606171 36773430 41278016 46054562 50997720
57082 50997720 55944094 60639145 64717850 67755926 69404498 69529622 68249274 65844928
57074 65844928 62630946 58874763 54783560 50516236 46192780 41904537 37728018 33731797
57066 33731797 29973225 26495002 23326720 20485398 17972716 15775469 13871486 12234495
57058 12234495 10834940 9641447 8624696 7758857 7019360 6382378 5827789 5340529 4908324
$$ packed form
57117C551307O6039P3936Q2644R1941J01355J11135J22320J35556J50689J67960
57107D654882J89012K16230K51601K96478L51759M17711M94284N82376O84428
57098H138761Q03173R40334J097466J277466J484087J720581J990215K296847
57090A9748930K641286L015946L405654L794355M167259M504586M776546M943158
57082E0997720M946374M695051M078705L038076J648572J25124j280348k404346
57074F5844928l213982l756183m091203m267324m323456m288243m176519l996221
57066C3731797l758572l478223l168282k841322k512682k197247j903983j636991
57058A2234495j399555j193493j016751q65839p39497o36982n54589m87260m32205
$$ plain form
57049 4908324 4520353 4168887 3849643 3559171 3293524 3050067 2828214 2627280 2445351
57040 2445351 2280993 2133924 2003006 1885436 1778909 1682742 1596116 1517254 1445389 1381502
57030 1381502 1325818 1276305 1230906 1189627 1153252 1121740 1095237 1075082 1062220 1055868 1055301 1061940
57018 1061940 1078381 1106391 1147492 1204967 1283618 1386608 1511589 1648064 1777625 1878224
57008 1878224 1930950 1925615 1863283 1755925 1622514 1481491 1344435 1216494 1101233 1002244
56998 1002244 920246 852190 794866 747403 709251 678247 652395 631600 616012 604343 595430
56987 595430 589901 588618 590819 595196 601381 608723 614808 616778 613202 603596 587575 566028 541924
56974 541924 518308 496302 476098 458564 444388 432862 423058 415265 409913 406265 403741 403532 407281
$$ packed form
57049D908324l87971l51466l19244k90472k65647k43457k21853k00934j81929
57040B445351j64358j47069j30918j17570j06527r6167q6626p8862p1865o3887
57030A381502n5684m9513m5399m1279l6375l1512k6503k0155j2862o352n67O639
57018A061940J6441K8010M1101N7475P8651J02990J24981J36475J29561J00599
57008A878224N2726n335o2332j07358j33411j41023j37056j27941j15261r8989
56998A002244q1998o8056n7324m7463l8152l1004k5852k0795j5588j1669q913
56987E95430n529j283K201M377O185P342O085J970l576r606j6021k1547k4104
56974E41924k3616k2006k0204j7534j4176j1526r804p793n352l648k524k09L749
$$ plain form
56961 407281 415046 425991 440182 458052 478745 500334 520925 538205 548822 550040 541806 526217
56949 526217 505575 482013 458056 435949 416640 400249 386957 376749 369273 364833 364451 368065
56937 368065 373947 381165 391382 406974 428535 455431 487167 522155 556073 583461 600589 605759
56925 605759 598132 578342 549642 516541 482380 449155 418622 391868 368480 347737 330092 316168
56913 316168 305143 295683 287721 281734 277044 272549 268434 265420 262904 259640 255821 252762 250882 249564
56899 249564 248649 248492 248969 249953 252347 257135 263863 271596 280856 293093 308670 327019 348226 372645
56885 372645 399104 425059 448243 466763 478133 480219 473304 459899 442757 424290 407249 393954
56873 393954 384740 378555 375040 374841 378266 385095 395489 409806 427986 450491 479348 516789 563062
$$ packed form
56961D07281P765J0945J4191J7870K0693K1589K0591J7280J0617J218q234j5589
56949E26217k0642k3562k3957k2107j9309j6391j3292j0208p476m440l82L614
56937C68065N882P218J0217J5592K1561K6896L1736L4988L3918K7388J7128N170
56925F05759p627j9790k8700l3101l4161l3225l0533k6754k3388k0743j7645j3924
56913C16168j1025r460p962n987m690m495m115l014k516l264l819l059j880j318
56899B49564r15j57M77R84K394M788O728P733R260J2237J5577J8349K1207K4419
56885C72645K6459K5955K3184J8520J1370K086o915j3405j7142j8467j7041j3295
56873C93954r214o185l515j99L425O829J0394J4317J8180K2505K8857L7441M6273
$$ plain form
56860 563062 616638 675411 735737 790984 833340 857436 861382 845523 812520 768214 719814 672529
56848 672529 628991 591246 561333 540158 527693 524251 529947 543480 563439 590602 627124 674078
56836 674078 731965 802774 888229 985186 1084805 1176398 1250048 1296182 1306957 1280606 1223138
56825 1223138 1144667 1055137 963306 876609 799663 733802 679088 635977 604664 584446 574633
56814 574633 574940 584479 601750 626527 660701 706479 764204 831610 903633 972457 1029063 1065712
56802 1065712 1077163 1060906 1018418 956237 883734 808890 736725 670791 613737 566150 526933
56791 526933 495551 472491 457395 448685 445553 448636 458303 473990 495584 523598 557160 593253
56779 593253 628302 658841 680406 688026 679196 655388 620272 577834 532241 487368 445303 406546
$$ packed form
56860E63062N3576N8773O0326N5247M2356K4096L946j5859l3003m4306m8400m7285
56848F72529m3538l7745k9913k1175j2465l442N696J3533J9959K7163L6522M6954
56836F74078N7887P0809Q5455R6957R9619R1593P3650M6134J0775k6351n7468
56825A223138p8471q9530r1831q6697p6946o5861n4714m3111l1313k0218r813
56814E74633L07R539J7271K4777L4174M5778N7725O7406P2023O8824N6606L6649
56802A065712J1451j6257m2488o2181p2503p4844p2165o5934n7054m7587l9217
56791E26933l1382k3060j5096q710l132L083R667J5687K1594K8014L3562L6093
56779E93253L5049L0539K1565P620q830k3808l5116m2438m5593m4873m2065l8757
$$ plain form
56767 406546 372027 343330 320497 301493 284607 269792 257097 245682 235236 226650 220257 214860
56755 214860 209340 203854 198748 193850 189548 186972 186217 185807 184700 183433 182610 181819 180772 179981 179527 178570
56739 178570 176800 174913 173095 170688 167947 166273 165948 165532 164408 163991 165255 166922 167497 167448 168003 169184
56723 169184 170408 171761 173400 174833 175852 177042 178484 179297 179341 179938 181872 184130 185618 186613 187509 187659
56707 187659 186740 185790 185639 185636 185089 184579 184646 184538 183597 182582 182352 182492 182449 182777 183977 185312 185981 186287 186527
56688 186527 185991 184303 182512 181642 181289 180757 180284 180035 179245 177642 176430 176578 177369 177838 178338 179417 180453
56671 180453 180748 180808 181289 181849 182196 182938 184227 184967 184642 184476 185510 186997 188036 189189 190978 192415 192774
56654 192774 193329 195490 198539 201008 202992 205227 207160 207947 208337 209556 211197 212090 212451 213298 214467 214974
$$ packed form
56767D06546l4519k8697k2833j9004j6886j4815j2695j1415j0446q586o393n397
56755B14860n520n486n106m898m302k576p55m10j107j267q23p91j047p91m54r57
56739A78570j770j887j818k407k741j674l25m16j124m17J264J667N75m9N55J181
56723A69184J224J353J639J433J019J190J442Q13M4N97J934K258J488R95Q96J50
56707A87659r19r50j51ln47n10O7j08r41j015k30J40m3L28J200J335O69L06K40
56688A86527n36j688j791q70l53n32m73k49p90j603j212J48P91M69N00J079J036
56671A80453K95O0M81N60L47P42J289P40l25j66J034J487J039J153J789J437L59
56654A92774N55K161L049K469J984K235J933P87L90J219J641Q93L61Q47J169N07
$$ plain form
56638 214974 214785 214684 215007 215806 217484 219972 222164 223409 224464 225823 226442 225561 224339 224005 223795 222470
56622 222470 220520 218968 217361 215032 213053 212693 213023 212353 211073 210742 211208 211034 210173 209833 210045 209594 208116
56605 208116 206332 204511 202494 200827 200034 199220 197160 194376 192415 191583 191056 190636 190628 190550 189835 189284 190053
56588 190053 191693 192941 193855 195373 197367 198994 200378 202083 203476 203539 202844 202871 203819 204833 205847 207356
56572 207356 208948 209950 210998 213108 215756 217770 219538 222312 225876 229016 231871 235771 241041 246894
56558 246894 253135 260101 267295 273868 279944 285669 289684 290637 289618 288995 289382 289784 289995 290437 290282 288331
56542 288331 285510 283985 283961 283718 282655 281804 281337 280045 277521 274664 271845 268627 265388 263147 261712
56527 261712 259945 257840 256336 255180 253018 249605 245934 242357 238642 235614 234468 234515 233867 232274 231073
$$ packed form
56638B14974j89j01L23P99J678K488K192J245J055J359O19q81j222l34k10j325
56622B22470j950j552j607k329j979l60L30o70j280l31M66j74q61l40K12m51j478
56605B08116j784j821k017j667p93q14k060k784j961q32n27m20qp8p15n51P69
56588A90053J640J248R14J518J994J627J384J705J393O3o95K7R48J014J014J509
56572B07356J592J002J048K110K648K014J768K774L564L140K855L900N270N853
56558B46894O241O966P194O573O076N725M015R53j019o23L87M02K11M42j55j951
56542B88331k821j525k4k43j063q51m67j292k524k857k819l218l239k241j435
56527B61712j767k105j504j156k162l413l671l577l715l028j146M7o48j593j201
$$ plain form
56512 231073 230469 229244 227214 225586 224725 223885 223259 223923 225558 226480 226278 226201 226806 227451 228291 230384 233396
56495 233396 235453 235722 235167 234534 233682 233022 233336 233896 233011 230742 228904 228160 227383 226170 225629 226234 227107
56478 227107 227901 229255 231088 232517 233710 235602 237598 237931 236554 235328 235028 234644 233948 234160 235480 236442
56462 236442 236380 236285 236665 236891 237117 238407 240424 241439 241239 241581 243226 245011 246392 248272 250603 251897
56446 251897 252008 252696 254442 255275 253991 252102 251407 251846 252816 254343 255814 255769 254175 252925 253084 253618 253652
56429 253652 253814 254441 254656 254186 253978 254146 253500 251909 250906 251069 251091 250293 249709 249841 249727 249173 249507 251119
56411 251119 252687 253762 255602 258457 260705 261838 263616 266929 270087 271647 272396 273131 273008 271736 270940
56396 270940 271609 272329 271698 270452 269770 269553 269691 270838 272559 272999 271825 271309 273041 275766 277818 279336
$$ packed form
56512B31073o04j225k030j628q61q40o26O64J635R22k02p7O05O45Q40K093L012
56495B33396K057K69n55o33q52o60L14N60q85k269j838p44p77j213n41O05Q73
56478B27107P94J354J833J429J193J892J996L33j377j226l00l84o96K12J320R62
56462B36442o2r5L80K26K26J290K017J015k00L42J645J785J381J880K331J294
56446B51897J11O88J746Q33j284j889o95M39R70J527J471m5j594j250J59N34L4
56429B53652J62O27K15m70k08J68o46j591j003J63K2p98n84J32j14n54L34J612
56411B51119J568J075J840K855K248J133J778L313L158J560P49P35j23j272p96
56396B70940O69P20o31j246o82k17J38J147J721M40j174n16J732K725K052J518
$$ plain form
56380 279336 280665 280958 280022 279316 279511 279198 277426 275300 273698 271863 269758 269261 271240 273851 275480 277024
56364 277024 279545 282071 283655 285277 287771 290023 291097 291968 293346 294045 293365 292877 293912 295401 296037
56349 296037 296324 296725 296117 294038 292184 291714 291310 289823 288451 288325 288334 287481 286949 287647 288127 287241 286536 287568
56331 287568 289149 289715 290210 292123 294705 296706 298872 302225 305810 308573 311609 316099 320899 324503 327507
56316 327507 330824 333469 334515 335332 337385 339664 340649 341007 341996 343125 343659 344577 346749 349196 351358 354996
56300 354996 361512 369506 377214 385029 393246 399824 403129 404531 405582 405041 401602 397139 394118 392020
56286 392020 389472 387652 388174 389625 389724 389212 390232 392498 394368 396147 399086 402536 405217 407881 411743
56271 411743 415772 418529 421103 425235 430106 433967 437352 441688 446358 450202 454330 460374 467467 473927
$$ packed form
56380B79336J329K93r36p06J95l13j772k126j602j835k105m97J979K611J629J544
56364B77024K521K526J584J622K494K252J074Q71J378O99o80m88J035J489O36
56349B96037K87M01o08k079j854m70m04j487j372j26Rq53n32O98M80q86p05J032
56331B87568J581N66M95J913K582K001K166L353L585K763L036M490M800L604L004
56316C27507L317K645J046Q17K053K279R85L58R89J129N34R18K172K447K162L638
56300C54996O516P994P708P815Q217O578L305J402J051n41l439m463l021k098
56286C92020k548j820N22J451R9n12J020K266J870J779K939L450K681K664L862
56271D11743M029K757K574M132M871L861L385M336M670L844M128O044P093O460
$$ plain form
56257 473927 480420 488528 497821 507233 517677 530406 544597 559381 576244 596419 618091 639492
56245 639492 662602 690298 721821 754660 788909 825979 864794 903178 941473 981097 1020893
56234 1020893 1058360 1093006 1125137 1153098 1175194 1192487 1206082 1213621 1212321 1203710 1191453 1176195
56222 1176195 1156415 1132640 1106835 1079260 1049816 1020717 993850 967305 938561 909263 882656
56211 882656 858327 833935 810267 789771 771626 753057 734256 717407 702102 686340 670877
56200 670877 658014 647236 636466 626399 619155 613922 608365 602959 599492 596803 592682 588414 586587
56187 586587 585959 583510 580037 578579 578686 577608 575853 576088 577599 577372 575789 575834 577498 578338 578753 581187
56171 581187 584793 586364 585986 586486 588041 588724 589558 593398 599419 604233 607851 612975 619101 623187 625659
$$ packed form
56257D73927O493Q108R293R412J0444J2729J4191J4784J6863K0175K1672K1401
56245F39492K3110K7696L1523L2839L4249L7070L8815L8384L8295L9624L9796
56234A020893L7467L4646L2131K7961K2096J7293J3595P539j300q611j2257j5258
56222A176195j9780k3775k5805k7575k9444k9099k6867k6545k8744k9298k6607
56211H82656k4329k4392k3668k0496j8145j8569j8801j6849j5305j5762j5463
56200F70877j2863j0778j0770j0067p244n233n557n406l467k689m121m268j827
56187E86587o28k449l473j458J07j078j755K35J511k27j583M5J664Q40M15K434
56171E81187L606J571l78N00J555O83Q34L840O021M814L618N124O126M086K472
$$ plain form
56156 625659 629956 636495 642786 649092 658143 669484 679880 689031 699362 710675 720815 731131 745337
56143 745337 763329 781982 801468 824712 851181 877473 903688 933022 965677 999634 1036893
56132 1036893 1082320 1136753 1198044 1268447 1353832 1455630 1570483 1697512 1838372 1989727
56122 1989727 2142770 2290615 2429507 2553402 2655557 2736482 2803161 2859881 2906503 2944978
56112 2944978 2978891 3005873 3018764 3015632 3001352 2978964 2947589 2909389 2869651 2828124 2777913
56101 2777913 2714105 2635970 2540719 2424531 2291576 2153440 2017878 1886139 1761808 1652428
56091 1652428 1560169 1480134 1410284 1354159 1311611 1276147 1244378 1219411 1202213 1188264 1175436
56080 1175436 1166574 1161741 1156539 1150521 1148494 1151146 1153346 1153851 1157366 1164721 1170810 1174782 1182262 1194676
$$ packed form
56156F25659M297O539O291O306R051J1341J0396R151J0331J1313J0140J0316J4206
56143G45337J7992J8653J9486K3244K6469K6292K6215K9334L2655L3957L7259
56132A036893M5427N4433O1291P0403Q5385J01798J14853J27029J40860J51355
56122A989727J53043J47845J38892J23895J02155Q0925O6679N6720M6622L8475
56112B944978L3913K6982J2891l132j4280k2388l1375l8200l9738m1527n0211
56101B777913o3808p8135r5251j16188j32955j38136j35562j31739j24331j09380
56091A652428r2259q0035o9850n6125m2548l5464l1769k4967j7198j3949j2828
56080A175436q862m833n202o018k027K652K200N05L515P355O089L972P480J2414
$$ plain form
56066 1194676 1206511 1216029 1228327 1244675 1259446 1271028 1285047 1303113 1319279 1331500 1345461
56055 1345461 1362897 1377439 1386674 1397000 1411640 1425126 1434821 1446608 1463740 1481207 1496583 1515195
56043 1515195 1539003 1561773 1581007 1603184 1631336 1658978 1682321 1706872 1735937 1764497 1790576
56032 1790576 1820518 1856637 1891965 1923605 1958616 2000284 2041769 2080172 2123228 2174679 2226844
56021 2226844 2275321 2326945 2385207 2442291 2494174 2549037 2611840 2675206 2734750 2798428 2871200
56010 2871200 2945609 3017318 3094459 3181677 3270866 3357879 3451876 3557617 3665677 3771242 3884806
55999 3884806 4012759 4145862 4278955 4422728 4583157 4749375 4915646 5094628 5294337
55990 5294337 5503486 5715136 5942634 6195604 6463121 6738152 7034939 7363727 7713090
$$ packed form
56066A194676J1835R518J2298J6348J4771J1582J4019J8066J6166J2221J3961
56055A345461J7436J4542R235J0326J4640J3486R695J1787J7132J7467J5376J8612
56043A515195K3808K2770J9234K2177K8152K7642K3343K4551K9065K8560K6079
56032A790576K9942L6119L5328L1640L5011M1668M1485L8403M3056N1451N2165
56021B226844M8477N1624N8262N7084N1883N4863O2803O3366N9544O3678P2772
56010B871200P4409P1709P7141Q7218Q9189Q7013R3997J05741J08060J05565J13564
55999C884806J27953J33103J33093J43773J60429J66218J66271J78982J99709
55990E294337K09149K11650K27498K52970K67517K75031K96787L28788L49363
$$ plain form
55981 7713090 8077005 8473766 8917318 9396973 9907629 10471455 11105869 11800506 12552010
55972 12552010 13389855 14339755 15395575 16558657 17869852 19370213 21069441 22991529
55964 22991529 25212455 27814425 30849919 34398904 38615529 43668463 49686858 56818503
55956 56818503 65277620 75272599 86969854 100626465 116692845 135709829 158242139
55949 158242139 185041868 216980640 254203753 294972280 335389360 370406864 395230226
55942 395230226 406269340 401775507 382466767 351629157 314071742 274430357 236045569
55935 236045569 200894851 169981378 143585061 121438619 103021006 87807757 75302818
55928 75302818 65000263 56450225 49330680 43397275 38411593 34169607 30547358 27458374
$$ packed form
55981G713090L63915L96761M43552M79655N10656N63826O34414O94637P51504
55972A2552010Q37845R49900J055820J163082J311195J500361J699228J922088
55964B2991529K220926K601970L035494L548985M216625N052934O018395P131645
55956E6818503Q459117R994979J1697255J3656611J6066380J9016984K2532310
55949A58242139K6799729L1938772L7223113M0768527M0417080L5017504K4823362
55942C95230226J1039114m493833j9308740l0837610l7557415l9641385l8384788
55935B36045569l5150718l0913473k6396317k2146442j8417613j5213249j2504939
55928G5302818j0302555q550038p119545n933405m985682m241986l622249l088984
$$ plain form
55920 27458374 24798411 22473012 20438862 18670990 17118544 15730293 14492144 13400846
55912 13400846 12426989 11538099 10732435 10016351 9370997 8772150 8221167 7726701 7275866
55903 7275866 6851456 6458710 6108158 5789400 5487214 5206792 4958454 4733135 4516567
55894 4516567 4312964 4132031 3966619 3805138 3652781 3519333 3398583 3280187 3169800
55885 3169800 3077627 2998467 2922293 2853737 2802473 2764721 2732515 2711356 2710908 2727309 2751478 2785558
55873 2785558 2834153 2887838 2931770 2962596 2981325 2978136 2940840 2871676 2780816 2670334 2539298
55862 2539298 2397500 2258863 2126732 1998898 1880437 1777799 1686572 1598992 1517927 1450343
55852 1450343 1392896 1337247 1284204 1239563 1201155 1162808 1126201 1096284 1069673 1039900 1009685
$$ packed form
55920B7458374k659963k325399k034150j767872j552446j388251j238149j091298
55912A3400846r73857q88890q05664p16084o45354n98847n50983m94466m50835
55903G275866m24410l92746l50552l18758l02186k80422k48338k25319k16568
55894D516567k03603j80933j65412j61481j52357j33448j20750j18396j10387
55885C169800r2173p9160p6174o8556n1264l7752l2206k1159m48J6401K4169L4080
55873B785558M8595N3685M3932L0826J8729l189l7296o9164r0860j10482j31036
55862B539298j41798j38637j32131j27834j18461j02638r1227q7580q1065o7584
55852A450343n7447n5649n3043m4641l8408l8347l6607k9917k6611k9773l0215
$$ plain form
55841 1009685 985963 967020 946268 924522 906891 891581 873388 854583 841053 831093 818867
55830 818867 805439 795686 787866 776948 764871 756885 750963 741330 729272 720034 712046 699805 684817
55817 684817 673328 665452 656487 646764 640395 636344 630377 623992 622187 624320 626163 628853 636694 648105
55803 648105 657929 666889 679737 695735 709937 722310 736646 751673 761945 766536 768576 767386
55791 767386 759361 745691 731186 716390 698552 679198 662966 650011 637059 624690 616004 609480
55779 609480 600871 590952 583703 578103 569617 558833 550888 547223 545636 547567 557318 574316 593516
55766 593516 612909 633214 650686 658060 652942 638638 617225 588918 557635 529520 505586 482573
55754 482573 460850 444384 433010 422032 409884 399345 390851 381508 371274 363431 358217 352314
$$ packed form
55841A009685k3722j8943k0752k1746j7631j5310j8193j8805j3530r960j2226
55830H18867j3428r753p820j0918j2077p986n922r633j2058r238p988j2241j4988
55817F84817j1489p876q965r723o369m051n967o385j805K133J843K690P841J1411
55803F48105R824Q960J2848J5998J4202J2373J4336J5027J0272M591K040j190
55791G67386q025j3670j4505j4796j7838j9354j6232j2955j2952j2369q686o524
55779F09480q609r919p249n600q486j0784p945l665j587J931R751J6998J9200
55766E93516J9393K0305J7472P374n118j4304k1413k8307l1283k8115k3934k3013
55754D82573k1723j6466j1374j0978j2148j0539q494r343j0234p843n214n903
$$ plain form
55742 352314 345246 340050 337155 333788 330007 329195 331927 335137 337828 341753 346099 347474 345621 343398
55728 343398 340848 335206 327061 320328 315551 309311 300983 293961 289335 284394 278535 274815 274295 274336 273794
55713 273794 274700 277632 280617 283726 289675 298729 307841 315711 323738 331132 334327 332394 328210 323214
55699 323214 315764 305598 295103 285130 274195 262762 253669 247448 241769 236155 232639 231131 228983
55686 228983 225785 223827 223178 221326 218348 217380 219067 220606 221202 223340 227565 231128 232970 235056 237461
55671 237461 237222 233565 229453 226540 223347 219689 217942 218359 218067 216412 216456 219456 222668 224563 227467
55656 227467 232912 238910 244044 250013 257913 266025 273326 281248 289966 296844 300463 302404 303380 301567
55642 301567 296540 290841 285793 279677 271805 264391 258531 252344 245000 238556 233840 228593 221818 215941
$$ packed form
55742C52314p068n196k895l367l781q12K732L210K691L925M346J375j853k223
55728C43398k550n642q145o733m777o240q328p022m626m941n859l720n20M1n42
55713B73794R06K932K985L109N949R054R112P870Q027P394L195j933m184m996
55699C23214p450j0166j0495r973j0935j1433r093o221n679n614l516j508k148
55686B28983l198j958o49j852k978r68J687J539N96K138M225L563J842K086K405
55671B37461k39l657m112k913l193l658j747M17k92j655M4L000L212J895K904
55656B27467N445N998N134N969P900Q112P301P922Q718O878L619J941R76j813
55642C01567n027n699n048o116p872p414n860o187p344o444m716n247o775n877
$$ plain form
55628 215941 212389 209009 204324 200523 199610 200031 199663 198944 198690 198093 197123 197726 200389 202618 202934 203150 204608
55611 204608 205429 203853 201112 198751 196135 192826 190401 189497 187952 184153 179640 176338 173940 171880 171027
55596 171027 171424 171176 169551 168481 169238 170458 171104 172220 173968 174268 172520 171453 173010 175435 176724
55581 176724 177948 180730 184292 187549 191552 197492 204633 212244 221058 230984 240157 248211 257671 270132
55567 270132 283975 297769 312635 328897 343668 354408 361978 367533 369333 365526 357436 347217
55555 347217 334744 319587 303649 288902 274722 260151 246614 235673 226239 216764 208180 201991
55543 201991 197328 192452 187372 182754 178160 173657 171033 171047 171496 170322 168528 167760 167328 166099 165078
55528 165078 165408 165913 165265 164613 165421 166650 166703 166243 166462 166474 165099 163328 162304 160694 156871 151998 148196
$$ packed form
55628B15941l552l380m685l801r13M21l68p19k54n97r70O03K663K229L16K16J458
55611B04608Q21j576k741k361k616l309k425r04j545l799m513l302k398k060q53
55596A71027L97k48j625j070P57J220O46J116J748L00j748j067J557K425J289
55581A76724J224K782L562L257M003N940P141P611Q814R926R173Q054R460J2461
55567B70132J3843J3794J4866J6262J4771J0740P570N555J800l807q090j0219
55555C47217j2473j5157j5938j4747j4180j4571j3537j0941r434r475q584o189
55543B01991m663m876n080m618m594m503k624J4M49j174j794p68m32j229j021
55528A65078L30N05o48o52Q08J229N3m60K19J2j375j771j024j610l823m873l802
$$ plain form
55511 148196 145277 142014 138959 137216 135886 133550 130964 129678 129301 128571 127701 127281 126440 124674 123873 125772
55495 125772 128851 130465 130720 131485 132870 133507 133280 133077 132827 132234 132352 134006 135764 135951 135530 136518 138706
55478 138706 140452 141645 143359 145567 147689 150363 154127 157301 157675 155563 152957 150573 147988 145653
55464 145653 144346 143465 142121 141059 141394 142495 143245 144155 145926 147214 146401 144460 143482 143336 142461 140986
55448 140986 140313 140305 139673 138663 138775 140064 141062 141081 140548 139598 138307 137703 138511 139571 139464 138849 139168 140052
55430 140052 140216 139951 140369 141089 141124 141240 142882 145422 146969 147413 148272 150017 151865 153732 156109 158448
55414 158448 159873 160984 162850 164929 166155 167270 169660 172533 173809 173293 172443 171528 169539 166639 164161
55399 164161 162367 160511 158836 158181 157899 156507 154152 152165 150557 148379 146215 145700 146575 146809 145734
$$ packed form
55511A48196k919l263l055j743j330k336k586j286l77p30q70m20q41j766q01J899
55495A25772L079J614K55P65J385O37k27k03k50n93J18J654J758J87m21R88K188
55478A38706J746J193J714K208K122K674L764L174L74k112k606k384k585k335
55464A45653j307q81j344j062L35J101P50R10J771J288q13j941r78j46q75j475
55448A40986o73qo32j010J12J289R98J9n33r50j291o04Q08J060j07o15L19Q84
55430A40052J64k65M18P20L5J16J642K540J547M44Q59J745J848J867K377K339
55414A58448J425J111J866K079J226J115K390K873J276n16q50r15j989k900k478
55399A64161j794j856j675o55k82j392k355j987j608k178k164n15Q75K34j075
$$ plain form
55384 145734 144664 144250 143641 142625 142320 143172 144183 144633 144988 145696 146567 147480 148440 149055 149179 149622 150800
55367 150800 151424 150169 147856 146064 144385 141294 137135 133826 131935 130383 128840 128067 127967 127550 126891
55352 126891 127030 127918 128499 128754 129637 131048 131900 132154 132729 133474 133256 132057 130916 129890 128155 126144 125415
55335 125415 126259 127454 128490 130024 131931 132929 132471 131331 130206 129318 129315 130751 132745 133875 134197 134648
55319 134648 134918 133942 132156 131038 130620 129756 128711 129062 130932 132622 133187 133207 132924 131893 130692 130727 132010
55302 132010 133209 134100 135760 138124 139619 139636 139229 139003 138432 137658 137833 139180 140633 141773 143165 144612
55286 144612 145170 145147 145871 147207 147633 147070 147179 148287 148563 147051 145164 144205 143609 142629 141656 140859 139482
55269 139482 137591 136580 136912 137157 136343 135542 136000 137292 138417 139267 140041 140589 141221 142784 145123 146777
$$ packed form
55384A45734j070m14o09j016l05Q52J011M50L55P08Q71R13R60O15J24M43J178
55367A50800O24j255k313j792j679l091m159l309j891j552j543p73j00m17o59
55352A26891J39Q88N81K55Q83J411Q52K54N75P45k18j199j141j026j735k011p29
55335A25415Q44J195J036J534J907R98m58j140j125q88lJ436J994J130L22M51
55319A34648K70r76j786j118m18q64j045L51J870J690N65K0k83j031j201L5J283
55302A32010J199Q91J660K364J495J7m07k26n71p74J75J347J453J140J392J447
55286A44612N58k3P24J336M26n63J09J108K76j512j887r59n96r80r73p97j377
55269A39482j891j011L32K45q14q01M58J292J125Q50P74N48O32J563K339J654
$$ plain form
55253 146777 146979 146635 146657 146694 146191 145430 144895 144743 145274 146634 147829 147499 145896 144578 143998 143144 141751 140886
55235 140886 140961 141094 140941 141254 142100 142508 142457 143128 144568 145230 144660 144462 145597 146825 147030 147054 147813 148390 147599
55216 147599 146045 145151 145243 145810 146642 147666 148561 149317 150193 150702 149933 148317 147595 148480 149776 150317 150140 149326
55198 149326 147517 145340 144390 144888 145151 144245 143356 143483 143701 142950 141845 141332 141069 140498 140141 140548 141195 141589
55180 141589 142234 143407 144208 143895 142970 142026 140825 139408 138714 139084 139483 139152 138718 138762 138841 138827 139597 141278
55162 141278 142477 142504 142765 144553 146973 148497 149181 149804 150090 149462 148526 148238 148428 148392 148151 147959 147519 146770
55144 146770 146483 147012 147468 147137 146621 146573 146459 145672 144753 144374 144269 144188 144704 145965 146939 147047 147237 148190 148803
55125 148803 147906 146262 145369 145326 145310 145178 145160 144902 144187 143740 144081 144505 144427 144638 145922 147488 148249 148646 149703
$$ packed form
55253A46777K02l44K2L7n03p61n35j52N31J360J195l30j603j318n80q54j393q65
55235A40886P5J33j53L13Q46M08n1O71J440O62n70j98J135J228K05K4P59N77p91
55216A47599j554q94R2N67Q32J024Q95P56Q76N09p69j616p22Q85J296N41j77q14
55198A49326j809k177r50M98K63r06q89J27K18p51j105n13k63n71l57M07O47L94
55180A41589O45J173Q01l13r25r44j201j417o94L70L99l31m34M4P9j4P70J681
55162A41278J199K7K61J788K420J524O84O23K86o28r36k88J90l6k41j92m40p49
55144A46770k87N29M56l31n16m8j14p87r19l79j05q1N16J261R74J08J90R53O13
55125A48803q97j644q93m3j6j32j8k58p15m47L41M24p8K11J284J566P61L97J057
$$ plain form
55106 149703 151210 152359 153358 154868 156532 157536 158041 158682 159280 159363 159393 160153 161416 162330 162571 162118 160662
55089 160662 158341 156348 155693 156064 156811 158114 160032 161427 161153 159600 157924 156604 155822 156171 157620 158716
55073 158716 158291 157182 156899 157396 157521 156883 155863 154557 153157 152667 153747 155427 156267 156194 155927 155422 154306
55056 154306 153163 152818 152872 152318 151073 149633 147950 146058 145112 146150 148342 149940 150523 150852 151054 150594
55040 150594 149775 149618 150315 151080 151504 151873 152326 152746 153372 154539 155984 157165 157920 158158 157597 156554 156106
55023 156106 156564 156691 155572 154244 154168 154990 155273 154640 153691 152537 151018 149814 149772 150507 151035 151308 151805 152223
55005 152223 152016 151672 152020 152795 153312 153935 155304 156707 156931 156378 156618 158148 160157 162185 164339 166030
54989 166030 166268 165303 164550 164722 165217 165330 164954 164268 163779 164404 166396 168535 169460 169370 169351 169741 170369 171590
$$ packed form
55106A49703J507J149R99J510J664J004N05O41N98Q3L0P60J263R14K41m53j456
55089A60662k321j993o55L71P47J303J918J395k74j553j676j320p82L49J449J096
55073A58716m25j109k83M97J25o38j020j306j400m90J080J680Q40p3k67n05j116
55056A54306j143l45N4n54j245j440j683j892r46J038K192J598N83L29K02m60
55040A50594q19j57O97P65M24L69M53M20O26J167J445J181P55K38n61j043m48
55023A56106M58J27j119j328p6Q22K83o33r49j154j519j204m2P35N28K73M97M18
55005A52223k07l44L48P75N17O23J369J403K24n53K40J530K009K028K154J691
54989A66030K38r65p53J72M95J13l76o86m89O25J992K139R25r0j9L90O28J221
$$ plain form
54971 171590 173485 174750 174158 172689 172403 173536 174461 174267 173569 172948 172420 172451 173734 175768 177185 177685 178247
54954 178247 179384 180517 181042 180726 179177 176380 173654 172600 173103 173762 174091 174821 176152 177365 178149 178807
54938 178807 179167 178826 178424 179090 180579 181568 181824 182436 183757 184828 185127 185279 185736 186323 187446 190265 195144
54921 195144 201179 207532 213997 220134 225317 229887 234799 239746 243042 243736 242474 239962 236021 230733
54907 230733 225124 220006 215135 210066 204952 200066 195456 191367 188222 185991 184336 183298 182984 182806 182109
54892 182109 181331 181347 181921 182108 181900 182079 182674 183158 184010 186277 189630 192635 195068 198137 202224 206364 210341
54875 210341 215379 222089 229366 235986 241725 246287 248727 248680 246866 243777 239203 233469 227637 221975 215792
54860 215792 209336 204255 201485 200201 199498 199462 199851 199435 197736 195912 194881 193924 192139 189881 187672 185094
$$ packed form
54971A71590J895J265n92j469k86J133R25j94o98o21n28L1J283K034J417N00N62
54954A78247J137J133N25l16j549k797k726j054N03O59L29P30J331J213P84O58
54938A78807L60l41m02O66J489R89K56O12J321J071K99J52M57N87J123K819M879
54921A95144O035O353O465O137N183M570M912M947L296O94j262k512l941n288
54907B30733n609n118m871n069n114m886m610m089l145k231j655j038l14j78o97
54892A82109p78J6N74J87k08J79N95M84Q52K267L353L005K433L069M087M140L977
54875B10341N038O710P277O620N739M562K440m7j814l089m574n734n832n662o183
54860B15792o456n081k770j284p03l6L89m16j699j824j031r57j785k258k209k578
$$ plain form
54844 185094 181972 179427 178443 178402 178216 177895 177827 177498 176293 174777 173939 173708 173289 172468 171589 170747 169908 169385
54826 169385 169430 169745 170012 170368 170882 171182 171120 171135 171421 171494 171077 170702 170888 171486 172278 173391 174655 175444 175684
54807 175684 176108 177020 177805 178205 178929 180297 181382 181418 181039 181158 181546 181555 181478 182020 183028 183721 183815 183542 183034
54788 183034 182435 182254 182830 183804 184632 185182 185381 184883 183711 182646 182382 182812 183655 185198 187826 191343 195351
54771 195351 199803 204705 209749 214712 219824 225404 231557 238374 245833 253368 260285 266700 273169 279266
54757 279266 283571 285357 285137 283196 278894 272139 264333 256985 250229 243530 236962 230951 225486 220391
54743 220391 215813 211903 208619 206232 205202 205141 204854 203874 202977 202740 202759 202872 203803 205769 207684 208759 209783
54726 209783 211706 214023 215809 217464 220112 223967 228497 233593 239381 245248 250183 253713 255696 255698 253501
$$ packed form
54844A85094l122k545r84m1j86l21o8l29j205j516q38k31m19q21q79q42q39n23
54826A69385M5L15K67L56N14L00o2J5K86P3m17l75J86N98P92J113J264P89K40
54807A75684M24R12P85M00P24J368J085L6l79J19L88Rp7N42J008O93R4k73n08
54788A83034n99j81N76R74Q28N50J99m98j172j065k64M30Q43J543K628L517M008
54771A95351M452M902N044M963N112N580O153O817P459P535O917O415O469O097
54757B79266M305J786k20j941m302o755p806p348o756o699o568o011n465n095
54743B20391m578l910l284k387j030o1k87r80q97k37J9J13R31J966J915J075J024
54726B09783J923K317J786J655K648L855M530N096N788N867M935L530J983Kk197
$$ plain form
54711 253501 249808 245568 240963 235764 230135 224398 218586 213012 208581 205715 203552 201063 198354 196066
54697 196066 194173 192346 190870 190140 189718 188870 187721 186995 186940 187220 187482 187394 186581 185206 184097 183688 183453
54680 183453 182930 182503 182448 182181 181369 180901 181604 182733 182950 182245 181682 181733 182042 182472 183204 183954 184080 183338 181846
54661 181846 179729 177495 176214 176379 177140 177538 177912 179010 180364 180849 180433 180042 179907 179366 178256 177279 176882
54644 176882 176737 176541 176513 177012 178206 180053 182044 183230 183145 182476 182198 182334 182209 181562 180743 180172 180257 181329
54626 181329 182938 183761 183037 181629 180793 180512 180054 179572 179861 180850 181600 181696 181536 181242 180416 179085 178034 178006
54608 178006 179166 181241 183593 185368 186282 187021 188243 189577 190309 190552 190813 190862 190177 189237 189164 190133 191122
54591 191122 191270 190612 189479 188075 186711 185720 185083 184711 184913 185943 187382 188644 189810 191148 192197 192301
$$ packed form
54711B53501l693m240m605n199n629n737n812n574m431k866k163k489k709k288
54697A96066j893j827j476p30m22q48j149p26n5K80K62q8q13j375j109m09k35
54680A83453n23m27n5k67q12m68P03J129K17p05n63N1L09M30P32P50J26p42j492
54661A81846k117k234j281J65P61L98L74J098J354M85m16l91j35n41j110r77l97
54644A76882j45j96k8M99J194J847J991J186q5o69k78J36j25o47q19n71Q5J072
54626A81329J609Q23p24j408q36k81m58m82K89R89P50R6j60k94q26j331j051k8
54608A78006J160K075K352J775R14P39J222J334P32K43K61M9o85r40p3R69R89
54591A91122J48o58j133j404j364r91o37l72K02J030J439J262J166J338J049J04
$$ plain form
54575 192301 191793 191703 192380 193292 194037 194645 194975 194753 194247 194115 194576 195372 196360 197498 198462 199064 199797 201133
54557 201133 202550 203104 202769 202350 202287 202455 202886 203713 204510 204657 204314 204229 204703 205521 206646 208074 209227 209510
54539 209510 209342 209658 210566 211455 212323 213874 216311 218975 221238 222891 223765 223911 224061 224953 226244 226966 226953
54522 226953 226810 226693 226221 225477 224924 224314 222920 220951 219516 218982 218491 217380 216005 214857 213869 212984 212492
54505 212492 212424 212364 212117 211853 211488 210739 209842 209378 209360 209398 209705 210813 212266 212905 212703 212976 214301 215494 215341
54486 215341 214276 213507 213392 213553 213922 214750 215985 217328 218646 219919 221036 221996 222988 224064 225087 226115
54470 226115 227399 228937 230559 232492 235109 238028 240217 241263 241813 242475 242984 242864 242312 241949 242131 242852
54454 242852 243975 245260 246446 247454 248240 248430 247556 245724 243635 241884 240505 239133 237270 234650 231812
$$ packed form
54575A92301n08r0O77R12P45O08L30k22n06j32M61P96R88J138R64O02P33J336
54557B01133J417N54l35m19o3J68M31Q27P97J47l43q5M74Q18J125J428J153K83
54539B09510j68L16R08Q89Q68J551K437K664K263J653Q74J46J50Q92J291P22j3
54522B26953j43j17m72p44n53o10j394j969j435n34m91j111j375j148r88q85m92
54505B12492o8o0k47k64l65p49q97m64j8L8L07J108J453O39k02K73J325J193j53
54486B15341j065p69j15J61L69Q28J235J343J318J273J117R60R92J076J023J028
54470B26115J284J538J622J933K617K919K189J046N50O62N09j20n52l63J82P21
54454B42852J123J285J186J008P86J90q74j832k089j751j379j372j863k620k838
$$ plain form
54439 231812 229965 229678 230029 229824 229208 229120 229497 229266 228099 226877 226270 226002 225836 226143 226993 227697 227766 227580
54421 227580 227612 227733 227725 227814 228244 228874 229528 230206 230697 230628 230127 229876 230233 230843 231259 231322 230867 229779 228532 227941
54401 227941 228216 228878 229716 230992 232602 233914 234699 235374 236100 236519 236660 237164 238191 239030 239295 239644 240728
54384 240728 242147 243085 243343 243174 242606 241543 240121 238529 236796 235132 234076 233918 234305 234604 234387 233498
54368 233498 232127 230938 230624 231226 232308 233658 235208 236412 236605 236015 235590 235763 236249 237106 238880 241325
54352 241325 243007 242761 240885 238521 236513 235199 234534 234061 233315 232483 232001 231512 230147 227976 226083 224890
54336 224890 223539 221461 219482 218650 218828 219175 219296 219245 219040 218817 218976 219615 220251 220470 220347 220038 219612 219496
54318 219496 220268 221684 222736 222982 223043 223493 224192 224953 225757 225941 224420 221431 218896 218286 219052 219917 220549
$$ packed form
54439B31812j847k87L51k05o16q8L77k31j167j222o07k68j66L07Q50P04O9j86
54421B27580L2J21qQ9M30O30O54O78M91o9n01k51L57O10M16O3m55j088j247n91
54401B27941K75O62Q38J276J610J312P85O75P26M19J41N04J027Q39K65L49J084
54384B40728J419R38K58j69n68j063j422j592j733j664j056j58L87K99k17q89
54368B33498j371j189l14O02J082J350J550J204J93n90m25J73M86Q57J774K445
54352B41325J682k46j876k364k008j314o65m73p46q32m82m89j365k171j893j193
54336B24890j351k078j979q32J78L47J21n1k05k23J59O39O36K19j23l09m26j16
54318B19496P72J416J052K46O1M50O99P61Q04J84j521k989k535o10P66Q65O32
$$ plain form
54301 220549 221000 220595 218719 216061 213930 212760 212232 212306 213112 214256 215227 216142 217230 217953 217571 216295 215089
54284 215089 214545 214680 215447 216687 217792 218159 217824 217140 216171 214998 214168 214089 214264 213868 212874 211945 211403 210986
54266 210986 210462 209897 209348 208809 208432 208491 209157 210447 212179 213880 215112 216007 217030 218144 218836 219102 219607
54249 219607 220543 221119 220663 219502 218263 217032 215754 214716 214035 213355 212646 212595 213482 214425 214527 214177 214340
54232 214340 215073 215568 215320 214454 213247 212031 211310 211326 211768 212316 213103 214189 215091 215349 215086 214582 213837 213001
54214 213001 212570 212616 212478 211779 211087 211042 211515 212204 213154 214030 213782 212009 209885 208825 208904 209420 210180 211161 211723
54195 211723 211385 210788 210717 210726 210009 209071 209173 210424 211752 212531 212989 213169 212752 211950 211393 211088 210485 209511 208563
54176 208563 207465 205572 203032 200967 200189 200460 201077 201507 201498 201328 201915 203847 206322 207867 208099 207979 208331
$$ packed form
54301B20549M51m05j876k658k131j170n28P4Q06J144R71R15J088P23l82j276j206
54284B15089n44J35P67J240J105L67l35o84r69j173q30p9J75l96r94r29n42m17
54266B10986n24n65n49n39l77N9O66J290J732J701J232Q95J023J114O92K66N05
54249B19607R36N76m56j161j239j231j278j038o81o80p09n1Q87R43J02l50J63
54232B14340P33M95k48q66j207j216p21J6M42N48P87J086R02K58k63n04p45q36
54214B13001m31M6j38o99o92m5M73O89R50Q76k48j773k124j060P9N16P60R81N62
54195B11723l38n97p1Rp17r38J02J251J328P79M58J80m17q02n57l05o03r74r48
54176B08563j098j893k540k065p78K71O17M30rj70N87J932K475J545K32j20L52
$$ plain form
54159 208331 208941 209284 209323 209342 209527 209908 210416 211010 211985 213774 216020 217412 217125 215981 215335 215185 214375 212415
54141 212415 210039 208044 206567 205558 205065 204903 204742 204678 205106 206027 207038 207938 208757 209341 209522 209508 209495 209125
54123 209125 208067 206887 206576 207304 208355 209119 209472 209381 208954 208674 208928 209452 209882 210448 211382 212166 212290 212279
54105 212279 212920 213857 214148 213924 214195 215233 216447 217784 219783 222110 223499 223512 223113 223108 223162 222815 222345 222066
54087 222066 221733 221222 221017 221440 222067 222358 222248 221799 220944 219936 219390 219544 220061 220825 222256 224519 227028
54070 227028 229028 230211 230576 230247 229581 228933 228278 227607 227613 229107 231706 233986 235082 235299 234988 233914 232186
54053 232186 230876 231024 232632 235113 238122 241411 244399 246524 247758 248452 248925 249416 250120 251110 252481 254593
54037 254593 257782 261899 266589 271824 277575 283109 287481 290804 294245 298650 303875 309476 315205 320665
$$ packed form
54159B08331O10L43L9J9J85L81N08N94R75J789K246J392k87j144o46j50q10j960
54141B12415k376j995j477j009m93j62j61o4M28R21J011R00Q19N84J81j4j3l70
54123B09125j058j180l11P28J051P64L53r1m27k80K54N24M30N66R34P84J24j1
54105B12279O41R37K91k24K71J038J214J337J999K327J389J3l99nN4l47m70k79
54087B22066l33n11k05M23O27K91j10m49q55j008n46J54N17P64J431K263K509
54070B27028K000J183L65l29o66o48o55o71OJ494K599K280J096K17l11j074j728
54053B32186j310J48J608K481L009L289K988K125J234O94M73M91P04R90J371K112
54037B54593L189M117M690N235N751N534M372L323L441M405N225N601N729N460
$$ plain form
54023 320665 325422 329766 334523 339816 344759 348746 352199 355662 358921 361553 363682 365621 367274 368434
54009 368434 369281 370116 370918 371523 372028 372831 374495 377620 382487 388871 396595 406061 417600 430295 442143
53994 442143 451283 456365 456028 449296 436943 421504 405422 389799 375091 361951 350783 341214 332727
53981 332727 325345 319180 313823 308717 303762 299121 294738 290459 286413 283037 280790 279791 279441 278641 276884
53966 276884 274932 273780 273179 272017 270054 268275 267470 267445 267773 268362 269060 269612 270340 271984 274568 277227
53950 277227 279387 281296 283211 285034 286961 289468 292357 294866 297060 299984 304058 308461 312585 316865
53936 316865 321532 325807 329188 332417 336283 340436 344321 348245 352411 355873 357669 358383 359343 360785 362009
53921 362009 362913 364260 366570 369675 373200 376791 380164 383594 387973 393680 399921 405930 412193 419514
$$ packed form
54023C20665M757M344M757N293M943L987L453L463L259K632K129J939J653J160
54009C68434Q47Q35Q02O05N05Q03J664L125M867O384P724R466J1539J2695J1848
53994D42143R140N082l37o732j2353j5439j6082j5623j4708j3140j1168r569q487
53981C32727p382o165n357n106m955m641m383m279m046l376k247r99l50q00j757
53966B76884j952j152o01j162j963j779q05k5L28N89O98N52P28J644K584K659
53950B77227K160J909J915J823J927K507K889K509K194K924M074M403M124M280
53936C16865M667M275L381L229L866M153L885L924M166L462J796P14R60J442J224
53921C62009R04J347K310L105L525L591L373L430M379N707O241O009O263P321
$$ plain form
53907 419514 427417 434637 440880 446871 452763 457641 460770 462389 463067 463066 462574 461905 461151 460086 458545 456559
53891 456559 454126 451255 448207 445282 442312 438754 434326 429261 423932 418455 412679 406407 399682 392907
53877 392907 386543 380673 375153 370159 366153 363231 360979 359055 357348 355503 352991 349972 347326 345448
53863 345448 343652 341240 338486 336056 334023 332036 329914 327528 324665 321542 318916 317109 315456 313266
53849 313266 310740 308385 306149 303874 301980 300921 300448 300138 300124 300520 300747 300373 300215 301587 304702 308701
53833 308701 312989 317667 322881 328675 335405 343516 353092 364329 378146 395232 414402 432652 446937
53820 446937 455427 457439 453232 444049 431609 417230 401749 386003 370809 356598 343764 333152
53808 333152 325441 320135 315946 312216 309326 307793 307716 309064 311653 314750 317451 319665 322137 325421 329446
$$ packed form
53907D19514P903P220O243N991N892M878L129J619O78jm92o69p54j065j541j986
53891D56559k433k871l048k925k970l558m428n065n329n477n776o272o725o775
53877C92907o364n870n520m994m006k922k252j924j707j845k512l019k646j878
53863C45448j796k412k754k430k033j987k122k386k863l123k626j807j653k190
53849C13266k526k355k236k275j894j059m73l10j4L96K27l74j58J372L115L999
53833C08701M288M678N214N794O730Q111R576J1237J3817J7086J9170J8250J4285
53820D46937Q490K012m207r183j2440j4379j5481j5746j5194j4211j2834j0612
53808C33152p711n306m189l730k890j533p7J348K589L097K701K214K472L284M025
$$ plain form
53793 329446 334123 339598 345666 351629 357052 362140 367025 371236 374224 376027 377057 377567 377674 377644 377732 377790
53777 377790 377353 376205 374699 373355 372103 370217 367252 363835 360981 358711 355995 352290 348319 344957
53763 344957 342037 338852 335235 331346 326894 321498 315662 310563 306856 304256 302199 300331 298405 296300
53749 296300 294223 292530 291409 290965 291269 291900 291845 290486 288401 286675 285692 285147 284859 284797 284674 284342 284356 285339
53731 285339 286935 288234 289082 290118 291550 292825 293583 294063 294401 294327 293789 293224 292963 292952 293163 293718 294488 295094
53713 295094 295421 295602 295506 294877 293992 293482 293432 293387 293352 294063 296002 298847 302106 305636 309215 312280 314572 316537
53695 316537 318713 321098 323450 325781 328145 330292 331880 332872 333483 333923 334322 334696 334876 334690 334278 333983
53679 333983 333913 333886 333787 333614 333175 332201 330842 329704 329256 329480 330106 330831 331301 331281 330918 330528 330091 329305 328093
$$ packed form
53793C29446M677N475O068N963N423N088M885M211K988J803J030N10J07l0Q8N8
53777C77790m37j148j506j344j252j886k965l417k854k270k716l705l971l362
53763C44957k920l185l617l889m452n396n836n099l707k600k057j868j926k105
53749B96300k077j693j121m44L04O31n5j359k085j726r83n45k88o2j23l32J4R83
53731B85339J596J299Q48J036J432J275P58M80L38p4n38n65k61j1K11N55P70O06
53713B95094L27J81r6o29q85n10n0m5l5P11J939K845L259L530L579L065K292J965
53695C16537K176K385K352K331K364K147J588R92O11M40L99L74J80j86m12k95
53679C33983p0k7r9j73m39r74j359j138m48K24O26P25M70k0l63l90m37p86j212
$$ plain form
53660 328093 326656 325045 323148 321194 319768 319144 318920 318512 317734 316778 315895 315234 314849 314835 315478 317049 319283
53643 319283 321324 322543 323122 323466 323422 322707 321821 321778 322871 324360 325442 325940 326045 326014 326300 327369 329164
53626 329164 331138 332943 334685 336449 338063 339471 340869 342367 343886 345526 347602 350217 353135 356154
53612 356154 359242 362318 365259 368176 371274 374451 377478 380550 384183 388489 392990 397219 401123 404840
53598 404840 408453 411991 415277 417799 419153 419571 419569 419121 417732 415332 412604 410352 408965 408447 408422 408081
53582 408081 406650 404076 400954 397849 395087 392994 391685 390626 389083 387021 385042 383436 381970 380563
53568 380563 379426 378414 376992 375086 373310 372131 371398 370986 371265 372572 374581 376550 377942 378749 379487
53553 379487 380826 382842 384697 385544 385604 385809 386629 387954 389930 392930 396686 400485 404369 409143 414882
$$ packed form
53660C28093j437j611j897j954j426o24k24m08p78r56q83o61l85j4O43J571K234
53643C19283K041J219N79L44m4p15q86m3J093J489J082M98J05l1K86J069J795
53626C29164J974J805J742J764J614J408J398J498J519J640K076K615K918L019
53612C56154L088L076K941K917L098L177L027L072L633M306M501M229L904L717
53598D04840L613L538L286K522J354M18km48j389k400k728k252j387n18k5l41
53582D08081j431k574l122l105k762k093j309j059j543k062j979j606j466j407
53568C80563j137j012j422j906j776j179p33m12K79J307K009J969J392Q07P38
53553C79487J339K016J855Q47O0K05Q20J325J976L000L756L799L884M774N739
$$ plain form
53538 414882 420455 425039 429215 433992 439560 445733 452913 461750 472202 483634 495668 508402 521848
53525 521848 535525 548624 560547 571482 582308 593526 604444 614079 622790 632174 643287 655912
53513 655912 669809 685560 703560 723035 742945 763304 784861 807882 831909 856379 880822
53502 880822 904685 927526 949350 970464 991162 1011708 1032231 1052396 1071541 1089433 1106580
53491 1106580 1123667 1141153 1159439 1178765 1198623 1217924 1236129 1253726 1271256 1288498 1304942
53480 1304942 1320371 1334543 1346989 1357724 1367544 1376963 1385333 1391666 1395917 1398841 1400915 1401956 1401443
53467 1401443 1398703 1393120 1384696 1374171 1362157 1348524 1333025 1315989 1297899 1278723 1258307 1237066
53455 1237066 1215709 1194578 1173716 1153165 1132609 1111218 1088620 1065743 1043985 1023706 1004185
$$ packed form
53538D14882N573M584M176M777N568O173P180Q837J0452J1432J2034J2734J3446
53525E21848J3677J3099J1923J0935J0826J1218J0918R635Q711R384J1113J2625
53513F55912J3897J5751J8000J9475J9910K0359K1557K3021K4027K4470K4443
53502H80822K3863K2841K1824K1114K0698K0546K0523K0165J9145J7892J7147
53491A106580J7087J7486J8286J9326J9858J9301J8205J7597J7530J7242J6444
53480A304942J5429J4172J2446J0735R820R419Q370O333M251K924K074J041n13
53467A401443k740n583q424j0525j2014j3633j5499j7036j8090j9176k0416k1241
53455A237066k1357k1131k0862k0551k0556k1391k2598k2877k1758k0279j9521
$$ plain form
53444 1004185 984814 965717 947324 930061 914390 900524 888084 876506 865787 856474 849011 843541
53432 843541 840195 839045 839750 841605 844030 846862 850359 855146 861926 870989 882161 895346 910677 927879
53418 927879 946068 964697 984294 1005707 1028962 1053460 1078960 1105700 1133790 1163186 1194156
53407 1194156 1227093 1261881 1298004 1335334 1374346 1415486 1458678 1503494 1549552 1596780 1645482
53396 1645482 1696012 1748163 1801157 1854419 1908054 1962273 2016784 2071122 2125098 2178422 2230300
53385 2230300 2280079 2327980 2374547 2419525 2461914 2500924 2536240 2567546 2594515 2617287 2636303
53374 2636303 2651603 2662831 2669937 2673319 2673200 2669303 2661162 2648262 2629855 2605188 2574127 2537238
53362 2537238 2495176 2448270 2396818 2341477 2283246 2223212 2162259 2100895 2039436 1978468 1918850
$$ packed form
53444A004185j9371j9097j8393j7263j5671j3866j2440j1578j0719r313p463n470
53432H43541l346j150P05J855K425K832L497M787O780R063J1172J3185J5331J7202
53418I27879J8189J8629J9597K1413K3255K4498K5500K6740K8090K9396L0970
53407A194156L2937L4788L6123L7330L9012M1140M3192M4816M6058M7228M8702
53396A645482N0530N2151N2994N3262N3635N4219N4511N4338N3976N3324N1878
53385B230300M9779M7901M6567M4978M2389L9010L5316L1306K6969K2772J9016
53374B636303J5300J1228P106L382j19l897q141j2900j8407k4667l1061l6889
53362B537238m2062m6906n1452n5341n8231o0034o0953o1364o1459o0968n9618
$$ plain form
53351 1918850 1861122 1805245 1751175 1699264 1649658 1601702 1554515 1507913 1462278 1417783 1374318
53340 1374318 1331945 1290796 1250782 1212053 1175586 1142498 1112731 1085125 1058827 1034057 1011417
53329 1011417 991159 973263 957584 943696 931156 920120 911151 904168 898179 892444 887424 884131
53317 884131 882883 883110 884133 885664 887599 889839 892518 896221 901747 909548 919419 930758 943122 956408
53303 956408 970623 985743 1001925 1019529 1038738 1059379 1081366 1104976 1130329 1156871 1183863
53292 1183863 1211247 1239568 1268974 1298810 1328243 1356972 1385079 1412365 1438002 1460888 1480464
53281 1480464 1497196 1512047 1525366 1536530 1544824 1550268 1553230 1553580 1550782 1544756 1536136 1525664 1513675
53268 1513675 1500154 1484956 1467931 1449123 1428852 1407375 1384521 1359917 1333535 1305734 1276775
$$ packed form
53351A918850n7728n5877n4070n1911m9606m7956m7187m6602m5635m4495m3465
53340A374318m2373m1149m0014l8729l6467l3088k9767k7606k6298k4770k2640
53329A011417k0258j7896j5679j3888j2540j1036q969o983n989n735n020l293
53317H84131j248K27J023J531J935K240K679L703N526P801R871J1339J2364J3286
53303I56408J4215J5120J6182J7604J9209K0641K1987K3610K5353K6542K6992
53292A183863K7384K8321K9406K9836K9433K8729K8107K7286K5637K2886J9576
53281A480464J6732J4851J3319J1164Q294N444K962L50k798o026q620j0472j1989
53268A513675j3521j5198j7025j8808k0271k1477k2854k4604k6382k7801k8959
$$ plain form
53257 1276775 1246581 1214995 1182119 1148431 1114676 1081550 1049279 1017570 986115 955024 924663
53246 924663 895272 866925 839670 813493 788334 764262 741395 719433 697625 675506 653450
53235 653450 632232 612275 593641 576480 561060 547401 535151 523807 513005 502772 493533 485560
53223 485560 478424 471459 464780 459147 454539 449674 443470 436348 429477 423330 417700 412563 407973 403405
53209 403405 398130 392202 386432 381489 377601 374885 373221 371933 370275 368225 366215 364236 361777 358495
53195 358495 354391 349565 344531 340505 338484 337998 337507 336085 334032 331910 329820 327770 325953 324370 322725
53180 322725 320876 318917 316791 314404 312217 311060 311106 311590 311765 311717 312041 313113 314830 316723 318189 318928
53164 318928 319222 319515 319832 319930 319840 319816 319924 320196 320962 322317 323361 322808 320486 317588 315321 313871 312815
$$ packed form
53257A276775l0194l1586l2876l3688l3755l3126l2271l1709l1455l1091l0361
53246I24663k9391k8347k7255k6177k5159k4072k2867k1962k1808k2119k2056
53235F53450k1218j9957j8634j7161j5420j3659j2250j1344j0802j0233r239p973
53223D85560p136o965o679n633m608m865o204p122o871o147n630n137m590m568
53209D03405n275n928n770m943l888k716j664j288j658k050k010j979k459l282
53195C58495m104m826n034m026k021m86m91j422k053k122k090k050j817j583j645
53180C22725j849j959k126k387k187j157M6M84J75m8L24J072J717J893J466P39
53164C18928K94K93L17R8r0k4J08K72P66J355J044n53k322k898k267j450j056
$$ plain form
53147 312815 311851 310852 309698 308390 307046 305724 304546 303895 303979 304235 303777 302470 301042 300075 299487 299041 298718
53130 298718 298432 297921 297111 296116 294850 293197 291653 291080 291655 292638 293403 294085 294951 295808 296456 297225 298548
53113 298548 300248 301689 302500 302889 303301 303907 304392 304270 303458 302391 301415 300390 299128 297859 296823 295798
53097 295798 294583 293596 293328 293425 293005 291740 290004 288186 286576 285620 285454 285370 284601 283457 282744 282326 281393
53080 281393 280024 279195 279160 279095 278558 278020 277598 276612 274971 273778 273802 274410 274796 275289 276515 278091 279147 279577
53062 279577 279824 279841 279165 277805 276418 275676 275819 276577 277313 277646 278093 279522 281827 283902 285213 286495 288343
53045 288343 290067 290689 290345 289860 289495 288928 288037 286935 285569 283989 282658 281829 280930 279225 276772 274161
53029 274161 271612 268968 266389 264473 263757 264378 265881 267104 266833 265112 263464 263291 264451 265852 266861
$$ packed form
53147C12815r64r99j154j308j344j322j178o51Q4K56m58j307j428r67n88m46l23
53130B98718k86n11q10r95j266j653j544n73N75R83P65O82Q66Q57O48P69J323
53113B98548J700J441Q11L89M12O06M85j22q12j067r76j025j262j269j036j025
53097B95798j215r87k68R7m20j265j736j818j610r56j66q4p69j144p13m18r33
53080B81393j369q29l5o5n37n38m22r86j641j193K4O08L86M93J226J576J056M30
53062B79577K47J7o76j360j387p42J43P58P36L33M47J429K305K075J311J282J848
53045B88343J724O22l44m85l65n67q91j102j366j580j331q29q99j705k453k611
53029B74161k549k644k579j916p16O21J503J223k71j721j648j73J160J401J009
$$ plain form
53014 266861 267526 267953 268255 268731 269345 269359 268238 266700 266098 266893 268360 269600 270142 269735 268337 266474 265041
52997 265041 264554 264839 265394 265795 265867 265751 265671 265511 264917 263983 263344 263294 263360 263158 263067 263513 264152 264464 264669 265239
52977 265239 265938 266190 266153 266435 266935 266947 266450 266376 267299 268650 269599 270131 270817 271946 273338 274822 276465 278320
52959 278320 280177 281722 282865 283756 284421 284623 284246 283587 282898 281917 280342 278524 276941 275195 272527 269350
52943 269350 267057 265987 264850 262820 260927 260370 260517 259922 258588 257764 257879 258083 257773 257296 256985 256630 256125
52926 256125 255786 255749 255756 255732 255920 256267 256302 255785 254991 254260 253723 253502 253726 254280 254994 255987 257376 258737 259404 259279
52906 259279 258845 258478 258300 258577 259613 261195 262725 263985 265259 266679 267905 268465 268011 266357 263835 261514
52890 261514 260434 260538 260916 261086 261378 261958 262221 261553 260225 259100 258675 258650 258343 257409 256224 255550 255785 256684
$$ packed form
53014B66861O65M27L02M76O14J4j121j538o02P95J467J240N42m07j398j863j433
52997B65041m87K85N55M01P2j16q0j60n94r34o39n0O6k02r1M46O39L12K05N70
52977B65239O99K52l7K82N00J2m97p4R23J351R49N32O86J129J392J484J643J855
52959B78320J857J545J143Q91O65K02l77o59o89r81j575j818j583j746k668l177
52943B69350k293j070j137k030j893n57J47n95j334q24J15K04l10m77l11l55n05
52926B56125l39l7Pk4J88L47L5n17p94p31n37k21K24N54P14R93J389J361O67j25
52906B59279m34l67j78K77J036J582J530J260J274J420J226N60m54j654k522k321
52890B61514j080J04L78J70K92N80K63o68j328j125m25k5l07r34j185o74K35Q99
$$ plain form
52872 256684 257869 259229 260570 261291 260922 259764 258572 257812 257641 258233 259539 260926 261708 262037 262782 264570
52856 264570 267349 270702 274087 276874 278628 279324 279059 277857 276096 274620 273799 272868 270910 268180 265669
52841 265669 263656 261607 259365 257528 256584 256464 256972 257888 258606 258423 257364 256108 255088 254304 254042 254959
52825 254959 257289 260515 263901 266809 268576 268823 267986 266886 265745 264251 262502 261091 260229 259631 259391
52810 259391 260095 261857 264027 266128 268433 271382 275067 279370 283836 287311 288578 287638 285567 282950 279432
52795 279432 275068 270972 268002 265723 263423 261349 260102 259420 258454 256928 255279 253958 253253 253476 254661
52780 254661 256235 257534 258482 259293 259770 259475 258509 257551 257103 257049 257033 256966 257056 257437 257855 257786 256995 255928 255366
52761 255366 255709 256770 258064 258969 258823 257481 255729 254629 254454 254766 255433 256785 258709 260398 261306 261697
$$ packed form
52872B56684J185J360J341P21l69j158j192p60j71N92J306J387P82L29P45J788
52856B64570K779L353L385K787J754O96k65j202j761j476q21r31j958k730k511
52841B65669k013k049k242j837r44j20N08R16P18j83j059j256j020p84k62R17
52825B54959K330L226L386K908J767K47q37j100j141j494j749j411q62n98k40
52810B59391P04J762K170K101K305K949L685M303M466L475J267r40k071k617l518
52795B79432m364m096k970k279k300k074j247o82r66j526j649j321p05K23J185
52780B54661J574J299R48Q11M77k95r66r58m48n4j6o7R0L81M18o9p91j067n62
52761B55366L43J061J294R05j46j342j752j100j75L12O67J352J924J689R08L91
$$ plain form
52745 261697 261985 262224 262556 263451 265039 266745 268037 269018 269914 270573 270890 271206 271771 272318 272615 272914 273296 273107
52727 273107 271814 270050 269143 269716 271279 272979 274208 274660 274415 274012 273975 274228 274173 273370 271945 270503 269786
52710 269786 270158 271198 272017 272198 272143 272307 272462 272041 270929 269515 268197 267107 266168 265158 263927 262712
52694 262712 261968 261701 261383 260759 260374 260888 262204 263664 264895 266040 267327 268786 270340 271918 273439 274755
52678 274755 275502 275150 273632 271906 271293 272080 273283 274019 274441 274999 275499 275539 275358 275481 275799 275708 275057 274391
52660 274391 274324 275100 276644 278591 280345 281547 282455 283535 284795 285889 286782 287888 289538 291579 293544
52645 293544 295003 295781 295936 295534 294473 292736 290710 288881 287278 285697 284487 284308 284918 285070 284199 283438
52629 283438 284165 286149 288101 289724 292118 296130 301182 305932 309348 310929 310564 308613 305802 302655 299198
$$ packed form
52745B61697K88K39L32Q95J588J706J292R81Q96O59L17L16N65N47K97K99L82j89
52727B73107j293j764r07N73J563J700J229M52k45m03l7K53n5q03j425j442p17
52710B69786L72J040Q19J81n5J64J55m21j112j414j318j090r39j010j231j215
52694B62712p44k67l18o24l85N14J316J460J231J145J287J459J554J578J521J316
52678B74755P47l52j518j726o13P87J203P36M22N58N00M0j81J23L18r1o51o66
52660B74391o7P76J544J947J754J202R08J080J260J094Q93J106J650K041J965
52645B93544J459P78J55m02j061j737k026j829j603j581j210j79O10J52q71p61
52629B83438P27J984J952J623K394M012N052M750L416J581l65j951k811l147l457
$$ plain form
52614 299198 295395 291653 288696 286979 286324 286144 286030 286067 286432 286783 286423 285175 283687 282648 282077 281667 281422
52597 281422 281487 281668 281662 281618 282000 282915 283996 284899 285577 286114 286568 286996 287379 287575 287572 287658 288153 289067 290143 291102
52577 291102 291727 292054 292613 294039 296156 297836 298210 297673 297226 297197 297182 296951 296687 296426 295908 295029 293928 292594
52559 292594 290896 289064 287676 287038 286872 286695 286236 285499 284773 284518 284878 285261 284822 283432 281883 281087 281371
52542 281371 282577 284425 286554 288443 289629 290044 290129 290514 291479 292627 293226 292970 292274 291729 291572 291866 292862
52525 292862 294732 296980 298546 298660 297575 296443 296467 297922 299923 301301 301775 302048 302885 304484 306854 310161
52509 310161 314379 318951 323156 326499 328631 329436 329456 329580 329774 328773 325686 321398 317590 314786 312258
52494 312258 309581 307280 305890 305245 304899 304665 304559 304692 305277 306301 307214 307451 307265 307487 308456 309731 310890
$$ packed form
52614B99198l803l742k957j717o55j80j14L7L65L51l60j248j488j039n71m10k45
52597B81422O5J81om4L82R15J081R03O78N37M54M28L83J96lQ6M95R14J076R59
52577B91102O25L27N59J426K117J680L74n37m47k9j5k31k64k61n18q79j101j334
52559B92594j698j832j388o38j66j77m59p37p26k55L60L83m39j390j549p96K84
52542B81371J206J848K129J889J186M15Q5L85R65J148N99k56o96n45j57K94R96
52525B92862J870K248J566J14j085j132K4J455K001J378M74K73Q37J599K370L307
52509C10161M218M572M205L343K132Q05K0J24J94j001l087m288l808k804k528
52494C12258k677k301j390o45l46k34j06J33N85J024R13K37j86K22R69J275J159
$$ plain form
52477 310890 312034 313350 314739 316094 317549 319211 320952 322536 323729 324345 324578 325194 326901 329535 332337
52462 332337 334974 337759 340749 343292 344735 345108 344828 344044 342612 340463 337795 334971 332258 329558 326474
52447 326474 322882 319322 316474 314351 312445 310649 309520 309502 310260 310991 311144 310775 310366 310353 310687 310923 310789
52430 310789 310394 309711 308385 306456 304860 304511 305159 305835 306192 306638 307376 308211 309209 310573 311785 311920 311100
52413 311100 310744 311959 314437 317276 320067 322675 324839 326745 329447 333979 340420 348339 357677 368476
52399 368476 380131 391632 402317 411711 418815 422271 421347 416371 408306 398355 387901 378222 369994
52386 369994 363226 357652 353027 349185 346147 344075 342904 342085 341066 339963 339499 340263 342242 344970 347845
52371 347845 350362 352365 354158 356225 358762 361568 364266 366393 367381 366801 364787 362034 359256 356732 354433
$$ packed form
52477C10890J144J316J389J355J455J662J741J584J193O16K33O16J707K634K802
52462C32337K637K785K990K543J443L73k80p84j432k149k668k824k713k700l084
52447C26474l592l560k848k123j906j796j129j8P58P31J53l69m09j3L34K36j34
52430C10789l95o83j326j929j596l49O48O76L57M46P38Q35R98J364J212J35q20
52413C11100l56J215K478K839K791K608K164J906K702M532O441P919R338J0799
52399C68476J1655J1501J0685R394P104L456r24m976q065r951j0454r679q228
52386C69994o768n574m625l842l038k072j171q19j019j103m64P64J979K728K875
52371C47845K517K003J793K067K537K806K698K127R88n80k014k753k778k524k299
$$ plain form
52356 354433 352409 350846 349759 348822 347596 345946 344231 343132 343249 344664 346765 348608 349673 350257 350991
52341 350991 352060 353181 354250 355540 357136 358653 359840 361088 363000 365740 369201 373439 378456 383766
52327 383766 388795 393628 398867 404862 411562 418973 427094 435305 442459 447835 451652 454543 456955 459143
52313 459143 461299 463444 465504 467597 469996 472841 476266 480700 486468 493061 499418 505103 510672 516690
52299 516690 523025 529381 535846 542474 548843 554522 559512 563695 566258 566386 564426 561826 559871 558776
52285 558776 557883 556397 554064 551523 549966 550084 551316 552431 552911 553537 555463 558861 562647 565551 567310
52270 567310 568665 570325 572343 574660 577678 581743 586385 590832 595202 600354 606449 612485 617588 621996
52256 621996 626281 630359 634024 637943 643188 649909 657161 664016 670176 675501 679585 682103 683246 683647
$$ packed form
52356C54433k024j563j087r37j226j650j715j099J17J415K101J843J065N84P34
52341C50991J069J121J069J290J596J517J187J248J912K740L461M238N017N310
52327C83766N029M833N239N995O700P411Q121Q211P154N376L817K891K412K188
52313D59143K156K145K060K093K399K845L425M434N768O593O357N685N569O018
52299E16690O335O356O465O628O369N679M990M183K563J28j960k600j955j095
52285E58776q93j486k333k541j557J18J232J115M80O26J926L398L786K904J759
52270E67310J355J660K018K317L018M065M642M447M370N152O095O036N103M408
52256F21996M285M078L665L919N245O721P252O855O160N325M084K518J143M01
$$ plain form
52242 683647 684082 685231 687395 690301 693363 696169 698602 700607 702179 703573 705257 707518 710325 713628
52228 713628 717484 721770 725967 729514 732346 734922 737638 740369 742688 744473 746103 747955 749895 751437
52214 751437 752396 753194 754509 756723 759695 762934 765996 768812 771717 775134 779264 784053 789238 794300 798653
52199 798653 802092 804915 807437 809690 811854 814553 818222 822418 826428 830438 835373 841470 847705 852845
52185 852845 856573 859332 861667 863996 866481 868637 869325 867560 863189 856736 848912 840552 832571 825569
52171 825569 819611 814620 810747 808174 806796 806261 806122 805913 805514 805618 807347 811068 815892 820606 824726
52156 824726 828317 831234 833028 833421 832516 830772 829062 828422 829253 830934 832597 834117 835977 838330 840759
52141 840759 842959 845209 847945 851086 853853 855219 854558 852058 848596 845225 842688 841254 840810 841176 842533
$$ packed form
52242F83647M35J149K164K906L062K806K433K005J572J394J684K261K807L303
52228G13628L856M286M197L547K832K576K716K731K319J785J630J852J940J542
52214G51437R59P98J315K214K972L239L062K816K905L417M130M789N185N062M353
52199G98653L439K823K522K253K164K699L669M196M010M010M935O097O235N140
52185H52845L728K759K335K329K485K156O88j765m371o453p824q360p981p002
52171H25569n958m991l873k573j378n35j39k09l99J04J729L721M824M714M120
52156H24726L591K917J794L93r05j744j710o40Q31J681J663J520J860K353K429
52141H40759K200K250K736L141K767J366o61k500l462l371k537j434m44L66J357
$$ plain form
52126 842533 845499 850593 857779 866726 877221 888845 900620 911764 922741 934612 947173 958581
52114 958581 967257 973286 977507 980075 980751 979975 978672 977202 975305 973081 971405 971306 973276 977136 982341
52099 982341 988577 996237 1006039 1017974 1030991 1043924 1056272 1067741 1077638 1085164 1089812 1091054 1088262
52086 1088262 1081664 1072838 1063462 1053940 1044014 1034290 1026194 1020566 1017170 1015462 1014897 1014503 1013080 1010187
$$ packed form
52126H42533K966N094P186Q947J0495J1624J1775J1144J0977J1871J2561J1408
52114I58581Q676O029M221K568O76p76j303j470j897k224j676r9J970L860N205
52099I82341O236P660R802J1935J3017J2933J2348J1469R897P526M648J242k792
52086A088262o598q826r376r522r926r724q096n628l396j708n65l94j423k893
$$ [...]
##END NTUPLES=NMR SPECTRUM
##END=
