##TITLE=AC1424_CRIAH12234_7790548_GKUUlojbC5
##JCAMPDX= 6.0         $$ Bruker NMR JCAMP-DX V2.0
##DATA TYPE= NMR SPECTRUM
##DATA CLASS= NTUPLES
##ORIGIN= BRUKER
##OWNER= Administrator
$$ 1.72 TOPSPIN		Version 2.1
$$ 2013-04-16 19:22:32.258 -0700  Administrator@X
$$ Compression mode = diff/dup
##.OBSERVE FREQUENCY= 400.02188249412
##.OBSERVE NUCLEUS= ^1H
##.ACQUISITION MODE= SIMULTANEOUS (DQD)
##.ACQUISITION SCHEME= undefined
##.AVERAGES= 64
##.DIGITISER RES= 22
##SPECTROMETER/DATA SYSTEM= spect
##.PULSE SEQUENCE= noesygpps1d.comp
##.SOLVENT NAME= COFFEE_meoh
##.SHIFT REFERENCE= INTERNAL, COFFEE_meoh, 1, 14.96088
##AUDIT TRAIL= $$ (NUMBER, WHEN, WHO, WHERE, PROCESS, VERSION, WHAT)
$$ ##TITLE= Audit trail, TOPSPIN		Version 2.1
$$ ##JCAMPDX= 5.01
$$ ##ORIGIN= Bruker BioSpin GmbH
$$ ##OWNER= Administrator
$$ $$ E:\/data/COFFEE/nmr/AC1424_CRIAH12234_7790548_GKUUlojbC5/12/pdata/1/auditp.txt
$$ ##AUDIT TRAIL=  $$ (NUMBER, WHEN, WHO, WHERE, PROCESS, VERSION, WHAT)
(   1,<2013-04-16 19:22:27.102 -0700>,<Administrator>,<X>,<go>,<TOPSPIN 2.1>,
      <created by zg
	started at 2013-04-16 19:10:57.161 -0700,
	POWCHK enabled, PULCHK disabled,
       configuration hash MD5:
       33 CF 6A 21 5C D3 B9 40 6C 15 AA 8D 27 A2 4F 13
       data hash MD5: 64K
       32 F6 FC 59 1B 22 7D 7D 45 47 0F 17 D5 EB B2 54>)
(   2,<2013-04-16 19:22:30.180 -0700>,<Administrator>,<X>,<proc1d>,<TOPSPIN 2.1>,
      <Start of raw data processing
       efp LB = 0.3 FT_mod = 6 PKNL = 1 PHC0 = 0 PHC1 = 0 SI = 128K 
       data hash MD5: 128K
       7C B6 F2 EE C5 1A 09 2B 21 4B 08 82 52 54 0D 78>)
(   3,<2013-04-16 19:22:31.211 -0700>,<Administrator>,<X>,<proc1d>,<TOPSPIN 2.1>,
      <pk PHC0 = -77.41516 PHC1 = 0 
       data hash MD5: 128K
       A9 94 95 3E 0E 8C 5F 27 BC 65 2B E0 F7 62 DC 49>)
(   4,<2013-04-16 19:22:31.649 -0700>,<Administrator>,<X>,<proc1d>,<TOPSPIN 2.1>,
      <abs ABSG = 1 
       data hash MD5: 128K
       17 F0 3B D6 5B CB 94 A3 D2 23 62 41 9B BA E4 9C>)
(   5,<2013-04-16 19:22:31.758 -0700>,<Administrator>,<X>,<proc1d>,<TOPSPIN 2.1>,
      <abs ABSG = 2 
       data hash MD5: 128K
       2C DC 14 AF E8 49 3B 88 7E 87 03 D5 B4 87 D4 27>)
(   6,<2013-04-16 19:22:31.852 -0700>,<Administrator>,<X>,<proc1d>,<TOPSPIN 2.1>,
      <abs ABSG = 3 
       data hash MD5: 128K
       29 E1 07 6E 23 3E 4D 0B 0B 49 34 6F F5 53 9D 42>)
(   7,<2013-04-16 19:22:31.977 -0700>,<Administrator>,<X>,<proc1d>,<TOPSPIN 2.1>,
      <abs ABSG = 4 
       data hash MD5: 128K
       6E 06 D7 48 47 83 F3 14 40 27 33 64 03 7E 28 30>)
(   8,<2013-04-16 19:22:32.086 -0700>,<Administrator>,<X>,<proc1d>,<TOPSPIN 2.1>,
      <abs ABSG = 5 
       data hash MD5: 128K
       FF EB BC 4A FB EC 55 0B 92 B1 82 46 E4 EF 48 D3>)
$$ ##END=
$$ 
$$ $$ hash MD5
$$ $$ 95 A5 23 BE 89 6F 4A C7 D2 22 48 EC 65 54 61 1A
##$RELAX= 
##$RELAX= 
##$RELAX= 
##$RELAX= 
##$RELAX= 
##$RELAX= 
##$RELAX= 
##$RELAX= 
$$ Bruker specific parameters
$$ --------------------------
##$DU= <E:\>
##$EXPNO= 12
$$ [...]
##$TP07= 0
##$TPNAME0= <>
##$TPNAME1= <>
##$TPNAME2= <>
##$TPNAME3= <>
##$TPNAME4= <>
##$TPNAME5= <>
##$TPNAME6= <>
##$TPNAME7= <>
##$TPOAL= (0..7)
0.5 0.5 0.5 0.5 0.5 0.5 0.5 0.5
##$TPOFFS= (0..7)
0 0 0 0 0 0 0 0
##$TUNHIN= 0
##$TUNHOUT= 0
##$TUNXOUT= 0
##$USERA1= <user>
##$USERA2= <user>
##$USERA3= <user>
##$USERA4= <user>
##$USERA5= <user>
##$V9= 5
##$VALIST= <valist>
##$VCLIST= <CCCCCCCCCCCCCCC>
##$VD= 0
##$VDLIST= <DDDDDDDDDDDDDDD>
##$VPLIST= <PPPPPPPPPPPPPPP>
##$VTLIST= <TTTTTTTTTTTTTTT>
##$WBST= 2048
##$WBSW= 25
##$XGAIN= (0..3)
0 0 0 0
##$XL= 0
##$YL= 0
##$YMAX_a= 6520406
##$YMIN_a= -14038963
##$ZGOPTNS= <>
##$ZL1= 120
##$ZL2= 120
##$ZL3= 120
##$ZL4= 120
##$ABSF1= 14.96088
##$ABSF2= -5.597301
##$ABSG= 5
##$ABSL= 3
##$ALPHA= 0
##$AQORDER= 0
##$ASSFAC= 0
##$ASSFACI= 0
##$ASSFACX= 0
##$ASSWID= 0
##$AUNMP= <proc_prof1d_extract.lims>
##$AXLEFT= 0
##$AXNAME= <>
##$AXNUC= <1H>
##$AXRIGHT= 0
##$AXTYPE= 0
##$AXUNIT= <>
##$AZFE= 0.1
##$AZFW= 0.1
##$BCFW= 0
##$BC_mod= 0
##$BYTORDP= 0
##$COROFFS= 0
##$CY= 15
##$DATMOD= 1
##$DC= 0
##$DFILT= <>
##$DTYPP= 0
##$F1P= 0
##$F2P= 0
##$FCOR= 0.5
##$FTSIZE= 131072
##$FT_mod= 6
##$GAMMA= 0
##$GB= 0
##$INTBC= 1
##$INTSCL= 1
##$ISEN= 128
##$LB= 0.3
##$LEV0= 0
##$LPBIN= 0
##$MAXI= 10000
##$MC2= 0
##$MEAN= 0
##$ME_mod= 0
##$MI= 0
##$NCOEF= 0
##$NC_proc= -2
##$NLEV= 6
##$NOISF1= 0
##$NOISF2= 0
##$NSP= 0
##$NTH_PI= 0
##$NZP= 0
##$OFFSET= 14.96088
##$PC= 1
##$PHC0= -77.41516
##$PHC1= 0
##$PH_mod= 1
##$PKNL= yes
##$PPARMOD= 0
##$PPDIAG= 0
##$PPIPTYP= 0
##$PPMPNUM= 2147483647
##$PPRESOL= 1
##$PSCAL= 4
##$PSIGN= 0
##$PYNMP= <proc.py>
##$REVERSE= no
##$SF= 400.020009686731
##$SI= 131072
##$SIGF1= 0
##$SIGF2= 0
##$SINO= 400
##$SIOLD= 131072
##$SPECTYP= <>
##$SREGLST= <1H.CDCl3>
##$SSB= 0
##$STSI= 131072
##$STSR= 0
##$SW_p= 8223.68421052631
##$SYMM= 0
##$S_DEV= 0
##$TDeff= 65536
##$TDoff= 0
##$TI= <>
##$TILT= no
##$TM1= 0
##$TM2= 0
##$TOPLEV= 0
##$USERP1= <user>
##$USERP2= <user>
##$USERP3= <user>
##$USERP4= <user>
##$USERP5= <user>
##$WDW= 1
##$XDIM= 131072
##$YMAX_p= 424647874
##$YMIN_p= -10650
##$CURPLOT= <Network HP LaserJet P1505>
##$CURPRIN= <$Network HP LaserJet P1505>
##$DFORMAT= <normdp>
##$LAYOUT= <+/1D_H.xwp>
##$LFORMAT= <normlp>
##$PFORMAT= <normpl>
##$SURQMSG= 1
$$ End of Bruker specific parameters
$$ ---------------------------------
##NTUPLES= NMR SPECTRUM
##VAR_NAME=  FREQUENCY,     SPECTRUM/REAL,   SPECTRUM/IMAG
##SYMBOL=    X,             R,               I
##VAR_TYPE=  INDEPENDENT,   DEPENDENT,       DEPENDENT
##VAR_FORM=  AFFN,          ASDF,            ASDF
##VAR_DIM=   131072,        131072,          131072
##UNITS=     HZ,            ARBITRARY UNITS, ARBITRARY UNITS
##FACTOR=    0.0627417313425164, 1,          1
##FIRST=     8223.62146879497, -1373,        -57556
##LAST=      0,             543,             -58421
##MIN=       0,             -10650,          0
##MAX=       8223.62146879497, 424647874,    0
$$ Real data points
##PAGE= N=1
##DATA TABLE= (X++(R..R)), XYDATA
$$ [...]
$$ plain form
63880 691397 680698 671951 664617 659227 656639 656962 659580 664053 670557 679458 690858 704673 720878
63867 720878 739432 760162 782874 807465 833775 861401 889796 918490 947052 974919 1001501
63856 1001501 1026481 1049918 1071887 1092034 1109422 1122874 1131603 1135624 1135470 1131466 1123387 1110867
63844 1110867 1093898 1072811 1048084 1020505 991233 961209 930516 898720 865767 832156 798351
63833 798351 764577 731255 699079 668501 639631 612698 587970 565062 543068 521807 502243
63822 502243 485125 469870 455455 441849 429670 418825 408482 398276 388660 380067 372509 366013
63810 366013 360700 356248 352044 348069 345005 343240 342272 341249 339595 337013 333556 329941 327159 325431
63796 325431 324009 322157 319757 316726 312679 307670 302657 298563 295313 292376 289848 288334 287949 288001 287580
$$ packed form
63880F91397j0699q747p334n390k588L23K618M473O504Q901J1400J3815J6205
63867G20878J8554K0730K2712K4591K6310K7626K8395K8694K8562K7867K6582
63856A001501K4980K3437K1969K0147J7388J3452Q729M021j54m004q079j2520
63844A110867j6969k1087k4727k7579k9272l0024l0693l1796l2953l3611l3805
63833G98351l3774l3322l2176l0578k8870k6933k4728k2908k1994k1261j9564
63822E02243j7118j5255j4415j3606j2179j0845j0343j0206r616q593p558o496
63810C66013n313m452m204l975l064j765r68j023j654k582l457l615k782j728
63796C25431j422j852k400l031m047n009n013m094l250k937k528j514l85N2m21
$$ plain form
63781 287580 286101 283534 280584 278418 277680 277827 277863 277549 277423 277754 278093 277958 277490 277185 277215 277245 276824 275883
63763 275883 274873 274348 274439 274822 275191 275465 275553 275292 274761 274304 274073 273982 274260 275442 277406 279036 279493 279375
63745 279375 279874 281117 282208 282790 283644 285613 288718 292500 296505 300134 302756 304450 306154 308639 311655
63730 311655 314439 316717 318803 321060 323719 326979 330813 334803 338570 342303 346508 351289 356283 361295
63716 361295 366524 372001 377113 380959 383073 383624 383008 381419 378793 375110 370723 366421 363041 360915 359710
63701 359710 358887 358232 357840 357710 357631 357549 357759 358537 359762 361149 362789 365170 368641 373039 377879 382682 387046
63684 387046 390651 393345 395142 396028 395906 394876 393442 392275 391748 391773 392081 392555 393261 394204 395228 396299
63668 396299 397779 400051 402812 405094 406305 406886 407546 408138 407918 406722 405123 403315 400627 396485 391275
$$ packed form
63781B87580j479k567k950k166p38J47L6l14j26L31L39j35m68l05L0L0m21r41
63763B75883j010n25R1L83L69K74Q8k61n31m57k31r1K78J182J964J630M57j18
63745B79375M99J243J091N82Q54J969L105L782M005L629K622J694J704K485L016
63730C11655K784K278K086K257K659L260L834L990L767L733M205M781M994N012
63716C61295N229N477N112L846K114N51o16j589k626l683m387m302l380k126j205
63701C59710q23o55l92j30p9q2K10P78J225J387J640K381L471M398M840M803M364
63684C87046L605K694J797Q86j22j030j434j167n27K5L08M74P06R43J024J071
63668C96299J480K272K761K282J211N81O60N92k20j196j599j808k688m142n210
$$ plain form
63653 391275 385860 380701 375883 371574 367923 364741 361736 358890 356330 354076 352256 351217 351046 351271 351513
63638 351513 352144 353800 356414 359307 362138 365271 369219 374130 379795 385739 391399 396606 401869 407771
63624 407771 414204 420643 427095 434275 442797 452627 463396 474852 487022 500303 515458 533096 553150
63611 553150 575197 599198 625433 653752 683525 714477 746946 780948 815390 848449 878379
63600 878379 903770 923563 937328 945422 948620 947769 943879 938125 931359 923825 915627 907168 898715 889557
63586 889557 878034 862591 842820 819620 794528 768837 743147 717621 692551 668651 646915
63575 646915 628344 613601 602547 594112 587032 580946 576576 574748 575435 577767 580709 583617 586458 589690
63561 589690 593749 598574 603809 609414 615711 622814 630586 639360 650183 663868 680235 698771 719749
$$ packed form
63653C91275n415n159m818m309l651l182l005k846k560k254j820j039j71K25K42
63638C51513O31J656K614K893K831L133L948M911N665N944N660N207N263N902
63624D07771O433O439O452P180Q522R830J0769J1456J2170J3281J5155J7638K0054
63611E53150K2047K4001K6235K8319K9773L0952L2469L4002L4442L3059K9930
63600H78379K5391J9793J3765Q094L198q51l890n754o766p534q198q459q453r158
63586H89557j1523j5443j9771k3200k5092k5691k5690k5526k5070k3900k1736
63575F46915j8571j4743j1054q435p080o086m370j828O87K332K942K908K841L232
63561E89690M059M825N235N605O297P103P772Q774J0823J3685J6367J8536K0978
$$ plain form
63548 719749 744147 772765 806101 844913 889887 940186 992682 1042953 1086825 1120984 1143038
63537 1143038 1152177 1150027 1140217 1126583 1111693 1096960 1083477 1072117 1062864 1054567 1045605 1034617
63525 1034617 1020579 1002588 979979 952657 921225 886820 850877 814732 779257 744905 712178
63514 712178 681784 654133 628974 605895 584994 566645 550677 536263 522726 510148 499033
63503 499033 489573 481349 473617 465909 458503 452206 447388 443344 438946 433932 429168 425565 423080 420967
63489 420967 418746 416694 415513 415580 416468 417233 417356 417297 417906 419415 421410 423771 427109 432000 438091 444256
63473 444256 449501 453599 456909 459658 461432 461465 459514 456181 452174 447613 442521 437631 433961 431651 429955
63458 429955 428379 427078 426022 424703 423032 421706 421179 420990 420725 421034 422938 426563 431299 436862 443427
$$ packed form
63548G19749K4398K8618L3336L8812M4974N0299N2496N0271M3872L4159K2054
63537A143038R139k150r810j3634j4890j4733j3483j1360r253q297q962j0988
63525A034617j4038j7991k2609k7322l1432l4405l5943l6145l5475l4352l2727
63514G12178l0394k7651k5159k3079k0901j8349j5968j4414j3537j2578j1115
63503D99033r460q224p732p708p406o297m818m044m398n014m764l603k485k113
63489D20967k221k052j181O7Q88P65J23n9O09J509J995K361L338M891O091O165
63473D44256N245M098L310K749J774L3j951l333m007m561n092m890l670k310j696
63458D29955j576j301j056j319j671j326n27j89k65L09J904L625M736N563O565
$$ plain form
63443 443427 450935 459050 467811 477676 488910 501523 515826 532535 552275 575451 602623 634411
63431 634411 670635 709661 748595 783988 812709 832963 845007 850896 853420 855129 857890 862843
63419 862843 870747 882575 899656 922922 952132 986086 1023388 1062539 1101508 1137808 1169114 1193517
63407 1193517 1209501 1216503 1215677 1209504 1200336 1189644 1178541 1168122 1158690 1149146 1137786 1123506 1105857
63394 1105857 1084275 1057975 1026764 991590 954173 916281 879313 844165 811167 780175 751000
63383 751000 723884 699481 678205 659647 642979 628057 615829 607241 602012 598946 597407 597902 601109
63370 601109 606860 614399 623207 633174 644250 656390 669767 684708 701417 719921 740227 762396
63358 762396 786672 813749 844696 880215 919855 962110 1005276 1047977 1088900 1126280 1157900
$$ packed form
63443D43427P508Q115Q761R865J1234J2613J4303J6709J9740K3176K7172L1788
63431F34411L6224L9026L8934L5393K8721K0254J2044N889K524J709K761M953
63419H62843P904J1828J7081K3266K9210L3954L7302L9151L8969L6300L1306K4403
63407A193517J5984P002q26o173r168j0692j1103j0419r432r544j1360j4280j7649
63394A105857k1582k6300l1211l5174l7417l7892l6968l5148l2998l0992k9175
63383G51000k7116k4403k1276j8558j6668j4922j2228q588n229l066j539M95L207
63370F01109N751P539Q808R967J1076J2140J3377J4941J6709J8504K0306K2169
63358G62396K4276K7077L0947L5519L9640M2255M3166M2701M0923L7380L1620
$$ plain form
63347 1157900 1181720 1196766 1203580 1203766 1198986 1190435 1179263 1167030 1155189 1144042 1132593 1119502
63335 1119502 1103971 1085671 1064240 1039175 1010167 977401 941676 904383 867203 831574 798397
63324 798397 768237 741666 719268 701515 688814 681515 679427 681163 684040 684780 680497 669582 652307
63311 652307 630746 607664 585054 563629 543570 525316 509368 495710 483898 473681 465194 458565
63299 458565 453579 449713 446265 442580 438477 434368 430602 426716 421865 416047 410342 405633 401589 397356
63285 397356 392804 388576 385146 382447 380326 378763 377563 376363 375112 374203 373978 374412 375311 376384 377064
63270 377064 376807 375862 375310 375934 377416 379037 380751 382957 385473 387514 388689 389368 389921 390302 390707 392041
63254 392041 395110 399616 404447 408768 412442 415587 418387 421333 425049 429625 434499 439292 444507 451097
$$ packed form
63347A157900K3820J5046O814J86m780q551j1172j2233j1841j1147j1449j3091
63335A119502j5531j8300k1431k5065k9008l2766l5725l7293l7180l5629l3177
63324G98397l0160k6571k2398j7753j2701p299k088J736K877P40m283j0915j7275
63311F52307k1561k3082k2610k1425k0059j8254j5948j3658j1812j0217q487o629
63299D58565m986l866l448l685m103m109l766l886m851n818n705m709m044m233
63285C97356m552m228l430k699k121j563j200j200j251r09k25M34Q99J073O80
63270C77064k57r45n52O24J482J621J714K206K516K041J175O79N53L81M05J334
63254C92041L069M506M831M321L674L145K800K946L716M576M874M793N215O590
$$ plain form
63240 451097 459533 469500 480401 491870 503837 516383 529674 544000 559734 577096 595812 615063
63228 615063 633975 652234 670135 688108 706382 725067 744156 763282 781845 799768 817917
63217 817917 837361 858297 879986 901640 922957 943680 963064 980074 993994 1004590 1011716 1014941
63205 1014941 1013686 1007703 997302 983072 965477 944909 922081 898090 873980 850519 828467 808715
63193 808715 791856 777839 766382 757557 751599 748315 747147 747873 750935 757004 766522 779636 796209
63180 796209 815693 837182 859777 882830 905929 928860 951606 974177 996391 1017897 1038386
63169 1038386 1057660 1075625 1092391 1108176 1122758 1135128 1143986 1148536 1148556 1143878 1134255 1119643 1100212
63156 1100212 1076162 1047966 1016682 983514 949121 913940 879070 846029 815445 786751 759448
$$ packed form
63240D51097Q436R967J0901J1469J1967J2546J3291J4326J5734J7362J8716J9251
63228F15063J8912J8259J7901J7973J8274J8685J9089J9126J8563J7923J8149
63217H17917J9444K0936K1689K1654K1317K0723J9384J7010J3920J0596P126L225
63205A014941j255n983j0401j4230j7595k0568k2828k3991k4110k3461k2052j9752
63193H08715j6859j4017j1457q825n958l284j168P26L062O069R518J3114J6573
63180G96209J9484K1489K2595K3053K3099K2931K2746K2571K2214K1506K0489
63169A038386J9274J7965J6766J5785J4582J2370Q858M550K0m678r623j4612j9431
63156A100212k4050k8196l1284l3168l4393l5181l4870l3041l0584k8694k7303
$$ plain form
63145 759448 733967 710910 690097 671001 653620 638361 625398 614590 605716 598268 591383 584538
63133 584538 578152 573038 569494 567306 566305 566345 567004 567920 569353 571856 575424 579508 583822 588585 593879
63118 593879 599272 604262 608778 613113 617616 622515 627760 632869 637135 640169 642229 644051 646303 649027
63104 649027 651503 652881 653123 653084 653482 654051 654021 653185 652097 651376 651219 651565 652314 653291 654227 654807 654716 653854 652591
63085 652591 651528 650735 649619 647947 646597 646675 648088 649674 650692 651543 652956 655098 657739 660747 664095
63070 664095 667734 671794 676671 682678 689772 697826 706980 717501 729467 742801 757552 773903 791922
63057 791922 811489 832621 855836 881954 911442 944050 979221 1016695 1056458 1098321 1142025
63046 1142025 1187660 1235361 1284513 1333925 1383082 1432526 1482547 1532225 1580469 1627444 1674041
$$ packed form
63145G59448k5481k3057k0813j9096j7381j5259j2963j0808q874p448o885o845
63133E84538o386n114l544k188j001M0O59R16J433K503L568M084M314M763N294
63118E93879N393M990M516M335M503M899N245N109M266L034K060J822K252K724
63104F49027K476J378K42l9L98N69l0q36j088p21j57L46P49R77R36N80r1q62j263
63085F52591j063p93j116j672j350P8J413J586J018Q51J413K142K641L008L348
63070F64095L639M060M877O007P094Q054R154J0521J1966J3334J4751J6351J8019
63057G91922J9567K1132K3215K6118K9488L2608L5171L7474L9763M1863M3704
63046A142025M5635M7701M9152M9412M9157M9444N0021M9678M8244M6975M6597
$$ plain form
63035 1674041 1720314 1765416 1808989 1851715 1894208 1936026 1975890 2012308 2043786 2068913 2086520
63024 2086520 2095566 2094950 2083842 2062206 2030697 1990187 1941843 1887484 1829300 1769208 1708903 1650229
63012 1650229 1594822 1543440 1496394 1454610 1419491 1391626 1370432 1355269 1346272 1343849 1348069 1358786
63000 1358786 1375695 1397991 1424534 1454604 1487892 1523595 1560322 1597263 1634745 1673174 1712122
62989 1712122 1750942 1789599 1828146 1865877 1901719 1935137 1966015 1993876 2017714 2036356 2048497
62978 2048497 2052570 2047136 2031421 2005327 1969290 1924390 1872151 1813826 1750233 1682710 1613674 1545567
62966 1545567 1479488 1415499 1353999 1296005 1242131 1191997 1144895 1100682 1059810 1022703 989160
62955 989160 958298 929103 901110 874393 849007 824913 802504 782405 764322 746760 728529
$$ packed form
63035A674041M6273M5102M3573M2726M2493M1818L9864L6418L1478K5127J7607
63024B086520R046o16j1108k1636l1509m0510m8344n4359n8184o0092o0305n8674
63012A650229n5407n1382m7046m1784l5119k7865k1194j5163q997k423M220J0717
63000A358786J6909K2296K6543L0070L3288L5703L6727L6941L7482L8429L8948
62989A712122L8820L8657L8547L7731L5842L3418L0878K7861K3838J8642J2141
62978B048497M073n434j5715k6094l6037m4900n2239n8325o3593o7523o9036o8107
62966A545567o6079o3989o1500n7994n3874n0134m7102m4213m0872l7107l3543
62955I89160l0862k9195k7993k6717k5386k4094k2409k0099j8083j7562j8231
$$ plain form
62944 728529 710036 692392 675807 659805 644661 631435 620457 610787 601434 592407 584266 577346
62932 577346 571707 567244 563434 559472 555064 550758 547222 544488 542169 540019 538037 536296 534908 533875
62918 533875 532858 531449 529817 528557 527679 526271 523635 520253 517062 514191 511090 507667 504469 501756
62904 501756 499195 496627 494465 493031 492074 491316 490983 491292 491858 492146 492244 492629 493328 493886 494051 493944 493574 492823
62886 492823 491914 491223 490540 489238 487445 486259 486336 486998 487343 487608 488568 490093 491244 491570 491337 490632 489308
62869 489308 487831 487126 487324 487576 487405 487235 487150 486190 483743 480816 478925 478243 477820 477323 477461 478697 480548
62852 480548 482409 484296 486331 488019 488650 488236 487636 487669 488291 488809 488828 488743 489077 489552 489294 487992 486317 484985
62834 484985 483970 483019 482429 482622 483303 483753 483880 484261 485145 486166 487228 488992 491953 495499 498456 500400
$$ packed form
62944G28529j8493j7644j6585j6002j5144j3226j0978r670r353r027q141o920
62932E77346n639m463l810l962m408m306l536k734k319k150j982j741j388j033
62918E33875j017j409j632j260q78j408k636l382l191k871l101l423l198k713
62904E01756k561k568k162j434r57p58l33L09N66K88R8L85O99N58J65j07l70p51
62886D92823r09o91o83j302j793j186P7O62L45K65R60J525J151L26k33p05j324
62869D89308j477p05J98K52j71j70q5r60k447k927j891o82m23m97J38J236J851
62852D80548J861J887K035J688O31m14o00L3O22N18J9q5L34M75k58j302j675j332
62834D84985j015r51n90J93O81M50J27L81Q84J021J062J764K961L546K957J944
$$ plain form
62818 500400 501940 503746 505802 507794 509796 512137 514805 517470 520169 523468 527633 532003 535654 538508
62804 538508 541374 544998 549566 555038 561382 568311 575324 582275 589569 597660 606689 616633 627341 638375
62790 638375 649453 661302 675404 692522 712075 733437 757253 784903 817121 853843 895021
62779 895021 940872 991501 1046890 1107110 1171962 1240613 1312121 1386104 1462212 1539047 1614216
62768 1614216 1685367 1750595 1807997 1855690 1892459 1917810 1931210 1931848 1919369 1894419 1858250 1812137
62756 1812137 1757361 1695458 1628241 1557710 1485844 1414145 1343356 1273901 1206596 1142632 1082930
62745 1082930 1027830 977327 931193 888878 849771 813669 780727 750935 723996 699721 678229
62734 678229 659646 643827 630321 618406 607392 597244 588733 582525 578229 574804 571728 569230 567548
$$ packed form
62818E00400J540J806K056J992K002K341K668K665K699L299M165M370L651K854
62804E38508K866L624M568N472O344O929P013O951P294Q091R029R944J0708J1034
62790F38375J1078J1849J4102J7118J9553K1362K3816K7650L2218L6722M1178
62779H95021M5851N0629N5389O0220O4852O8651P1508P3983P6108P6835P5169
62768A614216P1151O5228N7402M7693L6769K5351J3400O38j2479k4950l6169m6113
62756A812137n4776o1903o7217p0531p1866p1699p0789o9455o7305o3964n9702
62745A082930n5100n0503m6134m2315l9107l6102l2942k9792k6939k4275k1492
62734F78229j8583j5819j3506j1915j1014j0148q511o208m296l425l076k498j682
$$ plain form
62721 567548 566661 566774 568343 571395 575340 579663 584415 590010 597038 606284 618251 632472 647939 664452
62707 664452 683030 704751 729743 757647 788452 822443 859766 900570 945232 994082 1047206
62696 1047206 1104792 1167271 1234711 1306410 1381503 1459628 1540448 1622671 1703956 1781641 1853231
62685 1853231 1916366 1968903 2009192 2036084 2048690 2046369 2029006 1997215 1952306 1896089 1830550
62674 1830550 1757595 1679131 1597327 1514434 1432250 1351982 1274660 1201344 1132789 1069302 1011155
62663 1011155 958718 911883 869638 830781 794976 762731 734335 709144 686025 664325 644254
62652 644254 626341 610637 596616 583822 572281 562027 552540 543186 534069 525843 518651 511923 505403
62639 505403 499722 495580 492925 491409 491124 492223 494109 495698 496382 496214 495258 493372 490691 487756 484938
$$ packed form
62721E67548q87J13J569L052L945M323M752N595P028R246J1967J4221J5467J6513
62707F64452J8578K1721K4992K7904L0805L3991L7323M0804M4662M8850N3124
62696A047206N7586O2479O7440P1699P5093P8125Q0820Q2223Q1285P7685P1590
62685A853231O3135N2537M0289K6892J2606k321j7363l1791m4909n6217o5539
62674A830550p2955p8464q1804q2893q2184q0268p7322p3316o8555o3487n8147
62663A011155n2437m6835m2245l8857l5805l2245k8396k5191k3119k1700k0071
62652F44254j7913j5704j4021j2794j1541j0254r487r354r117q226p192o728o520
62639E05403n681m142k655j516k85J099J886J589O84j68r56j886k681k935k818
$$ plain form
62624 484938 482097 479041 476074 473747 472220 471122 470173 469718 470401 472307 474759 477172 479840 483450 487992
62609 487992 492753 497404 502456 508383 514919 521597 528494 535919 543796 552009 561182 572493 586733 603973
62595 603973 624059 646934 672417 700137 729904 761913 796400 833093 870904 908095 943043
62584 943043 975063 1004296 1030563 1052637 1068988 1078889 1082298 1079045 1068920 1052500 1031071 1005532
62572 1005532 976143 943606 909629 875853 842687 809801 777419 746502 717837 691551 667517
62561 667517 645662 625806 607720 591563 577893 566953 558195 550712 543928 537645 531666 525758 519962
62548 519962 514637 510166 506783 504646 503773 503841 504279 504713 505161 505757 506512 507475 508875 510838 513085 515126
62532 515126 516608 517349 517227 516468 516008 517180 520780 526551 533656 541577 550551 561303 574427 589938
$$ packed form
62624D84938k841l056k967k327j527j098r49m55O83J906K452K413K668L610M542
62609D87992M761M651N052N927O536O678O897P425P877Q213R173J1311J4240J7240
62595F03973K0086K2875K5483K7720K9767L2009L4487L6693L7811L7191L4948
62584I43043L2020K9233K6267K2074J6351R901L409l253j0125j6420k1429k5539
62572A005532k9389l2537l3977l3776l3166l2886l2382l0917k8665k6286k4034
62561F67517k1855j9856j8086j6157j3670j0940q758p483o784o283n979n908n796
62548E19962n325m471l383k137q73O8M38M34M48N96P55R63J400J963K247K041
62532E15126J482P41j22p59m60J172L600N771P105P921Q974J0752J3124J5511
$$ plain form
62518 589938 607411 626620 647972 672186 699608 730057 763319 799584 839285 882610 929217
62507 929217 978268 1028710 1079560 1129943 1178824 1224833 1266514 1302710 1332592 1355411 1370526
62496 1370526 1377799 1377947 1372519 1363496 1352722 1341627 1331580 1324410 1322138 1325968 1335947 1351941 1374527
62483 1374527 1404402 1441360 1484628 1533973 1589386 1649270 1709578 1765230 1812205 1848382 1873155
62472 1873155 1886795 1889723 1881652 1861315 1827223 1778894 1717619 1646437 1569252 1489277 1407885 1325211
62460 1325211 1241957 1160290 1082818 1011137 945671 886498 833806 787688 747896 713880 684978
62449 684978 660690 640815 625164 613106 603637 595915 589446 583849 578946 575230 573655 574631 577494
62436 577494 581205 585192 589318 593452 597376 600781 603081 603585 602106 599094 594921 589500 582890 575769
$$ packed form
62518E89938J7473J9209K1352K4214K7422L0449L3262L6265L9701M3325M6607
62507I29217M9051N0442N0850N0383M8881M6009M1681L6196K9882K2819J5115
62496A370526P273J48n428r023j0774j1095j0047p170k272L830R979J5994K2586
62483A374527K9875L6958M3268M9345N5413N9884O0308N5652M6975L6177K4773
62472A873155J3640K928q071k0337l4092m8329o1275p1182p7185p9975q1392q2674
62460A325211q3254q1667p7472p1681o5466n9173n2692m6118l9792l4016k8902
62449F84978k4288j9875j5651j2058r469p722o469n597m903l716j575R76K863
62436E77494L711L987M126M134L924L405K300N04j479l012m173n421o610p121
$$ plain form
62422 575769 568831 562079 555162 548101 541225 534681 528484 522788 517614 512485 506828 500660 494564 489120
62408 489120 484604 480934 477623 474147 470741 468378 467425 466793 465134 462588 460564 459968 460526 461797 463919
62393 463919 467038 470710 474322 477711 481081 484636 488464 492475 496278 499491 502342 505617 509863 514956
62379 514956 520656 527164 534793 543362 552363 561605 571303 581503 591816 601918 612103 623061 635205
62366 635205 648497 662969 679038 697083 717060 738981 763593 792097 825219 863085 906005
62355 906005 954671 1009216 1068535 1130840 1194483 1257913 1319257 1376387 1427201 1469692 1502344
62344 1502344 1524980 1538786 1544903 1543289 1533475 1516034 1492513 1464061 1430921 1393351 1352342 1309175
62332 1309175 1264794 1219988 1175901 1133996 1095433 1060541 1028883 999848 973088 948219 924345
$$ packed form
62422E75769o938o752o917p061o876o544o197n696n174n129n657o168o096n444
62408D89120m516l670l311l476l406k363r53o32j659k546k024n96N58J271K122
62393D63919L119L672L612L389L370L555L828M011L803L213K851L275M246N093
62379E14956N700O508P629Q569R001R242R698J0200J0313J0102J0185J0958J2144
62366F35205J3292J4472J6069J8045J9977K1921K4612K8504L3122L7866M2920
62355I06005M8666N4545N9319O2305O3643O3430O1344N7130N0814M2491L2652
62344A502344K2636J3806O117j614r814j7441k3521k8452l3140l7570m1009m3167
62332A309175m4381m4806m4087m1905l8563l4892l1658k9035k6760k4869k3874
$$ plain form
62321 924345 900478 876549 853359 831281 809638 787777 766051 745160 725142 705829 687743
62310 687743 671581 657123 643657 631301 620833 612259 604565 597097 590210 584348 579411 575428 572933
62297 572933 572017 571651 570693 569229 568343 568738 570118 571775 573296 574636 575885 577222 579030 581763 585488
62282 585488 589585 593262 596407 599607 603197 606827 610293 614210 619239 625024 630611 635678 640707 646156
62268 646156 652218 659232 667583 677298 688495 702195 719774 741633 767222 796489 830365 869633
62256 869633 914206 963893 1018972 1079465 1144513 1212859 1283296 1354108 1422708 1486437 1543338
62245 1543338 1591805 1630187 1657559 1674615 1683038 1683894 1676891 1661016 1635551 1600708 1557691 1508219
62233 1508219 1453913 1396178 1336516 1276582 1217839 1161480 1108570 1059756 1014752 972703 933303
$$ packed form
62321I24345k3867k3929k3190k2078k1643k1861k1726k0891k0018j9313j8086
62310F87743j6162j4458j3466j2356j0468q574p694p468o887n862m937l983k495
62297E72933r16l66r58j464q86L95J380J657J521J340J249J337J808K733L725
62282E85488M097L677L145L200L590L630L466L917N029N785N587N067N029N449
62268F46156O062P014Q351R715J1197J3700J7579K1859K5589K9267L3876L9268
62256H69633M4573M9687N5079O0493O5048O8346P0437P0812O8600O3729N6901
62245A543338M8467L8382K7372J7056Q423Q56p003j5875k5465l4843m3017m9472
62233A508219n4306n7735n9662n9934n8743n6359n2910m8814m5004m2049l9400
$$ plain form
62222 933303 897099 864622 835737 810031 787216 766875 748338 731177 715399 700960 687585
62211 687585 675309 664613 655680 648010 641058 634727 629036 623975 620023 618094 618455 620304 622830 626037
62197 626037 630040 634313 638408 642790 648124 654182 660213 666039 672053 678565 685939 694942 706011 718441
62183 718441 731193 744242 758186 772663 786300 798283 808967 818643 826724 832679 837105 841349
62171 841349 846519 853244 861983 873128 887150 905020 928203 957785 993663 1034774 1079859 1127707
62159 1127707 1176766 1224929 1269859 1309516 1342458 1367898 1385701 1396384 1400914 1400143 1394198 1382469
62147 1382469 1364285 1339585 1309044 1273831 1235391 1195207 1154529 1114324 1075478 1038809 1004878
62136 1004878 974097 947104 924574 906384 891379 878364 867055 857691 849990 843069 836340 830003
$$ packed form
62222I33303l6204l2477k8885k5706k2815k0341j8537j7161j5778j4439j3375
62211F87585j2276j0696q933p670o952o331n691n061l952j929L61J849K526L207
62197F26037M003M273M095M382N334O058O031N826O014O512P374R003J1069J2430
62183G18441J2752J3049J3944J4477J3637J1983J0684R676Q081N955M426M244
62171H41349N170O725Q739J1145J4022J7870K3183K9582L5878M1111M5085M7848
62159A127707M9059M8163M4930L9657L2942K5440J7803J0683M530p71n945j1729
62147A382469j8184k4700l0541l5213l8440m0184m0678m0205l8846l6669l3931
62136A004878l0781k6993k2530j8190j5005j3015j1309r364p701o921o729o337
$$ plain form
62124 830003 824611 820460 817501 815630 815010 816107 819297 824343 830534 837483 845530 855087 865892 877221
62110 877221 888554 899537 909359 916677 920387 920445 918088 915331 913977 914685 916920 919755 922392 923853
62096 923853 922887 918867 912646 905987 900212 895755 892776 891543 892036 893677 895764 898085 901008 905035 910253
62081 910253 916265 922795 930346 939900 951899 965959 981788 999805 1020416 1043114 1066819 1090786
62069 1090786 1114648 1137967 1160509 1182787 1205671 1229454 1253910 1279199 1305965 1334346 1363322
62058 1363322 1391277 1416889 1439363 1458074 1472141 1480415 1482240 1478388 1470709 1460313 1446446 1427696
62046 1427696 1403848 1375709 1343518 1306735 1265541 1221536 1176581 1131717 1087483 1044443 1002873
62035 1002873 962580 923603 886695 852677 821728 793689 768599 746455 726801 709106 693369
$$ packed form
62124H30003n392m151k959j871o20J097L190N046O191O949Q047R557J0805J1329
62110H77221J1333J0983R822P318L710N8k357k757j354P08K235K835K637J461
62096I23853r66m020o221o659n775m457k979j233M93J641K087K321K923M027N218
62081I10253O012O530P551R554J1999J4060J5829J8017K0611K2698K3705K3967
62069A090786K3862K3319K2542K2278K2884K3783K4456K5289K6766K8381K8976
62058A363322K7955K5612K2474J8711J4067Q274J825l852p679j0396j3867j8750
62046A427696k3848k8139l2191l6783m1194m4005m4955m4864m4234m3040m1570
62035A002873m0293l8977l6908l4018l0949k8039k5090k2144j9654j7695j5737
$$ plain form
62024 693369 679924 668790 659531 651603 644542 637919 631390 624742 617822 610640 603668 597764 593544 591004
62010 591004 589828 589757 590423 591245 591865 592548 593828 595946 598886 602717 607481 612850 618312 623684 629116 634502
61994 634502 639200 642496 644163 644418 643453 641173 637378 632059 625364 617342 607942 597348 586184 575172
61980 575172 564630 554517 544905 536165 528603 522104 516257 510742 505536 500805 496630 492819 489064 485377
61966 485377 482260 480290 479596 479889 480831 482159 483593 484961 486397 488144 490179 492286 494440 496764 499155
61951 499155 501358 503485 506087 509520 513607 518122 523317 529701 537524 546725 557224 568947 581606
61938 581606 594820 608581 623434 639940 657899 676279 694059 711094 727831 744250 759484
61927 759484 772709 784000 793880 802289 808461 811737 812061 809742 805201 799024 791885 784272 776560 769360
$$ packed form
62024F93369j3445j1134r259p928p061o623o529o648o920p182o972n904m220k540
62010E91004j176p1O66Q22O20O83J280K118K940L831M764N369N462N372N432N386
61994F34502M698L296J667K55r65k280l795n319o695q022r400j0594j1164j1012
61980E75172j0542j0113r612q740p562o499n847n515n206m731m175l811l755l687
61966D85377l117j970o94K93R42J328J434J368J436J747K035K107K154K324K391
61951D99155K203K127K602L433M087M515N195O384P823R201J0499J1723J2659
61938E81606J3214J3761J4853J6506J7959J8380J7780J7035J6737J6419J5234
61927G59484J3225J1291R880Q409O172L276L24k319m541o177p139p613p712p200
$$ plain form
61913 769360 763554 759946 759065 761144 766008 773107 782114 793410 807477 823807 840903 857389 872600
61900 872600 886048 896947 904655 909137 910603 908894 903528 894276 881655 867066 852334 838657 825876
61887 825876 813169 800439 788553 778175 769027 760554 752677 745409 738190 730131 720710 709930 698183
61874 698183 686334 675520 666283 658137 650448 643509 638192 634741 632451 630619 629288 629055 630481 633829
61860 633829 639002 645596 653190 661717 671526 683108 696833 712745 730465 749486 769834 792273
61848 792273 817516 845257 874277 903494 932619 961735 990484 1017803 1042240 1062430 1077377
61837 1077377 1086509 1089642 1087060 1079698 1069056 1056601 1043202 1029266 1015498 1003365 994653 990536
61825 990536 991129 995893 1004246 1015629 1029080 1043160 1056431 1067769 1076075 1080005 1078427 1071041 1058286
$$ packed form
61913G69360n806l608q81K079M864P099R007J1296J4067J6330J7096J6486J5211
61900H72600J3448J0899P708M482J466j709n366r252j2621j4589j4732j3677j2781
61887H25876j2707j2730j1886j0378r148q473p877p268p219q059r421j0780j1747
61874F98183j1849j0814r237q146p689o939n317l451k290j832j331k33J426L348
61860F33829N173O594P594Q527R809J1582J3725J5912J7720J9021K0348K2439
61848G92273K5243K7741K9020K9217K9125K9116K8749K7319K4437K0190J4947
61837A077377R132L133k582p362j0642j2455j3399j3936j3768j2133q712m117
61825I90536N93M764Q353J1383J3451J4080J3271J1338Q306L930j578p386j2755
$$ plain form
61812 1058286 1040797 1019307 994838 968378 940359 911019 881338 852996 827141 803653 781883
61801 781883 761591 742855 725581 709655 695285 682690 671578 661426 652161 644188 637753 632580
61789 632580 628138 624038 620110 616236 612142 607479 602329 597603 594434 592991 592244 591200 589921 588968 588276
61774 588276 587194 585471 583561 581996 580935 580383 580347 580612 580713 580307 579399 578191 576989 576338 576943 579207
61758 579207 582932 587527 592437 597385 602351 607386 612336 616701 619837 621316 621093 619366 616372 612358
61744 612358 607727 603185 599477 596762 594298 591068 586788 582060 577576 573539 569959 566984 564642 562655
61730 562655 560922 559868 559897 560764 561946 563400 565428 567924 570402 572808 575735 579597 583940 587882 591020
61715 591020 593664 596303 599030 601506 603400 604770 605852 606476 605958 603801 600292 596188 591960 587663 583360
$$ packed form
61812A058286j7489k1490k4469k6460k8019k9340k9681k8342k5855k3488k1770
61801G81883k0292j8736j7274j5926j4370j2595j1112j0152r265p973o435n173
61789F32580m442m100l928l874m094m663n150m726l169j443p47j044j279r53o92
61774E88276j082j723j910j565j061n52l6K65J01m06r08j208j202o51O05K264
61758E79207L725M595M910M948M966N035M950M365L136J479k23j727k994m014
61744F12358m631m542l708k715k464l230m280m728m484m037l580k975k342j987
61730E62655j733j054K9Q67J182J454K028K496K478K406K927L862M343L942L138
61715E91020K644K639K727K476J894J370J082O24n18k157l509m104m228m297m303
$$ plain form
61700 583360 579269 575468 571830 568257 564695 560880 556454 551502 546735 542887 539941 537094 533488 529013
61686 529013 524395 520443 517183 513935 510260 506499 503199 500333 497511 494712 492289 490325 488509 486683
61672 486683 485073 483825 482744 481644 480640 479907 479429 479088 478744 478108 476861 475143 473646 473028 473394 474473
61656 474473 476027 477866 479785 481787 484170 487067 490036 492476 494444 496701 499851 503638 507178 509734
61642 509734 511205 512069 512954 514219 515765 517168 517981 517946 517075 515673 514265 513336 513004 512918 512482 511213 508938
61625 508938 505757 501943 497839 493744 489790 485967 482367 479392 477565 477051 477380 477686 477213 475693 473384
61610 473384 470706 467716 463904 458747 452476 445973 439789 433648 427252 421173 416294 412524 408811 404657
61596 404657 400873 398368 396690 394503 391302 387952 385477 383904 382539 380812 378527 375675 372493 369541
$$ packed form
61700E83360m091l801l638l573l562l815m426m952m767l848k946k847l606m475
61686E29013m618l952l260l248l675l761l300k866k822k799k423j964j816j826
61672D86683j610j248j081j100j004p33m78l41l44o36j247j718j497o18L66J079
61656D74473J554J839J919K002K383K897K969K440J968K257L150L787L540K556
61642E09734J471Q64Q85J265J546J403Q13l5q71j402j408r29l32q6m36j269k275
61625E08938l181l814m104m095l954l823l600k975j827n14L29L06m73j520k309
61610D73384k678k990l812n157o271o503o184o141o396o079m879l770l713m154
61596D04657l784k505j678k187l201l350k475j573j365j727k285k852l182k952
$$ plain form
61582 369541 367286 365671 364410 363523 363170 363036 362412 361076 359667 358928 358874 358979 358892 358638 358269 357698 356929 356251
61564 356251 356092 356645 357571 358135 357958 357619 358130 359646 361138 361625 361357 361432 362564 364685 367401 370269 372834
61547 372834 374967 377089 379513 381717 382866 382978 382941 383414 384401 385873 387992 390504 392724 394515 396632
61532 396632 399693 403348 406835 409813 412162 413512 413567 412554 410881 408679 406082 403507 401102 398321 394708
61517 394708 390903 388182 387049 386818 386540 385882 385085 384487 384189 383934 383320 382323 381410 380912 380529 379798 378842 378250
61499 378250 378382 379168 380432 381942 383278 384109 384596 385185 386064 387113 388227 389251 389739 389306 388265 387468
61483 387468 387401 387801 388215 388617 389327 390543 392113 393712 395233 396984 399282 401810 403732 404649 405071 405617
61467 405617 406164 406278 406124 406271 406744 406960 406666 406310 406319 406477 406274 405535 404550 403740 403312 403117 402884 402716 403171
$$ packed form
61582C69541k255j615j261q87l53j34o24j336j409p39n4J05q7k54l69n71p69o78
61564C56251j59N53R26N64j77l39N11J516J492M87k68P5J132K121K716K868K565
61547C72834K133K122K424K204J149J12l7M73R87J472K119K512K220J791K117
61532C96632L061L655L487K978K349J350N5j013j673k202k597k575k405k781l613
61517C94708l805k721j133k31k78o58p97n98k98k55o14r97r13m98l83p31r56n92
61499C78250J32P86J264J510J336Q31M87N89Q79J049J114J024M88m33j041p97
61483C87468o7M00M14M02P10J216J570J599J521J751K298K528J922R17M22N46
61467D05617N47J14j54J47M73K16k94l56RJ58k03p39r85q10m28j95k33j68M55
$$ plain form
61448 403171 404636 406809 409016 410840 412202 413167 414116 415835 418899 423016 427333 431173 434222 436439 438330
61433 438330 440842 444280 447662 449961 451620 453896 456894 459424 460840 461822 463040 464188 464897 465646 467002
61418 467002 468674 470046 471193 472651 474519 476410 478001 479105 479422 478742 477312 475634 473964 472183 470006
61403 470006 467200 463778 460143 456784 453834 451225 449189 448002 447167 445619 443101 440674 439460 439429 439901
61388 439901 440606 441577 442458 442723 442411 442017 441830 441928 442577 443964 445586 446566 446706 446757 447554 449304 451847 455115
61370 455115 459028 463151 466773 469397 471099 472330 473408 474230 474615 474776 475250 476473 478704 482238 487171
61355 487171 492943 498685 504242 510321 517432 525235 533282 541877 551683 562904 575222 588000 599995
61342 599995 609466 615485 618923 621415 623604 625182 626365 628121 630740 633234 634720 635570 636535 637273 636555
$$ packed form
61448D03171J465K173K207J824J362R65R49J719L064M117M317L840L049K217J891
61433D38330K512L438L382K299J659K276K998K530J416R82J218J148P09P49J356
61418D67002J672J372J147J458J868J891J591J104L17o80j430j678j670j781k177
61403D70006k806l422l635l359k950k609k036j187q35j548k518k427j214l1M72
61388D39901P05R71Q81K65l12l94j87R8O49J387J622R80J40N1P97J750K543L268
61370D55115L913M123L622K624J702J231J078Q22L85J61M74J223K231L534M933
61355D87171N772N742N557O079P111P803Q047Q595R806J1221J2318J2778J1995
61342E99995R471O019L438K492K189J578J183J756K619K494J486Q50R65P38p18
$$ plain form
61327 636555 633761 629520 624930 620686 617076 614327 612567 611590 610945 610311 609692 609296 609356 610043 611364 613013
61311 613013 614569 616113 618478 622571 628500 635724 644041 653898 665592 678653 692305 705997 719038
61298 719038 730100 737734 741313 741074 737479 731027 722492 712696 701995 690512 678866 668042 658406
61285 658406 649413 640578 632251 625081 619141 614090 609940 607203 606284 607063 609140 612254 616413 621761 628302
61270 628302 635679 643284 650695 657877 664828 671225 676712 681530 686469 692130 698614 706146 715528 727432
61256 727432 741357 755900 770104 783901 796931 807592 814075 816184 815501 813702 811291 807978 803546
61243 803546 797975 791255 783687 776122 769388 763532 757985 752398 746989 742102 737784 733889 730289 726869
61229 726869 723518 720355 717937 717150 718712 722692 728398 734747 740804 746021 750179 753364 755982 758559
$$ packed form
61327F36555k794m241m590m244l610k749j760r77o45o34o19l96O0O87J321J649
61311F13013J556J544K365M093N929P224Q317R857J1694J3061J3652J3692J3041
61298G19038J1062P634L579k39l595o452q535r796j0701j1483j1646j0824r636
61285F58406q993q835q327p170n940n051m150k737r19P79K077L114M159N348O541
61270F28302P377P605P411P182O951O397N487M818M939N661O484P532R382J1904
61256G27432J3925J4543J4204J3797J3030J0661O483K109o83j799k411l313m432
61243H03546n571o720p568p565o734n856n547n587n409m887m318l895l600l420
61229G26869l351l163k418p87J562L980N706O349O057N217M158L185K618K577
$$ plain form
61215 758559 761356 764312 767370 770668 774299 778099 781803 785255 788323 790741 792123 792056 790308 787304 784444
61200 784444 783441 785007 788473 792992 798821 807059 818419 832801 849938 869767 891873 914988 937370
61187 937370 957587 974757 988300 997898 1003888 1007433 1009952 1012219 1014099 1015144 1015181 1014127 1011549 1006873
61173 1006873 1000046 991643 982275 972201 961538 950489 939201 927676 915924 903916 891385 878037
61161 878037 864004 849688 835072 819780 803992 788708 774820 762460 751682 743194 737766 735323
61149 735323 735192 736935 740380 745117 750611 756515 762177 766080 766592 763306 757036 748566 738186 726555
61135 726555 715161 705459 697849 691782 686596 682147 679016 678227 680468 685460 692284 700285 709396 719836
61121 719836 731993 746481 763639 782938 803505 825275 848932 874556 901088 927534 954019
$$ packed form
61215G58559K797K956L058L298L631L800L704L452L068K418J382o7j748l004k860
61200G84444j003J566L466M519N829Q238J1360J4382J7137J9829K2106K3115K2382
61187I37370K0217J7170J3543R598N990L545K519K267J880J045L7j054k578m676
61173A006873o827q403r368j0074j0663j1049j1288j1525j1752j2008j2531j3348
61161H78037j4033j4316j4616j5292j5788j5284j3888j2360j0778q488n428k443
61149G35323j31J743L445M737N494N904N662L903N12l286o270q470j0380j1631
61135G26555j1394r702p610o067n186m449l131p89K241M992O824Q001R111J0440
61121G19836J2157J4488J7158J9299K0567K1770K3657K5624K6532K6446K6485
$$ plain form
61110 954019 981161 1008889 1036453 1063192 1088723 1112674 1134784 1155188 1174168 1191707 1207495
61099 1207495 1221103 1231739 1238024 1238551 1232777 1221219 1204947 1185076 1162575 1138179 1112432 1085843
61087 1085843 1058768 1031107 1002607 973773 946079 920786 897920 876875 857554 840174 824264
61076 824264 808874 793901 780359 769034 759568 751237 743945 737950 733134 729170 726119 724288 723650
61063 723650 723957 725368 728443 733396 739662 746320 752776 759042 765628 773214 782252 792766 804542 817374
61049 817374 831082 845569 861158 878712 899001 921875 946312 971406 997146 1024209 1053139
61038 1053139 1083763 1115340 1147319 1179978 1214126 1250009 1286756 1323215 1359207 1395601 1433264
61027 1433264 1472343 1512496 1553410 1595059 1637822 1682376 1729093 1777497 1826654 1876044 1925795
$$ packed form
61110I54019K7142K7728K7564K6739K5531K3951K2110K0404J8980J7539J5788
61099A207495J3608J0636O285N27n774j1558j6272j9871k2501k4396k5747k6589
61087A085843k7075k7661k8500k8834k7694k5293k2866k1045j9321j7380j5910
61076H24264j5390j4973j3542j1325r466q331p292n995m816l964l051j831o38
61063G23650L07J411L075M953O266O658O456O266O586P586R038J0514J1776J2832
61049H17374J3708J4487J5589J7554K0289K2874K4437K5094K5740K7063K8930
61038A053139L0624L1577L1979L2659L4148L5883L6747L6459L5992L6394L7663
61027A433264L9079M0153M0914M1649M2763M4554M6717M8404M9157M9390M9751
$$ plain form
61016 1925795 1976395 2028978 2085930 2150398 2224860 2310493 2407761 2516821 2637525 2770388 2918309
61005 2918309 3086715 3282092 3511809 3785899 4117439 4520337 5008889 5601708 6325040
60996 6325040 7210814 8294297 9618233 11236473 13198895 15511170 18088676 20736303
60988 20736303 23175422 25117738 26364130 26887555 26853718 26558969 26314025 26333816 26677867
60979 26677867 27243686 27796245 28030368 27669544 26574661 24801792 22565792 20134762 17730649
60970 17730649 15490584 13481385 11726315 10220913 8942968 7863996 6957583 6200156
60962 6200156 5569166 5044128 4608210 4246937 3946485 3694577 3481683 3299926 3142007
60953 3142007 3002617 2879525 2771467 2675666 2588873 2509798 2438529 2374018 2313814 2255895 2198952
$$ packed form
61016A925795N0600N2583N6952O4468P4462Q5633R7268J09060J20704J32863J47921
61005B918309J68406J95377K29717K74090L31540M02898M88552N92819P23332
60996F325040Q85774J083483J323936J618240J962422K312275K577506K647627
60988B0736303K439119J942316J246392N23425l3837k94749k44944J9791L44051
60979B6677867N65819N52559K34123l60824j094883j772869k236000k431030k404113
60970A7730649k240065k009199j755070j505402j277945j078972r06413p57427
60962F200156o30990n25038m35918l61273l00452k51908k12894j81757j57919
60953C142007j39390j23092j08058r5801q6793p9075p1269o4511o0204n7919n6943
$$ plain form
60942 2198952 2141002 2079663 2014331 1946818 1879360 1812908 1747606 1683738 1621679 1561646 1503965
60931 1503965 1449110 1397238 1348100 1301522 1257573 1216262 1177524 1141425 1107972 1076872 1047899
60920 1047899 1021231 996924 974368 952876 932495 913594 896035 879564 864701 852310 842372
60909 842372 834003 826552 819951 814131 809006 804932 802360 801010 800136 799505 799265 798974 797667 794999 791475
60894 791475 787534 783170 778451 773550 768267 762341 756278 751020 746696 742511 737873 732794 727188 720739
60880 720739 713599 706333 699043 691395 683522 675950 668583 660839 652889 645602 639004 632039 624331 616988
60866 616988 611052 606184 601529 596930 592596 588485 584846 582598 582321 583394 584804 586220 587642 588617 588583
60851 588583 587535 585751 583333 580673 578889 579021 581017 583987 587079 589675 591141 591030 589376 586433 582401
$$ packed form
60942B198952n7950o1339o5332o7513o7458o6452o5302o3868o2059o0033n7681
60931A503965n4855n1872m9138m6578m3949m1311l8738l6099l3453l1100k8973
60920A047899k6668k4307k2556k1492k0381j8901j7559j6471j4863j2391r938
60909H42372q369p451o601n820n125m074k572j350q74o31k40k91j307k668l524
60894G91475l941m364m719m901n283n926o063n258m324m185m638n079n606o449
60880G20739p140p266p290p648p873p572p367p744p950p287o598o965p708p343
60866F16988n936m868m655m599m334m111l639k248k77J073J410J416J422R75l4
60851E88583j048j784k418k660j784J32J996K970L092K596J466j11j654k943m032
$$ plain form
60836 582401 577636 572631 567471 561828 555838 550477 546609 544213 542920 542668 543324 544250 544927 545558 546471 547404
60820 547404 547999 548532 549454 550561 551321 551804 552561 553631 554169 553143 550152 545752 541215 537699 535369 533493
60804 533493 531442 529219 527006 524828 522877 521403 519951 517411 513356 508710 504584 501019 497375 493365
60790 493365 489135 484864 480820 477283 473911 469838 464989 460579 457626 455615 453429 450913 448643 446721
60776 446721 444796 442922 441480 440569 440260 441023 443019 445391 447202 448748 450952 453860 456792 459731 463286
60761 463286 467338 470937 473728 476492 479977 484014 488039 491759 495094 498025 500709 503197 505057 505812
60747 505812 505644 505083 504201 502899 501752 501492 501562 500267 496690 491580 485984 479882 472777 464990 457639 451580
60731 451580 446737 442303 437441 432009 426725 422422 419211 416637 414434 412615 411036 409573 408656 408835 409737
$$ packed form
60836E82401m765n005n160n643n990n361l868k396j293k52O56R26O77O31R13R33
60820E47404N95N33R22J107P60M83P57J070N38j026k991m400m537l516k330j876
60804E33493k051k223k213k178j951j474j452k540m055m646m126l565l644m010
60790D93365m230m271m044l537l372m073m849m410k953k011k186k516k270j922
60776D46721j925j874j442r11l09P63J996K372J811J546K204K908K932K939L555
60761D63286M052L599K791K764L485M037M025L720L335K931K684K488J860P55
60747E05812j68n61q82j302j147k60P0j295l577n110n596o102p105p787p351o059
60731D51580m843m434m862n432n284m303l211k574k203j819j579j463r17J79R02
$$ plain form
60716 409737 410248 409915 409385 409199 408891 407781 406063 404570 403853 403909 404520 405470 406603 407948 409595 411383 412988
60699 412988 414385 415881 417582 419219 420618 421943 423362 424880 426657 429061 432182 435700 439440 443672
60685 443672 448593 453808 458625 462669 466088 469353 472978 477153 481554 485704 489521 493218 496715 499653
60671 499653 502159 505052 508883 512961 515618 515427 512200 507043 501512 496499 491829 487022 482188 477849
60657 477849 474049 470293 466424 462962 460361 458404 456688 455361 455004 455884 457591 459356 460643 461441 461971
60642 461971 462088 461219 459080 456199 453401 450975 448718 446459 444051 441127 437614 434344 432347 431541 430946
60627 430946 430264 430277 431364 432591 432945 432788 433298 434886 436917 438712 440118 441151 441711 441823 441801 441993 442516
60610 442516 443233 443974 444773 445887 447432 449048 450192 450753 451068 451312 451310 451020 450771 450751 450669 450239 449729 449728 450565
$$ packed form
60716D09737N11l33n30j86l08j110j718j493p17N6O11R50J133J345J647J788J605
60699D12988J397J496J701J637J399J325J419J518J777K404L121L518L740M232
60685D43672M921N215M817M044L419L265L625M175M401M150L817L697L497K938
60671D99653K506K893L831M078K657j91l227n157n531n013m670m807m834m339
60657D77849l800l756l869l462k601j957j716j327l57Q80J707J765J287P98N30
60642D61971J17q69k139k881k798k426k257k259k408k924l513l270j997q06n95
60627D30946o82J3J087J227L54j57N10J588K031J795J406J033N60J12k2J92N23
60610D42516P17P41P99J114J545J616J144N61L15K44kk90k49k0q2m30n10jQ37
$$ plain form
60591 450565 452165 454250 456472 458580 460649 462928 465294 467206 468376 469180 470115 471114 471809 472207 472701 473431
60575 473431 474095 474504 475050 476479 479291 483475 488765 494985 502069 509911 518488 528213 539774 553351
60561 553351 568106 582714 596114 607476 615789 620189 620746 618448 614346 609082 603122 596913 590713
60548 590713 584757 579656 576121 574272 573748 574547 577098 581425 586933 593379 601339 611355 623282 636959
60534 636959 652853 671329 691686 712607 733249 753170 771372 786234 796522 801970 802835 799405
60522 799405 792179 782200 770907 759643 749164 739480 730233 721361 713299 706420 700600 695613 691721
60509 691721 689407 688603 688673 689201 690436 692811 696420 701277 707866 717032 729353 744978 764287 788341
60495 788341 818254 854075 894729 939101 986686 1036813 1087688 1136875 1182673 1224560 1262337
$$ packed form
60591D50565J600K085K222K108K069K279K366J912J170Q04R35R99O95L98M94P30
60575D73431O64M09N46J429K812M184N290O220P084P842Q577R725J1561J3577
60561E53351J4755J4608J3400J1362Q313M400N57k298m102n264n960o209o200
60548E90713n956n101l535j849n24P99K551M327N508O446P960J0016J1927J3677
60534F36959J5894J8476K0357K0921K0642J9921J8202J4862J0288N448Q65l430
60522G99405p226r979j1293j1264j0479r684r247q872q062o879n820m987l892
60509F91721k314q04P0N28J235K375L609M857O589R166J2321J5625J9309K4054
60495G88341K9913L5821M0654M4372M7585N0127N0875M9187M5798M1887L7777
$$ plain form
60484 1262337 1295341 1322477 1342417 1353734 1355406 1347431 1330492 1304902 1270444 1227545 1178067 1124626
60472 1124626 1069644 1015324 963782 916335 872923 832903 796277 763524 734471 708160 683998
60461 683998 662329 643537 627144 612279 598769 587210 577931 570272 563072 555701 548410 541774 536005
60448 536005 530850 525992 521367 517144 513528 510547 507988 505613 503515 502115 501670 501961 502617 503538 504680
60433 504680 505667 506013 505687 505054 504324 503468 502629 502075 501597 500491 498432 495994 494022 492810 492170 491998 492382
60416 492382 493250 494305 495324 496324 497410 498537 499501 500152 500663 501464 502791 504419 506030 507687 509658
60401 509658 511889 514059 516176 518649 521639 524644 526961 528363 529206 530086 531510 533734 536724 540242 543955
60386 543955 547482 550614 553602 556951 560667 564075 566804 569609 573559 578525 583216 586686 589131 591116
$$ packed form
60484A262337L3004K7136J9940J1317J672p975j6939k5590l4458m2899m9478n3441
60472A124626n4982n4320n1542m7447m3412m0020l6626l2753k9053k6311k4162
60461F83998k1669j8792j6393j4865j3510j1559r279p659p200p371p291o636n769
60448E36005n155m858m625m223l616k981k559k375k098j400m45K91O56R21J142
60433E04680R87L46l26o33p30q56q39n54m78j106k059k438j972j212o40j72L84
60416D92382Q68J055J019J000J086J127R64O51N11Q01J327J628J611J657J971
60401E09658K231K170K117K473K990L005K317J402Q43Q80J424K224K990L518L713
60386E43955L527L132K988L349L716L408K729K805L950M966M691L470K445J985
$$ plain form
60372 591116 592698 593717 594463 595661 597891 601129 604673 607568 609409 610682 612036 613494 614815 616253
60358 616253 618273 620674 622838 624771 627046 629751 632501 635719 640883 649020 659632 671448 683500
60345 683500 695113 705673 714919 722922 729327 733254 734262 732769 729128 723063 714495 704278 693592
60332 693592 683221 673835 666163 660213 654911 649200 643056 637018 631400 626477 622695 619887 616912 612815
60318 612815 607968 603463 599962 597698 596938 597655 599297 601605 605115 610201 616399 623528 632715 645223
60304 645223 660916 678982 699539 723084 748669 774009 797300 817670 833946 844372 847854 844456
60292 844456 834563 818639 798139 775602 753341 732591 713991 698034 684783 673879 665104 658304
60280 658304 652684 647013 640791 634566 628931 623867 619213 614993 610987 606662 601811 596757 591780 586965
$$ packed form
60372E91116J582J019P46J198K230L238L544K895J841J273J354J458J321J438
60358F16253K020K401K164J933K275K705K750L218N164Q137J0612J1816J2052
60345F83500J1613J0560R246Q003O405L927J008j493l641o065q568j0217j0686
60332F93592j0371r386p672n950n302n711o144o038n618m923l782k808k975m097
60318F12815m847m505l501k264p60P17J642K308L510N086O198P129R187J2508
60304F45223J5693J8066K0557K3545K5585K5340K3291K0370J6276J0426L482l398
60292H44456r893j5924k0500k2537k2261k0750j8600j5957j3251j0904q775o800
60280F58304n620n671o222o225n635n064m654m220m006m325m851n054m977m815
$$ plain form
60266 586965 582664 579327 576659 573768 570435 567504 565638 564471 563392 562455 561940 561644 561176 560514 559775 558834
60250 558834 557727 557048 557434 558842 560694 562481 564004 565326 566735 568359 569628 569612 568265 566743 566033
60235 566033 565752 564970 563784 563271 564009 565474 567032 568845 571434 574776 578294 581578 584765 588143 591663
60220 591663 595026 598229 601770 606185 611507 617353 623450 629873 636842 644516 652995 662277 672166 682389
60206 682389 692864 703709 714939 726245 737065 746797 755070 762013 768235 774391 780705 786815 791892
60193 791892 794960 795577 794449 792961 791761 790186 787445 783817 779990 775707 770075 763107 755925 749249
60179 749249 742585 735280 727567 720033 712701 705357 698352 692392 687622 683552 679898 677059 675570 675321
60165 675321 675508 675307 674553 673704 673198 672929 672469 671649 670733 670085 669879 670106 670645 671376 672383 674011 676491 679596
$$ packed form
60266E86965m301l337k668k891l333k931j866j167j079r37n15k96m68o62p39r41
60250E58834j107o79L86J408J852J787J523J322J409J624J269j6j347j522p10
60235E66033k81p82j186n13P38J465J558J813K589L342L518L284L187L378L520
60220E91663L363L203L541M415N322N846O097O423O969P674Q479R282R889J0223
60206F82389J0475J0845J1230J1306J0820R732Q273O943O222O156O314O110N077
60193G91892L068O17j128j488j200j575k741l628l827m283n632o968p182o676
60179G49249o664p305p713p534p332p344p005n960m770m070l654k839j489k49
60165F75321J87k01p54q49n06k69m60q20r16o48k06K27N39P31J007J628K480L105
$$ plain form
60147 679596 682816 685759 688235 690163 691773 693750 696759 700805 705330 709868 714368 719081 724490 731217
60133 731217 739535 749003 758910 768887 778696 787717 795270 801347 806339 810106 812101 812539 812687 813636 815362
60118 815362 817299 819244 821291 823352 825260 827116 829167 831532 834248 837259 840110 841949 842129 840612
60104 840612 837609 833162 827364 820720 813853 806953 799781 792135 784160 776337 769329 763671 759397 756056
60090 756056 753220 750853 749114 748046 747656 748086 749409 751364 753512 755618 757696 759689 761343 762525 763499
60075 763499 764649 765808 765993 763986 759241 752146 743500 733945 723897 713679 703544 693689 684391 675913
60061 675913 668223 661066 654452 648796 644393 640999 638087 635248 632283 629288 626809 625468 625233 625523 626242
60046 626242 628092 631549 636219 641673 648177 655847 663813 671167 678277 686130 694675 702804 709781 715616
$$ packed form
60147F79596L220K943K476J928J610J977L009M046M525M538M500M713N409O727
60133G31217Q318R468R907R977R809R021P553O077M992L767J995M38J48R49J726
60118H15362J937J945K047K061J908J856K051K365K716L011K851J839J80j517
60104H40612l003m447n798o644o867o900p172p646p975p823p008n658m274l341
60090G56056k836k367j739j068l90M30J323J955K148K106K078J993J654J182R74
60075G63499J150J159J85k007m745p095q646r555j0048j0218j0135r855r298q478
60061F75913p690p157o614n656m403l394k912k839k965k995k479j341k35K90P19
60046F26242J850L457M670N454O504P670P966P354P110P853Q545Q129O977N835
$$ plain form
60032 715616 720149 722852 723681 723162 721438 718114 713208 707385 700960 693509 684853 675711 666951 658702 650587
60017 650587 642338 633882 625240 616670 608637 601439 595053 589288 583771 577952 571629 565395 560094 555979
60003 555979 552845 550715 549638 549102 548494 548061 548540 549892 551337 552663 554476 557004 559650 562029 564578
59988 564578 567805 571736 576324 581638 587351 592845 598023 603218 608093 611595 613281 613729 613318 611588 608291
59973 608291 604083 599623 594886 589931 585436 581787 578461 575052 572221 570910 571194 572504 574417 576625
59959 576625 578762 580874 583507 586788 589969 592378 594192 595752 596831 597155 596996 596682 596184 595713 595926 596870
59943 596870 597564 597371 597055 597573 598542 598827 598094 596835 595321 593475 591419 589335 587153 585101 584115 584887
59927 584887 586924 589356 592193 595984 600757 606196 612475 619965 628395 637172 646227 655719 665277 674363
$$ packed form
60032G15616M533K703Q29n19j724l324m906n823o425p451q656r142q760q249q115
60017F50587q249q456q642q570q033p198o386n765n517n819o323o234n301m115
60003E55979l134k130j077n36o08m33M79J352J445J326J813K528K646K379K549
59988E64578L227L931M588N314N713N494N178N195M875L502J686M48m11j730l297
59973F08291m208m460m737m955m495l649l326l409k831j311K84J310J913K208
59959E76625K137K112K633L281L181K409J814J560J079L24j59l14m98m71K13R44
59943E96870O94j93l16N18R69K85p33j259j514j846k056k084k182k052r86P72
59927E84887K037K432K837L791M773N439O279P490Q430Q777R055R492R558R086
$$ plain form
59913 674363 682972 691042 697627 701749 703809 705087 706107 706597 706808 707541 708764 709444 708985 707809 706306
59898 706306 704323 702012 700142 698988 697753 695758 693602 692526 693045 694724 696985 699632 702692 706123
59884 706123 709698 713157 716533 720296 724950 730499 736499 742592 748787 755274 762116 769028 775318 780208
59870 780208 783358 784893 784931 783508 781091 778592 776449 774108 770738 766046 760222 753734 747562 742752 739071
59855 739071 734874 729182 723214 718897 716448 714589 712666 711231 710739 711125 712818 716920 723911 733050 743332
59840 743332 754172 764867 774226 781211 785400 786676 785283 782528 780617 781151 784082 788350 792914 796783
59826 796783 798706 797687 793732 787658 780184 771562 762009 752132 742795 734679 728096 723148 719825 717800
59812 717800 716353 714873 713402 712203 710850 708329 704222 699213 694179 689455 685300 682231 680193 678038
$$ packed form
59913F74363Q609Q070O585M122K060J278J020M90K11P33J223O80m59j176j503
59898G06306j983k311j870j154j235j995k156j076N19J679K261K647L060L431
59884G06123L575L459L376L763M654N549O000O093O195O487O842O912O290M890
59870G80208L150J535L8j423k417k499k143k341l370m692n824o488o172m810l681
59855G39071m197n692n968m317k449j859j923j435m92L86J693M102O991R139J0282
59840G43332J0840J0695R359O985M189J276j393k755j911N34K931M268M564L869
59826G96783J923j019l955o074p474q622r553r877r337q116o583m948l323k025
59812G17800j447j480j471j199j353k521m107n009n034m724m155l069k038k155
$$ plain form
59798 678038 674708 670562 666820 663990 661598 659083 656199 652738 648704 644622 641022 637734 634308 630876
59784 630876 627896 625306 622656 619935 617565 615746 614457 613829 613771 613553 612639 611759 612218 614229 616866 619566
59768 619566 622684 626507 630681 634864 639176 643754 648483 653261 657969 662257 666046 670142 675522 682029
59754 682029 688603 694794 701116 707845 714503 720855 727492 734900 742595 749671 755799 761337 766754 772089
59740 772089 776707 779652 780610 780342 779721 778635 776529 773714 771211 769432 767911 766342 764933 763704 762370
59725 762370 761087 760397 760221 759698 758240 756041 753434 750550 747757 745531 743694 741584 739200 737380 736606
59710 736606 736460 736493 736809 737529 738491 739755 741683 744256 747084 750232 754118 758407 762047 764859 768107 772943
59694 772943 779029 785216 790803 795570 799216 801410 802031 801084 798869 796306 794353 792873 790905 788225 785708
$$ packed form
59798F78038l330m146l742k830k392k515k884l461m034m082l600l288l426l432
59784F30876k980k590k650k721k370j819j289o28n8k18r14q80M59K011K637K700
59768F19566L118L823M174M183M312M578M729M778M708M288L789M096N380O507
59754F82029O574O191O322O729O658O352O637P408P695P076O128N538N417N335
59740G72089M618K945R58k68o21j086k106k815k503j779j521j569j409j229j334
59725G62370j283o90j76n23j458k199k607k884k793k226j837k110k384j820p74
59710G36606j46L3L16P20R62J264J928K573K828L148L886M289L640K812L248M836
59694G72943O086O187N587M767L646K194O21r47k215k563j953j480j968k680k517
$$ plain form
59679 785708 783841 781892 779029 775242 770622 764803 757846 750726 744108 737427 730041 722603 716318 711422
59665 711422 707248 703368 699796 696479 693457 691226 690199 689993 689979 690260 691503 693980 697420 701632 706604
59650 706604 712063 717437 722319 726615 730256 732986 734403 734139 732144 728735 724123 718091 710632 702759
59636 702759 695879 690294 685144 680002 675622 672749 671028 669569 667836 665514 662298 658378 654476 650820
59622 650820 646743 641824 636670 631978 627562 623013 618611 614751 611059 607009 602967 599814 597868 596904
59608 596904 596860 597763 599297 601169 603610 606829 610231 612942 614831 616366 617723 618728 619501 620425 621544
59593 621544 622568 623386 624059 624451 624352 623937 623656 623721 623944 623888 623003 621008 618399 616147 614560 612893 610492
59576 610492 607729 605278 603051 600537 597704 594861 591989 589032 586548 585250 584980 584831 584259 583439 582633
$$ packed form
59679G85708j867j949k863l787m620n819o957p120o618o681p386p438o285m896
59665G11422m174l880l572l317l022k231j027k06j4K81J243K477L440M212M972
59650G06604N459N374M882M296L641K730J417k64j995l409m612o032p459p873
59636G02759o880n585n150n142m380k873j721j459j733k322l216l920l902l656
59622F50820m077m919n154m692m416m549m402l860l692m050m042l153j946r64
59608E96904m4R03J534J872K441L219L402K711J889J535J357J005P73R24J119
59593F21544J024Q18O73L92r9m15k81O5K23n6q85j995k609k252j587j667k401
59576F10492k763k451k227k514k833k843k872k957k484j298k70j49n72q20q06
$$ plain form
59561 582633 581840 581122 580749 580904 581558 582635 583987 585332 586520 587751 589264 590940 592470 593744 594890
59546 594890 596149 597961 600840 604899 609771 615181 621354 628776 638081 650320 666616 686969 709627
59533 709627 731771 750390 762616 766589 763007 755295 747276 740775 735816 732357 730903 731738 734540 738833
59519 738833 744261 750389 756527 761600 764140 762998 758532 752543 746499 740208 732652 723507 713178 701963
59505 701963 690041 678003 666638 656370 647401 640001 634082 628928 624059 620007 617492 616121 614704
59492 614704 612644 610349 608446 607329 607279 608337 610090 612079 614311 616924 619659 622197 624799 628040 632147
59477 632147 637071 642887 649605 656857 664250 671657 678652 684161 687413 688933 689914 690905 691708 692179 692382
59462 692382 692247 691813 691655 692429 694213 696846 700604 705919 712721 720703 729945 740628 752402 764628
$$ packed form
59561E82633p93p18l73J55O54J077J352J345J188J231J513J676J530J274J146
59546E94890J259J812K879M059M872N410O173P422R305J2239J6296K0353K2658
59533G09627K2144J8619J2226L973l582p712q019o501m959l459j454Q35K802M293
59519G38833N428O128O138N073K540j142m466n989o044o291p556r145j0329j1215
59505G01963j1922j2038j1365j0268q969p400n919n154m869m052k515j371j417
59492F14704k060k295j903j117n0J058J753J989K232K613K735K538K602L241M107
59477F32147M924N816O718P252P393P407O995N509L252J520R81R91Q03M71K03
59462F92382j35m34j58P74J784K633L758N315O802P982R242J0683J1774J2226
$$ plain form
59448 764628 776939 789013 800192 809948 818280 824976 828956 829129 825478 818615 808824 796481 782909
59435 782909 769800 758002 747679 739171 732628 727171 721615 715914 710965 707203 704432 702910 703492 706715
59421 706715 712572 721128 732480 746340 762479 781359 803394 828020 854614 883928 917132 953398
59409 953398 989476 1021400 1045347 1057481 1055355 1040475 1018137 993997 971682 953787 943171 941750
59397 941750 948708 960787 973652 982482 982594 971356 949900 922392 893468 866240 841925 820565
59385 820565 802112 787127 776347 769603 765634 763165 761797 761676 762781 764838 767579 770817 774400 778247
59371 778247 782307 786535 791033 795944 800951 805223 808303 810734 813334 816187 818964 821770 824881 827971
59357 827971 830577 833170 836832 841951 848140 855355 864048 874119 884758 895655 907499 921022 936307
$$ packed form
59448G64628J2311J2074J1179R756Q332O696L980J73l651o863r791j2343j3572
59435G82909j3109j1798j0323q508o543n457n556n701m949l762k771j522N82L223
59421G06715N857Q556J1352J3860J6139J8880K2035K4626K6594K9314L3204L6266
59409I53398L6078L1924K3947J2134k126j4880k2338k4140k2315j7895j0616j421
59397I41750O958J2079J2865Q830J12j1238k1456k7508k8924k7228k4315k1360
59385H20565j8453j4985j0780o744l969k469j368j21J105K057K741L238L583L847
59371G78247M060M228M498M911N007M272L080K431K600K853K777K806L111L090
59357H27971K606K593L662N119O189P215Q693J0071J0639J0897J1844J3523J5285
$$ plain form
59344 936307 953222 971681 991053 1010066 1027777 1044181 1059570 1073690 1085740 1094836 1100412 1102519
59332 1102519 1101667 1098069 1091267 1080998 1067998 1053281 1037074 1019431 1001494 984938 970129 956008
59320 956008 941861 928184 915656 904354 894243 885433 877635 870217 863088 856718 851100 845515 839481
59307 839481 833103 826396 819208 811982 805591 800185 795131 790315 786515 784302 783654 784930 789049 796294
59293 796294 806022 817962 832496 848845 863996 874358 877899 874249 863877 848258 830118 812253
59281 812253 796070 781730 769386 759737 753613 751418 752774 756620 762023 769014 778174 789512 802471
59268 802471 816927 833180 850682 867760 883018 896219 907471 916421 922692 926252 926797 923600 916603
59255 916603 907077 896602 885834 874659 863047 851379 840365 830862 823298 817217 811951 807655 804917
$$ packed form
59344I36307J6915J8459J9372J9013J7711J6404J5389J4120J2050R096N576K107
59332A102519q52l598o802j0269j3000j4717j6207j7643j7937j6556j4809j4121
59320I56008j4147j3677j2528j1302j0111q810p798p418p129o370n618n585o034
59307H39481o378o707p188p226o391n406n054m816l800k213o48J276M119P245
59293G96294R728J1940J4534J6349J5151J0362L541l650j0372j5619j8140j7865
59281H12253j6183j4340j2344r649o124k195J356L846N403O991R160J1338J2959
59268H02471J4456J6253J7502J7078J5258J3201J1252Q950O271L560N45l197o997
59255I16603r526j0475j0768j1175j1612j1668j1014r503p564o081n266m296k738
$$ plain form
59242 804917 803579 803063 803738 806532 810980 815270 818756 822930 829066 836363 843442 850380 857897 865466 871711
59227 871711 876187 879497 881931 883021 882300 879759 875683 870575 864980 859002 852367 845190 838091 831271
59213 831271 824284 817063 810227 803903 797293 790117 783422 778022 773084 767345 761015 755312 750701 746718
59199 746718 743119 740081 737535 735283 733601 732896 732913 733043 733217 733886 735290 737378 740192 743789 747991 752610
59183 752610 757564 762408 766331 769206 772067 775946 780744 785837 791162 796939 802877 808556 814231 820458
59169 820458 827197 834043 841083 848858 857698 867628 878552 889882 900331 908777 915102 919654 922232
59156 922232 922279 919769 915186 908720 900021 888693 874768 858979 842847 828030 815105 803299 791705
59143 791705 780293 769384 758816 748183 737490 727087 717343 708726 701599 695558 689648 683704 678768
$$ packed form
59242H04917j338n16O75K794M448M290L486M174O136P297P079O938P517P569O245
59227H71711M476L310K434J090p21k541m076n108n595n978o635p177p099o820
59213H31271o987p221o836o324o610p176o695n400m938n739o330n703m611l983
59199G46718l599l038k546k252j682p05J7J30J74O69J404K088K814L597M202M619
59183G52610M954M844L923K875K861L879M798N093N325N777N938N679N675O227
59169H20458O739O846P040P775Q840R930J0924J1330J0449Q446O325M552K578
59156I22232M7k510m583o466q699j1328j3925j5789j6132j4817j2925j1806j1594
59143G91705j1412j0909j0568j0633j0693j0403r744q617p127o041n910n944m936
$$ plain form
59130 678768 675611 673613 671712 669781 668287 667325 666846 667375 669588 673524 678887 685786 694513 704888 716413
59115 716413 728728 741508 754398 767508 781428 796233 810981 824691 837213 848742 859258
59104 859258 868916 878161 886767 893613 898104 901058 903384 904729 904275 902063 898637 894171 889010 884369
59090 884369 881367 879813 878828 878103 877659 877000 875550 873383 870580 866423 860197 852301 843644 834502 824871
59075 824871 815258 806081 796890 787261 777829 769425 761819 754466 747779 742381 737721 732808 727847 723751
59061 723751 720458 717149 713790 710995 708534 705438 701551 697667 694171 690764 687504 684882 682883 681102
59047 681102 679818 679801 680963 682259 682972 683194 683080 682597 681975 681502 680999 680295 679939 680503 681533 682283 683125 685043
59029 685043 688076 691587 695811 701672 709195 717666 727490 740284 756638 775028 793418 810919 827470
$$ packed form
59130F78768l157j998j901j931j494r62m79N29K213L936N363O899Q727J0375J1525
59115G16413J2315J2780J2890J3110J3920J4805J4748J3710J2522J1529J0516
59104H59258R658R245Q606O846M491K954K326J345m54k212l426m466n161m641
59090H84369l002j554r85p25m44o59j450k167k803m157o226p896q657r142r631
59075H24871r613r177r191r629r432q404p606p353o687n398m660m913m961m096
59061G23751l293l309l359k795k461l096l887l884l496l407l260k622j999j781
59047F81102j284j7J162J296P13K22j14m83o22m73n03p04l56N64J030P50Q42J918
59029F85043L033L511M224N861P523Q471R824J2794J6354J8390J8390J7501J6551
$$ plain form
59016 827470 842877 856690 868318 876969 882146 884348 884675 883711 881425 877945 873514 867959 861301 854889
59002 854889 850783 849856 851423 854750 859827 866564 874257 882131 889508 895366 898741 899830 899882 899766 899313
58987 899313 898062 895778 892225 887316 881608 875840 869986 863609 857147 851916 848790 847690 848300 850386
58973 850386 853488 857310 862461 869872 879457 890236 901624 913599 925776 937539 949102 961178
58961 961178 973464 984728 994659 1004377 1014518 1023799 1030005 1031664 1028411 1020478 1008367 992654 973957
58948 973957 953324 932296 911970 892357 873373 855909 840892 827880 815927 805460 797741 792678
58936 792678 788817 785536 783491 782579 781249 778515 775246 772680 770895 769483 768599 768443 768483 767923 766381 763747
58920 763747 760114 756176 752888 750304 747509 744053 740688 738395 737429 737653 739051 741553 744951 749206 754367
$$ packed form
59016H27470J5407J3813J1628Q651N177K202L27r64k286l480m431n555o658o412
59002H54889m106r27J567L327N077O737P693P874P377N858L375J089N2j16m53
58987H99313j251k284l553m909n708n768n854o377o462n231l126j100O10K086
58973H50386L102L822N151P411R585J0779J1388J1975J2177J1763J1563J2076
58961I61178J2286J1264R931R718J0141R281O206J659l253p933j2111j5713j8697
58948I73957k0633k1028k0326j9613j8984j7464j5017j3012j1953j0467p719n063
58936G92678l861l281k045r12j330k734l269k566j785j412q84j56M0n60j542k634
58920G63747l633l938l288k584k795l456l365k293r66K24J398K502L398M255N161
$$ plain form
58905 754367 760204 766664 774547 784790 797121 810382 824184 839115 855189 871303 886561 901162
58893 901162 915650 930227 945133 960900 977931 996572 1017613 1041813 1068756 1096978 1125212
58882 1125212 1152608 1177845 1199260 1216098 1228672 1237171 1241259 1240864 1236279 1227450 1214211 1197285
58870 1197285 1177952 1156779 1133880 1110385 1088272 1068565 1050941 1035222 1021837 1010560 1000181
58859 1000181 989802 979276 968242 956064 943005 930051 917241 903542 888767 874313 861593
58848 861593 850983 842488 835979 830371 824012 816457 808642 800981 792708 783435 773852 764396 754733 745087
58834 745087 736608 729771 723755 717912 712511 707574 702599 698019 695291 694768 695018 695039 695603 697505 700056
58819 700056 702399 704953 708392 712362 716267 720312 724844 729592 734237 738718 742310 743680 742674 740852
$$ packed form
58905G54367N837O460P883J0243J2331J3261J3802J4931J6074J6114J5258J4601
58893I01162J4488J4577J4906J5767J7031J8641K1041K4200K6943K8222K8234
58882A125212K7396K5237K1415J6838J2574Q499M088l95m585q829j3239j6926
58870A197285j9333k1173k2899k3495k2113j9707j7624j5719j3385j1277j0379
58859A000181j0379j0526j1034j2178j3059j2954j2810j3699j4775j4454j2720
58848H61593j0610q495o509n608o359p555p815p661q273r273r583r456r663r646
58834G45087q479o837o016n843n401m937m975m580k728n23K50K1N64J902K551
58819G00056K343K554L439L970L905M045M532M748M645M481L592J370j006j822
$$ plain form
58805 740852 739531 738408 736720 734478 731848 728650 725272 722683 720790 718121 714026 709708 706146 702465
58791 702465 697530 691883 686897 683102 680410 678988 678915 679900 682083 686140 692021 698806 706309 715325 725675
58776 725675 735722 744585 753076 761402 767782 770640 770465 768195 763494 756156 747595 739157 730346 720347
58762 720347 710011 700641 692016 683463 675899 670984 668974 668919 670205 672510 675027 677154 679248 681581
58748 681581 683490 684676 686250 689197 692909 696533 700585 705823 711742 717732 724567 733130 742606 751563
58734 751563 759911 768225 776201 783439 790849 799502 808831 817545 825517 833158 839839 844683 848268 851809
58720 851809 855245 857737 859556 861947 865631 870803 877902 886856 896187 904318 911265 917715 923172 926387
58706 926387 926992 925319 921309 914854 906423 896074 882768 866031 847284 828055 807965 786122 763480
$$ packed form
58805G40852j321j123j688k242k630l198l378k589j893k669m095m318l562l681
58791G02465m935n647m986l795k692j422p3R85K183M057N881O785P503R016J0350
58776G25675J0047Q863Q491Q326O380K858j75k270m701p338q561q438q811r999
58762G20347j0336r370q625q553p564m915k010n5J286K305K517K127K094K333
58748F81581J909J186J574K947L712L624M052N238N919N990O835Q563R476Q957
58734G51563Q348Q314P976P238P410Q653R329Q714P972P641O681M844L585L541
58720H51809L436K492J819K391L684N172P099Q954R331Q131O947O450N457L215
58706I26387O05j673m010o455q431j0349j3306j6737j8747j9229k0090k1843k2642
$$ plain form
58693 763480 741964 722189 703869 687662 674584 664201 655229 647399 641036 635511 629891 624463 619808
58680 619808 615063 609029 602466 597273 593822 590994 588482 587093 587001 587579 588852 591515 595665 601022 608092
58665 608092 617640 629356 642488 657214 673704 690304 704388 714725 721527 724711 723858 719572 713216
58652 713216 705526 696859 688219 680458 672995 664883 656641 649475 643335 637430 631967 627640 623999 620211
58638 620211 616927 615576 616287 618197 621164 625345 629770 633361 636844 641632 647242 651779 654511 655940
58624 655940 655909 653835 650528 647640 645509 643454 641843 641871 643608 646357 650548 657167 665583 674109 682488
58609 682488 691656 701265 709624 716046 721170 725041 726976 727310 727235 726931 725672 723644 721683 719488 716069
58594 716069 711728 707638 703841 699786 696450 695643 697449 700589 704986 711673 720463 730203 741065 754039
$$ packed form
58693G63480k1516j9775j8320j6207j3078j0383q972p830o363n525n620n428m655
58680F19808m745o034o563n193l451k828k512j389r2N78J273K663M150N357P070
58665F08092R548J1716J3132J4726J6490J6600J4084J0337O802L184q53m286o356
58652G13216p690q667q640p761p463q112q242p166o140n905n463m327l641l788
58638F20211l284j351P11J910K967M181M425L591L483M788N610M537K732J429
58624F55940l1k074l307k888k131k055j611K8J737K749M191O619Q416Q526Q379
58609F82488R168R609Q359O422N124L871J935L34p5l04j259k028j961k195l419
58594G16069m341m090l797m055l336q07J806L140M397O687Q790R740J0862J2974
$$ plain form
58580 754039 768289 781661 793842 806371 819452 831399 841489 850745 859549 867141 873938 881921
58568 881921 892122 903985 917552 933963 953422 975034 999094 1027178 1059413 1093864 1128955
58557 1128955 1164247 1198462 1229150 1254876 1275585 1290509 1298121 1298662 1294394 1286885 1276304 1263735
58545 1263735 1251596 1240990 1230882 1220447 1209997 1199011 1185583 1168629 1148631 1125821 1099807
58534 1099807 1071383 1042444 1013727 984899 957124 932921 912995 895779 880616 868710 860257
58523 860257 853386 846930 841786 838604 836513 834983 834600 835094 834939 833693 832495 831551 829512 826082 822725
58508 822725 820017 816806 812910 810088 809255 809119 808591 808279 808653 808929 808673 808293 807311 804530 800595 797870
58492 797870 797025 796315 794983 794680 796583 799855 803950 809793 817598 826137 835210 846353 860190 875722
$$ packed form
58580G54039J4250J3372J2181J2529J3081J1947J0090R256Q804P592O797P983
58568H81921J0201J1863J3567J6411J9459K1612K4060K8084L2235L4451L5091
58557A128955L5292L4215L0688K5726K0709J4924P612N41m268p509j0581j2569
58545A263735j2139j0606j0108j0435j0450j0986j3428j6954j9998k2810k6014
58534A099807k8424k8939k8717k8828k7775k4203j9926j7216j5163j1906q453
58523H60257o871o456n144l182k091j530l83M94j55j246j198r44k039l430l357
58508H22725k708l211l896k822q33j36n28l12L74K76k56l80r82k781l935k725
58492G97870q45p10j332l03J903L272M095N843P805Q539R073J1143J3837J5532
$$ plain form
58478 875722 893015 913614 937318 961487 984637 1007568 1029643 1047249 1057761 1062140 1061918 1056487
58466 1056487 1045368 1030557 1014603 998472 982886 969505 959249 951569 946619 945839 949326 955221
58454 955221 962879 973872 988637 1004976 1021180 1037595 1053554 1065854 1072085 1072827 1069023 1060140 1046639
58441 1046639 1031273 1016000 1000242 983880 969061 957266 947443 938856 932956 930579 930213 930838 933613
58428 933613 938994 945233 951649 960307 972540 986847 1002042 1019102 1037723 1054402 1066324 1074158
58416 1074158 1078908 1079442 1075496 1069646 1063558 1055428 1043764 1030524 1017893 1005223 991842 979597 969731
58403 969731 960476 950714 942730 938320 935460 932062 929788 930721 933386 935656 938622 943900 949823 953972
58389 953972 957016 960513 963357 963892 963263 963266 963102 961376 958975 956959 954151 949883 946563 946448 948482 951206
$$ packed form
58478H75722J7293K0599K3704K4169K3150K2931K2075J7606J0512M379k22n431
58466A056487j1119j4811j5954j6131j5586j3381j0256p680m950p80L487N895
58454I55221P658J0993J4765J6339J6204J6415J5959J2300O231P42l804q883j3501
58441A046639j5366j5273j5758j6362j4819j1795r823q587n900k377l66O25K775
58428I33613N381O239O416Q658J2233J4307J5195J7060J8621J6679J1922P834
58416A074158M750N34l946n850o088q130j1664j3240j2631j2670j3381j2245r866
58403I69731r255r762p984m410k860l398k274R33K665K270K966N278N923M149
58389I53972L044L497K844N35o29Lj64j726k401k016k808m268l320j15K034K724
$$ plain form
58373 951206 955817 963284 971541 978938 987387 998710 1010998 1022198 1034108 1049021 1065483 1081300
58361 1081300 1097754 1116838 1137216 1156924 1177121 1199055 1220132 1237120 1250546 1262045 1270411
58350 1270411 1274401 1276418 1279085 1281157 1281067 1281358 1285030 1290562 1295242 1300415 1308682 1318912 1328952 1340382
58336 1340382 1355495 1372364 1387985 1403655 1422209 1442643 1462492 1482721 1504994 1526835 1544779
58325 1544779 1559742 1574087 1586191 1593367 1597417 1601706 1605381 1606087 1605739 1607888 1611867 1615167 1618981 1625791
58311 1625791 1634208 1641927 1650963 1664149 1679477 1693932 1709709 1730231 1753124 1773859 1793329 1814931
58299 1814931 1837133 1856241 1873911 1894559 1917647 1939704 1961517 1986078 2011855 2035510 2058868
58288 2058868 2085781 2114596 2141254 2167345 2197318 2230201 2261946 2293398 2327883 2363529 2396421
$$ packed form
58373I51206M611P467Q257P397Q449J1323J2288J1200J1910J4913J6462J5817
58361A081300J6454J9084K0378J9708K0197K1934K1077J6988J3426J1499Q366
58350A270411L990K017K667K072r0K91L672N532M680N173Q267J0230J0040J1430
58336A340382J5113J6869J5621J5670J8554K0434J9849K0229K2273K1841J7944
58325A544779J4963J4345J2104P176M050M289L675P06l48K149L979L300L814O810
58311A625791Q417P719R036J3186J5328J4455J5777K0522K2893K0735J9470K1602
58299A814931K2202J9108J7670K0648K3088K2057K1813K4561K5777K3655K3358
58288B058868K6913K8815K6658K6091K9973L2883L1745L1452L4485L5646L2892
$$ plain form
58277 2396421 2428878 2466033 2506607 2545753 2584583 2627963 2675237 2722258 2770278 2823587 2880692
58266 2880692 2937290 2995562 3060784 3131178 3201064 3271579 3347919 3428393 3506977 3584377 3665574
58255 3665574 3748688 3827684 3903984 3983791 4066028 4144927 4222544 4306365 4396385 4487151 4580684
58244 4580684 4684349 4797602 4914200 5035791 5169730 5315228 5465629 5622482 5792847
58235 5792847 5974831 6161049 6354339 6564088 6789203 7021528 7264032 7527837 7813103
58226 7813103 8111496 8425832 8767737 9137338 9525892 9937347 10385837 10872997 11390556
58217 11390556 11944580 12553055 13220124 13938357 14716418 15577497 16530505 17572141 18718414
58208 18718414 20003389 21446348 23054631 24861704 26927287 29299198 32017197 35160330
$$ packed form
58277B396421L2457L7155M0574L9146L8830M3380M7274M7021M8020N3309N7105
58266B880692N6598N8272O5222P0394O9886P0515P6340Q0474P8584P7400Q1197
58255C665574Q3114P8996P6300P9807Q2237P8899P7617Q3821R0020R0766R3533
58244D580684J03665J13253J16598J21591J33939J45498J50401J56853J70365
58235E792847J81984J86218J93290K09749K25115K32325K42504K63805K85266
58226G813103K98393L14336L41905L69601L88554M11455M48490M87160N17559
58217A1390556N54024O08475O67069P18233P78061Q61079R53008J041636J146273
58208A8718414J284975J442959J608283J807073K065583K371911K717999L143133
$$ plain form
58200 35160330 38849077 43199431 48328457 54417014 61718709 70509980 81111094 93980735
58192 93980735 109716665 128946970 152322976 180624783 214592698 254223814 297901540
58185 297901540 342023552 381427520 410486917 424647874 421997849 404060329 375130715
58178 375130715 340473838 304604536 270567132 240052519 213684095 191207952 171764175
58171 171764175 154314480 138040747 122549551 107871026 94290638 82093091 71384449
58164 71384449 62105702 54144020 47377249 41649009 36781599 32631001 29096114 26079803
58156 26079803 23482487 21234594 19297467 17627714 16170724 14889316 13767005 12779719
58148 12779719 11892171 11084635 10356434 9699623 9093835 8530014 8015106 7549265 7120093
$$ packed form
58200C5160330L688747M350354N129026O088557P301695Q791271J0601114J2869641
58192I3980735J5735930J9230305K3376006K8301807L3967915L9631116M3677726
58185B97901540M4122012L9403968K9059397J4160957k650025j7937520k8929614
58178C75130715l4656877l5869302l4037404l0514613k6368424k2476143j9443777
58171A71764175j7449695j6273733j5491196j4678525j3580388j2197547j0708642
58164G1384449r278747p961682o766771n728240m867410m150598l534887l016311
58156B6079803k597316k247893j937127j669753j456990j281408j122311r87286
58148A2779719q87548q07536p28201o56811o05788n63821n14908m65841m29172
$$ plain form
58139 7120093 6722566 6363304 6041276 5744255 5468062 5220234 5000685 4796665 4600577
58130 4600577 4415789 4241559 4069296 3897632 3735217 3584753 3439289 3297396 3166703
58121 3166703 3048819 2935700 2824785 2723394 2634150 2549876 2467105 2391290 2324312 2259597
58111 2259597 2194016 2132463 2076457 2020084 1961511 1907038 1859395 1813005 1765017 1720230 1680781
58100 1680781 1641445 1599549 1559551 1523557 1487067 1448429 1412960 1383354 1355073 1325459 1298561
58089 1298561 1276761 1256244 1234912 1216384 1201978 1186924 1168662 1151068 1136490 1121291 1103231
58078 1103231 1085601 1070160 1053434 1033918 1015634 1000679 985384 967601 950644 936244 920791
58067 920791 902572 885760 873085 861291 847972 836292 828649 822032 813917 806646 801646 795307 785033
$$ packed form
58139G120093l97527l59262l22028k97021k76193k47828k19549k04020j96088
58130D600577j84788j74230j72263j71664j62415j50464j45464j41893j30693
58121C166703j17884j13119j10915j01391q9244q4274q2771p5815o6978o4715
58111B259597o5581o1553n6006n6373n8573n4473m7643m6390m7988m4787l9449
58100A680781l9336m1896l9998l5994l6490l8638l5469k9606k8281k9614k6898
58089A298561k1800k0517k1332j8528j4406j5054j8262j7594j4578j5199j8060
58078A103231j7630j5441j6726j9516j8284j4955j5295j7783j6957j4400j5453
58067I20791j8219j6812j2675j1794j3319j1680p643o617q115p271n000o339j0274
$$ plain form
58054 785033 773837 764639 755394 744043 733053 724820 717445 708995 701336 696027 691035 684962 679881
58041 679881 676696 672485 665658 658942 654109 648701 641249 634614 630687 626762 620695 614688 610344 604927
58027 604927 596387 587361 580291 573144 563860 554567 547430 540626 532430 525069 520578 516930 512291 508987
58013 508987 509111 510074 508756 506492 505847 505955 505217 505187 507558 510291 510866 510630 512169 515058 517805 521261
57997 521261 526622 532684 538280 544630 552144 557910 559620 559027 558336 556404 551891 546885 543644 540691 535870
57982 535870 530458 526469 522557 516485 509270 503158 497752 491663 485831 481707 478288 474253 470905 469813
57968 469813 469754 469154 469212 471403 474242 475830 477230 480000 482709 483378 483149 484052 485234 484853 483606 482933 481801
57951 481801 478785 475383 473694 472689 470330 467577 466738 467556 468483 470161 474034 479081 483570 488654 496619
$$ packed form
58054G85033j1196r198r245j1351j0990q233p375q450p659n309m992o073n081
58041F79881l185m211o827o716m833n408p452o635l927l925o067o007m344n417
58027F04927q540r026p070p147r284r293p137o804q196p361m491l648m639l304
58013E08987J24R63j318k264o45J08p38l0K371K733N75k36J539K889K747L456
57997E21261N361O062N596O350P514N766J710n93o91j932m513n006l241k953m821
57982E35870n412l989l912o072p215o112n406o089n832m124l419m035l348j092
57968D69813n9o00N8K191K839J588J400K770K709O69k29R03J182l81j247o73j132
57951D81801l016l402j689j005k359k753q39Q18R27J678L873N047M489N084P965
$$ plain form
57936 496619 506858 517147 527746 540687 555910 571504 586859 602322 616497 627086 633829 637892
57924 637892 639198 637106 632706 627671 621698 613747 604716 596246 587969 578669 569116 561120 554879 549828
57910 549828 546781 546487 547297 547158 546780 548060 550538 552294 553130 553912 553930 552000 549194 547372 545827 542438
57894 542438 537438 533104 530386 528674 528179 529622 532062 533784 534869 536439 538118 538796 539109 540440 542162
57879 542162 542483 541287 539662 537512 534261 530986 529034 527377 524171 520144 517594 516801 516335 516149 517302
57864 517302 519251 520543 521749 524685 529111 533222 537085 542565 550000 557876 565740 574550 584115 592878
57850 592878 600310 607052 612848 616774 619281 621438 622416 620394 615708 610547 605701 600187 593769 587173
57836 587173 580130 571941 563748 557407 552306 546266 539484 534546 532412 531380 530352 530184 531353 533046
$$ packed form
57936D96619J0239J0289J0599J2941J5223J5594J5355J5463J4175J0589O743M063
57924F37892J306k092m400n035n973p951r031q470q277r300r553p996o241n051
57910E49828l047k94Q10j39l78J280K478J756Q36P82J8j930k806j822j545l389
57894E42438n000m334k718j712m95J443K440J722J085J570J679O78L13J331J722
57879E42162L21j196j625k150l251l275j952j657l206m027k550p93m66j86J153
57864E17302J949J292J206K936M426M111L863N480P435P876P864Q810R565Q763
57850E92878P432O742N796L926K507K157R78k022m686n161m846n514o418o596
57836E87173p043q189q193o341n101o040o782m938k134j032j028j68J169J693
$$ plain form
57822 533046 535076 538123 541597 543821 544759 546073 548087 549225 548962 548805 549771 551220 552712 554645 556517
57807 556517 556781 554983 551956 547558 540516 530938 520750 511249 502434 494972 490287 488164 486689 485250
57793 485250 485339 487770 491373 495101 499224 503763 507942 511903 516943 523392 530256 537430 546119 556466
57779 556466 566920 576538 585884 595099 603324 610663 618500 627133 635154 641785 647603 652297 654108 652454
57765 652454 648917 644660 639026 631685 623988 616991 610103 602873 596266 590955 586082 580908 576088 572317
57751 572317 569292 566929 565996 566624 567785 569045 571231 574631 578360 582255 587450 594054 600228 604708 608474
57736 608474 612761 617119 620680 623690 626532 628765 630386 632567 635888 639207 641431 643059 644813 646172
57722 646172 646488 646291 646233 645898 644856 643741 643134 642369 640544 637847 634971 632106 629283 626799 624622 622314
$$ packed form
57822E33046K030L047L474K224R38J314K014J138k63j57R66J449J492J933J872
57807E56517K64j798l027m398p042r578j0188r501q815p462m685k123j475j439
57793D85250Q9K431L603L728M123M539M179L961N040O449O864P174Q689J0347
57779E56466J0454R618R346R215Q225P339P837Q633Q021O631N818M694J811j654
57765F52454l537m257n634p341p697o997o888p230o607n311m873n174m820l771
57751E72317l025k363r33O28J161J260K186L400L729L895N195O604O174M480L766
57736F08474M287M358L561L010K842K233J621K181L321L319K224J628J754J359
57722F46172L16j97n8l35j042j115o07p65j825k697k876k865k823k484k177k308
$$ plain form
57706 622314 620024 618477 617553 616197 614247 612964 613178 614320 615847 618096 621066 623923 626477 629559 633152
57691 633152 635718 636294 635765 635206 634511 633531 632933 632841 632265 631005 630706 632852 637114 642749 650231 660307
57675 660307 672860 687937 706719 730390 759314 794412 838019 892137 956864 1031154 1113029
57664 1113029 1197207 1273706 1330827 1359881 1357462 1325601 1271375 1204834 1134987 1067378 1005305
57653 1005305 951329 906330 868783 836822 810237 789296 772856 759104 747299 737537 729662 723591
57641 723591 719770 718204 717873 718036 719099 721356 724096 726872 730304 734600 738694 741920 745066 748608 751525
57626 751525 753257 755144 758285 761497 763187 763839 764762 765718 765833 765734 766636 768167 769187 770033 771999 775128
57610 775128 778396 781523 784827 787873 790017 791782 794032 796338 797882 799346 802089 805833 809012 811084
$$ packed form
57706F22314k290j547r24j356j950j283K14J142J527K249K970K857K554L082L593
57691F33152K566N76n29n59o95r80n98r2n76j260k99K146M262N635P482J0076
57675F60307J2553J5077J8782K3671K8924L5098M3607N4118O4727P4290Q1875
57664A113029Q4178P6499N7121K9054k419l1861n4226o6541o9847o7609o2073
57653A005305n3976m4999l7547l1961k6585k0941j6440j3752j1805r762p875o071
57641G23591l821j566l31J63J063K257K740K776L432M296M094L226L146L542K917
57626G51525J732J887L141L212J690O52R23R56J15r9R02J531J020Q46J966L129
57610G75128L268L127L304L046K144J765K250K306J544J464K743L744L179K072
$$ plain form
57596 811084 812815 814549 815922 817093 818632 820336 821604 822788 824724 827189 829277 831042 833283 835959
57582 835959 838320 840414 842966 845942 848694 851419 854993 859353 863428 866605 869103 871020 872329 873680
57568 873680 875871 878613 881014 883112 885736 889031 892464 896129 900677 906009 911343 916549 922170 928147
57554 928147 933792 939079 944755 951177 958149 965874 974867 984879 995000 1004837 1014488 1023351 1030221 1034801
57540 1034801 1038151 1041434 1045042 1048989 1053333 1058051 1063115 1068623 1074419 1079906 1084828 1089655 1094583 1098931
57526 1098931 1102468 1106429 1111961 1118356 1124305 1130200 1137428 1145782 1153471 1159663 1165280 1171149 1177036 1182885
57512 1182885 1189494 1197400 1206222 1215552 1225505 1236055 1246718 1257190 1267464 1277231 1285991 1293925 1301866
57499 1301866 1310366 1319444 1329077 1339138 1349028 1358187 1366779 1375123 1382916 1390046 1397663 1407154 1418261
$$ packed form
57596H11084J731J734J373J171J539J704J268J184J936K465K088J765K241K676
57582H35959K361K094K552K976K752K725L574M360M075L177K498J917J309J351
57568H73680K191K742K401K098K624L295L433L665M548N332N334N206N621N977
57554I28147N645N287N676O422O972P725Q993J0012J0121R837R651Q863O870M580
57540A034801L350L283L608L947M344M718N064N508N796N487M922M827M928M348
57526A098931L537L961N532O395N949N895P228Q354P689O192N617N869N887N849
57512A182885O609P906Q822R330R953J0550J0663J0472J0274R767Q760P934P941
57499A301866Q500R078R633J0061R890R159Q592Q344P793P130P617R491J1107
$$ plain form
57486 1418261 1429441 1439886 1449947 1459834 1469222 1478151 1487002 1495620 1503645 1511663 1520718 1530609 1539902
57473 1539902 1547764 1554680 1561340 1567918 1574477 1581053 1587358 1593438 1600449 1609574 1620293 1630931 1640804
57460 1640804 1650590 1660790 1671294 1682393 1694709 1707956 1721163 1734210 1747759 1761620 1774766
57449 1774766 1787218 1800407 1815221 1831020 1846933 1862750 1878147 1892413 1905592 1918732 1932516
57438 1932516 1946655 1960987 1975984 1991759 2007663 2023370 2039340 2055800 2072178 2087919 2103019
57427 2103019 2117581 2131802 2146438 2162225 2178712 2194771 2210260 2225924 2241701 2256620 2270592
57416 2270592 2284801 2299937 2315506 2331214 2347580 2364695 2381875 2399081 2417238 2436480 2455480
57405 2455480 2473279 2490581 2508451 2526882 2545325 2563579 2581516 2599004 2616597 2635216 2654701
$$ packed form
57486A418261J1180J0445J0061R887R388Q929Q851Q618Q025Q018R055R891R293
57473A539902P862O916O660O578O559O576O305O080P011R125J0719J0638R873
57460A640804R786J0200J0504J1099J2316J3247J3207J3047J3549J3861J3146
57449A774766J2452J3189J4814J5799J5913J5817J5397J4266J3179J3140J3784
57438A932516J4139J4332J4997J5775J5904J5707J5970J6460J6378J5741J5100
57427B103019J4562J4221J4636J5787J6487J6059J5489J5664J5777J4919J3972
57416B270592J4209J5136J5569J5708J6366J7115J7180J7206J8157J9242J9000
57405B455480J7799J7302J7870J8431J8443J8254J7937J7488J7593J8619J9485
$$ plain form
57394 2654701 2673962 2692984 2713165 2735057 2757292 2778647 2799747 2821708 2844403 2867290 2890784
57383 2890784 2915612 2941581 2967988 2994434 3020424 3045059 3068058 3090220 3112148 3133433 3153836
57372 3153836 3174210 3195266 3216467 3237131 3257727 3278996 3300692 3322240 3343856 3365974 3388276
57361 3388276 3410371 3432788 3456340 3481067 3506659 3533219 3560694 3588256 3615252 3642196 3669928
57350 3669928 3698398 3727121 3756153 3785635 3815001 3843649 3871898 3900351 3928757 3956440 3983441
57339 3983441 4010415 4037754 4065598 4094285 4124038 4154496 4185145 4215798 4246264 4276151 4305571
57328 4305571 4335391 4366211 4397748 4429731 4462523 4496160 4529711 4562481 4595052 4628185 4661453
57317 4661453 4694041 4726285 4759339 4793617 4828493 4863199 4897341 4930960 4964746 4999676 5035774
$$ packed form
57394B654701J9261J9022K0181K1892K2235K1355K1100K1961K2695K2887K3494
57383B890784K4828K5969K6407K6446K5990K4635K2999K2162K1928K1285K0403
57372C153836K0374K1056K1201K0664K0596K1269K1696K1548K1616K2118K2302
57361C388276K2095K2417K3552K4727K5592K6560K7475K7562K6996K6944K7732
57350C669928K8470K8723K9032K9482K9366K8648K8249K8453K8406K7683K7001
57339C983441K6974K7339K7844K8687K9753L0458L0649L0653L0466K9887K9420
57328D305571K9820L0820L1537L1983L2792L3637L3551L2770L2571L3133L3268
57317D661453L2588L2244L3054L4278L4876L4706L4142L3619L3786L4930L6098
$$ plain form
57306 5035774 5071805 5106783 5141096 5175527 5210041 5244438 5279319 5315335 5352084 5388770 5425355
57295 5425355 5462123 5498711 5534657 5570386 5606617 5643303 5680130 5717539 5756085 5795182 5833603
57284 5833603 5870987 5907946 5944978 5982215 6019938 6058385 6097193 6135839 6174352 6212920 6251129
57273 6251129 6288407 6324856 6360936 6396711 6432089 6467350 6502707 6537827 6572493 6607207 6642353
57262 6642353 6677381 6711642 6745432 6779337 6813099 6846101 6878497 6910956 6943762 6976946 7010683
57251 7010683 7044680 7077803 7109259 7139507 7169154 7197755 7224808 7251067 7277531 7303797 7328828
57240 7328828 7352796 7376729 7400765 7424190 7446900 7469453 7491903 7513940 7536003 7558975 7582902
57229 7582902 7607151 7631608 7656544 7681542 7705757 7729077 7751906 7774083 7795215 7815775 7836591
$$ packed form
57306E035774L6031L4978L4313L4431L4514L4397L4881L6016L6749L6686L6585
57295E425355L6768L6588L5946L5729L6231L6686L6827L7409L8546L9097L8421
57284E833603L7384L6959L7032L7237L7723L8447L8808L8646L8513L8568L8209
57273F251129L7278L6449L6080L5775L5378L5261L5357L5120L4666L4714L5146
57262F642353L5028L4261L3790L3905L3762L3002L2396L2459L2806L3184L3737
57251G010683L3997L3123L1456L0248K9647K8601K7053K6259K6464K6266K5031
57240G328828K3968K3933K4036K3425K2710K2553K2450K2037K2063K2972K3927
57229G582902K4249K4457K4936K4998K4215K3320K2829K2177K1132K0560K0816
$$ plain form
57218 7836591 7857413 7877145 7895296 7912076 7927384 7940922 7952986 7963877 7972878 7979110 7983003 7985529
57206 7985529 7986449 7984923 7981516 7977758 7973819 7968427 7961201 7953299 7945485 7937239 7928157 7918721 7909247 7899396
57192 7899396 7889058 7878485 7867370 7855167 7842452 7830550 7819570 7808309 7796390 7785029 7775182
57181 7775182 7766375 7757816 7749390 7741044 7732376 7723304 7714145 7704826 7695138 7685806 7677937 7671225 7664104 7655861
57167 7655861 7647067 7637709 7626570 7612964 7597620 7581356 7564370 7547229 7530916 7515223 7498532 7479761
57155 7479761 7459104 7436310 7409802 7378212 7341377 7299275 7251558 7198825 7142866 7084894 7024869
57144 7024869 6963166 6901348 6840760 6781990 6726376 6676263 6632872 6595596 6564116 6539368 6521570
57133 6521570 6509259 6501339 6498042 6498519 6499392 6497178 6490513 6478779 6460556 6435178 6404288 6370336 6335195
$$ packed form
57218G836591K0822J9732J8151J6780J5308J3538J2064J0891R001O232L893K526
57206G985529R20j526l407l758l939n392p226p902p814q246r082r436r474r851
57192G899396j0338j0573j1115j2203j2715j1902j0980j1261j1919j1361r847
57181G775182q807q559q426q346q668r072r159r319r688r332p869o712p121q243
57167G655861q794r358j1139j3606j5344j6264j6986j7141j6313j5693j6691j8771
57155G479761k0657k2794k6508l1590l6835m2102m7717n2733n5959n7972o0025
57144G024869o1703o1818o0588n8770n5614n0113m3391l7276l1480k4748j7798
57133F521570j2311p920l297M77Q73k214o665j1734j8223k5378l0890l3952l5141
$$ plain form
57120 6335195 6301627 6274091 6256192 6248760 6251718 6265720 6290182 6321989 6358592 6400913 6451531 6512312
57108 6512312 6586190 6679099 6797537 6946054 7129609 7356239 7634895 7973589 8383591 8884025
57098 8884025 9499945 10259246 11195697 12352353 13777266 15517402 17618787 20125340 23067677
57089 23067677 26453172 30270207 34493199 39070987 43916002 48920213 53971874 58918760
57081 58918760 63495607 67319809 70014556 71372434 71415521 70319321 68299926 65558996
57073 65558996 62281998 58637918 54765943 50769969 46728072 42703602 38751267 34922131
57065 34922131 31266133 27827574 24638719 21720124 19084867 16738178 14673754 12874687
57057 12874687 11318673 9980726 8832997 7847085 6998527 6267795 5637548 5091485 4615956
$$ packed form
57120F335195l3568k7536j7899p432K958J4002K4462L1807L6603M2321N0618O0781
57108F512312P3878R2909J18438J48517J83555K26630K78656L38694M10002N00434
57098H884025O15920P59301R36451J156656J424913J740136K101385K506553K942337
57089B3067677L385495L817035M222992M577788M845015N004211N051661M946886
57081E8918760M576847L824202K694747J357878M3087j096200k019395k740930
57073F5558996l276998l644080l871975l995974m041897m024470l952335l829136
57065C4922131l655998l438559l188855k918595k635257k346689k064424j799067
57057A2874687j556014j337947j147729r85912q48558p30732o30247n46063m75529
$$ plain form
57048 4615956 4200308 3835182 3512229 3225406 2970559 2743364 2539240 2355144 2189578
57039 2189578 2040649 1905823 1783673 1673976 1575769 1487016 1406572 1334738 1271341 1214935
57029 1214935 1164582 1120968 1085036 1056814 1036350 1024806 1024072 1036163 1063068 1105649 1161835 1226398
57017 1226398 1291975 1348589 1382906 1382048 1341350 1267896 1175282 1075676 977064 884900 802786 731549
57005 731549 669895 616442 570242 529944 494123 462493 435565 413155 394213 377960 364117
56994 364117 352186 341536 332109 324194 317723 312720 310102 310987 315435 322928 333712 348278 365421
56981 365421 382044 395075 402716 404046 398860 388324 374722 359970 344966 330380 317114 305705
56969 305705 296084 288225 282333 278346 276046 275818 278458 284137 292441 303545 318370 337272 359456
$$ packed form
57048D615956m15648l65126l22953k86823k54847k27195k04124j84096j65566
57039B189578j48929j34826j22150j09697r8207q8753q0444p1834o3397n6406
57029A214935n0353m3614l5932k8222k0464j1544p34J2091K6905M2581N6186O4563
57017A226398O5577N6614L4317q58m0698p3454r2614r9606r8612r2164q2114p1237
57005G31549o1654n3453m6200m0298l5821l1630k6928k2410j8942j6253j3843
56994C64117j1931j0650r427p915o471n003k618Q85M448P493J0784J4566J7143
56981C65421J6623J3031P641J330n186j0536j3602j4752j5004j4586j3266j1409
56969C05705r621p859n892l987k300k28K640N679Q304J1104J4825J8902K2184
$$ plain form
56956 359456 383766 408842 431931 448721 455437 450986 436940 416238 392264 368114 345656 325307
56944 325307 307039 291234 278373 268544 261760 258310 258411 261912 268757 279454 294851 315680 342340
56931 342340 374465 410288 446612 479376 504115 516564 514234 498035 471850 440278 406971 374535
56919 374535 344534 317102 291515 267682 246451 228298 212654 198897 187033 176964 168047 159958
56907 159958 153168 147954 143786 140241 137616 135976 134507 132654 131188 131236 132937 135848 140069 146028 153644
56892 153644 162643 173370 186615 203022 223307 248314 277846 309727 340835 368690 391362 406541
56880 406541 412229 408534 397908 383448 367477 351571 336979 324694 315508 310080 308651 310913 316583
56867 316583 326048 340116 359498 385009 417925 459534 510311 569735 636195 706029 772712 827879
$$ packed form
56956C59456K4310K5076K3089J6790O716m451j4046k0702k3974k4150k2458k0349
56944C25307j8268j5805j2861r829o784l450J01L501O845J0697J5397K0829K6660
56931C42340L2125L5823L6324L2764K4739J2449k330j6199k6185l1572l3307l2436
56919C74535l0001k7432k5587k3833k1231j8153j5644j3757j1864j0069q917q089
56907A59958o790n214m168l545k625j640j469j853j466M8J701K911M221N959P616
56892A53644Q999J0727J3245J6407K0285K5007K9532L1881L1108K7855K2672J5179
56880D06541N688l695j0626j4460j5971j5906j4592j2285r186n428j429K262N670
56867C16583R465J4068J9382K5511L2916M1609N0777N9424O6460O9834O6683N5167
$$ plain form
56855 827879 863975 876700 866132 836431 794113 745575 695632 647924 605632 570974 544465
56844 544465 525646 514546 511967 518674 535090 561775 599606 649550 712705 790321 882814 988153
56832 988153 1100776 1211411 1307650 1375997 1405883 1393792 1344486 1268468 1177664 1082041 988463
56821 988463 901424 824099 758328 704100 660194 625978 602177 589714 588522 598067 618532 650968
56809 650968 696626 756291 829154 911024 993649 1066284 1118318 1141431 1131640 1091189 1028118 952529
56797 952529 872628 793906 720459 655323 599682 553075 514691 483947 460242 443132 432818
56786 432818 429726 433754 444627 462786 489050 523265 563562 606397 646443 677012 692106 688901
56774 688901 668318 633712 589634 541179 492880 447490 406021 368815 335997 307166 281501
$$ packed form
56855H27879L6096J2725j0568k9701m2318m8538m9943m7708m2292l4658k6509
56844E44465j8819j1100k579O707J6416K6685L7831M9944O3155P7616R2493J05339
56832I88153J12623J10635R6239O8347K9886j2091m9306p6018r0804r5623r3578
56821I88463q7039p7325o5771n4228m3906l4216k3801j2463j192R545K0465L2436
56809F50968M5658N9665P2863Q1870Q2625P2635N2034K3113r791m0451o3071p5589
56797I52529p9901p8722p3447o5136n5641m6607l8384l0744k3705j7110j0314
56786D32818l092M028J0873J8159K6264L4215M0297M2835M0046L0569J5094l205
56774F88901k0583l4606m4078m8455m8299m5390m1469l7206l2818k8831k5665
$$ plain form
56763 281501 258360 237472 218835 202856 190166 180591 172666 164961 157538 151393 146842 143361 140627
56750 140627 138640 137010 135098 132836 130536 128102 125333 122846 121566 121357 121187 120676 120509 121181 122273
56735 122273 123122 123343 122659 121076 119408 118806 119539 120904 122351 123986 125956 128098 130332 132694 135002
56720 135002 137064 139106 141314 143197 144194 144690 145487 146547 147289 147909 149195 151127 152886 154328 156159
56705 156159 158471 160377 161453 162371 163668 164991 166019 167109 168406 169227 168964 167877 166480 164798 162695
56690 162695 160393 158183 156097 154138 152445 151125 150324 150410 151451 152728 153543 154312 155936 158203 159977
56675 159977 160890 161642 162455 162544 161518 160111 159100 158560 158669 160064 162798 165918 168779 171864 175639 179436
56659 179436 182279 184167 185820 187624 189403 190849 191767 192275 193000 194608 197039 199666 202216 204823 207306
$$ packed form
56763B81501k3141k0888j8637j5979j2690r575p925p705p423o145m551l481k734
56750A40627j987j630j912k262k300k434k769k487j280k09j70n11j67O72J092
56735A22273Q49K21o84j583j668o02P33J365J447J635J970K142K234K362K308
56720A35002K062K042K208J883R97M96P97J060P42O20J286J932J759J442J831
56705A56159K312J906J076R18J297J323J028J090J297Q21k63j087j397j682k103
56690A62695k302k210k086j959j693j320q01Q6J041J277Q15P69J624K267J774
56675A59977R13P52Q13Q9j026j407j011n40J09J395K734L120K861L085L775L797
56659A79436K843J888J653J804J779J446R18N08P25J608K431K627K550K607K483
$$ plain form
56644 207306 209264 210966 213154 215799 218049 219547 220768 221803 221925 220744 218763 216482 213961 211568
56630 211568 209998 209138 208005 206306 204926 204377 203883 202586 200627 198452 196101 193773 191992 190581 188539
56615 188539 185598 182841 181117 179917 178519 177032 175550 173457 170570 167876 166144 164754 162880 160901
56601 160901 159657 159164 159055 159449 160414 161382 162075 163171 165128 167216 168674 169871 171292 172373 172579 172736
56585 172736 173915 175727 177053 177798 178573 179303 179648 180322 182373 185306 187385 187861 187729 188199 189496 191272
56569 191272 193235 195193 197131 199353 202137 205521 209902 216374 225784 237827 251663 266872 283008
56556 283008 298786 312660 323746 331350 334273 331932 325915 319168 313477 308590 303699 298744 294051
56543 294051 289570 284944 280054 275250 271068 267533 263824 259176 254220 250596 248904 247854 245974 243259
$$ packed form
56644B07306J958J702K188K645K250J498J221J035J22j181j981k281k521k393
56630B11568j570q60j133j699j380n49m94j297j959k175k351k328j781j411k042
56615A88539k941k757j724j200j398j487j482k093k887k694j732j390j874j979
56601A60901j244m93j09L94R65R68O93J096J957K088J458J197J421J081K06J57
56585A72736J179J812J326P45P75P30L45O74K051K933K079M76j32M70J297J776
56569A91272J963J958J938K222K784L384M381O472R410J2043J3836J5209J6136
56556B83008J5778J3874J1086P604K923k341o017o747n691m887m891m955m693
56543B94051m481m626m890m804m182l535l709m648m956l624j692j050j880k715
$$ plain form
56529 243259 240488 237828 235094 232642 230912 229561 227950 226084 224290 222451 220367 218337 216575 214563
56515 214563 211819 208792 206146 203688 200869 197880 195367 193522 192204 191493 191326 191131 190532 189895 189450 188658
56499 188658 187237 186058 186042 186939 188111 189647 191639 193229 193768 194113 195460 197463 198944 199860 201089 202714
56483 202714 204018 204894 205810 206629 206862 206923 207715 209117 210140 210492 210774 211310 211971 213000 214727 216628 217931
56466 217931 219024 221009 223894 226508 228147 229060 229331 228581 226984 225460 224561 224007 223378 222519 221383 220262
56450 220262 219956 220846 222165 223100 224110 226016 228268 229530 229718 230000 230866 231587 231632 231272 230684 229706 228647
56433 228647 228182 228235 228004 227279 226763 226935 227420 227657 227495 227152 227146 227982 229305 229868 229131 228172 228072 228195 227410
56414 227410 226228 226126 227227 228335 228950 229589 230312 230627 230821 231778 233394 234711 235642 237120 239362 241502
$$ packed form
56529B43259k771k660k734k452j730j351j611j866j794j839k084k030j762k012
56515B14563k744l027k646k458k819k989k513j845j318p11j67j95n99o37m45p92
56499A88658j421j179j6Q97J172J536J992J590N39L45J347K003J481R16J229J625
56483B02714J304Q76R16Q19K33O1P92J402J023L52K82N36O61J029J727J901J303
56466B17931J093J985K885K614J639R13K71p50j597j524q99n54o29q59j136j121
56450B20262l06Q90J319R35J010J906K252J262J88K82Q66P21M5l60n88r78j059
56433B28647m65N3k31p25n16J72M85K37j62l43oQ36J323N63p37r59j00J23p85
56414B27410j182j02J101J108O15O39P23L15J94R57J616J317R31J478K242K140
$$ plain form
56398 241502 243058 244440 245856 247052 248236 250014 252329 254674 257258 260645 264399 267499 269981 272651
56384 272651 275337 277053 277930 279232 281313 283198 284398 285484 286553 286776 285904 284805 284049 283311 282469 281971
56368 281971 281789 281334 280643 280364 280452 280258 280090 281173 283781 286718 288905 290241 290870 291008 291592 293558 296376
56351 296376 298694 300391 302444 304809 306315 306785 307416 308753 310033 310881 311884 313135 313947 314426 315627
56336 315627 317801 320195 322850 326747 331810 336657 340792 345160 350027 354302 357570 360857 364612 367747
56322 367747 369463 370336 370947 371101 371052 371720 373025 373662 373106 372107 370831 368514 365471 363265 362175 360793
56306 360793 358990 358868 361572 365459 368823 372321 377131 382697 388009 393452 399584 405458 409839 412989
56292 412989 415951 419155 422775 427213 432163 436489 440028 444134 449498 454968 459557 464089 469680 476081
$$ packed form
56398B41502J556J382J416J196J184J778K315K345K584L387L754L100K482K670
56384B72651K686J716Q77J302K081J885J200J086J069K23q72j099p56p38q42m98
56368B81971j82m55o91k79Q8j94j68J083K608K937K187J336O29J38N84J966K818
56351B96376K318J697K053K365J506M70O31J337J280Q48J003J251Q12M79J201
56336C15627K174K394K655L897N063M847M135M368M867M275L268L287L755L135
56322C67747J716Q73O11J54m9O68J305O37n56r99j276k317l043k206j090j382
56306C60793j803j22K704L887L364L498M810N566N312N443O132N874M381L150
56292D12989K962L204L620M438M950M326L539M106N364N470M589M532N591O401
$$ plain form
56278 476081 482657 489591 497000 504276 511385 519448 528952 538836 548364 558437 570021 582736 595960
56265 595960 609908 624713 640009 656297 675048 696619 719834 744442 772026 803541 838167
56254 838167 875779 918309 967201 1021614 1080755 1145923 1218586 1298371 1384637 1478059 1578746
56243 1578746 1684570 1793244 1904376 2017522 2129786 2237251 2337361 2428136 2506552 2569665
56233 2569665 2616171 2645357 2655923 2647527 2622095 2582094 2528920 2464238 2391014 2311504 2226031
56222 2226031 2135486 2043173 1952197 1862738 1773990 1687196 1604624 1526939 1453675 1385010 1321146
56211 1321146 1261167 1204407 1151717 1103812 1059725 1018468 980567 946261 914002 882679 853634
56200 853634 828460 806439 786133 767794 752100 738089 724543 712019 701499 692443 684070 676998
$$ packed form
56278D76081O576O934P409P276P109Q063R504R884R528J0073J1584J2715J3224
56265E95960J3948J4805J5296J6288J8751K1571K3215K4608K7584L1515L4626
56254H38167L7612M2530M8892N4413N9141O5168P2663P9785Q6266R3422J00687
56243A578746J05824J08674J11132J13146J12264J07465J00110R0775P8416O3113
56233B569665M6506K9186J0566q396k5432m0001n3174o4682p3224p9510q5473
56222B226031r0545r2313r0976q9459q8748q6794q2572p7685p3264o8665o3864
56211A321146n9979n6760n2690m7905m4087m1257l7901l4306l2259l1323k9045
56200H53634k5174k2021k0306j8339j5694j4011j3546j2524j0520r056q373p072
$$ plain form
56188 676998 671765 667343 663017 659920 658841 658367 657210 656382 656960 657778 657632 657667 659229 661371 662991 665356
56172 665356 669889 675384 680042 684265 688870 692739 695122 698093 703716 710744 717165 723958 733064 743702
56158 743702 754111 765100 778415 793303 808216 824183 842970 863565 884157 906077 932060
56147 932060 961999 994171 1029368 1070173 1117449 1171223 1233803 1308259 1394946 1493108 1604543
56136 1604543 1731768 1873382 2024562 2180521 2335707 2481506 2609820 2718975 2812844 2895301
56126 2895301 2969034 3037751 3104195 3165978 3217238 3254050 3275089 3278874 3265214 3238610 3205419
56115 3205419 3167432 3121556 3064642 2994366 2906630 2797424 2667929 2524349 2373278 2220693
56105 2220693 2073954 1939722 1819855 1713161 1620301 1542926 1479215 1425161 1379678 1343963
$$ packed form
56188F76998n233m422m326l097j079m74j157q28N78Q18j46L5J562K142J620K365
56172F65356M533N495M658M223M605L869K383K971N623P028O421O793R106J0638
56158G43702J0409J0989J3315J4888J4913J5967J8787K0595K0592K1920K5983
56147I32060K9939L2172L5197M0805M7276N3774O2580P4456Q6687R8162J11435
56136A604543J27225J41614J51180J55959J55186J45799J28314J09155R3869Q2457
56126B895301P3733O8717O6444O1783N1260L6812K1039L785j3660k6604l3191
56115C205419l7987m5876n6914p0276q7736j09206j29495j43580j51071j52585
56105B220693j46739j34232j19867j06694r2860p7375o3711n4054m5483l5715
$$ plain form
56095 1343963 1316584 1293974 1275207 1261592 1252088 1243899 1237025 1233469 1232506 1231533 1230968 1233385 1238395 1243417
56081 1243417 1248775 1256865 1266913 1275917 1284162 1294302 1305626 1315045 1323367 1334581 1348991 1362963
56069 1362963 1375478 1389130 1404642 1420285 1436800 1456881 1479560 1501001 1520991 1542718 1566225
56058 1566225 1588292 1608819 1630829 1654019 1674869 1693439 1713396 1735008 1754931 1773343 1794263
56047 1794263 1818196 1841538 1863934 1888989 1916912 1943823 1969379 1997677 2029464 2060832 2090844
56036 2090844 2123076 2158418 2193901 2229845 2270463 2316024 2362080 2407721 2456784 2509752 2562634
56025 2562634 2615041 2670888 2729837 2786804 2841404 2898906 2960380 3021308 3081553 3146922 3218838
56014 3218838 3292451 3367072 3448186 3536679 3626645 3716687 3812681 3916339 4021965 4127775 4239329
$$ packed form
56095A343963k7379k2610j8767j3615r504q189o874l556r63r73n65K417N010N022
56081A243417N358Q090J0048R004Q245J0140J1324R419Q322J1214J4410J3972
56069A362963J2515J3652J5512J5643J6515K0081K2679K1441J9990K1727K3507
56058A566225K2067K0527K2010K3190K0850J8570J9957K1612J9923J8412K0920
56047A794263K3933K3342K2396K5055K7923K6911K5556K8298L1787L1368L0012
56036B090844L2232L5342L5483L5944M0618M5561M6056M5641M9063N2968N2882
56025B562634N2407N5847N8949N6967N4600N7502O1474O0928O0245O5369P1916
56014C218838P3613P4621Q1114Q8493Q9966R0042R5994J03658J05626J05810J11554
$$ plain form
56003 4239329 4358388 4479756 4602796 4734498 4877323 5025821 5178977 5343494 5520891
55994 5520891 5704287 5892400 6093496 6310872 6538301 6774716 7029003 7304782 7595316
55985 7595316 7899297 8226412 8581302 8957903 9355907 9786099 10253078 10750599 11281004
55976 11281004 11860298 12496569 13183901 13926099 14744654 15653993 16652355 17748018 18970037
55967 18970037 20341910 21872364 23586817 25540426 27786477 30365021 33342100 36828362
55959 36828362 40942419 45798301 51557901 58460458 66783847 76840398 89057450 104009116
55951 104009116 122326658 144655375 171749982 204405943 242875151 285959733 330440379
55944 330440379 371303817 402753079 419749372 419669260 403315609 374524078 338474462
$$ packed form
56003D239329J19059J21368J23040J31702J42825J48498J53156J64517J77397
55994E520891J83396J88113K01096K17376K27429K36415K54287K75779K90534
55985G595316L03981L27115L54890L76601L98004M30192M66979M97521N30405
55976A1281004N79294O36271O87332P42198Q18555R09339R98362J095663J222019
55967A8970037J371873J530454J714453J953609K246051K578544K977079L486262
55959C6828362M114057M855882N759600O902557Q323389J0056551J2217052J4951666
55951A04009116J8317542K2328717K7094607L2655961L8469208M3084582M4480646
55944C30440379M0863438L1449262J6996293q0112j6353651k8791531l6049616
$$ plain form
55937 338474462 299841222 261883256 226532760 194795803 167013519 143057796 122575118
55930 122575118 105167060 90429678 77959886 67407324 58500004 51000346 44673482
55923 44673482 39316511 34779547 30934629 27652996 24829194 22396588 20299457 18473377
55915 18473377 16866723 15455277 14218618 13122770 12139348 11260184 10478373 9773357 9127559
55906 9127559 8539855 8009851 7525082 7075297 6663534 6291495 5948573 5626107 5328365
55897 5328365 5058922 4809617 4573179 4353897 4155657 3971527 3794965 3629933 3480466
55888 3480466 3341112 3206709 3081114 2967513 2860314 2755275 2657787 2572731 2495726 2422748
55878 2422748 2358827 2308504 2266399 2225643 2187156 2152069 2113162 2062813 2002792 1938359 1869503
$$ packed form
55937C38474462l8633240l7957966l5350496l1736957k7782284k3955723k0482678
55930A22575118j7408058j4737382j2469792j0552562q907320p499658o326864
55923D4673482n356971m536964l844918l281633k823802k432606k097131j826080
55915A8473377j606654j411446j236659j095848r83422q79164p81811p05016o45798
55906I127559n87704n30004m84769m49785m11763l72039l42922l22466k97742
55897E328365k69443k49305k36438k19282j98240j84130j76562j65032j49467
55888C480466j39354j34403j25595j13601j07199j05039r7488q5056p7005p2978
55878B422748o3921n0323m2105m0756l8487l5087l8907n0349o0021o4433o8856
$$ plain form
55867 1869503 1795668 1722379 1655162 1592478 1531541 1475239 1426599 1382309 1338458 1297181 1261266
55856 1261266 1227828 1193579 1160882 1132419 1105255 1076242 1048005 1023622 1000570 975794 951484
55845 951484 929927 907860 882082 855832 833556 813893 793637 774075 757549 742135 725543
55834 725543 710112 698281 687286 673977 660838 651632 644924 637460 630150 625116 620400 613204 605106
55821 605106 598709 592306 583017 572149 562375 552720 541277 529845 520953 513245 504533 496485 491623
55808 491623 488743 485878 484683 487196 491372 494614 498683 506335 516132 525409 535220 547207 558499 565086
55794 565086 567772 569582 569695 565202 556765 547314 537027 524614 511802 501600 493571 485441 477657
55781 477657 471738 465825 456734 445107 434000 423737 412764 402332 395576 392699 391325 390901 392783
$$ packed form
55867A869503p3835p3289o7217o2684o0937n6302m8640m4290m3851m1277l5915
55856A261266l3438l4249l2697k8463k7164k9013k8237k4383k3052k4776k4310
55845I51484k1557k2067k5778k6250k2276j9663k0256j9562j6526j5414j6592
55834G25543j5431j1831j0995j3309j3139r206o708p464p310n034m716p196q098
55821F05106o397o403r289j0868r774r655j1443j1432q892p708q712q048m862
55808D91623k880k865j195K513M176L242M069P652R797R277R811J1987J1292O587
55794E65086K686J810J13m493q437r451j0287j2413j2812j0202q029q130p784
55781D77657n919n913r091j1627j1107j0263j0973j0432o756k877j374m24J882
$$ plain form
55768 392783 396723 401081 405722 411134 415611 416808 415126 412359 408315 402177 395755 391684 389489 386817
55754 386817 383269 379662 375008 367817 359080 350424 340777 328492 315268 304117 294729 284814 274866
55741 274866 267539 263121 259496 255931 253231 250816 247296 243430 241165 240304 239278 238350 238838 239953 239694
55726 239694 238031 236062 233038 227581 220937 215617 211705 207707 203984 201864 200444 198024 195852 196690
55712 196690 200306 204056 207331 211724 217342 222644 227545 233051 238208 240998 241922 243022 243718 241346 235697
55697 235697 229318 223341 216736 209772 204435 200956 197434 193398 190478 189133 187916 186498 186325 187734
55683 187734 189413 191152 194196 198448 202253 205458 209807 215699 221293 225377 228505 230804 231332 230251
55669 230251 229141 228541 227458 225739 224582 224265 223630 222300 221319 221214 221486 222141 223814 226341 229132 232630
$$ packed form
55768C92783L940M358M641N412M477J197j682k767m044o138o422m071k195k672
55754C86817l548l607m654p191q737q656r647j2285j3224j1151r388r915r948
55741B74866p327m418l625l565k700k415l520l866k265q61j026r28M88J115k59
55726B39694j663j969l024n457o644n320l912l998l723k120j420k420k172Q38
55712A96690L616L750L275M393N618N302M901N506N157K790R24J100O96k372n649
55697B35697o379n977o605o964n337l479l522m036k920j345j217j418j73J409
55683A87734J679J739L044M252L805L205M349N892N594M084L128K299N28j081
55669B30251j110o00j083j719j157l17o35j330r81j05K72O55J673K527K791L498
$$ plain form
55653 232630 237284 241598 243666 244183 245289 246869 246919 245212 243411 241599 237963 232260 226411 221151 215119
55638 215119 207921 201110 195317 189194 182103 175306 169622 164355 159300 155471 153015 150686 148081 146232
55624 146232 145373 144354 142831 141866 141805 141741 141504 141919 142709 142476 141198 140321 139948 138456 135483 132736 131176
55607 131176 129941 128699 128466 129257 129489 128717 128487 129447 130058 129306 128304 127956 127263 125368 123250 122008 121215
55590 121215 120204 119366 119034 118699 118276 118593 119780 120766 121117 121732 123040 124230 124925 125876 127433 129118 131272
55573 131272 135118 140498 145558 149448 153443 158683 164721 170962 177444 183421 187240 188539 188618 187890 185097
55558 185097 179881 173898 168408 162917 157306 152974 150553 148541 145603 142354 139578 136636 133072 130005
55544 130005 128387 127513 126612 126321 127263 128692 129839 131087 132609 133416 133043 132674 133290 134193 134605 135173 136568
$$ packed form
55653B32630M654M314K068N17J106J580N0j707j801j812l636n703n849n260o032
55638B15119p198o811n793o123p091o797n684n267n055l829k456k329k605j849
55624A46232q59j019j523r65o1o4k37M15P90k33j278q77l73j492k973k747j560
55607A31176j235j242k33P91K32p72k30R60O11p52j002l48o93j895k118j242p93
55590A21215j011q38l32l35m23L17J187R86L51O15J308J190O95R51J557J685K154
55573A31272L846N380N060L890L995N240O038O241O482N977L819J299P9p28k793
55558A85097n216n983n490n491n611m332k421k012k938l249k776k942l564l067
55544A30005j618q74r01k91R42J429J147J248J522Q07l73l69O16R03M12N68J395
$$ plain form
55527 136568 137998 138383 137783 136566 134515 131793 129340 127264 124383 120354 116669 114423 112772 110785 109087
55512 109087 108278 107441 105775 104245 104006 104497 104540 104106 103641 102957 102125 102176 103460 104576 104264 103142 102270 101325
55494 101325 99642 97807 96696 96006 95134 94455 94441 94602 94507 94667 95212 95080 93875 93153 94329 96563 98302
55477 98302 99619 101342 103013 103538 103049 102410 101646 100385 99129 98589 98409 97912 97429 97616 98196 98547 98726
55460 98726 98762 97915 95928 94043 93479 93726 93628 93182 93007 93042 93089 93640 94799 95475 95109 95056 96615 98754 99576
55441 99576 99104 98707 98620 98091 97419 97730 98919 99710 99754 99992 100850 101616 101791 101821 102192 102718 102835 101991 99986
55422 99986 97491 95773 95282 95164 94799 94894 96136 97700 98271 97813 97210 96858 96760 97256 98479 99709 100328 100743
55404 100743 101323 101345 100190 98696 97990 97796 97265 96663 96767 97255 97212 96673 96277 95967 95426 95245 96169 97735
$$ packed form
55527A36568J430L85o00j217k051k722k453k076k881m029l685k246j651j987j698
55512A09087q09q37j666j530k39M91M3m34m65o84q32N1J284J116l12j122q72r45
55494A01325j683j835j111o90q72o79j4J61r5J60N45j32j205p22J176K234J739
55477I8302J317J723J671N25m89o39p64j261j256n40j80m97m83J87N80L51J79
55460I8726L6q47j987j885n64K47r8m46j75L5M7N51J159O76l66n3J559K139Q22
55441I9576m72l97q7n29o72L11J189P91M4K38Q58P66J75L0L71N26J17q44k005
55422I9986k495j718m91j18l65R5J242J564N71m58o03l52r8M96J223J230O19M15
55404A00743N80K2j155j494p06j94n31o02J04M88m3n39l96l10n41j81R24J566
$$ plain form
55386 97735 99007 100094 101529 102787 103001 102652 102939 103870 104548 104970 105916 107299 108246 108678 109341 110386 111347
55369 111347 112446 114419 117004 118917 119391 118607 116693 113536 109570 105683 102290 99353 97071 95657 94727
55354 94727 93877 93442 93685 93855 93180 92251 92108 92512 92522 92265 92561 93197 93267 92993 93531 94964 96086 96322 96365
55335 96365 96672 96696 95984 94894 93945 93396 93574 94688 96310 97816 99139 100199 100102 98134 95279 93385 92964
55318 92964 93068 93119 93433 93977 94095 93699 93493 93794 94220 94598 95096 95415 95001 94097 93526 93395 93115 92680 92727 93333
55298 93333 93946 94571 95815 97593 98954 99396 99347 99231 99140 99497 100840 102763 104154 104745 105422 106757 108224
55281 108224 109131 109424 109294 108774 107962 107011 105879 104678 104014 104218 104586 104294 103699 103626 103773 103204 102197 102120
55263 102120 103387 104943 105950 106655 107344 107732 107772 107933 108301 108408 108240 108413 109059 109528 109486 109416 109765 110440 111303
$$ packed form
55386I7735J272J087J435J258K14l49K87R31O78M22R46J383R47M32O63J045R61
55369A11347J099J973K585J913M74p84j914l157l966l887l393k937k282j414r30
55354I4727q50m35K43J70o75r29j43M04J0k57K96O36P0k74N38J433J122K36M3
55335I6365L07K4p12j090r49n49J78J114J622J506J323J060r7j968k855j894m21
55318I2964J04N1L14N44J18l96k06L01M26L78M98L19m14r04n71j31k80m35M7O06
55298I3333O13O25J244J778J361M42m9j16r1L57J343J923J391N91O77J335J467
55281A08224R07K93j30n20q12r51j132j201o64K04L68k92n95p3J47n69j007p7
55263A02120J267J556J007P05O89L88M0J61L68J07j68J73O46M69m2p0L49O75Q63
$$ plain form
55244 111303 112227 112583 111632 109629 107611 105966 104145 101945 100097 99294 99515 100431 101694 102724 103055 102948
55228 102948 102928 102810 102055 100909 100162 99905 99613 99326 99623 100503 101435 102386 103563 104321 103759 102398 101764 102238
55210 102238 102828 103209 104314 106457 108482 109429 109725 110035 110237 110174 110226 110476 110326 109586 108921 108689 108367 107660
55192 107660 107138 107199 107402 107383 107431 107594 107271 106325 105680 106159 107493 109022 110523 111834 112533 112524 112215 111691 110544
55173 110544 108861 107483 106854 106494 105990 105546 105204 104557 103727 103649 104807 106572 108262 109896 111436 112315 112373
55156 112373 112369 112951 113858 114597 115016 114841 113607 111583 109872 109137 109084 109477 110551 112009 112876 112845 112623 112369
55138 112369 111196 108981 107260 107258 108212 108716 108644 108570 108318 107422 106317 105837 106007 106366 106866 107527 107778 107223 106515
55119 106515 106528 107148 107829 108698 110080 111405 111750 111180 110575 110375 110374 110491 110840 111226 111388 111586 112231 113133 113789
$$ packed form
55244A11303R24L56r51k003k018j645j821k200j848q03K21R16J263J030L31j07
55228A02948k0j18p55j146p47k57k92k87K97Q80R32R51J177P58n62j361o34M74
55210A02238N90L81J105K143K025R47K96L10K02o3N2K50j50p40o65k32l22p07
55192A07660n22O1K03j9M8J63l23r46o45M79J334J529J501J311O99rl09n24j147
55173A10544j683j378o29l60n04m44l42o47q30p8J158J765J690J634J540Q79N8
55156A12373mN82R07P39M19j75j234k024j711p35n3L93J074J458Q67l1k22k54
55138A12369j173k215j721kR54N04p2p4k52q96j105m80J70L59N00O61K51n55p08
55119A06515J3O20O81Q69J382J325L45n70o05k00jJ17L49L86J62J98O45R02O56
$$ plain form
55100 113789 114229 114907 115952 117122 118306 119502 120462 120887 120811 120406 119712 118964 118811 119680 121248 122918 124465
55083 124465 125797 126583 126674 126453 126237 125726 124624 123404 122779 122717 122583 122083 121489 121084 120862 120695 120454 120077
55065 120077 119684 119409 118999 117957 116269 114574 113396 112647 112122 111956 112288 112915 113549 114029 114156 113812 113383
55048 113383 113398 113606 113061 111442 109528 108166 107431 107140 107345 107959 108600 109272 110447 112127 113543 114290 115013
55031 115013 116491 118693 121088 123179 124320 123888 122164 120341 119167 118324 117498 117109 117458 118054 118471 118992
55015 118992 119815 120501 120905 121657 123002 124053 124107 123801 124039 124603 124814 124828 125178 125628 125539 124961 124490 124492 125194 126938
54995 126938 129479 131644 132557 132671 132845 133127 133327 133990 135638 137603 138733 138859 138535 137854 136594 135148
54979 135148 134203 133773 133546 133810 134999 136675 137998 138956 140074 141132 141277 140350 139113 138155 137399 136657 135912
$$ packed form
55100A13789M40O78J045J170J184J196R60M25p6m05o94p48j53Q69J568J670J547
55083A24465J332P86R1k21k16n11j102j220o25o2j34n00n94m05k22j67k41l77
55065A20077l93k75m10j042j688j695j178p49n25j66L32O27O34M80J27l44m29
55048A13383J5K08n45j619j914j362p35k91K05O14O41O72J175J680J416P47P23
55031A15013J478K202K395K091J141m32j724j823j174q43q26l89L49N96M17N21
55015A18992Q23O86M04P52J345J051N4l06K38N64K11J4L50M50q9n78m71KP02J744
54995A26938K541K165R13J14J74K82K00O63J648J965J130J26l24o81j260j446
54979A35148r45m30k27K64J189J676J323R58J118J058J45r27j237r58p56p42p45
$$ plain form
54962 135912 135121 134392 134218 134944 136202 137406 138435 139265 139497 139006 138579 139029 140104 141096 141943 142763 142870
54945 142870 141550 139559 138592 139292 140807 142213 143298 143984 144113 143971 144129 144616 144998 145306 146091 147463 148858
54928 148858 149919 150990 152624 155101 158438 162425 166710 171301 176826 183847 192118 200830 209196 216427
54914 216427 221697 224741 226020 225789 223642 219530 214361 208736 202029 193853 185641 179288 174774 170593
54900 170593 166259 162819 160932 159915 158873 157556 155907 153871 151908 150757 150458 150381 150199 150067 149954 149749
54884 149749 149916 151117 153315 156133 159846 164914 170860 176888 183402 191468 200739 209418 216434 222109
54870 222109 226367 227939 226160 222266 217928 213427 208057 201549 194296 186845 179888 174230 170118 166970
54856 166970 164166 161676 159556 157391 154718 151669 148854 146898 146102 146093 145774 144237 141848 139833 138680
$$ packed form
54962A35912p91p29j74P26J258J204J029Q30K32m91m27M50J075R92Q47Q20J07
54945A42870j320j991r67P00J515J406J085O86J29j42J58M87L82L08P85J372J395
54928A48858J061J071J634K477L337L987M285M591N525P021Q271Q712Q366P231
54914B16427N270L044J279k31k147m112n169n625o707q176q212o353m514m181
54900A70593m334l440j887j017j042j317j649k036j963j151k99p7j82j32j13k05
54884A49749J67J201K198K818L713N068N946O028O514Q066R271Q679P016N675
54870B22109M258J572j779l894m338m501n370o508p253p451o957n658m112l148
54856A66970k804k490k120k165k673l049k815j956p96rl19j537k389k015j153
$$ plain form
54841 138680 137640 135967 133907 132150 130987 130338 130026 129666 128780 127420 126276 125893 126135 126589 127147 127929
54825 127929 128947 129993 130673 130624 129905 129075 128566 128213 127748 127368 127368 127574 127754 128174 129056 129935 130415 131137 132950
54806 132950 135409 137204 137944 138377 138944 139303 139357 139547 139939 140130 140199 140639 141143 140696 139302 138364 138819 139939
54788 139939 140662 141134 142115 143651 145182 146455 147625 148769 149861 150963 152086 153139 154222 155660 157592
54773 157592 159886 162465 165304 168139 170764 173619 177457 182459 188265 194762 202086 209893 217452 224447
54759 224447 230840 236017 238998 239533 238080 234692 229037 221599 213647 205802 197798 189898 183214 178087
54745 178087 173409 168332 163628 160565 159232 158740 158395 157973 157416 156902 156743 156876 156920 156937 157438 158484 159603
54728 159603 160787 162630 165191 167834 170591 174522 180152 186648 193199 200108 207693 215110 221133 225245
$$ packed form
54841A38680j040j673k060j757j163o49l12l60q86j360j144l83K42M54N58P82
54825A27929J018J046O80m9p19q30n09l53m65l80%K06J80M20Q82Q79M80P22J813
54806A32950K459J795P40M33N67L59N4J90L92J91O9M40N04m47j394r38M55J120
54788A39939P23M72R81J536J531J273J170J144J092J102J123J053J083J438J932
54773A57592K294K579K839K835K625K855L838N002N806O497P324P807P559O995
54759B24447O393N177K981N35j453l388n655p438p952p845q004p900o684n127
54745A78087m678n077m704l063j333m92l45m22n57n14j59J33M4J7N01J046J119
54728A59603J184J843K561K643K757L931N630O496O551O909P585P417O023M112
$$ plain form
54714 225245 227209 226553 223446 219156 214584 209079 201812 193613 186253 180408 175518 171234 167796 165107
54700 165107 162543 159814 157268 155281 153869 152892 152174 151546 151095 151095 151448 151587 151237 150752 150388 149902 149263 149013
54682 149013 149323 149477 148993 148540 148861 149452 149306 148542 148247 148868 149665 149626 148289 145846 143120 141260 140776 141011
54664 141011 141013 140615 140133 139520 138579 137759 137904 139245 141191 142917 143708 143143 141643 140547 140869 142127 143019
54647 143019 143048 142778 142680 142594 142361 142284 142709 143580 144525 145100 144985 144229 143281 142582 142211 142061 142044 141961 141522 140790 140262
54626 140262 140258 140647 141409 142830 144723 146083 146166 145463 144992 145001 145034 144919 144950 145239 145556 145741 145794 145668 145341 144977
54606 144977 144703 144451 144306 144629 145515 146477 147047 147304 147436 147245 146533 145561 144697 144001 143565 143764 144709 145877
54588 145877 146793 147563 148294 148595 148251 147821 147857 148051 147873 147498 147330 147088 146291 145285 144886 145249 145850 146362 146835
$$ packed form
54714B25245J964o56l107m290m572n505p267q199p360n845m890m284l438k689
54700A65107k564k729k546j987j412r77p18o28m51%L53J39l50m85l64m86o39k50
54682A49013L10J54m84m53L21N91j46p64k95O21P97l9j337k443k726j860m84K35
54664A41011Kl98m82o13r41q20J45J341J946J726P91n65j500j096L22J258Q92
54647A43019K9k70r8q6k33p7M25Q71R45N75j15p56r48o99l71j50j7q3m39p32n28
54626A40262mL89P62J421J893J360Q3p03m71RL3j15L1K89L17J85N3j26l27l64
54606A44977k74k52j45L23Q86R62N70K57J32j91p12r72q64o96m36J99R45J168
54588A45877R16P70P31L01l44m30L6J94j78l75j68k42p97j006l99L63O01N12M73
$$ plain form
54569 146835 147244 147611 148321 149640 151176 152440 153569 154749 155466 155234 154703 154961 155935 156510 156174 155485 154928
54552 154928 154321 153509 152777 152288 151874 151559 151664 152262 153117 154227 155794 157561 158881 159609 160383 161847 164063
54535 164063 166699 169278 171178 171922 171637 170880 170055 169361 169153 169746 170861 171788 172088 171739 170700 168916 166722
54518 166722 164727 163251 162284 161893 162135 162613 162682 162133 161229 160113 158742 157382 156666 157007 158216 159735 160973
54501 160973 161501 161232 160400 159224 157727 156053 154592 153562 152812 152242 151929 151623 150797 149620 149153 149952 151250
54484 151250 152243 153399 155475 157889 159321 159552 159563 160042 160914 162141 163831 165624 167075 168599 170950 173750
54468 173750 175723 176492 177039 178161 179573 180798 181878 182773 183040 182628 182253 182432 182773 182611 181859 180884 180057
54451 180057 179656 179765 180031 179944 179446 178849 178231 177508 176929 176744 176418 175104 172996 171325 170829 171017 171167 171161 171043
$$ packed form
54569A46835M09L67P10J319J536J264J129J180P17k32n31K58R74N75l36o89n57
54552A54928o07q12p32m89m14l15J05N98Q55J110J567J767J320P28P74J464K216
54535A64063K636K579J900P44k85p57q25o94k08N93J115R27L00l49j039j784k194
54518A66722j995j476r67l91K42M78O9n49r04j116j371j360p16L41J209J519J238
54501A60973N28k69q32j176j497j674j461j030p50n70l13l06q26j177m67P99J298
54484A51250R93J156K076K414J432K31J1M79Q72J227J690J793J451J524K351K800
54468A73750J973P69N47J122J412J225J080Q95K67m12l75J79L41j62p52r75q27
54451A80057m01J09K66q7m98n97o18p23n79j85l26j314k108j671m96J88J50oj18
$$ plain form
54432 171043 170597 169856 169322 169256 169312 169202 169186 169613 170480 171650 172934 173858 174068 174131 175106 177032 178671 179158 179093
54413 179093 179442 180118 180300 179595 178217 176499 174880 174045 174371 175399 176269 176612 176712 177015 177768 178936 180231
54396 180231 181334 182195 182957 183661 184353 185380 186975 188525 188964 188123 187109 186990 187598 187991 187593 186487 185000
54379 185000 183500 182420 182069 182404 183133 183964 184728 185396 185992 186388 186384 186161 186407 187554 189197 190711 192111
54362 192111 193712 195256 196282 197174 198907 201675 204676 207275 209499 211286 212238 212448 212610 212841 212219 210009
54346 210009 206712 203424 200709 198520 196667 194890 192925 190857 189075 187718 186587 185656 185062 184488 183326
54331 183326 181687 180456 180102 180105 179819 179147 178132 176772 175614 175587 176642 177390 176756 175304 174320 174268 174804 175643
54313 175643 176584 177160 177066 176648 176363 176083 175450 174637 174228 174633 175975 178132 180477 182012 182202 181401 180197
$$ packed form
54432A71043m46p41n34o6N6j10j6M27Q67J170J284R24K10O3R75J926J639M87o5
54413A79093L49O76J82p05j378j718j619q35L26J028Q70L43J00L03P53J168J295
54396A80231J103Q61P62P04O92J027J595J550M39q41j014j19O08L93l98j106j487
54379A85000j500j080l51L35P29Q31P64O68N96L96mk23K46J147J643J514J400
54362A92111J601J544J026Q92J733K768L001K599K224J787R52K10J62K31o22k210
54346B10009l297l288k715k189j853j777j965k068j782j357j131r31n94n74j162
54331A83326j639j231l54Lk86o72j015j360j158k7J055P48o34j452r84n2N36Q39
54313A75643R41N76r4m18k85k80o33q13m09M05J342K157K345J535J90q01j204
$$ plain form
54296 180197 178838 177531 176666 176283 175916 175338 174878 174619 174084 173243 173022 174064 175699 176877 177529 178197 178948
54279 178948 179561 180311 181563 182911 183611 183666 183676 183805 183694 183238 182761 182504 182537 182943 183540 183748 183365 183122 183811
54260 183811 185186 186482 187662 189237 191110 192571 193425 194224 195308 196400 197234 197871 198268 198156 197487 196461
54244 196461 195087 193258 191260 189634 188473 187447 186491 185863 185490 184936 184175 183772 184073 184733 185216 185260 184647
54227 184647 183132 181020 179336 178975 179818 181041 182165 183465 185369 187665 189494 190152 189832 189400 189396 189491 189075
54210 189075 188088 186989 186091 185274 184286 183108 182017 181428 181477 181627 180961 179190 177204 176288 176920 178537 180250
54193 180250 181435 181836 181578 181163 181129 181591 182237 182736 183077 183610 184755 186426 187643 187216 185067 182564 181149
54176 181149 180958 181175 181387 181933 183119 184692 186226 187526 188483 188880 188580 187758 186768 185788 184645 183071 181175
$$ packed form
54296A80197j359j307q65l83l67n78m60k59n35q41k21J042J635J178O52O68P51
54279A78948O13P50J252J348P00N5J0J29j11m56m77k57L3M06N97K08l83k43O89
54260A83811J375J296J180J575J873J461Q54P99J084J092Q34O37L97j12o69j026
54244A96461j374j829j998j626j161j026r56o28l73n54p61m03L01O60M83M4o13
54227A84647j515k112j684l61Q43J223J124J300J904K296J829O58l20m32mR5m16
54210A89075r87j099q98q17r88j178j091n89M9J50o66j771j986r16O32J617J713
54193A80250J185M01k58m15l4M62O46M99L41N33J145J671J217m27k149k503j415
54176A81149j91K17K12N46J186J573J534J300R57L97l00q22r90r80j143j574j896
$$ plain form
54159 181175 179534 178638 178363 178300 178468 179239 180540 181677 182140 182150 182215 182597 183351 184408 185386 185809 185785 185906 186292
54140 186292 186331 185703 184978 184720 184681 184499 184566 185428 186782 187874 188593 189393 190308 190820 190669 190248 190140 190622 191473
54121 191473 192026 191698 190801 190441 191236 192623 193838 194944 196180 196969 196528 195210 194285 194542 195889 198056
54105 198056 200753 203212 204598 205010 205295 205778 205942 205483 204854 204471 204093 203408 202718 202684 203616 205232 206871
54088 206871 207906 208264 208624 209874 212394 216079 220869 226863 234030 242186 251087 260109 267984 273387 275826
54073 275826 275659 273450 269715 265107 260277 255563 251131 247239 243984 241087 238431 236472 235549 235109 234279
54058 234279 232914 231375 229622 227438 225342 224221 224044 223897 223456 223484 224584 226301 227845 229041 230217
54043 230217 231727 233899 236944 240616 244405 248265 252693 257970 263831 270043 276691 283696 290683 297623
$$ packed form
54159A81175j641q96k75o3J68P71J301J137M63J0O5L82P54J057R78M23k4J21L86
54140A86292L9o28p25k58l9j82O7Q62J354J092P19Q00R15N12j51m21j08M82Q51
54121A91473N53l28q97l60P95J387J215J106J236P89m41j318r25K57J347K167
54105A98056K697K459J386M12K85M83J64m59o29l83l78o85o90l4R32J616J639
54088B06871J035L58L60J250K520L685M790N994P167Q156Q901R022P875N403K439
54073B75826j67k209l735m608m830m714m432l892l255k897k656j959r23m40q30
54058B34279j365j539j753k184k096j121j77j47m41K8J100J717J544J196J176
54043B30217J510K172L045L672L789L860M428N277N861O212O648P005O987O940
$$ plain form
54029 297623 305048 313257 321793 330068 338051 345894 353166 358979 362853 365199 366923 368546 369683 369487
54015 369487 367688 364898 361694 357838 352966 347579 342532 337740 332327 326083 319807 314030 308395 302711
54001 302711 297700 294034 291244 288340 285084 282013 279425 277034 274484 271693 268600 265044 261056 257098
53987 257098 253819 251546 250045 248806 247567 246421 245409 244334 243115 242026 241271 240642 239942 239407 239243
53972 239243 239063 238408 237570 237251 237537 237926 238264 238878 239717 240198 240113 240087 240810 242320 244241 246254 248151 249853
53954 249853 251573 253647 256085 258603 261004 263195 265050 266804 269292 273081 277512 281517 285308 290270
53940 290270 297060 304906 313059 321854 331709 342016 351894 361488 371746 383181 395424 407672 418933
53927 418933 427958 433441 434504 431135 424455 416493 409119 403005 397974 394255 392702 393616 396177 399445
$$ packed form
54029B97623P425Q209Q536Q275P983P843P272N813L874K346J724J623J137j96
54015C69487j799k790l204l856m872n387n047m792n413o244o276n777n635n684
54001C02711n011l666k790k904l256l071k588k391k550k791l093l556l988l958
53987B57098l279k273j501j239j239j146j012j075j219j089p55o29p00n35j64
53972B39243j80o55q38l19K86L89L38O14Q39M81q5k6P23J510J921K013J897J702
53954B49853J720K074K438K518K401K191J855J754K488L789M431M005L791M962
53940B90270O790P846Q153Q795R855J0307R878R594J0258J1435J2243J2248J1261
53927D18933R025N483J063l369o680p962p374o114n031l719j553R14K561L268
$$ plain form
53913 399445 403293 407926 413087 418318 423620 429294 435361 441480 447279 452476 456900 460548 463385 465032
53899 465032 465002 463277 460322 456566 452400 448525 445543 443074 439967 435556 430062 423755 416593 408813 400962
53884 400962 393043 384623 376090 368724 362969 357689 351857 345952 340870 336404 331865 327422 323680 320474
53870 320474 317173 313828 310888 308079 304566 300094 295107 289964 284914 280607 277656 275709 273840 271822
53856 271822 270132 268751 266930 264325 261502 259046 256904 254923 253409 252694 252585 252583 252318 251536 249992 247710
53840 247710 245205 243247 242408 242736 243724 244640 245086 245179 245101 244737 244002 243294 243165 243707 244643 245880 247457 248974
53822 248974 249640 249140 248144 247662 248050 248809 249337 249708 250607 252513 255116 257716 260035 262334 264830 267499
53806 267499 270445 273963 278071 282436 286923 291688 296546 300860 304504 308346 313205 318725 323853 328113
$$ packed form
53913C99445L848M633N161N231N302N674O067O119N799N197M424L648K837J647
53899D65032l0j725k955l756m166l875k982k469l107m411n494o307p162p780p851
53884D00962p919q420q533p366n755n280n832n905n082m466m539m443l742l206
53870C20474l301l345k940k809l513m472m987n143n050m307k951j947j869k018
53856B71822j690j381j821k605k823k456k142j981j514p15j09kk65p82j544k282
53840B47710k505j958q39L28R88R16M46R3p8l64p35p08j29N42R36J237J577J517
53822B48974O66n00r96m82L88P59N28L71Q99J906K603K600K319K299K496K669
53806B67499K946L518M108M365M487M765M858M314L644L842M859N520N128M260
$$ plain form
53792 328113 331837 335434 339037 342718 346487 350092 353271 356142 359004 361821 364197 365735 366176 365411 363587
53777 363587 360965 357457 352666 346693 340478 334918 330008 325244 320422 315514 310254 304547 298975 294195
53763 294195 290070 286095 282433 279759 278155 276888 275275 273161 270542 267457 264274 261481 259116 256921
53749 256921 255019 253820 253219 252534 251324 249666 247636 245264 243151 242298 242915 244059 244913 245818 247500 249742
53733 249742 251558 252424 252726 253044 253558 254248 255113 255917 256082 255309 254241 254081 255367 257373 258988 259957 260886
53716 260886 262158 263407 264217 264871 266004 267839 270088 272443 274859 277474 280457 283798 287095 289831 292075
53701 292075 294557 297781 301415 304935 308529 312792 317718 322583 326792 330345 333435 336026 337963 339169
53687 339169 339625 339332 338356 336793 334746 332451 330294 328524 327090 325891 325039 324679 324773 325170 325643 325722 324911
$$ packed form
53792C28113L724L597L603L681L769L605L179K871K862K817K376J538M41p65j824
53777C63587k622l508m791n973o215n560m910m764m822m908n260n707n572m780
53763B94195m125l975l662k674j604j267j613k114k619l085l183k793k365k195
53749B56921j902j199o01o85j210j658k030k372k113q53O17J144Q54R05J682K242
53733B49742J816Q66L02L18N14O90Q65Q04J65p73j068j60J286K006J615R69R29
53716B60886J272J249Q10O54J133J835K249K355K416K615K983L341L297K736K244
53701B92075K482L224L634L520L594M263M926M865M209L553L090K591J937J206
53687C39169M56k93r76j563k047k295k157j770j434j199q52l60R4L97M73P9q11
$$ plain form
53670 324911 323381 322080 321730 321984 321954 321301 320403 319652 319036 318282 317149 315793 315008 315648 317423 318789 318605
53653 318605 317470 316725 316603 316231 315255 314411 314373 314876 315291 315454 315626 316090 317064 318659 320695 322769 324592
53636 324592 326064 327076 327608 328034 328984 330775 333180 335714 337947 339695 341137 342683 344482 346281 348014
53621 348014 350217 353484 357713 362252 366495 370009 372514 374407 376947 381114 386444 391686 396495 401768
53607 401768 408339 416100 424407 432590 439928 445851 450459 454353 457833 460729 463004 464873 466193 466416
53593 466416 465489 464164 463052 461838 459796 456797 453468 450533 448253 446335 444254 441786 439267 437215
53579 437215 435763 434568 433167 431228 428740 426203 424320 423157 421995 420450 419213 419011 419274 418761 417283
53564 417283 415802 414949 414467 414153 414238 414567 414414 413605 413003 413382 414504 415760 417035 418460 419893 421238 422780
$$ packed form
53670C24911j530j301l50K54l0o53q98p51o16p54j133j356p85O40J775J366j84
53653C18605j135p45j22l72r76q44l8N03M15J63J72M64R74J595K036K074J823
53636C24592J472J012N32M26R50J791K405K534K233J748J442J546J799J799J733
53621C48014K203L267M229M539M243L514K505J893K540M167N330N242M809N273
53607D01768O571P761Q307Q183P338N923M608L894L480K896K275J869J320K23
53593D66416r27j325j112j214k042k999l329k935k280j918k081k468k519k052
53579D37215j452j195j401j939k488k537j883j163j162j545j237k02K63n13j478
53564D17283j481q53m82l14Q5L29j53q09o02L79J122J256J275J425J433J345J542
$$ plain form
53547 422780 424724 426809 428836 431165 434189 437606 440719 443222 445416 447848 451003 455053 459623 464133
53533 464133 468612 473859 480553 488551 497316 506664 516703 527366 538466 550070 562467 575790 589881
53520 589881 604395 618905 633163 647470 662678 679639 698659 719442 741316 763535 785739
53509 785739 808298 832062 857589 884727 912834 941211 969354 997053 1024274 1050808 1076192
53498 1076192 1100173 1122973 1144815 1165534 1185127 1204313 1223877 1243748 1263472 1283341 1304077
53487 1304077 1325418 1346023 1365053 1383022 1400866 1418953 1437319 1456059 1474957 1493273 1510343
53476 1510343 1525968 1540007 1552139 1562268 1570630 1577256 1581880 1584502 1585367 1584152 1579915 1572215 1561627
53463 1561627 1548882 1534258 1518178 1501590 1485070 1468200 1450366 1431659 1412418 1392434 1371240
$$ packed form
53547D22780J944K085K027K329L024L417L113K503K194K432L155M050M570M510
53533D64133M479N247O694P998Q765R348J0039J0663J1100J1604J2397J3323J4091
53520E89881J4514J4510J4258J4307J5208J6961J9020K0783K1874K2219K2204
53509G85739K2559K3764K5527K7138K8107K8377K8143K7699K7221K6534K5384
53498A076192K3981K2800K1842K0719J9593J9186J9564J9871J9724J9869K0736
53487A304077K1341K0605J9030J7969J7844J8087J8366J8740J8898J8316J7070
53476A510343J5625J4039J2132J0129Q362O626M624K622Q65j215m237p700j0588
53463A561627j2745j4624j6080j6588j6520j6870j7834j8707j9241j9984k1194
$$ plain form
53452 1371240 1348811 1325495 1301684 1277991 1255242 1233808 1213294 1193259 1173731 1154684 1135718
53441 1135718 1116917 1099440 1084580 1072596 1062978 1055338 1049388 1044547 1040347 1036991 1034910 1034060 1034192
53428 1034192 1035486 1038400 1043117 1049549 1057510 1066510 1075966 1086123 1098168 1112845 1129529 1147307 1166246
53415 1166246 1186756 1208480 1230977 1255063 1282150 1312387 1344581 1377872 1412379 1448195 1484943
53404 1484943 1522595 1561794 1603013 1646170 1691280 1738678 1788279 1839418 1891776 1945759 2001563
53393 2001563 2058552 2116043 2174164 2233425 2293856 2355011 2416383 2477274 2536613 2593468 2647610
53382 2647610 2699163 2747869 2793216 2835202 2874400 2911066 2944579 2973972 2998772 3018973 3034461
53371 3034461 3044972 3050646 3052021 3048979 3040021 3023191 2997749 2964566 2924989 2879865 2829752 2775405
$$ packed form
53452A371240k2429k3316k3811k3693k2749k1434k0514k0035j9528j9047j8966
53441A135718j8801j7477j4860j1984r618p640n950m841m200l356k081q50J32
53428A034192J294K914M717O432P961R000R456J0157J2045J4677J6684J7778J8939
53415A166246K0510K1724K2497K4086K7087L0237L2194L3291L4507L5816L6748
53404A484943L7652L9199M1219M3157M5110M7398M9601N1139N2358N3983N5804
53393B001563N6989N7491N8121N9261O0431O1155O1372O0891N9339N6855N4142
53382B647610N1553M8706M5347M1986L9198L6666L3513K9393K4800K0201J5488
53371C034461J0511N674J375l042q958j6830k5442l3183l9577m5124n0113n4347
$$ plain form
53359 2775405 2717706 2657572 2596204 2534917 2474301 2413960 2353614 2294228 2237464 2184099 2133354
53348 2133354 2083728 2034202 1984721 1935858 1888113 1841438 1795489 1750265 1706229 1663841 1623366
53337 1623366 1585199 1549864 1517403 1487187 1458670 1432080 1408142 1387399 1369865 1354850 1340969
53326 1340969 1326897 1312402 1298125 1284203 1269882 1254872 1240244 1227317 1216335 1206884 1198911 1192437
53314 1192437 1186875 1181604 1176911 1173460 1171199 1169768 1169696 1172093 1177122 1183740 1191062 1199210 1208707 1219802
53300 1219802 1232613 1247278 1263770 1282035 1302338 1324993 1349717 1375825 1403051 1431577 1461228
53289 1461228 1491240 1520965 1550284 1579173 1607308 1634215 1659426 1682475 1703115 1721479 1737691
53278 1737691 1751380 1761959 1769237 1773339 1774222 1771800 1766312 1758021 1746715 1732175 1715023 1696411 1676858
$$ packed form
53359B775405n7699o0134o1368o1287o0616o0341o0346n9386n6764n3365n0745
53348B133354m9626m9526m9481m8863m7745m6675m5949m5224m4036m2388m0475
53337A623366l8167l5335l2461l0216k8517k6590k3938k0743j7534j5015j3881
53326A340969j4072j4495j4277j3922j4321j5010j4628j2927j0982r451p973o474
53314A192437n562n271m693l451k261j431p2K397N029O618P322Q148R497J1095
53300A219802J2811J4665J6492J8265K0303K2655K4724K6108K7226K8526K9651
53289A461228L0012K9725K9319K8889K8135K6907K5211K3049K0640J8364J6212
53278A737691J3689J0579P278M102Q83k422n488q291j1306j4540j7152j8612j9553
$$ plain form
53265 1676858 1655966 1633223 1608456 1581557 1552448 1521461 1489271 1456471 1423587 1391198 1359332
53254 1359332 1326987 1293193 1258583 1225090 1193945 1164718 1136335 1108147 1079830 1051227 1022728
53243 1022728 995076 968421 942118 915831 890144 865697 842347 819670 797816 777360 758618
53232 758618 741484 725689 710946 697124 684502 673579 664476 656716 649544 642128 633586 623430
53220 623430 612083 600456 588887 576969 564445 551684 539182 527175 515811 505094 494580
53209 494580 483799 473091 463353 454818 446894 439318 432615 426996 421695 415942 409922 404199 398763 393182
53195 393182 387215 380834 374129 367580 361873 357045 352392 347611 343358 340110 337283 334202 331334 329578
53181 329578 328779 327930 326611 325347 324563 324013 323302 322287 320860 318900 316598 314326 312072 309437 306374
$$ packed form
53265A676858k0892k2743k4767k6899k9109l0987l2190l2800l2884l2389l1866
53254A359332l2345l3794l4610l3493l1145k9227k8383k8188k8317k8603k8499
53243A022728k7652k6655k6303k6287k5687k4447k3350k2677k1854k0456j8742
53232G58618j7134j5795j4743j3822j2622j0923r103p760p172p416q542j0156
53220F23430j1347j1627j1569j1918j2524j2761j2502j2007j1364j0717j0514
53209D94580j0781j0708r738q535p924p576o703n619n301n753o020n723n436n581
53195C93182n967o381o705o549n707m828m653m781m253l248k827l081k868j756
53181C29578p99q49j319j264p84n50p11j015j427j960k302k272k254k635l063
$$ plain form
53166 306374 303592 302004 301880 302644 303377 303511 303067 302270 301090 299432 297676 296488 295907 295099 293422 291393
53150 291393 290121 289991 290306 290141 289136 287529 285776 284261 283214 282838 283364 284785 286576 288032 288960 289686
53134 289686 290374 290852 291193 291840 292807 293423 293376 293456 294544 296213 297118 296671 295648 295082 295198 295579 295927 296388
53116 296388 297357 299084 301367 303597 305231 306189 306723 307072 307387 307739 307960 307617 306464 304851 303425 302472
53100 302472 301730 300803 299522 297986 296391 294839 293256 291551 289865 288463 287341 286194 284839 283415 282095
53085 282095 280923 280019 279569 279381 278825 277541 275940 274765 274411 274827 275788 276949 277942 278676 279316 279764 279582
53068 279582 278688 277704 277164 276726 275656 273877 272043 270717 269854 269049 268007 266878 266295 266782 267952 268728
53052 268728 268726 268881 270164 272173 273766 274751 276004 277949 279875 280947 281133 280812 280131 279198 278412 278037 277751
$$ packed form
53166C06374k782j588j24P64P33J34m44p97j180j658j756j188n81q08j677k029
53150B91393j272j30L15j65j005j607j753j515j047l76N26J421J791J456R28P26
53134B89686O88M78L41O47R67O16m7Q0J088J669R05m47j023n66J16L81L48M61
53116B96388R69J727K283K230J634R58N34L49L15L52K21l43j153j613j426r53
53100C02472p42r27j281j536j595j552j583j705j686j402j122j147j355j424j320
53085B82095j172r04m50j88n56j284j601j175l54M16R61J161R93P34O40M48j82
53068B79582q94r84n40m38j070j779j834j326q63q05j042j129n83M87J170P76
53052B68728kJ55J283K009J593R85J253J945J926J072J86l21o81r33p86l75k86
$$ plain form
53035 277751 277082 276130 275466 275315 275294 275034 274775 275083 276095 277284 278002 277979 277275 276063 274756 274054 274364 275210
53017 275210 275762 275931 276341 277121 277518 277142 276906 277958 280088 281981 282893 283292 283842 284457 284679 284448 284139 284011
52999 284011 283911 283513 282778 282161 282280 283292 284689 285793 286313 286395 286430 286933 288254 290118 291793 293052 294612
52982 294612 297145 300208 302746 304549 306508 309364 312770 315792 317869 319050 319586 319604 319103 318083 316688
52967 316688 315164 313683 312296 311160 310582 310682 311247 312081 313245 314607 315474 315204 314067 312988 312422 311936
52951 311936 310933 309367 307584 305847 304224 302730 301360 300050 298714 297311 295911 294756 294134 294069 294240
52936 294240 294264 293892 292899 291194 289252 288043 288066 288672 288748 287921 286740 285927 285865 286561 287492 287636 286283 283938
52918 283938 281980 281398 282203 283906 285916 287423 287614 286416 284706 283522 283202 283334 283229 282458 281226 280269
$$ packed form
53035B77751o69r52o64j51k1k60k59L08J012J189P18k3p04j212j307p02L10Q46
53017B75210N52J69M10P80L97l76k36J052K130J893R12L99N50O15K22k31l09j28
52999B84011j00l98p35o17J19J012J397J104N20Q2L5N03J321J864J675J259J560
52982B94612K533L063K538J803J959K856L406L022K077J181N36J8n01j020j395
52967C16688j524j481j387j136n78J00N65Q34J164J362Q67k70j137j079n66m86
52951C11936j003j566j783j737j623j494j370j310j336j403j400j155o22o5J71
52936B94240K4l72r93j705j942j209K3O06P6q27j181q13o2O96R31J44j353k345
52918B83938j958n82Q05J703K010J507J91j198j710j184l20J32j05p71j232r57
$$ plain form
52902 280269 280108 280497 280914 281398 282322 283453 283951 283457 282499 281688 281155 281101 282116 284418 287262 289684 291475
52885 291475 292913 293853 293777 292610 290922 289307 287944 286774 285717 284726 283982 284042 285381 287677 289954 291658
52869 291658 293348 295998 299717 303475 306200 307969 309867 312752 316385 319862 322593 324562 325800 326058
52855 326058 325081 322902 319727 315780 311396 306965 302591 298044 293284 288818 285190 282230 279175 275594
52841 275594 271914 268956 267182 266485 266492 266816 267086 266973 266414 265757 265578 266171 267210 268009 268285 268604 269833 272068
52823 272068 274305 275354 274925 273615 272015 270261 268476 267098 266463 266311 266107 265708 265407 265519 266280 267988
52807 267988 270741 274029 277004 279228 280803 281734 281626 280143 277426 273906 270088 266601 264061 262642 262004
52792 262004 261783 261810 261901 261894 262021 262650 263463 263481 262302 260757 259849 259583 259408 259360 260048 261735 264054 266487 268620
$$ packed form
52902B80269j61L89M17M84R24J131M98m94r58q11n33n4J015K302K844K422J791
52885B91475J438R40p6j167j688j615j363j170j057r91p44O0J339K296K277J704
52869B91658J690K650L719L758K725J769J898K885L633L477K731J969J238K58
52855C26058r77k179l175l947m384m431m374m547m760m466l628k960l055l581
52841B75594l680k958j774o97PL24K70j13n59o57j79N93J039P99K76L19J229K235
52823B72068K237J049m29j310j600j754j785j378o35j52k04l99l01J12P61J708
52807B67988K753L288K975K224J575R31j08j483k717l520l818l487k540j419o38
52792B62004k21K7R1pJ27O29Q13J8j179j545r08k66j75m8O88J687K319K433K133
$$ plain form
52773 268620 270034 270479 270166 269535 268899 268507 268580 268818 268281 266443 264164 262933 263219 264156 264725 264621 264046 263352
52755 263352 262988 263262 264021 264885 265713 266432 266705 266349 266005 266694 268730 271578 274710 277881 280692 282696 284036
52738 284036 285294 286573 287444 287893 288554 289789 291290 292855 294759 297031 299114 300704 302239 304071 305719
52723 305719 306473 306189 305034 303000 300354 298059 297007 297052 297335 297321 296916 295870 293841 291103 288643 287362
52707 287362 287389 288138 288769 288701 287999 287240 286817 286537 286101 285729 285899 286650 287529 288230 288790 289146 288923 287976 286860
52688 286860 286436 287000 288024 288812 289220 289554 289930 290139 290156 290359 290917 291354 291203 290869 291199 292205 292793 291990
52670 291990 290013 287942 286663 286284 286303 286138 285724 285604 286219 287176 287630 287331 286805 286473 286228 286098 286748 288885
52652 288885 292507 296993 301579 305482 308020 309041 309030 308501 307503 305926 303994 302125 300561 299365 298560
$$ packed form
52773B68620J414M45l13o31o36l92P3K38n37j838k279j231K86R37N69j04n75o94
52755B63352l64K74P59Q64Q28P19K73l56l44O89K036K848L132L171K811K004J340
52738B84036J258J279Q71M49O61J235J501J565J904K272K083J590J535J832J648
52723C05719P54k84j155k034k646k295j052M5K83j4m05j046k029k738k460j281
52707B87362K7P49O31o8p02p59m23k80m36l72J70P51Q79P01N60L56k23r47j116
52688B86860m24N64J024P88M08L34L76K09J7K03N58M37j51l34L30J006N88q03
52670B91990j977k071j279l79J9j65m14j20O15R57M54k99n26l32k45j30O50K137
52652B88885L622M486M586L903K538J021j1n29r98j577j932j869j564j196q05
$$ plain form
52637 298560 298043 297570 297008 296437 295904 295405 295131 295327 295827 296210 296596 297720 299938 302669 305084 306833 307709
52620 307709 307225 305168 302232 299505 297501 296116 295248 294980 295335 296204 297314 298046 297701 296368 295122 294867
52604 294867 295310 295528 295194 294697 294387 294365 294831 295967 297551 299157 300636 301943 302744 302744 302249 301824 301534 301081
52586 301081 300582 300589 301359 302665 304281 306130 307989 309603 311110 312828 314627 315983 316655 316746 316209 314881
52570 314881 313035 311268 309781 308360 307093 306342 305881 304858 303030 301304 300558 300452 299985 298826 297497
52555 297497 296480 295748 295105 294545 294180 294073 294171 294307 294353 294460 294981 295990 297128 298027 298720 299393 299974 300226
52537 300226 300123 299909 299805 299852 299899 299623 298725 297355 296186 295794 296013 296234 296303 296769 298135 300192 302304 304103
52519 304103 305568 306610 307105 307488 308835 311884 316121 320287 323783 327217 331490 336744 342359 347579 351803
$$ packed form
52637B98560n17m73n62n71n33m99k74J96N00L83L86J124K218K731K415J749Q76
52620C07709m84k057k936k727k004j385q68k68L55Q69J110P32l45j333j246k55
52604B94867M43K18l34m97l10k2M66J136J584J606J479J307Q01%m95m25k90m53
52586C01081m99PP70J306J616J849J859J614J507J718J799J356O72R1n37j328
52570C14881j846j767j487j421j267p51m61j023j828j726p46j06m67j159j329
52555B97497j017p32o43n60l65j07R8J36M6J07N21J009J138Q99O93O73N81K52
52537C00226j03k14j04M7M7k76q98j370j169l92K19K21O9M66J366K057K112J799
52519C04103J465J042M95L83J347L049M237M166L496L434M273N254N615N220M224
$$ plain form
52504 351803 354570 355714 355456 354071 351498 347519 342238 336227 330260 325051 321013 318017 315579 313554
52490 313554 312426 312569 313456 314082 314046 313668 313140 312209 310917 310044 310403 311994 314097 315973 317263 318021 318658
52473 318658 319705 321341 323212 324818 325918 326560 327051 328130 330747 335220 340695 345792 349746 352679 355002
52458 355002 356945 358557 359575 359186 356485 351469 345296 339240 333694 328489 323838 320367 318256 316908
52444 316908 315585 314010 312207 310165 307938 305769 303875 302268 300983 300213 300064 300461 301462 303282 305649
52429 305649 307592 308371 308335 308293 308328 307937 307186 306905 307562 308657 309451 309766 309852 309985 310403 311182 312030 312734 313844
52410 313844 316266 320014 324161 328289 333169 339589 347468 356698 367861 381039 394516 405766 413405
52397 413405 417272 417173 412905 405474 396989 388934 381392 374193 367877 363114 359846 357497 355569 353717 351705
$$ packed form
52504C51803K767J144k58j385k573l979n281o011n967n209m038k996k438k025
52490C13554j128J43Q87O26l6l78n28r31j292q73L59J591K103J876J290P58O37
52473C18658J047J636J871J606J100O42M91J079K617M473N475N097L954K933K323
52458C55002J943J612J018l89k701n016o173o056n546n205m651l471k111j348
52444C16908j323j575j803k042k227k169j894j607j285p70j49L97J001J820K367
52429C05649J943P79l6m2L5l91p51k81O57J095P94L15Q6J33M18P79Q48P04J110
52410C13844K422L748M147M128M880O420P879R230J1163J3178J3477J1250P639
52397D13405L867r9m268p431q485q055p542p199o316m763l268k349j928j852k012
$$ plain form
52382 351705 349664 348050 347147 346892 347274 348419 350168 352096 354144 356728 360011 363641 367527 372261 378232
52367 378232 384706 390359 394500 397275 398872 399130 397990 395942 393749 391890 390386 389119 388153 387642 387475
52352 387475 387232 386690 386178 386154 386557 387013 387554 388634 390340 392128 393637 395309 397809 401125 404665 408073
52336 408073 411520 415219 419073 422925 426898 431367 436705 443211 451174 460808 472008 484295 497163
52323 497163 510445 524169 538110 551819 565175 578501 591899 604833 616780 628002 639210
52312 639210 650720 662530 675045 688998 704484 720711 736950 753264 770062 787381 804924
52301 804924 822455 839866 857137 874510 892394 910748 928720 945163 959287 970590 978498 982663
52289 982663 983598 982542 980452 977321 972699 966730 960401 954691 949718 944872 939684 934261 929013 924395
$$ packed form
52382C51705k041j614r03k55L82J145J749J928K048K584L283L630L886M734N971
52367C78232O474N653M141K775J597K58j140k048k193j859j504j267r66n11j67
52352C87475k43n42n12k4M03M56N41J080J706J788J509J672K500L316L540L408
52336D08073L447L699L854L852L973M469N338O506P963R634J1200J2287J2868
52323D97163J3282J3724J3941J3709J3356J3326J3398J2934J1947J1222J1208
52312F39210J1510J1810J2515J3953J5486J6227J6239J6314J6798J7319J7543
52301H04924J7531J7411J7271J7373J7884J8354J7972J6443J4124J1303P908M165
52289I82663R35j056k090l131m622n969o329n710m973m846n188n423n248m618
$$ plain form
52275 924395 921020 919451 919501 920186 920875 922195 925232 930054 935662 941314 947173 953599 960505 967628 974893
52260 974893 982284 989871 998227 1008336 1020723 1034982 1050479 1067089 1084953 1103750 1122588 1140435
52248 1140435 1156465 1170208 1181578 1190666 1197397 1201616 1203561 1203970 1203574 1202694 1201309 1199144 1195718 1190769
52234 1190769 1184816 1178802 1173039 1166982 1160213 1153035 1145827 1138424 1130647 1122936 1115850 1109345 1103161 1097549
52220 1097549 1092930 1088981 1084786 1079976 1075186 1071356 1069037 1068420 1069484 1071865 1074902 1078119 1081582 1085680
52206 1085680 1090656 1096391 1102513 1108643 1114558 1120119 1125149 1129529 1133450 1137342 1141530 1146182 1151631 1158332
52192 1158332 1166270 1174767 1183174 1191500 1199997 1208393 1215974 1222284 1227310 1230967 1232775 1232190 1228994 1223333
$$ packed form
52275I24395l375j569N0O85O89J320L037M822N608N652N859O426O906P123P265
52260I74893P391P587Q356J0109J2387J4259J5497J6610J7864J8797J8838J7847
52248A140435J6030J3743J1370R088O731M219J945M09l96q80j385k165l426m949
52234A190769n953o014n763o057o769p178p208p403p777p711p086o505o184n612
52220A097549m619l949m195m810m790l830k319o17J064K381L037L217L463M098
52206A085680M976N735O122O130N915N561N030M380L921L892M188M652N449O701
52192A158332P938Q497Q407Q326Q497Q396P581O310N026L657J808n85l196n661
$$ [...]
##END NTUPLES=NMR SPECTRUM
##END=
