##TITLE=AC1424_CRIAH12234_7790548_GKUUlojbC5
##JCAMPDX= 6.0         $$ Bruker NMR JCAMP-DX V2.0
##DATA TYPE= NMR SPECTRUM
##DATA CLASS= NTUPLES
##ORIGIN= BRUKER
##OWNER= Administrator
$$ 1.72 TOPSPIN		Version 2.1
$$ 2013-04-17 05:04:59.070 -0700  Administrator@X
$$ Compression mode = diff/dup
##.OBSERVE FREQUENCY= 400.02188249412
##.OBSERVE NUCLEUS= ^1H
##.ACQUISITION MODE= SIMULTANEOUS (DQD)
##.ACQUISITION SCHEME= undefined
##.AVERAGES= 8
##.DIGITISER RES= 22
##SPECTROMETER/DATA SYSTEM= spect
##.PULSE SEQUENCE= zg30
##.SOLVENT NAME= COFFEE_meoh
##.SHIFT REFERENCE= INTERNAL, COFFEE_meoh, 1, 14.98509
##AUDIT TRAIL= $$ (NUMBER, WHEN, WHO, WHERE, PROCESS, VERSION, WHAT)
$$ ##TITLE= Audit trail, TOPSPIN		Version 2.1
$$ ##JCAMPDX= 5.01
$$ ##ORIGIN= Bruker BioSpin GmbH
$$ ##OWNER= Administrator
$$ $$ E:\/data/COFFEE/nmr/AC1424_CRIAH12234_7790548_GKUUlojbC5/10/pdata/1/auditp.txt
$$ ##AUDIT TRAIL=  $$ (NUMBER, WHEN, WHO, WHERE, PROCESS, VERSION, WHAT)
(   1,<2013-04-16 19:09:25.099 -0700>,<Administrator>,<X>,<go>,<TOPSPIN 2.1>,
      <created by zg
	started at 2013-04-16 19:08:18.724 -0700,
	POWCHK enabled, PULCHK disabled,
       configuration hash MD5:
       33 CF 6A 21 5C D3 B9 40 6C 15 AA 8D 27 A2 4F 13
       data hash MD5: 64K
       D4 13 89 69 06 2B CA B7 CB DE 3F 3C 94 94 89 38>)
(   2,<2013-04-16 19:09:28.161 -0700>,<Administrator>,<X>,<proc1d>,<TOPSPIN 2.1>,
      <Start of raw data processing
       efp LB = 0 FT_mod = 6 PKNL = 1 PHC0 = 0 PHC1 = 0 SI = 32K 
       data hash MD5: 32K
       5F 85 4C C5 7C 36 43 11 BD 7D FD 0F 15 82 47 90>)
(   3,<2013-04-16 19:09:28.536 -0700>,<Administrator>,<X>,<proc1d>,<TOPSPIN 2.1>,
      <pk PHC0 = 100.1074 PHC1 = 0 
       data hash MD5: 32K
       38 FA 33 5F 64 50 1E 18 02 8E 3A 01 5A 17 B2 8D>)
(   4,<2013-04-16 19:09:28.692 -0700>,<Administrator>,<X>,<proc1d>,<TOPSPIN 2.1>,
      <abs ABSG = 1 
       data hash MD5: 32K
       0C 66 EE 63 0C AD 95 AF DB A3 46 12 A0 7C 26 24>)
(   5,<2013-04-16 19:09:28.802 -0700>,<Administrator>,<X>,<proc1d>,<TOPSPIN 2.1>,
      <abs ABSG = 2 
       data hash MD5: 32K
       D6 64 2B CF 0E 6F 06 0D 57 55 B3 5C 88 39 D0 EC>)
(   6,<2013-04-16 19:09:28.927 -0700>,<Administrator>,<X>,<proc1d>,<TOPSPIN 2.1>,
      <abs ABSG = 3 
       data hash MD5: 32K
       F4 B6 ED B1 44 80 97 09 8F 08 3D 15 D5 93 E9 D2>)
(   7,<2013-04-16 19:09:28.974 -0700>,<Administrator>,<X>,<proc1d>,<TOPSPIN 2.1>,
      <abs ABSG = 4 
       data hash MD5: 32K
       C6 42 01 26 DD 3B 8D 84 CA E5 E4 78 C0 B8 FC 90>)
(   8,<2013-04-16 19:09:29.067 -0700>,<Administrator>,<X>,<proc1d>,<TOPSPIN 2.1>,
      <abs ABSG = 5 
       data hash MD5: 32K
       43 04 09 D4 8A 7D 40 92 61 80 9E 51 24 46 8F 04>)
(   9,<2013-04-16 19:09:32.974 -0700>,<Administrator>,<X>,<audit>,<TOPSPIN 2.1>,
      <user comment:
       ICON-NMR User ID: COFFEE
       data hash MD5: 32K
       43 04 09 D4 8A 7D 40 92 61 80 9E 51 24 46 8F 04>)
$$ ##END=
$$ 
$$ $$ hash MD5
$$ [...]
##$TP= (0..7)
150 150 150 150 150 150 150 150
##$TP07= 0
##$TPNAME0= <>
##$TPNAME1= <>
##$TPNAME2= <>
##$TPNAME3= <>
##$TPNAME4= <>
##$TPNAME5= <>
##$TPNAME6= <>
##$TPNAME7= <>
##$TPOAL= (0..7)
0.5 0.5 0.5 0.5 0.5 0.5 0.5 0.5
##$TPOFFS= (0..7)
0 0 0 0 0 0 0 0
##$TUNHIN= 0
##$TUNHOUT= 0
##$TUNXOUT= 0
##$USERA1= <user>
##$USERA2= <user>
##$USERA3= <user>
##$USERA4= <user>
##$USERA5= <user>
##$V9= 5
##$VALIST= <valist>
##$VCLIST= <CCCCCCCCCCCCCCC>
##$VD= 0
##$VDLIST= <DDDDDDDDDDDDDDD>
##$VPLIST= <PPPPPPPPPPPPPPP>
##$VTLIST= <TTTTTTTTTTTTTTT>
##$WBST= 2048
##$WBSW= 25
##$XGAIN= (0..3)
0 0 0 0
##$XL= 0
##$YL= 0
##$YMAX_a= 647670
##$YMIN_a= -552719
##$ZGOPTNS= <>
##$ZL1= 120
##$ZL2= 120
##$ZL3= 120
##$ZL4= 120
##$ABSF1= 14.98509
##$ABSF2= -5.573092
##$ABSG= 5
##$ABSL= 3
##$ALPHA= 0
##$AQORDER= 0
##$ASSFAC= 0
##$ASSFACI= 0
##$ASSFACX= 0
##$ASSWID= 0
##$AUNMP= <proc_prof1d_extract_pilot.lims>
##$AXLEFT= 0
##$AXNAME= <>
##$AXNUC= <1H>
##$AXRIGHT= 0
##$AXTYPE= 0
##$AXUNIT= <>
##$AZFE= 0.1
##$AZFW= 0.1
##$BCFW= 0
##$BC_mod= 0
##$BYTORDP= 0
##$COROFFS= 0
##$CY= 15
##$DATMOD= 1
##$DC= 0
##$DFILT= <>
##$DTYPP= 0
##$F1P= 0
##$F2P= 0
##$FCOR= 0.5
##$FTSIZE= 32768
##$FT_mod= 6
##$GAMMA= 0
##$GB= 0
##$INTBC= 1
##$INTSCL= 1
##$ISEN= 128
##$LB= 0
##$LEV0= 0
##$LPBIN= 0
##$MAXI= 10000
##$MC2= 0
##$MEAN= 0
##$ME_mod= 0
##$MI= 0
##$NCOEF= 0
##$NC_proc= -8
##$NLEV= 6
##$NOISF1= 0
##$NOISF2= 0
##$NSP= 0
##$NTH_PI= 0
##$NZP= 0
##$OFFSET= 14.98509
##$PC= 1
##$PHC0= 100.1074
##$PHC1= 0
##$PH_mod= 1
##$PKNL= yes
##$PPARMOD= 0
##$PPDIAG= 0
##$PPIPTYP= 0
##$PPMPNUM= 2147483647
##$PPRESOL= 1
##$PSCAL= 4
##$PSIGN= 0
##$PYNMP= <proc.py>
##$REVERSE= no
##$SF= 400.02
##$SI= 32768
##$SIGF1= 0
##$SIGF2= 0
##$SINO= 400
##$SIOLD= 32768
##$SPECTYP= <>
##$SREGLST= <1H.CDCl3>
##$SSB= 0
##$STSI= 32768
##$STSR= 0
##$SW_p= 8223.68421052631
##$SYMM= 0
##$S_DEV= 0
##$TDeff= 65536
##$TDoff= 0
##$TI= <>
##$TILT= no
##$TM1= 0
##$TM2= 0
##$TOPLEV= 0
##$USERP1= <user>
##$USERP2= <user>
##$USERP3= <user>
##$USERP4= <user>
##$USERP5= <user>
##$WDW= 1
##$XDIM= 32768
##$YMAX_p= 465345735
##$YMIN_p= -791263
##$CURPLOT= <Network HP LaserJet P1505>
##$CURPRIN= <$Network HP LaserJet P1505>
##$DFORMAT= <normdp>
##$LAYOUT= <+/1D_H.xwp>
##$LFORMAT= <normlp>
##$PFORMAT= <normpl>
##$SURQMSG= 1
$$ End of Bruker specific parameters
$$ ---------------------------------
##NTUPLES= NMR SPECTRUM
##VAR_NAME=  FREQUENCY,     SPECTRUM/REAL,   SPECTRUM/IMAG
##SYMBOL=    X,             R,               I
##VAR_TYPE=  INDEPENDENT,   DEPENDENT,       DEPENDENT
##VAR_FORM=  AFFN,          ASDF,            ASDF
##VAR_DIM=   32768,         32768,           32768
##UNITS=     HZ,            ARBITRARY UNITS, ARBITRARY UNITS
##FACTOR=    0.250966925370066, 1,           1
##FIRST=     8223.43324360094, -146106,      46541
##LAST=      0,             338753,          -55441
##MIN=       0,             -791263,         0
##MAX=       8223.43324360094, 465345735,    0
$$ Real data points
##PAGE= N=1
##DATA TABLE= (X++(R..R)), XYDATA
$$ [...]
19558A60697h1280A83287g5418c3085j18682A40954a4270l37811i2586A76068
19547C52758d7569J7668H998K70449A01208a60220I850b02275k0499r6267J33491
19536a85550K7499k2253J4229j3571O435M0416n7103A51752a74208c3047m2784
19525g5831j5556l83208a43033C2103a65748d2125m7514a9267E8642b80588g9819
19513b39949B44585a7493E362R8912b17490D0369c90408A37606a46732A66751
19502A04341i5914j75966f7099j41117F0993h0509j66830P7257n0086H0300J68063
19491B48363b22620F5313e4698j60770H7960M9336c24027N4456n785J01591G5346
19479a68652c083p861B68531b10785G4883B1313i7331j00303E9116R3611i3298
$$ plain form
19558 160697 -81280 183287 -75418 -33085 -151767 140954 -14270 -352081 -92586 176068
19547 352758 -47569 -29901 8998 279447 101208 -160220 9850 -202275 -222774 -319041 -185550
19536 -185550 -158051 -180304 -166075 -179646 -173211 -132795 -189898 151752 -174208 -33047 -75831
19525 -75831 -91387 -474595 -143033 32103 -165748 -42125 -89639 -19267 58642 -280588 -79819
19513 -239949 244585 -17493 5362 104274 -217490 40369 -390408 137606 -146732 166751
19502 104341 -95914 -271880 -67099 -208216 60993 -80509 -247339 -170082 -220168 80300 248363
19491 248363 -222620 65313 -54698 -215468 87960 137296 -324027 -269571 -275356 -173765 75346
19479 -168652 -3083 -10944 268531 -210785 74883 21313 -97331 -197634 59116 152727 -93298
19467G7262c92655J62315J05118o1953b5198B64838b61013R6732P5263j5899q4125
19456a89042E584J92710B6458J76186b99379F5807J82983b63746M8238A69945
19445a14191k17706o2983a11395d771B41969a25758m5751B46371a03824A10236
19434A78831a7586j7964B78307h2516A82691b65008A63597a49558j36694A30013
19423A95271a9398j8209B48392b50626B72721f7699j14425O7848E9484a37842
19412a04793Q309m6018L1582l08293a10002B0796d4672r4454E6874a41688A28849
19400b0105k91474J42227M1828p8859n5682A27733g9308f9j03767b8725a181j00092
19388a01273C6639b09p2294A87053b08688D5388g2358l7580o7044m0879B31266
$$ plain form
19467 77262 -392655 -230340 -125222 -187175 -25198 264838 -261013 -164281 -89018 -104917 -189042
19456 -189042 5584 198294 26458 202644 -299379 65807 248790 -263746 -215508 169945
19445 -114191 -331897 -394880 -111395 -4771 241969 -125758 -171509 246371 -103824 110236
19434 178831 -17586 -35550 278307 -82516 182691 -265008 163597 -149558 -286252 130013
19423 195271 -19398 -37607 248392 -250626 272721 -67699 -182124 -114276 59484 -137842
19412 -104793 -96484 -142502 -110920 -419213 -110002 20796 -44672 -139126 56874 -141688 128849
19400 -20105 -311579 -169352 -127524 -206383 -262065 127733 -79308 -69 -103836 -28725 -1181 -101273
19388 -101273 36639 -209 -72503 187053 -208688 45388 -72358 -109938 -176982 -217861 231266
19376c2195e07j56518j97074M3909O7527A05414b11436a01544H4215l3841K9959
19365H0333A0951c71172B4311c24712b7596l13587A00557Q9147g4828m60910g9629
19353a6183r8218b7122k2761J9356l9158j5899k12096J48376A14749b18043q2578
19342c00621a29351l7017j00964D3641a72128m4964A73213b64071j8312k40170
19332e22553e1981B166a70631M3314D3831b14941B3812K37248A2776a2362k39091
19321b51453g7158m2638n7407O2459I3333J90630R0934e22960d5355H6166b6239
19309A23179A5155a39020A19118n5982J18603f4172C8619A1933a29426A8931J37288
19298A56219f9947C2344a61530r7757N9585g9894A10378f9309C3784i2362j34830
$$ plain form
19376 -32195 -507 -157025 -354099 -310190 -242663 105414 -211436 -101544 84215 50374 80333
19365 80333 10951 -371172 24311 -324712 -27596 -341183 100557 189704 -74828 -535738 -79629
19353 -16183 -114401 -27122 -49883 -30527 -69685 -85584 -297680 -149304 114749 -218043 -300621
19342 -300621 -129351 -166368 -267332 43641 -172128 -217092 173213 -264071 -282383 -522553
19332 -522553 -51981 2166 -170631 -127317 43831 -214941 23812 261060 12776 -12362 -251453
19321 -251453 -77158 -119796 -177203 -114744 93333 283963 374897 -522960 -45355 86166 -26239
19309 123179 15155 -139020 119118 63136 181739 -64172 38619 11933 -129426 18931 156219
19298 156219 -69947 32344 -161530 -259287 -199702 -79894 110378 -69309 33784 -92362 -227192
19287b27192k29471b5358j41817B10001a1110j25421o0819j06473b7654k22969
19277b50623d9419o7800j11396H5699c12571A45544a66122f7615C7078J40867
19267A77945a07016A50605G1544a90801F244h7311o4271j65409B89958A19127
19256b01994J8668C5638h7795J6495k26912j12600b2028I5321a40481r5953a06444
19244d4811j35412g5198K2285j04823B6118b4383A30173b04346C7727J87936G0316
19232h8873j81067O5545F4796a75964B4864J58840a1456C3834a45296j2916B52060
19220h8876j8944c6080j05325b7260l62339B6653d17046C8619b74738i5215m5854
19209a41069p4455j2493A08073Q4303b45952i6079B25959O9662a44952B72935
$$ plain form
19287 -227192 -456663 -25358 -167175 210001 -11110 -136531 -197350 -303823 -27654 -250623
19277 -250623 -49419 -117219 -228615 85699 -312571 145544 -166122 -67615 37078 177945
19267 177945 -107016 150605 71544 -190801 6244 -87311 -151582 -316991 289958 119127
19256 -201994 -183326 35638 -87795 -71300 -298212 -410812 -22028 95321 -140481 -236434 -106444
19244 -44811 -180223 -75198 -52913 -157736 26118 -24383 130173 -204346 37727 225663 70316
19232 -88873 -269940 -204395 64796 -175964 24864 183704 -11456 33834 -145296 -158212 252060
19220 -88876 -107820 -36080 -141405 -27260 -389599 26653 -417046 38619 -274738 -95215 -141069
19209 -141069 -215524 -228017 108073 192376 -245952 -96079 225959 295621 -144952 272935
19198A72680q2944m0593f9330p1693E7M89760b47154b9766j06452F68b86745P767
19186b78978n2004J12000A47845F0083A207a07439C30540d5202q2195e7076L269
19175e3807q575j24616d1786j87448a06684C4067i4854E3718d079H0473c34303
19163i6806r1111m5183A371a10063C8980h479j13688A48130a35839H5545A0291
19151A39016c28521f9351l5066A18644b36566H3639a60068j77492J67051j77553
19141c48062a12531B28440b32699g1063I3393q648a20127F9587J6776a26482L8713
19130h7769A07428a35575A93360b1089j93889N3504j68408D5087e20921B9276
19119a07681L1228C3607b95423P8090h1618j71141Q0198F0499d7950H4983p814
$$ plain form
19198 172680 89736 49143 -69330 -141023 57 489817 -247154 -29766 -136218 668 -286745 -278978
19186 -278978 -330982 -218982 147845 60083 1207 -107439 330540 -45202 -127397 -57076 -53807
19175 -53807 -62382 -186998 -41786 -229234 -106684 34067 -94854 53718 -4079 80473 -334303
19163 -96806 -187917 -233100 1371 -110063 38980 -8479 -122167 148130 -135839 85545 10291
19151 139016 -328521 -69351 -104417 118644 -236566 83639 -160068 -337560 -170509 -348062
19141 -348062 -112531 228440 -232699 -71063 93393 84745 -120127 69587 86363 -126482 -87769
19130 -87769 107428 -135575 193360 -21089 -214978 -161474 -329882 45087 -520921 29276
19119 -107681 -76453 33607 -295423 -217333 -81618 -252759 -172561 60499 -47950 84983 77169
19108G7169j1934g5935k0770j2592d0570F5416B4479a94918D52138B02682c45734
19096A631c81268i8724k46031C0970L57680c5242D20650A73012a22782A08789
19085d1184A61887a27478A80338J49786i9817l89194a98366h8641F8319b14232
19074C9133B928a12835j1782B13233a05839b8345n6503n0604k3251C8181J867
19063D0048Q2638J88732j8301a25873k9652D7283A9873g3210A14594c6247k74062
19052c10309A55138e4404R91o8335b3337M047m00185a72412g2872k36873A60128
19040b04223O7825k61499a67287G0303c94027d4931I8421a91844C4716b4527k1875
19029d6402j52120B6064b50637G0151Q8263b03937G9006h0292A97681a80316C9964
$$ plain form
19108 77169 65235 -75935 -96705 -109297 -40570 65416 24479 -194918 452138 202682 -345734
19096 1631 -381268 -98724 -344755 30970 388650 -35242 420650 173012 -122782 108789
19085 -41184 161887 -127478 180338 330124 -99817 -489011 -198366 -88641 68319 -214232
19074 39133 2928 -112835 -124617 213233 -105839 -28345 -84848 -135452 -158703 38181 40048
19063 40048 122686 311418 293117 -125873 -155525 47283 19873 -73210 114594 -36247 -310309
19052 -310309 155138 -54404 -53413 -121748 -23337 -19290 -419475 -172412 -72872 -309745 160128
19040 -204223 -136398 -397897 -167287 70303 -394027 -44931 98421 -191844 34716 -24527 -46402
19029 -46402 -198522 26064 -250637 70151 158414 -203937 79006 -80292 197681 -180316 39964
19017I0865a34505q5160I7216g7405B61046q1509f5932o2202j20345G8531l7371
19006D1160J78739n6940b86058O7927M8500A36778e54081h3689k52313I2264c7291
18994d941F2375c06324a8117k68326A10445K38154c03482O3234G5197B7415f9626
18982A0196a32514e571A12942a63879E151J20207c927A57006a51405j94834a28698
18970c4793l07135M5074B3296b36233d4638J045k91042A03969J66284c8049C4509
18958C40407a56816B25281p7884m4673a95281N8927B22548e285j78234C26695
18947A31013n6100N7337b1360k39139d6679A11934A4201n006i0473k864k51546
18936c44883H4961R0664j3255h2282c1067A47930a86653L8056b2046A04403a13965
$$ plain form
19017 90865 -134505 -219665 97216 -77405 261046 179537 -65932 -128134 -248479 78531 41160
19006 41160 219899 162959 -286058 -218131 -169631 136778 -554081 -83689 -336002 92264 -37291
18994 -4941 62375 -306324 -18117 -286443 110445 348599 -303482 -240248 75197 27415 -69626
18982 10196 -132514 -5571 112942 -163879 5151 125358 -3927 157006 -151405 -346239 -128698
18970 -34793 -341928 -296854 23296 -236233 -44638 -43593 -334635 103969 270253 -38049 34509
18958 340407 -156816 225281 147397 102724 -195281 -136354 222548 -5285 -183519 326695
18947 131013 74913 132250 -21360 -260499 -46679 111934 14201 9195 -90473 -93337 -344883
18936 -344883 84961 175625 162370 -82282 -31067 147930 -186653 -148597 -22046 104403 -113965
18924f482B85804E7328b37444o2107f6702H0734b28796j33314D8447d13476a92534
18912a70435j12790A62462a30363k09156a31798E1951K5289M863b07846P7917
18902a29929M5605n8810J0598J2486L9620k21554d8538A51929a88461f9699l83552
18891d53251D4379M0622J25418G8417a32338M6310K2818B72565b32445D1320M10769
18880D52089E9534a13978A11634R0355c33250J45531f2801A5967a09202M4889
18870f4313k65587i6104K9259A01444b05979A7481J98650E4570J8100d0991j8826
18859e9817j8523A17074e3551j07394A331b3554j26840J7215B99058c1127H9616
18847g7406A71077c88142a21544p296B96132a46895B80932a28744C4266J54968
$$ plain form
18924 -6482 285804 57328 -237444 -299551 -66702 80734 -228796 -362110 48447 -413476 -192534
18912 -170435 -283225 162462 -130363 -339519 -131798 51951 77240 82103 -207846 -129929
18902 -129929 -84324 -143134 -132536 -120050 -80430 -301984 -48538 151929 -188461 -69699 -453251
18891 -453251 44379 85001 210419 78417 -132338 -86028 -63210 272565 -232445 41320 452089
18880 452089 59534 -113978 111634 201989 -333250 -187719 -62801 15967 -109202 -64313
18870 -64313 -329900 -96104 -66845 101444 -205979 17481 216131 54570 72670 -40991 -59817
18859 -59817 -78340 117074 -53551 -160945 1331 -23554 -150394 -133179 299058 -31127 89616
18847 -77406 171077 -388142 -121544 -128840 296132 -146895 280932 -128744 34266 189234
18837A89234b25819B4897b98470B20684M3880a59025k25533J71035j4498d6673
18826F2895C1260J49359o7904D4309c31058I8654K9658O0405a25730A06622a7533
18814a91142Q667H2693b16176F343K65428B8496A3366c3835A31301E3869a95960
18802C7540h1963L0827A33838b76531R7280N0259C1668P8462K0797b26113H9115
18790a14393G6729p031c6899k26680e9075j33461D3083K45117a10599H5870b51061
18778a24545j6882e2397A72039F6318a58930r5677j49135P4467A87632B1146a55711
18766c49068a41431B07025a11956j75964q7182O4642b0689m30365a4116r0984
18756a05100n5860m1555h9400G004a29647b0827A74625P5503b73077k8000b5093
$$ plain form
18837 189234 -225819 24897 -298470 220684 264564 -159025 -384558 -213523 -228021 -46673
18826 62895 31260 180619 112715 44309 -331058 98654 128312 188717 -125730 106622 -17533
18814 -191142 -182475 82693 -216176 6343 271771 28496 13366 -33835 131301 53869 -195960
18802 37540 -81963 -51136 133838 -276531 -179251 -128992 31668 110130 130927 -226113 89115
18790 -114393 76729 69698 -36899 -263579 -59075 -192536 43083 288200 -110599 85870 -251061
18778 -124545 -141427 -52397 172039 66318 -158930 -254607 -403742 -329275 187632 21146 -155711
18766 -349068 -141431 207025 -111956 -287920 -375102 -310460 -20689 -451054 -14116 -105100
18756 -105100 -160960 -202515 -89400 7004 -129647 -20827 174625 250128 -273077 -301077 -25093
18744a23630B24068c48278a0889j37915g1619m7219c4340A16533b30524f9446
18733C5741e9577n1055E2568K635a42035G9271B0551a57802p687I6587K29865
18722C26452i4828B3720b81145A38596n0450h4158A61980a52296I1529f2040c0653
18710a7076C70989g8864m4161G656c5347A48177H537c02504E2966a26314f1040
18698D3581J00602a72173C2914g3370l32544A0513g7140A20070e9955N332q7433
18687a42056K2299m8562m4365k0236A7769J32805b70353J34629n1367B8679c86018
18675H7423l8470a92290G0188b20468c2226k02061A06874C9754J32397F1923i6250
18663a60564m7742M1720k892A18496J04515g6090l69314m6587a29511k13167B40697
$$ plain form
18744 -123630 224068 -348278 -10889 -148804 -71619 -118838 -34340 116533 -230524 -69446
18733 35741 -59577 -110632 52568 55203 -142035 79271 20551 -157802 -165489 96587 326452
18722 326452 -94828 23720 -281145 138596 88146 -84158 161980 -152296 91529 -62040 -30653
18710 -17076 370989 -78864 -123025 7656 -35347 148177 8537 -302504 52966 -126314 -61040
18698 43581 144183 -172173 32914 -73370 -405914 10513 -77140 120070 -59955 -54623 -142056
18687 -142056 -119757 -168319 -212684 -232920 17769 150574 -270353 -135724 -187091 28679 -386018
18675 87423 48953 -192290 70188 -220468 -32226 -234287 106874 39754 172151 61923 -96250
18663 -160564 -208306 -166586 -169478 118496 223011 -76090 -445404 -491991 -129511 -342678 240697
18651I4690O3317D1589i6737A62253j9222a18780m263q4504b6244H7739d1234
18639d91000b02219A77429G6969K3485f1932J7096j61160o1839j1976A48872o8907
18628G9965K4608c00846J36794A29542b57803o5259C87417e8864j20276I677a83555
18616h4351m53320a74544e6484A1630b04723D0522J11842b44470F67Q7488a66349
18604i124k08249K7026B6317n53a78154M9091r9431A7373b46211a06440M6717
18593e9723M054A1695a62195c4437o3855a9015k84213a39857P381r9901A42097
18581g1882E5132Q7419a74919j52766D16774E7323c69825B80872b1819A25970
18570a21329A24136C1826d5634C51099d5857A5813e53143f2478a4351A09356a93657
$$ plain form
18651 94690 158007 41589 -96737 162253 143031 -118780 -123043 -207547 -26244 87739 -41234
18639 -491000 -202219 177429 76969 100454 -61932 -44836 -205996 -267835 -279811 148872 79965
18628 79965 104573 -300846 -164052 129542 -257803 -323062 387417 -58864 -179140 9677 -183555
18616 -84351 -537671 -174544 -56484 11630 -204723 40522 152364 -244470 667 88155 -166349
18604 -9124 -217373 -190347 26317 25764 -178154 -129063 -228494 17373 -246211 -106440 -59723
18593 -59723 -55669 11695 -162195 -34437 -98292 -19015 -303228 -139857 -132476 -232377 142097
18581 -71882 55132 142551 -174919 -327685 416774 57323 -369825 280872 -21819 125970
18570 -121329 124136 31826 -45634 351099 -45857 15813 -553143 -62478 -14351 109356 -193657
18558b52542q3324A45844i4537E8603R8660B4616K48783a88607a6632j28766H6220
18546b06435i8920L9426j46856e2048F863J51591a22983M2814B89421o8681J04490
18535C25230F1397b10345j28644J43882H55d20579J890c1348H1263a5905A1886
18523a17247j73172H7468b58039i5677g859l40847G1691a83299b3654k06493E6899
18511b13302J1194f3342L0459A22595J52587b82928f3294C0643e9554A36129a36143
18499E4224b57640G0900c48506D690M13340A51869m7669D6276a65264G7593d44777
18487b1780A12698c8194j70250B39717a01790G1593a31380j21623J14489L7044
18477a01470B40883e8147k87528A28948P6436a61431E9541g8977B38831D6051
$$ plain form
18558 -252542 -335866 145844 -94537 58603 157263 24616 273399 -188607 -16632 -145398 86220
18546 -206435 -98920 -59494 -206350 -52048 6863 158454 -122983 -80169 289421 220740 325230
18535 325230 61397 -210345 -338989 -195107 855 -420579 -418689 -31348 81263 -15905 11886
18523 -117247 -290419 87468 -258039 -95677 -7859 -348706 71691 -183299 -23654 -230147 56899
18511 -213302 -202108 -63342 -32883 122595 275182 -282928 -63294 30643 -59554 136129 -136143
18499 54224 -257640 70900 -348506 4690 418030 151869 104200 46276 -165264 77593 -444777
18487 -21780 112698 -38194 -208444 239717 -101790 71593 -131380 -253003 -138514 -101470
18477 -101470 240883 -58147 -345675 128948 205384 -161431 59541 -78977 238831 46051
18466B09954H118b02034r020b4697B4777g7401A97639a20003b8142k66522d2576
18454A49386m4965J84936b69195A43189D1648a00004C98037d3998C0423g1417
18443F1930b10539c1498a4219r4717d0212G3927a29063k10860a02812F3895g7996
18431A2187g4612B34668q5589d5920B0980D082b0918r2629A16939k374K8669a48077
18418c28316A57811g3973A59441O9615a1708l6188A7106R8077c96244J88031e9802
18406c03887A66071b64971a5257A46555a06431j68668o6228a02923B28993a4449
18395a71494j60042J21926R8879E5770J10727a87250I9456a23947A09595C2513
18384A23298N2015i5930o4107F8411i1902B5237N5964a05480M8297j00481H8427
$$ plain form
18466 209954 8118 -202034 -211054 -24697 24777 -77401 197639 -120003 -28142 -294664 -42576
18454 149386 104421 289357 -269195 143189 41648 -100004 398037 -43998 30423 -71417
18443 61930 -210539 -31498 -14219 -108936 -40212 73927 -129063 -339923 -102812 63895 -77996
18431 12187 -74612 234668 149079 -45920 20980 4082 -20918 -113547 116939 114565 143234 -148077
18418 -328316 157811 -73973 159441 229056 -11708 -47896 17106 115183 -396244 -208213 -59802
18406 -303887 166071 -264971 -15257 146555 -106431 -275099 -341327 -102923 228993 -14449
18395 -171494 -331536 -209610 -110731 55770 166497 -187250 99456 -123947 109595 32513
18384 123298 175313 -95930 -160037 68411 -91902 25237 81201 -105480 -57183 -157664 88427
18372I200b9461n7844A43603e6340E2795a03297b269p162l9786B53039O0596j45792
18360A67843d9138H3206O4576a18375G0114d7714l35706J77332m9009C5303e2034
18348B6258J94392g7727f608k17964l1531A47581h3015D0868A9454c36274a11985
18336a57154O7104l98471d6306C0175e0879j62314D8548a22755j42463B10122
18325A21076L2982c81162g9193a264B6069c44295I7292a07710b1138C86360H1162
18313H6018a77821N0753j3311d2621m08967I1075b64894g4324I7281b31674H9685
18301A35542K2277f2193r4551C2104a58007A3193a44275L6728A71920a71777A65869
18289a51994f2854B43926A4692c26275a00902a6750m2326m8322E3689M5020Q2003
$$ plain form
18372 9200 -29461 -87305 143603 -56340 52795 -103297 -2269 -9431 -49217 253039 313635 167843
18360 167843 -49138 83206 147782 -118375 70114 -47714 -383420 -206088 -255097 35303 -52034
18348 26258 220650 -77727 -6608 -224572 -256103 147581 -83015 40868 19454 -336274 -111985
18336 -157154 -90050 -488521 -46306 30175 -50879 -213193 48548 -122755 -265218 210122
18325 121076 154058 -381162 -79193 -1264 26069 -344295 97292 -107710 -21138 386360 81162
18313 86018 -177821 -127068 -140379 -42621 -451588 91075 -264894 -74324 97281 -231674 89685
18301 135542 157819 -62193 -156744 32104 -158007 13193 -144275 -107547 171920 -171777 165869
18289 -151994 -62854 243926 14692 -326275 -100902 -16750 -59076 -107398 53689 98709 180712
18278A80712a56935B47214h0843b7385j89499A17259a33144I3281c79195a86093
18267b67460a0091A10182e2141l95692e4763A55195a65465A75759e7362n7207
18257a14569A84619Q0333H0121a58757m7575A8084J25518c95287f2170J2321k28163
18246b78012e0671A1241J26049L3690a41965E2175K22901a19774j61462f4900
18235C49844b90373J02355b9224j87645A13808A7588a80342o476R2010j31528
18225b26336d6752B32584b97310J47077E1937a06879A55123D6541c62476g4502
18214a11524c3461A51302b1973C01328D382Q7778h1303h48C4196J89826p3712
18203A50310k6388N7001N8739a61568J3153e4084k02974a26863m4791n8565n8309
$$ plain form
18278 180712 -156935 247214 -80843 -27385 -216884 117259 -133144 93281 -379195 -186093
18267 -267460 -10091 110182 -52141 -447833 -54763 155195 -165465 175759 -57362 -114569
18257 -114569 184619 264952 80121 -158757 -206332 18084 143602 -395287 -62170 -49849 -278012
18246 -278012 -50671 11241 137290 170980 -141965 52175 275076 -119774 -281236 -64900
18235 349844 -290373 -188018 -29224 -216869 113808 17588 -180342 -186818 -94808 -226336
18225 -226336 -46752 232584 -297310 -150233 51937 -106879 155123 46541 -362476 -74502
18214 -111524 -33461 151302 -21973 301328 4382 92160 -81303 -848 34196 224022 150310
18203 150310 123922 180923 239662 -161568 -148415 -54084 -257058 -126863 -171654 -230219 -288528
18192b88528O6535O2644I6464a06732k25170G6404N5941a30282c4309D25514b06682
18180A23038h7213k29458a54298L8567F0607A6673a03410b5503H0300b26511A03848
18168d8000A17075J90914a01068d0377E9658h1008m0891E8363a19228j7941J4467
18157a22702J6825A54023b08912B2311b52052o2589D377O8800J4990D3598d1447
18145C9162k954c74104J01807E099a40148F5580b4515I0162J20044G7446a73773
18133A42518l1784j340A4218d8887r4776C04679B9141g9587A81512P6341a966
18121f2809j86440d1241F7675h0593A78909B6543g4898A11244c94029A76058h5404
18109B87622l0669m032I2777b04930E3514K9967A2874d35682K14585k91671a61761
$$ plain form
18192 -288528 -221993 -159349 96464 -106732 -331902 76404 132345 -130282 -34309 425514 -206682
18180 123038 -87213 -316671 -154298 -115731 60607 16673 -103410 -25503 80300 -226511 103848
18168 -48000 117075 307989 -101068 -40377 59658 -81008 -121899 58363 -119228 -137169 -122702
18157 -122702 -105877 154023 -208912 22311 -252052 -314641 4377 73177 88167 43598 -41447
18145 39162 36208 -374104 -272297 5099 -140148 65580 -24515 90162 210206 77446 -173773
18133 142518 110734 109394 14218 -48887 -143663 304679 29141 -79587 181512 257853 -1966
18121 -62809 -249249 -41241 67675 -80593 178909 26543 -74898 111244 -394029 176058 -85404
18109 287622 256953 252921 92777 -204930 53514 83481 12874 -435682 -221097 -512768 -161761
18097a6383L370m8425j41371E44K93876b7723m10270B59257F7163J41726h885
18085B30794o8521B5795A1593J84529h946B18779g910j97130A36765H846b1242
18073c5504j3984G3627J15984p5095h8915a1047B64887b96747A21535d7860j69631
18062b17491k36502J73526j97157A08742a12804j401o8304B00677F235a17782
18051C9758O117b9713E0426N3382M5580e00963a39577K99A68271c32472A32842
18039F3832B7347J14104b28891a10978A32108k0849J15634I9091B6876a3887H6406
18027C7850b83072C0751a68649D0694j9192a08657E0911b99487J41249C5965j3916
18016B2049J33357E5183a11963A1799J04051j3189a07388j15240d9387l82095
$$ plain form
18097 -16383 -13013 -61438 -202809 544 294420 -27723 -437993 259257 67163 208889 -8885
18085 230794 162273 25795 11593 196122 -8946 218779 -7910 -205040 136765 8846 -21242
18073 -35504 -49488 73627 189611 114516 -88915 -11047 264887 -296747 121535 -47860 -217491
18062 -217491 -453993 -280467 -477624 108742 -112804 -114205 -182509 200677 6235 -117782
18051 39758 45875 -29713 50426 103808 149388 -500963 -139577 -139278 168271 -332472 132842
18039 63832 27347 141451 -228891 -110978 132108 111259 226893 99091 26876 -13887 86406
18027 37850 -283072 30751 -168649 40694 21502 -108657 50911 -299487 -158238 35965 22049
18016 22049 155406 55183 -111963 11799 115850 102661 -107388 -222628 -49387 -431482
18006d31482a4265k9710A33242i6451E8448d601l06051c552A00645R8076b36048
17994B6336O4932d4785A33428L1822o4869g1911m2177L4500q2981q3482a5353
17982a77776A39445A6114b4472A70215J35856I661N6143J6900K236a61059K6143
17971a34916d7863j54092P1616N3500j88647A57794a9375j03574j46845g4219
17960a95006o3836H0533f353A05085c0545D4955L6957K27124a69488A8195d25579
17948e341k88059I9464B3724b41495J17000j55722b1605A06932b03606d4213r8103
17937a42316p3790B76655B3233K324J6602M778c08028c345G1174i84j05591F2329
17924A1896O159L2080c11271j86044b39514h9701C24096a75556L1766n7678i1495
$$ plain form
18006 -431482 -14265 -43975 133242 -96451 58448 -4601 -310652 -3552 100645 198721 -236048
17994 26336 91268 -44785 133428 165250 100381 -71911 -114088 -79588 -162569 -246051 -15353
17982 -177776 139445 16114 -24472 170215 306071 9661 65804 82704 84940 -161059 -134916
17971 -134916 -47863 -201955 -130339 -76839 -265486 157794 -19375 -122949 -269794 -74219
17960 -195006 -258842 80533 -6353 105085 -30545 44955 81912 309036 -169488 18195 -425579
17948 -5341 -293400 99464 23724 -241495 -124495 -280217 -21605 106932 -203606 -44213 -142316
17937 -142316 -216106 276655 23233 25557 42159 46937 -308028 -3345 71174 -984 -106575 62329
17924 11896 18055 50135 -311271 -497315 -239514 -89701 324096 -175556 -143790 -201468 -91495
17912I139M2495J0172Q369b30889B2563c62781B84100g3769j15840i2947j42238
17901b35185B4099J51927l7806R8097a60984k17953f1577A43312D7228d7570B66618
17889A54006f6347G2644d6608r3214m8848b7823j53167j94387A89356k8838e7161
17877b5051j41175j57744A48373d53686b21892H2381d9505p7641H2980J62136
17867B45116H2667c28829a17354c765B31718L5868e5202G0349b0805i55F7633
17855A71986R8396a6935F3435K61830a55741H9340a48711n238P0146c8556A33426
17843A6862b16288c523C1691J11811h3157A9013b71535C0699a11655l0336A79213
17831A0155O8004a01176I0514a28010L7788E3343a06069C3462M12808b21392B1482
$$ plain form
17912 9139 51634 61806 70175 -230889 22563 -362781 284100 -73769 -189609 -92947 -235185
17901 -235185 24099 176026 138220 236317 -160984 -378937 -61577 143312 47228 -47570 266618
17889 154006 -66347 72644 -46608 -139822 -188670 -27823 -180990 -375377 189356 160518 -57161
17877 -25051 -166226 -323970 148373 -453686 -221892 82381 -49505 -127146 82980 245116
17867 245116 82667 -328829 -117354 -3765 231718 267586 -55202 70349 -20805 -955 67633
17855 171986 270382 -16935 63435 325265 -155741 89340 -148711 -153949 -83803 -38556 133426
17843 16862 -216288 -3523 31691 143502 -83157 19013 -271535 30699 -111655 -141991 179213
17831 10155 78159 -101176 90514 -128010 -90222 53343 -106069 33462 446270 -221392 21482
17819A7971f0354B32368i2107j07061Q8153q7626B7691J14756N3994H0450R1850
17808A72300b62375A03795b30266C14594D4239J26204B8033a7299j39823b9886
17797A78902J15606A11445a40062E4438k0864M0995c6l13403B09756a18843K1292
17786i7551A30561i079A04037J96148p5891b03721E0998J35660C6292K24077a10163
17774c31722h6652l2352C57K30132r0310B9109a19937p6088e9483A10927J24888
17763B35815G5551b044j87325A36702m4284j6839b45619l7341L1259B3069L1995
17752E5064f6294B11289C3328N8702d6929B66650A07375J98626k8050q3615E4297
17740I3240q339b28517C51249a70056I5987k1248h8269q0069c1192j39512j27620
$$ plain form
17819 17971 -60354 232368 -92107 -199168 -111015 -198641 27691 142447 196441 80450 172300
17808 172300 -262375 103795 -230266 314594 44239 170443 28033 -17299 -157122 -29886
17797 178902 294508 111445 -140062 54438 33574 74569 -36 -313439 209756 -118843 -97551
17786 -97551 130561 -9079 104037 300185 224294 -203721 50998 186658 36292 260369 -110163
17774 -331722 -86652 -119004 357 230489 140179 29109 -119937 -196025 -59483 110927 235815
17763 235815 75551 -2044 -189369 136702 92418 75579 -245619 -282960 -251701 23069 55064
17752 55064 -66294 211289 33328 92030 -46929 266650 107375 306001 277951 194336 54297
17740 93240 84901 -228517 351249 -170056 95987 74739 -88269 -168338 -31192 -170704 -298324
17729b98324E3350P0345F1245R3727G5993b47920M3830R5323B23620a5491j5990
17718c1481F1942K10616r8737F9306J32611J969J97647B3285f8205k53232D259
17706b53692a01425b8286A94157a68597B02126h3437n7045C04158d8190A11551
17695C09366a80792A86559H8454a03784k74007g7260A75785a48836B55411R8924
17685C54335A12719i8689A94997n5402Q9324c2517A91024b57374b9182m0345n3584
17674a23111G7464b68081g4217A03880j2967a9993A93569h7362B10617P771j02401
17663A15987h7489B33081h6895D6457a66453C2121K18265j12475a15113e4487
17652a53938L2609p0583N1942C1549j1330N2239j0334j5468K6317J5410L1264
$$ plain form
17729 -298324 53350 123695 61245 154972 75993 -247920 -204090 -108767 223620 -15491 -31481
17718 -31481 61942 272558 173821 69306 201917 203886 401533 23285 -68205 -321437 4259
17706 -253692 -101425 -28286 194157 -168597 202126 -83437 -140482 304158 -48190 111551
17695 309366 -180792 186559 88454 -103784 -377791 -77260 175785 -148836 255411 354335
17685 354335 112719 -98689 194997 139595 228919 -32517 191024 -257374 -29182 -69527 -123111
17674 -123111 77464 -268081 -74217 103880 90913 -19993 193569 -87362 210617 218388 115987
17663 115987 -87489 233081 -86895 46457 -166453 32121 250386 137911 -115113 -54487
17652 -153938 -121329 -191912 -139970 31549 20219 72458 62124 46656 72973 88383 119647
17641A19647i5497F3623K7754l0403B3345J5181J01053i0535A22499b85060N7080
17630b27980P3985L4508H2051c11245A20906f2265A24276c63785A34789D9278
17619b14589B12951A1172J00760e0352D3516B1294J4499e277A509b66860E9340
17607g9601A23990k9674c25159A3489Q5128f3744k12817c9508A71516J09505b06586
17595A20382J66488i2674k16568e102H1966K08070A5130a11069j4206A88832e0619
17583A40431O6036C5952Q144K69998D3248L1278i4543B74605B6498L2682a10713
17571A31493j5096a06699n7038A87775n9642L7294a46635A60662N3970G4618J50281
17560B24899a78183H0928k0123L2447A3262K4219R6546c13744B471J48420M1498
$$ plain form
17641 119647 -95497 63623 91377 60974 23345 38526 139579 -90535 122499 -285060 -227980
17630 -227980 -153995 -119487 82051 -311245 120906 -62265 124276 -363785 134789 49278
17619 -214589 212951 11172 111932 -50352 43516 21294 35793 -5277 1509 -266860 59340
17607 -79601 123990 94316 -325159 13489 98617 -63744 -276561 -39508 171516 281021 -206586
17595 120382 286870 -92674 -309242 -5102 81966 290036 15130 -111069 -125275 188832 -50619
17583 140431 206467 35952 44096 314094 43248 74526 -94543 274605 26498 59180 -110713
17571 131493 116397 -106699 -163737 187775 128133 165427 -146635 160662 214632 74618 224899
17560 224899 -178183 80928 60805 93252 13262 37481 134027 -313744 2471 150891 192389
17549A92389C7978K21097A03407k3026a40426A93245M4479a3660B9289d1531D35392
17537A01700b92999J2266B51391B0928L9812L83504C1353a01244D9305J47288
17527A96593g6277L0275A33691a16066E432d0732C1730N3432b54060D76485I23
17515E1769L70324j49549H9954a1635M849B6413h939B75180f9354k001B78377
17503a6077n4264A22404A4404K29622b0418A27662i8388A20406L69140i0001A81970
17491H3341A490a11764J5038j63525A77382A0195a12878B33094D4438a69477C35115
17479a71893A14407L46455j13189l9177a22281k6860B1829K76287I557e7237A20147
17467h7119K764J2838A13844c6069A26691P9837L85516B64865J86034a57899G2139
$$ plain form
17549 192389 37978 259075 103407 80381 -140426 193245 237724 -13660 29289 -41531 435392
17537 101700 -292999 -280733 251391 20928 60740 444244 31353 -101244 49305 196593
17527 196593 -76277 -46002 133691 -116066 5432 -40732 31730 85162 -254060 476485 923
17515 51769 422093 272544 89954 -11635 -6786 26413 -8939 275180 -69354 -71355 278377
17503 -16077 -70341 122404 14404 244026 -20418 127662 -98388 120406 489546 -90001 181970
17491 83341 1490 -111764 -96726 -260251 177382 10195 -112878 233094 44438 -169477 335115
17479 -171893 114407 460862 347673 308496 -122281 -149141 21829 298116 9557 -57237 120147
17467 -87119 -84355 -71517 113844 -36069 126691 206528 592044 264865 450899 -157899 72139
17455A09145A5574K65158J8973j05002K74487j78572h9321B84671J61455j87816
17445B58310J7492k3535I5153K9918M23722H5427K44055o8387I5449L42216I9994
17433A65926J45197a18787A1422J39951Q0803j10429K2743J50329g2240B56246
17422H1395a2434A58827K0004K31738A18304K09743A38104a03612B3587K7630
17412E1217c6472A38583J6739J9251F2955K42923q1643B3940J93694A7387J41505
17401A58892B2494J80839L49454B6748J73733i485A45775J54243A15615B7301
17390E1452J86420c80917B18398H8121J012L39233A00913R8239a10727A60089
17379B11352c9649C51927i211A88284J55756N3915A02825J42971a38216B29577
$$ plain form
17455 109145 15574 280732 299705 194703 469190 290618 -89321 284671 446126 258310
17445 258310 275802 252267 95153 125071 548793 85427 329482 261095 95449 437665 99994
17433 165926 311123 -118787 11422 151373 232176 121747 144490 294819 -72240 256246
17422 81395 -12434 158827 178831 410569 118304 328047 138104 -103612 23587 51217
17412 51217 -36472 138583 155322 174573 62955 305878 224235 23940 217634 17387 158892
17401 158892 22494 203333 552787 26748 200481 -9485 145775 300018 115615 27301
17390 51452 237872 -380917 218398 88121 89133 428366 100913 199152 -110727 160089
17379 211352 -39649 351927 -9211 188284 344040 397955 102825 245796 -138216 229577
17368b4020C74310j51831h9700C4838M52816A64284k1165G0248h9712H6477j9741
17357F6736K0395c0932A46843K53003B7404f8172C97738E9001K14503J0621q7984
17346A96141H359L9509b94296B55749F6905J60530m9718P7005f4552B86678R6025
17335C82703D1854J04939J41117O4520A28626f876C89827b41117B48836b25597
17324A95882g4569F6117L1443a7121H855K20343c2947j3505A36161o3806a21380
17312A49575L25658B11014O8765o1093F0621a14052B34800a55936E08664i1298
17301B05126K53767A56491d1076C52837r1882n7660G9266K44293K2653C0398K12219
17290B42617J75658A34987J14915N638A11582M6531c33432A61704K5851D0460
$$ plain form
17368 -24020 374310 222479 -89700 34838 487654 164284 143119 70248 -89712 86477 66736
17357 66736 87131 -30932 146843 399846 27404 -68172 397738 59001 273504 284125 196141
17346 196141 8359 47868 -294296 255749 66905 227435 177717 254722 -64552 286678 382703
17335 382703 41854 146793 287910 352430 128626 -6876 389827 -241117 248836 -225597
17324 195882 -74569 66117 97560 -17121 8855 229198 -32947 -46452 136161 72355 -121380
17312 149575 475233 211014 279779 218686 60621 -114052 234800 -155936 508664 -91298
17301 205126 458893 156491 -41076 352837 260955 203295 79266 323559 346212 30398 242617
17290 242617 418275 134987 249902 255540 111582 158113 -333432 161704 187555 40460
17279d1974B24689a5338k2535A89120H8362J49631k1386l9768q158k6785k883
17268A39013f1352B59064K67656B16634o9374H768J22139D0547N36756B15232
17257C82986C0642a6339A09383D5919K92902E468L63481j04904m8829B8142K48106
17246B76248B1636L65153e3825C34052A09470L59930a07859D25414j4619A87366
17235C67279I8388J49932K77165A50110J83105j20709K96360a43090j06436A08796
17224C73711j09419r0877N5051k2516O7838H8804J46272F8587d45851C7357M8322
17213H5679Q4034G3272L82949J5164j34353b2286C24560a3474A68964n993K45713
17202D08684a09730B34467n1692M5969n3330J93860j46468b8059A52471O4447
$$ plain form
17279 -41974 224689 -15338 -37873 189120 88362 237993 216607 176839 168681 141896 139013
17268 139013 -61352 259064 526720 216634 147260 8768 130907 40547 577303 215232
17257 382986 30642 -16339 109383 45919 338821 5468 368949 264045 215216 28142 276248
17246 276248 21636 386789 -53825 334052 109470 469400 -107859 425414 410795 187366
17235 367279 98388 248320 525485 150110 333215 212506 508866 -143090 -249526 108796
17224 373711 264292 173415 228466 205950 273788 88804 235076 68587 -445851 37357 85679
17213 85679 169713 73272 456221 471385 337032 -22286 324560 -13474 168964 162971 408684
17202 408684 -109730 234467 182775 228744 175414 369274 222806 -28059 152471 216918
17192B16918J0610J80572j62588J13093P9638j39362J10489j42241j15424h0809
17181A67929e1996K364D03576o5826j00853q518L3511C4131M25300G8229J3482
17170I1711C6662K63172J0141M2239C6424K78254L4718A68352K10929j65984C3532
17158a11538B70727a5997B89184A06622J28708J3940N19272B62304J83238k0621
17148D24921A52503k9824R5637O4357J24393n6982j0099l4878I9091K80060A48045
17136B09130K48174j96661J22808L57398A73962J90074I2315K06166J0257j33387
17126A75351M34594B02240H5565L60375j04231o853J05227k4774q957j96723L81523
17115E91152j50696J4015j25167K8769J6216j66338k3710B8054J97465R4809J75202
$$ plain form
17192 216918 227528 408100 245512 358605 438243 298881 409370 267129 151705 -80809
17181 167929 -51996 -49632 403576 337750 236897 228379 261890 34131 459431 78229 91711
17170 91711 36662 299834 309975 352214 36424 314678 349396 168352 379281 213297 33532
17158 -111538 270727 -15997 289184 106622 235330 249270 768542 262304 445542 424921
17148 424921 152503 122679 218316 282673 407066 350084 339985 305107 99091 379151 148045
17136 209130 457304 260643 383451 740849 173962 364036 92315 298481 308738 175351
17126 175351 609945 202240 85565 445940 341709 334856 440083 415309 406352 209629 591152
17115 591152 440456 454471 329304 358073 374289 207951 184241 28054 225519 320328 495530
17104D95530j20454K04269j26808l4827J65623k79229o9941J36472L57907A73916
17093E64541k10495O1288m4684j23648L3732A28912Q1767N35557l29713j52225
17083B64298K09815k30315o1799M00273J27188l6458j81215K19665B19593J25800
17073C45393L17653B73625n4444K51262P0157o0149A32932K45790J93846j12117
17063D60451q218p0816j64979K89946B05046L94692m3354r0844A84338L15070
17053D99408J12849l8616J34244j13110B09515K37602j25055J66729K61218k63534
17043D86475J11344k19895J59481K31358j04609J07189k92403j08941L46457J07180
17033H23636j80738B94799K42226O1571J01812o4348l866M8517l10511L15366
$$ plain form
17104 495530 375076 579345 452537 417710 583333 304104 234163 370635 728542 173916
17093 564541 354046 415334 370650 247002 280734 128912 210679 746236 416523 264298
17083 264298 474113 243798 181999 582272 709460 673002 491787 711452 219593 345393
17073 345393 663046 273625 219181 470443 540600 480451 132932 378722 572568 460451
17063 460451 452233 381417 216438 506384 205046 599738 556384 465540 184338 499408
17053 499408 612257 573641 707885 594775 209515 447117 322062 488791 750009 486475
17043 486475 597819 377924 537405 768763 664154 771343 478940 369999 716456 823636
17033 823636 642898 294799 537025 598596 700408 636060 632194 680711 370200 685566
17023F85566l24850L82174j35982l642L78501j47742P5344k83702J02452j91597
17013E36522M15106k47644k9975M8413q8104j68370K52346l6854K73117n509D66382
17001D22351J97107J46596N8815P9190q7351P1910j2066j64294J85136J3334k66156
16990F44572J89199N6550j95638M4012J17024j89734K41863j53923r5296K03303
16980H61932J86645l4734l33970J77377J27874j58963j11617p3966J21647Q1992
16970H44217l46602M26670j13668R6474l1569J80902k4335j13518j37330M71607
16960A252848l64829j18802K12023J00722K34971q5637m46993o2368J17375K37462
16950A076772O1469k44625R9370R6805k77839L43384j68826M7002J24150J23633
$$ plain form
17023 685566 360716 742890 606908 603266 981767 834025 909369 625667 728119 536522
17013 536522 951628 703984 674009 722422 634318 465948 718294 681440 954557 949048 466382
17001 422351 619458 766054 824869 904059 816708 888618 876552 712258 897394 910728 644572
16990 644572 833771 890321 694683 738695 855719 665985 907848 753925 658629 861932
16980 861932 1048577 1013843 679873 857250 985124 826161 714544 640578 762225 844217
16970 844217 497615 924285 810617 907091 875522 1056424 1032089 918571 781241 1252848
16960 1252848 888019 769217 981240 1081962 1316933 1231296 784303 721935 839310 1076772
16950 1076772 1138241 893616 992986 1089791 811952 1155336 986510 1033512 1157662 1281295
16940A281295j99871Q3619o4548J26825j86754K55664k87157N63589l58234k87627
16930I26801K85466o9060M7278K09212L95306n85240J20525K30162j66542j13095
16920A280813j30375J28922l1423Q2186M78917l73694K08963j23302J78806j74256
16910A525557K12329p1884k07419J82544K43323k60735K91684l99829k19751O40433
16900A936252K5121k25484j90669j18009O93393o57450J65535Q4950K26194m49185
16890A490648N00836j42755Q6598J69600L4812l8118j19025J68683k12835L4202
16880A972646j11198K83522k16662K73370J48618L49212k35130j30734j16725
16871B216919R1115k4227K79735j59033K6491J68225l96388N20020R426m61992
$$ plain form
16940 1281295 1081424 1165043 1100495 1227320 1040566 1296230 1009073 1572662 1214428 926801
16930 926801 1212267 1143207 1190485 1399697 1795003 1209763 1330288 1560450 1393908 1280813
16920 1280813 1150438 1279360 1247937 1330123 1809040 1435346 1644309 1521007 1699813 1525557
16910 1525557 1737886 1666002 1458583 1641127 1884450 1623715 1915399 1515570 1295819 1936252
16900 1936252 1961373 1735889 1545220 1427211 2120604 1463154 1628689 1713639 1939833 1490648
16890 1490648 1991484 1848729 1935327 2104927 2139739 2101621 1982596 2151279 1938444 1972646
16880 1972646 1861448 2144970 1928308 2201678 2350296 2699508 2464378 2333644 2216919
16871 2216919 2308034 2283807 2563542 2404509 2431000 2599225 2202837 2722857 2732283 2270291
16861B270291Q21921k48251p6448J07651Q1433k1374L7470M4375J23472j60666
16851B979874K95375K28474m03116K92176j12267j9205J29666J62283k39955K54923
16841C568228p9488L70545n4208J00117J0864k4712J97503J80420j62733K92607
16831D399143P7025o108o5391N53939n19455J69369L76982j03830j09817K54215
16821E026072M74334k38200L83273k39619o2516N13024r5455N57332n58054O86458
16811F446649J81337l16989J56440j167L38039K16237L48229j51940L21272l81728
16801G156379L63913K97760O8774L42313q8526K74600K30546M22470p1117L73516
16791I370628M67342K5194K91922K45853K30162N03436J30513J49970M59382M96503
$$ plain form
16861 2270291 3092212 2843961 2767513 2875164 2956597 2935223 2972693 3017068 3140540 2979874
16851 2979874 3275249 3503723 3100607 3392783 3280516 3261311 3390977 3553260 3313305 3568228
16841 3568228 3488740 3859285 3805077 3905194 3916058 3891346 4088849 4269269 4106536 4399143
16831 4399143 4476168 4470060 4404669 4958608 4439153 4608522 4985504 4881674 4771857 5026072
16821 5026072 5500406 5262206 5645479 5405860 5343344 5856368 5760913 6318245 5760191 6446649
16811 6446649 6627986 6310997 6467437 6466270 6804309 7020546 7368775 7216835 7538107 7156379
16801 7156379 7520292 7818052 7886826 8229139 8140613 8415213 8645759 9068229 8997112 9370628
16791 9370628 9837970 9863164 10155086 10400939 10631101 11134537 11265050 11415020 11874402 12370905
16781A2370905K36103L08582M43245K21667K53603J107257P8939M13955O86401
16772A6120657N14658N37600K44289R67525J38042J112632O33643O54201R58079
16763B1881326O58377Q36413Q13951Q30865J228231Q81910J327920J080500J427596
16754C0967089J303445J369364J541645J332864J954562J960085J790637K252219
16746D4471910K068784K383007K074512L197821K790693L109726L501571L569910
16738F7167934L957189M051207M088188M979179M745590N852453N525391O096332
16730A06463463O243367O899659O830258P237504P502695P422010P852544P704114
16722A64155614P168345O467903N617819N513233L725340K725647J159261r7017
$$ plain form
16781 12370905 12607008 12915590 13358835 13580502 13834105 14941362 15020301 15434256 16120657
16772 16120657 16635315 17172915 17417204 18384729 18522771 19635403 20269046 20923247 21881326
16763 21881326 22539703 23376116 24190067 25020932 26249163 27131073 28458993 29539493 30967089
16754 30967089 32270534 33639898 35181543 36514407 38468969 40429054 42219691 44471910
16746 44471910 46540694 48923701 50998213 54196034 56986727 60096453 63598024 67167934
16738 67167934 71125123 75176330 79264518 84243697 88989287 94841740 100367131 106463463
16730 106463463 112706830 119606489 126436747 133674251 141176946 148598956 156451500 164155614
16722 164155614 171323959 177791862 183409681 188922914 192648254 195373901 196533162 196436145
16714A96436145j120484k572610m003187n132060o017147o975142p163012p701988
16706A55750515p769724p903201p832654p682547p396275p085992o648456o398410
16698I7033256n643285n826143m857568m679039m826532m048454m096231l568923
16690E9487081l128950l395885k327442l025774k677429k093656k028292k176488
16682C8633165j810319j911809j670703j223706j513200j419625j466471j221666
16674B6395666r72915r35200j241426j187600m84159r06228q70075o85446r20510
16665A8192107q35499l40023l88700n76485l92896q46139o98382j775p41983n04739
16655A2865486k41011l30686k95262m83121m59262k29689n62855l0409l45741
$$ plain form
16714 196436145 195315661 192743051 188739864 183607804 177590657 170615515 163452503 155750515
16706 155750515 147980791 140077590 132244936 124562389 117166114 110080122 103431666 97033256
16698 97033256 91389971 85563828 80706260 76027221 71200689 67152235 63056004 59487081
16690 59487081 56358131 52962246 50634804 47609030 44931601 42837945 40809653 38633165
16682 38633165 36822846 34911037 33240334 32016628 30503428 29083803 27617332 26395666
16674 26395666 25422751 24487551 23246125 22058525 21574366 20668138 19798063 19112617 18192107
16665 18192107 17356608 17016585 16627885 16051400 15658504 14812365 14113983 14112208 13370225 12865486
16655 12865486 12624475 12293789 11998527 11515406 11056144 10826455 10263600 10233191 9887450
16646I887450j34504k31389m79827j86709l81222j88413n0866k89787k9680o26293
16636G288760J12793m53693p4783R2085l48777q8400j94221j56317j54214o4945
16626E958288j69898M1680l78684k79613l38217J83602K88230m51540j85737m4991
16616D623120M8723l05945j58214J56982k35268J26431j27237n5725K08769n47240
16606C734396J9199k80824J39757k38722m0460J56262o591j86919j19416n5987
16596C120695k34969M35391p1777L0064l68910O4121k16446p822P4446k48027
16586B576766m0483p5091K66608M124l70283k26400M32733j40572k73686k30286
16576A923430J93049K56542J19058k77907k89667K38125K38275l78598P6789k41925
$$ plain form
16646 9887450 9752946 9521557 9041730 8855021 8473799 8285386 8234520 7944733 7915053 7288760
16636 7288760 7401553 6947860 6873077 6965162 6616385 6527985 6333764 6177447 6023233 5958288
16626 5958288 5788390 5830070 5451386 5171773 4833556 5017158 5305388 4853848 4668111 4623120
16616 4623120 4671843 4365898 4207684 4364666 4129398 4255829 4128592 4072867 4281636 3734396
16606 3734396 3753595 3472771 3612528 3373806 3333346 3489608 3483017 3296098 3176682 3120695
16596 3120695 2885726 3321117 3249340 3279404 2910494 2974615 2758169 2750347 2824793 2576766
16586 2576766 2536283 2461192 2727800 2731924 2361641 2135241 2567974 2427402 2153716 1923430
16576 1923430 2116479 2373021 2492079 2214172 1924505 2162630 2400905 2022307 2099096 1857171
16566A857171J39933k26108K89276K0736l13112Q3940k76052j9224J50797n1008
16556A656349j25098L25226l91091P0055q0190N2765Q14R5159n1706l4061j81657
16545A336565K25102l14173M23376l753l35524m5612j58876L60472J78833m73774
16535A192636k7434r8292L98262o5378k8709j97174J3645K9785r3455Q1786k51013
16524I54659R4263j28062n6546K54796k04315P14111o05747N4711j5348J10739
16514A173261j09598K25823m07574L46301k18906k44012M43632C57383M31125
16505G88508L33124j74441P1312J64329m13412Q8904J94248k65728l13659L44384
16495H17569J43212j50955j83209J15980m7874L38093j99921j08287J69098k13588
$$ plain form
16566 1857171 1997104 1770996 2060272 2081008 1767896 1851836 1575784 1556560 1707357 1656349
16556 1656349 1531251 1856477 1465386 1535441 1455251 1508016 1508830 1603989 1552283 1518222 1336565
16545 1336565 1561667 1247494 1670870 1667117 1331593 1285981 1127105 1487577 1666410 1192636
16535 1192636 1165202 1066910 1465172 1399794 1371085 1173911 1187556 1217341 1123886 1205672 954659
16524 954659 1048922 920860 864314 1119110 914795 1628906 1023159 1077870 1062522 1173261
16514 1173261 1063663 1289486 881912 1228213 1009307 765295 1208927 357383 788508
16505 788508 1121632 947191 1018503 1182832 769420 858324 1052572 786844 473185 817569
16495 817569 960781 809826 626617 742597 694723 1032816 832895 724608 893706 680118
16485F80118L39631j63529k25243L9837j50185N19811k38254l16904K12925k73670
16475D24537O6636M34038k01844j47680j738M6879q5209K32545k95607n5259R5577
16464E12875L6596P7453l9697j12614J42304J51041l34407r5150o0901L00796
16454E78296r3188N3119k05340L12802k00541J04244k12835A37763M73469k12658
16444C98574K35813n7866L5331B85296J83725K50719r6631l11137L42863j61419
16434D93416K70187k25694L4358j28166j28342L08983j69358m2984o4168J8939
16424C67171O2553j79298J74232Q1926K10674l20159R8562K3861o3845r2875J18348
16413D81150j46950A37971K84761k07987j04703K59813q9254M04541A88987k857
$$ plain form
16485 680118 1019749 856220 630977 670814 520629 1040440 802186 485282 698207 424537
16475 424537 491173 925211 723367 575687 573949 620828 535619 768164 472557 417298 512875
16464 512875 549471 626924 587227 474613 616917 767958 433551 338401 277500 578296
16454 578296 485108 538227 332887 645689 445148 549392 336557 137763 611232 398574
16444 398574 634387 576521 611852 285296 469021 719740 623109 311972 654835 493416
16434 493416 763603 537909 572267 444101 315759 624742 455384 412400 348232 367171
16424 367171 429724 250426 424658 506584 717258 397099 495661 519522 455677 362802 481150
16413 481150 334200 137971 422732 214745 110042 369855 280601 685142 188987 186130
16403A86130L83301k13588L26667l13762A26350J92363I7441J36425r2724K35170
16393C76312H7232L74194J54614A27844J84770A16828J61671p5998K96478k23986
16383B74993m1158L53049e1506B28425k1924M3068r440q6993a02788B18793J02606
16372C21399A36271K25031J2857A49230J62224J6130A36387N2467K85552A05862
16361G34676b9821C28937j60875O459J40472j528l4498Q8336J8615r5979K4490
16350C14429j00193o630J42699q2104b6834C00772M827p3629j06576J9576L86856
16339E31826A87596J04350A19399J01377e3582A25798K21371M1819M7238C824
16328H4470J57328A20005C5754C753P3689b41072i2334A47497J69946d3912A12520
$$ plain form
16403 186130 569431 355843 682510 368748 126350 318713 97441 233866 141142 376312
16393 376312 87232 461426 616040 127844 312614 116828 278499 202501 498979 274993
16383 274993 233835 586884 -51506 228425 206501 249569 240129 153136 -102788 218793 321399
16372 321399 136271 361302 374159 149230 311454 327584 136387 188854 474406 105862
16361 734676 -29821 328937 168062 174521 314993 313465 278967 367303 385918 289939 314429
16350 314429 214236 207606 350305 268201 -26834 300772 305599 231970 125394 144970 531826
16339 531826 187596 291946 119399 220776 -53582 125798 347169 388988 436226 3824
16328 84470 241798 120005 35754 3753 77442 -241072 -92334 147497 317443 -43912 112520
16316C3646M53331C4921a76106M9219E4178B4131K34037F7903J80218o8065m3292
16305A36764E4179L38288o2940l5043a347B68423j33306K98352d0504B13140E2626
16293G6540O6141a57193A30465K76633r8154q8742l0300J69286f4284A2505J74485
16282A86990a8038B07765M056a29234A25327A4968Q5250b46625B63544j12198
16272A51346J15270F3634J66361A09659M9066p4359d5378a0345k7974A08105a47146
16260C04018F5626A5049g1073j43715A05026Q5355j1595J41910n0563a117F8369
16248C5889A2156e0671A09964K07911E2106J03540L7688p3520J02265a49557B12588
16236I3399P4632b65097b3005d295q1464A46501l5761i9608A53099F2853e785
$$ plain form
16316 33646 486977 34921 -176106 -126887 54178 24131 258168 67903 248121 180056 136764
16305 136764 54179 392467 329527 294484 -1347 268423 135117 433469 -40504 213140 52626
16293 76540 142681 -157193 130465 407098 308944 220202 189902 359188 -64284 12505 186990
16282 186990 -18038 207765 211821 -129234 125327 14968 100218 -246625 263544 151346
16272 151346 266616 63634 229995 109659 158725 84366 -45378 -10345 -38319 108105 -147146
16260 304018 65626 15049 -71073 -214788 105026 190381 178786 320696 270133 -1117 68369
16248 35889 12156 -50671 109964 317875 52106 155646 193334 119814 222079 -149557 212588
16236 93399 168031 -265097 -23005 -4295 -85759 146501 110740 -99608 153099 62853 -5785
16224i2684B87348d5919k0142r529n384p5054A68298e4086E4901k2572J15128
16213A47457a03265C6456N2956p863g3088A70263i0959C6162C053b18515Q9834
16202a28681m6466c3109C03309b4092g036j03682A22836L8197N9304a88640p6042
16191b64682K8702B35363b3916E4617a14164k8324O4952B32709H0947O8487c16998
16179A63928d6998A42970b54624d4356D98121b5963l78471a92683f9824C14245
16168a58360b8461A39168F0140k4584d11424e2227B37104j05881K6141F8471c78319
16156d37958D6195i5546J580D5203O2807a69310D1168a02414C57306A07970h0047
16144a30154d6809C8405R892J16143k0420i4042p5522A23021L3321o1955i871
$$ plain form
16224 -92684 287348 -45919 -66061 -75590 -80974 -156028 168298 -54086 54901 32329 147457
16213 147457 -103265 36456 89412 81549 -73088 170263 -90959 36162 3053 -218515 -128681
16202 -128681 -175147 -33109 303309 -24092 -7036 -110718 122836 161033 220337 -188640 -264682
16191 -264682 -235980 235363 -23916 54617 -114164 -142488 -77536 232709 80947 149434 -316998
16179 163928 -46998 142970 -254624 -44356 498121 -25963 -404434 -192683 -69824 314245
16168 -158360 -28461 139168 60140 35556 -411424 -52227 237104 131223 157364 68471 -378319
16156 -437958 46195 -95546 -93966 45203 108010 -169310 41168 -102414 357306 107970 -80047
16144 -130154 -46809 38405 48297 164440 144020 -94042 -169564 123021 156342 94387 -9871
16132A31540c63o6972j46663Q8302K3094q4365J9312e0892j45733N361A28261
16120I1720b25411R6291c7705m5522N244B09794C1718N9522c09340A45454p0521
16109G4933P278i6931A35419Q1119k2066m4824L03222j89867r3312m3645g5682
16097A74044B6561a14258C62037H1827J86158I8888k6036a01658j27199A27283
16086H7495J20892A540a00839G3898d8173l6011D4302a67614j9361A57517o5540
16075I1977b90000k4265R8020j28446A8750J24440a01230n0305F3076a61577O2588
16064i8989A55910f4710j2751E6226b51561C95698D0241d317E1430a03781B55295
16052a3365A19298a0328C5846J59675c76836C9176a60327A02727K7962R0324o3336
$$ plain form
16132 131540 -363 -67335 -213998 -125696 -102602 -186967 -167655 -50892 -196625 -191264 128261
16120 91720 -225411 -129120 -37705 -83227 -77983 209794 31718 91240 -309340 145454 74933
16109 74933 82211 -96931 135419 216538 194472 149648 452870 263003 169691 126046 -75682
16097 174044 26561 -114258 362037 81827 267985 98888 72852 -101658 -228857 127283
16086 87495 208387 1540 -100839 73898 -48173 -84184 44302 -167614 -186975 157517 91977
16075 91977 -290000 -314265 -216245 -344691 18750 143190 -101230 -151535 63076 -161577 -98989
16064 -98989 155910 -64710 -77461 56226 -251561 395698 40241 -4317 51430 -103781 255295
16052 -13365 119298 -10328 35846 195521 -376836 39176 -160327 102727 130689 221013 157677
16041A57677d6243l10484f6075L2319B25597C819J09881D7612d05955E2433b16487
16029a47925j15760I6087K50295a91679F1275K4626m0299c66437J05671A16316
16018F4655b42243A49761K1823n8230K65859p125j50989a69834A33772e8597k29612
16007b88209h2619k35625a17682e0501l0912j21130A01561N2879c91312J38449
15997b52863g4342f205m61109a88792k17516a53631A56872p311e5775H8144l9147
15986D8997K43515b92431B75978A20976J76180L6805A57680b7107C38257d3219
15975F4489K59238b72957E7885b23314q035C6231P9084j1619b8527l32372k555
15964c63454M790J23608B4765a53366J626m6494F5280O443J38658b67348f5618
$$ plain form
16041 157677 -46243 -356727 -66075 -33756 225597 3819 113700 47612 -405955 52433 -216487
16029 -147925 -263685 96087 346382 -191679 61275 85901 45602 -366437 -260766 116316
16018 64655 -242243 149761 171584 113354 379213 372088 221099 -169834 133772 -58597 -288209
16007 -288209 -82619 -318244 -117682 -50501 -81413 -202543 101561 154440 -391312 -252863
15997 -252863 -74342 -6205 -467314 -188792 -406308 -153631 156872 149561 -55775 88144 48997
15986 48997 292512 -292431 275978 120976 297156 333961 157680 -27107 338257 -43219
15975 64489 323727 -272957 57885 -223314 -231349 36231 115315 103696 -28527 -360899 -363454
15964 -363454 -358664 -235056 24765 -153366 -151740 -198234 65280 71723 210381 -267348 -65618
15952i2791k34541f6938q9731B26416a11464B34184K0269E0772O6792i5760q6154
15941a81914g1972m29314a99181A65584O7503b48035f2723l32985B01083a86916
15930a7705j60991A75269c2036l6071A2354a25714F3029J27930a02980b5363G626
15918a83675d5285p3282m877e3180D0894d28A2824J72000h2145j88058g9836n842
15906h5678j69001j0454F3944a38414L7743k9315C39214a07908A75648K69316
15896D44964A00047m5721a78721m0121d4097p9653o3588k9941A75171c1674r3468
15885a25142n0046K6824l9480I4508l8934j9407J64087a31918A54445K31482h2934
15873b10001B50346G893N8998e6451C24210e0334F046Q9771a3617k04371D836
$$ plain form
15952 -92791 -327332 -66938 -156669 226416 -111464 234184 254453 50772 117564 -95760 -181914
15941 -181914 -71972 -501286 -199181 165584 233087 -248035 -62723 -395708 201083 -186916
15930 -17705 -178696 175269 -32036 -68107 12354 -125714 63029 190959 -102980 -25363 7626
15918 -183675 -45285 -118567 -123444 -53180 40894 -428 12824 184824 -82145 -270203 -79836 -85678
15906 -85678 -254679 -265133 63944 -138414 -100671 -129986 339214 -107908 175648 444964
15896 444964 100047 54326 -178721 -218842 -44097 -123750 -187338 -217279 175171 -31674 -125142
15885 -125142 -175188 -148364 -187844 94508 55574 36167 200254 -131918 154445 385927 -82934
15873 -210001 250346 7893 66891 -56451 324210 -50334 6046 95817 -13617 -217988 4836
15861a58234J3496b1683n6584b6508B27079i0823K0507e781p6968m00488G3335
15849b30H7147R2288H366J41929b11651A53879a71809k891p1248D656P4827a78088
15836a7587A3103a48848G3257J63291a10315j24730A0380J19780k6896c14584
15825h4985n4824O4505j59867N879H1487a77964B3446b43205B65194a6024B78937
15813B81898b25435A67015b08086H4482J86157i9198k30803G4407a00062b6881
15802a65155n9923M7197j33843H5324a48982d9299k00593G2840B308J9745K71468
15791B93521A34254N4168f9992B53075F313L2879a15241D2654a02544D5135K2016
15780F7151b17764j14100j27281B11110e4322b3663j29000A62143B5614K08531
$$ plain form
15861 -158234 -144738 -21683 -78267 -26508 227079 -90823 -70316 -5781 -82749 -483237 73335
15849 -230 87147 179435 8366 150295 -211651 153879 -171809 -174700 -245948 4656 79483 -178088
15836 -17587 13103 -148848 73257 236548 -110315 -235045 10380 130160 103264 -314584
15825 -84985 -139809 -75304 -235171 -229292 81487 -177964 23446 -243205 265194 -16024 278937
15813 281898 -225435 167015 -208086 84482 270639 -99198 -330001 74407 -100062 -26881
15802 -165155 -225078 -177881 -311724 85324 -148982 -49299 -249892 72840 2308 22053 293521
15791 293521 134254 188422 -69992 253075 6313 39192 -115241 42654 -102544 45135 67151
15780 67151 -217764 -331864 -459145 211110 -54322 -23663 -152663 162143 25614 234145
15770B34145c35576A43087L2142a45242B2944M33758G8572J4552M21216E9688
15759A67893e7751E3301N7465O3560l683K11067e7014j86106j40158E1624g6691
15747a03530A37052J34683A9573J85094g606j12697E3343b09606i3006H4421f7415
15735b8094j0811J8266r5748C9312b92204F7601i6458d2052m14714a76472A89162
15723B67043a45068F0780b1832q3486G852K63410e62534a55236A46795f5634F7431
15711h5422a7852j02559r8247n2875B37503H6700a08924D1496b21661g9199C2120
15699h9327B50016g288j61345H9603b86042M9148I1873b26661B67938b69630N0223
15688b19407A42333B7441a91074I3940g2141o5531f6717l22709A66604a03732
$$ plain form
15770 234145 -335576 143087 175229 -145242 22944 456702 78572 93124 514340 59688
15759 167893 -57751 53301 110766 174326 170643 381710 -57014 -243120 -383278 51624 -76691
15747 -103530 137052 271735 19573 204667 -7606 -120303 53343 -209606 -93006 84421 -67415
15735 -28094 -38905 -20639 -116387 39312 -292204 67601 -96458 -42052 -456766 -176472 189162
15723 267043 -145068 60780 -21832 -105318 7852 271262 -562534 -155236 146795 -65634 67431
15711 -85422 -17852 -120411 -218658 -271533 237503 86700 -108924 41496 -221661 -79199 32120
15699 -89327 250016 -7288 -168633 89603 -286042 -236894 91873 -226661 267938 -269630 -219407
15688 -219407 142333 27441 -191074 93940 -72141 -137672 -66717 -389426 166604 -103732
15677i1919m2623l099B5423b25775F843a36123B98291j39400g8768B95326f3220
15665B88339D9619B3406a2914k54589A77580e9313b1728j20717k7508d0179m23329
15654d63508K29246j06562B574K835R8904P6986c381j94164A842R7011l2360P8894
15642A45387k8208P4820a8319H8915Q233A4959b56046b4680k90916B37188D3114
15630c42909A46373a71525A55177a7524A61909b24921B75200a96551D5067K731
15620D7798L7557b34448C3481L7098a00131L7301C9948j6111b41959Q2530H9446
15608F0381a30042d8756b546j24002b1229A30373b78961G4581e9723B02277c3941
15596b5796B76802p1858D4170c0419j92562A15279c75454J36927D4417P1867e2522
$$ plain form
15677 -91919 -134542 -137641 25423 -225775 6843 -136123 298291 158891 -78768 295326 -63220
15665 288339 49619 23406 -12914 -267503 177580 -59313 -21728 -142445 -169953 -40179 -463508
15654 -463508 -234262 -340824 2574 5409 104313 181299 -3381 -197545 1842 98853 66493 145387
15642 145387 117179 191999 -18319 88915 97148 14959 -256046 -24680 -315596 237188 43114
15630 -342909 146373 -171525 155177 -17524 161909 -224921 275200 -196551 45067 47798
15620 47798 85355 -234448 33481 70579 -100131 -62830 39948 23837 -241959 -159429 89446
15608 60381 -130042 -48756 -2546 -126548 -21229 130373 -278961 74581 -59723 202277 -33941
15596 -25796 276802 204944 44170 -30419 -222981 115279 -375454 -238527 44417 116284 -52522
15584d7795f565B20293G5d5487j81063L299A84635H7770i7497A55974c67290J67948
15572a99342j79607A9630M03104A80250i253j99521A03400E0976i3614j8391B6138
15560a7039D7918h9893b9923A86660A4585b1044k41868J03433L5663C98572d33366
15548b53082D7072a33412o3540B2582J335J89945a75629F7349H821J42755e7205
15536A82558E5580B4759K66507A11119O8699H417g4355D7238Q5080c2379q3188
15525a15567M9349A65936b14176c4627l49229B67019j09815b67367K5226c1856
15514B39230b0411j7464D6716j7925K9020a77709o8879R0514N6214A75022l7836
15503A37186f9275j41332A34844k6431b78397G7505c69209A03652b29837J4332
$$ plain form
15584 -47795 -6565 220293 75 -45487 -226550 -223251 184635 87770 -97497 155974 -367290 -199342
15572 -199342 -378949 19630 422734 180250 -9253 -208774 103400 50976 -93614 -112005 26138
15560 -17039 47918 -89893 -29923 186660 14585 -21044 -262912 -159479 -123816 398572 -433366
15548 -253082 47072 -133412 -196952 22582 23917 213862 -175629 67349 8821 151576 -57205
15536 182558 55580 24759 291266 111119 179818 8417 -74355 47238 132318 -32379 -115567
15525 -115567 -66218 165936 -214176 -34627 -383856 267019 157204 -267367 -242141 -31856
15514 239230 -20411 -37875 46716 28791 57811 -177709 -246588 -156074 -99860 175022 137186
15503 137186 -69275 -210607 134844 108413 -278397 77505 -369209 103652 -229837 -215505
15493b15505J06045A44413J32003a99364Q8355g351q0301R998a1745l1518A15406
15481b89132A05565O2856C8713a62000j07831g7883A25055a1897j01617A31125
15470C00207a46787G1215K61376A00520J8330L3740g1249l5854C05454a06544
15459C2977R9972B5111K51260G2508q15J2897B5512N1547a63472E3775a33299
15447F7926b4933j07624a6790j22413F9871a50178I2856a37001g530j12123H5352
15435d8395L037B12595g725F4580b30128B19451a0710A18925l9560a33124f4284
15423E8976a04260A85073n285b26003Q8083n3641i2600m4576H2274b12748B01693
15411d0044k53801h8733A0026b242F2819O5132D2534L7418M6297c1358A76645
$$ plain form
15493 -215505 -109460 144413 276416 -199364 -111009 -7351 -87652 -77654 -11745 -43263 115406
15481 -289132 105565 168421 38713 -162000 -269831 -77883 125055 -11897 -113514 131125
15470 300207 -146787 71215 332591 100520 118850 152590 -71249 -107103 305454 -106544
15459 32977 132949 25111 276371 72508 71693 84590 25512 77059 -163472 53775 -133299
15447 67926 -24933 -132557 -16790 -139203 69871 -150178 92856 -137001 -7530 -119653 85352
15435 -48395 -45358 212595 -7725 64580 -230128 219451 -10710 118925 79365 -133124 -64284
15423 58976 -104260 185073 179788 -226003 -137920 -191561 -92600 -137176 82274 -212748 201693
15411 -40044 -293845 -88733 10026 -2242 62819 127951 42534 79952 126249 -31358 176645
15399A84590a25925K1995K2105L3383J11B54322a53242B51609a35712A68435a89187
15387D0853a08650F2642h6895A7680R3347i4534j38063C718L08575a27802N4762
15376g3040c287q6086E7494R9739d98531h3181o6426E5159J15146b19154i112
15364A39419J96084A00913J2293c47264A18745n6216J08668a31850N7458G9117
15353A06911D7033P0683P360L6545c386B15963b43398O7428C39327a11467B81830
15341C871d944l5841I2275C353b1507B90880a1389A59087L8875J8094b61919F1345
15328A7267g7599B63003A23900P6820Q1437d62336a53620E1240a36765c4190j86328
15317b20518P1340A62685b09395M1286F64080a33852C28153H6277C0489R9127
$$ plain form
15399 184590 -125925 -103930 -81825 -48442 -48331 254322 -153242 251609 -135712 168435 -189187
15387 40853 -108650 62642 -86895 17680 111027 -94534 -232597 3718 312293 -127802 -73040
15376 -73040 -3287 -89373 57494 157233 -498531 -83181 -149607 55159 170305 -219154 -9112
15364 139419 335503 100913 113206 -347264 118745 62529 171197 -131850 -74392 79117
15353 106911 47033 117716 125076 161621 -3386 215963 -243398 -175970 339327 -111467 281830
15341 3871 -4944 -40785 92275 3353 -21507 290880 -11389 159087 197962 216056 -261919 61345
15328 17267 -77599 263003 123900 200720 282157 -462336 -153620 51240 -136765 -34190 -220518
15317 -220518 -149178 162685 -209395 -168109 664080 -133852 328153 86277 30489 129616
15307A29616h9602j32050L0044B1160i0882E75820D8258a9112j50536P8569G5561
15295H57h843m45563G2705C3619L50995b8407j48029G5844b07040B39799A2769
15283A71784m2380a44984E249a68033B29128c0666A22582P9690K20719a98788
15272b06314B43053a64179A96164a23993A55350K09588A70390a17808B21164J95287
15262D16451I75a3133A04732a67808O512b7321k5252D64509A8821K24545i3662
15250e0374B45119M1522Q3968Q66048L81901k58926P02650q59770E54239d7375
15239D15525k5111j46372j10876j5682B2063O5410c7392C2737h2373B22518q1259
15228A41259c13686f1197l9489G1077b5245k0938p2719B46040g5337k3093b2982
$$ plain form
15307 129616 -89602 -221652 -191608 21160 -90882 575820 48258 -19112 -169648 -91079 75561
15295 857 -8843 -454406 72705 33619 384614 -28407 -176436 75844 -207040 239799 12769
15283 171784 129404 -144984 5249 -168033 229128 -30666 122582 202272 422991 -198788
15272 -206314 243053 -164179 196164 -123993 155350 364938 170390 -117808 221164 416451
15262 416451 975 -13133 104732 -167808 -161296 -27321 -52573 464509 18821 243366 -93662
15250 -50374 245119 286641 370609 1236657 1618558 1359632 2062282 1202512 554239 -47375
15239 415525 390414 244042 133166 117484 22063 87473 -37392 32737 -82373 222518 141259
15228 141259 -313686 -61197 -100686 71077 -25245 -46183 -118902 246040 -75337 -98430 -22982
15216A49697R1981C2133O3815j8243J20360a55281c1220l4411J8000I7991a52191
15204a34295H8648K2949c310k08523a05569A8326a19654B64143b6094m8185B06112
15192C29943D0438K15358a49502j2526B57602H040K64851e8615A01869a07370
15181E5270B6837M3972K17385B7549e6016m126A57659l7248f783m84762C9943
15169H1423K4769A3451L58938a25593A17234A998a03297E29988a70865I857c0834
15157B55854b72033C93812E7002J60757r2026J46498I3247J71491C1589h8632
15146B01927h5329F999g2127B37637q2941E4172J12793l8663J74149J16466i0371
15134A93682d2247H2866a59803E3085J46467I5470J4822k1904R1785p1318K98370
$$ plain form
15216 149697 241678 32133 95948 77705 198065 -155281 -31220 -65631 -47631 97991 -152191
15204 -134295 88648 111597 -3310 -211833 -105569 18326 -119654 264143 -26094 -74279 206112
15192 329943 40438 255796 -149502 -162028 257602 8040 272891 -58615 101869 -107370
15181 55270 26837 70809 288194 27549 -56016 -60142 157659 120411 -6783 -491545 39943
15169 81423 106192 13451 372389 -125593 117234 1998 -103297 529988 -170865 9857 -30834
15157 255854 -272033 393812 57002 217759 125733 272231 93247 264738 31589 -88632
15146 201927 -85329 6999 -72127 237637 154696 54172 166965 128302 302451 418917 -90371
15134 193682 -42247 82866 -159803 53085 199552 95470 110292 88388 180173 108855 407225
15123D07225A98631p5234i25A76870q3232R8038A1496Q8407D8548L98783A27124
15111I8156J34889L0794c70544f5132D59698b4167k91678G2393c5289n1873A34819
15099a80319A92658J40708b5799B85652A02501a3866A78494a80510C37463j46322
15089A91141L01315A50584J24472J95125A23773a37225B40216A2001a67020E5669
15078D3660M3998J8005J28575l6225h1454j5370A06580J44057h1704B61389B6673
15066d0416j25075O0164C09378j06392C1770N0762J83178p7906J30076d4839C66148
15054H8778J76524N7559G3543J82981A22636n8119J66170p5291d8720B99670j41275
15043A58395Q1359J35125j45137K45692A4356h308r3815A14154J9839k1435J37950
$$ plain form
15123 407225 198631 123397 -925 176870 93638 191676 11496 99903 48548 447331 127124
15111 98156 233045 263839 -370544 -65132 459698 -24167 -315845 72393 -35289 -87162 134819
15099 -180319 192658 333366 -25799 285652 102501 -13866 178494 -180510 337463 191141
15089 191141 492456 150584 275056 470181 123773 -137225 240216 12001 -167020 55669
15078 43660 87658 105663 234238 198013 -81454 -96824 106580 250637 -81704 261389 26673
15066 -40416 -165491 -105327 309378 202986 31770 82532 265710 187804 317880 -44839 366148
15054 88778 265302 322861 73543 256524 122636 64517 230687 155396 -48720 299670 158395
15043 158395 239754 374879 229742 475434 14356 -8308 -102123 114154 133993 112558 250508
15032B50508q1640c0068H259J88725Q8741P9275l8456Q9977i2302C61358J37150
15021D98508i224C07994o1627I1798D5563a52717D66278A81430l1376J35939J02337
15010C88330E1632J18138b48684D84421b9531E9389K90038A60850b6673A16393
14999c8793A55527J80268j25907J18506A21515K4867K52364m0876p0775l3142
14989B53953K09404B2167J15161b57685C5428J54799A5845K43323A20905j9578
14979A01327a08945C6614K49336q5596I330L57236j77621L4265p5651K88476j37990
14968B98045J40507H2022g3901A14805d7578A64387K2768n8884N3894J87804a18736
14956B32188J53097H8296J23158m8300n7380K23109j50720n588A2080O7646O40404
$$ plain form
15032 250508 168868 -30068 8259 196984 285725 365000 326544 416521 -92302 361358 498508
15021 498508 -9224 307994 246367 91798 45563 -152717 466278 181430 150054 285993 388330
15010 388330 51632 169770 -248684 484421 -29531 59389 349427 160850 -26673 116393
14999 -38793 155527 335795 209888 328394 121515 146382 398746 357870 287095 253953
14989 253953 463357 22167 137328 -257685 35428 190227 15845 259168 120905 101327
14979 101327 -108945 36614 285950 200354 9330 366566 188945 223210 147559 436035 298045
14968 298045 438552 82022 -73901 114805 -47578 164387 187155 128271 182165 369969 -118736
14956 232188 385285 88296 211454 163154 105774 328883 178163 172575 12080 79726 720130
14945G20130k87147A70878c1853D38302A58708J47407C5350L71507k8830Q7947
14935D65974B14616K7322A00621B9189J21336L71535A12407N53245A10756L62116
14925D72872R0441B7555L31537A63668J30011r4055M11492A25102K30108J28445
14915D83655g5111C62535e2531E06061j78555J64856k14368A20199N8017F3223
14904B64835m9073K86594j68604n8048J70529B22348I757L95272j65782K19527
14894D58774j11492F5508L04826A22445J30246R8001J79863A90268J38522r2587
14884B36203O6931p475M34143B51122O1148l1762M1497d6450A59151L48711A83296
14872D7941K57894j38634J21503K18135j02447L4565r9030j827K01814k11761
$$ plain form
14945 720130 432983 170878 -31853 438302 158708 306115 35350 406857 378027 465974
14935 465974 214616 241938 100621 29189 150525 522060 112407 665652 110756 472872
14925 472872 563313 27555 359092 163668 293679 199624 611116 125102 355210 483655
14915 483655 -75111 362535 -52531 506061 327506 492362 277994 120199 178216 63223
14904 264835 215762 502356 333752 275704 446233 222348 9757 405029 239247 458774
14894 458774 347282 65508 370334 122445 252691 350692 530555 190268 328790 236203
14884 236203 303134 295659 729802 251122 312270 280508 322005 -46450 159151 507862 183296
14872 47941 305835 167201 288704 506839 404392 438957 339927 338100 539914 328153
14862C28153o2412J83486j36562M7820r5288K56742j00301q2004F8708J61041
14852B29749M82661B95885o8933M42834q8419p4795P1631B18400J84622J70597
14842E73619j03094B30103K03729L42355B64991L1660O8242l192K15202j53198
14832D23705K73682B83115K94940k11199L05072A64176L94423R9437m3604j09
14822F14323j99772K4575k1155k00466L27630j13314j7037M127p4416j65615K89608
14811D68488L13942k50346B45628l873M6573a32582E80034n0934k13076K93917
14801F09941k30348R9978o0011L7977K25957R6224B82788A20898M10028P4376
14791F05302J8564P3806K74621C45003L15765n1320L06493C39105M17549C62539
$$ plain form
14862 328153 265741 449227 312665 360485 265197 521939 421638 339634 68708 229749
14852 229749 712410 295885 226952 669786 581367 506572 578203 218400 403022 573619
14842 573619 470525 230103 433832 776187 264991 296651 364893 361701 576903 423705
14832 423705 697387 283115 578055 366856 671928 164176 558599 658036 614432 614323
14822 614323 414551 439126 417971 217505 545135 431821 414784 418911 344495 178880 468488
14811 468488 782430 532084 245628 241755 288328 -132582 580034 529100 316024 609941
14801 609941 379593 479571 419560 457537 683494 779718 282788 120898 530926 605302
14791 605302 623866 697672 972293 345003 660768 609448 915941 339105 756654 362539
14780E88453j16252q1633L39082L2100k09207K8551r3481j50756K57634j11852
14770D82639O8068j89290Q9046K33814j69097L65588k04314q1644l6313j30270
14760D28227L35632k89234J78913L85690n01296M5919K06247B94434J93132o4633
14750D22933J09572r6223L23654Q5589k55148J85463j31793K07864K289k3800
14740H30400k25907Q2149A98299J95700J41291P8217P036J0339P200j9272J12102
14729G30912J81301j11907R696m2421j8780J47464l25978J07247K26331j81586
14719G22279J27576m638J25325l905k10558k2306l4931L49367C39853M25574K76475
14708A041902l1904k29642r3309q2680r7451L81742K77200k38712j51799q5973
$$ plain form
14780 588453 472201 390568 729650 761750 552543 581094 487613 336857 594491 482639
14770 482639 550707 361417 450463 684277 515180 880768 676454 594810 558497 428227
14760 428227 763859 474625 653538 1039228 537932 583851 790098 294434 487566 422933
14750 422933 532505 436282 759936 845525 590377 775840 644047 851911 854200 830400
14740 830400 604493 686642 198299 393999 535290 613507 620543 630882 638082 618810 730912
14729 730912 912213 800306 810002 767581 748801 896265 570287 677534 903865 722279
14719 722279 849855 845217 970542 966637 756079 733773 698842 1048209 339853 765427 1041902
14708 1041902 1009998 780356 687047 604367 506916 888658 1165858 927146 775347 689374
14698F89374K50232C75674P28114q8090j23341o9771J19020k08190j205M38636
14688A170847n08334K44822J81442n4767m67326K47604J17454J08941k32242Q3296
14678H91737O8162J50595k65395o4051K1549r351L04028k46737K29564j37202
14668I42899k09575L22397k24031K23174N7156j94740K41766j28058k12839K46708
14658A064857j05328n0851J78231l48988N84259k94590P2533k60237L73614j34263
14648A079237O6477j3550j01541J41378j83484l7067M19735p5357j37786K78653
14638A436695m9322l18710j3738r0017R7194K33494L63033k21695j92629K10770
14628A455075l10252J44189J40374j47212q7606K98412Q3632j66950j44417M68450
$$ plain form
14698 689374 939606 375674 1103788 1015698 892357 822586 941606 733416 732211 1170847
14688 1170847 662513 907335 1088777 1034010 566684 814288 931742 1040683 808441 891737
14678 891737 959899 1110494 845099 781048 802597 793246 1097274 850537 1080101 942899
14668 942899 733324 1055721 831690 1054864 1112020 917280 1159046 1030988 818149 1064857
14658 1064857 959529 908678 1086909 737921 1322180 1027590 1100123 839886 1213500 1079237
14648 1079237 1145714 1132164 1030623 1172001 988517 951450 1371185 1295828 1158042 1436695
14638 1436695 1387373 1068663 1054925 964908 1062102 1295596 1658629 1436934 1244305 1455075
14628 1455075 1144823 1289012 1429386 1282174 1194568 1492980 1576612 1409662 1265245 1733695
14618A733695m1680j38644O0851k02249n7193Q8269P1561k18900K28744J39381
14608A663835k9840J16465n05661L90435J97784l68408O0497n2154K43248j47750
14598A568451M4485K85314l85687J98893k22915Q6778J51562J14835J3825M7088
14588A902629j05378N5715l9241p9631O8039j5202M1174J18367L90072P9399m83479
14577A932464J05827K54228j24631k26899M08205o9062L3317r3940j33688J05223
14567B191044j18117K71071J12586l85476M23526M2657J96841P06K12164M5059
14557B992061L37636l49891K53547K37742L48709K49930N89186J055431J699449
14548G413800L128860R018111K1210668M534523A9830693r063436l984760C267881
$$ plain form
14618 1733695 1692015 1553371 1614222 1411973 1354780 1443049 1514610 1295710 1524454 1663835
14608 1663835 1633995 1750460 1244799 1635234 1833018 1464610 1525107 1472953 1716201 1568451
14598 1568451 1612936 1898250 1512563 1711456 1488541 1575319 1726881 1841716 1855541 1902629
14588 1902629 1797251 1852966 1813725 1734094 1802133 1786931 1828105 1946472 2336544 2415943 1932464
14577 1932464 2038291 2292519 2167888 1940989 2349194 2280132 2313449 2219509 2085821 2191044
14567 2191044 2072927 2343998 2456584 2071108 2494634 2537291 2734132 2734838 2947002 2992061
14557 2992061 3329697 2979806 3233353 3471095 3819804 4069734 4658920 5714351 7413800
14548 7413800 10542660 19560771 40771439 45305962 19830693 10767257 6782497 3267881
14539B408571o83327J36422L552K816J55431k32675L52384n7247m0408j9705L3740
14528B059554K71376J9668K74332m35834K34290K92431m5346k09577k22112N0747
14518B289529R1326L21606j81027m2461R9651J98087q1551J15937J36040k37177
14508B709960L8212j8239J60125k73701N93234m9531k28304L17498K9643l34246
14498B944651K05958q6051M90984l97174Q5368k42617N70987k93334J51499N7611
14488C487882j34502N27585p53414M66149K40736k83904l5895L0517K21867J84762
14478C951783l13338K06464M34164l03103j2954j71573N33409j56469J48198l55403
14468C961178J83660N66477k04628K38923m38301L25152K15R1752j76792m8304
$$ plain form
14539 2408571 1725244 1861666 1865218 1868034 2023465 1790790 2143174 2085927 2045519 2025814 2059554
14528 2059554 2330930 2350598 2624930 2189096 2423386 2715817 2670471 2460894 2238782 2289529
14518 2289529 2380855 2702461 2521434 2478973 2578624 2776711 2695160 2811097 2947137 2709960
14508 2709960 2748172 2729933 2890058 2616357 3209591 3160060 2931756 3249254 3278897 2944651
14498 2944651 3150609 3064558 3555542 3158368 3243736 3001119 3572106 3278772 3430271 3487882
14488 3487882 3353380 3880965 3127551 3593700 3834436 3550532 3514637 3545154 3767021 3951783
14478 3951783 3638445 3844909 4279073 3975970 3963016 3791443 4324852 4168383 4316581 3961178
14468 3961178 4144838 4711315 4506687 4745610 4307309 4632461 4632676 4724428 4547636 4499332
14458D499332J13355J82758L51794o3296m18224L60602K64471L25162j0598l50255
14448E255101J69892K11135L94291n68343K0615J44882L93677k2622j49380J51769
14438F001017k1249J82097J22840q964K92462K06624l72101K20791Q0625J47892
14428F852034Q2162r2347N83899j99348L06651J27773k55799L59818M34849n37422
14418G662270J36909O38765l30215o1067M70213l05875O26499K39628j34361j9240
14408H923526K33578M29750k78177M09144J91333K10914m01650O57306M65082
14399A0840806j65205K68725L4934K63040M25816j6265J26135L56050r3078L12331
14389A2353289K50544J1427P35444J30204L27169L92458l00311M08949L37586
$$ plain form
14458 4499332 4612687 4795445 5147239 5083943 4665719 5026321 5290792 5615954 5605356 5255101
14448 5255101 5424993 5636128 6030419 5462076 5482691 5627573 6021250 5998628 5849248 6001017
14438 6001017 5979768 6161865 6284705 6275741 6568203 6774827 6402726 6623517 6704142 6852034
14428 6852034 6934196 6841849 7425748 7226400 7533051 7660824 7405025 7764843 8199692 7662270
14418 7662270 7799179 8437944 8107729 8046662 8516875 8211000 8837499 9077127 8942766 8923526
14408 8923526 9157104 9586854 9308677 9717821 9909154 10120068 9718418 10375724 10840806
14399 10840806 10675601 10944326 10979260 11242300 11668116 11651851 11777986 12134036 12040958 12353289
14389 12353289 12603833 12615260 13350704 13480908 13808077 14200535 13900224 14309173 14646759
14380A4646759J57332K10530K36305L10603M02849L56450K19935O89382Q8602
14371A7318747L01720K28897O14985K24265L50619L71030L64599M34474Q50241
14362B1059577j02960M44110M48567N94845O08696L78468N30504M72240L81930
14353B4815977O94410P33787O97357M79613M68761O34661J040061Q19067O01775
14344C0985469J072990N95866O07456J113494O42234J447364Q06259R26622J183383
14335C9381137J330834J203579Q07526J570483J219361J598196J341888J735357
14327E0188361J387932J841065J375665J894932J959772J988671K229250K087177
14319F4952825K197983K547816K521162K939428K591502K601754L582957L226635
$$ plain form
14380 14646759 14804091 15014621 15250926 15561529 15964378 16320828 16540763 17230145 17318747
14371 17318747 17620467 17849364 18464349 18688614 19039233 19410263 19774862 20209336 21059577
14362 21059577 20956617 21400727 21849294 22444139 23052835 23431303 23961807 24434047 24815977
14353 24815977 25510387 26244174 26941531 27421144 27889905 28524566 29564627 30383694 30985469
14344 30985469 32058459 32654325 33261781 34375275 35017509 36464873 37271132 38197754 39381137
14335 39381137 40711971 41915550 42723076 44293559 45512920 47111116 48453004 50188361
14327 50188361 51576293 53417358 54793023 56687955 58647727 60636398 62865648 64952825
14319 64952825 67150808 69698624 72219786 75159214 77750716 80352470 83935427 87162062
14311H7162062L166566L847504L961930M073757M122150M624129M820972N075720
14303A20854790N425143N516771O159307O382894P059883P078818P910715P915290
14295A74303611Q386696R030105R506324R889727J0780053J1523559J1410113
14288B44830188J2022533J2619127J3829439J3906283J4170040J4972148J4863973
14281C41213731J5204988J5135729J4989067J4843946J4149705J3319537J2204539
14274D41061242J0690279P207671M458337J521049K40869J66288l607612l205817
14266D58532306m278000p455216j0191688j2494648j3896287j5052873j5666333
14259C79497261j5957417j6416908j6151977j6140675j5173242j4881218j3149273
$$ plain form
14311 87162062 90328628 94176132 98138062 102211819 106333969 110958098 115779070 120854790
14303 120854790 126279933 131796704 137956011 144338905 151398788 158477606 166388321 174303611
14295 174303611 182690307 191720412 201226736 211116463 221896516 233420075 244830188
14288 244830188 256852721 269471848 283301287 297207570 311377610 326349758 341213731
14281 341213731 356418719 371554448 386543515 401387461 415537166 428856703 441061242
14274 441061242 451751521 458959192 463417529 464938578 465179447 465345735 461738123 458532306
14266 458532306 454254306 446799090 436607402 424112754 410216467 395163594 379497261
14259 379497261 363539844 347122936 330970959 314830284 299657042 284775824 271626551
14252B71626551j3693541j3135384j2411632j1584791j1298541j0665247r805011
14245A89032404r189403q246007q673290p693841p306625o743521o616202n924159
14237A28639356n245436n530871n532206m516685m672983m177623l417719l722512
14229I1823321m099527l522418k671164l442444l037379k852428k525965k283598
14221F7388398k322183j857509k861851j457146j972009k263589j628485j581828
14213E1443798j348805j803969j123253k004230j047667j310292m93783j078219
14205D1233580j389709j246469j234546j149525l50627n31029j506510r10747
14197C2914418r85757p46805j003878l47668p32154q57661n61878j101163m54794
$$ plain form
14252 271626551 257933010 244797626 232385994 220801203 209502662 198837415 189032404
14245 189032404 179843001 171596994 162923704 155229863 147923238 141179717 134563515 128639356
14237 128639356 123393920 117863049 112330843 107814158 103141175 98963552 95545833 91823321
14229 91823321 87723794 84201376 81530212 78087768 75050389 72197961 69671996 67388398
14221 67388398 65066215 63208706 60346855 58889709 56917700 54654111 53025626 51443798
14213 51443798 50094993 48291024 47167771 45163541 44115874 42805582 42311799 41233580
14205 41233580 39843871 38597402 37362856 36213331 35862704 35331675 33825165 32914418
14197 32914418 31928661 31181856 30177978 29830310 29098156 28240495 27678617 26577454 26122660
14188B6122660l48874p49165r53353j14177o64770n70412p45716L6106m82743
14179B1529556o79362k57462o48575l13318l72185n39006k32910m75288l35582
14170A7675868q2074q34801N9075p91236j68588k77989P9866l06385n85352J05417
14160A4873801l62619m79063k08270j58510l02516N911P8382o72379j94640m23568
14150A2156529K60505k64087l83303l64081J61145n59490M05862n28431m07476
14141A0477173K95158m97969j54556k45361p783j2515j85357r2150r7036m57176
14131I022428J01146k52888j8216K01903k19907l68190J8589j74069l15101L31475
14121H327170l17383M0777l77342j3091J68684j79239j00492j9149n91278N12402
$$ plain form
14188 26122660 25773786 25024621 24071268 23957091 23292321 22721909 21976193 22012299 21529556
14179 21529556 20850194 20592732 19944157 19630839 19258654 18719648 18486738 18011450 17675868
14170 17675868 17593794 16758993 16818068 16026832 15858244 15580255 15660121 15353736 14768384 14873801
14160 14873801 14511182 14032119 13823849 13665339 13362823 13368734 13447116 12774737 12580097 12156529
14150 12156529 12417034 12152947 11769644 11405563 11566708 11007218 11413080 10884649 10477173
14141 10477173 10772331 10274362 10119806 9874445 9866662 9854147 9668790 9576640 9479604 9022428
14131 9022428 9123574 8870686 8852470 9054373 8834466 8466276 8484865 8310796 7995695 8327170
14121 8327170 8009787 8050564 7673222 7660131 7828815 7649576 7549084 7529935 6938657 7451059
14111G451059m34536K19952k99344j26343N7154j0464n07736K62880j12791o7467
14101F432364L5687k36895m15717L40255k95368K92813m00776j35524o3251J04722
14091E658310K11607k05610m22698O9461n40565P12668j82201l60908K19098q8268
14081E070894l02038k7J8400J94248j38620J21739l47364J23578K1597n62249
14071D200158M31978l26307k37113L42746O1489O356l69632J89845j19020o0594
14061D119906p2755j30149K5665K7455L10370k72245k20298K91000l3757m95756
14051C549436J51021K6917l3337l69325K81306j21284J3462j22136j32661O1295
14041C304694K44244l80965n5360J35042K2639L4130P5894l34150k3887K96612
$$ plain form
14111 7451059 7016523 7236475 6937131 6810788 6867942 6857478 6349742 6612622 6499831 6432364
14101 6432364 6468051 6231156 5815439 6155694 5860326 6153139 5752363 5616839 5553588 5658310
14091 5658310 5869917 5664307 5241609 5311070 4770505 5483173 5300972 4940064 5159162 5070894
14081 5070894 4768856 4768829 4787229 4981477 4842857 4964596 4617232 4740810 4762407 4200158
14071 4200158 4632136 4305829 4068716 4411462 4472951 4479307 4109675 4299520 4180500 4119906
14061 4119906 4047151 3917002 3942667 3970122 4280492 4008247 3787949 4078949 4045192 3549436
14051 3549436 3700457 3727374 3694037 3324712 3606018 3484734 3498196 3376060 3243399 3304694
14041 3304694 3548938 3167973 3112613 3247655 3270294 3304424 3380318 3046168 3022281 3318893
14031C318893J83838n00535J73961k59516M68531l25198j53158j18859o0997Q2105
14021B809065J6549j95392Q0850J79598o04591J97622J0973m817J32836J6417
14011B639110j24699j46996J71717q6274q6578n0016K20703j43880M0950j33666
14001B300371n51P5946l58148L75937K46178j64961m40681J25107L5160J11961
13991B306319o4297M46217R41663K019443P116291K0377073J5973758k3469343
13983B5647124j2176961n307197k542513j111100p84740l02329L9157l08040j09180
13974C044221j14367m83734K58171m1784l28432K32730k23531P8987q0650K2577
13964B364188k03290K42313j66380k8429j48439J76033j57096k07096J41595Q2451
$$ plain form
14031 3318893 3502731 3002196 3176157 2916641 3385172 3059974 2906816 2787957 2726960 2809065
14021 2809065 2825614 2630222 2711072 2890670 2286079 2483701 2494674 2489857 2622693 2639110
14011 2639110 2514411 2367415 2539132 2452858 2366280 2316264 2536967 2393087 2434037 2300371
14001 2300371 2299820 2375766 2017618 2393555 2639733 2474772 2034091 2159198 2194358 2306319
13991 2306319 2242022 2688239 3629902 5649345 12765636 33142709 49116467 25647124
13983 25647124 13470163 8162966 5620453 4509353 3724613 3422284 3461441 3153401 3044221
13974 3044221 2929854 2446120 2704291 2662507 2334075 2566805 2343274 2422261 2341611 2364188
13964 2364188 2160898 2403211 2236831 2208402 2059963 2235996 2078900 1871804 2013399 2095850
13954B095850p9854J44383j17039Q0623k22562j12049J97487P1729l56259K22788
13944A925097p4350r8872k97372M91143n7097k94824L43423j85507m45057J44021
13934A450605J03540P7295J22476K31644n85995M5197J1647N23703j18282n42075
13924A319755L40421j81306K5397M2331l0078L01077k69389k05095j62816K79029
13914A459326o1209O6381M8305l27532K39342R0954k45802n9640L23753k21962
13904A311916J04242J33466l2482o7077j88958J80975K0351j91528N30189k94640
13894A506454k02344J61036K9092J64152j89574k72813O5572k04039L59439n69457
13884H47518M40801O4359l79243M64170k33787J85242j54207K7350N6370N4807
$$ plain form
13954 2095850 2015996 2160379 2043340 2123963 1901401 1789352 1986839 2058568 1702309 1925097
13944 1925097 1850747 1751875 1454503 1945646 1888549 1593725 1937148 1751641 1306584 1450605
13934 1450605 1554145 1631440 1753916 1985560 1399565 1444762 1456409 1980112 1861830 1319755
13924 1319755 1660176 1478870 1504267 1546598 1516520 1817597 1548208 1343113 1180297 1459326
13914 1459326 1398117 1464498 1512803 1185271 1424613 1515567 1269765 1210125 1533878 1311916
13904 1311916 1416158 1549624 1517142 1450065 1261107 1442082 1462433 1270905 1801094 1506454
13894 1506454 1304110 1465146 1494238 1658390 1468816 1196003 1261575 1057536 1416975 847518
13884 847518 1288319 1352678 973435 1437605 1203818 1389060 1234853 1262203 1318573 1373380
13874A373380P654O3386j29211j7848J94913k99523j82448o3767N59872k99307
13864A207101j18914K40056j01051N6118l57332J84738K16691k28922Q265J81313
13854A288063j91530k93868O70110j14392k83161K84705j17980k87374m0823K89784
13844A203534L3184l03548J44732l64203M47586k53178K84607l06160l325O39260
13834A522489m73244j12371O7577R5650j10630k99907K33319n6804L659K74496
13824A144234m49130K25080k6255P3837K23133m14737m2116K39843J83644M746
13814A162279j78549O8725p3086j75529j68358J95836l3019j84139K82578r273
13804H87465K03333j14119L02643l44077J26512l83481P212k07660L1852L51532
$$ plain form
13874 1373380 1381034 1444420 1315209 1297361 1492274 1192751 1010303 946536 1506408 1207101
13864 1207101 1088187 1328243 1227192 1283310 925978 1110716 1327407 1098485 1106750 1288063
13854 1288063 1096533 802665 1472775 1358383 1075222 1359927 1241947 954573 913750 1203534
13844 1203534 1236718 933170 1077902 713699 1161285 908107 1192714 886554 883229 1522489
13834 1522489 1049245 936874 1004451 1100101 989471 689564 922883 866079 869738 1144234
13824 1144234 695104 920184 893929 967766 1190899 776162 734046 973889 1157533 1162279
13814 1162279 983730 1052455 979369 803840 635482 831318 798299 614160 896738 887465
13804 887465 1090798 976679 1279322 935245 1061757 678276 685488 477828 509680 861212
13794H61212q3125Q3127j29715M6095N1573C66626J96554M87883C90010J57057
13784E47067K04734l3022j90827J74822o1430L84046k23348K68986m18191J95492
13774H48329n7929j2609K04377j27690m8725n5311Q6131k70109J26078K94825
13764I87367k50902m779J33553M5022o2911L56844k49149k78242L5121L95055
13754A106979l15877l73063K21526M1667l02253J87861q6588N0625K53629j09822
13744F74684j15232Q2853I3536O39433j22213k55037K87136R0513k51697j0646
13734D71025K86457j77290L3891N7259k49256J39073J59365j43732M3120M14l0446
13723E89880Q0166K5290j74250J71270M6732j21587K33435C94429J6005j06212
$$ plain form
13794 861212 778087 861214 731499 777594 829167 366626 563180 1051063 390010 547067
13784 547067 751801 718779 527952 702774 641344 1025390 802042 1071028 652837 848329
13774 848329 790400 777791 982168 854478 805753 750442 836573 566464 692542 987367
13764 987367 736465 731686 865239 910261 847350 1204194 955045 676803 711924 1106979
13754 1106979 791102 418039 639565 681232 378979 566840 480252 530877 784506 674684
13744 674684 559452 642305 93536 732969 610756 355719 642855 733368 481671 471025
13734 471025 757482 580192 614083 671342 422086 561159 720524 576792 619912 620326 589880
13723 589880 670046 695336 521086 692356 739088 617501 850936 394429 410434 304222
13713C04222K18669J2832m4050M8848j40654J83984O8352j62650J80567J8075
13703F88195l35997K39428k47461L21354l8867k00754J18968j20471J26208k75222
13693B75381M23667C21778L79415k08252L30685k80342B24789K98868j31147J98112
13683E90622K10528C77138K7367L80091C32169J49822P6098J38153k62550L86570
13673H20262k63049K18363l59165q1847K10597j21751q420L8177R9491L21426
13663H74084j95104j49122j41040Q2670k4045K85642A54205K37003a45816C85293
13652C48523K9064J14934J7404B13201J81764r2293K58924L1511B91439N5465
13642C46904K18078K3499k19683j790m0253K36227B45459Q661K9375K60916j95144
$$ plain form
13713 304222 522891 535723 491673 540521 399867 583851 652203 489553 670120 688195
13703 688195 352198 591626 344165 665519 626652 425898 544866 424395 550603 275381
13693 275381 699048 321778 701193 492941 823626 543284 224789 523657 392510 590622
13683 590622 801150 377138 404505 784596 332169 481991 558089 696242 433692 820262
13673 820262 557213 775576 416411 334564 545161 423410 414990 453167 552658 874084
13663 874084 678980 529858 388818 471488 447443 733085 154205 391208 -145816 385293
13652 348523 377587 492521 509925 213201 394965 302672 561596 593107 291439 346904
13642 346904 564982 588481 368798 367008 326755 562982 245459 254120 283495 544411 349267
13631C49267N900K3019r8144K87811j81440J2325J06238j6320j87577K38759o9929
13620D69909B15728M4148J35914O7412K0515O1821J30046j77168k44871L01321
13610E54866K49611l52554O9019A44426K43834K47190k10966l8539j8107j25423
13600B42415N20917k52939j22518K20464A30805J20030j2211K90610G4716L55835
13590D30551o1845j45970J76602G6438O7462n965K16775O1948o8742J53445l4798
13579D66563A94821J69532o5993j06409L77846B83371j37178J1926m4320L92643
13569E06442b00417E09357j96482n2806R4524K30487A70123J06762K5400P8329
13559C80614j21632l6373L75130m5701A59521K26458j76608J72667P7942A80699
$$ plain form
13631 349267 355167 378186 280042 567853 386413 398738 504976 488656 301079 539838 469909
13620 469909 215728 259876 395790 463202 483717 545538 675584 498416 253545 554866
13610 554866 804477 451923 520942 144426 388260 635450 424484 385945 367838 242415
13600 242415 763332 510393 387875 608339 130805 250835 238624 529234 74716 430551
13590 430551 368706 222736 399338 76438 143900 137935 354710 416658 347916 501361 466563
13579 466563 194821 364353 298360 191951 569797 283371 146193 158119 113799 506442
13569 506442 -200417 509357 312875 260069 354593 585080 170123 276885 302285 380614
13559 380614 258982 222609 597739 552038 159521 385979 209371 382038 459980 180699
13548E69714k67906j7733R9725K29890A46379K85212j41445J31601Q5318n2898
13538D54167k6300n0367C3705L78856j88494K56031A54485L5409J13265r3632
13528B09527J00904Q7339k0371K9803K07501D7817M43179B35966Q1853q670h5609
13516C87784j8569N5189k12182K30641j94242j6154J17806j44600J73292L00864
13506F79829C38143J14352A14812A769K98847r041A15346J87217L69736B24884
13495C90204k9051J05852J285P9421e2217C25670j1966n6222j24564J60754a36811
13483B33119R2396D7534L49054A93177c4857D257Q8841e5634B99365Q8994A57418
13471B38616n2140J31094j09400P4154n0768K129K43474c4391B63774N00706A05341
$$ plain form
13548 569714 301808 284075 383800 613690 146379 431591 290146 421747 507065 454167
13538 454167 427867 377500 33705 412561 224067 480098 154485 189894 303159 209527
13528 209527 310431 397770 377399 407202 614703 47817 490996 235966 317819 309149 -85609
13516 387784 369215 424404 212222 442863 248621 232467 350273 205673 378965 679829
13506 679829 338143 452495 114812 1769 300616 291575 115346 302563 672299 224884
13495 390204 361153 467005 468290 547711 -52217 325670 313704 257482 132918 293672 -136811
13483 233119 325515 47534 396588 193177 -34857 4257 93098 -55634 299365 388359 157418
13471 238616 186476 317570 208170 282324 231556 233685 477159 -34391 263774 764480 105341
13459A93951J51397j15989L4454j09679L86884D8229R9043n0636K7452B8922L24136
13448C53058j04227Q038K20984A85639l2334P2154A9771K68356D9638M14572A72234
13436B88417j14779E3199N15313G2289K51026J09794H1008J06724n6946K29920
13426C60706j74261F4715K99277j60116J15665a65355B36985P4719j30276G2986
13415I6810L56347j53393j14548o9280l2321L56558j71755a66005B46618D2980
13404B55213m1127f1486A26215M17621r1318j89687g4726a6254D46039R7255B41844
13392A62570K63031D8418J49093J35441q6387J70342b3148E50037D8860e5057
13381E3631q564N9950k0633J87267o6189L00247k6601f0021C85465a37483F65947
$$ plain form
13459 193951 345348 229359 263813 154134 541018 48229 147272 96636 124088 28922 353058
13448 353058 248831 256869 477853 185639 153305 225459 19771 288127 49638 464210 172234
13436 288417 173638 53199 568512 72289 323315 433109 81008 187732 130786 360706
13426 360706 186445 64715 363992 203876 319541 -165355 236985 311704 181428 72986
13415 96810 453157 299764 185216 115936 83615 440173 268418 -166005 246618 42980
13404 255213 214086 -61486 126215 543836 452518 262831 -74726 -16254 446039 543294 241844
13392 162570 425601 48418 197511 332952 246565 416907 -23148 550037 48860 -55057
13381 53631 45067 105017 84384 271651 205462 505709 479108 -60021 385465 -137483 665947
13369C91589J43561k30148o5647J65231j73786L313K55023j72560f6198B438K67666
13358B70104j08996J27108m4753a57576j9132A14505J6623K17619a94296D08982
13347D86162H3243a42585A50904N63263a02959D44307J03147j15292O840m6052
13337C92950Q7104j53463E2650K17340A10423O148J45836A14861P0405q6191A5434
13325B27734P1237a22235a4959E4975M61707I2493L02164R1694A94781k2393L38273
13314E10661j20377J22286p453A78844F3706K46254H9779J76707G7178J43697
13304B20875H2698L68969j41789i9034I6954B6108O5170J51584L0120F6236M0890
13293A07126K43406b2833B09273L15220A69860N7352D5459N6441c752C19324e6141
$$ plain form
13369 391589 535150 305002 239355 404586 230800 234113 489136 316576 -66198 2438 270104
13358 270104 161108 288216 243463 -157576 -176708 114505 131128 348747 -194296 408982
13347 486162 83243 -142585 150904 714167 -102959 444307 547454 432162 439002 392950
13337 392950 480054 326591 52650 269990 110423 116571 262407 114861 185266 99075 15434
13325 227734 298971 -122235 -14959 54975 516682 92493 394657 486351 194781 172388 510661
13314 510661 390284 512570 505117 178844 63706 309960 89779 266486 77178 220875
13304 220875 82698 451667 309878 -99034 96954 26108 91278 242862 272982 66236 107126
13293 107126 350532 -22833 209273 524493 169860 227212 45459 101900 -3752 319324 -56141
13281c1274B5087K04766D7435J1712a13731A24771m7509K13594A13719m1553K65522
13270C37688G0617a14287F0325a42035E9216M074M9730A612a57354A59482K9530
13259A89012F4935a05517E3499f6458A62141B5678L12813C8666a03652I4460c440
13247e6177B21588q1002R1645A06052L5117b06370B86669C6043J93015K85827
13237E14885a17214F8801J85341E5777J4087K75535a31006c8571C07820M6984
13227C54804A33496A7144L21168F8381J90882a48601D11642D0345J94468r8138
13217A36675J28904K03326c25921J48098B16798F0498a12385M8183k7658C388
13206g6555B91600a7786F8384a58113E7878J00689F5179J61297l5718e9292A0689
$$ plain form
13281 -31274 25087 229853 47435 59147 -113731 124771 77262 290856 113719 72166 337688
13270 337688 70617 -114287 60325 -142035 59216 63290 113020 1612 -157354 159482 189012
13259 189012 64935 -105517 53499 -66458 162141 25678 338491 38666 -103652 94460 -3440
13247 -56177 221588 140586 232231 106052 141169 -206370 286669 36043 229058 514885
13237 514885 -117214 68801 254142 55777 69864 345399 -131006 -38571 307820 354804
13227 354804 133496 17144 338312 68381 259263 -148601 411642 40345 234813 136675
13217 136675 265579 468905 -325921 -177823 216798 60498 -112385 -64202 -91860 3388
13206 -76555 291600 -17786 68384 -158113 57878 158567 65179 226476 190758 -59292 10689
13194i1226B91441F7094a34193a5188k18154E5049k2439J63854q3884j77J72097
13183B84500j36434A9797K08781A7291b58971A30017j9348J55723j16759D1129
13172B69753e3805p2068I6535a4476j18109B04293J05912n7549B1313a44142A57943
13160B16988m157D9988J42159a16151L4319C43357p8484E7835K5650l7644c10797
13148A43974J81282A28511O6698a06416A75639H2915e4132l11674B11700N4001
13138B65701q8756a86441B57016a71653A77939m9241O0576G9917K82316f5140
13127a5852j8895a0714A57623a19292A69267b16C23923A28727m3576J59123a6997
13115a07841k0169B20474J06810H337J90530n2261C1490a02592A33584J60804
$$ plain form
13194 -91226 291441 67094 -134193 -15188 -233342 55049 32610 196464 112580 112403 284500
13183 284500 148066 19797 228578 17291 -258971 130017 110669 266392 149633 41129
13172 269753 -53805 -125873 96535 -14476 -132585 204293 310205 252656 21313 -144142 157943
13160 216988 212831 49988 192147 -116151 -81832 343357 264873 57835 83485 45841 -310797
13148 143974 325256 128511 195209 -106416 175639 82915 -54132 -365806 211700 265701
13138 265701 176945 -186441 257016 -171653 177939 128698 189274 79917 362233 -65140
13127 -15852 -34747 -10714 157623 -119292 169267 -216 323923 128727 85151 244274 -16997
13115 -107841 -128010 220474 327284 8337 198867 146606 31490 -102592 133584 294388
13105B94388I4015J42959Q2374I7326A9149b6021k28381b4034C55088a45237B90343
13093A56065J21653A18249O2906J21613J19234A21822k9859K45895A13810e2576
13082D8781K26046a12403j49164B49298a35787F0075J4430m998D292K39275O2573
13071C06140H1717a88035A59293N3707P3227D5295a18243C31110g4117A48480
13060C29734c7133B99592b2382k50483A58056e4438R302k3436p6184B40843D5945
13048B34234h506B73839a14411A59068E6439L67001B7746a47750A12034J93062
13038C05096b0047A11124a18591a0005C57316A58082R9385e8486A3540a4943F2771
13026C1621K72944A28720J27804L4268K25662j05888J08472I5285k8874b61894
$$ plain form
13105 294388 94015 236974 319348 97326 19149 -26021 -254402 -24034 355088 -145237 290343
13093 156065 277718 118249 181155 302768 422002 121822 91963 337858 113810 -52576
13082 48781 274827 -112403 -261567 249298 -135787 60075 74505 69507 4292 243567 306140
13071 306140 81717 -188035 159293 213000 286227 45295 -118243 331110 -74117 148480
13060 329734 -37133 299592 -22382 -272865 158056 -54438 -45136 -68572 -144756 240843 45945
13048 234234 -8506 273839 -114411 159068 56439 423440 27746 -147750 112034 305096
13038 305096 -20047 111124 -118591 -10005 357316 158082 257467 -58486 13540 -14943 62771
13026 31621 304565 128720 256524 290792 516454 410566 519038 95285 66411 -261894
13015C10556J25371j73572e193k54417c8539A48481O907a28047A1859a48934A4396
13003A61508J95858A30682b20771G3955Q0794B1330b6108B09089K08123D2837
12992a39364G7738d4961A31222c8004A28539J4795Q3307I7223p11O4013g0181
12980b0861F37062k12750A22353n5340J56953e530C74283a25238E7515a27801
12969d4763D28076j54191C6715K56897C4635J13092i567b404I3350m5458D726
12957a20716A91161i5933B2129J87485l1115g3051J2950I2258d08579A15449i174
12945A88287B3614f0160G6032a04910E277M4493b02054B99747D4695j4623a04700
12933b9063C9427g7394j05241D00377j63064E3863J91706A9271a69588j03675
$$ plain form
13015 310556 435927 262355 -5193 -259610 -38539 148481 155388 -128047 11859 -148934 14396
13003 161508 357366 130682 -220771 73955 154749 21330 -26108 209089 417212 42837
12992 -139364 77738 -44961 131222 -38004 128539 143334 226641 97223 96512 160525 -70181
12980 -20861 637062 424312 122353 67013 223966 -5530 374283 -125238 57515 -127801
12969 -44763 428076 273885 36715 293612 34635 147727 -9567 -2404 93350 47892 4726
12957 -120716 191161 -95933 22129 209614 178499 -73051 -60101 92258 -408579 115449 -9174
12945 188287 23614 -60160 76032 -104910 5277 49770 -202054 299747 44695 30072 -104700
12933 -29063 39427 -77394 -182635 400377 237313 53863 245569 19271 -169588 -273263
12923b73263B92671G0891J02446l9788a57675E6987j2299a32581B68337b216j67637
12912a69853B26662M65F5107a60215A55092K55215a49000A40827o0896c6906G8371
12900b76993A2297b07077e2607j65482P359f3561C4442K64886A00197a84645F2480
12888b48815f2569B23016C4873M43594B13185k6843e1717A78664B3000K72450
12878B95450r8435c42754b5893l39702H6138f9321n7650C1596J77889j854q6560
12867A21071a18720B82355L5938g876E78100A44927j5608b50227A5201K8648k0120
12856B3729L28854A67147h2945E8845K19085a70506B09449E232P57b45873q7155
12845c33028B18181a22322d8726B01971J82317f3457l2136C2618M333b27979A43201
$$ plain form
12923 -273263 292671 70891 173337 133549 -157675 56987 44688 -132581 268337 -2216 -169853
12912 -169853 226662 227127 65107 -160215 155092 410307 -149000 140827 79931 -36906 78371
12900 -276993 12297 -207077 -52607 -218089 -210730 -63561 34442 299328 100197 -184645 62480
12888 -248815 -62569 223016 34873 478467 213185 186342 -51717 178664 23000 295450
12878 295450 197015 -342754 -25893 -365595 86138 -69321 -126971 31596 209485 207631 121071
12867 121071 -118720 282355 318293 -7876 578100 144927 129319 -250227 15201 43849 23729
12856 23729 352583 167147 -82945 58845 277930 -170506 209449 5232 5989 -245873 -333028
12845 -333028 218181 -122322 -48726 201971 384288 -63457 -95593 32618 36951 -227979 143201
12833A51100a50463J5531B40107g0319B671a43592A16620B4788P2573a86473D7154
12821A5666a48923D7840J2827b3394N061j59117g6212E356P1542K47916i6366
12809d822B1140G777a31260l1297B2978P6774B2648J19675o0963J17473c17601
12797a3297j52977e4500l17616a7512A65423C2020K8146b46474a03195B51415
12786D72839g6718A50835H39a85000A63344J28788a53508I2103K2491g1352j03675
12775a75027I4581J57193K4653j17021f380C5263b66094b6068B93610d5961k512
12764d8473C9257A0041J43847L660P8287o3148A4784J94955i4240q4894E8070
12752B10908n9411L997P526o1631e740A89461a86048j17013D8216j4813L46399
$$ plain form
12833 151100 -150463 -134932 240107 -70319 2671 -143592 116620 24788 97361 -186473 47154
12821 15666 -148923 47840 60667 -23394 -18333 -177450 -76212 5356 76898 324814 -96366
12809 -4822 21140 7777 -131260 -162557 22978 99752 22648 142323 81360 198833 -317601
12797 -13297 -166274 -54500 -372116 -17512 165423 32020 60166 -246474 -103195 251415
12786 472839 -76718 150835 839 -185000 163344 292132 -153508 92103 114594 -71352 -175027
12775 -175027 94581 251774 276427 159406 -6380 35263 -266094 -26068 293610 -45961 -48473
12764 -48473 39257 10041 153888 157548 235835 172687 14784 209739 -94240 -179134 58070
12752 210908 151497 155494 163020 101389 -5740 189461 -186048 -303061 48216 33403 379802
12741C79802F9544a07589B00681a01145D8346i857B34493h8438B04342F5479N5229
12730A20708c4395C36949n4050H4201b00932K7690C1485a69071c4534C03620g0378
12718B82839L8039H8969J20592C0844l015L41357E9720L48287b67047A25511J9256
12707A44767b2115A34253J59924A42471J84694A60603a50979E0830m502J64731
12697B11059l3318N017o8514K01907a4104l024B22679b19817h2212L7916A05270
12685G9491b00533D2486J17137M8411a583I6356K46351j64267E0778a68602N7391
12674a11211E38900g956E8207K20129q8999a72734L1656B15326R1619G1125A311
12662A40133a26501o5422i5303C57560e9896A11595g050E04542j27933A40677
$$ plain form
12741 379802 69544 -107589 200681 -101145 48346 -9857 234493 -88438 204342 65479 120708
12730 120708 -34395 336949 282899 84201 -200932 -173242 31485 -169071 -34534 303620 -70378
12718 282839 320878 88969 209561 30844 27829 369186 59720 408007 -267047 125511 144767
12707 144767 -22115 134253 294177 142471 327165 160603 -150979 50830 46328 211059
12697 211059 177741 182758 114244 316151 -14104 -17128 222679 -219817 -82212 -44296 105270
12685 79491 -200533 42486 159623 208034 -1583 96356 342707 178440 50778 -168602 -111211
12674 -111211 538900 -7956 58207 278336 189337 -172734 -141078 215326 306945 71125 1311
12662 140133 -126501 -191923 -95303 357560 -59896 111595 -7050 504542 376609 140677
12651A96500J26791C3779K53048b2883O421A58146J40542B7183a54877K4689D28382
12639i472B72967a70093F3637i150C14246n2167G4899L32614O9169j05675k4555
12628C46452p2211a69250B74244a52857O7580a5619B34409I800P8425a18502C4407
12616d5071R043a6211A45786d6659C99208H0578a4158C56790M6721j69472c4124
12604e0312G7670b33911I3842E450K15704b98059J10325B9134a72205j91314a5639
12592d2197A71070E7320b7595j30855E6836A1188a43162P802B5647K20976h2041
12580a19687D99377j82623Q004d610A72767E303a69505k39172f0046C38342a21520
12568F3759N0830M3213J28007c8547F3429R2719K08557A67365R4963K5928j33132
$$ plain form
12651 196500 323291 33779 286827 -22883 -16462 158146 298688 27183 -154877 -130188 428382
12639 -9472 272967 -170093 63637 -9150 314246 262079 74899 407513 476682 371007 346452
12628 346452 274241 -169250 274244 -152857 -85277 -15619 234409 9800 88225 -118502 34407
12616 -45071 -36028 -16211 145786 -46659 399208 80578 -14158 356790 403511 234039 -34124
12604 -50312 77670 -233911 93842 5450 221154 -298059 -187734 29134 -172205 -363519 -15639
12592 -42197 171070 57320 -27595 -158450 56836 11188 -143162 -135360 25647 246623 -82041
12580 -119687 499377 316754 324758 -4610 172767 5303 -169505 -408677 -60046 338342 -121520
12568 63759 114589 157802 285809 -38547 63429 156148 364705 167365 262328 288256 155124
12557A55124b98724k7020D9291J8383a8325C45257e6966A20923a95092I3362O629
12546I9991D7424L4831d1400E8392d22929F789O5411L43596j99617B8914J78296
12535B07210C5452R0281B6300J43084L5526j5509A121K8103J5762J04016C2013
12523B15385c07578E7560d3996E5970a44590n4221E3751a28033j55886B51654
12512c3851D4698a53912A77176c05288J00633h7419j06531B27748D533a00435
12501B04481a35034B74615A06106R1796a81893d7460j97121d2930j35998K5148
12491a53780J1888A78869M5870a72819O6103B62012b8661B97989F7922l174f5473
12479D50J88835b33599m9317C15494I1733a6958B311J30467g4147A39544a11880
$$ plain form
12557 155124 -298724 -325744 49291 67674 -18325 345257 -56966 120923 -195092 93362 99991
12546 99991 47424 82255 -41400 58392 -422929 6789 72200 415796 216179 28914 207210
12535 207210 35452 125733 26300 169384 204910 189401 1121 29224 44986 149002 32013
12523 215385 -307578 57560 -43996 55970 -144590 -198811 53751 -128033 -283919 251654
12512 -33851 44698 -153912 177176 -305288 -204655 -87419 -193950 227748 4533 -100435
12501 204481 -135034 274615 106106 197902 -181893 -47460 -244581 -42930 -178928 -153780
12491 -153780 -141892 178869 224739 -172819 -106716 262012 -28661 297989 67922 64748 -65473
12479 450 189285 -233599 -282916 315494 91733 -16958 2311 132778 -74147 139544 -111880
12467C59158a65169A89466c70071B44431p4875K3688C0070O17795c1213l625j17222
12456a52060r0633J21007k03509a28450f2804B39843M0714C3606J4114e7902A76600
12444a52791H3121L6784K31888J16228A14099J46927a64651D41749B02079a22277
12433B3777J33959c85620D3795K7557L2632g1564E368O3611b04051C0285b757
12421a46742F1667J9552j9883l078R5316j0E5592a09932A18083b2205B04570q6825
12409A17745c50246A26927J4127J81670E9419A000a53805o2401D2238a548F0814
12397i8161C49035m5251d6645B13195a0712l7988D3609R6887k2430a58067B10641
12385b18397B51532A6439a09774a7849B55821m6570E9845J08536K3577i1019E8189
$$ plain form
12467 359158 -165169 189466 -370071 244431 169556 193244 30070 647865 -31213 -34838 -152060
12456 -152060 -242693 -121686 -325195 -128450 -62804 239843 280557 33606 47720 -57902 176600
12444 -152791 83121 119905 351793 468021 114099 261026 -164651 441749 202079 -122277
12433 23777 157736 -385620 43795 71352 103984 -71564 5368 68979 -204051 30285 -2757
12421 -146742 61667 81219 61336 58258 153574 153564 55592 -109932 118083 -22205 204570 117745
12409 117745 -350246 126927 141054 322724 59419 1000 -153805 -216206 42238 -1548 60814
12397 -98161 349035 303784 -46645 213195 -10712 -48700 43609 140496 118066 -158067 210641
12385 -218397 251532 16439 -109774 -17849 255821 209251 59845 168381 191958 -91019 58189
12373B36588E700f0559p0830J2470j55447A13926C2667J20816c40844F2632f0156
12361a75156K109B16801H4969f3258I422d91533b331A57604g8814I4882f6789
12349a17249c0842A16721K661E0926b2282P803B5285N1405k7811R6736N6072q8266
12337A13421J14416a34467B0117g8467b5980C56492j40383F1162J43346n2026
12327A52482J97913a11947F0686a41301C4071a61333A50403f2820k29599a406
12316E5667K17074f1577F6529J00997M9864C3077K31043H5952i1212A02112c4709
12304c08405A60448d85514F8599Q3127j5117N6400a91692A42576E1783g9318A21
12292C84405b09810A141K51257d5733A15615K17185b44841L9377F01L58811A36389
$$ plain form
12373 236588 5700 -60559 -131389 -118919 -274366 113926 32667 153483 -340844 62632 -60156
12361 -175156 -173047 216801 84969 -63258 9422 -491533 -2331 157604 -78814 94882 -66789
12349 -117249 -30842 116721 119382 50926 -22282 -14479 25285 76690 48879 145615 201687 113421
12337 113421 227837 -134467 20117 -78467 -25980 356492 216109 61162 204508 152482
12327 152482 350395 -111947 60686 -141301 34071 -161333 150403 -62820 -292419 -1406
12316 55667 272741 -61577 66529 167526 217390 33077 264120 85952 -91212 102112 -34709
12304 -308405 160448 -485514 68599 151726 136609 193009 -191692 142576 51783 -79318 121
12292 384405 -209810 1141 252398 -45733 115615 332800 -244841 -205464 601 359412 136389
12280F0136j1428a64357D15805A58992p8503J45922L3790j549b6081A08189E426
12268A1495L04695a50397A17506P2203K73291E9405J29113b651k55014a15359
12257C00872A05612B8140L68338i2176A27000C9654M02160A67727m3291d38385
12246B17539h9212j1618A32518l4037K06315n1877O9140J08190c47915B44912
12235C29492c00015F196a34790L7112B05231o2323M5765O172K74771B9986f6159
12223a95144H1153J94992n6786J25901G6293J12881j4041K7842b26547E02961
12212B80638n5239J26285f7265C00873C7835J16336R6079C6690c3378A90180J44121
12201C34301l2036A14427l1971b8067D5898P5409a6808D2988Q1634g0372A50190
$$ plain form
12280 60136 48708 -164357 415805 158992 80489 226411 260201 258652 -26081 108189 5426
12268 11495 316190 -150397 117506 189709 463000 59405 188518 -2651 -257665 -115359
12257 300872 105612 28140 396478 -92176 127000 39654 441814 167727 124436 -438385
12246 217539 -89212 -100830 132518 98481 304796 252919 322059 430249 -347915 244912
12235 329492 -300015 6196 -134790 -97678 205231 142908 188673 194845 469616 29986 -66159
12223 -195144 81153 276145 219359 345260 76293 189174 175133 202975 -226547 502961
12212 280638 225399 351684 -67265 300873 37835 154171 250250 36690 -33378 190180 334301
12201 334301 302265 114427 82456 -28067 45898 121307 -16808 42988 124622 -70372 150190
12189b0498B426J83432a07096B31113K54657A29872a24760D68408A88034J09014
12179B97048b41637c0546E5568A5855J95700p1273a09172D99503B14509c4627
12168c03615A92590n1721J36772Q9568j82344L27146a14954B46389E7490d447
12157B88686G9825c5926A4940L20669A64664B0813L47835a07348A89577a40483
12146a67672C42474N1009j86872d0701A97989B782Q9221a08849C1209b14768a1792
12134A05618J26291q3654j1175D4149O8053J94204j37139J52483P0347F4659c4499
12122B64491g4585A16094h3997B4786a28361a8166j89504a8741A13751c46530
12111A93537b63220M6122A83221L877o3417n2836K04102c8174A8164J20765C2401
$$ plain form
12189 -20498 2426 185858 -107096 231113 485770 129872 -124760 468408 188034 297048
12179 297048 -241637 -30546 55568 15855 211555 140282 -109172 499503 214509 -34627
12168 -303615 192590 140869 277641 367209 184865 512011 -114954 246389 57490 -4447
12157 288686 79825 -35926 14940 335609 164664 20813 368648 -107348 189577 -140483
12146 -167672 342474 393483 206611 -40701 197989 2782 92003 -108849 31209 -214768 -11792
12134 105618 231909 148255 137080 44149 112202 306406 169267 321750 392097 64659 -34499
12122 264491 -74585 116094 -83997 24786 -128361 -18166 -207670 -18741 113751 -346530
12111 193537 -263220 -217098 183221 187098 123681 70845 274947 -38174 18164 138929 32401
12099a45569N549j62225J10947B42962b25259A40207m7468e1039l35905f5088
12088a79492B50359l9595a85250C11487B9396J41704K46113G2695N3096J02107
12078B27898e0800B00644B4607K32508K15310M86427J786227F83702C37149j0561
12068C26588a17894l0942E325L96756B5254K34683j01872F2714J32926J9705b88911
12056C97158A60086G4843J132g929C10931G2013M752a38051k0438A09454h1700
12044b03708G8389c36594b3556j78308K2758B42069F0849N5008J70061a06472
12033a14234B7365O4265a11522B63006c1834j22749j08264F2015e9294B25076
12022A30983a19132a9763m5146p0552I3778c07515r0415a34745d7511J5766A65353
$$ plain form
12099 -145569 -140020 -302245 -191298 242962 -225259 140207 92739 -51039 -386944 -65088
12088 -179492 250359 210764 -185250 311487 29396 171100 417213 72695 125791 227898
12078 227898 -50800 200644 24607 257115 472425 958852 2745079 683702 337149 326588
12068 326588 -117894 -148836 5325 402081 25254 259937 158065 62714 195640 215345 -288911
12056 397158 160086 74843 75975 -7929 310931 72013 76765 -138051 -158489 109454 -81700
12044 -203708 78389 -336594 -23556 -201864 -179106 242069 60849 115857 285918 -106472
12033 -114234 27365 91630 -111522 263006 -31834 -154583 -262847 62015 -59294 225076
12022 130983 -119132 -19763 -64909 -135461 93778 -307515 -397930 -134745 -47511 -31745 165353
12010B46622d6044j11549d344B70978N1102a87387d0350J295A50441b91015F7357
11998e2440B7940O982a91538K2898e2660F5756a41868j30576D46357h9252A77189
11986D9054h3378I8922b75492L9519A088a58223a4815k3993F4864K96667a8045
11974c29875p5379c6468F1837A1292P8173D4544J40713a21991j69471G8792a79735
11962b28645D8275J17155a12122A47525d17105B78873a50957o7761A77674c738
11951C2367N6027c7268B38691n4707b2602A28823O5103i3726i172j46227H6830
11939A09283a04182I1736c2178A71736m5989b66293F8071L0041f7839j47684g6312
11927C2558h4201A48827a34922C1903e3472A61119o2553k1847J3241a51542j61195
$$ plain form
12010 246622 -46044 -157593 -4344 270978 322080 -187387 -40350 -39055 150441 -291015 67357
11998 -52440 27940 34922 -191538 -168640 -52660 65756 -141868 -272444 446357 -89252 177189
11986 49054 -83378 98922 -275492 -235973 1088 -158223 -14815 -38808 64864 361531 -18045
11974 -329875 -405254 -36468 61837 11292 89465 44544 185257 -121991 -291462 78792 -179735
11962 -228645 48275 165430 -112122 147525 -417105 278873 -150957 -218718 177674 -3738
11951 32367 88394 -37268 238691 183984 -22602 128823 193926 -93726 -9172 -155399 86830
11939 109283 -104182 91736 -32178 171736 125747 -266293 68071 98112 -67839 -215523 -76312
11927 32558 -84201 148827 -134922 31903 -53472 161119 98566 76719 89960 -151542 -312737
11916c12737B16582D2700c22432g9245C86J37581a39245o0657G3234C3456j2335
11905B1121M2510k7995h5953c983l19237A03274b46066B09994j2711C8601J97921
11894B36522h0238L552q5539H1424J60425c1594m7256A45741c62968l3846F6448
11882a08081L7864B64576j15608I492a64646k8767A43442a38156C8888c25072
11871a23788d7096J7334A22768g613B82513A38042a43793C40567d8353H0823J6450
11860I7273h5113A255b20772f8768k4822p3140A3349J52956H1021b2426L892A59301
11847c4225k41352P1777j46585D4053e06311A2639b9968A11034b92018d6593B05467
11835c06864h0658h844E3357f3327j14797B97091b14641d1270A82654b08043A33386
$$ plain form
11916 -312737 216582 42700 -322432 -79245 386 137967 -139245 -199902 73234 33456 21121
11905 21121 63631 35636 -85953 -3983 -323220 103274 -246066 209994 197283 38601 236522
11894 236522 -80238 -76686 -162225 81424 241849 -31594 -78850 145741 -362968 -396814 66448
11882 -108081 -70217 264576 148968 9492 -164646 -193413 143442 -138156 38888 -325072
11871 -123788 -47096 -29762 122768 -7613 282513 138042 -143793 340567 -48353 80823 97273
11860 97273 -85113 1255 -220772 -68768 -93590 -166730 13349 166305 81021 -22426 -18534 159301
11847 -34225 -275577 -203800 -350385 44053 -506311 12639 -29968 111034 -292018 -46593 205467
11835 -306864 -80658 -8844 53357 -63327 -178124 297091 -214641 -41270 182654 -208043 133386
11823g7657k32705L6716a10923B00325r9852a96365D5952a04051j08627A56258
11812A44380a12911C3661e9601A86123a90923j04418B0891J13193a91922k518
11802a94440K720B95038c0242A15549b98720D3067a56836B3591a68604E779a58364
11790A5935a93426g5784h388A11708a74381A4059g7117j7212B08899b0843A43182
11778A16669d6240o3380e993j20343m9177C2166K20152j21651b78792J7790d7096
11766b08935D1652a89440B3739J07938F4711d0860B75516o4379h7396j61865A50539
11754b09854R0556A97545J30581r9341r6856m8246i9217A53659M2497c39587e5553
11742C4836O4714l5643K69911H4363J46575l53a16289q1191r889j7106A99368
$$ plain form
11823 -77657 -310362 -273646 -110923 200325 100473 -196365 45952 -104051 -212678 156258
11812 144380 -112911 33661 -59601 186123 -190923 -295341 20891 134084 -191922 -194440
11802 -194440 -191720 295038 -30242 115549 -298720 43067 -156836 23591 -168604 5779 -158364
11790 15935 -193426 -75784 -8388 111708 -174381 14059 -77117 -94329 208899 -20843 143182
11778 116669 -46240 -109620 -5993 -126336 -175513 32166 252318 130667 -278792 -261002 -47096
11766 -208935 41652 -189440 23739 131677 64711 -40860 275516 211137 -87396 -249261 150539
11754 -209854 -119298 197545 328126 228785 131929 83683 -99217 153659 196156 -339587 -55553
11742 34836 99550 63907 333818 84363 230938 230585 -116289 -197480 -207369 -224475 199368
11730i1126k7494A7527L93316c0800r113A18704a39285c7529j55868I1109c3154
11718C22626D5782R6799F2003A8100m780N202K00302J5778o2659b63A65800f1263
11705E6910a33906A600b5082A13636d25949a69401H752e1284A23392b62225e8067
11693B14819a54539A30518e8379A3484b12798J02718B53455a34370D12527b24444
11682E35654A53501L1493A9506P019R0357J5811a4765A87468P9041h4941p6385
11671a61326A42524a06428j78976C77782G0148O1792a96r5686A36868P7211B715
11659A97564E1737K87220a04261F5520j5022j6253K45137o0327F4101N4514m4716
11648G3899c4406o6897a8209A4855L11718j52773i3396K7103E733a06283G1236
$$ plain form
11730 -91126 -118620 17527 410843 -30800 -39913 118704 -139285 -37529 -193397 91109 -33154
11718 322626 45782 142581 62003 18100 13320 18522 218824 234602 171943 -263 165800 -61263
11705 56910 -133906 1600 -25082 113636 -425949 -169401 8752 -51284 123392 -262225 -58067
11693 214819 -154539 130518 -58379 13484 -212798 -110080 253455 -134370 412527 -224444
11682 535654 153501 184994 19506 26525 116882 132693 -14765 187468 266509 -84941 -161326
11671 -161326 142524 -106428 -285404 377782 70148 131940 -196 -95882 136868 214079 2715
11659 197564 51737 338957 -104261 65520 50498 34245 279382 219055 64101 118615 73899
11648 73899 -34406 -101303 -18209 14855 326573 173800 -93396 -66293 5733 -106283 71236
11636a85167B16785K13264i8713H878R8547h753A878e0034B30063n6097M890b16720
11623e5319k1216J8173B42059b30051Q8552p5378F0156h1489q210A8664I145a23551
11610A4704J31349J78812j02382f6653b0991j02680d1411A9451e504G0862B1540
11598A0778a59966N4189E3740a92733j8696A79285m5585K83211H7918J6662l6391
11587F8189N21977a5328E0366a65709G6725P6979B6170f5582A4465K62843b54608
11575a7624B63352j21819a01195E1461L33023G9198K89172j26163A11244A1939
11564b87127c1169i184B70697b0000C06235C7091b29196j49935A04596a77249
11553a00341k7942C21581a39662k7028E25129B28965J34724j06356K72950A41309
$$ plain form
11636 -185167 216785 430049 -98713 8878 107425 -8753 1878 -50034 230063 173966 178856 -216720
11623 -55319 -76535 -58362 242059 -230051 -141499 -216877 60156 -81489 -89699 18664 9145 -123551
11610 14704 146053 324865 222483 -66653 -20991 -123671 -41411 19451 -5504 70862 21540
11598 10778 -159966 -105777 53740 -192733 -211429 179285 133700 416911 87918 104580 68189
11587 68189 590166 -15328 50366 -165709 76725 153704 26170 -65582 14465 277308 -254608
11575 -17624 263352 141533 -101195 51461 384484 79198 368370 242207 111244 11939
11564 -287127 -31169 -9184 270697 -20000 306235 37091 -229196 -379131 104596 -177249
11553 -100341 -128283 321581 -139662 -166690 525129 228965 363689 257333 530283 141309
11542c58657a51819A57556C4773c1227A44214M54090A14129N9857P0873m6027
11532A98832r3449Q4753i599m4894j92049k1448f0082A65871e7059A94544r6320
11521I8224I655a24329A7841f468k1112p9944M2029j86460I53J6012Q4673K20735
11509C22373a87183D32953j78692p3124q5040J13634D0272J62669J10189b96000
11498e269I0148k1555O2224M504i3967P184b4278A22185e3571A95536C6564L24101
11486C60665h4850A82967c435A89614n0151L1349a55296D94377B34571L5229d2101
11474b84498a10579A52309G4638L91956d9355C95054E7012Q4113J50904I3710
11463b6894B62781d0711J342C83323d411j71191A60993K0517J20950A13837P2059
$$ plain form
11542 -358657 -151819 157556 34773 -31227 144214 598304 114129 173986 244859 198832
11532 198832 105383 190136 -9599 -54493 -246542 -267990 -60082 165871 -57059 194544 98224
11521 98224 9655 -124329 17841 -6468 -27580 -107524 -65495 -251955 953 16965 101638 322373
11509 322373 -187183 432953 254261 181137 96097 209731 40272 202941 313130 -296000
11498 -5269 90148 68593 130817 135321 -93967 -86783 -24278 122185 -53571 195536 36564 360665
11486 360665 -84850 182967 -3435 189614 139463 170812 -155296 494377 234571 269800 -42101
11474 -284498 -110579 152309 74638 466594 -49355 395054 57012 141125 292029 93710
11463 -26894 262781 -40711 -39369 383323 -4411 -175602 160993 181510 302460 113837 185896
11452A85896l908E3642K23501a06055A02392N472d8260l2485A60652N0642R9654
11441C10948a10939B57425j00727K64905j59387b1213l35130L7829i584A30376
11430A19078L26087a04478D58311b37467a9862k43464A90534f7119a2065B24917
11419a6414l964B53618d9466N968p4297F2608a81564A72306G0199h8788A11141
11407A94743F4063J07572a7173l06037A2820c51086a24015A71683D4508O7177
11397A11685J691c9896j90801O473Q182c4949j33736F8768a48219q2210r2293
11386c22722I1882a68879B36959b68170M6898B13499J68231n5864a95689F2321
11375h5923B74705N4451b45039d2613N03I5525a0952j88283D02040a52954A37180
$$ plain form
11452 185896 181988 53642 277143 -106055 102392 107864 -48260 -80745 160652 211294 310948
11441 310948 -110939 257425 156698 421603 262216 -21213 -356343 -318514 -9584 130376
11430 119078 445165 -104478 458311 -237467 -19862 -263326 190534 -67119 -12065 224917
11419 -16414 -20378 253618 -49466 -43498 -117795 62608 -181564 172306 70199 -88788 111141
11407 194743 64063 171635 -17173 -323210 12820 -351086 -124015 171683 44508 111685
11397 111685 113376 -39896 -230697 -224224 -216042 -34949 -168685 68768 -148219 -230429 -322722
11386 -322722 91882 -168879 236959 -268170 -221272 213499 381730 325866 -195689 62321
11375 -85923 274705 329156 -245039 -42613 -42110 95525 -10952 -199235 402040 -152954 137180
11363b4199A11009c62383J64659g4899G7378i8061H172b77284Q7008a6327m7117
11352f3444B27056b60936A75582J08195p459C9371G282J4316J05643L09569H9129
11340e2620H6219N2526c86956g5744c7229n7667l28383E1261B4413o7L1741a03620
11327a10074N3909A12022F666d0431C47341j36483F8328e2481Q08C32577A10769
11315a42095B2159c47690B0643f8767A87391D9313J77066p033E2239h6281k3759
11304a10040A0023b52927R6238F3482b02697K2671P7097A59884p9379R2267b01251
11292A16195k2411N6493Q3093K30762b65156D4443L35167a54927N7147n0272c7610
11280B34890H3756B5285c56620B00377H4385J00644a12044M0891A91619b29947
$$ plain form
11363 -24199 111009 -362383 -197724 -74899 77378 -98061 8172 -277284 -190276 -16327 -63444
11352 -63444 227056 -260936 175582 283777 276318 39371 7282 21598 127241 436810 89129
11340 -52620 86219 138745 -386956 -75744 -37229 -94896 -423279 51261 24413 24346 56087 -103620
11327 -110074 -56165 112022 6666 -40431 347341 210858 68328 -52481 -51673 332577 110769
11315 -142095 22159 -347690 20643 -68767 187391 49313 226379 219346 52239 -86281 -110040
11304 -110040 10023 -252927 -156689 63482 -202697 -180026 -102929 159884 80505 172772 -201251
11292 116195 93784 150277 233370 464132 -265156 44443 379610 -154927 -97780 -148052 -37610
11280 234890 83756 25285 -356620 200377 84385 185029 -112044 -71153 191619 -229947
11269I1091J04124B0457a64744A04960a21985C43330c0064A6259b46858L1794
11259b15064a8245F9234J05607E1922K1385g3521A45480E4385J12602b07671R3427
11248a14244A90975e5120A6482h663l52863M7260B10110m5835L849b45271E3160
11236A96766H4238b52398k2033A11165Q3675p1641a93851C22144b63340j58235
11226d21575b9192A20374A055N7488N8344b01398P8004N6293C7124K7749a36576
11214d4645j46373O6696J3428I1297a43412a5605j75155N7808B1479c3184k38085
11203b71269h3119j03658k805h901I4433d85668a49919K9786B3834g485k63999
11192b71484j3526B95464d7232j01402A81445l4573J74328a21014M2143a4275
$$ plain form
11269 91091 195215 20457 -164744 104960 -121985 343330 -30064 16259 -246858 -215064
11259 -215064 -18245 69234 174841 51922 73307 -73521 145480 54385 166987 -207671 -114244
11248 -114244 190975 -55120 16482 -8663 -361526 -314266 210110 164275 168124 -245271 53160
11236 196766 84238 -252398 -274431 111165 194840 123199 -193851 322144 -263340 -421575
11226 -421575 -29192 120374 1055 58543 116887 -201398 -123394 -67101 37124 64873 -136576
11214 -44645 -191018 -124322 -110894 91297 -143412 -15605 -190760 -132952 21479 -33184 -271269
11203 -271269 -83119 -186777 -189582 -8901 94433 -485668 -149919 -120133 23834 -7485 -271484
11192 -271484 -285010 295464 -47232 -148634 181445 146872 321200 -121014 -78871 -14275
11181D2108f3918j45575C96037d0698q2659B30509g7536C15904B6418f2624D4581
11169b19595B63662b04612P2804B32745f7080B06844N3851P1300E3741a9003o0238
11158g9241l0116j04932e70C64995f2832F0568c5017B00148b05016C88048d26869
11146b06140A01399c66612f7697m1690d7905n1370A05719Q9824J5017N9061a31694
11134B5150a93476A57373F4081c3792A10190a51208a3604j87374B78016A0987
11123d3923G1416J75925O2381a43253G3190J21978H7316J06053G5333a63973E5799
11111A12153J29207J0961j0791A10423b69022B05028J3325O1000m165J38950A10563
11099B24752A10818J80469A11663N7075K36530j46566J0786l4782a84169C07054
$$ plain form
11181 42108 -63918 -209493 396037 -40698 -123357 230509 -77536 315904 26418 -62624 44581
11169 -219595 263662 -204612 -131808 232745 -67080 206844 260695 331995 53741 -19003 -79241
11158 -79241 -109357 -214289 -570 364995 -62832 60568 -35017 200148 -205016 388048 -426869
11146 -206140 101399 -366612 -67697 -109387 -47905 -99275 105719 195543 210560 269621 -131694
11134 25150 -193476 157373 64081 -33792 110190 -151208 -13604 -200978 278016 10987
11123 -43923 71416 247341 309722 -143253 73190 195168 87316 193369 75333 -163973 55799
11111 112153 241360 252321 241530 110423 -269022 205028 218353 279353 275188 414138 110563
11099 224752 110818 291287 111663 168738 405268 258702 269488 234706 -184169 307054
11088B29197O5276Q7261d7540A4766K96088I602J1179K36208f3521A80539J58064
11077C38603L8356K1452L30263C25911L1092j0116A63993L73043A27428L44855
11067D72283B01358J74931m7379r5191P5584K73549L4019j91723m8650K05757
11057E82255J860j18478J45646j16074L27548C44773K99634J79356j95511j4979
11047F13273K804j78238J61331K03043C07255L60884L5519O1818P1337J1143L90226
11036A238182o17552j62600L14563C37224M55924j8024j20360j35047j52005L81134
11026G48846J23089Q7889k38813L7679Q8123l32825O4509j16682j10224L48950
11016G00541K8930C53372L52933K23760l99296o2065J04944p4000P2282J14941
$$ plain form
11088 229197 294473 381734 -47540 14766 310854 9602 20781 256989 -63521 180539 338603
11077 338603 376959 398411 728674 325911 357003 346887 163993 537036 127428 472283
11067 472283 201358 376289 328910 233719 309303 582852 616871 425148 376498 582255
11057 582255 584115 465637 611283 495209 822757 344773 644407 823763 628252 613273
11047 613273 616077 437839 599170 802213 307255 668139 703658 765476 836813 847956 1238182
11036 1238182 620630 458030 772593 337224 793148 775124 654764 519717 367712 748846
11026 748846 871935 959824 721011 758690 846813 513988 578497 461815 351591 700541
11016 700541 729471 353372 706305 930065 530769 468704 573648 499648 571930 686871
11006F86871J51342C96089M65529l75193L4967l3569P7919o8621L29169p4123
10996G52167j15910L4383o7528k22934M04402j2787J56233j52026K08777Q4966
10986A069743k88114J42083M5769j86207K00612j49156L87443J55321r803J584
10976A369275O05352J03127K50256P5121L58734J70681j73928j30783k66959j35877
10966B224999j55088j21614n9968m18361J61466m3267q2441K39624o0151j68015
10956A517184L26407m28082r8466j2303n8329j44620E16856k4654J67756p075
10946F52883j48998p6140j18455a04990A20710c240A75956Q1385a00142B15915
10935g2353B3040J17601m884b2988A87402D8873J02038f5575A73124n6992f5695
$$ plain form
11006 686871 838213 396089 861618 486425 521392 487823 565742 497121 826290 752167
10996 752167 636257 670640 603112 380178 784580 771793 928026 776000 984777 1069743
10986 1069743 781629 923712 969481 783274 983886 834730 1222173 1377494 1367691 1369275
10976 1369275 1974627 2077754 2328010 2403131 2761865 2932546 2758618 2627835 2360876 2224999
10966 2224999 2069911 1948297 1888329 1469968 1631434 1588167 1505726 1745350 1685199 1517184
10956 1517184 1843591 1415509 1317043 1304740 1246411 1101791 516856 492202 659958 652883
10946 652883 503885 427745 309290 -104990 120710 -3240 175956 257341 -100142 215915
10935 -72353 23040 140641 135757 -22988 187402 48873 150911 -65575 173124 116132 -65695
10923C19320b881l10274B19871a4860A76223g2385J0405q357L4537B37849C8636
10911A28900e4922j20384P9589A01386J22890a30817b7621B62562A14001a04151
10900g032k45652F3512j5929c2498A81204c1598J0005j46740A99559j9453q7560
10889I2546a55545n3385M7650A54129a5738r9396j63394D21922c95351I6315d2620
10877g3464r3055Q0710K2678D66747c08532D9470a66039C4510O2217A2905K43501
10866B56406c1493C2047b2441A0126J7969h4257m6094l29206a29568H1298A0086
10854b70856B41608D6736Q6679l3097P1801R6018I8532b83142A7110b62127R3845
10843a68282N3953l60574a08770h37A7983R9563a30273F7542J15761m2948b88602
$$ plain form
10923 319320 -2881 -313155 219871 -14860 176223 -72385 -61980 -70337 -35800 237849 38636
10911 128900 -54922 -175306 -95717 101386 224276 -130817 -27621 262562 114001 -104151
10900 -7032 -252684 63512 47583 -32498 181204 -31598 -21593 -168333 199559 180106 92546
10889 92546 -155545 -208930 -161280 154129 -15738 -115134 -278528 421922 -395351 96315 -42620
10877 -73464 -166519 -85809 -63131 466747 -308532 49470 -166039 34510 96727 12905 256406
10866 256406 -31493 32047 -22441 10126 28095 -84257 -130351 -459557 -129568 81298 10086
10854 -270856 241608 46736 133415 100318 172119 268137 98532 -283142 17110 -262127 -168282
10843 -168282 -114329 -474903 -108770 -837 17983 117546 -130273 67542 183303 140355 -288602
10831b40124b6311B89645E343a42336A26455a12583E4263a46487r7580m2927A01451
10819B02624D9755b83489A27578D8188L91229p9698C3619f17923A30578l9568
10809I1010d84676C83505b52525f0045A71841C1059r872f6379b2924l61329h9899
10797A24710a7961l13446A50844D8451a4638C3995a21763G7617O6675J40192a60792
10785a7427o1741l66128J96773d0170A53739a04251I8499B4505d4722l92673Q7585
10774c49810o1576J78812a8025a106B81793b66785A5027h6171A18656M24590A0538
10762g4403k3237j51912r045J07046J3759j0072A45035a26635I7669m4515J44779
10751A97933a55155d2242k15865A3295L3673K51190F4529a07928H1175q514J76221
$$ plain form
10831 -240124 -26311 289645 5343 -142336 126455 -112583 54263 -146487 -244067 -286994 101451
10819 202624 49755 -283489 127578 48188 439417 359719 33619 -617923 130578 91010
10809 91010 -484676 383505 -252525 -60045 171841 31059 21187 -66379 -22924 -384253 -89899
10797 124710 -17961 -331407 150844 48451 -14638 33995 -121763 77617 144292 284484 -160792
10785 -17427 -79168 -445296 -248523 -40170 153739 -104251 98499 24505 -44722 -437395 -349810
10774 -349810 -411386 -232574 -18025 -1106 281793 -266785 15027 -86171 118656 543246 10538
10762 -74403 -97640 -249552 -258597 -151551 -137792 -147864 145035 -126635 97669 53154 197933
10751 197933 -155155 -42242 -258107 13295 46968 298158 64529 -107928 81175 72661 248882
10740B48882a62490k06906a67075C7138F963a61029m8795a9468j41629G4834a17772
10728i7449o7748A912K26671A7504K78079c4683B25069a66137b9867j32644B42026
10716h5964A74684b00134A78926b06140F8389d1731j77344c8909j25529A71416
10705a75257I8180D1442b30866h5711L1869A20167e8480B02414a42405c8819j8150
10694e6969a4426j05026B88279e3103B02065b22214A50338d2175A4223a6690k90990
10683c07680B42707D9183J5099J27329D266K92665c10193a15873c0280J4636j54289
10672a69933A841a46907b2444A38191K94680A65754j363b1364j33651e4528j94129
10661b48657k9851A30951O6452c16411B09753i6701j17698E575K02536l1149a99775
$$ plain form
10740 248882 -162490 -369396 -167075 37138 6963 -161029 -209824 -19468 -161097 74834 -117772
10728 -97449 -165197 1912 228583 17504 295583 -34683 225069 -166137 -29867 -162511 242026
10716 -85964 174684 -200134 178926 -206140 68389 -41731 -219075 -38909 -164438 171416
10705 -175257 98180 41442 -230866 -85711 -53842 120167 -58480 202414 -142405 -38819 -56969
10694 -56969 -14426 -119452 288279 -53103 202065 -222214 150338 -42175 14223 -16690 -307680
10683 -307680 242707 49183 64282 191611 4266 296931 -310193 -115873 -30280 -15644 -169933
10672 -169933 1841 -146907 -22444 138191 432871 165754 164391 -21364 -155015 -54528 -248657
10661 -248657 -278508 130951 197403 -316411 209753 -96701 -214399 5575 208111 176962 -199775
10649I4632N1012a64411r9356g1954J8219o431k4475k34402O8637B96475c17775
10637a50071f8922a4302k11986G7100i3624B48418a58933A05552c55056A4621
10626a43599j935A34944b66980A40148d14851J74803b5924A13972b45552A05988
10615a80761I6278O8613c6383I3140b36953b4191I3681a25922j01315A3384d7612
10603A34219a53828j80873h9186C18446h4567N781K1333B34283e2273H3090O9380
10592A52470a01228c4629j44533f7020j42837m3543J00555A42818g471l64991
10582c72462B22616b60898P3959B2773g7058H615d45334A45654c11643g5406j45495
10571b20901j91455E05626h9211A4032M56744G8788b09165Q0091k29501G1118
$$ plain form
10649 94632 145644 -164411 -263767 -71954 -53735 -60166 -84641 -319043 -250406 296475 -317775
10637 -150071 -68922 -14302 -226288 77100 -93624 248418 -158933 105552 -355056 14621
10626 -143599 -145534 134944 -266980 140148 -414851 -240048 -25924 113972 -245552 105988
10615 -180761 96278 164891 -36383 93140 -236953 -24191 93681 -125922 -227237 13384 -47612
10603 134219 -153828 -334701 -89186 318446 -84567 -78786 -57453 234283 -52273 83090 152470
10592 152470 -101228 -34629 -179162 -67020 -209857 -253400 -152845 142818 -7471 -372462
10582 -372462 222616 -260898 -186939 22773 -77058 8615 -445334 145654 -311643 -75406 -220901
10571 -220901 -412356 505626 -89211 14032 470776 78788 -209165 -129074 -358575 71118
10560A8012a15696J3465k89756f1181j53723f8252q862d470C5307g733A06272
10548e7028A66662a40540k10178A31088a2746j92090l4860R3851l0959j9761P3394
10537a23171j35547b9697B11833n1857a88491d5322j6908A27890J46705b51873
10526a07319l3473M5340j8397A75015l8837J6629b48008f9225A70042Q065b2968
10514a53657A01004c69922a36153J2633J1170B65370b1423j06543d5551E53188
10503a09479b5382k81799a28511M3898B94595i2137j25A86047d4242r9234j81231
10492c24707a23099k01555E0900a30400A656K02022k0717d41994c3681j32789
10482a66470c741A35783J21415p8677J21400h0237C9628L28339C648K42614k0631
$$ plain form
10560 18012 -115696 -102231 -391987 -61181 -214904 -68252 -77114 -4470 35307 -7733 106272
10548 -57028 166662 -140540 -350718 131088 -12746 -204836 -239696 -145845 -176804 -196565 -123171
10537 -123171 -258718 -29697 211833 159976 -188491 -45322 -62230 127890 274595 -251873
10526 -107319 -140792 -95452 -113849 175015 136178 152807 -248008 -69225 170042 178107 -22968
10514 -153657 101004 -369922 -136153 -123520 -112350 265370 -21423 -127966 -45551 553188
10503 -109479 -25382 -307181 -128511 -84613 294595 -92137 -92262 186047 -44242 -143476 -324707
10492 -324707 -123099 -324654 50900 -130400 1656 203678 182961 -441994 -33681 -166470
10482 -166470 -3741 135783 257198 178521 299921 -80237 39628 367967 3648 246262 225631
10471B25631g7198A3639d7783a3370B99640j48775b2746k62284A7718a10498A85663
10459A95205n4556b41658F3523j1382b876j53284N6646l86269C53282j29524C8995
10447A69930b18552B21415g7631k81797L0422J33422A08532a94515h2501K1138
10437f1363A68421F308J60000J26047i1390a0126l18386L8734C24298B3296J21508
10426A44804c04672E1505g5328j25162A5466a21992e1393I4194L3513e9892C8191
10414A09115M5704i1423P658Q926p0247D4418f64296d7428j06903p5478R3401
10403a36408b701j74693j01078a30363A45501l2188a34600B58991q4716D5206
10392C58000b9144o067J5436h686A59579a34472B30721E5048b79668B49811a38417
$$ plain form
10471 225631 -77198 13639 -47783 -13370 299640 150865 -22746 -285030 17718 -110498 185663
10459 195205 140649 -241658 63523 52141 -2876 -156160 -99514 -485783 353282 223758 38995
10447 169930 -218552 221415 -77631 -359428 -329006 -195584 108532 -194515 -82501 -61363
10437 -61363 168421 6308 166308 292355 -91390 -10126 -328512 -289778 324298 23296 144804
10426 144804 -304672 51505 -75328 -200490 15466 -121992 -51393 94194 127707 -59892 38191
10414 109115 154819 -91423 -83765 -74839 -145086 44418 -664296 -47428 -154331 -229809 -136408
10403 -136408 -2701 -177394 -278472 -130363 145501 113313 -134600 258991 174275 45206
10392 358000 -29144 -35211 -19775 -8686 159579 -134472 230721 55048 -279668 249811 -138417
10380A05787a85662B20796J04638P1982c4048F9977K06414l3418K32868A80532
10369C07327A20888J70949J85479L13370C84196J80579L979B60472n8692N02205
10359G03985l28384j14182a706D43890k13919h2413D28643O0938B26041M36174
10349F62215p6866j82270K9301j94743b0706E02499k22552K73675A09355J92907
10339C02262g6752D44987A22535c651B05567p678m8799J16183R7607a48602j21840
10328b70442A5323J29487a19386I4334m5588J98099L4904F7858K01077h1711q891
10317i0602E9701J33698f9121D57210F3158Q2249g7677j57651E2784K71315j33194
10306A90905J80741g6215J571A53148L2853n8609a47417m7514a823k76453O5472
$$ plain form
10380 105787 -185662 220796 325434 397416 -34048 69977 276391 242973 475841 180532
10369 307327 120888 291837 477316 790686 384196 564775 568754 260472 201780 703985
10359 703985 375601 261419 -1706 443890 229971 -82413 428643 489581 226041 662215
10349 662215 585349 403079 432380 237637 -20706 502499 279947 553622 109355 302262
10339 302262 -76752 444987 122535 -3651 205567 197889 149090 265273 362880 -148602 -270442
10328 -270442 15323 144810 -119386 94334 48746 246845 281749 67858 268935 -81711 -90602
10317 -90602 59701 193399 -69121 457210 63158 145407 -77677 -235328 52784 324099 190905
10306 190905 371646 -76215 -74644 153148 186001 127392 -147417 -194931 -1823 -278276 -212804
10295b12804g4343p2896C4526K48819H1645l9176a59677k8684M7376A19509a28371
10283b96956J2546B50026m7669c8811M485r897D37548a30163D845a38363A12273
10271a7056o1423o8271D5014J47131b5234b260j01547c7190l66706a49563A05477
10259C31742A16740M06262A78797M38631B97485A20952J76421g3971B20859a77442
10248E8194O401J61281I1168b38009b934B14367g5615H3554g352C79267a03822
10236A21220d7904A6322c08646h808m27047a7391j74154l958L2400c6369k56931
10225b93300a23371j2745I9674c1119F2103L65395b06833f9157d531l67233e7174
10213A27787k9159c5911l1692j4897l0479j86442A72832q1567M0154b2571D71412
$$ plain form
10295 -212804 -74343 -147239 34526 283345 81645 42469 -159677 -188361 -140985 119509 -128371
10283 -296956 -284410 250026 202357 -38811 -34326 -44223 437548 -130163 4845 -138363 112273
10271 -17056 -78479 -146750 45014 192145 -25234 -2260 -103807 -37190 -403896 -149563 105477
10259 331742 116740 523002 178797 617428 297485 120952 297373 -73971 220859 -177442
10248 58194 64595 225876 91168 -238009 -2934 214367 -75615 83554 -7352 379267 -103822
10236 121220 -47904 16322 -308646 -8808 -435855 -17391 -191545 -195503 -163103 -36369 -293300
10225 -293300 -123371 -136116 99674 -31119 62103 427498 -206833 -69157 -4531 -371764 -57174
10213 127787 98628 -35911 -67603 -82500 -112979 -299421 172832 91265 131419 -22571 471412
10201A62151b4903G5489k8840a16700j35019i8092j85942N1290E4041J8872b30815
10189G124g78n66014a12572c7022R884C4700J778M6148C6145i1405q7998c4907
10176b75371d3103H6992C3633Q2092J93961b19833P2772K7546m296j0086C24878
10164d08229H2981b02781g9029c1830A13142d20205C6990a6784k3228j35234q274
10153a83520K9461f6502B6388P7275A4053J79348a78403p2348J21949d0228A21336
10141b31653c4671k7062l1023j51071H922a90595l095B20898D5050f7136a3288
10129A00747a40947M1977A46151b30110E5789f6586l59917B17947a5682k67149
10119b82831e7635C33471E7456c2316j29232b3669E6817b42295D33367a22910
$$ plain form
10201 162151 -24903 75489 46649 -116700 -251719 -98092 -284034 -232744 54041 72913 -230815
10189 7124 -778 -566792 -112572 -37022 -27138 34700 36478 82626 36145 -91405 -179403 -34907
10176 -275371 -43103 86992 33633 115725 309686 -219833 -147061 -119515 -123811 -133897 324878
10164 -408229 82981 -202781 -79029 -31830 113142 -420205 36990 -16784 -40012 -175246 -183520
10153 -183520 -154059 -66502 26388 103663 14053 193401 -178403 -250751 -128802 -40228 121336
10141 -231653 -34671 -61733 -92756 -243827 8922 -190595 -193690 220898 45050 -67136 -13288
10129 100747 -140947 -98970 146151 -230110 55789 -66586 -426503 217947 -15682 -282831
10119 -282831 -57635 333471 57456 -32316 -161548 -23669 56817 -242295 433367 -122910
10108a6132j44585j61417A7044K78338f2825H0232e822k41405e6529B25143b23858
10096A1185M6901a69760K6287N0226E8152b40908F247i4099b6682A34830e943
10084f3303j78635B24259b8236m4109A12953b48280h1679B39923a94023M1153
10074a52870e4571j7866l04312K6561J26083i5928l940a4937j57412A0082c06781
10062a77977C2798J20419b25443F1187i6123A02787f7833B27718P900c7021k36413
10051b73434J14410D8829J1881A4875c42523A9118d4961C7182i6406h778q5803
10040i4581B6482b79903g8213E0441J10339l8734K142b33938H1679B4786b43543
10028a63159D5515M1856l439a16597o2724b0726k01592L5782C17283A51939a78360
$$ plain form
10108 -16132 -160717 -322134 17044 295382 -62825 80232 -5822 -247227 -56529 225143 -223858
10096 11185 58086 -169760 -143473 -93247 58152 -240908 6247 -94099 -26682 134830 -5943
10084 -63303 -241938 224259 -28236 -72345 112953 -248280 -81679 239923 -194023 -152870
10074 -152870 -54571 -72437 -376749 -350188 -224105 -95928 -99868 -14937 -172349 10082 -306781
10062 -177977 32798 153217 -225443 61187 -96123 102787 -67833 227718 235618 -37021 -273434
10051 -273434 -159024 48829 60710 14875 -342523 19118 -44961 37182 -96406 -8778 -94581
10040 -94581 26482 -279903 -78213 50441 160780 122046 124188 -233938 81679 24786 -243543
10028 -163159 45515 87371 83932 -116597 -179321 -20726 -222318 -186536 317283 151939 -178360
10016b29278A5960b45532a8189m2408n1864l3216A0151a76704d2090f61D3151
10004a76240A84958a39772a2735m6581C9900h5588H787M2785c9952B35327c24156
9992a42064a3274k86498L5141I1937k3323b56350R3731d1446l5790k38092A08834
9980a4655b726E5760a53873J8475K8940n5431M4524k07998H9796K12501f1898
9968f3575k5359p6611I3124b35695i2983c5524A40149a66388j11867J38804f027
9956D2123b43545A91802L25531b35435K8511K6356Q2396l18289c9236B37201p1813
9945A65388c7915A81769c43042b1657n6818k32935c0066E3685b0486p4132I7928
9933i7070a773G1454A9308i9928n3561P5036j24362C3313a70687C87103b63132
$$ plain form
10016 -229278 15960 -245532 -18189 -60597 -112461 -145677 10151 -176704 -42090 -661 43151
10004 -176240 184958 -139772 -12735 -59316 39900 -85588 8787 51572 -39952 235327 -324156
9992 -142064 -13274 -299772 -264631 91937 68614 -256350 -162619 -41446 -77236 -315328 108834
9980 -14655 -2726 55760 -153873 -135398 -106458 -161889 -117365 -325363 89796 302297 -61898
9968 -63575 -88934 -165545 93124 -235695 -92983 -35524 140149 -166388 -278255 -139451 -6027
9956 42123 -243545 191802 517333 -235435 -206924 -180568 -98172 -416461 -39236 237201 165388
9945 165388 -37915 181769 -343042 -21657 -78475 -311410 -30066 53685 -20486 -94618 97928
9933 -97070 -1773 71454 19308 -99928 -153489 -78453 -202815 33313 -170687 387103 -263132
9921I2027n445a78290L3429G0416b1293G9768b31072K081d4876B8464D650h6076
9908a03845k21256a16620H0075b40444j5456N0700B9161b62765a05332A46448
9897i579k86070H2920k8672g6567D6836a54865j8966I0118N5306f9073C5408c2927
9884a37496o6101h3545E0842b0545A86316J3956d9141J3471j4924j09554B28994
9872b5603G6980j6545g2287L5287j08171e6638j97188h3963j76621A16771L1221
9861A47992F4640I767a2795o454Q881k66893k6490A44130J04431b40500h6381
9849a72059k24269B04938a44890k38317J32330D7674H91b44362J13110A55556
9838b33093A47543e9055l02432g4839j76045J25204b1989m2572j8928L5172j74056
$$ plain form
9921 92027 86582 -178290 -144861 70416 -21293 79768 -231072 -228991 -44876 28464 4650 -86076
9908 -103845 -325101 -116620 80075 -240444 -255900 -205200 29161 -262765 -105332 146448
9897 -9579 -295649 82920 54248 -76567 46836 -154865 -173831 90118 145424 -69073 35408 -32927
9884 -137496 -203597 -83545 50842 -20545 186316 200272 -49141 -35670 -50594 -160148 228994
9872 -25603 76980 60435 -72287 -37000 -145171 -56638 -253826 -83963 -260584 116771 147992
9861 147992 64640 9767 -12795 -19249 -10368 -277261 -303751 144130 248561 -240500 -86381
9849 -172059 -396328 204938 -144890 -383207 -250877 47674 891 -244362 -131252 155556
9838 -233093 147543 -59055 -361487 -74839 -250884 -125680 -21989 -64561 -83489 -48317 -222373
9827b22373D01132l5829G531R3417j0315a23181f563j12694N8363n1334o3623
9816a75851j1478P8782B41705D3592B1335a59737c9835K159P330A55537e0211
9804f33157h6340m7338q9592A4571K49391a93923B19546f061l9361j0421j81111
9793b36954N0078A20098K4110A7841K7716j8550K71984a99433L8108j20741k56103
9782e38169F8070b79036P9747E5325a90258p9997q7344B56824G0925b25571k31701
9771d57272D9260a17969b028B69670c23535f4955C4607K845J10337c95078b2934
9759D12535A73250h8710G8664a07862j6758p6843A13039a88497P8525A01367c16900
9747a23687B147d94066i0240k55484J41148i4553A38497a49535F6490a23144e9798
$$ plain form
9827 -222373 401132 365303 7531 100948 90633 -123181 -6563 -119257 -60894 -112228 -175851
9816 -175851 -187329 -108547 241705 43592 21335 -159737 -39835 -37676 -30346 155537 -50211
9804 -633157 -86340 -133678 -223270 14571 263962 -193923 219546 -6061 -45422 -55843 -236954
9793 -236954 -186876 120098 144208 17841 45557 27007 298991 -199433 -161325 -282066 -538169
9782 -538169 68070 -279036 -199289 55325 -190258 -270255 -357599 256824 70925 -225571 -457272
9771 -457272 49260 -117969 -2028 269670 -323535 -64955 34607 37452 147789 -395078 -22934
9759 412535 173250 -88710 78664 -107862 -124620 -201463 113039 -188497 -109972 101367 -316900
9747 -123687 2147 -494066 -90240 -345724 -204576 -94553 138497 -149535 66490 -123144 -59798
9735i8314k83766i590F9348i1642q9888m3085I3218a88338g9577A02110b11331
9723H4913e870C22587A6337J30285J63605j52583G4563a45509C93949j96435c77860
9711a12286b2409p2698j06749i0286k7012q3562B10543b88418N0122A6628a98265
9699b65559e072n5290D0231a29078N1924M977j17900G6700b42781c5682A15032
9687a5074G225c9594j5126A59941a29104b3422k01981p2201a36116L1360H4512
9675a46241A37419h6406d543k46517h6771d1643k05205j03642G5064a38115m3873
9664a81988P0999M1442j63784A70663c1475A75148f1560j60692G0659c63502D53528
9652a30502m0116p846P9364H156J16785a36302k09532m4652a21167B8834d45602
$$ plain form
9735 -98314 -382080 -9590 69348 -91642 -181530 -224615 93218 -188338 -79577 102110 -211331
9723 84913 -5870 322587 16337 146622 310227 157644 74563 -145509 393949 197514 -377860
9711 -112286 -22409 -95107 -201856 -90286 -117298 -200860 210543 -288418 -238296 16628 -198265
9699 -265559 -5072 -60362 40231 -129078 -77154 -72177 -190077 76700 -242781 -35682 115032
9687 -15074 7225 -39594 -54720 159941 -129104 -23422 -225403 -297604 -136116 -104756 84512
9675 -146241 137419 -86406 -4543 -251060 -86771 -41643 -246848 -350490 75064 -138115 -181988
9664 -181988 -110989 -69547 -233331 170663 -31475 175148 -61560 -222252 70659 -363502 453528
9652 -130502 -170618 -178464 -99100 8156 124941 -136302 -345834 -390486 -121167 28834 -445602
9640c91797a63830g3133k15398L1671J5951l2719A51249L4980h7812C3181f8365
9628b63008k4607J8940i6558k31933A34842c71508c9357q325B56352j2813g5073
9616a50940k4659Q3695m5208q5424L0485q7729L6905L7764R5583B40400b69497
9604E1733J25317h8996K760G0096e13450a94187B50579e8541n6610q2108B53860
9592d1102D873d13390G6909J4522c5060A59168d7888r2188m0132H0041i4738A269
9579c61548D2216b07200j30689j54482B32775d84139I458k35R3556c32540J59312
9568a73228B05809J56565b78399n741K1505J29242D6913b76417i8762A60418a58429
9556A61445e5844A8861d93340C300d2282p3804p8383G4363h666j02418A8489a86915
$$ plain form
9640 -391797 -163830 -73133 -288531 -256860 -240909 -273628 151249 186229 -87812 33181 -68365
9628 -263008 -287615 -268675 -96558 -328491 134842 -371508 -39357 -47682 256352 243539 -75073
9616 -150940 -175599 -91904 -137112 -222536 -192051 -279780 -242875 -205111 -109528 240400 -269497
9604 51733 177050 -88996 -86236 70096 -513450 -194187 250579 -58541 -115151 -197259 253860
9592 -41102 4873 -413390 76909 91431 -35060 159168 -47888 -140076 -180208 80041 -94738 1269
9579 -361548 42216 -207200 -337889 -492371 232775 -484139 9458 9223 102779 -332540 -173228
9568 -173228 205809 362374 -278399 -284140 -262635 -133393 46913 -276417 -98762 160418 -158429
9556 161445 -55844 18861 -493340 3300 -42282 -116086 -194469 74363 -8666 -111084 18489 -186915
9543a76461A14629g0313k12879A09816a31472O3703F7481c6601n7200l743c6766
9531d255A44237B3856A035M0557a45516O791M1109J1455A01706a71493A11896
9519H007R4285N4447e0897K3465B8851f8158B55928b21662h9341j9899c8734A72176
9506f9163A39759O652F8331K8604a62238D1874b43265l40088A12834d69550K05055
9495b64495N8620A81103a23732j83495a10056k02279A93362b80442J26065c8410
9484B7921e670C40659a10158C3402N1747d30794a63357j659N9222G5961a40613
9472f5364B727J3812L3679b36241a02592M5064j15481A3009c54810a31667b5035
9460f0472n0422l6286G8279d2627A96018a13251o264I6937a82938k04569M130
$$ plain form
9543 -176461 114629 -70313 -283192 109816 -131472 -67769 67481 -36601 -93801 -97544 -36766
9531 -4255 144237 23856 1035 41592 -145516 -138725 -97616 -86161 101706 -171493 111896
9519 8007 102292 156739 -50897 -27432 28851 -68158 255928 -221662 -89341 -109240 -38734 172176
9506 -69163 139759 146411 68331 96935 -162238 41874 -243265 -583353 112834 -469550 -264495
9495 -264495 -205875 181103 -123732 -307227 -110056 -312335 193362 -280442 -154377 -38410
9484 27921 -5670 340659 -110158 33402 85149 -430794 -163357 -165016 -105794 75961 -140613
9472 -65364 2727 16539 50218 -236241 -102592 -57528 -173009 13009 -354810 -131667 -25035
9460 -60472 -110894 -147180 78279 -42627 196018 -113251 -119515 96937 -182938 -387507 -383377
9449c83377A99728a28365a227m3209C75409a1880r7371A36805c61495J03530M4862
9438b13103r2679J12286M0236a6302A5406f9615A5210a63707h1436n4052K1810
9427a13678L8655J8317j21590L8920B79007H8362a30072k14213a34412C3131a5265
9415F8715b36077B95205A27927f2463A24561P8277a9726d894l21533b5377j64468
9404a89845H3439c08054A65301e596m1841A40547f7667b9196a0103r6509l5530
9393a42142k02753a24319B21285a01916B58705b11106j63973a1133A73151e3007
9382b53685F006J11335K8122a63378O3661L4909j98947R4462O3930j48805A62161
9370G7434e0374A29896c07484a42348q3960A0328a40370j61995A84690E990f4623
$$ plain form
9449 -383377 199728 -128365 -1227 -44436 375409 -11880 -109251 136805 -361495 -257965 -213103
9438 -213103 -305782 -193496 -153260 -16302 15406 -69615 15210 -163707 -81436 -135488 -113678
9427 -113678 -75023 -56706 -178296 -139376 279007 88362 -130072 -344285 -134412 33131 -15265
9415 68715 -236077 295205 127927 -62463 124561 202838 -19726 -4894 -326427 -25377 -189845
9404 -189845 83439 -308054 165301 -5596 -47437 140547 -67667 -29196 -10103 -106612 -142142
9393 -142142 -344895 -124319 221285 -101916 258705 -211106 -375079 -11133 173151 -53007
9382 -253685 6006 117341 145463 -163378 -99717 -64808 -263755 -169293 -105363 -254168 162161
9370 77434 -50374 129896 -307484 -142348 -226308 10328 -140370 -302365 184690 5990 -64623
9358c3417j18608j65873J34137A82360b49289C68423A71664f1177N246k33659
9348b89590B38747a22798A27274N4402b5469p1934j0793A67727b72138n5016B0652
9336a47511F88a0307A28576b63150B13272a14731k1067O3244l24065A4222e460
9324b33073E7033j5224b34736H1760f0895j46869A45153b84776D3475B584f9438
9312b89038a39251K512B52817I3440i6762m85642a41628j34814A06703a23956
9301a58747p8120f7789a6002A5046b643o5124B24954h1388j71217c5289j59537
9290a94826A41735N5597i7907a9106l91666a33924J8729B0698a62490C70460c8862
9278I685c49199A06619b6033j60112B56179g8265j40287A4764N794h9373B0271
$$ plain form
9358 -33417 -152025 -317898 -183761 182360 -249289 368423 171664 -61177 -55931 -289590
9348 -289590 238747 -122798 127274 181676 -25469 -97403 -108196 167727 -272138 -327154 20652
9336 -147511 688 -10307 128576 -263150 213272 -114731 -135798 -72554 -396619 14222 -5460
9324 -233073 57033 41809 -234736 81760 -60895 -207764 145153 -284776 43475 2584 -69438
9312 -289038 -139251 -136739 252817 93440 -96762 -582404 -141628 -276442 106703 -123956
9301 -158747 -236867 -67789 -16002 15046 -2643 -67767 224954 -81388 -252605 -35289 -194826
9290 -194826 141735 197332 -97907 -19106 -410772 -133924 -115195 20698 -162490 370460 -38862
9278 9685 -349199 106619 -26033 -186145 256179 -78265 -218552 14764 20558 -89373 20271
9266c11342a46337n3779N9389O8505j314k76970B19427b72762B17417F9039P0435
9255A39474c29581i1333k02737a30247A87378c69231A86691j3590d34954J55499
9245b79455A635b09699g0818B56862e050E2850J6734b2921k76578A93259c08520
9233g7505B06903L8788b84469a00590a8839D61851A3874f9356k29201a6029A70595
9221b55420A37801b49442B75010e77962a89638e2446I1049a13449G1382b19612
9210a76502A92337E2934J21703F511a69170j62129a17944q0866d9474E647b25509
9198a99100J3863j74497a25168n2875A43926o8819c0800C55054e516k60778A36307
9186a8704k13275f1976B1724K59975b32400C6240J35201F9212b35022D02457b74883
$$ plain form
9266 -311342 -146337 -200116 -140727 -72222 -73536 -350506 219427 -272762 217417 69039 139474
9255 139474 -329581 -91333 -294070 -130247 187378 -369231 186691 173101 -434954 -279455
9245 -279455 1635 -209699 -70818 256862 -5050 52850 69584 -22921 -299499 193259 -308520
9233 -77505 206903 245691 -284469 -100590 -18839 461851 13874 -69356 -298557 -16029 170595
9221 -255420 137801 -249442 275010 -577962 -189638 -52446 91049 -113449 71382 -219612
9210 -176502 192337 52934 174637 6511 -169170 -331299 -117944 -198810 -49474 5647 -225509
9198 -199100 -185237 -359734 -125168 -178043 143926 75107 -30800 355054 -5516 -266294 136307
9186 -18704 -231979 -61976 21724 281699 -232400 36240 171441 69212 -235022 402457 -274883
9174a76452A18224b47724d2857B44290a86489G3631a4351j02146e3924E4125Q1890
9163A36015F0630h5490c3021G9411c29477J00601D26067A19132i7859A14544b30044
9151g7473j58782K9900a8883j72601B94M1017N9870j5849C6215a08097j07056
9140b15153b8175j68247b0506j2806l00697D3274R024a85449K7734a6476B02065
9128g4113j57684M783F5152J18612a495q5132j61292j09717a3914E1065J39614
9117A90679c36622R2102k37247H6537Q3884h6267b0062j37026B84174H5601a15719
9105a99484D53545c4324G7609K45065b0373D8496A1416D893L5694b49597J09158
9094a40439e6927M042p4096N7443c2543j88846f1532K7490j28282c3123j89700
$$ plain form
9174 -176452 118224 -247724 -42857 244290 -186489 73631 -14351 -116497 -53924 54125 136015
9163 136015 60630 -85490 -33021 79411 -329477 -228876 426067 119132 -97859 114544 -230044
9151 -77473 -236255 -206355 -18883 -191484 294 41311 101181 85332 36215 -108097 -215153
9140 -215153 -28175 -196422 -20506 -33312 -334009 43274 52298 -185449 -157715 -16476 202065
9128 -74113 -231797 -227014 65152 183764 -1495 -86627 -247919 -357636 -13914 51065 190679
9117 190679 -336622 -244520 -481767 86537 170421 -86267 -20062 -157088 284174 85601 -115719
9105 -199484 453545 -34324 77609 322674 -20373 48496 11416 4893 40587 -249597 -140439
9094 -140439 -56927 -52885 -126981 -69538 -32543 -221389 -61532 -34042 -162324 -33123 -222823
9083b22823G1669c81117A879K08093f6027q0686H2125J00218K1615a6137j61510
9072a77647D3508b40650c1131k6796l6392A9032i8514D3418L6189i7221A58596
9060g6806j71397I0330a61733A10713c22555A39103b15787h9912j32042c4989
9049a0631j70093A98192b01650O8837e3550l9822J7733L4654I40k71K5484P2763
9037I8916J01983H3850L8192b00969a452F490K07884I6370g6955b3322C469c24722
9024D0686f3749j12138n045q1531E5086j3899e51848b085k34710a7365j12287
9013a29652l9883j0495A47169D9730b44861d7781n6415j7199A66697d50876a16156
9001a40521A91698d967B17169d3633j95580D645P279P0330a8493E1815i9325A42093
$$ plain form
9083 -222823 71669 -381117 1879 209972 -66027 -146713 82125 182343 203958 -16137 -177647
9072 -177647 43508 -240650 -31131 -57927 -94319 19032 -98514 43418 79607 -97221 158596
9060 -76806 -248203 90330 -161733 110713 -322555 139103 -215787 -89912 -221954 -34989
9049 -10631 -180724 198192 -201650 -132813 -53550 -93372 -75639 -40985 940 669 26153 98916
9037 98916 200899 83850 122042 -200969 -1452 6490 214374 96370 -76955 -23322 3469 -324722
9024 40686 -63749 -175887 -180932 -262463 55086 41187 -551848 -2085 -236795 -17365 -129652
9013 -129652 -169535 -180030 147169 49730 -244861 -47781 -104196 -121395 166697 -450876 -116156
9001 -140521 191698 -4967 217169 -43633 -239213 4645 11924 82254 -18493 51815 -99325 142093
8988A23417a20748N724A52585B7043K77980i5340b5370A22751c66089I7527b12024
8976D1877i7355F0032a884B2127c3683k62282G1833J2042a90009M3111d3037j13739
8964a56776l8744C9416B414c7029a5496E9280A7965i6385j03125N4825D6234q519
8952C7715b99633h663E8187c53453h1833F4956K38573a98086G8438c08750N7002
8941b51748H466c35733k56391A28575C0066b5439l6283k77520B75741b10564A60242
8929E241b27729P7625H3657K40198a62706A94586j8397K138401n79052D46440
8918C09219A6318P5720a09811J0046c8840j96389d4331k64837o4354A13727g5228
8906H1403g0497B0249i1994D4369a65991K8881L3121q8780B31871B1340a45830
$$ plain form
8988 123417 -120748 -115024 152585 27043 305023 -95340 -25370 122751 -366089 97527 -212024
8976 41877 -97355 60032 -1884 22127 -33683 -295965 71833 83875 -190009 -146898 -43037 -156776
8964 -156776 -195520 39416 2414 -37029 -15496 59280 17965 -96385 -199510 -144685 46234 37715
8952 37715 -299633 -8663 58187 -353453 -81833 64956 303529 -198086 78438 -308750 -251748
8941 -251748 8466 -335733 -592124 128575 30066 -25439 -61722 -339242 275741 -210564 160242
8929 5241 -227729 -150104 83657 323855 -162706 194586 176189 2314590 1735538 446440
8918 309219 16318 92038 -109811 -99765 -38840 -235229 -44331 -309168 -373522 113727 -75228
8906 81403 -70497 20249 -91994 44369 -165991 -137110 -103989 -192769 231871 21340 -145830
8894d0338A3839c45372o9465d0476f524k20600E5560b24607J01835A35200a52883
8882A90050N4331a16275b4475l35283a23318j9966A3907o802a01350j48245K8704
8871b20891m218k1649R0780k12414A88287B6868L8881J66727K4131c0940F8434
8859b0551k03443B42936A4562a01414j35290A32398M2355b38420Q3734a4715k53122
8848b67837J22273D0772g3260K7938j30389p6402O8574Q3889B88608G1268K31640
$$ plain form
8894 -40338 13839 -345372 -414837 -40476 -6524 -227124 55560 -224607 -122772 135200 -152883
8882 190050 244381 -116275 -24475 -359758 -123318 -143284 13907 7105 -101350 -249595 -220891
8871 -220891 -225109 -246758 -155978 -368392 188287 26868 65749 232476 256607 -30940 68434
8859 -20551 -223994 242936 14562 -101414 -236704 132398 174753 -238420 -154686 -14715 -267837
8848 -267837 -145564 40772 -73260 -45322 -175711 -252113 -183539 -99650 288608 71268 302908
$$ [...]
##END NTUPLES=NMR SPECTRUM
##END=
