##TITLE=AC1425_HONAH13237_7765442_B5vj5BzvKL
##JCAMPDX= 6.0         $$ Bruker NMR JCAMP-DX V2.0
##DATA TYPE= NMR SPECTRUM
##DATA CLASS= NTUPLES
##ORIGIN= BRUKER
##OWNER= Administrator
$$ 1.72 TOPSPIN		Version 2.1
$$ 2013-04-11 21:36:22.270 -0700  Administrator@X
$$ Compression mode = diff/dup
##.OBSERVE FREQUENCY= 400.02188249412
##.OBSERVE NUCLEUS= ^1H
##.ACQUISITION MODE= SIMULTANEOUS (DQD)
##.ACQUISITION SCHEME= undefined
##.AVERAGES= 8
##.DIGITISER RES= 22
##SPECTROMETER/DATA SYSTEM= spect
##.PULSE SEQUENCE= zg30
##.SOLVENT NAME= COFFEE_meoh
##.SHIFT REFERENCE= INTERNAL, COFFEE_meoh, 1, 14.98509
##AUDIT TRAIL= $$ (NUMBER, WHEN, WHO, WHERE, PROCESS, VERSION, WHAT)
$$ ##TITLE= Audit trail, TOPSPIN		Version 2.1
$$ ##JCAMPDX= 5.01
$$ ##ORIGIN= Bruker BioSpin GmbH
$$ ##OWNER= Administrator
$$ $$ E:\/data/COFFEE/nmr/AC1425_HONAH13237_7765442_B5vj5BzvKL/10/pdata/1/auditp.txt
$$ ##AUDIT TRAIL=  $$ (NUMBER, WHEN, WHO, WHERE, PROCESS, VERSION, WHAT)
(   1,<2013-04-11 21:36:12.707 -0700>,<Administrator>,<X>,<go>,<TOPSPIN 2.1>,
      <created by zg
	started at 2013-04-11 21:35:06.866 -0700,
	POWCHK enabled, PULCHK disabled,
       configuration hash MD5:
       33 CF 6A 21 5C D3 B9 40 6C 15 AA 8D 27 A2 4F 13
       data hash MD5: 64K
       31 F5 8B 90 43 4C 14 15 93 E3 9B FF 8F 4F 84 21>)
(   2,<2013-04-11 21:36:17.239 -0700>,<Administrator>,<X>,<proc1d>,<TOPSPIN 2.1>,
      <Start of raw data processing
       efp LB = 0 FT_mod = 6 PKNL = 1 PHC0 = 0 PHC1 = 0 SI = 32K 
       data hash MD5: 32K
       31 A1 2A 2F 67 D7 97 C0 01 D9 BF 79 6D BD 67 78>)
(   3,<2013-04-11 21:36:17.692 -0700>,<Administrator>,<X>,<proc1d>,<TOPSPIN 2.1>,
      <pk PHC0 = 99.14063 PHC1 = 0 
       data hash MD5: 32K
       70 35 B7 4B 98 7E 52 E9 9E 6B DC 39 3D 65 89 26>)
(   4,<2013-04-11 21:36:17.926 -0700>,<Administrator>,<X>,<proc1d>,<TOPSPIN 2.1>,
      <abs ABSG = 1 
       data hash MD5: 32K
       33 86 5B 33 B7 18 34 C9 D5 00 20 03 0B 6D F3 A1>)
(   5,<2013-04-11 21:36:18.067 -0700>,<Administrator>,<X>,<proc1d>,<TOPSPIN 2.1>,
      <abs ABSG = 2 
       data hash MD5: 32K
       58 CB D2 41 9A 26 0D F8 A4 87 F1 4B D7 7C 84 90>)
(   6,<2013-04-11 21:36:18.223 -0700>,<Administrator>,<X>,<proc1d>,<TOPSPIN 2.1>,
      <abs ABSG = 3 
       data hash MD5: 32K
       0C 21 F8 67 48 80 92 32 88 57 E9 E6 E9 3D C7 78>)
(   7,<2013-04-11 21:36:18.379 -0700>,<Administrator>,<X>,<proc1d>,<TOPSPIN 2.1>,
      <abs ABSG = 4 
       data hash MD5: 32K
       14 CF 3A 82 B9 18 65 48 0D AF B8 51 9F 06 02 70>)
(   8,<2013-04-11 21:36:18.520 -0700>,<Administrator>,<X>,<proc1d>,<TOPSPIN 2.1>,
      <abs ABSG = 5 
       data hash MD5: 32K
       65 5B 79 5E 36 92 6C 89 16 89 88 E5 97 9C BC A3>)
$$ ##END=
$$ 
$$ $$ hash MD5
$$ $$ CF 59 4F 7F 0F C8 AD CF E1 E0 7E F0 52 BD A9 D8
##$RELAX= 
##$RELAX= 
##$RELAX= 
##$RELAX= 
##$RELAX= 
##$RELAX= 
##$RELAX= 
$$ Bruker specific parameters
$$ --------------------------
##$DU= <E:\>
##$EXPNO= 10
##$NAME= <AC1425_HONAH13237_7765442_B5vj5BzvKL>
$$ [...]
150 150 150 150 150 150 150 150
##$TP07= 0
##$TPNAME0= <>
##$TPNAME1= <>
##$TPNAME2= <>
##$TPNAME3= <>
##$TPNAME4= <>
##$TPNAME5= <>
##$TPNAME6= <>
##$TPNAME7= <>
##$TPOAL= (0..7)
0.5 0.5 0.5 0.5 0.5 0.5 0.5 0.5
##$TPOFFS= (0..7)
0 0 0 0 0 0 0 0
##$TUNHIN= 0
##$TUNHOUT= 0
##$TUNXOUT= 0
##$USERA1= <user>
##$USERA2= <user>
##$USERA3= <user>
##$USERA4= <user>
##$USERA5= <user>
##$V9= 5
##$VALIST= <valist>
##$VCLIST= <CCCCCCCCCCCCCCC>
##$VD= 0
##$VDLIST= <DDDDDDDDDDDDDDD>
##$VPLIST= <PPPPPPPPPPPPPPP>
##$VTLIST= <TTTTTTTTTTTTTTT>
##$WBST= 2048
##$WBSW= 25
##$XGAIN= (0..3)
0 0 0 0
##$XL= 0
##$YL= 0
##$YMAX_a= 662429
##$YMIN_a= -564158
##$ZGOPTNS= <>
##$ZL1= 120
##$ZL2= 120
##$ZL3= 120
##$ZL4= 120
##$ABSF1= 14.98509
##$ABSF2= -5.573092
##$ABSG= 5
##$ABSL= 3
##$ALPHA= 0
##$AQORDER= 0
##$ASSFAC= 0
##$ASSFACI= 0
##$ASSFACX= 0
##$ASSWID= 0
##$AUNMP= <proc_prof1d_extract_pilot.lims>
##$AXLEFT= 0
##$AXNAME= <>
##$AXNUC= <1H>
##$AXRIGHT= 0
##$AXTYPE= 0
##$AXUNIT= <>
##$AZFE= 0.1
##$AZFW= 0.1
##$BCFW= 0
##$BC_mod= 0
##$BYTORDP= 0
##$COROFFS= 0
##$CY= 15
##$DATMOD= 1
##$DC= 0
##$DFILT= <>
##$DTYPP= 0
##$F1P= 0
##$F2P= 0
##$FCOR= 0.5
##$FTSIZE= 32768
##$FT_mod= 6
##$GAMMA= 0
##$GB= 0
##$INTBC= 1
##$INTSCL= 1
##$ISEN= 128
##$LB= 0
##$LEV0= 0
##$LPBIN= 0
##$MAXI= 10000
##$MC2= 0
##$MEAN= 0
##$ME_mod= 0
##$MI= 0
##$NCOEF= 0
##$NC_proc= -8
##$NLEV= 6
##$NOISF1= 0
##$NOISF2= 0
##$NSP= 0
##$NTH_PI= 0
##$NZP= 0
##$OFFSET= 14.98509
##$PC= 1
##$PHC0= 99.14063
##$PHC1= 0
##$PH_mod= 1
##$PKNL= yes
##$PPARMOD= 0
##$PPDIAG= 0
##$PPIPTYP= 0
##$PPMPNUM= 2147483647
##$PPRESOL= 1
##$PSCAL= 4
##$PSIGN= 0
##$PYNMP= <proc.py>
##$REVERSE= no
##$SF= 400.02
##$SI= 32768
##$SIGF1= 0
##$SIGF2= 0
##$SINO= 400
##$SIOLD= 32768
##$SPECTYP= <>
##$SREGLST= <1H.CDCl3>
##$SSB= 0
##$STSI= 32768
##$STSR= 0
##$SW_p= 8223.68421052631
##$SYMM= 0
##$S_DEV= 0
##$TDeff= 65536
##$TDoff= 0
##$TI= <>
##$TILT= no
##$TM1= 0
##$TM2= 0
##$TOPLEV= 0
##$USERP1= <user>
##$USERP2= <user>
##$USERP3= <user>
##$USERP4= <user>
##$USERP5= <user>
##$WDW= 1
##$XDIM= 32768
##$YMAX_p= 461711482
##$YMIN_p= -675385
##$CURPLOT= <Network HP LaserJet P1505>
##$CURPRIN= <$Network HP LaserJet P1505>
##$DFORMAT= <normdp>
##$LAYOUT= <+/1D_H.xwp>
##$LFORMAT= <normlp>
##$PFORMAT= <normpl>
##$SURQMSG= 1
$$ End of Bruker specific parameters
$$ ---------------------------------
##NTUPLES= NMR SPECTRUM
##VAR_NAME=  FREQUENCY,     SPECTRUM/REAL,   SPECTRUM/IMAG
##SYMBOL=    X,             R,               I
##VAR_TYPE=  INDEPENDENT,   DEPENDENT,       DEPENDENT
##VAR_FORM=  AFFN,          ASDF,            ASDF
##VAR_DIM=   32768,         32768,           32768
##UNITS=     HZ,            ARBITRARY UNITS, ARBITRARY UNITS
##FACTOR=    0.250966925370066, 1,           1
##FIRST=     8223.43324360094, 63826,        -160047
##LAST=      0,             41091,           -195451
##MIN=       0,             -675385,         0
##MAX=       8223.43324360094, 461711482,    0
$$ Real data points
##PAGE= N=1
##DATA TABLE= (X++(R..R)), XYDATA
$$ [...]
19547a83594E65J88258a56853L5058b3335a837G2282P7438G657a05339A98099
19535a34805F9261J61551A0869K7779A5187J35477b72359K8731J16582B96036
19524e5154j80000I7244M7120m0356b589H395b41890B1683N3895b06098k1429
19513b27527A91518G7775J37142m4204L360h8064l17464B7786P2616a45584A08437
19501G527j958J9185J88515I3124J40563J77507b89778Q7984C5540L39678b2105
19489G8542L9560J54670j35973f15990K46122J00658A29495f6274J8259A50415
19478H2655c05138A11671l3334d35622h4578k2077A66144h7705m7733j06927O9152
19467a73213M9711m0205e1201o2817A8336a69677J0429F6149b84102a28433A30438
$$ plain form
19547 -183594 565 188823 -156853 -121795 -23335 -1837 72282 149720 7657 -105339 198099
19535 -134805 69261 230812 10869 38648 15187 150664 -272359 -243628 -127046 296036
19524 -55154 -235154 97244 144364 104008 -2589 8395 -241890 21683 75578 -206098 -227527
19513 -227527 191518 77775 214917 170713 174073 -88064 -405528 27786 100402 -145584 108437
19501 7527 5569 24754 213269 93124 233687 411194 -289778 -201794 35540 375218 -22105
19489 78542 118102 272772 136799 -615990 -369868 -269210 129495 -66274 -48015 150415
19478 82655 -305138 111671 78337 -435622 -84578 -106655 166144 -87705 -135438 -242365 -173213
19467 -173213 -123502 -163707 -51201 -114018 18336 -169677 -159248 66149 -284102 -128433 130438
19455A7636a5170m5952j24559d3878o2064I4577c32337f2631J3757l88376J38011
19444b99239a17737k24574a8881A03378a50693n4878m01161A58465b83780j1752
19434b95532A01914i1605F0827c8534j36350C3216c79163h9262k40730h8120C49979
19422I181a20430k3753d4783B06629q3089a55466k9232c5045A58875e9719B07546
19410D0311b57904j68156i3061A18490J46397a03566B8488K3304J40665d5207
19399e4558l83969h3353K912j05762J7448j0635e3038j63742N0725J3336D4896
19387h2297k19343P4361f3724B4829e0343K1101A2115b0661l2122m4797A86961
19375b2029G1191a28147C3676j3554Q1951P5904L3014a55341M4884L9491q2212
$$ plain form
19455 17636 -15170 -61122 -185681 -43878 -105942 94577 -332337 -62631 -48874 -437250 -299239
19444 -299239 -117737 -342311 -18881 103378 -150693 -205571 -606732 158465 -283780 -295532
19434 -295532 101914 -91605 60827 -38534 -174884 33216 -379163 -89262 -329992 -88120 349979
19422 9181 -120430 -144183 -44783 206629 123540 -155466 -184698 -35045 158875 -59719 207546
19410 40311 -257904 -426060 -93061 118490 264887 -103566 28488 51792 192457 -45207
19399 -54558 -438527 -83353 -80441 -186203 -168755 -179390 -53038 -216780 -166055 -152719 44896
19387 -82297 -301640 -227279 -63724 24829 -50343 -29242 12115 -20661 -52783 -97580 186961
19375 -22029 71191 -128147 33676 20122 102073 177977 210991 -155341 -110457 -70966 -153178
19364a53178N8238K0929e083n24811G0793L5478b1002B68589G5425J22134m0617
19353A56942b74427a04890q978c567m61941A69748a40433o8532A17529a29042
19342b6648r8662J6158A1023a52672l0105g7863p1636B11498a44349A206a97895
19330a51632A3278R8505i6467C46040c89430G6349a50180H1319K03466i5733j60944
19319b56677a13315A7796N6922B882J84322p0360E0077B869a52059f9651B3248
19307g7146A41038a01451F1304g6297l4047m82431K87228A27097E9030b3265j62835
19296a86100d2625A23892a39027N7461L0854F4158a71667j85958E8602J61070
19286B19672a65141g4771j36133R7909n2415e7438K5117B3966a02424B6139R2197
$$ plain form
19364 -153178 -94940 -74011 -5083 -529894 70793 106271 -21002 268589 75425 197559 156942
19353 156942 -274427 -104890 -113868 -3567 -465508 169748 -140433 -208965 117529 -129042
19342 -26648 -125310 -109152 11023 -152672 -182777 -77863 -149499 211498 -144349 1206 -197895
19330 -151632 13278 111783 -96467 346040 -389430 76349 -150180 81319 284785 -95733 -256677
19319 -256677 -113315 17796 74718 2882 187204 116844 50077 2869 -152059 -69651 23248
19307 -77146 141038 -101451 61304 -76297 -110344 -592775 -305547 127097 59030 -23265 -186100
19296 -186100 -42625 123892 -139027 -81566 -50712 64158 -171667 -357625 58602 219672
19286 219672 -165141 -74771 -210904 -112995 -165410 -57438 -32321 23966 -102424 26139 118336
19275A18336n7608Q320f3427D2512i3990H4114J18726a00475j78421C062d40815
19263D0950d9586l8001A07514h1454C2154b26246r9020k1444D4705b67956n4099
19252c22055g9132E4901a79370A58261J23266h2899F4491K95842c49065M7622
19242c01443B17362f2793A07926a06224b2393D2101J80347b36365d214C2592A5171
19230b9780A18258c8049k16518e3101j32133d8788l1903B13795d3051j05424o7280
19219b15755P8268H0436N5749C752a29110M5820c9521a9398j86933B298d17883
19207b68328k9605J00726j369K5889m6629i7243j89961A10883k8626b42982J03649
19196a39333F052i1597l20981R8272D5825a24458B5615H897d18403B84755B7292
$$ plain form
19275 118336 60728 69048 -63427 42512 -93990 84114 202840 -100475 -278896 3062 -440815
19263 40950 -49586 -87587 107514 -81454 32154 -226246 -325266 -346710 44705 -267956 -322055
19252 -322055 -79132 54901 -179370 158261 281527 -82899 64491 360333 -349065 -301443
19242 -301443 217362 -62793 107926 -106224 -22393 42101 222448 -236365 -4214 32592 15171
19230 -29780 118258 -38049 -254567 -53101 -185234 -48788 -80691 213795 -43051 -148475 -215755
19219 -215755 -137487 80436 136185 3752 -129110 -83290 -39521 -19398 -206331 2298 -417883
19207 -268328 -297933 -197207 -198576 -172687 -219316 -97243 -287204 110883 82257 -242982 -139333
19196 -139333 6052 -91597 -412578 -314306 45825 -124458 25615 8897 -418403 284755 27292
19184g3565k77179J4219c7881j76930I4607b17384q0336J39939m8546a8148l72696
19173c90844G2947a00928B401Q0722K399a89043h6982B07309g6918A54982N635
19162A60617a24435m2142l083N5424A35532b38470j5368p3508B9294J91361n7085
19151A63570b15061a6604m36226E6388i4221c3852J188B42897b37748J5585J156
19140b21007a3669l854j17366B8378L50780F3235c15051e3545P990l72940b03949
19128a88807F648R3311Q7900c89361A71513G8338A3292a37184O0306M081I7461
19116B21963b31086c6294A25118J1091A7407N9544J3838A0619J00373a25882k73771
19105c99653g2216n6033j70754f7653I4410h3167C21520c11471a22401A22997
$$ plain form
19184 -73565 -350744 -336525 -37881 -214811 94607 -217384 -297720 -157781 -206327 -18148 -390844
19173 -390844 72947 -100928 2401 83123 85522 -189043 -86982 207309 -76918 154982 160617
19162 160617 -124435 -166577 -169660 -114236 135532 -238470 -253838 -327346 29294 220655 163570
19151 163570 -215061 -16604 -452830 56388 -94221 -33852 -32664 242897 -237748 -222163 -221007
19140 -221007 -13669 -17523 -134889 28378 379158 63235 -315051 -53545 -45555 -418495 -203949
19128 -188807 6648 99959 187859 -389361 171513 78338 13292 -137184 -76878 -72797 97461
19116 221963 -231086 -36294 125118 136209 17407 76951 90789 10619 110992 -125882 -399653
19105 -399653 -72216 -128249 -299003 -67653 94410 -83167 321520 -311471 -122401 122997
19094e993l32182a61593K9161k77050a00373d6287k5990a7871q4593L8589A39728
19082A40701Q4441A10073l7855a31571A76528Q1423b2783k15156B5341f8346C2013
19070B5183J40465b51438H7492M1577q759b19858A52158b04536E7214d51422a61260
19058b50660N6083A40637h3111k10893g8332E9272N4222a23792b2962A81746a03023
19046H3905R7053H2090b14206K4591N4041r0446d5648B40246B3357J67988D8068
19034b5407C02664D3032A3121J14300D5610K03327a34173f6597C28178A54357
19023B66812b06378G4411J52167a67705j9420J5676B3498J1620f3991l22808A01043
19011b16367i3063o9101e9236K7948j94115Q2203e8384J8215l7947A39857F1865
$$ plain form
19094 -5993 -338175 -161593 -132432 -409482 -100373 -46287 -72277 -17871 -102464 -63875 139728
19082 140701 225142 110073 72218 -131571 176528 257951 -22783 -237939 25341 -68346 32013
19070 25183 165648 -251438 87492 129069 120310 -219858 152158 -204536 57214 -451422 -161260
19058 -250660 -194577 140637 -83111 -294004 -78332 59272 113494 -123792 -22962 181746 -103023
19046 83905 180958 82090 -214206 -189615 -135574 -226020 -45648 240246 23357 191345 48068
19034 -25407 302664 43032 13121 127421 45610 248937 -134173 -66597 328178 154357
19023 266812 -206378 74411 226578 -167705 -187125 -171449 23498 35118 -63991 -386799 101043
19011 -216367 -93063 -162164 -59236 -31288 -225403 -143200 -58384 -40169 -78116 139857 61865
18999a72985B92549c1543C50180a64266I2515l99a27900A16695D3051e7179j82549
18988b39728J03850G5855C5390b51638j40134i6822k86755H1281h4247A2844b69735
18976c4905j9803l9384r9724P02r709A77523b12272G9668N5135e3854A13009d7859
18963g773p8317j9581n4921c6201E3312g0499E6930K82328o0723A09548n4560
18952E4988J14607E164d8700G3098J62011a1121l2434j75795d2212A25869a4742
18940a20132O966c012r0735B1465L494f935j3668k6297j33807M6040e8010A11291
18927a81455d174j48230j06951A691b06284a897l5673n9081B7278c79586A40635
18915a11903f595k41285J20009a8118j60611l2163g1868m13159D3336G516J10343
$$ plain form
18999 -172985 292549 -31543 350180 -164266 92515 92116 -127900 116695 43051 -57179 -239728
18988 -239728 -135878 75855 35390 -251638 -391772 -96822 -383577 81281 -84247 12844 -269735
18976 -34905 -54708 -94092 -193816 -193114 -202823 177523 -212272 79668 134803 -53854 113009 -47859
18963 -7773 -86090 -105671 -160592 -36201 53312 -70499 56930 339258 278535 109548 54988
18952 54988 169595 5164 -48700 73098 235109 -11121 -43555 -219350 -42212 125869 -14742
18940 -120132 -113166 -3012 -93747 21465 24959 -6935 -20603 -46900 -180707 -134667 -58010 111291
18927 -181455 -4174 -152404 -259355 1691 -206284 -1897 -37570 -96651 27278 -379586 140635
18915 -111903 -6595 -247880 -127871 -18118 -178729 -210892 -71868 -485027 43336 7516 117859
18904A17859B6304b24763b6388l0658b883B73979a9953k20596J13332c4029C03447
18892F6431j5200n560a5460j72278b4350j10312N6309k7852F8395h7328k51858
18881c39186J37964p7369c2262j33410b9770r9385C650K94756f5432j02115O0907
18870a06640q3620B46694C5478b09154C2658a8613G1503d29l4901l3540E6717
18858b34448j43704a61984O8751j52252I239J92330K9566a05830J9461a9437o7775
18847h7212k2527k8683c8700o9989d1820I6096b490j14761n101j05607c8103k70147
18835c08250a6038A07119a54198B4649g8754j78166J917b9949k7814j22069j37746
18824c17578Q9740j33959Q1467B6218O597J5215a79721d7190B72868a00215E9709
$$ plain form
18904 117859 26304 -224763 -26388 -57046 -2883 273979 -19953 -240549 -127217 -34029 303447
18892 66431 51231 45671 -15460 -187738 -24350 -134662 -78353 -106205 68395 -87328 -339186
18881 -339186 -201222 -278591 -32262 -165672 -29770 -129155 3650 298406 -65432 -167547 -106640
18870 -106640 -190260 246694 35478 -209154 32658 -18613 71503 -429 -35330 -68870 56717
18858 -234448 -378152 -161984 -93233 -245485 9239 201569 231135 -105830 -86369 -19437 -87212
18847 -87212 -109739 -138422 -38700 -108689 -41820 96096 -2490 -117251 -122352 -227959 -38103 -308250
18835 -308250 -16038 107119 -154198 24649 -78754 -256920 -255003 -29949 -57763 -179832 -317578
18824 -317578 -227838 -361797 -280330 26218 32815 48030 -179721 -47190 272868 -100215 59709
18812A1295J90983K1275j2995a27570A65062O9510e7265F0085h9756j1226d8112
18800C0728K10469m9588a60605d6438j92249A27358a71273A38713b55384I56a66974
18788h0038l0896A33559O6514a02378q8843r9194p8928B95978c94281A86412a06060
18776F0692l0107r988J1585a44777B5901J89030o2900b10298L0669c8502A49770
18764a62013A10305P0634M4349o5549b42846J18410N7314a9221g148A19175g0521
18752i9852j12036A89930p7423a00718A35810j6904C89f9537D1155j9292b24285
18740A88645d34927a86553A23314c82253A50562J8123a15731n4581B2406O9858
18730I2264b32433d1676A41032c96755D5048c24371L9106A41894c38564a2433
$$ plain form
18812 11295 202278 223553 210558 -127570 165062 234572 -57265 60085 -89756 -100982 -48112
18800 30728 241197 191609 -160605 -46438 -238687 127358 -171273 138713 -255384 956 -166974
18788 -80038 -110934 133559 200073 -102378 -191221 -290415 -369343 295978 -394281 186412 -106060
18776 60692 30585 20597 32182 -144777 25901 214931 152031 -210298 -179629 -38502 149770
18764 -162013 110305 180939 225288 159739 -242846 -124436 -67122 -19221 -7148 119175 -70521
18752 -99852 -211888 189930 112507 -100718 135810 118906 389 -69537 41155 21863 -224285
18740 188645 -434927 -186553 123314 -382253 150562 168685 -115731 -170312 22406 92264
18730 92264 -232433 -41676 141032 -396755 45048 -324371 -285265 141894 -338564 -12433
18719a28207O2819q2342c8812j2785q5861A54497a07147J0199A2615K90445a42689
18707a71157I0860a4065j676j17885I1201h3332k9973C3593c3199A04430L5943
18696A40373d67899d2654j49997d0372L391B77547c12928A58994o7942a07312
18685a52029d2904j05327C2098a87366C1283a02170H394b12826A9465a07478m7346
18674a54824A19504i508j095j60498B64137a37040A1088J93191a65913j32624
18664b98537A42303B7469K6896N9245c6219J4251q9178p537n7031q028A87673
18652d4176A04229K2142J00762E8751J33094o4641c01807p590A32009a39197b2109
18640d1325J8623j04977D0738A432a00520E3454d59387h6654l13232c0963j42701
$$ plain form
18719 -128207 -65388 -147730 -38812 -51597 -137458 154497 -107147 -96948 12615 303060 -142689
18707 -171157 90860 -14065 -15741 -133626 91201 -83332 -113305 33593 -33199 104430 140373
18696 140373 -467899 -42654 -192651 -40372 -36981 277547 -312928 158994 91052 -107312
18685 -152029 -42904 -148231 32098 -187366 31283 -102170 8394 -212826 19465 -107478 -154824
18674 -154824 119504 -9508 -10603 -171101 264137 -137040 11088 204279 -165913 -298537
18664 -298537 142303 27469 54365 113610 -36219 -21968 -111146 -118683 -175714 -183742 187673
18652 -44176 104229 126371 227133 58751 191845 127204 -301807 -309397 132009 -139197 -22109
18640 -41325 -22702 -127679 40738 1432 -100520 53454 -459387 -86654 -399886 -30963 -173664
18629a73664r8479C7191a6052l6387o8140G5643b46273C5791a10771I469g0448
18617b32709c3580l5789B00063a41014G8238a47084F6656a55738A57467G3996
18606I7609b14082a05488K5672L0284F5678a2199k41652A67563a64278e0830C5965
18594B4967e9201A28974F468a76046K8617F4364i8757B59299a236G4592a5251
18582c04134g0905n9493m0464a9786m5491A33344a6051G2582P9458a37283M4348
18571i2935A36887b5950m7257l1996C00909C4977h6946b8681k72558A07988c06397
18559c72361a14965a8042k5855n807E0985c31161a19B71122a08200j26563L4187
18548b00576j55221d2685A38219O9021c3816F9503i2758n0643d8286e031k1898
$$ plain form
18629 -173664 -272143 37191 -16052 -52439 -120579 75643 -246273 35791 -110771 9469 -70448
18617 -232709 -33580 -69369 200063 -141014 78238 -147084 66656 -155738 157467 73996
18606 97609 -214082 -105488 -79816 -49532 65678 -12199 -253851 167563 -164278 -50830 35965
18594 24967 -59201 128974 6468 -176046 -147429 64364 -98757 259299 -1236 74592 -15251
18582 -304134 -70905 -130398 -170862 -19786 -65277 133344 -16051 72582 152040 -137283 -92935
18571 -92935 136887 -25950 -73207 -105203 300909 34977 -86946 -28681 -301239 107988 -306397
18559 -372361 -114965 -18042 -43897 -49704 50985 -331161 -119 271122 -108200 -234763 -200576
18548 -200576 -355797 -42685 138219 207240 -33816 69503 -92758 -143401 -48286 -5031 -26929
18537b6929A44548g3657B3877d05357H022c09350a11988A17383C5838b45537C4396
18525a17013G2378a54274B32679a64416N0228j03714b5773C2420K09466q2903
18515A58983a81628I2722a29895k9417g9637B60625c45795N2341A26906m7609
18505G9297a69432k42443a46372C4518a6845H937b40310J05703G6880a31700o0254
18494a91954N2198o0628B71860b95250A75612p3503b14270D38344a21437q380
18484a29817A68176c3757j37940B46990A19802f4287r8322j48284J11260A50509
18473c38281d1987D6198d039F3732M7170H400b0589r0324F4713L33035f2153b6230
18460f5009H0N780b13932l06365a32536f5379A23790a67871d0941I3771f7831
$$ plain form
18537 -26929 144548 -73657 23877 -405357 8022 -309350 -111988 117383 35838 -245537 34396
18525 -117013 72378 -154274 232679 -164416 -114188 -217902 -25773 32420 241886 158983
18515 158983 -181628 92722 -129895 -159312 -79637 260625 -345795 -293454 126906 79297
18505 79297 -169432 -411875 -146372 34518 -16845 8937 -240310 -134607 76880 -131700 -191954
18494 -191954 -139756 -200384 271860 -295250 175612 102109 -214270 438344 -121437 -129817
18484 -129817 168176 -33757 -171697 246990 119802 -64287 -162609 -310893 -199633 150509
18473 -338281 -41987 46198 -4039 63732 110902 8400 -20589 -110913 64713 397748 -62153 -26230
18460 -65009 80 5860 -213932 -520297 -132536 -65379 123790 -167871 -40941 93771 -67831
18448f830q2134C6667J30754l5455i8575l6077O2013A37491M9319b12840B45749
18436b50649j63210E0267h1606k79050A4984N4805B9334b41569L1211C9288K2264
18425F1552J47013a10339H677b6011p9822I8165D4682J50120M5464A16979b11754
18413d18141A82191f2121j10764F4901a11318J329M6434j70313J10510m5914A39076
18401B34422p3829p6105D694Q3997h3468j86044Q1079f1762R433j11394g3415
18389g0905A56619N6893b9444q0473b6746A98504D3852P849b76656C35128C8362
18377F8916a49664j7934j53567d5154B18870a82028e472C14862b8657k113I4941
18365A9098J10829h1798B88474A3298K02709M3114a65915O3181B97155j44912
$$ plain form
18448 -6830 -88964 36667 167421 131966 -98575 -134652 -72639 137491 186810 -212840 245749
18436 -250649 -413859 50267 -81606 -360656 14984 69789 29334 -241569 -210358 39288 61552
18425 61552 208565 -110339 8677 -26011 -105833 98165 44682 194802 240266 116979 -211754
18413 -418141 182191 -62121 -172885 64901 -111318 -109989 -63555 -233868 -123358 -169272 139076
18401 234422 160593 84488 4694 88691 -83468 -269512 -188433 -61762 -52329 -163723 -73415
18389 -70905 156619 213512 -29444 -109917 -26746 198504 43852 51701 -276656 335128 38362
18377 68916 -149664 -167598 -321165 -45154 218870 -182028 -5472 314862 -28657 -30770 94941
18365 19098 129927 -81798 288474 13298 216007 259121 -165915 -102734 297155 152243
18355A52243c8438D4303A4457a19413j39806D0235c48991A22080a89042A35907
18344A74775a10868b5661A55506g9871l7366d2954B53507A20815a02142A06965
18333e3098A59023a06986d3192m18434M6035I6275b40388M1749B31280a73015
18322b3074o2833A83731h8765A01898a59285l8519q5182L2862g0697l4802d9946
18310A89747d5176j4328G3874a77793h7422A1255b63691b972q6035B3748b21056
18298b57979e5712k2832E00164b6021B83712B1245N4007a45248b148F8083A5243
18286h1894B17182a39304B90092A27995K03033D8753b63280M280A67952o8361
18276I9591h6395F2123a80960A32623a05205b6749j58130A76591a53262L2223
$$ plain form
18355 152243 -38438 44303 14457 -119413 -259219 40235 -348991 122080 -189042 135907
18344 174775 -110868 -25661 155506 -79871 -117237 -42954 253507 120815 -102142 106965
18333 -53098 159023 -106986 -43192 -461626 -415591 96275 -240388 -198639 231280 -173015
18322 -23074 -85907 183731 -88765 101898 -159285 -197804 -282986 -250124 -70697 -105499 -49946
18310 189747 -45176 -59504 73874 -177793 -87422 11255 -263691 -2972 -89007 23748 -221056
18298 -257979 -55712 -78544 500164 -26021 283712 21245 75252 -145248 -2148 68083 15243
18286 -81894 217182 -139304 290092 127995 331028 48753 -263280 -259000 167952 99591
18276 99591 -86395 62123 -180960 132623 -105205 -26749 -184879 176591 -153262 -121039
18266a21039E33a39966f7041F6226a40020N2321M463k40478C5133a673H7643f9358
18253b05792e7112A02796J77334l0572b14662A48063g7437r7468F6964g7260A27486
18241A91455I994a8384F0272J50381o455P6763e5760k63840A86315F1667c96884
18229I9445Q5325D0328K24385r0494K38758F6030a44378j57083b6322j8916q3239
18218a28477k10630A86026o2091a20226K0787A35700b12551H7373f8602H9550
18207A77048A1169h7862l39423h4401l6932L9751G2997g2171c5291E154J45525
18196A50679a21731n7556F946b01492a4501H5852b93501d2130j77910A26999a69674
18184i0268l52719a56875j5091r4868B5239L0695Q1704a07466k2192e5856j52611
$$ plain form
18266 -121039 533 -139966 -67041 66226 -140020 -87699 -83236 -323714 35133 -1673 87643 -69358
18253 -205792 -57112 102796 280130 249558 -214662 148063 -77437 -174905 66964 -77260 127486
18241 191455 9994 -18384 60272 210653 204198 280961 -55760 -319600 186315 61667 -396884
18229 99445 184770 40328 264713 174219 412977 66030 -144378 -301461 -26322 -45238 -128477
18218 -128477 -339107 186026 123935 -120226 -99439 135700 -212551 87373 -68602 89550
18207 177048 11169 -87862 -427285 -84401 -121333 -81582 72997 -72171 -35291 5154 150679
18196 150679 -121731 -179287 6946 -201492 -14501 85852 -293501 -42130 -220040 126999 -169674
18184 -90268 -442987 -156875 -171966 -266834 25239 55934 137638 -107466 -129658 -55856 -208467
18173b08467G3766b57530J2768j69489H297M2645b15103G5699j1873L6808b27585
18161c00729d9605B02356b03320K8682B24621r7714n9489b70663g9276B74073
18150I797i2542k97489m3680d8230C29166b4179a882l85348A25033B841R1575
18139I4416j3476R7301c12555A576P1734j4881a63095j00568A85237a1405j35448
18128a46853C9038b60836I9584h7045o8307O1856D4823b12859M8010K1042F0439
18116e9405l04617D3386A7005i2323j40051A5115c08855c9679C9503M6012P9514
18105A65029g0427a2055k89575R8731e2511o2426J6740I0776d5699m9698j12594
18094b07991i7183j07376d6374A05822J8936a62876K335B2438K67891f9292l30859
$$ plain form
18173 -208467 73766 -257530 -244762 -414251 8297 50942 -215103 75699 63826 100634 -227585
18161 -300729 -49605 202356 -203320 -174638 224621 126907 67418 -270663 -79276 274073
18150 9797 -92542 -390031 -433711 -48230 329166 -24179 -1882 -387230 125033 2841 94416
18139 94416 80940 178241 -312555 1576 73310 58429 -163095 -263663 185237 -11405 -146853
18128 -146853 39038 -260836 99584 -87045 -155352 -93496 44823 -212859 -164849 -143807 60439
18116 -59405 -364022 43386 17005 -92323 -232374 15115 -308855 -39679 39503 85515 165029
18105 165029 -70427 -12055 -301630 -202899 -52511 -114937 -98197 90776 -45699 -95397 -207991
18094 -207991 -97183 -204559 -46374 105822 124758 -162876 -160541 22438 290329 -69292 -400151
18083d00151C2308c8021j70857f8687j45240l8997D2528b07826c8285j42410f3518
18071E0644g5086b3230D814P1562J40458E7063b47566A84011a55372A38507f0769
18059B3340c53755a00554I494a73683A12407b64315J16216H6034O6243b56879
18048D6931J29360A5258J42270b86812A59456b05714m9695B15657c50311J69191
18038a81120l8121A16081e3603a544A40022D4260J73225a34818j02823P2131j8470
18027a83980p0C79116d6392k2817j73353O3004A3535j49K29299b86686h1933j10517
18015a92450A45707c00849e2570A52665a07429m2899b1447G7526a4222L14B10309
18003a04526A49662K09405A50352g0973j95541C5129a33158B88335j13794E0726
$$ plain form
18083 -400151 32308 -38021 -208878 -68687 -213927 -252924 42528 -207826 -38285 -180695 -63518
18071 50644 -75086 -23230 4814 76376 216834 57063 -247566 184011 -155372 138507 -60769
18059 23340 -353755 -100554 9494 -173683 112407 -264315 -148099 86034 152277 -256879
18048 46931 176291 15258 157528 -286812 159456 -205714 -255409 215657 -350311 -181120
18038 -181120 -219241 116081 -53603 -1544 140022 44260 217485 -134818 -237641 -165510 -183980
18027 -183980 -184050 379116 -46392 -69209 -242562 -179558 13535 13386 242685 -286686 -81933 -192450
18015 -192450 145707 -300849 -52570 152665 -107429 -150328 -21447 77526 -14222 -13908 210309
18003 -104526 149662 359067 150352 -70973 -266514 35129 -133158 288335 174541 50726
17992c2976j24265L1277j67310A97037f2895G9559L5093b63471Q3749A94512b30691
17980A16728D8100b58402D335b3509l1868r1292q8158J3347B33584c09652A21181
17968A82402a61304H3881a56135j7909Q3054D2182J72000a9422j38616b3008G7039
17956C47133l7819b6431E6000d4957m23523D2563j5221g4585A5211b03853A13631
17944A10671K8928P2881F0582a73096C7335j2258b41324l7046a15668J652C39588
17932d9127F6822c25610e3064B89997A9647a6938j15999A75820a26340j4446i356
17920a83784A6272a16730H2722c43497B45499q6F0708a02208j1323j41743J21032
17909a34242A98087b12832A93497m1044C4029c9489A90008A4020J71304I2083
$$ plain form
17992 -32976 -157241 -125964 -293274 197037 -62895 79559 114652 -263471 -179722 194512 -230691
17980 116728 48100 -258402 4335 -23509 -55377 -146669 -234827 -221480 233584 -309652 121181
17968 182402 -161304 83881 -156135 -174044 -90990 42182 214182 -19422 -158038 -23008 77039
17956 347133 309314 -26431 56000 -44957 -468480 42563 27342 -74585 15211 -203853 113631
17944 110671 139599 212480 60582 -173096 37335 25077 -241324 -278370 -115668 -114016 339588
17932 -49127 66822 -325610 -53064 289997 19647 -16938 -132937 175820 -126340 -140786 -9356
17920 -183784 16272 -116730 82722 -343497 245499 245413 60708 -102208 -113531 -255274 -134242
17909 -134242 198087 -212832 193497 152453 34029 -39489 190008 14020 185324 92083
17898a23304e4288I6701R1421O4973c9383q9635k29521E2386K89776M1559A26093
17886A44382m8986J71448J27993D390L8268M9590b20870L3178j46345g1778B41820
17874B04949B1505K99678D0120b3523B33411a83947P5550C0288J52602C2549c2849
17862a01279c532k91551a31770B33877a56846I1954b22384P5234c8298r7073a8218
17850c00267A89397G6856p539J67732G9711n394Q3778c42193B432M6190M1744
17839I0366l8352h0668l40047A41829f1745a6691D4555i1403H9639d1569B5536
17827a02442J9167l2156G49f3499A05320J00963F6341N5082R1953a3458A2615
17815a65208k2255c4205j72113P2733k15489B79420b66514B71812i2381C68127
$$ plain form
17898 -123304 -54288 96701 188122 253095 -39383 -129018 -358539 52386 342162 383721 126093
17886 144382 95396 266844 394837 4390 42658 92248 -220870 -187692 -334037 -71778 241820
17874 204949 21505 321183 40120 -23523 233411 -183947 -108397 30288 182890 32549 -32849
17862 -101279 -3532 -295083 -131770 233877 -156846 91954 -222384 -147150 -38298 -135371 -18218
17850 -300267 189397 76856 69317 237049 79711 74317 158095 -342193 2432 48622 90366
17839 90366 52014 -80668 -420715 141829 -61745 -16691 44555 -91403 89639 -41569 25536
17827 -102442 -83275 -115431 749 -63499 105320 206283 66341 121423 213376 -13458 12615
17815 -165208 -187463 -34205 -206318 -133585 -349074 279420 -266514 271812 -92381 368127
17804b226B9180c42710C37530E9033M3688c21731a21223N9212A7586b22204B86918
17792E3705f9242A65460L2986b6875j43962n0592R4482A2788g4512b7031k01360
17781b28391D90361a5641k8132N740A3939J74301a97342C40939I5985I285a09068
17769g6423J3361A40737j0599J44243E8101a46590B75630a48552J4440M4664I3733
17757G7563K00980C4526a24579b1935M734k97452A0962L9658J27034C9594e7627
17745d29101J78392B11749p1662a84980O7867A7244J22579b78940O1457B211a9614
17733B02238b11735k67373A7757K0234a51677D8289a20528D6179J4060J0139g8189
17721A08517j1189k0969a48279O3301b0422C19936B9171J45801J27857a25596
$$ plain form
17804 -2226 29180 -342710 337530 59033 102721 -321731 -121223 -62011 17586 -222204 286918
17792 53705 -69242 165460 198446 -26875 -170837 -221429 -126947 12788 -74512 -27031 -228391
17781 -228391 490361 -15641 -43773 -38033 13939 188240 -197342 340939 95985 9285 -109068
17769 -76423 -63062 140737 130138 274381 58101 -146590 275630 -148552 -134112 -89448 93733
17757 77563 278543 34526 -124579 -21935 -17201 -314653 10962 50620 177654 39594 -57627
17745 -429101 -250709 211749 140087 -184980 -117113 17244 139823 -278940 -217483 2211 -19614
17733 202238 -211735 -479108 17757 37991 -151677 48289 -120528 46179 60239 70378 -78189
17721 108517 97328 76359 -148279 -84978 -20422 319936 29171 174972 302829 -125596
17710c2604l56521A27944J30992i0049A21765m1830b7752B02729b30321h3233
17699A64035k9169n5280b20456D34494e6842k76911a39603B36448p7017c362j60296
17688a63658G1147a95510h8008A49173B0366L1443b51247D661a18889B6024N7405
17677H3429h3791p4771G7988d2235C9450O3731A397K7056R0131K55333b78036
17665b63065J25004n6226A1178J43953n3300j8427B2859b06300A2199h2238a3758
17653C3599O6231e8137H0601a28509B31989c39874a20207r4687A48709F970M2886
17642D9856b6685j98874D75809k04027b29572R2817a8332D9682J67200n8721L7288
17631A95449q2268J78148A08440c52159c6182k10630F2887J30018a40286H1593
$$ plain form
17710 -32604 -389125 127944 258936 -90049 121765 79935 -27752 202729 -230321 -83233
17699 164035 134866 79586 -220456 434494 -56842 -333753 -139603 236448 159431 -3362 -163658
17688 -163658 71147 -195510 -88008 149173 20366 51809 -251247 4661 -118889 26024 83429
17677 83429 -83791 -158562 77988 -42235 39450 103181 1397 28453 118584 373917 -278036
17665 -263065 -138061 -194287 11178 155131 101831 83404 22859 -206300 12199 -82238 -13758
17653 33599 99830 -58137 80601 -128509 231989 -339874 -120207 -214894 148709 6970 49856
17642 49856 -26685 -225559 475809 271782 -229572 -136755 -18332 49682 216882 158161 195449
17631 195449 113181 291329 108440 -352159 -36182 -246812 62887 192905 -140286 81593
17620B47938d2960B1989f3235A30805B1033Q7879a09315C27839a63836H5293d5656
17608h3434A46335K54896c6756m312C8572J81831P851C0856b1933k19940B25409
17596F6441J60167f1641A30669a68883B249Q5690b35692A68171H760b18323Q5650
17585a32673B4298I445K44668m6937F1312n249J89412g1181k1452n0904c6362
17573a26742i508j58854B54160c2670A04811K65631A30245J75991a57421A71397
17562a69719E1370J86665a002E4384J59549J3553N2031a46677A35743a36871C3443
17550A4665d7568j24093Q3404I1878a74206D1300A8944K78348J7584a38806J5346
17539a23460d3295C7790P1924C0145O3478K4355J02036j0129L7886g4787A98941
$$ plain form
17620 247938 -42960 21989 -63235 130805 21033 108912 -109315 327839 -163836 85293 -45656
17608 -83434 146335 401231 -36756 -41068 38572 220403 228254 30856 -21933 -241873 225409
17596 66441 226608 -61641 130669 -168883 2249 87939 -235692 168171 8760 -218323 -132673
17585 -132673 24298 9445 254113 207176 61312 56063 245475 -71181 -92633 -143537 -36362
17573 -126742 -9508 -168362 254160 -32670 104811 370442 130245 306236 -157421 171397
17562 -169719 51370 238035 -1002 54384 213933 227486 279517 -146677 135743 -136871 33443
17550 14665 -47568 -171661 -88257 91878 -174206 41300 18944 297292 314876 -138806 -123460
17539 -123460 -43295 37790 109714 30145 93623 117978 220014 209885 247771 -74787 198941
17527a09379r1227A57238o5451b9606k9235H5944a84027E9450q023A848K11142
17516B12990J8504O0746H5127E215J45189o5247M8504e1818G3155b8010q3739
17505a11749B42203c4443B06170i031p3230B66319J41042j60632e3079J8629B56262
17493A07562J34386a37448B44543F8644O6996a41014n7940A557b65770g7462C04089
17481B16030i9918D45157A32554a9454F4529J73109h9297A99269K19266A76758
17470A56723L33070a94242C9667K56574J01918E622K83237O7401p9578B32O0723
17459F0955M10822I2479i0674k3196a6874C35677p1281n2003k1917R5456A24802
17447A00595J79207H5242J41220m7695J24402N3939A35776b9848D12769A40581
$$ plain form
17527 -109379 -200606 157238 91787 -29606 -58841 85944 -184027 59450 51427 1848 212990
17516 212990 231494 292240 85127 5215 150404 85157 133661 -51818 73155 -28010 -111749
17505 -111749 242203 -34443 206170 -9031 -82261 266319 407361 246729 -53079 -34450 256262
17493 107562 241948 -137448 244543 68644 135640 -141014 -198954 1557 -265770 -77462 304089
17481 216030 -99918 445157 132554 -19454 64529 237638 -89297 199269 418535 176758
17470 156723 489793 -194242 39667 296241 398159 5622 288859 356260 276682 232 60955
17459 60955 471777 92479 -90674 -113870 -16874 335677 264396 212393 190476 285932 124802
17447 100595 279802 85242 226462 178767 303169 357108 135776 -29848 412769 140581
17436B47236K69399A21117a19493C84215I0069f1375D06608d8310a9970E62980
17425A93737N38955C65341b3989H9906N74841B20634p8267n6874L0783M01566
17415E17842j49190F2441a32670A99337l1478J38814A35545O8758b279k23276
17405b25555F7040K18386C1219a7555A02855m4064N5112l8612c10417e4955G0422
17393A43136C5434N02667A05313m1826K36800c46240B785R5522M8213A7838J42888
17382A60726b06519A60241J336G6303j3797K38033j00298K53480j33215j24615
17372A95891C5979e573A48190J25245j04629K03410l1679K4471j20363o6886a3482
17360B18574I1921Q9390o0784k0634M6103K50168A72071K49083j85230A06910
$$ plain form
17436 247236 516635 121117 -119493 384215 90069 -61375 406608 -48310 -19970 562980
17425 193737 732692 365341 -23989 89906 664747 220634 142367 85493 116276 517842
17415 517842 368652 62441 -132670 199337 167859 306673 135545 204303 -2279 -225555
17405 -225555 67040 285426 31219 -17555 102855 58791 113903 75291 -310417 -54955 70422
17393 143136 35434 538101 105313 63487 300287 -346240 2785 98307 146520 17838 160726
17382 160726 -206519 160241 161577 76303 62506 300539 200241 453721 320506 195891
17372 195891 35979 -5573 148190 273435 168806 372216 340537 365008 244645 177759 -13482
17360 218574 91921 181311 120527 99893 145996 396164 172071 421154 235924 106910
17349B97138r8758K4061k0259a31319D6469J96797J63495I6922L2655J51334f7140
17337A63678B7279i0463E3490K55615A8611J83217J65680E9090J43843o6530R2698
17326B29101E5880J19420K02865f7397B14953J1422a02921H7517K77641j15678
17316B49480k8009k2153J85074a68925A66035l0420J8427K1475C1972L51358A30608
17304a21574A57099J19846B3077L5343A0854M1462L4242J04601c9405B67761D7486
17292a9106m656A23614P8653A3499J52353K84510D4852K75578j03747E0962e6282
17280B00887M96093A93933K35275E3128K44473l7919p3302j8896a13083B21789
17269a30770C52263A46976A5388Q4360R867P661B1036J79778K40404r432p6101
$$ plain form
17349 297138 198380 222441 202182 -131319 46469 243266 406761 96922 129577 280911 -67140
17337 163678 27279 -90463 53490 309105 18611 201828 367508 59090 202933 136403 229101
17326 229101 55880 175300 378165 -67397 214953 226375 -102921 87517 365158 249480
17316 249480 221471 199318 384392 -168925 166035 135615 154042 175517 31972 383330 130608
17304 -121574 157099 276945 23077 58420 10854 52316 86558 191159 -39405 267761 47486
17292 -19106 -23762 123614 202267 13499 165852 450362 44852 320430 216683 50962 -56282
17280 200887 696980 193933 429208 53128 297601 259682 186380 167484 -113083 221789
17269 -130770 352263 146976 15388 99748 109615 117276 21036 200814 441218 431786 355685
17258C55685b5443C30839c3275C47937a68314B47842K79554G6253O6411C656K29895
17247B33551J29177A68634p7929K67820A68410J14670Q5637A57962J04548i0983
17236I6572O0168k0079C7270L31698A19435R080M2166J87451A18752J7924J82899
17225C19575j53480J61245K7917A7010L58532J19182F6873K04593q5354K14758
17215D00870J68233A79256R1130N105q9419a00878D82937o73j77516J28121p4500
17204C58369F1775K04685F5165K87337r2593J161J56208j3270I9149J89286L004
17193B91439N9410k8711K0434A21709J70693A45184L38524k21729M1417C2985
17182F46110A5172M6156M15592j83287M76477l48004j30965b8274B96888j02383
$$ plain form
17258 355685 -25443 330839 -33275 347937 -168314 247842 527396 76253 142664 3656 233551
17247 233551 362728 168634 90705 358525 168410 283080 368717 157962 262510 -90983
17236 96572 156740 136661 37270 368968 119435 128515 170681 358132 118752 136676 319575
17225 319575 166095 327340 355257 17010 375542 494724 66873 271466 186112 400870
17215 400870 569103 179256 270386 275491 186072 -100878 482937 482264 304748 432869 358369
17204 358369 61775 266460 65165 352502 259909 261070 417278 404008 99149 288435 291439
17193 291439 350849 322138 342572 121709 292402 145184 483708 261979 303396 32985
17182 646110 15172 61328 476920 293633 770110 422106 291141 -28274 296888 194505
17172A94505A1788N09138q2836J05211D7094J14470J06546J21936r3986Q5446
17162C81506A77701J16215K5666K37046B65587o2144N05483B87406m9045m5531
17152A92830P5433J57636j17042l7540C4527K80675O1408K11897B72810L4015
17142C06825O8241j87128L75703j81805A38938O1886q7907P51952B03685M6875
17132B50560P9299Q1910R7136j44648o4415K52899j83824L11768j87201L4936
17122E28420K52732C07626N15440B74537K34176B27114J22201j50270K61149j24755
17112C35439N70926C71801n2201J14601j56915J39052Q4882p2096A74123L4273
17102B08396j9039N4460p3174L43960k49580L14053A72178L25643n3447N27708
$$ plain form
17172 194505 11788 520926 438090 543301 47094 161564 268110 390046 296060 381506
17162 381506 177701 293916 319582 556628 265587 203443 708926 287406 238361 192830
17152 192830 268263 425899 308857 271317 34527 315202 376610 588507 272810 306825
17142 306825 375066 187938 563641 381836 138938 200824 112917 864869 203685 250560
17132 250560 329859 411769 508905 364257 299842 552741 368917 680685 493484 528420
17122 528420 781152 307626 823066 274537 508713 227114 349315 199045 460194 335439
17112 335439 906365 371801 319600 434201 277286 416338 501220 429124 174123 208396
17102 208396 189357 243817 170643 514603 265023 579076 172178 497821 444374 972082
17092I72082B98572k6794O8220p9380j08492L67654M6612j54126j8146j90674
17082B03446J13679J60095A42579O92615m08293J07574m6791k8934L34439k16753
17072E76436k5209q5051j436O5837j48813l9675K33064j42285j77895L81359M6624
17061F82956j64723p4307O1754r5953J32658L896R2525j75309j32750L0286K25534
17050E86567N8310j44117K23712k53519J03040r7506Q4046m6886R2925A21898
17039D26804L05294j04768j58887p987K86860r4887j85787M5326K48499j60046
17029F00421m0373l9496R4419j69778L65219j04884p5848Q5259o3319k55426J14404
17018E10598J45311J45707j99979R7185J09287N8671l59191Q3167K29465l1554
$$ plain form
17092 972082 298572 271778 339998 260618 152126 519780 566392 412266 394120 203446
17082 203446 317125 477220 142579 835194 426901 534475 487684 458750 793189 576436
17072 576436 551227 466176 464740 530577 381764 342089 575153 432868 254973 636332 682956
17061 682956 518233 443926 505680 409727 542385 546281 638806 463497 330747 361033 586567
17050 586567 644877 500760 724472 470953 573993 476487 560533 513647 606572 121898
17039 426804 732098 627330 468443 460456 747316 652429 466642 511968 760467 600421
17029 600421 560048 520552 614971 445193 810412 705528 629680 714939 651620 396194 510598
17018 510598 655909 801616 601637 698822 808109 866780 507589 590756 820221 788667
17008G88667J19152R8148m76050n7665J97373K4089l6837j35379L33195j86074
16998F68619R7256K4679J47946l32129L79464R8789l94849R0703J95396l43528
16988F32346J95816j06248J51596j90128K78318j33671j61634N31640j57748n4740
16978I85547J01082l52810p6389L66539k2302j21017p4982J0882J02200J01465
16968A020215K13408J24279k44850l81880L58039j67151J60093j61012K46608
16959A167749n1613r2617N4595O6090l38303L96706k81168J49699K28934k63683
16949A036389P9847L34148m20503J03562j84607K41590P3683J68826j17655k66741
16939A048539J67233J51294j48862m8416j07847K43389j21435K3479L32733k17627
$$ plain form
17008 788667 907819 1005967 529917 472252 669625 693714 656877 521498 854693 668619
16998 668619 765875 790554 938500 606371 985835 1084624 689775 780478 975874 632346
16988 632346 828162 721914 873510 683382 961700 828029 666395 1198035 1040287 985547
16978 985547 1086629 733819 657430 1023969 1001667 880650 805668 816550 918750 1020215
16968 1020215 1233623 1357902 1113052 731172 1089211 922060 1082153 921141 1167749
16959 1167749 1116136 1023519 1078114 1144204 805901 1202607 921439 1071138 1300072 1036389
16949 1036389 1116236 1450384 1029881 1133443 948836 1190426 1264109 1432935 1315280 1048539
16939 1048539 1215772 1367066 1218204 1169788 1061941 1305330 1183895 1207374 1540107 1322480
16929A322480j24733J56893J15818j8217j22819k9286J75976p8016l35575L88857
16919A451378k15463O7136M63629l52272j54882N2735J05842Q0956o1174O5010
16909A502895J34334l64121O38052l09998J3998J15565j21546K6295J13857Q6736
16899A836067Q6961q2694j24157J84078j87616K05465q6949r91J60450q5093M2940
16888A948461k00043O4832R3647K44617J01434p616j52425r7340J35428K53756
16878B384751R1261m70038L04976P1032j07062J70219P698J77956j89853J10088
16868B551028R5845j29797K50100q942o7887l73274J44287N64540m34157K17903
16858B809646L60855J7367k07075L62358J4352m28918M17911m58290O37239n82900
$$ plain form
16929 1322480 1197747 1354640 1470458 1452241 1329422 1300136 1476112 1398096 1062521 1451378
16919 1451378 1235915 1303051 1766680 1414408 1259526 1312261 1418103 1499059 1437885 1502895
16909 1502895 1637229 1273108 1911160 1601162 1615160 1730725 1609179 1635474 1749331 1836067
16899 1836067 1923028 1840334 1716177 1900255 1712639 1918104 1831155 1830164 1990614 1905521 1948461
16888 1948461 1748418 1813250 1906897 2151514 2252948 2245332 2092907 1995567 2130995 2384751
16878 2384751 2476012 2005974 2310950 2381982 2274920 2445139 2452837 2630793 2440940 2551028
16868 2551028 2646873 2517076 2767176 2758234 2690347 2317073 2461360 3025900 2591743 2809646
16858 2809646 3170501 3187868 2980793 3343151 3357503 2928585 3346496 2888206 3525445 2942545
16848B942545M17466j56097L10624l24860J34075N8724K35189J34324J34071J09503
16838C995564N5782k22704J99942j88849K54868J16357J17950J26133J0340K87178
16828D752561K78201k98157k10130J03477M74593r8078K59565p9170j64114K17893
16818E236641M47619R8762j27705K13542J70882J32915k34805M05140L70156L3210
16808F746357l33417K07292J74050J22944P3242M98249J90841L9468R5797J82050
16798G996873j37201M19930N40284L8672L60521J0393J81069N00758K55111K52570
16788A0418980J8962R48680k63418N56243j49903L77206K95012K80035P97903
16779A3279700J20017K24264P74727L64476J38502O95443O03478M95566K98625
$$ plain form
16848 2942545 3360011 3203914 3514538 3189678 3323753 3382477 3617666 3751990 3886061 3995564
16838 3995564 4051346 3828642 4028584 3839735 4094603 4210960 4328910 4455043 4465383 4752561
16828 4752561 5030762 4732605 4522475 4625952 5100545 5002467 5262032 5182862 5018748 5236641
16818 5236641 5684260 5783022 5655317 5868859 6039741 6172656 5937851 6342991 6713147 6746357
16808 6746357 6412940 6620232 6794282 6917226 6990468 7488717 7679558 7719026 7814823 7996873
16798 7996873 7859672 8279602 8819886 8858558 9219079 9229472 9410541 9911299 10166410 10418980
16788 10418980 10437942 11386622 11123204 11679447 11529544 11906750 12201762 12481797 13279700
16779 13279700 13399717 13623981 14398708 14763184 14901686 15597129 16200607 16696173 16994798
16770A6994798R58807K61240P36286Q75009O50389Q99063K71084J073258J084496
16761B3804430N42957J205849P95023J188505J138173J269137J019022J680685
16753C2643781J312794J609239J531250J980184J685458J813854K326482K702010
16745D7605052K402295K354387L197462K915095K958055L727363M269089M092904
16737G3521702M074578M497846M892468N436608N867171O403140O237228O727023
16729A17657764P132496P664283P632770P627601P811994Q269418P006694P256371
16721A78059391O343197N925614M647965L664783K379969O82424m67170j959345
16713A99276828l190958m436876n419824o558502o889606p503416p915251p754694
$$ plain form
16770 16994798 17953605 18214845 18951131 19826140 20476529 21375592 21646676 22719934 23804430
16761 23804430 24347387 25553236 26348259 27536764 28674937 29944074 30963096 32643781
16753 32643781 33956575 35565814 37097064 39077248 40762706 42576560 44903042 47605052
16745 47605052 50007347 52361734 55559196 58474291 61432346 65159709 69428798 73521702
16737 73521702 77596280 82094126 86986594 92423202 98290373 104693513 110930741 117657764
16729 117657764 124790260 132454543 140087313 147714914 155526908 163796326 170803020 178059391
16721 178059391 184402588 190328202 194976167 198640950 201020919 201703343 201236173 199276828
16713 199276828 196085870 191648994 186229170 179670668 172781062 165277646 157362395 149607701
16705A49607701q112254q041878p410913p751795o841898o866280o053436o214726
16697I2314521n590983m620263n102378m479473m218652m336692l237918l418943
16689E7309219k770383l178647k884249k277358k277876k337210k231475j591625
16681C7760396j691457j877274j510279j320389j668009j214121j323509j166086
16673B5989272j017372p89787j195121q59354r54071r03292p21125m47755q61776
16664A8239619p65281o74149o16737k83721q57435n06129r9228p04314m20327
16655A3312298m15982l31900n32587n57968J1797p93904n865j60181m41350k89698
16645I794660j21977k80910m31034j09888k08721q3346o74976M7999m29154Q1929
$$ plain form
16705 149607701 141495447 133453569 126042656 118290861 111448963 104582683 98529247 92314521
16697 92314521 86723538 82103275 77000897 72521424 68302772 63966080 60728162 57309219
16689 57309219 54538836 51360189 48475940 46198582 43920706 41583496 39352021 37760396
16681 37760396 36068939 34191665 32681386 31360997 29692988 28478867 27155358 25989272
16673 25989272 24971900 24182113 22986992 22127638 21173567 20270275 19549150 19101395 18239619
16664 18239619 17474338 16800189 16183452 15899731 15042296 14536167 14436939 13732625 13312298
16655 13312298 12896316 12564416 12031829 11473861 11485658 10691754 10685889 10525708 10084358 9794660
16645 9794660 9672683 9391773 8960739 8850851 8642130 8558784 7883808 7931807 7502653 7584582
16635G584582j48187k65428p3302l53468o7340m34106K08389l54806j49170K90267
16625F237431n83407r7200k61271J44036m3282j80552k78227p2391k98106Q9599
16615D656630j20163j31199j94246j19903J66785m46769L27689k04651M28026
16606D362199o79848J82275o1047n0443k34370J63284k97571p9278R2291k19276
16596C178216k41473K43887k82138J84018J68806o56550Q1865R1397J30096k28486
16586B669638K70563l33741Q572j83098k70122N55086m02916K17475q1620k53812
16576B196025p0963R0856j3582j57327R0437k55677j22704L49299O4037K6228
16566B196629k19794J63705l86058J93469N8343l44104L21790m9121o6132r6834
$$ plain form
16635 7584582 7436395 7170967 7097665 6744197 6676857 6242751 6451140 6096334 5947164 6237431
16625 6237431 5654024 5556824 5295553 5439589 5396307 5215755 4937528 4865137 4567031 4656630
16615 4656630 4536467 4405268 4211022 4091119 4257904 3811135 4138824 3934173 4362199
16606 4362199 3682351 3864626 3803579 3753136 3518766 3682050 3384479 3305201 3397492 3178216
16596 3178216 2936743 3180630 2898492 3082510 3251316 2594766 2676631 2768028 2898124 2669638
16586 2669638 2940201 2606460 2615032 2431934 2161812 2716898 2313982 2531457 2449837 2196025
16576 2196025 2125062 2215918 2202336 2045009 2135446 1879769 1757065 2106364 2170401 2196629
16566 2196629 1976835 2140540 1754482 1947951 2006294 1662190 1983980 1934859 1868727 1771893
16556A771893J4022k77753K85646j91461j02186J35181q3407K78635k95961K17844
16546A752453k28669k4485O826k00725J27640k66790L72744l02202J30717K64097
16536A631606m71129k24434M11587m36321J42860L61255k44524N5017o936J74389
16526A393370l1585l32579p2761K58595n7564j4780j97161J77719k69794j73889
16516F79571L54896K38666l40814J23045J4646D97412J64498K94482O9215K6959
16506A052566j21328l25763j49289J02061N03765k56093J8420l8112J45720n3032
16496H78915M10907D50677N69116k98035O5700o4629m8189k27377J2651K05756
16486F65670J83536C61056K33046k6527r1092K99164C41629M32931k11194J15213
$$ plain form
16556 1771893 1785915 1508162 1793808 1602347 1500161 1635342 1551935 1830570 1534609 1752453
16546 1752453 1523784 1499299 1506125 1305400 1433040 1166250 1538994 1236792 1367509 1631606
16536 1631606 1160477 936043 1347630 911309 1054169 1415424 1170900 1225917 1218981 1393370
16526 1393370 1361785 1029206 956445 1215040 1157476 1142696 945535 1123254 853460 679571
16516 679571 1034467 1273133 932319 1055364 1070010 497412 661910 956392 1025607 1052566
16506 1052566 931238 605475 456186 558247 1062012 805919 824339 786227 931947 878915
16496 878915 1289822 450677 1019793 721758 787458 722829 674640 447263 459914 665670
16486 665670 849206 361056 594102 567575 476483 775647 341629 774560 563366 678579
16476F78579J63104D05276o1929N21186K0409j16225J0747k76609l8908q1990
16466C81957N10883C24114J71126K00469B89008J09126J07700J81927j95559j60212
16456C31990M31826C26455m7661L41760k24941m423O4018j19040N4045J49885
16446E40098J94653l50229J50641j07087j89235J00091o7309K68309B05670O11415
16436H17085j67475B65823J51199J69679j8264B41662A2409N66530J33781A55012
16425D55990B15119O51699l96272j22546j51501J30711o2667j10854M3706H3815
16414D44347R8742j51330j74943K28696R9849o8245j01717J30835B22161P3410
16404B95571n8471J32900K6019A29601N14207B08610R1496K86308o4422k50449
$$ plain form
16476 678579 841683 405276 343347 864533 884942 768717 779464 502855 463947 381957
16466 381957 892840 324114 495240 695709 289008 398134 505834 687761 492202 331990
16456 331990 763816 326455 278794 620554 395613 391190 455208 336168 390213 540098
16446 540098 734751 384522 535163 428076 238841 338932 271623 539932 205670 817085
16436 817085 649610 265823 417022 586701 568437 241662 12409 578939 712720 155012
16425 455990 215119 866818 470546 348000 196499 327210 264543 153689 197395 83815
16414 444347 543089 391759 216816 445512 545361 477116 375399 506234 222161 295571
16404 295571 237100 370000 396019 129601 643808 208610 300106 586414 521992 271543
16394B71543Q923O1147p0654J38375A99346Q2750J77474A13266a44388C08268
16383g7936B17838N2927N148R7451A34074J23636F8455N17037k72551a5916H1322
16371D6074a0047A50598l6242K94249j20332k3788I0562J82614N1582g764C6855
16359C76827k7958q1444J05994A21191L68114j69973e843B45155J15282j58652
16349B01785L8381j6541r8218K79347j86445p1553K87536C2682J83947r8629c9665
16337E5317e4637C72352m3730j44696K35972j75890a9648C51862F5663J23126
16327A88789B0638J5534Q1667O6108K05964b1150j44314A07684c18938J03113
16317b15825k0235C68848H3168K04464F6507P8604k6561K6361b06136C23030M598
$$ plain form
16394 271543 280466 341613 270959 409334 199346 282096 459570 113266 -144388 308268
16383 -77936 217838 270765 275913 373364 134074 257710 68455 585492 312941 -15916 81322
16371 46074 -10047 150598 114356 408605 288273 264485 90562 273176 324758 -7764 36855
16359 376827 348869 267425 373419 121191 489305 319332 -5843 245155 360437 201785
16349 201785 240166 223625 125407 404754 218309 146756 434292 32682 216629 118000 -39665
16337 55317 -54637 372352 328622 183926 419898 244008 -19648 351862 65663 188789
16327 188789 20638 36172 117839 183947 389911 -21150 -165464 107684 -318938 -215825
16317 -215825 -236060 368848 83168 287632 66507 145111 118550 144911 -206136 323030 327628
16306C27628C9155K86929d7782K2535j4924B55656a47608B46680I8368K68153
16296C66521b216C41036A49678k8031a0796D35680C6777g3744E6082c37638A20840
16284I5888J6322D7457L20515j59366J79803i1481H1781K98581d1818F87015k63815
16273D23200A35214N5584a82120C68843H2519N554M23865j19716a50171A2570
16262A04587a34501B3767f9759C48487a6209E6196B0785c0459C15347j34544k063
16251A78740A395a35902A1314c01029a18323b6854B63754b7366e08E4414A2131
16239A27337a55074F1899a29983a6066l2699A75468H19J5103N7643K59970E4141
16227D6228L79218F5260K46144a86926C83322A26548a93223A72175J22186a9519
$$ plain form
16306 327628 39155 326084 -47782 -25247 -40171 255656 -147608 246680 98368 366521
16296 366521 -2216 341036 149678 121647 -10796 435680 36777 -73744 56082 -337638 120840
16284 95888 112210 47457 367972 208606 388409 -91481 81781 380362 -41818 687015 423200
16273 423200 135214 190798 -182120 368843 82519 88073 511938 392222 -150171 12570
16262 104587 -134501 23767 -69759 348487 -16209 56196 20785 -30459 315347 180803 178740
16251 178740 1395 -135902 11314 -301029 -118323 -26854 263754 -27366 -508 54414 12131
16239 127337 -155074 61899 -129983 -16066 -48765 175468 819 15922 73565 333535 54141
16227 46228 425446 65260 311404 -186926 383322 126548 -193223 172175 294361 -19519
16216B27318f8770K2420j43756D58689A75960i6541A54168K0956b9261B23004
16205C45087j22341H4254J41235a98206A65435M4385j04877L7947e163l61995
16195c67158B49811g2923B23629H8927L54357a16461A71596j0102b78492a05224
16184a15377A78963c61708B57094q0553E5925J6503a05049A18542d30775E1360
16173A75651D1427c36666b8998I0827M7442J36833a0864C62196a12891A09191
16162B9018J9580A5786b10948e1192C28824i4330E0653M5850j0757O3282E3045
16150G7203b75508M7725B37600I4996l3863e4535j42702O6015b9000k539B704
16138a95084Q5819J6040A10737A7400c2744B74561a99529A0638J16568b15410
$$ plain form
16216 227318 -68770 -46350 -190106 458689 175960 -96541 154168 175124 -29261 223004
16205 345087 222746 84254 225489 -198206 165435 209820 104943 142890 -5163 -367158
16195 -367158 249811 -72923 223629 88927 443284 -116461 171596 161494 -278492 -105224
16184 -115377 178963 -361708 257094 176541 55925 72428 -105049 118542 -430775 51360
16173 175651 41427 -336666 -28998 90827 138269 275102 -10864 362196 -112891 109191
16162 29018 48598 15786 -210948 -51192 328824 -94330 50653 96503 85746 149028 53045
16150 77203 -275508 -227783 237600 94996 61133 -54535 -197237 -131222 -29000 -31539 2704
16138 -195084 -109265 -93225 110737 17400 -32744 274561 -199529 10638 127206 -215410
16127a94042L752j43230A62948F8695a12239I3159a81879e0939k25281G1849a20388
16115E4366a22113D0879N2574J53152c3256j15845P3046A61797d57339a8601l1254
16104d9855j54172I2047N1899n2844J74724a3286A79286l257n3560a71812A70848
16092a55292H2462a4597A56141l8369k8644c62067A67409a5280j34850k23333
16082c73463E1564O2245l1223J32238j5030d0273j63246I4805i4692j10206A80826
16070a27373M0176n9283B17310D8859a80920B53057i1249B31314A4286b09052
16059a18287K2122A88746E8192a28896B20327c12294a39539M1942l18561g1063
16048d8268A02294a43353j79839A6933K07862q9362c18540J31995c3293j16930
$$ plain form
16127 -194042 -190290 -333520 162948 68695 -112239 93159 -181879 -50939 -276220 71849 -120388
16115 54366 -122113 40879 93453 246605 -33256 -149101 -76055 161797 -457339 -18601 -49855
16104 -49855 -204027 92047 143946 91102 265826 -13286 179286 176029 122469 -171812 170848
16092 -155292 82462 -14597 156141 117772 89128 -362067 167409 -15280 -150130 -373463
16082 -373463 51564 113809 82586 214824 199794 -40273 -203519 94805 -94692 -204898 180826
16070 -127373 -87197 -146480 217310 48859 -180920 253057 -91249 231314 14286 -209052
16059 -118287 -96165 188746 58192 -128896 220327 -312294 -139539 -97597 -416158 -71063
16048 -48268 102294 -143353 -323192 16933 224795 135433 -318540 -186545 -33293 -150223
16038a50223H7910b35964E9967a4056m3937l5514C49484a51913I8278a50968B14180
16026e342k34810O8883B4206b67354C2037L4005J62420n0952a31876q2143F4302
16014I1682b28743B10595b7311G6873a27831c2624j62228E3514J1694N6623n035
16003A16796l4143O5138e1323j30134B29435r3853h8290E7695e9567j00007d6636
15991c24466e1350A77255d6157O680k42185a25853C75015A15448m9791J04094
15981A69751J11801J87968A48644J45380A25889a18966a6131k39569Q0256j70940
15971c46384C2083c0760k72916H1733a55923E3796L114R5556b22182B0384b0527
15959a24457A8056a47908B17437p2478b31788r284F6832O3177K47580a15828B71649
$$ plain form
16038 -150223 87910 -235964 59967 -14056 -57993 -93507 349484 -151913 98278 -150968 214180
16026 -5342 -240152 -171269 24206 -267354 32037 66042 228462 177510 -131876 -214019 64302
16014 91682 -228743 210595 -27311 76873 -127831 -32624 -194852 53514 65208 121831 116796
16003 116796 82653 147791 -51323 -181457 229435 135582 -88290 57695 -59567 -159574 -46636
15991 -324466 -51350 177255 -46157 -39477 -281662 -125853 375015 115448 65657 169751
15981 169751 281552 469520 148644 294024 125889 -118966 -16131 -255700 -175444 -346384
15971 -346384 32083 -30760 -303676 81733 -155923 53796 56910 152466 -222182 20384 -20527
15959 -124457 18056 -147908 217437 144959 -231788 -241072 66832 130009 377589 -115828 271649
15947a98765A89562q4514b12454b056A65578c3776k32076A84057a18377a0625
15936A28013b7375k79916F0811b984o9887B02080i7439j13265J04465A20538b14703
15924B02137j01051b77742i218j16577l9794m7382Q8061N5145j63730A24477e7442
15912a88373B63276Q5293k7588b6795A60101F7191O8197c47803E8798a57237f0079
15900c84664G7775c56912G4036A8202b68958L2506J4817Q1413B38320a81033c7931
15888b89250i2084L1144A12618b07970Q6491D94968g3617a9228j94211j5658A33949
15876B49454d0784k1276j12553A32485h9696i434j83483p7007c724j3828m27697
15865d45249c8098A05325J12003a45494L9610p6165k2445A38533M6048b14594
$$ plain form
15947 -198765 189562 105048 -212454 -2056 165578 -33776 -265852 184057 -118377 -10625
15936 128013 -27375 -307291 60811 -2984 -72871 202080 -97439 -210704 -106239 120538 -214703
15924 202137 101086 -277742 -9218 -125795 -165589 -212971 -124910 -69765 -233495 124477 -57442
15912 -188373 263276 348569 320981 -26795 160101 67191 135388 -347803 58798 -157237 -60079
15900 -384664 77775 -356912 74036 18202 -268958 -236452 -221635 -140222 238320 -181033 -37931
15888 -289250 -92084 -60940 112618 -207970 -121479 494968 -73617 -19228 -213439 -229097 133949
15876 249454 -40784 -62060 -174613 132485 -89696 -9434 -192917 -269924 -3724 -17552 -445249
15865 -445249 -38098 105325 217328 -145494 -105884 -182049 -204494 138533 184581 -214594
15854f9607o9965D3307M1728b42137d6077A83598i3079A44539J17598d4003b709
15842a36199d9950j65340R5112j57427o6918g2074k40746a4196j32366D89280
15831G0693a06851j04580k81159a3200j9397r2805e2162A19165c25906f5144p4978
15820a40122j10084a10074p241J2516j29006a10740M3306b5510E8206i7355l184
15809a00539B66526c82996F9784g8331m1860E1918k5757a25589D3140K003J5022
15798F0165a60438p833P9939c876H1007a1935A78293B8682c542C29032F7287P8226
15786A45513d0865A0702J41148E9832e9442E3556C200O3994H783b07202j92373
15775c99575g0118r0923B32193A00867f5539j28400P0221k85516A3221J2743a40270
$$ plain form
15854 -69607 -139572 43307 85035 -242137 -46077 183598 -93079 144539 262137 -44003 -2709
15842 -136199 -49950 -215290 -120178 -277605 -344523 -72074 -312820 -14196 -146562 489280
15831 70693 -106851 -211431 -492590 -13200 -32597 -125402 -52162 119165 -325906 -65144 -140122
15820 -140122 -250206 -110074 -117315 -104799 -233805 -110740 -67434 -25510 58206 -97355 -100539
15809 -100539 266526 -382996 69784 -78331 -120191 51918 26161 -125589 43140 45143 60165
15798 60165 -160438 -168271 -88332 -3876 81007 -11935 178293 28682 -3542 329032 67287 145513
15786 145513 -40865 10702 151850 59832 -59442 53556 3200 67194 8783 -207202 -399575
15775 -399575 -70118 -161041 232193 100867 -65539 -193939 -123718 -409234 13221 25964 -140270
15763a44728D6562J07696b08364B37486l1651a40986B39490b1822A90455J21441
15753C11896A00974b46589P1111L8378A44881K75669C3296b6243F1873N1076h6105
15741B53499b80354B47480n4800a29365k11362e3864A15440a87077h0420I9439
15730c0443a5095B7974i3431I0855M38245b17117G6755a4739F7434J58176f280
15718a95160E5139f7368A17377a38505r7036H2684a45632d5094A26352b6185j31005
15707a57190j6925j12728J30876c5833B68704c39469b4521k66530a22268N0355
15697g1913q0171A21848b79260A20007a95236A89889Q8865H4236a26664D5007
15686A41791J45676a26606a7094m8144A27855B0882d4270j71035J9558C37585
$$ plain form
15763 -144728 46562 154258 -208364 237486 205835 -140986 239490 -21822 190455 311896
15753 311896 100974 -246589 -175478 -137100 144881 420550 33296 -26243 61873 112949 -86105
15741 253499 -280354 247480 192680 -129365 -340727 -53864 115440 -187077 -80420 99439
15730 -30443 -15095 27974 -93431 90855 529100 -217117 76755 -14739 67434 225610 -6280
15718 -195160 55139 -67368 117377 -138505 -235541 82684 -145632 -45094 126352 -26185 -157190
15707 -157190 -174115 -286843 -155967 -35833 268704 -339469 -24521 -291051 -122268 -71913
15697 -71913 -152084 121848 -279260 120007 -195236 189889 278754 84236 -126664 45007
15686 141791 287467 -126606 -17094 -65238 127855 20882 -44270 -215305 -195747 337585
15675I1095J09049f2973A60345a05708L2315L0998p6353a1269E2419a28790n655
15664a34445R965k77485d3414l07189B08351f4826r4026d5839k17278a27487f1700
15652f2044H8464a86845h9436C74108g8777b7351p1501D6002a05877j99160A24194
15640D553J45373e92427A78964a74980J4284c0669D5364a26509E1382b12752G2121
15628C9385L8084k4255a71630A3400K25139K7668b24554c5451p6029A55674H765
15616A75941J35607I9643a29329A58355H361a4388m6164B43212a19200A90402
15605I4670k6708J25710a65451H1354b21630D981f0406n056A78394p1046G600
15593d21691A35793Q9762H3617J55880m0066b69246A54341N8794I5492b1678o3258
$$ plain form
15675 91095 200144 -62973 160345 -105708 -73393 -42395 -118748 -11269 52419 -128790 -134445
15664 -134445 -124480 -401965 -43414 -350603 208351 -64826 -158852 -45839 -263117 -127487 -61700
15652 -62044 88464 -186845 -89436 374108 -78777 -27351 -98852 46002 -105877 -305037 124194
15640 4553 149926 -592427 178964 -174980 -160696 -30669 45364 -126509 51382 -212752 72121
15628 39385 77469 53214 -171630 13400 238539 266207 -224554 -35451 -111480 155674 8765
15616 175941 311548 99643 -129329 158355 8361 -14388 -60552 243212 -119200 190402
15605 94670 67962 193672 -165451 81354 -221630 4981 -60406 -65462 178394 107348 7600
15593 -421691 135793 225555 83617 239497 199431 -269246 154341 213135 95492 -21678 -84936
15582h4936A77653o2775h8184k93117D5209a19597B32605r2894a96758E3370c383
15570b3029j46329l606B06226p8205g7698l41398B84406a12426k00208A19048
15559A96834i3513A54365C6577a32350B18831a91663l15464F2957R389b97649
15548C8909b30365j247R5395e9012B63708H3540b35046b6828E1897R857j0778
15537E0976N4664b00174A35522J7801b3908D38880b58084d7665A70771o6814c1673
15525b01769E2007N1717N7524c28997J58894c3407j73758A2263J58104a6316F8726
15513b05549B63437A02573N434H252f4748j03819B7693e8904C7246b6647o9357
15502i6004A06758j2628c284A98606a69162A93528A6833J71349n4216h7737k6097
$$ plain form
15582 -84936 177653 114878 -88184 -381301 45209 -119597 232605 139711 -196758 53370 -3383
15570 -23029 -169358 -172964 206226 128021 -77698 -419096 284406 -112426 -312634 119048
15559 196834 -93513 154365 36577 -132350 218831 -191663 -507127 62957 72346 -297649
15548 38909 -230365 -231612 -136217 -59012 263708 83540 -235046 -26828 51897 61754 50976
15537 50976 105640 -200174 135522 153323 -23908 438880 -258084 -47665 170771 103957 -31673
15525 -201769 52007 103724 161248 -328997 -170103 -33407 -207165 12263 170367 -16316 68726
15513 -205549 263437 102573 108007 8252 -64748 -168567 27693 -58904 37246 -26647 -96004
15502 -96004 106758 94130 -3284 198606 -169162 193528 16833 188182 133966 -87737 -113834
15491a13834A38890b5709l37727B30728D4875b4376k04916D0412c44791C09699
15480A39758E3039J66190b84830m6671f508j76446Q0881A53190o369a22902e9440
15468c39919J37700h4266H6387M2611a00476l4085A8560P7942a25650j59580A45455
15456G4390L5954b39962a10749L6133K6955A93188h6431C976K06039b85062B43137
15444B78262a574k7807A62321l9162a02413F2604a59371M5447G2020b83873h4825
15432d7469J5416I8845d07188c4259k20656D51807a10217G2887a5024m6885I3926
15420C9962r279M4429e5919A59993a26275A553a58158C0408m941b66605p3670
15409c40275A44212i4381j63446C56518c80515a54216k45316B26943A08094i6195
$$ plain form
15491 -113834 138890 -25709 -363436 230728 44875 -24376 -229292 40412 -344791 309699
15480 139758 53039 219229 -284830 -331501 -6508 -182954 -102073 153190 146821 -122902 -59440
15468 -339919 -202219 -84266 86387 128998 -100476 -134561 18560 96502 -125650 -285230 145455
15456 74390 110344 -239962 -110749 -74616 -47661 193188 -86431 3976 210015 -285062 243137
15444 278262 -1574 -29381 162321 123159 -102413 62604 -159371 -113924 72020 -283873 -84825
15432 -47469 -32053 98845 -407188 -34259 -254915 451807 -110217 72887 -15024 -61909 93926
15420 39962 30683 75112 -55919 159993 -126275 1553 -158158 30408 25467 -266605 -340275
15409 -340275 144212 -94381 -257827 356518 -380515 -154216 -399532 226943 108094 -96195
15398C01614g1881E7561d1174o5634c6733o2270F7559a00431m4452B29453f1204
15386A08501a08814B49678a09546J6293k17723l4557R655J18230P9341A72941
15375A35573k7978c38463a21246A99674c29160i9056A75793p4332i9308B06262
15364c62239a71232P9419B82966c7233B44338C9775a80107q3743l5894B680Q6561
15353H9241e9883A98133q9931e6678C57491A27242b27919a8913k71395h0722A12789
15341F6179J72786a52792B2701d0697k12003H0663i7411b2760H7566J07341b16149
15329B4291J77489B0167J53416a2685I5132g8775D16498a88886l6991a12402M9769
15318f2633c394j79935B71184b9852B50176E9585R2316j7598d9954o0815A63627
$$ plain form
15398 301614 -71881 57561 -41174 -106808 -36733 -99003 67559 -100431 -144883 229453 -61204
15386 108501 -108814 249678 -109546 -93253 -310976 -345533 -335878 -217648 -138307 172941
15375 135573 107595 -338463 -121246 199674 -329160 -99056 175793 101461 -99308 206262
15364 -362239 -171232 -91813 282966 -37233 244338 39775 -180107 -263850 -299744 2680 89241
15353 89241 -59883 198133 108202 -56678 357491 127242 -227919 -18913 -290308 -80722 112789
15341 66179 238965 -152792 22701 -40697 -252700 80663 -97411 -22760 87566 194907 -216149
15329 24291 201780 20167 173583 -12685 95132 -78775 416498 -188886 -225877 -112402 -62633
15318 -62633 -3394 -183329 271184 -29852 250176 59585 151901 134303 -49954 -110769 163627
15306A49986D3624K60891a50522A11787k0713K8478g4211D4285M7708h2489A99978
15294b66197a23508A74112J79095j63496K39239c66983B92755K28829a07415E7286
15283a6198A2576K60675r0923b3219j07101M0494l473B00673P6724J1567c03091
15271A13507N1836F1410a35744A54571j0009m5732A7849M6583J7704J9645g4893
15259C35981i5931F7081r517R3032O5944A2523J68280G8984K3992i3859D73729
15247A198951N49849j68275q3949J82560H12646j73965A35884g754A0319K35187
15237B45506i685B16018q2414A7699f6582F5324f3147I5148K14788A06727o09
15226A06118J166N1330F8543O6844a66633C58776A21810e9971H2145j295P3735
$$ plain form
15306 149986 43624 304515 -150522 111787 91074 119552 -74211 44285 91993 -82489 199978
15294 -266197 -123508 174112 353207 189711 428950 -366983 292755 521584 -107415 57286
15283 -16198 12576 273251 182328 -23219 -130320 -89826 -93299 200673 277397 288964 -303091
15271 113507 165343 61410 -135744 154571 144562 98830 17849 64432 82136 101781 -74893
15259 335981 -95931 67081 57564 150596 216540 12523 180803 78984 102976 -93859 473729
15247 1198951 1748800 1580525 1496576 1679136 812646 638681 135884 -7754 10319 245506
15237 245506 -9685 216018 133604 17699 -66582 65324 -63147 95148 309936 106727 106118
15226 106118 107284 158614 68543 135387 -166633 358776 121810 -59971 82145 80850 154585
15215A54585a18393D8640J1601A4215L14966j36283K40220D8587O9126c45259
15204b36578A052K27334A4836J58879B5747J02715a4402D4523j5960a29958B25644
15192i2858C35739H878b95218A3052K31074r8088a82089E4976R2944D7685l681
15181D4004a36339B00109A1556N4269K25923p2421R6816H836K30243I6579a86500
15169b5496A65482i65G914l874a43745c0263A49635a97475A45886N080B0008J67031
15157A87039E968M1623a44713L7548B5949P7453J80799q0677f7283C51814j42357
15146B09457M7541j5777j16378f5724c19k98387a37795j02529A53308k6720M9677
15135A76265J39901a16201b9253j37100C76495j00073h5009C97032j82937J27323
$$ plain form
15215 154585 -118393 48640 60241 14215 329181 192898 433118 48587 117713 -345259
15204 -236578 1052 228386 14836 173715 25747 128462 -14402 44523 28563 -129958 225644
15192 -92858 335739 8878 -295218 13052 244126 146038 -182089 54976 147920 47685 44004
15181 44004 -136339 200109 11556 65825 291748 219327 316143 8836 239079 96579 -186500
15169 -25496 165482 -965 7914 4040 -143745 -30263 149635 -197475 145886 150966 20008 187039
15157 187039 5968 47591 -144713 -107165 25949 103402 284201 203524 -67283 351814 209457
15146 209457 256998 241221 124843 -65724 -319 -298706 -137795 -240324 153308 126588 176265
15135 176265 316166 -116201 -29253 -166353 376495 276422 -85009 397032 214095 341418
15125C41418a78291G06547D2322K42738O1141m8856q5200J6240B1774L4301N2321
15114A08396O1428K4753f9157B42303K08952A67374F6053b06095D42736j90958
15104B51778r597c8367A03358K66707A27256R7531b9153B19900a17451A61645
15093A05378P8128N5557R4039Q9469B8679J22535K5034J74329F8266j4770f6876
15081D8465G385J64215L798i9510j1678H6159K06636J7287L9535j14197E4082
15069A50343M5285D3346L21986a94188a110A45743J67800L4946i0384A42319K24530
15058C66849l3719F427P3539b6809B26058P6252c56118I3447R1253O4845n5535
15047A94010J05007G074J49995G1667K00295m3554K8089A16301f5424C64844F9250
$$ plain form
15125 341418 -178291 706547 42322 285060 346201 297345 212145 228385 21774 56075 108396
15114 108396 169824 194577 -69157 242303 451255 167374 66053 -206095 442736 251778
15104 251778 242181 -38367 103358 370065 127256 224787 -29153 219900 -117451 161645
15093 105378 183506 239063 333102 422571 28679 151214 176248 350577 68266 53496 -66876
15081 48465 7385 171600 175398 -99510 -111188 86159 292795 310082 349617 235420 54082
15069 150343 195628 43346 365332 -194188 -1110 145743 313543 348489 -90384 142319 366849
15058 366849 333130 6427 79966 -26809 226058 302310 -356118 93447 184700 249545 194010
15047 194010 299017 7074 157069 71667 271962 228408 256497 116301 -65424 364844 69250
15035B59693e3566B15717p8354K34701O304J09131a09638B43063K2330j0738K1708
15024B76363J05851a7378B08856a30594a8862B04743j251E4564N86787l20191
15014C21160J03347A09237K90447A31737J37929O7636r4412q8322J33751j0168
15004B78151J35695j17821I2853J30064f261A04230J02349G5570J5584K59856
14994C51010n1311F2985J82184A12013K21244C0628J59308M1038K04948b5908
14983A05440e7087B61462O1724n6416J23820A29238k2043f331B91331I0429K11221
14972C01650G1980M83270B49463J81574J5011j34880n6633J55159j78302m4017
14962A87375J50546C9158L21940q6962Q5458b30683e9157j0905B39711q284q1250
$$ plain form
15035 259693 -53566 215717 137363 372064 378368 487499 -109638 243063 265393 254655 276363
15024 276363 382214 -17378 208856 -130594 -18862 204743 203492 54564 641351 321160
15014 321160 424507 109237 399684 131737 269666 337302 242890 154568 288319 278151
15004 278151 413846 296025 92853 222917 -6261 104230 206579 75570 91154 351010
14994 351010 299699 62985 245169 112013 333257 30628 189936 230974 435922 -25908
14983 105440 -57087 261462 323186 266770 390590 129238 107195 -6331 291331 90429 301650
14972 301650 71980 555250 249463 431037 446048 311168 254535 409694 231392 187375
14962 187375 337921 39158 361098 274136 359594 -230683 -59157 -70062 239711 231427 150177
14951A50177J14754O0563O862j23484m1770M1791D0069K70216q6308K3649H144
14939E59242L2785k73588A50099K37763A08891K64988R8448A79202d4495C31084
14928E22120G880f7354I7284D4429K62640K49166J7547H2325J08373J97988j0439
14917C78247j51507A09189K90660D921L75683j80810K28135j60043n4866Q2566
14907B95586K38187H7017L04271A84771K89629q969r9590A17325L77965n9315
14897D35975B12983K35943j61721l544L87949B63003K60988I0482J57358n3185
14887A94655K32543P3915k05661E8333K25346K29546j12243A34288J62924K17903
14877E15115p8549j09864J88220j43484M2943A11591M26666A95377m783K6807
$$ plain form
14951 150177 264931 325494 332356 208872 167102 208893 40069 310285 223977 247626 8144
14939 559242 592027 318439 150099 387862 108891 373879 472327 179202 -44495 331084
14928 522120 7880 -67354 97284 44429 307069 556235 573782 82325 190698 388686 378247
14917 378247 226740 109189 399849 4921 380604 199794 427929 267886 213020 295586
14907 295586 533773 87017 391288 184771 474400 465431 365841 117325 495290 435975
14897 435975 212983 448926 287205 283661 671610 263003 523991 90482 247840 194655
14887 194655 427198 501113 295452 58333 283679 513225 400982 134288 297212 515115
14877 515115 436566 326702 514922 371438 414381 111591 538257 195377 190594 217401
14867B17401n2964L4158D5493O78056C04140E4294K43674K97123B1627M92094
14857E13721o3414N4265L6205B15657K89300k08493J28377J93361k71967P1216
14847D17451N1030K02783k51201L4614r5848J94084n0569k17333K06866o8340
14837D23537K59752j95261J54886B54806N48803l74971O147K36281k37344r8121
14827C35601M21310k60800K08553n8817k28466E8128M52965l5987J80693B02531
14816F40854B64284K36859K17123o1058j40232k6988J31029k48251j54144J96342
14806D14964J14459q0395l1396o5561J35290K85367C35269J89710k05427K38862
14796E58414J97765j84369n8986J43961j77625N2007J19671P1144k28374j1366
$$ plain form
14867 217401 164437 198595 45493 723549 304140 54294 297968 595091 21627 513721
14857 513721 450307 504572 540777 215657 504957 296464 424841 618202 346235 417451
14847 417451 468481 671264 420063 454677 358829 552913 502344 285011 491877 423537
14837 423537 683289 488028 642914 254806 803609 428638 434785 671066 433722 335601
14827 335601 756911 496111 704664 645847 417381 58128 511093 475106 655799 202531
14816 640854 264284 501143 718266 657208 516976 489988 621017 372766 218622 414964
14806 414964 529423 449028 417632 352071 487361 772728 335269 524979 319552 558414
14796 558414 756179 571810 512824 656785 479160 531167 650838 721982 493608 482242
14786D82242J6948p307m7172N469M11029D26993J45484m0928j6183j90618L33606
14775F58354j81321M1372o4548L9348K87592l525l66399O309J72619L24404j65824
14764G48381C34036L23059p6875j64433K24177j70482J38328J01347N05205n59393
14754F54969j76832M02749j02083j90759K05671n4094J23622j93459k38458L2790
14744D64116J34789J17930k68576o3072K7661J81004N2867K77433j02102l06481
14734E15569o6310K29077L65859k22827J35343k68037j52891L23806l7715k02617
14724F19257K78805k27189J03651J81391j09700J67073j97509N17J43115o8134
14714H91277p0264J34921m3918D44673K05318J74124j13394J55612l0l8316M0407
$$ plain form
14786 482242 499190 491883 444711 450180 861209 426993 572477 531549 515366 324748 658354
14775 658354 477033 518405 453857 493205 780797 777272 410873 417182 589801 914205 748381
14764 748381 334036 657095 580220 415787 639964 469482 607810 709157 1214362 654969
14754 654969 478137 880886 778803 588044 793715 739621 863243 669784 431326 464116
14744 464116 598905 716835 448259 385187 412848 593852 646719 924152 822050 515569
14734 515569 449259 678336 1044195 821368 956711 688674 535783 859589 821874 619257
14724 619257 898062 670873 774524 955915 846215 1013288 815779 816296 959411 891277
14714 891277 821013 955934 912016 444673 649991 824115 710721 866333 866303 827987 868394
14703H68394J14987k02342K33718k98503L61350j10783j89321L43998j20723k01821
14693G98954K0224J68739n5089l2463J43731k2994k80213M43248l87236J58399
14683I55300J79467L9940j10253l77310L91958k81870J91188j97012L1768N32242
14673A355418k69544k4601K5819J40170k03823l58062K32083L73742k20387l29240
14663G21575L42370K08758l27523L01164q243M3123q1939j93991N5943n4427M08942
14652A415752k32307j12694N2312O0065K21281O2030l25626J48603k97411L81710
14642A373715m99004N09466o6989K88463p0961r3102L2220n93j77429k474J17278
14631A410590l00823J62929p2206P0190j40754O92594m40567j39568L26534K20290
$$ plain form
14703 868394 983381 781039 1014757 716254 1077604 966821 777500 1121498 1000775 798954
14693 798954 819178 987917 932828 900365 1044096 1021102 740889 1184137 796901 955300
14683 955300 1134767 1174707 1064454 687144 1079102 797232 988420 791408 823176 1355418
14673 1355418 1085874 1061273 1087092 1227262 1023439 665377 897460 1271202 1050815 721575
14663 721575 1063945 1272703 945180 1246344 1238101 1281224 1199285 1005294 1061237 1006810 1415752
14652 1415752 1183445 1070751 1123063 1183128 1404409 1466439 1140813 1289416 992005 1373715
14642 1373715 874711 1384177 1317188 1605651 1534690 1441588 1473808 1473215 1295786 1293312 1410590
14631 1410590 1109767 1272696 1200490 1270680 1129926 1822520 1381953 1242385 1568919 1789209
14621A789209l16921k68574O5222L09721K60306m40234o4376J05843L95420q262
14611A827354p9507k21659K3632K72805k98126k55377K09234L28841l23562M98352
14601A981987o4522k50971n4920k64655L30825j94324L02490Q1986l43612N8867
14591A583151P62397q30092J76193O93389o12088j89317N56150k88055K38693
14582B090421k90254M68000j85115n557o8696J75574J05961L48980p00234K46347
14572B185427j99829L84855k20368K43030j42137k05811L99415Q2369l7375m4691
14562B444885M1915M74523l8734l78107N39386P2557k55975M76070p7449L11733
14552C610804M09148N47481Q40039J886243M139239J0349289J8249531O599209
$$ plain form
14621 1789209 1472288 1203714 1268936 1578657 1838963 1398729 1334353 1440196 1835616 1827354
14611 1827354 1747847 1526188 1549820 1822625 1524499 1269122 1478356 1807197 1483635 1981987
14601 1981987 1917465 1666494 1611574 1346919 1677744 1483420 1785910 1867896 1524284 1583151
14591 1583151 2345548 1515456 1691649 2385038 1772950 1583633 2139783 1851728 2090421
14582 2090421 1800167 2268167 2083052 2077495 2008799 2184373 2290334 2639314 1939080 2185427
14572 2185427 1985598 2370453 2150085 2393115 2250978 2045167 2444582 2526951 2489576 2444885
14562 2444885 2486800 2961323 2922589 2544482 3083868 3156425 2900450 3376520 3299071 3610804
14552 3610804 4019952 4567433 5407472 7293715 11432954 21782243 40031774 46630983
14544D6630983B2680806j0087777F293312k980871o82429o97229K0454R9985K70040
14535B323262n19419R9906j81982N97524j59045K65758k82597L49047k1885M06475
14525B877044o11395R120K9479m4704M45288l17096J10209K81123k41664J69677
14515B707081O4328L9178j95451J94429P0417K23087m3060k11098M45929p7897
14505C216943r5445k54203j11733K82617j04863J77297Q8728r2286J36948o898
14495C237105K47938L03948j30460j06617n2673J80928m9055L56676k12270Q2512
14485C858032J32781k42417L52648k83168J27557O10740n94281n9418L48093m1959
14475D208608K40770k3508q2236L0782j93533K39943k04694J41084K57517j34890
$$ plain form
14544 46630983 22680806 12593029 6293312 3312441 2630012 1932783 1953237 2053222 2323262
14535 2323262 1803843 1903749 1721767 2319291 2160246 2426004 2143407 2492454 2470569 2877044
14525 2877044 2265649 2274769 2304248 2259544 2704832 2387736 2497945 2779068 2537404 2707081
14515 2707081 2771409 2810587 2615136 2809565 2879982 3103069 3060009 2848911 3294840 3216943
14505 3216943 3121498 2867295 2755562 3038179 2933316 3110613 3199341 3107055 3244003 3237105
14495 3237105 3485043 3788991 3658531 3551914 3499241 3680169 3631114 3987790 3775520 3858032
14485 3858032 3990813 3748396 4101044 3817876 3945433 4556173 3961892 3902474 4250567 4208608
14475 4208608 4449378 4425870 4343634 4374416 4180883 4420826 4216132 4357216 4614733 4479843
14465D479843L66419n20322M04413J41248O8288J28574n6695K59572j18378J80746
14455E333708J381R768j39849N8988M54133j99992K38057J79224j85068n642M27560
14444F172268k75992N32136l62153J73886N1484L84399l75068J62267J99650r3452
14434F569425k94675N82465r9200K56690K05991K01954l26671K56379L38353k28869
14424G461842K34774r2762K98486K49604o0942K85354K55554k77610J29238O4467
14414H548005j26702L39573K13180R6101K18159k02599N77296M8289K80523N4745
14404A0046570m5096K89093j38036N99558J32283o049K84851J34171N62686l25138
14394A1534893M22509q2518J68525N61912j70341M88660K13021R7266L84467J78733
$$ plain form
14465 4479843 4846262 4325940 4730353 4871601 4939889 5068463 5011768 5271340 5152962 5333708
14455 5333708 5335089 5344857 5205008 5263996 5718129 5518137 5756194 5935418 5750350 5744708 6172268
14444 6172268 5896276 6428412 6066259 6240145 6291629 6676028 6300960 6463227 6662877 6569425
14434 6569425 6274750 6857215 6758015 7014705 7220696 7422650 7095979 7352358 7690711 7461842
14424 7461842 7696616 7603854 7902340 8151944 8091002 8376356 8631910 8354300 8483538 8548005
14414 8548005 8421303 8760876 8974056 9070157 9288316 9085717 9663013 9711302 9991825 10046570
14404 10046570 10001474 10290567 10152531 10752089 10884372 10878323 11163174 11297345 11860031 11534893
14394 11534893 11957402 11874884 12043409 12605321 12434980 12923640 13136661 13233927 13618394 13797127
14384A3797127J83975N07311n7581K19177O79881K45660K49161L98294j62582
14375A6060423M97504M17818j37429P98195J19720L80549l3548O32342L71658
14366A9107232K22785Q68480L42438J27576N15130N49415N70956M16869P52860
14357B3473741K18253P15617O12365Q38930k3320O95304P22661O07470R07475
14348B8768496N84187M58530R09906R10049O87081J025239R09842O32763Q69088
14339C5755181J166188Q42454J142500J104515J426912J021482J257661J001610
14331D4718503J439266J438680J941114Q51933K050237J431027J571137J767211
14323E7209108K017934K245058J819463K074171K721975K601547K327949K569739
$$ plain form
14384 13797127 13981102 14488413 14430832 14650009 15329890 15575550 15824711 16223005 16060423
14375 16060423 16557927 16975745 16838316 17636511 17756231 18136780 18103232 18735574 19107232
14366 19107232 19330017 20198497 20540935 20668511 21183641 21733056 22304012 22720881 23473741
14357 23473741 23691994 24407611 25019976 25858906 25835586 26530890 27253551 27861021 28768496
14348 28768496 29352683 29811213 30721119 31631168 32318249 33343488 34253330 34886093 35755181
14339 35755181 36921369 37763823 38906323 40010838 41437750 42459232 43716893 44718503
14331 44718503 46157769 47596449 49537563 50389496 52439733 53870760 55441897 57209108
14323 57209108 59227042 61472100 63291563 65365734 68087709 70689256 73017205 75586944
14315G5586944L040971K755947L446811L381999L755881K980215M277600M068407
14307A03294775M647184M461899M903845N118369N757047N413676O601584O161125
14299A46359504O998860P517228P633555Q764396Q552662R505932R852462J0376001
14291B15560600J0972636J1304518J2289093J2545338J3273579J3474342J4315625
14284C03735731J4518965J4759998J4991100J5303229J5040440J4832795J4289601
14277D07471859J3125245J2424379J0880507Q970710O143895K694887j02892j370961
14269D60237629j032003l247263k849892l351062n879761q928501j1003452j2495110
14261D11450585j3993918j4710656j5177724j4970593j5518930j5153412j4944296
$$ plain form
14315 75586944 78627915 81383862 84830673 88212672 91968553 94948768 99226368 103294775
14307 103294775 107941959 112403858 117307703 122426072 128183119 133596795 140198379 146359504
14299 146359504 153358364 160875592 168509147 177273543 185826205 195332137 205184599 215560600
14291 215560600 226533236 237837754 250126847 262672185 275945764 289420106 303735731
14284 303735731 318254696 333014694 348005794 363309023 378349463 393182258 407471859
14277 407471859 420597104 433021483 443901990 452872700 459016595 461711482 461608590 460237629
14269 460237629 459205626 455958363 453108471 449757409 443877648 434949147 423945695 411450585
14261 411450585 397456667 382746011 367568287 352597694 337078764 321925352 306981056
14254C06981056j3955749j3459534j3396351j3076993j2025165j1813966j1410560
14247B17842738j0342086r964065r252607q605574q616597p977304p693698o953557
14239A48437250o706122n845847n882303n490176n748596m745873m826964m389909
14231A04801460l955522l682950m266611l483397l321594l358827l234471k752605
14223G6745483k777966l047085k197509k071201j972681k411331k547469j525373
14215E8194868k163497j325162j469873j831693j766734j537597j647190p99034
14207D5654088o53516j589350j061457j742468j101787j134125p11846p56345
14199C6903194j413145j082901o15424j045382n73691o11538p21908r86363p89386
$$ plain form
14254 306981056 293025307 279565773 266169422 253092429 241067264 229253298 217842738
14247 217842738 207500652 197536587 188283980 179678406 171061809 163084505 155390807 148437250
14239 148437250 141731128 135885281 130002978 124512802 118764206 114018333 109191369 104801460
14231 104801460 100845938 97162988 92896377 89412980 86091386 82732559 79498088 76745483
14223 76745483 73967517 70920432 68722923 66651722 64679041 62267710 59720241 58194868
14215 58194868 56031371 54706209 53236336 51404643 49637909 48100312 46453122 45654088
14207 45654088 45000572 43411222 42349765 40607297 39505510 38371385 37659539 36903194
14199 36903194 35490049 34407148 33791724 32746342 32172651 31561113 30839205 29852842 29063456
14190B9063456r34115r5750j158525j69634j026317o58223l69844q10135l19716
14181B3521197m92147l61370p30964k0343q76388k83223m59119k88820q45238
14172A9163585o8185k11483n24458k65568k1857o80909l31588m80104k89257m27422
14162A5862754k97120Q7477l78820m11349k18564l26119J26284n42814k43777
14153A3657952r8952p23932j59548P083m7324j10704k39464l61090j55836M5534
14143A1813719m12613p6973m71642M4641j30401O1185l60729k33620j72561J40726
14133A0201732o00725J16086N2945l75814N27733o19982k23336l22231J82328
14124H938736k17763q3817k98872L45986k97736m17446k5128K34067n19558L2276
$$ plain form
14190 29063456 28129341 28033591 26875066 26705432 25679115 25020892 24651048 23840913 23521197
14181 23521197 23029050 22667680 21936716 21916373 21039985 20756762 20297643 20008823 19163585
14172 19163585 19095400 18883917 18359459 18093891 18072034 17391125 17059537 16579433 16290176 15862754
14162 15862754 15565634 15653111 15274291 14862942 14644378 14318259 14444543 13901729 13657952
14153 13657952 13559000 12835068 12675520 12682603 12635279 12524575 12285111 11924021 11768185 11813719
14143 11813719 11401106 11324133 10852491 10897132 10766731 10827916 10467187 10233567 10061006 10201732
14133 10201732 9601007 9717093 9770038 9394224 9921957 9301975 9078639 8756408 8938736
14124 8938736 8720973 8637156 8338284 8684270 8386534 7969088 7943960 8178027 7658469 7690745
14114G690745j35655J04335n83412M12076j75616Q6628m53475J58569K20450p64974
14104F559671j8380j75530K43678j27572l28568J01364J80010k74113K12130j98683
14094F174007j4568k20305m7158k07481j50465L70730l34565k23732j89847N40308
14084E696924k10970l08447j07274K98678j59393j36890Q1908l6368l48617n4259
14074D715292K22636k02386J07596j28746Q6269q4763k14906O1790J31901k58846
14064D435837l55205L78599r5172L5564N7733j37793l1349L1691r9784J4550m54226
14053C780445J07660l9400K43712m77937L07880k97432L1359J40897k42192J23081
14043C678073j11617j87371J21153J17144n89771K73194q407l21859L38064J27510
$$ plain form
14114 7690745 7555090 7659425 7076013 7488089 7312473 7399101 6945626 7104195 7324645 6559671
14104 6559671 6541291 6365761 6609439 6481867 6153299 6254663 6434673 6160560 6372690 6174007
14094 6174007 6159439 5939134 5891976 5684495 5534030 5904760 5570195 5346463 5156616 5696924
14084 5696924 5485954 5177507 5070233 5368911 5209518 5072628 5154536 5118168 4769551 4715292
14074 4715292 4937928 4735542 4843138 4714392 4800661 4715898 4500992 4562782 4694683 4435837
14064 4435837 4080632 4459231 4364059 4399623 4457356 4319563 4288214 4319905 4220121 4234671 3780445
14053 3780445 3888105 3848705 4092417 3614480 3922360 3624928 3656287 3797184 3554992 3678073
14043 3678073 3566456 3379085 3500238 3617382 3027611 3300805 3292398 2970539 3308603 3436113
14033C436113k80239P4024J04636J8733K19344k67287n13661K49748q4880J7516
14023B974047j2495j6560l16439n3510J74181j71154j00086M96411l09375k01453
14013B463567K0270R2373k44055j92986K74457K97082n70191K67421J08728k66419
14003B250247O7887k6424l70940K55663k15731J90892K55782j37101l29917r50
13993A939408O001R7674j38753N40363R05061K780131Q242997J8230120J6218918
13984D8821920k0203639j3615618o263436k745964o78961j200437l74157j35716
13976C603992m75359J20409m60351j58840O9918n755l23824L39604k09495J44000
13966B644299m53642J6233r2761L57434l17958J37060k2523j29673J3472N4782
$$ plain form
14033 3436113 3155874 3229898 3334534 3353267 3572611 3305324 2791663 3041411 2956531 2974047
14023 2974047 2961552 2944992 2628553 2575043 2749224 2578070 2477984 2974395 2665020 2463567
14013 2463567 2483837 2576210 2332155 2139169 2413626 2710708 2140517 2407938 2516666 2250247
14003 2250247 2318134 2291710 1920770 2176433 1960702 2151594 2407376 2270275 1940358 1939408
13993 1939408 1945409 2043083 1904330 2444693 3349754 6129885 14372882 32603002 48821920
13984 48821920 28618281 15002663 8739227 5993263 5314302 4113865 3739708 3603992
13976 3603992 3128633 3249042 2788691 2629851 2699769 2694014 2370190 2709794 2500299 2644299
13966 2644299 2190657 2206890 2114129 2471563 2153605 2290665 2268142 2138469 2151941 2206723
13956B206723l5470J88837k06146m20213M53383j53884K84430n72593L33328K03304
13946B281699l95853J77636m03039J33495k00791L19962k07278J9611K92695l13301
13936A704836L8891J00063o5007J98946l50003J79824j49369n9485P8794m5991
13926A631499k26822M07867k57904k04474k4705M22320m11219J79972J24009m02244
13916A238299M71376k50801K95751n4289j30190r9815K3408J07356J0817L8028
13906A649940j73995J3767k71223K02313j17237J61877O7956p107o0158j96207
13896A269926J81995q5445O7864o7102J08834K15291l91612M1638J67277J69365
13886A678031o89387L95782L2515j25394l99368P18721m41214J90489k33699M89231
$$ plain form
13956 2206723 2171253 2360090 2153944 1733731 2187114 2033230 2317660 1745067 2078395 2281699
13946 2281699 1885846 2063482 1660443 1793938 1593147 1913109 1705831 1725442 2018137 1704836
13936 1704836 1743727 1843790 1778783 1977729 1627726 1807550 1658181 1598696 1677490 1631499
13926 1631499 1404677 1812544 1554640 1350166 1325461 1747781 1336562 1516534 1640543 1238299
13916 1238299 1709675 1458874 1754625 1700336 1570146 1470331 1493739 1601095 1611912 1649940
13906 1649940 1475945 1489712 1218489 1420802 1303565 1465442 1533398 1526291 1466133 1269926
13896 1269926 1451921 1366476 1434340 1367238 1476072 1691363 1299751 1341389 1508666 1678031
13886 1678031 988644 1384426 1416941 1291547 892179 1610900 1169686 1360175 1126476 1615707
13876A615707l61129j60603L09237p5105k0117J88505m67021K89035l45871K8646
13866A001284l01037J38079M16387k22904M5322L1658k81364K22696q4356Q9446
13856A055211k1754k0729M10522l77399l58956M74844J29273p4527L8413k70740
13846I84158K17692r4077q2575K46686j28066j51469k16660L47999k18785p6776
13836H28127L9095J88958o3209k89429K24585K3685k8515L14349k67465j34602
13826H35579J73746q3158j13879L74011l46758K1822J11707L2527o0336m0024
13816I05237m0594J5872j65637J88454k4481O7400k36768l27094M24330R9469
13806I06188Q5893j22376L39825k38242k58227J03625j4266J4856K77507j71091
$$ plain form
13876 1615707 1254578 1093975 1403212 1328107 1307990 1496495 1029474 1318509 972638 1001284
13866 1001284 700247 838326 1254713 1031809 1077131 1108789 827425 1050121 965765 1055211
13856 1055211 1033457 1012728 1423250 1045851 686895 1161739 1291012 1216485 1254898 984158
13846 984158 1201850 1107773 1025198 1271884 1143818 992349 775689 1123688 904903 828127
13836 828127 867222 1056180 992971 703542 928127 951812 923297 1237646 970181 835579
13826 835579 1009325 926167 812288 1186299 839541 861363 973070 1005597 945261 905237
13816 905237 864643 880515 714878 903332 878851 946251 709483 382389 806719 906188
13806 906188 992081 869705 1209530 971288 713061 816686 802420 817276 1094783 923692
13796I23692l53825L25576j58332K13885j27987P8161l31702K97825r626k12810
13786F44857N20138n02650j32910J18414Q0451Q1820o8814p787R4405P3116k80378
13775F20662m2098K93683l23548K22701J49659m3476j2905j74906q6264Q3134
13765F86642K58174j18246o6717N8341J74720l33554R6767M1537k56833K96325
13755H37156j45334L72364C42204M57562l96955K07278J60165q0511J12243o6863
13745G35123k84983K77031j49697R5113J36870j12710n0373q8824k8630J02564
13735F31484j60579K25097q7052K8300k61054L80224j83471j70425L73746o1954
13725G14316q1880j50197R7696j12941M375p6526L81886l45183J64048O1955j6864
$$ plain form
13796 923692 569867 895443 737111 950996 823009 901170 569468 867293 857667 644857
13786 644857 1164995 662345 529435 647849 728300 810120 741306 733519 827924 901040 620662
13775 620662 578564 872247 548699 771400 921059 877583 864678 689772 603508 686642
13765 686642 944816 826570 759853 818194 992914 659360 756127 797664 540831 837156
13755 837156 691822 1064186 342204 799766 402811 610089 770254 689743 801986 735123
13745 735123 450140 727171 577474 672587 809457 696747 646374 557550 528920 631484
13735 631484 470905 696002 608950 637250 376196 756420 572949 402524 776270 714316
13725 714316 632436 482239 579935 466994 471369 394843 776729 431546 595594 657549 640685
13714F40685J9816n892j10417L46577k96771O9450k2979M3118P771j01693j30239
13703D59426M4014R2070j15323J18749l2849K6286j863L0189J75494B31824J62165
13692C93989J20587K69986l36738K06143j69554K44679j09391k00675J00184J38425
13682F57635j65919B38356J95792q8338J41783L28586C32931m104L59152o9681
13672F18298q0624L1041A04285L00867j78571N55128l27095n0959R5120j7674
13662D81101K8685J94083k07921q2123J02713q569k6524j58051K87258B69563
13651C79531O6063M03801l09278j09194j43374L2369K58010m1552r6508K44072
13641F83940k20286j08070J15062j400H9002N32895j88154K78697Q3611k64877
$$ plain form
13714 640685 660501 654609 544192 890769 593998 663448 640469 683587 691358 589665 459426
13703 459426 503440 595510 480187 598936 566087 592373 590510 620699 796193 231824 393989
13692 393989 514576 784562 447824 653967 484413 729092 619701 419026 519210 657635
13682 657635 491716 238356 434148 345810 487593 816179 332931 328827 687979 618298
13672 618298 537674 568715 104285 405152 226581 781709 454614 403655 498775 481101
13662 481101 509786 703869 495948 413825 516538 507969 481445 323394 610652 269563
13651 379531 445594 849395 540117 430923 287549 319918 577928 536376 439868 683940
13641 683940 463654 355584 470646 469246 89002 621897 433743 712440 796051 531174
13631E31174Q6946j69372M77534C53490K23521m3043j79068K6765J37765A55143
13620F45252C03576J56833K59436C50539l4158K98544j14518j43682q1515N66790
13610H42000B04029L11820B01120K16772j10968R731j51365J41528Q4931J81453
13600E73202m8663P8861k40152K08129p8589A16031Q8104O2817J44923A66663
13589B66794N09909B78212L54243M7733J2909C39683P3557p4763J49976B07212
13578B43275K56616m073B20370L7808k636J28144j38966j3173M61264k36841B06872
13566B61236j03082K40820P1545k5813A81886Q3269j09111J16259A03132K96426
13556C99558H0021M97128J7450B19018p47H9229j083P05105j88684B33554J78641
$$ plain form
13631 531174 618120 448748 926282 353490 577011 533968 354900 381665 519430 155143
13620 645252 303576 460409 719845 350539 316381 614925 500407 356725 275210 842000
13610 842000 204029 515849 201120 417892 306924 316655 165290 306818 391749 573202
13600 573202 524539 603400 363248 571377 492788 116031 204135 266952 411875 166663
13589 266794 776703 278212 632455 680188 693097 339683 413240 338477 488453 207212
13578 243275 499891 495818 220370 258178 255542 383686 244720 231547 692811 455970 206872
13566 261236 158154 398974 470519 444706 181886 265155 156044 272303 103132 399558
13556 399558 80021 577149 594599 219018 218271 89229 88146 793251 604567 233554 412195
13545D12195A38927J12028n0243G4702L67602I7552J81186K13917j41687D5256
13534E21915o5382A92155K47717K3250n1984K13776B30252R7068n5939F1744M21669
13523D83413A80768J68806l3848O8866j71704P4468p4996D3791K57276D4596N03324
13512E47920r8840L4009I4862L7456L9286N10024B87848j8844M1552q3577c5302
13500C13828r8230j2700J95873j68050j10701J45293O489j10684J92750J53088
13490E06956A07964L54250m3784j71360k7028J08550j55757J83108A60367L20876
13480D81243N330j59648A59115L0546Q8862K68407j19963j52548J8654p9524j7862
13469A95687L67880A40933f6932C50252j35508K9126A1333a9262D91003J43148
$$ plain form
13545 412195 138927 250955 200712 74702 442304 97552 278738 492655 350968 45256
13534 521915 456533 192155 439872 463122 411138 624914 230252 327320 271381 61744 483413
13523 483413 180768 349574 315726 384592 212888 287356 212360 43791 301067 44596 547920
13512 547920 449080 483089 94862 132318 171604 681628 287848 269004 310556 226979 -35302
13500 313828 215598 202898 398771 230721 120020 265313 271802 161118 353868 506956
13490 506956 107964 462214 418430 247070 220042 328592 172835 355943 160367 481243
13480 481243 486573 326925 159115 189661 278523 546930 426967 274419 293073 213549 195687
13469 195687 563567 140933 -66932 350252 214744 243870 11333 -19262 491003 634151
13459F34151k58934j13003L3837L8223m8512L01871g4179F0837J60446N8655j08328
13448A71610R8579K58041j85975A32922J73335M9999r030E6821L23676j34732
13438B45765j22140J25181L5405j21076m9281L49864A33962J18954P6794A05598
13427A86559L12901j69503A58408J6823k7053J36586n6943q053K95823b24270
13416C55129p9628J41349A49486E1861K63433I9149J89654q051F6338a26641A89573
13404D12213A56240N7125Q4899L01740b01843D4576j2814L90879I723d9766E59142
13392D57543j61840b07687A46421F8500B0798O0344O3947F7044K09363e2607D56006
13380C13856M83A11449O8244K00190j54575l2713I0929J39516I4361A7628K28694
$$ plain form
13459 634151 375217 262214 296051 334274 285762 587633 -74179 60837 221283 279938 171610
13448 171610 270189 528230 342255 132922 306257 356256 347226 56821 380497 245765
13438 245765 123625 248806 284211 163135 113854 463718 133962 252916 329710 105598
13427 186559 499460 329957 158408 175231 148178 284764 227821 219768 515591 -224270
13416 355129 275501 416850 149486 51861 315294 99149 288803 280752 66338 -126641 189573
13404 412213 156240 213365 298264 600004 -201843 44576 31762 422641 9723 -49766 559142
13392 457543 295703 -207687 146421 68500 20798 81142 145089 67044 276407 -52607 456006
13380 313856 314339 111449 179693 379883 225308 192595 90929 230445 94361 17628 246322
13369B46322d658C73897i7068a1143A71488E4583L11225L32010C37650j10564
13359B27086E1597K8680R890j5023b1261B22762J50854H7236L09706A34260K10579
13348C44839q3172q8564L5271J2803j8070P1535J70148A20860P4189K10566I5215
13336B39508A01634K15295F4704K39386K96572a08961B79025Q0798A35450K2711
13326A58161A9321J03078J09760J88107j33810p039q4140Q5890m0135N6164j23685
13315A73511J07773j4341A25482Q5037L93130A72297O9060a75207D04720A57404
13304B23916p7814o3361C0351K7297K85026I7704c8935B99803M3174K13963A30445
13292A82874a0257B45128J06687F207K15784K08315e8580I4038J79717D1705F574
$$ plain form
13369 246322 -4658 373897 -97068 -11143 171488 54583 365808 697818 337650 227086
13359 227086 51597 80277 90167 75144 -21261 222762 373616 87236 396942 134260 344839
13348 344839 261667 173103 208374 221177 203107 274642 444790 120860 195049 405615 95215
13336 239508 101634 316929 64704 304090 600662 -108961 279025 359823 135450 158161
13326 158161 19321 122399 232159 420266 286456 279417 195277 281167 241032 297196 173511
13315 173511 281284 266943 125482 210519 603649 172297 241357 -175207 404720 157404
13304 223916 146102 82741 30351 57648 342674 97704 -38935 299803 342977 556940 130445
13292 182874 -10257 245128 351815 6207 221991 430306 -58580 94038 273755 41705 6574
13280B54379J87243a96940G2241R4647N5988o9851D0973N3061L73182a36995E7644
13268c1304A20577D3015f853B46147p4978a154j06905q6712A21788c5475E5376
13256B67045e4592A00266k1111J56956Q5899K06029i2121C47154P9210A99336
13245A22992D8910e711A04174N8441D4544L0188a6729D489K15664n8407p0826
13234I0920K27369i9291B54817g3942B05219I9384a25328A8136J32121G4172a97743
13222A12975a8548A48399J12229J41752a7726B2020L28746j38613B7914O684J96851
13211B31449j05030P5905a13882C17437r4640f6717A14919O8324F2480a46509
13200A95501k2060k2787k5087b12274B58305L1506J24117A02882O6284r029F5632
$$ plain form
13280 254379 441622 -196940 72241 166888 222876 153025 40973 94034 467216 -136995 57644
13268 -31304 120577 43015 -6853 246147 171169 -1154 -108059 -194771 121788 -35475 55376
13256 267045 -54592 100266 79155 236111 322010 528039 -92121 347154 426364 199336
13245 122992 48910 -5711 104174 162615 44544 74732 -16729 4489 220153 161746 90920
13234 90920 318289 -99291 254817 -73942 205219 99384 -125328 18136 150257 74172 -197743
13222 112975 -18548 148399 260628 402380 -17726 22020 350766 212153 27914 34598 231449
13211 231449 126419 202324 -113882 317437 222797 -66717 114919 183243 62480 -146509
13200 195501 173441 150654 125567 -212274 258305 289811 413928 102882 169166 160137 65632
13188B12235p3410O054L15445j65897a8434n7842B6055a2357A20171L4953n3780
13177A01344R4498M2280N2719P2524A31085E0830J25099a03587I5737J81746a27221
13165a13486q8086D7714Q8036E6700J33506a27418F7029L48264H062a70332O8158
13154a02174G5873J85620l5739A6272J24699a19594A841N4695B2568J15903c7067
13142e235j05344I8540K25025F2220q786L0905K73103j71852K7935a41459C61854
13130h9491j50453D53432A34971F1576J70402d0274A67316J9653f6364C29384
13119H2755a28882A95687C4191J68771c1029F0817J22952C6878a61559J5468j6062
13108a62153e1095H1346i8834G6980E801O7926B2862M4178K134M4405e881m4956
$$ plain form
13188 212235 138825 144879 460324 294427 -18434 -76276 26055 -12357 120171 155124 101344
13177 101344 195842 238122 290841 363365 131085 50830 175929 -103587 95737 277483 -127221
13165 -113486 -201572 47714 135750 56700 190206 -127418 67029 415293 8062 -170332 -102174
13154 -102174 75873 261493 225754 16272 140971 -119594 1841 56536 22568 138471 -37067
13142 -5235 -110579 98540 323565 62220 53434 84339 357442 185590 213525 -141459 361854
13130 -89491 -239944 453432 134971 61576 231978 -40274 167316 186969 -66364 329384
13119 82755 -128882 195687 34191 202962 -31029 60817 183769 36878 -161559 -146091 -162153
13108 -162153 -51095 81346 -98834 76980 5801 73727 22862 67040 69174 113579 -5881 -50837
13096e0837a697k98639a25015A48543B9055b45605f1366j2489B21033I0270P8336
13085A68606n8861E0323J70599A2172a03400C58369j15281o2217E859d9063A20320
13073B59441j13710R6581D2206J03555J10217a03954C72204F8559J89031b59916
13062C79919j41981j14460a32194q6493C07259A7701b8772A17300a27222B87886
13051A42856O934D4646P6819a46565B82635A33091O7176k6664L01119j90400a07140
13039A57043K02604b7625H3358K0139D5743A8398M65570a186E42200c3205H4247
13027F5951K0068i389B7356R3497e9187j25432C81405q1940H0781R4309L5241
13016B10331G8556K74493c5436C2310d4164B62567e717E0241M81117k58458j03196
$$ plain form
13096 -50837 -1697 -300336 -125015 148543 29055 -245605 -61366 -73855 221033 90270 168606
13085 168606 109745 50323 220922 12172 -103400 358369 243088 180871 5859 -49063 120320
13073 259441 145731 242312 42206 145761 255978 -103954 372204 68559 257590 -259916
13062 379919 237938 123478 -132194 -218687 307259 17701 -28772 117300 -127222 287886
13051 142856 149790 44646 121465 -146565 282635 133091 200267 173603 474722 284322 -107140
13039 157043 359647 -27625 83358 103497 45743 18398 483968 -1186 542200 -33205 84247
13027 65951 86019 -9389 27356 120853 -59187 -184619 381405 299465 80781 175090 210331
13016 210331 78556 353049 -35436 32310 -44164 262567 -5717 50241 531358 272900 169704
13005A69704n7184D9850e4506A7625K97121R9136r6668n8901j03318a59801A12676
12993D8038K3064i2642A0091J41462i6272A12070h6799o0038n455d6447H7632
12981G2530A9919g0835A19398K5711F958a12785k9235A00017K40068r1563B3768
12969A08396O9170D0232b93017N3411A86597J79067A12996d5539H5069J98526
12959B83595L21177c9168A18839A2635J21822o620f5126p0969A16686a39993q54
12948a40847B69975E2949b4503k69752a23595e7328B05804G8158c73059e5173
12937a23431R808L4804J3342H1090J67172B491b28135A66951B1660a46336K9240
12926a17096m8465I4966h6103r459g788A32892c9333B34923b50462N9741d9100
$$ plain form
13005 169704 112520 49850 -54506 17625 314746 413882 317214 258313 154995 -159801 112676
12993 48038 71102 -92642 10091 151553 -96272 112070 -86799 -146837 -152292 -46447 87632
12981 72530 19919 -70835 119398 145109 6958 -112785 -142020 100017 340085 248522 23768
12969 108396 177566 40232 -293017 -239606 186597 365664 112996 -45539 85069 283595
12959 283595 604772 -39168 118839 12635 134457 127837 -65126 -136095 116686 -139993 -140847
12948 -140847 269975 52949 -24503 -294255 -123595 -57328 205804 78158 -373059 -55173
12937 -123431 -113623 -78819 -65477 81090 248262 2491 -228135 166951 21660 -146336 -117096
12926 -117096 -165561 94966 -86103 -95562 -7788 132892 -39333 234923 -250462 -190721 -49100
12914B90553o6055j11229A108d9004q619H8398b70115A82369I1135A8758b00300
12902E38227c8586H5890k8443b677r4282B31542j11965K7193J11544Q8618G3927
12890h4838M744B49365A23995m6762J50987Q913i9781A15192J35332j23274c88870
12878B45172B1083N5190l2048a60584A04806e5769E2093K95378A37580a24190
12867b22592a03104d7085J9314A26554c79420a86770B18691b8895A98709J71403
12857C70112a20516B8444m164L7189c29091j34845D18348C5628O8917K12544b16759
12845B87812c3930m0800C31026A46522F6356b6968B30010a87411B5373b37980
12834b17959E9231K50J45991a8238k9994A25356a10879d9604E1305h9791n2625
$$ plain form
12914 290553 224498 113269 1108 -49004 -57623 88398 -270115 182369 91135 18758 -200300
12902 538227 -38586 85890 57447 -2677 -96959 231542 119577 146770 258314 346932 73927
12890 -84838 -80094 249365 123995 77233 228220 237133 -99781 115192 250524 127250 -388870
12878 245172 21083 76273 44225 -160584 104806 -55769 52093 347471 137580 -124190
12867 -222592 -103104 -47085 -27771 126554 -379420 -186770 218691 -28895 198709 370112
12857 370112 -120516 28444 24280 61469 -329091 -463936 418348 35628 104545 317089 -216759
12845 287812 -33930 -74730 331026 146522 66356 -26968 230010 -187411 25373 -237980
12834 -217959 59231 59481 205472 -18238 -48232 125356 -110879 -49604 51305 -89791 -142416
12823a42416c1314A78794g1035D363J27053l4377a53450n9579C18288h2101G3979
12811A71604A6221c8792F2429a90295P4963B10916j00679M67896A53717i3760
12800A52689a94036A4867L06325b50888O7409C2199R0964M561a54340B22175h1889
12788a77098O6575C4735O7108L2787E1283a66301D742J44043c9264j39170A14930
12776A70486f3451K8604C8964J38295Q6599f3348j13028F6878a56777C91683a13093
12764b985D9566b50911B63571F6261J88151c16111A20409D0563Q0949b00739j0573
12753b11312A23510C8232K43488N3918I1608a86857I8714b8154B70545q9193h4800
12741d0153k79242C89530H9773Q4292l5179Q3485L1224K7647a87499A97693q4816
$$ plain form
12823 -142416 -31314 178794 -71035 4363 131416 97039 -153450 -213029 318288 -82101 73979
12811 171604 16221 -38792 62429 -190295 -115332 210916 110237 578133 153717 -93760
12800 152689 -194036 14867 321192 -250888 -183479 32199 123163 127724 -154340 222175 -81889
12788 -177098 -110523 34735 101843 134630 51283 -166301 4742 148785 -39264 -178434 114930
12776 170486 -63451 -34847 38964 177259 263858 -63348 -176376 66878 -156777 391683 -113093
12764 -2985 49566 -250911 263571 66261 254412 -316111 120409 40563 121512 -200739 -211312
12753 -211312 123510 38232 281720 335638 91608 -186857 98714 -28154 270545 181352 -84800
12741 -40153 -319395 389530 89773 174065 138886 222371 253595 281242 -187499 197693 112877
12730A12877J31661a23857B05417G0654a3403j23030G7632a6820j05356A21834
12719A10415a57331M4715c913k30639A4118Q2160C9605M20609j91504b7378R305
12708a8073A20301J10241f5020B13616K07961G8198O6815f606m84126a13803C344
12696A50998J3965A4215c2067j92605A14048D9573R4830B5413K30434g6690c3068
12684A85661c23472d4980A4103e7457k76407a66057B15990c5306f002B05177J74254
12673C79431A18412J13341a20219A57522a97517K3383C11650b5383B8671J29767
12663A58438J76300E5072n437N3406C6901e9064j23163A57291N6024f8267K6651
12652d1616j91998g4814B41123A05347J0760J57685n3275g8146A8559b42873G8042
$$ plain form
12730 112877 244538 -123857 205417 70654 -13403 -136433 77632 -16820 -122176 121834
12719 110415 -157331 -112616 -3913 -234552 14118 96278 39605 460214 268710 -27378 -18073
12708 -18073 120301 230542 -65020 213616 421577 78198 145013 -6606 -490732 -113803 3344
12696 150998 164963 14215 -32067 -224672 114048 49573 144403 25413 255847 -76690 -33068
12684 185661 -323472 -44980 14103 -57457 -333864 -166057 215990 -35306 -6002 205177 379431
12673 379431 118412 231753 -120219 157522 -197517 -174134 311650 -25383 28671 158438
12663 158438 334738 55072 49635 103041 36901 -59064 -182227 157291 213315 -68267 -41616
12652 -41616 -233614 -74814 241123 105347 116107 273792 220517 -78146 18559 -242873 78042
12640a1258D2852b06085A28454b04549f3243I1826e0779D4766M72119a80265B47891
12628E93413k16012C5896Q3362J65766H8887M4092a8074A07168a4377k650C5256
12616a55573b6016D40323A32420M3884e2625B45769l6862a3862r1718j55445A43423
12604A3234a88569e4193F6475O7383J7489K89609a61347C26922a17394B54569
12593c7190A88147J21165j15985e4995C41926c00262A66973J9468k5210n7579
12583A03652J23188J23909c43844c3255A54740b45980A41833M8973b02169B53757
12572c85815g4700F8369O2884Q6401o5169O6270A1847a08475B41908A9651J02126
12561A21777J0120b08773B30778K31868B08714E6820b9494B38479l8130c33304
$$ plain form
12640 -11258 42852 -206085 128454 -204549 -63243 91826 -50779 44766 516885 -180265 247891
12628 593413 377401 35896 119258 285024 88887 132979 -18074 107168 -14377 -17027 35256
12616 -155573 -26016 440323 132420 176304 -52625 245769 208907 -13862 -105580 -261025 143423
12604 13234 -188569 -54193 66475 133858 151347 440956 -161347 326922 -117394 254569
12593 -37190 188147 309312 193327 -54995 341926 -300262 166973 186441 161231 103652
12583 103652 226840 350749 -343844 -33255 154740 -245980 141833 190806 -202169 253757
12572 -385815 -74700 68369 131253 217654 152485 218755 11847 -108475 241908 19651 121777
12561 121777 131897 -208773 230778 462646 208714 56820 -29494 238479 200349 -333304
12550A97543k8365c17904J37761p4403C3558J43805J25615a72376B81892b69579
12539c22399J05361K9771e2229D4672a17389e8600A30129K0164k6160a87121B27341
12527a7842A84008J7468a5596A6333P4114b4060I9465h032H2752k6754o672K16309
12515B65635R2228e5686B82768C6594O0189h4690A44269e5085p104j04609h659
12503B52683A00392d445j92260A43534M6460k6874a85188k5542B86606b47610
12492e3170j4653j30336d0581A38916d04064h832n4964k42914A58383e9464a8933
12480B8443O0726e88n2473A05610b9603B21891D367e9656A12734l7519i1473K8864
12468f2609m4897B31854a5885A05053E44h656j60452A59824d85386I413R9297
$$ plain form
12550 197543 169178 -317904 -180143 -254546 33558 177363 302978 -172376 281892 -269579
12539 -322399 -217038 -187267 -52229 44672 -117389 -58600 130129 150293 124133 -187121 227341
12527 -17842 184008 201476 -15596 16333 90447 -24060 99465 -8032 82752 55998 49326 265635
12515 265635 357863 -55686 282768 36594 96783 -84690 144269 -55085 -62189 -166798 -8659
12503 252683 100392 -4445 -196705 143534 189994 163120 -185188 -210730 286606 -247610
12492 -53170 -67823 -198159 -40581 138916 -404064 -8832 -63796 -306710 158383 -59464 -18933
12480 28443 89169 -588 -53061 105610 -29603 221891 4367 -59656 112734 75215 -91473 -62609
12468 -62609 -107506 231854 -15885 105053 544 -8656 -169108 159824 -485386 9413 108710
12457A08710h5088j97175P8264P7866q0881a03011C5252J57610H8291a85596A52392
12445A69898g4953C01317g3864I0132J11654a25311G6706e2601B16786i0817j77115
12434b67932B27841l3859a36051A55824A2203g5703j7485l5623D5664E369L20860
12423C26229a50697j418C00439a75520A7150e5966F3631c28394A41682K4074b0038
12411I3605J5320a8811j61412k6428a7039j16228k5550b3319j92143E2322E990
12399A52083b80238A91487d7313k07221A08860c77079C3914R1424a49606B05976
12388A99444q3393J9937c02751C0819J25470D783O4427b09707A23903l8921c5595
12376b05628Q8256C25732b5426A3507O6406a11859A59136N1174a70082B20603
$$ plain form
12457 108710 -85088 -282263 -203999 -126133 -207014 -103011 35252 192862 88291 -185596 152392
12445 169898 -74953 301317 -73864 90132 201786 -125311 76706 -52601 216786 -90817 -267932
12434 -267932 227841 193982 -136051 155824 12203 -75703 -93188 -128811 45664 5369 326229
12423 326229 -150697 -152115 300439 -175520 17150 -55966 63631 -328394 141682 165756 -20038
12411 93605 108925 -18811 -180223 -206651 -17039 -133267 -158817 -23319 -215462 52322 5990
12399 152083 -280238 191487 -47313 -254534 108860 -377079 33914 125338 -149606 205976
12388 199444 116051 135988 -302751 30819 156289 4783 69210 -209707 123903 84982 -35595
12376 -205628 -117372 325732 -25426 13507 79913 -111859 159136 210310 -170082 220603
12365D9428L6293N1474j454i7655C04714q9128L6706B8897g3155j38236E6708
12353B92578E6339a69548B23683r842G8595a6690B39020A00466j6004i4325a8786
12341i0725A47221a85151A4471c3949j8945A59244R2633E350i7661j26928e3584
12329A2608J82225A3716a26788D4011a26901B15192a87229j58105B7881b98942
12318a39912C05314j32845a70510E6749a46888P0803D0607J07023o4735R7390
12308A80285j4165O4142b65981a03276l36217G0542l2582K87491A30049J26883
12298B56932E5333M0786a01430b0321A3454c25212A79756Q0743K41M0104c4199
12286a66457C40J59028a91121I5487J7382a4620o6642C64551j72058G1689J58112
$$ plain form
12365 49428 85721 137195 135741 -97655 304714 215586 252292 28897 -73155 -211391 56708
12353 292578 56339 -169548 223683 213841 78595 -16690 239020 100466 84462 -94325 -18786
12341 -90725 147221 -185151 14471 -33949 -52894 159244 251877 5350 -97661 -224589 -53584
12329 12608 194833 13716 -126788 44011 -126901 215192 -187229 -345334 27881 -298942
12318 -139912 305314 172469 -170510 56749 -146888 -76085 40607 147630 82895 180285
12308 180285 166120 230262 -265981 -103276 -439493 70542 37960 325451 130049 256932
12298 256932 55333 96119 -101430 -20321 13454 -325212 179756 260499 260740 300844 -34199
12286 -166457 340 159368 -191121 95487 112869 -14620 -81262 364551 192493 71689 229801
12275B29801m6793J11031j47009M8653D8281K23967a42853E10498a62007j0732
12265a72739G0181J1373k3136L52858a95296H3158h6402A85366C6645a62942A58077
12253a25087B15034B4908P7075h7559C26264j47487G4873a32061C0467L46955
12243C77422F2461a18313A00689a20906e7595B50834g2720A03945J39466b5119
12232A17281J09452a94032E57201b00423A0887c1580A07182J16747o8933J3671
12222A68667J69386j7051o4560G3086M7998J77780H1269L03278j92194J83966
12212C76319A19845c043A50516M0075o7896J37162I9232J21535K04229D0717c6609
12200I0111M47715B46719F3128K8187J23577H1516O3973O0267e1381A10917D604
$$ plain form
12275 229801 183008 294039 147030 195683 48281 272248 -142853 510498 -162007 -172739
12265 -172739 70181 81554 58418 411276 -195296 83158 -86402 185366 36645 -162942 158077
12253 -125087 215034 24908 101983 -87559 326264 178777 74873 -132061 30467 377422
12243 377422 62461 -118313 100689 -120906 -57595 250834 -72720 103945 243411 -25119
12232 117281 226733 -194032 557201 -200423 10887 -31580 107182 223929 154996 168667
12222 168667 338053 321002 256442 73086 121084 298864 81269 384547 192353 376319
12212 376319 119845 -3043 150516 190591 122695 259857 99232 220767 424996 40717 -36609
12200 90111 537826 246719 63128 91315 214892 81516 145489 205756 -51381 110917 4604
12188d9672A30799A1118M47024A59456C2398n119K09019I3221J19035h0031B66587
12176C16918a13758H5901N150K07868a24101D43542A59481a60060c5029B62173
12165b52346B09723A3806L08529d76966g5261b4828B07380h8361e588j9007E9112
12153a90425E9315J59270a12434J9122B09102m2954a57962G1474b85745B1237
12142B40702g1893b9311C10950j48330m6508b8027n2166D8869P3396a76809b1459
12130E4787B416L23852n5396G9113L2864c35281b8800A70585P6104F9514f2102
12118B2391b57093E0208d3197n1826m9381B1969b57979f1723A81065E5195M2588
12107I7783E73M55821E0404a36437B0842a85516k0813c9209k77507e9872j18937
$$ plain form
12188 -49672 130799 11118 458142 159456 32398 27279 236298 93221 212256 -80031 266587
12176 316918 -113758 85901 91051 298919 -124101 443542 159481 -160060 -35029 262173
12165 -252346 209723 13806 322335 -476966 -75261 -24828 207380 -88361 -5588 -24595 59112
12153 -190425 59315 218585 -112434 -93312 209102 166148 -157962 71474 -285745 21237
12142 240702 -71893 -29311 310950 162620 116112 -28027 -80193 48869 122265 -176809 -21459
12130 54787 2416 326268 270872 79113 111977 -335281 -28800 170585 246689 69514 -62102
12118 22391 -257093 50208 -43197 -95023 -144404 21969 -257979 -61723 181065 55195 97783
12107 97783 573 456394 50404 -136437 20842 -185516 -206329 -39209 -316716 -59872 -178809
12096a78809B53219d4341A33613j6516c47764B63015c2036j8114F4912N353k4303
12085D5962K17032A25153a43863o2518H7665C2546O6610A284a52222b9321I02499
12073A864978k06911D59743n0818N8044b65331L9105H0323a21593d0122G1301
12062D3157a0249B41490H9193a97809P2711L5021J9698C20558h0868J1853G5108
12050e2137l7416d00o3689C3176a5301k52571M9447g0856A36550C6270K4083a75120
12037a62851Q0062I4915c35085A31159c20831B72269a30599n4079A34377r465
12027A24912j4194c26143H5126J70452d2551q4214B11139c68700G0307l179L01721
12016C68849B4492N9866J77093N5660A0208d3485o2982k7819A08400a06902L6794
$$ plain form
12096 -178809 253219 -44341 133613 117097 -347764 263015 -32036 -50150 64912 70265 45962
12085 45962 262994 125153 -143863 -206381 87665 32546 99156 1284 -152222 -29321 902499
12073 1864978 1658067 459743 408925 466969 -265331 -226226 80323 -121593 -40122 71301
12062 43157 -10249 241490 89193 -197809 -125098 -90077 -70379 320558 -80868 -69015 75108
12050 -52137 -89553 -400 -64089 33176 -15301 -267872 -218425 -70856 136550 36270 60353 -175120
12037 -162851 -82789 94915 -335085 131159 -320831 272269 -130599 -184678 134377 124912
12027 124912 110718 -326143 85126 255578 -42551 -126765 211139 -368700 70307 67128 368849
12016 368849 24492 84358 261451 317111 10208 -43485 -106467 -134286 108400 -106902 -70108
12005g0108G1505N0877j5137H001N1274N0159f4146D692P3304M4056R7650b45585
11992C55510a95905M8794b5892q1488j85089a33109j06896j43464A01629h8657
11981b5221H5679g2136L2769A36876g2546G1041c23422I1951P8049F2368g3876
11969a73838C2128a21151F1080a69512E6495g1639J950j20891B28966O5259b10875
11957f2069j19712A30166a27851b4357o1151l0546J2057j8799d2224d736k46752
11946b51488F3365K89250a9053j50186I1743a05795A59459a24974k8274B06027
11935a60089j24688R7374k29408b8702J1996l2078A23708O3524q501F1205K07843
11924B69048a67385b9102A54835h1772k28824a1421A71253q1752A7728Q3889a22430
$$ plain form
12005 -70108 71505 122382 107245 8001 59275 109434 -64146 4692 77996 122052 219702 -245585
11992 355510 -195905 -147111 -25892 -107380 -292469 -133109 -240005 -383469 101629 -88657
11981 -25221 85679 -72136 -39367 136876 -72546 71041 -323422 91951 170000 62368 -73876
11969 -173838 32128 -121151 61080 -169512 56495 -71639 -69689 -190580 228966 294225 -210875
11957 -62069 -181781 130166 -127851 -24357 -85508 -116054 -103997 -122796 -42224 -4736 -251488
11946 -251488 63365 352615 -19053 -169239 91743 -105795 159459 -124974 -153248 206027
11935 -160089 -284777 -187403 -416811 -28702 -16706 -48784 123708 187232 178731 61205 269048
11924 269048 -167385 -29102 154835 -81772 -310596 -11421 171253 89501 17728 101617 -122430
11912B42188a21471B71081q2575c37271A91997a18B21434H7238b11641i9569A1558
11900A91348A2120a12535I6465f0873A21529a03866j2239A22304b70642G8740
11889a18096H7589c56642c8098A0197N8889J42872q1930m8915B1991J03744g4591
11877c22903G0085j0479a06592r3327e8637j03272g6113L0996E6913A0306i1603
11865a25984l1369O2111A73305a03438C0180a32760G8755b94008G9669b4851r0677
11854a15528F4397K0850b96429C9947P6761J10867p1279b7188A01750b30233A87012
11842B07975b58433F5097e3892C62339b98421J47886k2656A640K48860E4115b75397
11830a42089N7999o1364J4475O3683P824j9426a0279r8170j47062a25332j4272
$$ plain form
11912 242188 -121471 271081 188506 -337271 191997 -118 221434 87238 -211641 -99569 11558
11900 191348 12120 -112535 96465 -60873 121529 -103866 -116105 122304 -270642 78740
11889 -118096 87589 -356642 -38098 10197 69086 211958 130028 81113 21991 125735 -74591
11877 -322903 70085 59606 -106592 -199919 -58637 -161909 -76113 -45117 56913 10306 -91603
11865 -125984 -157353 -95242 173305 -103438 30180 -132760 78755 -294008 79669 -24851 -115528
11854 -115528 64397 85247 -296429 39947 116708 227575 156296 -27188 101750 -230233 187012
11842 207975 -258433 65097 -53892 362339 -298421 -150535 -173191 1640 250500 54115 -275397
11830 -142089 -84090 -145454 -130979 -67296 -59472 -78898 -10279 -108449 -255511 -125332 -139604
11819a39604B58314c04950P5752B20659a800j58575c3959M382j32529c3817F2948
11807G987J06475J37611d538j27830q1289A06951d55655D2987b74202A67909m8598
11796A19311b19588e082j0368l25362E7483K0390O6172b06562B4013a00757j20675
11785b21432d9506E7548A4873K53706A3236J80319C3509J35727J05475C167N6793
11774E9960k096J96132g2337m867B11391a6123O155A0497a72391f9498A10050
11762A63783b81226c0852A65492a3312A18877C5072i9023D04764A21359k8273
11752I3086J19581C2696N1314b85110c9292I660a47765j88832g5085m5723C83506
11740c30167A27723a19061A53445B8588A2399M8719K85686d1629j14580B1286
$$ plain form
11819 -139604 258314 -304950 -229198 220659 -1800 -160375 -33959 -29577 -162106 -33817 62948
11807 7987 114462 252073 -4538 -132368 -213657 106951 -455655 42987 -274202 167909 119311
11796 119311 -219588 -5082 -15450 -340812 57483 77873 144045 -206562 24013 -100757 -221432
11785 -221432 -49506 57548 14873 268579 13236 193555 33509 169236 274711 3167 59960
11774 59960 57864 253996 -72337 -77204 211391 -16123 -9968 10497 -172391 -69498 110050
11762 163783 -281226 -30852 165492 -13312 118877 35072 -99023 404764 121359 93086
11752 93086 212667 32696 84010 -285110 -39292 9660 -147765 -336597 -75085 -120808 383506
11740 -330167 127723 -119061 153445 28588 12399 61118 346804 -41629 -156209 21286
11729F8901j1333O2663L2524p6263e28r2736A84196c00419B8233J47585C5779
11717a79834r907c1993C06651a72622B66793A00993h7357D01703A22324a53295
11706C3749J98878a0084j08355q8596i0670A11184K42512j51511d2205F2626g8482
11694A04731b21656A45549i2237p0673H7621h1872J5434K8495a8894A45580a53039
11682C1010J97031I1280g6658E4246j4605O3535b37838g4659A36110o2721k1934
11671E1455c27793A02676K5128m4133a52045E2988L45365A66561a02584L5637
11661f6947k53552P3796e9197K2473B511b8755B0388O3343a26094K1134d792j99112
11649b03904F3982A77a34004A56247c0443A10176C9954a0482C19641A31081A7218
$$ plain form
11729 68901 57568 120231 152755 76492 -528 -93264 184196 -300419 28233 175818 35779
11717 -179834 -189741 -31993 306651 -172622 266793 100993 -87357 401703 122324 -153295
11706 33749 232627 -10084 -118439 -207035 -90670 111184 353696 202185 -42205 62626 -78482
11694 104731 -221656 145549 -92237 -162910 87621 -81872 -66438 -37943 -18894 145580 -153039
11682 31010 228041 91280 -76658 54246 39641 103176 -237838 -74659 136110 73389 51455
11671 51455 -327793 102676 127804 83671 -152045 52988 398353 166561 -102584 -66947
11661 -66947 -320499 -246703 -59197 -36724 2511 -28755 20388 83731 -126094 -104960 -4792 -203904
11649 -203904 63982 177 -134004 156247 -30443 110176 39954 -10482 319641 131081 17218
11637b843A60786p8333a49509D1222a07710B2768K6930L07144A74293P1317n1958
11626A93652a71935F2138L03230H3141B4435I6b46952I5858M5743D2045c05668
11614F3977a93764C00283c67156A19671Q6032a1790m0537j13401C156b06025F8984
11602C4664d953l1881A89333m5217M675h9207C64782h4944A52932J5189J85256
11591C53377a26004A76103B6423J20656b4684C54552L7902I3069j7462n904a6339
11579a06709B35965n7708C1088j4304c44101e6291k6800k5886H4388l9218J8798
11568F3968J07152E1076Q146K06548f0360C64586C4906M7339A577d2541p3887
11557a16428o103C00694a24561B08003E353J95312H2405M11708b50889B72678
$$ plain form
11637 -2843 160786 82453 -149509 41222 -107710 22768 49698 356842 174293 245610 193652
11626 193652 -171935 62138 365368 83141 24435 96 -246952 95858 141601 42045 -305668
11614 63977 -193764 300283 -367156 119671 205703 -11790 -52327 -165728 3156 -206025 68984
11602 34664 -4953 -36834 189333 144116 148791 -89207 364782 -84944 152932 168121 353377
11591 353377 -126004 176103 26423 147079 -24684 354552 392454 93069 75607 69703 -16339
11579 -106709 235965 178257 31088 16784 -344101 -56291 -83091 -108977 84388 45170 63968
11568 63968 171120 51076 59222 265770 -60360 364586 34906 82245 1577 -42541 -116428
11557 -116428 -122531 300694 -124561 208003 5353 200665 82405 494113 -250889 272678
11546B59307a64020k15569F9904L42904q9736j45925q8038l6790J90247j20634
11536A21932J20271b83822B30128a9887B04366C7816N8842O7766J77187A60006
11525b4544j34922C70787F2259J81586j11004l8686J7974N708a52547B63505E5619
11513C6589J4271J15157g0132B51910H5492e3524A55227J02589c0186B66726D1073
11501e1914A65127o6958l6567L35824e8461B59129r5432D1232d15186A16371N1987
11490A68358a6362m9842B75755q8655k2235J58153N7523b64792A10978J86450
11480B97428C3567L02033A23445a22028B18215n6471R7385r101n8805b15826A65456
11468A40809K43054k5744a54969A93959K5840i2221F9973M63077e8257A31361
$$ plain form
11546 259307 -164020 -379589 69904 412808 323072 177147 89109 52319 242566 121932
11536 121932 242203 -283822 230128 -19887 204366 37816 96658 164424 341611 160006
11525 -24544 -159466 370787 62259 243845 132841 94155 112129 117837 -152547 263505 55619
11513 36589 50860 166017 -70132 251910 85492 -53524 155227 257816 -30186 266726 41073
11501 -51914 165127 98169 61602 397426 -58461 259129 163697 41232 -415186 116371 168358
11490 168358 -16362 -66204 275755 187100 164865 323018 380541 -264792 110978 297428
11480 297428 33567 335600 123445 -122028 218215 161744 259129 250028 191223 -215826 165456
11468 140809 383863 358119 -154969 193959 219799 -92221 69973 533050 -58257 131361
11457I1981D3633b3795A97914l9198d9969I3500J92242K8567G327e1561A16174
11445A64715E5255K84041c11927b1807m5815G9396Q2063J70171A9648e241A63247
11433d5770A77263o2205p641A7769R2320a23396q2798A96900A8068L9482J5956
11422G3506M6073b55660H3370a37105B71593A7806Q5051N9660b71239F4152a30011
11410e4645o797E1068l370i9379a4636C04483A0925K26752a11496C75341B5282
11398A21938m9764a48336N1269m608k1250B09536H0911a20572E0758R3041L6563
11387A80362L6123a90489Q7626P31n2231B52534a04263b5096B77357A02536R6820
11376A99356Q9029r6207f8724K7828A96808e3471C713c06420a28193M9802B43066
$$ plain form
11457 91981 43633 -23795 197914 158716 -49969 93500 285742 314309 7327 -51561 116174
11445 164715 55255 339296 -311927 -21807 -67622 79396 161459 331630 19648 -5241 163247
11433 -45770 177263 115058 107417 17769 110089 -123396 -206194 196900 18068 57550 73506
11422 73506 119579 -255660 83370 -137105 271593 17806 102857 162517 -271239 64152 -130011
11410 -54645 -61442 51068 47698 -99379 -14636 304483 10925 237677 -111496 375341 25282
11398 121938 72174 -148336 -97067 -101675 -122925 209536 80911 -120572 50758 143799 180362
11387 180362 216485 -190489 -102863 -102132 -154363 252534 -104263 -25096 277357 102536 199356
11376 199356 288385 192178 -68724 -40896 196808 -53471 3713 -306420 -128193 -78391 243066
11364C18785J50263a06710D8845A7393O2307f456j21160A79142c35621A04108
11353D7154f2626A02696a22329A81399j4448A4677b35529E6239K5439d30604G1869
11341b00311A04175J41529a23483j41718a04635M8074I5801b05387C30867b25765
11330a11204M2459G9799a96096K0272a5637j2626j12988B84086A30817k1569O9567
11319A78815a57172f8373F7169J53965H9205j9622L7099D6200K96642f6232C46814
11307i5381b0661B64143e6474G3632e4118b2712k41551G2157H171f7275p7613
11296a44888A58953l4729B7098b25119H8835a36461B4870q306a29581F4538c62909
11284A7214M4772R3229b5215j45198Q804P0062q0514F0074M2586J43438D6363
$$ plain form
11364 318785 469048 -106710 48845 17393 79700 -6456 -127616 179142 -335621 104108
11353 47154 -62626 102696 -122329 181399 166951 14677 -235529 56239 81678 -430604 71869
11341 -200311 104175 245704 -123483 -265201 -104635 -56561 95801 -205387 330867 -225765
11330 -111204 -68745 79799 -196096 -175824 -15637 -28263 -141251 284086 130817 109248 178815
11319 178815 -157172 -68373 67169 221134 89205 69583 106682 46200 342842 -66232 346814
11307 -95381 -20661 264143 -56474 73632 -54118 -22712 -264263 72157 8171 -67275 -144888
11296 -144888 158953 124224 27098 -225119 88835 -136461 24870 16564 -129581 64538 -362909
11284 17214 61986 155215 -25215 -170413 -161609 -91547 -172061 60074 102660 246098 46363
11272F0465a31179p2336I5755d428A85937a55562f7015H2560a17050E9576A3771
11260A27942k7749b04929E3017g7159l30608J84046A56704c2382D3066J12179
11250A55245a29264F5146J14219j8716j4732c9085k19550o9139B38791a77241
11239d90733e7682Q193m24923J01057M6436a15336o0468K990m5472B93672b43816
11227F1107a14779n7627E6382a85617F7985a35483A9943d11713F8812d13644a77173
11215a63085q8100k0016c9444k21275B0037b01071Q8155a523B93332a1699k33073
11204b44772H5828k5162J49299L901b4306j00238j76484d2941A29293j5719k7433
11193H6141l6527D075a2469k97663L870a05426C6356K7754L1481B2942a99250
$$ plain form
11272 60465 -131179 -203515 95755 -4428 185937 -155562 -67015 82560 -117050 59576 13771
11260 127942 100193 -204929 53017 -77159 -407767 -223721 156704 -32382 43066 155245
11250 155245 -129264 65146 179365 160649 145917 -39085 -258635 -327774 238791 -177241
11239 -490733 -57682 -49489 -474412 -373355 -326919 -115336 -175804 -172814 -218286 293672 -243816
11227 61107 -114779 -172406 56382 -185617 67985 -135483 19943 -411713 68812 -413644 -177173
11215 -163085 -251185 -271201 -39444 -260719 20037 -201071 -112916 -1523 293332 -11699 -244772
11204 -244772 85828 60666 209965 213866 -24306 -124544 -301028 -42941 129293 113574 86141
11193 86141 49614 4075 -12469 -310132 -306262 -105426 36356 64110 95591 22942 -199250
11181F2813J02330D0325j1824J85703q6827a4458F589J97574p7229O0832a01108
11169B5593J04159B3785a3286E6844N871b20856e1994j22792H1635l5778J43491
11158A89348k2884b90185A98732A5027J36883a532j13434I0864m5019J11626B3802
11146A2621b15624J05495B29375C5322J55690a5300A41208K6353O6658K29258
11136D63477B19912C3763K36067E4046d3704J4729m3286B8789M2173L00862b15014
11124A19316o593B057c85251A01984a39808J3374c4956n4853o9286a762I0294
11112E968J813K14359A6360b68457A15710d3947I3411P5722F8442J77810n1902
11101A94350H7251b08604A9118L60906A14723L79519r0415j6829j93016L55359
$$ plain form
11181 62813 165143 40325 28501 214204 127377 -14458 6589 204163 126934 187766 -101108
11169 25593 129752 23785 -13286 56844 62715 -220856 -51994 -174786 81635 45857 189348
11158 189348 166464 -290185 198732 15027 151910 -1532 -114966 90864 45845 157471 23802
11146 12621 -215624 -110129 229375 35322 191012 -15300 141208 167561 234219 463477
11136 463477 219912 33763 269830 54046 -43704 -28975 -72261 28789 70962 371824 -215014
11124 119316 112723 2057 -385251 101984 -139808 -126434 -34956 -89809 -159095 -1762 90294
11112 5968 7781 222140 16360 -268457 115710 -43947 93411 169133 68442 246252 194350
11101 194350 87251 -208604 19118 380024 114723 494242 403827 386998 193982 549341
11091E49341H0949J98468p9391B4304a0512B68648K79360B52585F6481K023L62248
11080D30752j32917J65721e3732D11836A87180K41797r1422P3923J9627l7886
11070C93219K2838A12007J14933J84461R6266N6726j12458A07760K64463L7917
11060D10140K02216j18363M0942J09979k68810M59828l73335K76050k361j6686
11050G19600Q6019j45141M5773J13494m039j33432j68444L29454C68062P6922
11040D44984N68750k71954J35987j18815k25692k37784L16403N5877K80320j93511
11030G54565q0558j50202M09671k05444O1440J79362j26364l60578K54415l8329
11020F97978r843l15542L64326r1434P4251k84915M67081l18680j74901N24736
$$ plain form
11091 549341 80949 279417 200026 24304 -10512 268648 548008 252585 66481 68504 430752
11080 430752 297835 463556 -53732 411836 187180 428977 337555 411478 431105 393219
11070 393219 416057 112007 226940 411401 507667 564393 451935 107760 372223 410140
11060 410140 612356 493993 534935 644914 376104 835932 462597 738647 736286 719600
11050 719600 805619 660478 706251 819745 815706 682274 513830 843284 368062 444984
11040 444984 1013734 741780 877767 758952 533260 295476 611879 667756 948076 754565
11030 754565 674007 523805 933476 728032 789472 968834 842470 481892 736307 697978
11020 697978 688135 372593 736919 645485 719736 434821 901902 583222 408321 933057
11010I33057m66339J49528B21125K93710M35164k72972j22486J48004j53892J50248
11000F98901k62066L70327Q2j30781k29803K27281L8997j47715L25251C89157
10989F75042j24784K31971K26903j50511o4533K65859n3699N1900R122K11475
10979A278745R1731j64950J19497M20357M56742O1784M41230K48782n5386k01477
10969B697055o797n26551L60113j74407j85293l19399l00468J74624j18797J31530
10959A731610j46837K89785n544k64008j2758J8634j72629k39992l98444L21404
10949A121221k82580l05472K38426j36132k72501J87822j15152a4125k6757B35673
10938B8316b01768E83080p8004j52720i8055G6305a18359D3730P9575J33502K46591
$$ plain form
11010 933057 466718 616246 221125 514835 949999 677027 554541 702545 548653 698901
11000 698901 436835 807162 807244 676463 446660 673941 712938 565223 890474 389157
10989 675042 550258 782229 1009132 858621 794088 1059947 1006248 1058148 1067270 1278745
10979 1278745 1370476 1205526 1325023 1745380 2202122 2263906 2705136 2953918 2898532 2697055
10969 2697055 2690258 2163707 2523820 2349413 2164120 1844721 1544253 1718877 1600080 1731610
10959 1731610 1584773 1874558 1869014 1605006 1592248 1610882 1438253 1198261 799817 1121221
10949 1121221 838641 533169 771595 635463 362962 550784 435632 -14125 -40882 235673
10938 28316 -201768 583080 505076 352356 -98055 76305 -118359 43730 123305 256807 503398
10927E03398A12658d2858C2570J01153B1218A0196Q0698L0742J87016C9181a3589
10915A02504m3277J36949a82595c2830C11488a61452C8166b3997k27679a9053
10904A16601b4414R040A51143b3263A15372Q4598b6731A50465g7478C56140c31908
10892d1763B21487e0361I7875h4736k8314A17135m0723A9726a13894A5301J05097
10881A20398b31691A72671j6310b73808R2131A23805a41244C6474n24J7756h3832
10869I4848f9468L4290j91003A2415f8662j6464D13408I463i3549d2543k2834
10858f5377C24499A584a24054c6122j09160A97343m2992B1991a37776E1263K62092
10847C13355d36179B51480c98714H8693c1289A22989n940J34231b528l18090A12547
$$ plain form
10927 503398 112658 -42858 32570 133723 21218 10196 90894 121636 308652 39181 -13589
10915 102504 59227 196176 -182595 -32830 311488 -161452 38166 -23997 -251676 -19053
10904 116601 -24414 -15374 151143 -23263 115372 199970 -26731 150465 -77478 356140 -331908
10892 -41763 221487 -50361 97875 -84736 -113050 117135 76412 19726 -113894 15301 120398
10881 120398 -231691 172671 156361 -273808 -181677 123805 -141244 36474 35950 53706 -83832
10869 94848 -69468 -35178 -226181 12415 -68662 -85126 413408 9463 -93549 -42543 -65377
10858 -65377 324499 1584 -124054 -36122 -145282 197343 154351 21991 -137776 51263 313355
10847 313355 -436179 251480 -398714 88693 -31289 122989 117049 251280 -2528 -320618 112547
10835B00564d5336B5424O5785J07215m8452i2737M0741A84701J61428a26060A23015
10823b17455I8436a8391r5104q6521j18342C7907b37673j5897B2025J8656L60798
10812D01479F2840j0612K19557i0999j23338A26383b53704A14593b86979A02974
10801a43665j10964H0904h7467c8508B6550a89216f0725A0691J90178b565j7778
10790b0343k1554j49233A169R9198a58131m8271A87911h4775F0630B8445J49369
10779A77814F0646J09046m6513Q2915p7396i0051A026K709b04323M0157E8947
10767E5154K80820a42911j49044A08192r632N6279a99773A44142K6974D7124M6297
10756I3421h6441B05007c14134D4217J30542F8468a32930C16056r2983c05673
$$ plain form
10835 200564 -45336 25424 91209 198424 149972 -92737 -51996 184701 346129 -126060 123015
10823 -217455 98436 -18391 -113495 -200016 -318358 37907 -237673 -253570 22025 40681 401479
10812 401479 62840 52228 271785 -90999 -214337 126383 -253704 114593 -286979 102974
10801 -143665 -254629 80904 -87467 -38508 26550 -189216 -60725 10691 200869 -2565 -20343
10790 -20343 -41897 -191130 1169 100367 -158131 -206402 187911 -84775 60630 28445 177814
10779 177814 60646 169692 123179 206094 128698 -90051 1026 3735 -204323 -164166 58947
10767 55154 335974 -142911 -291955 108192 98560 154839 -199773 144142 171116 47124 93421
10756 93421 -86441 205007 -314134 44217 174759 68468 -132930 316056 223073 -305673
10745B1199e6845A24071J05457A6532J76186f8996j10882b319D9939f4585B36923
10733b3688B4944a24286M2076L1141j49099E871h0586c6820A41233b36826G2314
10721G3601K79948b49253B20978b64151B46937m4100b57702L2213A27454E2761
10710a36875A78913a55210A62503l6456b63099C043Q7655J36456F9641d31796
10699e6661r7322h31C80712b65167n9176A23255b88159K6859I7652B5423M1603
10688F7026f1470j2268A50601c39514a05373p3055B8472K33759a51864p6482j02309
10677c30655F8390c12255a45514B0093b37699m3998e2171j41260F096K30711a73765
10665g6194j50096D4882c12448L5043B3378a9086k88200J15239j18038a16463
$$ plain form
10745 21199 -56845 124071 229528 16532 192718 -68996 -179878 -2319 49939 -64585 236923
10733 -23688 24944 -124286 -82210 -51069 -200168 5871 -80586 -36820 141233 -236826 72314
10721 73601 353549 -249253 220978 -264151 246937 202837 -257702 -225489 127454 52761
10710 -136875 178913 -155210 162503 126047 -263099 3043 90698 227154 69641 -431796
10699 -56661 -153983 -831 380712 -265167 -324343 123255 -288159 -261300 97652 25423 67026
10688 67026 -61470 -73738 150601 -339514 -105373 -178428 28472 262231 -151864 -228346 -330655
10677 -330655 68390 -312255 -145514 20093 -237699 -281697 -52171 -193431 6096 236807 -173765
10665 -76194 -226290 44882 -312448 -277405 23378 -19086 -307286 -192047 -310085 -116463
10654D895i3485f546q5866j25805d6662k0640F0592K8543a93230P1078C7049J48162
10642A85211d01332a28280A13996j3311a99386m9868h9348K0779I2131b10895
10631c5828A51702a90615k03062a13132n8192a2709q7519p6500Q1611A12083a74463
10619e9433I5522g1743c3941A52278a16607k4638G7887J0505K85180g2846j7473
10608i0319Q983A45951a50470p8745k20256b23172A06600C3066J13475b4060j59240
10597a83300D22561A12957B638R2209M697l6163J36476c7485j61868A37740k9501
10586A08239c11392J54570o9250g1151a01n874j1724E3658G661b91025a12468
10574b387j48024f639o1007B01755c7772m3118C4129A2208b64921A0302a38030
$$ plain form
10654 4895 -93485 -6546 -92412 -218217 -46662 -67302 60592 89135 -193230 -122152 37049 185211
10642 185211 -401332 -128280 113996 100685 -199386 -249254 -89348 -68569 92131 -210895
10631 -35828 151702 -190615 -393677 -113132 -171324 -12709 -100228 -176728 -95117 112083 -174463
10619 -59433 95522 -71743 -33941 152278 -116607 -141245 77887 88392 373572 -72846 -90319
10608 -90319 -81336 145951 -150470 -229215 -449471 -223172 106600 33066 146541 -24060 -183300
10597 -183300 422561 112957 2638 94847 99544 63381 199857 -37485 -199353 137740 108239
10586 108239 -311392 -156822 -226072 -71151 -101 -5975 -17699 53658 7661 -291025 -112468
10574 -2387 -150411 -6639 -67646 201755 -37772 -80890 34129 12208 -264921 10302 -138030
10562C8952a30884L2426D7668N051L1413J70616A4957b15309k3996f0221j26320
10551a86541H1504a91247Q6781b4144l6907E5409c31063e7163K391k1619A8722
10539c827A55927d715l09126J04475A60696a48349j82994A85096c79826J18453
10529b61373A0362K79262c58943A18232k747q624D9999b45392J09018H3501L33610
10518D17111a50054f4769B98884i843C2202a24112d3977E15770g2161l3940B08505
10506a26647j54036J29771H1642f79p1625a2211B4749h937C0182P8271f0000j21368
10494a81368G5283a23664C21104a17854N7834i92o1552B998J26379B7503L03871
10483C31374k7980A37631L40150K2081k9471n3119J11667F1261J92773h6255B38193
$$ plain form
10562 38952 -130884 -98458 47668 52719 84132 254748 14957 -215309 -239305 -60221 -186541
10551 -186541 81504 -191247 -104466 -24144 -61051 55409 -331063 -57163 -54772 -76391 18722
10539 -3827 155927 -4715 -313841 -209366 160696 -148349 -331343 185096 -379826 -261373
10529 -261373 10362 289624 -358943 118232 115485 106861 49999 -245392 -136374 83501 417111
10518 417111 -150054 -64769 298884 -9843 32202 -124112 -43977 515770 -72161 -106101 208505
10506 -126647 -280683 -150912 81642 -679 -72304 -12211 24749 -8937 30182 108453 -60000 -181368
10494 -181368 75283 -123664 321104 -117854 -60020 -992 -62544 2998 129377 27503 331374
10483 331374 303394 137631 477781 499862 470391 417272 528939 61261 254034 -86255 238193
10471b10837G4999k0463g5541m6460d4693l9076C7951K05789l2251r6909b51302
10459I8321b43913N4502M6507L1665L2705G4751Q1392a26925l00376a16002o2461
10448a78463A36376E9314g2062j34203n0850J1634a4320A52863J06313c01682
10437a43267E3741k1957a44k1991q2628D90596A4139F247J81236H0286g5647E4190
10424A1297M4703a53211l1254G7125e23843J62562H5301a66961E8759B1975J22067
10413A44042g03D9925b7259C89445E5749e469A29838A9465N3092B9302J15807
10402A45109b48841A95110a75799E8198b44110B0450J40460A725a51283a9816
10391d0863A45206P3374E4954h5919j43859A3673J53747l8834J12037C1036K13052
$$ plain form
10471 -210837 74999 54536 -75541 -122001 -44693 -83769 37951 243740 211489 114580 -251302
10459 98321 -243913 -189411 -142904 -111239 -78534 74751 156143 -126925 -427301 -116002 -178463
10448 -178463 136376 59314 -72062 -206265 -257115 -245481 -14320 152863 259176 -301682
10437 -143267 53741 31784 -144 -22135 -104763 490596 14139 6247 187483 80286 -75647 54190
10424 11297 56000 -153211 -184465 77125 -523843 -361281 85301 -166961 58759 21975 144042
10413 144042 -703 49925 -27259 389445 55749 -5469 129838 19465 72557 29302 145109
10402 145109 -248841 195110 -175799 58198 -244110 20450 160910 1725 -151283 -19816
10391 -40863 145206 218580 54954 -85919 -229778 13673 167420 128586 240623 31036 244088
10380B44088J6047j04004l6739J08965l5896p8366K200M07651B27529q1165L58974
10369E05338A56576J22910K28167n211P3926A97391m1913K18021D2617J41056
10359A83673R566E2786O8661K70615i7644B17337m0454K41753j67708O27545k3546
10348H54927l58002L1873P3291k39623A56310J32694J28294M0126J29270A90970
10337A29530c5867D5727K01200a7116G0777K35063i7626J8066H7161a73911e8415
10325A29934a04095B37237R9968p040B4672d4984B02987p5815K59533G2827K72630
10314C45457a86963I4981K06962a14412Q751K7075D1641a33865C08636j21231
10304A87405A7702L6715g7023j20689C1954P2825b91212G9824c40224c4072J2167
$$ plain form
10380 244088 260135 156131 119392 228357 192461 114095 116295 523946 227529 146364 505338
10369 505338 156576 279486 507653 502442 576368 197391 155478 373499 42617 183673
10359 183673 193239 52786 121447 392062 -97644 217337 176883 418636 250928 878473 854927
10348 854927 496925 528798 602089 362466 156310 289004 417298 457424 586694 190970
10337 129530 -35867 45727 246927 -17116 70777 305840 -97626 -79560 87161 -173911 -58415
10325 129934 -104095 237237 337205 330165 24672 -44984 202987 127172 386705 72827 345457
10314 345457 -186963 94981 301943 -114412 -105661 -78586 41641 -133865 308636 187405
10304 187405 17702 54417 -77023 -197712 31954 104779 -291212 79824 -340224 -34072 -21905
10293b1905l03084f7527E400d1553D8706a2841A06307A1678a64750p1585a15877
10281B18750c38066a08359j31019H8329c28447H1220K35297a20410c6022q6556
10271a22578a6735r7183j02665i5581b7209k347l525j44359A44163O1349N2862
10260B58374Q6985k1672j18975L726K12393J39245a24469B189j088b11418a01398
10248a88621G2022J25800K0295h5526A56367a45211L5211l7662K5931A03938K9822
10237A33760i867l55147a75427m6146E7837J28244a14606p91A54016a43454c9839
10225e19477H4693r750A9114a02732G3081J23449a60237B10248b93857F6603a41851
10213b80783a13772E4797J29139n6280c59336I6011A7882Q6976c38180b3319p8148
$$ plain form
10293 -21905 -324989 -67527 5400 -41553 48706 -12841 106307 11678 -164750 -236335 -115877
10281 218750 -338066 -108359 -239378 88329 -328447 81220 316517 -120410 -36022 -122578
10271 -122578 -16735 -113918 -216583 -95581 -27209 -29556 -33081 -177440 144163 205512 258374
10260 258374 345359 323687 204712 208438 420831 560076 -124469 2189 1101 -211418 -101398
10248 -188621 72022 197822 218117 -85526 156367 -145211 -110000 -147662 -121731 103938 133760
10237 133760 -9867 -365014 -175427 -221573 57837 186081 -114606 -115397 154016 -143454 -39839
10225 -519477 84693 74943 19114 -102732 73081 196530 -160237 210248 -293857 66603 -141851
10213 -280783 -113772 54797 183936 127656 -359336 96011 17882 104858 -338180 -23319 -101467
10202a01467d6371m5742e689l04932C41756b86516A12415b2316j90997H9752J10836
10191B00588b18425L6615h0947I7940a19907D4389b05641J8108P7254k23072B87721
10179a53761E5555a62008d5364C4638b23623A84028D7286J18436l5348c1452j43927
10168a75379C5392a64409k7387O3445p7964H9783a70055A32868a85380h0623l63735
10157d44358A50013a31898H150K15763a00637r8831g2658B17025a09870j9693
10147a29563m392A49811N7448b55638P1841K6430b9733k24365j40868J70011M4802
10136a80153A31237c23572a5911j01770M9868l15567B12534a63329l1095j377
10126a95801g4256F7231c3641l8423j36014l63321B2445b2142D2313N0291C4124
$$ plain form
10202 -101467 -46371 -92113 -5689 -310621 341756 -286516 112415 -22316 -213313 89752 200588
10191 200588 -218425 -181810 -80947 97940 -119907 44389 -205641 -187533 -110279 -333351 287721
10179 -153761 55555 -162008 -45364 34638 -223623 184028 47286 165722 130374 -31452 -175379
10168 -175379 35392 -164409 -191796 -128351 -206315 89783 -170055 132868 -185380 -80623 -444358
10157 -444358 150013 -131898 8150 223913 -100637 -199468 -72658 217025 -109870 -129563
10147 -129563 -133955 149811 207259 -255638 -183797 -157367 -29733 -254098 -394966 -224955 -180153
10136 -180153 131237 -323572 -15911 -117681 -67813 -383380 212534 -163329 -194424 -195801
10126 -195801 -74256 67231 -33641 -72064 -208078 -571399 22445 -22142 42313 92604 34124
10114D0737b12562p7006M3707A81394A5000d1861j75216h2803B51680a60534M6852
10103a13682E6138A1642a08658E6792b29365P6464K4637j42037E4703Q0897a48380
10091D7949g7483l02352a83680A71041L7286f0291K0150C03797b37025K0890j91933
10080d08068A19743e78457D0205J08046a63754B72927D914J51793n568b8762r7951
10069a26713A9348P4497D5069F157g2805K5590A15402L428E7337a05720j34021
10058b39741D219L79575f807A30804c7070A75834b001A80248b2068j35786b2518
10046A55407L9203p4891K06146c76255B11288a66766A33486c24938I1182N7913
10036A49095a53747l7773o4673A74063c19770o3817C1434A0360b56379f573j45074
$$ plain form
10114 40737 -212562 -289568 -245861 181394 15000 -41861 -217077 -82803 251680 -160534 -113682
10103 -113682 56138 11642 -108658 56792 -229365 -152901 -128264 -270301 54703 135600 -148380
10091 47949 -77483 -379835 -183680 171041 208327 -60291 -40141 303797 -237025 -216135 -408068
10080 -408068 119743 -578457 40205 148251 -163754 272927 4914 156707 151139 -28762 -126713
10069 -126713 19348 93845 45069 6157 -72805 -47215 115402 118830 57337 -105720 -239741
10058 -239741 4219 383794 -6807 130804 -37070 175834 -2001 180248 -22068 -157854 -22518
10046 155407 194610 119719 325865 -376255 211288 -166766 133486 -324938 91182 149095
10036 149095 -153747 -191520 -256193 174063 -319770 -383587 31434 10360 -256379 -6573 -151647
10025a51647j5144d6668R307m21231J89181K8189h8198q1295F0015b05405E3823
10013A14718e50C26374a37927a1920B02958b14116q0824a31088i902K406A29752
10001h6716A46402a88589H3955c53202c3707q8543J3613N3591B0836a32410L7452
9990i4958M4178C56902f849n5900l1043B43710I6681c46135J19410f3486C56168
9978b73524R2736L3661k22082i4980j55287c6950j46690A40616a29949B4146a71238
9966B8543R6419b40727a13889j91102p7882a28853B98278a98761e4555B12689
9955a06254L3587I5329b12036c6198k95887C8463i6647l7585A24008d0938m9659
9944i0597A89710i307k02379l2766J0664b334A40652L8035d4988j08960A8246
$$ plain form
10025 -151647 -166791 -46668 -37361 -458592 -269411 -241222 -88198 -169493 60015 -205405 53823
10013 114718 -550 326374 -137927 -11920 202958 -214116 -294940 -131088 -9902 -7496 129752
10001 -86716 146402 -188589 83955 -353202 -33707 -122250 -108637 -55046 20836 -132410 -94958
9990 -94958 -50780 356902 -6849 -62749 -93792 243710 96681 -346135 -226725 -63486 356168
9978 -273524 -180788 -147127 -369209 -94980 -250267 -36950 -183640 140616 -129949 24146 -171238
9966 28543 124962 -240727 -113889 -304991 -382873 -128853 298278 -198761 -54555 212689
9955 -106254 -72667 95329 -212036 -36198 -332085 38463 -96647 -134232 124008 -40938 -90597
9944 -90597 189710 -9307 -211686 -244452 -233788 -2334 140652 178687 -44988 -153948 18246
9932b6417H4925K4964d62168a10350M9668n35332G2666c1744j77450B22206j09851
9921A12355a21723j36016J20143e9934j08285D1464a66177e9975a9138k47458
9911b66596P4109M0644A17959b78331j83903F5748K26234a92436j19215a21536
9900I7255N6095b14185C0616Q2111b9099p7217B21624f0669j65837Q4739n9147
9889b00914e5071j7013l09719a87376M6881C21853g7758j83413J01415j06532
9879b66288E9827a89193h4013L2778a6923j01564A88148c14287m4507B243O7806
9868G0049A9357b40065O4101l16559A31165C6451K31195c05866c0873j0389j07945
9857a49207O8079l0988A09053D7175j4983f8243I1824N1549L8231i2126k21966
$$ plain form
9932 -26417 84925 109889 -462168 -110350 -60682 -596014 72666 -31744 -209194 222206 112355
9921 112355 -121723 -257739 -137596 -59934 -168219 41464 -166177 -59975 -19138 -266596
9911 -266596 -192487 -151843 117959 -278331 -462234 65748 291982 -192436 -311651 -121536
9900 97255 153350 -214185 30616 112727 -29099 -106316 221624 -60669 -226506 -141767 -200914
9889 -200914 -55071 -72084 -381803 -187376 -140495 321853 -77758 -261171 -159756 -266288
9879 -266288 59827 -189193 -84013 -51235 -16923 -118487 188148 -314287 -358794 2243 70049
9868 70049 19357 -240065 -175964 -492523 131165 36451 267646 -305866 -30873 -41262 -149207
9857 -149207 -81128 -112116 109053 47175 32192 -68243 91824 143373 181604 -92126 -314092
9846c14092B85708a78406N0547j05330M4586o7381j79004J23361A14188d41202
9835D2434a80249d6402l7578a0842o6224A56979b50655K3551C356N2505Q4992
9824A40853a26995A89770A8325a36978b1823A19054f4984Q259k88799c8369k39770
9813b78139H3127J0943k7117J74382I6222d4600q1240b8204A87374k8245f1085
9801b27979B40342l4367h4830C12a51870K140b5039A96810J50620b29604Q1587
9790a48017k3268O6790D6621a11572F1162B4625a65359b3157C6592a96496M4799
9779a51697p4832i5380j17756P3282G0394B8308l705J89413d6840E2614b607p4562
9767g7169k9367F7201f4864E0892a08682B19045L0272c61645C78016B2521J36558
$$ plain form
9846 -314092 285708 -178406 -127859 -233189 -188603 -255984 -434988 -311627 114188 -441202
9835 42434 -180249 -46402 -83980 -10842 -77066 156979 -250655 -227104 3356 55861 140853
9824 140853 -126995 189770 18325 -136978 -21823 119054 -64984 -56725 -345524 -38369 -278139
9813 -278139 83127 94070 66953 241335 96222 -44600 -125840 -28204 187374 159129 -61085
9801 -227979 240342 205975 -84830 312 -151870 -149730 -25039 196810 347430 -229604 -148017
9790 -148017 -171285 -104495 46621 -111572 61162 24625 -165359 -23157 36592 -196496 -151697
9779 -151697 -226529 -95380 -213136 -139854 70394 28308 24603 214016 -46840 52614 -2607 -77169
9767 -77169 -106536 67201 -64864 50892 -108682 219045 249317 -361645 378016 22521 159079
9756A59079c1371k15403i0408q8435K7728b6799o6593p8827A39214a7912B9856
9744b00993a8321o3942n9809l35654a49192B01347J42805a47078M2380G1311k1785
9733D9526D482b40186D5520g6004k31881A53448b32992C25a15075k40029a35457
9721a17914b3138k43906c905k88573I993d54178J8251D06321a74794K6371N7040
9710i1383L1614A24876a44782m365r6584l3426H0496a55659A00230b47861J05715
9699a42146e2472H389J1713f2069k69026a41966j23407h1500B08183f4437B11900
9687d4855l4569j12920P3086B64470A15454J27161b05813e1374A42617c0581l3676
9676f4257b138A78040a81606k92617a67017f3696J6880E735R3723Q3027F980a90757
$$ plain form
9756 159079 -31371 -246774 -90408 -178843 -151115 -26799 -93392 -172219 139214 -17912 29856
9744 -200993 -18321 -82263 -142072 -477726 -149192 201347 344152 -147078 -104698 71311 49526
9733 49526 4482 -240186 45520 -76004 -307885 153448 -232992 325 -115075 -355104 -135457
9721 -117914 -23138 -267044 -3905 -292478 9993 -454178 -435927 406321 -174794 -148423 -91383
9710 -91383 -59769 124876 -144782 -149147 -245731 -279157 80496 -155659 100230 -247861 -142146
9699 -142146 -52472 8389 20102 -62069 -331095 -141966 -265373 -81500 208183 -64437 211900
9687 -44855 -79424 -192344 -119258 264470 115454 242615 -205813 -51374 142617 -30581 -64257
9676 -64257 -2138 178040 -181606 -474223 -167017 -63696 -46816 5735 99458 182485 6980 -190757
9663i6382j3700B15299E3021i0284l8021L0872m4293A03595b69506a01490k90217
9652c91707a64494b5575A65118a18976c5662A20256f326k26096j18807K9387a05850
9640a64873j4230l9039c8567B64413A29601a15879C4390c00937A9184N852a77027
9628d23348B6568b43404O7111B21d1985a2515k80429C20225f4220B01540c2643
9616B74982b60106a5539r3362j41146A01056a12056A56282b93544e5660I0337
9605h3616c6150D8824b43175O6736F8819b63494o2780m4636B34244a96962Q6730
9594a10232b8088D4907R7758g5309L4845E267e7503H1419a61271r849f8988j00039
9582a69027C1289J31286d63208A16451a35836G2984a9209r9164C9954A0122f3433
$$ plain form
9663 -96382 -110082 215299 53021 -90284 -128305 -97433 -141726 103595 -269506 -101490 -391707
9652 -391707 -164494 -25575 165118 -118976 -35662 120256 -6326 -232422 -351229 -321842 -105850
9640 -164873 -179103 -218142 -38567 264413 129601 -115879 34390 -300937 19184 25036 -177027
9628 -423348 26568 -243404 -176293 221 -41985 -12515 -292944 320225 -64220 201540 -32643
9616 274982 -260106 -15539 -108901 -250047 101056 -112056 156282 -293544 -55660 90337
9605 -83616 -36150 48824 -243175 -176439 68819 -263494 -326274 -370910 234244 -196962 -110232
9594 -110232 -28088 44907 142665 -75309 -40464 5267 -57503 81419 -161271 -171120 -68988 -169027
9582 -169027 31289 162575 -463208 116451 -135836 72984 -19209 -118373 39954 10122 -63433
9570b25270o97A41428M1775a5547j18171A30581a43699I318e7303B82809a09635
9558F7922a6886j37673k0888O5953A90526I053J80750p499K2601e7529B6193b25611
9545a21018a2476B22423d69654B14464b34119B5180O4732b12518I060a58841C541
9533h5239A08945c6655j47567B85926a32971j24709E7203a03955C7709c50785
9522c5872k9457k54765J31293c6521a7618A70606H0817b7811A9883a11688L0158
9511h1530j07442o1744A60861E6961d3323B2551b56227c6884D994K67481A21004
9499b6497A19090m1679a42115o289O7756A4608L1247e3247j23097B1976d01579
9487e39863H9867c3525l16048A38881j0378d0848a3201n0753I1641a02473D3870
$$ plain form
9570 -225270 -225967 141428 183203 -15547 -133718 130581 -143699 9318 -57303 282809 -109635
9558 67922 -16886 -154559 -175447 -109494 190526 9053 189803 182304 204905 -57529 26193 -225611
9545 -121018 -12476 222423 -469654 214464 -234119 25180 89912 -212518 9060 -158841 3541
9533 -85239 108945 -36655 -184222 285926 -132971 -257680 57203 -103955 37709 -350785
9522 -35872 -65329 -320094 -188801 -36521 -17618 170606 80817 -27811 19883 -111688 -81530
9511 -81530 -188972 -250716 160861 56961 -43323 22551 -256227 -36884 4994 272475 121004
9499 -26497 119090 77411 -142115 -148404 -80648 14608 45855 -53247 -176344 21976 -401579
9487 -539863 89867 -33525 -349573 138881 128503 -40848 -13201 -63954 91641 -102473 43870
9475c24501a43k62198B15688a28155d6634j82728g6380A07174c00127C2993b92009
9463b11500g7712J6407C03829F4597d05988a23103R603L9297A2938J34842c5747
9451h3157H4393f0449l80738h1948B93528i772A26231D2114O9092a11905c0146
9439b97316I592a26295A7782L8596c04092K74J46149g4635A5429K40206a25397
9427c96855E7547B6919Q7337g907l88786B46352A2067a51822B07434E7810b446
9415A6227a85648N6840C1511h474l82k9069j53301G9459b72954m1205a7373H3003
9402a04767A33889Q400A6780d2237o6403n0091j69546A80340b15518P0675o016
9391a50859B1686a78613a7197j62152p0459N8278D17480d9146r2205j50478f6067
$$ plain form
9475 -324501 -143 -262341 215688 -128155 -46634 -229362 -76380 107174 -300127 32993 -292009
9463 -211500 -77712 -61305 303829 64597 -405988 -123103 -113500 -74203 12938 147780 -35747
9451 -83157 84393 -60449 -441187 -81948 293528 -9772 126231 42114 111206 -111905 -30146
9439 -297316 9592 -126295 17782 56378 -304092 -303818 -157669 -74635 15429 255635 -125397
9427 -396855 57547 26919 114256 -7907 -396693 246352 12067 -151822 207434 57810 -2446
9415 16227 -185648 -128808 31511 -8474 -8856 -37925 -191226 79459 -272954 -314159 -17373 83003
9402 -104767 133889 142289 16780 -42237 -108640 -158731 -328277 180340 -215518 -144843 -150859
9391 -150859 21686 -178613 -17197 -179349 -249808 -191530 417480 -49146 -141351 -291829 -66067
9379i9846j29217a11631A18850M1045d7472p1449I3273c19675A21486O4479h2423
9367a22257A78188f7396k28774a16176P438A72675D4205a81618p7888f7455E9264
9355A76584c79247a05162E5842b89017a18401b5633C35270E1684d0408F1833a56046
9343G7819b47717j1496L5595k9669J18836A92119B8330a52318r5833A56678b71809
9331g3289A87291A9271a84015q3687c0998k55806g1844F114a0383k52786l29251
9320e92420D7908i2015c2579r9783j1215j28236A28178b38487d2000A82334a98838
9308B57757b52411H8458F621M9895a53674m4278A04012a41402B7070M03823A01091
9296a7456A37921c80853P9789e0844J3994A67678k018m6251b59624m3793a8437
$$ plain form
9379 -99846 -229063 -111631 118850 159895 -47472 -118921 93273 -319675 121486 185965 -82423
9367 -122257 178188 -67396 -296170 -116176 -108738 172675 44205 -181618 -259506 -67455 59264
9355 176584 -379247 -105162 55842 -289017 -118401 -25633 335270 51684 -40408 61833 -156046
9343 77819 -247717 -259213 -223618 -253287 -134451 192119 28330 -152318 -248151 156678 -271809
9331 -73289 187291 19271 -184015 -267702 -30998 -286804 -71844 6114 -10383 -263169 -592420
9320 -592420 47908 -92015 -32579 -132362 -143577 -271813 128178 -238487 -42000 182334 -198838
9308 257757 -252411 88458 6621 56516 -153674 -197952 104012 -141402 27070 430893 101091
9296 -17456 137921 -380853 -301064 -50844 -36850 167678 165660 119409 -259624 -303417 -18437
9284c32289a9247A57942k7775c17453H2187C604J6077b72669J7045r0603A21752
9272a18655K6585G7176J92046G7267c66616i9777k63007a60038F1674k7359a04548
9260d1210k46850a3478A17638b76879J30283e4338m1036a1859k56544F3321j096
9249F2225i9197d5286a3956A75703K8469b15713O9285j27735c4972j93679B7541
9237g9839H2455J09926J7934f9338G545c30005A80255E0465a17726J0275A3092
9225A07580L9315c9367j09253l33991K05609e127j22954d5551j77977J10138B43252
9213A03551e2546k38326A13181b87948E649K05708r7211g1981o9775A77295a42259
9201a10450j41446e039p0757b4239p849j0689k3275j76e633l34017J33544e895
$$ plain form
9284 -332289 -19247 157942 130167 -317453 82187 3604 19681 -272669 -255624 -346227 121752
9272 -118655 -92070 77176 269222 77267 -366616 -99777 -362784 -160038 61674 34315 -104548
9260 -41210 -288060 -13478 117638 -276879 -146596 -54338 -95374 -11859 -268403 63321 62225
9249 62225 -99197 -45286 -13956 175703 204172 -215713 -146428 -274163 -34972 -228651 27541
9237 -79839 82455 192381 210315 -69338 7545 -330005 180255 50465 -117726 -107451 13092
9225 107580 146895 -39367 -148620 -482611 -277002 -5127 -128081 -45551 -223528 -113390 243252
9213 103551 -52546 -290872 113181 -287948 5649 211357 114146 -71981 -141756 177295 -142259
9201 -110450 -251896 -5039 -75796 -24239 -32088 -42777 -66052 -66228 -5633 -339650 -206106 -5895
9188c7073k09732A30396d1878l05656d9122F229e3950j78069r952A00333l4924
9177F5409k4512K1971o787Q3976I742R037a48748k19300D254b00337g2936l2423
9165a05359e2172m38969a43473k16415A837M78489a68020l7579B30351c80515
9154C73460A05930f9709B91878a63726M6762d348j90101B10794a20198N4508J3247
9143e2443J6609j81733A06505h9610k20517a1359o3341a0569j15948D2286N6379
9132I8665a5402A69473F9287a65164j48098a48738B3489K2777P6096a33561J7047
9121a16514l82228A336J26029d3355B828K1206a89397j7358e3855j40604D6058
9109A29443b9666q5453A04176c7059H1883c21955f8096j51249B08383a59877j58378
$$ plain form
9188 -37073 -246805 130396 -41878 -347534 -49122 6229 -53950 -232019 -241971 100333 65409
9177 65409 40897 62868 56081 140057 9742 18779 -148748 -368048 4254 -200337 -72936 -105359
9165 -105359 -52172 -491141 -143473 -359888 1837 480326 -168020 -205599 230351 -380515
9154 373460 105930 -69709 291878 -163726 -116964 -4348 -194449 210794 -120198 -65690 -52443
9143 -52443 -35834 -217567 106505 -89610 -310127 -11359 -74700 -10569 -126517 42286 98665
9132 98665 -15402 169473 69287 -165164 -313262 -148738 23489 46266 122362 -133561 -116514
9121 -116514 -498742 1336 127365 -43355 2828 24034 -189397 -206755 -53855 -194459 46058
9109 129443 -29666 -115119 104176 -37059 81883 -321955 -68096 -219345 208383 -159877 -318255
9098c18255B05636r2507i154C54b58750E4038J24503h325A21511E8785a38460
9086E2484L2736j6664i5011E8014c30236O2906i6594a8803r9111j09150i2759
9074B4027Q7665c206j60755C36213A33694m3930j3764A4420c3102k58286B5748
9062a16069L0035A54167a12230k61844a202k66805P8017f3934J3365a8227l23899
9051c42126A16780a89677O31A26532a56610f1939j43061I7588L6322B7518L35185
9040C62703I5770a07834H0873e7177j38718g2799q2658I5144c1171I8907J7238
9029A16145h1885j33219a5908I8925L0141c57218J37788d6939j18428B2717c62065
9017B05328a34833k85714A69898A309J02158j4705h5850j03611A0593f595k90016
$$ plain form
9098 -318255 205636 113129 -9154 354 -258750 54038 178541 -8325 121511 58785 -138460
9086 52484 85220 68556 -95011 58014 -330236 -267330 -96594 -18803 -117914 -227064 -92759
9074 24027 111692 -3206 -163961 336213 133694 89764 76000 14420 -33102 -291388 25748
9062 -116069 -86034 154167 -112230 -374074 -1202 -268007 -189990 -63934 -50569 -18227 -342126
9051 -342126 116780 -189677 -189046 126532 -156610 -61939 -205000 97588 133910 27518 362703
9040 362703 95770 -107834 80873 -57177 -195895 -72799 -155457 95144 -31171 98907 116145
9029 116145 -81885 -215104 -15908 98925 129066 -357218 -219430 -46939 -165367 22717 -362065
9017 205328 -134833 -420547 169898 1309 103467 88762 -85850 -189461 10593 -6595 -296611
9006b96611A31495a37493N9894j18498A02768a71209k02407D4772a054A4019h5976
8994b76136a32519j91687B18819b20063Q5411o0005d0682n6572k47594a20151
8983b74755D49996F832N8631b89784A42356c9068A3009J88211f043C29833G5405
8971h4704b055H0985i2111k07685A68367b5500A26767a01082E2192a11914G0440
8959C592M6374b18370i039a08j36507B32099a10964B8214O7300b47222a12565
8947A55573b69423b9883m178j04164A26131b93511a05136A24238f1589r9092k18229
8936c78910c329B53061j12825J85152j18170D9657P466a29440A3633a39619B3756
8924A46905K75961J220364L515940L549985B881103I51568m68798d186D17300
$$ plain form
9006 -296611 131495 -137493 -77599 -196097 102768 -171209 -373616 44772 -1054 14019 -85976
8994 -276136 -132519 -324206 218819 -220063 -134652 -194657 -40682 -97254 -344848 -120151
8983 -274755 449996 6832 65463 -289784 142356 -39068 13009 201220 -6043 329833 75405
8971 -84704 -2055 80985 -92111 -299796 168367 -25500 126767 -101082 52192 -111914 70440
8959 3592 49966 -218370 -9039 -108 -136615 232099 -110964 28214 95514 -247222 -112565
8947 155573 -269423 -29883 -34061 -138225 126131 -293511 -105136 124238 -61589 -160681 -378910
8936 -378910 -3329 253061 140236 325388 207218 49657 57123 -129440 13633 -139619 23756
8924 146905 422866 1643230 5159170 8709155 2881103 951568 482770 -4186 417300
8914I2718b46182g295A85327h1603H6785a13440A41614R6395A5655K09374a78645
8902A6472b61562i1619I4123i3522o532A72850c87034N1428A4907O5739F909b9724
8889b3916j4065C5889a27559C85060o9768d9749d215m3291r0610E0402L90216
8878D40618H0994R4251A5644J63696O3827f8829k53023c2525k10468K5832J04012
8867a13149A1712J09335b38292A00817d8107j20953B53615d87600C803J27473
$$ plain form
8914 92718 -246182 -7295 185327 -81603 86785 -113440 141614 238009 15655 225029 -178645
8902 16472 -261562 -91619 94123 -93522 -100054 172850 -387034 -335606 14907 80646 6909 -29724
8889 -23916 -37981 35889 -127559 385060 315292 -49749 -4215 -47506 -138116 50402 440618
8878 440618 80994 175245 15644 179340 243167 -68829 -321852 -32525 -242993 -217161 -113149
8867 -113149 11712 121047 -238292 100817 -48107 -169060 253615 -487600 3803 131276
$$ [...]
##END NTUPLES=NMR SPECTRUM
##END=
