##TITLE=AC1425_HONAH13237_7765442_B5vj5BzvKL
##JCAMPDX= 6.0         $$ Bruker NMR JCAMP-DX V2.0
##DATA TYPE= NMR SPECTRUM
##DATA CLASS= NTUPLES
##ORIGIN= BRUKER
##OWNER= Administrator
$$ 1.72 TOPSPIN		Version 2.1
$$ 2013-04-11 21:49:24.615 -0700  Administrator@X
$$ Compression mode = diff/dup
##.OBSERVE FREQUENCY= 400.02188249412
##.OBSERVE NUCLEUS= ^1H
##.ACQUISITION MODE= SIMULTANEOUS (DQD)
##.ACQUISITION SCHEME= undefined
##.AVERAGES= 64
##.DIGITISER RES= 22
##SPECTROMETER/DATA SYSTEM= spect
##.PULSE SEQUENCE= noesygpps1d.comp
##.SOLVENT NAME= COFFEE_meoh
##.SHIFT REFERENCE= INTERNAL, COFFEE_meoh, 1, 14.96103
##AUDIT TRAIL= $$ (NUMBER, WHEN, WHO, WHERE, PROCESS, VERSION, WHAT)
$$ ##TITLE= Audit trail, TOPSPIN		Version 2.1
$$ ##JCAMPDX= 5.01
$$ ##ORIGIN= Bruker BioSpin GmbH
$$ ##OWNER= Administrator
$$ $$ E:\/data/COFFEE/nmr/AC1425_HONAH13237_7765442_B5vj5BzvKL/12/pdata/1/auditp.txt
$$ ##AUDIT TRAIL=  $$ (NUMBER, WHEN, WHO, WHERE, PROCESS, VERSION, WHAT)
(   1,<2013-04-11 21:49:18.725 -0700>,<Administrator>,<X>,<go>,<TOPSPIN 2.1>,
      <created by zg
	started at 2013-04-11 21:37:49.285 -0700,
	POWCHK enabled, PULCHK disabled,
       configuration hash MD5:
       33 CF 6A 21 5C D3 B9 40 6C 15 AA 8D 27 A2 4F 13
       data hash MD5: 64K
       8E 42 92 19 9F 35 26 B7 07 C5 A0 14 53 64 32 A9>)
(   2,<2013-04-11 21:49:21.865 -0700>,<Administrator>,<X>,<proc1d>,<TOPSPIN 2.1>,
      <Start of raw data processing
       efp LB = 0.3 FT_mod = 6 PKNL = 1 PHC0 = 0 PHC1 = 0 SI = 128K 
       data hash MD5: 128K
       D3 31 C9 92 41 2B EE 4E 63 AF 4A 19 5E 6D DC 07>)
(   3,<2013-04-11 21:49:22.881 -0700>,<Administrator>,<X>,<proc1d>,<TOPSPIN 2.1>,
      <pk PHC0 = -78.54675 PHC1 = 0 
       data hash MD5: 128K
       78 40 6A CA 70 45 93 DF DC 2F FB 02 81 62 A8 09>)
(   4,<2013-04-11 21:49:23.584 -0700>,<Administrator>,<X>,<proc1d>,<TOPSPIN 2.1>,
      <abs ABSG = 1 
       data hash MD5: 128K
       B5 DC A4 4F 3B 3C DA C8 72 8E 02 C9 6F A4 D0 5A>)
(   5,<2013-04-11 21:49:23.756 -0700>,<Administrator>,<X>,<proc1d>,<TOPSPIN 2.1>,
      <abs ABSG = 2 
       data hash MD5: 128K
       F3 A3 1B 0E 66 19 09 03 5A 84 73 5C 3C 9A 39 77>)
(   6,<2013-04-11 21:49:23.928 -0700>,<Administrator>,<X>,<proc1d>,<TOPSPIN 2.1>,
      <abs ABSG = 3 
       data hash MD5: 128K
       6A 38 5E 4A 6F E4 53 3E C4 B5 E3 F8 23 53 DC 5B>)
(   7,<2013-04-11 21:49:24.115 -0700>,<Administrator>,<X>,<proc1d>,<TOPSPIN 2.1>,
      <abs ABSG = 4 
       data hash MD5: 128K
       A5 CD BC 70 7A 2B D4 F9 3A E3 19 12 24 9B 19 EA>)
(   8,<2013-04-11 21:49:24.287 -0700>,<Administrator>,<X>,<proc1d>,<TOPSPIN 2.1>,
      <abs ABSG = 5 
       data hash MD5: 128K
       59 57 6F 7A 9C DE D1 EA 7A B3 52 CF 04 67 70 3E>)
$$ ##END=
$$ 
$$ $$ hash MD5
$$ $$ F4 50 2C B9 70 2A 48 B3 74 15 22 B9 68 0D D9 3E
##$RELAX= 
##$RELAX= 
##$RELAX= 
##$RELAX= 
##$RELAX= 
##$RELAX= 
##$RELAX= 
##$RELAX= 
$$ Bruker specific parameters
$$ --------------------------
##$DU= <E:\>
##$EXPNO= 12
$$ [...]
##$TP07= 0
##$TPNAME0= <>
##$TPNAME1= <>
##$TPNAME2= <>
##$TPNAME3= <>
##$TPNAME4= <>
##$TPNAME5= <>
##$TPNAME6= <>
##$TPNAME7= <>
##$TPOAL= (0..7)
0.5 0.5 0.5 0.5 0.5 0.5 0.5 0.5
##$TPOFFS= (0..7)
0 0 0 0 0 0 0 0
##$TUNHIN= 0
##$TUNHOUT= 0
##$TUNXOUT= 0
##$USERA1= <user>
##$USERA2= <user>
##$USERA3= <user>
##$USERA4= <user>
##$USERA5= <user>
##$V9= 5
##$VALIST= <valist>
##$VCLIST= <CCCCCCCCCCCCCCC>
##$VD= 0
##$VDLIST= <DDDDDDDDDDDDDDD>
##$VPLIST= <PPPPPPPPPPPPPPP>
##$VTLIST= <TTTTTTTTTTTTTTT>
##$WBST= 2048
##$WBSW= 25
##$XGAIN= (0..3)
0 0 0 0
##$XL= 0
##$YL= 0
##$YMAX_a= 6044555
##$YMIN_a= -13397769
##$ZGOPTNS= <>
##$ZL1= 120
##$ZL2= 120
##$ZL3= 120
##$ZL4= 120
##$ABSF1= 14.96103
##$ABSF2= -5.597152
##$ABSG= 5
##$ABSL= 3
##$ALPHA= 0
##$AQORDER= 0
##$ASSFAC= 0
##$ASSFACI= 0
##$ASSFACX= 0
##$ASSWID= 0
##$AUNMP= <proc_prof1d_extract.lims>
##$AXLEFT= 0
##$AXNAME= <>
##$AXNUC= <1H>
##$AXRIGHT= 0
##$AXTYPE= 0
##$AXUNIT= <>
##$AZFE= 0.1
##$AZFW= 0.1
##$BCFW= 0
##$BC_mod= 0
##$BYTORDP= 0
##$COROFFS= 0
##$CY= 15
##$DATMOD= 1
##$DC= 0
##$DFILT= <>
##$DTYPP= 0
##$F1P= 0
##$F2P= 0
##$FCOR= 0.5
##$FTSIZE= 131072
##$FT_mod= 6
##$GAMMA= 0
##$GB= 0
##$INTBC= 1
##$INTSCL= 1
##$ISEN= 128
##$LB= 0.3
##$LEV0= 0
##$LPBIN= 0
##$MAXI= 10000
##$MC2= 0
##$MEAN= 0
##$ME_mod= 0
##$MI= 0
##$NCOEF= 0
##$NC_proc= -2
##$NLEV= 6
##$NOISF1= 0
##$NOISF2= 0
##$NSP= 0
##$NTH_PI= 0
##$NZP= 0
##$OFFSET= 14.96103
##$PC= 1
##$PHC0= -78.54675
##$PHC1= 0
##$PH_mod= 1
##$PKNL= yes
##$PPARMOD= 0
##$PPDIAG= 0
##$PPIPTYP= 0
##$PPMPNUM= 2147483647
##$PPRESOL= 1
##$PSCAL= 4
##$PSIGN= 0
##$PYNMP= <proc.py>
##$REVERSE= no
##$SF= 400.020009623499
##$SI= 131072
##$SIGF1= 0
##$SIGF2= 0
##$SINO= 400
##$SIOLD= 131072
##$SPECTYP= <>
##$SREGLST= <1H.CDCl3>
##$SSB= 0
##$STSI= 131072
##$STSR= 0
##$SW_p= 8223.68421052631
##$SYMM= 0
##$S_DEV= 0
##$TDeff= 65536
##$TDoff= 0
##$TI= <>
##$TILT= no
##$TM1= 0
##$TM2= 0
##$TOPLEV= 0
##$USERP1= <user>
##$USERP2= <user>
##$USERP3= <user>
##$USERP4= <user>
##$USERP5= <user>
##$WDW= 1
##$XDIM= 131072
##$YMAX_p= 430519732
##$YMIN_p= -9915
##$CURPLOT= <Network HP LaserJet P1505>
##$CURPRIN= <$Network HP LaserJet P1505>
##$DFORMAT= <normdp>
##$LAYOUT= <+/1D_H.xwp>
##$LFORMAT= <normlp>
##$PFORMAT= <normpl>
##$SURQMSG= 1
$$ End of Bruker specific parameters
$$ ---------------------------------
##NTUPLES= NMR SPECTRUM
##VAR_NAME=  FREQUENCY,     SPECTRUM/REAL,   SPECTRUM/IMAG
##SYMBOL=    X,             R,               I
##VAR_TYPE=  INDEPENDENT,   DEPENDENT,       DEPENDENT
##VAR_FORM=  AFFN,          ASDF,            ASDF
##VAR_DIM=   131072,        131072,          131072
##UNITS=     HZ,            ARBITRARY UNITS, ARBITRARY UNITS
##FACTOR=    0.0627417313425164, 1,          1
##FIRST=     8223.62146879497, 1497,         -59379
##LAST=      0,             2924,            -59414
##MIN=       0,             -9915,           0
##MAX=       8223.62146879497, 430519732,    0
$$ Real data points
##PAGE= N=1
##DATA TABLE= (X++(R..R)), XYDATA
$$ [...]
63865G45219J8576K0104K1321K2318K3356K4512K5169K4423K2325K0113J8741
63854I86177J7765J6152J3605J0478O863K638j776n493q214j0565j3252j6255
63842I98123j9069k1448k3570k5608k7378k8539k9039k9277k9713l0419l0988
63831G03075l0828k9571k7394k5041k3293k2266k1398k0241j8925j7650j6157
63820D50311j4158j1961j0144q868q030p737q024q297p787o545n272m293l442
63807C45753k772k578k634k363j838j749k194k413k052j773k147k758k936k679
63793C12867k369k115j944k051k442k739k763k758k802k584k137k032k412k579
63779B79140k108j620j757k075j760r58m87o14q86r54q61p21o74r48j464j673
$$ plain form
63865 745219 763795 783899 805220 827538 850894 875406 900575 924998 947323 967436 986177
63854 986177 1003942 1020094 1033699 1044177 1051040 1053678 1051902 1046409 1038195 1027630 1014378 998123
63842 998123 979054 957606 934036 908428 881050 852511 823472 794195 764482 734063 703075
63831 703075 672247 642676 615282 590241 566948 544682 523284 503043 484118 466468 450311
63820 450311 436153 424192 414048 405180 397150 389413 381389 373092 365305 358760 353488 349195 345753
63807 345753 342981 340403 337769 335406 333568 331819 329625 327212 325160 323387 321240 318482 315546 312867
63793 312867 310498 308383 306439 304388 301946 299207 296444 293686 290884 288300 286163 284131 281719 279140
63779 279140 277032 275412 273655 271580 269820 268862 268375 267761 266875 265921 265060 264339 263665 262717 261253 259580
63763B59580j255o67m41l58R7P74J058P15J5p47j269j124k73N79P34M27L55O18
63745B58818P64O52N82O82Q91J381K355L443L930L615K921K269J802J684K054
63730B87843K722L286L575L556L156K541K320K850L573L704L400L562M505N479
63716C36072N625M833L612K557J982J715J221K27q72j539j812k085k430k605k505
63701C43996k176j579q07k82k03n7P70K099L179L621L573L231K806K621K641K202
63685C65635R21m15o86J5N58L83L7N4K82M32N83Q24J019J096J126J062Q65Q00
63667C74591J100J499J604J548J581J319K59j148j942k104k540l528m291m295
63653C63653l999l924l947l903m023m306m192l382k296j410p29k69k38l65J53
$$ plain form
63763 259580 258325 257658 257217 256859 256956 257730 258788 259503 259518 258771 257502 256378 256105 256684 257418 257845 258200 258818
63745 258818 259582 260234 260816 261498 262389 263770 266125 269568 273498 277113 280034 282303 284105 285789 287843
63730 287843 290565 293851 297426 300982 304138 306679 308999 311849 315422 319126 322526 326088 330593 336072
63716 336072 341697 346530 350142 352699 354681 356396 357617 357844 356972 355433 353621 351536 349106 346501 343996
63701 343996 341820 340241 339434 339152 338949 338892 339662 341761 344940 348561 352134 355365 358171 360792 363433 365635
63685 365635 366556 366141 365455 365470 366028 366411 366448 366502 366784 367216 367799 368623 369642 370738 371864 372926 373791 374591
63667 374591 375691 377190 378794 380342 381923 383242 383501 382353 380411 378307 375767 372239 367948 363653
63653 363653 359654 355730 351783 347880 343857 339551 335359 331977 329681 328271 327542 327273 327035 326670 326823
63638C26823J517K788L145K985L153L661L946L944M109M575N030N351N757O349
63624C83133O918P334P816Q692J0061J1661J3090J4230J5348J6656J7990J9230
63612E32159K0743K2951K5516K7636K9135L0621L2533L4555L6102L6743L6025
63601H64719L3519K9305K3877J7530J0445L433k230o038q615j0546j1592j1514
63589I32293j0950j0859j1663j3341j5916j9256k2813k6017k8572l0112l0123
63578G12671k8674k6604k4466k1831j8224j4254j1091r058p422n462l162r36Q57
63565E42344K122L059L988M995N892O603P250P773P883P700Q016R550J2198J5257
63551F44630J8131K0684K3232K6391L0458L4809L8365M0909M3297M5978M7730
$$ plain form
63638 326823 328340 331128 334273 337258 340411 344072 348018 351962 356071 360646 365676 371027 376784 383133
63624 383133 390051 397385 405201 413893 423954 435615 448705 462935 478283 494939 512929 532159
63612 532159 552902 575853 601369 629005 658140 688761 721294 755849 791951 828694 864719
63601 864719 898238 927543 951420 968950 979395 982828 980598 974560 965945 955399 943807 932293
63589 932293 921343 910484 898821 885480 869564 850308 827495 801478 772906 742794 712671
63578 712671 683997 657393 632927 611096 592872 578618 567527 558469 551047 545585 542423 541487 542344
63565 542344 544466 547525 551513 556508 562400 569003 576253 584026 591909 599609 607625 617175 629373 644630
63551 644630 662761 683445 706677 733068 763526 798335 836700 877609 920906 966884 1014614
63540A014614M6317M0203K9566J6281L190p204j3918j7299j7873j6110j3285j1267
63528A053215j0834j1114j1466j2926j6776k2405k7810l1863l4953l7530l9192
63517G96346l9350l8036l5780l3205l0774k8530k6122k3347k0520j7986j5735
63506D86961j3792j2527j1973j1293r694p525n768m762m158l764l645l563l208
63493C91289k756k540k275j510n90l07o28p08j44P24J662K808L889M229L774L248
63477D00165L032K751K301K288K968L560L323K586J974J192n15k937m838n366
63463D12484m884m326m135m045l633k831j922j191o61k07J95N35J002J816K827
63448C91024L582L881M053M557N499O688P936R150J0273J1298J2283J3349J4684
$$ plain form
63540 1014614 1060931 1101134 1130700 1146981 1150171 1142967 1129049 1111750 1093877 1077767 1064482 1053215
63528 1053215 1042381 1031267 1019801 1006875 990099 967694 939884 908021 873068 835538 796346
63517 796346 756996 718960 683180 649975 619201 590671 564549 541202 520682 502696 486961
63506 486961 473169 460642 448669 437376 427682 420157 414389 409627 405469 401705 398060 394497 391289
63493 391289 388533 385993 383718 382208 381618 381311 380683 379975 379831 380555 382217 385025 388914 393143 396917 400165
63477 400165 403197 405948 408249 410537 413505 417065 420388 422974 424948 426140 425625 422688 417850 412484
63463 412484 407600 403274 399139 395094 391461 388630 386708 385517 384856 384649 384844 385379 386381 388197 391024
63448 391024 394606 398487 402540 407097 412596 419284 427220 436370 446643 457941 470224 483573 498257
63435D98257J6559J9158K2428K6213L0351L4397L7232L7377L3983K7659K0307
63424H03921J4062J0135Q411Q163R148J1752J6045K1128K5938L0313L4754L9136
63412A032906M2268M2846M0432L5417K8471K0302J1697L445l747r267j2786j4510
63400A217474j5093j5231j5410j6045j7517j9984k3327k7374l1945l6499m0007
63389I59042m1535m0967l9019l6546l4054l1710k9528k7218k4226k0317j6121
63378F17801j2631j0140q087o057m273k764q08K019M822O434P224Q653J1110J3499
63364F26802J5145J6770J9014K1294K3044K4940K7684L0572L2640L4551L7664
63353I10120M1509M3836M3424M1285L8620L4858K8655J9996J0433J672n350j0308
$$ plain form
63435 498257 514816 533974 556402 582615 612966 647363 684595 721972 755955 783614 803921
63424 803921 817983 828118 836529 844692 853840 865592 881637 902765 928703 959016 993770 1032906
63412 1032906 1075174 1118020 1158452 1193869 1222340 1242642 1254339 1257784 1254037 1244770 1231984 1217474
63400 1217474 1202381 1187150 1171740 1155695 1138178 1118194 1094867 1067493 1035548 999049 959042
63389 959042 917507 876540 837521 800975 766921 735211 705683 678465 654239 633922 617801
63378 617801 605170 595030 586943 580886 576613 573849 573041 575060 579882 586316 593540 602193 613303 626802
63364 626802 641947 658717 677731 699025 722069 747009 774693 805265 837905 872456 910120
63353 910120 951629 995465 1038889 1080174 1118794 1153652 1182307 1202303 1212736 1214408 1209058 1198750
63341A198750j3214j4404j4526j4350j4560j5512j7163j9384k2294k6019l0154
63330I97170l3770l6080l6959l6776l5971l4731l2827k9820k5713k1255j7300
63319F55968j3831j0077n696j686O9j795o942j3358j8703k1840k2998k2659k0909
63306D95543j8047j4982j2438j0276q256o803o248n809m448k482j241j190j544
63293D01779j787k351l480m514m891m960n192n301m770l708k596j643r20o99j080
63278C53887j634j878j855j767j407m94O22J183Q87J92k08N4Q80J847K466K543
63262C55318K287J975J637J209Q16P25J030J576K118K547K946L456M095M780N483
63247C91998O115O296N717M898N036O599Q555R655J0087J1011J2752J4439J5456
$$ plain form
63341 1198750 1185536 1171132 1156606 1142256 1127696 1112184 1095021 1075637 1053343 1027324 997170
63330 997170 963400 927320 890361 853585 817614 782883 750056 720236 694523 673268 655968
63319 655968 642137 632060 626364 624678 624747 622952 616010 602652 583949 562109 539111 516452 495543
63306 495543 477496 462514 450076 439800 431544 424741 418493 412684 408236 405754 404513 403323 401779
63293 401779 399992 397641 394161 389647 384756 379796 374604 369303 364533 360825 358229 356586 355666 354967 353887
63278 353887 352253 350375 348520 346753 345346 344852 345474 346657 347544 347736 347528 347582 348462 350309 352775 355318
63262 355318 357605 359580 361217 362426 363242 363967 364997 366573 368691 371238 374184 377640 381735 386515 391998
63247 391998 398113 404409 410126 415024 420060 426659 435214 444869 454956 465967 478719 493158 508614
63234E08614J6140J6909J7676J8484J9750K1291K2047K1433K0326J9909K0134
63223G22713K0180J9882J9763J9977K0147K0259K0808K1860K2708K2683K1845
63212I52825K0591J8993J6811J3904J0373O391K069k520p254j1823j5812j8997
63200I85551k1525k3589k5036k5458k4692k3010k0840j8467j5982j3346j0401
63189G63205p031l392J18L251O159R087J1953J4463J6688J9069K1689K3854K4844
63176I03957K4904K4940K5283K5346K4623K3476K2589K2142K1805K1116J9515
63165A159696J6583J2624Q594M907Q51m288j0061j5552k0697k5990l1152l5171
63153A060344l7531l8536l8465l7405l5875l4547l3186l0856k7460k4070k1465
$$ plain form
63234 508614 524754 541663 559339 577823 597573 618864 640911 662344 682670 702579 722713
63223 722713 742893 762775 782538 802515 822662 842921 863729 885589 908297 930980 952825
63212 952825 973416 992409 1009220 1023124 1033497 1039888 1041957 1039437 1032183 1020360 1004548 985551
63200 985551 964026 940437 915401 889943 865251 842241 821401 802934 786952 773606 763205
63189 763205 756174 752782 752900 756151 762310 771397 783350 797813 814501 833570 855259 879113 903957
63176 903957 928861 953801 979084 1004430 1029053 1052529 1075118 1097260 1119065 1140181 1159696
63165 1159696 1176279 1188903 1197497 1202404 1203255 1198967 1188906 1173354 1152657 1126667 1095515 1060344
63153 1060344 1022813 984277 945812 908407 872532 837985 804799 773943 746483 722413 700948
63142G00948j9299j7177j5474j4412j3254j1367r363q241p806o953n279l493k224
63129E66606j197J08J627K829L445L757M215M921N615O135O638P161P272O568
63115F25700N374M421L888L358K661K132J955J917J957K267K603K180P54q72j776
63100F58519j982k067k226k207j844j274q03p83j240j529r13L04R32N04j2L32
63084F43711J073J167O76O04J279J910J804J296J204J865K960M020M878N656O433
63069F80536P054P408P796Q638R807J0741J1277J1874J2945J4474J6497J9231
63057H18278K2377K4979K6552K7911L0212L3619L7379M0807M3627M5746M7326
63046A198813M8887N0704N2289N3008N2942N2657N2285N1513N0411M9632M9645
$$ plain form
63142 700948 681649 664472 648998 634586 621332 609965 600602 592361 584555 577602 572323 568830 566606
63129 566606 565409 565517 567144 569973 573418 577175 581390 586311 591926 598061 604699 611860 619132 625700
63115 625700 631074 635495 639383 642741 645402 647534 649489 651406 653363 655630 658233 660413 661167 660295 658519
63100 658519 656537 654470 652244 650037 648193 646919 646116 645333 644093 642564 641651 641955 642887 643391 643379 643711
63084 643711 644784 645951 646627 647231 648510 650420 652224 653520 654724 656589 659549 663569 668447 674103 680536
63069 680536 687590 694998 702794 711432 721239 731980 743257 755131 768076 782550 799047 818278
63057 818278 840655 865634 892186 920097 950309 983928 1021307 1062114 1105741 1151487 1198813
63046 1198813 1247700 1298404 1350693 1403701 1456643 1509300 1561585 1613098 1663509 1713141 1762786
63035A762786N0144N0368M9820M8647M7330M5955M3781L9820L3817K6282J7620
63024B216370P745l234j4582k5513l5641m4638n2038n7692o1784o4076o3895o1296
63012A739726n7446n3208m8148m1694l4452k7401k0421j2793m766K561Q753J4346
63000A465057J9720K4598K8789L2447L5562L7932L9776M1594M3279M4090M3665
62989A856509M2532M1468M0817M0461L9878L8130L4443K8960K2557J5793Q402
62978B209950j24r841k0274l0680m0471m9535n8062o5746p1524p4552p5176p4470
62966A639495p3025p0708o7334o3071n8293n3552m9429m6015m2769l9376l6298
62955A039625l3967l1939k9583k7171k5369k4126k2958k1971k1543k1228k0139
$$ plain form
63035 1762786 1812930 1863298 1913118 1961765 2009095 2055050 2098831 2138651 2172468 2198750 2216370
63024 2216370 2224115 2220881 2206299 2180786 2145145 2100507 2048469 1990777 1928993 1864917 1801022 1739726
63012 1739726 1682280 1629072 1580924 1539230 1504778 1477377 1456956 1444163 1439397 1441958 1450711 1465057
63000 1465057 1484777 1509375 1538164 1570611 1606173 1644105 1683881 1725475 1768754 1812844 1856509
62989 1856509 1899041 1940509 1981326 2021787 2061665 2099795 2134238 2163198 2185755 2201548 2209950
62978 2209950 2209826 2199985 2179711 2149031 2108560 2059025 2000963 1935217 1863693 1789141 1713965 1639495
62966 1639495 1566470 1495762 1428428 1365357 1307064 1253512 1204083 1158068 1115299 1075923 1039625
62955 1039625 1005658 973719 944136 916965 891596 867470 844512 822541 800998 779770 759631
62944G59631j8399j7024j6336j5623j4519j3484j2708j1635j0044q598p808p349
62932F06104o819o358n943n006l393j979j623j987k110j728j377j429j640j554
62918E63158j054n30n94j436k458k897k740k554k518k311j984k030k444k531k086
62903E32991j920k578l311l012j742n93k64m55n03j13N01Q31M71m03j105j139
62887E17656p14l47k51k70k16n6J54L43N47Q86J296J445J224J059J261J303M89
62870E25809p62j227n87Q6m8m67l59K0j03n66m42N08J402J440R57R31J720K616
62852E30928K725K086J633J949K490K446J936J688J725J324L41l10N1Q80J218
62837E53110Q77L54jj41q8%j93o43p80j67R00J758K094J989J620J260J237J529
$$ plain form
62944 759631 741232 724208 707872 692249 677730 664246 651538 639903 629859 621261 613453 606104
62932 606104 599285 592927 586984 581978 578585 576606 574983 572996 570886 569158 567781 566352 564712 563158
62918 563158 562104 561574 560980 559544 557086 554189 551449 548895 546377 544066 542082 540052 537608 535077 532991
62903 532991 531071 528493 525182 522170 520428 519835 519571 519116 518613 518500 519001 519832 520303 519900 518795 517656
62887 517656 516942 516595 516344 516074 515858 515802 515956 516299 516846 517732 519028 520473 521697 522756 524017 525320 525809
62870 525809 525047 523820 523233 523319 523271 522804 522445 522465 522362 521796 521354 521862 523264 524704 525661 526592 528312 530928
62852 530928 533653 535739 537372 539321 541811 544257 546193 547881 549606 550930 551271 550961 551012 551892 553110
62837 553110 553987 554341 554340 554199 554111 554111 553918 553275 552495 552328 553228 554986 557080 559069 560689 561949 563186 564715
62819E64715J694J496J264J307J436J417J424J613J613J052L01J10O72J515K173
62804E83802K513K553K436K520L060L890M656N272N837O341O832P615Q839J0072
62790F56238J0820J1479J3217J6649K1079K5319K8978L2626L6722M0943M4829
62779I38899M8744N3621N9613O5662P0703P4752P8214Q0682Q1306Q0075P7669
62768A709940P4039O8234N9788M9373L7657K4576J0268m192j7781l0499m2587
62757A938816n3383o1881o7991p2409p5497p7095p7236p6248p4199p0930o6641
62746A165306o1914n7168n2544m8239m4478m1177l7999l4714l1258k7640k4075
62735G04100k0921j8201j5554j2957j1012r941q950p220n131l603k634j495j87
$$ plain form
62819 564715 566409 567905 569169 570476 571912 573329 574753 576366 577979 579031 579332 579442 580114 581629 583802
62804 583802 586315 588868 591304 593824 596884 600774 605430 610702 616539 622880 629712 637327 646166 656238
62790 656238 667058 678537 691754 708403 729482 754801 783779 816405 853127 894070 938899
62779 938899 987643 1041264 1100877 1166539 1237242 1311994 1390208 1470890 1552196 1632271 1709940
62768 1709940 1783979 1852213 1912001 1961374 1999031 2023607 2033875 2029683 2011902 1981403 1938816
62757 1938816 1885433 1823552 1755561 1683152 1607655 1530560 1453324 1377076 1302877 1231947 1165306
62746 1165306 1103392 1046224 993680 945441 900963 859786 821787 787073 755815 728175 704100
62735 704100 683179 664978 649424 636467 625455 615514 606564 599344 594213 590610 587976 586481 586294
62722E86294M84L64L86J203K307L067L795N157P085Q947J0476J1944J3665J5858
62708F71032J8746K2251K5636K8135K9976L2314L5993M0787M6010N1404N6907
62697A059191O2019O6163O9677P3646P8375Q2687Q5286Q6270Q6449Q5522Q1972
62686A917257P4873O4864N2982L9421K4058P542q924k4610l9402n3061o4914p4356
62674A915730q1320q6125q9077r0179q9281q6540q2610p8125p3060o7124o0644
62663A031645n4546m9295m4609m0299l6653l3622l0492k6897k3508k1042j9207
62652F51475j7313j5389j3879j2690j1385j0011q948q147p275o405n809n256m276
62639E24692l043k232k041j998j651q14O33K402L408K618L80j824k993l251k952
$$ plain form
62722 586294 586778 587142 587528 588731 591038 594105 597900 603057 610142 619089 629565 641509 655174 671032
62708 671032 689778 712029 737665 765800 795776 828090 864083 904870 950880 1002284 1059191
62697 1059191 1121210 1187373 1257050 1330696 1409071 1491758 1577044 1663314 1749763 1835285 1917257
62686 1917257 1992130 2056994 2109976 2149397 2173455 2180997 2172073 2147463 2108061 2055000 1990086 1915730
62674 1915730 1834410 1748285 1659208 1569029 1479748 1393208 1310598 1232473 1159413 1092289 1031645
62663 1031645 977099 927804 883195 842896 806243 772621 742129 715232 691724 670682 651475
62652 651475 634162 618773 604894 592204 580819 570808 561860 553713 546438 540033 534224 528968 524692
62639 524692 521649 519417 517376 515378 513727 512913 513546 515948 519356 521974 522354 520530 517537 514286 511334
62624E11334k141j128o26q11r76n56J30N81R85J785K854L703M225M717N317N881
62608E35274O376O954P630Q132Q179P857P682Q264R805J1972J4302J6653J9089
62595F68169K1540K3894K6343K9244L2555L5670L7925L9110L9420L9104L8095
62584A031069L5953L2272K7236K1458J5186Q055O9p733j4243j9624k4894l0248
62572A074556l4634l7077l7730l7369l6578l5729l5088l4449l3064l0462k7165
62561F95211k4139k1768j9658j7402j5086j3042j1353r847q471p439o851o350
62549E33805n506m524m037m033l592k158n71j17q42j575j443o07M92J689K695
62534E09676K919K165J084N54Q71J692K486K930L178L828N369P621J0101J2666
$$ plain form
62624 511334 509193 508065 507439 506628 505652 505096 505226 505807 506792 508577 511431 515134 519359 524076 529393 535274
62608 535274 541650 548604 556234 564366 572545 580402 588084 596348 606153 618125 632427 649080 668169
62595 668169 689709 713603 739946 769190 801745 837415 875340 914450 953870 992974 1031069
62584 1031069 1067022 1099294 1126530 1147988 1163174 1171229 1171298 1163565 1149322 1129698 1104804 1074556
62572 1074556 1039922 1002845 965115 927746 891168 855439 820351 785902 752838 722376 695211
62561 695211 671072 649304 629646 612244 597158 584116 572763 562916 554445 547006 540155 533805
62549 533805 528299 523775 519738 515705 512113 509955 509384 509267 508425 506850 505407 504800 505292 506981 509676
62534 509676 512595 514760 515844 516398 517269 518961 521447 524377 527555 531383 536752 544373 554474 567140
62520E67140J5309J7578J9092K0561K3289K7328L1213L3961L6423L9848M3970
62509H75712M7519N0003N1905N3318N3602N2450N0265M7254M2924L6898K9612
62498A391462K1772J3640N383k298q465j2713j5137j5591j3660r494m082J659
62486A352476P673J4254K1096K7458L3064L8214M2983M7025N0129N2070N1561
62475A738003M6442L5961K2411R509p93r407j8525k9770m3460n8208p1015p8992
62463A542156q1755q1527q0559p9195p6715p3017o8588o3432n7159m9951m2690
62452G87568l6146l0550k5770k1379j6787j1987q077o261o219o162m753k406l48
62439F10723R59J955K952L755M259M726N226N260M353K730J009o33k497m619o407
$$ plain form
62520 567140 582449 600027 619119 639680 662969 690297 721510 755471 791894 831742 875712
62509 875712 923231 973234 1025139 1078457 1132059 1184509 1234774 1282028 1324952 1361850 1391462
62498 1391462 1413234 1426874 1432257 1429959 1421494 1408781 1393644 1378053 1364393 1354899 1350817 1352476
62486 1352476 1360149 1374403 1395499 1422957 1456021 1494235 1537218 1584243 1634372 1686442 1738003
62475 1738003 1784445 1820406 1842817 1852326 1851533 1842126 1823601 1793831 1750371 1692163 1621148 1542156
62463 1542156 1460401 1378874 1298315 1219120 1142405 1069388 1000800 937368 880209 830258 787568
62452 787568 751422 720872 695102 673723 656936 644949 636872 630611 624392 618230 613477 611071 610723
62439 610723 611682 613637 616589 620344 624603 629329 634555 639815 644168 646898 647907 647274 644777 640158 633751
62424F33751p256p250p023p144p741q566r180r212q606p619o599n850n650n989
62410E30066o312n918m785l615k937k659k587k806l184l175k561j825j248l83
62396D86071R31J801J589J329K471M464N138L682J820J504K590L569L646L229
62382E23834K976L244M118N342O291O546O331O208O537P341Q357R089R267R409
62368F14890J0322J1911J3180J3753J4644J6833J9848K2588K5140K8745L4053
62357H25907M0235M6037N1033N5605O0103O4233O7053O7490O5060O0253N4010
62346A457019M6806L8383K8498J7765P557j066q230j4818k1234k7054l1996l6669
62334A454961m1639m6166m8762m8922m7539m5521m2894l9554l6003l2791k9922
$$ plain form
62424 633751 626495 619245 612222 605078 597337 588771 579591 570379 561773 554154 547555 541705 536055 530066
62410 530066 523754 517836 513051 509436 506499 503840 501253 498447 495263 492088 489527 487702 486454 486071
62396 486071 487002 488803 490392 491721 494192 498656 503794 507476 509296 510800 513390 516959 520605 523834
62382 523834 526810 530054 534172 539514 545805 552351 558682 564890 571427 578768 587125 596214 605481 614890
62368 614890 625212 637123 650303 664056 678700 695533 715381 737969 763109 791854 825907
62357 825907 866142 912179 963212 1018817 1078920 1143153 1210206 1277696 1342756 1403009 1457019
62346 1457019 1503825 1542208 1570706 1588471 1596028 1594962 1586732 1571914 1550680 1523626 1491630 1454961
62334 1454961 1413322 1367156 1318394 1269472 1221933 1176412 1133518 1093964 1057961 1025170 995248
62323I95248k7281k5097k3464k2005k0664k0265k1450k3450k4681k4420k3168
62312G39303k1582j9845j8129j6823j5978j5029j3465j1475r679q402p414o340
62300E75142n161m224l768l506k914j888q28LQ62K028L245L976M037L754L569
62285E74327L656L846L802L384K888K664K587K298K004K453L909N671P021Q086
62271F28596R347J0682J1631J2279J3244J4839J6834J9027K1566K4575K7870L1246
62259H41736L4771L8709M3252M8350N3708N8902O3557O7310O9676P0173O8682
62248A458826O5318N9918N2068M1891L0428J8855P608l352j3734k2908l0630l7357
62236A626931m3833n0516n7208o2978o6670o7800o6873o4683o1509n7301n2304
$$ plain form
62323 995248 967967 942870 919406 897401 876737 856472 835022 811572 786891 762471 739303
62312 739303 717721 697876 679747 662924 646946 631917 618452 606977 597298 588896 581482 575142
62300 575142 569981 565757 561989 558483 555569 553681 552853 552856 553718 555746 558991 562967 567004 570758 574327
62285 574327 577983 581829 585631 589015 591903 594567 597154 599452 601456 603909 607818 613489 620510 628596
62271 628596 637943 648625 660256 672535 685779 700618 717452 736479 758045 782620 810490 841736
62259 841736 876507 915216 958468 1006818 1060526 1119428 1182985 1250295 1319971 1390144 1458826
62248 1458826 1524144 1584062 1636130 1678021 1708449 1727304 1734912 1731560 1717826 1694918 1664288 1626931
62236 1626931 1583098 1532582 1475374 1412396 1345726 1277926 1211053 1146370 1084861 1027560 975256
62225I75256m7162m2437l8306l4495l0434k5772k1048j7406j5347j4115j2788
62214F75946j1413j0505r833q647o959n646n149m861m126l128k352j650n06J042
62200F02213K298K779K784K923L317L605L599L725M516N925P355Q299Q658Q505
62186F70501P996P569P749Q586R595J0427J1201J1952J2271J1837J0907R926R008
62173G99525Q214P959Q616R965J1582J3654J6890K1640K7434L3361L8579M2615
62161A040034M5539M7698M9127M9283M7586M3866L8072L0109K0541J1034L291
62150A426180k443p313j2352j7654k2943k8206l3440l8165m1524m2814m1980l9766
62138A097580l7256l4953l2431k9081k4980k0740j6750j3107j0059p922o506n213
$$ plain form
62225 975256 928094 885657 847351 812856 782422 756650 735602 718196 702849 688734 675946
62214 675946 664533 654028 644195 635548 628589 622943 617794 612933 608807 605679 603327 601677 601171 602213
62200 602213 604511 607290 610074 612997 616314 619919 623518 627243 631759 637684 645039 653338 661996 670501
62186 670501 678497 686066 693815 702401 711996 722423 733624 745576 757847 769684 780591 790517 799525
62173 799525 807739 815698 824314 834279 845861 859515 876405 898045 925479 958840 997419 1040034
62161 1040034 1085573 1133271 1182398 1231681 1279267 1323133 1361205 1391314 1411855 1422889 1426180
62150 1426180 1423737 1416424 1404072 1386418 1363475 1335269 1301829 1263664 1222140 1179326 1137346 1097580
62138 1097580 1060324 1025371 992940 963859 938879 918139 901389 888282 878223 870301 863795 858582
62126H58582l745k382j497j124j069j067q09j68N55R76J203J826L256N324P422
62111H67283Q758Q554O451K861j236m852p315q276p817o404m567k779j760k460
62097H46441n066q332j0462j0649r376p470n450l675k322j144J87J467K202K558
62083G88909L371M969O593P378P563Q259J0242J3204J6142J8280J9644K0759K1860
62070I47173K2646K2917K3068K3556K4202K4538K4735K5595K7622L0528L3616
62059A230196L6121L7219L6315L3532K9462K4367J8040J0614L025l572q617j2362
62047A434340j5645j9546k4746l0905l6876m1595m4699m6320m6733m6236m5067
62036A035972m3308m1097l8838l6813l4706l1966k8621k5316k2461j9928j7603
$$ plain form
62126 858582 854837 852455 850958 849834 848765 847698 846889 846721 847276 848252 849455 851281 854537 859861 867283
62111 867283 876041 884595 891046 893907 892671 887819 880504 872228 864411 858007 853440 850661 848901 846441
62097 846441 841375 833043 822581 811932 802556 795086 789636 785961 783639 782495 782682 784149 786351 788909
62083 788909 792280 797249 803842 811220 818783 827042 837284 850488 866630 884910 904554 925313 947173
62070 947173 969819 992736 1015804 1039360 1063562 1088100 1112835 1138430 1166052 1196580 1230196
62059 1230196 1266317 1303536 1339851 1373383 1402845 1427212 1445252 1455866 1458891 1455319 1446702 1434340
62047 1434340 1418695 1399149 1374403 1343498 1306622 1265027 1220328 1174008 1127275 1081039 1035972
62036 1035972 992664 951567 912729 875916 841210 809244 780623 755307 732846 712918 695315
62025F95315j5771j4615j3802j2871j1786j0887j0412j0231r936r165q064p310
62013E60465p484q355r046q800p498n579l791k728k258j571k18J261K220L002
61999E09620M281N630N835M786L911M300N258N379M393L218K578K232J502M2j943
61984E61022l899n311o007o168o123o221o620o993o750n835n024m918m995m387
61970D81771l265k568k548k628k657l117l823l744k664j834k144k658k041o64
61956D45416l4n64j171r66k44L97R90J872L004M040M739N093N235N395N836O739
61940D85777Q150R900J1549J2627J3098J3320J3401J3034J2196J1569J1729J2211
61928F28561J1990J0801R363Q252P178N622L697J905K69j716m204o422p344o838
$$ plain form
62025 695315 679544 664929 651127 638256 626470 615583 605171 594940 585004 575839 567775 560465
62013 560465 552981 544626 535580 526780 519282 513703 509912 507184 504926 503355 503137 504398 506618 509620
61999 509620 513901 519531 525366 530152 534063 538363 543621 549000 553393 556611 559189 561421 562923 562965 561022
61984 561022 557123 551812 545805 539637 533514 527293 520673 513680 506930 501095 496071 491153 486158 481771
61970 481771 478506 475938 473390 470762 468105 464988 461165 457421 454757 452923 450779 448121 446080 445416
61956 445416 445382 444818 443647 442681 442437 442834 443824 445696 448700 452740 457479 462572 467807 473202 479038 485777
61940 485777 493927 503827 515376 528003 541101 554421 567822 580856 593052 604621 616350 628561
61928 628561 640551 651352 660715 668967 676145 681767 685464 687369 687638 685922 681718 675296 667952 661114
61914F61114n713m660l479j635Q06L223N291P203R144J0879J2028J2409J2065
61901G18675J1286J0512R862Q822O805M021J268j057l165n066o360p055p775q758
61887G32015r346r010q251p803p508o817o073o275p609r121j0038j0662j1545
61874F21957j2389j2411j1489j0371r634q954p617n505l265j594o91l11pQ03K487
61859E41009M629O131O413O320P342R962J3190J5695J7023J7649J8312J9418K0801
61846G03894K1955K2618K3056K3497K3472K2128J9174J5171J1006P392M609K210
61834I00182q13m865q832j1011j0894r389p358m829j814J121L515N571P565R285
61820H67434J0340J0531R636P426M197P50k556o095j0050j3779j6580j8500j9876
$$ plain form
61914 661114 655401 650741 647262 645627 646433 649656 654947 662150 671294 682173 694201 706610 718675
61901 718675 729961 740473 750335 759157 765962 769983 771251 770194 767029 761963 755603 748548 740773 732015
61887 732015 722669 713659 705408 697605 690097 683280 677207 670932 663323 654202 644164 633502 621957
61874 621957 609568 597157 585668 575297 565663 556709 549092 543587 540322 538728 538037 537726 537719 538522 541009
61859 541009 545638 551769 558182 564502 571844 581806 594996 610691 627714 645363 663675 683093 703894
61846 703894 725849 748467 771523 795020 818492 840620 859794 874965 885971 893363 897972 900182
61834 900182 899369 894504 885672 874661 863767 854378 847020 842191 840377 841498 845013 850584 858149 867434
61820 867434 877774 888305 897941 905367 909564 910314 907758 901663 891613 877834 861254 842754 822878
61807H22878k0564k0196j8854j7089j5473j4384j3777j3045j1610r880q996r346
61795F49664r942r699q614p271n951m817m293m474m622l999k856k005j707j619
61781E77795j512j428j399j482j873k476k693k141j280r20j294j976k353j931
61767E53037o45P98J433J286J426K373L275L269K832K937L560M080M513N199N667
61752E95040N043L460J937R35J7j073k054k885l960n234o007n857n224m805m854
61737E64479n190n406n031l959k743j976j466n40Q58K043K511K399J977J320O43
61722E49919M50J008J945K616K677K304J984J999K054J621P74J99K03K11k77q90
61706E68797j079j111j583k446l281m118n125n854n786n347n365n666n323m211
$$ plain form
61807 822878 802314 782118 763264 746175 730702 716318 702541 689496 677886 668006 659010 649664
61795 649664 639722 630023 621409 614138 608187 603370 599077 594603 589981 585982 583126 581121 579414 577795
61781 577795 576283 574855 573456 571974 570101 567625 564932 562791 561511 560591 559297 557321 554968 553037
61767 553037 552392 553190 554623 555909 557335 559708 562983 566252 569084 572021 575581 579661 584174 589373 595040
61752 595040 600083 603543 605480 606415 606432 605359 603305 600420 596460 591226 585219 579362 574138 569333 564479
61737 564479 559289 553883 548852 544893 542150 540174 538708 538168 539026 541069 543580 545979 547956 549276 549919
61722 549919 550369 551377 553322 555938 558615 560919 562903 564902 566956 568577 569351 569550 569753 569964 569687 568797
61706 568797 567718 566607 565024 562578 559297 555179 550054 544200 538414 533067 527702 522036 516713 512502
61692E12502l259l025l041k853k691k798k929k924l067l475l772l668l336k978
61678D68686k577k261k293k491k312j762j531j945k431k424k154k034j820r92
61664D39659L37J440J792J410N65m54j277j474q25M24J605K090J834J419J447
61649D49992K022K843L498L557K788J592P81O28O32M96P04J498K058J577N57k9
61633D75194l98j487l029l551k481j057o87j373k278k917l277l439l578l894m217
61618D37531m113l518k776j965r14L8J17q03j875k394k576k943l553m123m441
61603D01692m375m037l951m471m988m517l191k251k294k556k293j903k053k490
61589C56322k485j913j243q86j039j687k340k239j307l79j74m92p91r35r83q56
$$ plain form
61692 512502 509243 506218 503177 500324 497633 494835 491906 488982 485915 482440 478668 475000 471664 468686
61678 468686 466109 463848 461555 459064 456752 454990 453459 451514 449083 446659 444505 442471 440651 439659
61664 439659 439996 441436 443228 444638 445203 444749 443472 441998 441173 441597 443202 445292 447126 448545 449992
61649 449992 452014 454857 458355 461912 464700 466292 467073 467701 468333 468829 469533 471031 473089 474666 475223 475194
61633 475194 474796 473309 470280 466729 464248 463191 462504 461131 458853 455936 452659 449220 445642 441748 437531
61618 437531 433418 429900 427124 425159 424245 424283 424400 423597 421722 419328 416752 413809 410256 406133 401692
61603 401692 397317 393280 389329 384858 379870 375353 372162 369911 367617 365061 362768 360865 358812 356322
61589 356322 353837 351924 350681 349795 348756 347069 344729 342490 341183 340804 340630 340138 339347 338412 337429 336573
61573C36573o28o36q57p96l20L3K2J58P02R94N11j66k58Mk2j49K63J069J528J535
61553C39560J717K318K844K871K536K097J640J213Q73N10L8k99k40M5K19L77Q77
61536C59196J662K289K581K834L242L514L243K470J661J182Q35O1j279k539l042
61521C77910k975l022l259l163k711k502k532j880k03J383J727J149P06N45R5
61506C61268n88q55o78o91j006r22q6R04J333J224J084J253J720K153J995R70
61490C69078l71j004n16M50R43O15j54o99n97mM63M17K45O41J651K552K708K238
61472C78656J684J325J019N66rm84p28q52r72r00l44N25J063Q91L40n6k22l34
61454C81168k80J72P97J055Q80Q50J463K464L104K906K091J346J212J673K299
$$ plain form
61573 336573 335945 335309 334452 333656 333336 333369 333391 333549 334251 335245 335756 335590 335332 335336 335314 335165 335428 336497 338025 339560
61553 339560 341277 343595 346439 349310 351846 353943 355583 356796 357669 358179 358217 357918 357678 357723 357942 358319 359196
61536 359196 360858 363147 365728 368562 371804 375318 378561 381031 382692 383874 384709 384770 383491 380952 377910
61521 377910 374935 371913 368654 365491 362780 360278 357746 355866 355663 357046 358773 359922 360628 361173 361268
61506 361268 360680 359825 359147 358456 357450 356528 356442 357346 358679 359903 360987 362240 363960 366113 368108 369078
61490 369078 368707 367703 367187 367637 368580 369195 369041 368342 367745 367741 368204 368621 368866 369507 371158 373710 376418 378656
61472 378656 380340 381665 382684 383250 383241 382757 382029 381177 380205 379305 378961 379486 380549 381440 381780 381724 381502 381168
61454 381168 380888 381060 381857 382912 383792 384642 386105 388569 391673 394579 396670 398016 399228 400901 403200
61439D03200K738K956L040K996K820K514J937R21k67r38o63J47O85O26L10J50
61423D23172J22j5k16k5Q82K109K724K183Q79m35j421k081k209j609o82k24n21
61406D22633j182j826k344k486j951j077p37j244j956k168j887j432r37n45m97
61391D00364o39m04L67J106J387J449J518J272N21j79j02P38J787K595K947K846
61375D17573K687K976L563L726L312L019L185L199K631K008J816J594Q83K05J30
61360D52507K11r7j70Q90K658L925M463M966N591N888O012O651P699Q187P751
61345E17132P079O748O572O275N895N312M271L131K726L212L755L584K675J310
61331E79677l17j824k729l057l282l567l654l558l607l672l142j958r15n86n68
$$ plain form
61439 403200 405938 408894 411934 414930 417750 420264 422201 423122 422855 421917 421254 421401 422086 422712 423022 423172
61423 423172 423294 423279 423063 423038 423920 426029 428753 430936 431815 431380 429959 427878 425669 424060 423378 423154 422633
61406 422633 421451 419625 417281 414795 412844 411767 411030 409786 407830 405662 403775 402343 401406 400861 400364
61391 400364 399725 399321 399688 400794 402181 403630 405148 406420 406941 406762 406660 407398 409185 411780 414727 417573
61375 417573 420260 423236 426799 430525 433837 436856 440041 443240 445871 447879 449695 451289 452172 452377 452507
61360 452507 452718 452621 452451 453341 455999 459924 464387 469353 474944 480832 486844 493495 501194 509381 517132
61345 517132 524211 530959 537531 543806 549701 555013 559284 562415 565141 568353 572108 575692 578367 579677
61331 579677 579360 577536 574807 571750 568468 564901 561247 557689 554082 550410 547268 545310 544395 543809 543241
61316E43241j07R85K361L578M330M652N092O224P867R276J0121J0770J1552J2340
61302F32282J3015J3648J3960J3190J0942P720M429J574q36l033n290p665r742
61289F84194j0899j0954j0299r469q806q488q429q193p347n911m242k713j691
61276E86753j379j275l22J750L787M673M816N221N678N267M217L681L760L393
61262F30020K451K213L273M580N298O078P443Q331P670O264N651N761N186L390
61248G03609J240m96j838k830l223l198l412l984m265l900l486l674m157m027
61234F62359k931j440l62mp6j00J90P39J348J908K560L532M815N983O601O673
61218F91795O501O073N133L989L572M286N290N533M996M281L512K513J669J476
$$ plain form
61316 543241 543134 544119 546480 550058 554388 559040 564132 570356 578223 587499 597620 608390 619942 632282
61302 632282 645297 658945 672905 686095 697037 704757 709186 710760 709924 706891 701601 693936 684194
61289 684194 673295 662341 652042 642573 633767 625279 616850 608657 601310 595399 591157 588444 586753
61276 586753 585374 584099 583777 585527 589314 593987 598803 604024 609702 614969 619186 622867 626627 630020
61262 630020 632471 634684 637957 642537 647835 653913 661356 669687 677357 683621 689272 695033 700219 703609
61248 703609 704849 704353 702515 699685 696462 693264 689852 685868 681603 677703 674217 670543 666386 662359
61234 662359 659428 657988 657626 657622 657546 657446 657636 658375 659723 661631 664191 667723 672538 678521 685122 691795
61218 691795 698296 704369 709502 713491 717063 721349 726639 732172 737168 741449 744961 747474 749143 750619
61204G50619J510R78K27N09K132M059N586P188R230J1092J2279J3362J5020J6942
61190H50733J8379J9087J8891J7180J3694R349N481K665R03K93N77O30n51k561
61176I54750m199n180o260p776r051r452r208q954q989r352j0140j1327j2520
61163H42342j3240j3477j3794j4659j5721j5995j4980j3322j1982j0968r557p622
61151F87025n941m953m106k795j278j61M35O30K59p78k107l313m507n899p164
61136F45347p711p305o037m028j653L42J491K156L037M430O228Q262J0247J1807
61122F66613J2995J4354J6143J7924J9340K0696K2236K3546K4332K5177K6649
61111H90005K8179K8683K8034K7019K6082K4919K3195K0898J8121J5192J2812
$$ plain form
61204 750619 752129 753107 753334 753843 755975 760034 765620 772808 782038 793130 805409 818771 833791 850733
61190 850733 869112 888199 907090 924270 937964 947313 952794 955459 956362 956655 957232 957862 957311 954750
61176 954750 950551 945371 939111 931335 922284 912832 903624 894670 885681 876329 866189 854862 842342
61163 842342 829102 815625 801831 787172 771451 755456 740476 727154 715172 704204 694647 687025
61151 687025 681084 676131 672025 669230 667952 667791 668226 668856 669115 668337 666230 662917 658410 652511 645347
61136 645347 637636 630331 624294 620266 618613 618955 620446 622602 625639 630069 636297 644559 654806 666613
61122 666613 679608 693962 710105 728029 747369 768065 790301 813847 838179 863356 890005
61111 890005 918184 946867 974901 1001920 1028002 1052921 1076116 1097014 1115135 1130327 1143139
61100A143139J1248R575O523K012k889p466j1867j6138j9662k1879k3010k3691
61088A045895k4415k5386k6466k7101k6692k5279k3479k1756k0067j8219j6280
61077G90755j4537j3281j2531j1805j0481q570o777n467m151k438r03k26pO70
61063G00251J873K995L949N125O256O554O136O198P451R258J0689J1692J2816
61050G91243J4373J6225J7973J9260K0247K1684K3939K6162K7267K7573K8413
61039A034359L0106L1494L1846L1960L2834L4211L5153L5349L5101L4768L4793
61028A401974L5759L7735M0006M1939M3683M5630M7726M9672N1298N2456N3305
61017A901183N4945N8885O5406P3394Q2278R2964J06073J20435J34635J49378
$$ plain form
61100 1143139 1154387 1163962 1170485 1172497 1169608 1162142 1150275 1134137 1114475 1092596 1069586 1045895
61088 1045895 1021480 996094 969628 942527 915835 890556 867077 845321 825254 807035 790755
61077 790755 776218 762937 750406 738601 728120 719550 712773 707306 703155 700717 699814 699588 699581 700251
61063 700251 702124 705119 709068 714193 720449 727003 733139 739337 746788 756046 766735 778427 791243
61050 791243 805616 821841 839814 859074 879321 901005 924944 951106 978373 1005946 1034359
61039 1034359 1064465 1095959 1127805 1159765 1192599 1226810 1261963 1297312 1332413 1367181 1401974
61028 1401974 1437733 1475468 1515474 1557413 1601096 1646726 1694452 1744124 1795422 1847878 1901183
61017 1901183 1956128 2015013 2080419 2153813 2236091 2329055 2435128 2555563 2690198 2839576
61007B839576J67245J90811K22152K63384L16388L82552M63908N63752O84717
60998F094485Q26795R87852J164282J350614J543225J747466J970366K186563
60990A7871648K306753K204147J807291J182480N15314k777k77301l18267j83477
60981B5105811N1001K69710L16351O7202m71698j147177j750445k136744k276418
60972A8027593k222099k049135j820475j579616j352458j149733r72448q18667
60964F062962o86622n74391m79958m01913l38761k87935k46733k13729j87907
60955B645013j67009j48412j31423j17026j05326r4750q4137p4002o5269n8081
60945A599578n2505m9187m8281m8553m8458m7491m5944m4016m1904m0084l8675
$$ plain form
61007 2839576 3006821 3197632 3419784 3683168 3999556 4382108 4846016 5409768 6094485
60998 6094485 6921280 7909132 9073414 10424028 11967253 13714719 15685085 17871648
60990 17871648 20178401 22382548 24189839 25372319 25887633 25884856 25607555 25289288 25105811
60981 25105811 25156812 25426522 25742873 25810075 25338377 24191200 22440755 20304011 18027593
60972 18027593 15805494 13756359 11935884 10356268 9003810 7854077 6881629 6062962
60964 6062962 5376340 4801949 4321991 3920078 3581317 3293382 3046649 2832920 2645013
60955 2645013 2478004 2329592 2198169 2081143 1975817 1881067 1796930 1722928 1657659 1599578
60945 1599578 1547073 1497886 1449605 1401052 1352594 1305103 1259159 1215143 1173239 1133155 1094480
60934A094480l7021l4669l2162l0121k8159k5655k3067k1348k0355j9024j7004
60923H05895j5022j3586j2430j1320j0469r790q754p298o073n418m798l729k538
60910F94670j698j066l43K74M56M06N14O74M33k65r59j225j114j060j513k479
60894F85705l403l731l573l482l646l857m208n037n993o059n057m328n154p003
60880F21174q223q122p470p142p168p216p294p523p687p368o412n122m026l394
60866E27007k991k402j666j285j437j533r02L69J654K589L297L969M590M932M588
60851E40779L289J494L73O21J597K224K447L077M189M662L604J585j14j026j765
60836E67036k929m267n063m969m355l847l696l621l220k454j671j214j065r04
$$ plain form
60934 1094480 1057459 1022790 990628 960507 932348 906693 883626 862278 841923 822899 805895
60923 805895 790873 777287 764857 753537 743068 733278 724524 717226 711153 705735 700937 697208 694670
60910 694670 692972 691906 691563 691837 692293 692699 693213 693887 694320 694055 693096 691871 690757 689697 688184 685705
60894 685705 682302 678571 674998 671516 667870 664013 659805 654768 648775 642716 637659 633331 628177 621174
60880 621174 612951 604829 597359 590217 583049 575833 568539 561016 553329 545961 539549 534427 530401 527007
60866 527007 524016 521614 519948 518663 517226 515693 514791 515160 516814 519403 522700 526669 531259 536191 540779
60851 540779 544068 545562 545935 546556 548153 550377 552824 555901 560090 564752 568356 569941 569827 568801 567036
60836 567036 564107 559840 554777 549808 545453 541606 537910 534289 531069 528615 526944 525730 524665 523761
60822E23761n11j25k97j246k471l225l349l285l318l215k789k367k418k947l653
60807D88545m373n023n320m999m240l575l282l199l101l004l091l419l869m216
60793D33834m294m023l319k098n87N43P11J11m67n61m55n69q43r42p03j86M51
60776D16603R62J130J080J134J365J568J802K338L024L258K912K651K939L323
60762D46089L246K941K889K874K365J526J059J105J075N42k64r24j297j470j604
60747D60152j862k160k108j424l76M72P58K97j126l364n484o407o054n413n324
60732D20577n601n491m759l934l597l638l411k585j525p38k15K93O66N85J72j63
60716C86636l53n34m14L60J241J225L87n4M62J104J154J071J352J498J024N51
$$ plain form
60822 523761 523250 523125 522828 521582 519111 515886 512537 509252 505934 502719 499930 497563 495145 492198 488545
60807 488545 484172 479149 473829 468830 464590 461015 457733 454534 451433 448429 445338 441919 438050 433834
60793 433834 429540 425517 422198 420100 419513 420056 420767 420878 420411 419850 419395 418826 417983 417041 416338 416152 416603
60776 416603 417565 418695 419775 420909 422274 423842 425644 427982 431006 434264 437176 439827 442766 446089
60762 446089 449335 452276 455165 458039 460404 461930 462989 464094 465169 465711 465447 464523 463226 461756 460152
60747 460152 458290 456130 454022 452598 452222 452694 453452 453749 452623 449259 443775 437368 431314 425901 420577
60732 420577 414976 409485 404726 400792 397195 393557 390146 387561 386036 385298 385083 385376 386042 386627 386799 386636
60716 386636 386283 385749 385335 385695 386936 388161 388548 388494 388956 390060 391214 392285 393637 395135 396159 396710
60700C96710R35J966K905L511L741L268K243J712K197K729K397J872K111K517
60686D30814K013J155J293K157K214J234N69Q44J141Q20M24L97L53P2n6P2L7j55
60668D45398n8N1o79k186l375l732l804l898l679l287l383l726l246j943j114
60653D07339j197j039J6R37Q89P04J284J990J886J402J387J520R52k25j356k327
60637D14162l188l535l292l304l981m213k928r57N8l7j25J90L60L39P47J610K211
60620C94117K254K060J619O31n19r39o19n21j070j455q60M52J602K059J751Q51
60604D01413j81o83l70L56Q22P27L76L68R36J584J652J292J394K263L014K710
60588D17673J626P69N87P89J072J339J414J177R09Q68P77K42m81p23k47O58J839
$$ plain form
60700 396710 397645 399611 402516 406027 409768 413036 415279 416991 419188 421917 424314 426186 428297 430814
60686 430814 432827 433982 435275 437432 439646 440880 441449 442293 443434 444254 444678 445075 445428 445500 445444 445516 445553 445398
60668 445398 445340 445391 444712 442526 439151 435419 431615 427717 424038 420751 417368 413642 410396 408453 407339
60653 407339 406142 405103 405119 406056 406945 407649 408933 410923 412809 414211 415598 417118 418070 417845 416489 414162
60637 414162 410974 407439 404147 400843 396862 392649 389721 388764 388822 388785 388660 388850 389210 389549 390296 391906 394117
60620 394117 396371 398431 400050 400681 400162 399223 398604 398083 397013 395558 394698 395150 396752 398811 400562 401413
60604 401413 401232 400549 400179 400535 401357 402084 402460 402828 403764 405348 407000 408292 409686 411949 414963 417673
60588 417673 419299 420068 420655 421444 422516 423855 425269 426446 427355 428223 429000 429242 428761 428038 427791 428449 430288
60571D30288L299M744N613N719N502N682O787Q769J0786J1776J1597J1179J1179
60558E32920J0955R501O910M133J702n26k599m276n477o216o177n046l170j256
60544E31378M06J875K960L560M347O187Q821J1070J2425J3617J5405J7587J9573
60531F49211K1085K1926K1611J9823J6825J3081Q771M050n66m509p670j0291j2400
60518G40947j3597j3435j1979r937q192p118o469n924n442m935m070k713j299
60505F45837k19Q63K654N293Q308J1366J4538J7840K1094K4341K7989L2340L7194
60492H49438M1912M5663M7688M7712M6071M3270L9527L5013L0131K5071J9304
60481A270800J2130L715n014j3505k1986l0567l8524m4855m9164n1708n2798n2473
$$ plain form
60571 430288 433587 438331 443944 449663 455165 460847 467634 476403 487189 498965 510562 521741 532920
60558 532920 543875 553376 560286 564419 566121 565595 562996 558720 553243 547027 540850 535804 532634 531378
60544 531378 531784 533659 536619 540179 544526 550713 559534 570604 583029 596646 612051 629638 649211
60531 649211 670296 692222 713833 733656 750481 763562 772333 776383 775817 771308 763638 753347 740947
60518 740947 727350 713915 701936 691999 683807 676689 670220 664296 658854 653919 649849 647136 645837
60505 645837 645618 646481 649135 654428 662736 674102 688640 706480 727574 751915 779904 812244 849438
60492 849438 891350 937013 984701 1032413 1078484 1121754 1161281 1196294 1226425 1251496 1270800
60481 1270800 1282930 1286645 1281631 1268126 1246140 1215573 1177049 1132194 1083030 1031322 978524 926051
60469I26051n0651m7391m3043l8249l3708k9833k6608k3738k0960j8280j5943
60458E77647j4137j2692j1250r726q370p404o798o485o392o186n406m076k796
60445D75929k028j656j414j325j419j482j389j299j204q19k75l52j393k503k533
60430D54838j538n44j22J6J69J70j48o11j036j408j668j663j386j022o74k91K28
60413D43310R17J668K158K152J910J926K169K089J583J288J528J710J321Q35R23
60398D67487J385J685K012K856L888M265L896L461L245K888K288J935K164K782
60384E06237L426L770L410K268J081Q37J641K742L592M203M492M121L170K347
60370E47337K213K559K756K375J450M48r5j36j51k72P0J178K233K286J721J797
$$ plain form
60469 926051 875400 828009 784966 746717 713009 683176 656568 632830 611870 593590 577647
60458 577647 563510 550818 539568 529842 521472 514068 507270 500785 494393 488207 482801 478725 475929
60445 475929 473901 472245 470831 469506 468087 466605 465216 463917 462713 461894 461619 461267 459874 457371 454838
60430 454838 453300 452756 452634 452650 452819 452989 452841 452230 451194 449786 448118 446455 445069 444047 443373 443082 443310
60413 443310 444227 445895 448053 450205 452115 454041 456210 458299 459882 461170 462698 464408 465729 466564 467487
60398 467487 468872 470557 472569 475425 479313 483578 487474 490935 494180 497068 499356 501291 503455 506237
60384 506237 509663 513433 516843 519111 520192 521029 522670 525412 529004 533207 537699 541820 544990 547337
60370 547337 549550 552109 554865 557240 558690 559138 559043 558907 558756 558484 558554 559732 561965 564251 565972 567769
60354E67769K810L783L950L722L882M702N998P396Q299Q247P524O871O419N474
60340F46846L536R73j475l397m728n536n992o284o454o497o508o485o221n717
60326E86061n336n192m788l852k989k832k989k699k105j906k071j878j111j91
60312E46122P20J813K960L906N018O866R209J1412J3662J6541J9524K1293K1554
60299F80600K1214K0572J8717J5089J0281M952q26o712j1883j6065j9511k1614
60287F94814k1061j8045j4790j2886j1518r399p124o149o336o121m718k952k078
60274E71637k691m494o322o749n426l571k552k466k653k946l525m066l962l173
60260E17041k211j465j156j498k273k601j857n68J71n5p50j201r01K42J641K299
$$ plain form
60354 567769 570579 574362 578312 582034 585916 590618 596616 604012 612311 620558 628082 634953 641372 646846
60340 646846 650382 651355 649880 646483 641755 636219 630227 623943 617489 610992 604484 597999 591778 586061
60326 586061 580725 575533 570745 566893 563904 561072 558083 555384 553279 551373 549302 547424 546313 546122
60312 546122 546842 548655 551615 555521 560539 567405 576614 588026 601688 618229 637753 659046 680600
60299 680600 701814 722386 741103 756192 766473 771425 770599 763887 752004 735939 716428 694814
60287 694814 673753 655708 640918 628032 616514 607115 599991 593842 587506 581385 576667 573715 571637
60274 571637 568946 564452 558130 551381 545955 542384 539832 537366 534713 531767 528242 524176 520214 517041
60260 517041 514830 513365 512209 510711 508438 505837 503980 503412 503583 503528 502778 501577 500676 500918 502559 504858
60244E04858J900J213R96J056Q43M10J01j70n49o33LJ020J750K045K131K009J769
60227E20752K001L065M308M848M811M935N175M811L798L059L216L889M513N163
60213E78344O182P487Q620R315R716J0099J0407J0212R321Q329P987Q087P624
60200F91730O397N512N774O307N740M110K595J717R45k6p14q18q45j384k427l600
60184G21013m606n214n350n360n756o449o772o423n999o133o461n946m219k191
60170F44134j092j085j132m03O19P70k18j370j772j635j705k124k357k075j516
60155F27039j040n73K69J647L070L696L172K169J685J948K363K454K362K396K651
60140F55308L147L906M718N342N993P080Q446R565J0393J1306J2094J2008J1021
$$ plain form
60244 504858 506758 507971 508967 510023 510866 511276 511377 511207 510658 510025 510028 511048 512798 514843 516974 518983 520752
60227 520752 522753 525818 530126 534974 539785 544720 549895 554706 558504 561563 564779 568668 573181 578344
60213 578344 584526 592013 600633 609948 619664 629763 640170 650382 659703 668032 676019 684106 691730
60200 691730 698127 703639 709413 715720 721460 725570 728165 729882 730827 730801 730087 729269 728424 727040 724613 721013
60184 721013 716407 711193 705843 700483 694727 688278 681506 675083 669084 662951 656490 650544 646325 644134
60170 644134 643042 641957 640825 640422 641041 641811 641593 640223 638451 636816 635111 632987 630630 628555 627039
60155 627039 625999 625426 625695 627342 630412 634108 637280 639449 641134 643082 645445 647899 650261 652657 655308
60140 655308 658455 662361 667079 672421 678414 685494 693940 703505 713898 725204 737298 749306 760327
60127G60327R913Q838O930L941J095n19j357k260k839k247p79N18J400K306L088
60112G88355L042K117R71q3j274k565l580m236m681m750m411m488n858p939r053
60097G41567q451p004n681m429k993j851j518j540r75K89J385J664J634K362M031
60082G18490N465N335L797K395K256K928L258K751J585k22k770n657q164j0082
60068G21365j1749j3274j4169j3903j2507j0571q868p867p426p047o513o000n537
60055E95934m845l909l214l053l104k957k482j447M62K723L984L704L096L579
60041E88471M949O024O504P037P785Q075P472O247M821L454K425J750Q84o54k492
60026F52752l886m717n377n971o385o768p152o995o082n412o135p809q882q761
$$ plain form
60127 760327 770240 779078 786008 789949 791044 790525 789168 786908 784069 781822 781043 781561 782961 785267 788355
60112 788355 791397 793514 794485 794402 793128 790563 786983 782747 778066 773316 768905 764417 758559 750620 741567
60097 741567 733116 726112 720431 716002 713009 711158 709640 708100 707125 707414 708799 710463 712097 714459 718490
60082 718490 723955 729290 733087 735482 737738 740666 743924 746675 748260 748038 745268 739611 731447 721365
60068 721365 709616 696342 682173 668270 655763 645192 636324 628457 621031 613984 607471 601471 595934
60055 595934 591089 587180 583966 580913 577809 574852 572370 570923 571385 574108 578092 581796 584892 588471
60041 588471 593420 599444 605948 612985 620770 628845 636317 642564 647385 650839 653264 655014 655898 655244 652752
60026 652752 648866 644149 638772 632801 626416 619648 612496 605501 599419 594007 587872 580063 571181 562420
60012E62420q273q069p769o909n663m377l223k493k454k662k245j036K40R50J054
59997E09491P13K20K43J204K353K499J742J457K370L662M395M724N189N636N550
59982E51448M937M260L767L248K236M27j819l501l945l620l429l430l006k130
59968E45443j478j290j023k32R79K387L814M771M935M939N714O972P423O581N305
59953E95240M253L008J211n99j855k783l726m429m585m327l747k655j315o55j119
59938E71917j997k425k420k442k569k609k477j977q50O44J809K578L696N400O824
59923E73102P280P345P861Q594Q736Q233P728P536P398P044O339N196L896L239
59909F69527L781N084O128O302N705M857M362M491M742M212K702J001j83r97j803
$$ plain form
60012 562420 554147 546078 538309 531400 525737 521360 518137 515644 513190 510528 508283 507247 507487 508437 509491
59997 509491 510204 510424 510667 511871 514224 516723 518465 519922 522292 525954 530349 535073 540262 545898 551448
59982 551448 556385 560645 564412 567660 569896 570323 568504 565003 561058 557438 554009 550579 547573 545443
59968 545443 543965 542675 541652 541420 542399 544786 548600 553371 558306 563245 568959 575931 583354 589935 595240
59953 595240 599493 602501 603712 603113 601258 598475 594749 590320 585735 581408 577661 575006 573691 573036 571917
59938 571917 569920 567495 565075 562633 560064 557455 554978 553001 552151 552795 554604 557182 560878 566278 573102
59923 573102 580382 587727 595588 604182 612918 621151 628879 636415 643813 650857 657196 662392 666288 669527
59909 669527 673308 678392 684520 690822 696527 701384 705746 710237 714979 719191 721893 722894 722711 721714 719911
59894G19911k425k551k300j871j094J08J225J742J875K198K854L624M367M953
59880G32616N116M889M879N510O328O536N962M996L938K903K112J668J218L72
59866G89043o44j297j560j946k686l386l602l484l589m182m883n135m889m543
59852G43217m139l139j408J61P33Q40J649L128M118M297M762O212P618P469N507
59837G81025K598l42k624l669l409k391j013O90K151K041j90l252n430o554p572
59822G52059q703r139q455p265o355n874n563n186m645m050l692l652l551l073
59808F72856k517k435k863l355l618l681l536l023k096r88j08J74k02q15j186
59793F42607j349j657j989j816j169r02j589k774l696m185m327l981l206k674
$$ plain form
59894 719911 717486 714935 712635 710764 709670 709778 711003 712745 714620 716818 719672 723296 727663 732616
59880 732616 737732 742621 747500 753010 759338 765874 771836 776832 780770 783673 785785 787453 788671 789043
59866 789043 788399 787102 785542 783596 780910 777524 773922 770438 766849 762667 757784 752649 747760 743217
59852 743217 739078 735939 734531 734692 735425 736265 737914 741042 745160 749457 754219 760431 768049 775518 781025
59837 781025 783623 783281 780657 776988 773579 771188 770175 770865 773016 775057 774867 771615 766185 759631 752059
59822 752059 743356 734217 725762 718497 712142 706268 700705 695519 690874 686824 683132 679480 675929 672856
59808 672856 670339 667904 665041 661686 658068 654387 650851 647828 645732 644744 644636 644810 644608 643793 642607
59793 642607 641258 639601 637612 635796 634627 633725 632136 629362 625666 621481 617154 613173 609967 607293
59779F07293k910l416l244k209r86j67K79O98J359K191K773K756K479K718L680
59764F13294M713N284N601N985O301O554P299Q792J0301J1015J1214J1740J2681
59751G20774J3367J3516J3651J4287J5210J5605J4768J2815J0754R551R050Q305
59739H71653O950N424L810J499j523m140n543o207o723o687n750m814m913n569
59725H37467n570m879m467m605m633m306m116m252m346m280m356m559m516m190
59711G74392l837l343k434j454j075j233j183o09J27Q07J597K438L044L534M367
59696G75138N542O623P613R018J0937J2660J3311J2333R525N341J076k004l837
59683H63276n252o537p123o746n999n582n697o368p651r268j0631j1431j1740
$$ plain form
59779 607293 604383 600967 597723 595514 594528 594361 594640 595338 596697 598888 601661 604417 606896 609614 613294
59764 613294 618007 623291 628892 634877 641178 647732 655031 663823 674124 685139 696353 708093 720774
59751 720774 734141 747657 761308 775595 790805 806410 821178 833993 844747 854298 863348 871653
59739 871653 878603 884027 887837 889336 887813 883673 878130 871923 865200 858513 852763 847949 843036 837467
59725 837467 831897 827018 822551 817946 813313 809007 804891 800639 796293 792013 787657 783098 778582 774392
59711 774392 770555 767212 764778 763324 762249 761016 759833 759224 759351 760158 761755 764193 767237 770771 775138
59696 775138 780680 787303 794916 803934 814871 827531 840842 853175 862700 868041 869117 867113 863276
59683 863276 858024 851487 844364 837618 831619 826037 820340 813972 806321 797053 786422 774991 763251
59670G63251j1509j0563r152p814o660n400m152l458l347l092k163q51L74J499
59656F96963K663L708M418M847N128N215M958M298L353K489K106J993J182j022
59642G42299l948o191p199p686q436r407j0054r928q806o808m603l014k223j749
59628F52247j185o08k63l00q30j838k994l968m746n342n403m750m008m014m667
59613F07331n112m991m683m331l460j826N7J507K282K452K161J718J478J486J548
59598E97617J612J667J443P96K14K91Q16J098J036J123J469J680J628J486R78
59583F14954l89k224l403l618l785m569n452n730n501n123m513l623k899k627
59569E61498k389j841j436j668k072j756o60M21R24J000J009J047J011P79K99
$$ plain form
59670 763251 751742 741179 732027 724213 717553 712153 708001 704543 701196 698104 695941 695090 695464 696963
59656 696963 699626 703334 707752 712599 717727 722942 727900 732198 735551 738040 740146 742139 743321 742299
59642 742299 738351 732160 724961 717275 708839 699432 689378 679450 670644 663836 659233 656219 653996 652247
59628 652247 651062 650454 650191 649891 649061 647223 644229 640261 635515 630173 624770 620020 616012 611998 607331
59613 607331 602219 597228 592545 588214 584754 582928 582985 584492 586774 589226 591387 593105 594583 596069 597617
59598 597617 599229 600896 602339 603135 603349 603640 604456 605554 606590 607713 609182 610862 612490 613976 614954
59583 614954 614565 612341 608938 605320 601535 596966 591514 585784 580283 575160 570647 567024 564125 561498
59569 561498 559109 557268 555832 554164 552092 550336 549676 550097 551021 552021 553030 554077 555088 555867 556166
59554E56166k45m89k31K79O77R28J321K025K789L155K964K690L079M442O415Q509
59538E94474J0503J2213J3419J4512J6513J9535K1570J9834J3606N113k361o719
59526G32212p691o307m148k368j068J85J341J912J832J431O68q13k750m339n404
59511G04693o597q132r304r583r289q781p884o711o060o266o405n534m097l176
59497F06874k843k245j122j38L20P69J740K847L246K672J735J219J389K019K894
59482F21376M098N727P527Q988R771J0019J0284J1209J2978J4937J6020J5722
59470G48656J4328J2066Q626M047n48l840n716p009q052q255p054m554j251K317
59456G43761N592Q283J0589J2698J4331J5282J6048J7114J7917J7458J5794J3952
$$ plain form
59554 556166 555921 555432 555201 555480 556157 557085 558406 560431 563220 566375 569339 572029 575108 579550 585965 594474
59538 594474 604977 617190 630609 645121 661634 681169 702739 722573 736179 741292 738931 732212
59526 732212 724521 718214 714066 711698 710630 710815 712156 714068 715900 717331 717999 717186 714436 710097 704693
59511 704693 698096 689964 680660 671077 661788 653007 645123 638412 632352 626086 619681 614147 610050 606874
59497 606874 604031 601786 600664 600526 600846 601615 603355 606202 609448 612120 613855 615074 616463 618482 621376
59482 621376 625474 631201 638728 647716 657487 667506 677790 688999 701977 716914 732934 748656
59470 748656 762984 775050 783676 787723 787175 783335 777619 770610 762558 754303 747249 742695 741444 743761
59456 743761 749353 757636 768225 780923 795254 810536 826584 843698 861615 879073 894867 908819
59444I08819J2468J0869Q575N370J071m174r301j2947j4751j5234j4606j2806
59432H63353j0545r004q516q700r713j1756j3498j2865r864o752m805k825M08
59419G54918M156P429J0873J5323J9879K3050K4812K6066K7178K8548L1244L4832
59407A008308L5407K8438J3899k978j6217k2997k3534j9460j3036o219P18Q647
59395I90976J6713K0956J7107M839j1277k5017l2512l3725l1023k6847k2496j8437
59383H49257j4978j2292j0111p886n344k795q67L9J68K21O48J176J332J091O63
59368H00322j55j571k873k944j813p40m54k49O26J714K228K403L084M448N982
59353H10008P367Q728J0279J2195J4513J6755J8196J8901J9842K1473K2857K2915
$$ plain form
59444 908819 921287 932156 940731 946101 947172 942998 933697 920750 905999 890765 876159 863353
59432 863353 852808 843804 835288 826588 816875 805119 791621 778756 768892 762140 757335 754510 754918
59419 754918 759074 766503 777376 792699 812578 835628 860440 886506 913684 942232 973476 1008308
59407 1008308 1043715 1072153 1086052 1083074 1066857 1043860 1020326 1000866 987830 981611 982329 990976
59395 990976 1007689 1028645 1045752 1050591 1039314 1014297 981785 948060 917037 890190 867694 849257
59383 849257 834279 821987 811876 803990 798646 795851 794984 795023 795191 795412 796060 797236 798568 799659 800322
59368 800322 800167 798596 795723 792779 790966 790226 789772 789523 790149 791863 794091 796494 799578 804026 810008
59353 810008 817375 826103 836382 848577 863090 879845 898041 916942 936784 958257 981114 1004029
59341A004029K1899K0790J9769J8126J5372J1610P150K478j642m888p875j1264
59329A095554j4619j6921j8010j8647j9293j9569j9012j7759j6390j5447j5047
59318I04840j4695j3731j2236j1157j1088j1378j0931r590q157p336p202p427
59306G79912p528p075o065m877l623k002k4J740L043M428O290Q181R698J1252
59292G93350J3006J3657J1428O030j079q048j3478j6452j6866j5624j3731j1339
59280G40854q303n155k600m25K123N062P782J0145J2467J4571J5901J6582J7293
59267H26297J8019J7914J6552J4452J2117R500O588L771J216j448m417p205r142
59254I04214j0080j0362j0412j0370r988q831o937m995l657k865k175j415n59
$$ plain form
59341 1004029 1025928 1046718 1066487 1084613 1099985 1111595 1118745 1121223 1119581 1114693 1106818 1095554
59329 1095554 1080935 1064014 1046004 1027357 1008064 988495 969483 951724 935334 919887 904840
59318 904840 890145 876414 864178 853021 841933 830555 819624 810034 801877 794541 787339 779912
59306 779912 772384 765309 759244 754367 750744 748742 748718 750458 753501 757929 764219 772400 782098 793350
59292 793350 806356 820013 831441 837471 836392 828344 814866 798414 781548 765924 752193 740854
59280 740854 732551 727396 724796 724371 726494 731556 739338 749483 761950 776521 792422 809004 826297
59267 826297 844316 862230 878782 893234 905351 914851 921439 925210 926426 924978 920561 913356 904214
59254 904214 894134 883772 873360 862990 853002 844171 837234 832239 828582 825717 823542 822127 821568
59241H21568N92K020L186L718M042M634N086M800M224M363N184N547M784L333
59227H77081J779J69j495l018m513o438q721j0573j1417j1515j1414j1266j0986
59214G87673j0516r745q605p404o701o639o723o436n728m848m065l591l443l308
59200F99921k841k054j141q1J195K309K674K272J819J975K707L518M091M563N285
59185G26212O285P093P261O954O679O516O151N738N856O443O566N723M551L745
59171H11773L093K301J844K111K520K495K634L646M781M622L131J486J02j742
59157H44797m198o210p055p393q263r796j1341j2347j2704j2706j2786j2983j2697
59144G14318j1464r740q451p907p741p636p421o732n400m007l235k800j906n84
$$ plain form
59241 821568 822160 824180 827366 831084 835126 839760 844846 849646 853870 858233 863417 868964 873748 877081
59227 877081 878860 879029 877534 874516 870003 863565 854844 844271 832854 821339 809925 798659 787673
59214 787673 777157 767412 758807 751403 744702 738063 731340 724904 719176 714328 710263 706672 703229 699921
59200 699921 697080 695026 693885 693804 694999 697308 699982 702254 704073 706048 708755 712273 716364 720927 726212
59185 726212 732497 739590 746851 753805 760484 767000 773151 778889 784745 791188 797754 803477 808028 811773
59171 811773 814866 817167 819011 821122 823642 826137 828771 832417 837198 841820 844951 846437 846539 844797
59157 844797 840599 834389 827334 819941 811678 801882 790541 778194 765490 752784 739998 727015 714318
59144 714318 702854 693114 684663 676756 669015 661379 653958 647226 641826 637819 634584 631784 629878 629294
59130F29294K76L28K59Q68K275M142N929O984P057O729O742P062P262P551Q512
59115G01270J0000J1217J1870J2354J2833J3005J2732J2131J1064R420P709O492
59103H32097N367L529J241l46r26j380k243l019l333l684m521n418n649n063l966
59088H02686k782j966j797k052k365k835l741m831n617o201o994p756p909p646
59074G38194p744q222q225p353o153n167m416l969m049m375m287l771l451l452
59060F63560l194k500j954j890j879j510r32l77J21L55j5q91j806k563l219l554
59044F37752l306k792k478k169j443o13k50r3N11J404K070K870M372N866O188
59029F47889N874O657Q803J0802J1929J3221J5367J7516J8860J9794K0674K0900
$$ plain form
59130 629294 629570 629898 630157 631025 633300 637442 643371 650355 657412 664141 670883 677945 685207 692758 701270
59115 701270 711270 722487 734357 746711 759544 772549 785281 797412 808476 817896 825605 832097
59103 832097 837464 840993 842234 841888 840962 839582 837339 834320 830987 827303 822782 817364 811715 806652 802686
59088 802686 799904 797938 796141 794089 791724 788889 785148 780317 774700 768499 761505 753749 745840 738194
59074 738194 730450 722228 714003 706650 700497 695330 690914 686945 682896 678521 674234 670463 667012 663560
59060 663560 660366 657866 655912 654022 652143 650633 649701 649324 649445 649800 649785 648894 647088 644525 641306 637752
59044 637752 634446 631654 629176 627007 625564 624951 624701 624608 625119 626523 628593 631463 635835 641701 647889
59029 647889 653763 660420 669223 680025 691954 705175 720542 738058 756918 776712 797386 818286
59017H18286J9956J8046J5097J0669N473J339j104l177n821q182r467j0399j1532
59004H39184j1780j0179p757n983m480j981J269L818N082N609N596M708L163J812
58990H28081J092P74O16N69M76J59m45j558l364n228n836m653k531m13J710L966
58974H13415N818O958Q089R832J1574J2361J2360J2508J3233J4232J5095J5423
58962I50898J4864J3617J2332J1077R120O177K956j34l720q123j2257j4873j6153
58949I65781j7076j7971j8578j8793j8521j7412j5635j4148j3392j2457j0476
58938G91322q006o036m428k460l43J004J279J004O99O71J149J838J868Q74m50
58923G79985j475k508l818m737m695m313m356m357l514k261j673j727j406k70
$$ plain form
59017 818286 838242 856288 871385 882054 887527 888866 887762 884585 878764 870582 861115 850716 839184
59004 839184 827404 817225 809468 803485 799005 797024 798293 802111 807193 812802 818398 823106 826269 828081
58990 828081 829173 829947 830563 831132 831608 831767 831322 829764 826400 821172 815336 810683 808152 807739 809449 813415
58974 813415 819233 826191 834280 844112 855686 868047 880407 892915 906148 920380 935475 950898
58962 950898 965762 979379 991711 1002788 1011908 1018085 1021041 1020907 1017187 1009064 996807 981934 965781
58949 965781 948705 930734 912156 893363 874842 857430 841795 827647 814255 801798 791322
58938 791322 783316 777280 772852 770392 770049 771053 772332 773336 774035 774706 775855 777693 779561 780435 779985
58923 779985 778510 776002 772184 767447 762752 758439 754083 749726 746212 743951 742278 740551 739145 738875
58909G38875J209K642M019N222O080O890Q118R783J1592J3404J5098J6441J7524
58896H56897J8675J9551J9186J7461J5662J4842J4595J4192J3978J4687J6236
58885A035962J8158K0326K2251K2588K0477J6713J2606Q478M239L98k699n738
58873A173759r335j2803j5257j6974j8394j8773j7360j5176j3943j3801j3587
58862A008356j2786j1704j0293q491p266p678r096r889r614r078q593p714o560
58849H89594n811n405m666l709l441m175n429o952q773j0427j1409j2106j3042
58836G94249j3545j2586j0683r402r113q699p580o475o017n875n544m897l840
58823F89993k402j068j50R27K592L942L864K950K752L436L836L687L941M750M892
$$ plain form
58909 738875 740084 742726 746745 751967 758047 764937 773055 782838 794430 807834 822932 839373 856897
58896 856897 875572 895123 914309 931770 947432 962274 976869 991061 1005039 1019726 1035962
58885 1035962 1054120 1074446 1096697 1119285 1139762 1156475 1169081 1177559 1181798 1182196 1179497 1173759
58873 1173759 1164424 1151621 1136364 1119390 1100996 1082223 1064863 1049687 1035744 1021943 1008356
58862 1008356 995570 983866 973573 965082 957816 950138 941042 931153 921539 912461 903868 896154 889594
58849 889594 883783 878378 873712 870003 866562 862387 856958 850006 841233 830806 819397 807291 794249
58836 794249 780704 768118 757435 748033 738920 730221 722641 716166 710149 704274 698730 693833 689993
58823 689993 687591 686523 686373 687300 689892 693834 697698 700648 703400 706836 710672 714359 718300 723050 727942
58808G27942L708K021O69n32j821k783l153l270l329l148k949l375m425n335n730
58793F94490n903n873n275m378l960l934l277j662j3J006J899L222M597N479O030
58778F82448O624P147P321P204O919O319N199L508J212j572m300o306p401p788
58764G06534p594o944o216n630m892l825k851k189j116R46L103L870L139K125
58750F78460J599J196M31o35j665k186j608J17K058L299L984M665N156N057M758
58735G04686M917N392N787O362P253P509O331M629L859L899L681L250L381L575
58721G74511K547N22q29q28k61N30K135M347N872O188O131O145N528L904K025
58706H18467N36q78k661m732o898r027j0787j2131j3812j6289j8506j9130j8522
$$ plain form
58808 727942 731650 733671 734340 733808 731987 729204 726051 722781 719452 716304 713355 709980 705555 700220 694490
58793 694490 688587 682714 677439 673061 669101 665167 661890 660228 660215 661221 663120 666342 670939 676418 682448
58778 682448 689072 696219 703540 710744 717663 723982 729181 732689 733901 732329 728029 721723 714322 706534
58764 706534 698940 691996 685780 680150 675258 671433 668582 666393 665277 666223 669326 673196 676335 678460
58750 678460 680059 681255 681686 681051 679386 677200 675592 675709 677767 681066 685050 689715 694871 699928 704686
58735 704686 709603 714995 720782 727144 734397 741906 748237 752866 756725 760624 764305 767555 770936 774511
58721 774511 777058 777580 776751 775923 775662 776192 778327 782674 788546 794734 800865 807010 812538 816442 818467
58706 818467 819003 818125 815464 810732 803834 794807 784020 771889 758077 741788 723282 704152 685630
58693F85630j7986j7479j5940j3530j1493r962q017n938n168n684n716m537l502
58680E60678l561l837l446k861k544j939p74K17P34J600L151M359M465M272M907
58665E65421O438Q383J0472J2329J3346J3329J2272R563M775p07m530o179p195
58652F37717q425q933q257p646q062q638q231p090n934m735l354k295j852j444
58638E52821n32P13K030L420M539M838M511M157L534J992J21p50p46j261k461
58623E76926k935k243j690j980k110j365m75P2R91K648M240N384O728Q262Q836
58608F01289Q164P427P027N780L330J326R26J036L46n73o70l22m38r57j520k321
58592F29850l175l028j481M36J957L667O033Q242R549J0428J1487J2465J3070
$$ plain form
58693 685630 667644 650165 634225 620695 609202 599240 591223 585285 580117 574433 568717 564180 560678
58680 560678 557117 553280 549834 546973 544429 542490 541716 541933 542667 544267 547418 551777 556242 560514 565421
58665 565421 571859 580242 590714 603043 616389 629718 641990 651553 656328 655621 651091 644912 637717
58652 637717 629292 620359 612102 604456 596394 587756 579525 572435 566501 561766 558412 556117 554265 552821
58638 552821 552289 553002 555032 558452 562991 567829 572340 576497 580031 582023 582144 581394 580648 579387 576926
58623 576926 573991 571748 570058 568078 565968 564603 564128 564200 565191 567839 572079 577463 584191 592453 601289
58608 601289 609453 616880 623907 629687 633017 634343 635269 636305 636651 636078 635408 635086 634648 633691 632171 629850
58592 629850 626675 623647 622166 622602 624559 628226 634259 642501 652050 662478 673965 686430 699500
58579F99500J3470J3331J1941R860Q745Q836Q428O657M906M608N520P094R583
58566H12479J2772J5457J7307J9403K2130K4462K6147K8290L0744L1293K8784
58555A069268K4714K0390J5009Q116J632k657n503q153r923r769q484p419o620
58542A080601n978o547q902j1903j4669j7975k2094k5259k6183k6117k6458k6157
58530H62359k3645j9610j5854j2907j0638r458r081p828n114k876k658l152k610
58517G36928j656j580j822j443j219j908k295j382o24j521k755k358j018n62p51
58502G14034k94M36M42M12J302K008J099l76n58O3j96j077j075j74P18J939M209
58485G22912O645Q087R214J1111J3077J4225J5598J8152K0325K0377J9505J9578
$$ plain form
58579 699500 712970 726301 738242 748102 756847 765683 774111 780768 785674 790282 795802 802896 812479
58566 812479 825251 840708 858015 877418 899548 924010 950157 978447 1009191 1040484 1069268
58555 1069268 1093982 1114372 1129381 1137497 1139129 1136472 1130969 1122816 1112893 1103124 1094640 1087221 1080601
58542 1080601 1074623 1068076 1059174 1047271 1032602 1014627 992533 967274 941091 914974 888516 862359
58530 862359 838714 819104 803250 790343 779705 770247 761166 753338 748224 745348 742690 739538 736928
58517 736928 735272 733692 731870 730427 729208 727300 725005 723623 722999 721478 718723 716365 715347 714785 714034
58502 714034 713740 714176 714618 715030 716332 718340 719439 719063 718505 718568 718372 717295 716220 716046 716764 718703 722912
58485 722912 729557 737644 746858 757969 771046 785271 800869 819021 839346 859723 879228 898806
58473H98806J9394J6466J1203O046J573l211p780j0625j2087j3489j4214j2722
58461H79360r695p052m768j632J720L735N055P411J0254J1694J2037J2952J3797
58448I34868J2263Q314M084K06m363r212j2510j4112j5455j6421j5424j2622r949
58435H49667p903n276k127r1N07J180K724M489O155Q000R586J0335J0961J2217
58421I00424J2950J1631Q905O277L491k64l846n803p175r546j1665j1381r702
58408H84296r331j0230j0241r242q890r067q325p127o886o553m134p95N47J48
58394G94170P70K629L357K711K934M357M878M081L853M535M352L027K282K500
58380H40436K368J943K494L409K877J596K007M008N208N251O001P552Q109P785
$$ plain form
58473 898806 918200 934666 945869 951915 953488 950277 942497 931872 919785 906296 892082 879360
58461 879360 869665 862613 857845 856213 857933 861668 866723 874134 884388 896082 908119 921071 934868
58448 934868 947131 955445 959529 959735 955372 946160 933650 919538 904083 887662 872238 859616 849667
58435 849667 841764 836488 834361 834270 834777 835957 838681 843170 849325 857325 866911 877246 888207 900424
58421 900424 913374 925005 933910 940187 943678 943414 939568 933765 926590 917044 905379 893998 884296
58408 884296 874965 864735 854494 845252 836362 827295 818970 811843 804957 798404 794270 793475 794022 794170
58394 794170 794940 797569 800926 803637 806571 810928 815806 819887 823740 828275 832627 835654 837936 840436
58380 840436 842804 844747 847241 850650 853527 855123 857130 861138 866346 871597 877598 885150 893259 901044
58366I01044Q526J0295J1221J1405J2639J4507J4898J4165J4549J5742J5246J2929
58354A057166J0862R022N695J864L49P57R2j661j612M26J573J285K014M122N325
58339A097279N522P072R879J1313J1412J2937J5883J7200J6446J6401J7654J7877
58327A256875J6776J6241J5503J1918O855M589M989L683R3j420N80K358J990K031
58313A343061L624M393L878M840P567Q983Q805J0272J3500J4737J3506J3640J5798
58300A466604J6116J3868J3115J4955J5577J4010J4223J7158J8426J6532J5776
58289A636360J8237K0383K0378K1246K3904K4813K3387K3958K7495K9282K7794
58278A897237K7757L1127L3431L2337L1591L3013L3162L1442L2667L7830M1298
$$ plain form
58366 901044 909570 919865 931086 942491 955130 969637 984535 998700 1013249 1028991 1044237 1057166
58354 1057166 1068028 1077050 1082745 1084609 1084958 1085715 1085807 1084146 1082534 1082960 1084533 1085818 1087832 1091954 1097279
58339 1097279 1102801 1109873 1119752 1131065 1142477 1155414 1171297 1188497 1204943 1221344 1238998 1256875
58327 1256875 1273651 1289892 1305395 1317313 1324168 1328757 1333746 1337429 1337522 1336102 1336682 1339040 1341030 1343061
58313 1343061 1346685 1351078 1354956 1359796 1367363 1376346 1385151 1395423 1408923 1423660 1437166 1450806 1466604
58300 1466604 1482720 1496588 1509703 1524658 1540235 1554245 1568468 1585626 1604052 1620584 1636360
58289 1636360 1654597 1674980 1695358 1716604 1740508 1765321 1788708 1812666 1840161 1869443 1897237
58278 1897237 1924994 1956121 1989552 2021889 2053480 2086493 2119655 2151097 2183764 2221594 2262892
58267B262892M1076M2576M8130N2325N2285N2999N7461O1089O1042O1590O4993
58256B858458O6608O4238O2781O4466O4455O1157O0508O4780O7975O7781P0618
58245C573825P9081Q6224Q8546R2514J01632J09623J13370J19629J31526J41721
58235D637691J46675J53848J66816J77750J83233J92379K09955K27122K38715
58226F334184K53515K76910L00252L18525L41078L73039M04535M30829M63895
58217I496762N10624N59865O05318O59869P31943Q10594Q90552R87675J111915
58208A6365117J251346J402530J588485J825672K104641K427382K830260L344328
58200C3139761L971624M730834N683399O880194Q333483J0085524J2246078J4895385
$$ plain form
58267 2262892 2303968 2346544 2394674 2446999 2499284 2552283 2609744 2670833 2731875 2793465 2858458
58256 2858458 2925066 2989304 3052085 3116551 3181006 3242163 3302671 3367451 3435426 3503207 3573825
58245 3573825 3652906 3739130 3827676 3920190 4021822 4131445 4244815 4364444 4495970 4637691
58235 4637691 4784366 4938214 5105030 5282780 5466013 5658392 5868347 6095469 6334184
58226 6334184 6587699 6864609 7164861 7483386 7824464 8197503 8602038 9032867 9496762
58217 9496762 10007386 10567251 11172569 11832438 12564381 13374975 14265527 15253202 16365117
58208 16365117 17616463 19018993 20607478 22433150 24537791 26965173 29795433 33139761
58200 33139761 37111385 41842219 47525618 54405812 62739295 72824819 85070897 99966282
58192I9966282J7984901K1372917K4897813K8400368L1817782L5287111L8782977
58185B98510151M1208918M0010830L2494742J8212642Q2449j7141350k9680578
58178C83697804l6305235l7838666l5880784l2073576k7892163k4388475k1902091
58171A67416814k0136566j8591549j6937872j5103254j3181856j1322321r637770
58164F2505626q165184o895415n819109m925225m181903l553637l026823k595701
58156B3342629k238396j930353j667269j452665j275863j122401r92834q91286
58148A1771562q07679p29859o61325o08955n64722n17001m69108m29759l95334
58139F587820l57987l21741k94482k72449k47759k23522k07326j97155j86914
$$ plain form
58192 99966282 117951183 139324100 164221913 192622281 224440063 259727174 298510151
58185 298510151 339719069 379729899 412224641 430437283 430519732 413378382 383697804
58178 383697804 347392569 309553903 273673119 241599543 213707380 189318905 167416814
58171 167416814 147280248 128688699 111750827 96647573 83465717 72143396 62505626
58164 62505626 54340442 47445027 41625918 36700693 32518790 28965153 25938330 23342629
58156 23342629 21104233 19173880 17506611 16053946 14778083 13655682 12662848 11771562
58148 11771562 10963883 10234024 9572699 8963744 8399022 7882021 7412913 6983154 6587820
58139 6587820 6229833 5908092 5613610 5341161 5093402 4869880 4662554 4465399 4278485
58130D278485j78524j75742j73301j64566j53212j45764j39575j29414j18709
58121B899678j12897j08468r9892r0724q6812q4875p8809p1125o7419o5376o0001
58110A973280n4073n2791n3305m9994m5127m4083m4843m2280l8412l8341m0162
58099A469869l8707l5430l5151l6539l4975l1522l0208k9783k6751k3175k3033
58088A124595k4115k1849j7933j6877j7321j5118j1908j2221j4843j5370j4637
58077I42403j6443j9373j9096j6645j6405j7873j7177j4946j4927j6432j5672
58066G57414j3172j2544j3243j1718q546p401q065p213n152n078o709p055o569
58053F44949q126j0844j1128r164q254q591p574n511n071n797m908k891k679l989
$$ plain form
58130 4278485 4099961 3924219 3750918 3586352 3433140 3287376 3147801 3018387 2899678
58121 2899678 2786781 2678313 2578421 2487697 2400885 2316010 2237201 2166076 2098657 2033281 1973280
58110 1973280 1919207 1866416 1813111 1763117 1717990 1673907 1629064 1586784 1548372 1510031 1469869
58099 1469869 1431162 1395732 1360581 1324042 1289067 1257545 1227337 1197554 1170803 1147628 1124595
58088 1124595 1100480 1078631 1060698 1043821 1026500 1011382 999474 987253 972410 957040 942403
58077 942403 925960 906587 887491 870846 854441 836568 819391 804445 789518 773086 757414
58066 757414 744242 731698 718455 706737 698191 690790 682725 675512 670360 665282 658573 651518 644949
58053 644949 636823 625979 614851 605687 597433 588842 581268 575757 570686 564889 559981 557090 554411 550422
58039E50422l924k564k557l860m127l556m159n166m360l051m337p361q584p889
58025D84927q045r043q510p034p344q693p700m632l277m528n408m664m199m570
58011C97280l978k234j234j231o76J48m68j875j823o27m28q69J31J850J706K00
57995C85872K43J848K291J338J456K858L072J753J128J432M17k086l513l051k656
57980C92402l170l312k868l023l393k524j271j754l164k755p18J50n31n33L11
57965C63847n2j332r30J080J721L34o15m52j281l263l747k241j656l209m441l707
57949C40056k548k120j287K99R10Q1k69P25J658K114L561O030P440P322P633Q974
57933C80579R581R056R230J0266R755O966M226K771R63j970m199m831n567p219
$$ plain form
58039 550422 546498 543934 541377 537517 533390 529834 525675 520509 516149 513098 508761 501400 492816 484927
58025 484927 476882 467839 459329 452295 444951 436258 428558 423926 420649 416121 410713 406049 401850 397280
58011 397280 393302 391068 389834 388603 387927 388075 387607 385732 383909 383282 382854 381985 382116 383966 385672 385872
57995 385872 386115 387963 390254 391592 393048 395906 398978 400731 401859 403291 403708 401622 398109 395058 392402
57980 392402 389232 385920 383052 380029 376636 374112 372841 371087 367923 365168 364450 364600 364069 363536 363847
57965 363847 363795 362463 361533 362613 364334 364668 364053 363601 362320 359057 355310 353069 351413 348204 343763 340056
57949 340056 337508 335388 334101 334400 335310 335391 335122 335847 337505 339619 343180 349210 356650 363972 371605 380579
57933 380579 390160 399216 408446 418712 428467 435433 439659 442430 443393 441423 437224 432393 426826 419607
57919D19607q106p510p233q081q237o799n524n396m806k902j335r67j49J883L201
57904C57646K722K256K981L196J728M86J183K421K386J845K019K107J176K33K43
57889C84628K76l69m63P50J676Q62p21j673k248k726k106l11N22j003l337m493
57873C69264m752n149n365m929m506m360l512j906j227k034k394r81Q10J602K381
57858C32942M199N860O036N586N738N984N673N696O644P313O902O564O901O221
57844D18259L436M63n95o30j502k805l216l251m053m932m701m160m799o061o311
57829C75142n525m882m546l854k934k300j668p55k76p12j115n98J57K02j43l48
57813C45845q61j799k045j096l37r55k164l033m282o469q074p499n650m494m267
$$ plain form
57919 419607 411501 403991 396758 388677 380440 373641 368117 362721 357915 355013 353678 352711 352562 354445 357646
57904 357646 360368 362624 365605 368801 370529 371015 372198 374619 377005 378850 380869 382976 384152 384385 384628
57889 384628 384904 384535 384072 384822 386498 387360 386639 384966 382718 379992 377886 377575 378097 377094 373757 369264
57873 369264 364512 359363 353998 349069 344563 340203 336691 334785 333558 331524 329130 328149 328959 330561 332942
57858 332942 337141 343001 349037 354623 360361 366345 372018 377714 384358 391671 398573 405137 412038 418259
57844 418259 421695 422158 421563 420933 419431 416626 413410 410159 406106 401174 396473 392313 387514 381453 375142
57829 375142 369617 364735 360189 356335 353401 351101 349433 348678 348402 347690 346575 345977 346134 346336 346193 345845
57813 345845 344984 343185 341140 340044 339707 338752 336588 333555 329273 322804 314730 307231 301581 297087 292820
57798B92820l937l363l125l129k929k613k188j190M2K64m98m36J165K560K451
57783B75894K133L023M246M649N111O676Q267Q598Q529R186R551Q394O885O696
57769C67838O930N648L127J008n92k478m059m252l801m209n174n483n409n918
57755C43176o434n868m903m802m892l747j943j077q82J1J245J397P88Q55J233
57740C14157K83j702k589j656k16R99K553M300N058M615M052L848L474K916K808
57725C42900L080L108L078L575M158L993L460L407L368K405J120Q05J135Q06l1
57710C80367k19K4n63j842k525k565l012l659l200j701n79j2J305L575N383O037
57694C76814O319O568N997M276J962r84n085r550j2443j3103j2635j1775j0076
$$ plain form
57798 292820 288883 285520 282395 279266 276337 273724 271536 270346 270388 270652 270154 269718 270883 273443 275894
57783 275894 278027 281050 285296 289945 295056 301732 309999 318597 327126 336312 345863 354257 361142 367838
57769 367838 374768 380416 383543 384551 383959 381481 377422 373170 369369 365160 359986 354503 349094 343176
57755 343176 336742 330874 325971 321169 316277 312530 310587 309510 308628 308639 309884 311281 312069 312924 314157
57740 314157 314440 312738 310149 308493 308277 309276 311829 316129 321187 325802 329854 333702 337176 340092 342900
57725 342900 345980 349088 352166 355741 359899 363892 367352 370759 374127 376532 377652 378457 379592 380398 380367
57710 380367 380148 380172 379609 377767 375242 372677 369665 366006 362806 361105 360526 360514 361819 365394 370777 376814
57694 376814 383133 389701 395698 399974 401936 400952 395867 386317 373874 360771 348136 336361 326285
57681C26285p545n145l152p43K308N180P761J1225J6292K2273K8407L4860M1858
57668D79864M9008N5923O2616O8845P3437P3859O6083M6434J5757j8728m7686
57657I25412o6024p4222p4774o9896o2129n4124m6859l9749l2830k7129k2886
57646C54790j9245j5929j3493j1794r990q106o871o065m846l609l365l468k237
57633B45772m3P70n34j981k074j669j794j757p39N57J017M89p28k483m069m432
57617B26302l686l058k882k196p81J52Lk58J20M71J86k01j67o5p4L52J173J330
57599B16721L56q32j416j693k051k257k354k827l388l055j970j593k431l152k716
57584A85342j821j336r12j57K57k63j112j508j629j922k279k579l018l356k962
$$ plain form
57681 326285 318740 313595 310443 309700 312008 317188 324949 336174 352466 374739 403146 438006 479864
57668 479864 528872 584795 647411 716256 789693 863552 929635 976069 991826 973098 925412
57657 925412 859388 785166 710392 640496 578367 524243 477384 437635 404805 377676 354790
57646 354790 335545 319616 306123 294329 284339 276233 269362 263297 258451 254842 251477 248009 245772
57633 245772 245729 246499 245965 243984 241910 240241 238447 236690 235951 236508 237525 238014 237286 234803 230734 226302
57617 226302 222616 219558 216676 214480 213699 213851 213854 213596 213716 214187 214373 214172 214005 213940 213866 214218 215391 216721
57599 216721 217077 216245 214829 213136 211085 208828 206474 203647 200259 197204 195234 193641 191210 188058 185342
57584 185342 183521 182185 181273 181116 181373 181110 179998 178490 176861 174939 172660 170081 167063 163707 160745
57569A60745k114j908k437k490j693j342k244l271l098k095j385j188j092j003
57555A33385q60l22N10R54Q84R83J387J290M57j93j43o4l52k87M81J021O23n5
57537A39699k35j66j29L55J298J474J12j745k623k475k151j993j919k038k267
57522A25197k141j712j706k171k119j194m59o41q33k9J264K028K330K733L086
57507A23633L016K898L244L744L824L531L172K764K400K374K403J690K75p22p57
57492A57489o02q82j125r38q46j202j532j664k169k979l028k125j553j904j999
57477A32941j106m76j183k088j742q19p89j351j176l76j77p31j061q10n09l62
57461A18185j19J55L08O09J070R30r0q42k51R70J417R94N45K17l29p15l68K66
$$ plain form
57569 160745 158631 156723 154286 151796 150103 148761 146517 143246 140148 138053 136668 135480 134388 133385
57555 133385 132525 132203 132713 133667 134551 135534 136921 138211 138668 138475 138332 138268 137916 137629 138110 139131 139754 139699
57537 139699 139464 139298 139169 139524 140822 142296 142408 140663 138040 135565 133414 131421 129502 127464 125197
57522 125197 123056 121344 119638 117467 115348 114154 113695 113054 112221 112192 113456 115484 117814 120547 123633
57507 123633 126649 129547 132791 136535 140359 143890 147062 149826 152226 154600 157003 158693 158968 158246 157489
57492 157489 156887 156005 154880 153942 153096 151894 150362 148698 146529 143550 140522 138397 136844 134940 132941
57477 132941 131835 131359 130176 128088 126346 125527 124738 123387 122211 121835 121658 120927 119866 119056 118547 118185
57461 118185 118066 118221 118529 119138 120208 121138 121048 120206 119955 120925 122342 123336 123881 124098 123769 123054 122686 122952
57443A22952M43N33J294K186J969P59j0L83J182J516J334R27M35k4l92p77j161
57426A33549j256j047r33r36n03L97Q54L42m69r33j407k178k479j679m22M36J083
57409A22419J834K016J124J03P9O19O49K55R9j59j197k336k229r44J53L61J58
57392A23004k8k22k58J30O82J013J268J545J287K91l37M56J965K700K516K389
57376A38401K485K058J034K52J24K15J47q7o08j487k264k448k255k083j750j023
57360A30711l72k41j83L25Q87J009J154J872K574K443J839J559J379P20Q5L29
57344A46090J053J205Q37Q47J312J509J207O18m48j957k727j694K12J026L43n17
57328A48916o66m27j38K42L76k13j120j498j366j346j395j075p47j077j645j457
$$ plain form
57443 122952 123395 123928 125222 127408 129377 130136 130126 130509 131691 133207 134541 135468 135903 135879 135487 134710 133549
57426 133549 132293 131246 130313 129377 128874 129271 130125 130467 129998 129065 127658 125480 123001 121322 120900 121336 122419
57409 122419 124253 126269 127393 127496 127575 128194 128843 129098 129197 129038 127841 125505 123276 122332 122485 122846 123004
57392 123004 122976 122754 122496 122626 123308 124321 125589 127134 128421 128712 128375 128831 130796 133496 136012 138401
57376 138401 140886 142944 143978 144230 144354 144569 144716 144629 144021 142534 140270 137822 135567 133484 131734 130711
57360 130711 130339 130098 129915 130240 131127 132136 133290 135162 137736 140179 142018 143577 144956 145676 145761 146090
57344 146090 147143 148348 149185 150032 151344 152853 154060 154678 154230 152273 149546 147852 148064 149090 149433 148916
57328 148916 148250 147823 147685 147927 148303 148090 146970 145472 144106 142760 141365 140290 139543 138466 136821 135364
57312A35364o55k58l45n5O55P32k74j483j889j382o16n29j717l364l431j041J948
57295A21660L049K235J432J592J882J605J165J091J389J938K471K405J661J212
57281A46787J779K607K760K726L342M045L831L202L256L599L083K013J620J836
57267A86486J663J285J636K280J898O51j32k88o88j057l45R02J007j3n38l04o52
57250A93791j703j920r82m18p49o28M11Q80J12l23P90K368K978K793K464J803
57234B01667Q65O55J564K480K575K481K792K893K321J849K106K461K319K256K849
57219B34133L465L302K653K265K300K562K962L224K992K581K701L235L422L263
57205B75060L516M191M435M061L742L635L299L065L821N268O129O320P064Q630
$$ plain form
57312 135364 134709 134451 134106 134051 134706 135438 135164 133681 131792 130410 129794 129265 127548 124184 120753 119712 121660
57295 121660 124709 126944 128376 129968 131850 133455 134620 135711 137100 139038 141509 143914 145575 146787
57281 146787 148566 151173 153933 156659 160001 164046 167877 171079 174335 177934 181017 183030 184650 186486
57267 186486 188149 189434 191070 193350 195248 195899 195767 195479 194791 193734 193389 194291 195298 195285 194747 194443 193791
57250 193791 192088 190168 189186 188768 188019 187391 187802 188682 188794 188471 189261 191629 194607 197400 199864 201667
57234 201667 202532 203187 204751 207231 209806 212287 215079 217972 220293 222142 224248 226709 229028 231284 234133
57219 234133 237598 240900 243553 245818 248118 250680 253642 256866 259858 262439 265140 268375 271797 275060
57205 275060 278576 282767 287202 291263 295005 298640 301939 305004 308825 314093 320222 326542 333606 342236
57191C42236R823J0091J0227J0534J0282R418Q988R232R183Q584Q380Q759Q693
57178D64430P974P648P897P551O375N718O108O323N791N761P131R009J0417J1565
57164E69698J2583J2935J3002J4329J7277K0244K2089K3452K4970K6155K6842
57153G83576K7723K8635K8429K7240K6707K7197K7229K6395K6347K7776K9092
57142A086346K9302K9578L0696L1497L1370L1677L3096L4099L3688L3250L4020
57131A438619L5054L5428L6072L7764L9576M1052M3519M7563N1509N4138N6584
57120A916878N9973O3678O7449P2643P9612Q6619R3006J00648J10579J21241J31970
57109B904296J45071J62403J83205K07336K37314K74995L19781L72491M37408
$$ plain form
57191 342236 352059 362150 372377 382911 393193 402611 411599 420831 430014 438598 446978 455737 464430
57178 464430 472404 480052 487949 495500 501875 507593 513701 520024 525815 531576 538707 547716 558133 569698
57164 569698 582281 595216 608218 622547 639824 660068 682157 705609 730579 756734 783576
57153 783576 811299 839934 868363 895603 922310 949507 976736 1003131 1029478 1057254 1086346
57142 1086346 1115648 1145226 1175922 1207419 1238789 1270466 1303562 1337661 1371349 1404599 1438619
57131 1438619 1473673 1509101 1545173 1582937 1622513 1663565 1707084 1754647 1806156 1860294 1916878
57120 1916878 1976851 2040529 2107978 2180621 2260233 2346852 2439858 2540506 2651085 2772326 2904296
57109 2904296 3049367 3211770 3394975 3602311 3839625 4114620 4434401 4806892 5244300
57100E244300N18378O16888P36141Q82401J059378J265691J500055J763216K051842
57091A5638290K357167K673470L000639L333765L658167L960143M233659M470975
57083D3326275M658619M787345M839208M737214M328920L477957K204105P17752
57075G3077395p05032j881869k771669l411561l849578m129661m295821m380789
57067D7651415m393831m328724m181092l956331l668743l339591k993050k649209
57059A8140844k320627k014993j737807j491488j275331j088081r28825p94960
57051F488732o81891n85744n04515m36292l78380l28794k86780k51404k21168
57042B813764j95324j73928j56318j40955j26925j14399j03558r4222q6364p9733
$$ plain form
57100 5244300 5762678 6379566 7115707 7998108 9057486 10323177 11823232 13586448 15638290
57091 15638290 17995457 20668927 23669566 27003331 30661498 34621641 38855300 43326275
57083 43326275 47984894 52772239 57611447 62348661 66677581 70155538 72359643 73077395
57075 73077395 72372363 70490494 67718825 64307264 60457686 56328025 52032204 47651415
57067 47651415 43257584 38928860 34747768 30791437 27122694 23783103 20790053 18140844
57059 18140844 15820217 13805224 12067417 10575929 9300598 8212517 7283692 6488732
57051 6488732 5806841 5221097 4716582 4280290 3901910 3573116 3286336 3034932 2813764
57042 2813764 2618440 2444512 2288194 2147239 2020314 1905915 1802357 1708135 1621771 1542038
57032A542038p3131o5347n6586m7814l9058k9598j9531r636J03J0499K1844L3784
57020A267567M5828N5883N8294M6082J7180k1845n9303q5768r8485j00167r5120
57009A030146q6687p7046o7778n9699n2578m5848l9702l4804l1041k7418k3437
56998D84108j9713j6926j4963j3445j2375j1727j1063j0006q641p060n092k649
56986C50448J57L407P213J0986J3519J3947J1967P352L62p319j3325j6702j8267
56973C63745j8748j7835j5394j2337r562p045m534k151J71K849N777Q287J0403
56960C03626J2991J6300J9495K2134K4616K6449K5410J9630R652k174j3361k1777
56948D42991k6018k6505k5241k3480k0569j5900j0765o934m318j450K317O399
$$ plain form
57032 1542038 1468907 1403560 1346974 1299160 1260102 1230504 1210973 1201337 1201440 1211939 1233783 1267567
57020 1267567 1313395 1369278 1427572 1473654 1490834 1468989 1409686 1323918 1225433 1125266 1030146
57009 1030146 943459 866413 798635 738936 686358 640510 600808 566004 534963 507545 484108
56998 484108 464395 447469 432506 419061 406686 394959 383896 373890 365249 358189 353097 350448
56986 350448 350605 354012 361225 372211 385730 399677 411644 418996 419358 412039 398714 382012 363745
56973 363745 344997 327162 311768 299431 289869 282824 278290 276139 276310 279159 284936 293223 303626
56960 303626 316617 332917 352412 374546 399162 425611 451021 470651 480303 478129 464768 442991
56948 442991 416973 390468 365227 341747 321178 305278 294513 287579 283261 281811 284128 290527
56936B90527J0306J4116J7844K1401K5084K9211L3217L5465L3912K6951J4497
56925E52531j201j6363k7907l4748l7105l5694l2010k8171k5405k3180k0513j7484
56913B52750j4884j3044j1718j0609r421p912o349n328m795l933k435j059n29
56900A60734n76n13P2J550M144P083Q925R409J0000J1898J4519J6808J9035K2199
56886B85287K6241K9903L1870L1222K7263J9875J0115p3q727j4515j7215j7710
56874D03536j6990j5093j1656p398l787j034K301P260J3229J9192K5029L0902
56862D45491L6548M1997M7877N4029N8481N8395N1455L6484J4411j0479l1841
56851H02848m5276n0713n0516m6621m0225l2651k4865j6753p972J090R995J9116
$$ plain form
56936 290527 300833 314949 332793 354194 379278 408489 441706 477171 511083 538034 552531
56925 552531 551330 534967 507060 472312 435207 399513 367503 339332 313927 290747 270234 252750
56913 252750 237866 224822 213104 202495 193074 185162 178813 173485 168690 164757 162322 161263 160734
56900 160734 160158 159645 159717 161267 165411 172494 181419 190828 200828 212726 227245 244053 263088 285287
56886 285287 311528 341431 373301 404523 431786 451661 461776 461703 452976 438461 421246 403536
56874 403536 386546 371453 359797 352399 348612 347578 349879 357139 370368 389560 414589 445491
56862 445491 482039 524036 571913 625942 684423 742818 794273 830757 845168 834689 802848
56851 802848 757572 706859 656343 609722 569497 536846 511981 495228 487256 488346 498341 517457
56839E17457K8990L9536N0493O1612P1989Q0534Q7623R4220R7878R1587O9298
56828A291217L2532r833m7763p5110r0189r4381r0783q2667p2197o0642m9116
56817F51068l8217k7513j6453n501M574J4056K3841L3945M3437N1761N9102O5220
56805H59320O8307O4977N1666K7236m728l6656o1087p4506p7794p4182o7197n9242
56793F16114n0934m1936l2714k4621j8058j1847n078J666P720J3612J9898K5846
56781D99668L0569L4257L6866L6377L0006J7008m77j8682l3589m2311m4784m3680
56769E01228m1636l8929l4769k9726k5488k2742k0789j8914j6971j4899j2719
56758B23646j0831r495q302o844n461m599m051l486l063k916k743k589l013l778
$$ plain form
56839 517457 546447 585983 636476 698088 770077 850611 938234 1032454 1130332 1221919 1291217
56828 1291217 1323749 1313916 1266153 1191043 1100854 1006473 915690 833023 760826 700184 651068
56817 651068 612851 585338 568885 563384 567958 582014 605855 639800 683237 734998 794100 859320
56805 859320 927627 992604 1044270 1071506 1066778 1030122 969035 894529 816735 742553 675356 616114
56793 616114 565180 523244 490530 465909 447851 436004 430926 432592 440312 453924 473822 499668
56781 499668 530237 564494 601360 637737 667743 684751 684274 665592 632003 589692 544908 501228
56769 501228 459592 420663 385894 356168 330680 307938 287149 268235 251264 236365 223646
56758 223646 212815 203320 195018 188174 182713 178114 174063 170577 167514 164598 161855 159266 156253 152475
56744A52475l534j792o2J82m32m67K0K8l69k68L28N46J27l76o38o78l58K99O49
56725A45680K95j64p8K41L63P17J663K425K192J496J241J211Q15N59J220K210
56709A62086K361J839J760K236K267J508P92Q62J603K435K726K014N48o70r37
56694A83430n43j03P9l01j400k330j779j18O64j58r55n47n0n84j137n33K89P9
56676A74003l21L60J279R76J41L31J044O71m95q33k74n1j44M28J255J038J28K8
56658A79564O22M93j76K90J944K792J932P58N30Q17Q76P13K77p02j724j870j361
56641A85775j268j646j602j088r75j325j386j231j712k765l373l237k926k539
56627A58702j793j197j399j751j186j62J48M0O11J418J126J31M7Q30Q87L4k13
$$ plain form
56744 152475 148941 147149 147087 147269 146837 146370 146390 146418 146049 145781 146109 146655 146782 146406 145768 145090 144732 145031 145680
56725 145680 145975 145811 145733 145974 146337 147054 148717 151142 153334 154830 156071 157282 158097 158656 159876 162086
56709 162086 164447 166286 168046 170282 172549 174057 174849 175711 177314 179749 182475 184489 185037 184367 183430
56694 183430 182887 182784 182863 182562 181162 178832 177053 176935 177599 177441 176486 175939 175889 175305 174168 173635 173924 174003
56676 174003 173682 174042 175321 176297 176438 176769 177813 178484 177989 177156 176882 176831 176687 177115 178370 179408 179536 179564
56658 179564 180186 180679 180503 180793 182737 185529 187461 188219 188749 189566 190442 191155 191432 190730 189006 187136 185775
56641 185775 184507 182861 181259 180171 179196 177871 176485 175254 173542 170777 167404 164167 161241 158702
56627 158702 156909 155712 154313 152562 151376 151214 151362 151402 152013 153431 154557 154688 154735 155565 156452 156486 156273
56610A56273N87J255J449K146L299L470K350J321J084R84J002K042L657L973K608
56595A87500J326J111Q63j77j063j155j308j993k211j309j64M62J042J897K402
56580A87223K258J968J532L42j097j292j99N03J26o2P59J641J836K016K633L002
56564B03189L008L713N368O663O968P490R069J0692J1168J0553Q964N839J602
56551B94286j716k841k768k858k981k632k288k389k315j576q71j014j820k762
56537B63455l611l944l318k375k353l190l588l202l000l208k893j960j522j711
56523B23580j318j90K31n46j180r50q45j334j456j007j249k355k600j320k70o65
56507B06526j267r23n79j139j553r02l01q29j490j057j96P1L00J225K082K025
$$ plain form
56610 156273 156860 158115 159564 161710 165009 168479 170829 172150 173234 174218 175220 177262 180919 184892 187500
56595 187500 188826 189937 190800 190623 189560 188405 187097 185104 182893 181584 181420 181882 182924 184821 187223
56580 187223 189481 191449 192981 193323 192226 190934 190735 191238 191364 191302 192061 193702 195538 197554 200187 203189
56564 203189 206197 209910 215278 221941 228909 236399 245468 256160 267328 277881 286845 292684 294286
56551 294286 292570 289729 286961 284103 281122 278490 276202 273813 271498 269922 269051 268037 266217 263455
56537 263455 259844 255900 252582 250207 247854 244664 241076 237874 234874 231666 228773 226813 225291 223580
56523 223580 222262 222072 222303 221757 220577 219627 218782 217448 215992 214985 213736 211381 208781 207461 207191 206526
56507 206526 205259 204336 203757 202618 201065 200163 199862 199033 197543 196486 196290 196361 196661 197886 199968 201993
56491B01993J649J550J002l28j092m14M36K57O1J069K279K094R68L81M37L29R2
56474B12763J05l3o05q32k49K38k9k02L97R07O38M43R60J231O22K75Q85J068j26
56455B18456j071j85J191J009k3R9J141J299M80J94Q26J387J574J906K204J874
56439B32361J272J127J097M94k53l33JJ76O17J741K570J972M95n14q11q19m00
56422B40793M63P76m9q82m73N80R78O98L86j28j038j420n25P41J106P10K88j95
56404B42809p01l00J240K419K135J439J599K021J800J744K783L890L670K637J876
56389B71061R05r40k415k043p62m96j167j296p01l27k83j51l64j313k011j551
56373B56146p70p02o00M36J347R30M03J552L510M012K968K182K237K191J801J667
$$ plain form
56491 201993 203642 205192 206194 205866 204774 204360 204796 205053 205114 206183 208462 210556 211524 211905 212342 212671 212763
56474 212763 212868 212835 212230 211398 211149 211387 211358 211156 211553 212460 213098 213541 214501 215732 216354 216629 217514 218582 218456
56455 218456 217385 217200 218391 219400 219377 219476 220617 221916 222396 222590 223416 224803 226377 228283 230487 232361
56439 232361 233633 234760 235857 236351 236098 235765 235766 235942 236559 238300 240870 242842 243337 242823 242012 241193 240793
56422 240793 241256 242032 241983 241101 240628 241208 242186 242884 243270 243142 242104 240684 240159 240900 242006 242716 243004 242809
56404 242809 242108 241808 243048 245467 247602 249041 250640 252661 254461 256205 258988 262878 266548 269185 271061
56389 271061 271966 271026 268611 266568 265806 265310 264143 262847 262146 261819 261536 261385 261021 259708 257697 256146
56373 256146 255376 254674 254074 254510 255857 256787 257190 258742 262252 266264 269232 271414 273651 275842 277643 279310
56357B79310J582R38K47L50P15M04j07L0J87n27j208m98R49J461R62N78N80O65
56339B86618J230K340K606J212k59j08P52O16nL07R77O33p5L86J617K305K844
56322C03996M199N328M681L135K568K613J866J091K019L847M265L236K598K662
56308C48104K397K234L440N142N365M511M672N979O794P113Q414J0408J1092R941
56294D35606Q057N604K156q91j535n07j84n51M55K834M360M409M599N448N755
56279D75615N478O032P422Q161Q211R012J0433J0835J0243J0442J1705J2520J2731
56266E98840J3940J6468J8855K0650K2839K5404K7373K9327L2968L8016M2524
56255H87204M6372N1481N8457O6026P3858Q2944R2978J02352J10865J19617J28159
$$ plain form
56357 279310 280892 281830 282077 282427 283142 283546 283439 283469 283656 283129 281921 281423 282372 283833 284795 285373 285953 286618
56339 286618 287848 290188 292794 294006 293747 293639 294391 295007 295002 295309 296286 296919 296844 297230 298847 301152 303996
56322 303996 308195 313523 318204 321339 323907 326520 328386 329477 331496 335343 339608 342844 345442 348104
56308 348104 350501 352735 356175 361317 366682 371193 375865 381844 388638 395751 404165 414573 425665 435606
56294 435606 443663 449267 451423 450532 448997 448490 448306 447755 448210 451044 455404 459813 464412 469860 475615
56279 475615 481093 487125 494547 502708 510919 519931 530364 541199 551442 561884 573589 586109 598840
56266 598840 612780 629248 648103 668753 691592 716996 744369 773696 806664 844680 887204
56255 887204 933576 985057 1043514 1109540 1183398 1266342 1359320 1461672 1572537 1692154 1820313
56244A820313J34824J39727J44362J48154J48707J45435J39726J31440J18690
56235C071378J01368Q1559O0149L6299J0688j4003l6379n7162p6353r2510j05126
56224B979908j14938j21765j24896j25460j25441j24491j20871j15174j09819
56215A897053j05135r9431r2702q6707q1501p5667o9680o5334o1974n7237n1381
56204A050304m6903m3969m0331l5773l2384l0318k7526k3865k1186j9346j6494
56193G12209j3331j2389j2901j1423p956o285p450q043o165m082l500l029j850
56180F13805j401j905j488j08m4j362j347L92R31o17j402K1J504J710K112L120
56164F13921K880J485J776M305O143O183O841Q953R940Q955Q840J0937J2772J3038
$$ plain form
56244 1820313 1955137 2094864 2239226 2387380 2536087 2681522 2821248 2952688 3071378
56235 3071378 3172746 3254305 3314454 3350753 3361441 3347438 3311059 3253897 3177544 3085034 2979908
56224 2979908 2864970 2743205 2618309 2492849 2367408 2242917 2122046 2006872 1897053
56215 1897053 1791918 1692487 1599785 1513078 1431577 1355910 1286230 1220896 1158922 1101685 1050304
56204 1050304 1003401 959432 919101 883328 850944 820626 793100 769235 748049 728703 712209
56193 712209 698878 686489 673588 662165 654209 647924 640474 632431 626266 622184 618684 615655 613805
56180 613805 612404 610499 609011 608903 608859 607497 606150 606542 607473 606856 605454 605475 606979 608689 610801 613921
56164 613921 616801 618286 620062 624367 630510 636693 643534 652487 662427 671382 680222 691159 703931 716969
56150G16969J4092J7249K0340K2214K4991K9532L3368L5642L9597M7515N7329
56139A058838O6606P5770Q5202R3286R9438J04953J09015J08186J01566R2178
56129A995038Q1962P0237N8449N0863M8401M6898M3309L8486L2194K1529O749
56118B494115p141j7280k6095l5302m2881m8684n6905o9550q2904r3425j01681
56107A912267j07658j08229j02620r4706q6766p6627o3889n2769m5450l8808l1058
56096A103687k5243k2633j9327j3353q615p665o975l815j167j344j124J967M761
56083I99154M669M622O996Q778P614O591Q138R309P994P472R929J1757J0390R378
56069A112791J1514J3511J2695J2340J4924J6885J5608J4792J7213J9079J7421
$$ plain form
56150 716969 731061 748310 768650 790864 815855 845387 878755 914397 953994 1001509 1058838
56139 1058838 1125444 1201214 1286416 1379702 1479140 1584093 1693108 1801294 1902860 1995038
56129 1995038 2077000 2147237 2205686 2256549 2304950 2351848 2395157 2433643 2465837 2487366 2494115
56118 2494115 2486974 2469694 2443599 2408297 2365416 2316732 2259827 2190277 2107373 2013948 1912267
56107 1912267 1804609 1696380 1593760 1499054 1412288 1335661 1271772 1219003 1173553 1134745 1103687
56096 1103687 1078444 1055811 1036484 1023131 1014516 1006851 999876 996061 994894 993550 992426 994393 999154
56083 999154 1003823 1008445 1015441 1024219 1031833 1038424 1046562 1055871 1063865 1071337 1081266 1093023 1103413 1112791
56069 1112791 1124305 1137816 1150511 1162851 1177775 1194660 1210268 1225060 1242273 1261352 1278773
56058A278773J5988J7787J8923J6123J3216J3730J4282J1880J0397J2980J5441
56047A439520J4187J3287J6539K0071K0090K0269K4010K7151K6024K4870K7435
56036A673453K9410K7214K5786K9220L2342L0520K9002L3109L7947L7765L6794
56025B022562M0556M4955M4604M3443M6457M9419M7683M6386N0818N5648N5084
56014B547615N4490O0017O6216O6372O5586P0683P6713P6962P6662Q2885R0471
56003C334672R2291R3622J01682J10872J13641J15783J25319J36633J41802J46831
55993D513148J59725J73745J80109J85897K00962K18873K30000K41242K62649
55984F366350K87105L04354L22149L51495L84562M10415M38267M80762N29361
$$ plain form
56058 1278773 1294761 1312548 1331471 1347594 1360810 1374540 1388822 1400702 1411099 1424079 1439520
56047 1439520 1453707 1466994 1483533 1503604 1523694 1543963 1567973 1595124 1621148 1646018 1673453
56036 1673453 1702863 1730077 1755863 1785083 1817425 1847945 1876947 1910056 1948003 1985768 2022562
56025 2022562 2063118 2108073 2152677 2196120 2242577 2291996 2339679 2386065 2436883 2492531 2547615
56014 2547615 2602105 2662122 2728338 2794710 2860296 2930979 3007692 3084654 3161316 3244201 3334672
56003 3334672 3426963 3520585 3622267 3733139 3846780 3962563 4087882 4224515 4366317 4513148
55993 4513148 4672873 4846618 5026727 5212624 5413586 5632459 5862459 6103701 6366350
55984 6366350 6653455 6957809 7279958 7631453 8016015 8426430 8864697 9345459 9874820
55975I874820N72242O20429O88489P66599Q41625R27702J043758J180262J323405
55966A7839331J491706J710817J974717K274336K641215L117157L707464M416306
55958C9173049N299434O423391P806505R471019J1516674J4049507J7050120K0381383
55950A31171082K3885932K7411144L0853056L4298122L7851070M0796272M0871382
55943C67138060L5083871K2078293L916602j4744587k9454519l8172200m1321786
55936C04523734m0489098l7311925l3078948k8654579k4480655k0712121j7409959
55929A02386449j4602430j2246860j0257903q585357p210255o085681n144861
55922C8253102m355539l712538l188461k740584k355399k041143j785366j560405
$$ plain form
55975 9874820 10447062 11067491 11755980 12522579 13364204 14291906 15335664 16515926 17839331
55966 17839331 19331037 21041854 23016571 25290907 27932122 31049279 34756743 39173049
55958 39173049 44472483 50895874 58702379 68173398 79690072 93739579 110789699 131171082
55950 131171082 155057014 182468158 213321214 247619336 285470406 326266678 367138060
55943 367138060 402221931 424300224 428216826 413472239 384017720 345845520 304523734
55936 304523734 264034636 226722711 193643763 164989184 140508529 119796408 102386449
55929 102386449 87784019 75537159 65279256 56693899 49483644 43397963 38253102
55922 38253102 33897563 30185025 26996564 24255980 21900581 19859438 18074072 16513667
55914A6513667j361484j200907j072046r54222q45944p60164o92930o27504n63640
55905H434826n13801m75740m35934l95009l64157l41158l14244k84986k64263
55896E045534k50157k31929k11342j98543j91225j78559j61832j51065j45171
55887C325711j34843j21466j14122j11170j03299r1780q5705q3871p6993o5543
55877B336919n8487n6458n2681m8391n1064n8724o1796n9468n9275o1773o0285
55866A708517n4861n2086n1709m7316l9648l5818l5830l3109k7960k7463l2003
55855A270714l4440l2873l2345l3679l2245k8123k6411k7199k5794k2786k3239
55844I51580k6228k5743k1884k0591k2271k1324j7209j5475j7115j7012j3861
$$ plain form
55914 16513667 15152183 13951276 12879230 11925008 11079064 10318900 9625970 8998466 8434826
55905 8434826 7921025 7445285 7009351 6614342 6250185 5909027 5594783 5309797 5045534
55896 5045534 4795377 4563448 4352106 4153563 3962338 3783779 3621947 3470882 3325711
55887 3325711 3190868 3069402 2955280 2844110 2740811 2649031 2563326 2479455 2402462 2336919
55877 2336919 2278432 2221974 2169293 2120902 2069838 2011114 1949318 1889850 1830575 1768802 1708517
55866 1708517 1653656 1601570 1549861 1502545 1462897 1427079 1391249 1358140 1330180 1302717 1270714
55855 1270714 1236274 1203401 1171056 1137377 1105132 1077009 1050598 1023399 997605 974819 951580
55844 951580 925352 899609 877725 857134 834863 813539 796330 780855 763740 746728 732867
55833G32867j2152j3195j3281j1595j1310j2165j0441o753n597o926o515m588
55821F18349n579r186j0440q872r000j1325j1449q808p679q701p800m539l275
55808E11696m732m482j172J413J862L243O299P771O966P106Q849R093P230N966
55794E67108N181J764l623o577o586p764j0993j2372j0692r413r751q551m726
55781D83005j432k26Q00J842O00j938j283L445Q236J1437J6063K3413L0458L5112
55767F09532L7980L7304K8507J1272q257k4349l5800m2203m2190l7391l2541k9462
55755D72402k5700k0519j6863j5776j4410j1498r550r707r565p994p087p486o673
55742C09574l894j862j719j050J285L100L275L388L486J207l162n821n471n229
$$ plain form
55833 732867 720715 707520 694239 682644 671334 659169 648728 641975 636378 629452 622937 618349
55821 618349 612770 603584 593144 584272 575272 563947 552498 543690 536011 527310 519510 514971 511696
55808 511696 506964 502482 501310 502723 504585 507828 514127 521898 528864 535970 544819 553912 561142 567108
55794 567108 572289 574053 570430 563853 557267 549503 538510 526138 515446 506033 496282 487731 483005
55781 483005 481573 481347 482147 483989 484589 482651 481368 484813 493049 504486 520549 543962 574420 609532
55767 609532 647512 684816 713323 724595 716338 691989 656189 613986 571796 534405 501864 472402
55755 472402 446702 426183 409320 393544 379134 367636 358086 348379 338814 330820 323733 316247 309574
55742 309574 305680 303818 302099 301049 302334 305434 308709 312097 315583 316790 313628 307807 302336 297107
55728B97107o750p620o579o124p485q000o058m016l614l118j466p33j812j968
55714B31764N79L771N872Q327J1939J4357J4055J2822J1703Q594K633k984n654
55701C17778p096r581j1940j2366j1919j2107j1912j0041p624o110m966l525k596
55688B05995k326j269P12J556O29J01J123K017J926K645M852O164N163L881M000
55673B37169L955K266L55k89o94j747k157j360j302k877l809k461o65l04j94J046
55657B26932K136J815J509K553L516K941K041K142K092P85m33l95m81j885l170
55642B42098l132l268m762n796m787l570m382o057o376n831o016o358n557m405
55628A71801m157l886k258k76M03K58N10O70m5o64k40P2q46j705j058n5m43j599
$$ plain form
55728 297107 290357 282737 276158 270034 262549 254549 248491 244475 240861 237743 236277 235544 233732 231764
55714 231764 232343 236114 241986 250313 262252 276609 290664 303486 315189 323783 326416 323432 317778
55701 317778 310682 301101 289161 276795 264876 252769 240857 230816 223192 217082 212116 208591 205995
55688 205995 203669 202400 203112 204668 205297 205398 206521 208538 210464 213109 217961 224125 229288 233169 237169
55673 237169 241124 243390 243745 243456 242762 241015 238858 237498 236196 233319 229510 227049 226384 226080 225886 226932
55657 226932 229068 230883 232392 234945 238461 241402 243443 245585 247677 248462 248029 247634 247153 245268 242098
55642 242098 238966 235698 230936 225140 220353 216783 212401 206344 199968 194137 188121 181763 176206 171801
55628 171801 167644 163758 161500 161224 161627 161885 162395 163065 163020 162356 162116 162188 161342 159637 158579 158524 158081 156482
55610A56482k074k300l170l671k606j106q45j247r86o25j185j692q09M61L61o06
55594A34382q24m73o81r92k70Q33Q41N9r6M77R16J331K332L469M013M412N283
55577A55012N990N946O151P690R870J1563J3086J5062J6818J7716J8650K0288
55565C03842K1186J9564J5723J1037N969Q40l149n639q276j2129j5551j6669j6350
55552C00398j6443j6651j5647j3894j2835j2336j1310r853q602p036m576k297
55540A68918j400j126k96L88k52j362j343n33k89m63j09K97l42j549k119k297
55524A56123k965l626l425l140l915m873m413k978k255k353k138j648j792k196
55510A14406j672m51J86P5J2o4p33j521j539j137j186j369j000o64j146j626r50
$$ plain form
55610 156482 154408 152108 148938 145267 142661 141555 140710 139463 138477 137852 136667 134975 134166 134627 134988 134382
55594 134382 133558 133085 132404 131412 131142 131975 132816 132875 132779 133256 134172 135503 137835 141304 145317 149729 155012
55577 155012 161002 166948 173099 180789 190659 202222 215308 230370 247188 264904 283554 303842
55565 303842 325028 344592 360315 371352 377321 378161 375012 369373 361097 348968 333417 316748 300398
55552 300398 283955 267304 251657 237763 224928 212592 201282 191429 182827 175791 171215 168918
55540 168918 167518 166392 166096 166484 166232 164870 163527 162994 162705 162242 162133 162430 162088 160539 158420 156123
55524 156123 153158 149532 146107 142967 139052 134179 129766 126788 124533 122180 120042 118394 116602 114406
55510 114406 112734 112283 112469 112544 112556 112492 111759 110238 108699 107562 106376 105007 104007 103343 102197 100571 99621
55493I9621J78L65J6M30J224R61j93p40l24J31L44O83P97J49n65m04P0j82o81
55474A01880n16l67j269k225j541J74Q46K44j18O7k94j168j295o27m07p19l29
55457I2336Q18J290O60J98O31J112Q81L25mKN00J414J797Q41o35j116n22J07N00
55438A01135J102J534R67j71o49l74k51m11k80l8k44l49N92J954K157J049k8l50
55420A07345l18j14L77O15J21k01Q78K822M072M379M505M206K642M54p95j100
55404A29888j789k932l262k629k332k763k800j909j002p70q75j019j252j147k48
55389A03159O78M76l76l23P85J566J445J277J540J693J435J080N72l25j035r07
55373A12740o12j136j816j313j23O4p56r34q3L73k44r62j115j181j346j111n91
$$ plain form
55493 99621 99799 100164 100180 100610 101834 102795 102602 101862 101538 101669 102013 102696 103493 103642 103077 102673 102743 102561 101880
55474 101880 101364 100997 99728 97503 95962 96136 96982 97226 97108 97175 96881 95713 94418 93791 93384 92665 92336
55457 92336 93154 94444 95104 95302 95933 97045 97926 98251 98247 98249 98749 100163 101960 102801 102166 101050 100528 100635 101135
55438 101135 102237 103771 104738 104567 103918 103544 103293 102882 102602 102564 102320 101971 102563 104517 106674 107723 107695 107345
55420 107345 107027 106913 107290 107905 108026 107825 108703 111525 115597 119976 124481 128687 131329 131783 130988 129888
55404 129888 128099 125167 121905 119276 116944 114181 111381 109472 108470 107700 106825 105806 104554 103407 103159
55389 103159 103837 104313 103937 103614 104399 105965 107410 108687 110227 111920 113355 114435 115007 114682 113647 112740
55373 112740 112128 110992 109176 107863 107740 107804 107048 106114 106031 106404 106160 105198 104083 102902 101556 100445 99854
55356I9854n01p12n26k61o67j113m66N23J45j099r66P82J907J370O32O53M44m57
55338I9542p18K73J041M76m65p13p24r34n91N28J087L44m27RQ81R64N72O06Q63
55319A02614O71K12j1j36l87m19j4L76M13K98N7n10q96k28J101J591Q61K08M51
55300A06252P68L42m15r44j413j826j591o94M0L60Q57J484J425Q51J035K069K426
55283A11026J481N64N83N79k11q54n75l33j038j776j452p50q28j248q87Q5O99
55266A05065Q80J119J204O28k08m69j64J26L05O28R16P64K13l74q06r75p49k89
55248A07814Q1M42J046J530J241L66k97o37j134j539j162m72o88j596j618m92
55232A02885J07p11j599j198k9P88J111J043K83p77q67J83Q21K35l08K03O79l5
$$ plain form
55356 99854 99353 98641 98115 97854 97187 96074 95608 96131 96276 95177 94211 94993 96900 98270 98902 99555 99999 99542
55338 99542 98824 99097 100138 100614 100149 99436 98712 97778 97187 97715 98802 99146 98719 98728 99609 100573 101145 101751 102614
55319 102614 103285 103497 103486 103350 102963 102544 102530 102906 103319 103617 103674 103164 102268 102040 103141 104732 105593 105801 106252
55300 106252 107020 107362 106947 106003 104590 102764 101173 100479 100519 100879 101736 103220 104645 105496 106531 108600 111026
55283 111026 112507 113071 113654 114233 114022 113168 112593 112260 111222 109446 107994 107244 106416 105168 104281 104366 105065
55266 105065 105945 107064 108268 108896 108688 108219 108055 108181 108486 109114 110030 110794 111007 110633 109827 108852 108103 107814
55248 107814 107895 108337 109383 110913 112154 112520 112223 111586 110452 108913 107751 107279 106591 104995 103377 102885
55232 102885 102992 102281 100682 99484 99455 100243 101354 102397 102680 101903 101036 101219 102040 102275 101967 102170 102849 102814
55214A02814r24m78P71J248Q36N48N23J41m01l35K03M07K21K72O53Q35O17K78
55196A08229l3l69o94j002j313j359q81l67n66j157j000N5R40J179J401J700J224
55179A05987O7l19N62J240O68j87k63j70o08p86O2J081J307J299J713J712N66
55162A13931o29o52k51n81q56K40J866K051P56l42n89p86j182j149o95n05m85
55145A10142Q5J002J261O77M4j99k76k40j9l3n90j079q56m77p75j298j052k75
55127A06042ok55j56L44M60J31J70P81J227J010L76k78o00j82Q21J325O22l80
55109A11452l25O79J421J418J182J016Q51R24J444J805J333M81J61L22K84J08
55093A24556K89N92M37J39L11M90k17j345j494m69M68N39K71L15O63J151J593
$$ plain form
55214 102814 101890 101412 102183 103431 104267 104815 105338 105479 105078 104743 104946 105353 105574 105846 106499 107334 107951 108229
55196 108229 108196 107827 107133 106131 104818 103459 102578 102211 101645 100488 99488 99543 100483 101662 103063 104763 105987
55179 105987 106054 105735 106297 107537 108205 108018 107755 107585 106977 106191 106253 107334 108641 109940 111653 113365 113931
55162 113931 113302 112650 112399 111818 110962 111202 113068 115119 115875 115533 114944 114158 112976 111827 111132 110627 110142
55145 110142 110227 111229 112490 113167 113211 113012 112736 112496 112477 112444 111854 110775 109919 109442 108667 107369 106317 106042
55127 106042 106036 105781 105625 105969 106429 106560 106730 107511 108738 109748 110124 109846 109246 109064 109885 111210 111832 111452
55109 111452 111127 111806 113227 114645 115827 116843 117694 118618 120062 121867 123200 123681 123842 124164 124448 124556
55093 124556 124845 125437 125874 126013 126324 126814 126597 125252 123758 123289 123757 124296 124567 124882 125545 126696 128289
55076A28289J403K08j165j455o53Q7J64M9J51K83K99K65J6n94j082r20m86m05
55058A24454l73K50R68O38o88j646j401m26M90R61P75K3n44l43pn60j714k158
55040A18699j374q3R51J409R59l36j314q32M88R54K62k73RK08l85j141j267r00
55022A16034m30J83Q43R29J90o47o83J46J135J419N55r84k044k018j532j270p83
55005A11043N39J885J918Q81L20P59J262J317J571K268K525J799Q05L80M40O06
54989A30318Q95J245J249Q36M26J13m93j340j746j427q98n42j72K73M32K77K38
54972A29684M06L81J86L89J054J453J187O77L45Q3j42r8O0j90p91j018o15j25
54954A32926J25M54R32J061P43O09Q57P16k94j460j864j630j487j604j483p43
$$ plain form
55076 128289 129692 129900 128735 127280 126627 126714 126878 126927 127078 127361 127660 127925 127941 127347 126265 125345 124859 124454
55058 124454 124081 124331 125299 125937 125249 123603 122202 121776 122266 123227 124002 124025 123481 123138 123131 122571 120857 118699
55040 118699 117325 117242 118193 119602 120561 120225 118911 118079 118567 119521 119783 119510 119519 119727 119342 118201 116934 116034
55022 116034 115604 115787 116630 117559 117749 117102 116419 116565 117700 119119 119674 118690 116646 114628 113096 111826 111043
55005 111043 111582 113467 115385 116266 116586 117345 118607 119924 121495 123763 126288 128087 128892 129272 129712 130318
54989 130318 131213 132458 133707 134543 134969 135082 134589 133249 131503 130076 129178 128636 128464 128737 129169 129446 129684
54972 129684 130090 130471 130657 131046 132100 133553 134740 135417 135762 135845 135703 135605 135665 135475 134684 133666 133051 132926
54954 132926 133051 133505 134437 135498 136241 136850 137707 138423 138129 136669 134805 133175 131688 130084 128601 127858
54938A27858M25J401J623J171Q44J233J902K036J737J779K242K395K041J940K670
54923A53297L895N093O179P095P593P711P775P700O957N446L628J757l12k382
54909B21432l933n008o139p240p501o748n895n646n632n261m563l751k782j854
54895A49479j508j750j762j049k36j42o21q58m04N41J524K216K646L185L994M621
54879A59876M666M641N412O825P806P857P534P316O865N729L910J525j311m065
54865B24586n940o781p082p082o555n638m872m308l468k438j954k139k180j641
54851A62508j161j385k059k642k969k937k331j411r42j207j661j809j760j609
54837A36625j208p20o55r87j104q40o86p50m79K09N99L57J53N36J117J277R49
$$ plain form
54938 127858 128283 129684 131307 132478 133322 134555 136457 138493 140230 142009 144251 146646 148687 150627 153297
54923 153297 157192 162285 168464 175559 183152 190863 198638 206338 213295 218741 222369 224126 223814 221432
54909 221432 217499 212491 206352 199112 191611 184863 178968 173322 167690 162429 157866 154115 151333 149479
54895 149479 147971 146221 144459 143410 143174 143032 142411 141553 141149 141690 143214 145430 148076 151261 155255 159876
54879 159876 164542 169183 174595 181420 189226 197083 204617 211933 218798 224527 228437 229962 228651 224586
54865 224586 218646 211865 204783 197701 191146 185508 180636 176328 172860 170422 168468 166329 164149 162508
54851 162508 161347 159962 157903 155261 152292 149355 147024 145613 144671 143464 141803 139994 138234 136625
54837 136625 135417 134697 134042 133055 131951 131111 130425 129675 129196 129405 130004 130361 130514 131050 132167 133444 134393
54820A34393L40l15m77K72J303J439O64J67M62P14M08K71Q30J361J191Q73J153
54803A45049J739K017K090K175J886J005K02L5L9l73q56q37n42m61n04m76o97
54786A51491j271j447o38N39J058P44O2o43r98m14J108K586L240L334L309L007
54770A65067K551K960M744O734P574P624Q229R597J0723J0982J0532R454P671
54757B64442N549L554J401j512m967q026j0109j1240j1484j0916r948q954p804
54744A89986o366n114m515m193l455k319j292n64r5l2k96k54M12R45N93j12l5
54727A63294R63K162L290M573N752O288O448P046P954P980O481M185K142N96p77
54712B28377k171l634n220o773p764p680o602n327m778n077n260m383k791j694
$$ plain form
54820 134393 134733 134418 133941 134213 135516 136955 137619 137786 138248 138962 139370 139641 140471 141832 143023 143896 145049
54803 145049 146788 148805 150895 153070 154956 155961 156163 156198 156237 155864 155008 154171 153629 153168 152664 152188 151491
54786 151491 150220 148773 148135 148674 149732 150476 150538 149895 148897 148483 149591 152177 155417 158751 162060 165067
54770 165067 167618 170578 175322 182056 189630 197254 205483 215080 225803 236785 247317 256771 264442
54757 264442 269991 273545 274946 273434 268467 260441 250332 239092 227608 216692 206744 197790 189986
54744 189986 183620 178506 173991 169798 166343 164024 162732 162168 162073 162041 161745 161491 161903 162848 163441 163329 163294
54727 163294 164257 166419 169709 174282 180034 186322 192770 199816 207770 215750 222231 226416 228558 229154 228377
54712 228377 226206 222572 217352 210579 202815 195135 188533 183206 178428 173351 168091 163708 160917 159223
54698A59223j473j268n57r0o02j441j440o04qk91j037j545j489j083q88j306j928
54681A42173j901j133m76l95l10K05N39J32m50m02R9M68P63J188J256N12n07j032
54663A40729j242j668j988j554o11R8M93Q17P33o3p91m56N93J201J104Q25L10
54646A38530q87k188k270q66Q99J981K165J543M32k24L51J540K066J806J602J470
54630A47950N54j010j842j341n67n08q01p57n11m23l36j29j65n94q58n08J44N90
54612A38888P33N71l7q97j388j212p07k36J72L88J33m05n60n8O79J225J509J399
54594A40197P24j15l25K26Q76J138J116P88r5j175j504p82J90O84P93O98J60p02
54576A42892j041l44P60J363J281P74n5r36j186m95N29J115J187J005N22k32o84
$$ plain form
54698 159223 157750 156482 155925 155835 155233 153792 152352 151748 151740 151449 150412 148867 147378 146295 145407 144101 142173
54681 142173 140272 139139 138663 138268 137958 138163 138702 138834 138384 137982 138081 138549 139312 140500 141756 142268 141761 140729
54663 140729 139487 137819 135831 134277 133666 133764 134257 135074 135807 135744 134953 134497 135090 136291 137395 138220 138530
54646 138530 137643 135455 133185 132319 133218 135199 137364 138907 139339 139115 139466 141006 143072 144878 146480 147950
54630 147950 148504 147494 145652 144311 143744 143236 142435 141678 141167 140744 140408 140279 140114 139520 138662 138154 138298 138888
54612 138888 139621 140192 140155 139258 137870 136658 135951 135715 135887 136275 136408 136003 135443 135385 136064 137289 138798 140197
54594 140197 140921 140806 140481 140707 141583 142721 143837 144625 144530 143355 141851 141069 141259 141943 142736 143434 143594 142892
54576 142892 141851 141507 142267 143630 144911 145685 145630 144694 143508 143013 143542 144657 145844 146849 147371 147139 146455
54559A46455l59L48O82N05K08k7k42k65J10N86N89kp14j044p94m1Q67J370J192
54540A49424Q15J053K072L052K969J629j01j114j025l47J97K72j18q64j623j817
54524A54474j237m61k48o25r78q76l82K33N58J15r48j474m46J447K380J621L15
54507A53468k61k17l26o49o99m31k70l27l27j63o1j24j93j78k07l59m25j84K71
54488A48338O09O90P72J125J519J447Q59K42r7l74p31q16m38q1k20n11k93M44
54470A52484J212J828K322K386J770R51O37P43P04N88R17J490J435N54l32n68
54454A69121m10k98l06m84r73j556j769j666j735k008k014j696j433j120k03J108
54438A52558J796J513J031Q09K96p28j288o05N71J031P73N79N87K92k90n21q8
$$ plain form
54559 146455 146096 146444 147126 147631 147839 147812 147570 147305 147415 148001 148590 148588 147874 146830 146036 145995 146862 148232 149424
54540 149424 150239 151292 153364 156416 159385 161014 160913 159799 158774 158427 158624 158896 158778 157914 156291 154474
54524 154474 153237 152776 152528 151903 150925 150049 149667 149900 150458 150573 149625 148151 147705 149152 151532 153153 153468
54507 153468 153207 152990 152664 152015 151316 150885 150615 150288 149961 149798 149737 149613 149420 149242 149035 148676 148251 148067 148338
54488 148338 148947 149637 150409 151534 153053 154500 155359 155601 155504 155130 154399 153583 153145 153064 152844 152333 152040 152484
54470 152484 153696 155524 157846 160232 162002 162953 163590 164333 165037 165625 166542 168032 169467 170021 169689 169121
54454 169121 168711 168413 168107 167623 166650 165094 163325 161659 159924 157916 155902 154206 152773 151653 151450 152558
54438 152558 154354 155867 156898 157707 158003 157275 155987 155382 155953 156984 157757 158336 158923 159215 158925 158404 158316
54421A58316O78J324J528J099K45l58k70J46L19K69K76K12j88n83l89K93P96Q34
54403A64547P34P03N04O2j64L40J440K394K504J672M50m29n99j84M95J116J354
54386A76939J037M35J10K91O26O16J46n39j149j525j655j604j323o86K34J018
54370A72971J319J260J139J032R95J297J923K212J701J015J104J823K252K282
54356A94325K717L652L963K884J083l46j109j435j438j423k014l276m307m318
54342A88958l615k876k172j373q84j087j473j223m37J8k20o42p10m29m7L24N92
54325A72704N84K39k07l24J67R95J409R30jn61n67n04n46l37J19J84m45j182j370
54306A71287j090p65n16m11o80j237j449r80l48r2Q4P07J494J617Q89Pk56K20
$$ plain form
54421 158316 158994 160318 161846 162945 163190 162832 162562 162708 163027 163296 163572 163784 163596 163013 162624 162917 163713 164547
54403 164547 165281 165984 166488 166550 166386 166726 168166 170560 173064 174736 175186 174757 174158 173974 174469 175585 176939
54386 176939 177976 178411 178521 178812 179438 180054 180200 179661 178512 176987 175332 173728 172405 171719 171953 172971
54370 172971 174290 175550 176689 177721 178716 180013 181936 184148 185849 186864 187968 189791 192043 194325
54356 194325 197042 200694 204657 207541 208624 208278 207169 205734 204296 202873 200859 197583 193276 188958
54342 188958 185343 182467 180295 178922 178038 176951 175478 174255 173818 173836 173616 172974 172264 171835 171788 172112 172704
54325 172704 173288 173527 173320 172996 173163 174158 175567 176497 176496 175935 175368 174864 174318 173981 174100 174284 173839 172657 171287
54306 171287 170197 169432 168916 168505 167825 166588 165139 164159 163811 163719 163803 164510 166004 167621 168510 168517 168261 168481
54288A68481R58J328J081N80L51L85K43j21k18J93P26R96J019Q23L23k19k95J9
54270A76653J0n42r52o76k4N67J102J487J379R93J103J644J513M94K9J047K224
54253A88051J890O47L72J234J581O02o66j168j120j085j035q53q52j217j603j612
54237A83166j223n81Q6K94l15j322j848j542q01m9N69Q45N80Q0q3J45K72Q4m6
54218A78311K43Q56J410J557J164N28K66N61P93L23n88j240j514j754j913j661
54202A77342j159r57j080r73m19J89N18N60L43j03m44l50p0m5o6M00J143J265
54184A76094M91l89o14k99K9J79K57L70N87R02J130J172J249J531J661J232N21
54167A86103J57J25j17o62j054j188j412j639j196O5J264J506Q43k6n24m05J76
$$ plain form
54288 168481 169439 170767 171848 172428 172779 173164 173407 173286 173068 173261 173987 174983 176002 176825 177148 176929 176634 176653
54270 176653 176663 176121 175169 174493 174469 175036 176138 177625 179004 179997 181100 182744 184257 184751 184780 185827 188051
54253 188051 189941 190588 190960 192194 193775 194377 193711 192543 191423 190338 189303 188450 187598 186381 184778 183166
54237 183166 181943 181362 181448 181742 181427 180105 178257 176715 175914 175865 176434 177279 177859 177939 177856 178001 178273 178357 178311
54218 178311 178554 179410 180820 182377 183541 184069 184335 184896 185689 186012 185424 184184 182670 180916 179003 177342
54202 177342 176183 175226 174146 173173 172754 172943 173461 174021 174364 174261 173817 173467 173397 173352 173286 173686 174829 176094
54184 176094 176585 176196 175582 175283 175312 175491 175748 176118 176705 177607 178737 179909 181158 182689 184350 185582 186103
54167 186103 186260 186385 186268 185606 184552 183364 181952 180313 179117 179182 180446 181952 182795 182769 182245 181840 182016
54150A82016N75J67p45j129n67J51J55l51n38j33M18P41R16J130J263J028M04
54133A85501j67j79K94N81K40l82p28p64p16m29L50J209J456J123R08J061J095
54116A90453P12K29p7l47n21j65P48J411J130K10m56l91K34R95J478J400Q29J73
54098A98045j77m6O32J723K685K921K533K301K721L441L824L721L437L242L079
54083B34082K591J378n13k392l519l821l723l416k802k095j742j695j372n10M91
54068B10942J219J628J646J083J45n12o08o04r17j301j266p30J26J129K025K484
54052B16489K483K308K076J725J616K326L576M133L394K347K276L092L696L555
54038B55092L106K784K592K588L070M057N106N764N910N659N230M950N022N231
$$ plain form
54150 182016 182591 182758 182013 180884 180317 180468 180623 180272 179734 179601 180019 180760 181676 182806 184069 185097 185501
54133 185501 185334 185155 185449 186030 186270 185888 185160 184396 183680 183251 183601 184810 186266 187389 188297 189358 190453
54116 190453 191165 191394 191317 190970 190449 190284 191032 192443 193573 193783 193327 192936 193170 194165 195643 197043 197872 198045
54098 198045 197868 197822 198454 200177 202862 205783 208316 210617 213338 216779 220603 224324 227761 231003 234082
54083 234082 236673 238051 237538 235146 231627 227806 224083 220667 217865 215770 214028 212333 210961 210451 210942
54068 210942 212161 213789 215435 216518 216663 216151 215543 214939 214022 212721 211455 210725 210851 211980 214005 216489
54052 216489 218972 221280 223356 225081 226697 229023 232599 236732 240126 242473 244749 247841 251537 255092
54038 255092 258198 260982 263574 266162 269232 273289 278395 284159 290069 295728 300958 305908 310930 316161
54024C16161N085M246K747J004l07n83Q2Q02Q13L08K8J35k1j010k569l905m403
54007C18613m068l463l356m030m875m979m245l578l686m090l844l004k687l508
53993B65200m582m612l561k534k207k100j598r16n96o02n54n76j149k135k607
53978B34871j904m98N53P37M65L08K38j94r62j309o44N17J090P81L45M36R06J467
53960B37203K256L218L632L022K063J811K350K951L276L621M145M698N345O317
53946B85908P420Q211Q774R722J1283J2981J4178J4379J3078J0037N790J365k546
53933D00580n667p615q065p452o679o071n218l971k799k005j310m27N91J682K924
53918C48498M141M972N423N834O246O417O466O779P244P348P046O798O666O192
$$ plain form
54024 316161 321246 325492 328239 329243 328936 328353 328435 329237 330050 330358 330386 330521 330500 329490 326921 323016 318613
54007 318613 314545 311082 307726 303696 298821 293842 289597 286019 282333 278243 274399 271395 268708 265200
53993 265200 260618 256006 252445 249911 247704 245604 244006 243090 242494 241892 241338 240762 239613 237478 234871
53978 234871 232967 232469 233022 233759 234224 234532 234770 234576 233614 232305 231661 232178 233268 234049 234394 234830 235736 237203
53960 237203 239459 242677 246309 249331 251394 253205 255555 258506 261782 265403 269548 274246 279591 285908
53946 285908 293328 301539 310313 320035 331318 344299 358477 372856 385934 395971 401761 403126 400580
53933 400580 394913 387298 379233 371781 365102 359031 353813 349842 347043 345038 343728 343301 343892 345574 348498
53918 348498 352639 357611 363034 368868 375114 381531 387997 394776 402020 409368 416414 423212 429878 436070
53904D36070N227M019K528N98j147j787j624j936k943l462l049l004m314n949
53890D19227o402n839n490n735o098o505p273q129q407q001p301o492n668n219
53876C26668n260n103m178l057k698l042l299l269l347l490l253k718k470k644
53862B78840k927l237l583l475k528j497j535k470k964k456j793j685j744j514
53848B45432j309j384j301p68l35m34n23L0P11N42m45j273j424j257j111q46m67
53831B33838l37m58k11O64J391J057o7p64l75N92J316J506J215M92l28n12K36
53814B39255J193J480J263J399K022K385K154J963K304K744K760K693L146L932
53800B70693M352M335M536N329O312O899O904O440N624M645L899L753M151M537
$$ plain form
53904 436070 441297 445316 447844 448442 447295 445508 443884 441948 439005 435543 432494 429490 425176 419227
53890 419227 412825 406986 401496 395761 389663 383158 375885 367756 359349 351348 344047 337555 331887 326668
53876 326668 321408 316305 312127 309070 306372 303330 300031 296762 293415 289925 286672 283954 281484 278840
53862 278840 275913 272676 269093 265618 263090 261593 260058 257588 254624 252168 250375 248690 246946 245432
53848 245432 244123 242739 241438 240670 240335 239901 239378 239408 240119 240661 240216 238943 237519 236262 235151 234305 233838
53831 233838 233501 233043 232832 233496 234887 235944 235877 235113 234738 235330 236646 238152 239367 239859 239531 239019 239255
53814 239255 240448 241928 243191 244590 246612 248997 251151 253114 255418 258162 260922 263615 266761 270693
53800 270693 275045 279380 283916 289245 295557 302456 309360 315800 321424 326069 329968 333721 337872 342409
53786C42409M304L364K216J409J037Q32N58L6r67k401l597l835l295k966l472
53771C35632m446n171n348n076m568m088l832l702l546l583m121m878n197m988
53757B73088m694m314l382k087j450j897k566k610k267k070j848j326r56j133
53743B40488j244m09J123K212K175J244P4n92k57O22P66k82j245p53O92J444R63
53726B47021J34l39n21l60M67J587K026J598J184J361J701J782J912K299K425
53711B64277J932J480J934L097L912L805L211K865K960L127K947K381J734J341
53697C01003J383J932K933M038M783N048N027M703L802K492J459R17K10j059k114
53682C36557k046j230p66r28j179j406j958k528k196q94K11K14m69r18q65n99
$$ plain form
53786 342409 346713 350077 352293 353702 354739 355571 356129 356165 355198 352797 349200 345365 342070 339104 335632
53771 335632 331186 326015 320667 315591 311023 306935 303103 299401 295855 292272 288151 283273 278076 273088
53757 273088 268394 264080 260698 258611 257161 255264 252698 250088 247821 245751 243903 242577 241621 240488
53743 240488 239244 238835 239958 242170 244345 245589 245663 245071 244814 245436 246202 245920 244675 243922 244614 246058 247021
53726 247021 247155 246816 246295 245935 246402 247989 250015 251613 252797 254158 255859 257641 259553 261852 264277
53711 264277 266209 267689 269623 272720 276632 280437 283648 286513 289473 292600 295547 297928 299662 301003
53697 301003 302386 304318 307251 311289 316072 321120 326147 330850 334652 337144 338603 339520 339730 338671 336557
53682 336557 334511 333281 332515 331587 330408 329002 327044 324516 322320 321426 321637 321851 321382 320464 319599 319000
53666C19000l26j37k05o11j162j568j602j082j35O10N64n1m75m88n40q21q67l99
53648C09705J36K39P3J36N70J146J621J792J486Q42M36Q48K053L327L717K865
53632C30992J488Q19J284K007J988J426J232J592J829J681J780K644L863M704
53618C59329M981N016N142N515O141O744O910O482N770N263N248N591N784N373
53604D39289M532L927L717L228K011P53L96P60Q99M90J9k86o96j206j431j380
53588D55022j502j826j895j646j545j717j750j506j346j398j397j379j689k175
53574D32251k281k077k245k825l005k421j656j110m52L19M44l59j172j163p12
53559D11536n04m06m6L27M16N84J065J184L88n81n83K43P92O73N12P36J057J299
$$ plain form
53666 319000 318674 318537 318332 317721 316559 314991 313389 312307 312172 312782 313346 313295 312820 312332 311792 310971 310104 309705
53648 309705 309841 310080 310153 310289 310859 312005 313626 315418 316904 317746 318182 319030 321083 324410 328127 330992
53632 330992 332480 333299 334583 336590 338578 340004 341236 342828 344657 346338 348118 350762 354625 359329
53618 359329 364310 369326 374468 379983 386124 392868 399778 406260 412030 417293 422541 428132 433916 439289
53604 439289 443821 447748 451465 454693 456704 457457 457853 458613 459512 460002 460021 459735 459039 457833 456402 455022
53588 455022 453520 451694 449799 448153 446608 444891 443141 441635 440289 438891 437494 436115 434426 432251
53574 432251 429970 427893 425648 422823 419818 417397 415741 414631 414179 414498 414942 414583 413411 412248 411536
53559 411536 411032 410626 410580 410907 411323 411907 412972 414156 414544 413963 413380 413623 414415 415088 415600 416336 417393 418692
53541D18692J833K973M360N153M665K994J329J197K964N360O929P545Q047Q912
53527D82953R966J1085J2273J3238J3535J3201J2740J2566J2905J3946J5544J6935
53515F40887J7382J7111J7179J8377K0614K3128K4981K5605K5360K5347K6214
53504H82185K7333K7580K6711K5448K4518K4056K3800K3286K2100K0410J9046
53493A146473J8534J8422J8080J7739J7972J8491J8485J8033J8115J9033J9824
53482A349201J9582J8597J7717J7241J6893J6467J5932J5186J4090J2554J0425
53471A523885P568M282J356o69k077l569n470p589r723j1943j4219j6162j7322
53458A448348j7682j7624j7444j7203j7169j7976j9866k2025k3232k3203k2659
$$ plain form
53541 418692 420525 423498 427858 433011 437676 440670 441999 443196 446160 451520 458449 465994 474041 482953
53527 482953 492919 504004 516277 529515 543050 556251 568991 581557 594462 608408 623952 640887
53515 640887 658269 675380 692559 710936 731550 754678 779659 805264 830624 855971 882185
53504 882185 909518 937098 963809 989257 1013775 1037831 1061631 1084917 1107017 1127427 1146473
53493 1146473 1165007 1183429 1201509 1219248 1237220 1255711 1274196 1292229 1310344 1329377 1349201
53482 1349201 1368783 1387380 1405097 1422338 1439231 1455698 1471630 1486816 1500906 1513460 1523885
53471 1523885 1531453 1535735 1537091 1536422 1534345 1530776 1525306 1517717 1507994 1496051 1481832 1465670 1448348
53458 1448348 1430666 1413042 1395598 1378395 1361226 1343250 1323384 1301359 1278127 1254924 1232265
53447A232265k2124k1383k0406j9872k0089k0143j8976j6896j5067j3759j2065
53436A031485r435o492m141k559j480q34o27n72k32O64K230M427O805Q558R265
53421A037062R445J0104J1701J3803J5727J7317J8966K0982K3107K4775K5801
53410A228790K6671K8080L0272L2823L5028L6434L7190L7873L8982M0548M2336
53399A615027M4277M6491M8929N1324N3458N5173N6206N6427N6321N6691N7685
53388B198009N8542N8542N7768N6669N5362N3720N1791M9700M7406M4872M2228
53377B774609L9436L6141L2146K7678K2878J7456J1251M790j171o343j0869j5143
53365B932859k0033k6541l4484m2086m7702n1493n4572n7041n8069n7600n6654
$$ plain form
53447 1232265 1210141 1188758 1168352 1148480 1128391 1108248 1089272 1072376 1057309 1043550 1031485
53436 1031485 1022050 1015558 1011417 1008858 1007378 1006544 1005917 1005345 1005113 1005777 1008007 1012434 1019239 1027797 1037062
53421 1037062 1046507 1056611 1068312 1082115 1097842 1115159 1134125 1155107 1178214 1202989 1228790
53410 1228790 1255461 1283541 1313813 1346636 1381664 1418098 1455288 1493161 1532143 1572691 1615027
53399 1615027 1659304 1705795 1754724 1806048 1859506 1914679 1970885 2027312 2083633 2140324 2198009
53388 2198009 2256551 2315093 2372861 2429530 2484892 2538612 2590403 2640103 2687509 2732381 2774609
53377 2774609 2814045 2850186 2882332 2910010 2932888 2950344 2961595 2966385 2965214 2958871 2948002 2932859
53365 2932859 2912826 2886285 2851801 2809715 2762013 2710520 2655948 2598907 2540838 2483238 2426584
53354B426584n5859n4912n3704n2767n2176n1032m8716m5799m3204m1221l9995
53343A887199m0067m1521m3141m3408m2159m0397l8645l6378l3163k9599k6690
53332A472031k4813k3570k2391k0929j9147j7292j5810j5012j4790j4700j4389
53321A269188j3877j3438j3267j3256j3089j2483j1364r858q149o367m626l080
53309A146334j760l80J458L664N544O556P045P771Q954J0260J1663J3573J5993
53296A236675J8300K0182K2075K4198K5935K6776K7335K8481K9908L0538L0065
53285A520468K9189K8263K6719K4047K0665J7456J4985J3246J1667R261N424P97
53273A722187l224o052q377j0935j3493j5514j7078j8615k0189k1709k3494k5872
$$ plain form
53354 2426584 2370725 2315813 2262109 2209342 2157166 2106134 2057418 2011619 1968415 1927194 1887199
53343 1887199 1847132 1805611 1762470 1719062 1676903 1636506 1597861 1561483 1528320 1498721 1472031
53332 1472031 1447218 1423648 1401257 1380328 1361181 1343889 1328079 1313067 1298277 1283577 1269188
53321 1269188 1255311 1241873 1228606 1215350 1202261 1189778 1178414 1168556 1160407 1154040 1149414 1146334
53309 1146334 1144574 1144194 1145652 1149316 1154860 1161416 1168461 1176232 1185186 1195446 1207109 1220682 1236675
53296 1236675 1254975 1275157 1297232 1321430 1347365 1374141 1401476 1429957 1459865 1490403 1520468
53285 1520468 1549657 1577920 1604639 1628686 1649351 1666807 1681792 1695038 1706705 1715966 1721390 1722187
53273 1722187 1718963 1712911 1704534 1693599 1680106 1664592 1647514 1628899 1608710 1587001 1563507 1537635
53261A537635k8384l0040l0438l0089k9612k9137k8669k8535k9014k9760k9961
53250A213996k9236k8109k7443k7464k7549k7029k6071k5484k5674k6036k5643
53239I18258k4352k2973k2251k2008k1522k0583j9681j9092j8239j6467j4122
53228F96968j2260j1264j0439r209q046p665p866p892p741q249r762j1449j2311
53215E72815j2427j2689j3497j4224j4045j2917j1504j0342r404q491p688p209
53203D38378p019o945o966p090p074o681o141n878n866n746n598n822o219n946
53189C49387m825l827l791m246m179l413k534j908j531j484j807k148k205k299
53175C09190k807l380l427l083k798k368j379m32o52j860k513j876j063j264j949
$$ plain form
53261 1537635 1509251 1479211 1448773 1418684 1389072 1359935 1331266 1302731 1273717 1243957 1213996
53250 1213996 1184760 1156651 1129208 1101744 1074195 1047166 1021095 995611 969937 943901 918258
53239 918258 893906 870933 848682 826674 805152 784569 764888 745796 727557 711090 696968
53228 696968 684708 673444 663005 653796 645750 638085 630219 622327 614586 606337 596575 585126 572815
53215 572815 560388 547699 534202 519978 505933 493016 481512 471170 461766 453275 445587 438378
53203 438378 431359 424414 417448 410358 403284 396603 390462 384584 378718 372972 367374 361552 355333 349387
53189 349387 344562 340735 336944 332698 328519 325106 322572 320664 319133 317649 315842 313694 311489 309190
53175 309190 306383 303003 299576 296493 293695 291327 289948 289516 288864 287004 284491 282615 281552 280288 278339
53160B78339j798p18J46J21k37j48L66P40O51K00m11j086j670j815j281l32L99
53143B71466N53L46J16j20m28o15m85k22j37k03k28j96p4L94J150J436P06l22
53125B73137m05N42J368J351R98R62J094J011Q19P66P51O88Q82J493K057K078
53109B89592J748J540J347O48n98j708k014j562j000r18j330j765j844j700j699
53094B78737j920k084j945j492q87m54n06r30j135p79k82j65k05Q2M08N6q27j214
53076B64458o34K62P51Q81Q94O60J60j49LK29R8k30m61p00j104j386j232q13m65
53057B61222j90J04K04j19o00o57QJ159K162K329J512M54J28N90R78P69L80L34
53039B70767M73M29K30J2l60r05j261j223j092j127j137r41o87l18N26J621J945
$$ plain form
53160 278339 276541 275823 275969 276090 275853 275705 276071 276811 277462 277662 277251 276165 274495 272680 271399 271067 271466
53143 271466 272019 272365 272481 272361 271933 271318 270833 270611 270474 270271 270043 269847 269773 270167 271317 272753 273459 273137
53125 273137 272732 273274 274642 275993 276991 277953 279047 280058 280877 281643 282394 283082 283964 285457 287514 289592
53109 289592 291340 292880 294227 294875 294277 292569 290555 288993 287993 287075 285745 283980 282136 280436 278737
53094 278737 276817 274733 272788 271296 270409 269955 269449 268519 267384 266605 266323 266158 265953 266035 266443 266499 265672 264458
53076 264458 263824 264086 264837 265718 266612 267272 267432 267283 267286 267515 267613 267383 266922 266222 265118 263732 262500 261687 261222
53057 261222 261032 261136 261340 261221 260621 259964 259972 261131 263293 265622 267134 267588 267716 268306 269284 270053 270433 270767
53039 270767 271240 271669 271899 271911 271551 270646 269385 268162 267070 265943 264806 263865 263178 262860 263386 265007 266952
53022B66952J039o6j30O84J278J192P51J25p31j347j049n5O13M24j29l76j83L00
53004B69292R33J498J767J739J502R44O3o11n30L0K64j8k17K3K59Rm62n11J20
52985B76094J103J876K061J741J406J460J712J604R52J84j56L5M57P60Q28Q37
52969B92954J007J262J276R89Q18J112J643J927J888J777J652J285O06r4n04o00
52953C08998o64j047j807k538k748k460k092j769j158k43L17j6r15j671j977j952
52937B86258j721j451j336j150l12J158K231K069J087J88n46j472k222k034j052
52922B79695k65r8m1K75N20L27l02j299k461k996k116k93R80R99N83O49R30P10
52904B75797R6k05N3N06P54O19Q6n42p03k16L67M02l4l50k75p7q1l09n98p86p82
$$ plain form
53022 266952 267991 267925 267795 268479 269757 270949 271700 271825 271094 269747 268698 268643 269256 269680 269551 269175 268992 269292
53004 269292 270225 271723 273490 275229 276731 277675 277738 277127 276597 276627 276891 276873 276656 276679 276938 276947 276485 275974 276094
52985 276094 277197 279073 281134 282875 284281 285741 287453 289057 290009 290193 290037 290072 290529 291289 292117 292954
52969 292954 293961 295223 296499 297488 298306 299418 301061 302988 304876 306653 308305 309590 310196 310102 309598 308998
52953 308998 308334 307287 305480 302942 300194 297734 295642 293873 292715 292472 292789 292773 291858 290187 288210 286258
52937 286258 284537 283086 281750 280600 280288 281446 283677 285746 286833 287021 286475 285003 282781 280747 279695
52922 279695 279430 279332 279291 279566 280086 280413 280111 278812 276351 273355 271239 270946 271926 272925 273508 274157 275087 275797
52904 275797 275893 275688 275741 276247 277001 277620 277706 277164 276461 276245 276612 277014 276980 276630 276355 276278 276197 275888 275290 274504 273722
52883B73722n90l63l06m87p43p50l68J29K97J27J26O14J266J664J975K567L301
52866B82181L733L844L881L628K650J249L41J85O8n30j226j608j994k732l359
52851B90311l249k669k463k791k964k514j865j717k129k477k233j555j048j014
52837B59623j179j209j222j516j909j865j205l43L36Q90J561K330K875K740J679
52822B61586J27q85p73k08k78r67j267p55j40L0J85P80J350J310R91J131J773
52805B63990K361K607K500J825M33j158k163k467k572k763k883k826k632k127
52791B52125j192k57P6n1J30Q58J467J370Q40M91M85N89O53O72O31N76O38P69
52773B60870P35N02L67L95J50n89j210r37k1M18j87j116j370q81l66k86m87o80
$$ plain form
52883 273722 273132 272769 272463 271976 271233 270483 270115 270244 270541 270668 270794 271408 272674 274338 276313 278880 282181
52866 282181 285914 289758 293639 297267 299917 301166 301507 301692 301760 301230 300004 298396 296402 293670 290311
52851 290311 287062 284393 281930 279139 276175 273661 271796 270079 267950 265473 263240 261685 260637 259623
52837 259623 258444 257235 256013 254497 252588 250723 249518 249175 249511 250401 251962 254292 257167 259907 261586
52822 261586 261713 260828 260055 259847 259569 258602 257335 256580 256440 256470 256655 257435 258785 260095 261086 262217 263990
52805 263990 266351 268958 271458 273283 273716 272558 270395 267928 265356 262593 259710 256884 254252 252125
52791 252125 250933 250676 250752 250701 250831 251689 253156 254526 255366 255857 256342 256931 257584 258256 258887 259463 260101 260870
52773 260870 261605 262107 262474 262869 263019 262430 261220 260283 260262 260680 260493 259377 258007 257126 256760 256474 255987 255307
52755B55307p33m85J96J001J277P87P3k09J2M77J171K150L028L227K788K376K410
52738B74853K574K386J858J400J359J770K304K391J667M55m44n77j83L14P75J141
52722B94043J197Q68M21O0m24j253k135k553k434k172k010j743j083q5Q30J151
52706B82678O98j07o03n82m63n24m08L00J210J461Q15q6n43m80k00O0J71P7p5
52687B83399mL82R34J497J915J797Q30n35j297j134q95j398k217k344j659r50
52671B78321o05k35L34O49N28N73J179J756J573Q61L13j7m77p42r2J287K295K464
52653B89965K526L135L878M138M095M130L850K537L12j887l352l972l843l156
52639C02356k392j964j669j061k73J04p5l53m63o14q05n58L76J451J906J517N54
$$ plain form
52755 255307 254574 254089 254285 255286 256563 257350 257423 257214 257226 257703 258874 261024 264052 267279 270067 272443 274853
52738 274853 277427 279813 281671 283071 284430 286200 288504 290895 292562 293017 292573 291996 291813 292127 292902 294043
52722 294043 295240 296108 296529 296589 296165 294912 292777 290224 287790 285618 283608 281865 280782 280697 281527 282678
52706 282678 283376 283269 282666 282084 281621 281097 280689 280989 282199 283660 284475 284389 283846 283366 283166 283226 283397 283474 283399
52687 283399 283395 283777 284711 286208 288123 289920 290750 290215 288918 287784 286889 285491 283274 280930 279271 278321
52671 278321 277716 277481 277815 278464 278992 279565 280744 282500 284073 284934 285247 285230 284753 284011 283919 285206 287501 289965
52653 289965 292491 295626 299504 303642 307737 311867 315717 318254 318566 316679 313327 309355 305512 302356
52639 302356 299964 298000 296331 295270 294997 295101 295026 294673 294210 293596 292791 292233 292609 294060 295966 297483 298037
52622B98037o61j783k377k212j564r47o18n11m97n22m79j84M51J198J584J330
52606B90245P31L78L76K14l26n55K09J402J691P08m26n85P1O20O10K54j25k84
52588B95208L9P78J329J141M72R3K30L42P1j56K41J081J635J583J257Q72R0j264
52570C05042k465k571j667q13o78q72q68q35j059j154n69M97J264J319P91p9r63
52553B94320j323r70n25o13q42m37L79O22J16k87j33Q5Q7L19Q20P29l41j342j104
52534B89560P2J070J532J892K203K011J299O50M43N03N81O29O08M70L56M19N33
52517C04831N40O28J083J736K104K054J941K098K490K852K950K712K311K003J745
52502C34078J136p8j617k914l593l579l056k505k440k866l230l103k645k160j644
$$ plain form
52622 298037 297376 295593 293216 291004 289440 288493 287875 287364 286867 286345 285866 285682 286133 287331 288915 290245
52606 290245 290976 291354 291730 291944 291618 291063 291272 292674 294365 295073 294647 294062 294133 294753 295363 295617 295492 295208
52588 295208 295247 296025 297354 298495 298967 299060 299290 299632 299703 299547 299788 300869 302504 304087 305344 306216 306306 305042
52570 305042 302577 300006 298339 297526 296848 295976 295108 294273 293214 292060 291491 291988 293252 294571 295362 295283 294320
52553 294320 292997 292027 291502 290889 290047 289610 289989 290611 290727 290440 290307 290392 290479 290798 291618 292347 292006 290664 289560
52534 289560 289632 290702 292234 294126 296329 298340 299639 300289 300732 301235 301816 302445 303053 303523 303879 304298 304831
52517 304831 305371 305999 307082 308818 310922 312976 314917 317015 319505 322357 325307 328019 330330 332333 334078
52502 334078 335214 335136 333519 330605 327012 323433 320377 317872 315432 312566 309336 306233 303588 301428 299784
52487B99784j017m51p5K73O62Q07N31J89K39O70J214J765K208K247J873J630J915
52470C14464K326K248J790J549J692J880J929J954J989K014K214K694L069K790
52456C44602J855P02m53j704k977l958m487m621m494m290m263m335m056l269k503
52441C01749k217k074j535q02m11k62J31O39O80K49p8j48l58o99n77J85R68J231
52423B96671J120R47P11M03K54L45M47M47M41L73J04MP51K325L825M615N039N612
52405C24434O148O283O380P241Q950J0507J0631Q769N360J395k239n044o737p160
52391C74918o566n673n000m363l468k711k679l090k982j992p25K18Q40J231J255
52376C39213J039J129J805K687L333L700L825L687L577L996M826N229M649L399
$$ plain form
52487 299784 298767 298316 298241 298514 299176 299983 300514 300703 300942 301612 302826 304591 306799 309046 310919 312549 314464
52470 314464 316790 319038 320828 322377 324069 325949 327878 329832 331821 333835 336049 338743 341812 344602
52456 344602 346457 347159 346706 345002 342025 338067 333580 328959 324465 320175 315912 311577 307521 304252 301749
52441 301749 299532 297458 295923 295121 294710 294448 294579 295218 295898 296147 296069 295921 295563 294864 294287 294472 295440 296671
52423 296671 297791 298738 299449 299852 300106 300451 300898 301345 301786 302159 302263 302267 303018 305343 309168 313783 318822 324434
52405 324434 330582 336865 343245 350486 359436 369943 380574 389343 394703 396098 393859 388815 382078 374918
52391 374918 368352 362679 357679 353316 349848 347137 344458 341368 338386 336394 335669 335887 336727 337958 339213
52376 339213 340252 341381 343186 345873 349206 352906 356731 360418 363995 367991 372817 378046 382695 386094
52362C86094J983N26q27j634j763j648j514r99k7O88O07J68L4J50K69O93J602
52345C84402K263J923J137J091J854K344J978J366J272J790K714L910N019N573
52331D18636N677N981O821P927R145J0730J2654J4307J5245J5706J5956J5728
52319E54513J4824J3832J3565J4028J4538J4715J4806J5053J5358J5654J6172
52308G17058J7096J8207J9067J9365J8992J8082J7121J6699J6858J6889J6171
52297I11605J5013J4196J3761J2850J0887Q279N668L076L66k027l554m471n438
52284I80211o389o681o372o377p015p366o534m821l108j716n97M7J48M17J705
52269I25552L822N749O940P758Q678R667J0421J0725J0481R916R688J0395J1903
$$ plain form
52362 386094 388077 388603 387776 386142 384379 382731 381217 380218 380191 380879 381486 381654 381688 381838 382107 382800 384402
52345 384402 386665 388588 389725 390816 392670 395014 396992 398358 399630 401420 404134 408044 413063 418636
52331 418636 424313 430294 437115 445042 454187 464917 477571 491878 507123 522829 538785 554513
52319 554513 569337 583169 596734 610762 625300 640015 654821 669874 685232 700886 717058
52308 717058 734154 752361 771428 790793 809785 827867 844988 861687 878545 895434 911605
52297 911605 926618 940814 954575 967425 978312 986591 992259 995335 995701 993674 990120 985649 980211
52284 980211 973822 967141 960769 954392 947377 940011 933477 928656 925548 923832 923235 923282 923430 923847 925552
52269 925552 929374 935123 942063 949821 958499 968166 978587 989312 999793 1009709 1019397 1029792 1041695
52256A041695J3557J4914J5865J6253J6030J5673J5717J5821J5077J3303J1250
52245A205155R306O900L655L18k102l520m451n019n136n211n840o918p816q362
52231A170959q853r143q658p526o783p023p594p660p412p420p324o192m059k143
52217A073169j281r90m44L19P71R68J506K533L525M093M470N026N719O254O460
52202A112098O315N896N431N152M977M616M198M344N298O327O559O146O019O520
52188A189896O933O516N394M114K834J419l7j372k905n111p700r573j0015r522
52174A170871r152r302r542r396q779p709o131m197k404j168n02j79ML11J039
52159A103764K190L294L899L976L642K707J024q73k063k254k031j933j733r57
$$ plain form
52256 1041695 1055252 1070166 1086031 1102284 1118314 1133987 1149704 1165525 1180602 1193905 1205155
52245 1205155 1214461 1221361 1225016 1225334 1223232 1219712 1215261 1210242 1205106 1199895 1194055 1187137 1179321 1170959
52231 1170959 1162106 1152963 1144305 1136779 1129996 1122973 1115379 1107719 1100307 1092887 1085563 1079371 1075312 1073169
52217 1073169 1071888 1070898 1070454 1070773 1071544 1072512 1074018 1076551 1080076 1084169 1088639 1093665 1099384 1105638 1112098
52202 1112098 1118413 1124309 1129740 1134892 1139869 1144485 1148683 1153027 1158325 1164652 1171211 1177357 1183376 1189896
52188 1189896 1196829 1203345 1208739 1212853 1215687 1217106 1217069 1215697 1212792 1207681 1199981 1190408 1180393 1170871
52174 1170871 1161719 1152417 1142875 1133479 1124700 1116991 1110860 1106663 1104259 1103091 1102589 1102410 1102414 1102725 1103764
52159 1103764 1105954 1109248 1113147 1117123 1120765 1123472 1124496 1123623 1121560 1119306 1117275 1115342 1113609 1112652
52145A112652K90J387J948K096K070J901J496Q72J53n40j188j764k068j679l58
52130A117268J546L303M616N996Q121J0957J3797J6089J7913J9618K1328K2902
52118A263454K4167K4970K5172K4782K4054K3258K2356K1123J9538J7896J6435
52107A507205J5085J3724J2565J1981J2070J2526J2942J2980J2388J1174R778
52096A644418Q684P744O271L914J055j873m968q387j1692j4276j6096j7484j8316
$$ plain form
52145 1112652 1112942 1114329 1116277 1118373 1120443 1122344 1123840 1124712 1124865 1124325 1123137 1121373 1119305 1117626 1117268
52130 1117268 1118814 1122117 1126733 1132729 1140850 1151807 1165604 1181693 1199606 1219224 1240552 1263454
52118 1263454 1287621 1312591 1337763 1362545 1386599 1409857 1432213 1453336 1472874 1490770 1507205
52107 1507205 1522290 1536014 1548579 1560560 1572630 1585156 1598098 1611078 1623466 1634640 1644418
52096 1644418 1653102 1660846 1667117 1671031 1672086 1670213 1665245 1656858 1645166 1630890 1614794 1597310 1578994
$$ [...]
##END NTUPLES=NMR SPECTRUM
##END=
