##TITLE=AC1426_HONAH13238_7764444_YZCY4IfKzg
##JCAMPDX= 6.0         $$ Bruker NMR JCAMP-DX V2.0
##DATA TYPE= NMR SPECTRUM
##DATA CLASS= NTUPLES
##ORIGIN= BRUKER
##OWNER= Administrator
$$ 1.72 TOPSPIN		Version 2.1
$$ 2013-04-11 22:08:35.480 -0700  Administrator@X
$$ Compression mode = diff/dup
##.OBSERVE FREQUENCY= 400.02188249412
##.OBSERVE NUCLEUS= ^1H
##.ACQUISITION MODE= SIMULTANEOUS (DQD)
##.ACQUISITION SCHEME= undefined
##.AVERAGES= 8
##.DIGITISER RES= 22
##SPECTROMETER/DATA SYSTEM= spect
##.PULSE SEQUENCE= zg30
##.SOLVENT NAME= COFFEE_meoh
##.SHIFT REFERENCE= INTERNAL, COFFEE_meoh, 1, 14.98509
##AUDIT TRAIL= $$ (NUMBER, WHEN, WHO, WHERE, PROCESS, VERSION, WHAT)
$$ ##TITLE= Audit trail, TOPSPIN		Version 2.1
$$ ##JCAMPDX= 5.01
$$ ##ORIGIN= Bruker BioSpin GmbH
$$ ##OWNER= Administrator
$$ $$ E:\/data/COFFEE/nmr/AC1426_HONAH13238_7764444_YZCY4IfKzg/10/pdata/1/auditp.txt
$$ ##AUDIT TRAIL=  $$ (NUMBER, WHEN, WHO, WHERE, PROCESS, VERSION, WHAT)
(   1,<2013-04-11 22:08:27.199 -0700>,<Administrator>,<X>,<go>,<TOPSPIN 2.1>,
      <created by zg
	started at 2013-04-11 22:07:21.589 -0700,
	POWCHK enabled, PULCHK disabled,
       configuration hash MD5:
       33 CF 6A 21 5C D3 B9 40 6C 15 AA 8D 27 A2 4F 13
       data hash MD5: 64K
       D2 FA 60 07 D4 36 E2 D8 51 88 59 2F B0 0A 8B 6A>)
(   2,<2013-04-11 22:08:30.339 -0700>,<Administrator>,<X>,<proc1d>,<TOPSPIN 2.1>,
      <Start of raw data processing
       efp LB = 0 FT_mod = 6 PKNL = 1 PHC0 = 0 PHC1 = 0 SI = 32K 
       data hash MD5: 32K
       00 03 8F 28 46 57 6D A0 B0 46 D8 7E 9D 64 39 73>)
(   3,<2013-04-11 22:08:30.808 -0700>,<Administrator>,<X>,<proc1d>,<TOPSPIN 2.1>,
      <pk PHC0 = 97.8772 PHC1 = 0 
       data hash MD5: 32K
       71 A4 07 CD 61 E5 30 C7 A8 7E 71 2C 1A C9 DE 1F>)
(   4,<2013-04-11 22:08:31.042 -0700>,<Administrator>,<X>,<proc1d>,<TOPSPIN 2.1>,
      <abs ABSG = 1 
       data hash MD5: 32K
       A4 C3 EA 18 7A B7 C3 3E 75 0D F7 2F 4A AB AD 24>)
(   5,<2013-04-11 22:08:31.199 -0700>,<Administrator>,<X>,<proc1d>,<TOPSPIN 2.1>,
      <abs ABSG = 2 
       data hash MD5: 32K
       17 D2 07 C5 00 15 98 77 E2 C2 BF 57 AB 10 38 CF>)
(   6,<2013-04-11 22:08:31.355 -0700>,<Administrator>,<X>,<proc1d>,<TOPSPIN 2.1>,
      <abs ABSG = 3 
       data hash MD5: 32K
       5F 5B C2 9B B5 1A 7F 70 39 79 36 5D EB 6A 73 87>)
(   7,<2013-04-11 22:08:31.496 -0700>,<Administrator>,<X>,<proc1d>,<TOPSPIN 2.1>,
      <abs ABSG = 4 
       data hash MD5: 32K
       DA F5 D7 D1 8E 3D AF 1A 62 E7 D8 09 DA 43 22 8E>)
(   8,<2013-04-11 22:08:31.652 -0700>,<Administrator>,<X>,<proc1d>,<TOPSPIN 2.1>,
      <abs ABSG = 5 
       data hash MD5: 32K
       E6 AB A7 94 5F E2 50 07 D7 95 01 FA 23 B1 36 EE>)
$$ ##END=
$$ 
$$ $$ hash MD5
$$ $$ 09 0C 1F E0 72 E5 8C 16 DC B6 54 88 94 BF F6 D0
##$RELAX= 
##$RELAX= 
##$RELAX= 
##$RELAX= 
##$RELAX= 
##$RELAX= 
##$RELAX= 
$$ Bruker specific parameters
$$ --------------------------
##$DU= <E:\>
##$EXPNO= 10
##$NAME= <AC1426_HONAH13238_7764444_YZCY4IfKzg>
$$ [...]
150 150 150 150 150 150 150 150
##$TP07= 0
##$TPNAME0= <>
##$TPNAME1= <>
##$TPNAME2= <>
##$TPNAME3= <>
##$TPNAME4= <>
##$TPNAME5= <>
##$TPNAME6= <>
##$TPNAME7= <>
##$TPOAL= (0..7)
0.5 0.5 0.5 0.5 0.5 0.5 0.5 0.5
##$TPOFFS= (0..7)
0 0 0 0 0 0 0 0
##$TUNHIN= 0
##$TUNHOUT= 0
##$TUNXOUT= 0
##$USERA1= <user>
##$USERA2= <user>
##$USERA3= <user>
##$USERA4= <user>
##$USERA5= <user>
##$V9= 5
##$VALIST= <valist>
##$VCLIST= <CCCCCCCCCCCCCCC>
##$VD= 0
##$VDLIST= <DDDDDDDDDDDDDDD>
##$VPLIST= <PPPPPPPPPPPPPPP>
##$VTLIST= <TTTTTTTTTTTTTTT>
##$WBST= 2048
##$WBSW= 25
##$XGAIN= (0..3)
0 0 0 0
##$XL= 0
##$YL= 0
##$YMAX_a= 602595
##$YMIN_a= -513232
##$ZGOPTNS= <>
##$ZL1= 120
##$ZL2= 120
##$ZL3= 120
##$ZL4= 120
##$ABSF1= 14.98509
##$ABSF2= -5.573092
##$ABSG= 5
##$ABSL= 3
##$ALPHA= 0
##$AQORDER= 0
##$ASSFAC= 0
##$ASSFACI= 0
##$ASSFACX= 0
##$ASSWID= 0
##$AUNMP= <proc_prof1d_extract_pilot.lims>
##$AXLEFT= 0
##$AXNAME= <>
##$AXNUC= <1H>
##$AXRIGHT= 0
##$AXTYPE= 0
##$AXUNIT= <>
##$AZFE= 0.1
##$AZFW= 0.1
##$BCFW= 0
##$BC_mod= 0
##$BYTORDP= 0
##$COROFFS= 0
##$CY= 15
##$DATMOD= 1
##$DC= 0
##$DFILT= <>
##$DTYPP= 0
##$F1P= 0
##$F2P= 0
##$FCOR= 0.5
##$FTSIZE= 32768
##$FT_mod= 6
##$GAMMA= 0
##$GB= 0
##$INTBC= 1
##$INTSCL= 1
##$ISEN= 128
##$LB= 0
##$LEV0= 0
##$LPBIN= 0
##$MAXI= 10000
##$MC2= 0
##$MEAN= 0
##$ME_mod= 0
##$MI= 0
##$NCOEF= 0
##$NC_proc= -8
##$NLEV= 6
##$NOISF1= 0
##$NOISF2= 0
##$NSP= 0
##$NTH_PI= 0
##$NZP= 0
##$OFFSET= 14.98509
##$PC= 1
##$PHC0= 97.8772
##$PHC1= 0
##$PH_mod= 1
##$PKNL= yes
##$PPARMOD= 0
##$PPDIAG= 0
##$PPIPTYP= 0
##$PPMPNUM= 2147483647
##$PPRESOL= 1
##$PSCAL= 4
##$PSIGN= 0
##$PYNMP= <proc.py>
##$REVERSE= no
##$SF= 400.02
##$SI= 32768
##$SIGF1= 0
##$SIGF2= 0
##$SINO= 400
##$SIOLD= 32768
##$SPECTYP= <>
##$SREGLST= <1H.CDCl3>
##$SSB= 0
##$STSI= 32768
##$STSR= 0
##$SW_p= 8223.68421052631
##$SYMM= 0
##$S_DEV= 0
##$TDeff= 65536
##$TDoff= 0
##$TI= <>
##$TILT= no
##$TM1= 0
##$TM2= 0
##$TOPLEV= 0
##$USERP1= <user>
##$USERP2= <user>
##$USERP3= <user>
##$USERP4= <user>
##$USERP5= <user>
##$WDW= 1
##$XDIM= 32768
##$YMAX_p= 453964142
##$YMIN_p= -701289
##$CURPLOT= <Network HP LaserJet P1505>
##$CURPRIN= <$Network HP LaserJet P1505>
##$DFORMAT= <normdp>
##$LAYOUT= <+/1D_H.xwp>
##$LFORMAT= <normlp>
##$PFORMAT= <normpl>
##$SURQMSG= 1
$$ End of Bruker specific parameters
$$ ---------------------------------
##NTUPLES= NMR SPECTRUM
##VAR_NAME=  FREQUENCY,     SPECTRUM/REAL,   SPECTRUM/IMAG
##SYMBOL=    X,             R,               I
##VAR_TYPE=  INDEPENDENT,   DEPENDENT,       DEPENDENT
##VAR_FORM=  AFFN,          ASDF,            ASDF
##VAR_DIM=   32768,         32768,           32768
##UNITS=     HZ,            ARBITRARY UNITS, ARBITRARY UNITS
##FACTOR=    0.250966925370066, 1,           1
##FIRST=     8223.43324360094, 12550,        123332
##LAST=      0,             -221455,         -165281
##MIN=       0,             -701289,         0
##MAX=       8223.43324360094, 453964142,    0
$$ Real data points
##PAGE= N=1
##DATA TABLE= (X++(R..R)), XYDATA
$$ [...]
23848 18381 -155526 -88219 -62892 -41260 105793 -83423 139488 -367176 -160248 48991 -200017
23836 -338932 -10593 45607 -33659 -206488 161070 -270099 -47708 128748 -96230 218301
23825 188947 124363 -318257 176861 -45112 28123 -97775 -195173 -239759 -128562 7142 -40356
23813 -111246 -126073 -106252 53035 -227613 -325967 38554 -211378 51759 18059 170673 -130562
23801 12871 -261456 13567 260715 118827 -244677 97691 -315530 -341417 27321 126175 -41723
23789 -18870 -419115 -342950 177081 25580 324472 117608 241855 -81455 111968 248976
23779 248976 117862 -66131 -78020 60006 -91077 32189 -142655 -13784 -25775 -25986 -30583 -353420
23767 -353420 137567 258920 -69640 403297 -101973 -161160 303177 48143 130181 55613
23756 -129412 45871 156592 -270919 25386 -82563 -142733 2062 -139982 17689 213268 -42722
23744 200764 -53424 85010 -3317 79900 -166050 -188195 40609 193495 165662 -150329 33875
23732 -152770 97326 -94185 180814 223514 -40082 194349 85291 -311697 -71966 89152 229005
23721 229005 46389 -110163 -175346 -146920 -154545 -2623 57337 -80173 -250883 -126509 81811
23709 94541 293765 -382507 -70350 -204684 -15472 -182647 235829 -86855 59259 4180 105863
23698 105863 -330228 225918 386925 235603 -120212 -269825 -44608 -20426 -320147 -86640
23687 138712 -94133 -122486 -22910 8249 -100216 -29767 266436 149709 -216645 -129860 -193026
23676 -193026 91606 46467 10904 -292311 -105875 224799 -105624 -18959 160546 75359
23665 -67418 114462 172163 -122893 58010 -10045 -207966 258777 335941 -147472 20557 97213
23654 97213 130663 135194 -234834 103698 5997 -90891 -56524 -174025 -215717 194930 -76865
23642 93568 167084 -160359 -123697 464442 7646 4750 442010 -18748 53293 -16340 -25648 -201209
23630 -201209 47745 -152009 227141 100038 -151649 151191 -102106 401848 -286979 -43592
23619 -187316 26744 -64076 240373 133497 -129997 -236776 -274157 -25263 183836 -717 -174076
23608 -174076 -127379 134688 6662 225897 -317797 -212713 -290198 -166338 -159226 351920 -25600
23596 82838 141151 -206925 -27148 168728 -155651 183377 -192403 38451 -7430 466660 114949
23584 86940 232383 141661 173255 418818 -309626 -82059 -15590 -170020 -5099 23965 3216
23572 -177909 -164303 -228194 167146 128711 196679 304008 48914 -5477 -238448 -280772 -180040
23561 -180040 -235739 -60492 -87114 -287517 109828 -118383 -492127 -72493 281919 9383 161136
23550 161136 -77414 -145913 225830 -79567 44892 28255 4567 -227557 -237581 281393 357208
23539 357208 -168841 -183584 190623 -317688 199898 -268719 41437 18879 199745 13046
23528 96524 -65202 -40158 -221120 -301365 -36713 -91458 160774 306457 144637 172634 113129
23517 113129 19352 130919 181151 97007 -328416 -330008 317398 -295337 -53681 336588 98705
23505 -50853 -12988 -96353 -129070 -139832 45415 -179481 159167 -213038 -223477 260878 -66550
23493 -98512 37353 142061 77112 77477 100339 -265224 -372380 -108745 -14813 -145518 189437
23481 -50465 -126332 -143523 -104078 -1142 -50411 249336 -58741 -37084 -243226 197097 248037
23470 248037 89531 149560 -249528 42161 279233 -111529 8039 63651 -18447 76852 183339
23459 183339 101223 -46901 21880 87574 26281 126392 -90935 44397 -26279 -38749 159458
23447 148462 -448762 -124358 1689 -173911 359556 -58264 -271555 -191026 135965 -154197
23436 -12151 132752 -237356 -158168 91265 -250177 118018 -29541 -84256 -276503 102488
23425 -90143 -70379 -83361 152729 -221986 -81444 -181187 67422 147469 -141011 -61075 287276
23413 -13913 -204743 -190428 20907 70192 124456 -57581 11946 -154289 -444377 34984 -11601
23401 34696 95695 41623 -38413 -138302 107155 121476 3818 310779 -167533 -113521 36518
23389 104938 -267201 -126751 -228304 -199694 -180002 214581 -30583 67783 135498 100177 151773
23378 151773 227573 22502 62723 -211375 -7015 -177469 -65358 -324024 -86058 -181165 126099
23366 94452 234857 -104987 -198081 -65858 9657 412946 104718 180177 341529 -4636 -105936
23355 -105936 -330822 149233 -235799 -93115 -218253 165769 71392 -96184 303611 38455
23344 -139410 -674 -30176 -261064 -302464 -11682 -382696 241282 77144 239731 188159 -40366
23332 -115804 304809 33785 -143481 92686 -220189 221229 -136052 -213684 -409480 -216761
23322 -216761 -6349 -142127 -39091 -25708 264952 95155 -176364 -110020 19323 -437881 201349
23310 -315629 189432 -167466 99611 -86619 -37651 -142991 33899 -123489 161921 154098 220525
23299 220525 40087 -50354 -34923 75517 -249604 -40549 32878 24235 48831 296645 125559
23287 -95571 98994 -438940 24815 -18467 192490 -58657 -437538 -142714 -353963 -271767 -167241
23276 -167241 -17461 149532 -73156 55904 110247 100395 37302 71836 -87847 -6746 44962 -117449
23263 345426 -297317 16088 13085 -85604 33574 153336 200832 106592 57135 -93511 223867
23251 112241 160550 -206891 -201747 -60642 -222874 -47174 248245 20131 26041 -112433 -151302
23240 -151302 275503 -108209 -414045 -96657 -276429 -75932 -106976 73281 68851 134552 27392
23228 -169987 -316312 -225015 72740 -55768 -86691 103287 146164 107148 12219 44526 417066
23217 417066 -52446 -27938 -16580 24346 -206693 240989 -128014 219501 -61838 -241799
23207 -241799 -256092 110922 -157736 -309991 -14978 -10770 -103909 150700 248917 197649 24689
23195 442577 329778 -25810 46493 60849 -46658 -190952 -202054 374738 -96889 -221250 163421
23183 93566 83666 -342581 -84801 -170518 88552 -117265 -185958 -38848 -164943 -254343 167264
23171 49858 -113147 52178 -7716 47816 -118713 98104 91036 59160 43864 -63586 -113922 155302
23158 135266 -37980 285748 -308764 112715 -62292 62839 85067 -3531 14301 -181894 56252
23146 -86731 -24689 378207 112267 -269387 93796 71872 98842 45087 76634 -184186 -310700
23135 -310700 -337380 -46439 -73256 -288603 -210225 -131842 -39226 234085 8844 -27640 161375
23123 -71337 13428 384990 -55724 -109445 11160 -4436 -24981 8956 -210341 -133533 68285 -14283
23110 35143 -336601 -56182 -163299 224091 11124 -84410 -78722 -110409 -154892 -369036 129663
23098 -296587 101832 -4049 323813 58913 6455 136375 -37656 132870 -56803 -16303 -204522
23087 -204522 -315777 103573 66356 83371 -92797 199892 -100157 91549 -91290 265131
23076 52929 212809 190713 157671 -131935 -248265 -276608 147467 79249 21724 5107 -24299
23064 334513 -335503 -60335 -56102 -215221 48385 -30498 154396 196413 -247006 -79202 -89733
23053 -89733 -128661 -20202 -62979 -24135 -186745 126680 77516 -12049 5163 111649 -27029
23041 188268 -230297 205251 92777 -117714 -233755 98888 -18716 -66462 15771 -162210
23030 -125863 158613 -75769 177062 168581 29929 -82698 117270 -117904 -3002 87157 345823
23019 345823 -35769 179151 -82897 -184768 65194 -132023 -394156 -244936 36696 -36756
23008 46061 22815 229719 -99321 21735 -216489 -61875 -139815 -119739 17295 -52945 -172026
22997 -172026 -11684 131822 342825 -248108 110954 -433457 77057 170976 -227137 -68481
22986 209113 -123990 -214576 106908 27769 -177362 42087 -30431 254109 -18020 116880
22975 -337637 -277576 -13154 -52477 72780 -181842 122968 -215107 -36136 103160 -169772
22964 -68682 126434 -101888 -132867 -446662 -101900 -71227 41100 -282844 208339 -133742
22953 -117060 -161131 -123071 58818 -226756 22068 161548 -138978 132630 27071 -232366
22942 -74797 125179 25993 34771 -125636 79255 -4119 -255875 -44627 -185794 176062 63123
22930 71677 -119969 -52467 -132892 70088 -37651 -284747 52443 -180970 87522 106476 313269
22919 313269 -149157 -105478 7047 34979 -58192 -23225 67427 194271 -85592 -227704 168078
22907 8037 -109308 -287903 -130076 88927 27157 115744 -168016 -22442 -107955 -75981 31973
22895 64471 -5444 193136 -169531 -178557 -214715 -76228 -92450 -142844 -124065 53 -195144 -110176
22883 -110176 -281296 -90494 -17403 -44325 -312440 -12644 -38327 86505 88262 -171822 -156541
22872 -156541 -230168 -290503 -88146 -149286 -99603 120171 131142 -152611 219992 -180546 -46432
22860 87075 226333 49421 249628 -195205 -115229 55691 52327 279052 -75477 125134 134520
22849 134520 11656 164769 -235985 -11378 195879 93320 -241850 -41537 47124 -228549
22838 -19302 -40151 13349 -187640 240243 5519 319626 -219414 133592 83627 67414 158440
22827 158440 7523 -127522 101885 34646 -45521 113158 -26307 -309276 -13130 217792 -87985
22815 -26835 118344 -220402 -106771 100799 -54220 -2150 107715 93054 -38320 13892 206748
22804 206748 -8964 33184 -184084 57824 -50836 485803 -210479 -17313 50207 12291 192353
22793 192353 182235 -144829 -220922 198555 -82030 20048 78563 7481 -80598 -39616 -135093
22782 -135093 211390 -22873 -45780 -123875 27319 57775 -74379 -207423 -75452 39196 -5430
22770 25425 72933 204894 284119 -2440 -5374 -81677 -19077 -42420 -86242 70409 -319664 59080
22757 95442 -86083 -170777 77115 -1226 -33205 139061 -232133 -33577 -197331 -287493 -323539
22746 -323539 102211 57349 44447 -120710 -135578 -69778 224151 273058 152337 149191 10428
22734 66725 -144870 60425 76685 -51797 144566 -30802 -211779 -143803 -120190 -172358 -209743
22723 -209743 333381 257371 118342 324010 115907 -42645 -47435 -157185 5319 -199793 -258736
22712 -258736 -2039 30969 -165493 -5596 118506 -182608 -94463 -345721 31399 -229144 -31492
22700 292709 -18118 -126207 -241828 -194930 -54038 -440140 -216227 -152740 -231219 -242555 -45067
22688 45611 83080 -203775 -54465 64136 277145 -161500 -30353 -130841 -104395 -51141 -115518
22677 -115518 -468879 71500 17741 355899 -172618 -263242 59706 8553 -91668 144121 37893
22665 80834 55490 22201 -46321 84317 -195561 49288 -125155 84805 -128354 -341860 278860
22653 -166144 -105768 -98154 -103605 -264664 -75297 164755 106299 -156942 115771 177804 793
22641 -57587 -177074 27116 50109 128611 612 -269725 230831 146351 61146 -35499 -34385 473669
22628 -286605 127188 66885 122204 198023 27358 -112111 -303840 50587 -171533 18449 -85921
22616 266987 252234 -37443 -191135 -79883 -275513 -317266 -343978 -44004 -10447 268839 -295999
22604 -231373 -275199 63673 45188 176038 -181007 -14912 245239 157647 4632 -268215 -183756
22593 -183756 8239 190530 -56465 121008 215037 -148300 -179659 58835 -168444 -238052 -211682
22582 -211682 111256 -194960 -19525 -255310 349545 96762 -439262 -187834 -74508 -8835
22571 151023 142409 -219200 122108 94864 -152611 89692 404342 9381 7788 -478369 -62070
22559 -192083 122698 59913 -188640 -169007 -38594 -48481 -198689 264887 130356 281676
22549 281676 121514 -238201 -76583 -3720 -287943 -132491 -396882 332734 83142 -141282
22538 211531 -27858 -314846 94586 39626 85536 101644 139567 -388918 274526 85985 58298
22527 58298 -143752 54246 242011 95977 127315 -59088 41679 -329201 -204389 -197962 118947
22515 -6432 164766 35778 -274339 182532 24846 5376 10128 -397097 -247699 -34523 -105916
22504 -105916 29931 178988 -102600 -298855 -174874 60281 -89277 -160388 158395 -40235
22493 -255594 108520 38712 -213939 57166 26858 130658 256590 -103028 52969 -124694
22482 -286426 26876 74159 -75611 -40140 -78133 -75990 211081 -234731 -290551 157325 -67708
22470 -353695 180743 -44407 -103178 33460 -153505 185072 129391 -241471 34372 -3055 34579
22458 -350731 -23826 36910 -187544 -140091 -12017 -178645 37067 -49532 -137724 -76768 -272349
22447 -272349 -269707 143217 7411 231215 223898 -52624 -188833 52287 77395 186370 13596
22435 -164870 -289790 -90450 -215561 -257544 -86360 -75129 109227 179850 132961 50391 -81236
22423 -140815 -24357 279447 -196474 -17807 -176627 -27125 148816 -353133 -160833 -202235
22413 -202235 -170613 131101 4490 -83115 -137305 -224627 111932 109124 -316442 73666 63442
22402 63442 179777 -60482 23175 -183019 109415 57456 128830 154247 20096 9000 93044
22391 93044 -14212 90861 126325 -172371 113037 9154 -61255 147584 186119 -45085 -239240
22380 -239240 150452 299656 -61923 200013 -154960 -217918 -30078 -57830 -115776 92915 -253565
22368 -162570 -29085 284806 111213 -75586 -127503 47033 -322 120856 92387 69834 12391
22356 -198583 44351 -46293 202162 -8643 -42738 118643 -272262 -238575 -132931 -393726 140963
22344 114060 -192843 98280 23424 -320884 -4800 95788 -100275 -85651 92071 78642 -61688
22332 -269456 176301 76436 -103267 -223332 50264 -248255 -75117 -61461 244240 1256 -5151
22320 -4770 271423 -182199 84169 -162132 84331 -283509 272641 74867 -126622 233449
22309 -167577 -107519 -241067 -244237 15887 -113550 49846 -96585 -21729 -183819 -214204 -152531
22298 -152531 85408 -120319 153659 -239901 -220040 -19058 -97253 -178014 323661 -89507 -16130
22286 -16809 -339090 33898 -199000 -184807 288817 459972 -369814 97974 -200194 207374
22275 117346 -103305 55936 129465 18401 238128 -171663 -65746 76932 -28554 -157053 -79931
22264 -79931 326377 -256658 458171 111992 -58540 -156328 59555 -412630 -27234 182532
22253 -124231 -65562 -104022 -398920 244171 -30928 -96749 -215081 -133245 -366307 -21024 12475
22241 -60311 -187626 -59510 211586 39501 138806 -106628 83224 17734 -169167 -122927 -34259
22229 44264 -167785 -143761 -328923 -221288 -57902 116549 81527 -50954 73476 11477 -92501
22217 -109672 -111084 -88053 -8422 307883 -173217 -206944 404449 117336 -219711 93908 -542418
22205 -133987 45540 201679 -227157 10231 -409061 -58735 -329628 71842 -25452 262323
22194 -184480 -35307 -150778 -28619 -491033 -125011 -86894 -236114 -39708 -31648 285238 178226
22183 178226 -119824 181045 -158860 -68292 -414569 -225628 -142142 20438 -460372 24265
22172 -58781 2339 91586 50616 172929 -212738 -130984 -137561 225198 -315246 160657 -25893
22160 7282 -288721 162680 -45851 67398 -72497 -85021 189501 76635 51035 -119819 -74432
22149 -74432 162045 -64743 29699 1176 -271886 -92712 -103424 207047 78539 -89308 -310150
22138 -310150 -83723 -262457 -79659 308540 12130 87838 81095 290165 -9921 81691 -90841
22126 225980 -247968 -253384 87795 123861 -1454 -62248 -352155 7181 51899 134770 -114411
22114 -188397 428775 12724 -134730 -22687 -129232 -209283 -63130 6918 -104753 -193855 -177645
22103 -177645 104942 -104087 -19725 -238631 -205363 -142722 -62364 55323 38976 -113890 115215
22091 -14821 -231223 -180890 11968 -15451 -26939 -48679 -16552 251191 -40869 -142539 -31900
22079 -7970 -156749 -252288 67928 217953 750 -61784 120936 65827 -116489 -39832 264606
22067 738 -82524 153329 85385 138680 -10311 447795 -252707 -30042 199430 -61559 176515
22055 -172944 -193974 -64239 67493 -131098 -157573 -169900 153970 36288 -46377 -328483 -120381
22043 -72707 150928 -89537 189884 -201415 -99980 -193280 -42957 -123865 21354 238429 6811
22031 -200305 -303765 -214830 6085 -181432 71027 -125676 -21576 109263 -478511 48604 -181596
22019 381109 -128117 209126 582041 205129 -97579 -189220 -67940 -432717 36027 10857
22008 -297824 -48234 -89993 65440 -78564 57395 90185 -7503 74111 -102847 -57940 -139471
21997 -139471 58326 52150 194705 37048 -369429 -198588 64190 258132 -146315 163191
21986 56870 -26085 -13541 27152 145496 154570 -59672 -155121 31856 -136366 76708 109948
21975 109948 226928 -130815 105460 -2790 -126170 -81296 7075 118911 -139596 -171136 -262139
21964 -262139 157256 -140999 -86091 -30165 24242 -455893 168040 5100 -40627 -297958 -88264
21952 31276 -214297 66900 -79403 124466 -284404 24877 78067 -205802 169028 -90634 -419337
21941 -419337 33808 -366469 242525 91328 -44421 -99918 -119132 -191356 114773 -330374 -479419
21930 -479419 106735 -179987 -182942 -280477 158523 -312902 -373322 313341 -200705 86881
21919 22380 -44660 206405 6280 152318 -152941 -232163 -355493 137626 -416395 71936 -42927
21907 82215 -52176 61035 -158431 179632 -28176 9010 -117009 -79154 60854 -33145 43915
21895 196300 -143935 -209797 377352 -192781 54958 171 -84904 162087 36371 328998 -170040
21883 40119 -30699 -293877 -46557 175364 164285 501427 -91182 -270281 41006 -224333 -139791
21872 -139791 -61359 -13208 236441 -247533 -28891 359874 50085 -145714 -378941 153033
21861 -81563 -144895 167624 210888 209101 -323638 -33889 -192569 179952 -12028 -284748 11891
21849 243809 96068 -69169 351535 -244082 -29162 -25789 -178639 18229 -84123 384145 -75090
21837 -83016 -316840 218930 -123759 -274617 172563 -221966 10391 -268987 159873 213521
21827 213521 -172243 -166774 -147730 -151902 -318101 112529 -258433 100724 -134646 123993
21816 143724 -375889 -6624 -69646 -107122 -38739 -117452 171180 50369 -87043 93084 -372817
21804 -118264 -50648 -37563 234535 172890 55706 -83888 348735 140616 63438 83073 -180588
21792 -178976 105577 -164086 103160 -154457 -390417 58834 389873 -34416 -274046 -295986
21782 -295986 61257 -285815 -344512 269047 15827 45398 4830 30239 -17168 -77680 -62940
21771 -62940 -57202 168128 -130043 160076 203385 -153209 -101605 -204180 35776 -296985 -77005
21759 178471 -166997 -53356 -176708 154328 -183853 116541 164292 -359325 100326 372844
21749 372844 69600 -204898 -105490 192215 -50693 407656 93547 -57418 -120408 -281337 -176080
21738 -176080 -209481 -63905 -301100 -18516 -63991 -45154 -231452 83290 96961 18050 132528
21727 132528 163192 -49012 -369863 48266 -166184 102168 -57579 -231328 117947 -192802
21716 21368 282712 99204 -56823 -136137 -167391 62974 14732 32230 -416188 79990 -55346
21704 10833 -269377 78128 -29197 352203 45390 133121 222324 -264289 -103882 -74791 -87836
21693 -87836 56016 166365 -91001 -261664 -37252 -151017 -126560 -65575 133931 116827 180926
21682 180926 -79805 -69308 -19281 287276 31504 216995 106493 115567 -140126 333970 83624
21670 -130231 268690 -22812 168631 -99337 94280 -322231 -176215 103667 -198541 41691
21659 43990 16693 -79023 15214 -81342 609453 -66778 57270 -121136 -28248 33189 8184
21647 -157306 -113606 -175263 -4195 20386 18922 -152805 -425487 50199 -31905 12431 -211224
21635 -111883 -116784 -117457 -146929 -99842 132990 -440043 164715 -88866 112041 7446 -122249
21623 -30905 146865 -91849 102664 273882 136783 -28331 65087 -117497 -17923 137584
21612 -130428 -411353 -29714 -245387 -180264 36874 -66029 45481 66511 105099 -213572 123734
21600 -142490 -42759 145859 -71501 -202072 -80209 -10972 254062 -93723 200653 -173821
21589 -87852 129991 30611 -143417 66186 20097 -7181 -225808 -117763 -140168 -251716 -85646
21577 -111362 47704 -118129 -393875 277017 13272 -180162 -421847 -82564 66801 -206866
21566 107939 -150273 323001 74278 -72636 179164 -59581 141741 -211863 -223713 11011
21555 -52552 102810 -106951 208348 -26466 189743 -202209 -277148 448473 -162678 251051
21544 -37781 -84908 -133595 -177140 -100630 142715 -318744 -365309 -30478 -31283 117556 -94980
21532 -9785 -30022 -90361 98239 194098 -204290 -95946 8336 -171723 -187249 -126080 -209278 189514
21519 -82328 -48047 -1789 -162724 -152972 12404 -409781 163726 68519 65199 -205232 -165180
21508 -165180 27951 23073 -26011 155132 52755 130733 -157820 -114170 8984 -96444 160573
21496 107880 -29192 136629 -390336 254114 -122922 -288994 -110141 334683 234107 51838
21485 -96940 -104979 -24990 17007 164284 4776 -231065 -225727 -143728 87948 -165313 -213601 551108
21472 -147468 51059 -306158 54333 246026 82539 125477 -157361 -439541 -57023 -164094
21462 -164094 -101649 -81578 36261 -246303 196648 -110903 -239217 37853 179769 -127455
21451 -111149 101928 23759 74306 -131485 -228295 21212 -87695 101095 82493 -109118 -284014
21440 -284014 8924 -5356 206506 896 242468 647262 266452 239495 221511 394901 122426
21428 -81298 105686 353030 -107046 -34411 314679 86824 -172879 275728 -162674 164243
21417 -333723 215930 -32914 -193306 -186275 -130878 -372001 -25586 -98982 95855 -184271 -259609
21406 -259609 -354981 -180889 213597 38940 -153170 -60722 62885 -43786 -72302 -76458 306990
21394 -232385 -13248 261401 -104596 -31683 26887 -238724 83025 -179894 44585 -305738
21383 -69777 59674 -51263 18640 -93608 493378 -279697 -128305 -23009 -116153 -94399 -145533
21372 -145533 -16009 412713 55245 -2142 -274025 34303 -232338 232919 98710 -196815 59061
21360 -62723 -8112 7221 12246 174439 119058 10780 340822 -204871 15391 188472 -131576
21348 65941 -132383 -385096 224972 -252196 -37954 103721 -102956 -97345 -95391 79140 -113246
21336 -290711 -141406 -173654 -294340 -234591 176315 -282208 -157357 114579 13487 -235751
21325 -342294 -238446 57235 86159 -161441 -232099 163430 -180860 11456 86130 -163289
21314 9406 34965 -119766 97112 -88089 43088 -204776 34855 225069 79625 28270 -43940
21302 -71332 100878 -167315 65112 -109346 -155864 -190065 -174537 190880 -266947 191635
21291 -162035 -76593 102637 -201036 -85276 51859 41849 81350 -125364 -43296 -250625 -73843
21279 -256522 -54124 254942 -25406 379985 143267 158317 123287 -148780 148013 185166
21269 185166 32244 57029 289688 -180820 41218 30260 -23663 2079 234256 -165456 126706
21257 -169856 40214 392475 96058 62828 -352667 -186 -6867 -201302 11510 -45411 -30589
21246 -30589 58411 -244101 175561 -127581 -37189 253266 -51426 -204002 -258453 8327 435233
21235 435233 56706 194 -150630 8301 -312562 166094 219875 -298111 -184276 224151 24576
21223 -163975 -77845 519627 198318 198560 -177065 -39530 -37445 99944 -314712 61857 210270
21212 210270 -156896 317501 -35527 108480 22874 154209 -220108 13983 -115030 -102494
21202 -102494 -135987 109643 33853 -291336 214781 61976 59670 -248124 90500 160704 260348
21191 260348 134509 106124 263387 -343274 207877 -96942 -157919 -26866 55732 -121666
21180 199896 -502336 -374161 -326470 -186821 -132075 -162160 -111401 40319 -387797 -92266 -40790
21168 46991 -419630 -110608 -228044 -166154 -107463 66691 -89104 73765 -358519 -297212 -147421
21156 -38783 26023 111780 -104134 197525 8678 -69545 27269 -51838 56610 -46721 -59494
21145 -59494 150162 -231824 -7627 120049 -43408 18084 30840 -411734 -441764 29292 544
21133 -52980 243446 53799 20542 59653 -134670 -93005 -366512 249052 30423 -372858 348073
21121 -217096 11139 146454 -23441 -240097 8598 25779 -131015 -132205 64104 -134640 6867
21109 35235 -85879 9825 -306081 6934 -416712 -290717 -8010 -340599 227944 55423 82841
21098 82841 -16741 -105385 -263634 171927 230429 103047 7031 -95997 99252 -32096 54096
21086 213874 -14216 -58946 94342 96914 -174139 -37258 88068 -110415 -211195 -259352 17997
21074 -86693 -168310 60060 -559163 157431 61337 62872 -259979 -164474 12251 -114811 47028
21062 -338649 -76448 37116 2363 -140922 31860 32010 -542378 -64916 -178034 -7594 -139184
21051 -139184 170030 156896 -333706 94449 -269336 38599 -239465 239724 -44955 168821
21040 -46619 25587 -38333 -122767 -59155 -128127 -156569 -97075 19755 100766 -217372 272792
21028 -135734 -333109 -96327 -257887 13020 -144882 -342144 -329696 95226 134383 144147 8678
21016 52205 -175053 -23594 -64167 63769 -98095 -80830 54011 -506254 -75125 -249223 252499
21004 187507 159416 -342294 -132978 47234 -112672 131277 90653 145638 117101 -183877
20993 -31638 -175815 -32491 13382 22960 -6841 -75323 21196 -127758 -35841 -309140 -319150
20982 -319150 -193376 91924 -77940 236421 -62811 120578 316305 -259221 132665 260061
20972 260061 -39068 -263708 -263715 -63740 -211773 148038 -111163 -57318 -296855 -406548 -476516
20961 -476516 -346139 -268831 -57749 179053 -87131 -398261 62917 -434180 28544 225958
20951 225958 182888 45846 39833 25024 54145 -192208 171981 -300862 -40500 -102489 -72566
20940 -72566 71896 -227244 114906 267277 380838 -180951 -45632 76243 -217275 130592
20929 -105961 527319 64117 418604 294034 -225100 -41640 84975 -49048 183675 24900
20918 -111534 -4490 -142757 15928 128612 -85068 -186997 179491 44162 55518 -365422 -80773
20906 -311223 -185460 -359197 190924 -207476 -95420 -459578 26610 -146517 112819 112410
20896 112410 11435 57758 68024 116353 -330519 232871 -237955 107382 -55686 -156226
20886 -156226 304768 127769 -16343 -233242 -4983 -38916 -206616 -103410 9790 -94914 -137437
20875 -137437 51401 176116 28474 -63573 -111996 -381192 224239 92943 21590 52960 -163832
20863 -292923 -7731 -373810 9260 -235922 -106956 -36159 42793 56786 127510 -58080 -19830
20851 431288 141848 -184545 -142222 -191018 -77326 141234 -111743 -227705 -41893 -107791
20841 -107791 -349666 -155961 116503 -109476 -62055 21353 -309824 -246545 215814 147129
20831 147129 -70120 20996 -240873 -37407 393956 -102598 -245095 195196 -153855 -309748
20821 -309748 -68160 -320682 176855 -72345 39872 -87578 238973 -84413 272301 -376926
20810 -205021 -194641 -151179 -22671 -1341 287877 -79239 -77035 -161377 -160640 158338 38596 -202083
20797 -9650 96960 211187 -58079 2236 -490770 25284 39976 -152878 -222997 86828 -42415
20785 -42769 128266 159493 -304828 -78966 85575 -61149 45583 90953 -23389 -90901 -38648
20773 217844 45980 -80152 87820 -106225 -194322 64100 -36987 159533 217129 -143092 336133
20761 73146 -125467 -2605 -117863 -68727 -285650 -67073 46918 246103 -131903 135876 -54100
20749 97477 -116993 106390 -191824 -66203 -189304 -340226 -159515 182863 -224177 -49205
20738 -103151 -10437 219263 -230127 45966 136382 165837 -130242 -427258 320619 -82405
20727 12252 42810 118565 8491 -166401 -53589 71266 148412 -227815 -6813 156938 -184190
20715 -218646 -53717 -323627 -111233 109412 -35803 -252345 -181625 -193984 -195101 -123014 -125336
20704 -125336 277753 -178287 178293 -97283 -75087 -220439 40287 99201 -78667 -383066
20694 -383066 -100574 -100694 -99154 -157327 36900 -124047 -226583 204240 30739 -97266 -224426
20683 -224426 6174 47473 113155 -31571 -355159 -19847 -111073 235666 -144421 -228206 -118486
20672 -118486 45829 -15209 -24335 -5794 176811 54954 -50882 -98063 -21928 -123270 -146944
20661 -146944 -113665 -10971 -365489 -4549 25921 43745 -11983 163423 -112218 195272 -193047
20649 -71439 92707 89163 213086 290795 -400626 37888 -55585 11418 -159160 -64941 -195707
20638 -195707 61420 -184876 -48036 246043 111155 -207129 7583 144101 -96654 99362 149174
20627 149174 84899 -62609 -393767 136140 -149481 28204 -275518 184665 -333263 -278820
20617 -278820 -79786 146492 46396 -324306 -98353 331656 239086 -45151 -2653 58558 -129793
20605 -140824 129038 -94463 -53999 -31815 -193682 -119247 -217887 262641 35402 -119778 126208
20593 112851 -49061 128247 -27349 71145 145438 -320552 -248174 -210933 142915 -177492 -185594
20582 -185594 -96215 27408 -230533 15799 52072 -88542 144 70133 -40448 -180449 -76318
20570 207340 -148330 -205617 8193 94141 -42796 103605 56398 78495 -47573 -107143 103363
20558 -69314 154898 198509 174229 -276535 44186 -25050 -31279 270810 -7666 -356440 -327042
20547 -327042 -321539 -233515 -185949 -135278 -34892 192428 215177 63372 367614 39616 191832
20536 191832 -200151 -167202 -125259 -65276 314003 106588 -223202 -132164 -33311 85253 14490
20524 -33810 -106799 91064 -179209 -132468 104864 157605 -127560 -188414 -34053 -57096 133973
20512 197826 128330 110131 103036 -19786 191243 16834 -172185 -197430 -242939 54680 -183018
20500 210851 -145701 -374734 170763 69272 -199101 -6436 738 194424 -131012 26580 52428
20489 52428 -148750 -78749 -271602 -228477 -100442 223156 -277295 -260866 -112006 -212166
20479 -212166 -226285 -112609 58576 -535824 20999 59428 -153197 55097 48496 2123 -109801
20467 243344 -51333 -12054 -34779 207260 279756 43061 530438 142971 -142843 -62614 47724
20455 189430 -105977 -56782 32746 266434 98573 -357816 46710 18738 -162517 -108716 150948
20443 -193377 -148735 -358005 129729 30213 24382 37004 75013 -309208 118815 -56167 194291
20431 -308625 314526 -114637 -227373 21382 -62415 -93939 43416 83578 58909 -375273 -127730
20419 105773 -261030 -99172 -311449 -347632 -40641 213740 -108898 -457361 -20139 -209161
20409 -209161 -326292 -90103 6820 -278551 117423 -56444 -82384 331034 -82999 -85454 277435
20397 -177157 -36612 -61191 286972 -30147 -88149 313434 -103382 -248810 -118012 155002
20386 4903 89883 -244380 -175656 -17402 231257 -207094 -82564 -237203 -52613 -192957 306643
20374 -47959 89540 -55640 55328 -116105 -127501 222202 61335 -298672 -216558 -278252 101215
20362 -55113 -65303 -136291 -150346 -278669 40684 79261 -257055 -117239 -183294 -300706 54946
20350 -113835 46419 55486 -379054 -258603 388653 -364911 55269 102651 -325651 16892 -125638
20338 164140 -132357 223969 -7975 107017 301582 117332 19908 171647 76199 -428679
20327 -92450 -48415 -134372 -116078 -236123 181263 -68141 90317 124355 -106049 157059 151500
20316 151500 -204385 79092 88165 -206661 -50772 -118673 83008 -22694 -290224 -31030 -27004
20305 -27004 218719 81877 22130 20213 174256 54841 -294979 -166831 -120750 -194502 -63761
20293 -27196 -80042 160813 33969 232468 23691 -171168 -61445 81865 -75965 148922 -176784
20281 50665 155071 -242394 -11900 -91686 -247980 197399 -367887 -8849 96045 -11351 -79161
20270 -79161 28851 -24594 81164 -83839 91171 -48278 -76880 135181 -380925 131064 -94529
20258 10110 -95840 -39430 176414 40530 15997 -218654 -479867 249746 -114961 -85715 -151361
20247 -151361 14535 -165365 152469 179947 151579 -88815 -55837 -79088 -163490 155105 106814
20236 106814 -80865 -142544 -51036 -76805 -9941 -169154 -153842 -207049 -167711 -219410 -113067
20225 -113067 -137557 -514902 -319963 -136166 -220254 -232528 47057 -278579 35792 -174411
20214 19478 61290 122659 -163607 -142852 5784 -100199 172917 -4373 -7662 -23868 -114279 -184708
20202 -184708 -156289 64541 -158297 -160039 375663 313400 -66415 -165121 -203935 -8143 115412
20190 -114933 -239692 53746 -3522 -154760 -118904 -261682 -39740 -111707 147256 78077 -65302
20178 241221 177291 14995 132830 -155238 -65160 -34455 -93504 341716 -177325 -140704 146111
20166 -139876 -85675 -29601 -238821 81369 -148259 -302856 191026 -144006 91497 -115518
20155 -248324 -25481 250726 -92353 -271641 -192049 -114192 -221652 160057 78683 106066 -35310
20143 290586 96581 -10179 -333518 29719 -90883 110971 -17180 -3528 -77862 -269943 -69777
20131 15676 165583 399123 150430 -180286 9162 121956 -218966 3763 4198 -108779 113841
20119 -7066 125545 -54614 374433 -180481 175311 73342 -133146 -130146 -206308 -86796 57075
20107 -110449 -13114 -254808 -22000 -251940 82326 -210339 59676 -169190 334993 260789
20097 260789 -208544 -120739 59903 -195677 -101793 11505 -270971 -43454 26031 291419 -169994
20085 -123076 94725 -335134 199772 -195418 29288 -143129 -84306 -241954 60716 42 -147229
20073 -184382 -68028 66149 141424 -112770 -256785 -167747 61325 -158190 146548 104377 184804
20062 184804 -1693 248458 -146331 335616 -209541 -391939 -169640 -301010 204657 12917
20051 -26690 -67590 284097 -299772 -199911 -171602 -5540 9116 48494 -174376 -95893 -299879
20040 -299879 -136133 -366497 -92650 57480 -184986 113297 -190869 -173475 269216 206970
20030 206970 -136891 -102448 66271 17199 167469 -91318 30658 -68967 276486 -255810 215863
20018 -154744 -119270 -279286 314825 123681 -75559 -170494 -96940 -85767 -1252 -153763 28945
20006 -29254 45239 49741 22149 -239829 143509 -4290 275233 -228533 192517 -92613 129829
19994 -49086 -4477 -27307 42465 19736 81564 174505 -3337 -132733 302751 280290 -192525
19982 -426878 -175774 -87907 -30052 -52091 -169316 -75225 -144786 -333576 -229146 -119127
19972 -119127 -125966 116323 -58559 249348 129095 -77999 -55069 -82879 97971 139820 128254
19961 128254 -103066 106927 -269678 44094 -50361 -254761 44980 -4885 28938 -43895 -360572
19950 -360572 124825 -61386 -261663 -7570 -60732 -210848 104967 56075 246400 -65608 97881
19938 85480 49189 35332 -180247 -117811 20693 83959 -139305 -135615 -190480 -50234 -82266
19927 -82266 -500308 -265729 76451 -494079 164843 -364196 -35095 -320203 -127846 68409
19916 -4252 110390 -80706 -160605 106890 391641 -239239 -145038 -262394 -178943 153824 -228548
19904 -392930 87867 -116365 164534 -308884 78802 -89404 198185 -198834 -159279 -78990
19893 -130338 81490 -76670 -189601 125080 -90125 -172215 -394124 -62805 113173 -228469
19882 -991 -180066 -63946 123413 -15839 73204 -196534 -162901 -331814 -443 100240 -122832
19870 -241686 158696 101780 -269591 -305190 -206887 -69959 -46340 -79385 -40927 -313595 -57935
19858 50954 -151776 -102621 -180352 -211488 6030 -237666 -208499 407341 -168743 -52515 163874
19846 176558 -287246 -149196 -178574 -340456 -57945 -67792 -76246 -157039 -66447 -100435 33480
19834 100425 47086 -215654 -221076 -287940 -251665 244453 -237687 57919 -152901 -254689 -233942
19823 -233942 -58120 -304736 50441 -327115 180860 43319 34187 -108791 94484 55538 171872
19812 171872 -15889 -141317 31231 -195689 23899 354586 -343961 120369 -41650 -96280
19802 -96280 -178916 -43469 235242 250362 -375867 -165362 -194075 84283 -144763 -245131 -203894
19791 -203894 -26029 44292 -35466 420437 -256505 -122657 -454921 -211291 -194677 -125489
19781 -125489 -214592 -460371 -42668 -144006 108320 30053 -61851 -210749 128306 92426
19771 92426 -96390 -275301 222986 210837 185649 137822 61482 -253959 162897 237457 -36721
19759 -313698 -220158 -228575 136819 -385037 -423634 -352076 340051 6359 61928 -212495 29865
19747 76772 -235190 217338 61944 -44264 -322863 -199173 -44332 17468 -91754 162266 -301258
19735 -260022 296980 -33195 -24069 -56439 331965 295926 -128696 -48411 423646 284848 223414
19724 223414 -3667 -7887 165190 -304815 -414524 65231 -34644 -68192 -166424 189708 81878
19712 58452 220331 -49954 76665 -294524 -133205 -218296 -77142 -170451 175686 142009 -176730
19700 14167 52162 202607 232871 -257121 -259532 -189915 71121 197213 88075 -40610 50725
19688 117385 -93971 -405759 -340088 296198 174772 -125885 -57308 54128 4352 -124428 18854
19676 -113113 325467 -296161 -26360 -80524 -10962 -312081 -165516 43923 -189043 115122
19665 274439 -65305 -239195 -156978 56140 206848 -37102 175072 58253 -40888 269520 -41991
19653 26131 -31452 173570 106558 -112878 -138013 -153276 263272 -358830 -70405 21080 55441
19642 55441 229996 -123252 33435 71913 82534 -54673 -25562 -216383 -102629 -65784 -249543
19631 -249543 85786 -121710 -117777 -60490 26181 -15889 -192478 -143196 -60397 -211251 -94996
19619 -296311 -48382 244970 59922 -159674 84019 226584 -125168 -21276 -206447 114210
19608 -90388 -73018 -257790 -98832 96719 -22643 -368428 -131166 180726 140137 -47334 120335
19596 -46397 -27953 196005 113945 -58165 -18070 41276 -301432 124184 -192311 -281933 164498
19584 9824 -354688 42274 -67233 -195184 -70428 23676 189348 115991 -17883 -173374 -26392
19572 -156855 -71434 -264803 17983 201742 -57370 -122970 -244296 -327688 -53411 -59542 -104551
19561 -104551 -214842 -185569 -4334 146427 -53266 -96948 41443 -143159 287612 174991 -315651
19549 65149 -296670 21586 40231 286321 -216592 235698 48222 -138208 -48707 -111209 263123
19537 -5784 -212356 -377899 -276640 25866 136002 21963 154172 92693 -167300 -54127 -96090
19526 -96090 -274889 -67301 -52626 -251770 41104 -148666 -196645 46458 142575 -235406 -211948
19515 -211948 -173815 -61487 -23341 -35484 -222596 -268121 138308 -170129 -425272 -451538 -205078
19503 34629 83267 -32290 -222631 -244297 15349 102671 -137530 9920 -145158 -234269 -93992
19491 -273495 -264 -249515 111679 -278871 -142337 -80034 -199502 -105619 -92831 -130603 22018
19479 -363648 -127461 -18883 -162579 62411 105552 4756 -133554 61322 -133902 45544 176746
19468 176746 -5000 -99144 -137262 152785 -170868 143669 -25304 259658 126851 -187125
19457 -28110 -265505 -69412 -35844 168275 -406104 -1953 -79359 104991 -256704 25099 -106936
19445 308400 -48830 -157547 -29748 -244325 56934 176863 -295645 6899 65932 56156 -55653
19433 -20800 -165585 206593 3826 -478117 -66166 -70709 -47118 -66414 -84882 -195738 -204784
19422 -204784 221287 -47877 144962 -55844 -261187 69689 -103525 208958 -76997 -174393
19412 -174393 7517 244497 33862 207537 -41464 -190310 33032 149512 325317 1722 168494
19401 168494 -230685 -216193 -6376 3305 -69104 -28484 -52 -225354 -343630 116222 -160257
19389 -306177 -180742 -234262 -205939 -216478 181187 63384 -50174 -347866 -158422 130981
19378 133566 -20739 -281083 54671 96489 80712 -975 -259649 -130855 -20907 -265853 -203064
19367 -203064 112612 99905 111150 125095 -143623 -28708 -12910 -48275 -151175 24568 30483
19356 30483 -106576 -411614 5432 -89848 -127713 -103622 -212887 -157209 -64357 128291 -152436
19344 -100172 -172312 -96112 70056 -191324 141403 -30443 -344228 -254086 -29478 -55288 -470069
19333 -470069 -96238 -87056 -273808 48281 365109 -132260 -236940 -25994 3434 -60518 26105
19321 -106106 -36034 -70919 -255920 -61764 181132 -8027 -28680 107724 21180 316050 -169783
19309 26142 -100825 48946 -113354 -209633 2608 363238 33096 -159764 496855 -180641 -154124
19298 -154124 -198494 -143038 -299497 41463 22252 -48917 -17283 -156351 -178309 -130322 -33712
19286 -160080 112847 -34413 -111070 -160623 145724 -147301 -54906 -231783 -71160 -240600
19276 -240600 -35144 6951 249736 335202 -219680 -77261 -328208 109747 233062 56884 -87314
19264 -190197 -109307 177060 115052 -212291 23519 -51378 -383280 -226914 -7470 -206301 -320449
19253 -320449 -184870 101325 -31656 212986 139772 -22473 117550 -154812 -244287 -76098
19242 -75427 66031 -77634 -47528 42436 -76042 43511 63949 182387 22162 55378 43958
19231 43958 -184658 206891 -57764 102921 144639 -190166 -2943 -171995 -258396 21352 162784
19220 162784 -31866 -326967 16541 -39881 -210018 -274032 -286009 -9834 -121367 -161504 -27092
19208 -374321 -51074 187749 226074 -34476 -137821 -26285 98971 -170751 6824 -265 5192 103085
19196 103085 -206440 42735 251175 32212 -203748 -109238 -263400 -311029 171792 -346497
19185 91676 -145070 -65322 -110160 -37448 241394 167508 -299841 191541 -131907 202811
19174 -249823 -257914 -55033 168241 58374 -158706 -79057 70297 -210459 -101608 -33008 81268
19162 -61460 -304697 -104995 -143632 -102325 -108784 -167013 182715 -13189 -5167 -107820 -163170
19151 -163170 159412 -128033 -179701 48294 -218140 -33946 201215 -258723 -67971 -134834
19141 -134834 67030 -64974 141188 142701 -11257 117253 -185565 -6519 -4114 -93874 2733 18590
19129 18590 -146172 27509 -77489 111555 -475651 189432 -209287 5862 -141463 -157245 -72513
19117 -96673 -143118 -190139 57721 53839 -95345 -78843 -30772 -117502 -40859 -126071 -86506 -283450
19105 -283450 -67766 34206 97831 30827 -172832 87547 -262361 122918 -80703 27574 -102044
19093 -58675 -207391 147006 -215496 -170595 49288 121329 -71095 154516 77679 149657 158690
19082 158690 -255865 138877 -29091 -132497 -155835 -108030 -121673 243500 -101090 -146492
19072 -146492 -68540 -1767 -320683 21303 -192950 -6469 -322360 -217817 -89682 263903 -241902
19060 144629 51696 -152601 49721 -31636 -249435 275303 59013 -85625 -4159 -92001 -299542
19049 -299542 150370 -188956 126220 -67620 -22560 -28539 -96829 -359940 -125949 -121044 -11856
19037 22151 -68757 340124 136100 -139397 -69425 -171419 28645 -86688 124261 244320
19027 244320 -150461 65422 27523 -191528 107337 20843 65703 133525 -157231 -269779
19017 -269779 143506 128711 -175661 126701 -53014 -352040 315065 522779 -106393 -489759
19007 -489759 127487 -92395 93461 -30699 32827 -130505 -400505 -190262 127053 64420
18997 64420 -299484 129585 -351593 60475 -132059 165895 -135614 -42303 85500 -105956
18986 -405052 -140746 229113 -144589 -161114 206084 -152033 247218 -31229 -53832 96094
18975 136305 -128628 -234410 41096 -275074 286992 -97218 155707 -204180 -169057 -335820
18965 -335820 37876 113082 184126 80055 -48731 -129468 -70315 -45289 -60903 -185597 -144961
18954 -144961 75 45722 -88970 -202960 -6017 -44077 -247802 -420567 -50363 -105873 4233 227017
18942 227017 60322 246097 -132025 -106078 7101 -174592 -206172 119039 162305 168272 -124048
18930 -55949 -157692 146353 508095 -154747 123843 89249 18165 -382730 -333455 111766
18919 -105414 104484 -123137 -143103 -184723 -53213 111860 -140379 -356080 38831 -26200
18908 123465 108405 -10835 -99450 25375 168819 -19550 -255828 149475 -186096 -55713 178599
18896 295872 -293962 59076 -179992 -130864 -246274 115222 -167347 -214264 -163356 -196866
18886 -196866 -215130 31023 -113809 -159745 -345534 -85621 -8002 205964 101923 -85236 -132245
18875 -132245 70079 -147806 -31400 124914 111282 -237275 159539 -201598 -121811 108285
18864 -28769 220672 138688 58995 -28229 -216604 312633 79936 -376977 38241 -207056 -64289
18852 -26434 18763 76431 -44752 -202603 50095 87505 234020 1726 -374572 -17551 -2295
18840 1948 107906 179723 16426 -110697 -260981 -106606 -304165 134442 -236840 79848
18829 -119810 -44758 32165 104945 -168685 -42630 353 252640 -112196 116214 173446 534610
18818 534610 6024 89871 103060 -334079 -86007 85691 -130561 436376 45731 124268 11649
18806 106212 165695 76235 -60301 318534 -213210 -183537 101525 -347536 -8134 -60902 -168401
18795 -168401 -83184 40959 33402 -59105 361647 -347071 -458436 -142742 272507 -143085
18784 -91180 42951 109070 -363112 68945 -88058 88771 59139 -209904 -77929 -406762 -105731
18772 135012 107307 154727 21520 65294 65642 -39292 94373 -263775 -39731 -224885 47686
18760 -126115 77653 -268236 -363175 -59007 -291131 -146430 -125898 -287438 -324793 195169
18749 -445473 26230 -178116 -545244 -81762 25383 205162 -171466 -198262 98544 63551 -13691
18737 -220852 103234 -13144 99939 -8402 -169463 -250581 219802 -62064 -252257 -337792 -148908
18725 44523 36707 -24169 -384765 8467 -334808 -70908 -187152 313984 -337422 -95946 200643
18713 -69781 -57327 97496 -162533 81345 141147 450374 -17305 -236809 -134658 -194925 50101
18701 101542 -414195 -262215 11811 -47183 -376629 -23675 137747 55049 31672 104059 -8752
18689 -54553 -209178 -124122 144643 -83192 -161155 147033 37019 -90699 -61148 15325 -180761
18677 75597 39939 -246977 59099 -47776 -145486 -182194 -1690 -270352 -193336 25069 -22785
18665 -14232 -90135 -161211 97603 -23611 -308224 -66210 -30234 169194 -218682 -72284 -181781
18654 -181781 -150414 -128236 -75074 -292484 -120931 -232689 160621 -103146 -113553 -134613
18644 -134613 -166862 65333 -132641 47045 -190288 195 197664 -465580 -99398 -72164 -104684
18633 -104684 -155965 -94752 137184 19729 -220555 -112474 -90217 46680 16578 -13568 -135878
18622 -135878 87272 -49986 146349 22122 -215454 43736 -232181 -373778 7001 -176301 313007
18610 408239 131616 29903 136113 152140 -103043 -435643 20486 -60475 -149758 -170657 -230880
18599 -230880 55651 42749 106527 -79452 -240461 -10244 -113652 -81511 64657 -264012 84213
18587 205216 -61282 133254 151746 -257007 -209054 39529 -178224 -167924 -203628 -84489 -367375
18576 -367375 -27067 -205166 142959 149260 180087 -219673 -102027 -221203 -53684 320153
18565 -560 -108523 -264136 -84027 -135733 -125374 -199230 12359 -146024 -139276 48639 176605
18554 176605 81642 195447 96413 178491 63475 180477 -241282 25086 -156030 -15617 -177610
18543 -177610 166858 -142716 34886 -131950 275676 -220976 12126 -10966 -208673 44397
18532 26890 212386 -3799 89978 -17786 -230726 -81257 -61137 184985 -191391 -121435 -278189
18521 -278189 136238 -60580 -49441 52712 -181520 -33243 -270766 -328804 -16375 -49 -93188
18510 -93188 -1869 -176526 4641 -98892 -143492 135655 -120849 11699 303862 -6342 -395287
18499 -395287 173488 -225747 449215 170025 -80630 -318546 -9833 44608 -179687 -107618
18489 -107618 136247 184667 18473 -284200 68948 102773 -29976 474867 160791 21624 57045
18478 57045 -155051 -194344 -41141 -14980 -170463 -247702 -31219 121305 32821 -12097 -148836
18467 -148836 -94521 -32073 -41332 -152644 -196106 -250286 92838 -26015 -91153 -220245 -39197
18455 -183637 -14018 -36068 73954 -4575 -59850 -201588 -331242 136741 -106777 -113010 -60720
18444 -60720 261454 -89934 -114584 211187 -194869 93395 -129921 5404 -130433 -152457 169517
18432 127274 13680 -91222 56324 -316048 113409 -133940 95366 -16213 -81730 -32865 -313797
18421 -313797 197109 -258076 -114852 -201688 250836 28983 -33754 -58763 -235576 -137770
18411 -137770 5052 -2377 36357 373912 -123143 -121045 185194 28932 -307184 16893 83473
18400 83473 -256621 -448732 -65898 63824 -144758 -95799 -239841 -213195 -288546 -38092 -78422
18389 -78422 -30017 -150199 70351 -174926 -101641 -112518 -129314 -382354 -70736 106021 41328
18377 128095 158993 -82193 -78456 40564 -307405 78873 -221877 120026 79825 488505 -74794
18365 59505 227844 -220535 56217 -392196 -15517 -86501 -148090 265876 -216096 -84485 43816
18353 289068 136100 -222080 141454 88377 91129 70077 27264 -116945 -172306 -351223 -100202
18341 -73443 145288 -51332 218139 -186676 -69141 436171 -185603 70236 3982 19139 72266
18330 72266 2823 73558 -191079 -26640 -252057 -76514 -298701 -50937 -109766 82157 -240944
18318 -85875 15553 15494 -224146 -124981 69832 -64482 189362 -239623 -195535 208986 -67091
18306 -333503 277081 -138845 165960 -389123 128956 -140727 29419 -86405 31288 150682
18296 150682 -85815 242838 -146681 96700 -194877 -206597 -73392 49679 139200 98223 -75879
18284 -71059 166780 148367 59769 -156619 -150979 -302277 -79719 -126580 -77114 -213849 -357344
18273 -357344 192939 -103016 -174247 -226474 -80349 -48666 9602 -191673 -210496 -139380 -185473
18262 -185473 21127 309710 -19345 220987 114297 146466 -216451 -393820 -222844 117189
18251 224536 307450 -204627 -226889 -77230 130129 -146091 78137 92843 -291920 64788 -152359
18239 115904 226499 -190685 92922 -278978 -70329 48293 133700 -38145 168880 -48339 75383
18227 -114668 82774 -286014 -143603 -52285 -134655 -46442 -101680 -39807 -67815 315691 -103444
18215 1508 263414 -266943 -126059 -59787 123922 88514 -253697 15939 -824 -127072 -44733
18203 346224 -97468 156967 124802 -185352 -155801 -229504 59830 185406 -29028 -250196 -46586
18191 -14942 -265047 -41765 232957 -48846 -76353 -144351 -200747 -119825 -272533 -298673 -1491
18179 33715 271967 -193364 372055 38033 6471 174724 -47372 116061 -33535 -155464 -65435
18167 114774 35810 18462 -5646 -136197 282373 -160025 -83097 -213680 130030 44593 -155387
18155 -28290 -143317 -183673 -15996 -332306 -155732 -420005 -334027 -94878 122578 254156
18145 254156 29473 -38564 -123309 269307 -67379 -60758 279178 -55980 356941 281404 -204115
18133 -7583 59421 55669 -81839 -107843 -895 15133 170338 151506 -412832 57229 116258 105411
18121 105411 -67402 -104028 -103959 145877 -243483 -36114 104999 76908 45226 -414952 110326
18109 -283604 -55650 110549 -65998 47645 135116 -192315 12891 -266086 -399343 290456
18098 -101404 -167564 145569 312958 69236 -35300 217706 -208800 -46991 -229887 177546
18087 -254628 182158 -147931 -89290 -9937 -221830 -240520 -149268 232225 -117857 131045
18076 151104 64661 7281 -132433 158038 -248365 -113028 -303848 -40717 63237 80663 -92145
18064 -85819 -282390 60392 -118728 284790 -153193 -81755 -112916 329041 -74223 -56998 128643
18052 -347837 -194355 97756 54979 -182628 -46431 -36545 68900 -308305 -312531 197492 -99054
18040 57680 -8968 -12085 76889 -191270 -408984 -21784 -151294 23805 -236093 -163513 236733
18028 -10671 3692 -141021 2217 -180864 -131000 -12057 -142280 -215013 -138930 8823 -119789
18016 126134 69158 -52093 205978 -19515 -308755 217981 124235 -193041 22656 -339458
18005 -59895 165106 -98128 -30719 38662 -89904 -86228 515426 -12561 -75697 200392 60358
17993 105052 -60378 43133 300692 95798 165396 149321 234623 158478 -329177 27150 70037
17982 70037 7919 153121 -41833 94023 -111156 -174930 -1403 -248801 29518 -142171 -255691
17971 -255691 71688 -78867 137923 -80482 92950 93479 149123 -296630 -40262 -80872 106531
17959 -8629 -82833 114240 -257866 -112710 -382481 -161911 -95680 100987 -80767 288399
17948 3320 148163 -202110 -204221 93031 184003 -184536 192286 -109851 38436 -85541 9469
17936 -104276 127917 -256921 -26558 -59517 86846 -112003 128222 -275666 -140417 104578
17925 39463 55049 -268026 -5155 72673 -254723 -210859 -176822 -193582 -152347 -38955 -211702
17914 -211702 -134078 -77913 18699 187414 -86685 -212634 195419 -245593 35129 -674 118681
17902 -196469 109810 -112689 -112745 -110352 26069 -27334 -180479 96195 -147178 -224147 -203671
17891 -203671 8715 -47684 -222952 -126063 5401 -263513 -284682 244502 -128070 279368 166972
17880 166972 -114394 112232 -53775 52211 289608 -285693 -237103 71908 113202 38829 35921
17869 35921 -112791 -108863 -327388 -27919 -103566 241655 -340438 221216 81832 -117322 182792
17857 -104099 -74603 21755 -64736 235812 101995 -3010 168850 225266 -106512 129061 163763
17846 163763 -273489 -208627 98070 267399 -23047 -11164 37380 -216684 72419 185520 -220643
17834 94009 -376100 -140192 -108570 365424 -49724 -253579 -190865 380208 32185 67469 -409580
17822 -290344 28838 -31486 2347 207083 -60502 22871 86322 414978 -287540 172570 -91442
17810 15808 -90262 -293465 -14654 -38042 35351 -161873 55803 102610 385137 39933 129082
17799 129082 -215605 89682 26760 14345 210406 -276098 87066 9958 -98 251195 196267
17788 196267 130518 -63043 -211065 -92115 156690 299322 -112654 56802 -211514 -12704
17777 90461 -37198 79528 52083 32701 -84187 -1520 -24838 -170378 -194611 60878 254711
17766 254711 124765 191569 -53124 -72308 -57991 -101660 -255637 -318933 75298 371269 25588
17754 142478 47021 -103269 224259 -231196 26677 331800 61051 7789 99628 172372 177289
17743 177289 -286754 373444 41806 49804 -216496 -288181 -147930 8882 124091 146876 -101607
17731 -53541 -52872 22181 15441 -81518 -36742 -36964 -209825 -106880 -215412 178364 105076 278504
17719 278504 177856 -356721 -180386 63798 -39447 -252257 19301 26841 -34911 -425481 36887
17707 285808 -226345 -5400 201394 -358461 -151579 566446 11662 -93212 69966 -248004
17696 139991 144199 -189446 -40131 -88066 160661 -76045 107485 132376 -105160 100715 -9353
17684 -154983 -37975 272607 130049 -68728 175754 44187 319624 473748 -61541 -43772
17674 -43772 -15382 28952 -236923 -208416 33774 244569 171324 55009 -263495 -242836 -127452
17663 -127452 -47500 111679 90404 -41143 41044 137680 68045 38112 -142754 -75476 168837
17651 -286991 -15840 -49397 -138437 273080 24680 -59286 37994 -83562 -126605 -99313 173632
17639 155369 23723 71038 246458 3806 -135938 -80538 -303563 -189304 -137896 247883 -72694
17627 -177945 -97670 -56926 -287387 80812 115965 221813 -12256 454405 -29707 -88226 74755
17615 92248 58104 148592 -152398 -192401 191724 262159 -263847 -168366 -68966 -150167 -121419
17604 -121419 -146055 129965 4280 107049 149076 323956 127003 87414 -347359 68174 1297
17592 21031 381231 -85562 -129327 -146048 33522 -184093 172800 190021 -186205 -7407 -49461
17581 -49461 140395 -153993 -122086 252973 345528 82939 50487 83669 -109048 -44313 -212522
17570 -212522 74008 256024 19447 -146250 116749 -158526 -53824 -104430 300353 167277
17560 167277 22572 95021 346157 -31519 471298 39679 139521 164448 178821 183907 -190321
17548 -132152 194448 -66295 -307449 -247657 -252844 85274 279998 -160803 262726 -205174
17537 180509 391544 162917 -25036 -20230 -134975 352801 -108173 -31769 -58505 224167
17526 166217 -250478 169721 279876 497697 2826 148120 195905 176941 44692 26867 64709
17515 64709 -14725 -44403 -156556 74276 84465 293012 90592 -46953 33690 172223 -2663
17503 182475 240440 22757 -277004 80490 56024 351913 -15730 270620 -64741 284316 -52138
17491 -146 -43262 -104135 22660 -51694 199363 22205 -142372 -2156 -11928 221051 131553 214949
17479 214949 -86368 113463 3976 -60592 382801 -38062 -53713 286630 341551 32666 169490
17468 169490 -113671 403342 198993 148481 278679 110349 133975 -202901 -185820 30227
17457 -72234 402318 191215 332297 -65577 103351 296142 509196 37353 227544 19766
17446 141184 83613 118464 -145015 278790 91256 -107102 792 293899 188769 -14334 116843
17434 -31702 481392 173651 242118 -38242 188352 285416 400876 452114 224537 289250 451914
17423 451914 -184637 66980 191749 -14386 394177 108261 204705 67526 144011 166979 48676
17411 75474 -17730 151696 160328 327027 337392 130544 143837 359428 210853 227665 334302
17400 334302 217071 198515 -176751 60222 414845 208041 191192 117655 66549 -179836
17389 213585 192539 190394 230588 356195 237358 515002 70825 296441 37252 185242 -45310
17377 -71206 516143 -52589 46006 -46418 23526 150980 211548 189066 266441 100861 128449
17366 128449 -109196 202277 207491 192953 -120933 125839 113134 433130 79964 -125841
17355 62431 100969 -64199 -143239 -88205 197191 254189 328525 200600 296587 61771 115228
17344 115228 200956 272259 133830 79037 261052 -208678 -127874 138795 111793 262966
17334 262966 3243 257935 137828 515991 120110 199310 160159 193163 108171 159823 16970
17322 94901 -183844 151972 272791 250123 352608 314703 17835 229292 -218074 55049
17311 65906 7452 105687 171828 -81771 -55954 73574 -95451 115811 142614 410361 203370
17299 113429 122101 163995 28720 90568 164520 132393 225702 227560 104504 213613 64154
17287 140800 78925 157295 513795 151030 112094 97798 39422 210400 -36215 -76123 151138
17275 152146 -77823 144797 48064 87192 10480 148185 56776 77258 86682 199504 158046
17264 158046 175423 165410 192370 51239 -26479 268727 149200 124532 -107360 432340 64833
17252 215479 168224 22567 181176 79384 30038 84652 62278 48004 88322 117779 203949
17241 203949 79884 94449 146297 214325 202873 281411 40612 42472 78274 166558 228893 27698
17228 -58139 78192 -28732 -206015 219075 391274 -321352 186999 -111948 136956 360061
17218 360061 316834 -28208 92227 18258 197687 102194 98096 -124952 597159 448201 379937
17207 379937 -46790 248723 396893 197139 344542 338856 360079 564119 -158010 20850
17196 238013 382291 -58450 231340 42658 401158 214503 407321 -25994 231367 -20850
17185 141082 179286 380517 144737 248490 78193 217414 465702 250467 95030 420746
17175 420746 110831 83262 373874 285056 246961 133715 113927 211865 330184 411047 421361
17164 421361 412758 145657 30359 313152 317014 165045 329206 442057 552169 594422 302798
17153 302798 618268 282379 155234 407671 -19100 452001 157065 209242 37777 190414
17143 190414 330427 527072 409938 343710 -6394 273489 103315 511802 283532 180959
17133 180959 360742 239535 324127 -100718 212815 110586 335440 199167 216756 385080
17123 385080 565266 467903 216715 289339 293710 377255 127755 72051 349411 267104 77458
17111 575066 -2323 375095 579407 660149 8449 371024 202009 -22850 235698 437670 637397
17100 637397 181436 340587 448991 207192 411282 434695 562219 325204 418074 34302
17089 519749 200226 135896 546235 482017 447813 274829 398308 264002 544000 520016
17079 520016 410988 695722 492021 167851 915097 203600 156395 244872 576441 248088
17068 440619 25713 344126 505660 198971 81178 543567 431789 620278 469884 368150
17058 368150 709752 611113 329295 419486 385438 508301 298420 258945 87642 495347
17048 495347 543336 624194 576159 324637 306459 107846 156984 376480 609065 753114
17038 753114 658681 700189 448697 546718 576892 200919 420569 359370 537015 291626
17028 291626 336003 665428 608268 443463 439262 505836 708848 537499 358802 391954 375132
17017 375132 397241 579669 432906 430169 550116 1025116 553570 818821 502711 941805
17007 941805 511653 666728 606746 906156 301276 303398 471013 873838 411950 410584
16997 410584 509148 829023 530413 541542 566290 826363 753392 722848 799258 711167 805603
16986 805603 564518 495733 724517 962926 513741 554216 875822 888428 721785 761746
16976 761746 337847 708049 590049 1049944 818761 759011 1270438 613694 589758 1084874
16966 1084874 824272 956995 779777 719530 867741 474770 955439 631803 903087 1105025
16956 1105025 720517 976462 970762 1136739 920873 803503 1105162 946176 832839 782162
16946 782162 656395 863780 893600 1101298 692418 1144118 988089 1005481 1057304 1316918
16936 1316918 1178070 1168145 880121 1062928 1240910 1026262 1294153 1285683 1018553 1361690
16926 1361690 1107712 1145653 1196432 1255683 1247075 1515545 1241130 956590 1306770 1302760 1286490
16915 1286490 1330060 1505828 1354686 1315838 1098695 1426324 1511764 1637393 1722045 1424007
16905 1424007 1235743 1440098 1724004 1447249 1659731 1800547 1937694 1229319 1467830
16896 1467830 1649823 1574283 1656853 1734351 1856483 1379822 2042163 1841763 1758375 1920287
16886 1920287 1862056 1692615 1837184 1442379 1617835 1993632 1756712 1912433 2205286 2241565
16876 2241565 1854136 2187109 1750495 2049843 2007431 2114504 2070492 2137747 2521459 2064024
16866 2064024 2593573 2383937 2081032 2654367 2623241 2447254 2593556 2657579 2631948 2439411
16856 2439411 2880502 2504572 2493436 3239591 2913274 2578198 3004942 3049747 3048976 2860090
16846 2860090 3117799 3417175 3052637 3145632 3456255 3372094 3598725 3425845 3728138 3380053
16836 3380053 3875844 3670015 3672079 3818345 3945114 3959008 3829890 3844693 3902848 4465594
16826 4465594 4366683 4429411 4559935 4420457 4378067 4775346 4936951 4964269 5009465 5004572 5317206
16815 5317206 5022650 5408804 5356367 5581905 5434471 5396907 5831715 5804561 6079849 6163125
16805 6163125 6077669 6301792 6673078 6546092 6699322 6968316 7122350 7491950 7196193 7636605
16795 7636605 8028652 7964189 8128305 8507173 8778345 8835371 8985493 9162462 9626081 9754253
16785 9754253 9825934 10102675 10496359 10910371 11267511 11495347 11984480 12171597 12368322 12697894
16775 12697894 13117667 13928203 14145213 14522416 15212194 15689830 16190357 16930101 17400751
16766 17400751 17928853 18857413 19348201 19812776 20853686 21876039 22836426 23566083 24551898
16757 24551898 25678330 26632338 27530388 28695376 29688299 31617837 33067843 34568805
16749 34568805 36198785 37799228 40146953 42128528 44199097 46791222 48951532 51800246
16741 51800246 54557060 57909973 61211939 64707888 68751928 73003280 76838268 81929793
16733 81929793 87043862 92359902 98156769 104335399 110698380 117837693 124462826 131460661
16725 131460661 139076234 146426571 153354114 159996749 166883348 172251911 177260192 180958424
16717 180958424 183958093 185044630 185721586 184268386 181756728 178131580 173881212 167947377
16709 167947377 161671677 154844917 147847889 140299120 132829872 125428476 118478669 111241010
16701 111241010 105061195 98294579 92763073 86774299 81742127 76566795 72254228 68187667
16693 68187667 63892322 60068730 56680004 53429439 50843763 48072816 45320559 43056320
16685 43056320 40711919 38557689 36965552 35118345 33464359 31673719 30230680 29036449
16677 29036449 27425409 26397551 25382035 24071790 23084084 22634384 21341195 20530050
16669 20530050 19547084 18876416 17888671 17348998 16731523 16440530 15704000 14983018 14464434
16660 14464434 14266062 13654693 13333626 13072769 12385783 12125923 11805210 11165843 10616802
16651 10616802 10496060 10536697 10137336 9784887 9585576 9039018 8947432 8683254 8544051 8077990
16641 8077990 7619226 7791602 7177057 7220669 6882427 6964002 6727908 6682389 6499021 6347464
16631 6347464 6285743 5656630 5905374 5617590 5865889 5760549 5256920 5148478 4705527 5175998
16621 5175998 4942085 5062424 4478789 4526506 4630739 4484327 4126053 4510438 4038045 4064691
16611 4064691 3956324 3548030 3793765 3617002 3581609 3627407 3259560 3215816 3499951 3469809
16601 3469809 3432653 3153305 3215046 3174027 3027802 2752629 3003331 2793685 2985222 2918408
16591 2918408 2645606 2993568 2509236 2771758 2507444 2534847 2522329 2330064 2178957 2603948
16581 2603948 2466177 2202164 2350907 2301062 1991076 2239854 2213967 2072148 1954711 1917749
16571 1917749 1968911 1818631 1932621 1576496 2118010 1910748 1815783 2076608 1603794 1854056
16561 1854056 1627085 1623859 1588634 1775881 1515466 1694306 1561926 1621633 1501781 1609486
16551 1609486 1597234 1272073 1586393 1550474 1740978 1483490 1317268 1227341 1489515 1292028
16541 1292028 1086930 1396091 1427751 1492433 1405354 1116683 1044799 1198938 987576 1186101
16531 1186101 939698 1021795 1200793 1237237 1259153 898953 1022623 1118464 1022998 891176
16521 891176 710845 1065145 948160 957100 693760 1178392 724685 985777 1054920 783473
16511 783473 892547 916303 952110 787240 1124359 1077465 931881 553569 852507 598507
16501 598507 606149 975092 773313 907760 672657 694693 803850 815167 942269 550936
16491 550936 947499 831312 425733 589014 772807 489949 815321 802870 761847 782741
16481 782741 742759 995307 688899 962281 874465 579026 872094 746719 395571 553327
16471 553327 729889 580964 798396 628511 503521 349048 504833 878260 784999 274567
16460 519026 847181 497802 876001 749252 542102 378314 685624 116485 418598 395838
16450 395838 568391 266542 283227 501144 777644 534490 281543 799232 535588 570962
16440 570962 459690 315430 663899 364378 316655 573188 445955 602631 1017961 361381
16429 461647 159635 428708 147063 556429 608627 419113 157289 636885 457368 498771
16419 498771 472769 512093 513470 448775 219831 746881 505877 129225 615929 96702 211646
16408 211646 378439 93358 444369 428300 -206969 625042 251048 241188 68671 239113
16398 239113 204891 93973 508109 195456 335170 82199 311511 320584 408937 438779 427885
16387 427885 347824 231941 446726 -24882 116163 506216 491029 26913 241868 94375
16376 509556 302713 133205 193829 248964 162408 74459 244174 284396 247414 257914 453139
16365 453139 -27987 320011 121471 548307 373237 563628 211503 264823 83672 148943
16355 148943 77957 229500 -26306 172053 159715 399669 87493 145108 55656 188476 472236
16344 472236 401817 133706 235129 188603 289446 248493 -54545 550471 594142 252222
16333 208433 339444 318719 151255 76965 10179 7310 76917 4337 129824 172980 -155566
16321 238077 131237 -22185 155013 102172 164414 137241 181135 283066 134490 134310 196399
16310 196399 299784 -13761 259566 -176148 -216049 29555 243602 141698 392319 -137838
16299 59458 181111 246385 325344 210840 326831 329851 25784 138827 139808 53385 80581
16288 80581 -57812 -72271 533088 33862 64385 87226 153170 17057 108487 -61723 160141
16276 122657 -76754 250997 92125 363375 -34042 422080 -33493 190867 107758 93871 134062
16265 134062 135885 -79829 148091 -3520 127046 -10351 31418 -14961 162181 -50329 88887
16253 113686 -29918 -18852 261771 279927 -32223 -14913 58635 50991 37321 27490 290608
16242 290608 4377 -74314 -14062 -11808 234492 161523 -188417 -295135 161861 -3954 -93131
16231 -93131 130356 25087 109663 119108 200102 225673 -122679 -94686 -71380 -163437 126356
16219 257787 227911 233026 290830 45370 328438 -177996 -39195 204702 -4686 -101643 -50796
16207 -200501 129797 118616 92366 324903 -139192 10261 -35642 83518 603 -114590 -112194
16196 -112194 260349 88174 120876 79712 409578 59032 151506 18502 -19586 147675 -229314
16184 160104 6330 245804 128315 104966 9125 -358030 -149589 -163129 -136213 175572 -36795
16172 354115 -237816 -71203 32481 -278559 15527 64066 -116713 -7279 12182 10842 -109368
16160 104917 42581 61844 -104323 431717 177364 -178205 205159 -144167 133706 -154805
16149 225386 190040 -331909 61237 154270 121018 223324 48396 -82888 -326318 -104263 -51819
16137 3665 177144 -60642 7383 2979 -73226 7361 -65603 -238057 -226072 77796 -163325 160727
16124 -118482 -85433 173426 -60631 101967 111467 -80362 -67692 -109010 -247106 14798 120799
16113 120799 -59700 139908 -160143 -7099 -247919 180942 -166871 72033 -171994 -34959
16102 87995 212801 148995 258340 185199 129072 174642 -10196 15664 392481 -80702 -29431
16090 98789 -324606 -406296 -46446 -206125 -123578 -105960 177758 -165291 184780 -4355 -212683
16079 -212683 -230255 336222 294984 -271592 311820 110733 -326010 -4557 297769 -81402
16068 33858 -227293 168899 -107894 181814 176791 133241 -203664 37152 80335 133621 -132695
16056 148266 -120109 -165936 126729 -147129 -84874 218375 274038 100312 -209328 99275
16045 -143362 21194 -65881 -250039 -66581 -125760 208361 228572 81654 120064 51064 -26256
16033 -217787 68115 -144162 -47318 20764 44308 379102 -228793 137121 9462 -71110 -36604
16022 -36604 12543 -212524 -131779 -416779 88357 -94272 -251952 102199 -115875 141875
16011 5842 49170 393373 -175964 -76631 -58085 -298396 -740 157288 -252566 371444 22249
15999 -65830 -181322 -121620 -29866 -219688 -211528 -7927 -218786 -278910 -156162 19858 64005
15988 64005 -17606 123588 235143 140534 210721 266863 128968 -75861 537551 635063 119188
15976 38662 -106231 102275 -168650 130455 151985 -524893 -11867 -29456 -18089 263524
15965 15605 34605 115371 -69906 -134111 -175756 -110336 -3876 18309 63644 -53186 -297661 -462394
15953 -462394 1247 -168356 -272528 418957 214871 69086 -1278 304073 -139037 348288
15942 -322811 4432 -66038 -70109 194069 34989 166364 90535 -66899 89590 -47699 147980
15930 -107158 -273920 7186 -107222 40989 -312203 404774 -159718 -99149 -262172 108264
15919 -118150 -87325 -57634 -65325 -49384 248271 214709 90344 8162 -214116 -233967 -11998
15907 -371283 -17820 -176356 121389 -23046 39419 -62908 88648 172776 -134185 -207682 205476
15895 -119782 -39994 141403 54498 444625 78253 -249982 -47186 -85904 183176 -246038
15884 174372 27635 455236 -155159 -118657 -37264 -35189 6461 96669 12331 167586 117561
15873 117561 -78579 -182091 24203 -91945 16721 -2698 -71997 96978 -146827 -105172 -247341
15862 -247341 167157 -225960 -221495 -135428 -285420 27229 -160109 -170766 93973 -368 138098
15850 -184780 -38560 24254 475 140003 316538 -166835 -151848 -360133 26074 -337102 -232797
15839 -232797 1070 -158681 173799 317172 -295097 81317 108384 -78595 -60628 198792 -260722
15827 46156 -114348 108155 -98171 271873 -32887 -115040 -34586 -38461 118488 -176023 105903
15815 88354 80354 16137 204444 -268767 -46183 347268 163360 -71277 -188110 25150 -27804
15803 255406 266815 88007 -63819 296977 139881 62862 -103115 44672 -339673 -120002
15792 -145463 45665 165764 -250189 4773 201731 -200711 -40981 -93851 200927 -68243 -79664
15781 -79664 -150761 278362 -288886 -42764 -52942 27443 -320592 39744 -194128 -248347 -133806
15770 -133806 -225094 46408 -203966 -75534 -42667 216560 220408 181541 115011 118895 45819
15758 -372331 -37829 -50196 280982 -134615 -89374 -15262 13258 3422 -12641 28272 115214
15747 115214 336154 -246443 21088 -139477 -55907 -135756 -366379 -45548 204767 -257792
15736 -53546 34701 -31365 15832 349637 198561 -72471 -233102 -242909 -14527 421165 -189033
15724 -86090 125115 255309 -69525 -138386 -50610 80332 -69731 122151 346663 -73517 -49543
15713 -49543 -72936 -100869 -345734 -121402 -238977 162257 106227 -274331 -383207 330899
15702 65208 -77137 118474 -13432 -333284 -67027 -336777 -27766 -46070 -84033 9709 38779
15691 38779 -78360 -142873 38385 -130722 -46004 -332911 113400 -53279 131452 -177655 141184
15679 41790 29848 120259 -16298 -185718 95799 313453 259294 52967 -24738 -158073 144680
15667 -131846 78759 -44341 -87031 -215852 -118009 163010 81156 -468513 -166279 -514273
15657 -514273 -287696 -108455 -38456 89655 -195689 269376 332016 174371 51065 55961 -73392
15645 271006 10602 226701 103910 -102250 -34707 15284 -238041 57062 -173362 -106162
15635 -106162 -27095 -133505 59478 -370 -19151 58588 -179794 38256 -444114 141264 119205
15624 119205 5867 -113643 -11906 -132340 42667 10617 159942 -204904 44062 159743 244035
15613 244035 32564 -14368 -210052 160835 -206788 92373 -122440 97380 156163 180300 198662
15602 198662 55881 86195 -409029 -99075 49979 -262090 235522 102230 -183816 -221727
15592 -221727 -136472 -328273 -221113 25111 -15019 -175047 155960 -188560 60826 18099
15581 274042 143189 -136853 118163 -306243 -95214 204548 -311151 153869 -131534 -260883
15571 -260883 -180992 -267863 194781 387998 -54509 19476 -14378 171283 -105408 289641
15560 -170012 217536 -301317 -129616 -229991 245161 -84307 -21540 -26606 -29281 -249722 89453
15548 -10269 -152455 13457 -5058 -103040 -404542 106746 304439 -75269 45444 -142534 27325
15536 29513 388114 -9089 -57444 -117422 162699 -366655 -209065 244258 117505 -92713 79090
15524 74486 124124 -34404 -58600 -125661 69470 196621 106885 84018 -63651 61131 99702
15513 99702 224892 -33237 20133 85793 -45989 191492 -288737 -187561 99549 48496 -11221
15501 58457 -78718 150525 -130570 -373113 30513 -170590 143650 -276148 360974 -84419
15490 94948 208369 -177494 310121 109506 147057 -34506 46835 -6648 -493965 -287888 -67992
15478 33173 73974 190317 12878 140841 252123 -210714 -22932 -163763 119911 94304
15468 94304 159972 -502727 -87774 -182064 -54311 36254 -60877 342976 -319077 132664 -152652
15456 30653 -68933 -164482 -141276 -48771 185892 -46677 -2266 -36556 23283 154587 210113
15445 210113 14139 269216 -177705 -3380 279295 -266414 206813 50154 -87458 -135341 245969
15433 23565 9990 -160669 347999 -256218 226132 -91595 20948 -172264 7123 -226522 -514357
15422 -514357 -211661 118187 -388333 -49206 -88055 85512 -18842 55890 2744 -397211 -147320
15410 17239 -110754 175547 184583 -302611 -336447 74803 231279 76570 290333 -129194 -208527
15399 -208527 -180341 -13985 -19007 -258667 -4060 21461 250139 309752 -268785 195712 285297
15388 285297 75620 -146653 20049 111355 108378 -25525 -125781 166811 -254490 26605 -28412
15376 -398812 50429 47211 -86943 -806 -176263 165949 -77568 -272567 100233 32863 -22567
15364 46225 -215229 122056 -290764 -22500 -46131 -138311 220336 49767 -31368 171417 -21105
15352 174658 303447 -238442 186681 133800 -111126 -138601 487115 4182 304929 -48108
15341 -48054 -82148 84969 48787 -29556 -253429 -4065 107319 -106062 127120 20067 214670
15330 214670 -129209 22977 -37830 69159 -64903 -55261 -176587 74703 2538 100711 141514
15319 141514 -41386 198350 120158 42827 -129444 2110 -236471 94341 -178323 -303624 249226
15307 -71492 158435 186358 156762 8164 79550 -9471 -224574 187497 -11653 -139294 -227233
15296 -227233 96706 106938 28087 -169771 58924 158889 452975 115275 386952 24151 310896
15285 310896 265530 -100097 -47302 22543 -97923 244780 155334 -128102 452775 140685
15274 -91060 -89519 418006 -135727 -35135 -106850 -1755 140966 -60851 91335 72228 293840
15263 293840 74921 -81662 149076 -243271 211082 255930 240343 10540 -141243 37464 170960
15252 170960 -14161 141612 116651 279706 465926 1461571 1509187 1381462 1749787 538451
15241 155642 23607 -68684 435165 -145099 -8147 212979 -164260 -87187 -74765 190994 71284
15229 233782 110319 -333174 -42163 122324 11403 60489 32747 133357 206900 -103294
15218 65343 44713 160527 179659 351514 894 -108925 144324 -212083 -20554 33355 76141
15207 76141 46874 170121 -203480 -98044 3125 532017 -300539 -42161 -134521 5166 -104536
15195 -178698 159053 -94692 118459 -49620 77229 38458 -78062 7116 135659 393787 -115739
15183 69292 -154104 292468 -176175 -97158 252749 -96383 -158289 75537 -248755 -14809 -24320
15172 -24320 -205805 63338 270326 32478 237850 22929 22286 227315 382337 45117 -182518
15160 278779 140731 -11753 -242389 390704 -81459 329531 -21935 -35224 578732 -314599
15149 20813 -6421 -72625 293929 -13870 -10279 -150034 158909 -152367 236286 -47573 -36071
15138 -36071 342274 240462 318733 214973 351793 -99402 -282808 247484 203337 -10272
15127 -38776 105342 -7507 185097 268224 91969 139148 58163 438154 245190 -79825 -41484
15116 -41484 109355 -138850 423757 62200 70154 -43139 254654 314477 133691 118881 169496
15105 169496 147412 -5392 -170749 -9894 -136541 140687 163155 321789 24339 23074 258445
15094 258445 -208751 -340759 -85696 336934 135916 237247 77689 -11106 337596 140874
15083 602876 128401 566234 104195 183609 -217565 -98632 82084 202854 78028 231661
15073 231661 -41646 20653 137454 28579 253570 139521 206318 175981 311458 207515
15063 207515 139599 156209 -90812 27992 326061 235605 166083 64826 74586 416515 -34331
15051 79381 260101 73615 329867 -48091 -79467 37210 198740 15453 -10326 288545 -42545
15039 292270 294519 -30962 -159290 181988 180437 148442 -128163 261605 351619 99134 43570
15027 335101 219361 122962 -43073 -15563 469364 256187 218753 153334 -71370 403548 -175312
15015 378155 305657 51997 63756 106427 77818 9959 334970 206060 202846 -74394 -114051
15004 -114051 190979 360592 234079 253654 86880 -173675 -70266 -13901 300275 72467
14993 233948 120114 92763 148638 322804 93009 -329323 191208 420492 347229 296546
14983 296546 116731 79865 87420 153749 204978 -101584 197640 167222 87105 281988 35458
14971 210236 86503 138925 -82778 302864 191891 225332 269879 419332 455227 94780 358700
14960 358700 216204 141689 433237 9096 277087 234348 455657 84740 230850 185829 282496
14949 282496 190750 221496 96752 117755 299813 241395 330126 322146 125794 27328 -102744
14937 592306 267726 237258 16528 -37723 84039 532477 112269 228625 376644 376288 141824
14925 211034 126196 185545 13164 34355 94388 337787 207460 357191 250662 -52075 461689
14913 213084 260378 320589 469220 336232 167335 327171 432888 343011 266372 463367
14903 463367 21664 178 453412 305056 302134 88501 357136 300468 335042 314146 219330
14892 219330 324965 533928 165970 303350 436965 347112 381336 114829 221254 338222
14882 338222 290582 448520 43042 204578 126159 466326 496981 240775 187274 398457
14872 398457 303480 292793 400509 633522 370034 -45963 442735 714121 342790 403900
14862 403900 125875 362464 -5937 661680 241823 592300 132089 534470 463080 158052
14851 73067 808115 135510 308190 366778 495369 184322 411186 -29886 526679 341457
14841 341457 153257 261299 409593 411326 410676 93195 398003 404409 424126 204505 247119
14830 247119 218924 -4723 291877 571379 268596 580104 636151 202314 498342 427332
14820 427332 53406 639119 382359 486069 576784 806366 416674 266151 342764 644169
14810 644169 289124 565134 438460 118784 607075 639472 237528 420336 309964 550870
14800 550870 601233 576499 257162 638866 121508 346476 409485 406704 633902 260319
14789 546682 473127 744817 388365 640318 261036 365340 689747 557650 585393 301610
14779 301610 331182 413451 300755 539920 414374 350849 775223 540863 692591 621931
14769 621931 345254 497744 47330 183484 395549 311388 518715 566281 516625 547452
14759 547452 711578 604567 538292 249558 641884 347482 624926 553512 584681 548271
14749 548271 534805 405455 534518 580406 551454 222020 435066 57828 491772 579040
14739 579040 705741 486476 858878 618488 486787 657775 584384 411344 554015 736161
14729 736161 680469 825808 614830 720007 579550 490403 679025 685456 573003 387485
14719 387485 636873 602551 641117 988186 556402 450586 810371 742201 892909 818846
14709 818846 724983 616351 780530 761816 1047182 826638 958095 675140 495187 1053188
14699 1053188 938363 823689 716621 772902 717416 743752 823770 853788 687304 779126
14689 779126 856251 557464 835957 872987 831515 822157 756016 969587 788030 413586 862631
14678 862631 1092790 954491 687139 595258 557226 670684 802714 649302 895244 730315
14668 730315 948912 1140640 1051209 759088 956928 1069702 687984 1053171 922273 963280
14658 963280 1046829 1088876 925869 864166 839276 850600 1075354 1097599 1202849 846224 1091126
14647 1091126 912788 1034445 1004186 837740 993532 793602 1097647 1003736 1245025 1027265
14637 1027265 998551 975059 924987 1386646 836847 1126365 1185261 1199628 1190690 1057840 1222934
14626 1222934 1169180 1124053 1168698 1106027 1144114 1085712 1309259 1025714 1163736 1251602 1342685
14615 1342685 1055833 1362298 1028842 1067485 1340136 1443864 1107974 1602654 1103049 1135838
14605 1135838 1318915 1407032 1374055 1436458 1324074 1189901 1466666 1215931 1053739 1275907
14595 1275907 1523254 1476613 1377527 1435668 1335214 1468638 1781909 1454576 1661406 1537383
14585 1537383 1515290 1772857 1614559 1443056 1746250 1628271 2221107 1526714 1854674 1804823
14575 1804823 1572051 1872748 2013521 1796702 1880021 1790245 1814611 1951779 1986438 2202016
14565 2202016 2238377 1849419 2110385 2295235 2318320 2122517 2495381 2347570 2570246 2575905
14555 2575905 2794604 2800966 3123003 3577691 3561903 4545902 6394603 9827723 18182936
14546 18182936 36736772 45863603 20665071 11092517 5421578 2980898 2106287 1924122
14538 1924122 1832815 1824551 1778341 1806887 1546183 1770202 1732260 1914814 1887454 1584411 1913882
14527 1913882 1881678 2146913 1845184 1984881 1741797 2050972 2303739 2293898 1876170 2288788
14517 2288788 2137959 2329163 2214907 2024977 2577682 2263135 2541515 2799288 2113948
14508 2113948 2668462 2664938 2355548 2749531 2447110 2798870 2836046 2766242 2678909 2616382
14498 2616382 2800622 2750968 2651159 2806461 2713474 2825215 2880432 2973214 3065941 3020217 2982542
14487 2982542 2825407 3117036 3644428 3345693 3377425 3395142 3200772 3663440 3023736 3150774
14477 3150774 3457584 3472070 3641211 3590444 3832452 3237298 3582099 3511522 3716297 3739200
14467 3739200 4060284 3978129 3929042 3872280 4318511 3920958 3987385 3963717 4558305 4630233
14457 4630233 4335290 4524469 4487981 4523352 4583721 4927172 4419253 4619152 4828164 4487261
14447 4487261 4818333 4942576 4920756 5113831 5090709 4919517 5230089 5198657 5340700 4852419
14437 4852419 5313176 5522154 5713884 5308847 5910465 5489877 5513717 6220706 6063891 6312677
14427 6312677 6349362 6102734 6519646 6325564 6341476 6445255 6907974 6487077 6953901 6804568
14417 6804568 7203241 7361165 7500445 7306450 7433221 7560643 7838509 7935662 8336900 8240530
14407 8240530 8097620 8431544 8430154 8590398 8822729 9097020 8905354 9096548 9509244 9545914
14397 9545914 9689182 10268584 10364245 10369983 10315494 10670606 11192701 10812160 11138995 11032188
14387 11032188 11843296 11842795 12164407 11857218 12315788 12593381 12633604 12855883 13285922 13757902
14377 13757902 13557025 14034095 13997466 14384961 14460841 14917087 15301521 15364843 15821817 16323836
14367 16323836 16661969 16658898 17060077 17487557 17635129 17905897 18561555 18868736 19400884 20056922
14357 20056922 20320325 20583255 20933415 21399419 22118072 22666412 23214143 23481051 24536614
14348 24536614 24666016 25476454 26110503 26861490 27368104 28027974 28889832 29846747 30657651
14339 30657651 31535193 32372037 33368297 33826349 35251310 36371182 37324476 38451914 39583514
14330 39583514 41088737 42016616 43510636 44909712 46317998 47698606 49662876 51069558
14322 51069558 52578626 54819173 56616518 58567677 60800378 63266225 65585732 68108819
14314 68108819 70740350 73846369 76454616 79733756 82950113 86482070 90463666 94346276
14306 94346276 98640950 102658213 108003642 112627211 118184787 123786684 129628373 136397644
14298 136397644 143134158 150525696 158546620 167033365 175487222 185078622 195170799 205701134
14290 205701134 216942466 228781866 241304864 254907055 268669683 283097275 298171218
14283 298171218 313513711 329270580 345299526 361296284 377204532 392359614 407090735
14276 407090735 420520345 432673632 443314412 450718352 453609871 453964142 452228211 453314108
14268 453314108 452041507 447706277 442563467 433987838 422971120 410408828 396554096
14261 396554096 381735059 365832791 349487719 333283127 316863146 300888110 285022172
14254 285022172 270910816 257561836 243837136 231188158 218665296 207519217 196305102
14247 196305102 186277301 176899907 167833690 159678202 151934208 144207007 137090574 130372989
14239 130372989 124521122 119100952 113707849 108372346 103704740 98822285 94861789 90834576
14231 90834576 87625733 83721379 80308283 77134706 74110488 71322869 68126144 65932997
14223 65932997 63877972 60791036 59291661 57029135 55406247 53370992 51102735 49842368
14215 49842368 48297735 46842476 45546487 43910479 42571907 41155600 39957421 38661955
14207 38661955 38540637 37493029 36073928 34836944 33892466 32793795 32248792 31450203 30573197
14198 30573197 29343216 28464500 27904325 27206309 26663331 26017979 25521803 24692891 23811693
14189 23811693 23511367 23194915 22615497 21607696 21372071 20869827 20604520 20061233 19434144
14180 19434144 19301403 18670761 18071044 17986640 17527749 16906510 16608202 16406100 15756059
14171 15756059 15824146 15364301 15358404 14537641 14497273 14067957 14025233 13589243 13577759 13081387
14161 13081387 12824859 12558751 12375636 12346195 12052154 11832509 11728232 11426991 11162608
14152 11162608 10911680 10774180 10469657 10618279 10210042 10140800 10107930 9841646 9853868 9562448
14142 9562448 9349128 9335176 9165200 9146632 8926556 9055372 8530319 8409909 8305150 8499472
14132 8499472 8218051 7928266 7954455 7925677 7794570 7556084 7497750 7606816 7298992 7097818
14122 7097818 7159366 6902364 6875076 6963676 6916124 6969355 6522792 6688779 6243846 6473372
14112 6473372 6140100 5936246 6094732 6300133 6078565 5854503 5609684 5475528 5760209
14103 5760209 5662626 5750785 5632875 5321410 5354004 5311445 5315500 4885093 5244422 5071707
14093 5071707 4665350 5028728 4786770 4762343 4923695 4502944 4732422 4419971 4593703 4634109
14083 4634109 4481035 4631355 4039651 4447850 4386375 3920857 3922663 4116667 4317319 4163581
14073 4163581 3912414 4087140 4123932 3940349 3964054 3942439 3761340 4074852 3718313 3769771
14063 3769771 3418858 3509862 3939033 3554265 3500761 3514454 3661264 3888502 3266211 3311671
14053 3311671 3484345 2926274 3490639 3163090 3276648 3144469 2935735 2982797 2961444 3144508
14043 3144508 2836780 2866205 2875986 2904644 3018382 2820778 2970010 2778595 2618894 2706085
14033 2706085 2638744 2548577 2569072 2329783 2514903 2773281 2442554 2715922 2623568 2495361
14023 2495361 2563465 2578087 2354042 2358328 2586730 2127274 2057016 2127464 2208188 2613143 2118154
14012 2118154 1893865 2034925 2103725 2222976 1794303 2324014 2010008 2090067 2105805 2162331
14002 2162331 2201969 1971833 1922128 1653902 1729590 1843910 1777142 1750604 1437461 1570376
13992 1570376 1689183 1881395 1927552 3061007 5168832 11836444 30125900 46446224
13984 46446224 25803802 12922620 7732954 5189996 4105305 3902626 3269538 2776521
13976 2776521 2777438 2795805 2612462 2628214 2387076 2057004 2004365 2203171 1792798 1860270 1803584
13965 1803584 2109535 1744059 1755703 1671085 2101467 1973978 1796230 1766658 1755503 1808745
13955 1808745 1775215 1948425 1641961 1898868 1851051 1865051 1826369 1851859 1491584 1765912
13945 1765912 1698042 1617333 1435780 1645980 1252607 1704589 1818222 1505753 1722941 1550261
13935 1550261 1835658 1579502 1551300 1354032 1418607 1690103 1299903 1494381 1608041 1236287
13925 1236287 1611072 1647952 1066559 1275492 1688579 1559752 1122371 1616762 1492939 1258304
13915 1258304 1424130 1161500 1337422 1392121 1347783 1182062 1569050 1378155 1171748 1037834
13905 1037834 1204652 1349301 1045074 1054186 1269024 1130346 1179135 1171689 1178847 1042492 1269459
13894 1269459 1367023 1069995 1227617 1251101 1153168 1029371 1299849 1108855 1055710 1303966
13884 1303966 1121104 1039151 1132830 1245592 1129624 1386552 1135106 1186453 1182340 1196061
13874 1196061 720784 1064444 880260 623670 1177046 1061257 969073 1240725 933222 926273
13864 926273 1082291 951112 1001358 950268 676861 1015571 658397 790714 1074303 659369
13854 659369 1059963 837804 1139260 879106 971569 912588 998947 1212510 927365 863519
13844 863519 1185967 693428 1012208 1132536 720464 739038 1248931 1133481 826130 807164
13834 807164 1004733 745980 786485 729205 1055422 833938 774442 872589 655133 1117723
13824 1117723 924486 815488 992060 802357 780998 923443 650778 610374 989670 484217
13813 759389 577760 610518 696240 854641 479654 619745 689911 732998 904037 765451
13803 765451 524556 1118322 909431 636401 469387 480409 935912 859286 428477 631196
13793 631196 532165 541726 857294 1027915 675044 787056 791747 535724 643851 570473 792048
13782 792048 951895 841399 451858 801205 700432 506361 502789 762235 758583 749884 831100
13771 831100 388290 580756 731491 814002 482781 322377 648472 438052 296298 618976
13761 618976 605935 415902 756770 801505 719943 597114 845192 678868 480563 922654
13751 922654 491451 744089 587125 555767 782334 784683 506774 403512 577712 534369
13741 534369 605469 395113 306017 435964 848007 479279 370142 571997 353640 507119
13731 507119 772314 323632 634039 100683 563200 539353 427034 646187 483491 445692
13721 445692 456223 391791 430736 369916 649312 538781 571168 512369 811874 551237 355034
13710 355034 515483 704287 315211 636476 575163 254739 107989 485381 447495 408108
13700 408108 177712 526373 533079 272600 773776 560600 823283 497027 681462 459804
13690 459804 156153 577324 618496 529072 377280 483768 229197 696214 578682 173582
13679 407999 222921 496270 327814 428686 99853 454444 481742 704650 45110 102511
13669 102511 600994 300664 279370 459355 502631 206068 644761 644660 679905 770031 264358
13657 132355 489739 559939 309346 290408 534769 235776 303434 489768 451199 73108
13646 492317 482618 293283 229455 216419 468133 495965 384167 352637 474554 125066 206575
13635 206575 869988 174362 482623 452480 125022 337119 402057 767458 97332 348751
13625 348751 364605 382065 358494 578812 71363 561481 280639 220532 430461 110874
13614 372169 64569 319643 172865 214599 258578 254939 166478 412746 274384 320657 304455
13603 304455 429912 443767 435075 642516 214743 530117 295914 217430 298073 406781
13593 406781 444168 432538 402510 338967 493784 680078 490729 294025 156859 139208
13583 139208 351677 567507 481864 254858 75385 227616 438220 354199 -37496 124087
13572 140353 141757 268802 313281 405937 209316 273459 455008 201144 338775 480690
13562 480690 215853 451007 293630 288386 197516 -119615 192724 263657 471188 125315
13551 188753 89938 -35981 43923 204291 86113 238472 481768 19183 363140 386730 142705
13539 144117 358340 457869 501359 161257 140298 277527 310106 290301 410715 303011
13529 303011 161093 166942 25945 510521 373873 75226 84579 124514 150853 438577 361481
13518 361481 146121 489738 283697 340085 92701 461128 -213644 518538 -169790 43335
13507 248406 321466 221196 165449 90318 655721 34996 159493 29448 148945 89573 205288
13496 205288 167854 220902 281137 514029 177956 252449 266287 220898 120782 426938 317743
13485 317743 269811 260814 319335 287951 172552 -30144 46081 -131989 168005 344355 53872
13473 151326 332374 139661 350079 271196 285872 454593 217510 26430 -23845 410891
13462 101412 351956 216033 143508 90960 300998 75808 269753 -130717 247527 125770
13452 125770 210092 -160109 249509 184362 175741 205350 129868 279155 213234 475395 15564
13440 471432 238574 39599 187322 435714 -102883 289538 480447 -114299 87359 51339
13430 51339 114945 270198 239044 69693 206396 166158 270650 276303 286046 100382 146438
13419 146438 71645 312695 647908 46965 -4722 171607 326351 26618 639188 538609
13409 538609 -11509 180212 263946 200634 172826 158603 93748 217361 277739 48835 270721
13398 270721 151840 -123340 161403 322647 246167 -17650 106176 185490 1425 -276266
13387 155796 119280 409534 212380 165205 114388 197813 -238325 143141 54029 15715 87976
13376 87976 1797 236318 387011 354583 44808 223716 300032 79044 39163 334002 62100
13364 455429 3430 439912 172939 8305 116876 -259395 283029 158658 195335 39483 -37766
13352 245993 4930 488162 399515 423270 138155 177566 373140 261943 104720 469329
13342 469329 368483 368970 320962 313665 -36964 278264 255194 415607 234041 177125 82088
13330 -99175 221622 219086 484390 -131474 381182 415430 176889 286748 481871 254183
13320 254183 545749 265681 -3390 33701 185118 274663 38636 152473 -86284 -219055 508482
13308 225451 277176 77765 -59281 386162 230411 -18224 378672 -120236 -51996 181874
13297 200777 569985 -21469 172431 233808 85812 181588 100210 -4337 362886 -235399 154666
13285 208439 285021 206815 51038 148531 215630 -111187 191461 142529 124936 115436 31391
13273 252373 -35303 8168 -8040 -583 277725 135232 -43460 145146 -2999 1798 143806 303163
13261 303163 180427 95956 162944 233299 325254 -200835 211851 -9920 -147320 231224 41611
13249 271793 -53923 -73330 -143575 -221756 -92740 -101932 289245 -284001 109021 94574 128112
13238 128112 -237872 220348 382441 23355 309841 -144249 32772 348872 148476 -3583
13227 -3189 228009 91319 344437 51464 262201 -123713 89111 200056 222480 166574 215796
13216 215796 68893 -95196 212962 577896 63254 1101 -18224 -23867 132252 -7731 -73438
13205 -73438 -193141 121444 -67975 24244 223751 -49133 144569 127518 347373 111407
13194 319896 -40650 70191 -101147 -268932 133426 -93968 122398 15133 109229 12757 432503
13183 432503 83802 21102 356372 61153 -48614 191349 -152469 -27735 -134691 190498
13172 40321 -380195 -26853 -8024 -82610 -257470 284573 123697 -251430 -19818 -20299 252020
13160 -24661 -217707 -126581 200552 238513 35478 197913 76248 56980 48349 136546 -67545
13148 29259 184192 179029 137053 154379 80798 -135884 179618 -149079 201505 74671 -327043
13136 136259 -175442 158033 513106 16210 194757 16787 172262 -223063 55186 65154
13126 65154 173424 -193114 -32549 -163901 139747 -7251 128568 -118179 -153803 -43443 391027
13114 217162 194949 177733 -53395 92440 214484 212721 27940 -9184 91507 150060 -8579 211322
13101 45940 -120200 92304 -63441 266307 407183 302890 216793 256820 166497 -81616 18891
13089 305707 102264 53465 145587 -78964 -165839 225460 69233 163147 84923 -1291 141759
13077 93714 223106 192818 38779 -33456 59315 -110456 125152 114738 334053 107325 -72924
13065 172075 153153 147828 177668 -39305 149963 305758 84372 363920 -21015 -369987 73884
13053 46471 250068 365049 142099 -185505 266455 183846 -60568 79425 171245 107241 -5396
13041 197901 522783 305415 -277150 266684 -7883 -56184 131712 115979 405055 -50091
13030 103596 88112 86620 -180775 157791 217280 110601 -73118 190700 132176 10309 118585
13019 118585 -93898 27631 151601 146138 3821 -314429 147703 242656 49585 -57115 170886
13007 87807 -60234 21546 -64998 296007 267931 252263 175063 -4590 63029 -130460 179805
12995 -63140 -212960 -39951 152031 324118 -136902 -26607 92226 191593 138544 -9779 125348
12983 -97408 -46778 119073 202451 -52605 -307702 -253277 334268 89148 -45119 128405 -113847
12971 81075 -14491 -106349 -267253 192598 249640 268217 -56107 -303545 -305227 -446761 -19737
12959 98935 -118793 110731 171774 59044 -118303 72273 -263437 170587 218059 -145318
12948 57096 15768 -334024 136240 130029 12470 223910 25873 -115033 62537 241766 -48399
12936 17037 237033 66626 -154437 231329 101004 91629 292201 -56549 78546 -50865 362219
12924 -70961 -121411 -52290 -208499 59003 215735 47811 -155422 234936 -219824 -324458
12914 -324458 -155944 117828 -118304 258358 297288 -194316 -83321 -172286 77491 205570
12904 205570 56031 222580 -298512 92180 -77243 271981 426844 -507699 -137920 176196
12893 -91939 -57921 333690 -103480 171962 137230 -113567 258368 57714 -237331 19942
12882 -244367 4473 -201949 128752 294721 162330 104815 -106402 154490 205959 -279788
12871 187084 -21327 60302 -66622 41698 126609 -402822 -57396 -393945 317199 11438 -103011
12859 -169400 221968 -223396 271292 321857 -39311 141448 27667 -137482 167221 -61173
12848 68978 166640 33974 -107629 119971 -89803 -2564 -78837 82865 32644 -25964 45634
12836 169450 -41811 -50337 288332 -143706 171349 3935 580408 59139 -6757 -33206 -132903
12825 -132903 104802 -254666 31336 -170172 381377 -78469 82069 77532 354981 324016 -181211
12813 -28262 17271 57107 38410 -179333 -57889 -27162 114038 380904 165027 93966 163585
12802 163585 -314962 50441 -162687 -153379 -78825 -90034 -43786 -306283 -37704 46680 -5522
12790 19416 168120 -21731 -184363 -29894 -203116 271718 305078 14987 -119131 184609
12779 36225 -70477 277280 -178041 161477 308529 -26388 142926 186998 105431 -285648
12768 25794 40663 10245 221413 255745 -186540 213822 37064 198686 122931 350087 -230481
12756 87955 148401 -33930 -39378 129725 -132781 113228 -530229 -168685 -86451 -68844 207908
12744 -24630 72299 -70254 404348 -328788 -41327 80369 -207749 -205774 247756 99569 -111778
12732 49563 34948 -56702 172045 -138889 81540 11716 336883 20109 56167 -2953 461599
12720 -54947 -192970 -65279 -71985 -190415 -56455 1797 -83928 217957 -146279 180846 -82103
12708 247796 74608 34354 208943 268253 98846 253641 127060 -11091 117469 19852 15548
12697 15548 87508 -177316 -73194 420408 139187 -143402 -23725 75343 59139 -248491 2703
12685 106105 155938 187123 10593 -253193 -39377 -64096 21462 17979 295447 122069 335216
12674 335216 251972 206865 -25172 -897 246685 243295 -91051 4010 125865 1079 188791 158613
12662 158613 193292 -91268 178968 -43344 -168897 122407 199589 -32348 222607 -44121 165807
12650 -159062 -106374 54360 -160702 -186007 166962 -28976 -408482 195461 277120 -432175
12639 180498 103619 397956 311105 3616 49432 136983 70739 -84936 -140606 -133513 219727
12627 -22958 353153 276840 84298 217186 24472 232223 353784 -77351 -87527 110450 168975
12616 168975 -24618 180041 119910 47269 51849 49928 144169 78817 63927 -73330 200615
12604 1224 57022 -148661 -27747 -119686 217287 -67162 -200462 -152268 131507 8334 122610
12593 122610 -155958 -82494 84058 91127 -63371 361644 -84495 50017 -179046 100309 289315
12582 289315 -967 92667 -84845 67921 -16443 40473 73344 53328 90735 -29925 -82967 80598
12569 -253807 64388 467536 6439 134950 105907 -80486 280550 3697 64380 -145030 46980
12557 -5076 -31321 119981 54488 41991 100402 -163023 -9309 302090 9560 -190766 -13038
12545 -126107 66539 55968 -79828 -488771 180110 136266 27885 41484 82283 -321395 -11316
12533 28113 -282311 -64572 145388 296158 77628 -75120 201593 -249249 -198996 260025
12522 8116 -159252 230818 65958 136842 -29863 219531 -40000 83434 -129861 -110269 -168099
12511 -168099 180107 67663 316276 194566 421002 38233 159654 -410189 81809 -239878
12500 -190447 -14731 -242955 70646 20064 362516 120800 260656 -220971 -168663 147237
12489 42267 91909 152553 -6251 62974 110574 -157136 220212 151986 206295 64828 -270322
12477 92188 -84377 -186428 -322769 90729 300565 -30805 -21998 -78473 -104977 43765 -201016
12465 -310041 -98490 222597 253358 -24543 34357 8510 -10466 -153760 -90917 -199979 213013
12453 -313251 -149269 83504 10383 124974 -109092 17874 -7822 -117922 -468689 -101038
12442 186287 127409 -180581 -4796 -77127 -39790 71564 -131023 65552 -39310 151665 47001
12430 -105452 286401 42155 167718 -235128 87355 -224079 82930 133352 200997 42648 11528
12418 288567 99017 -195989 -66209 112981 -148635 223155 -251057 -271563 -119424 331142
12407 134852 127549 -16189 242937 -279390 -163510 -77335 208858 -106799 624 59860 -137828
12395 114726 3461 -245461 -220066 147573 84061 -195520 41239 -131025 -22259 -14774 -262031
12384 -262031 89451 -2377 -258686 207308 254645 -117503 -10948 -190037 -192590 -18460 100525
12372 62327 91541 -55879 139416 -69864 168837 173196 -121745 -44057 -3511 -75161 -158611
12361 -158611 -123766 173417 -61808 23398 274504 -11182 -74999 323094 311621 884 220384
12350 220384 1795 -15142 2359 23834 -25907 275057 14844 -141027 -91553 -126752 -193664
12339 -193664 -81358 16275 168958 -135077 -193912 92408 -177469 -90937 -179117 152655 -46367
12327 -459419 -388172 -137972 233287 100026 -196336 -86992 64732 -148987 183710 250767
12317 250767 -187755 134013 -329737 86034 267527 -10914 135719 230848 -34260 -7809 132485
12305 88639 435156 141818 -257332 214386 -290742 -24428 283898 36276 86019 -68948
12294 533696 309758 423733 324760 317391 -117553 119336 262485 145655 154498 -93399 -105921
12283 -105921 -56843 27736 157921 94463 124714 340271 -52183 325514 -290876 120225
12272 116775 356256 222397 294822 370814 -3698 87290 -62815 265671 19889 -172769 -253823
12261 -253823 -354957 40562 -43157 141101 -27308 -50967 -196229 295901 -13460 448877
12250 68400 -35995 137808 278727 -87323 -45821 429885 143051 154584 -114229 112167
12239 -34992 196110 -65706 319872 11712 63153 -149561 -145393 288058 -50326 318629 48046
12227 -14682 135637 206063 -11062 312388 259753 238971 197388 -2596 143694 107446 27681
12215 -218891 279543 -64420 -236614 265319 183775 286089 -52790 -164269 -27558 175480
12204 67506 71480 -21834 76667 -152944 179901 316667 343835 -108014 194632 86924 201688
12193 201688 229669 480991 335682 271510 372792 170441 55943 148033 3992 325104 -61769
12181 125100 -144864 268090 -46771 379827 -279778 369173 -181959 200285 -72804 1150
12170 92977 -73946 28432 265656 -250970 314535 56306 135903 91349 132079 -6421 11329
12158 131272 107767 -35284 -134962 -115037 63589 2861 131951 10222 -96119 65385 238874
12147 238874 -62670 -238643 104236 17991 34379 110474 1203 353342 272855 -21235 -96447
12136 -96447 39106 2092 9310 193327 -135071 -75218 -69366 158299 4751 489627 161586
12124 -78289 63636 -189481 -193011 119639 337992 197013 35699 -46216 -446865 373391 -234207
12112 177177 -39515 74354 -276432 -235511 17666 -11954 -144498 -83837 85394 235811 58651
12100 89026 -38133 272734 166010 69805 -86766 141586 -5595 77100 -64682 -159667 -138033
12089 -138033 40096 40697 -301140 -259695 32478 -145265 -6008 -13208 109717 42012 -79411 -3738
12076 -98775 13853 -149871 -100330 -176763 80075 97928 1383130 2089129 930387 388270
12065 -6346 12367 158720 81012 -516280 100188 27179 315195 180419 150003 2479 158434
12054 158434 -223854 147829 43880 -57651 241020 -89874 23861 -294657 -238674 -170036 36856
12042 -259331 -75229 -333843 22134 -295694 -24691 107763 120840 13982 29778 -178742 -100156
12031 -100156 -110145 377379 214917 26166 6975 -65222 47819 -20738 -127485 -29889 55885
12019 -12098 -4780 55951 -264048 73931 182938 -125827 -91747 14690 118530 45506 157182
12008 157182 -290203 1708 -221857 -221108 -384205 -288205 -167519 -197794 -186117 -241680 159919
11996 31704 -164095 198801 409630 630580 206014 60082 -198566 -34630 142680 -320549
11985 98101 -307520 -27567 191550 -38875 53775 112243 -244530 153254 81449 170540 12079
11973 -110294 195714 -86026 233644 -184326 -261154 -55885 -71634 211893 -95956 -119841 190227
11961 -360378 112588 115530 80381 7516 -292557 -58245 -194615 -400830 92706 67914 -97978
11949 11354 13470 -50786 20078 100955 -14628 -315045 -88167 -185592 136015 192903 368397
11938 368397 -71974 138216 -207010 -154330 144297 -333376 -23124 118670 -256898 -345892
11928 -345892 -83316 -159062 8896 -57383 165381 79857 14558 104983 -143936 206709 -3467
11916 124432 446765 121695 140742 223709 -50217 90853 -47849 114906 -105227 124924
11905 136455 -173061 14465 -1158 -6398 -50632 47970 7366 -95588 194804 -78826 89856 -155715
11892 224092 -201088 182962 74065 160527 107277 292481 -8030 37042 -228365 -9825 149484
11880 -147173 41758 51138 -140185 -293133 185674 -7038 -372134 73978 -3221 -158630 93179
11868 3213 98493 -306597 -13570 -120050 97041 200440 -110668 121454 84352 -165686 -368358
11857 -368358 -271073 179650 125814 -421356 326768 212687 34201 -422979 -102216 55579
11846 30311 140745 -237366 73720 -69608 33522 -461981 221669 64844 -237458 -242676 334849
11834 59141 -189424 -237210 1751 158521 -158065 89564 162469 -70812 -259164 -128079 -1824
11822 76097 167300 48516 157530 78676 -94013 -99194 -74086 306712 26063 -136181 214210
11810 222807 -101444 116704 -252780 54056 245991 -116947 -20073 278225 -113455 -282772
11800 -282772 443801 12669 80753 53631 36851 -29484 -106503 -223278 -21811 -126597 48267
11788 -89349 -61118 42460 -102337 -90885 -454788 -230506 -221329 301753 -126297 123973 -48156
11776 59833 2037 -90639 137649 -39199 473704 16981 -76106 -146894 -36501 122690 -133554
11764 -227783 -86969 52986 -27160 -190748 2346 161576 -3143 170263 68301 121347 229004
11753 229004 115971 -26296 -104339 -270252 30610 50002 171794 -230781 250926 -154977
11742 38946 16601 -73029 -22027 115319 -100225 36116 47129 100426 -69120 195963 -72156
11730 -141238 -207853 122963 -32946 -54550 193499 -416617 150005 -59415 122931 145143
11720 145143 -263966 211724 -1980 -37733 -87085 151115 66557 -123549 452 382976 -240881
11708 200978 88813 38881 -72860 -156159 39394 4545 560236 193389 -20924 -320971 -171990
11697 -171990 16436 -43674 -297445 27205 48624 -49435 254683 -120028 -52719 474972 334607
11686 334607 222453 364847 10720 74448 139190 68034 -87595 75801 1869 311189 -46257
11674 -69982 56379 47118 -6661 77152 41546 -13225 -253891 90012 -70496 288422 110536
11662 146979 -41922 178414 -40857 46387 -251278 121238 72859 -60706 93762 -71319 -23474
11650 -120227 -110847 24389 189002 119210 -128756 -145002 340630 160269 135726 22648 350760
11639 350760 250265 -329990 -21351 -61269 226798 -13631 -201736 -26044 119655 440792
11629 440792 -37951 -157723 -128190 182858 33669 83798 82100 326137 -55224 244001 -32886
11617 -72286 59361 154912 -80407 -40787 -104520 139924 176989 79841 23365 125640 -7899
11605 96679 28133 -15732 117580 -43283 -5219 57441 179819 153220 135745 -153037 318476
11593 64756 -108572 102978 -114804 -126893 49062 524879 -75525 243801 115605 221333
11583 221333 117586 -80271 -186680 -180536 77623 306037 -133880 23831 28028 41229 -94550
11571 331209 63334 -43962 -102636 344005 331752 73950 271265 -42364 192932 285507 481537
11560 481537 253203 -89953 215437 -126905 108567 116937 -324591 -303801 288551 152394
11550 152394 -123894 237554 15002 161776 -57313 73856 91488 123337 -248301 221308
11539 -21072 -103444 223077 -307883 -194073 24721 -20231 232251 -40212 369739 372729 213765
11528 213765 256040 54940 196259 -392592 156687 162247 -7424 128378 230474 -265997 38097
11516 21595 44946 5942 69654 87188 -57646 9388 -98643 84605 -44225 85255 297939 8915
11503 -7978 -200729 141114 162021 63364 36873 146903 274154 -114931 189091 184681 138603
11492 138603 130082 -6314 71409 141468 -198891 -11204 134139 -253584 337058 -82605 227527
11480 361379 166555 211514 -5758 -113729 135351 158462 59157 46493 239159 155840 -167039
11468 630874 430195 61557 79374 -82024 289830 -14276 -76572 36879 -24707 -31218 117729
11456 68409 -167964 -281463 68842 -182054 377306 -497220 361205 -118172 -70317 -61528
11446 -61528 2833 236687 74917 -90856 -234467 208740 221685 46593 -3848 120007 391071
11435 391071 -130373 -22718 76043 96193 -294195 -96540 70385 100701 152341 -100588 -32691
11423 -113041 214263 245636 -282260 -89459 145566 -83767 -18188 112082 -66900 -311565
11413 -311565 -151822 58298 201679 -114698 123806 102423 21167 433154 72098 207512
11403 207512 -203798 209554 273939 259623 -194278 -54777 -146096 68406 50561 -121013 121142
11391 416800 145968 -104685 -216732 369754 -205559 -54184 -104996 89595 -122208 -61370
11381 -61370 -101106 253514 -64359 165320 133435 -26172 302872 150670 161706 13783 -41369
11369 -71145 -102399 80769 109310 -169309 185777 121654 -136040 295574 55509 -7029 -44892
11358 -44892 28504 -352971 230706 32543 -198732 47039 -255952 -10910 -36795 79465 -125783
11346 -55359 44274 86125 94778 119067 195832 139768 -173220 171552 -226573 14883 165470
11335 165470 -264983 208734 35637 -7815 -373626 -304255 8172 103185 213639 -73894 -171839
11324 -171839 -80092 -91383 98843 -83408 68450 33593 -109247 87398 57008 -13189 -115865
11313 -115865 68299 76930 -3453 -130965 -155486 -35288 -93719 -214892 91926 -152371 -213560
11302 -213560 111624 167817 177617 -189360 -140611 125004 49985 -185537 114986 161675 -175379
11290 28730 -245672 -279524 -71649 128231 99784 -213390 -86644 -47679 -277408 113186 65670
11279 65670 -125450 -108379 61264 83208 259793 279907 -28803 -262383 28791 26124 -71946
11267 49424 -256632 -112933 318598 96291 -76990 181593 -6394 -14689 -11649 -118090 -215142
11256 -215142 -66107 -99521 -317914 -41002 -10398 -158475 175068 -208384 -42482 -22307 189776
11244 126681 116638 -324627 39881 -418705 625 6329 9111 -123444 -236477 81048 299085
11233 299085 -245177 -90103 58805 44989 -232192 35687 -30251 231043 -83155 16942 149584
11222 149584 -192575 94880 88947 -357520 -64376 -17182 -318288 -37317 -194689 -269431 -119531
11210 197191 53342 -295108 -28433 -24612 88420 -100271 114336 -215848 288901 -34952 -105179
11199 -105179 -451050 -6114 -263847 -96432 203601 12160 -125017 -140076 -183910 -394952 -46987
11187 13902 -75400 75913 -17221 77767 140114 -178254 22864 199553 -54634 -31008 65645
11175 -40602 -203959 -92067 -157396 -435921 -15249 -160908 -161765 55787 -285778 -81882 48878
11163 -229177 -208807 -33097 98454 174424 -112843 202493 -33271 49006 -3514 637 -30328 83534
11150 -124895 147584 184454 9566 -92585 -68244 -102895 153633 47910 37456 -234214 145088
11138 125018 -25094 -130428 44136 76761 -13379 -21547 -202976 204231 -102399 56302 137863
11127 137863 44846 163131 -92133 -18793 1238 -248728 -92848 -282364 -7943 -188315 153455
11115 -110783 29059 77349 -21888 256480 -176816 325717 215627 61660 -71469 78939 -16015
11103 230533 477828 108474 7242 84413 307003 -20484 272582 -84602 300518 180815
11093 180815 29488 196985 281811 254474 327182 261064 -60741 521216 372700 142290 297576
11082 297576 -77635 379061 207618 406242 74436 179061 50093 259499 211520 281263
11072 281263 78918 -22101 343215 50588 582300 356713 728249 264265 482565 467079
11062 467079 608100 454790 682993 832620 603021 346112 513114 491731 570568 304097
11052 304097 526296 995518 687831 555480 650546 604677 544658 899378 522667 384143
11042 384143 420521 590770 947667 464415 447623 637577 684994 329460 784711 514700
11032 514700 556175 456527 409929 573825 851512 788461 341224 656666 1022243 330388
11021 450176 393727 595955 329992 689668 508820 793682 490891 685472 797222 688555
11011 688555 477968 447850 684538 763683 953684 731767 481333 456831 643736 519972
11001 519972 623278 831819 390228 680949 728220 702299 495284 448211 766161 739496
10991 739496 793363 1078375 999142 586998 794751 1026303 737494 749292 675902 1253550
10981 1253550 1083174 976765 973068 1338646 1424894 1802718 1698920 2138622 2334580 2438160
10971 2438160 2509298 2655325 2321142 2606998 2235487 1911232 1985826 1823926 1705880 1595270
10961 1595270 1990272 1902482 1720936 1709748 1778406 1646544 1511920 1304088 1055270 1443880
10951 1443880 910238 844438 294940 929756 409166 512212 330510 332438 396656 319386
10941 319386 378161 113396 170309 272515 276127 -109271 -30987 -211466 -223304 88143 129591
10930 129591 274504 56957 -5158 214610 35270 86665 -177704 -344684 99608 222085 75036
10918 32847 -103758 234931 -104748 -3657 9088 82089 20060 -140271 181695 -140943 -96004
10907 -96004 -93493 -38879 -63967 395553 226587 -48842 -164831 161866 -145585 91401 150291
10896 150291 -116841 204302 -9892 -55097 -144303 -263202 -159259 -12607 60203 -165290 90078
10884 -114134 -19692 -280610 -220859 -102307 186252 104681 14352 -78173 -208561 -141170 50783
10872 -135530 209200 35574 89647 -114087 -169521 164669 127971 151525 -321444 -42888 10603
10860 17966 46475 77200 -124676 174523 -139831 -11984 96910 -115040 -171948 270327 354600
10849 354600 -9482 -73921 -9021 146354 -177532 121736 -160696 -67933 52621 241519 -138340
10837 415258 -51818 -92628 -192421 17615 2006 136649 -116069 4839 56887 256598 14567
10825 220816 -151398 39845 64072 -254115 -303624 39392 190030 -15845 -72644 302605 26718
10813 -78697 192412 48620 -133772 -31602 -7170 -126346 200883 153750 -168820 22233 -203733
10801 40308 8337 174714 154303 -98072 221017 -71592 -243746 164497 264636 -54402 -198836
10790 -198836 52340 -51825 -54107 -152755 131016 50783 -93663 27808 -285702 -7836 44817
10778 42817 -336579 -285508 -66525 -181603 13743 136930 -405581 28689 -150740 -252563
10768 -252563 -7496 -113959 -25817 -157393 -45101 -385687 86552 -49208 32403 11460 111969
10757 111969 -2000 47074 270367 269973 107899 38691 -31087 100935 -84890 221581 -77481
10745 147418 8476 -391486 137533 66484 -265699 -369873 -76807 -10870 -45177 -92097 -129731
10734 -129731 87148 103061 103866 -101206 -115915 -161698 -85035 113718 157553 -71590 73666
10722 -56234 -385114 -92145 -243391 -213615 21162 171620 -67382 157435 -75028 -192163 -77322
10710 182509 -155829 -61288 -159893 -260310 -74731 145917 -93328 -63439 -17359 179301 -218715
10698 -112327 223753 39069 167805 -18688 -113444 -231492 -87263 -73839 -23508 -342792 85880
10686 91010 203174 -83325 94791 150288 -97500 -285332 -143159 -43100 -33537 -39920 -113375
10675 -113375 65994 25421 188655 156552 -133031 -26986 -207276 31327 117157 73835 -213169
10663 -281001 -227278 61171 -58588 176103 85156 16707 312190 240212 -132601 104788 -320371
10651 -209717 48768 -113383 122446 -69864 -7980 -88347 107452 -370346 -3065 -124914 -200465
10640 -200465 64474 -32364 105295 -123965 -235809 -4955 -363070 -154990 -351614 -121242
10629 68347 231493 -129081 -139428 -58895 -237303 60644 -81041 25495 -245686 -76648 194825
10617 -158616 -9585 -174961 -72357 2320 -247908 49790 221508 -79683 -52066 139350 144584
10606 144584 -5057 -209636 -92578 5621 16884 -32232 141822 10427 121304 -127685 7667
10594 201569 -32232 -189255 176688 -189913 -85943 -91198 47178 125720 -12004 -35923 -168738
10583 -168738 26258 -155177 -122807 347802 -174295 -33175 126662 -17138 -192066 -97423
10573 -97423 -159884 -379309 102332 119636 23047 34155 -99646 422073 39517 -393056 208933
10561 -151664 165889 92221 86165 33952 -62824 -267618 207101 86748 -116280 -256140 177565
10549 -200177 -58849 122293 -90585 242116 -18362 40895 -253618 -173125 -74774 107126 -144650
10537 -65248 153274 329103 -34995 -49790 164514 17017 -74048 -57957 -127774 249439 161981
10526 161981 -301258 240347 -28771 -3669 76763 199157 146128 36569 -442509 180955 -125267
10514 -319904 -184149 95028 228983 96830 290268 13673 -195093 -205312 -141328 -29144 188796
10502 32875 -211746 -220360 28934 80255 -170509 186999 -101424 99026 51369 -147003 32547
10490 155345 18079 -169942 182717 -150207 -71265 53495 -21768 376372 335055 49817 562251
10479 562251 142463 400062 95009 181501 409819 -23541 -5584 59239 -127955 -293131 -211691
10468 -211691 181502 368363 268795 -99104 -181126 -122914 -24149 17973 152067 -100035 24686
10456 -117517 -235436 -32153 167947 -198769 -83647 -144053 9241 27319 16596 343147 -137965
10444 -7272 -18130 -59196 62531 20118 -15142 31864 -65046 -45718 95373 -74094 -71663 13858
10431 85830 31637 -187564 -105826 -46157 -192945 73437 69206 -36680 66810 62609 924 -15300
10418 132919 175791 120470 -124934 -138429 151954 -292950 -108299 -100205 168614 -80240 -29150
10406 26439 341206 -26703 33468 -132235 -110627 -170193 -63319 97413 94896 -132596 -186803
10395 -186803 94065 -37594 10643 174170 120616 419026 100973 304977 218898 -177461
10384 189043 35869 117006 270227 -1487 -306769 229547 242839 418815 188372 97265 326946
10373 326946 4714 534103 200151 206242 36017 217538 728823 568474 153976 162406 507384
10362 507384 23946 380584 525224 458998 394452 142207 187051 -1467 211951 -95776 219379
10350 493600 406853 458718 451735 691946 129830 327010 295392 46711 606198 296150 212638
10339 212638 87549 157119 160349 183165 165187 268136 159371 140987 75305 413427 100446
10327 -89519 -164468 -87955 76808 249215 149991 121427 -81376 336233 5161 58604 420761
10316 420761 174930 -71897 277655 222376 -61714 108026 190286 68829 -87288 277650 -206776
10304 95357 26827 -88154 -42844 84710 18050 278178 -45637 -136398 -271154 -24698 6492
10292 -10110 80842 121963 -169307 118338 67568 -109178 -83455 -99866 -39728 48357 -274613
10280 12136 -233443 -51196 -69406 -33061 -277086 109654 67359 43987 133859 -176217 -126557
10269 -126557 158360 -29800 486041 91903 112332 -100323 189838 -118913 134038 56333
10258 338568 518702 164237 281199 99141 152627 -282251 -153992 207643 -219546 24387
10247 291711 -55672 -19402 -42114 209739 -468061 -51428 168580 -70780 -174664 -181297 -99032
10236 -99032 184665 -107754 71503 162265 4330 207739 106885 105583 -339943 -153097 76575
10224 -117243 92979 -275198 122427 -206080 13620 297066 -14048 -344559 5573 -111675
10213 -41489 -22869 170168 99081 -121910 -234435 120938 -92341 56790 -14748 185111 93188
10202 93188 -233435 -233479 98442 42016 -112985 -357273 -235478 -97733 -14689 -406903 -299804
10191 -299804 -203467 73241 -166307 -299881 161337 -420823 -33825 424172 -85712 -239456
10181 -239456 -354482 -154810 299818 -208925 -13632 -19189 81651 -211544 -103366 -331291
10171 -331291 51517 -174566 178743 -89160 171007 102878 97912 -251300 -53702 -135407 -260038
10160 -260038 -134250 -326342 15557 -12141 126211 -217122 141876 -134149 -102410 224501
10149 -34745 -26207 -184914 -134668 100630 59724 -349610 94534 -352523 152755 -106854 9393
10137 102915 -59693 85776 -207297 280454 64096 -89971 -204118 5606 -80684 -195132 -100702
10126 -100702 -190742 17954 88316 -215595 -214953 -2374 -87866 -105531 -189819 -144851 -84496 48610
10113 -248803 163959 -38344 -263603 -92466 241272 14070 -97582 -47962 -166314 176110
10102 -420316 -18395 -8656 112575 150808 113677 139478 108011 -166177 139237 41820 -60720
10090 -179191 45330 -123874 110254 -119770 38233 -116798 298588 292736 -418190 -292412
10080 -292412 -299033 -152974 -22534 199452 -283264 85188 281867 -196825 -34411 -16963 -21438
10069 -21438 -42588 -125032 -233947 -154200 487103 60412 -162583 24702 -197046 -189719 -142143
10058 -142143 26474 85251 -78583 1138 -636788 18880 -306068 -110220 18544 132852 -122852
10046 104496 54748 -175879 -114212 -208444 -245668 -75778 129945 -193291 -54992 201151 59310
10034 -102873 190366 -117739 -101965 17966 -44019 193863 126984 -118774 221823 -151298
10023 -70669 -68847 183244 -31416 -10144 -293058 143971 -224195 -44211 -145130 -265874 -218757
10012 -218757 156854 81139 54300 -19121 -46499 6962 -96674 -40473 -4945 143557 -262887
10000 -128486 -47658 -6983 -199721 -210668 -340812 -429033 19740 -261559 -204764 -68138 -98146
9989 -98146 -175125 28026 -37409 134831 -239423 67403 41744 -268107 -266775 -40887 -259258
9978 -259258 26469 -70490 -372515 -14771 -297124 -26196 259693 -265680 203163 -8431 -136477
9967 -136477 -223900 -80338 220055 -6139 54557 -105964 243774 11277 40748 271701 -87543
9955 333240 -134346 -283936 44932 443164 -307582 125302 2877 74733 -128823 35370 80788
9944 80788 -117214 -186281 -335600 -288362 -211329 238092 -227315 111578 -64309 -281223 -144078
9933 -144078 238446 -234507 -432304 86522 -437092 -145369 -333353 1741 148047 45164
9922 -115771 41412 -154195 -280509 -279952 245644 -21269 -70253 95137 2632 -420245 -114234
9910 27457 -55101 -101033 -400914 -44904 79700 -192835 -288840 113918 -144594 50661 75331
9899 75331 282618 -44696 38501 25190 -94248 -524306 -136577 139026 -12272 -346179 -88925
9887 141067 4952 -95625 111678 -77746 -258018 242801 11673 -29811 -197959 -62490 -147030
9876 -147030 -402576 -251265 -65832 12382 -155699 -50912 -263467 -276297 -221072 -29362 -74241
9865 -74241 30017 -79088 -149874 130492 -169723 -60897 -82775 -38443 32679 -68212 20129
9853 4583 -61804 -142310 -326460 52790 -168391 -201685 122554 -9119 -75266 -232189 -64630
9841 78318 -147847 94998 364101 -44135 108438 -40868 193844 -119657 -20039 -320992 1219
9829 -197257 -164116 -71071 40192 -212904 -307867 -186386 343347 -352357 -149244 -181300 -77955
9817 -164258 165141 28789 282274 432060 -63728 13625 -173022 -81859 259921 96292 101206
9806 101206 -137132 -35406 -195834 140597 272707 -74910 149188 149331 -161255 418335 102452
9794 38158 88782 -101891 -46614 151002 32863 -166784 2117 -402873 76370 57867 -264906
9782 -202356 135026 25436 -106309 54887 43399 -93065 23258 58362 -34788 117841 -46412
9770 -96889 -200953 233049 -34095 -4067 -334150 318484 55861 -115278 259975 -220445 92342
9758 164333 12595 16016 -90210 -119858 -180927 -241794 -105595 -149560 -118155 57853 -94461 54336
9745 -152873 58844 -121463 40912 -240661 11105 202279 -44115 -212711 180201 134744 -172105
9733 56547 106971 -46331 -245891 -178281 150319 10272 66420 -60494 -149993 -134549 -120581
9722 -120581 -172799 -310666 223053 -63094 -100034 -332656 -56127 -166777 95453 -269937 126137
9710 -248507 73660 -302066 -30002 -99325 46067 -262371 -130632 -220221 -150068 -26208 42154
9698 214516 -70239 -12940 293398 174505 -156992 23272 -55949 -66619 27215 212326 303553
9687 303553 -45178 160816 4223 -41306 -155307 -119983 -113912 -70553 103848 109165 -106579
9675 -50876 -7671 190953 -76122 -180837 196111 141298 -25686 -26343 -73050 59880 -372264 -311136
9663 -311136 135762 -88383 130675 -305182 -298327 -280192 80254 -252555 -441380 83745 -108942
9651 -87363 -328041 -113031 189545 -209860 -34864 115326 -231646 -98327 -211015 -258469
9641 -258469 -55828 35512 -204203 106182 -91386 97307 -33702 -19105 -13784 -18125 37804 -276072
9628 -11006 -118414 40403 -92061 -41762 55625 -10329 -45379 85471 -154529 47991 118859
9617 118859 -282217 114087 -49710 133703 -203249 113215 -264396 -173558 -112963 -209467
9607 -209467 106662 72365 50995 -105768 -121002 73182 136325 -131972 -90943 43063 -166865
9595 3288 -153228 28411 -222701 -101023 98509 108401 112120 -133959 -9874 -381691 -12395 124835
9582 -139894 -58869 -274972 -159244 -224743 -167763 -252007 -97880 73932 -345829 -39498 -217247
9571 -217247 -29869 -267164 59073 -42555 -81222 95922 49114 -138445 -19070 -13170 134990
9559 16648 29417 306988 6645 -217926 -131203 2195 -183967 157981 -240928 -257149 -242775
9548 -242775 -163586 196553 -73853 -193366 -358274 -140054 32114 -171037 -19565 213051
9537 -416244 -54766 105130 -74200 -106530 -248134 -193682 182186 203303 -103647 61228 -212551
9525 162852 -53283 -58898 -67477 -43014 -235496 -263508 39001 -238569 -295138 -195437 -578321
9514 -578321 -7974 192992 -202202 -143469 -278375 -5760 -93431 -243503 -29934 -200890 -47459
9502 -107644 -29590 -352783 -87400 -65926 -150328 -12284 -136440 -26675 -166456 25187 -200356
9490 -222414 -233156 -28311 42509 -296536 62848 -236667 -38016 -220878 154458 158592 -219981
9478 -102200 8568 -28530 224222 134169 104201 -16374 -361285 -204754 -252680 -285808 -59170
9466 -157035 -149169 114351 287326 -210237 -270393 -161210 -242169 -203067 -119563 -70237 -248882
9455 -248882 93337 -54675 -89021 56299 -158590 -297525 52468 -103345 134517 -117922 206774
9443 -144236 247923 33237 36176 -188940 222652 186445 -54097 -51373 -277898 -109852 279288
9431 -142381 -93687 5608 -189389 261166 26057 -62602 125955 -128700 204850 41535 -252808
9419 10845 -107229 62358 153026 -26060 139638 -109676 -93909 153298 -447092 62318 -328069
9407 -257502 -97002 144615 -252261 -287052 152114 49064 -44807 122608 -28308 -22565 -308970
9396 -308970 228775 -60883 -222130 -173813 193108 -183189 -5445 41012 -3131 36068 -83127
9384 145338 102385 -236783 -122182 163280 203008 -144471 -155195 -237895 -103361 37713 90105
9373 90105 -44950 256664 -77357 -349305 171617 -218039 -18419 -278554 -40276 -265729 -202390
9362 -202390 42244 324712 -30776 90943 225133 -121441 -76501 -309210 -175445 -190062 -66810
9350 -160801 -29207 59378 -97597 125010 6592 35700 -231911 -283375 358521 -32630 50723
9338 122422 57022 147483 -106007 161975 27271 1613 -129275 -38464 -115417 -62460 -164829
9327 -164829 156521 -67006 49758 -275340 90619 -77561 232273 -118327 -77626 60852 -8131
9315 -171976 35324 3726 -162363 -38753 -43164 191684 -200153 -160256 -55965 -277075 -136333
9303 -238838 -21278 155416 51534 35430 -132529 118590 -161467 183781 235572 -45671 -236405
9292 -236405 93173 185384 -139992 124498 -26080 -104474 -128184 146511 -365078 -222294 -93260
9280 120873 -100577 8816 -145657 136552 -48607 30198 -248511 -223754 -144757 -335092 117956
9268 -64967 -45061 -37948 -148698 -247271 69942 -169743 -121542 -479035 -13788 84393 -291810
9256 -275719 -64267 178375 43015 -430643 16128 -252896 127948 2382 -32498 -219419 -63266
9244 -158803 -92224 147652 22952 193351 167093 -161348 -70474 197944 -16156 85721 -97763
9232 63542 -160330 62001 -45830 -31031 -68074 169059 -13529 -219500 21507 28387 -53050
9220 -131173 -229871 -103250 -55411 -116983 -217171 82184 57032 73597 380 -42159 18733 -309877
9207 -223999 -96671 -285238 -175297 128496 -146530 -56646 -30186 43939 -31005 -52903 63767
9195 -165345 4018 36300 -136872 -101912 -153774 -312571 -114689 71599 240018 -101102 -28554
9183 -106096 -13063 -200583 -137356 -106772 -297998 61209 -135160 -177034 83049 31065 -212543
9171 -100962 -106762 -144456 87603 -154290 -151630 -198260 -285682 -31801 -83450 -494 -221911 110027
9158 -102646 395822 -158775 -399277 -115136 -244094 -174279 209569 -181612 -27271 -115014
9148 -115014 121606 412609 -261490 48850 96402 -58447 -462170 20213 45818 114038 47018
9136 156214 259380 72408 -330718 120794 195946 139063 -100055 -310417 -421823 -368010
9126 -368010 255020 -280945 -90053 -175423 58438 130242 146751 -283731 -411532 299050 -21036
9114 -140302 76181 -459084 -320620 -123710 90768 141160 -336549 -81802 -148015 -163951 -152261
9103 -152261 -69209 -81244 -68317 -374886 73638 38547 96644 35863 129551 -254593 97707
9091 283452 -297981 -46751 217653 -335987 116677 -343501 -89234 13001 -83826 164856
9080 -100771 -346057 48936 451107 -67940 -57518 -4842 -157661 314464 -33912 279280 -73728
9068 93474 -164649 -154703 -5457 27760 106895 -145870 -35959 -3304 212024 68583 82693 360421
9056 360421 -49514 -231872 105230 202061 -91383 -24085 -349330 -401378 -30636 -235769 48293
9044 -413582 -42411 300181 -66099 25947 -65185 -84843 237783 -188840 -317212 79049 -42616
9032 -267018 -256924 152540 -69268 52739 76236 -166902 60158 122163 -124131 111181 144394
9021 144394 -233277 -381567 -243270 -159781 -70880 34933 -151784 -124482 -122439 -211045 -11893
9009 13947 114451 423082 92506 123990 291647 84290 -112859 -68804 -298372 33268 64012
8998 64012 162666 81151 46541 121245 -293093 -25236 40601 -54945 278766 -95993 331306
8986 -190600 -220180 58365 39298 1108 66136 -218477 -195348 -327802 -25975 250730 -68781
8974 -11635 91161 -274929 -28943 -320983 27395 -150682 15813 85112 -67483 -111730 -36348
8962 -98452 81082 -235419 89387 207850 262715 71974 -272032 130453 129451 -79907 -283902
8951 -283902 -75070 -119878 -151341 -68029 -172019 -274746 -209524 -48301 7416 -3566 -132010
8940 -132010 -43512 -300103 -153988 -138508 -319598 318594 338310 -82518 -150910 -295222 -38761
8928 -93641 -15612 -303980 67701 342648 367697 1951907 6686053 9934149 2341084 635585
8917 413440 166920 34232 30327 -278094 121727 326763 -39676 -54820 72348 369147 132311
8905 -196836 -259339 200152 107857 -250200 -152599 69751 -3627 -92960 6126 -276045 -78976
8893 -20747 -280836 -17299 -11374 16049 -290790 135076 81441 142615 -119004 62495 134379
8882 134379 -72106 110726 25270 -21357 -222585 48537 -61968 178368 -114822 -315514 62708
8870 109968 207661 -172880 317971 30807 287904 -13176 62425 -240887 -240575 -295342 -73137
8858 -323548 -59555 213067 115768 -99440 -67034 268190 -115155 -288233 -150892 -83359 -3660
8846 46616 -260957 13102 140220 -67468 -8611 -132936 -234217 -465821 124822 -231132 32411
8834 -61000 -421464 65238 -94311 241873 -27742 -105448 -81764 117290 112143 247742 -275434
8822 -9509 -103258 -69753 -475333 -51054 243801 -158698 199118 -111407 -25662 -196584 128335
8810 -77007 -145745 169621 -92368 -103191 8368 -76112 -177212 -169374 -74963 116174 -33194 -63452
8798 -63452 -23394 -256825 -123459 -125376 83715 -327112 -241855 -200553 -35724 -114440 -384880
8787 -384880 182690 30721 -91160 -352421 109842 -44379 -517213 106803 -91323 56364 263742
8776 263742 87652 -25333 -367305 29821 199464 61507 54139 -189626 96641 215544 -200260
8764 -153193 -176023 259072 123621 -19342 126211 -227125 -248549 55837 15880 -105496 147742
8752 -375262 -397268 29555 -214224 -481584 -207531 -195560 75668 154184 -1672 140226 5353
8740 -130827 -159194 -305027 -63023 81571 129730 141476 -268780 -59311 67060 85934 -25764
8728 -184935 -167562 -72396 309180 -219318 91113 -144896 271356 -437116 121402 67133
8718 67133 341274 -458267 -164997 -36873 -291080 224296 -31621 -37711 180516 -35840 -50097
8707 -50097 226935 142792 62760 -122511 50478 184210 -153231 -178761 -211834 -56579 -68681
8696 -68681 -264305 -77370 182059 -66796 -31762 -257240 -101550 -53470 164530 -151839 91512
8684 -103920 -52462 25960 45054 127971 -148598 -109091 -24529 -129896 292097 28605 -434986
8672 600 -296141 29775 -80351 149967 126299 -113993 -79281 40387 20726 -238404 -27246
8660 155130 -187603 -103099 -246555 -81954 -62275 152375 -78568 24256 22479 -299215 -320452
8649 -320452 -70334 -25971 129961 22367 -219868 -224768 -258279 74239 -214969 -330280 -15788
8637 93055 -103874 165424 175348 227677 304784 -160056 -189361 137258 171876 15173 106598
8626 106598 47767 -24208 -139253 678 -157029 -5947 32123 -137405 -29078 -297350 -193955
8615 -193955 -36077 109546 -194729 -65248 -66829 -10463 -319272 34633 -317643 -91896 94835
8603 100157 -81789 -59692 -56469 111919 25089 -227103 114173 131054 30501 201107 -180871
8591 165800 271750 -43691 73182 205731 -1424 -224888 -232589 84672 10067 -164030 -122819
8580 -122819 156907 -52293 -205699 -185971 -107158 239418 100587 -59983 150698 221725 -91457
8568 -5672 -92514 -148823 62612 155985 -112256 102344 199257 233904 334846 50330 -228614
8556 -44894 -113522 93222 -27703 -73459 -205561 -26792 -406480 11967 -399384 96269 167873
8545 167873 -239291 -278535 31357 54113 -259889 59934 -140723 173790 149092 -34973 188527
8533 -149398 -111809 -181056 -21643 -155906 -126054 2488 8781 89637 -142547 -110042 -34499 137772
8520 81006 -271651 -236195 -179685 39172 -234652 -246431 -102978 112598 427561 -252619 39567
8508 156717 241457 28068 -141889 -6679 -47538 -386162 -177325 46919 -48990 18183 -158905
8496 -436194 448768 -30047 72394 -95455 -102908 -213996 -177747 -88120 25519 -359894 81929
8484 -151820 132481 -50179 -214543 192513 -161320 -141615 125946 218813 25799 43335 -135895
8472 151715 148750 62999 -44106 365915 -194186 -102543 16174 -209522 42377 136695 -254386
8460 -205388 -113321 -41352 203585 -110042 -145547 257821 79870 -39550 -53204 -75736 212709
8448 -202990 -146248 238317 -310483 -130040 -38885 -30460 105690 47640 -420687 -116133 -99991
8437 -99991 -212242 -106215 -218132 -47739 -27234 -40367 -246164 -71882 84471 169531 -128179
8425 -59429 -147066 127448 -156619 259577 -207467 66164 -128556 96486 206299 -10341 -78295
8414 -78295 -34576 -100916 -193645 -96558 -192485 196747 -74717 47793 -167528 -147458 -113663
8403 -113663 20343 -129835 161321 -163941 78736 -94707 15788 -194385 -434590 -291780
8393 -291780 12266 -76271 296791 -199469 160810 -11331 -130502 51702 -231113 47071 -158716
8381 -61276 -24971 -37787 6689 11803 -298811 120935 330319 -5333 29202 -107601 -204323 -105262
8369 -105262 -254112 -62273 133784 -224135 73856 -104389 -384690 1948 159150 -351840
8358 -33287 -292092 99894 116585 -113618 -80033 196255 -101125 116672 -276654 -82558 -23320
8346 -16313 130692 85452 7737 97322 -504257 34094 60148 21084 -22840 95230 -255166
8334 39065 101875 67616 -131896 -178256 -30348 60281 -225779 -359358 -91528 64885 -295460
8322 -2350 103660 -263570 311381 -97570 -72368 -296047 409889 -173608 -122884 -200607 166060
8310 -211812 76997 -9243 106335 -264198 -295209 -201842 -97669 412880 -32859 -250215 -348970
8299 -348970 -8323 -130856 -73654 -78233 412994 -143546 -170933 -23073 208583 -170596 38166
8287 -235539 -138568 -108710 88263 -243102 -121320 -78601 -101246 -108878 -39459 -81270 79859
8275 -208090 -82638 -5841 -370498 34475 -268703 -99783 -148851 -220414 9426 -300753 -32599
8263 226513 -353180 -136146 -183799 19146 -32788 88606 313131 398674 -78199 247420 -78897
8251 -107245 -164358 210341 139058 658078 280053 104092 23366 -87968 -261436 -301314 154377
8239 72885 -100815 96148 -72016 60775 -66223 -117921 -35431 -36446 -281928 -1047 -5264 -173679
8227 -173679 82168 -237047 -161580 -50143 -227075 -49029 -344659 11104 -400416 120367 -91610
8215 164746 100937 46198 119966 246101 -204219 228375 -75433 65596 -82405 -271167 -258834
8204 -258834 -154506 -102649 132646 8630 264691 -483817 -99611 82854 26298 -191303 107398
8192 -199365 -277350 -89931 224622 -245914 312035 -103302 -125405 89837 3732 -75277 -113716
8181 -113716 -237497 -91025 219302 185146 -91634 145289 -46984 160482 16857 333032 -106493
8169 -207797 -17894 189020 187123 -206114 254494 -276562 -284026 77373 51865 -191969 40067
8157 -566436 48103 53796 -207842 55206 77124 -8304 -132205 50109 -138027 -216491 107508
8145 -125242 -93913 29496 -54538 -47178 50162 -2909 -39796 36922 -67531 -112059 -272986 -47322
8132 -81357 -170008 57384 -5501 -109729 -95387 -20458 84884 50975 23358 79540 -154757 -295686
8120 -295686 223370 178225 -13931 -13753 2822 -79006 52481 -403716 -124898 172439 -40990
8108 377052 -13587 10031 186042 24884 -11880 -230716 -48710 -185166 -1802 289029 -296687
8096 101955 79745 -235341 -88949 -15798 -198704 -126541 57331 -212143 91693 6901 -151909
8084 219234 -403194 46869 -131400 -98972 -119681 -62483 166598 200447 -24850 -100042 22760
8072 -178588 -387498 177957 109748 -46014 -106037 -160993 44329 -38734 -171024 -333510 -13658
8060 -40725 -156650 -136592 -262453 -321856 118592 302064 11680 -78621 -177944 171053 -482080
8048 110612 -84373 -207934 -163354 -141856 147547 168702 294121 225424 21845 -277047 39277
8036 -51467 19736 69569 34948 233134 -144574 62349 -35507 39298 78667 -153408 -172862
8025 -172862 77728 115061 -208038 -282097 -114694 321555 29007 -242665 -229721 -45039 -132364
8014 -132364 1478 -65271 159035 71750 175845 -66717 -124869 -189935 52958 -13540 -3606 -46246
8002 -46246 117270 -130028 -179212 117243 -27936 63704 -6240 -84792 223185 272701 -1840
7990 185304 -337809 90618 -187061 -151523 137449 105323 -354004 -149830 -196204 -102584 62733
7978 59076 -14240 -58038 135464 108182 -255552 -256075 43258 -376717 -140140 -6285 -330234
7967 -330234 -19146 -116287 -49122 94014 -156240 -168879 69312 -12640 211341 -207114 -238275
7956 -238275 -246832 172567 -104250 97384 -177764 186158 81381 11458 -102287 41604 -60280
7944 113264 -92513 -148419 -68378 -44996 14041 -22380 -19127 -178970 -146763 -96405 -200798
7933 -200798 437829 168553 231819 -132082 18859 -289033 -138351 -127797 232781 -75513
7922 46183 -256672 -205026 164521 -299637 -690 -198306 -75743 -253206 -49531 -79428 -119729
7911 -119729 -6309 -204577 74076 74599 -219686 -84949 -143552 -91916 321737 -268183 -38883
7899 48319 174239 -8355 -54182 -103901 92389 -284329 -15181 -203509 -79483 -127791 -252563
7888 -252563 79081 -4570 22119 140137 -10562 307056 -368183 -50776 -106201 227103 160507
7877 160507 -181920 -101437 -189265 -103232 272452 -131571 -100449 -248229 -99231 -26760 21263
7865 -2747 -126062 164583 -79413 72278 156962 -193797 210335 -100045 64208 -583056 70956
7853 -243992 67897 -206479 -149679 -33344 -104413 336953 143597 238434 128797 -22639 21315
7841 -183368 -182411 -11958 -83988 134353 168280 -3267 14701 110833 -95577 222122 -226928 252651
7828 -206091 -221646 -40585 3505 -157172 24130 191901 -66667 42633 84207 203295 -5047
7816 -166020 19564 185460 -209474 -419247 -40329 221447 -140858 98009 -70489 -140645 -154176
7805 -154176 -14128 162189 211317 -132082 -354822 102768 99654 132118 -154054 61365 -78297
7793 -47555 297608 -18173 386581 -41602 -197675 81986 -137070 -206461 120521 -123624 8774
7781 -85925 150649 -169311 -177793 -308 -114521 111972 -61829 70484 -389843 -177423 -19124
7769 -17313 74591 134894 60813 -15645 68493 -39000 370732 -198425 60732 75119 -308651
7757 -100035 -34353 -56889 -14306 -104807 202094 -58017 -98571 -288394 -262905 155359 -1136
7745 201850 -4379 77733 403512 -44183 81401 -133603 -195564 -160951 88682 117097 -142900
7733 8948 -51232 -88865 -16022 -64882 -172099 41099 6154 -34810 86590 -80387 -32385 146722
7720 -240310 -91425 54921 57622 77188 -168477 193809 258370 -639 37020 -33983 -89985 227026
7707 68548 109576 165637 -19758 24225 166254 75148 94228 -82173 -132013 -210935 -158169 -233069
7695 -233069 73729 -43592 -380529 -274521 -226760 27395 51445 36625 -79999 43640 -282897
7683 -183804 44669 -299608 -14268 -89804 -512839 195255 56113 -214194 -33501 56159 118243
7672 118243 192604 185966 224149 -106984 -147259 266097 -83769 33068 -337019 -13346 -80857
7661 -80857 -47791 -5543 -242749 -126687 -109952 -160155 -182600 -33480 7724 -437628 -217808
7649 139255 158391 -140432 238549 241526 -206362 61664 138886 -2823 629 -113954 -127084 -380148
7637 -380148 -16094 -132222 41388 -14536 74374 190648 7547 119731 -219805 58923 160573
7626 160573 139234 6355 -177561 -85611 -78634 -73789 -331353 -48826 -6473 170500 21347 -114609
7613 -65307 -116834 10350 -73441 -193764 68939 -64612 112522 92868 72123 12606 185478
7602 185478 -140369 -217654 -223839 -44096 44712 70314 23463 93534 147292 -153485 -272062
7591 -272062 403702 -120504 -156458 -180810 -340764 -2988 -171329 -42976 179021 248410 -248296
7579 -308359 94365 -42272 -109965 -10208 46259 -65331 -178376 -103655 -242049 104624 34300
7567 -50964 81718 -170455 -199178 -270060 -53105 43671 -276766 -85279 53607 -14816 -69323
7556 -69323 -134447 176494 58445 -117411 115105 -32104 -88644 100167 -86784 -30968 -8590
7544 -47180 432373 -474759 -182205 -37705 162476 -280778 -407049 -245373 176822 -251234
7533 309580 16250 114794 7346 232225 -439157 -81271 -147043 83005 -195910 29226 55810
7522 55810 -138538 82477 318479 -5088 -3199 111221 291482 -395601 -83452 13773 196965
7511 196965 -23721 -81684 84592 -242183 -128229 -183473 431230 -49591 292240 -32539 -193686
7500 -193686 60858 -72206 138103 52795 -9931 -150353 312145 -243025 66932 -48534 -209578
7489 -209578 30711 -173608 4187 -110917 166889 57109 130040 121169 220638 106589 90995
7478 90995 115734 -56202 -184567 75704 118352 -98343 23562 -205082 -247828 -254255 124385
7466 -10681 31551 -436312 -198000 -130059 -96132 -194524 55082 54818 -226080 -76126 94827 7752
7453 257067 -35311 88837 -101591 -266275 -43755 11568 -31216 393235 137647 -7185 131667
7441 -27854 -78133 25945 13255 7671 36047 -313995 96281 121347 -39854 -81449 -19915 -32289
7429 -32289 -57361 55875 -253505 247479 184442 -15040 7270 -65834 -223625 146306 -12632
7417 -28638 21271 -149674 113552 14626 -60334 -121602 32221 -483917 -75869 -54292 83911
7405 -232391 -106640 -70513 66487 -137655 -3929 171905 169455 123585 -153654 -3234 68971
7393 -277830 -189934 13829 -262958 102521 -362959 -73522 109367 -262668 -225774 181160
7382 492907 61880 -49404 -55445 -228919 -152762 -205305 -256019 -189295 137661 -250995 -96273
7370 -33642 -50373 -172301 -114017 -16754 -66943 80395 -43248 110192 -33907 39788 -8507 -86269
7358 -86269 60380 8955 -35722 -283498 -146859 -7166 11218 -99369 -57492 105631 -80859 212853
7345 -4564 -182828 174443 241597 91734 37457 -27485 -140895 -203265 99704 10190 182656
7334 182656 -24847 69085 37471 -233521 180996 42759 65859 124779 -182096 -85754 -87248
7323 -87248 -77760 256228 -30318 -155472 -306060 -163724 32600 255995 -30080 -72150 175387
7311 24888 -121142 -161364 -186466 -19183 -254431 103968 -361887 -25874 -247470 -71828 19543
7299 -190295 98737 246921 234532 171976 -113658 415093 29204 -129963 109770 -153991
7288 145431 -39840 43629 -61870 184671 -236101 -383130 -112387 105240 347536 -313261
7277 -131026 -140263 214297 -60885 5272 -245469 29439 -159766 50299 -143285 150262 -111398
7265 26379 88678 13325 -105847 69719 -77187 20737 23974 -179412 -329304 59603 -188021
7253 104097 1008 161263 173839 105636 -1277 61104 -30340 130711 -61092 112441 -184655
7241 -159287 83737 179545 -231987 -71876 -409152 265169 -222987 65251 -453715 -172267
7230 -155973 -127020 -49317 -165442 -406305 -193156 175107 87996 -137113 156192 287597
7220 287597 63018 -177622 -87091 -56028 81231 62374 -287179 157278 -70788 -63356 -173024
7209 -173024 33814 -377760 -473299 258364 -82606 122916 78399 1124 297188 -36325 86707
7197 146303 -158995 -146881 116597 -125180 -265740 69325 -27959 220733 -61860 -1780 -218658
7186 -218658 33471 -52045 -56416 -73738 -44206 -207545 -77576 111898 -164328 -73577 -260067
7175 -260067 11821 4916 237368 -57870 -71276 -106891 -261373 148011 105303 2219 -80651
7163 -81780 179405 44278 248916 -104716 -12942 -134482 -172216 93261 -70772 -101574 -6395
7151 -228263 -44759 -147080 11297 62302 -131002 49657 150471 80526 -310694 -262342 16772
7139 -81387 -138865 -29779 -193746 -173975 147332 -66504 -24861 -296450 -109120 12852 -137354
7127 -305913 397353 -37525 542384 -76520 73090 -134228 -240145 -208479 33803 -184698 -193691
7116 -193691 252819 -45869 55914 -290502 -129245 183720 130032 -143521 -249989 -260218
7106 -260218 30247 132150 266724 -362884 104635 316378 181110 161062 -649572 -251592
7095 199185 123011 -183681 -182312 -83858 -162941 351340 -22438 63903 230777 9188 -1040 26567
7082 265993 -342173 -43189 -6497 -241036 114086 136924 -71263 -280624 -363179 -115830 -320142
7071 -320142 -38011 163417 -212463 46893 167270 -19087 -430213 -103188 356884 253797
7061 253797 68085 -94994 189524 -193084 -11332 128858 -38945 19004 -202774 -34081 8146
7049 -4291 -197486 -237458 -130837 149728 -37629 14656 -239556 146592 -110947 77320 -269337
7037 144148 -182881 -204407 60541 -147990 -128928 -55876 25955 -9296 -113686 18502 -68 -61979
7025 -61979 20457 -139274 -203777 100868 136899 74011 84914 -10765 -151758 78442 96286
7014 96286 -51922 93796 -6243 5750 -31382 185183 -211535 257519 158658 -452520 25006
7002 144521 107728 -82444 -181102 74829 45629 -27663 285544 129705 92876 164121 -98753
6990 67214 -190113 -282178 -245707 25399 33578 14857 -36374 47843 358084 61250 -139679
6978 -211206 -11257 -8452 176965 86019 -192276 13790 -344803 -132047 68756 -255341 73281
6966 -186234 328710 26708 20561 16377 140062 -83439 -298092 -58105 56637 -166317 276011
6954 -14545 35843 167167 -291580 -95667 119399 -25245 -153391 -240925 62704 -29614 61799
6942 19899 36193 -203708 -179832 89726 36902 -29236 -278634 -72959 -362955 136608 243577
6931 243577 -275073 73460 -123743 -120205 -131028 -147861 251334 -157566 166522 218536 194420
6920 194420 -60526 83761 46921 -61101 -323089 29288 36986 -143389 -64283 -174667 -194328
6909 -194328 -210113 -137723 -356977 44731 67683 101962 210346 20682 172953 -74734 96387
6897 -77254 12024 6117 95387 -77743 107077 -107701 -97820 -190367 190546 -16184 -13905 105210
6884 130461 -148076 -294965 -112961 220232 64771 -98455 58128 142056 46048 37644 316518
6873 316518 -102662 -208195 -269887 -159556 -43996 -17468 368047 -176032 145182 88625
6863 88625 -113589 -215704 3513 -123876 263545 -388412 341715 -73214 42607 -135310 -253497
6852 -253497 11933 -91652 157273 305879 35961 -12239 -268759 -227558 -16343 233982 -149799
6840 -123636 -137431 86775 -18982 13862 86433 143476 -135555 -187541 -29128 23399 13418 300486
6828 300486 -256880 23811 -124590 -57269 -34320 140703 203672 -334870 -276774 -22105 -93329
6817 -93329 81374 -153144 232239 228232 37529 -23496 86195 98959 -1483 -297797 99227 -175351
6804 -102736 389684 -222359 -106261 -308882 230172 -246946 -176712 -11873 -131038 52351
6793 -205969 -11253 -158168 -72138 19549 355087 -41447 -34945 -5459 -103629 5883 -145151 -144996
6781 -144996 30176 -182606 236785 61728 58020 -175142 -297928 228353 -145160 -134819 74922
6769 -142672 -115885 19004 -327341 56090 77669 -387467 -90923 -70472 -52818 149832 -228259
6757 127296 16816 6334 -34897 -204959 163974 144294 -48710 83031 -120174 -290494 279004
6745 174447 -50973 20596 76475 -47336 260607 57399 116911 225226 -121711 257897 197678
6734 197678 368280 26216 332584 -194371 137152 -98600 -39700 208268 173786 181283 -46597
6722 339332 -61082 174669 139302 395012 141478 -223632 -228380 -5301 -426528 5501 -151445
6710 -184286 224844 -244987 -450507 -20595 355713 152494 -40904 10896 91928 376017
6700 376017 -70367 -210018 266361 48832 9651 -168788 -101362 -168887 -331310 -35253 -83461
6689 -83461 150414 181702 -326443 -11459 -460808 247778 -145572 -23572 283132 159156
6679 159156 109851 -184176 74160 -417745 -388676 -240246 -165882 191070 132993 126264 -99769
6667 49161 -66459 19912 192659 -6354 227533 -29350 102190 -78549 -247624 224175 -82770
6655 19666 262284 -335416 -293929 -96790 -265002 158442 -265825 309018 -209842 -291125
6645 -291125 -17027 94067 -6691 -116824 155720 519377 -66149 192013 -157559 102759 -122611
6633 -39599 -61098 -26384 -197552 -47500 -45131 -197973 -116511 -143077 -317444 -215335 5393
6621 46491 -277875 -43511 -312324 -44938 50036 -86072 191911 -105778 185194 103117 -433
6609 152049 47910 -96077 121614 289034 -2152 72470 120833 524691 314039 47102 -98632
6597 206888 -48818 65660 -105683 965 -34932 -22313 -120608 37575 193446 184199 22498 75961
6585 75961 22522 268432 -127190 48852 -186545 127709 303880 -33649 253250 92508 -207036
6573 711 393816 139476 38991 270313 -276411 -359769 -59157 -40458 215958 63826 -58824
6561 -36760 -59219 -53790 1982 315061 -55233 202674 -89996 65921 103042 -12787 -109935 -166342
6549 -166342 23444 -194298 -131558 137593 117523 -136913 -184780 -281559 180479 -10112 48002
6537 -33835 -33845 15723 -143462 -200325 46984 212750 864 -214368 382640 -163348 -115956 74925
6524 -177737 -96283 179250 205029 87748 175468 -177308 -165232 -99026 42285 -128977 -101610
6513 -101610 232918 -27611 177368 35535 -132258 173470 -175118 137547 -38029 -16843
6502 105324 -52645 -18524 -237196 98032 130735 249252 -88978 144571 -148305 -149105 -102963
6491 -102963 -113438 81111 22470 104099 15123 -227302 237871 23611 77500 -137128 -144000
6480 -144000 40365 26611 145966 -1621 -17042 71053 -172225 -16732 86278 65970 96758
6469 96758 -87299 134128 -199716 -112231 109985 26594 -25205 -151805 -55296 115746 242467
6458 242467 268908 3826 228934 -52294 151941 -307907 98387 -244511 59464 105214 109995
6447 109995 -97117 -47638 -61333 182888 102575 -62693 -175647 -4048 -155249 291189 -431087
6435 4054 81332 -115221 143940 101482 181922 114374 -61980 -267158 -170021 -156137 110567
6423 -176311 -71707 245479 -149176 1920 163057 -79966 -64285 -300896 -287544 -117983 -230721
6412 -230721 155925 -320847 69418 -14421 81008 -74192 -649422 -14349 -32830 160498 64477
6400 85572 -59036 -353456 240862 229581 7638 138869 367626 -89528 -8259 410910 -325583
6388 12090 708 -130197 174199 -248912 -112146 904 303682 -195445 99000 67443 286762
6377 286762 180521 36322 166247 423642 -380089 -230468 54055 -32062 4515 211820 -37721
6365 -124787 -48468 -24658 -50217 -57166 151781 -118153 -38843 -17061 -69470 123088 -140160
6353 131131 -119245 -372254 33235 -184186 9243 -169157 136204 78120 -107572 45493 -129478
6341 135693 -125343 71448 73359 358434 17552 72078 -196514 -222497 19690 -163380 147781
6329 134422 218919 -99821 -207862 -116933 111384 108751 -150092 -394983 576084 192208 7455
6317 130604 -21039 167040 209205 155364 -25207 -169737 -155203 -23968 155118 -109655 305032
6305 -159203 -267276 -115552 -77133 148440 -273582 -209183 168438 -229200 -245103 -45966
6294 157903 -43644 -125037 161906 -207041 -156845 174345 -270393 38214 -115095 -121560 179950
6282 331706 31628 23305 -196259 137263 19260 -144406 -230675 372890 42020 -61085 52061
6270 -48178 153516 -252246 -169664 -10214 227278 -11598 -73635 -234790 -318026 8873 248007
6259 248007 85425 -22701 -29482 203224 -31971 -26348 62898 -62397 -185705 40160 -24849 -185961
6247 -185961 -152210 31345 -100906 -93392 -203699 -102636 295804 108002 -259831 193293
6236 -131594 -49576 -220154 -68489 97296 -145317 -22611 48003 -25183 -89314 16762 -65500
6224 140352 206099 -96854 -115454 128507 201056 37893 -197814 -84410 154317 -5933 -197394
6213 -197394 82489 162347 72938 35771 111003 -79157 -361433 -38496 77448 28733 -84695
6201 -64920 229460 290765 -49105 -363788 -101389 -281895 102989 -174606 -26406 -139089
6191 -139089 -99990 -7948 89206 25570 -72563 22562 53197 -265853 133614 11919 -140735
6179 -94275 103828 316124 49369 -279818 53455 49444 228822 -95496 -29027 47490 -37289
6167 69529 -12912 4755 47016 188336 -127125 -98059 -19569 27036 122578 -33938 -189979
6156 -189979 -18380 139907 -460649 -111599 33088 95110 -43189 -60876 112808 19152 1083
6144 94647 -60948 -126564 246259 -12871 -198373 -78813 98372 -73960 -56789 -86151 -123930
6133 -123930 103887 26033 -80692 48660 107981 -53573 -30762 -35925 -21149 103265 -9145 -197571
6121 -197571 74743 260951 31952 -19273 -110016 5021 -4063 319702 -196071 74433 -89228
6109 87173 -37160 109403 77489 131689 42859 128747 283438 165509 -124403 134356 61026
6097 216876 -166147 -263277 17476 -315283 -278501 -6596 -318888 -218309 -157960 346488 33462
6085 159991 -139775 98828 -26495 -39691 -146661 31304 -23251 -68023 -114908 18803 255159
6074 255159 240567 6355 -210658 70763 74229 -197232 101626 75324 -176223 -26524 18945
6062 15921 -25853 219610 35841 -153481 -2732 -182707 13067 141809 -83887 -38887 -302973
6051 -302973 -25456 -52237 -29982 -22989 109614 109551 -196815 92618 40430 -88238 5751 153380
6039 153380 -102447 106451 56327 83874 181684 185047 -138462 -223363 190455 -202990 -61423
6027 114797 -302611 -174300 -229471 -426375 95445 94272 -101355 -100284 -33750 26018 231773
6016 231773 -125477 -226697 -103914 41483 -144777 144742 169744 -26545 -268914 125120
6005 220797 -266807 144409 -327890 -118379 -10678 -127702 -142515 -33348 48742 -106252
5994 76890 18361 -69311 26449 219299 -72317 97937 -65462 -296327 251557 334180 -26867
5982 -387570 93356 330014 -199754 113337 -143935 17131 -96049 -52377 -318455 71756 -45163
5970 -106647 135779 269531 139869 226786 -26095 -65997 167693 5929 -219444 153696 -19689
5958 62865 -47337 198466 -570 -10416 139830 -50189 -224419 60423 -20123 -78236 5242 -396795
5945 70972 -274823 -73250 11721 -97827 15216 -244603 -11008 40925 -2734 48373 -288637
5933 -88427 -46333 114577 -361791 131709 -13943 -363247 -41865 86403 -70047 43114 -52732
5921 -117210 126346 156798 368816 -54932 -155633 -31598 241157 -199453 212326 -951 -158008
5910 -158008 27521 -29972 -2299 116093 89714 410628 100589 -10526 -139838 -331566 -30147
5898 -151804 -70319 113090 -117791 -191759 424800 29316 374671 339455 145885 -3604 -32322
5887 -32322 221577 -131880 406797 -104562 -318274 88595 15702 -220942 457828 -10513
5876 -61638 -58820 10134 151701 -35564 -19834 -107906 -152011 164839 -117099 224438 -43955
5864 -55947 89722 -9881 315303 -285888 -94462 -298925 89854 -176771 -362926 88171 37176
5852 146629 -180173 198229 86868 131303 -13190 -56659 113414 6820 -128329 -26970 79801
5840 -125185 84148 -151740 -183424 29828 83113 192089 -383214 227351 -251538 -124139
5829 -59717 59057 -114172 224580 -345326 -121311 -112927 17572 111286 -298590 -132829 -49714
5817 -95287 -3597 78828 125958 -90058 169426 -95749 208412 -139907 -221984 363148 140497
5805 50587 -20378 259266 -215229 7428 -104451 -124025 83233 95789 -71896 -337273 151854
5793 70410 -6821 114157 93372 -11670 38034 -100573 40322 7546 110043 -60392 433180
5781 158108 -263518 130214 -102559 196612 69593 224084 -285956 -86501 273490 70837
5770 -215349 148297 47547 -155973 119407 22142 -75432 203689 386886 -365181 198484
5759 149127 -37448 23947 -52461 -36008 37531 -319253 195626 -82561 58833 -281211 156038
5747 -218479 11470 83280 11256 104512 -46429 -133145 140550 106243 117218 -163615 56435
5735 66743 97045 -381746 98414 -49662 103599 -19535 -64458 -187670 -11339 -388196 -125772
5723 110101 195805 16044 201127 -28875 -165791 18315 -214404 -88329 -261620 -28251 -37196
5712 -37196 -277847 127708 296245 97446 -35377 259877 -158275 -108230 32636 -215005 28944
5700 98350 -145099 -103517 198769 -298640 -11785 -141745 -24408 41575 12530 -166236 -185293
5689 -185293 -43588 -206831 9928 279069 -78234 -44568 -157804 117900 -25860 -15791 18711
5677 80455 -16616 -146447 205851 -105129 111481 139958 -79810 -87760 -19242 -61091 3117
5665 109920 198327 211879 -24030 17448 -77127 -353316 50724 140568 391593 29119 155498
5654 155498 341494 -247445 108933 122589 -70910 -116235 58306 210866 -51283 -233358 344065
5642 2025 -67077 -174364 -158479 -135260 -107972 131744 -134697 -124986 -102747 -4238 23755 -65473
5629 60494 -54785 158261 227899 207490 -84916 47392 209888 -118804 -15942 112935 -61059
5617 -225747 13789 158107 228025 -86123 238671 54135 157031 67838 54831 9895 -261624
5605 -104747 -61176 259137 161077 -89094 153909 78225 -208978 -98631 -231772 -65947 -97134
5594 -97134 132014 81094 -181116 4405 118383 166975 82396 -110908 -451449 184122 156218
5583 156218 -27275 353337 -336733 275055 -68133 4172 27263 -159725 176813 -125537 150249
5571 -100966 -29809 44716 -29683 -273319 -106374 -158214 -188538 -72514 -564110 -26072 -240223
5560 -240223 178415 151597 -72419 -257742 -81451 15403 -113040 371085 -110505 5597 -147601
5548 -29627 385756 95675 106229 74562 153056 -69661 -86989 -20458 -43003 98222 -70561 -134259
5536 -134259 73476 -36304 -49510 -226406 293387 105369 88666 -168609 -63564 -96559 -177932
5525 -177932 144639 263937 41558 -87614 -199659 230512 128716 -276697 370014 298655
5515 298655 -127205 -117712 16465 99726 -100371 -262245 135294 -146313 -89759 -411746 -72149
5503 -86800 -83892 101014 -110329 103161 -344730 41208 -6190 185592 31567 -311881 234618
5491 209385 29561 -58633 -174665 -131321 -122010 8919 169363 -114152 -51513 179899 238994
5480 238994 121082 88893 -440838 -228327 -225738 -93609 31374 874 -224929 -139217 -127909
5469 -127909 175350 -108571 51967 260661 -34332 140749 159811 362634 -52737 190093
5458 -592525 -155077 307438 -48861 3134 98418 128077 -126352 -116703 -111537 49719 112699 331737
5446 331737 4882 10716 258636 150762 49041 164030 135110 -334595 68949 -88466 -109490
5435 -109490 -113117 78290 94883 55415 -61529 -165852 94094 -1853 13326 -324121 -97371 149320
5422 -76007 1685 -125957 -126608 84880 168870 15724 -124397 133628 -69435 118385 94251 116792
5410 116792 -103951 41499 77247 -359532 -262918 134880 -247244 324115 181313 92600
5400 92600 -51805 -87861 230535 26428 129289 -55746 -136972 -28103 -45116 79114 -87688
5388 77813 8891 -346881 45481 -75854 -38050 -128110 -129277 -105796 143020 331621 226318
5377 226318 -51847 15544 72781 51564 -173720 -144187 23554 -103509 14831 -33160 33213
5365 110868 -61266 -44524 81800 -51759 -23851 -14305 15360 -182360 16831 -88915 -45811 -38037
5353 -38037 143464 48666 -61325 270581 -38583 233854 -28014 -120665 200165 -44544 208420
5341 1221 257365 -70864 105739 -247408 58528 -173045 216450 -25095 39686 90706 -196685
5329 -31991 -87381 -121424 99178 -214183 82454 -127727 -44585 -28958 241996 203214 -166093
5317 99406 -91791 -99796 -15783 55280 -19735 -84749 216259 -76954 -99776 83598 122302 220106
5305 220106 -126585 -49204 277468 189625 44163 63046 -241086 273238 -70671 162138 -6095
5293 46 -109889 31408 221808 251619 -353583 120150 -131342 99919 251842 -296661 52884
5281 61555 -59894 -189956 140874 -34887 -113206 114560 -96247 100391 370612 206035 186562
5270 186562 16884 -51990 174606 -363703 253450 96109 -100218 -37681 -108047 -171461 -71916
5258 -233850 -181478 -164771 21891 32074 -201777 50357 -110015 304688 -33757 149146 -78442
5246 133543 -145667 325396 389303 283751 -117202 124055 34199 -121042 250336 -188634
5235 -121327 -104470 -212995 -54094 -228293 -371407 -263563 334865 -247749 -24806 165886
5224 79890 -196725 22563 12404 -25604 -53514 -20654 -96968 12150 74110 -8795 168161 -190135
5211 -98553 -238162 34790 -136729 -467272 -82317 195310 -30937 -31933 -134680 169519 -72336
5199 -260432 117918 -96608 -116260 8543 -160537 8196 224032 -34909 -36164 133129 3235 262960
5187 262960 -212066 25253 338682 226745 -342066 -45548 208860 14735 -17971 -97329 -332732
5176 -332732 -224950 181473 85123 -131787 -228217 -29361 162571 29366 -33503 -91814 -46237
5165 -46237 -214938 -22274 137462 -63019 -29387 -7074 -94355 -219339 167441 -224057 -18066
5153 258810 148320 356505 186510 92705 307963 -60900 128614 151790 147005 -215927 78599
5141 15588 -164793 95576 -179590 -275765 -129725 320695 -194671 -102054 -171599 -372907 -15774
5129 50664 -94358 47635 -325454 -37245 1922 102170 25503 -187479 -261034 15295 -3177 104841
5116 109272 18702 -44819 -19611 359575 91217 22104 -8929 69262 226059 156420 -11387
5104 69586 -68238 94642 -29449 -16856 130187 -371749 147296 54548 -58154 -85987 98148
5092 207351 90411 -144731 123619 74903 238603 -262486 235494 304355 -3528 26392 -34305
5080 -159539 71057 1080 -156187 130384 -300011 -159942 54098 -36243 -202014 -55027 356990
5068 -77613 -853 289415 -11939 92290 390134 10783 236782 39610 65272 47854 -92326 123416
5055 -258669 -37581 -72567 47045 166699 -14080 315640 -75320 113518 -61721 -162748 163829
5043 -92789 -183909 174665 259454 -119588 -40294 -194466 -23651 259372 145312 27616 -15308
5031 240699 -80245 60960 -283096 103791 -36807 128063 -123469 -52696 134288 152002 246066
5020 246066 -247224 -171464 -51875 -257977 -74806 69618 -231930 58833 190075 -319994 -46251
5008 -64629 93144 -91013 133758 -385946 60426 9657 438528 -56408 -59648 223668 -84851
4996 248195 28745 -29008 93335 45510 -101112 -139883 -223339 101991 -209577 -190032 -134250
4985 -134250 130582 140574 8505 92003 -7362 -357581 -11729 -63027 -171726 46534 208533
4974 208533 -14178 -38636 -278798 -75459 -226918 -61685 -285922 -311211 -106249 -67550 -178326
4963 -178326 -63913 266176 -13030 -66137 100943 31749 -134662 91284 214318 17027 -138621
4951 -59762 -85935 161553 86027 -1116 77482 106876 432559 241326 -103100 -27820 204033
4939 32746 -115178 -58423 10492 207532 -131287 -40962 251909 -101679 98513 -44758 85498
4927 -77019 -252987 263449 246116 -452513 -254204 9872 -129592 -35986 15868 498935 51580
4915 -240936 124505 -146565 -241045 -21759 95899 -308843 150556 82129 -68796 15515 -26988
4903 60654 -197090 1338 -8620 68947 94299 -69367 49959 330731 -170645 -42235 127123
4891 153122 32354 -195872 253952 -74853 102259 104173 -170682 -43640 194195 74741 -265445
4879 89516 78654 -59190 41735 -253312 -262725 -34691 -115320 345743 -63621 8342 2897 47275
4867 47275 112911 -33464 -145230 263112 -23168 -26245 -18627 38468 -535474 73215 -170119
4855 223640 -104361 689211 165618 -117542 -128902 -52553 116200 -222351 167633 130549
4845 130549 125720 -83349 -264045 224947 118410 6978 -64381 -182616 139169 -113904 2373
4833 162491 172544 -182940 -178706 -126842 -155593 -80241 76968 181559 224195 -6384 188617
4821 133140 -299399 10401 -6956 -170341 22715 222036 -12000 7428 -32809 -6511 20481 -88923
4808 -227193 -104508 131102 248265 -229855 15929 -19150 213151 41778 -262063 62930
4797 -169762 62845 -190742 -141433 247713 -24108 -122679 -76841 -150954 141155 -54908 -14340
4785 16685 490333 388578 98371 -152438 -219129 -80770 8549 -27555 257391 -193853 -61812
4773 -15379 128751 -212482 -59460 -36948 80431 23734 196175 -107826 -35003 -10438 -137412
4762 -137412 207186 -143865 -59268 131255 76099 303017 66601 -26974 195417 -31949 -37342
4751 -37342 -40263 3543 -82427 -48677 -224119 -30540 173991 16139 -247949 39193 -252837
4739 -145476 129902 -8384 188394 -24018 -60645 190151 -77214 310451 184714 254801 19714
4727 -86926 -329300 332288 85665 -210001 -12199 -71874 109373 351736 -83959 -118523 -71806
4716 -71806 -316245 19807 -120542 74109 -117892 -72172 -28767 -131373 -35234 -98297 22906
4704 122225 -6852 44472 289637 59152 -75019 73928 204429 -235980 -18086 292828 -9084
4692 241574 77891 186760 -206659 -119664 -35856 272438 -313953 81192 -45601 26068 9566
4680 -54586 -22844 -44976 -185414 -170446 31317 404378 63822 -381192 166505 62820 -77218
4668 4248 84221 311761 87201 290578 -99778 -286766 -77031 223102 -365630 -137587 50583
4656 -197430 -43736 -145223 -41754 90638 100757 -225423 247386 -152572 35253 -138204 -3798
4644 201024 464897 116694 -189444 -127249 171677 303750 -348251 30462 -216108 3855
4633 -89673 83139 83697 216634 -71955 2753 41921 145004 -145276 -60443 -314746 -170097
4622 -170097 137206 -215797 112348 262361 291312 -47598 -110339 -273780 60752 -55798 -433897
4611 -433897 -119715 132305 211795 -28596 -139962 183412 -152553 -108071 -62845 -97127 292860
4599 -225295 166426 -79396 62661 29229 158885 -68765 35398 7938 14097 -24755 160739
4587 -15721 44088 -187296 288870 132204 245318 12538 -252299 85810 282205 182683 -20981
4575 -22483 109812 -246000 -221469 -410386 -80199 -74193 -182980 -37294 -154079 125515 -198814
4563 -20439 -12551 -148896 297743 -19658 189297 248399 21761 -13762 258583 71659 -46935
4551 15885 15780 -54308 150730 168161 -193176 107151 -167016 97663 61925 -173282 -63805
4539 -109694 19070 138652 -59645 167784 -72045 110266 177371 -294274 165877 -128312
4528 -250460 27802 -104853 -61575 63473 148057 109020 104081 118420 -24613 300284 -9915 -73520
4516 -73520 104534 -189220 304120 -226585 44038 -170718 132279 82832 80998 -221323 69579
4504 -89733 163576 -223700 -37976 102439 -182025 53775 -11159 -13006 -22910 -109556 292276
4492 -131985 -90478 -291780 -135097 183053 193165 367040 9251 -176223 165003 140044 -75009
4480 74078 485708 93763 156939 335646 194259 -213814 -294454 -117294 47914 132850 38582
4468 -115938 -69915 327060 251570 461553 -3553 19276 171277 29219 163741 232687 -73184
4456 116870 85773 -185744 93019 22176 158987 264523 -169018 241221 -269407 41712
4445 -41908 56279 -53018 -219162 22848 106976 8537 74192 286923 224310 -48798 -192808
4434 -192808 -247047 -114869 297107 -202028 39246 83461 189645 19540 148891 -157025
$$ [...]
##END NTUPLES=NMR SPECTRUM
##END=
