##TITLE=AC1427_PERAH13238_7765536_XiRO4GehPd
##JCAMPDX= 6.0         $$ Bruker NMR JCAMP-DX V2.0
##DATA TYPE= NMR SPECTRUM
##DATA CLASS= NTUPLES
##ORIGIN= BRUKER
##OWNER= Administrator
$$ 1.72 TOPSPIN		Version 2.1
$$ 2013-04-11 22:40:50.957 -0700  Administrator@X
$$ Compression mode = diff/dup
##.OBSERVE FREQUENCY= 400.02188249412
##.OBSERVE NUCLEUS= ^1H
##.ACQUISITION MODE= SIMULTANEOUS (DQD)
##.ACQUISITION SCHEME= undefined
##.AVERAGES= 8
##.DIGITISER RES= 22
##SPECTROMETER/DATA SYSTEM= spect
##.PULSE SEQUENCE= zg30
##.SOLVENT NAME= COFFEE_meoh
##.SHIFT REFERENCE= INTERNAL, COFFEE_meoh, 1, 14.98509
##AUDIT TRAIL= $$ (NUMBER, WHEN, WHO, WHERE, PROCESS, VERSION, WHAT)
$$ ##TITLE= Audit trail, TOPSPIN		Version 2.1
$$ ##JCAMPDX= 5.01
$$ ##ORIGIN= Bruker BioSpin GmbH
$$ ##OWNER= Administrator
$$ $$ E:\/data/COFFEE/nmr/AC1427_PERAH13238_7765536_XiRO4GehPd/10/pdata/1/auditp.txt
$$ ##AUDIT TRAIL=  $$ (NUMBER, WHEN, WHO, WHERE, PROCESS, VERSION, WHAT)
(   1,<2013-04-11 22:40:42.864 -0700>,<Administrator>,<X>,<go>,<TOPSPIN 2.1>,
      <created by zg
	started at 2013-04-11 22:39:37.161 -0700,
	POWCHK enabled, PULCHK disabled,
       configuration hash MD5:
       33 CF 6A 21 5C D3 B9 40 6C 15 AA 8D 27 A2 4F 13
       data hash MD5: 64K
       62 3F B9 46 8E 26 8A 7D 8B FC 4C 0A D1 D5 0D 71>)
(   2,<2013-04-11 22:40:45.973 -0700>,<Administrator>,<X>,<proc1d>,<TOPSPIN 2.1>,
      <Start of raw data processing
       efp LB = 0 FT_mod = 6 PKNL = 1 PHC0 = 0 PHC1 = 0 SI = 32K 
       data hash MD5: 32K
       DD CE 31 3B 7C 30 7E 0F 9F DB F7 61 CE 8F 86 22>)
(   3,<2013-04-11 22:40:46.426 -0700>,<Administrator>,<X>,<proc1d>,<TOPSPIN 2.1>,
      <pk PHC0 = 98.64075 PHC1 = 0 
       data hash MD5: 32K
       5F A7 AE 2D 95 D7 87 29 92 28 84 16 DF D5 23 E9>)
(   4,<2013-04-11 22:40:46.661 -0700>,<Administrator>,<X>,<proc1d>,<TOPSPIN 2.1>,
      <abs ABSG = 1 
       data hash MD5: 32K
       76 6F B9 12 C3 B9 74 8F 6A 36 8D 09 82 CE 6C D8>)
(   5,<2013-04-11 22:40:46.817 -0700>,<Administrator>,<X>,<proc1d>,<TOPSPIN 2.1>,
      <abs ABSG = 2 
       data hash MD5: 32K
       56 C2 53 17 22 10 09 B1 E0 0D B7 8C DC 03 2E F1>)
(   6,<2013-04-11 22:40:46.973 -0700>,<Administrator>,<X>,<proc1d>,<TOPSPIN 2.1>,
      <abs ABSG = 3 
       data hash MD5: 32K
       8C F0 E1 D5 F9 5F 11 9D 5C B1 37 CA 77 27 0E 33>)
(   7,<2013-04-11 22:40:47.114 -0700>,<Administrator>,<X>,<proc1d>,<TOPSPIN 2.1>,
      <abs ABSG = 4 
       data hash MD5: 32K
       59 03 56 9C C4 47 0A 05 F3 AA 4B AD 60 75 FE A8>)
(   8,<2013-04-11 22:40:47.254 -0700>,<Administrator>,<X>,<proc1d>,<TOPSPIN 2.1>,
      <abs ABSG = 5 
       data hash MD5: 32K
       4E B4 B9 1F 6C 3B 4C 9B 8F 5B E4 E8 5D E3 04 84>)
$$ ##END=
$$ 
$$ $$ hash MD5
$$ $$ CD 4F AC EB 13 C9 BA FA 89 0A 3A 16 3E 25 E1 48
##$RELAX= 
##$RELAX= 
##$RELAX= 
##$RELAX= 
##$RELAX= 
##$RELAX= 
##$RELAX= 
$$ Bruker specific parameters
$$ --------------------------
##$DU= <E:\>
##$EXPNO= 10
##$NAME= <AC1427_PERAH13238_7765536_XiRO4GehPd>
$$ [...]
150 150 150 150 150 150 150 150
##$TP07= 0
##$TPNAME0= <>
##$TPNAME1= <>
##$TPNAME2= <>
##$TPNAME3= <>
##$TPNAME4= <>
##$TPNAME5= <>
##$TPNAME6= <>
##$TPNAME7= <>
##$TPOAL= (0..7)
0.5 0.5 0.5 0.5 0.5 0.5 0.5 0.5
##$TPOFFS= (0..7)
0 0 0 0 0 0 0 0
##$TUNHIN= 0
##$TUNHOUT= 0
##$TUNXOUT= 0
##$USERA1= <user>
##$USERA2= <user>
##$USERA3= <user>
##$USERA4= <user>
##$USERA5= <user>
##$V9= 5
##$VALIST= <valist>
##$VCLIST= <CCCCCCCCCCCCCCC>
##$VD= 0
##$VDLIST= <DDDDDDDDDDDDDDD>
##$VPLIST= <PPPPPPPPPPPPPPP>
##$VTLIST= <TTTTTTTTTTTTTTT>
##$WBST= 2048
##$WBSW= 25
##$XGAIN= (0..3)
0 0 0 0
##$XL= 0
##$YL= 0
##$YMAX_a= 603861
##$YMIN_a= -515593
##$ZGOPTNS= <>
##$ZL1= 120
##$ZL2= 120
##$ZL3= 120
##$ZL4= 120
##$ABSF1= 14.98509
##$ABSF2= -5.573092
##$ABSG= 5
##$ABSL= 3
##$ALPHA= 0
##$AQORDER= 0
##$ASSFAC= 0
##$ASSFACI= 0
##$ASSFACX= 0
##$ASSWID= 0
##$AUNMP= <proc_prof1d_extract_pilot.lims>
##$AXLEFT= 0
##$AXNAME= <>
##$AXNUC= <1H>
##$AXRIGHT= 0
##$AXTYPE= 0
##$AXUNIT= <>
##$AZFE= 0.1
##$AZFW= 0.1
##$BCFW= 0
##$BC_mod= 0
##$BYTORDP= 0
##$COROFFS= 0
##$CY= 15
##$DATMOD= 1
##$DC= 0
##$DFILT= <>
##$DTYPP= 0
##$F1P= 0
##$F2P= 0
##$FCOR= 0.5
##$FTSIZE= 32768
##$FT_mod= 6
##$GAMMA= 0
##$GB= 0
##$INTBC= 1
##$INTSCL= 1
##$ISEN= 128
##$LB= 0
##$LEV0= 0
##$LPBIN= 0
##$MAXI= 10000
##$MC2= 0
##$MEAN= 0
##$ME_mod= 0
##$MI= 0
##$NCOEF= 0
##$NC_proc= -8
##$NLEV= 6
##$NOISF1= 0
##$NOISF2= 0
##$NSP= 0
##$NTH_PI= 0
##$NZP= 0
##$OFFSET= 14.98509
##$PC= 1
##$PHC0= 98.64075
##$PHC1= 0
##$PH_mod= 1
##$PKNL= yes
##$PPARMOD= 0
##$PPDIAG= 0
##$PPIPTYP= 0
##$PPMPNUM= 2147483647
##$PPRESOL= 1
##$PSCAL= 4
##$PSIGN= 0
##$PYNMP= <proc.py>
##$REVERSE= no
##$SF= 400.02
##$SI= 32768
##$SIGF1= 0
##$SIGF2= 0
##$SINO= 400
##$SIOLD= 32768
##$SPECTYP= <>
##$SREGLST= <1H.CDCl3>
##$SSB= 0
##$STSI= 32768
##$STSR= 0
##$SW_p= 8223.68421052631
##$SYMM= 0
##$S_DEV= 0
##$TDeff= 65536
##$TDoff= 0
##$TI= <>
##$TILT= no
##$TM1= 0
##$TM2= 0
##$TOPLEV= 0
##$USERP1= <user>
##$USERP2= <user>
##$USERP3= <user>
##$USERP4= <user>
##$USERP5= <user>
##$WDW= 1
##$XDIM= 32768
##$YMAX_p= 454526932
##$YMIN_p= -704366
##$CURPLOT= <Network HP LaserJet P1505>
##$CURPRIN= <$Network HP LaserJet P1505>
##$DFORMAT= <normdp>
##$LAYOUT= <+/1D_H.xwp>
##$LFORMAT= <normlp>
##$PFORMAT= <normpl>
##$SURQMSG= 1
$$ End of Bruker specific parameters
$$ ---------------------------------
##NTUPLES= NMR SPECTRUM
##VAR_NAME=  FREQUENCY,     SPECTRUM/REAL,   SPECTRUM/IMAG
##SYMBOL=    X,             R,               I
##VAR_TYPE=  INDEPENDENT,   DEPENDENT,       DEPENDENT
##VAR_FORM=  AFFN,          ASDF,            ASDF
##VAR_DIM=   32768,         32768,           32768
##UNITS=     HZ,            ARBITRARY UNITS, ARBITRARY UNITS
##FACTOR=    0.250966925370066, 1,           1
##FIRST=     8223.43324360094, -48094,       -124474
##LAST=      0,             48986,           -245188
##MIN=       0,             -704366,         0
##MAX=       8223.43324360094, 454526932,    0
$$ Real data points
##PAGE= N=1
##DATA TABLE= (X++(R..R)), XYDATA
$$ [...]
$$ plain form
19554 -81830 -105830 290212 3736 43785 -18411 126827 -2325 60452 -115191 7743 356590
19543 356590 -243975 -259069 -312038 -207547 188552 85423 252204 59832 112526 -26147 231960
19531 -162315 -59942 -115639 94118 -167869 241887 89049 -161151 -159166 -325516 -74148 -279885
19520 -279885 -935 150324 -187452 -191712 -35082 -47811 -363379 -288614 8589 234014 -300337
19508 81477 -65614 44728 -65614 135837 -6968 65451 235136 -97897 -117108 460196 76073
19496 -194696 -209356 116446 -103354 29942 -148247 -45643 -19770 169607 -113661 40798
19485 -317909 -59763 -73214 -51635 -68950 78412 -145234 91136 -213973 -111785 -61923 5383
19473 -3631 -104205 -36567 -67150 -234536 128018 222781 11532 -380785 -392366 -218980 96146
$$ packed form
19554h1830k4000B90212C736M0049a8411A26827b325F0452a15191G743L48847
19543C56590b43975j5094n2969J04491A88552H5423J66781E9832N2694b6147B31960
19531a62315e9942n5697I4118a67869B41887H9049a61151J985j66350g4148k05737
19520b79885i35A50324a87452m260c5082j2729l15568P4765H589K25425c00337
19508H1477f5614D4728f5614A35837f968F5451J69685i7897j9211D60196G6073
19496a94696j4660A16446a03354B9942a48247d5643a9770A69607a13661D0798
19485c17909e9763j3451K1579j7315G8412a45234I1136b13973J02188M9862E383
19473c631j00574c6567l0583j67386A28018R4763A1532c80785j1581J73386I6146
$$ plain form
19461 -77238 -75641 -185311 -176640 -34839 199140 -185693 -248068 -357695 51189 31958 198015
19450 198015 -260632 -390969 193653 -167490 142161 376014 -111490 -142921 -18077 25209
19439 -141272 -345414 -67196 -72600 -9513 -45643 -70173 -138174 261619 45728 267222 199879
19428 199879 -32027 -169347 38456 -84053 -226956 50987 -241577 107096 2267 -67334 -83233
19417 -83233 140593 -31279 84263 -88686 85313 -368461 -383546 -33039 106341 22135 -107269
19405 -217326 130667 270395 -167037 -70933 -185121 257921 -141784 -27650 -144587 -202185
19395 -202185 -192122 -12252 -92932 86017 -110323 -215341 -235869 -96243 140063 43640 196735
19384 196735 -142044 -444942 -146751 130835 89290 311905 69529 -30032 -54502 -313502
$$ packed form
19461g7238J597j09670Q671c4839A99140a85693o2375j09627E1189j9231J66057
19450A98015b60632j30337A93653a67490A42161K33853a11490l1431a8077B5209
19439a41272k04142f7196n404i513l6130k4530o8001B61619D5728K21494o7343
19428A99879c2027j37320C8456h4053j42903E0987b41577A07096B267f7334j5899
19417h3233A40593c1279H4263h8686H5313c68461j5085c3039A06341B2135a07269
19405b17326A30667J39728a67037g0933j14188B57921a41784b7650j16937n7598
19395b02185J0063a2252q0680H6017a10323j05018k0528i6243A40063D3640J53095
19384A96735a42044l02898a46751A30835m1545K22615F9529c0032k4470k59000
$$ plain form
19374 -313502 147459 118338 -376800 236110 57099 25503 -146532 -145727 88046 29084 42057
19363 42057 -94880 -64509 -34696 184181 -87422 -387422 -48515 79944 -155694 -253900 85183
19351 -176929 -346435 -95624 -195896 111378 -154611 -295041 131128 -181889 23579 -270987
19340 79109 -124071 -480618 -26749 28085 59338 -208521 -115331 142237 209529 145323 85205
19329 85205 -183927 -67409 -220054 -333062 -145042 175821 -342622 15449 61702 -258016
19318 -33744 -102393 -159276 37810 -59703 -5521 -188369 33641 -225577 -220095 -355282 222989
19306 -203759 61218 65247 -233670 87827 111406 153403 172606 -365402 -36342 -242028 -405280
19295 -405280 -108018 -83322 -229479 -134996 100018 -199440 49384 -327415 -216516 -130018
$$ packed form
19374c13502A47459k9121c76800B36110E7099B5503a46532Q05H8046B9084J2973
19363D2057i4880L0371K9813A84181h7422l00000d8515G9944a55694r8206H5183
19351a76929j69506i5624j00272A11378a54611j40430A31128a81889B3579b70987
19340G9109a24071l56547b6749B8085L1253b08521R3190A42237O7292o4206o0118
19329H5205a83927f7409j52645j13008a45042A75821c42622A5449M6253b58016
19318c3744o8649n6883C7810e9703e521j82848C3641b25577N482j35187B22989
19306b03759F1218M029b33670H7827K3579M1997J9203c65402c6342k05686j63252
19295d05280a08018K4696j46157R4483A00018a99440D9384c27415J10899Q6498
$$ plain form
19285 -130018 -36893 62156 -227723 -157824 130314 -92124 160857 -149941 -75766 54283 202947
19274 202947 43612 -97237 -63143 -72207 -18684 246274 51554 -242796 242194 -497496 121479
19262 -232515 -82519 187684 123924 -158387 204171 -272581 -64248 103217 119710 41671
19251 -399630 339443 236532 -198291 -13019 -134128 -17345 -145396 11753 -167712 20173
19240 13977 -181866 -121641 -5334 -123157 -110658 -7718 86672 -208728 -58825 -233301 277638
19228 -64425 -25234 -266836 -100567 -227376 -108163 -98446 -206188 -452372 -185247 -140631
19218 -140631 203146 -37589 -80338 49005 54271 345 -68592 -93754 85349 -190339 167821
19206 -157541 -163960 -27304 -36543 -31656 -25046 -107031 299300 -191714 -161926 -35464 -160868 147457
$$ packed form
19285a30018c6893F2156b27723O9899A30314i2124A60857a49941P4175E4283J48664
19274B02947D3612i7237L4094r064a8684B46274E1554b42796B42194d97496A21479
19262b32515h2519A87684o3760a58387B04171b72581f4248A03217J6493D1671
19251c99630C39443j02911a98291a3019j21109a7345j28051A1753a67712B0173
19240A3977a81866O0225e334j17823J2499g718H6672b08728e8825j74476B77638
19228f4425b5234k41602a00567j26809a08163R717j07742k46184a85247M4616
19218a40631B03146c7589m2749D9005N266C45f8592k5162H5349a90339A67821
19206a57541o419b7304r239M887O610q1985B99300a91714K9788c5464j25404A47457
$$ plain form
19193 34742 -15543 -85367 -297336 123521 -103632 -38632 -410994 181535 210061 21805 137767
19182 137767 -240391 276395 114777 -258937 -226655 -246852 -178850 102757 88298 -177976
19171 263545 -216479 61810 41358 -23989 333679 -119901 141288 -6009 95365 -210199 104158
19159 25141 -16911 -379080 -28461 -298995 -76491 88508 -43888 49715 195989 -417760 -194130
19147 14254 -151252 -108730 -230756 111083 -389071 -142453 -133770 66936 -120924 -120306 -12359
19135 27763 261535 -134984 7025 38952 263105 67978 -66725 -401128 333073 -37139 -322412
19124 -322412 -393025 -47056 21714 -303475 -128041 -76787 32435 -298143 13789 151061 -110916
19112 -240480 -3800 74746 123129 -66380 -119079 -190256 -157748 84963 -70330 -179261 118819
$$ packed form
19193C4742a5543o9824k11969A23521a03632c8632l72362A81535K8526B1805J15962
19182A37767b40391B76395A14777b58937L2282k0197O8002A02757j4459a77976
19171B63545b16479F1810k0452b3989C33679a19901A41288f009I5365b10199A04158
19159B5141a6911l62169b8461k70534g6491H8508d3888D9715J46274d17760a94130
19147A4254a51252M2522j22026A11083c89071a42453Q683F6936a20924O18a2359
19135B7763K33772a34984G025L1927K24153F7978f6725l34403C33073c7139k85273
19124c22412p0613d7056B1714c03475a28041N1254C2435b98143A3789J37272a10916
19112b40480c800G4746M8383f6380n2699p1177L2508H4963g0330j08931A18819
$$ plain form
19100 121374 335783 -73516 732 -291914 -75370 99020 -482275 -179137 242129 150635 -87725
19088 -224996 29481 1790 256022 -125871 -156768 -245772 -159412 -311249 -201629 -15242 128403
19076 -75831 -90415 -15171 278687 47920 -29491 -129584 296814 26294 17576 -53717 -150077
19065 -150077 -258157 -324994 66716 -13285 -159676 -308177 10628 102450 -153029 -175396 222959
19053 -308298 -115802 -2180 -187000 -262193 -58169 -199634 -296639 -462361 -59575 -111666 49483
19041 -163329 -310557 -45148 -123116 -89255 183105 -70962 193320 -94905 -201988 192354
19030 -20653 -127415 320243 -85171 -100950 279826 302330 11 196364 -139384 179284 91646
19019 91646 264124 288072 -217776 -114528 -179259 -449614 100085 314297 45274 -56339
$$ packed form
19100A21374K14409g3516G32b91914g5370I9020d82275a79137B42129r1494h7725
19088b24996B9481A790K54232a25871l0897q9004Q6360j51837J09620a5242A28403
19076g5831j4584a5171B78687D7920b9491j00093B96814B6294q718e3717r6360
19065a50077j08080o6837F6716a3285j46391j48501A0628R1822a53029k2367B22959
19053c08298a15802b180j84820p5193e8169j41465r7005j65722e9575n2091D9483
19041a63329j47228d5148p7968L3861A83105g0962A93320i4905j07083A92354
19030b0653j06762C20243h5171j5779B79826K2504A1J96353a39384A79284q7638
19019I1646J72478K3948b17776J03248o4731k70355A00085K14212D5274e6339
$$ plain form
19008 -105272 -455080 -394642 -164140 37610 -22497 -220015 -163447 -205669 -98460 -93046 47146
18996 -13325 195005 150148 30678 -234004 215718 87004 -42851 -71350 175677 220532 41109
18984 -114933 -8658 288276 -161656 34285 10670 -46843 79770 68488 -164258 -83315 -94117
18973 -94117 -424623 -275272 23201 -121597 -243959 14524 28754 -32572 -74677 -284871 282535
18961 -29245 -61295 -214447 70385 -323720 27356 224109 -66341 -290689 -171279 -204012 -211874
18950 -211874 177392 -91000 17087 154520 207634 53756 44180 -129038 57450 245556 -29713
18938 194917 -93440 11405 260089 14609 -47944 56085 181034 -111686 66413 -54226 -186607
18927 -186607 -298300 -153301 -223257 129160 74271 -23993 -240254 -89848 -2321 -300402 -84813
$$ packed form
19008a05272l49808O0438a64140C7610b2497j97518N6568m2222i8460N414D7146
18996a3325A95005m4857C0678b34004B15718H7004d2851k8499A75677M4855D1109
18984a14933h658B88276a61656C4285A0670d6843G9770j1282a64258Q0943j0802
18973i4117l30506J49351B3201a21597j22362A4524J4230c2572m2105k10194B82535
18961b9245l2050j53152G0385c23720B7356J96753f6341k24348J19410l2733p862
18950b11874A77392i1000A7087J37433N3114E3756r576a29038E7450J88106b9713
18938A94917i3440A1405K48684A4609d7944E6085J24949a11686F6413e4226j32381
18927a86607j11693J44999o9956A29160n4889b3993k16261h9848b321k98081h4813
$$ plain form
18915 -136296 -163140 -191653 -158201 -93950 -59540 44296 49942 -473317 75310 166692 4485 -29358
18902 88387 -141849 -176734 -316671 -38682 -321129 -15225 -127274 443418 -150523 -139951
18892 -139951 77521 138815 -278877 -107362 -192605 -104571 -10395 -64562 -253831 -37689 277892
18880 -103954 -151962 -325917 -204117 27614 -164857 150400 -93618 -6988 94490 -40497 -24251
18869 -24251 -432374 -147172 33013 129769 -84996 -312060 376245 102821 -362866 25704
18858 -354118 39364 -188164 -496545 -312605 -44311 -35291 206360 87098 92548 -365300 -66312
18846 255685 -235955 -374732 -130133 -11578 96047 158251 -178276 -10853 -201150 -13968
18835 -328859 -74366 -187553 -121398 22115 412948 -121569 -54891 -317271 422252 184736
$$ packed form
18915a36296k6844k8513L3452O4251L4410D4296N646d73317G5310R1382D485b9358
18902H8387a41849l4885j39937c8682k82447a5225j12049D43418a50523J0572
18892a39951G7521O1294b78877a07362q5243Q8034a0395n4167j89269c7689B77892
18880a03954m8008j73955J21800B7614a64857A50400i3618f988I4490d0497J6246
18869b4251m08123a47172C3013R6756h4996k27064C76245A02821c62866B5704
18858c54118C9364a88164l08381J83940d4311R020B06360H7098N450c65300f6312
18846B55685b35955j38777a30133a1578I6047O2204a78276a0853j90297a3968
18835c28859g4366j13187O6155B2115L90833a21569e4891k62380D22252A84736
$$ plain form
18824 22962 237510 -66574 8906 -121786 -17202 -184881 352980 501795 158420 -83699 -47578
18813 -47578 -4782 123261 167227 -72166 11947 310830 349771 145133 200839 -268265 -108260
18801 -139739 149678 177882 -76632 -178612 174157 17832 -368217 -88451 -35244 -49635 128181
18789 -80352 -206970 -153064 -341658 -45481 -287152 -313014 49735 -164352 37376 -129890 -79688
18778 -79688 126241 174466 16482 192549 38486 -361426 104131 -124760 10393 40688 165473
18767 165473 144033 152427 128759 -154506 191914 -9262 -67373 216517 -31949 -89587 335118
18755 -128880 -224569 -265172 163510 -50704 -24386 -382787 15765 -54327 1091 76675 215895
18744 215895 -169522 133135 289757 -299123 -84675 85325 -260599 84014 27086 -17180
$$ packed form
18824B2962K14548f6574H906a21786a7202j67679C52980J48815A58420h3699L6121
18813d7578d782A23261M3966g2166A1947K98883L8941A45133N5706b68265a08260
18801a39739A49678K8204g6632j01980A74157A7832c68217h8451c5244j4391A28181
18789h0352j26618N3906j88594d5481k41671k5862D9735a64352C7376a29890N0202
18778g9688A26241M8225A6482J76067C8486c61426A04131a24760A0393L0295J24785
18767A65473k1440Q394k3668a54506A91914i262n8111B16517c1949n7638C35118
18755a28880r5689m0603A63510e0704b4386l58401A5765e4327A091P5584J39220
18744B15895a69522A33135J56622b99123h4675H5325b60599H4014B7086a7180
$$ plain form
18733 -264571 -216582 -163957 226418 -145501 -267874 19066 -111898 -7988 201132 34103 62835
18722 62835 -103441 -209230 -189293 169209 -192486 -149625 6537 -46597 151235 82815 -38227
18710 -216029 126790 -31347 -67604 -98399 -189276 130454 -119740 85586 -351904 -137782
18699 -273889 69663 162917 -18039 -47850 66418 128674 209649 170606 -89885 85271 116556
18688 116556 -458855 -142804 28156 -147527 -147744 -254016 67381 -10704 -146632 -149619 -216352
18677 -216352 -202239 -44671 413891 -191120 63925 -153310 -232579 108520 -14142 -148184
18667 -148184 -252764 -284129 -76595 -45480 -87657 -83315 291468 -114970 -268544 -251248 -103995
18655 39445 -143170 157099 42618 -60025 -83112 -292673 -238199 124444 -161504 -139996 107058
$$ packed form
18733b64571M7989N2625B26418a45501j22373A9066a11898g988B01132C4103K8732
18722F2835a03441j05789J9937A69209a92486M2861F537d6597A51235o8420c8227
18710b16029A26790c1347l6257l0795r0877A30454a19740H5586c51904a37782
18699b73889F9663R3254a8039k9811F6418O2256Q0975l9043h9885H5271L1285
18688A16556d58855a42804B8156a47527k17j06272F7381a0704j35928k987o6733
18677b16352J4113d4671D13891a91120F3925a53310p9269A08520a4142j34042
18667a48184j04580l1365g6595L1115m2177M342B91468a14970j53574J7296a03995
18655C9445a43170A57099D2618f0025k3087k09561N4474A24444a61504K1508A07058
$$ plain form
18643 118642 -117672 -102156 -115931 -167422 -128426 -299416 262523 -59339 251239 -67672 -258157
18632 -258157 -248221 80132 -227176 -66637 201879 -14077 -9550 -129473 33938 75403 -9584
18620 194901 146856 -59129 97663 29903 104074 -145117 -149898 -84550 -108052 -252183 -143755
18609 -143755 62633 -95146 -8500 -77024 16778 10954 -256621 209689 74315 -273813 26095
18597 134167 -239976 -52028 -60437 -53551 54934 207073 189473 -267337 135050 302260 -56792
18585 169166 -118544 -134437 -16799 142753 -94069 -39346 -84734 273381 71523 120313 55673
18573 -53324 -282597 70599 -73333 -32501 -96223 -120137 -238267 119060 -315265 -7606 -285662
18562 -285662 -66780 -31316 89849 32898 251447 -168344 -149179 -31674 -307845 -160365 -100967
$$ packed form
18643A18642a17672J5516j3775n1491L8996j70990B62523e9339B51239f7672j90485
18632b58157R936H0132b27176f6637B01879a4077M527j19923C3938M1465i584
18620A94901m8045e9129I7663B9903P4171a45117m781O5348k3502j44131J08428
18609a43755F2633i5146h500o8524A6778n824b56621B09689G4315b73813B6095
18597A34167b39976e2028q409O886E4934J52139j7600b67337A35050J67210e6792
18585A69166a18544j5893a6799A42753i4069c9346m5388B73381G1523M8790E5673
18573e3324k29273G0599g3333c2501o3722k3914j18130A19060c15265g606k78056
18562b85662f6780c1316H9849C2898K18549a68344J9165c1674k76171J47480N9398
$$ plain form
18551 -100967 -112814 53178 8147 -132905 -9812 -154187 -74469 -98475 191254 -32131 -65033
18540 -65033 46426 -250976 211660 80958 101840 -152319 -41173 -64340 190995 -95922 -63701
18529 -63701 -146844 294142 -299947 82386 -159952 -36654 -239874 -28057 -293692 -77540 -113399
18518 -113399 -254749 20417 -316099 -172018 -21117 32948 -251577 240038 -63413 74266
18507 305684 -155012 108886 133613 -206763 -94671 -227476 -93959 72819 -198264 66350
18496 151879 25052 204549 503615 112090 -218001 294977 27428 72270 -233917 -142005
18486 -142005 63196 106569 -4076 -100354 62949 194041 -76075 -287567 98134 125389 81646
18475 81646 709 -381984 -260897 -57140 -45982 60083 -242668 -237411 94377 -49648 84642 -28452
$$ packed form
18551a00967j1847E3178H147a32905i812j44375g4469k4006A91254c2131l2902
18540f5033D6426b50976B11660H0958K0882a52319d1173k3167A90995i5922L2221
18529f3701q3143B94142b99947H2386a59952c6654k03220b8057k65635g7540l5859
18518a13399j41350B0417c16099J44081b1117C2948b51577B40038f3413G4266
18507C05684a55012A08886K4727b06763i4671j32805i3959G2819a98264F6350
18496A51879B5052J79497K99066A12090b18001B94977B7428M4842b33917R1912
18486a42005F3196M3373d076r6278F2949J31092g6075k11492I8134K7255m3743
18475H1646G09c81984J21087e7140J1158F0083b42668N257I4377d9648H4642b8452
$$ plain form
18462 -319192 -273259 -125151 83027 30216 -9801 -163482 -56638 -94530 55306 -1900 126701
18450 -46285 -99534 -58029 -151562 -220075 -120436 -373576 -14912 31588 69987 -339660 34553
18438 -203156 -64051 -229123 -34547 49920 178323 51093 71072 46981 -225338 206120 105701
18427 105701 -79374 33227 307785 103493 -173148 37177 -90760 14766 -8403 -4149 -198864
18416 -198864 295936 -30927 -217530 -147557 94363 -63575 274649 -144995 267960 178050
18406 178050 119211 87538 157530 -120211 -148529 -46285 -137417 -114986 -47806 -79015 -215120
18395 -215120 -256873 -208141 158711 18128 -80446 309042 -382790 224537 75255 -189868
18384 74635 -224408 -126711 -295041 170013 200640 -63056 -158614 -471639 -276659 -224468 68367
$$ packed form
18462c19192M5933a25151H3027C0216i801j53681e6638l7892E5306a900A26701
18450d6285n3249M1505r3533o8513R9639k53140a4912C1588L8399c39660C4553
18438b03156f4051j65072c4547D9920J28403E1093J9979k4091b25338B06120j00419
18427A05701g9374C3227K74558A03493a73148C7177i0760A4766h403d149j94715
18416a98864B95936c0927j86603O9973I4363f3575B74649a44995B67960q9910
18406A78050n8839l1673O9992a20211k8318d6285r1132K2431d7806l1209j36105
18395b15120m1753M8732A58711A8128h0446C09042c82790B24537G5255a89868
18384G4635b24408R7697j68330A70013L0627f3056r5558l13025J94980N2191F8367
$$ plain form
18372 -4550 -132523 -9798 -366469 110193 -192245 -25231 183537 91531 202848 251641 312792
18361 312792 166311 -112162 163599 -225238 30007 -160503 -76441 -91047 -253372 -63226
18350 103310 -62582 -68623 223124 155971 -254072 -29049 339561 236688 79311 260048 -47159
18338 -343820 -206948 -207998 206892 78908 -399682 -408215 133272 160511 18649 -7240 100352
18326 150978 -64627 22892 -27339 142819 -156970 -20408 -6607 -172035 -3032 189867 130019
18315 130019 301403 -161325 -396262 29875 119056 324245 -171314 101279 -10641 -41637
18305 -41637 224117 371488 125273 -48607 142494 -41704 175412 -104285 192622 -126047
18294 -128859 -320352 -44619 -200523 186943 -130357 11845 -313636 -198735 -533 153588
$$ packed form
18372d550j27973i798l56671A10193a92245b5231A83537I1531J11317M8793O1151
18361C12792j46481a12162A63599b25238C0007a60503g6441j4606j62325f3226
18350A03310f2582o041B23124o7153b54072b9049C39561j02873G9311J80737d7159
18338c43820J36872j050B06892G8908c99682q533A33272K7239A8649g240A00352
18326A50978f4627B2892b7339A42819a56970b0408f607j65428c032A89867n9848
18315A30019J71384a61325k34937B9875Q9181K05189a71314A01279a0641l0996
18305d1637B24117J47371A25273d8607A42494d1704A75412a04285A92622a26047
18294a28859j91493d4619j55904A86943a30357A1845c13636J14901e33A53588
$$ plain form
18283 49861 -464236 -351161 -85213 -13837 -110776 -383789 -401209 -87533 -148329 -151915 -46600
18271 -73259 165153 -143476 103507 198392 33946 327858 88454 205875 49837 -129861
18260 57058 -222440 -261422 -159565 -36842 -111000 -273485 27491 -224418 -59057 77440 -218324
18248 218248 108433 140781 -133904 132283 188852 48594 -282377 18227 -225457 -310649
18238 -310649 -141117 201026 -6140 -16717 138435 63762 89935 -35122 334330 -20815 -128194
18227 -128194 -315200 238034 -267051 -151529 90091 -107880 8142 182972 -165906 -122321
18217 -122321 117784 78632 120333 91610 67361 -151482 106641 -386975 -38581 187875
18206 52211 160110 -231571 -29198 -212647 -82540 -74196 17121 -98934 -112157 -93309 75864
$$ packed form
18283D9861d64236J13075h5213a3837r6939k73013j7420h7533o0796l586d6600
18271g3259A65153a43476A03507R4885C3946K93912H8454J17421D9837a29861
18260E7058b22440l8982J01857c6842p4158j62485B7491b24418e9057G7440b18324
18248B18248A08433L2348a33904A32283N6569D8594b82377A8227b25457q5192
18238c10649a41117B01026f140j0577A38435F3762K6173c5122C34330b0815j07379
18227a28194j87006B38034b67051J15522I0091a07880H142J74830a65906M3585
18217a22321A17784l9152M1701k8723k4249a51482A06641c86975c8581A87875
18206E2211J07899b31571b9198j83449h2540Q344A7121i8934j3223J8848G5864
$$ plain form
18194 72003 455980 -342899 -66117 47111 -60183 -78176 -135250 97822 -69829 -365216 -142648
18182 -34722 105746 -202547 25780 -67537 -84727 -34540 113784 3925 -22894 256038 -4891
18170 55302 110611 -261648 -47361 52410 332852 228944 -18399 -45024 -422602 -3956 -77151
18159 -77151 31082 7471 106942 -104800 44736 -114437 -193404 335735 113880 -200119 160648
18147 29019 115531 -101720 272735 -393078 -145253 -15424 91330 -393071 104213 -30860
18136 143933 -28781 -97371 -73599 -123026 -402408 129643 -5624 90739 -248792 174193 -14620
18124 88753 117108 -249612 -292316 203232 120492 -432475 257401 -170638 -69496 126315
18113 -247975 -3960 96457 -236310 17552 -36796 -250620 -97609 -39356 162859 -13930 -180909
$$ packed form
18194G2003L83977c42899f6117D7111f0183j7993n7074I7822f9829k95387a42648
18182c4722A05746b02547B5780f7537j7190c4540A13784C925b2894B56038d891
18170E5302N5309b61648d7361E2410K80442j03908a8399k6625l77578c956p3195
18159g7151C1082G471R9471a04800D4736a14437p8967C35735A13880b00119A60648
18147B9019Q6512a01720B72735c93078a45253a5424I1330c93071A04213c0860
18136A43933b8781o8590K3772m9427k79382A29643e624I0739b48792A74193a4620
18124H8753K8355b49612m2704B03232q2740d32475B57401a70638f9496A26315
18113b47975c960I6457b36310A7552c6796k13824i7609c9356A62859a3930j66979
$$ plain form
18102 -180909 -374568 382826 -123367 -399746 -86186 -407092 -73129 202928 -16336 -460820
18092 -460820 -195035 -216167 101450 -274981 -203496 123402 120056 -197341 -36296 -77777 -194619
18081 -194619 -336860 34059 -386137 279714 -21837 7398 -179044 -249206 405394 75779 -9611
18069 376658 -255459 -135564 198066 13010 -29907 162799 2260 35485 40319 -377961 -18379
18057 -246319 -271725 307337 -18003 232844 295128 -295474 -220624 138349 -334390 -366527
18047 -366527 -191934 -25041 -135168 -135665 179750 -185183 -29826 -50916 60221 -217865 162015
18035 -190052 214090 208269 -173084 211288 5865 -203137 65711 207311 -160899 -224879 75714
18023 178877 4427 -110614 143120 -5327 -332913 208636 -193084 -275533 -82434 -180620 140701
$$ packed form
18102a80909j93659C82826a23367k76379h6186l20906g3129B02928a6336m44484
18092d60820a95035k1132A01450b74981P1485A23402l346a97341c6296m1481j16842
18081a94619j42241C4059c86137B79714b1837G398a79044p0162D05394G5779i611
18069C76658b55459J19895A98066A3010b9907A62799B260L3225M834c77961a8379
18057b46319k5406C07337a8003B32844O2284b95474P4850A38349c34390l2137
18047c66527J74593b5041j10127m97A79750a85183b9826k1090F0221b17865A62015
18035a90052B14090n821a73084B11288E865b03137F5711J41600a60899o3980G5714
18023A78877D427a10614A43120e327l27586B08636a93084q2449h2434r8186A40701
$$ plain form
18011 46873 46626 116412 48560 85789 -172207 -259707 106968 -51110 -431920 -129461 -31033
17999 -261605 394253 84902 183079 15896 15782 7513 41414 -219562 77046 71107 -158439 -319489
17987 -319489 97566 -130984 144920 288722 -141762 -400605 -205779 -5965 66437 -102754
17976 -179539 122501 -160386 -30316 46180 10921 -372757 -209514 -156598 100727 -123743
17965 -2940 -18951 217402 -90798 -111593 22638 67683 99212 -79730 -270281 -87373 -119674
17954 -119674 97878 -203927 -230807 51270 49254 -85986 213841 -20983 159793 47782 81227
17943 81227 -316798 123489 -116720 128753 335665 -23741 14733 -163514 -195558 179894
17932 -32699 17457 -297173 -209651 241450 61159 -162891 214018 106113 -10070 -30463 109300
$$ packed form
18011D6873k47O9786D8560L7229a72207q7500A06968e1110l80810a29461c1033
17999b61605C94253H4902R8177A5896j14G513L3901b19562G7046n939a58439j61050
17987c19489I7566a30984A44920J43802a41762k58843J94826e965F6437a02754
17976a79539A22501a60386c0316D6180A0921c72757J63243N2916A00727a23743
17965b940j6011B17402i0798k0795B2638M5045L1529g9730j90551h7373l2301
17954a19674I7878b03927k6880E1270k016h5986B13841b0983A59793D7782L3445
17943H1227c16798A23489a16720A28753K06912b3741A4733a63514l2044A79894
17932c2699A7457b97173Q7522B41450F1159a62891B14018A06113a0070k0393A09300
$$ plain form
17920 66389 86140 -52523 96356 -238072 -236330 -114311 -175617 -124356 -82641 106050 129791
17909 129791 -84675 -39718 -193242 271294 89148 150277 285623 30786 148685 88040 -154811
17897 -163388 -58449 111540 101338 -391580 19626 -493394 105540 81194 -54314 22659 168834
17886 168834 -24281 278134 144140 -172177 -96780 -57159 -270112 -29072 -67243 -51683 -37549
17875 -37549 -204935 140930 87335 51690 -80302 98545 243653 -119636 61044 -144972 -8734
17863 203496 -364420 222462 -96314 -42335 230124 177961 326879 -3956 81899 16225 -142536
17851 275272 22230 12643 -17820 -7201 -49812 -213 141124 -272767 497 38935 -365084 363850
17838 376042 18222 2990 -79696 -21419 153306 110764 -76231 173069 -98248 -182380 104191
$$ packed form
17920F6389J9751e2523I6356b38072J742a14311o1306N1261M1715A06050K3741
17909A29791h4675c9718j53524B71294H9148O1129J35346C0786J17899o0645a54811
17897a63388e8449A11540j0202c91580A9626d93394A05540k4346e4314B2659J46175
17886A68834b4281B78134j33994a72177P5397L9621k12953b9072l8171J5560J4134
17875c7549j67386A40930n3595l5645h0302I8545J45108a19636F1044a44972h734
17863B03496c64420B22462i6314d2335B30124n2163J48918c956H1899A6225a42536
17851B75272B2230r587a7820g201m2611b13A41124b72767D97L8438c65084C63850
17838C76042A8222B990g9696b1419A53306m2542g6231A73069i8248q4132A04191
$$ plain form
17826 -517964 43731 -11778 -263468 -121825 -12037 14723 -37450 -182409 23685 -332444 -138476
17814 3126 -222403 167549 54068 -86277 90882 174966 51738 211332 60075 -80141 -237008
17803 -237008 93833 -138808 111824 -53633 259313 38013 -36473 -198683 196752 -127390
17792 247575 54432 -508268 -312413 217133 136080 71098 38904 222286 19726 1014 -199961
17780 19097 -103726 165676 -13385 -174854 -128786 -118239 -96495 177299 -360513 243316
17769 -140097 -512010 274689 -64790 148986 206290 165280 -39034 -255374 -218540 -10674 -112446
17758 -112446 142974 120831 -177804 -345114 23403 83751 -148413 -139204 -109554 -41975 208456
17746 176002 -46305 -109126 -1701 94623 208627 -80453 395946 -213254 -392592 148774 15946
$$ packed form
17826e17964D3731a1778k51690a21825a2037A4723c7450j44959B3685c32444a38476
17814C126b22403A67549E4068h6277I0882Q4084E1738J59594F0075h0141j56867
17803b37008I3833a38808A11824e3633B59313C8013c6473j62210A96752a27390
17792B47575E4432e08268J95855B17133q1053o4982l2194J83382A9726A014a99961
17780A9097a03726A65676a3385j61469M6068J0547K1744A77299c60513B43316
17769a40097l71913B74689f4790A48986N7304m1010c9034k16340L6834a0674j01772
17758a12446A42974k2143a77804j67310B3403O0348a48413R209K9650d1975B08456
17746A76002d6305o2821a701I4623J14004h0453C95946b13254j79338A48774A5946
$$ plain form
17734 95787 54074 -145318 -181708 233548 -1222 -178553 -141643 -50899 -295880 -60245 -137921
17723 -137921 170413 2877 95087 314716 181426 182242 -42836 -186134 -212808 -5097 40488
17711 6045 58396 -136193 5589 -180856 -39505 -545108 122917 -117981 16366 31444 97612
17700 97612 193539 -26765 -91950 5886 26504 -82489 29437 310722 -151463 231491 109963
17688 -128509 -96596 85430 34949 180478 -402554 77898 4886 257409 149695 -152557 -115941
17677 -115941 -136124 178464 270442 22877 36783 -65485 -52348 83873 306581 -62761 18474
17665 233539 -31516 -7988 137448 -115670 -161621 166263 -64732 -50733 -58616 176605 214728
17654 214728 -163519 92335 -294922 -76628 18944 -61404 263113 158844 100948 -95241 91083
$$ packed form
17734I5787m1713a45318l6390B33548a222j77331L6910e0899k44981f0245p7676
17723a37921A70413B877R2210K19629j33290Q16d2836j43298k6674e097D0488
17711F045N2351a36193E589a80856c9505n05603A22917a17981A6366J5078O6168
17700I7612R5927b6765o5185E886K0618h2489B9437K81285a51463B31491A09963
17688a28509L1913H5430C4949J45529d02554G7898D886K52523j07714a52557L6616
17677a15941k0183A78464R1978B2877J3906f5485J3137H3873K22708f2761A8474
17665B33539c1516g988A37448a15670m5951A66263f4732J3999p883A76605L8123
17654B14728a63519I2335b94922g6628A8944f1404B63113j04269n7896i5241I1083
$$ plain form
17642 -31424 -39743 12489 102303 -119248 -134489 171213 132276 111824 -161410 130150 265249
17631 265249 -224588 -27173 152522 171858 398472 -329861 105544 419586 39834 -104207
17620 -568856 43031 182312 -53474 -99207 213244 -15058 -22636 87894 -126817 -57270 -80515
17609 -80515 -212256 8252 49777 36695 -76585 -11593 16981 -9088 127222 42608 100290 105819
17597 105819 -97409 -114639 107566 -181659 -228814 -66359 108302 139198 -69560 -109176 356189
17585 192678 -45970 -301697 -74664 -315538 65034 -718 -184026 -4918 28611 -60053 -161552
17574 -161552 -213718 -238339 -277175 7942 56554 -211940 103068 283326 313190 -121590 42415
17562 -22048 39177 -141287 7592 -143432 63695 102896 -105251 -31575 -411795 25073 44871
$$ packed form
17642c1424q319A2489Q9814a19248j5241A71213l8937k0452a61410A30150J35099
17631B65249b24588b7173A52522J9336K26614c29861A05544L14042C9834a04207
17620e68856D3031J39281e3474m5733B13244a5058p578H7894a26817e7270k3245
17609h0515j31741H252M1525j3082g6585a1593A6981i088A27222D2608N7682N529
17597A05819i7409j7230A07566a81659m7155f6359A08302L0896f9560l9616C56189
17585A92678d5970k55727g4664k40874F5034g18j83308d918B8611f0053j01499
17574a61552n2166k4621l8836G942M8612b11940A03068J80258K9864a21590D2415
17562b2048C9177a41287G592a43432F3695L9201a05251c1575l80220B5073J9798
$$ plain form
17551 44871 261489 -136918 -79133 -1601 173905 505697 -110548 166897 -75144 74149 -39376
17539 214805 22491 -15114 411355 -19233 2461 -295940 -392717 324137 -73556 -147931 -93493
17528 -93493 25400 221049 136949 74339 -170646 182255 315665 225228 -55993 -21561 -38782
17517 -38782 97040 203874 408984 114431 23656 -86767 115052 -83837 125447 -52283 381518
17505 -2231 -108433 341525 -290969 -85151 353814 44210 258686 -25944 -5074 243282 -78273
17493 -71552 391738 175346 -350784 438821 -19564 49378 292343 107785 293079 199322
17483 199322 27831 -74924 17442 92269 18945 243155 41385 311867 462098 213518 548066
17472 548066 72569 176161 146452 -188581 118481 -172125 298028 -109751 116732 116240
$$ packed form
17551D4871K16618a36918N7785a601A73905L31792a10548A66897g5144G4149c9376
17539B14805B2491a5114D11355a9233B461b95940r6777C24137g3556p4375N4438
17528i3493B5400J95649q4100o2610a70646A82255J33410r0437e5993b1561j7221
17517c8782I7040J06834K05110A14431B3656h6767A15052h3837A25447e2283C81518
17505b231j06202C41525b90969h5151C53814D4210K14476b5944e074B43282g8273
17493g1552C91738A75346c50784D38821a9564D9378K42965A07785J85294r3757
17483A99322B7831g4924A7442P4827A8945K24210D1385K70482J50231B13518L34548
17472E48066G2569J03592k9709a88581A18481a72125B98028a09751A16732m92
$$ plain form
17462 116240 148206 83390 124276 111558 105661 235332 136485 124203 241785 225639 -118548
17450 217074 -81353 102972 48464 543958 236764 153593 170735 202153 378384 176926
17439 412693 145455 155365 243428 -271174 214877 165189 323689 88169 238666 205339 149049
17428 149049 482161 308606 285095 381579 213492 -3034 420551 135129 220243 267676 287994
17417 287994 467586 34695 391238 105979 -91044 430506 190878 69587 24670 94679
17407 94679 523186 73630 42534 183078 -65346 61897 94473 172557 -99140 85470 -58855
17395 97629 343729 108068 44390 252463 239853 -28349 27737 134439 -34339 242993 212064
17384 212064 -8344 86807 -10958 71003 226009 276639 220166 113926 -169364 785 -81458
$$ packed form
17462A16240L1966o4816M0886j2718n897J29671r8847j2282J17582j6146a18548
17450B17074h1353A02972D8464M95494B36764q3171J7142L1418J76231A76926
17439D12693A45455R910Q8063b71174B14877m9688J58500H8169J50497l3327n6290
17428A49049L33112j73555k3511R6484j68087c034D20551A35129Q5114M7433K0318
17417B87994J79592C4695L56543A05979i1044D30506A90878F9587B4670P0009
17407I4679M28507G3630l1096J40544f5346F1897L2576P8084i9140H5470e8855
17395I7629K46100A08068D4390K08073j2610b8349B7737J06702c4339B42993l0929
17384B12064h344H6807a0958G1003J55006N0630n6473j06240a69364G85h1458
$$ plain form
17372 228268 -78223 248991 239153 243860 70317 -28222 341287 214356 7462 350606 151249
17360 219643 234720 -97809 30049 92186 -157127 235351 430762 41132 -12539 -43946 156951
17348 148922 417868 358426 -75044 368930 -144267 146373 -106246 30367 -93636 -130810
17338 -130810 119075 215186 119118 -27666 26953 416540 -90818 69968 286267 -75650 8239
17326 158204 2298 166182 61795 170687 8940 -67056 78092 -125265 -31177 147659 -182926
17314 23955 171471 236544 264490 -28072 -37530 113458 -218501 230945 200170 328462 -204961
17302 -181863 14908 60621 186194 -51786 526037 256267 127814 292846 139452 377486
17292 377486 101605 456664 47053 98362 21432 -81006 -4728 29830 43996 -392349 453210
$$ packed form
17372B28268g8223B48991r838M707G0317b8222C41287j26931G462L43144A51249
17360B19643J5077i7809C0049O2137a57127B35351J95411D1132a2539l1407A56951
17348A48922K68946n9442g5044C68930a44267A46373a06246C0367i3636l7174
17338a30810A19075R6111r6068b7666B6953L89587i0818F9968K16299g5650H239
17326A58204B298J63884F1795J08892H940f7056G8092a25265c1177A47659a82926
17314B3955J47516O5073K7946b8072r458A13458b18501B30945l0775J28292b04961
17302a81863A4908M5713J25573e1786E26037B56267A27814J65032A39452K38034
17292C77486A01605L55059D7053N1309B1432h1006d728B9830J4166c92349D53210
$$ plain form
17280 199270 366647 -22613 297906 293849 138359 142347 152907 351619 -23754 289377 83583
17268 399203 118081 -113921 19358 -99862 280263 160140 146195 89822 129652 185446 20671
17256 108378 13282 72138 286017 7682 92748 111692 -374 36096 388745 302777 461791
17245 461791 187213 61012 164669 165917 44712 360209 -155488 168223 1457 120560 92037
17234 92037 33966 139466 8697 139995 385872 -280000 -240685 218783 -25169 90024 184727
17223 184727 126105 269120 290231 267588 164118 132483 134697 110082 310543 -185826 -27673
17211 43899 162024 390845 317314 189677 451224 371570 11708 -81938 413212 188851
17200 262315 136851 116970 237066 6505 142186 16342 152108 79739 208445 130209 406093
$$ packed form
17280A99270J67377b2613B97906m057A38359L988J0560J98712b3754B89377H3583
17268C99203A18081a13921A9358i9862B80263j20123j3945n6373L9830N5794B0671
17256A08378A3282N8856K13879G682Q5066J8944c74C6096L52649q5968J59014
17245D61791A87213F1012J03657J248D4712L15497a55488A68223A457J19103k8523
17234I2037C3966J05500H697J31298K45877b80000L9315B18783b5169I0024R4703
17223A84727n8622J43015K1111k2643j03470l1635K214k4615K00461a85826b7673
17211D3899J18125K28821p3531j27637K61547p9654A1708h1938D13212A88851
17200B62315j25464j9881J20096F505J35681A6342J35766p2369J28706p8236K75884
$$ plain form
17189 406093 18715 245843 412038 294625 -26424 463127 236077 470919 135369 316341
17179 316341 8056 239634 377755 117106 469320 263355 380307 298571 84129 152234
17169 152234 424490 119120 133192 -118070 160749 157559 173556 307132 244662 254377 511815
17158 511815 124470 410164 337672 286049 391128 193492 258896 61662 479909 336622
17148 336622 177613 225037 330647 465609 2570 440809 148339 329225 254302 189075
17138 189075 235714 328918 151105 289980 376482 273575 360636 284892 644285 221680
17127 -10801 86257 283341 14267 68980 291270 -54517 88247 326225 422365 -100414 343587
17115 457221 756562 214105 476706 385003 351658 467988 266776 480112 170729 334779
$$ packed form
17189D06093A8715K27128J66195j17413b6424D63127k27050K34842A35369J80972
17179C16341H056K31578J38121A17106L52214k05965J16952q1736H4129O8105
17169A52234K72256A19120J4072a18070A60749l190J5997J33576o2470R715K57438
17158E11815A24470K85694p2492n1623J05079A93492O5404F1662M18247j43287
17148C36622j59009M7424J05610J34962B570M38239A48339J80886p4923o5227
17138A89075M6639R3204A51105J38875Q6502j02907Q7061p5744L59393B21680
17127a0801H6257J97084A4267N4713K22290e4517H8247K37978R6140a00414C43587
17115D57221K99341B14105K62601r1703l3345J16330k01212K13336A70729J64050
$$ plain form
17105 334779 263250 397112 409576 37597 302333 138354 648480 485219 452640 213716
17094 572760 449365 676293 331973 377757 250828 393749 313190 569848 290054 151127
17084 151127 131287 191456 162544 242989 98989 205040 393077 311627 365061 607538 325178
17073 325178 409302 433440 439537 514476 246362 -14884 383587 843567 447254 102382 501999
17062 501999 224741 460070 358560 531896 538479 584133 506468 446569 210634 440572
17052 440572 177126 328414 311601 495802 300539 329384 665051 445033 186077 842775
17042 842775 46598 529802 415412 429362 476060 438603 515269 604518 554119 466060 900632
17031 900632 163667 420056 162160 492877 464803 830368 316826 444414 463308 568281
$$ packed form
17105C34779p1529J33862J2464C7597K64736A38354N10126j63261l2579B13716
17094E72760j23395K26928C31973M5784j26929J42921q0559K56658k79794j38927
17084A51127j9840O0169k8912Q0445I8989J06051J88037q1450N3434K42477k82360
17073C25178Q4124K4138O097P4939B46362a4884C83587M59980l96313A02382L99617
17062E01999B24741K35329j01510J73336O583M5654p7665n9899B10634K29938
17052D40572A77126J51288j6813J84201j95263K8845L35667k20018A86077O56698
17042H42775D6598M83204j14390J3950M6698l7457P6666Q9249n0399q8059M34572
17031I00632A63667K56389A62160L30717k8074L65565C16826J27588J8894J04973
$$ plain form
17021 568281 491868 734771 517168 408275 622027 249157 513551 522913 612173 255615
17010 494747 379403 406212 656632 54452 762802 635608 619662 787508 711251 625546
17000 625546 798019 729152 733351 929329 664927 224334 652563 675615 621065 471478
16990 471478 502688 567500 911334 829522 759692 708136 698639 349097 671205 487095 648425
16979 648425 687963 629651 618878 879036 964578 789071 721604 838798 917783 790329 793590
16968 793590 661680 745718 827656 576217 786119 827977 560232 773608 1097599 905344
16958 905344 733042 699092 704232 447012 857947 902669 826902 926250 783356 760966 447607
16947 447607 837460 1017900 1046998 817619 455193 980288 907806 1050637 829437 979677
$$ packed form
17021E68281p6413K42903k17603j08893K13752B49157K64394R362Q9260B55615
17010D94747j15344K6809K50420E4452P08350j27194j5946J67846p6257q5705
17000F25546J72473o8867M199J95978k64402B24334M28229K3052n4550j49587
16990D71478L1210O4812L43834q1812o9830n1556r497C49097L22108j84110J61330
16979F48425L9538n8312j0773K60158Q5542j75507o7467J17194P8985j27454L261
16968G93590j31910Q4038Q1938k51439K09902M1858k67745K13376L23991j92255
16958I05344j72302l3950N140k57220M10935M4722p5767R9348j42894k2390l13359
16947D47607L89853J80440K9098k29379l62426N25095p2482J42831k21200J50240
$$ plain form
16937 979677 802885 736891 828219 764213 987780 848560 832465 916898 1093427 911320
16927 911320 1069819 1135657 1365096 1104908 1113458 1341454 1200706 1265450 1194522 1601660
16917 1601660 1386241 1352652 1461392 1313901 1014641 1248909 1373507 1333128 1100911 1188400
16907 1188400 1378217 1557656 1144625 1424339 1193337 1475993 1315577 1766431 1566356
16898 1566356 1594295 1333958 1742258 1588718 1564060 1829406 1629131 1483460 1344323 1451781
16888 1451781 1985433 1665953 1543855 1491031 1581605 1811463 1849422 1811526 1782325 1779492 1987123
16877 1987123 1886769 1486955 1943761 1994760 1999643 1976613 1930400 2021573 1919479 2026308
16867 2026308 1973658 2053270 2309017 2317453 2565169 2152281 2022668 2483017 2251328 2081355
$$ packed form
16937I79677j76792o5994R1328o4006K23567j39220j6095Q4433J76529j82107
16927I11320J58499O5838K29439k60188Q550K27996j40748O4744p0928M07138
16917A601660k15419l3589J08740j47491k99260K34268J24598m0379k32217Q7489
16907A188400J89817J79439m13031K79714k31002K82656j60416M50854k00075
16898A566356K7939k60337M08300j53540k4658K65346k00275j45671j39137J07458
16888A451781N33652l19480j22098n2824R0574K29858L7959l7896k9201k833K07631
16877A987123j00354l99814M56806N0999M883k3030m6213R1173j02094J06829
16867B026308n2650P9612K55747Q436K47716m12888j29613M60349k31689j69973
$$ plain form
16857 2081355 2486686 2504127 2444218 2502244 2581805 2663046 2832718 2597138 2666288 2498077
16847 2498077 2849368 2708067 3218526 2785999 2857243 2882029 3089388 3046744 3049609 3320115
16837 3320115 2784887 3147013 3835466 3593744 3282258 3494705 3232101 3480661 3695984
16828 3695984 3638392 3973903 3945609 4000690 4286875 3646612 4401422 4386259 4153228 4378551
16818 4378551 4600802 4580119 4563994 4933782 4974865 4760007 4819777 5244225 5300226 5240483
16808 5240483 5565522 5719707 5811164 5839062 5803155 6466530 6273472 6608797 6630469 6724099
16798 6724099 6838027 6959032 7407779 7317693 7661234 7653863 8051184 8133731 8198080 8896732
16788 8896732 8675055 9190544 9253444 9879664 9908716 10182407 10261313 10716227 10848037 11410460
$$ packed form
16857B081355M05331J7441n9909N8026P9561Q1241J69672k35580O9150j68211
16847B498077L51291j41301N10459m32527P1244K4786K07359m2644K865K70506
16837C320115n35228L62126O88453k41722l11486K12447k62604K48560K15323
16828C695984n7592L35511k8294N5081K86185o40263P54810j5163k33031K25323
16818D378551K22251k0683j6125L69788M1083k14858N9770M24448N6001n9743
16808E240483L25039J54185R1457K7898l5907O63375j93058L35325K1672R3630
16798F724099J13928J21005M48747r0086L43541p371L97321Q2547O4349O98652
16788H896732k21677N15489O2900O26220K9052K73691P8906M54914J31810N62423
$$ plain form
16778 11410460 11787686 11933312 12504513 12656358 13381125 13326702 13778923 14195339 14530055
16769 14530055 15531700 16450265 16711040 17192019 17988305 18351259 19035565 20071246 20725475
16760 20725475 21556560 22227790 23477746 24435544 25582035 26503977 27455370 28842692 30346008
16751 30346008 31367328 33442932 34773572 36491096 38239826 40619391 42444489 44652750
16743 44652750 47205747 49727683 52783989 55963469 59183508 62882108 66699786 70748398
16735 70748398 75281092 80021108 85274462 90933140 96619787 103238563 109769417 116742188
16727 116742188 124488433 132326950 139771746 148098918 155994596 163522717 170889749 177225810
16719 177225810 183219753 187477419 191061256 193135003 193561583 192408236 190202805 186571601
$$ packed form
16778A1410460L77226J45626N71201J51845P24767n4423M52221M16416L34716
16769A4530055J001645R18565K60775M80979P96286L62954O84306J035681O54229
16760B0725475Q31085O71230J249956R57798J146491R21942R51393J387322J503316
16751C0346008J021320K075604J330640J717524J748730K379565J825098K208261
16743D4652750K552997K521936L056306L179480L220039L698600L817678M048612
16735G0748398M532694M740016N253354N658678N686647O618776O530854O972771
16727A16742188P746245P838517P444796Q327172P895678P528121P367032O336061
16719A77225810N993943M257666L583837K073747M26580j153347k205431l631204
$$ plain form
16711 186571601 181389325 175327571 168204190 160861982 153125424 145056861 136786533 128818183
16703 128818183 121134523 113815331 106572501 99935535 93683210 87566356 82212115 77074742
16695 77074742 72253052 68002303 63831754 59731763 56258428 53085535 49970431 47532667
16687 47532667 44372059 42458462 40065501 37970724 36011786 34024114 32478179 30779776
16679 30779776 29538922 28146532 26702269 25280840 24447631 23610473 22844159 21398026
16671 21398026 20530349 19393853 19304903 18568094 17421466 16728733 16269140 15712479 15247727
16662 15247727 14751192 14386683 13790439 13036318 12762270 12298154 12215719 11249032 11236714 10674665
16652 10674665 10501421 10110595 9787062 9469677 9496142 9279555 8771957 8698467 8192740 7833752
$$ packed form
16711A86571601n182276o061754p123381p342208p736558q068563q270328p968350
16703A28818183p683660p319192p242830o636966o252325o116854n354241n137373
16695G7074742m821690m250749m170549m099991l473335l172893l115104k437764
16687D7532667l160608j913597k392961k094777j958938j987672j545935j698403
16679C0779776j240854j392390j444263j421429q33209q37158p66314j446133
16671B1398026q67677j136496q8950p36809j146628o92733m59593n56661m64752
16662A5247727m96535l64509n96244p54121k74048m64116q2435r66687j2318n62049
16652A0674665j73244l90826l23533l17385K6465k16587n07598p3490n05727l58988
$$ plain form
16642 7833752 7694355 7769591 7453435 7309284 7073505 6798014 6587974 6710545 6469874 6139614
16632 6139614 6240370 5940800 5617951 5480375 5444982 5834907 5267813 5195633 4900598 5363035
16622 5363035 4853306 4496364 4693163 4758827 4673319 4113048 4431525 4341670 4060763 4191309
16612 4191309 3734135 3990955 3936769 3413276 3696431 3230179 3573698 3574276 3184130 3493601
16602 3493601 3317796 3021019 3274807 3187366 2968733 2773414 3011389 2826974 2796284 2966508
16592 2966508 2508878 2600959 2827880 2643696 2697590 2708678 2339837 2665269 2450422 2473751
16582 2473751 2533624 2053100 2298308 2387506 2192074 1980084 1966369 2033613 1907302 2152585
16572 2152585 2043731 1818285 2192381 1987037 1813034 1846975 1796390 1945151 1920229 1720795
$$ packed form
16642G833752j39397P5236l16156j44151k35779k75491k10040J22571k40671l30260
16632F139614J00756k99570l22849j37576l5393L89925n67094p2180k95035M62437
16622E363035n09729l56942J96799O5664q5508n60271L18477q9855k80907J30546
16612D191309m57174K56820n4186n23493K83155m66252L43519N78l90146L09471
16602C493601j75805k96777K53788q7441k18633j95319K37975j84415l0690J70224
16592B966508m57630R2081K26921j84184N3894J1088l68841L25432k14847K3329
16582B473751N9873m80524K45208Q9198j95432k11990j3715O7244j26311K45283
16572B152585j08854k25446L74096k05344j74003L3941n0585J48761k4922j99434
$$ plain form
16562 1720795 1699581 1688497 2091253 1693502 1381028 1289067 1573643 1669924 1445617 1131075
16552 1131075 1631233 1610430 1421160 1601571 1468433 1232182 1399276 1458022 1452136 1531495
16542 1531495 1057562 1110921 1246913 1179833 1338819 1406889 1321819 1353004 821021 1083260
16532 1083260 1236063 1104142 1103890 727022 1384983 1223465 1102467 951194 1147601 793227
16522 793227 992102 994624 761384 881876 625318 924058 820177 837539 1001118 797588
16512 797588 832935 581402 863232 815371 706304 785594 621338 399641 698161 642498
16502 642498 876336 800431 925215 907133 922608 921491 788285 762163 364384 850352 829992
16491 829992 831414 458826 610715 420579 582943 564399 878696 436642 882054 795638
$$ packed form
16562A720795k1214j1084M02756l97751l12474r1961K84576R6281k24307l14542
16552A131075N00158k0803j89270J80411j33138k36251J67094N8746n886P9359
16542A531495m73933N3359J35992o7080J58986O8070q5070L1185n31983K62239
16532A083260J52803j31921k52l76868O57961j61518j20998j51273J96407l54374
16522G93227J98875K522k33240J20492k56558K98740j03881J7362J63579k03530
16512G97588L5347k51533K81830m7861j09067P9290j64256k21697K98520n5663
16502F42498K33838p5905J24784j8082J5475j117j33206k6122C64384M85968k0360
16491H29992J422l72588J51889j90136J62364j8544L14297D36642M45412q6416
$$ plain form
16481 795638 386651 736385 974354 528757 547529 987489 494752 534464 650648 705138
16471 705138 831182 696169 577523 456026 817428 426226 570994 439000 500260 722975
16461 722975 538673 588211 358035 628583 463410 372736 407525 381753 434804 397187 571538
16450 571538 646227 626833 380737 422637 636539 697652 381994 377513 642915 634911 506020
16439 506020 718176 415750 367492 478878 308847 494937 287953 383563 275520 160451
16429 160451 342070 509983 316894 198327 402081 169096 279306 -33743 246798 367703
16419 367703 475515 346118 246207 591347 142473 116283 177471 631548 349930 348347
16409 348347 242198 329455 480027 421378 523229 85382 225186 558639 536722 180653
$$ packed form
16481G95638C86651L49734K37969m45597J8772M39960m92737L9712J16184N4490
16471G05138J26044j35013j18646j21497L61402l91202J44768j31994O1260K22715
16461G22975j84302M9538k30176K70548j65173r0674L4789k5772N3051l7617J74351
16450E71538P4689j9394k46096M1900K13902O1113l15658m481K65402q004j28891
16439E06020K12156l02426m8258J11386j70031J86090k06984R5610j08043j15069
16429A60451J81619J67913j93089j18567K03754A69096J10210c3743B46798J20905
16419C67703J07812j29397r9911L45140A42473k6190O1188M54077k81618j583
16409C48347j06149Q7257J50572n8649J01851H5382J39804L33453k1917A80653
$$ plain form
16398 145850 452941 495358 120480 213168 270709 509309 465042 517716 374498 82303 -160456
16386 165345 159246 337962 401347 203158 538906 349703 183110 264358 81142 121186 301171
16375 301171 61432 270141 175083 258312 -44960 203457 103052 398144 -22435 295651
16364 135982 569961 396820 -81318 127714 210790 94803 155935 347293 216255 381122
16354 381122 76071 217746 447792 166628 -102900 130242 37613 243516 304682 318261
16344 318261 155650 177024 -111613 325771 276028 -3339 -179103 82475 284834 333701 96054
16332 -139162 262007 281599 216917 432582 209411 170120 259118 320777 -35667 300074 -113349
16320 188522 45443 -118547 197041 -206095 18734 -124117 319913 -1651 240191 -15600
$$ packed form
16398A45850L07091M2417A20480R2688N7541K38600m4267N2674j43218H2303a60456
16386A65345o099J78716O3385j98189L35748j89203j66593Q1248H1142M0044J79985
16375C01171F1432K08709r5058Q3229d4960B03457j00405K95092b2435B95651
16364A35982M33979j73141h1318A27714Q3076I4803O1132J91358j31038J64867
16354C81122G6071J41675K30046A66628a02900A30242C7613K05903O1166J3579
16344C18261A55650K1374a11613C25771m9743c339j75764H2475K02359M8867I6054
16332a39162B62007J9592o4682K15665B09411l9291Q8998O1659c5667C00074a13349
16320A88522D5443a18547A97041b06095A8734a24117C19913a651B40191a5600
$$ plain form
16309 332203 14225 -68400 77694 288013 425035 221794 -45996 397471 70446 243702
16299 243702 78214 150642 -1231 302267 -19862 408197 -108034 150575 124662 210930 147468
16288 147468 75784 194401 297307 -57988 147006 -83735 -61849 175626 175470 -25613 174624
16276 46280 114388 -8638 100331 139302 108445 207331 369598 25243 49445 -354927 94461
16264 164361 114406 225576 121686 -33182 211845 128385 -161246 61104 -96202 351866
16253 -191741 87049 -67565 37810 -67870 -121785 78198 280893 70858 32082 -62887 -10283
16241 -173226 105135 -48062 26197 291841 222429 21073 -83963 9826 319387 62661 267002
16230 267002 -50828 158492 160836 74673 -7351 148676 -39975 -103599 173352 -72078 2468
$$ packed form
16309C32203A4225f8400G7694K10319J37022k03241d5996C97471G0446J73256
16299B43702G8214P2428a231C02267a9862D08197a08034A50575k5913Q6268o3462
16288A47468p1684J18617J02906e7988A47006h3735K1886A75626j56b5613A74624
16276D6280O8108h638A00331L8971l0857R8886J62267B5243K4202c54927I4461
16264A64361m9955J11170j03890c3182B11845q3460a61246F1104i6202C51866
16253a91741H7049f7565C7810f7870n3915G8198K02695G0858C2082f2887a0283
16241a73226A05135d8062B6197K65644o9412B1073h3963I826L09561F2661K04341
16230B67002e0828A58492K344G4673g351A48676c9975o3624A73352g2078B468
$$ plain form
16218 188162 -72013 70302 40398 -168428 -60779 -191526 -82162 163542 -58792 237645 6134
16206 24353 -55206 -113023 133220 -242062 -267391 -318689 -4663 91153 223880 40986 27089
16195 27089 261194 -29103 10232 469923 332705 30138 -125658 -63300 97175 26975 298039
16184 298039 -106969 6856 196228 202785 78485 -80966 -104566 -110335 9304 229074 -44210 44421
16171 259228 53147 92692 -68506 249004 -119050 270501 590510 -119255 -206986 -41305
16160 -259272 -72730 -54014 207157 -232643 21331 23499 155359 25024 -4230 138714 -135301
16148 251300 21620 -121039 161531 93945 -120045 153070 81096 23294 23241 -183443 111116
16136 -15500 66782 166123 169871 50685 160778 -41963 330262 -66582 280426 -174396 96286
$$ packed form
16218A88162g2013G0302k9904a68428f0779j30747h2162A63542e8792B37645F134
16206B4353e5206n7817A33220b42062k5329n1298d663I1153J32727D0986j3897
16195B7089K34105b9103A0232M59691j37218C0138a25658O2358I7175B6975K71064
16184B98039a06969F856J89372O557G8485h0966k3600n769I304K19770d4210D4421
16171B59228E3147L9545f8506B49004a19050B70501L20009a19255q7731d1305
16160b59272g2730J8716B07157b32643B1331K168J31860B5024d230A38714a35301
16148B51300B1620a21039A61531o7586a20045A53070p1974B3294n3a83443A11116
16136a5500F6782R9341L748E0685J10093d1963C30262f6582B80426a74396I6286
$$ plain form
16124 -153864 -2152 185146 185011 -182815 -138698 394174 -85315 409079 146709 -209995 61135
16112 -50873 -477917 345664 -113760 -10045 13420 -147137 129179 -284538 -81272 -180087
16102 -180087 40787 236902 112130 6741 249163 -152010 44778 -58436 246740 95636 -174204
16090 -251599 -28117 -247767 153180 -248165 -242680 -100313 -37695 -183303 153367 103411
16080 103411 -415676 124928 -13874 -163274 90371 -47711 -117712 -206375 -126467 156525 -192010
16068 -142743 -15854 87219 -191907 255551 -64712 310926 -135369 -134977 -383266 57803 -123906
16056 158386 -167048 -92228 14813 -149312 -267955 56084 -58836 54786 21432 -18627 246219
16044 264822 -47444 152078 -4316 -273892 68981 -153994 -307887 -431 -114477 -32266 -78894
$$ packed form
16124a53864b152A85146j35a82815M4117C94174h5315D09079A46709b09995F1135
16112e0873m27044C45664a13760a0045A3420a47137A29179b84538h1272r8815
16102a80087D0787J96115A12130F741K42422a52010D4778e8436B46740I5636a74204
16090b51599b8117k19650A53180b48165N485a00313c7695j45608A53367m9956
16080A03411d15676A24928a3874j49400I0371d7711p0001q8663P9908A56525a92010
16068a42743a5854H7219a91907B55551f4712C10926a35369L92k48289E7803a23906
16056A58386a67048P4820A4813a49312j18643E6084e8836E4786B1432a8627B46219
16044B64822d7444A52078d316k69576F8981a53994j53893d31j14046c2266m6628
$$ plain form
16033 -78894 -189133 32042 -23693 -27439 -426308 -338579 137985 -208550 109808 112871 245650
16022 245650 -149684 223960 506370 258930 25332 4710 -66585 -38549 -3116 27556 64645
16011 64645 -55462 44035 71559 -126542 -22597 172028 -114517 235577 -87423 87017 -38776
15999 -169463 -150257 135314 32565 -273744 63652 64738 307677 -147297 100070 113329 122127
15988 122127 11242 -81776 40837 -38269 84378 205863 231888 433996 254113 46563 437281
15977 437281 -103255 -109096 213897 -124544 -159223 -5062 -20723 -4693 -189253 130031 -32048
15965 5130 550242 180149 163975 271278 10220 95362 -145279 51242 98285 -191685 147952
15953 -22687 -430707 -326242 -441096 -165481 187423 -157014 -300997 -296762 -146596 -70232
$$ packed form
16033g8894j10239C2042b3693l746l98869Q7729A37985b08550A09808L063J32779
16022B45650a49684B23960K82410k47440B5332D710f6585K8036c116B7556L7089
16011F4645e5462D4035K7524a26542b2597A72028a14517B35577h7423H7017c8776
15999a69463J9206A35314C2565b73744F3652J086K42939a47297A00070J3259Q798
15988A22127A1242h1776D0837c8269H4378J21485K6025K02108j79883D6563L90718
15977D37281a03255n841B13897a24544l4679e062j5661d693j84560A30031c2048
15965E130N45112A80149j6174J07303A0220Q5142a45279E1242M7043a91685A47952
15953b2687m08020J04465j14854a65481A87423a57014j43983M235a46596g0232
$$ plain form
15942 -100393 80986 -223114 71254 110744 50241 79200 -178958 76622 -321918 357072 -72351
15930 -137357 62886 19360 218005 187049 -12733 -248159 55839 185567 -316096 -403242 -41818
15918 -313847 391837 -12426 -176241 61789 163599 147457 -190059 202218 184187 -160192
15907 137453 -255802 -228430 -61313 127683 -173817 -77450 291593 227554 -40930 79741 -246020
15895 -138634 -53645 -97633 -168654 -7983 172591 76491 -122481 36610 105842 -293561 -161684
15884 -161684 -168571 -614239 -177990 205391 -146382 -326201 79779 -140263 101987 -28593
15873 -168150 -155321 -183766 285237 -281619 157456 -26457 -92648 37028 -109809 -4703 -239617
15862 -239617 -115255 -105889 -253788 77183 224127 -266080 325395 -13725 258373 97445
$$ packed form
15942a00393H0986b23114G1254L9490E0241K8959a78958G6622c21918C57072g2351
15930a37357F2886A9360J98645l0956a2733k35426E5839J29728c16096q7146d1818
15918c13847C91837a2426j63815F1789J01810j6142a90059B02218j8031a60192
15907A37453b55802K7372f1313A27683a73817g7450B91593o4039d0930G9741b46020
15895a38634e3645m3988p1021g983A72591G6491a22481C6610O9232b93561J31877
15884a61684o887m45668a77990B05391a46382j79819G9779a40263A01987b8593
15873a68150J2829k8445B85237b81619A57456b6457o6191C7028a09809d703k34914
15862b39617a15255R366j47899G7183J46944b66080C25395a3725B58373I7445
$$ plain form
15851 69664 407784 -34224 412528 -115621 -191473 -8432 -125278 -37538 24244 -252843 -198071
15840 -198071 106499 -54344 -14387 -233615 100263 -12388 -177066 -79693 -42966 -253274
15830 -253274 191881 4941 26769 -67705 205151 -6531 -39783 -61970 -143592 -510192 -161046
15818 178568 -189621 300673 -7567 -316989 103024 -333701 -240299 -304109 -74574 -216124
15808 -216124 78652 293133 35145 -112869 -134736 67313 -275561 110348 -128878 34844
15797 15191 247818 -187530 124894 75199 -330255 -192748 -23692 -6074 -131461 130276
15786 -39126 -88124 -60855 -124485 -100705 -55135 -345995 70494 -31488 -315782 87448 -211076
15774 -231320 189694 -30438 -161173 105459 131192 -212839 250894 101566 -344978 -181260
$$ packed form
15851F9664L38120c4224D12528a15621p5852h432j16846c7538B4244b52843N4772
15840a98071A06499e4344a4387k19228A00263a2388j64678g9693L6727k10308
15830b53274A91881D941K1828f7705B05151f531l3252k2187q1622l66600a61046
15818A78568a89621C00673g567l09422A03024c33701R3402o3810g4574j41550
15808b16124G8652K14481C5145a12869k1867F7313b75561A10348a28878C4844
15797A5191K32627a87530A24894m9695c30255J37507b3692f074j25387A30276
15786c9126m8998K7269o3630K3780M5570k90860G0494c1488k84294H7448b11076
15774b31320A89694c0438j30735A05459K5733b12839B50894A01566c44978J63718
$$ plain form
15764 -181260 -51373 182778 -27301 -3033 394945 146425 -14920 48724 292275 -152984 156629
15752 -192994 10559 78316 26065 -221212 329277 -16520 -39170 90910 263921 -195144 -110831
15741 -110831 130017 -427239 -14984 157393 59049 -36090 98610 -153446 263846 -100172
15730 -175704 127966 317791 -275573 -139961 89582 99473 -226553 -71910 -161019 -114811 -291780
15719 -291780 -105545 -42282 -28653 -122790 -55584 34453 322336 -6952 272254 -168406 -206515
15708 -206515 -105011 240836 -249930 -280797 108908 -220963 -365304 144721 145766 -78642
15697 -31813 -520624 -159808 -69797 -40583 224488 108416 339689 230837 -23628 263236
15686 192410 525088 -65326 -249807 -84006 99852 22638 -228199 -40697 -15366 -87707 -393796
$$ packed form
15764a81260e1373A82778b7301c033C94945A46425a4920D8724K43551a52984A56629
15752a92994A0559O7757B6065b21212C29277a6520k2650I0910J73011a95144Q4313
15741a10831A30017d27239a4984A57393E9049c6090I8610a53446B63846a00172
15730a75704A27966J89825b75573J35612H9582R891b26553g1910q9109M6208j76969
15719b91780a05545d2282J3629r4137e5584C4453K87883f952B72254a68406l8109
15708b06515J01504B40836b49930l0867A08908b20963j44341A44721J045g8642
15697c1813m88811a59808f9797K9214B24488A08416K31273j08852b3628B63236
15686A92410L32678f5326j84481h4006I9852B2638b28199d0697a5366p2341l06089
$$ plain form
15675 -393796 -19512 -108326 -96319 -35580 325936 142899 68792 112546 -294788 46562 -160868
15663 298469 31538 194791 164891 -228621 119485 -42010 105556 -68557 -50142 -292366
15653 -292366 -166441 -220706 -43557 159340 -22284 377419 -46951 399081 -150178 522521
15642 166333 75762 -31974 61780 -122895 86844 -25282 -40709 -231521 -16004 -154171 -121918
15631 -121918 69164 55054 -111035 367184 -26756 230408 -99115 159996 120600 109406 250253
15620 250253 -46563 -187831 190729 -356432 72790 -347683 -48438 92661 69129 181999
15610 181999 81666 -247475 32628 -45795 -266710 33761 -91802 -87471 -269620 59908 87784
15599 87784 -61091 33492 -82274 -61544 -270534 34954 -180018 -319335 61419 -35712 -50608
$$ packed form
15675c93796a9512q8814J2007c5580C25936A42899F8792M3754b94788D6562a60868
15663B98469C1538J63253k9900b28621A19485d2010A05556f8557J8415k42224
15653b92366J25925n4265d3557A59340b2284C77419d6951C99081a50178E22521
15642A66333G5762c1974F1780a22895H6844b5282j5427j90812a6004j38167L2253
15631a21918F9164j4110a11035C67184b6756B30408i9115A59996l9396j1194J40847
15620B50253d6563j41268A90729c56432G2790c47683d8438I2661k3532J12870
15610A81999H1666b47475C2628d5795k20915C3761i1802M331j82149E9908K7876
15599H7784f1091C3492h2274K0730k08990C4954a80018j39317F1419c5712j4896
$$ plain form
15588 -50608 -57646 31472 253187 174062 -329556 -163633 8973 60707 -125506 -115474 4541
15576 -25122 -99989 -180804 -240749 -94500 247041 37831 38669 -164549 -88058 -73749 -14096 49914
15563 -9466 -101247 216666 267305 -118904 300354 279131 -209143 169675 59351 -8437 -194114
15552 -194114 -279492 -112956 -200207 -205639 91115 71388 -250643 -68839 170348 132662 188066
15541 188066 -357936 176656 -151113 164045 -11416 -27112 -125013 -22129 7171 -6402 -36812
15530 -36812 46531 81022 13113 -133933 -128787 -1150 -31100 -30972 -277794 101456 230826 193242
15518 193242 146862 -103604 -122383 100934 33948 41555 258228 -31128 347523 231403 87046
15506 186034 321553 -36181 -40476 456 -179339 -123125 -56809 48668 -14824 -408816 -180661
$$ packed form
15588e0608p038C1472K21715p9125c29556a63633H973N1734a25506J0032D541
15576b5122p4867q0815n9945i4500B47041C7831Q38a64549P6491J4309a4096D9914
15563i466r1781B16666N0639a18904C00354k1223b09143A69675E9351h437j85677
15552a94114q5378a12956q7251n432I1115j9727b50643f8839A70348l7686N5404
15541A88066c57936A76656a51113A64045a1416j5696r7901b2129G171f402l0410
15530c6812D6531L4491A3113a33933N146a150k9950J28k46822A01456J29370l7584
15518A93242m6380a03604j8779A00934C3948P607K16673c1128C47523j16120H7046
15506A86034J35519c6181m295D56a79339N6214e6809D8668a4824l93992a80661
$$ plain form
15494 -138509 71586 56224 229391 6820 4608 -154233 -205133 -176699 51799 84381 -278995
15482 128710 -34831 59593 -170741 140201 -177792 -159840 -93529 -16078 -273432 240500
15471 -132931 116115 91162 266140 -198479 -90472 -432145 -312711 117118 -97126 16846
15460 293770 -209382 -146603 26935 12315 -143602 -203538 -59257 29164 34410 -189961 108580
15448 -129593 12970 -119297 -277822 -32425 -243047 44598 45327 134055 51720 -28359 -24542
15437 -24542 -33679 -113337 -26657 3427 -195974 -238530 167932 91569 -98617 -392565 -99391
15425 -49605 -328751 -112241 22222 42229 24055 -150163 7223 -32989 72996 184397 109350
15414 109350 -164057 -161141 -131711 -80175 -34963 134748 160600 422714 -166386 -100119 -292754
$$ packed form
15494a38509G1586j5362J73167F820k212a54233n0900K8434E1799L2582b78995
15482A28710c4831E9593a70741A40201a77792J7952O6311a6078k57354B40500
15471a32931A16115k4953J74978a98479i0472l41673J19434A17118i7126A6846
15460B93770b09382O2779B6935A2315a43602n9936e9257B9164N246a89961A08580
15448a29593A2970a19297j58525c2425k10622D4598P29Q8728E1720b8359L817
15437b4542r137p9658b6657C427a95974m2556A67932p6363i8617k93948i9391
15425d9605k79146a12241B2222K0007j8174a50163G223c2989G2996J11401p5047
15414A09350a64057K916K9430N1536c4963A34748K5852K62114a66386O6267j92635
$$ plain form
15403 -292754 -78783 -97253 74106 157215 521072 -374836 255743 111070 -267186 363025
15392 177284 -178960 188121 -77361 102130 -39996 -113633 201933 -225407 69646 43865
15382 43865 -217368 185823 -87723 78424 448372 -146441 -269783 1275 116200 -179635
15371 -251082 -303136 -83561 -186337 -1882 -191426 -111763 -188281 -332974 185114 -181880 153806
15359 -159372 -125978 145238 -123009 141463 114708 -282279 46520 -61615 106550 -151794
15348 -336636 75756 -156688 67291 -268190 17206 156401 87298 270034 -187255 84577
15337 56366 238542 -27796 -134768 -268023 -111600 -199953 -112291 -44147 -359855 -3080 51819
15325 72890 -27951 123067 151679 -40012 187965 -134757 -47764 70670 80792 -53785 -144731
$$ packed form
15403b92754g8783j8470G4106Q3109L63857c74836B55743A11070b67186C63025
15392A77284a78960A88121g7361A02130c9996p3637B01933b25407F9646k5781
15382D3865b17368A85823h7723G8424L69948a46441j23342A275J14925a79635
15371b51082n2054h3561j02776a882j89544P9663p6518j44693A85114a81880A53806
15359a59372L3394A45238a23009A41463k6755b82279D6520f1615A06550a51794
15348c36636G5756a56688F7291b68190A7206J39195o9103J82736a87255H4577
15337E6366J82176b7796j06972j33255a11600q8353Q7662d4147l15708c080E1819
15325G2890b7951A23067K8612d0012A87965a34757d7764G0670J0122e3785r0946
$$ plain form
15314 -144731 -16406 27755 -152109 179163 -62916 49278 -84422 302026 -51900 400787 -32474
15302 89801 -192582 -5448 -160531 58478 269406 36095 214583 45291 127349 279779 144472
15291 144472 -79860 403207 10377 253101 -204473 201280 10663 -68998 -57558 -187313
15281 -187313 162881 105713 179018 346265 -272259 173642 199077 -146228 -246696 -132696
15271 -132696 273113 -114163 -215326 263296 -17677 -127337 -138594 113178 -52534 -29285
15261 -29285 -400592 237753 92621 -169091 2555 304872 -11998 -122860 125802 337254
15251 337254 234956 658988 600338 855738 1980425 1174840 1367006 1057874 369848 229627
15241 229627 158844 -324128 92560 114736 92003 1749 57931 -10967 -162000 -29887 -13279
$$ packed form
15314a44731a6406B7755a52109A79163f2916D9278h4422C02026e1900D00787c2474
15302H9801a92582e448j55083E8478K10928C6095J78488D5291Q2058J52430j35307
15291A44472g9860D03207A0377K42724b04473B01280A0663f8998J1440j29755
15281a87313A62881n7168P3305J67247b72259A73642K5435a46228j00468J14000
15271a32696B73113a14163j01163B63296a7677j09660j1257A13178e2534K3249
15261b9285l71307B37753I2621a69091B555L02317a1998j10862A25802K11452
15251C37254j02298M24032n8650K55400J124687q05585J92166l09132C69848j40221
15241B29627p0783c24128I2560K2176k2733A749N6182a0967j51033b9887a3279
$$ plain form
15229 237537 -67662 -87606 40819 20125 -66215 7475 306261 217762 -255284 -45252 22774
15217 183039 -438281 9069 228717 -163889 -64436 -97174 257890 -37466 -137088 421288 46212
15205 -327684 38396 -57800 347787 -60687 151579 -83222 -195012 86839 186856 -13050 111507
15193 55073 93437 26667 226599 -55248 98094 161431 306737 -139007 -8271 -228653 78364
15181 23333 -165360 281817 199960 -50124 141607 -189539 -143142 269288 -144621 19172
15170 129722 136149 55388 -163932 -179788 138568 -83237 230438 184779 -12079 166238 3605
15158 163188 -123422 -159814 71565 48898 96668 -88845 -26103 142065 311965 138018 -354515
15146 180849 7419 -108616 213524 265663 227226 174140 -6014 177594 582138 -65278 111208
$$ packed form
15229B37537f7662j9944D0819B0125f6215G475K98786q8499b55284d5252B2774
15217A83039d38281I069K19648a63889f4436l2738B57890c7466r9622D21288D6212
15205c27684C8396e7800C47787f0687A51579h3222j11790H6839J00017a3050A11507
15193E5073L8364B6667J99932e5248I8094O3337J45306a39007h271k20382G8364
15181B3333a65360B81817q1857e0124A41607a89539M6397B69288a44621A9172
15170A29722O427E5388a63932j5856A38568h3237B30438m5659a2079A66238C605
15158A63188a23422l6392G1565k2667M7770h8845b6103A42065J69900A38018c54515
15146A80849G419a08616B13524N2139l8437n3086f014A77594M04544f5278A11208
$$ plain form
15134 252329 -79380 63027 -98587 -98084 194613 43871 -11349 -20294 -23042 298596 20691 -253774
15121 6082 179467 108624 -20713 132861 240145 88777 315009 403838 161843 -1671 -30361
15110 -30361 14336 266637 -32531 205003 -234155 115798 166404 484092 -13709 -112259 317077
15098 272113 -103643 26481 68943 -15695 -206425 94163 285326 80826 550886 171899
15087 250352 301353 26186 -196325 231954 277048 -107742 195610 222315 123556 156620 -234365
15075 161428 72650 141401 192639 294794 274506 484270 563846 -130205 382606 -215312
15064 -23111 379403 -82103 131126 135011 49211 -157272 57339 230715 30206 -94688 -30242
15052 252300 189204 -47280 157153 222366 -78900 115373 480276 161967 13881 468865
$$ packed form
15134B52329g9380F3027i8587N03A94613D3871a1349q945k748B98596B0691b53774
15121F082J73385p0843b0713A32861J07284H8777K26232Q8829A61843a671k8690
15110c0361A4336K52301c2531B05003b34155A15798N0606L17688a3709r8550C17077
15098B72113a03643B6481M2462a5695j90730I4163J91163H0826M70060A71899
15087B50352N1001B6186a96325B31954M5094a07742A95610K6705r8759L3064b34365
15075A61428G2650O8751N1238J02155k0288K09764P9576a30205C82606b15312
15064b3111C79403h2103A31126L885D9211a57272E7339J73376C0206i4688c0242
15052B52300o3096d7280A57153O5213g8900A15373L64903A61967A3881M54984
$$ plain form
15042 468865 242809 -77437 -210894 254092 37347 -23236 705 5310 322398 -165684 309227
15030 -45065 53062 -168024 -56905 194946 615347 -108167 164367 -131401 5944 333189
15020 333189 -164034 -138805 448028 -76833 202005 197380 129271 480076 274826 324205 63927
15008 234202 138048 257873 347952 207274 49014 161490 -90186 220470 -77208 177217
14997 292074 56858 279447 100918 526163 337265 76631 363136 -23652 506140 440461
14987 440461 183268 363435 431137 -381928 119611 18468 401922 212743 45428 59001
14977 59001 165876 -15930 161291 -82489 57306 471263 249952 292391 256872 -154328 80581
14965 165766 164540 -124546 -114185 191479 179918 194923 -4744 143706 260444 396988 337450
$$ packed form
15042D68865k26056g7437j33457B54092C7347b3236G05M605L17088a65684C09227
15030d5065E3062a68024e6905A94946M20401a08167A64367a31401E944L27245
15020C33189a64034K5229D48028g6833B02005m625o8109L50805k05250M9379F3927
15008B34202r6154J19825R0079j40678D9014J12476i0186B20470g7208A77217
14997B92074E6858K22589A00918M25245j88898G6631K86505b3652E06140o5679
14987D40461A83268J80167O7702c81928A19611A8468L83454j89179D5428J3573
14977E9001J06875a5930A61291h2489E7306M13957k21311M2439l5519a54328H0581
14965A65766j226a24546J0361A91479j1561J5005d744A43706J16738J36544n9538
$$ plain form
14954 337450 430763 -45931 199891 316546 171436 436816 51316 358857 -10307 297288
14943 305717 83025 237995 38668 53817 304918 214141 71005 316540 450163 393949 300036
14932 300036 54635 192253 226176 470865 53489 250656 376838 -49775 346514 89795
14921 234960 315020 551167 65150 364529 380164 118113 146513 228870 417369 273356
14911 273356 -6671 374083 237637 49128 172010 269828 295181 245925 352156 241365 198257
14900 198257 43552 190718 62948 439396 433780 124323 500252 474972 460737 75514 356892
14889 356892 -50902 87402 156353 199896 48918 -141612 74094 157598 161167 283337 199676
14878 199676 -98439 349104 502166 361590 513781 104692 358572 294998 512733 178081
$$ packed form
14954C37450R3313d5931A99891J16655j45110K65380E1316L07541a0307B97288
14943C05717H3025J54970C8668J5149K51101r0777G1005K45535J33623n6214r3913
14932C00036E4635J37618L3923K44689E3489J97167J26182d9775C46514H9795
14921B34960Q0060K36147F5150K99379J5635A18113K8400Q2357J88499j44013
14911B73356f671C74083j36446D9128J22882R7818K5353m9256J06231j10791m3108
14900A98257D3552J47166F2948L76448n616A24323L75929k5280j4235G5514K81378
14889C56892e0902H7402O8951M3543D8918a41612G4094Q3504L569J22170q3661
14878A99676i8439C49104J53062j40576J52191A04692K53880o3574K17735A78081
$$ plain form
14867 332099 230309 161410 151076 40340 54861 416082 260006 323746 384019 275616 509373
14856 509373 260825 382099 144403 428298 541292 279344 369006 236329 566114 327486
14846 327486 338876 371879 237179 258054 199622 502029 693250 284364 187578 551465
14836 551465 248861 360541 423858 267676 14008 313994 551080 612425 192615 216634
14826 216634 -13026 50007 564808 296513 236315 526581 269999 366355 188774 346429
14816 346429 169075 197051 664694 514481 488600 604436 302596 526413 478753 559011
14806 559011 536047 656727 315271 481829 368497 256672 227836 206025 369276 479666
14796 479666 157556 515549 605210 598041 649962 441062 525214 284413 681356 254034
$$ packed form
14867C32099j01790o8899j0334D0340J4521L61221j56076O3740O0273j08403K33757
14856E09373k48548J21274A44403K83895J12994k61948Q9662j32677L29785k38628
14846C27486J1390L3003j34700K0875n8432L02407J91221B84364r6786L63887
14836E51465B48861J11680O3317j56182A4008K99986K37086O1345A92615K4019
14826B16634a3026E0007N14801k68295o0198K90266k56582R6356j77581J57655
14816C46429A69075K7976M67643j50213k5881J15836l01840K23817m7660Q0258
14806E59011k2964J20680C15271J66558j13332j11825k8836k1811J63251J10390
14796D79666A57556L57993Q9661p169N1921k08900Q4152k40801L96943B54034
$$ plain form
14785 374081 288617 522498 381472 504336 750030 717645 455309 767072 499146 568836
14775 568836 356155 492765 247292 362804 399822 381867 172800 619247 832290 505168
14765 505168 321595 429823 703177 149787 574002 732546 690164 494256 347688 370403
14755 370403 664093 375331 228725 383871 506066 377602 689329 634946 300643 744123
14745 744123 602549 440274 650656 738034 436646 761845 331861 261004 868905 614829
14735 614829 796690 496791 578451 594813 544274 663411 685344 668828 725441 743054 433741
14724 433741 738646 713424 779423 669949 589045 577467 1030750 386215 712786 673415
14714 673415 458045 902361 672142 1075534 1010498 696066 377697 746243 632685 835842
$$ packed form
14785C74081q5464K33881j41026J22864K45694l2385k62336L11763k67926O9690
14775E68836k12681J36610k45473J15512L7018j7955A72800M46447K13043l27122
14765E05168j83573J08228K73354A49787M24215J58544m2382j95908j46568K2715
14755C70403K93690k88762j46606J55146J22195j28464L11727n4383C00643M43480
14745G44123j41574j62275K10382Q7378l01388L25199C31861p0857O07901k54076
14735F14829J81861k99899Q1660J6362n0539J19137K1933j6516N6613J7613l09313
14724D33741L04905k5222O5999j09474q0904j1578M53283C86215L26571l9371
14714F73415k15370M44316k30219M03392o5036l14432l18369L68546j13558K03157
$$ plain form
14704 835842 464269 636922 693928 897020 874627 681392 490659 923576 575693 1057702
14694 1057702 823549 995506 873188 887575 729331 863906 530177 638851 782062 892877
14684 892877 607683 610104 841505 1021501 812923 695960 899170 611353 694742 868315
14674 868315 874507 1301225 1040404 908194 939718 465857 722728 601846 831621 1079623
14664 1079623 1030393 890846 1176331 1085282 1216850 1243570 741988 949018 678671 731153
14654 731153 1040048 785026 989184 1045006 1208326 751727 949386 1170244 822061 714496
14644 714496 900047 1113700 1036996 1014041 1285201 1249733 648109 1072527 1048411 724846
14634 724846 1027450 1165658 858186 1373012 869822 1221602 1187633 782810 1036115 1117871
$$ packed form
14704H35842l71573J72653N7006K03092k2393j93235j90733M32917l47883M82009
14694A057702k34153J71957j22318J4387j58244J34575l33729J08674J43211J10815
14684H92877k85194K421K31401J79996k08578j16963K03210k87817Q3389J73573
14674H68315O192M26718k60821j32210L1524D65857K56871j20882K29775K48002
14664A079623m9230j39547K85485r1049J31568K6720n01582K07030k70347N2482
14654G31153L08895k55022K04158N5822J63320m56599J97659K20858l48183j07565
14644G14496J85551K13653p6704k2955K71160l5468o01624M24418k4116l23565
14634G24846L02604J38208l07472N14826n03190L51780l3969m04823K53305Q1756
$$ plain form
14624 1117871 1128309 1342342 1114243 1091160 1352500 902112 1192733 1379603 1281701 1233085
14614 1233085 991005 1298639 1069231 1267527 1305153 1370205 1290046 1461490 1420152 1244015
14604 1244015 1060580 1192110 1429091 1550869 1539319 1460220 1075394 936685 1518358 1216857
14594 1216857 1557602 1593445 1532660 1629721 1678958 1542843 1570158 1502740 1494798 1384906 1575684
14583 1575684 1830865 1662607 1719419 1766478 1338571 1345951 1444621 1936414 1614860 1440472
14573 1440472 1895987 1741684 1729224 2138445 2013841 1873643 1835327 2218758 2138923 2083446
14563 2083446 2461551 2246756 2199390 1922030 2658285 2544103 2751380 2500133 2755411 2931680
14553 2931680 2808103 3052789 4280712 4891203 7618222 11224189 19337418 34491472
$$ packed form
14624A117871J0438K14033k28099k3083K61340m50388K90621J86870r7902m8616
14614A233085k42080L07634k29408J98296L7626O5052q0159J71444m1338j76137
14604A244015j83435J31530K36981J21778j1550p9099l84826j38709N81673l01501
14594A216857L40745L5843o0785R7061M9237j36115K7315o7418p942j09892J90778
14583A575684K55181j68258N6812M7059m27907P380R8670M91793l21554j74388
14573A440472M55515j54303j2460M09221j24604j40198l8316L83431p9835n5477
14563B083446L78105k14795m7366k77360P36255j14182K07277k51247K55278J76269
14553B931680j23577K44686J227923O10491K727019L605967Q113229J5154054
$$ plain form
14545 34491472 41037639 22747158 10289446 4760696 3163135 2116518 1833562 1820365
14537 1820365 1308455 1542912 1933393 1792517 1735297 1835365 1767253 1939528 1911519 1413896
14527 1413896 2217991 1853968 1848854 1759406 2354195 2355734 2254698 2045450 2293964 2507882
14517 2507882 2196466 2100316 2425386 2440513 2143913 2157746 1971823 2498138 2748944 2166915
14507 2166915 2407981 2409514 2488753 2382211 2325768 2760419 2538223 2966497 2660602 2672949
14497 2672949 2564911 2608702 2893558 2645047 2667963 2966571 3060527 3218718 2864143 3130914
14487 3130914 3359314 2936638 3160096 3213647 3373690 3422208 3073130 3294300 3756744 3488923
14477 3488923 3321697 3565403 3438057 3455413 3443799 3324335 3638648 3943222 3700599 3557354
$$ packed form
14545C4491472O546167j8290481A0289446D760696j597561j046617k82956j3197
14537A820365n11910K34457L90481j40876n7220J00068o8112J72275k8009m97623
14527A413896Q04095l64023n114q9448N94789J539j01036k09248K48514K13918
14517B507882l11416r6150L25070J5127k96600J3833j85923N26315K50806n82029
14507B166915K41066J533P9239j06542n6443M34651k22196M28274l05895J2347
14497B672949j08038M3791K84856k48511K2916K98608R3956J58191l54575K66771
14487C130914K28400m22676K23458N3551J60043M8518l49078K21170M62444k67821
14477C488923j67226K43706j27346J7356j1614j19464L14313L04574k42623j43245
$$ plain form
14467 3557354 4074311 3914889 4121694 3832943 3979890 4206221 4252071 4159813 4088161 4192655
14457 4192655 4047545 4532169 4264354 4485116 4410178 4271030 4560804 4473641 4410781 4943968
14447 4943968 4845142 4806890 5018665 5068973 4722235 5303250 4937934 5373692 5068738 5191155
14437 5191155 5220931 5708818 5574759 5650649 5555611 5569646 5422678 6034340 6016054 5957581
14427 5957581 6028522 5673768 6442792 6313321 6354996 6522072 6669392 6615877 6604038 6557095
14417 6557095 6895731 7268426 7234549 7619200 7225585 7557521 7688100 7539846 7533518 8002320
14407 8002320 8263473 8552140 8227384 8470601 8747044 8896212 8867266 9151159 9290822 9263244
14397 9263244 9561586 9473980 9902913 9912544 10112905 10348569 10573957 10636609 10702702 10889116
$$ packed form
14467C557354N16957j59422K06805k88751J46947K26331M5850r2258p1652J04494
14457D192655j45110M84624k67815K20762p4938j39148K89774q7163o2860N33187
14447D943968r8826l8252K11775N0308l46738N81015l65316M35758l04954J22417
14437E191155K9776M87887j34059P5890r5038J4035j46968O11662j8286n8473
14427E957581P0941l54754P69024j29471M1675J67076J47320n3515j1839m6943
14417F557095L38636L72695l3877L84651l93615L31936J30579j48254o328M68802
14407H002320K61153K88667l24756K43217K76443J49168k8946K83893J39663k7578
14397I263244K98342q7606M28933R631K00361K35664K25388O2652O6093J86414
$$ plain form
14387 10889116 11182870 11478166 11683662 11671365 12007157 11783007 12425983 12514098 12779955 13179403
14377 13179403 13188318 13447345 13812561 14061552 14403348 14946810 14818251 15278188 15508327 15947981
14367 15947981 15810903 16143821 16679178 16951234 17431102 18104820 18430070 18727568 19186516
14358 19186516 19598576 19965041 20353609 21160303 21460750 22120199 22580853 22994352 23598107
14349 23598107 24258430 24933931 25496435 26019617 26833647 27769938 28370905 29272067 29555597
14340 29555597 30532992 31266165 32250169 33449003 34174501 35286446 36177485 37605923 38398378
14331 38398378 39613138 40830013 41855949 43577226 44856545 46188245 47833267 49597200
14323 49597200 51343946 53223443 54801304 56972842 59177583 61447431 63522457 65647785
$$ packed form
14387A0889116K93754K95296K05496j2297L35792k24150O42976Q8115K65857L99448
14377A3179403Q915K59027L65216K48991L41796N43462j28559M59937K30139M39654
14367A5947981j37078L32918N35357K72056M79868O73718L25250K97498M58948
14358A9186516M12060L66465L88568Q06694L00447O59449M60654M13499O03755
14349B3598107O60323O75501N62504N23182Q14030R36291O00967R01162K83530
14340B9555597R77395P33173R84004J198834P25498J111945Q91039J428438P92455
14331C8398378J214760J216875J025936J721277J279319J331700J645022J763933
14323D9597200J746746J879497J577861K171538K204741K269848K075026K125328
$$ plain form
14315 65647785 68339672 71349326 73936507 76846026 79958449 83616593 87292868 90609223
14307 90609223 94478962 98939587 103142364 108307084 113266680 118842663 124427926 130753366
14299 130753366 136982922 143959630 151222871 159585836 167819717 176685771 186231442 196213225
14291 196213225 207348132 218627715 230507479 243487011 257099905 271105745 285832022
14284 285832022 301235321 317089777 333132533 349497150 365565700 381969038 397464735
14277 397464735 412058761 426000928 438201134 447323967 451476371 452396037 452762716 453685034
14269 453685034 454526932 453870011 451572090 444316340 435153476 423549779 410949230 396657774
14261 396657774 381727113 366042892 349740145 333078162 316590584 300454319 285017107
$$ packed form
14315F5647785K691887L009654K587181K909519L112423L658144L676275L316355
14307I0609223L869739M460625M202777N164720M959596N575983N585263O325440
14299A30753366O229556O976708P263241Q362965Q233881Q866054R545671R981783
14291A96213225J1134907J1279583J1879764J2979532J3612894J4005840J4726277
14284B85832022J5403299J5854456J6042756J6364617J6068550J6403338J5495697
14277C97464735J4594026J3942167J2200206R122833M152404R19666L66679R22318
14269D53685034Q41898o56921k297921p255750r162864j1603697j2600549j4291456
14261C96657774j4930661j5684221j6302747j6661983j6487578j6136265j5437212
$$ plain form
14254 285017107 270707927 257001840 243203695 230218643 217987066 206469806 195701706
14247 195701706 185459568 175783014 166957821 158901626 151015630 143561819 136629386 129771999
14239 129771999 123786105 118385299 112944611 107693162 103282631 98392409 94048104 90428505
14231 90428505 87221513 83177142 79923265 76644200 73561094 70667156 68089012 65393364
14223 65393364 63072267 60982217 58479837 56550131 55023111 52878219 50686683 49228271
14215 49228271 47920066 46458468 45432125 43646185 42141979 40705451 39668200 38815362
14207 38815362 38223725 37240103 35898352 34477117 33516358 32725025 32012049 31436907 30302433
14198 30302433 29367776 28677379 27889646 27174293 26744391 26247658 25067630 24341460 23831233
$$ packed form
14254B85017107j4309180j3706087j3798145j2985052j2231577j1517260j0768100
14247A95701706j0242138r676554q825193q056195p885996p453811o932433o857387
14239A29771999n985894n400806n440688n251449m410531m890222m344305l619599
14231I0428505l206992m044371l253877l279065l083106k893938k578144k695648
14223F5393364k321097k090050k502380j929706j527020k144892k191536j458412
14215D9228271j308205j461598j026343j785940j504206j436528j037251q52838
14207C8815362n91637r83622j341751j421235r60759p91333p12976n75142j134474
14198C0302433r34657o90397p87733p15353m29902m96733j180028p26170n10227
$$ plain form
14189 23831233 23394029 22670796 22385905 21439379 21449941 20960538 20446263 20091423 19601789
14180 19601789 19044666 18759861 18328310 17978864 17661565 17203506 16807539 16747120 16260725
14171 16260725 15779242 15688756 15367297 15006715 14665978 14227223 13911660 13729462 13563142
14162 13563142 13677238 13037523 13089827 12765965 12730670 12368340 12347151 11841228 11717258 11809966
14152 11809966 11526009 10756808 11151800 10417340 10184678 10307059 10360677 10052615 9974444 9611755
14142 9611755 9699373 9452012 9302090 9290346 9059819 8622422 8872763 8658290 8455569 8658567
14132 8658567 8222256 8144229 7867015 8031035 8072008 7587265 7617888 7568231 7384957 7196778
14122 7196778 7103467 7320841 7105407 7058001 6862852 6971338 6780453 6828053 6686876 6584239
$$ packed form
14189B3831233m37204p23233k84891r46526J0562m89403n14275l54840m89634
14180A9601789n57123k84805m31551l49446l17299m58059l95967o0419m86395
14171A6260725m81483r0486l21459l60582l40737m38755l15563j82198j66320
14162A3563142J14096o39715N2304l23862l5295l62330k1189n05923j23970R2708
14152A1809966k83957p69201L94992p34460k32662J22381N3618l08062p8171l62689
14142I611755Q7618k47361j49922j1744k30527m37397K50341k14473k02721K02998
14132H658567m36311p8027k77214J64020M0973m84743L0623m9657j83274j88179
14122G196778r3311K17374k15434m7406j95149J08486j90885M7600j41177j02637
$$ plain form
14112 6584239 6310073 6330990 6139395 6277345 6359140 6004976 5982515 6010022 5614982 5908154
14102 5908154 5219755 5627189 5388801 5517151 5498178 5250192 5052879 5100891 5073723 4842607
14092 4842607 4928647 5005328 4960234 4845685 4974148 4385190 4804565 4475064 4583341 4434203
14082 4434203 4366117 4770595 4024921 4180946 4353149 4187100 4231466 4399875 4132919 4082773
14072 4082773 4436509 3925326 3963999 3902412 3420835 3847719 3587655 3408145 3468178 3757611
14062 3757611 3741684 3468381 4057320 3669239 3878640 3340639 3464919 3705717 3133895 3271204
14052 3271204 3200345 3243833 3074569 3320324 3198335 3365055 3199373 3046435 3121189 3277143
14042 3277143 3306406 2924133 2629741 2823295 2717489 2762182 2685987 2906538 2829445 2601390
$$ packed form
14112F584239k74166K0917j91595J37950Q1795l54164k2461K7507l95040K93172
14102E908154o88399M07434k38388J28350j8973k47986j97313M8012k7168k31116
14092D842607Q6040P6681m5094j14549J28463n88958M19375l29501J08277j49138
14082D434203o8086M04478p45674J56025J72203j66049M4366J68409k66956n0146
14072D082773L53736n11183L8673o1587m81577M26884k60064j79510O0033K89433
14062C757611j5927k73303N88939l88081K09401n38001J24280K40798n71822J37309
14052C271204p0859M3488j69264K45755j21989J66720j65682j52938P4754J55954
14042C277143K9263l82273k94392J93554j05806M4693p6195K20551p7093k28055
$$ plain form
14032 2601390 2767896 2808586 2426086 2710053 2602543 2637465 2394320 2624020 2936586 2610199
14022 2610199 2494783 2380031 2159902 2299356 2442201 2467059 2331147 2455921 2322669 2638715
14012 2638715 2161686 2392028 2200669 1780012 1954128 2111142 1593656 1921877 1864223 2297174
14002 2297174 1786404 2000993 1985713 2078285 1835967 1834288 1797572 1801663 1920617 1479753 2021201
13991 2021201 1941361 2653351 3865488 6949222 13855146 28759590 41516892 26847440
13983 26847440 12652377 7228339 5115153 3961270 3886767 3376463 2972580 2742002 2623705
13974 2623705 2617937 2148475 2267975 2218711 2295712 2314076 2094054 2030752 2158248 2079944 1963191
13963 1963191 1987131 2559310 2276399 1836496 1879705 1989344 1788316 1714051 1841025 1943251
$$ packed form
14032B601390J66506M0690l82500K83967j07510L4922k43145K29700L12566l26387
14022B610199j15416j14752k20129J39454J42845K4858j35912J24774j33252L16046
14012B638715m77029K30342j91359m20657J74116J57014n17486L28221n7654M32951
14002B297174n10770K14589j5280R2572k42318j679l6716M091J18954m40864N41448
13991B021201p9840P11990J212137L083734O905924J4904444J2757302j4669452
13983B6847440A2652377n424038k113186j153883p4503n10304m03883k30578j18297
13974B623705n768m69462J19500m9264P7001J8364k20022o3302J27496p8304j16753
13963A963191K3940N72179k82911m39903M3209J09639k01028p4265J26974J02226
$$ plain form
13953 1943251 1814399 1668757 1698315 1991579 1692796 1455147 1789665 1609327 1678798 1515474
13943 1515474 1758342 1285204 1487537 1469500 1612432 1595309 1454695 1777547 1499747 1505091
13933 1505091 1654468 1538428 1771028 1637426 1182122 1298323 1374014 1313571 1433641 1524149
13923 1524149 1482683 1359700 1494040 1501077 1172570 1451267 1458633 1570572 1676460 1291858
13913 1291858 1390762 1026768 1339822 1411212 1312804 1175327 1343432 998074 1526393 1223932
13903 1223932 1640102 1303151 1316414 1403525 1403313 1150075 1166405 1134001 1157895 1336037 1151494
13892 1151494 1205229 1420020 1099649 868207 1225155 1234729 1553675 1572857 1078648 1059055
13882 1059055 1195678 1085999 1129934 1230363 1199083 1439896 1130024 1037609 1063621 975432
$$ packed form
13953A943251j28852j45642K9558K93264k98783k37649L34518j80338O9471j63324
13943A515474K42868m73138K02333j8037J42932j7123j40614L22852k77800N344
13933A505091J49377j16040K32600j33602m55304J16201P5691o0443J20070R0508
13923A524149m1466j22983J34340P037l28507K78697P366J11939J05888l84602
13913A291858R8904l63994L13054P1390r8408j37477J68105l45358N28319l02461
13903A223932M16170l36951J3263Q7111k12k53238J6330l2404K3894J78142j84543
13892A151494N3735K14791l20371k31442L56948R574L18946J9182m94209j9593
13882A059055J36623j09679M3935J00429l1280K40813l09872r2415K6012q8189
$$ plain form
13872 975432 1063532 1057967 829549 1169555 1058638 937563 758899 1282666 683708 1101121
13862 1101121 875681 966893 775312 1153759 1163472 968974 838129 653777 1121576 786189
13852 786189 932300 1010474 1205611 642947 1201463 808890 668483 1057615 973813 838588
13842 838588 1004243 565236 959721 563547 550379 805425 912801 768280 885369 1078801
13832 1078801 976846 801338 813041 808117 724847 785672 724567 901030 868471 689674 709799
13821 709799 934488 728665 462019 590820 401139 537738 432119 511544 749252 875864
13811 875864 1063782 688308 626203 692559 556543 794442 912104 735111 820640 786791
13801 786791 760937 783973 759401 1031670 676506 1001824 849133 759896 733011 710226 612850
$$ packed form
13872I75432Q8100n565k28418L40006j10917j21075j78664N23767n98958M17413
13862A101121k25440R1212j91581L78447R713j94498j30845j84352M67799l35387
13852G86189J46111P8174J95137n62664N58516l92573j40407L89132q3802j35225
13842H38588J65655m39007L94485l96174j3168K55046J07376j44521J17089J93432
13832A078801j01955j75508J1703m924q3270O0825o1105J76463l2559j78797K0125
13821G09799K24689k05823k66646J28801j89681J36599j05619P9425K37708J26612
13811H75864J87918l75474o2105O6356j36016K37899J17662j76993Q5529l3849
13801G86791k5854K3036k4572K72269l55164L25318j52691q9237k6885k2785r7376
$$ plain form
13790 612850 530319 785963 908423 798652 734146 522468 652787 745886 706581 306492
13779 1186686 361570 478859 554552 437908 658248 469435 764365 409830 713326 700170
13769 700170 580682 487650 701627 574592 634405 607496 556668 712440 747818 624335
13759 624335 697183 308548 536341 563611 283855 530902 684003 731324 507796 579214
13749 579214 423464 758616 612662 593247 823825 665988 712923 680158 313687 727469
13739 727469 383652 630893 392936 544916 327512 630665 577264 426101 362839 651484
13729 651484 373909 506526 617540 748017 273382 965413 496377 473739 369745 470038
13719 470038 438832 228396 622641 540810 816654 287467 460498 485919 215557 490336
$$ packed form
13790F12850q2531K55644J22460j09771o4506k11678J30319R3099l9305C06492
13779A186686C61570J17289P5693j16644K20340j88813K94930l54535L03496j3156
13769G00170j19488r3032K13977j27035N9813k6909n0828J55772L5378j23483
13759F24335P2848C08548K27793K7270k79756K47047J53101M7321k23528P1418
13749E79214j55750L35152j45954j9415K30578j57837M6935l2765C13687M13782
13739G27469l43817K47241k37957J51980k17404L03153n3401j51163o3262K88645
13729F51484k77575J32617J11014J30477B73382O92031m69036k2638j03994J00293
13719D70038l1206k10436L94245q1831K75844B87467J73031K5421B15557K74779
$$ plain form
13709 490336 593223 636568 673223 548947 20043 487651 533714 405090 362532 557784
13699 557784 457733 724862 290427 465713 206751 420990 868138 786534 305136 480230
13689 480230 53814 313518 517454 454977 122772 481344 578231 361911 493192 423689
13679 423689 351588 850036 592728 451575 567786 181068 541025 481719 474781 258854
13669 258854 313273 753003 469848 760027 405964 479613 423130 446277 298308 285351
13659 285351 479682 204482 427353 215469 472239 163649 165847 607335 491319 105677
13648 232779 448762 225413 338147 180080 458374 402772 243926 427402 453077 422279
13638 422279 389935 381971 425184 421219 338719 276413 124270 468062 486593 320780 127611
$$ packed form
13709D90336J02887M3345L6655j24276B0043M67608M6063j28624m2558J95252
13699E57784j00051K67129B90427J75286B06751K14239M47148q1604C05136J75094
13689D80230E3814K59704K03936o2477A22772L58572R6887k16320J31281o9503
13679D23689p2101M98448k57308j41153J16211A81068L59957n9306o938k15927
13669B58854N4419M39730k83155K90179l54063P3649n6483K3147j47969j2957
13659B85351J94331B04482K22871k11884K56770A63649K198M41488j16016A05677
13648B32779K15983k23349J12734j58067K78294n5602j58846J83476K5675l0798
13638D22279l2344p964M3213l965q2500o2306A24270L43792J8531j65813A27611
$$ plain form
13626 159493 553787 553448 245220 193829 645611 386210 493877 220753 522417 442723
13616 442723 802187 497804 -142818 308811 153920 125374 254588 603472 110470 551681
13606 551681 459123 480581 346522 641346 213197 371005 543632 506848 457448 376418
13596 376418 386699 562452 10961 367382 582524 298739 252658 473504 47000 296934
13586 296934 -1416 230884 37361 396149 494220 536414 426639 258561 139625 479136
13576 479136 301528 138859 391618 131885 605005 531586 412252 143647 373203 284968
13566 284968 457858 523675 412943 305915 528549 163875 38486 57371 211892 34307
13555 358822 57143 113440 221312 334293 243601 164291 321184 449578 57228 285392
$$ packed form
13626A59493L94294l39B45220n1391M51782k59401J07667B20753L01664p9694
13616D42723L59464l04383a42818C08811A53920k8546J29214L48884A10470M41211
13606E51681r2558K1458j34059K94824B13197J57808J72627l6784m9400q1030
13596C76418J0281J75753A0961L56421K15142k83785m6081K20846D7000K49934
13586B96934a416B30884C7361L58788R8071M2194j09775j68078j18936L39511
13576D79136j77608A38859K52759A31885M73120p3419j19334A43647K29556q8235
13566B84968J72890O5817j10732j07028K22634A63875C8486J8885J54521C4307
13555C58822E7143N6297J07872J12981r0692p9310J56893J28394E7228K28164
$$ plain form
13545 285392 291969 278191 26060 202914 283161 91710 234098 11476 154188 -127547 365779
13533 427855 382982 15417 376939 254589 53523 168956 403224 413008 111979 -77651 91234
13521 374325 339208 135085 471975 282254 342668 192040 12427 108908 424276 124824
13510 328232 116683 462579 197073 96618 630293 111484 261098 418406 707093 202966
13499 126674 231557 153345 638835 255248 450186 551431 303203 333546 202765 242926
13489 242926 432004 -80288 183912 -118 273935 184276 505327 201759 306176 486719
13479 486719 260872 91470 341834 144435 233349 120249 108409 315054 163411 120805
13469 120805 203788 523630 67407 187101 -29962 366275 270475 -127947 242145 292042
$$ packed form
13545B85392O577j3778B6060J76854Q0247I1710J42388A1476J42712a27547C65779
13533D27855m4873A5417L61522j22350E3523J15433K34268R784A11979g7651I1234
13521C74325l5117A35085L36890j89721O0414j50628A2427R6481L15368A24824
13510C28232A16683L45896A97073I6618N33675A11484J49614J57308K88687B02966
13499A26674J04883p8212M85490B55248J94938J01245k48228L0343j30781M0161
13489B42926J89078h0288A83912a18B73935q9659L21051B01759J04417J80543
13479D86719k25847I1470K50364A44435Q8914j13100j1840K06645j51643m2606
13469A20805Q2983L19842F7407J19694b9962C66275r5800a27947B42145M9897
$$ plain form
13459 292042 258960 -3068 50963 301944 -130168 371794 97162 225558 301962 381671 212889
13448 212889 48237 316791 -82588 362157 56726 256043 171782 189418 -40640 102551 -286683
13436 426797 -91820 158599 -23936 183985 -102197 464190 181992 33389 343165 46600
13425 187460 331633 460802 226894 107288 1997 219001 335115 270968 -153205 223076
13414 334115 412146 621420 172642 166346 121651 392645 286192 311808 54726 -44606 250519
13402 362270 68333 339320 -125336 164231 -213192 -58405 102271 329574 58224 136877
13392 136877 522433 134059 619025 -126734 238547 13973 -159557 184253 28264 58687
13382 58687 25791 101925 242017 352313 273639 326991 230368 389136 102142 592616 3382
$$ packed form
13459B92042l3082c068E0963K50981a30168C71794I7162J28396P6404P9709j68782
13448B12889D8237K68554h2588C62157E6726J99317q4261J7636d0640A02551b86683
13436D26797i1820A58599b3936A83985a02197D64190A81992C3389L09776D6600
13425A87460J44173J29169B26894A07288A997K17004J16114o4147a53205B23076
13414C34115P8031K09274A72642o296m4695K70994j06453K5616E4726d4606B50519
13402C62270F8333K70987a25336A64231b13192e8405A02271K27303E8224P8653
13392A36877L85556A34059M84966a26734B38547A3973a59557A84253B8264L0423
13382E8687B5791P6134J40092J10296p8674N3352r6623J58768A02142M90474C382
$$ plain form
13370 43330 73059 234888 271664 466918 140868 113809 20613 -110387 619449 462303
13360 462303 433161 510157 11812 245868 25872 298716 179900 264347 308969 168772 245372
13349 245372 14598 224407 120165 285545 -16659 -146021 298600 422106 493322 -90635
13338 309154 146698 289440 -5004 408493 360998 284420 294917 141146 83654 -14790 -41482
13327 -41482 280581 304022 80772 68156 254453 355034 660988 272524 330609 266087 250565
13316 250565 263468 15198 319626 171854 -14010 274737 196214 283232 -87818 315391 5817
13304 154029 126708 -261697 -16996 -141888 334741 180824 -21224 211656 68339 -30586
13293 54229 265142 252701 139916 311651 33485 186895 229263 -255250 157101 -117423
$$ packed form
13370D3330K9729J61829L6776J95254A40868k7059B0613a10387F19449j57146
13360D62303k9142P6996A1812K34056B5872K72844j18816Q4447M4622j40197P6600
13349B45372A4598K09809j04242J65380a6659j29362B98600J23506P1216i0635
13338C09154A46698J42742e004D08493m7495p6578J0497A41146n7492a4790k6692
13327d1482B80581K3441H0772j2616J86297J00581L05954B72524N8085o4522j5522
13316B50565J2903A5198L04428j47772a4010B74737p8523Q7018h7818C15391E817
13304A54029k7321b61697a6996j24892C34741j53917b1224B11656F8339c0586
13293E4229K10913j2441j12785J71735C3485J53410M2368b55250A57101a17423
$$ plain form
13282 141850 190764 -174958 20862 130487 120870 -67505 222237 155296 103696 55913 202608
13271 202608 245633 24708 21423 416258 90279 92254 -246465 -178477 -24938 173987 -73416
13259 81216 120311 -45736 139003 12236 151939 235802 380088 202424 492442 7623 -254178
13247 227303 -53612 117338 -211967 -233404 -180230 -113901 129464 -125817 268278 303948
13237 303948 202999 200364 98361 125111 107401 96839 118169 419716 41713 191055 63906
13225 376171 162623 -54207 179791 111525 64772 138359 177131 -156345 -493374 226540
13214 254894 168482 167278 294435 -171577 318341 -313633 174829 338594 -91837 36962
13203 86319 -19488 18604 208939 -326 174437 83583 52531 -321204 78967 445919 117649
$$ packed form
13282A41850M8914a74958B0862J09625r617f7505B22237o6941n1600m7783J46695
13271B02608M3025B4708l285L94835I0279J975b46465O7988b4938A73987g3416
13259H1216L9095d5736A39003A2236J39703Q3863J44286j77664K90018G623b54178
13247B27303e3612A17338b11967k1437N3174O6329A29464a25817B68278L5670
13237C03948j00949k635I8361K6750j7710j0562K1330L01547D1713J49342F3906
13225C76171A62623e4207A79791o8266m6753P3587L8772a56345l37029B26540
13214B54894q6412j204J27157a71577C18341c13633A74829J63765i1837C6962
13203H6319a9488A8604J90335c26A74437H3583l1052c21204G8967L66952A17649
$$ plain form
13191 127354 68953 70044 138261 142935 31504 129868 133731 495401 454990 -229376 296522
13179 -123340 -81855 -40840 222040 304043 158014 194838 123227 279010 154053 19694 57993
13168 57993 -29862 -289869 -138261 217584 290088 -60719 -92384 -65673 206010 222852 -216753
13156 -76177 111011 -89091 11209 195005 243646 -154769 -112697 -113013 218803 -14086 26611
13144 207170 384177 256284 66214 -15613 59124 107503 128567 -83116 104701 224775 -193900
13132 25634 132246 70094 35988 -143099 315192 3817 62451 257805 114324 166507 -17616
13120 -93330 163766 63216 149975 56312 -49094 183487 77399 316791 -3915 -358822 165470
13108 -3692 72924 137070 182318 251925 -40143 -99551 75104 173700 18696 92378 111975 315449
$$ packed form
13191A27354n8401J091O8217M674C1504R8364L863L61670m0411b29376B96522
13179a23340M1485d0840B22040Q2003j46029L6824p1611J55783j24957A9694L8299
13168E7993b9862k60007a38261B17584P2504f0719l1665K6711B06010J6842b16753
13156g6177A11011h9091A1209J83796M8641a54769M2072l16B18803a4086B6611
13144B07170J77007j27893F6214a5613E9124M8379K1064h3116A04701J20074a93900
13132B5634J06612o2152l4106a43099C15192C817N8634J95354A14324N2183a7616
13120i3330A63766F3216Q6759E6312d9094A83487G7399K39392c915l54907A65470
13108c692G2924O4146M5248O9607d0143n9408G5104R8596A8696P3682J9597K03474
$$ plain form
13096 315449 -68732 20161 -93838 35133 322682 52668 4303 31870 -192974 95202 340781
13085 340781 31301 -183386 -324650 -1991 130642 -188018 -71720 8006 -3270 -47227 -135733
13074 -135733 -186057 417790 173425 -3021 -3026 -1730 -131978 248078 -44346 -163237 196669
13062 -197790 34656 259190 175045 270885 -68425 -249706 239080 145515 -87319 182821 -308173
13050 -49578 -127924 115869 312243 307260 -193444 449617 318489 -80009 31003 182765 -29914
13038 -117800 139855 175012 73730 8822 181515 -11737 257274 229873 184744 -45334 256352
13026 178740 -175486 37765 219515 600068 235301 -76492 169229 38363 -79768 345127
13015 265758 45145 62810 -475622 -152676 225189 8632 136562 200523 220234 92383 -51634
$$ packed form
13096C15449f8732B0161i3838C5133K87549E2668D303K7567a92974I5202K45579
13085C40781C1301a83386j41264a991A30642a88018g1720H006c270m3957q8506
13074a35733n0324D17790A73425c021nJ296j30248B48078d4346j18891A96669
13062a97790C4656K24534q4145R5840f8425j81281B39080r3565h7319A82821c08173
13050d9578p8346A15869J96374m983a93444D49617j31128h0009C1003J51762b9914
13038a17800A39855L5157G3730H822J72693a1737B57274k7401m5129d5334B56352
13026A78740a75486C7765J81750L80553B35301g6492A69229C8363g9768C45127
13015B65758D5145J7665d75622a52676B25189H632J27930O3961J9711I2383e1634
$$ plain form
13003 -117803 285405 14223 -103077 142487 214693 43667 -2537 -71501 303191 -254950 256016
12991 -129694 -129748 103019 170445 130177 -275072 86999 30300 14861 -68261 178113 19808
12979 249392 509307 106154 167906 80253 -184980 -236949 54766 189505 356418 -103080
12968 -151666 302928 -62809 44283 290178 130611 144627 56777 -86642 182540 -13147 -163945
12957 -163945 -41946 482127 141520 244795 38534 36659 -108613 31571 144322 62172 44087
12946 44087 167547 352122 -244834 -80682 -165353 189047 -87785 -87454 80404 -18840 -72230
12935 -72230 -78779 -32100 -138247 230696 43983 23607 223305 22972 70785 370201 301882
12924 301882 -138288 -56185 191617 61369 -108596 4082 72909 -118983 112570 171209 282631
$$ packed form
13003a17803B85405A4223a03077A42487P2206D3667b537o8964C03191b54950B56016
12991a29694n4A03019O7426m0268b75072H6999C0300A4861f8261A78113A9808
12979B49392K59915A06154O1752H0253a84980n1969E4766J34739J66913a03080
12968a51666C02928f2809D4283K45895A30611J4016E6777h6642A82540a3147j50798
12957a63945d1946D82127A41520J03275C8534j875a08613C1571J12751F2172j8085
12946D4087J23460J84575b44834h0682q4671A89047h7785L31H0404a8840n3390
12935g2230o549c2100j06147B30696D3983k0376J99698B2972M7813K99416o8319
12924C01882a38288e6185A91617F1369a08596D082O8827a18983A12570N8639J11422
$$ plain form
12913 282631 33649 60075 371639 -1551 -28605 188579 -63434 277334 68302 -73184 -192121
12902 -192121 164718 231986 130823 114518 2730 121742 -53514 300948 272183 340706 -259390
12890 124553 -27920 -382918 -171599 -103516 -48655 15181 327130 -64149 -464981 -126633
12879 -46439 -176584 -397260 9830 13650 -26541 219612 196183 -150419 -119552 14528 -122369
12867 -421756 -123044 147123 89897 119862 162570 -39456 -71509 28622 -214047 161401 -3524
12855 -7875 382764 76841 -27324 17952 -55827 -33498 -6801 168072 231642 219024 115485
12844 115485 119915 3024 415575 44336 -28292 -43661 220049 213714 117329 -221709 132747
12832 248816 -177726 -91916 -229573 197229 -302951 -219426 -8331 -282465 120707 65950
$$ packed form
12913B82631C3649K6426L11564a551k7054A88579f3434B77334F8302g3184j18937
12902a92121A64718O7268j01163j6305B730J19012e3514C00948k8765O8523b59390
12890A24553b7920l54998a71599O8083d8655A5181L11949f4149m00832a26633
12879d6439j30145k20676I830L820b6541B19612k3429a50419L0867A4528a22369
12867d21756a23044A47123n7226K9965M2708c9456l2053B8622b14047A61401c524
12855g875C82764G6841b7324A7952e5827K2329f801A68072O3570j2618j03539
12844A15485M430C024M12551D4336b8292j5369B20049o335r6385b21709A32747
12832B48816a77726Q5810j37657A97229c02951Q3525h331k74134A20707n4757
$$ plain form
12822 65950 341509 -437701 -194313 143435 102381 124742 -255197 16038 122828 38099
12811 -358562 370561 47208 -188991 -336597 133445 -9478 40099 -1787 -86831 -363107 226158
12799 219380 100729 50001 -120885 -106578 144268 5483 -58662 -96322 101680 164585 -1849
12787 -177153 -96155 154749 61999 -22791 -83752 122216 126439 310235 215183 123888 -146295
12775 1992 -59826 96879 -275946 -151217 52158 -161229 175148 -93152 79153 -54752 14104
12763 330472 -60452 238395 156141 209990 -42797 79427 51079 262528 52399 -287825 -352712
12752 -352712 -98902 56064 -133360 -116461 -212598 -144738 -78135 88925 17765 46676 -231907
12740 250984 -60389 25491 125068 45625 64428 142035 -136712 -86877 -2841 -62883 68140
$$ packed form
12822F5950K75559d37701a94313A43435m1054K2361b55197A6038J06790C8099
12811c58562C70561D7208a88991j47606A33445i478D0099a787q5044k76276B26158
12799B19380A00729E0001a20885J4307A44268E483e8662l7660A01680O2905a849
12787a77153Q0998A54749F1999b2791o0961A22216M223J83796r5052r1295a46295
12775A992e9826I6879b75946J24729E2158a61229A75148i3152G9153e4752A4104
12763C30472f0452B38395q2254N3849d2797G9427k8348K11449E2399b87825o4887
12752c52712i8902E6064a33360J6899r6137O7860O6603H8925A7765K8911b31907
12740B50984f0389B5491R9577D5625J8803P7607a36712M9835b841o0042F8140
$$ plain form
12728 439765 -230233 118101 185159 87359 -7179 -74675 489007 -212100 -51901 44464 44614
12717 44614 -215882 99498 193288 117779 195150 -54967 229332 -53690 346610 318462 118740
12705 -87165 95248 53955 -13888 291513 240961 30494 231645 25553 -23948 -44367 -86919
12694 -86919 345805 91510 229253 45772 20676 -15678 156206 248526 -75111 270857 286500
12683 286500 101270 304461 89278 24174 231811 442402 203811 128802 123885 253147
12673 253147 329367 277799 -189857 96604 159591 168952 -56345 43681 -182024 199714 -1530
12661 -185202 168264 -65137 61996 45474 62528 -103889 -213 -89973 86419 19105 277430
12650 277430 199820 -8438 132278 129618 139553 -125784 -44180 41826 122896 376146 -287250
$$ packed form
12728D39765b30233A18101O7058H7359g179o7496D89007b12100e1901D4464J50
12717D4614b15882I9498R3790p5509P7371e4967B29332e3690C46610k8148A18740
12705h7165I5248m1293a3888B91513n0552C0494K01151B5553b3948k0419m2552
12694h6919C45805I1510J37743D5772B0676a5678A56206R2320g5111B70857J5643
12683B86500A01270K03191H9278B4174K07637K10591B03811p5009m917J29262
12673B53147P6220n1568a89857I6604O2987R361e6345D3681a82024A99714a530
12661a85202A68264f5137F1996j6522J7054a03889b13q9760H6419A9105K58325
12650B77430p7610h438A32278k660R935a25784d4180D1826Q1070K53250b87250
$$ plain form
12638 317880 127134 68432 102518 -204431 63604 79160 -17588 176386 403407 254633
12628 254633 -36057 7189 61440 220555 -155510 311315 277054 128224 231203 19419 102712
12617 102712 -184619 200463 292181 -154468 38055 190090 -165052 -77018 168480 40332
12606 -189385 -2101 216526 -152168 174332 -90827 249772 236082 394411 29855 141327
12596 141327 339201 -26253 328396 183997 267980 54077 -60506 197989 -175631 133072
12585 -165860 203279 238029 -128142 179504 124270 -27944 220812 -78736 219068 -37975
12574 -68506 -234357 235550 -229659 -33236 -645 254315 -153933 -233819 -262243 223302 433314
12563 433314 5439 255049 -272652 145293 -352717 80974 -210362 -45223 -105005 80222 305244
$$ packed form
12638C17880A27134n8702L4086b04431F3604J5556a7588A76386K27021j48774
12628B54633c6057G189N4251J59115a55510C11315l4261A28224J02979A9419Q3293
12617A02712a84619B00463R1718a54468C8055J52035a65052g7018A68480D0332
12606a89385b101B16526a52168A74332i0827B49772j3690J58329B9855J11472
12596A41327J97874b6253C28396j44399Q3983E4077f0506A97989a75631A33072
12585a65860B03279L4750a28142A79504n5234b7944B20812g8736B19068c7975
12574f8506j65851B35550b29659c3236f45B54315a53933p9886k8424B23302K10012
12563D33314E439K49610b72652A45293c52717H0974b10362d5223n9782H0222K25022
$$ plain form
12552 305244 53403 -141852 62664 151220 56185 13601 -20712 -68787 -67725 7245 17729 -124640
12539 -29899 -99590 -74018 132009 -71997 -51969 -160273 201915 -56490 -57543 122157 -51602
12527 -145368 26761 13974 99720 -87499 -74044 -11578 -48358 -105375 114294 -114815 83256
12515 257070 11662 84441 139758 -135651 145922 44141 -8204 -357726 -37399 -191393 122535
12503 -201259 -19841 163401 36522 156273 65179 40483 15833 238473 -34948 -79873 6290
12491 1487 -168625 -137615 221288 156317 24768 172698 154832 153099 -212269 -181897 -129050
12480 -129050 348951 64946 -193098 118028 183433 142900 107649 134498 223921 -109006 -240597
12469 -240597 -173964 186104 -11491 -249700 177633 -41918 12399 -311937 171988 -160556
$$ packed form
12552C05244E3403a41852F2664Q8556E6185A3601b0712m8075J062G245J0484a24640
12539b9899o9691K5572A32009g1997K0028j08304B01915e6490j053A22157e1602
12527a45368B6761j2787Q5746h7499J3455a1578l6780n7017A14294a14815H3256
12515B57070A1662P2779N5317a35651A45922D4141h204l49522c7399j53994A22535
12503b01259a9841A63401C6522J19751F5179k4696A5833K22640c4948m4925F290
12491A487a68625L1010B21288o4971B4768J47930j7866j733b12269L0372N2847
12480a29050C48951F4946a93098A18028O5405m0533l5251K6849Q9423a09006j31591
12469b40597O6633A86104a1491k38209A77633d1918A2399c11937A71988a60556
$$ plain form
12458 28849 98528 124047 183500 7385 -14366 281742 -55663 -322514 -28134 -10725 266141
12446 208058 46943 80509 153329 115695 -86921 275812 -27779 2654 50689 45208 -38915 69989
12433 -231579 -49498 151496 -294426 -197825 173751 -220455 -211948 20202 -46142 401495 187147
12421 -157219 318830 -80978 -5127 -187002 -212 -137425 109519 -366941 -95681 -229461 -39954
12409 5594 -53879 62372 -138083 -17184 -128087 201771 -109430 -159782 -15212 357351 97509
12397 40708 375967 -213574 -11764 25742 3551 51278 194387 169669 437312 -159065 -169182
12386 -169182 -92502 65954 156975 82099 54938 118486 164922 39828 -223014 173283 -512374
12374 -41351 139481 220774 -127577 78168 -207451 -219352 -262873 12760 -255723 -121887 -20281
$$ packed form
12458B8849O9679K5519N9453G385a4366B81742e5663k66851b8134a0725B66141
12446B08058D6943L3566P2820l7634h6921B75812b7779B654M8035n481c8915F9989
12433b31579d9498A51496b94426R6601A73751b20455Q507B0202d6142D01495A87147
12421a57219C18830h0978e127j81875b12j37213A09519c66941i5681j33780c9954
12409E594e3879F2372a38083a7184j10903B01771a09430n0352a5212C57351I7509
12397D0708L35259b13574a1764B5742C551M7727J43109k4718K67643a59065j0117
12386a69182P6680F5954R1021p4876k7161O3548M6436C9828b23014A73283e12374
12374d1351A39481Q1293a27577G8168b07451j1901m3521A2760b55723a21887b0281
$$ plain form
12362 352778 -59652 -129559 -72503 36981 -107810 -321654 129973 43624 77801 226366 -4197
12350 -204784 -92634 456322 -333 -92747 246023 -62192 35740 -254793 -44824 125096 234
12338 38024 -408143 101475 -278332 297269 -326527 -114687 -265708 -236224 -146943 22074
12327 102709 -99082 347189 139777 -81041 -404722 70869 188198 301848 11368 -4706 -543
12315 -230660 90200 -197254 180091 47199 -20294 112221 49335 99130 -228112 112531
12304 -68878 -116228 -140526 68799 272089 287256 98253 -140172 47321 284681 162735 52859
12292 262375 106343 -79089 39200 112732 131776 70495 28303 -17363 186979 -9110 158832
12280 280737 29415 -85125 91060 158222 -21091 105820 584038 159425 82204 43496 171394
$$ packed form
12362C52778e9652o9907N7056C6981a07810k13844A29973D3624L4177J48565d197
12350b04784i2634D56322c33r2414B46023f2192C5740b54793d4824A25096B34
12338C8024d08143A01475b78332B97269c26527a14687j51021K9484Q9281B2074
12327A02709i9082C47189A39777h1041l23681G0869J17329J13650A1368d706e43
12315b30660I0200a97254A80091D7199b0294A12221D9335M9795b28112A12531
12304f8878m7350k4298F8799K03290J5167I8253a40172D7321K37360j21946E2859
12292B62375A06343g9089C9200P3532J9044o1281B8303a7363A86979i110A58832
12280B80737B9415h5125I1060O7162b1091A05820M78218A59425p7221l8708J27898
$$ plain form
12269 171394 -14454 14652 186972 -21853 17300 187900 -53573 117276 408807 404624 102609
12257 -184602 -11153 224532 33684 167351 -15154 23245 116742 -64459 19607 347364 -103375
12245 298491 201995 202604 178465 155619 -123194 100721 2335 166212 115474 300011 159778
12234 159778 406397 181982 432393 241433 118820 279892 -255187 129145 150661 338219
12224 338219 353092 13187 181107 -49508 -14479 -53205 340535 156318 314407 271902 219023
12213 219023 -139505 139125 403301 -245413 200614 61172 305288 87184 237946 -188102
12202 -54257 53057 41500 228935 206255 105058 59388 300914 296152 78950 157270 65338
12190 214949 -87143 -214454 58065 212769 128018 -83663 251831 99164 -119384 -108595 221028
$$ packed form
12269A71394a4454A4652J72320b1853A7300J70600e3573A17276K91531m183A02609
12257a84602a1153B24532C3684J33667a5154B3245R3497f4459A9607L27757a03375
12245B98491r6496O09k4139k2846a23194A00721B335J63877n0738J84537j40233
12234A59778K46619A81982K50411j90960A18820J61072b55187A29145K1516J87558
12224C38219J4873A3187J67920d9508a4479l8726C40535A56318J58089m2505n2879
12213B19023a39505A39125K64176b45413B00614F1172K44116H7184J50762a88102
12202e4257E3057j1557J87435k2680j01197m5670K41526m762G8950P8320F5338
12190B14949h7143j27311E8065J54704q4751h3663B51831I9164a19384J0789B21028
$$ plain form
12178 182699 -25947 -35372 124363 89497 37465 416343 144663 157145 227968 247555 225880
12167 225880 79203 53350 -100572 -86450 45938 -181000 153521 15073 32395 -282849 -9186
12155 206695 237748 35664 90533 66586 -253803 24271 77745 -133039 90927 254805 -1851
12143 364258 81780 55923 -53630 48080 -223750 47066 -147100 -41987 -79710 203597 -74552
12131 -99216 -106730 220376 -58535 -45551 389714 -89269 162499 144907 -3783 -24189 -117615
12120 -117615 402735 129528 18351 206366 -57879 344479 268857 -5669 -53255 16082 29783
12109 29783 -334005 17292 387558 166661 -36828 44806 323602 367280 -30730 3883 72167
12098 72167 88328 -284400 377797 -84111 273781 328962 -188985 105309 300744 -45746
$$ packed form
12178A82699b5947r425A24363l4866C7465L78878A44663J2482P0823J9587k1675
12167B25880G9203k5853a00572J4122D5938a81000A53521A5073J7322b82849i186
12155B06695L1053C5664N4869k3947b53803B4271N3474a33039I0927J63878a851
12143C64258H1780k5857e3630D8080b23750D7066a47100d1987l7723B03597g4552
12131i9216p514B20376e8535J2984C89714h9269A62499j7592c783k0406r3426
12120a17615D02735A29528A8351J88015e7879C44479p5622e669m7586A6082J3701
12109B9783c34005A7292L70266A66661c6828D4806K78796M3678c0730C883O8284
12098G2167J6161b84400C77797h4111B73781N5181a88985A05309J95435d5746
$$ plain form
12087 -1348 55417 -400811 -72933 -115727 52848 -218764 -15252 -194583 -43907 60443 -57789
12075 29918 -175940 28762 233029 347376 313326 1032874 2195933 889799 288306 54522
12064 217079 458011 114139 200632 -275467 75636 -130393 94096 71988 84387 -116523
12053 -67148 157099 -136047 -86812 215912 47216 -75580 207981 315215 -9944 -133129 3473
12041 163157 96124 -186201 -25113 468482 120013 -50509 83278 144850 -250246 -48990 -59600
12030 -59600 -57031 51917 -31539 -87021 146680 70730 147922 160944 -10708 -21200 177062
12018 166298 -17431 -61639 -20254 -233281 -52551 215582 172953 -251378 -137474 480640
12007 98221 -282502 -233048 -109178 -318818 -262484 -18113 259609 -298596 -205746 126288
$$ packed form
12087a348E5417d00811g2933m2794E2848b18764a5252j79331d3907F0443e7789
12075B9918a75940B8762K04267J14347l4050P19548J163059H89799B88306E4522
12064B17079K40932A14139Q6493b75467G5636a30393I4096k2108J2399a16523
12053f7148A57099a36047M9235B15912D7216g5580B07981J07234i944j23185C473
12041A63157o7033a86201b5113D68482A20013e0509H3278O1572b50246d8990j0610
12030e9600K569E1917c1539n5482A46680G0730P7192J3022a0708j0492A77062
12018A66298a7431m4208b0254k13027e2551B15582m2629b51378J13904D80640
12007I8221b82502M9454a09178k09640N6334a8113B59609b98596R2850A26288
$$ plain form
11996 126382 -226494 210061 -238255 -149553 -24897 -68345 95153 69689 -39749 161592 575
11984 156089 -159387 23631 286054 -27853 44906 118474 135437 -179686 6308 -214715 -90252
11972 -138347 -105411 -74991 13024 -221708 186224 286321 -202968 -22183 -77209 -80592 -167889
11961 -167889 -91412 192766 186259 -73999 3870 67145 198006 99589 36810 15443 86056
11950 86056 110561 93266 -30049 149024 -55481 -18012 -352076 17829 -64337 -55793 -343796
11939 -343796 20931 184303 48908 -5855 204981 116487 137672 315682 145249 118366 -429653
11927 114995 -359331 -190988 -373707 -198624 -135190 174225 -77019 -33592 22485 -14698
11916 -218323 -248296 -83751 -143089 -47594 -17250 113977 -18542 -74059 137466 -348089 23765
$$ packed form
11996A26382b26494B10061b38255Q8702b4897m3448I5153k5464c9749A61592E75
11984A56089a59387B3631K62423b7853D4906P3568J6963a79686F308b14715i0252
11972a38347L2936L0420A3024b21708A86224J00097b02968b2183n5026l383q7297
11961a67889P6477A92766o507g3999C870O3275J30861r8417C6810A5443P0613
11950H6056K4505j7295c0049A49024e5481a8012l34064A7829f4337Q544k88003
11939c43796B0931J63372D8908e855B04981q8494K1185J78010A45249k6883d29653
11927A14995c59331J68343j82719J75083O3434A74225g7019c3592B2485a4698
11916b18323k9973h3751n9338d7594a7250A13977a8542n5517A37466c48089B3765
$$ plain form
11904 122388 72697 -132625 34595 -106465 -131691 -74116 -28954 101902 -230283 139007
11893 -195081 207003 26631 264375 92708 9646 -39703 -319251 -116304 -225002 -19845 -146720
11882 -146720 -73294 -175899 123318 -66542 117941 69720 -197359 449127 189972 168173
11872 168173 73699 132261 311708 -128979 -100148 6870 -216635 54554 21362 -191108 120682
11860 50858 77765 71480 -180583 215350 -129615 -110085 2932 151198 -126636 230983 -182593
11848 -181629 54306 96703 41418 -189660 23371 -45999 293374 187650 -67412 -217248 -333032
11837 -333032 29667 -284649 -209308 81996 -143044 -67918 -21685 -285882 -67489 -52787 -131121
11826 -131121 -36668 -924 -49060 320627 -103635 45287 -22303 -40643 -198195 -43813 -70945
$$ packed form
11904A22388m9691a32625C4595a06465k5226N7575b8954A01902b30283A39007
11893a95081B07003B6631K37744I2708I646c9703k79548a16304j08698a9845j26875
11882a46720g3294j02605A23318f6542A17941m8221a97359D49127A89972k1799
11872A68173G3699N8562J79447a28979K8831F870b16635E4554B1362a91108A20682
11860E0858K6907o285a80583B15350a29615J9530B932J48266a26636B30983a82593
11848a81629E4306M2397D1418a89660B3371d5999B93374j05724f7412j49836j15784
11837c33032B9667b84649P5341H1996a43044f7918b1685k64197f7489J4702p8334
11826a31121c6668i24m8136C20627a03635D5287b2303j8340j57552d3813k7132
$$ plain form
11815 -70945 -153820 -117954 -82728 24384 -163556 357014 21448 -34010 9456 119730 101296
11804 101296 43563 -31737 209601 57511 48154 -142966 -149166 231758 -99001 161289 72962
11792 -222308 18981 138400 217171 -176 479758 -44282 -9040 192444 -91262 9013 -84286 -94972
11780 -94972 18020 -137563 43387 117416 -40330 -96274 365668 57844 67140 118128 -110287
11768 -78056 32658 -228491 251248 -135685 -46012 -98436 269259 -69534 -69751 250135 13732
11756 150547 -44240 -247947 128979 -121058 118631 116644 -367272 35891 118806 -190836
11745 109987 148605 -12906 -75496 -68186 -355288 -55458 10822 164367 -56891 -69669 -109184
11734 -109184 -158854 73201 142204 -64639 -49088 -243750 187360 -48853 -210701 221886 125311
$$ packed form
11815g0945q2875L5866L5226B4384a63556C57014B1448c4010I456J10274j8434
11804A01296D3563c1737B09601E7511r357a42966o200B31758i9001A61289G2962
11792b22308A8981J19419P8771a76D79758d4282i040A92444i1262I013h4286j0686
11780i4972A8020a37563D3387P4029d0330n5944C65668E7844R296N0988a10287
11768g8056C2658b28491B51248a35685d6012n2424B69259f9534k17B50135A3732
11756A50547d4240k03707A28979a21058A18631j987c67272C5891Q2915a90836
11745A09987L8618a2906o2590P310k87102e5458A0822J53545e6891j2778l9515
11734a09184m9670G3201O9003f4639J5551j94662A87360d8853j61848B21886r6575
$$ plain form
11723 125311 67194 50473 -35905 10633 77356 110180 -16942 -341122 255741 59201 169494
11712 169494 154922 -5564 118775 -28994 -4162 -8585 -72254 346532 362645 93849 10584 246849
11700 246849 239197 99582 93009 204050 -276475 65282 35176 221413 -434009 -378430 78134
11688 218212 72542 185234 -111332 227353 110664 250932 134627 48268 -57086 -74748
11678 -74748 318938 133077 103870 -40533 354884 -258175 173336 289625 -252197 80279
11667 -45639 79175 270278 -137500 100788 136518 158241 319124 82603 -5673 -13511 -102647
11656 -102647 -32560 213159 375795 125261 -69335 -50502 -11730 168064 259774 -90242 -159327
11645 -159327 -310974 -196778 -61377 193079 40602 122672 -168147 -161674 112514 77742 -62550
$$ packed form
11723A25311n8117j6721c5905A0633O6723L2824a6942l24180B55741E9201J10293
11712A69494j4572e564A18775b8994d162m423o3669C46532J6113I3849A0584K36265
11700B46849p652I9582o573J11041b76475F5282l0106J86237d34009N5579G8134
11688B18212G2542J12692a11332B27353A10664J40268j16305D8268e7086j7662
11678g4748C18938A33077k9207d0533C54884b58175A73336J16289b52197H0279
11667d5639G9175J91103a37500A00788L5730K1723J60883H2603e673p838q9136
11656a02647c2560B13159J62636A25261f9335J8833a1730A68064R1710i0242o9085
11645a59327j51647J14196f1377A93079D0602Q2070a68147O473A12514l4772f2550
$$ plain form
11633 76661 76718 362169 -160729 6814 121133 21208 -78178 -107531 20126 -125759 -14877 40336
11620 220421 228742 181778 155026 267141 273596 54143 28434 75002 92987 313861 -229306
11608 62353 -332618 -204232 126631 -104366 -51811 130640 -29702 304515 69395 -416059
11597 -88180 418152 78831 425569 130482 -52164 173700 -317695 9839 438111 68945 91981
11586 91981 -108368 14567 239680 46946 349446 -40519 273658 -245214 113808 332588
11576 332588 43902 5768 -201201 -16729 98767 -49445 159338 246496 -53453 490684 102114
11564 -76082 -135832 216000 25451 444730 12276 81900 188181 313239 126619 -60159 -1177
11552 211311 373673 175093 40481 -149320 62372 164077 41410 151708 86977 208196
$$ packed form
11633G6661N7K85451a60729F814J14319B1208g8178k9353B0126a25759a4877D0336
11620B20421Q321m6964k6752J12115O455E4143k5709M6568J7985K20874b29306
11608F2353c32618J28386A26631a04366e1811A30640b9702C04515F9395d16059
11597h8180D18152G8831L46738A30482e2164A73700c17695I839M28272F8945K3036
11586I1981a08368A4567K25113D6946L02500d0519B73658b45214A13808K18780
11576C32588D3902E768b01201a6729I8767d9445A59338Q7158e3453D90684A02114
11564g6082n9750B16000B5451M19279A2276O9624J06281J25058A26619f0159a177
11552B11311J62362A75093D0481a49320F2372J01705D1410J10298o4731J21219
$$ plain form
11542 208196 -200906 -33596 193963 206788 44237 15292 422201 139336 -26693 155916
11531 414759 253115 100020 -219060 96605 -96522 108941 -156207 153875 121224 256422
11521 256422 -100845 -100041 356844 135915 1115 84690 127977 168946 171567 395973 -181178
11509 -26225 561460 399849 9105 380269 43696 60206 -102608 165521 299488 205254 -155553
11497 -161386 66942 17496 191232 204511 27800 248913 -171342 34134 14114 -247907 243413
11485 103425 133235 27654 -95452 113030 73375 -200963 -81576 436662 -177308 288446
11474 258092 225468 99642 -149836 231080 383892 266076 60985 183313 123046 134618
11464 134618 340027 214420 7812 3298 202130 -74002 103527 185909 183596 295695 265498
$$ packed form
11542B08196b00906c3596A93963J2825D4237A5292M06909A39336b6693A55916
11531D14759j61644A00020b19060I6605i6522A08941a56207A53875l2651J35198
11521B56422a00845Q04C56844A35915A115Q3575M3287M0969K621K24406a81178
11509b6225E61460j61611I105L71164D3696J6510a02608A65521J33967r4234a55553
11497a61386F6942A7496J73736J3279B7800K21113a71342C4134A4114b47907B43413
11485A03425K9810B7654i5452A13030l9655b00963h1576D36662a77308B88446
11474B58092l2624I9642a49836B31080J52812j17816F0985J22328o0267J1572
11464A34618K05409j25607G812C298J98832g4002A03527Q2382k313J12099l0197
$$ plain form
11453 265498 -22063 35164 182517 -57325 -265435 -45929 40374 -8678 -155893 27975 -42336
11441 190572 199862 127545 62339 215999 -85156 76761 26093 289797 155868 -4985 -77987
11430 -77987 -266028 -113863 -14662 -140532 52796 -314653 211002 65380 19746 173960
11420 173960 -130491 -191382 -114820 -171290 -28006 103472 63949 22997 158940 -124975 -368852
11409 -368852 36555 257 146066 -159660 28899 208835 161497 -72591 12101 207316 -254698
11397 27535 -29164 248591 217195 67855 -58028 102526 208355 -14680 128035 187487 9768
11385 -204882 -151571 -41618 228844 89139 -206219 197754 244087 -93480 353189 129188
11374 231522 -44992 172276 -45008 378038 -21213 -142713 -72601 105439 327440 -127677
$$ packed form
11453B65498b2063C5164J47353e7325k08110d5929D0374h678j47215B7975d2336
11441A90572R290p2317F2339J53660h5156G6761B6093K63704j33929d985p3002
11430g7987j88041a13863a4662j25870E2796c14653B11002F5380A9746J54214
11420A73960a30491o0891P6562n6470b8006A03472l9523B2997J35943a24975k43877
11409c68852C6555B57J45809a59660B8899J79936m7338g2591A2101J95215b54698
11397B7535b9164B48591l1396F7855e8028A02526J05829a4680A28035N9452I768
11385b04882N3311d1618B28844H9139b06219A97754M6333i3480C53189A29188
11374B31522d4992A72276d5008C78038b1213j21500P0112A05439K22001a27677
$$ plain form
11363 215652 172947 -22496 -195049 119315 108285 69065 8188 125491 141222 144638 85276
11352 85276 311995 19074 233069 -248545 304263 46352 97221 -37497 343261 -68503 121029
11340 28788 -295367 -62680 -110054 -73703 -36752 -123752 205005 50690 -83657 -161738 94498
11328 -48260 -160019 -177693 -79600 -98309 209124 -203524 -170930 -164616 263968 46489 -237095
11316 21861 -52288 421454 -106995 -255167 -69691 -256271 -1503 179745 -7819 -10162 -56418
11305 -56418 -104206 -174751 104196 -290394 -90010 -44756 18299 -12563 521275 262710 149186
11294 149186 -30414 -181882 -240246 -155354 142990 -391436 -115451 -168853 -236127 -128223
11284 -128223 -163075 -81710 -60514 238660 -468347 3720 63393 80619 -100343 -446129 104352
$$ packed form
11363B15652m2705b2496j72553A19315j1030l9220H188J17303J5731L416n9362
11352H5276K26719A9074K13995b48545C04263D6352N0869c7497C43261f8503A21029
11340B8788b95367f2680m7374L6351c6752q7000B05005E0690h3657p8081I4498
11328d8260j11759j7674g9600j8709B09124b03524L2594O314B63968D6489b37095
11316B1861e2288D21454a06995j48172f9691j86580a503A79745g819k343m6256
11305e6418m7788p0545A04196b90394i0010d4756A8299a2563E21275k58565j13524
11294A49186c0414j51468n8364Q4892A42990c91436a15451n3402o7274J07904
11284a28223l4852Q1365K1196B38660d68347C720N9673J7226a00343l45786A04352
$$ plain form
11272 -430467 -5363 -232024 -243030 32009 -370564 -240337 -196577 -400435 1960 -210769 184200
11260 7256 -4204 51822 -102698 102390 -222019 -1046 -44939 -40862 -156212 -66441 68540 -283770
11247 32606 -213587 -324500 -111727 41141 -190298 -396089 36329 -221434 177702 -13744
11236 -325684 -178968 -30745 186938 29699 374134 14394 -228488 -28397 73111 -17824 17127
11224 -55012 -66109 149811 -80146 -261653 61625 155519 162595 -47393 151490 193081 220957
11213 220957 -54543 59342 -145820 422988 239606 39720 -274079 -130972 27796 -104530
11202 75828 103682 37725 -7569 -217338 -142806 168405 -318064 65593 -78168 -52039 71889
11190 -154767 74119 185898 59482 147392 338150 -97062 271842 1079 -101411 31562 -213208
$$ packed form
11272d30467e363k26661j1006C2009c70564J30227M3760k03858A960b10769A84200
11260G256d204E1822a02698A02390b22019a046m3893M077j15350f6441F8540b83770
11247C2606b13587j10913a11727D1141a90298k05791C6329b21434A77702a3744
11236c25684J46716c0745A86938B9699L44435A4394b28488b8397G3111a7824A7127
11224e5012j1097A49811h0146j81507F1625R3894P076d7393A51490M1591K7876
11213B20957e4543E9342a45820D22988j83382C9720b74079a30972B7796a04530
11202G5828K7854C7725g569k09769P4532A68405c18064F5593g8168K6129G1889
11190a54767G4119J11779E9482Q7910J90758i7062B71842A079a01411C1562b13208
$$ plain form
11178 -56251 44497 180581 51013 37677 204219 -81783 108403 -87942 89834 90569 -34786
11166 -141379 151090 62764 -68374 -97213 -36140 -179867 -21633 151507 -318864 -55456 -196532
11155 -196532 -261033 -294017 -136846 114278 -80658 -90337 166988 -150679 -98932 -109621 -196172
11144 -196172 -94232 -106914 173350 -180740 -53638 89531 -171006 -215732 124728 56066 -5309
11132 189187 24928 -75539 5831 140700 205989 6992 180026 58262 283645 138382 216832
11121 216832 110325 -195268 33125 328114 -183188 166802 -128432 -58132 278015 211051
11111 211051 409276 -21608 30347 201317 -11671 78450 -254035 124206 70594 117283 411216
11100 411216 193390 133733 78874 131120 -126735 4092 389632 326210 78826 111603 277084
$$ packed form
11178e6251D4497J36084E1013j3336J66542h1783A08403h7942H9834P35c4786
11166a41379A51090F2764f8374k8839c6140j43727b1633A51507c18864e5456j41076
11155a96532o4501l2984a36846A14278h0658r679A66988a50679N1747j0689q6551
11144a96172i4232j2682A73350a80740e3638H9531a71006m4726A24728E6066e309
11132A89187B4928g5539E831J34869O5289F992J73034E8262K25383A38382P8450
11121B16832j06507a95268C3125K94989a83188A66802a28432e8132B78015o6964
11111B11051J98225b1608C0347J70970a1671G8450b54035A24206n3612M6689K93933
11100D11216A93390n9657n4859N2246a26735D092L85540o3422G8826L2777J65481
$$ plain form
11089 277084 186660 285960 134307 -18791 440693 34120 238832 103068 126182 143523 186534
11078 186534 238483 216648 240647 358636 226350 469452 35441 19557 450260 196193
11067 645251 368200 370213 480971 511207 237186 586134 529664 379271 537444 777336
11057 777336 497642 350643 792829 523720 693882 794328 737615 753254 484350 978254
11047 978254 537532 629516 837335 474313 850379 630397 700462 688113 907535 925700
11037 925700 761592 575111 646580 362700 609817 734753 564467 665706 558903 750588
11027 750588 670248 569272 613113 568955 543924 699357 705368 515382 631700 666655 663016
11016 663016 537399 786058 390185 622732 489919 832715 548102 308791 588298 423115
$$ packed form
11089B77084r0424R9300A34307a8791D40693C4120K04712A03068K3114J7341M3011
11078A86534N1949k1835K3999J17989j32286K43102C5441j5884M30703A96193
11067F45251k77051K013J10758L0236B37186L48948n6470j50393J58173K39892
11057G77336k79694j46999M42186k69109J70162J00446n6713J5639k68904M93904
11047I78254m40722R1984K07819l63022L76066k19982P0065j2349K19422J8165
11037I25700j64108j86481P1469k83880K47117J24936j70286J01239j06803J91685
11027G50588q0340j00976M3841m4158k5031J55433O011j89986J16318L4955l639
11016F63016j25617K48659C90185K32547j32813L42796k84613k39311K79507j65183
$$ plain form
11006 423115 741127 867893 636274 473570 893978 846013 548483 511803 562905 612151
10996 612151 672252 534148 988744 545898 1045964 427392 1183142 890008 669227 995190
10986 995190 370898 840541 1002944 916000 946687 1216998 1210058 1474715 1758077 1740272
10976 1740272 2034373 1899656 2709786 2468896 2847097 2958706 3010291 2971640 2626077 2726407
10966 2726407 2432272 2154323 1655833 1763362 1796662 1528172 1594822 1750301 1982712 2021735
10956 2021735 1832508 1500144 1652323 1095689 1245625 1114511 857990 778690 441234 766237
10946 766237 479541 257379 502621 282251 359903 445684 -45596 389906 94859 144972
10936 144972 -233877 -91420 338932 131470 -203587 -82525 363219 -106863 106009 -88284
$$ packed form
11006D23115L18012J26766k31619j62704M20408m7965k97530l6680N1102M9246
10996F12151O0101j38104M54596m42846N00066D27392P55750k93134k20781L25963
10986I95190C70898M69643J62403q6944L0687K70311o940K64657K83362j7805
10976A740272K94101j34717Q10130k40890L78201J11609N1585l8651l45563J00330
10966B726407k94135k77949m98490J07529L3300k68490O6650J55479K32411L9023
10956B021735j89227l32364J52179n56634J49936j31114k56521p9300l37456L25003
10946G66237k86696k22162K45242k20370P7652Q5781d5596C89906I4859N0113
10936A44972b33877i1420C38932A31470b03587h2525C63219a06863A06009h8284
$$ plain form
10925 -66563 -26076 66819 -120576 346927 -179039 138558 -150091 -132071 -16610 -130629
10915 -130629 -262722 201402 -47588 -327727 75967 -210069 42089 -161556 93654 67612
10905 67612 191951 216741 -158367 -60710 -153780 -26860 -131324 -81946 47682 127057 -190086
10893 57619 -203519 243006 233273 246873 48792 91272 117824 -249991 90039 15607 -101325
10881 175975 -238666 -98891 337035 -354159 -131919 -102821 203603 255771 -30299 118277
10870 135595 102283 -64590 -10664 -321998 -255531 -118993 -102239 -123629 -82676 98749 -262763
10858 -53217 -156265 -147672 -19715 320346 4053 24197 157912 -224707 98235 17986 -126602
10846 303869 -185293 91518 -17848 -120389 -315826 48195 231988 -44542 112139 164118
$$ packed form
10925f6563b6076F6819a20576C46927a79039A38558a50091J8020a6610j14019
10915a30629j32093B01402d7588k80139G5967b10069D2089a61556I3654k6042
10905F7612J24339K4790a58367f0710r3070b6860j04464M9378D7682P9375a90086
10893E7619b03519B43006r733J3600D8792M2480K6552b49991I0039A5607a01325
10881A75975b38666i8891C37035c54159a31919K9098B03603N2168c0299A18277
10870A35595l3312f4590a0664l11334O6467a18993J6754k1390M0953I8749b62763
10858e3217j03048Q593a9715C20346D053K0144J33715b24707I8235A7986a26602
10846C03869a85293I1518a7848j02541j95437D8195J83793d4542A12139N1979
$$ plain form
10836 164118 13389 273164 20748 -245937 -190241 -36981 -1552 -23330 221525 -18958 20233
10824 162741 145098 -87892 -91472 -73896 -33706 60439 181378 62388 -92679 -144483 -16824
10812 -8117 -156628 239665 -140329 -226581 136531 17603 162329 40257 -109818 230197
10801 422 -154603 -144146 -304241 32743 14592 -109706 52871 -29098 19247 -318715 182655
10789 26770 308926 84191 -180275 -185371 77578 115126 -8865 -40463 -185423 2671 219739
10778 219739 23831 -252618 -375727 -8615 -145557 -255134 128501 201339 212887 -234256
10767 -80041 191485 53815 -138900 234030 -153107 257136 48927 -145199 108183 37580
10756 -225804 -44705 575341 87498 -103129 -57952 33001 5479 33149 45575 27054 -39693
$$ packed form
10836A64118A3389K59775B0748b45937N5696c6981a552k1778B21525a8958B0233
10824A62741j7643h7892l580J7576c3706F0439J20939F2388i2679n1804a6824
10812h117j48511B39665a40329q6252A36531A7603J44726D0257a09818B30197
10801D22a54603J0457j60095C2743A4592a09706E2871b9098A9247c18715A82655
10789B6770K82156H4191a80275n096G7578L7548h865l1598j44960B671K17068
10778B19739B3831b52618j23109h615j36942j09577A28501P2838J1548b34256
10767h0041A91485E3815a38900B34030a53107B57136D8927a45199A08183C7580
10756b25804d4705E75341H7498a03129M5177C3001E479K7670J2426j8521c9693
$$ plain form
10744 145328 -26595 -122051 -132204 10823 172639 -199343 -172870 -163018 -196615 -151738 121744
10732 -293434 290981 -182253 71432 190531 -275480 84132 -114170 256484 53107 242750
10722 242750 134550 -8952 -29509 -162580 57260 -126314 -56576 -5718 -47448 17290 99591
10711 99591 -200742 116385 113938 94560 -444323 -123303 43934 -189060 -332883 -65126 -36079
10700 -36079 -242161 16797 62628 84670 -284543 -219659 -62418 -40573 33247 303686 26946
10688 15380 -54437 210649 -206993 -71668 -83538 -307517 -51966 -108930 -239437 130307 -88328
10676 -188794 -22067 -222391 -271571 59263 -152055 -86481 -122900 -364869 -71108 46724 -368272
10664 242600 43718 -175362 -142574 131940 -117784 -187182 -58615 54866 11252 -113493 -240319
$$ packed form
10744A45328b6595r5456j0153A0823J61816a99343K6473R852l3597M4877A21744
10732b93434B90981a82253G1432J19099b75480H4132a14170B56484E3107J89643
10722B42750j08200h952k0557j33071E7260a26314e6576e718m1730A7290Q2301
10711I9591b00742A16385k447j9378d44323a23303D3934a89060j43823f5126K9047
10700c6079k06082A6797M5831K2042b84543O4884f2418K1845C3247K70439B6946
10688A5380e4437B10649b06993g1668j1870k23979e1966n6964j30507A30307h8328
10676a88794b2067k00324m9180E9263a52055O5574l6419k41969g1108D6724c68272
10664B42600D3718a75362L2788A31940a17784o9398e8615E4866A1252a13493j26826
$$ plain form
10653 -240319 -217393 -23738 -198102 271600 -345345 -90136 102706 -25101 -28032 -36625 -95697
10642 -95697 -275165 -91576 -114432 242174 116651 -332475 35604 216419 -126113 104280
10631 -23573 -216245 -272452 -133999 -94724 186568 -44448 -56972 -311571 487 175379 87968
10620 87968 73235 174058 59673 116997 -45045 -24019 -379298 -260532 -30242 86693 230925
10609 230925 198875 -284988 -346953 -270914 -341218 87422 105904 5422 363621 222950 -176098
10597 -183075 41875 55897 41829 28492 95114 -143446 -191905 128351 327259 18010 -357381
10585 145977 192403 -383386 -157435 -363281 -10595 84934 94498 -30422 -8406 47628 -121148
10573 -94409 -60723 -187281 224804 -159928 -261512 369459 184089 -8479 46253 -95825 -212362
$$ packed form
10653b40319K2926b3738j74364B71600c45345i0136A02706b5101k931q593n9072
10642i5697j79468i1576k2856B42174A16651c32475C5604J80815a26113A04280
10631b3573j92672n6207a33999L9275A86568d4448j2524k54599D87J74892q7411
10620H7968j4733J00823E9673N7324d5045K1026l55279J18766c0242H6693J44232
10609B30925l2050b84988o1965P6039p0304H7422J8482E422L58199j40671a76098
10597a83075D1875J4022j4068j3337O6622a43446m8459A28351J98908A8010c57381
10585A45977M6426c83386a57435k05846a0595H4934R564c0422h406D7628a21148
10573i4409L3686j26558B24804a59928j01584C69459A84089h479D6253i5825j16537
$$ plain form
10562 -212362 65 -215433 60990 29366 -108537 -251820 122616 65273 -33578 -232779 -279390
10551 -279390 161049 75602 -255839 -138978 -74894 -158801 -105330 -154444 -10214 81216 -118052
10539 337380 160087 -28211 -4845 -259980 -126022 -268306 -15820 -192893 282958 7519 -95449
10527 399941 -74678 -146309 82284 263392 -121012 199680 -72798 -400017 -202455 -85 121201
10515 -385977 226659 -138503 -338617 -12310 -116138 -188899 68890 -16387 7977 279800 -11134
10503 7960 -155661 27572 154025 -307166 57443 67549 89208 -106102 90604 -56773 -70789
10492 -70789 -120336 182328 25168 59511 5928 -4956 167408 290188 42952 72400 288100
10481 288100 393611 186924 231489 51921 107337 100818 -203192 348687 75790 191869 -232182
$$ packed form
10562b12362F5b15433F0990B9366a08537j43283A22616n7343c3578j99201m6611
10551b79390A61049G5602b55839J16861O4084q3907N3471m9114a0214H1216a18052
10539C37380A60087b8211d845k55135a26022j42284a5820j77073B82958G519i5449
10527C99941g4678p1631H2284J81108a21012A99680g2798l27219J97562h5A21201
10515c85977B26659a38503k00114a2310j03828p2761F8890a6387G977K71823a1134
10503G960a55661B7572J26453c07166E7443J0106K1659a06102I0604e6773j4016
10492g0789m9547A82328B5168L4343E928d956A67408J22780D2952K9448K15700
10481B88100J05511A86924M4565E1921N5416o519b03192C48687G5790J16079b32182
$$ plain form
10469 -1062 65041 125058 -157725 261301 -291412 -217477 122736 11979 -45163 -293000 186073
10457 -161615 6047 73708 -3637 -133948 72129 73764 -12854 121264 35431 99384 52663 180716
10445 180716 4843 257587 -167526 40146 217655 -17292 -140988 374 71176 -77133 -416455
10434 -416455 -360260 -96573 -24574 -128171 234387 47336 -9273 235285 77507 23473 -92039
10422 255826 145510 -45805 42674 210910 -316908 134574 75115 -66668 -425369 275929
10411 114295 16210 261940 492951 48336 57899 94791 140945 -50338 34416 19597 -30221
10399 -85005 -74745 72365 -83224 205007 230593 -96060 569785 247145 -189720 111450 189423
10388 189423 -44861 25912 195448 33779 -59130 322685 385816 66604 325809 326977 136730
$$ packed form
10469a062F5041O0017a57725B61301b91412P3935A22736A1979d5163k47837A86073
10457a61615F047O7661c637j30311G2129J635a2854A21264C5431O3953m6721J28053
10445A80716D843K52744a67526D0146J77509a7292j23696C74P0802g7133l39322
10434d16455N6195i6573b4574j03597B34387D7336i273B35285G7507B3473i2039
10422B55826j10316d5805D2674J68236c16908A34574n9459f6668l58701B75929
10411A14295A6210K45730K31011D8336R563L6892M6154e0338C4416j4819c0221
10399h5005J0260G2365h3224B05007K5586i6060E69785B47145a89720A11450P7973
10388A89423d4861B5912J69536C3779e9130C22685O3131F6604K59205J168A36730
$$ plain form
10376 37752 437008 386742 -49510 -96090 275256 298529 94405 25006 -72871 -2257 737749
10364 281487 419353 363217 59827 110645 148109 308522 -138465 46002 92109 17837 378776
10353 378776 370613 502371 680351 610980 367250 559048 278800 367803 332461 392692 372869
10342 372869 511312 47351 258029 210548 197386 -8967 141126 350356 62212 150326 326996
10331 326996 72442 -75114 -25806 91795 191613 60749 308168 91164 366368 393683 -361827
10319 411 158425 63992 118321 -123016 252221 31986 -21234 411701 -110665 282461 49048
10307 279996 -67254 -240508 -48248 82426 -66356 -234157 -2764 166883 -331862 227929 -66049
10295 2146 42392 -59414 -49167 -150424 -272724 4342 -59319 -253367 -135540 -49832 156806
$$ packed form
10376C7752L99256n0266d9510m6580B75256K3273I4405B5006g2871b257G37749
10364B81487J37866n6136E9827N0818L7464J60413a38465D6002M6107A7837L60939
10353C78776q163J31758J77980o9371k43730J91798B78800Q9003l5342O0231j9823
10342C72869J38443D7351K10678m7481j3162h967A41126K09230F2212Q8114J76670
10331C26996G2442g5114b5806I1795R9818F0749K47419I1164K75204K7315c61827
10319D11J58014F3992N4329a23016B52221C1986b1234D11701a10665B82461D9048
10307B79996f7254j73254d8248H2426f6356j67801b764A66883c31862B27929f6049
10295B146M0246e9414J0247j01257j22300D342e9319j94048J17827d9832A56806
$$ plain form
10283 267414 -139096 101020 -15872 -52777 -201436 -284318 431066 -178838 -37465 78953
10272 67841 19951 63179 -151285 42617 29 104090 -66451 -25087 49658 -138499 132432
10260 -200968 103752 187905 369451 -31922 40875 408520 373281 291751 114424 5424 -72952
10248 -40231 -161889 -358345 -222536 -299482 -157699 -105191 -1798 -53160 -62461 -6524 43021
10236 -133430 328974 -141545 -13757 -375451 -76208 219487 201601 -58919 -242753 -100629
10225 -174549 313087 195596 29452 87579 -118836 -17935 106099 -102625 -75024 -378615
10215 -378615 -125740 44663 57801 11200 38313 -9801 -284434 -55772 -98409 232321 -255907
10203 -81079 -175084 -259714 -218808 -200533 -243848 -220607 -280203 -36977 264102 100396 -246169
$$ packed form
10283B67414a39096A01020a5872l6905j48659q2882D31066a78838c7465G8953
10272F7841A9951M3228a51285D2617B9J04061f6451b5087D9658a38499A32432
10260b00968A03752Q4153J81546c1922D0875L67645l5239q1530A14424E424g2952
10248d0231j21658j96456J35809p6946J41783N2508a798n1362r301f524D3021
10236a33430C28974a41545a3757l61694g6208B19487j7886e8919j83834a00629
10225a74549C13087j17491B9452N8127a18836a7935A06099a02625K7601l03591
10215c78615a25740D4663J3138A1200K7113i801k74633e5772m2637B32321b55907
10203h1079r4005q4630M0906J8275m3315K3241n9596c6977B64102A00396b46169
$$ plain form
10191 -427076 63615 -362 177734 157949 -75651 -24524 63231 -134339 -357855 -174074 -17847
10179 52657 27666 69885 -216521 -100914 106165 -36867 141660 99053 41772 -149262 89994
10167 -43034 2081 103708 161228 -300841 -130551 94188 -30054 187315 68372 -206300 -21953
10155 -265035 82042 -128671 -206599 10804 -361829 -346959 8236 -70071 -24243 45235 -52316
10143 -98767 21198 -53601 16174 -122358 -110107 -24786 -34425 -23653 11848 -271406 -134710
10131 45043 -264487 -241091 34241 -170858 85130 -234721 181118 157453 -60528 -75338 40542
10119 625 -368994 -158073 -40820 3919 -113077 -28797 168538 -38606 28683 357637 -56870
10107 -102400 -53460 22813 65308 122129 -106853 -107444 -91752 -209400 33899 -177870 -13022
$$ packed form
10191d27076F3615c62A77734j9785g5651b4524F3231a34339k23516a74074a7847
10179E2657k4991M2219b16521a00914A06165c6867A41660m2607D1772a49262H9994
10167d3034B081J01627N7520c00841a30551I4188c0054A87315F8372b06300b1953
10155b65035H2042a28671p7928A0804c61829J4870H236g0071b4243D5235e2316
10143i8767B1198e3601A6174a22358J2251b4786r639J0772A1848b71406a34710
10131D5043b64487K3396C4241a70858H5130b34721A81118k3665f0528j4810D0542
10119F25c68994a58073d0820C919a13077b8797A68538c8606B8683L28954e6870
10107a02400M8940B2813M2495N6821a06853n91J5692j17648C3899a77870a3022
$$ plain form
10095 100378 -65723 -229475 252742 177119 -248158 42763 -419116 -238093 -224642 -29503
10084 150458 253120 -285506 -32470 -377724 -117097 -84093 -106338 22594 -374267 79915
10073 -51942 195415 56050 19643 -175324 -204002 -105221 -380300 94556 -275519 294106 56828
10061 151942 -20101 -48608 -335316 49807 -72763 85198 -45598 -119720 -309517 236703 146638
10050 146638 9908 -118848 -166117 -108100 284567 -64887 -316062 -200276 -199136 -215890 -11579
10038 -54281 25180 -235521 -20496 -293176 -375267 -38683 -209882 -56861 -172011 -105989 24689
10026 25997 -281897 31737 140924 -96519 -33756 -109568 -44192 -11345 106250 -177680 51740
10014 -284904 -281035 -169619 195231 -102966 -322429 -248182 5129 38651 -43112 423425 -26198
$$ packed form
10095A00378f5723j63752B52742p5623b48158D2763d19116J81023J3451b9503
10084A50458J02662b85506c2470l45254a17097L3004k2245B2594c74267G9915
10073e1942A95415E6050A9643a75324k8678R8781k75079I4556b75519B94106E6828
10061A51942b0101k8507k86708D9807g2763H5198d5598p4122j89797B36703r0065
10050A46638I908a18848m7269N8017B84567f4887k51175J15786J140j6754a1579
10038e4281B5180b35521b0496k72680q2091c8683j71199e6861j15150O6022B4689
10026B5997b81897C1737J09187i6519c3756p5812d4192a1345A06250a77680E1740
10014b84904L869J11416A95231a02966k19463P4247E129L3522d3112D23425b6198
$$ plain form
10002 -122186 -350173 -140379 -228781 -219843 -109317 -255441 207319 -453700 32513 119753
9992 119753 -71726 -124441 85942 113180 4668 121240 -243721 -176531 -84411 130348 -30845
9980 -36947 -148656 -143273 -67317 261525 -90956 50549 -29284 41241 291464 -38102 -411399
9969 -411399 44861 52764 -169893 -112028 -30500 466081 138959 -131800 -391365 -218988 -253678
9958 -253678 173606 -212870 19181 44854 6115 -119433 -142529 -197388 -135740 60457 -345142
9946 -133775 -161002 69151 -215508 7741 42324 3141 -103100 56764 -202064 272343 -152784
9934 51209 -87008 -409129 21869 179120 -44462 -267677 -26137 -191166 54172 -6546 -107662
9923 -107662 80293 30016 -45578 -160204 -63344 194096 -175656 -25472 18537 -229196 -164909
$$ packed form
10002a22186k27987a40379q8402Q938a09317j46124B07319d53700C2513Q7240
9992A19753g1726n2715H5942K7238D668J16572b43721O7190h4411A30348c0845
9980c6947j11709N383f7317B61525i0956E0549b9284D1241K50223c8102l73297
9969d11399D4861P903a69893N7865c0500D66081A38959a31800k59565J72377l4690
9958b53678A73606b12870A9181K5673F115a19433k3096n4859O1648F0457c45142
9946a33775k7227F9151b15508G741L4583C141a03100E6764b02064B72343a52784
9934E1209h7008l22121B1869J57251d4462k23215b6137j65029E4172f546j01116
9923a07662H0293C0016d5578j14626f3344A94096a75656b5472A8537b29196O4287
$$ plain form
9912 -164909 -118646 -115910 -104560 -123925 -99684 -108100 14542 8281 163692 -222592 -201130 -69865
9899 285698 -31280 -267954 -115330 58737 -206181 -84125 33496 13799 -93968 -401673 -145190
9887 -307044 -258706 -62682 177492 -139020 114645 135991 -74579 72296 -235042 -392122 -190797
9875 50032 -168415 51348 -29880 96539 -131910 -40211 1397 119665 -148589 176512 -378659
9863 -272164 -35398 -142504 -81773 300241 -66603 -64091 318915 31774 33141 28711 85272 100132
9851 100132 -54265 124417 34100 82976 -1400 15477 -52044 65959 -43641 -316966 68902
9839 82291 -48644 -83956 223294 8234 -29809 -184386 -1498 -18320 -10057 -165155 -203812 -306537
9827 -306537 -284284 -152449 -145119 21169 103864 -46759 -123867 55546 -303652 -274497 148702
$$ packed form
9912a64909M6263K736J1350j9365K4241q416A4542o261J55411b22592K1462f9865
9899B85698c1280k36674a15330E8737b06181h4125C3496A3799i3968l07705a45190
9887c07044M8338f2682A77492a39020A14645K1346g4579G2296b35042j57080a90797
9875E0032a68415E1348b9880I6539a31910d0211A397J18268a48589A76512c78659
9863b72164c5398j07106O0731C00241f6603K512C18915C1774J367m430N6561J4860
9851A00132e4265A24417C4100M8876a400A5477e2044F5959d3641k73325F8902
9839H2291d8644l5312B23294H234b9809j54577a498j6822Q263j55098l8657j02725
9827c06537K2253J31835P330B1169Q2695d6759p7108E5546c03652K9155A48702
$$ plain form
9815 48121 -230712 320113 44862 188634 -126615 8324 7763 -334075 -217931 23237 -244528
9803 -74885 55450 -131181 142508 -163417 -148288 83764 -182464 52038 180285 -257100 -5995
9791 -197882 -81503 -4236 24202 -64978 -6979 146415 -307476 -12756 -214695 -327344 177697
9779 -188663 -282290 -114344 -177171 -204885 89196 265084 -348583 -59849 -91265 -207077 -66954
9767 -125783 -142356 -56139 -9553 65129 -12805 -295012 130809 46678 95142 64490 72281 -162461
9754 -149027 -285900 -120736 -320951 -179152 -43777 21524 217389 10777 -308140 -187813
9744 -187813 -179137 151893 -16287 -223753 -140047 8376 -254875 52097 -139868 -250752 -218314
9733 -218314 167732 19729 103288 -61703 166838 103631 -356586 -136536 -414808 -115601
$$ packed form
9815D8121b30712C20113D4862J43772a26615H324n61c34075J16144B3237b44528
9803g4885E5450a31181A42508a63417J5129H3764a82464E2038J28247b57100e995
9791a97882h1503d236B4202f4978f979A46415c07476a2756k01939j12649A77697
9779a88663r3627a14344o2827k7714H9196J75888c48583e9849l1416j15812f6954
9767a25783j6573e6139i553F5129a2805k82207A30809D6678M8464l0652P791a62461
9754a49027j36873a20736k00215J41799d3777B1524J95865A0777c08140J20327
9744a87813Q676A51893a6287k07466Q3706H376b54875E2097a39868j10884L2438
9733b18314A67732A9729Q3559f1703A66838o3207c56586a36536k78272a15601
$$ plain form
9722 -267890 110780 -178062 -76875 -131649 220516 109142 -88302 279112 -18202 65115 485295
9711 485295 49287 -277662 217377 -5818 76541 -165742 -33363 62420 -51899 -9585 24623
9699 -20789 -206155 -42184 -88571 14190 -51691 76299 -15151 129155 -22708 -53742 -171917
9688 -171917 47674 -177255 -117214 -69591 137605 36024 -26869 17072 81802 -77581 -91689
9677 -91689 -284211 171101 57513 -30997 193839 -395375 119316 -56996 -20799 5202 -125184
9665 -195851 7475 -385309 69937 18155 -72322 -139563 181540 69368 120246 -183276 -38518
9653 -315326 -129264 255345 153472 -92289 -308693 -61511 68348 -94573 -114399 -140545 92031
9641 33163 26638 65332 -283970 267919 29305 -384926 -33766 -116774 509346 135248 -308798
$$ packed form
9722b67890A10780a78062g6875n4774B20516A09142h8302B79112a8202F5115M20180
9711D85295D9287b77662B17377e818G6541a65742c3363F2420e1899i585B4623
9699b0789j85366d2184m6387A4190e1691G6299a5151A29155b2708l1034j18175
9688a71917D7674a77255O0041M7623A37605C6024b6869A7072O4730g7581j4108
9677i1689j92522A71101E7513c0997A93839c95375A19316e6996b0799E202a25184
9665a95851G475c85309F9937A8155g2322o7241A81540F9368N0878a83276c8518
9653c15326a29264B55345j01873i2289k16404f1511F8348i4573j9826k6146I2031
9641C3163o525L8694b83970B67919B9305c84926c3766q3008E09346A35248c08798
$$ plain form
9629 -169195 -57290 -397876 50502 -202242 -224456 -162445 -43252 -342433 2186 -289237 -56311
9617 -175219 -95001 11368 193455 -319022 -155958 -118559 -186823 -162878 -140252 124463 -217047
9605 -254233 206277 64231 -208796 -37814 39680 -79061 73452 17909 -323495 -232541 -45161
9593 -76149 -262418 -415695 42872 -120432 112829 -166324 104651 184516 -87832 42039 -159490
9581 -234439 -207474 -161309 -319442 -290985 -138537 -159685 -81485 -135171 79570 305326 -331760
9569 -424376 36371 -79659 180023 107293 -332928 -333581 144796 -163 -161635 289039 -63807
9557 81742 -124247 94885 -104219 352537 250189 -59981 -508 120254 -70862 -346182 -209826
9546 -209826 96563 -249550 149517 -277707 62285 -313659 -314993 5875 224046 -284678 -133062
$$ packed form
9629a69195e7290l40586E0502b02242k2214O2011d3252k99181B186b89237e6311
9617a75219Q0218A1368J82087c19022a55958L7399o8264K3945K2626A24463b17047
9605b54233B06277F4231b08796c7814C9680g9061G3452A7909c23495R0954d5161
9593g6149j86269j53277D2872a20432A12829a66324A04651P9865h7832D2039a59490
9581b34439K6965M6165j58133K8457a38537k1148P8200n3686G9570K25756c31760
9569d24376C6371g9659A80023p2730c32928o53A44796a63j61472B89039f3807
9557H1742a24247I4885a04219C52537j02348e9981e08A20254g0862k75320J36356
9546b09826I6563b49550A49517b77707F2285c13659j334E875K18171b84678a33062
$$ plain form
9534 -167047 132448 -7514 -124737 -139131 -424318 -153426 139711 -125182 318059 35069
9523 312802 -140298 -216004 147389 -128229 -126061 222023 -44552 7618 -154543 -164001 354595
9511 -84543 101200 50613 -27120 -128895 -248313 -91923 -208377 -91262 167016 -24456 -491832
9500 -491832 -141291 -146319 71263 149632 99374 -76288 -23047 -45954 -208862 65193 -24135
9488 -102882 25316 -222823 -10328 -42061 -175003 -439184 21040 -6252 5321 -112087 224753
9476 92280 202901 14866 67713 5419 -133323 -233413 44101 -74801 169661 -47914 -180249
9465 -180249 -131982 -441829 -152522 -57682 353298 56523 -300761 -202279 -54360 -147069 -100447
9454 -100447 98887 -95849 -209563 -46992 -88050 -70400 -241621 192555 -16998 -63464 -22113
$$ packed form
9534a67047A32448g514j17223j4394k85187a53426A39711a25182C18059C5069
9523C12802a40298p5706A47389a28229K168B22023d4552G618a54543r458C54595
9511h4543A01200n0587b7120j01775j19418i1923j16454i1262A67016b4456m67376
9500d91832a41291n028G1263P8369n0258g6288b3047k2907j62908F5193b4135
9488a02882B5316b22823a0328l1733j32942k64181B1040f252E321a12087B24753
9476I2280J10621A4866N2847E419a33323j00090D4101g4801A69661d7914j32335
9465a80249M8267l09847a52522e7682C53298E6523c00761R8482e4360r2709M6622
9454a00447I8887i5849j13714d6992m1058J7650j71221A92555a6998m6466b2113
$$ plain form
9442 -128025 -202531 -17981 70652 126376 58289 -125996 -126779 26550 -308596 -16726 77264 -236921
9429 -31717 203749 -255057 -126930 -157617 214280 -108467 -12109 -129261 24567 -67885 384356
9417 -392973 -123585 86818 80977 82197 152298 -42972 -282934 -27722 -177062 11512 162511
9406 162511 -189437 -55275 -82046 -37133 159690 -97025 50064 -67682 42606 -9501 -145952
9395 -145952 -107741 22595 -145471 -200947 108090 172799 150476 75565 -38853 -284222 -105937
9383 -184100 81048 -100017 -182847 113039 -252117 -318336 -19572 -65445 -1816 -157940 56079
9371 -36066 -162021 349180 -296131 -343401 -306347 -124189 -58711 329426 -25711 -49152 -96195
9360 -96195 -110763 -228092 -254918 -138117 16205 -218704 -261488 11429 -267316 162704 -26124
$$ packed form
9442a28025p4506a7981G0652N5724E8289a25996p83B6550c08596a6726G7264b36921
9429c1717B03749b55057a26930l0687B14280a08467a2109j17152B4567f7885C84356
9417c92973a23585H6818n841J220P0101d2972k39962b7722j49340A1512J50999
9406A62511a89437e5275k6771c7133A59690i7025E0064f7682D2606i501j36451
9395a45952L8211B2595a45471n5476A08090O4709k2323p4911c8853k45369a05937
9383a84100H1048a00017q2830A13039b52117o6219a9572m5873a816j56124E6079
9371c6066j25955C49180b96131m7270L7054a24189e8711C29426b5711k3441m7043
9360i6195j4568j17329k6826J16801A6205b18704m2784A1429b67316A62704b6124
$$ plain form
9348 -108020 78950 3513 -434860 24424 -183023 237771 84444 183192 -230346 -83674 64888
9336 -72799 -116283 -56955 -156945 -112061 -180976 138091 27738 105625 -65517 -264716 86645
9324 -110581 -88104 -99050 26764 35199 -159418 39523 -23138 -9226 -206411 -31092 -34182 115500
9311 -304434 153763 -176067 32230 19212 -386536 91820 -152471 -82532 -205500 -432110
9301 -432110 150555 -5912 -68907 -219115 157054 -61754 -277023 -17682 76325 -21819 -113549
9290 -113549 -103217 -241231 -290700 -1468 -215895 168332 135472 -100214 358940 270205 166773
9279 166773 19218 22877 71571 -11445 -258179 67333 -95718 162292 -256791 -51304 412656
9267 104855 -48705 -43014 133838 -42558 58182 207693 75038 171490 102970 285700 -45234
$$ packed form
9348a08020G8950C513d34860B4424a83023B37771H4444R8748b30346h3674F4888
9336g2799m3484e6955r9990M4884o8915A38091B7738P7887f5517j99199H6645
9324a10581K2477j0946B6764Q435a59418C9523b3138i226j97185c1092l090A15500
9311c04434A53763a76067C2230j3018c86536I1820a52471O9939j22968k26610
9301d32110A50555e912o2995j50208A57054f1754k15269a7682G6325b1819r1730
9290a13549J0332j38014m9469a468k14427A68332l2860a00214C58940q8735j03432
9279A66773A9218L659M8694a1445k46734F7333i5718A62292b56791e1304D12656
9267A04855d8705N691A33838d2558E8182J49511G5038R6452o8520J82730d5234
$$ plain form
9255 -85509 73725 -116551 -284647 36486 18167 -212439 -65847 279375 4377 -332725 -218107
9244 -218107 66600 -363366 -97316 -41846 -117555 -16945 -133197 67280 -40696 176197 -343203
9232 97829 119285 164510 292452 -228818 146314 -135732 -303218 49585 -166456 -37803 -82142
9221 -82142 156680 -182667 56828 79812 91687 148260 -187458 -116724 205974 -115562 26500
9209 -134443 -123297 4352 73372 28278 -183255 54289 179745 -441801 23181 -248164 253698
9197 -170632 -59888 165567 -373572 -1641 332249 -100412 -85807 -74860 -263987 3590 -72485
9185 18897 101035 -216519 -419434 -108902 -67218 136908 -405738 -45542 30838 -248819 -35316
9173 206059 26975 -52961 -48898 -151844 -77460 -559 -117069 119635 -166803 -141744 -148499 -106214
$$ packed form
9255h5509G3725a16551j68096C6486A8167b12439f5847B79375D377c32725J14618
9244b18107F6600c63366i7316d1846p5709a6945j16252F7280d0696A76197c43203
9232I7829K1456M5225J27942b28818A46314a35732j67486D9585a66456c7803m4339
9221h2142A56680a82667E6828K2984J1875N6573a87458P0734B05974a15562B6500
9209a34443J1146D352O9020B8278a83255E4289J25456d41801B3181b48164B53698
9197a70632e9888A65567c73572a641C32249a00412J4605J0947j89127C590g2485
9185A8897Q2138b16519k02915a08902M1684A36908d05738d5542C0838b48819c5316
9173B06059B6975e2961M063j02946P4384e59j16510A19635a66803K5059o755M2285
$$ plain form
9161 -106214 105872 111737 1209 -336839 123902 -19325 -256174 63707 -229716 154559 -62091
9149 43671 -148831 -46694 373675 -293232 -145677 -311140 -235293 -322490 119281 -253345
9138 160559 -79939 62233 -188609 237469 -161719 -141792 -71668 305060 -34959 258761 -103155
9126 -5193 -219160 -317459 179398 -86423 -98518 180177 174106 142204 -181263 -207999 79032
9114 -92543 -195557 -218785 52964 -153789 -181509 -1651 -133010 -108822 -26686 112906 32487
9102 -7731 143141 -72441 42130 -266451 287469 -54207 89549 4759 411036 139703 29095
9090 -126844 44625 14050 49188 147951 58503 -120739 -21256 196905 -256980 124656 166759
9079 166759 -181568 -298928 121811 47221 183275 -65877 -384403 43322 409219 67561
$$ packed form
9161a06214A05872N865A209c36839A23902a9325k36849F3707b29716A54559f2091
9149D3671a48831d6694C73675b93232a45677j65463P5847q7197A19281b53345
9138A60559g9939F2233a88609B37469a61719J9927P0124C05060c4959B58761a03155
9126e193k13967r8299A79398h6423j2095A80177o071l1902a81263k6736G9032
9114i2543j03014k3228E2964a53789k7720a651j31359K4188b6686A12906C2487
9102g731A43141g2441D2130b66451B87469e4207H9549D759M06277A39703B9095
9090a26844D4625A4050L5138R8763E8503a20739b1256A96905b56980A24656M2103
9079A66759a81568j17360A21811D7221J36054f5877l18526D3322L65897F7561
$$ plain form
9068 -226469 -305281 44913 133389 41069 17184 188907 -49340 -137364 252256 -125475 -186333
9057 -186333 -155264 -62177 143450 -106455 -177874 -174626 423871 -79200 -199416 -220762 -225746
9046 -225746 -139284 33026 140214 -230284 -127600 -21737 208547 -166008 288123 -71464
9035 -307873 -141516 -180982 54698 -281373 124560 -325714 146879 100104 133949 -91936 21100
9023 -146245 34826 226339 -157139 -76956 -213804 -111111 109366 -262551 -140679 -40558
9012 -111164 -126227 -35737 -286211 275415 -430563 268021 -121107 372190 -134722 -223119
9002 -223119 183093 131949 -98054 137929 -61227 29182 110678 146441 311627 -281729 -181941
8991 -181941 -264166 -481745 -232826 176390 115950 -389 -167640 -53156 -731 -254202 140888
$$ packed form
9068b26469p8812D4913Q8476D1069A7184J71723d9340q8024B52256a25475o0858
9057a86333L1069f2177A43450a06455p1419L248D23871g9200j20216k1346m984
9046b25746Q6462C3026J07188b30284J02684b1737B08547a66008B88123g1464
9035c07873a41516l9466E4698b81373A24560c25714A46879m6775L3845i1936B1100
9023a46245C4826J91513a57139g6956j36848J02693A09366b62551J21872d0558
9012a11164j5063c5737k50474B75415d30563B68021a21107C72190a34722q8397
9002b23119A83093n1144i8054A37929f1227B9182Q1496L5763J65186b81729R9788
8991a81941q2225k17579b32826A76390o0440c89j67251e3156g31k53471A40888
$$ plain form
8979 86741 131250 79092 -219871 86726 -267366 -3543 -186008 225582 -79299 278462 -284301
8967 3153 309926 -164280 43706 2832 271618 -36344 -439827 -274173 174885 -416356 -309548
8956 -309548 -36630 145176 -32708 -313656 115564 -218495 90083 272287 -486389 -67348
8945 -58773 -31857 -106752 -109789 44609 -199015 -208722 -278590 -240729 -84439 139609 -102372 23812
8932 79369 86166 7538 -106725 36610 218238 9448 -72370 357554 1154071 2518082 7584817
8921 7584817 6325909 1788804 725433 94410 146690 -26101 104274 144862 392225 147842
8910 152628 189123 179111 19462 145408 -175416 86281 -51815 -100027 -65189 -190754 -100592
8899 -100592 -140 237618 73629 -141921 -81258 -140374 -207852 89453 17119 185350 -182696
$$ packed form
8979H6741M4509n2158b19871H6726b67366c543j82465B25582g9299B78462b84301
8967C153L06773a64280D3706B832K68786c6344m03483J65654A74885d16356J06808
8956c09548c6630A45176c2708k80948A15564b18495I0083J82204d86389f7348
8945e8773K6916p4895l037D4609a99015r707o9868L7861h4439A39609a02372B3812
8932G9369O797G538a06725C6610J81628I448g2370C57554P96517J364011N066735
8921G584817j258908A788804G25433I4410N2280b6101A04274M0588K47363A47842
8910A52628L6495j0012A9462J25946a75416H6281e1815m8212L4838j25565R0162
8899a00592a40B37618G3629a41921O0663n9116o7478H9453A7119J68231a82696
$$ plain form
8887 -30403 -326267 63548 -350704 -19690 57542 26790 -68506 -187017 -273969 -93924 -398078
8876 -398078 19380 -264579 -15868 -305667 -167772 -180314 116909 39568 -52879 -125935 62700
8864 198777 -78449 -69529 159740 234387 -128569 -135223 -224072 18236 -132125 -142251 -170849
8853 -170849 28016 -165429 29849 -248134 -158689 -345466 7680 -8157 -262233 282662 -179174
8841 -98049 155918 26748 -11709 -58676 25761 -251225 135514 121838 61019 -151871 66960
$$ packed form
8887c0403k95864F3548c50704a9690E7542B6790f8506j18511q6952i3924l04154
8876c98078A9380b64579a5868k89799J37895j2542A16909C9568e2879p3056F2700
8864A98777g8449Q920A59740P4647a28569o654q8849A8236a32125j0126k8598
8853a70849B8016a65429B9849b48134Q9445j86777G680h157k54076B82662a79174
8841i8049A55918B6748a1709m6967B5761b51225A35514j3676o0819a51871F6960
$$ [...]
##END NTUPLES=NMR SPECTRUM
##END=
