##TITLE=AC1427_PERAH13238_7765536_XiRO4GehPd
##JCAMPDX= 6.0         $$ Bruker NMR JCAMP-DX V2.0
##DATA TYPE= NMR SPECTRUM
##DATA CLASS= NTUPLES
##ORIGIN= BRUKER
##OWNER= Administrator
$$ 1.72 TOPSPIN		Version 2.1
$$ 2013-04-11 22:53:54.350 -0700  Administrator@X
$$ Compression mode = diff/dup
##.OBSERVE FREQUENCY= 400.02188249412
##.OBSERVE NUCLEUS= ^1H
##.ACQUISITION MODE= SIMULTANEOUS (DQD)
##.ACQUISITION SCHEME= undefined
##.AVERAGES= 64
##.DIGITISER RES= 22
##SPECTROMETER/DATA SYSTEM= spect
##.PULSE SEQUENCE= noesygpps1d.comp
##.SOLVENT NAME= COFFEE_meoh
##.SHIFT REFERENCE= INTERNAL, COFFEE_meoh, 1, 14.96082
##AUDIT TRAIL= $$ (NUMBER, WHEN, WHO, WHERE, PROCESS, VERSION, WHAT)
$$ ##TITLE= Audit trail, TOPSPIN		Version 2.1
$$ ##JCAMPDX= 5.01
$$ ##ORIGIN= Bruker BioSpin GmbH
$$ ##OWNER= Administrator
$$ $$ E:\/data/COFFEE/nmr/AC1427_PERAH13238_7765536_XiRO4GehPd/12/pdata/1/auditp.txt
$$ ##AUDIT TRAIL=  $$ (NUMBER, WHEN, WHO, WHERE, PROCESS, VERSION, WHAT)
(   1,<2013-04-11 22:53:48.537 -0700>,<Administrator>,<X>,<go>,<TOPSPIN 2.1>,
      <created by zg
	started at 2013-04-11 22:42:18.841 -0700,
	POWCHK enabled, PULCHK disabled,
       configuration hash MD5:
       33 CF 6A 21 5C D3 B9 40 6C 15 AA 8D 27 A2 4F 13
       data hash MD5: 64K
       AB BD 66 97 D9 82 32 2E EB 35 FC FC EA 14 AD 5D>)
(   2,<2013-04-11 22:53:51.584 -0700>,<Administrator>,<X>,<proc1d>,<TOPSPIN 2.1>,
      <Start of raw data processing
       efp LB = 0.3 FT_mod = 6 PKNL = 1 PHC0 = 0 PHC1 = 0 SI = 128K 
       data hash MD5: 128K
       11 88 AA B3 30 49 08 2E AA FD 02 F1 36 0C E7 2F>)
(   3,<2013-04-11 22:53:52.584 -0700>,<Administrator>,<X>,<proc1d>,<TOPSPIN 2.1>,
      <pk PHC0 = -79.14551 PHC1 = 0 
       data hash MD5: 128K
       DF BE A7 98 78 14 94 7A BE 86 79 63 ED CB 01 E4>)
(   4,<2013-04-11 22:53:53.303 -0700>,<Administrator>,<X>,<proc1d>,<TOPSPIN 2.1>,
      <abs ABSG = 1 
       data hash MD5: 128K
       83 A6 D5 17 2B D2 2C 41 CB D4 20 2E 84 74 DF 86>)
(   5,<2013-04-11 22:53:53.475 -0700>,<Administrator>,<X>,<proc1d>,<TOPSPIN 2.1>,
      <abs ABSG = 2 
       data hash MD5: 128K
       E9 5F B3 3F A6 28 3C EC EA EF E9 53 02 9A 03 34>)
(   6,<2013-04-11 22:53:53.662 -0700>,<Administrator>,<X>,<proc1d>,<TOPSPIN 2.1>,
      <abs ABSG = 3 
       data hash MD5: 128K
       46 70 D6 87 CB DA DB F8 A4 71 48 0B 82 FE B2 03>)
(   7,<2013-04-11 22:53:53.850 -0700>,<Administrator>,<X>,<proc1d>,<TOPSPIN 2.1>,
      <abs ABSG = 4 
       data hash MD5: 128K
       AF EC 38 EC 52 3F B2 54 BF DF 68 DE D6 B1 E6 A9>)
(   8,<2013-04-11 22:53:54.022 -0700>,<Administrator>,<X>,<proc1d>,<TOPSPIN 2.1>,
      <abs ABSG = 5 
       data hash MD5: 128K
       0B E8 CB D1 55 CC 77 12 4F B6 E9 32 45 B8 A4 C7>)
$$ ##END=
$$ 
$$ $$ hash MD5
$$ $$ 01 CA 38 6E 05 67 1A 2E 22 CB 3A 4A 22 D2 4F 6B
##$RELAX= 
##$RELAX= 
##$RELAX= 
##$RELAX= 
##$RELAX= 
##$RELAX= 
##$RELAX= 
##$RELAX= 
$$ Bruker specific parameters
$$ --------------------------
##$DU= <E:\>
##$EXPNO= 12
$$ [...]
##$TP07= 0
##$TPNAME0= <>
##$TPNAME1= <>
##$TPNAME2= <>
##$TPNAME3= <>
##$TPNAME4= <>
##$TPNAME5= <>
##$TPNAME6= <>
##$TPNAME7= <>
##$TPOAL= (0..7)
0.5 0.5 0.5 0.5 0.5 0.5 0.5 0.5
##$TPOFFS= (0..7)
0 0 0 0 0 0 0 0
##$TUNHIN= 0
##$TUNHOUT= 0
##$TUNXOUT= 0
##$USERA1= <user>
##$USERA2= <user>
##$USERA3= <user>
##$USERA4= <user>
##$USERA5= <user>
##$V9= 5
##$VALIST= <valist>
##$VCLIST= <CCCCCCCCCCCCCCC>
##$VD= 0
##$VDLIST= <DDDDDDDDDDDDDDD>
##$VPLIST= <PPPPPPPPPPPPPPP>
##$VTLIST= <TTTTTTTTTTTTTTT>
##$WBST= 2048
##$WBSW= 25
##$XGAIN= (0..3)
0 0 0 0
##$XL= 0
##$YL= 0
##$YMAX_a= 5722791
##$YMIN_a= -12657087
##$ZGOPTNS= <>
##$ZL1= 120
##$ZL2= 120
##$ZL3= 120
##$ZL4= 120
##$ABSF1= 14.96082
##$ABSF2= -5.597362
##$ABSG= 5
##$ABSL= 3
##$ALPHA= 0
##$AQORDER= 0
##$ASSFAC= 0
##$ASSFACI= 0
##$ASSFACX= 0
##$ASSWID= 0
##$AUNMP= <proc_prof1d_extract.lims>
##$AXLEFT= 0
##$AXNAME= <>
##$AXNUC= <1H>
##$AXRIGHT= 0
##$AXTYPE= 0
##$AXUNIT= <>
##$AZFE= 0.1
##$AZFW= 0.1
##$BCFW= 0
##$BC_mod= 0
##$BYTORDP= 0
##$COROFFS= 0
##$CY= 15
##$DATMOD= 1
##$DC= 0
##$DFILT= <>
##$DTYPP= 0
##$F1P= 0
##$F2P= 0
##$FCOR= 0.5
##$FTSIZE= 131072
##$FT_mod= 6
##$GAMMA= 0
##$GB= 0
##$INTBC= 1
##$INTSCL= 1
##$ISEN= 128
##$LB= 0.3
##$LEV0= 0
##$LPBIN= 0
##$MAXI= 10000
##$MC2= 0
##$MEAN= 0
##$ME_mod= 0
##$MI= 0
##$NCOEF= 0
##$NC_proc= -2
##$NLEV= 6
##$NOISF1= 0
##$NOISF2= 0
##$NSP= 0
##$NTH_PI= 0
##$NZP= 0
##$OFFSET= 14.96082
##$PC= 1
##$PHC0= -79.14551
##$PHC1= 0
##$PH_mod= 1
##$PKNL= yes
##$PPARMOD= 0
##$PPDIAG= 0
##$PPIPTYP= 0
##$PPMPNUM= 2147483647
##$PPRESOL= 1
##$PSCAL= 4
##$PSIGN= 0
##$PYNMP= <proc.py>
##$REVERSE= no
##$SF= 400.020009706828
##$SI= 131072
##$SIGF1= 0
##$SIGF2= 0
##$SINO= 400
##$SIOLD= 131072
##$SPECTYP= <>
##$SREGLST= <1H.CDCl3>
##$SSB= 0
##$STSI= 131072
##$STSR= 0
##$SW_p= 8223.68421052631
##$SYMM= 0
##$S_DEV= 0
##$TDeff= 65536
##$TDoff= 0
##$TI= <>
##$TILT= no
##$TM1= 0
##$TM2= 0
##$TOPLEV= 0
##$USERP1= <user>
##$USERP2= <user>
##$USERP3= <user>
##$USERP4= <user>
##$USERP5= <user>
##$WDW= 1
##$XDIM= 131072
##$YMAX_p= 358464292
##$YMIN_p= -101386
##$CURPLOT= <Network HP LaserJet P1505>
##$CURPRIN= <$Network HP LaserJet P1505>
##$DFORMAT= <normdp>
##$LAYOUT= <+/1D_H.xwp>
##$LFORMAT= <normlp>
##$PFORMAT= <normpl>
##$SURQMSG= 1
$$ End of Bruker specific parameters
$$ ---------------------------------
##NTUPLES= NMR SPECTRUM
##VAR_NAME=  FREQUENCY,     SPECTRUM/REAL,   SPECTRUM/IMAG
##SYMBOL=    X,             R,               I
##VAR_TYPE=  INDEPENDENT,   DEPENDENT,       DEPENDENT
##VAR_FORM=  AFFN,          ASDF,            ASDF
##VAR_DIM=   131072,        131072,          131072
##UNITS=     HZ,            ARBITRARY UNITS, ARBITRARY UNITS
##FACTOR=    0.0627417313425164, 1,          1
##FIRST=     8223.62146879497, -86,          -60243
##LAST=      0,             2123,            -60725
##MIN=       0,             -101386,         0
##MAX=       8223.62146879497, 358464292,    0
$$ Real data points
##PAGE= N=1
##DATA TABLE= (X++(R..R)), XYDATA
$$ [...]
63929D664640J46256J14884Q1171M6351J0801k5527o2059r7310j29744j58661
63919D590802j83993k05411k22043k33121k38648k39241k35668k28693k19142
63910B584842k07710j94725j80340j64976j49362j34124j19516j05630r2645q0711
63900A155103o9726n9494n0146m2265l6356l2124k8493k4444j9896j5692j2817
63889G63650j1651j1776j2306j2535j2454j2610j3249j3797j3406j1890r702p225
63877F21049m570k028jJ681L777O666R934J3138J6325J9421K1795K3085K3903
63864G54175K4977K6015K6232K5721K5425K5760K6100K5675K4295K2113J9335
63853A025823J6285J3129R476M903l6m089o848r320j2573j6455k0077k2988k5313
$$ plain form
63929 4664640 4810896 4925780 5006951 5053302 5064103 5038576 4976517 4879207 4749463 4590802
63919 4590802 4406809 4201398 3979355 3746234 3507586 3268345 3032677 2803984 2584842
63910 2584842 2377132 2182407 2002067 1837091 1687729 1553605 1434089 1328459 1235814 1155103
63900 1155103 1085377 1025883 975737 933472 897116 864992 836499 812055 792159 776467 763650
63889 763650 751999 740223 727917 715382 702928 690318 677069 663272 649866 637976 628274 621049
63877 621049 616479 614451 614450 616131 619908 626574 636508 649646 665971 685392 707187 730272 754175
63864 754175 779152 805167 831399 857120 882545 908305 934405 960080 984375 1006488 1025823
63853 1025823 1042108 1055237 1064713 1069616 1069580 1065491 1058643 1049323 1036750 1020295 1000218 977230 951917
63840I51917k7240k8962l0762l2584l3802l3878l3073l2088l1231l0413k9606
63829F08278k8729k7322k5012k2303k0259j9300j8736j7686j5982j4069j2355
63818C86525j0955r854r037q436p815o863n561m462m265m869n275m720l671l107
63804B97635l125k900k069j304j280j666j654j106o46q21j576k494l168l312k865
63789B67649k107j487j255j322j454j566j746k089k462k543k115j333o06k72m62
63774B44830j137j936k151j316QN49k00j227j210k18M16r0j027j277p22j33jp5
63756B33083M6L00K94j67q24j124p25R4O00L73j55j95M75J346J842J866J633J399
63738B40161J464K050K927L425L173K608K403K631K833K812K825K978K965K653
$$ plain form
63840 951917 924677 895715 864953 832369 798567 764689 731616 699528 668297 637884 608278
63829 608278 579549 552227 527215 504912 484653 465353 446617 428931 412949 398880 386525
63818 386525 375570 365716 356679 348243 340428 333565 328004 323542 319277 314408 309133 304413 300742 297635
63804 297635 294510 291610 289541 288237 286957 285291 283637 282531 281885 281064 279488 276994 273826 270514 267649
63789 267649 265542 264055 262800 261478 260024 258458 256712 254623 252161 249618 247503 246170 245564 245292 244830
63774 244830 243693 241757 239606 238290 238298 238847 238647 237420 236210 235992 236408 236318 235291 234014 233292 233159 233158 233083
63756 233083 233129 233429 233723 233556 232732 231608 230883 230977 231577 231950 231795 231600 232075 233421 235263 237129 238762 240161
63738 240161 241625 243675 246602 250027 253200 255808 258211 260842 263675 266487 269312 272290 275255 277908
63724B77908K486K991M040M971N293N021M418L740L237L055L005K641J708M70
63710C24984n83j214j511j562j359j061j103j734k527k656j792n05M41R77J604
63695C10399K477L022K740K036J922K840M100M633M116L140K388J963J611J279
63681C48666J135J086P32r6j022j538j544j265q76m63k13k56m00k88Q9L62L18
63664C44427J56J34J95J30j86q05j761k865l673l921l875m004m345m433l908k978
63648C08288k181j839j819j764j418p30K14J207J908K062J814J590J649J902K291
63633C13174L034M212N343N820N630N262M989M764M786N514O916Q262Q990R386
63619C96082J0065J1153J2328J3315J4044J4615J5489J7284J9950K2481K4037
$$ plain form
63724 277908 280394 283385 287425 292396 297689 302710 307128 310868 314105 317160 320165 322806 324514 324984
63710 324984 324401 323187 321676 320114 318755 317694 316591 314857 312330 309674 307882 307377 307818 308795 310399
63695 310399 312876 315898 318638 320674 322596 325436 329536 334169 338285 341425 343813 345776 347387 348666
63681 348666 349801 350887 351619 351523 350501 348963 347419 346154 345278 344815 344602 344346 343946 343658 343747 344109 344427
63664 344427 344583 344717 344912 345042 344856 344051 342290 339425 335752 331831 327956 323952 319607 315174 311266 308288
63648 308288 306107 304268 302449 300685 299267 298537 298751 299958 301866 303928 305742 307332 308981 310883 313174
63633 313174 316208 320420 325763 331583 337213 342475 347464 352228 357014 362528 369444 377706 386696 396082
63619 396082 406147 417300 429628 442943 456987 471602 487091 504375 524325 546806 570843
63608E70843K4991K6312K8116K9591L0200L0120K9385K7457K4033J9682J5197
63597H55927J0726N996J149l168o420q567r879j0583j0825j0871j1261j2563j4772
63584G74889j7086j8662j9566k0571k1932k2878k2546k0978j8826j6494j4057
63573E61293j1762r979q641p158n105k670l63J517L043M460N929P319Q209Q283
63559E54375P761P333P525Q244R014R627J0420J1901J4222J7089K0133K3180K6128
63546G26952K8822L1260L3771L6594L9207M0390L9079L4979K8275J9241Q516k405
63534A064681j1509j7321j9644j9373j7779j5907j4352j3367j3100j3651j5028
63523H93650j7229k0364k4401k8661l1924l3386l3347l2677l1776l0420k8423
$$ plain form
63608 570843 595834 622146 650262 679853 710053 740173 769558 797015 821048 840730 855927
63597 855927 866653 872649 873798 870630 864210 855643 845764 835181 824356 813485 802224 789661 774889
63584 774889 757803 739141 719575 699004 677072 654194 631648 610670 591844 575350 561293
63573 561293 549531 539552 530911 523753 518648 515978 515615 517132 520175 524635 530564 537883 546092 554375
63559 554375 562136 569469 576994 585238 594252 603879 614299 626200 640422 657511 677644 700824 726952
63546 726952 755774 787034 820805 857399 896606 936996 976075 1011054 1039329 1058570 1067086 1064681
63534 1064681 1053172 1035851 1016207 996834 979055 963148 948796 935429 922329 908678 893650
63523 893650 876421 856057 831656 802995 771071 737685 704338 671661 639885 609465 581042
63512E81042k5966k3295k0562j8056j6115j4661j3204j1526r962q806p788o523
63500D04578n213m395m152m022l683l266k928k471j713q85m06l06j94K24Q04J242
63484C73214J442J436J177O78L05N33J323K030K177K021K030K150J975J558J396
63469C95445J553J327R7j886l792m992n226m448k970j582r88j126j353j195o61
63454C68203O7P64J105R98J030K025L960N758O487O388O420P098Q165R246J0356
63439D38070J1718J3335J4890J6056J6954J8294K0785K4378K8191L1266L3096
63428F67033L3391L1784K8189K3180J7604J2019O907L184J863L094O060R913J4374
63415H58595J9258K3975K7859L0689L2420L2595L0488K5847J9282J1897M709j653
$$ plain form
63512 581042 555076 531781 511219 493163 477048 462387 449183 437657 427695 418889 411101 404578
63500 404578 399365 394970 390818 386796 383113 379847 376919 374448 372735 371850 371444 371138 370944 371168 371972 373214
63484 373214 374656 376092 377269 377947 378252 378785 380108 382138 384315 386336 388366 390516 392491 394049 395445
63469 395445 396998 398325 398422 396536 392744 387752 382526 378078 375108 373526 372538 371412 370059 368864 368203
63454 368203 368270 369034 370139 371137 372167 374192 378152 383910 390397 396785 403205 410303 418468 427714 438070
63439 438070 449788 463123 478013 494069 511023 529317 550102 574480 602671 633937 667033
63428 667033 700424 732208 760397 783577 801181 813200 820107 823291 825154 828248 834308 844221 858595
63415 858595 877853 901828 929687 960376 992796 1025391 1055879 1081726 1101008 1112905 1117614 1115961
63403A115961o929j1050j3904j5349j5498j4982j4768j5616j7662k0468k3443
63392I46292k6262k8879l1115l2461l2552l1731l0767k9842k8282k5537k2093
63381F26771j8996j6642j4568j2353j0162q253o386m153j619O96K503M030N621
63368E46489P222Q564R735J1310J3650J6296J8366J9641K0852K2717K5064K7240
63356G47146K9112L1124L3374L5202L5855L5203L3606L1337K8369K4492J9464
63345A084284J3215O139q70o767j0803j2785j3274j3450j4313j5819j7205j8235
63333I80117j9578k1704k4061k5858k7136k8317k9127k8850k7481k5645k3396
63322F98964k0099j5751j1457q109n399k792p87l87j771m270p468j1437j5897
$$ plain form
63403 1115961 1109032 1097982 1084078 1068729 1053231 1038249 1023481 1007865 990203 969735 946292
63392 946292 920030 891151 860036 827575 795023 763292 732525 702683 674401 648864 626771
63381 626771 607775 591133 576565 564212 554050 545797 539411 535258 533639 534335 536838 540868 546489
63368 546489 553711 562275 572010 583320 596970 613266 631632 651273 672125 694842 719906 747146
63356 747146 776258 807382 840756 875958 911813 947016 980622 1011959 1040328 1064820 1084284
63345 1084284 1097499 1103638 1102768 1096001 1085198 1072413 1059139 1045689 1031376 1015557 998352 980117
63333 980117 960539 938835 914774 888916 861780 833463 804336 775486 748005 722360 698964
63322 698964 678865 663114 651657 643548 638149 635357 634570 634183 632412 628142 620674 609237 593340
63309E93340j9810k2114k2504k1414j9570j7520j5364j2931j0413q524p672p267
63297D08237o419n064l855l133k765k904l890n238n682m747l530l298l873m118
63283C49721l537k649k006j604j270j014q69p77p10p03p07o27m22q3L51O37M52
63266C34183r5m51l59k49m54m78L52J801K946L375L478L605L600L294K832K355
63250C59735J944J976K979M810O507P278P365P621Q505R749J0813J1487J2058
63237D52827J2960J4197J5285J5979J6757J8146J9809K0911K1308K1581K1985
63226F51745K2107K1782K1509K1658K1929K1979K1921K1802K1334K0548K0021
63215H88335J9944J9570J8188J6051J3668J0871P305L315o32m853r802j4824j8674
$$ plain form
63309 593340 573530 551416 528912 507498 487928 470408 455044 442113 431700 423176 415504 408237
63297 408237 401818 396754 392899 389766 387001 384097 380207 374969 369287 364540 361010 357712 353839 349721
63283 349721 346184 343535 341529 339925 338655 337641 336772 335995 335285 334582 333875 333248 332826 332743 333094 333731 334183
63266 334183 334088 333637 333278 333029 332575 332097 332449 334250 337196 340571 344049 347654 351254 354548 357380 359735
63250 359735 361679 363655 366634 371444 377951 385229 392594 400215 408720 418469 429282 440769 452827
63237 452827 465787 479984 495269 511248 528005 546151 565960 586871 608179 629760 651745
63226 651745 673852 695634 717143 738801 760730 782709 804630 826432 847766 868314 888335
63215 888335 908279 927849 946037 962088 975756 986627 993932 997247 996615 991762 981960 967136 948462
63202I48462k1175k3282k5462k6990k7090k5900k4035k1856j9474j6917j4046
63191G02235j0758p394m443j881P15L389N832Q122J0669J3301J5293J6457J7421
63178G68958J8515J9310J9582J9837K0272K0121J8783J6921J5593J4790J3756
63167I66438J2232J0545Q688O259L198k38m183q979j4259j8962k2486k5237k7833
63154H85183l0246l1976l2580l1974l0483k8756k7202k5473k2933j9674j6649
63143E87237j4598j3361j2330j1166r807q280o825n833n330m810l880k784j876
63130D86357j012J22J306K014K260K558L077L359L120K771K817L131L256L215
63116E18351L472M085M410L907K947K474K882L545L536K706J809J641K167K609
$$ plain form
63202 948462 927287 904005 878543 851553 824463 798563 774528 752672 733198 716281 702235
63191 702235 691477 684083 679640 677759 678474 681863 687695 695817 706486 719787 735080 751537 768958
63178 768958 787473 806783 826365 846202 866474 886595 905378 922299 937892 952682 966438
63167 966438 978670 989215 997903 1004162 1007360 1007122 1002939 993960 979701 960739 938253 913016 885183
63154 885183 854937 822961 790381 758407 727924 699168 671966 646493 623560 603886 587237
63143 587237 572639 559278 546948 535782 525975 517695 510870 505037 499707 494897 491017 488233 486357
63130 486357 485345 485467 486773 488787 491047 493605 496682 500041 503161 505932 508749 511880 515136 518351
63116 518351 521823 525908 530318 534225 537172 539646 542528 546073 549609 552315 554124 555765 557932 560541
63102E60541K285J233O0o37o77l22k4l0j03K72J258K320K734K345J654J179J006
63085E75094R92J108J346J516J369R30N72P59J688L051M183M640M656M847N520
63070F12271O512P679R062J0432J1250J1456J1845J3145J5061J6743J7963J9257
63058G62676K1061K3307K5805K8458L1070L3499L6013L9044M2494M5759M8445
63047A137631N0592N2259N3425N4342N5331N6102N5978N4954N3870N3275N2790
63036A730549N1916N0782M9663M8396M6802M5031M2867L9241L3179K4902J5396
63025B178724N319n028j5134k4595l3725m2967n1738n8665o3074o5460o6511o6276
63013A690870o4412o0683n5118m8234m1109l4570k8251k1166j3267n705O18N970
$$ plain form
63102 560541 562826 564059 564119 563482 562805 562483 562459 562429 562326 562598 563856 566176 568910 571255 572909 574088 575094
63085 575094 576086 577194 578540 580056 581425 582355 582927 583686 585374 588425 592608 597248 601904 606751 612271
63070 612271 618783 626462 635524 645956 657206 668662 680507 693652 708713 725456 743419 762676
63058 762676 783737 807044 832849 861307 892377 925876 961889 1000933 1043427 1089186 1137631
63047 1137631 1188223 1240482 1293907 1348249 1403580 1459682 1515660 1570614 1624484 1677759 1730549
63036 1730549 1782465 1833247 1882910 1931306 1978108 2023139 2066006 2105247 2138426 2163328 2178724
63025 2178724 2184043 2179015 2163881 2139286 2105561 2062594 2010856 1952191 1889117 1823657 1757146 1690870
63013 1690870 1626458 1565775 1510657 1462423 1421314 1386744 1358493 1337327 1324060 1318355 1318973 1324943
63001A324943J0973J5653J9774K3457K6807K9424L0933L1702L2448L3340L3974
62990A613428L4041L3513L2349L0551K8416K6215K3671K0173J5523J0060M034
62979A871974k675j0159j8212k6535l4883m2722m9234n3959n7262n9757o1389
62968A455187o1474n9659n6485n2853m9219m5570m1939l8570l5619l3045l0817
62957I49937k8928k7121k4984k2579k0636j9760j9630j9353j8520j7474j6639
62946G14313j6012j5405j4787j4168j3448j2564j1636j0839j0202r592q781p638
62934E69241o446n825n973o104n197l431k186k350l112k976j600j17K12p72k192
62919E21172k968k638j656r46r82j353j426j204j215j710k347k701k658k315j792
$$ plain form
63001 1324943 1335916 1351569 1371343 1394800 1421607 1451031 1481964 1513666 1546114 1579454 1613428
62990 1613428 1647469 1680982 1713331 1743882 1772298 1798513 1822184 1842357 1857880 1867940 1871974
62979 1871974 1869299 1859140 1840928 1814393 1779510 1736788 1687554 1633595 1576333 1516576 1455187
62968 1455187 1393713 1334054 1277569 1224716 1175497 1129927 1087988 1049418 1013799 980754 949937
62957 949937 921009 893888 868904 846325 825689 805929 786299 766946 748426 730952 714313
62946 714313 698301 682896 668109 653941 640493 627929 616293 605454 595252 585660 576879 569241
62934 569241 562795 556970 550997 544893 539696 536265 534079 531729 528617 525641 524041 523924 524136 523364 521172
62919 521172 518204 515566 513910 512964 511982 510629 509203 507999 506784 505074 502727 500026 497368 495053 493261
62904D93261j275r31p00m46l34p02j474k046j960j392p28j8Q22J476J409N98k70
62887D85290n01m2N83Q59O74L25K31N25Q67P95L06p7P8N72Q79Q27P44Q90J034
62868D94859P60R3m61n19l23l97q06r78m99J92K94k26m30M20J907L002L274L076
62850E03238K747K250J651J311J330J303R42O07P38J059Q52j1p64n93M32J453
62834E18545J677J073K14m03p40q62n29M97J798K512K283J616J134R57R74J196
62818E31942J433J199M52pN02J497J960J733J544J762J996K010K223L022M105
62803E57373M856N049M917M863N201N927O772P597Q689J0196J1610J2413J3084
62790F58547J4688J7457K0530K3248K5904K9001L2585L6676M1548M7091N2553
$$ plain form
62904 493261 491986 491055 490355 489909 489575 488873 487399 485353 483393 482001 481273 481255 482077 483553 484962 485560 485290
62887 485290 484789 484747 485330 486189 486863 487188 487419 487944 488811 489606 489912 489835 489913 490485 491364 492191 492935 493825 494859
62868 494859 495619 495712 495251 494732 494409 494012 493206 492228 491729 491921 492215 491989 491559 491979 493886 496888 500162 503238
62850 503238 505985 508235 509886 511197 512527 513830 514772 515379 516117 517176 518028 518017 517253 516660 517092 518545
62834 518545 520222 521295 521509 521106 520366 519504 518975 519472 521270 523782 526065 527681 528815 529772 530746 531942
62818 531942 533375 534574 535026 535019 535521 537018 538978 540711 542255 544017 546013 548023 550246 553268 557373
62803 557373 562229 567278 572195 577058 582259 588186 594958 602555 611244 621440 633050 645463 658547
62790 658547 673235 690692 711222 734470 760374 789375 821960 858636 900184 947275 999828
62779I99828N7405O1918O6442P0730P4467P7870Q1052Q3283Q3472Q1108P6251
62768A813826O9134O0236N0248L9312K6859J2761j852j5705k8674m1167n2737
62757A932241o2344o9638p5002p8591q0388q0921q0786p9517p6258p1512o6892
62746A110392o2956n8651n3300m7839m3282l9236l4906l0658k7408k5092k2793
62735F64271k0116j7442j5043j2822j0808r198p832o321m702l424k650k049j321
62722E50543m96L30J085J574J694J875K863M859P207R131J0538J1906J3647J5781
62708F32537J8166K0742K3526K6453K9430L2502L5854L9465M2971M6127M9321
62697I97094N3173N7576O1617O4646O6879O8587O9248O8079O5120O1002N5818
$$ plain form
62779 999828 1057233 1119151 1185593 1256323 1330790 1408660 1489712 1572995 1656467 1737575 1813826
62768 1813826 1882960 1943196 1993444 2032756 2059615 2072376 2070524 2054819 2026145 1984978 1932241
62757 1932241 1869897 1800259 1725257 1646666 1566278 1485357 1404571 1325054 1248796 1177284 1110392
62746 1110392 1047436 988785 935485 887646 844364 805128 770222 739564 712156 687064 664271
62735 664271 644155 626713 611670 598848 588040 578842 571010 564689 559987 556563 553913 551864 550543
62722 550543 550047 550377 551462 553036 554730 556605 559468 564327 571534 580665 591203 603109 616756 632537
62708 632537 650703 671445 694971 721424 750854 783356 819210 858675 901646 947773 997094
62697 997094 1050267 1107843 1169460 1234106 1300985 1369572 1438820 1506899 1572019 1633021 1688839
62686A688839M8966M0182K9978J8847O748o223j9222l1304m2220n2013o0131o5768
62674A556679o9052p1068p2445p2546p0566o6902o2809n8921n4852n0286m5725
62663H61507m1775l8253l4571l0738k7356k4641k2040j9116j6307j4373j3352
62652E78985j2470j1140r668q748q507q307p543o348n358m855m460l697k561j398
62638D83925m62J46L01K3k90j89K13L48K2l10k13J14K60K43L48M63J16p50j433
62619D82875j191l4J330K330K983L582M148M436M417M477N032O104P396Q644R727
62604E46256J0561J1156J1751J2686J4131J6051J8343K0830K3262K5552K7929
62593G38508L0492L2863L4630L6071L7779L9612M0548L9785L7370L3594K8409
$$ plain form
62686 1688839 1737805 1777987 1807965 1826812 1833560 1827337 1808115 1776811 1734591 1682578 1622447 1556679
62674 1556679 1487627 1416559 1344114 1271568 1201002 1134100 1071291 1012370 957518 907232 861507
62663 861507 819732 781479 746908 716170 688814 664173 642133 623017 606710 592337 578985
62652 578985 566515 555375 545707 536959 528452 520145 512602 506254 500896 496041 491581 487884 485323 483925
62638 483925 483463 483609 483910 483933 483643 483454 483667 484015 484037 483727 483514 483628 483888 484131 484479 484942 485058 484308 482875
62619 482875 481684 481650 482980 485310 488293 491875 496023 500459 504876 509353 514385 520489 527885 536529 546256
62604 546256 556817 567973 579724 592410 606541 622592 640935 661765 685027 710579 738508
62593 738508 769000 801863 836493 872564 910343 949955 990503 1030288 1067658 1101252 1129661
62582A129661K1951J5013Q332J697n553j3290k0484k6312l0868l4608l7567l9345
62570I68627l9716l9127l8435l8048l7328l5273l1901k8447k5841k3565k0681
62559F10265j7485j5197j4139j3251j1666r817q545p796o890n685m724m363m304
62546D86403m089l669l304l068k653j696k91R68J526J419J111R14Q00P25P73R26
62530D76795R81Q71Q56J301K413M154O214Q075R469J0802J2762J5411J8071K0227
62516E88402K2163K4389K6925K9472L2011L4746L7544L9880M1338M1840M1420
62505I60130L9983L7408L3715K9151K4177J9194J4177Q698K539l827r510j3861
62493A141974j6746j8343j8853j8298j6509j3375r241m732p5N038J0592J5752
$$ plain form
62582 1129661 1151612 1166625 1174957 1176654 1171101 1157811 1137327 1111015 1080147 1045539 1007972 968627
62570 968627 928911 889784 851349 813301 775973 740700 708799 680352 654511 630946 610265
62559 610265 592780 577583 563444 550193 538527 528710 520165 512369 505479 499794 495070 490707 486403
62546 486403 482314 478645 475341 472273 469620 467924 467633 468601 470127 471546 472657 473571 474371 475096 475869 476795
62530 476795 477776 478647 479503 480804 483217 487371 493585 501660 511129 521931 534693 550104 568175 588402
62516 588402 610565 634954 661879 691351 723362 758108 795652 835532 876870 918710 960130
62505 960130 1000113 1037521 1071236 1100387 1124564 1143758 1157935 1166633 1169172 1165345 1155835 1141974
62493 1141974 1125228 1106885 1088032 1069734 1053225 1039850 1030609 1025877 1025802 1030840 1041432 1057184
62481A057184J9751K3032K6757L1112L4796L6391L5641L3117K9159K3710J6898
62470A367548R275J481o034j3126k0128k7740l6171m4347n0452n3580n4607n5043
62458A017076n5288n4409n1640m7493m3131l9057l4944l0569k6281k2415j8775
62447E93074j5060j1518q693o698n067l365j613j17R16J545K012K557L143L456
62433E54572L276K800K297J607K73j787m015n767o850p446p740p794p620p194
62419E08612o557n942n648n680n691n392m852m338l995l790l592l238k729k416
62405D44752k667l179l022j774k56L88J52J27R33J862J935J258Q09J112J730K090
62389D46250K257K624L178L418K968J983J005O15J117K324L632M542N145N848
$$ plain form
62481 1057184 1076935 1099967 1126724 1157836 1192632 1229023 1264664 1297781 1326940 1350650 1367548
62470 1367548 1376823 1378304 1372270 1359144 1339016 1311276 1275105 1230758 1180306 1126726 1072119 1017076
62458 1017076 961788 907379 855739 808246 765115 726058 691114 660545 634264 611849 593074
62447 593074 578014 566496 557803 551105 546038 542673 541060 540943 541859 543404 545416 547973 551116 554572
62433 554572 557848 560648 562945 564552 564825 563038 559023 553256 546406 538960 531220 523426 515806 508612
62419 508612 502055 496113 490465 484785 479094 473702 468850 464512 460517 456727 453135 449897 447168 444752
62405 444752 442085 438906 435884 434110 433854 434242 434394 434521 435454 437316 439251 440509 441318 442430 444160 446250
62389 446250 448507 451131 454309 457727 460695 462678 463683 464298 465415 467739 471371 475913 481058 486906
62375D86906O669P224P507Q139R404J0550J0727J0364J0883J2933J5643J7852
62363F14801J9430K1067K3337K6415L0228L4360L8211M1648M5222M9163N2655
62352I96537N4700N5353N5224N3992N0461M4246L6442K8294K0002J1309K494n889
62340A403165j3631k0546k5989k9574l2133l5052l8561m1447m2538m1873m0204
62329A041617l8011l5447l2761l0250k7925k5641k3455k1577k0027j8691j7683
62318G50149j7333j7693j8296j8612j8577j8531j8601j8455j7629j6058j4067
62307E56297j2066j0407r365q930q523p367n398l458k274j596p74N5J34n60r17
62292D84851j47J048J385Q28O30J616L075L724L261K521K390K955L715M232M465
$$ plain form
62375 486906 493575 500799 508306 516445 525849 536399 547126 557490 568373 581306 596949 614801
62363 614801 634231 655298 678635 705050 735278 769638 807849 849497 894719 943882 996537
62352 996537 1051237 1106590 1161814 1215806 1266267 1310513 1346955 1375249 1395251 1406560 1409054 1403165
62340 1403165 1389534 1368988 1342999 1313425 1281292 1246240 1207679 1166232 1123694 1081821 1041617
62329 1041617 1003606 968159 935398 905148 877223 851582 828127 806550 786523 767832 750149
62318 750149 732816 715123 696827 678215 659638 641107 622506 604051 586422 570364 556297
62307 556297 544231 533824 524459 515529 507006 499639 494241 490783 488509 486913 486139 486194 486328 485768 484851
62292 484851 484704 485752 487137 487965 488595 490211 493286 497010 500271 502792 505182 508137 511852 516084 520549
62277E20549M584M682M686M569M571N023N929O915P659Q293R225J0703J2690J5025
62263F25103J7523K0012K2538K5408K8880L2790L6769M0703M4697M8618N2097
62252I95138N5036N7586N9355N9121N5868M9944M2645L4816K6293J6762O604l364
62240A455804j2593k0987k8563l5251m0966m5700m9558n2692n5084n6323n5874
62229A002213n3686n0418m6819m3055l8829l4038k9081k4547k0789j7805j5325
62218F27821j2957j0494q121o214m857l680k339r65L4N64R58J522K205K840L467
62203E89784M147M682M855M790M764M631M000K980K205J890J443M83l30j28Q57
62188F31053J590J708J865K580L553M297M757N000M939M710M735N073N274N229
$$ plain form
62277 520549 525133 529815 534501 539070 543641 548664 554593 561508 569167 577460 586685 597388 610078 625103
62263 625103 642626 662638 685176 710584 739464 772254 809023 849726 894423 943041 995138
62252 995138 1050174 1107760 1167115 1226236 1282104 1332048 1374693 1409509 1435802 1452564 1459168 1455804
62240 1455804 1443211 1422224 1393661 1358410 1317444 1271744 1222186 1169494 1114410 1058087 1002213
62229 1002213 948527 898109 851290 808235 769406 735368 706287 681740 660951 643146 627821
62218 627821 614864 604370 596249 590035 585178 581498 579159 578194 578228 578792 579750 581272 583477 586317 589784
62203 589784 593931 598613 603468 608258 613022 617653 621653 624633 626838 628728 630171 630654 630324 630196 631053
62188 631053 632643 634351 636216 638796 642349 646646 651403 656403 661342 666052 670787 675860 681134 686363
62174F86363N562O685Q008Q814R419J0874J3747J7731K2123K6171K9355L1939
62162H76791L4832L8275M1096M2039M1298L9637L6580L0953K3193J5472R091L158
62150A232415l400r882j4948j8732k2485k6577l0141l2570l4250l5624l6360l5866
62138I31580l4097l1510k8444k4893k0872j6805j3357j0756q529o225m201l110
62126G28781k770k275j361p02n28O8J769L797M962N366O014P205Q310Q913R083
62111G76632Q591O958M362J654o60k618l991m259l666l327l865m709n128n224
62097G60750n364n322m603l172j407L76J928L001L600M016M404M761N422O855
62083G75245Q711R899J0032J0088J1040J2588J3950J5190J6799J8541J9758K0581
$$ plain form
62174 686363 691925 698610 706618 715432 724851 735725 749472 767203 789326 815497 844852 876791
62162 876791 911623 949898 990994 1033033 1074331 1113968 1150548 1181501 1204694 1220166 1229257 1232415
62150 1232415 1229015 1219133 1204185 1185453 1162968 1136391 1106250 1073680 1039430 1003806 967446 931580
62138 931580 897483 865973 837529 812636 791764 774959 761602 750846 742317 736092 731891 728781
62126 728781 726011 723736 722375 721673 721145 721213 722982 726779 731741 737107 743121 750326 758636 767549 776632
62111 776632 785223 792181 796543 798197 797537 794919 790928 786669 783003 779676 775811 771102 765974 760750
62097 760750 755386 750064 745461 742289 740882 741258 743186 746187 749787 753803 758207 762968 768390 775245
62083 775245 783956 793855 803887 813975 825015 837603 851553 866743 883542 902083 921841 942422
62071I42422K1732K3282K4525K5081K5215K5160K5010K5277K6544K8392K9567
62060A222207K9524K8897K8244K7129K4889K1481J7125J1864O014L19m926j0262
62048A402505j5946k1101k4819k7629l0888l4959l8830m1504m2918m3481m3412
62037A037018m2740m1447l9482l7011l4630l2777l1065k8743k5867k3287k1398
62026F78571j9577j7231j4699j2667j1209r967q978q598q784r004q934q742q603
62013E31578q325p653o720n912n397m976m360l479k460j391k80P57J487J914K453
61998D87236L448M564N013M539L760L271K786J643o7j419j884k076k964m612o139
61983D97099o812o741o396n881n093m358m255m739m907m060k685j881j975k279
$$ plain form
62071 942422 964154 987436 1011961 1037042 1062257 1087417 1112427 1137704 1164248 1192640 1222207
62060 1222207 1251731 1280628 1308872 1336001 1360890 1382371 1399496 1411360 1417374 1417693 1412767 1402505
62048 1402505 1386559 1365458 1340639 1313010 1282122 1247163 1208333 1166829 1123911 1080430 1037018
62037 1037018 994278 952831 913349 876338 841708 808931 777866 749123 723256 699969 678571
62026 678571 658994 641763 627064 614397 603188 593221 584243 575645 566861 557857 548923 540181 531578
62013 531578 523253 515600 508880 502968 497571 492595 488235 484756 482296 480905 480625 481382 482869 484783 487236
61998 487236 490684 495248 500261 504800 508560 511831 514617 516260 516193 514774 512890 510814 507850 503238 497099
61983 497099 490287 483546 477150 471269 466176 461818 457563 452824 447917 443857 441172 439291 437316 435037
61969D35037k114j473o08L99J309J563R57J27j94o4L0J33O60J440J731J367J178
61952D41478J898L172M031M033L616L533M268N747P390Q577R275J0002J1104J2337
61938E30461J3409J4451J5626J6575J6777J6270J5539J4789J3873J2862J2109
61927F92741J1594J0698Q950O617M323K411R12k24j247k699m838p021q171p941
61913G06105o958n799m229j851R08L121M534N811P425Q882R415R036Q328P479
61899G52207O050L727Q14k137m773o947q589r772j0648j1172j1227j1075j1299
61886F75159j2017j2545j2155j0917r517q547q283q809r833j0643j0778j0603
61874E50512j0676j0749j0033q495p082o448o101n227l803k354j067K88J773L206
$$ plain form
61969 435037 432923 431450 430842 431241 432550 434113 435070 435197 435003 434939 434969 435102 435762 437202 438933 440300 441478
61952 441478 443376 446548 450579 454612 458228 461761 466029 471776 479166 487743 497018 507020 518124 530461
61938 530461 543870 558321 573947 590522 607299 623569 639108 653897 667770 680632 692741
61927 692741 704335 715033 723983 730600 734923 737334 738246 738022 736775 734076 729238 722217 714046 706105
61913 706105 699147 693348 689119 687268 688176 691297 695831 701642 709067 717949 727364 736400 744728 752207
61899 752207 758257 761984 762798 760661 755888 748941 740352 730580 719932 708760 697533 686458 675159
61886 675159 663142 650597 638442 627525 618008 609461 601178 592369 582536 571893 561115 550512
61874 550512 539836 529087 519054 510559 503477 497029 490928 485701 481898 479544 478477 478765 480538 483744
61860D83744M628O293Q156R804J1076J2394J4212J6355J8260J9736K1212K3125
61848F48995K5249K6853K7493K7422K7140K6706K5703K3765K0949J7647J4309
61837I12231J1211Q208M774O71l360o034o773o238n345m163k211N17L431O101
61823I13020Q528J0543J1583J1342J0247Q805O780L470j217o456j1372j5872k0254
61810I29147k4312k7196k8350k8198k7704k7343k6809k5590k3542k0880j8011
61799F51212j5541j4098j3741j3667j2897j1215r287p824o949o391n991n765n630
61786E22216n357m807m112l559l321l294l155k656j883j213r47r50p68j14P61
61771D86841J298J245Q91O56O73R14J454K230K696K308J427J145J943L048L557
$$ plain form
61860 483744 488372 494665 502821 512625 523701 536095 550307 566662 584922 604658 625870 648995
61848 648995 674244 701097 728590 756012 783152 809858 835561 859326 880275 897922 912231
61837 912231 923442 931650 936424 937095 933735 927701 920928 914690 909345 905182 902971 903488 906919 913020
61823 913020 921548 932091 943674 955016 965263 974068 980848 984318 983101 976645 965273 949401 929147
61810 929147 904835 877639 849289 821091 793387 766044 739235 713645 690103 669223 651212
61799 651212 635671 621573 607832 594165 581268 570053 560766 552942 545993 539602 533611 527846 522216
61786 522216 516859 512052 507940 504381 501060 497766 494611 491955 490072 488859 487912 486962 486194 486080 486841
61771 486841 488139 489384 490275 490931 491604 492518 493972 496202 498898 501206 502633 503778 505721 508769 512326
61756E12326L679M165M878M853L789K554J909J486N52p92j797k176k372k788l284
61741E26982l503l358l021k665k324j922j379p85l76k64k95k57j16J24O04J458
61725E08903K518L400L832L808L488L106K813K495J922J269J145J801K520K360
61711E45380J330L39o5k78q50j678k360k871l400l817l739l117k391k076k353
61696E18054l074l907m483m539m031l131k199j659j683j940j961j780j859k262
61682D79546k339j595n07J6k20o20p44q01j095j449j443r82m52l62q57j525j767
61665D62804j505j325j696k324k573k362k078j780j123j62M75M23P1j17j61j11
61649D46456M20J663K968L337K585J467P26N19P26J256J896K306K343K198K058
$$ plain form
61756 512326 516005 520170 525048 529901 533690 536244 538153 539639 540191 539399 537602 535426 533054 530266 526982
61741 526982 523479 520121 517100 514435 512111 510189 508810 508025 507649 507385 507090 506833 506717 506841 507445 508903
61725 508903 511421 514821 518653 522461 525949 529055 531868 534363 536285 537554 538699 540500 543020 545380
61711 545380 546710 547049 546984 546706 545856 544178 541818 538947 535547 531730 527991 524874 522483 520407 518054
61696 518054 514980 511073 506590 502051 498020 494889 492690 491031 489348 487408 485447 483667 481808 479546
61682 479546 477207 475612 475105 475121 474901 474281 473537 472736 471641 470192 468749 467767 467315 466953 466096 464571 462804
61665 462804 461299 459974 458278 455954 453381 451019 448941 447161 446038 445876 446351 446774 446845 446728 446567 446456
61649 446456 446876 448539 451507 454844 457429 458896 459622 460141 460867 462123 464019 466325 468668 470866 472924
61634D72924J838J387P04j64j271k588l770m250l712k475j395j166j671k149k119
61619D50123j867j882k150k337k384k449k385j911j313j340k181l118l518l648
61605D17640m060m677n049n244n720o380o447n510m140l206k985l223l655m081
61591C53263m176l729l015k566k611k955l317l429k990k028j204j183j599j354
61577C17107j90O67Q8j348k089j623q66o41p30o48n35p19j039j083p79k82L69
61560C05659J113J647J764J689J688J634J293P95M12J14j96k49K82J169J794J835
61544C22443J369N06n44j194r15J1P28Q74R45J476K393L243L652L432K651J746
61528C42816J110N65l50j563k442k678k555k301j830j309j235j611j762j386j087
$$ plain form
61634 472924 474762 476149 476853 476689 475418 472830 469060 464810 461098 458623 457228 456062 454391 452242 450123
61619 450123 448256 446374 444224 441887 439503 437054 434669 432758 431445 430105 427924 424806 421288 417640
61605 417640 413580 408903 403854 398610 392890 386510 380063 374553 370413 367207 364222 360999 357344 353263
61591 353263 349087 345358 342343 339777 337166 334211 330894 327465 324475 322447 321243 320060 318461 317107
61577 317107 316917 317584 317672 316324 314235 312612 311746 311105 310375 309727 309192 308473 307434 306351 305572 305290 305659
61560 305659 306772 308419 310183 311872 313560 315194 316487 317282 317694 317808 317612 317363 317645 318814 320608 322443
61544 322443 323812 324318 323774 322580 321665 321676 322404 323278 324223 325699 328092 331335 334987 338419 341070 342816
61528 342816 343926 344491 344141 342578 340136 337458 334903 332602 330772 329463 328228 326617 324855 323469 322382
61513C22382j293j411p58K35O17L23N0J3k25p58j056q62n82n40m88q4N52J043
61495C17158J112O82m3n46m33qQ1k57m86l23l0K74Q66J627J739P46n65j023m18
61476C20153N30J324K012K556K608K075J383R96J004J231J366R83j07j358j822
61461C34934j236l61k8j78k37j3K44M88R55J585J857J430N93j05l72j96L56J066
61443C40782J472J207M44j83j40N79J499K068K116J994K178K603K632J910J036
61428C62197J002J973L015L113K188R63J60KK57N36N94N30O88J210J800K044J913
61411C84185J783J903J978J432J47j181j669j232o93p43j101j079o82n55r00j113
61395C80480p48j95n9k95m54l88k95k04o2o7m11p29m26M40J162J352J350J461
$$ plain form
61513 322382 321089 319678 318920 319155 319772 320095 320145 320158 319933 319175 318119 317257 316675 316135 315647 315563 316115 317158
61495 317158 318270 318952 318909 318363 317930 317922 318003 317746 317260 316937 316907 317181 318047 319674 321413 322159 321594 320571 320153
61476 320153 320683 322007 324019 326575 329183 331258 332641 333637 334641 335872 337238 338221 338114 336756 334934
61461 334934 333698 333337 333309 333131 332894 332881 333125 333613 334568 336153 338010 339440 340033 339928 339556 339360 339716 340782
61443 340782 342254 343461 343905 343722 343582 344161 345660 347728 349844 351838 354016 356619 359251 361161 362197
61428 362197 363199 365172 368187 371300 373488 374451 374611 374613 374870 375406 376000 376530 377218 378428 380228 382272 384185
61411 384185 385968 387871 389849 391281 391428 390247 388578 387346 386653 385910 384809 383730 383048 382493 381593 380480
61395 380480 379732 379537 379478 379183 378729 378341 378046 377842 377780 377713 377302 376573 376147 376587 377749 379101 380451 381912
61377C81912J430J109J100K005L295L683K686J268O04P63R65P79M50K24m3m24
61361D01806o02l54K3J45J87O36J516K325K766L112L738M654N646O549P195P442
61345D46784P440P583P862P669O587N150M361M463M701M310L376K512K029J758
61331E16585J450J067O34J22l98o79o50o89j230k075k417j815q24l18m30m97O9
61314E07905J310K973M726O061O526O300O154O683P852R341J0935J2387J3353
61301F02506J3677J3433J2538J0733Q136N349K777K69k394n055p454r403j0461
61288F34651j0133q808p851q172r206r855r844r478q710p334n743m567l774k897
61274E28279j929j169m57N79J707K409K834L458L991L677K703K200K656L396L890
$$ plain form
61377 381912 383342 384451 385551 387556 390851 394534 397220 398488 399092 399855 400820 401599 402049 402273 402230 401806
61361 401806 401204 400850 400873 401018 401205 401841 403357 405682 408448 411560 415298 419952 425598 432147 439342 446784
61345 446784 454224 461807 469669 477338 483925 489075 493436 497899 502600 506910 510286 512798 514827 516585
61331 516585 518035 519102 519736 519858 519460 518781 518131 517442 516212 514137 511720 509905 509081 508763 508333 507836 507905
61314 507905 509215 512188 516914 522975 529501 535801 541955 548638 556490 565831 576766 589153 602506
61301 602506 616183 629616 642154 652887 661023 666372 669149 669418 667024 661969 654515 645112 634651
61288 634651 624518 615710 607859 599687 590481 580626 570782 561304 552594 545260 539517 534950 531176 528279
61274 528279 526350 525181 524724 525303 527010 529419 532253 535711 539702 543379 546082 548282 550938 554334 558224
61259E58224M475N443O419P067P535P775P335O319N575N387M904L599K268J742
61245F34067J476N25p77j293q68m78p79j511k221k661k480j455r0P29Q13P45R53
61228F24695J379K029L061M169M751M857N257O209O873O438N291M458M286M288
61214F88041M041L614L131K483J715J330J808K913L729L535K505J449R60J058
61200G22312J596K694M451O479Q027Q730R017R707J1171J2889J3884J3697J2840
61187H37494J2084J1382R894P225M172J927Q63M42K1o56j642k869m066m937n543
61172H65791o124o706p123p508q259r467j0690j1498j1929j2229j2442j2475j2426
61159G36915j2541j2873j3176j3134j2603j1678j0619r645q712p458n583l300
$$ plain form
61259 558224 562699 568142 574561 581628 589163 596938 604273 610592 616167 621554 626458 630057 632325 634067
61245 634067 635543 636068 635291 633998 633130 632652 631873 630362 628141 625480 623000 621545 621455 622184 622997 623742 624695
61228 624695 626074 628103 631164 635333 640084 644941 650198 656407 663280 669718 675009 679467 683753 688041
61214 688041 692082 695696 698827 701310 703025 704355 706163 709076 712805 716340 718845 720294 721254 722312
61200 722312 723908 726602 731053 737532 745559 754289 763306 773013 784184 797073 810957 824654 837494
61187 837494 849578 860960 870854 878079 882251 884178 885041 885483 885504 884848 883206 880337 876271 871334 865791
61172 865791 859667 852961 845838 838330 830071 820604 809914 798416 786487 774258 761816 749341 736915
61159 736915 724374 711501 698325 685191 672588 660910 650291 640646 631934 624476 618893 615593
61147F15593j266L7O93R82Q13m8j259k009k122k512l989n891o671n718l959k511
61131E80163j491l94R81K521M201N963P465Q388Q934R596J0687J2313J4541J7170
61117F81038J9602K1383K2752K4203K5675K6587K6668K6256K5763K5178K4250
61106I49355K2831K0967J8910J7083J5829J5008J3957J1954Q786M968J304j944
61094A099008n406r797j4737j8923k1588k3269k4754k5867k6055k5677k5713k6291
61082H50931k6394k5295k3494k1855k0471j8907j7160j5692j4629j3507j1937
61071F41590j0179q822q021p312o182m617k976j548m39K34M60O33J348K674M029
61056F00872M927N531O177O790P165P497Q115Q919R653J0578J2303J4893J7602
$$ plain form
61147 615593 614327 614364 615057 616039 616852 616804 615545 613536 611414 608902 604913 599022 592351 586633 582674 580163
61131 580163 578672 578278 579259 581780 585981 591944 599409 607797 616731 626327 637014 649327 663868 681038
61117 681038 700640 722023 744775 768978 794653 821240 847908 874164 899927 925105 949355
61106 949355 972186 993153 1012063 1029146 1044975 1059983 1073940 1085894 1094680 1099648 1100952 1099008
61094 1099008 1093602 1083805 1069068 1050145 1028557 1005288 980534 954667 928612 902935 877222 850931
61082 850931 824537 799242 775748 753893 733422 714515 697355 681663 667034 653527 641590
61071 641590 631411 622589 614568 607256 601074 596457 593481 591933 591494 591728 592188 592821 594169 596843 600872
61056 600872 605799 611330 617507 624297 631462 638959 647074 655993 665646 676224 688527 703420 721022
61043G21022J9638K0801K1378K1847K2754K4406K6416K7867K8236K7996K8101
61032I90462K9063L0678L2526L4366L6019L7281L8214L9370M1227M3411M4989
61021A397606M5798M6925M9364N2742N6267O0537O7253P7108Q9184J02788J18689
61010B164261J38053J61340J89020K22322K62316L09250L63902M28627N05761
61001D744852N95745O98299Q14920R48851J103046J278486J470501J660500J809822
60992A5125022J867728J793481J576270J239223Q31446M19231P6000j38213k04693
60983B2585495j60772q4860o0419j44279l54764o73944j053093j422005j709005
60974A6922354j866867j887439j794789j626222j417893j200089r95682q17592
$$ plain form
61043 721022 740660 761461 782839 804686 827440 851846 878262 906129 934365 962361 990462
61032 990462 1019525 1050203 1082729 1117095 1153114 1190395 1228609 1267979 1309206 1352617 1397606
61021 1397606 1443404 1490329 1539693 1592435 1648702 1709239 1776492 1853600 1942784 2045572 2164261
61010 2164261 2302314 2463654 2652674 2874996 3137312 3446562 3810464 4239091 4744852
61001 4744852 5340597 6038896 6853816 7802667 8905713 10184199 11654700 13315200 15125022
60992 15125022 16992750 18786231 20362501 21601724 22433170 22852401 22928401 22790188 22585495
60983 22585495 22424723 22339863 22279444 22135165 21780401 21106457 20053364 18631359 16922354
60974 16922354 15055487 13168048 11373259 9747037 8329144 7129055 6133373 5315781
60966E315781o68735n46409m47039l67365l03875k53248k13092j81528j56686
60957B177804j37124j21855j09378r7687q5931p5092o6179n8672n1615m5192m0092
60946A288987l6140l2802l0412k9512k9403k8720k7289k6123k5620k4941k3422
60935I74603k1567k0219j9505j8923j8055j6888j5720j4892j4396j3874j3200
60924G87364j2698j2419j1694r992p895o545o297o493o337n417l656j409N70J891
60910F98973L098M905P119Q957J0197J1252J2391J3684J5501J8128K0935K2854
60898H47994K3762K4625K6218K8410L0768L3030L4833L5775L5989L6105L6419
60887A193928L6591L6121L4585L1502K6777K1221J5802J0361L965l401j0544j6703
$$ plain form
60966 5315781 4647046 4100637 3653598 3286233 2982358 2729110 2516018 2334490 2177804
60957 2177804 2040680 1918825 1809447 1711760 1625829 1550737 1484558 1425886 1374271 1329079 1288987
60946 1288987 1252847 1220045 1189633 1160121 1130718 1101998 1074709 1048586 1022966 998025 974603
60935 974603 953036 932817 913312 894389 876334 859446 843726 828834 814438 800564 787364
60924 787364 774666 762247 750553 740561 732666 726121 719824 713331 706994 701577 697921 696512 697082 698973
60910 698973 702071 706976 714095 723052 733249 744501 756892 770576 786077 804205 825140 847994
60898 847994 871756 896381 922599 951009 981777 1014807 1049640 1085415 1121404 1157509 1193928
60887 1193928 1230519 1266640 1301225 1332727 1359504 1380725 1396527 1406888 1410853 1407452 1396908 1380205
60875A380205k2349k7880l2565l5543l7048l7919l8441l8390l7698l6441l4581
60864A001350l2274l0003k7962k5795k3443k1622k0789k0244j9049j7427j6348
60853G46394j6071j5959j5604j5204j4826j4171j3160j2115j1155j0071r000q574
60841E90484r052r797j0037r760r475r350r084q567q183q267q496q162o988n506
60827D69760m450l960l588k992k292j686j063k42O19J207J501J823K356K891L101
60812D62985K944K690K562K528K527K718L259L802L641K640J593J242J273Q87
60798D97291J37k02j1j17r09j586j435j009j269k110k653k650k613k740k654k332
60782D73138k335k912l584l963m372n193o113o478o158n644n442n638n858n546
$$ plain form
60875 1380205 1357856 1329976 1297411 1261868 1224820 1186901 1148460 1110070 1072372 1035931 1001350
60864 1001350 969076 939073 911111 885316 861873 840251 819462 799218 780169 762742 746394
60853 746394 730323 714364 698760 683556 668730 654559 641399 629284 618129 608058 599058 590484
60841 590484 581432 571635 561598 551838 542363 533013 523929 515362 507179 498912 490416 482254 475266 469760
60827 469760 465310 461350 457762 454770 452478 450792 449729 449487 450106 451313 452814 454637 456993 459884 462985
60812 462985 465929 468619 471181 473709 476236 478954 482213 486015 489656 492296 493889 495131 496404 497291
60798 497291 497428 497226 497215 497098 496189 494603 493168 492159 490890 488780 486127 483477 480864 478124 475470 473138
60782 473138 470803 467891 464307 460344 455972 450779 444666 438188 432030 426386 420944 415306 409448 403902
60768D03902m448k986j859j172l44Q74J750J400N1j133j278m14R97K490L415L135
60752D04380J873Q98J294K712L839L997L755L944M607N151N141M595L774K935
60738D52895K192J396K84j015k007k550l277m723o250o560n396m095m052n136
60724D11706o073n988n155m358m137m537n195n532n212m450l740l325l220l475
60710C47309l953l965k781p05R18J163N71K96N93P35K29n18q87p80m72o0N33J204
60692C39430J657J709J469J207J144J310J583J864K171K528K806K854K794K972
60678C67498L587M565N757O964P710P463O336N191M776M972N280N591O031O283
60664D48004N774M468K930J540K69p78j264j269j452k184l032l468l534l424k898
$$ plain form
60768 403902 399454 396468 394609 393437 393093 393967 395717 397117 397168 396035 394757 394343 395340 397830 401245 404380
60752 404380 406253 407151 408445 411157 414996 418993 422748 426692 431299 436450 441591 446186 449960 452895
60738 452895 455087 456483 456767 455752 453745 451195 447918 443195 436945 430385 424989 420894 416842 411706
60724 411706 405633 399645 394490 390132 385995 381458 376263 370731 365519 361069 357329 354004 350784 347309
60710 347309 343356 339391 336610 335905 336823 337986 338557 338853 339446 340181 340410 339892 339005 338225 337753 337693 338226 339430
60692 339430 341087 342796 344265 345472 346616 347926 349509 351373 353544 356072 358878 361732 364526 367498
60678 367498 371085 375650 381407 388371 396081 403544 409880 415071 419847 424819 430099 435690 441721 448004
60664 448004 453778 458246 461176 462716 462985 462207 460943 459674 458222 456038 453006 449538 446004 442580 439682
60649D39682j768o10l00q99j571j659j403j488k234l330m182m465m449m661n148
60634D01515n275m484l045j811j399j825k617l035k489j195j89k19q80j251j092
60619C70709p44k32P39J883K363J928J293J084J029O21k0m19m95m90m35j54L26
60602C78986P26Q72Q08O26L73J76K47P27J465J995J932J487J337J720J980J461
60586C96918N53K46P68J397J580J431J068L37m73n42L72J431J859J925K259K868
60570D13997L592M771O626Q428R324R582R996J0417J0006Q849Q013P828P297N690
60556E24416L547J594l17k424m078m586m401m418m388l228p90J742L495M894O561
60541E17619Q098Q805R059J0078J2333J4922J6631J7052J6481J5209J3371J1178
$$ plain form
60649 439682 437914 437304 437004 436105 434534 432875 431472 429984 427750 424420 420238 415773 411324 406663 401515
60634 401515 396240 391756 388711 386900 385501 383676 381059 378024 375535 374340 374151 373932 373052 371801 370709
60619 370709 369965 369733 370472 372355 374718 376646 377939 379023 380052 380673 380653 380234 379739 379249 378814 378660 378986
60602 378986 379712 380584 381392 382018 382391 382567 382814 383541 385006 387001 388933 390420 391757 393477 395457 396918
60586 396918 397471 397717 398485 399882 401462 402893 403961 404298 403825 403283 403655 405086 406945 408870 411129 413997
60570 413997 417589 422360 428986 437414 446738 456320 466316 476733 486739 495588 503601 511429 518726 524416
60556 524416 527963 529557 529240 526816 522738 518152 513751 509333 504945 501717 500927 502669 506164 511058 517619
60541 517619 525717 534522 543581 553659 565992 580914 597545 614597 631078 646287 659658 670836
60529F70836Q822O197L052n36l993o608p942p976p123o082n458n342n369n198
60515F27280m791m255l608k812j895r05Q5R57J703K638M251O614R183J1360J3163
60500F58968J5178J7922K1375K5061K8457L1399L4201L7210M0163M2198M2667
60489I94799M1759L9940L7000L2147K5058J6408P116k513j2531k2473l1303l8280
60477A087127m3472m7238m9443m9625m7793m4680m1097l7300l3207k8963k4988
60466F39321k1521j8453j5637j3159j1213r862q994q381p809p229o779o562o385
60453D97337n985n426n041m914m715m210l661l482l621l551k876j778q28l95l10
60438D46544j31K34L52j34q67j120p59m38o74j172j368j278j346j602j574j091
$$ plain form
60529 670836 679658 685855 688907 688371 684378 677770 669828 661852 654729 648647 643189 637847 632478 627280
60515 627280 622489 618234 614626 611814 609919 609014 609099 610056 611759 614397 618648 625262 634445 645805 658968
60500 658968 674146 692068 713443 738504 766961 798360 832561 869771 909934 952132 994799
60489 994799 1036558 1076498 1113498 1145645 1170703 1187111 1194227 1191714 1179183 1156710 1125407 1087127
60477 1087127 1043655 996417 946974 897349 849556 804876 763779 726479 693272 664309 639321
60466 639321 617800 599347 583710 570551 559338 549476 540482 532101 524292 517063 510284 503722 497337
60453 497337 491352 485926 480885 475971 471256 467046 463385 459903 456282 452731 449855 448077 447249 446854 446544
60438 446544 446413 446647 446999 446865 445998 444878 444119 443681 443007 441835 440467 439189 437843 436241 434667 433576
60422D33576o67q04j265j378q98k69nq8q9L36J172K134K813K844K130J051K33
60405D40826R5O05J461K266K589K196J333O48O08J202K218L449M512M814M136
60390D72958K938J854J115P91J111K030K848K952K715K943L581L767L200K532
60376E07335K259K091J807J881K698L705L994L404K530J910J669J723J880J888
60362E40774J660J389J258J289J558K145K768K919K689K904M072N713P072Q030
60348E86240Q803R326R515R728J0167J0179Q929O627M375K707J063j206l873o136
60334F56444p465p948q038q063p947p430o648o216o421o652o072m726l516l173
60320E66129l644m382m805m483l355j822m01P62J802K691L312L863M834O522Q770
$$ plain form
60422 433576 432909 432105 430840 429462 428564 428295 428290 428202 428113 428449 429621 431755 434568 437412 439542 440593 440826
60405 440826 440921 441526 442987 445253 447842 450038 451371 452019 452627 453829 456047 459496 464008 468822 472958
60390 472958 475896 477750 478865 479656 480767 482797 485645 488597 491312 494255 497836 501603 504803 507335
60376 507335 509594 511685 513492 515373 518071 521776 525770 529174 531704 533614 535283 537006 538886 540774
60362 540774 542434 543823 545081 546370 547928 550073 552841 555760 558449 561353 565425 571138 578210 586240
60348 586240 595043 604369 613884 623612 633779 643958 652887 659514 663889 666596 667659 666453 662580 656444
60334 656444 648979 641031 632993 624930 616983 609553 602905 596689 590268 583616 577544 572818 569302 566129
60320 566129 562485 558103 553298 548815 545460 543638 543237 543999 545801 548492 551804 555667 560501 567023 575793
60305E75793J1193J3443J5418J7360J9583K1796K3043K2624K0844J8352J4961
60294G74410R743K335o272j4271k0134k3306k4257k3901k2690k0462j7272j4010
60282E99913j1635j0171q933p558o217n088m242l936m306m821m725m056l562l613
60268E17050l802l742l573l522l471l181k585j781j073r06j326j655j286o52n84
60253D83911r30p73p8K9r47j897j583l08O45O92K34k99q64j361j490j120m16L97
60235D73842J128J562J600J517J781K583L648M459M698M409L793K890J763R37
60221E10610J170K382L404L334K759K829L559M012L946M114M854N585O020O695
60207E65273P759Q314P733O778O550O973P141O688O003N447N042M754M427L742
$$ plain form
60305 575793 586986 600429 615847 633207 652790 674586 697629 720253 741097 759449 774410
60294 774410 784153 786488 780216 765945 745811 722505 698248 674347 651657 631195 613923 599913
60282 599913 588278 578107 569174 561616 555399 550311 546069 542133 537827 533006 528281 524225 520663 517050
60268 517050 513248 509506 505933 502411 498940 495759 493174 491393 490320 489414 488088 486433 485147 484495 483911
60253 483911 482981 482208 482130 482159 481212 479315 477732 477424 478069 478761 478995 478696 477832 476471 474981 473861 473445 473842
60235 473842 474970 476532 478132 479649 481430 484013 487661 492120 496818 501227 505020 507910 509673 510610
60221 510610 511780 514162 517566 520900 523659 526488 530047 534059 538005 542119 546973 552558 558578 565273
60207 565273 573032 581346 589079 595857 602407 609380 616521 623209 629212 634659 639701 644455 648882 652624
60193F52624K661J685J236J130J011P66K23r54k492l400l257k977l507m419m763
60178F35567m673m958n490n331m347l448l130k930k525k273k333k206j684j301
60164E88938j426j618j444j224j364j531j225p09o79j192j624j501r20j68N59
60149E72872J094J376J657K182K699K666K132J925K658L799M212L594K904L248
60135F09018M638O219P351Q044Q450Q466Q019P294O417N182L399J367k42r28p63
60120F81931l00j09k16r3O10J441J651J219P85N84J85m78o73KP44N57l73j107
60102F86360j382j771k631l582m136m101l462k400j440r93p80k06P81J708K357
60087F64322K877L194L089K857L052L447L076J698L66O8M30L93l36j213j909k748
$$ plain form
60193 652624 655285 656970 658206 659336 660347 661113 661336 660382 657890 654490 651233 648256 644749 640330 635567
60178 635567 630894 625936 620446 615115 610768 607320 604190 601260 598735 596462 594129 591923 590239 588938
60164 588938 587512 585894 584450 583226 581862 580331 579106 578397 577718 576526 574902 573401 572481 572313 572872
60149 572872 573966 575342 576999 579181 581880 584546 586678 588603 591261 595060 599272 602866 605770 609018
60135 609018 613656 619875 627226 635270 643720 652186 660205 667499 673916 679098 682497 683864 683622 682694 681931
60120 681931 681631 681522 681306 681213 681823 683264 684915 686134 686919 687503 687688 687210 686537 686539 687283 687840 687467 686360
60102 686360 684978 683207 680576 676994 672858 668757 665295 662895 661455 660462 659682 659476 660257 661965 664322
60087 664322 667199 670393 673482 676339 679391 682838 685914 687612 687978 688046 688476 688869 688533 687320 685411 682663
60071F82663m119n977p940r565j0515j0730j0488j0135r816r470q971q203p164
60058E69570o105n338m830m289l760l698m240m679m186k767j208j63L66P29J260
60043E26662K130L244M241M853N223N609N827N449M632M200M578M980M214K210
60029E88052J90p68r03j213k139l254m173n083o203p146p334o845o401o417o490
60014E23873o008m969l901l150k604k134j904k024k189j999j547j310j436j504
60000D87194j147o03l68n58q40q84n95n1N36R42J271J938K973L667L466K920K990
59983E02851L504L264J881N47M34J134J376P21k26r12j323j566j700j916k346
59968E05723k663k387j560p08j09M33J221K355L696M753M833L818K618K264K706
$$ plain form
60071 682663 678544 672567 664627 655062 644547 633817 623329 613194 603378 593908 584937 576734 569570
60058 569570 563465 558127 553297 549008 545248 541550 537310 532631 528445 525678 524470 524307 524673 525402 526662
60043 526662 528792 532036 536277 541130 546353 551962 557789 563238 567870 572070 576648 581628 585842 588052
60029 588052 588242 587474 586571 585358 583219 579965 575792 570709 564506 557360 550026 543181 536780 530363 523873
60014 523873 517865 512896 508995 505845 503241 501107 499203 497179 494990 492991 491444 490134 488698 487194
60000 487194 486047 485444 485076 484518 483678 482794 482199 482148 482684 483626 484897 486835 489808 493475 496941 499861 502851
59983 502851 506355 509619 511500 512047 512481 513615 514991 515712 515486 514574 513251 511685 509985 508069 505723
59968 505723 503060 500673 499113 498405 498296 498729 499950 502305 506001 510754 515587 519405 522023 524287 526993
59953E26993L015K709K135J608R96K96j05j52l59r26j183n28N48J031P39M31O31
59936E37879R46P66J22m75p91j062j494j824j547m73R78K034K175J622J242J714
59920E41812K746L351L081K622K889L836M769N434O137O832P080P003P240P618
59906F12450O871M397J437m09j064j505j996k059j792j908k404k409j567o40l69
59891F07033m97k93N54J876L305M418N002N278N508N459M850M121M039M544M879
59876F60076M847M999N373N091L675J833M12o41j730k768l576m520n964p472q222
59861F51413p892o690m959l249k332k460k926k869k292j734j284n87M22J420K330
59846F16311L490N139P013Q509R074Q541P256N777M340K953J915J696K132K352
$$ plain form
59953 526993 530008 532717 534852 536460 537456 537752 537647 537495 537136 536210 535027 534499 535047 536078 536817 537248 537879
59936 537879 538825 539591 539713 539238 538447 537385 535891 534067 532520 532047 533025 535059 537234 538856 540098 541812
59920 541812 544558 547909 550990 553612 556501 560337 565106 570540 576677 583509 590589 597592 604832 612450
59906 612450 619321 623718 625155 624746 623682 622177 620181 618122 616330 614422 612018 609609 608042 607402 607033
59891 607033 606536 606243 606797 608673 611978 616396 621398 626676 632184 637643 642493 646614 650653 655197 660076
59876 660076 664923 669922 675295 680386 684061 685894 686306 685665 683935 681167 677591 673071 667107 659635 651413
59861 651413 643521 636831 631872 628623 626291 623831 620905 618036 615744 614010 612726 612139 612561 613981 616311
59846 616311 619801 624940 631953 640462 649536 658077 665333 671110 675450 678403 680318 682014 684146 686498
59832F86498J965J567J618J360k76l087n702p096p339p040o777o943p469p679
59818F33600p010n856n130n054m950m226k956j498j67O52O67J32l71p54j457k581
59802E93041l616m271m873n510n453m123k240j271j728k620k695j679j92J073
59788E53843J707J526O98q7q9O43J206Q59q2p30q06q65j337j875j895j422r65
59771E50329p64n33O2R20J589J742J521J417J737K218K303J830J256J151J693
59756E68471K626L553M140M402M789N750P030P766P478O651O071N938N947N965
59742F46577O112O306O214N666M838L929K924J737N37k46k48M56J347J854J754
59727F89757J118J56p19r73n02J02L12M21Q82J165L55j193j983j535j123j644
$$ plain form
59832 686498 688463 690030 691648 693008 692732 689645 683943 676847 669508 662468 655691 648748 641279 633600
59818 633600 626590 620734 615604 610550 605600 601374 598418 596920 596753 597405 598072 598204 597833 597079 595622 593041
59802 593041 589425 585154 580281 574771 569318 565195 562955 561684 559956 557336 554641 552962 552770 553843
59788 553843 555550 557076 557774 557687 557598 558241 559447 560306 560224 559494 558688 557823 556486 554611 552716 551294 550329
59771 550329 549565 549032 549094 550014 551603 553345 554866 556283 558020 560238 562541 564371 565627 566778 568471
59756 568471 571097 574650 578790 583192 587981 593731 600761 608527 616005 622656 628727 634665 640612 646577
59742 646577 652689 658995 665209 670875 675713 679642 682566 684303 684840 684594 684346 684802 686149 688003 689757
59727 689757 690875 691031 690312 689339 688837 688939 689251 689672 690554 691719 692074 690881 688898 687363 686240 684596
59711F84596k096j264O3J84q85j485q57N1N24J223K709M121M296L476K959L558
59695G01173N136P200R143J0096R470P714N954M631L010L98k522m204m099l406
59681G49694l548m308m213k733j239j338k932m586n316n333n323n751o742p944
59667F88388q514p887o580n591n146m612l649k598j683o72L99J031J124J380K263
59652F47653L239L573L380L280L334L016K058P61n14j720k955m190n196n677n591
59637F44451n402n709o423o638n586l557j597m95k96o03j016j344j637k018k402
59622E99728k585k572k601k744k808k810l136l930m719m969m704m208l428k239
59608E52275j006l23k45k68j31q7l36o28o04j83N02J263J763J676J112P23J078
$$ plain form
59711 684596 682500 681236 681299 681483 680598 679113 678256 678307 678831 680054 682763 686884 691180 694656 697615 701173
59695 701173 706309 713509 722652 732748 742218 749932 755886 760517 763527 763925 761403 757199 753100 749694
59681 749694 746146 741838 737625 734892 733653 732315 729383 724797 719481 714148 708825 703074 696332 688388
59667 688388 679874 671987 665407 659816 654670 650058 646409 643811 642128 641456 641855 642886 644010 645390 647653
59652 647653 650892 654465 657845 661125 664459 667475 669533 670294 669780 668060 665105 660915 655719 650042 644451
59637 644451 639049 633340 626917 620279 614693 611136 609539 609044 608748 608145 607129 605785 604148 602130 599728
59622 599728 597143 594571 591970 589226 586418 583608 580472 576542 571823 566854 562150 557942 554514 552275
59608 552275 551269 550946 550701 550433 550302 550215 549879 549251 548647 548464 548966 550229 551992 553668 554780 555503 556581
59591E56581K065L065L534L325K656J980J668J601J129k40k175l736m318m139
59577E62996l801l615l546l586l866m368m723m506l721k908k643k923l140k799
59563E12851k128j717j616j171j5J195J450O75j76k94J97P69J309K000K772L341
59547E19442L668M019M547N132N620O004O342O687P157P949R219J1017J3213J5327
59533F25343J6505J5911J3230Q860L716j105m674o525o665n327k954l07J737K787
59519F60532L128L157K897K269J371K30j386l422n195o154o655p376q161q227
59505F27008p428o548o202o198o144o024n795n135l967k748j798p81P03K389L680
59490E75012M380M647M557M153L720L544L620L943M800O260P748Q699R448J0726
$$ plain form
59591 556581 558646 561711 565245 568570 571226 573206 574874 576475 577604 577364 575189 571453 567135 562996
59577 562996 559195 555580 552034 548448 544582 540214 535491 530985 527264 524356 521713 518790 515650 512851
59563 512851 510723 509006 507390 506219 506204 507399 508849 509524 509348 509054 509251 510020 511329 513329 516101 519442
59547 519442 523110 527129 531676 536808 542428 548432 554774 561461 568618 576567 585786 596803 610016 625343
59533 625343 641848 657759 670989 679849 683565 682460 677786 671261 664596 659269 656315 656008 657745 660532
59519 660532 663660 666817 669714 671983 673354 673584 672198 668776 663581 657427 650772 643396 635235 627008
59505 627008 619580 613032 606830 600632 594488 588464 582669 577534 573567 570819 569021 568240 568943 571332 575012
59490 575012 579392 584039 588596 592749 596469 600013 603633 607576 612376 618636 626384 635083 644531 655257
59476F55257J2371J3416J3487J3299J3371J3088J1603R100O332L397j53m034o980
59463G53554q017p388n904l997j808L53K307M460P294J0494J3146J4849J6018
59450G95361J7032J7681J7710J7385J7110J6784J5896J3984J0787O281Q86m575
59438I42322r438j3550j6826j8879j9500j9196j8684j8083j7137j5980j5115j4600
59426G45334j3916j2696j1055r096o615l458K08M109P959J1331J3931J6047J8308
59413G60391K0850K3239K5185K6748K7574K6592K2881J6479Q071j390j0420j7022
59401I29178j9831j9040j5713j0641m553J001M080L812P50m264j0753j7912k4138
59388H11976k7919k8853k7436k4344k0378j6564j3538j0954q176n412l467k389
$$ plain form
59476 655257 667628 681044 694531 707830 721201 734289 745892 754992 761324 764721 764568 760534 753554
59463 753554 745537 738149 732245 728248 726440 726793 729100 733560 740854 751348 764494 779343 795361
59450 795361 812393 830074 847784 865169 882279 899063 914959 928943 939730 946011 946897 942322
59438 942322 932884 919334 902508 883629 864129 844933 826249 808166 791029 775049 759934 745334
59426 745334 731418 718722 707667 698571 691956 688498 688706 692815 700774 712105 726036 742083 760391
59413 760391 781241 804480 829665 856413 883987 910579 933460 949939 958010 956620 946200 929178
59401 929178 909347 890307 874594 863953 859400 860401 864481 868293 869043 864779 854026 836114 811976
59388 811976 784057 755204 727768 703424 683046 666482 652944 641990 633814 628402 624935 622546
59376F22546j237N22K209L026L231L513L735L222K163J685K411L707M611M812
59362F60156M479L848L398L815N205O770P747Q315R145J0479J2123J3878J5427
59349G64785J6260J6391J6738J8063J9800K0755K0678K0276J9772J8579J6455
59338I68552J4028J1760R224N874J881k230o241j0013j3060j4949j5953j6888
59326I31985j8268j9778k0505j9757j7824j5895j4878j4446j3592j1965j0135
59315G54942q582p193n825m708m009l517k980k320j379l2J380K368L159M496O348
59300G32148P677P934P967Q838J0435J1844J2489J2142J0361O849K101k949p730
59287H20106j1928j4966j6354j6346j5609j4381j2528j0217p863n560l214j089
$$ plain form
59376 622546 621309 621831 624040 627066 630297 633810 637545 640767 642930 644615 647026 650733 655344 660156
59362 660156 664635 668483 671881 675696 680901 687671 695418 703733 712878 723357 735480 749358 764785
59349 764785 781045 797436 814174 832237 852037 872792 893470 913746 933518 952097 968552
59338 968552 982580 994340 1003564 1009438 1011319 1009089 1002848 992835 979775 964826 948873 931985
59326 931985 913717 893939 873434 853677 835853 819958 805080 790634 777042 765077 754942
59315 754942 746360 739167 733342 728634 724625 721108 718128 715808 714429 714397 715777 718145 721304 725800 732148
59300 732148 739825 747759 755726 764564 774999 786843 799332 811474 821835 828684 830785 827836 820106
59287 820106 808178 793212 776858 760512 744903 730522 717994 707777 699914 694354 691140 690051
59275F90051M23J594L213N560Q007R775J0641J0880J0877J0833J0553R582P833
59262G89822N879M152K223m90l488n576o520p428r138j1022j1909j1605j0844
59249G24056j0091r133p751o159m656l295k101j253q18m98M7P64J362J870K659
59234F85003L781M652M701M091L420K870K080P85q34k447l809m635m773m559m591
59219F85735m940n106m831m457m217l767k833j802j235j079q79m32J93R43J641
59204F52934J889J582J258J456K012K385K466K508K537K392K162K041J865J365
59190F80852Q11Q07J402J879J587O72r2o4O29J111O85k31n06J54P59N50K24Q48
59172F92077K137K883K788K720L253M019M667N412O351P063P307P340P307P001
$$ plain form
59275 690051 690474 692068 695281 700841 708848 718623 729264 740144 751021 761854 772407 781989 789822
59262 789822 795701 799853 802076 801586 798098 792522 786002 778574 769436 758414 746505 734900 724056
59249 724056 713965 704832 697081 690922 686266 682971 680870 679617 678799 678301 678348 679112 680474 682344 685003
59234 685003 688784 693436 698137 702228 705648 708518 710598 711383 710549 708102 704293 699658 694885 690326 685735
59219 685735 680795 675689 670858 666401 662184 658417 655584 653782 652547 651468 650589 650157 650350 651293 652934
59204 652934 654823 656405 657663 659119 661131 663516 665982 668490 671027 673419 675581 677622 679487 680852
59190 680852 681663 682470 683872 685751 687338 688010 687918 687854 688483 689594 690279 690048 689542 689696 690455 691005 691229 692077
59172 692077 694214 697097 699885 702605 705858 709877 714544 719956 726307 733370 740677 748017 755324 762325
59158G62325O498O232O025M921K544m7j584k167k862m148n536o499p035p248p109
59143G44310o777o719p186p850q152p923p506p375p646p977p947p491o876o297
59129F40588n591m490l017j579o63l62j50O85K274L951N094N955P262R052J0412
59114F69421J0560R764Q912Q490Q285P913P256O449N734N360N403N539N171M008
59100G68265K560J813K158K735K222M01j517k355k383k710l593m098l549k570
59086G57379k199k480k552k095j978l145n185o590o485n644n526o510p697q229
59072F91064q145p736o773n016l051j907j905k464k989l430l897m221m158l721
59058F31651l117k579k329k501k919l082k498j101N88J723J788J176Q52J220J556
$$ plain form
59158 762325 768823 775055 781080 786001 788545 788498 786914 784747 781885 777737 772201 765702 758667 751419 744310
59143 744310 737533 730814 723628 715778 707626 699703 692197 684822 677176 669199 661252 653761 646885 640588
59129 640588 634997 630507 627490 625911 625248 624886 624736 625421 627695 631646 636740 642695 649957 659009 669421
59114 669421 679981 689745 698657 707147 715432 723345 730601 737050 742784 748144 753547 759086 764257 768265
59100 768265 770825 772638 774796 777531 779753 780154 778637 776282 773899 771189 767596 763498 759949 757379
59086 757379 755180 752700 750148 748053 746075 742930 737745 731155 724670 719026 713500 706990 699293 691064
59072 691064 682919 675183 668410 663394 660343 658436 656531 654067 651078 647648 643751 639530 635372 631651
59058 631651 628534 625955 623626 621125 618206 615124 612626 611525 612113 613836 615624 616800 617652 618872 620428
59043F20428Q68q48k595l446l318k680k009j511j109n28L64J330J985K252K445
59028F11628L019M264O098P985R304J0050J0826J1988J3114J3678J3831J3951
59016G29736J3760J2603J0523Q386O865N803M621K907N49k198m601n828n672m738
59002G72716l810l198k627j581J76K214L647L921L316K539K079K069K368K448
58988G86277J625n8j596k086j736j397j484j914k554l047k652j120O40J703K519
58973G73120M184O613Q699J0097J1563J3288J4324J4046J3120J2450J2073J1630
58961I05207J1154J0692R814Q099N673K941J89k339m538o827r765j3059j5656
58948I01585j7023j7619j7872j7600j6745j5775j4814j3282j1001q849p591o777
$$ plain form
59043 620428 621296 620448 617853 614407 611089 608409 606400 604889 603780 603252 603616 604946 606931 609183 611628
59028 611628 614647 618911 625009 632994 642298 652348 663174 675162 688276 701954 715785 729736
59016 729736 743496 756099 766622 775008 781873 787676 792297 795204 795753 793555 788954 783126 777454 772716
59002 772716 768906 765708 763081 761500 761676 763890 767537 771458 774774 777313 779392 781461 783829 786277
58988 786277 787902 787844 786248 784162 782426 781029 779545 777631 775077 772030 769378 768258 768898 770601 773120
58973 773120 777304 783917 792616 802713 814276 827564 841888 855934 869054 881504 893577 905207
58961 905207 916361 927053 936867 944966 950639 953580 953769 951430 946892 940065 930300 917241 901585
58948 901585 884562 866943 849071 831471 814726 798951 784137 770855 759854 751005 743414 736637
58936G36637n565l986k642j670q44k33m2o3K1R0q3l28m24n88j070j622j987k426
58918G13175l210l917l947l357k571j639m20Q25J746K458L182L681L844M382O043
58903G20275Q348J0085J0971J1828J3071J4096J4434J4556J4984J5355J4988J3966
58891H76957J3030J2677J2812J3195J3824J4769J5873J6749J7120J7057J6753
58880A040816J5992J4148J0926O956L254K11k567n480q416j1027j3144j4732j5685
58867A021252j5948j5636j4870j3593j1790r887q620q360q709q964q968r192r991
58854H76724j1074j1916j2338j2426j2140j1427j0520r707q908p913o885o243
58842G55227o114o301o663p120p421p526p933q929r711r148p466o201o180o508
$$ plain form
58936 736637 731072 727086 724444 722774 721930 721697 721655 721592 721613 721703 721620 721292 720868 720280 719210 717588 715601 713175
58918 713175 709965 706048 702101 698744 696173 694534 694114 694939 696685 699143 702325 706006 709850 714232 720275
58903 720275 728623 738708 749679 761507 774578 788674 803108 817664 832648 848003 862991 876957
58891 876957 889987 902664 915476 928671 942495 957264 973137 989886 1007006 1024063 1040816
58880 1040816 1056808 1070956 1081882 1088838 1092092 1092303 1089736 1084256 1075840 1064813 1051669 1036937 1021252
58867 1021252 1005304 989668 974798 961205 949415 939528 930908 922548 913839 904875 895907 886715 876724
58854 876724 865650 853734 841396 828970 816830 805403 794883 785176 776268 768355 761470 755227
58842 755227 749113 742812 736149 729029 721608 714082 706149 697220 687509 678361 670895 664694 658514 652006
58828F52006n968m556l093j987j111l76K13Q56J690K542L228L812M272M297L839
58813F59664L413L467L757L771L413K914K400J871J337O51m72j953l230l929m234
58798F72840m413m377m071l780l728l814m043m638n334n234l938k282j351j171
58784F20666r44k04R04K165L449M504N089N244N132M799M301L762L089K009O15
58769F64580o49j729l068m709n972o427o477o488o076m909l531k636k125j565
58755F08219j007n93P7J305K511K909K565K029J397O15K58R74K334L272L582M061
58739F34508N160O349O880O634O079N845O196O653O401N489N031N668O461O203
58725G19557N211M786N194N441M917M186L993M431N283O344P194P308O722O063
$$ plain form
58828 652006 646038 641482 638389 636402 635291 634915 635128 635984 637674 640216 643444 647256 651528 655825 659664
58813 659664 663077 666544 670301 674072 677485 680399 682799 684670 686007 686658 686186 684233 681003 677074 672840
58798 672840 668427 664050 659979 656199 652471 648657 644614 639976 634642 629408 625470 623188 621837 620666
58784 620666 619722 619518 620422 622587 626036 630540 635629 640873 646005 650804 655105 658867 661956 663965 664580
58769 664580 663931 662202 659134 654425 648453 642026 635549 629061 622985 618076 614545 611909 609784 608219
58755 608219 607212 606619 606696 608001 610512 613421 615986 618015 619412 620027 620285 621259 623593 626865 630447 634508
58739 634508 639668 646017 652897 659531 665610 671455 677651 684304 690705 696194 701225 706893 713354 719557
58725 719557 724768 729554 734748 740189 745106 749292 753285 757716 762999 769343 776537 783845 790567 796630
58711G96630N762N619N137L990K197K24j348k614m474p437j0665j2917j4118j5227
58697G50759j6805j8517j9888k0658k0490j9166j7230j5604j4489j3221j1386
58686E63305r405p844o738n820n006m408m040l757l390l004k913l163l077j937
58672D98803j86Q41O82M76J372L077M667N990P387Q669R367R549R503R035P900
58657E77132O432M936L028N33j672k716l085l785m785n431n851o515o899o104
58643E45218m537l549l475l436k953k402j834q34L57R15Q45J027J741K284K290
58628E31657K210K266K019J259L37n22j287j473n55R38J874K132K572L462M145
58613E51034M387M703N168N260N053N214N518M851L046J392P71O59M03J60j9o70
$$ plain form
58711 796630 802392 808011 813148 817138 819335 819559 818211 815597 811123 803686 793021 780104 765986 750759
58697 750759 733954 715437 695549 674891 654401 635235 618005 602401 587912 574691 563305
58686 563305 553900 546056 539318 533498 528492 524084 520044 516287 512897 509893 506980 503817 500740 498803
58672 498803 498617 499458 500140 500616 501988 505065 509732 515722 523109 531778 541145 550694 560197 569232 577132
58657 577132 583564 588500 591528 592061 590389 587673 584588 580803 576018 570587 564736 558221 551322 545218
58643 545218 540681 537132 533657 530221 527268 524866 523032 522198 522555 523470 524315 525342 527083 529367 531657
58628 531657 533867 536133 538152 539411 539748 539226 537939 536466 535911 536849 538723 540855 543427 546889 551034
58613 551034 555421 560124 565292 570552 575605 580819 586337 591188 594234 595626 596397 597056 597459 597619 597600 596930
58597E96930j702k011j149k48l71r54q37O9J049J836K672L598M479N363O345P413
58581F22482Q670J0186J1502J1914J1442J0770J0131R146P943P315P516P898Q161
58568G45076Q941J0711J3008J5235J7325J9178K0423K1197K2300K4011K5536K5993
58556I68934K5155K3020J9595J5432J1359P369K827j951n554p467q887j0838j2680
58543A026314j3318j2896j2437j2549j3322j4754j6587j8270j9638k0961k2083
58532H49499k2306k1545k0575j9673j8047j5180j1851r162p366o144n208m165
58520F88277k676j162n03o59o39r2J68l42j019j398j880k649l084k893k659k638
58504F64152k227j246m65k25J15O91N72m74j171p14j00l21o53j7J215K093K708
$$ plain form
58597 596930 595228 593217 592068 591820 591449 590495 589658 589727 590776 592612 595284 598882 603361 608724 615069 622482
58581 622482 631152 641338 652840 664754 676196 686966 697097 706243 714186 721501 729017 736915 745076
58568 745076 754017 764728 777736 792971 810296 829474 849897 871094 893394 917405 942941 968934
58556 968934 994089 1017109 1036704 1052136 1063495 1070864 1073691 1071740 1066186 1058719 1049832 1038994 1026314
58543 1026314 1012996 1000100 987663 975114 961792 947038 930451 912181 892543 871582 849499
58532 849499 827193 805648 785073 765400 747353 732173 720322 711160 703794 697650 692442 688277
58520 688277 685601 684439 683936 683277 682638 682546 682714 682372 681353 679955 678075 675426 672342 669449 666790 664152
58504 664152 661925 660679 660214 659989 660104 660795 661367 660893 659722 659008 658908 658587 657934 657917 659132 661225 663933
58487F63933L583M492N178O253Q100R802J0514J0935J2100J3597J4366J4476J4706
58474G92035J4971J4592J3455J1732R018N090R37k208m400o430q304r468j0003
58461H21017j0364j0286r067o686l804r81J420L114M335N812P568Q614Q462P905
58447H27059P432O080K986j011m597p760j0931j3263j3504j2012j0271q767o832
58434G54609m359k262j169p20j96Q82K627M596O081P055Q244R826J0872J0770
58420H06856J0195R810Q988O902M008J381p56k771m621o102p495q979j0025j0196
58406G97195r857r364q396o812n301m299l297j950q65m64j84L83P70Q82J619L219
58390G53279M363M051L083K564K300J817J542J726J582P66K70O22P43q9p47k30
$$ plain form
58487 663933 667516 672008 677186 683439 691539 701341 711855 722790 734890 748487 762853 777329 792035
58474 792035 807006 821598 835053 846785 855803 860893 861830 859622 855222 848792 840488 831020 821017
58461 821017 810653 800367 791300 784614 780810 779829 781249 784363 788698 794510 802078 810692 819154 827059
58447 827059 834491 840571 843557 842546 837949 830189 819258 805995 792491 780479 770208 761441 754609
58434 754609 750250 747988 746819 746099 745903 746785 749412 754008 760089 767144 775388 785214 796086 806856
58420 806856 817051 826861 835849 842751 846759 848140 847384 844613 839992 833890 826395 817416 807391 797195
58406 797195 787338 777974 769578 762766 757465 753166 749869 747919 747054 746590 746406 746789 747559 748441 750060 753279
58390 753279 757642 761693 764776 767340 769640 771457 772999 774725 776307 777073 777343 777965 778708 778619 777872 777642
58374G77642O56J038J630K965L893L695L799N299O725O576O228P627R799J0507
58360H48079J0009J0228J1310J1833J1593J1364J0737Q874O706N718N317L949
58348I55717K111J463J698J158M1J86J841L387M113M865N991O932P766R050J0400
58333A016719J1140J1848J3356J4879J5232J4954J5051J4693J2655J0041Q836
58322A159404Q531P011M145J736N02k74n85J04J094J431J971L857N896O199N632
58307A206654O573Q951J0595J0948J1325J1980J2036J1870J2679J3998J4459J4397
58295A346465J4975J5625J5235J4861J6056J7681J7662J6831J7382J8732J8822
58284A530327J8415J9895K2640K3925K3789K4599K6252K6452K5481K6130K8733
$$ plain form
58374 777642 778298 779336 780966 783931 787824 791519 795318 800617 807342 813918 820146 827773 837572 848079
58360 848079 858088 868316 879626 891459 903052 914416 925153 934027 940733 946451 951768 955717
58348 955717 957828 959291 960989 962147 962188 962374 964215 967602 971715 976580 982571 989503 997269 1006319 1016719
58333 1016719 1027859 1039707 1053063 1067942 1083174 1098128 1113179 1127872 1140527 1150568 1159404
58322 1159404 1167935 1174946 1179091 1180827 1181329 1181055 1180470 1180574 1181668 1183099 1185070 1188927 1194823 1201022 1206654
58307 1206654 1213227 1222178 1232773 1243721 1255046 1267026 1279062 1290932 1303611 1317609 1332068 1346465
58295 1346465 1361440 1377065 1392300 1407161 1423217 1440898 1458560 1475391 1492773 1511505 1530327
58284 1530327 1548742 1568637 1591277 1615202 1638991 1663590 1689842 1716294 1741775 1767905 1796638
58273A796638L0707L1203L1985L3540L4456L4854L6389L8781M0305M1493M4335
58262B194686M8155N0476N1530N3593N6379N7653N7716N8656N9864N9210N7782
58251B805700N8248N9583N9031N8221O1087O6644P0427P2530P7189Q4711R1056
58240C564427R5565J01738J09984J16968J22746J30981J41460J49930J56270J65103
58230D855172J77464J89628K01036K15346K32734K49430K65801K86505L11834
58221F984950L37597L64109L96143M33592M72161N13619N64673O25423O90500
58212A1382767P62039Q49039R53612J071764J208818J379370J591491J847666
58204B1046566K162449K559939L050500L630072M306053N101242O026780P076658
$$ plain form
58273 1796638 1827345 1858548 1890533 1924073 1958529 1993383 2029772 2068553 2108858 2150351 2194686
58262 2194686 2242841 2293317 2344847 2398440 2454819 2512472 2570188 2628844 2688708 2747918 2805700
58251 2805700 2863948 2923531 2982562 3040783 3101870 3168514 3238941 3311471 3388660 3473371 3564427
58240 3564427 3659992 3761730 3871714 3988682 4111428 4242409 4383869 4533799 4690069 4855172
58230 4855172 5032636 5222264 5423300 5638646 5871380 6120810 6386611 6673116 6984950
58221 6984950 7322547 7686656 8082799 8516391 8988552 9502171 10066844 10692267 11382767
58212 11382767 12144806 12993845 13947457 15019221 16228039 17607409 19198900 21046566
58204 21046566 23209015 25768954 28819454 32449526 36755579 41856821 47883601 54960259
58196E4960259Q258618R605596J1145475J2885072J4836133J7030174J9490306
58189A48211633K2195734K5034089K7682991K9488733K9560690K7143100K1985571
58182C31302541J4415054N177523m687569j3932200k1361396k6251438k8572756
58175B56089759k8808345k7593753k5504588k3015153k0466377j8022614j5715875
58168I6963054j3555912j1578231r809184q246593o889123n746984m812070m047825
58160C2277132l419436k910262k502399k166583j881589j643877j449707j285225
58152A5018054j141238j020777r24192q41187p64241o96306o38880n85082n30790
58143G875361m80945m38848l99769l60597l25597k97418k71794k46252k25044
$$ plain form
58196 54960259 63218877 72824473 83969948 96855020 111691153 128721327 148211633
58189 148211633 170407367 195441456 223124447 252613180 282173870 309316970 331302541
58182 331302541 345717595 350895118 346207549 332275349 310913953 284662515 256089759
58175 256089759 227281414 199687661 174183073 151167920 130701543 112678929 96963054
58168 96963054 83407142 71828911 62019727 53773134 46884011 41137027 36324957 32277132
58160 32277132 28857696 25947434 23445035 21278452 19396863 17752986 16303279 15018054
58152 15018054 13876816 12856039 11931847 11090660 10326419 9630113 8991233 8406151 7875361
58143 7875361 7394416 6955568 6555799 6195202 5869605 5572187 5300393 5054141 4829097
58134D829097k10644j98694j86022j75642j69394j63279j54468j45798j39240
58125C285916j31731j21503j11966j05534r9696r2714q7142q4212q0720p4871
58115B295827o9608o6790o3671n8427n3746n1681m9992m6862m4278m3639m2768
58104A704365m0316l8561l8843l8686l6391l4213l4086l4202l2661l0630k9349
58093A316427k7668k4980k2933k2158k0896j8716j7726j8344j7953j5673j4216
58082A095164j5036j5867j5260j5250j7074j8419j7572j6372j6440j6357j5109
58071I16408j4535j5603j6014j4315j2723j3037j3271j1414r163q777r241q646
58059G69669p556p075o348m912m750p021r306r085p575p247p854p890p695q146
$$ plain form
58134 4829097 4618453 4419759 4233737 4058095 3888701 3725422 3570954 3425156 3285916
58125 3285916 3154185 3032682 2920716 2815182 2715486 2622772 2535630 2451418 2370698 2295827
58115 2295827 2226219 2159429 2095758 2037331 1983585 1931904 1881912 1835050 1790772 1747133 1704365
58104 1704365 1664049 1625488 1586645 1547959 1511568 1477355 1443269 1409067 1376406 1345776 1316427
58093 1316427 1288759 1263779 1240846 1218688 1197792 1179076 1161350 1143006 1125053 1109380 1095164
58082 1095164 1080128 1064261 1049001 1033751 1016677 998258 980686 964314 947874 931517 916408
58071 916408 901873 886270 870256 855941 843218 830181 816910 805496 796333 787556 778315 769669
58059 769669 762113 755038 748690 743778 739028 732007 722701 713616 706041 698794 690940 683050 675355 667209
58045F67209q258o913n329n091n470n080m526m924n542n295m965n647o541o477
58031E87151o119o484o903o489o089o770p851q319q582r029q560o557m550m022
58017D90827m146l624l000l153l291k574k122l094m287l829k076p08j28K24J69
58002D55188o51j432j227m09K77J008J927K256J662J167J397J498R69Q54J732
57987D66216K463K346K398L018K596L91j552j539j068k130l745l932l213l291
57973D58958l780l202k057j905k479k425k034k441l019k338r95p15j204o71Q74
57958D30567J602J011M85N97L34p79j856k290k389k234j601j037j326j867j238
57943D17979O36K488L750M959O119O444O007O052P291R033J0308J0836J0708R994
$$ plain form
58045 667209 658951 652038 646709 641618 636148 631068 626542 621618 616076 610781 605816 600169 593628 587151
58031 587151 581032 574548 567645 561156 555067 548297 540446 532127 523545 514516 505956 499399 494849 490827
58017 490827 486681 483057 480057 476904 473613 471039 468917 465823 461536 457707 455631 454923 454795 455019 455188
58002 455188 454537 453105 451878 451469 451746 452754 454681 456937 458599 459766 461163 462661 463630 464484 466216
57987 466216 468679 471025 473423 476441 479037 479428 477876 476337 475269 473139 469394 465462 462249 458958
57973 458958 455178 451976 449919 448014 445535 443110 441076 438635 435616 433278 432283 431568 430364 429693 430567
57958 430567 432169 433180 433665 434262 434596 433817 431961 429671 427282 425048 423447 422410 421084 419217 417979
57943 417979 418615 421103 424853 429812 435931 442375 448382 454434 461725 470758 481066 491902 502610 512604
57929E12604Q855P434N785M324L714L726K956O53k071l853m982o446p865q043
57915E16791p037o220o388p049p454p318o716o066n835n700m711k895j710k091
57901D39601l106l586l812m387m666l898k860k691k920k369j264p28p13j53J147
57886D03595K305K792K778K428J962J980K682L315L346L280L367K685Q36p14p05
57871D35932k75j172k833l340k534j910j946j736j054p05q89j034j122j521j692
57856D12169q05M98Q39L38M26J474K354K378K005J569Q81J29l15r28k443m314
57840D16255n189m777l881k940k004j763k802m099m000k568j274o26O0P61O84
57825C81837J14L45J553K580L010L531M059L524J997J095J614K491K704K527K312
$$ plain form
57929 512604 521459 528893 534678 539002 542716 546442 549398 550051 547980 544127 539145 532699 524834 516791
57915 516791 509754 503534 497146 490097 482643 475325 468609 462543 456708 451008 446297 443402 441692 439601
57901 439601 436495 432909 429097 424710 420044 416146 413286 410595 407675 405306 404042 403314 402601 402448 403595
57886 403595 405900 408692 411470 413898 415860 417840 420522 423837 427183 430463 433830 436515 437351 436637 435932
57871 435932 435657 434485 431652 428312 425778 423868 421922 420186 419132 418427 417538 416504 415382 413861 412169
57856 412169 411364 411862 412701 413039 413465 414939 417293 419671 421676 423245 424126 424255 423940 423012 420569 416255
57840 416255 411066 406289 402408 399468 397464 395701 392899 388800 384800 382232 380958 380332 380392 381153 381837
57825 381837 381951 382296 383849 386429 389439 392970 397029 400553 402550 403645 405259 407750 410454 412981 415293
57810D15293J589J83j162k023k889l993m741m844m774m640l859k398j132m53K51
57795C80408J228J729J308O56N15P22Q15P33N27J42k48m35o43j019r09K30J548
57778C87307J833J493J885K861K931J888J256J677J919J154K74J0m64j876l305
57763D00843l602l112k864k969k946k738k502k108j610j502j832j813r59K42J223
57748C71751K057K771K904K363J877J993K441K883L443M033L974K902J311j33
57734D06570j072j175k82R00J271P45J83j45p67j580j734j271j355k265k728j970
57718C93325r46o51n70N0P35P08K42L9J04J95M32N89j97j979l218k572o62J012
57700C86636K069L067M048M546M688N092N801O114N335L230J35l044n404o953
$$ plain form
57810 415293 416882 417065 415903 413880 410991 406998 402257 397413 392639 387999 384140 381742 380610 380157 380408
57795 380408 381636 383365 384673 385329 385844 386566 387381 388114 388641 388783 388535 388100 387457 386438 385529 385759 387307
57778 387307 389140 390633 392518 395379 398310 400198 401454 403131 405050 406204 406478 406488 406024 404148 400843
57763 400843 397241 394129 391265 388296 385350 382612 380110 378002 376392 374890 373058 371245 370286 370528 371751
57748 371751 373808 376579 379483 381846 383723 385716 388157 391040 394483 398516 402490 405392 406703 406570
57734 406570 405498 404323 404041 404941 406212 406957 407140 406995 406228 404648 402914 401643 400288 398023 395295 393325
57718 393325 392379 391728 391158 391208 391943 392651 392893 392932 393036 393231 393663 394252 394055 392076 388858 386286 385624 386636
57700 386636 388705 391772 395820 400366 405054 410146 415947 422061 427396 430626 430761 427717 422313 415360
57686D15360q335r443r266p516n338l707k177K9K663N126P573J0348J3125J5629
57672D24071J8638K3115K8862L4773M0068M4431M7362M8137M6040M0093K9286
57661H24876J3864l900k0923l4939m4767m9954n0897m8774m4595l8768l1959k5532
57649D43732k0482j6585j3282j0663q923p647o384n277m484l692k758k127j886
57636C39542j371l66K32k06r38j026o89n37m12j01k66j369k471k471j853j928
57620C23770k768l347l286l084k877k323j622j413j633j516p93LL70K59k52q79
57604B98609r52q5J149J839J803J440R13K39k52m25q33j908l049l389l026k606
57588B89467k146j348o75q59j538j616q68j62p1l32o96j231j715j647j142r62
$$ plain form
57686 415360 407025 397582 388316 380800 375462 371755 369578 369607 372270 377396 384969 395317 408442 424071
57672 424071 442709 465824 494686 529459 569527 613958 661320 709457 755497 795590 824876
57661 824876 838740 834840 813917 778978 734211 684257 633360 584586 539991 501223 469264 443732
57649 443732 423250 406665 393383 382720 373797 366150 359766 354489 350005 346313 343555 341428 339542
57636 339542 338171 337805 338037 337831 336893 335867 335178 334641 334229 334128 333862 332493 330022 327551 325698 323770
57620 323770 321002 317655 314369 311285 308408 306085 304463 303050 301417 299901 299108 299111 299481 299740 299488 298609
57604 298609 297657 297572 298721 300560 302363 303803 304716 304955 304703 304278 303445 301537 298488 295099 292073 289467
57588 289467 287321 285973 285298 284439 282901 281285 280417 280255 280184 279852 279156 277925 276210 274563 273421 272459
57572B72459j461k100k259j905j435j240j535k146k594k579k228j591m78Q38J399
57557B51145P32k92n86k90j90k89M1Q92J795K653L632M414M465L891L188K447
57541B77648J651J369K153L514M574N306O030O161M864K770J513J483J459O95
57527C21190r5k00p4l84r24j136r40m98J70R33J451J647J779J870J687J259Q12
57510C28547J97q34j810j947j371j029j208j199o25q2r3l56m84o50j067j521j888
57493C12580k395k951k971k229j285p02m55m00n93q46p20l40m43j165j617j236
57477B92232p77j160k048k388j904j213p57m53k53l14n82p48o92n77n32n41o32
57460B76661q57j091j099q61n92m70m62l94j46K14M71N28N84Q83J295J348P72
$$ plain form
57572 272459 270998 268898 266639 264734 263299 262059 260524 258378 255784 253205 250977 249386 248908 249746 251145
57557 251145 251877 251585 250999 250709 250519 250230 250271 251163 252958 255611 259243 263657 268122 272013 275201 277648
57541 277648 279299 280668 282821 286335 290909 296215 302245 308406 313270 316040 317553 319036 320495 321190
57527 321190 321095 320895 320821 320437 319513 318377 317437 316939 317109 318042 319493 321140 322919 324789 326476 327735 328547
57510 328547 328744 327910 326100 324153 322782 321753 320545 319346 318721 318639 318546 318190 317706 317056 315989 314468 312580
57493 312580 310185 307234 304263 302034 300749 300047 299592 299192 298599 297753 297033 296693 296250 295085 293468 292232
57477 292232 291455 290295 288247 285859 283955 282742 281985 281532 281279 280965 280383 279635 278943 278366 277834 277293 276661
57460 276661 275804 274713 273614 272753 272161 271691 271229 270835 270689 270903 271374 271902 272486 273369 274664 276012 276784
57443B76784j22o63l99N34J518K003J956J725J519J311J169J264J398J113N05
57428B91615L20Q30J212P38qN7Q80J350R22J95j57j90k34l38m16m53m15k90k54
57409B95364m09m48q2M33O43O14O53O21K38j32Q7N64M13l10m60N04J712K174J996
57390C04175J842J885J912J856J657J089K89L2Q97K367L281L030K003J047P97
57375C28159J290J963K117J567P58K04%l0lO7J78L62O31Q93J087J341J746K033
57357C44363J752Q76k1k30N27J822K738K574J629R59J213J943K369K353K241K182
57341C69290K153K265K477K362J780J317J422J535R22K5n0Q23J637J729J474J427
57325C92588J654J945K041J579N69j72J58J198J909K034K183K521K467J809J075
$$ plain form
57443 276784 276662 275999 275600 276134 277652 279655 281611 283336 284855 286166 287335 288599 289997 291110 291615
57428 291615 291935 292765 293977 294715 294707 294764 295644 296994 297916 298111 297954 297764 297530 297192 296776 296323 295908 295618 295364
57409 295364 294955 294507 294425 294858 295501 296115 296768 297389 297627 297495 297582 298146 298559 298249 297789 298293 300005 302179 304175
57390 304175 306017 307902 309814 311670 313327 314416 314705 314737 315634 318001 321282 324312 326315 327362 328159
57375 328159 329449 331412 333529 335096 335854 336058 336058 336028 336025 336092 336270 336632 337263 338156 339243 340584 342330 344363
57357 344363 346115 346991 346970 346740 347267 349089 351827 354401 356030 356989 358202 360145 362514 364867 367108 369290
57341 369290 371443 373708 376185 378547 380327 381644 383066 384601 385523 385548 385498 386321 387958 389687 391161 392588
57325 392588 394242 396187 398228 399807 400376 400204 400362 401560 403469 405503 407686 410207 412674 414483 415558
57310D15558O69N07O75J438K424K760K315J945K225K788L122L197L058K687K454
57295D47822K843L570L880L811M085M640M517L538K802K984L369L178K681K280
57281D96000J668P03O5J50K52k35p49o69n41j113j897j925j364j128j311j194
57265D86712n92m4K86Q24J638K221K382K606L228L857L973L772L992M948O028
57250E25831O373O026N921O533P044O536N574N529O470O902N888M258L282L176
57236F05343L467L938M436M588M412M601N422O054N683M727M165M232M530N014
57222F70612N960P165P929P846P213O699O868P722Q542Q530P766P092O988P135
57208G74067P214P359P599P667P644P982Q602Q851Q707Q999R979J0725J0625J0413
$$ plain form
57310 415558 416227 416734 417409 418847 421271 424031 426346 428291 430516 433304 436426 439623 442681 445368 447822
57295 447822 450665 454235 458115 461926 466011 470651 475168 478706 481508 484492 487861 491039 493720 496000
57281 496000 497668 498371 498436 498586 498838 498603 497854 497185 496644 495531 493634 491709 490345 489217 487906 486712
57265 486712 486120 486076 486362 487186 488824 491045 493427 496033 499261 503118 507091 510863 514855 519803 525831
57250 525831 532204 538230 544151 550684 557728 564264 569838 575367 581837 588739 594627 598885 602167 605343
57236 605343 608810 612748 617184 621772 626184 630785 636207 642261 647944 652671 656836 661068 665598 670612
57222 670612 676572 683737 691666 699512 706725 713424 720292 728014 736556 745086 752852 759944 766932 774067
57208 774067 781281 788640 796239 803906 811550 819532 828134 836985 845692 854691 864670 875395 886020 896433
57194H96433J0985J2061J2861J3294J3625J3765J3693J3876J4520J5102J5372
57183A045587J5945J7159J8273J8754J9314K0594K1741K1676K0944K0978K1941
57172A262906K2786K3072K3363K3984K4629K5187K5904K6737K7439K8182K9272
57161A543461L0327L0592K9959K9044K8327K7830K7466K7148K6796K6731K7635
57150A855316K9676L2119L4206L5864L7053L7288L6430L5242L4464L4078L4134
57139B235870L5229L7429L9706M1395M3158M5473M7346M7831M7712M8279M9268
57128B718696M9662M9583M9801N0032M9497M8672M8884N0599N3653N8712O6841
57117C294632P7965R1297J06933J25568J46862J69471J92328K14730K35895K56125
$$ plain form
57194 896433 907418 919479 932340 945634 959259 973024 986717 1000593 1015113 1030215 1045587
57183 1045587 1061532 1078691 1096964 1115718 1135032 1155626 1177367 1199043 1219987 1240965 1262906
57172 1262906 1285692 1308764 1332127 1356111 1380740 1405927 1431831 1458568 1486007 1514189 1543461
57161 1543461 1573788 1604380 1634339 1663383 1691710 1719540 1747006 1774154 1800950 1827681 1855316
57150 1855316 1884992 1917111 1951317 1987181 2024234 2061522 2097952 2133194 2167658 2201736 2235870
57139 2235870 2271099 2308528 2348234 2389629 2432787 2478260 2525606 2573437 2621149 2669428 2718696
57128 2718696 2768358 2817941 2867742 2917774 2967271 3015943 3064827 3115426 3169079 3227791 3294632
57117 3294632 3372597 3463894 3570827 3696395 3843257 4012728 4205056 4419786 4655681 4911806
57107D911806K77904L04444L37641L78621M29234M91418N66521O57466P70659
57098I125714R13346J089476J299889J545440J828152K150893K517875K932642
57090B3403427L391479L879938M378581M868891N329365N730113O037775O218787
57082F3238356O223525N971255N379490M434390L232524J938756O94148m41940
57074I0670504j479350k450515l375648m248116n030617n663892o090516o279651
57066E6052199o235430n989214n587838n084088m528258l961757l415403k910678
57058A8339533k460380k069202j736103j456919j225150j032466q70984p35334
57050F752995o22004n27700m49515l85901l35965k98221k71179k54578k48266
$$ plain form
57107 4911806 5189710 5494154 5831795 6210416 6639650 7131068 7697589 8355055 9125714
57098 9125714 10039060 11128536 12428425 13973865 15802017 17952910 20470785 23403427
57090 23403427 26794906 30674844 35053425 39922316 45251681 50981794 57019569 63238356
57082 63238356 69461881 75433136 80812626 85247016 88479540 90418296 91112444 90670504
57074 90670504 89191154 86740639 83364991 79116875 74086258 68422366 62331850 56052199
57066 56052199 49816769 43827555 38239717 33155629 28627371 24665614 21250211 18339533
57058 18339533 15879153 13809951 12073848 10616929 9391779 8359313 7488329 6752995
57050 6752995 6130991 5603291 5153776 4767875 4431910 4133689 3862510 3607932 3359666
57041C359666k49372k51791k49189k38385k19988j96682j71348j46145j22390
57032A514376j00751q1372o3911m7843l2938j9404p307L893J4874K5346L3703
57021A238666L7941L6688K9077J3993r376l9460p1178r8014j15736j23857j23803
57010G74941j16932j04781r0101p6049o4258n4451m5877l8485l2505k7727k3638
56999A00137k0037j7156j5216j3966j2729A0027A025f329o295n294l729j498J141
56986b2004L965O721b285H367J1588J1611J0118O772K113k890p556j1477j4161
56973A4485h06j5142j4227j2687j0387p424m127p28K504N031O501P387Q737J1187
56959b4181i715H125K0598K2136K1974J9781J5435R185J851n388j1607j6405j9477
$$ plain form
57041 3359666 3110294 2858503 2609314 2370929 2150941 1954259 1782911 1636766 1514376
57032 1514376 1413625 1332253 1268342 1220499 1187561 1168157 1160850 1164743 1179617 1204963 1238666
57021 1238666 1276607 1313295 1342372 1356365 1346989 1307529 1236351 1138337 1022601 898744 774941
57010 774941 658009 553228 463127 387078 322820 268369 222492 184007 151502 123775 100137
56999 100137 80100 62944 47728 33762 21033 10027 1025 -6329 -12624 -17918 -21647 -23145 -22004
56986 -22004 -18039 -11318 -2285 8367 19955 31566 41684 48456 50569 47679 40123 28646 14485
56973 14485 -806 -15948 -30175 -42862 -53249 -60673 -64800 -65528 -63024 -57993 -51492 -44105 -35368 -24181
56959 -24181 -9715 8125 28723 50859 72833 92614 108049 117234 119085 113697 102090 85685 66208
56946F6208k0449j9443H982e976j2315q942m923q87K771O168R548a491A5375K0894
56932C6269K4591K7201K8301K7768K5322K0523J3347M464n035j4029k1561k6970
56920A40191k9980l0591k9078B4404A640a8041j6960j4251j1438q783o684n372
56908h1529m704m187l398k426j671j278j034p76l83N09K160M040N219N710O589
56893g7159Q448J0566J2168J3705J6076B867K1578K3039K3827K4230K3720K1340
56881A40601J6498R524J738n206j0349j3567j4741j3486j0127o152k867q1L219
56868I5004P285J1546J5707K0059K4831L0013L5705M1788M7302N0739N1073M7957
56856D79009M1217L0780J7276K155j2768k5670l4926l9649m0037l6847l0798k2752
$$ plain form
56946 66208 45759 26316 8982 -5976 -18291 -27233 -32156 -33043 -30272 -24104 -14556 -1491 15375 36269
56932 36269 60860 88061 116362 144130 169452 189975 203322 207786 202751 188722 167161 140191
56920 140191 110211 79620 50542 24404 1640 -18041 -35001 -49252 -60690 -69473 -76157 -81529
56908 -81529 -86233 -90420 -93818 -96244 -97915 -99193 -100227 -101003 -101386 -100877 -98717 -94677 -89458 -83748 -77159
56893 -77159 -68711 -58145 -45977 -32272 -16196 2867 24445 47484 71311 95541 119261 140601
56881 140601 157099 166623 168361 163155 152806 139239 124498 111012 100885 94733 91866 91785 95004
56868 95004 102289 113835 129542 149601 174432 204445 240150 281938 329240 379979 431052 479009
56856 479009 520226 551006 568282 570437 557669 531999 497073 457424 417387 380540 349742 326990
56844C26990j4005n563K592J0941J9411K7621L5818M4646N4096O3396P1748P8235
56832G15926Q1076P8027O7939N1364K9650M365k2140m6428o5110p6311q0084p7799
56820F60475p1209o1741n0348l8013k6027j5321n762L388J2451K1238K9766L8253
56808D97150M6392N3079N6934N6713N1305M0065K3439L152j8171l7525n2331o1457
56796F58745o5449o5329o1511n4337m5077l5471k6480j8208j0798m473J106O561
56784B79279J1880J6683K1163K5704K9425L0356K7412K1248J2938K885q391j9371
56772D51211k8314l4469l7949l8975l7879l5450l2527k9300k5567k1591j8295
56761A10895j6382j5419j4129j1760r045p384p034o848n994n113n043A498c120
$$ plain form
56844 326990 312985 307422 310014 320955 340366 367987 403805 448451 502547 565943 637691 715926
56832 715926 797002 875029 942968 994332 1023982 1028347 1006207 959779 894669 818358 738274 660475
56820 660475 589266 527525 477177 439164 413137 397816 392054 395442 407893 429131 458897 497150
56808 497150 543542 596621 653555 710268 761573 801638 825077 828229 810058 772533 720202 658745
56796 658745 593296 527967 466456 412119 367042 331571 305091 286883 276085 271612 272718 279279
56784 279279 291159 307842 329005 354709 384134 414490 441902 463150 476088 478973 470582 451211
56772 451211 422897 388428 350479 311504 273625 238175 205648 176348 150781 129190 110895
56761 110895 94513 79094 64965 53205 44160 36776 29742 22894 16900 11787 6744 1498 -3120
56747f457k546k476k161j161k60j72n93r55j160j096l77Q67J686J369L68l29k96
56730a5749R3J91l51j145j244j99J203J906J981K183K423J922Q23K55N94J015
56714d099J149a270A464L138K212J144J350K466L102K807K211J759J399J072P21
56699B4845J62m28l96K98O98K67p9N99J629J669P80J58K17K76N0J18P40J387J683
56680C4673J896K188K180J554N03o46j679k248k010j138k20N03J198J748J612
56665D0114P06k09k87M79J386J740J346O06K40O40J380J622J071K64j78j66P3
56648E0827M51R13J151Q48J85j59K80J199J913K213K510L102L631L618L240L053
56632G8975L104K892K238J524J019N09o5k58J95Q00Q00n2j492l000l796l210j647
$$ plain form
56747 -6457 -9003 -11479 -13640 -14801 -15061 -15233 -15826 -16781 -17941 -19037 -19414 -18547 -16861 -15492 -15124 -15453 -15749
56730 -15749 -15656 -15465 -15816 -16961 -18205 -18404 -17201 -15295 -13314 -11131 -8708 -6786 -5963 -5708 -5114 -4099
56714 -4099 -2950 -1270 1464 4602 6814 7958 9308 11774 14876 17683 19894 21653 23052 24124 24845
56699 24845 25007 24579 24183 24481 25179 25446 25367 25966 27595 29264 30044 30202 30419 30695 30745 30863 31603 32990 34673
56680 34673 36569 38757 40937 42491 42994 42348 40669 38421 36411 35273 35053 35556 36754 38502 40114
56665 40114 40820 40611 40324 40803 42189 43929 45275 45881 46121 46761 48141 49763 50834 51098 50920 50754 50827
56648 50827 51278 52191 53342 54190 54375 54216 54496 55695 57608 59821 62331 65433 69064 72682 75922 78975
56632 78975 82079 84971 87209 88733 89752 90261 90196 89938 90133 90933 91733 91681 90189 87189 83393 80183 78536
56615G8536o63j315k744l215k354j492j691k350k217j186m29q88k210l278l419
56600D9085k770j745o02L52O83L62PJ64N72O76N84Q25J318J393R57P67J338K222
56582E6188K747K757K343J546P09M39P81J047R42J097J949K821K893K481K476
56567H3216L012L544L998M901O430Q150R635J0765J1467J1701J1716J1714J1365
56554A91614J0130Q085N929M244L171K655K547K487K203J891J854J795J013n85
56540B39033k197l051l316l837n113o688p558p129n788m490l887m025m661n526
56526A71767o200o257n688m871m026l101k249j844j876j896j784j949k468k682
56512A24876k179j540j509j895j939j432q86q21j289j892j963j126N7N17N7l26
$$ plain form
56615 78536 77873 76558 73814 70599 68245 66753 65062 62712 60495 59309 58880 57992 55782 52504 49085
56600 49085 46315 44570 43968 44320 45003 45365 45372 45536 46108 46784 47368 48193 49511 50904 51861 52628 53966 56188
56582 56188 58935 61692 64035 65581 66290 66729 67510 68557 69499 70596 72545 75366 78259 80740 83216
56567 83216 86228 89772 93770 98671 105101 113251 122886 133651 145118 156819 168535 180249 191614
56554 191614 201744 209829 215758 220002 223173 225828 228375 230862 233065 234956 236810 238605 239618 239033
56540 239033 236836 233785 230469 226632 221519 214831 207273 200144 194356 189866 185979 181954 177293 171767
56526 171767 165567 159310 153622 148751 144725 141624 139375 137531 135655 133759 131975 130026 127558 124876
56512 124876 122697 121157 119648 117753 115814 114382 113496 112675 111386 109494 107531 106405 106462 106979 107036 106710
56496A06710Q6O89N98j3m05n03o54o65r3P62J180J135J214J529J557J059L31m09
56478A14108j123j471j041j30M09K87J08M64J209J783J815J273M06l42o75o83
56462A16397n54k66J80M78L89J37J05L41P31J274J780J731R53J03m6M24R10J154
56444A26221J229J050N55O9r4j26k08RP34J280R19M8l41j32J5n1K17R26J466J414
56424A35200R66L93j94m91j98M18Q44J116J576J953J626P64K86N19P92O43M57
56407A46670O22P46K74o41j356j560j485j482j573j467j039o57o95p55o4J174
56391A36712J691R94L55J062K414K680J546L65K11Q63J645K163K174J703J269
56376A57847J267J291R10O50J130J651J046l45j019o03k35n25p31l47j5j74j71
$$ plain form
56496 106710 106796 107485 108083 108070 107665 107162 106508 105843 105750 106512 107692 108827 110041 111570 113127 114186 114517 114108
56478 114108 112985 111514 110473 110343 110752 111039 111147 111611 112820 114603 116418 117691 118097 117755 117080 116397
56462 116397 115843 115577 115757 116235 116624 116761 116866 117207 117938 119212 120992 122723 123676 123779 123733 124157 125067 126221
56444 126221 127450 128500 129055 129124 129030 128904 128696 128705 129439 130719 131638 131686 131345 131213 131228 131177 131394 132320 133786 135200
56424 135200 136166 136559 136365 135874 135676 136094 136938 138054 139630 141583 143209 143973 144259 144778 145570 146213 146670
56407 146670 147292 148038 148312 147671 146315 144755 143270 141788 140215 138748 137709 137052 136357 135602 135538 136712
56391 136712 138403 139397 139752 140814 143228 145908 147454 147819 148030 148893 150538 152701 154875 156578 157847
56376 157847 159114 160405 161315 161965 163095 164746 165792 165447 164428 163825 163590 163065 162334 161987 161972 161798 161627
56359A61627N21J259J259P82M98M40L05K15M10P09P52N27K67J36K53O90J279J770
56341A73699K120K222J678M93l09L18J923L015K947K358J835J298Q14Q56J445
56326A96712K005K331K733L103K863K025J299R67O97N67J175K452L495L816L720
56311B29960L342K513J736J893K699K872K220K033K970M128M885O000P916R496
56297B84663R527Q329O828N153L255J756J051N52j57l42N45J643K030K340L609
56282C30782N281N927N520N491O632Q206R196R456R457R658J0213J0892J1352
56269D38063J1715J2552J3987J5404J6430J7670J9882K2886K5919K8654L1397
56258F54559L4557L8330M2694M7467N2647N8635O5629P2979P9975Q7091R5316
$$ plain form
56359 161627 162148 163407 164666 165448 165946 166386 166691 166906 167316 168025 168777 169304 169571 169707 169960 170650 171929 173699
56341 173699 175819 178041 179719 180212 179903 180221 182144 185159 188106 190464 192299 193597 194411 195267 196712
56326 196712 198717 201048 203781 206884 209747 211772 213071 214038 214735 215302 216477 218929 222424 226240 229960
56311 229960 233302 235815 237551 239444 242143 245015 247235 249268 252238 256366 261251 267251 275167 284663
56297 284663 294190 302519 309347 314500 317755 319511 320562 321114 320957 320615 321160 322803 324833 327173 330782
56282 330782 336063 341990 347510 353001 359633 367839 377035 386491 395948 405606 415819 426711 438063
56269 438063 449778 462330 476317 491721 508151 525821 545703 568589 594508 623162 654559
56258 654559 689116 727446 770140 817607 870254 928889 994518 1067497 1147472 1234563 1329879
56247A329879J04231J12088J18067J23079J27806J31340J32452J30960J26951
56238B436853J19839J09188R5547P9669O1717M1969K1277J46k1550m3126o2546
56227B838983p8348r1086j01873j10509j16211j19186j20224j19433j16587j12153
56217A753373j06901j00984r4290q7290q0636p4408o8458o2989n8228n4058n0389
56206I14742m7180m3801l9462l4650l0918k8715k6717k3932k0972j8495j6025
56195E83875j3407j1748j1539j1334r824p861o895o663o111n400n190m922l676
56182D79305k042j343j592j819j819j979j989j295k95L25Q99J990K961K827J998
56167D76132J738K341L188M047M976N560N531N587O347P244P685Q355R995J1820
$$ plain form
56247 1329879 1434110 1546198 1664265 1787344 1915150 2046490 2178942 2309902 2436853
56238 2436853 2556692 2665880 2761427 2841096 2902813 2944782 2966059 2966205 2944655 2901529 2838983
56227 2838983 2760635 2669549 2567676 2457167 2340956 2221770 2101546 1982113 1865526 1753373
56217 1753373 1646472 1545488 1451198 1363908 1283272 1208864 1140406 1077417 1019189 965131 914742
56206 914742 867562 823761 784299 749649 718731 690016 663299 639367 618395 599900 583875
56195 583875 570468 558720 547181 535847 526023 518162 511267 504604 498493 493093 487903 482981 479305
56182 479305 477263 475920 474328 472509 470690 468711 466722 465427 465132 465457 466356 468346 471307 474134 476132
56167 476132 477870 480211 483399 487446 492422 497982 503513 509100 515447 522691 530376 538731 548726 560546
56153E60546J2741J3341J4952J7527K0091K2575K5514K8708L1780L5414M0305
56142H23494M5748N0987N7048O5298P4839Q3420R0239R5770R9394R9528R5939
56131A681704Q9882Q2125P2833O3225N5281M9587M5045M0622L5866L0006K2223
56120B268399J2779K534q267j9415k9738l8407m6539n5764o5828p5359q4152r2516
56108A767727r9053j01525r9640r4942q8223p9272o8817n8535m9200m0639l3255
56097I54626k7594k2854j7851j3127j0032q210o181l926k616k134j238J66J169
56084H40198J927L282M703N021M773N364O386O342N616N968P328P904P409P335
56070I19556Q095Q650R021J0402J2599J4052J4533J5219J6113J6005J5067J4794
$$ plain form
56153 560546 573287 586628 601580 619107 639198 661773 687287 715995 747775 783189 823494
56142 823494 869242 920229 977277 1042575 1117414 1200834 1291073 1386843 1486237 1585765 1681704
56131 1681704 1771586 1853711 1926544 1989769 2045050 2094637 2139682 2180304 2216170 2246176 2268399
56120 2268399 2281178 2283712 2275445 2256030 2226292 2187885 2141346 2085582 2019754 1944395 1860243 1767727
56108 1767727 1668674 1567149 1467509 1372567 1284344 1205072 1136255 1077720 1028520 987881 954626
56097 954626 927032 904178 886327 873200 863168 854958 848777 844851 842235 840101 838863 839029 840198
56084 840198 842125 845407 850110 855131 859904 865268 871654 877996 883612 889580 896908 904812 912221 919556
56070 919556 927651 936301 945322 955724 968323 982375 996908 1012127 1028240 1044245 1059312 1074106
56058A074106J5298J5271J4564J4222J4161J3495J2888J3656J4885J4510J2923
56047A229979J2392J3260J3977J4524J6161J8148J8519J8034J9396K2472K4402
56036A421264K4597K5448K7726K9461L0062L1246L3177L3855L3196L3660L5849
56025A759541L7576L8136L9449M2048M4007M4774M6052M8121M9427N0401N3222
56014B252754N7209N9195N9222O0859O5036O8760P0950P4125P9006Q2932Q5265
56003C015313Q8830R4417R9310J02972J08474J16520J23886J29619J36769J46122
55993D162232J54451J61066J69601J81102J92039K01616K14146K31436K49883
55984E917572K67867K88763L13809L39624L65851L97237M35025M74726N15859
$$ plain form
56058 1074106 1089404 1104675 1119239 1133461 1147622 1161117 1174005 1187661 1202546 1217056 1229979
56047 1229979 1242371 1255631 1269608 1284132 1300293 1318441 1336960 1354994 1374390 1396862 1421264
56036 1421264 1445861 1471309 1499035 1528496 1558558 1589804 1622981 1656836 1690032 1723692 1759541
56025 1759541 1797117 1835253 1874702 1916750 1960757 2005531 2051583 2099704 2149131 2199532 2252754
56014 2252754 2309963 2369158 2428380 2489239 2554275 2623035 2693985 2768110 2847116 2930048 3015313
56003 3015313 3104143 3198560 3297870 3400842 3509316 3625836 3749722 3879341 4016110 4162232
55993 4162232 4316683 4477749 4647350 4828452 5020491 5222107 5436253 5667689 5917572
55984 5917572 6185439 6474202 6788011 7127635 7493486 7890723 8325748 8800474 9316333
55975I316333N64906O24783O90972P62410Q46423R48346J066768J204276J372392
55966A7397609J581142J835885K149607K544213L032547L613487M292320N089340
55958D1536150O018672P077163Q268089R619082J1161828J2910613J4876210J7083995
55950A28551802J9560786K2306172K5242484K8090739L0222721L0701649K8627444
55943C13303797K3566988J5731614N861893m940963j5334434k3964513k9863681
55936B84360701l2752074l2978850l1206738k8147693k4461710k0700628j7231659
55929I6881349j4217541j1688536r620847p959185o624039n542102m666439l961017
55921C2601643l385564k907604k512614k189942j921065j690395j494474j331038
$$ plain form
55975 9316333 9881239 10506022 11196994 11959404 12805827 13754173 14820941 16025217 17397609
55966 17397609 18978751 20814636 22964243 25508456 28541003 32154490 36446810 41536150
55958 41536150 47554822 54631985 62900074 72519156 83680984 96591597 111467807 128551802
55950 128551802 148112588 170418760 195661244 223751983 253974704 284676353 313303797
55943 313303797 336870785 352602399 358464292 353523329 338188895 314224382 284360701
55936 284360701 251608627 218629777 187423039 159275346 134813636 114113008 96881349
55929 96881349 82663808 70975272 61354425 53395240 46771201 41229099 36562660 32601643
55921 32601643 29216079 26308475 23795861 21605919 19684854 17994459 16499985 15168947
55913A5168947j190092j063710r53798q62007p81471p05801o37239n78794n26578
55904G869457m76776m32387l96444l65382l35203l07832k85700k66042k45943
55895D757748k27391k12392j98434j83429j69865j59579j49597j37470j25821
55886C193770j17308j09879j01119r2772q6928q1956p6019p0607o7053o3708n9834
55875B266587n8066n9694o1642o1465o1104o2339o2879o0640n7779n6572n5135
55864A609272n1147m6300m3163m0773l7187l3407l1185k9717k7972k7452k9229
55853A211740l0933l0146k8120k7007k6032k3832k1862k1872k2434k1493k0244
55842I37765k0884k2494k2613k1196j9813j8518j6690j5367j5623j6044j4759
$$ plain form
55913 15168947 13978855 12915145 11961347 11099340 10317869 9612068 8974829 8396035 7869457
55904 7869457 7392681 6960294 6563850 6198468 5863265 5555433 5269733 5003691 4757748
55895 4757748 4530357 4317965 4119531 3936102 3766237 3606658 3457061 3319591 3193770
55886 3193770 3076462 2966583 2865464 2772692 2685764 2603808 2527789 2457182 2390129 2326421 2266587
55875 2266587 2208521 2148827 2087185 2025720 1964616 1902277 1839398 1778758 1720979 1664407 1609272
55864 1609272 1558125 1511825 1468662 1427889 1390702 1357295 1326110 1296393 1268421 1240969 1211740
55853 1211740 1180807 1150661 1122541 1095534 1069502 1045670 1023808 1001936 979502 958009 937765
55842 937765 916881 894387 871774 850578 830765 812247 795557 780190 764567 748523 733764
55831G33764j2598j1474j1074r962q558q164q234p435o356o505p562q137q304
55818F19401q977r686r386q635q708r314r213q306p234n847l877k174j399o13
55804E26032J088K682K884K521L249M961O411P393Q314Q580P415N422L591J601
55790E92144j164l957n786p128q768r938r518q093o950n956m364k799k421k742
55776E12560k241n65J608M287Q030J2571J7079K1155K4206K4569K0931J3957N220
55763F63367m611j5082k4475l0800l3657l3794l1580k7504k3140j9936j7624j5266
55751C85898j3060j1616j0362q369o037m448l727l391l460l806l396j765k51j29
55737C12081n29K0J061J082k3j340k881n025o792o888n968n725o168n903m766
$$ plain form
55831 733764 721166 709692 698618 688656 680098 671934 663700 656265 649909 643404 635842 627705 619401
55818 619401 610424 600738 591352 582717 574009 564695 555482 547176 539942 534095 530218 528044 526645 526032
55804 526032 527120 529802 532686 535207 538456 543417 549828 557221 565535 574115 581530 586952 590543 592144
55790 592144 590980 587023 581237 574109 565341 555403 545885 537792 530842 524886 520522 517723 515302 512560
55776 512560 510319 509754 511362 515649 523679 536250 553329 574484 598690 623259 644190 658147 663367
55763 663367 658756 643674 619199 588399 554742 520948 489368 461864 438724 418788 401164 385898
55751 385898 372838 361222 350860 342491 336454 332006 328279 324888 321428 317622 314226 312461 312210 312081
55737 312081 311552 311572 312633 313715 313692 312352 309471 304446 297654 290766 284798 279073 272905 267002 262236
55722B62236m055m251m466m144l520k428m09K027L796M832N896P033P728Q165
55708B78440Q784Q897P387M510J498j309m271o882q215q669r435j0410j0443r515
55694B40367q764q383p393n629m154l468k919k153j554j131m14L17L17kO66K433
55678A98136L923M333M298M354M060L063J757M43r83k227k619k275k072k287k343
55663B09561k010j669j202M7J928L228L138K098J025O06J243K654L648L369K639
55648B30303K815L597L420J924M19k50o52j316j849k022k384l274m295n230o350
55633B14856p527q052p666o808n743m461l401l098l040k230q87k55n71p62l36
55618A60019L0J01O24J636J867O28j033j872j986k048k180k372k941l801m168
$$ plain form
55722 262236 258181 253930 249464 245320 241800 239372 238963 240990 244786 249618 255514 262547 270275 278440
55708 278440 287224 296121 303508 308018 309516 308207 303936 297054 288839 280170 270735 260325 249882 240367
55694 240367 231603 223220 215827 210198 206044 202576 199657 197504 195950 194819 194405 194722 195039 195037 195703 198136
55678 198136 202059 206392 210690 215044 219104 222167 223924 224367 223384 221157 218538 216263 214191 211904 209561
55663 209561 207551 205882 204680 204727 206655 209883 213021 215119 216144 216750 217993 220647 224295 227664 230303
55648 230303 233118 236715 240135 242059 242478 242228 241576 240260 238411 236389 234005 230731 226436 221206 214856
55633 214856 207329 199277 191611 184803 179060 174599 171198 168100 165060 162830 161943 161688 161117 160355 160019
55618 160019 160049 160150 160774 162410 164277 164905 163872 162000 160014 157966 155786 153414 150473 146672 142504
55603A42504l661k872k311j774j225j162j585j676j195j009j497j645o55O44J048
55588A21929P53P93J459K326L261M300M997M848M169L725L814M325N396P203R299
55573A82597J0879J1645J2015J2522J3357J4323J5001J5023J4274J2653R888N971
55561C30148J675k040n072q014j0968j3286j4543j5020j5039j4623j3985j3491
55549B05742j2903j1504r247p049n601m620l599k554j716j138r41j295j807j698
55535A40070q90k60m31r59j062o41j73o3l94r59j413j661k033k602k767k100j331
55518A20331j474k285k696k557k662l136l135k336j400p84l43k96j108k168k127
55503I1824r81l45j022j870j846j586j931k324j840p76JL57N20K77l95p84m60
$$ plain form
55603 142504 138843 135971 133660 131886 130661 129499 127914 126238 125043 124034 122537 120892 120237 120881 121929
55588 121929 122682 123475 124934 127260 130521 134821 139818 144666 148835 152560 156374 160699 166095 173298 182597
55573 182597 193476 205121 217136 229658 243015 257338 272339 287362 301636 314289 324177 330148
55561 330148 331823 329783 324711 316697 305729 292443 277900 262880 247841 233218 219233 205742
55549 205742 192839 181335 172088 165039 159438 154818 151219 148665 146949 145811 144870 143575 141768 140070
55535 140070 139180 138920 138489 137530 136468 135827 135654 135591 135197 134238 132825 131164 129131 126529 123762 121662 120331
55518 120331 118857 116572 113876 111319 108657 105521 102386 100050 98650 97866 97523 97227 96119 93951 91824
55503 91824 90843 90498 89476 87606 85760 84174 82243 79919 78079 77303 77304 77661 78181 78458 78063 77279 76819
55486G6819m9o4N6Q29J559J448R53R31J154Q37K2o79j122j378j059L1J119J395
55468H2802J132R36O25n7l95L06J334J502R72P45Q38M93j41j42M34M70l65j141
55450I0348j289j317j545j377m83L72L55k95p67p86o64o53p47q93j037j053p81
55433G7388j27Q16J659J947J715J515J622J593J017K84J7J68K80L80Q50J572K000
55416I4696K018K043K252K379K313K259K173J612M09r99k006k350k083j490j066
55401A02160j255j945k525k571k315k263k473k405j556k07O90N50j92o89o75l48
55385H1981L44J546K639K600J442M03K56L38k27j125j460j138q39r41j244j458
55369H3117j403r59k77K21M10O11Q64O90k4m72KQ45J019L73l87p55p33m52j38
$$ plain form
55486 76819 76770 76706 76762 77591 79150 80598 81551 82482 83636 84473 84495 83816 82694 81316 80257 80288 81407 82802
55468 82802 83934 84870 85495 85438 85043 85349 86683 88185 89157 89902 90740 91233 91092 90950 91384 91854 91489 90348
55450 90348 89059 87742 86197 84820 84337 84709 85064 84769 84002 83216 82552 81899 81152 80259 79222 78169 77388
55433 77388 77261 78077 79736 81683 83398 84913 86535 88128 89145 89429 89446 89614 89894 90274 91124 92696 94696
55416 94696 96714 98757 101009 103388 105701 107960 110133 111745 112154 111155 109149 106799 104716 103226 102160
55401 102160 100905 98960 96435 93864 91549 89286 86813 84408 82852 82645 83335 83885 83693 83004 82329 81981
55385 81981 82325 83871 86510 89110 90552 90955 91211 91549 91322 90197 88737 87599 86760 85819 84575 83117
55369 83117 81714 80755 80478 80699 81109 81720 82584 83274 83250 82778 82780 83625 84644 85017 84630 83875 83142 82690 82552
55350H2552j59n38o55l7Q95J376J283R86N85q6r75j835k470k587j825m04P53J078
55332G7937R96J104J311J318J297J339R81L2p20n11K44O64O48O01M76R0k09j51
55314H7447k72r77j541j109j68K03M7J58M84L59%K17P70N83l74q61k94N22Q39
55295H6033Q97J048J109J003J030J202J187J086J284J436P38o23j397r87j54L26
55279I5218N38O45K97n78j335j531j445j312r10k72P8L3J66O12O57j9o09l71K77
55260I0139N46M53M92O91P18N11K54J4j28oK89M60N10P11R04N37l28r18r52j048
55240I3849j532j698r64J18O72O84N87L04l96j074j042m03P2ml49o16p36o97m83
55221H6292k39j48k04l11m00l78j91q0l73q32p44O2Q00P46K46J14M30N49J84j48
$$ plain form
55350 82552 82393 81855 81200 81163 82058 83434 84717 85703 86288 86202 85227 83392 80922 78335 76510 76106 76859 77937
55332 77937 78933 80037 81348 82666 83963 85302 86283 86315 85595 85084 85328 85992 86640 87241 87717 87807 87598 87447
55314 87447 87175 86198 84657 83548 83380 83583 83630 83788 84272 84631 84631 84848 85618 86201 85827 84966 84672 85194 86033
55295 86033 86930 87978 89087 90090 91120 92322 93509 94595 95879 97315 98053 97430 96033 95046 94892 95218
55279 95218 95756 96401 96698 96120 94785 93254 91809 90497 89587 89315 89393 89426 89592 90204 90861 90842 90233 89862 90139
55260 90139 90685 91138 91630 92321 93039 93550 93804 93818 93690 93684 93973 94433 94943 95654 96558 97095 96767 95849 94897 93849
55240 93849 92317 90619 89655 89773 90445 91129 91716 92020 91624 90550 89508 89105 89177 89173 88824 88208 87472 86775 86292
55221 86292 86053 85905 85701 85390 84990 84612 84421 84341 83968 83136 82392 82454 83254 84000 84246 84360 84790 85339 85523 85375
55201H5375J41Q70J285R68L81L11P92R65J99r83j578j361r02n23j8O14R45P63
55183H8244L57k6m19p50p36l76M0L68N81M53j28o28n18k77p06j372j014L66J263
55164H4722R23M10P21J176P72o7l12l7j1j91O4O36P15J61k89j40L32O91P27K80
55144I1283o56j545j593o21O76J389J178M96J21L70P17N09p7l12r7k4k17o4N31
55125I2064O94k9q23q70n87o85q53l98M73J065J366J723J762Q44o54j617j617
55108I1858j138n28K41Q75Q69M26L94J090J861J971J317L21l97k92N63J338J334
55091A02103Q60O07N60K39k78m24q3L70P75J143J140N13j66j70J66q1q16j018
55073A05440m57l8j61r1O04J148Q38J46j77k79o17r30p48m13o37j318j624j137
$$ plain form
55201 85375 85516 86386 87671 88639 89020 89331 90123 91088 91287 90304 88726 87365 86463 85940 85922 86536 87481 88244
55183 88244 88601 88575 88156 87406 86670 86294 86334 86702 87283 87736 87608 86980 86462 86185 85479 84107 83093 83459 84722
55164 84722 85645 86055 86776 87952 88724 88657 88345 88308 88297 88106 88170 88806 89521 89682 89393 89253 89585 90276 91003 91283
55144 91283 90627 89082 87489 86868 87544 88933 90111 90607 90728 91098 91815 92324 92247 91935 91838 91814 91597 91533 92064
55125 92064 92758 92729 91906 91036 90449 89764 88911 88513 88986 90051 91417 93140 94902 95746 95092 93475 91858
55108 91858 90720 90192 90433 91308 92177 92603 92997 94087 95948 97919 99236 99557 99160 98868 99431 100769 102103
55091 102103 102963 103570 104130 104369 104091 103667 103584 103954 104729 105872 107012 107525 107359 107189 107355 107274 106458 105440
55073 105440 104983 104945 104784 104693 105297 106445 107283 107429 107252 106973 106356 105426 104678 104265 103628 102310 100686 99549
55055I9549k82L33M73K22k19o05p86p83o31l89l71q81j571j522l89R95J597J442
55037I6182J275J332J185O75K35O1k82j089j816j683p36K06N89O39P57R07Q09
55020I9246M59L1m59j007j229o83L54R51O12j19l99l2O18J305J974K396K269J717
55002A08004J272J288J580J714J401P56K66L92J061J670J726J275N86k04q92j134
54986A20761r54q83j192j399j066o62q36j228r13Q1O72K59n05p48m38k8K79M56
54968A11656L82R6m0J57L40J67p9J55Q32J250Q92Q3l74j10M01M61Q6p6K13L08
54948A16800l49j251j478j030p65j016j102m71L96O45J63m51o79m94j18L15Q70
54931A09985J688K666L327L220K479J714J404J625K282L189L990M429M734N281
$$ plain form
55055 99549 99267 99600 100073 100295 100076 99471 98685 97902 97271 96882 96511 95630 94059 92537 92148 93143 94740 96182
55037 96182 97457 98789 99974 100649 100884 100945 100663 99574 97758 96075 95339 95545 96134 96773 97530 98437 99246
55020 99246 99705 99736 99277 98270 97041 96358 96712 97663 98275 98156 97757 97725 98343 99648 101622 104018 106287 108004
55002 108004 109276 110564 112144 113858 115259 116015 116281 116673 117734 119404 121130 122405 122991 122787 121895 120761
54986 120761 119807 118924 117732 116333 115267 114605 113769 112541 111628 111709 112381 112640 112135 111387 110949 110921 111200 111656
54968 111656 112038 112134 112094 112251 112591 112758 112679 112834 113666 114916 115808 115891 115517 115407 115808 116269 116355 116279 116492 116800
54948 116800 116451 115200 113722 112692 111927 110911 109809 109338 109734 110379 110542 110091 109412 108918 108800 109115 109985
54931 109985 111673 114339 117666 120886 123365 125079 126483 128108 130390 133579 137569 141998 146732 152013
54917A52013N892N962N393M752M362L772K478O77j098k639m008n137n938o490
54903A59991o753o366n163l712k858k747k745k305j594j155j152j257j114p63
54889A20307m29j24L48R47J403J713K246L025L408K977K390K597L506M210M421
54874A52945M669N074M987M245L718L893L805K286k41k245l043l315l716l981
54860A69081l701l202l153l611l935l645k991k604k668k742k390j810j511j611
54846A29507j808j967k161k193j650o80j03l31p42n57L8K19l58j259j932k112
54830A11911j726q89nN05N77L80J0m15n40j68L34M48J77q5j94k65j76L28J020
54811A11227J330J195J178J530J737J354P95P82J285J537J091L58K3K08M30K48
$$ plain form
54917 152013 157905 163867 169260 174012 178374 182146 184624 185301 184203 181564 177556 172419 166481 159991
54903 159991 153238 146872 141709 137997 135139 132392 129647 127342 125748 124593 123441 122184 121070 120307
54889 120307 119878 119754 120102 121049 122452 124165 126411 129436 132844 135821 138211 140808 144314 148524 152945
54874 152945 157614 162688 167675 171920 175638 179531 183336 185622 185381 183136 180093 176778 173062 169081
54860 169081 165380 162178 159025 155414 151479 147834 144843 142239 139571 136829 134439 132629 131118 129507
54846 129507 127699 125732 123571 121378 119728 119048 118945 118614 117872 117315 117353 117572 117214 115955 114023 111911
54830 111911 110185 109296 109291 109796 110373 110753 110763 110348 109808 109640 109974 110422 110599 110514 110320 110055 109879 110207 111227
54811 111227 112557 113752 114930 116460 118197 119551 120346 121128 122413 123950 125041 125399 125422 125630 126060 126308
54795A26308j94l82j16K14J46k17m14l39l75o64o81Q3J281J977J765J209J104
54778A30705J546J964J862J292P19N93J043J861K765L707M827O045O882O968O604
54763A79383O482O889P487P918Q142Q012P031M926K130p25l455n994p812q429
54749B11985q339q539r088q971p727o339n862n888n174l517k026j635k024k272
54735A34584j880j004l2O61Q30N90L82N67J094J695K259K852L465L947M209M414
54719A58633M849N550O044N612M021J938M11j86m78j275k582l740m323m521m622
54704A65331m601m458m528n005n349m755l214j688j048j262j734k059k113j773
54690A21744j025j63M15N33K39l10p20m96L21R24O90N7m9M06N29k09j273j863
$$ plain form
54795 126308 126114 125732 125616 125830 125976 125759 125345 125006 124631 123967 123286 123369 124650 126627 128392 129601 130705
54778 130705 132251 134215 136077 137369 138088 138681 139724 141585 144350 148057 152884 158929 165811 172779 179383
54763 179383 185865 192754 200241 208159 216301 224313 231344 236270 238400 237675 234220 228226 220414 211985
54749 211985 203646 195107 186019 177048 169321 162982 157120 151232 146058 142541 140515 138880 136856 134584
54735 134584 132704 131700 131668 132329 133159 133749 134131 134698 135792 137487 139746 142598 146063 150010 154219 158633
54719 158633 163482 169032 175076 180688 184709 186647 187058 186872 186394 185119 182537 178797 174474 169953 165331
54704 165331 160730 156272 151744 146739 141390 136635 133421 131733 130685 129423 127689 125630 123517 121744
54690 121744 120719 120556 120971 121504 121743 121433 120713 120217 120538 121462 122152 122209 122160 122566 123095 122886 121613 119750
54672A19750j817j453j011n87k63kL76Q69J197J178R39O00O3o67j254j380j142
54655A15396q12m61J6O25J237J684J774J402P20P6l72o84q52p01k21L50Q18J132
54637A21127J179Q63N00N77R36P92j32r80q01K01R84R59L95k50q50j338j477j099
54619A21586m11J13J27k72n83l94J27M35K64j87o66j053j058m01N47Q51K37l78
54601A18884p3Q08J231Q70K45k86q57j413j484q02L31J363J864J654R86N58P82
54584A24661J124P21l51j030o61K27P57P82P39Q27Q00M41j26n65o62m84k88j86
54566A26726k2K66L74J7m57l57L91J001P52j03o72m28K81O49K38o26j202j113
54548A25715o39j60M04J248K014K072J435Q65R07J290J521J546J522J373J018
$$ plain form
54672 119750 117933 116480 115469 114882 114619 114617 114993 115862 117059 118237 119176 119776 119839 119172 117918 116538 115396
54655 115396 114584 114123 114139 114764 116001 117685 119459 120861 121581 121657 121285 120601 119749 119048 118827 119177 119995 121127
54637 121127 122306 123169 123669 124246 125182 125974 125842 124862 124061 124262 125246 126205 126600 126350 125500 124162 122685 121586
54619 121586 121175 121288 121415 121143 120560 120166 120293 120728 120992 120805 120139 119086 118028 117627 118174 119025 119262 118884
54601 118884 118811 119619 120850 121720 121965 121679 120822 119409 117925 117123 117454 118817 120681 122335 123321 123879 124661
54584 124661 125785 126506 126155 125125 124464 124691 125448 126230 126969 127796 128596 129037 128911 128346 127684 127200 126912 126726
54566 126726 126704 126970 127344 127361 126904 126547 126938 127939 128691 128588 127916 127488 127769 128418 128656 128030 126828 125715
54548 125715 125076 124916 125320 126568 128582 130654 132089 132954 133861 135151 136672 138218 139740 141113 142131
54533A42131P68R53J261R59j30j231j457p51R1L38j6m62o78p78q92q52m88j2K18
54514A38972K47M03O17L48n86j513j572p38K06O47P01P58Q49O91J92l91q13j108
54496A37910j373j445j034j52Q00J421J613J440R17J22o48j056j011o72k25J98
54480A36805N49Q83J238J385R13j66j162j383r07l02K04Q43J626K138K106J741
54464A46511J357J021P69P33Q57Q23M70M7j59j31Q4M76P24K81p94j511j047R6
54446A50607P95P89P45Q42L84q63j917j850j139q84j133j041m57k50p88j128l55
54429A42357J025J747J463Q72M65k9p66j177o15P68K104K609K116J025n1o69p42
54412A52502l88K36P74P07q6q98r00k49O9l65p94l70O79J401J302P48L89N26R16
$$ plain form
54533 142131 142899 143852 145113 146072 145942 144711 143254 142503 142594 142932 142916 142454 141776 140998 140106 139254 138766 138754 138972
54514 138972 139219 139622 140239 140587 140001 138488 136916 136178 136384 137031 137732 138490 139339 140030 140222 139831 139018 137910
54496 137910 136537 135092 134058 133906 134706 136127 137740 139180 140097 140219 139571 138515 137504 136832 136607 136805
54480 136805 137354 138237 139475 140860 141773 141607 140445 139062 138155 137853 138057 138900 140526 142664 144770 146511
54464 146511 147868 148889 149658 150391 151248 152071 152541 152588 152429 152298 152382 152858 153582 153863 153069 151558 150511 150607
54446 150607 151402 152191 152936 153778 154162 153299 151382 149532 148393 147509 146376 145335 144878 144628 143840 142712 142357
54429 142357 143382 145129 146592 147464 147929 147900 147134 145957 145342 146110 148214 150823 152939 153964 153913 153244 152502
54412 152502 152114 152350 153124 153831 153745 152847 151947 151698 151767 151402 150608 150238 150917 152318 153620 154368 154757 155283 156199
54393A56199J032O46K38M86J287J859J845J734J826J539L82j040j761j747j618
54378A62907j485j010l66j48k98j53L76N66R4m02l57n1R7K83P56J186J177R87
54360A64159J072J278J166Q91R95J476J746J576J458J764K134K052J673J580J879
54345A86899J983J435N48m7l13q33j936l165l823l797l547l440l435l377l223
54330A59929k911k275j259r7Q23J234J150P93L74m5l97m48k8N02M59k84r94r87
54312A55539n41m15p65j017q19m33k36l29p28j420k068k071j225k3Q81J294J427
54295A47051J431J203O21j63o20k90N86J117P73R2J1O39J225J201O73p2r01j523
54277A53054j460o87J59M74L33K60N61J079J377J139N20P4O5J12j33k60L24J268
$$ plain form
54393 156199 157231 157877 158115 158601 159888 161747 163592 165326 167152 168691 169073 168033 166272 164525 162907
54378 162907 161422 160412 160046 159898 159600 159447 159823 160389 160483 160081 159724 159673 159770 160053 160809 161995 163172 164159
54360 164159 165231 166509 167675 168566 169561 171037 172783 174359 175817 177581 179715 181767 183440 185020 186899
54345 186899 188882 190317 190865 190818 190505 189672 187736 184571 180748 176951 173404 169964 166529 163152 159929
54330 159929 157018 154743 153484 153387 154210 155444 156594 157387 157761 157716 157319 156871 156843 157345 157804 157520 156526 155539
54312 155539 154998 154583 153818 152801 151982 151549 151313 150984 150256 148836 146768 144697 143472 143449 144330 145624 147051
54295 147051 148482 149685 150306 150143 149523 149233 149819 150936 151709 151801 151812 152451 153676 154877 155550 155478 154577 153054
54277 153054 151594 150907 151066 151540 151873 152133 152694 153773 155150 156289 156809 156883 156948 157060 156927 156667 156991 158259
54259A58259J597J198J052J670K239J775N32m41o18l28j04k35p01j155j167p87
54243A62786n95r11j345j373j015n82j80J24N5m70r89j003n88j67R1K77M03M22
54225A54940L85L01J08n8Q7L56P4r63j932j915r68J74R85J276Q93No64o07k70
54206A52207l33n35p3J000J689J423P08J85j31m68p21p07n50m54m01l35l83o00
54188A51521p10l68L62R98J060M89l17q51r47p95n68k10L15P94R99Q98N48qn41
54169A52669o52l17l4j32k50P3N86O43J14n53j017j266j245q37k54L4j17l97m41
54150A46607r2O04J322J505R50K32P1L96N30J86k35l42j62J86O15Q63O43J26j77
54131A53828j37p7j17M9N10Q39O67J83j69j75J18N24P78P79Q26J230J743J763
$$ plain form
54259 158259 159856 161054 162106 163776 166015 167790 168322 167881 167263 166935 166831 166596 165895 164740 163573 162786
54243 162786 162191 161280 159935 158562 157547 156965 156785 156909 156964 156494 155505 154502 153914 153747 153838 154115 154518 154940
54225 154940 155325 155626 155734 155676 155763 156119 156193 155230 153298 151383 150415 150589 151574 152850 153743 153748 153084 152477 152207
54206 152207 151874 151339 151266 152266 153955 155378 156086 156271 156140 155672 154951 154244 153694 153240 152839 152504 152121 151521
54188 151521 150811 150443 150805 151803 152863 153352 153035 152184 151237 150442 149874 149664 149979 150773 151772 152670 153218 153210 152669
54169 152669 152017 151700 151666 151534 151284 151357 151943 152586 152700 152147 151130 149864 148619 147782 147528 147562 147445 147048 146607
54150 146607 146515 147119 148441 149946 150896 151128 151199 151595 152125 152311 152076 151734 151572 151758 152373 153236 153879 154005 153828
54131 153828 153691 153614 153497 153546 154056 154895 155562 155745 155576 155401 155519 156043 156821 157600 158426 159656 161399 163162
54113A63162J227P33O97Q53P83M35l6n58j003j211j224j153p79J92J350J796J298
54096A66562O14L13M8n97j177j044l68J74L82N50P49Q08Q34J063J214P29l03j015
54078A69536o91M65J658K212J990J446J326J991K931L263K748K057J967K590L508
54063A98997M368N081N574N639N093M077L028K265J579L98j470l434m690n031
54049B21474m865m549m007l041j684j27J417K633L146K943K590K705L237L614
54035B25486L604L654M213N075N750O189O600O733O009M530L265K839K686J977
54021B88610R79P24J453K133J711L16j032j524j210q26j134k195l255l552l222
54006B77976l114l751m826n697n950n472m442l400k889k863k824k579k340k065
$$ plain form
54113 163162 164389 165122 165819 166672 167455 167890 167854 167296 166293 165082 163858 162705 161926 162118 163468 165264 166562
54096 166562 167176 167489 167537 166940 165763 164719 164351 164525 164907 165457 166206 167014 167848 168911 170125 170854 170551 169536
54078 169536 168845 169310 170968 173180 175170 176616 177942 179933 182864 186127 188875 190932 192899 195489 198997
54063 198997 203365 208446 214020 219659 224752 228829 231857 234122 235701 236099 234629 231195 226505 221474
54049 221474 216609 212060 208053 205012 203328 203201 204618 207251 210397 213340 215930 218635 221872 225486
54035 225486 229090 232744 236957 242032 247782 253971 260571 267304 273313 277843 281108 283947 286633 288610
54021 288610 289589 290313 291766 293899 295610 295926 294894 293370 292160 291334 290200 288005 284750 281198 277976
54006 277976 274862 271111 266285 260588 254638 249166 244724 241324 238435 235572 232748 230169 227829 225764
53992B25764j418n71l21r44j579j379o94m16n79n03l9J90j32n12m59j07K38O57
53974B17196J332K019K306K229K241K543K704K189J105J59j81k53o62j432k093
53959B31402k416k563k507j897p26M28J155J651K085K158J767J565K129L031L468
53944B40730L521L888M591M912M641M422M630M777M467M136M231M326L657K247
53930B99176R59N47J088K166L181L655L564L372L504L938M469N065N763O462P198
53915C54107Q352J0123J1970J3138J3719J4565J6032J7336J7440J6182J4086J1357
53903E18407P576K491l304q639j2599j4983j6032j5977j4915j3086j1091r646
53891D08202r022q848q572q068p637p494p427p150o771o699p074p546p663p264
$$ plain form
53992 225764 224346 223775 223454 222510 220931 219552 218858 218442 217863 217360 217321 217511 217379 216867 216408 216301 216539 217196
53974 217196 218528 220547 222853 225082 227323 229866 232570 234759 235864 236023 235842 235589 234927 233495 231402
53959 231402 228986 226423 223916 222019 221293 221721 222876 224527 226612 228770 230537 232102 234231 237262 240730
53944 240730 244251 248139 252730 257642 262283 266705 271335 276112 280579 284715 288946 293272 296929 299176
53930 299176 300135 300682 301770 303936 307117 310772 314336 317708 321212 325150 329619 334684 340447 346909 354107
53915 354107 362459 372582 384552 397690 411409 425974 442006 459342 476782 492964 507050 518407
53903 518407 525983 528474 525170 516531 503932 488949 472917 456940 442025 428939 417848 408202
53891 408202 399180 390332 381760 373692 366055 358561 351134 343984 337213 330514 323440 315894 308231 300967
53877C00967o379n043l490k381k384l318m105l867k923k434l065m358n332n402
53863B46486m582l281k176j964k743l692l834l108k260j742j247n42r7m22j185
53848B13611j513j035j56M97N37j04j045j519j140m90m67j076j469j187o99n80
53832B02165p79r70j046q66j47R74J708J516Q97P50J238J761J878J667J360J092
53816B13198R87J091J231J214J112J087J123J236J655K410K985K883K392K310
53802B36914K987M083N144N889O080N673N110M927N035M940M587M408M453M195
53788C04425L408K588K240K203K044J603R46J78m66q01j144k006l147l650l311
53773C05110l193m080n179n214m298l663l733l703l112k699l205m168m597m304
$$ plain form
53877 300967 294588 289545 286055 283674 281290 277972 273867 270000 267077 264643 261578 257220 251888 246486
53863 246486 241904 238623 236447 234483 231740 228048 224214 221106 218846 217104 215857 215315 215218 214796 213611
53848 213611 212098 211063 210907 211404 211941 211837 210792 209273 208133 207643 207176 206100 204631 203444 202745 202165
53832 202165 201386 200416 199370 198504 198357 199331 201039 202555 203452 204202 205440 207201 209079 210746 212106 213198
53816 213198 214185 215276 216507 217721 218833 219920 221043 222279 223934 226344 229329 232212 234604 236914
53802 236914 239901 243984 249128 255017 261097 266770 271880 276807 281842 286782 291369 295777 300230 304425
53788 304425 307833 310421 312661 314864 316908 318511 319457 319635 319169 318368 317224 315218 312071 308421 305110
53773 305110 301917 297837 292658 287444 283146 279483 275750 272047 268935 266236 263031 258863 254266 249962
53759B49962l922l880m031m136m162m054l615k825j999j523j491j656j637j201
53745B09830m25L40P51P64O14M36J24l86p97o84q3M31M47K50M09R64J425J477
53727B15887J326J229J187J193J403J785J987J899J914K224K246J388J56k68M35
53712B35991J333J540J221R78R07Q00Q30J396K439L436M014M165L902L184K190
53697B68326J342R54J110J788K778L533L538K983K624K767K825K234J377J075
53683B99254J297J086j39j742k614k407j647r46n34m02m53m65l04k38n87j044
53667B88115q45O8O09j73j720k525j958q55k63k84m50o01q88j217j277j015o90
53650B74031m91l54j38K04N90P74M86j54n40j39R30K072K769K782K108J097M05
$$ plain form
53759 249962 246040 242160 238129 233993 229831 225777 222162 219337 217338 215815 214324 212668 211031 209830
53745 209830 209405 209745 210496 211260 211874 212310 212434 212048 211251 210567 210484 210915 211362 211612 212021 212985 214410 215887
53727 215887 217213 218442 219629 220822 222225 224010 225997 227896 229810 232034 234280 235668 235824 235556 235991
53712 235991 237324 238864 240085 241063 241970 242770 243600 244996 247435 250871 254885 259050 262952 266136 268326
53697 268326 269668 270622 271732 273520 276298 279831 283369 286352 288976 291743 294568 296802 298179 299254
53683 299254 300551 301637 301498 299756 297142 294735 293088 292142 291608 291206 290753 290288 289984 289746 289159 288115
53667 288115 287270 287338 287947 287774 286054 283529 281571 280716 280453 280169 279719 279118 278230 277013 275736 274721 274031
53650 274031 273540 273186 273048 273252 273842 274616 275102 274948 274408 274269 275199 277271 280040 282822 284930 286027 286432
53633B86432L61N24L15n4J34R97J846K239K500K959L308L110K534K139K216K711
53617C14271L481M298M747M584M021L483L220L294L658L991L905L526L510M048
53603C68037M340L589K214J384J564K180K628K893L121L249L249L220L076K591
53589D07335J922J481J157K16j578l271l695k868j974j967k734l590m181m578
53575C81675m739m311l181j979j578k057k505k125j186n32m55n10k87J94P14J026
53559C58164Q12R0m31l5R29J410J184J264K337L617L891L135K355K147K226K222
53543C85317K229K421K711K964L282L862M752N784O613O932O800O654O816P129
53529D54266P360P717Q588R828J0753J1005J1099J1843J3284J4558J4912J4715
$$ plain form
53633 286432 286793 287317 287632 287578 287712 288709 290555 292794 295294 298253 301561 304671 307205 309344 311560 314271
53617 314271 317752 322050 326797 331381 335402 338885 342105 345399 349057 353048 356953 360479 363989 368037
53603 368037 372377 375966 378180 379564 381128 383308 385936 388829 391950 395199 398448 401668 404744 407335
53589 407335 409257 410738 411895 412111 410533 407262 403567 400699 398725 396758 394024 390434 386253 381675
53575 381675 376936 372625 369444 367465 365887 363830 361325 359200 358014 357482 357027 356517 356230 356424 357138 358164
53559 358164 358976 359066 358635 358600 359529 360939 362123 363387 365724 369341 373232 376367 378722 380869 383095 385317
53543 385317 387546 389967 392678 395642 398924 402786 407538 413322 419935 426867 433667 440321 447137 454266
53529 454266 461626 469343 477931 487759 498512 509517 520616 532459 545743 560301 575213 589928
53517E89928J5095J6560J8329J9344J9608J9995K0950K2051K2855K3480K4125
53506H12320K4667K5044K5447K5778K5499K4469K3357K2744K2354K1769K1309
53495A074757K1415K1600K1041J9977J9510J9918K0139J9239J7612J6389J6201
53484A287798J6818J7597J7926J7585J6932J6475J6177J5455J3936J1834R498
53473A458031P048M619K546R83l74j960l944o292q939j1668j4038j5617j6262
53460A394133j6209j6013j6286j7233j8430j9348j9969k0610k1308k1853k2312
53449A184562k2855k3058k2169k0282j8552j7829j7646j6987j5524j3601j1509
53438I84550r421p679o469n398l980k380j073Q2J682L678N182N674N815O616Q132
$$ plain form
53517 589928 605023 621583 639912 659256 678864 698859 719809 741860 764715 788195 812320
53506 812320 836987 862031 887478 913256 938755 963224 986581 1009325 1031679 1053448 1074757
53495 1074757 1096172 1117772 1138813 1158790 1178300 1198218 1218357 1237596 1255208 1271597 1287798
53484 1287798 1304616 1322213 1340139 1357724 1374656 1391131 1407308 1422763 1436699 1448533 1458031
53473 1458031 1465079 1469698 1472244 1473227 1472853 1470893 1466949 1460657 1451718 1440050 1426012 1410395 1394133
53460 1394133 1377924 1361911 1345625 1328392 1309962 1290614 1270645 1250035 1228727 1206874 1184562
53449 1184562 1161707 1138649 1116480 1096198 1077646 1059817 1042171 1025184 1009660 996059 984550
53438 984550 975129 967450 960981 955583 951603 949223 948150 948232 949914 953592 958774 964448 970263 976879 985011
53423I85011R546J0347J0965J2189J4241J6626J8637J9919K0685K1567K3158K5437
53411A188328K7646K9009K9663L0617L2652L5407L7854L9439M0501M1677M3302
53400A576095M5367M7650M9783N1434N2575N3398N4004N4479N5164N6394N7819
53389B154162N8437N7586N5627N3429N1406M9363M7016M4361M1615L8946L6296
53378B688244L3367K9964K6253K2423J8187J3139P671K871r24m908j0510j7671
53366B808106k4991l1391l6921m1991m6537n0230n2985n4970n6297n6936n6814
53355B298043n5913n4425n2760n1222m9700m7924m5982m4281m3021m2089m1465
53344A769261m1317m1536m1542m0833l9495l7911l6247l4409l2368l0169k7694
$$ plain form
53423 985011 994557 1004904 1015869 1028058 1042299 1058925 1077562 1097481 1118166 1139733 1162891 1188328
53411 1188328 1215974 1244983 1274646 1305263 1337915 1373322 1411176 1450615 1491116 1532793 1576095
53400 1576095 1621462 1669112 1718895 1770329 1822904 1876302 1930306 1984785 2039949 2096343 2154162
53389 2154162 2212599 2270185 2325812 2379241 2430647 2480010 2527026 2571387 2613002 2651948 2688244
53378 2688244 2721611 2751575 2777828 2800251 2818438 2831577 2839248 2842119 2841195 2836287 2825777 2808106
53366 2808106 2783115 2751724 2714803 2672812 2626275 2576045 2523060 2468090 2411793 2354857 2298043
53355 2298043 2242130 2187705 2134945 2083723 2034023 1986099 1940117 1895836 1852815 1810726 1769261
53344 1769261 1727944 1686408 1644866 1604033 1564538 1526627 1490380 1455971 1423603 1393434 1365740
53333A365740k4761k1460j8264j5731j4186j3547j3355j3080j2563j2137j2093
53322A194563j2190j1947j1284j0513r715q588p135n965n507n210m082k006J05
53309A100526J462K284L290M733O301P694Q932J0179J1528J2974J4387J5664J7047
53296A217001J9031K1686K4257K5875K6542K7017K7750K8389K8415K7779K6732
53285A500474K5403K3796K1949J9853J7427J4760J2199R923P613M826J569j728
53273A658064m769p593j0305j2836j5093j7151j9124k1011k2724k4232k5578k6812
53261A450836k7944k8937k9694l0071l0030k9835k9902l0316l0562l0027k8742
53250A124776k7398k6561k6154k5815k5479k5275k5155k4937k4632k4315k3801
$$ plain form
53333 1365740 1340979 1319519 1301255 1285524 1271338 1257791 1244436 1231356 1218793 1206656 1194563
53322 1194563 1182373 1170426 1159142 1148629 1138914 1130326 1123191 1117226 1111719 1106509 1102427 1100421 1100526
53309 1100526 1101988 1104272 1107562 1112295 1118596 1126290 1135222 1145401 1156929 1169903 1184290 1199954 1217001
53296 1217001 1236032 1257718 1281975 1307850 1334392 1361409 1389159 1417548 1445963 1473742 1500474
53285 1500474 1525877 1549673 1571622 1591475 1608902 1623662 1635861 1645784 1653397 1658223 1659792 1658064
53273 1658064 1653295 1645702 1635397 1622561 1607468 1590317 1571193 1550182 1527458 1503226 1477648 1450836
53261 1450836 1422892 1393955 1364261 1334190 1304160 1274325 1244423 1214107 1183545 1153518 1124776
53250 1124776 1097378 1070817 1044663 1018848 993369 968094 942939 918002 893370 869055 845254
53239H45254k2832k1554k0507j9949j9485j8456j6619j4467j2923j2473j2538
53228F53451j1942j0263q416p571p861q631r477j0320j0854j0865j0952j1893
53216E34406j3200j3482j2492j1616j1698j1630j0128p976p108p902q755q403
53204D10016p413o983p258p457p144o734o829p479q099q045p243o260n659n413
53190C12000n103m531l912l459l086k567j882j354j415k095k776k722j920j146
53176B74032r90j211j194p76k97r0k30n71q09p20n34p53j380j758j505j106j134
53159B58974j346j159p09o45j092j543j693j699j587j127m39j30n57j295j562
53144B42391r35L22J427J672J130O09O43Q42O29J89N5J22m1k30J13P41P84J63
$$ plain form
53239 845254 822422 800868 780361 760412 740927 722471 705852 691385 678462 665989 653451
53228 653451 641509 631246 622830 615259 607398 598767 589290 578970 568116 557251 546299 534406
53216 534406 521206 507724 495232 483616 471918 460288 450160 442184 435076 427174 418419 410016
53204 410016 402603 395620 388362 380905 373761 367027 360198 352719 344620 336575 329332 323072 317413 312000
53190 312000 306897 302366 298454 294995 291909 289342 287460 286106 284691 282596 279820 277098 275178 274032
53176 274032 273042 271831 270637 269861 269564 269474 269244 268673 267864 267144 266610 265857 264477 262719 261214 260108 258974
53159 258974 257628 256469 255760 255115 254023 252480 250787 249088 247501 246374 245935 245805 245248 243953 242391
53144 242391 241456 241778 243205 244877 246007 246616 247259 248101 248730 248919 248974 249096 249055 248825 248938 249679 250463 250626
53126B50626k07R2L66M5l76k26L64R07J283J463J198O13L75O53O26k25r98n78
53108B56001O13J140N31l68q86j289j910k446k506k170j735j355j173j296j503
53093B39648j428j118r82j101j023m41M02J084J339R61r0j274j678r77J52Q66
53077B34340J063J204J538J881J940J559Q35J61p3M9K1l81p68p71o25p37j014
53060B40222j066q41n96l63J9M36N21K35k5QJ64K09J78J74J40L4j2J37L90N74
53040B40538N66K87k55q15j080j083j172j448j506j025k70K63M82O52Q48Q85O97
53023B36564M40K28O0N9M29J096J619J646J261Q04N38M97N69N58L94K47L50O47
53005B48006P71M74o2m36m53k50p7o1j71l52o31r34r15k13R99J967K042J256J35
$$ plain form
53126 250626 250419 250511 250877 250922 250546 250320 250684 251591 252874 254337 255535 256148 256523 257176 257802 257577 256579 256001
53108 256001 256614 257754 258285 257917 257031 255742 253832 251386 248880 246710 244975 243620 242447 241151 239648
53093 239648 238220 237102 236120 235019 233996 233555 233957 235041 236380 237341 237251 235977 234299 233322 233474 234340
53077 234340 235403 236607 238145 240026 241966 243525 244360 244521 244448 244497 244518 244137 243369 242598 241973 241236 240222
53060 240222 239156 238315 237719 237356 237375 237811 238332 238567 238542 238550 238714 238923 239101 239275 239415 239449 239437 239574 239964 240538
53040 240538 241104 241391 241136 240321 239241 238158 236986 235538 234032 233007 232737 233000 233482 234134 234982 235867 236564
53023 236564 237004 237232 237292 237351 237780 238876 240495 242141 243402 244206 244744 245241 245810 246368 246762 247009 247359 248006
53005 248006 248777 249251 249189 248753 248300 248050 247973 247912 247741 247389 246758 245824 244909 244696 245695 247662 249704 250960 251095
52986B51095p74j001k73R93J754J426P10O27J042J019M92M18J120J625J206N15
52970B61994M02N49K48r8M43J626K117J375L95L26J116J850J880J285O46N46R11
52953B77611Q48l76k208l263k986k218j859j743j315p92q19j321j458p94J09M62
52937B57878J95j58k80l62o07p77m71K13O28L19l98q29p33m64l59l59l37m32p75
52918B51892j104r75l91J13J28n7J48P65J111P09l5l88k60j87m22o89q02r48j106
52899B47502q70j93K88J73L1N67J476J860J481Q65L13k84p40n58J00K66n78j688
52881B50011j970j346o83o44j070j432j441j110n10L02J067J345R42L21K11O96
52865B44689J115J030R02J382K308K881K684K003J282P54M77K77k73j354k516
$$ plain form
52986 251095 250321 249320 249047 250040 251794 253220 253930 254557 255599 256618 257110 257528 258648 260273 261479 261994
52970 261994 262396 262945 263193 263095 263538 265164 267281 268656 269051 269377 270493 272343 274223 275508 276154 276700 277611
52953 277611 278459 278083 275875 272612 269626 267408 265549 263806 262491 261699 260880 259559 258101 257307 257416 257878
52937 257878 258073 257915 257635 257273 256666 255889 255418 255631 256259 256578 256180 255351 254618 254154 253795 253436 253099 252667 251892
52918 251892 250788 249813 249422 249535 249663 249606 249754 250519 251630 252339 252304 251916 251656 251469 251047 250358 249556 248608 247502
52899 247502 246632 246439 246727 246900 246931 247498 248974 250834 252315 253180 253493 253209 252469 251911 252011 252277 251699 250011
52881 250011 248041 246695 246012 245368 244298 242866 241425 240315 239805 240107 241174 242519 243461 243782 243993 244689
52865 244689 245804 246834 247736 249118 251426 254307 256991 258994 260276 261030 261507 261784 261511 260157 257641
52850B57641l204l483l707l762l304k570k169k055j543n40N5n18j896l021l123
52835B22801k115n47O84R79O24L73N04P07P94Q95J002R82R99J239J256M33q74
52818B30736j606j484j213j063m44P06J368R37K10J33N15P97J141J784K173J837
52802B36527J373J387J174k45k145k710j534k24k37j245k008j976j464r22n67
52787B25184m31m65n68o16l95K06Q06P54Jo44n47o6J75K72N86Q35N20m3r1L16
52767B25789L48k72r35j186j239j282j123p40m79m02q9N47R68Q41O14Q15J234
52750B23409J302R26N35M59O10P51P43N86M01L32M82Q67J377J783J898J798J769
52733B40028J907K012J948J810J637J309Q97P20Q03P74N57N69Q64P22k84j429
$$ plain form
52850 257641 254437 250954 247247 243485 240181 237611 235442 233387 231844 231304 231359 230841 228945 225924 222801
52835 222801 220686 220139 220823 221802 222426 222799 223303 224010 224804 225699 226701 227683 228682 229921 231177 231610 230736
52818 230736 229130 227646 226433 225370 224926 225632 227000 227937 228147 228280 228795 229592 230733 232517 234690 236527
52802 236527 237900 239287 240461 240216 238071 235361 233827 233603 233366 232121 230113 228137 226673 225751 225184
52787 225184 224753 224288 223720 223104 222709 222915 223721 224475 224476 223832 223285 223219 223394 223666 224252 225087 225607 225564 225473 225789
52767 225789 226137 225865 224930 223744 222505 221223 220100 219360 218881 218479 218390 218937 219905 220746 221360 222175 223409
52750 223409 224711 225637 226172 226631 227241 227992 228735 229321 229722 230054 230536 231403 232780 234563 236461 238259 240028
52733 240028 241935 243947 245895 247705 249342 250651 251548 252268 253071 253845 254402 254971 255835 256557 256273 254844
52717B54844j791j531j411j533j458j201j116j099q10m86n28n83l3P45Q30K66
52701B43105o3J0j39m52j00Q27J104L36k57K50J051J009L27j07j35p5J20N34P34
52682B48079M96M25R78J525J312O83L91K64k95r39q12o8J89m54j196j207m98M44
52664B49317J121J095L70k78l7Q08J204P99L03L65P69J082J343J788K330K609
52648B64988K326J467M71L7L04M05n59k180l136k880k144j612j047j25P36J062
52632B58113J202J705K204J753K43j214j480n44O50J149O54m81j610k132j752
52617B58460o25N92J061M74n42j015o85j93j80n49p80o65l79j01J52L73N68Q13
52599B56779J162J541J899K268K553K437J793R49L17j06n00p09m23J85N56M60
$$ plain form
52717 254844 253053 251522 250111 248578 247120 245919 244803 243704 242894 242408 241880 241297 241264 242009 242839 243105
52701 243105 243042 243052 242913 242461 242361 243188 244292 244628 244371 244621 245672 246681 247008 246901 246766 246691 246811 247345 248079
52682 248079 248575 249000 249978 251503 252815 253498 253889 254153 253858 252919 252107 252039 252228 251774 250578 249371 248873 249317
52664 249317 250438 251533 251903 251625 251588 252396 253600 254399 254702 255067 255836 256918 258261 260049 262379 264988
52648 264988 267314 268781 269252 269289 269593 269998 269439 267259 264123 261243 259099 257487 256440 256315 257051 258113
52632 258113 259315 261020 263224 264977 265220 264006 262526 261982 262632 263781 264435 263954 262344 260212 258460
52617 258460 257835 258427 259488 259962 259420 258405 257720 257527 257347 256798 256018 255353 254974 254873 255025 255398 255966 256779
52599 256779 257941 259482 261381 263649 266202 268639 270432 271381 271698 271592 271092 270383 269960 270145 270701 271161
52583B71161J84j02n11q70o05M23J492J835J499Q97J05q29j305q22K1J19n98j100
52565B70994q40m28m64o17m06j28k72o21o11k31Q3J27l7m24r33j142q49m58l02
52546B62441o5M40M42q15k572l202k317j068l34K69J155J770J513P99M19L92K39
52529B59506n1oN57J385K141K517K158J050j59o44k17N70J026Q12J17l76O1J458
52511B71905K995L818L840L511L131K705K246J768J120J69q84j662k031k148k178
52496B88305k165k149k164k204k242k234k033j515q18k66L2K38L52J30l81o38
52480B70248k91K65M15K32L57J091K010K496K342J832J398J277J417J607J792
52465B88488K074K412K491K068J363R40J145J671J741Q61n93j786k524l409m665
$$ plain form
52583 271161 271345 271243 270732 269862 269257 269680 271172 273007 274506 275403 275508 274679 273374 272552 272573 272692 272094 270994
52565 270994 270154 269726 269262 268645 268239 268111 267839 267218 266607 266376 266459 266586 266549 266125 265192 264050 263201 262743 262441
52546 262441 262376 262816 263258 262443 259871 256669 254352 253284 252950 253219 254374 256144 257657 258456 258875 259267 259506
52529 259506 259455 259449 260006 261391 263532 266049 268207 269257 269098 268454 268237 268807 269833 270645 270762 270386 270447 271905
52511 271905 274900 278718 282558 286069 289200 291905 294151 295919 297039 297208 296324 294662 292631 290483 288305
52496 288305 286140 283991 281827 279623 277381 275147 273114 271599 270781 270515 270547 270785 271137 271267 270886 270248
52480 270248 269957 270222 270637 270869 271226 272317 274327 276823 279165 280997 282395 283672 285089 286696 288488
52465 288488 290562 292974 295465 297533 298896 299836 300981 302652 304393 305254 304661 302875 300351 296942 292277
52450B92277n355m626l230k738l320l503k368q51k54n29p89p43o91o49l70K5J93
52433B62479J37J07J51K53M89O41J64q56j273k09J578K507K021R50K89M21J222
52416B71071K125K274J476P69J200K290K763K526K801M131N578O190O286O659
52402C18139P359P806P592O681N167L222R79j601m327o413p129o845o587o566
52388C17477o018m703l476k932k509j590o09k12q9M53J269J739J898K222K565
52373C05485K392J975K327L715N128N647N485N205M616L194J284L6QM70L86l34
52357C47019r33r39o42m14n0P90J819K326K063J586J536J938K260J962R45k64
52341C61002o93L31K418M294M994M743M578N219O501P737Q405Q514Q489Q772R510
$$ plain form
52450 292277 286922 282296 279066 276328 273008 269505 267137 266286 266032 265503 264714 263971 263280 262631 262261 262286 262479
52433 262479 262616 262723 262874 263127 263616 264257 264421 263565 262292 262083 263661 266168 268189 269139 269428 269849 271071
52416 271071 273196 275470 276946 277715 278915 281205 283968 286494 289295 293426 299004 305194 311480 318139
52402 318139 325498 333304 340896 347577 352744 355966 356945 355344 351017 344604 337475 330630 324043 317477
52388 317477 311459 306756 303280 300348 297839 296249 295640 295428 295339 295792 297061 298800 300698 302920 305485
52373 305485 307877 309852 312179 315894 321022 326669 332154 337359 341975 345169 346453 346489 346497 346967 347353 347019
52357 347019 346086 345147 344505 344091 344041 344831 346650 348976 351039 352625 354161 356099 358359 360321 361266 361002
52341 361002 360309 360640 363058 367352 372346 377089 381667 386886 393387 401124 409529 418043 426532 435304 444814
52326D44814J0564J1731J2926J4173J5525J6844J7675J7583J6691J5722J5230
52315F09478J5087J5034J5317J6290J7592J8353J8230J7672J7179J6882J6867
52304G93981J7212J7484J6884J5301J3703J2987J2848J2331J1165R964R152Q214
52292I51226O250L066m92l285m976o241p778r322j0020r644q878q324p787o830
52278H76965n492m067k573q83Q72K450L825N065O061O794P634Q897J0241J1023
52264I26812J1218J1518J2341J3220J3414J2882J2326J2332J2720J2885J2589
52253A064257J2228J2230J2442J2270J1364R924Q310O638M768K534k6k551m473
52240A149915n578o392p613r224j0518j1111j1350j1543j1416j0718r880r482
$$ plain form
52326 444814 455378 467109 480035 494208 509733 526577 544252 561835 578526 594248 609478
52315 609478 624565 639599 654916 671206 688798 707151 725381 743053 760232 777114 793981
52304 793981 811193 828677 845561 860862 874565 887552 900400 912731 923896 933860 943012 951226
52292 951226 957476 960542 960050 956765 951789 945548 937770 928448 918428 908784 899906 891582 883795 876965
52278 876965 871473 867406 864833 863950 864822 867272 871097 876162 882223 889017 896651 905548 915789 926812
52264 926812 938030 949548 961889 975109 988523 1001405 1013731 1026063 1038783 1051668 1064257
52253 1064257 1076485 1088715 1101157 1113427 1124791 1134715 1143025 1149663 1154431 1156965 1156939 1154388 1149915
52240 1149915 1144337 1137945 1130332 1121108 1110590 1099479 1088129 1076586 1065170 1054452 1044572 1035090
52228A035090r365q919q059p308o960o707o235n623n039m437l784l190k620j856
52214I54988r16k03J76Q51K423M450N753N805N295N105N283N316N029M645M278
52199A008278L928L826M188M619M422L613L100L550M650N646O077N675M287K408
52185A068267J159J038J186N25q41k140l324m897o695p925q405q710r016q856
52171A011366q203p732p627p124n724l980k549j286J33J423K239K836L528L958
52157I81258L653K866K176J667J083M98J18k23p33j101r38m89k57j22M55J457
52141I91368K289K624K684K618K270J659J180J110J373J861K735M188O180Q393
52127A032532J0417J1990J3296J4911J7214J9954K2501K4407K5576K6157K6508
$$ plain form
52228 1035090 1025725 1016806 1008747 1001439 994479 987772 981537 975914 970875 966438 962654 959464 956844 954988
52214 954988 954072 953869 954045 954896 957319 961769 967522 973327 978622 983727 989010 994326 999355 1004000 1008278
52199 1008278 1012206 1016032 1020220 1024839 1029261 1032874 1035974 1039524 1044174 1049820 1055897 1061572 1065859 1068267
52185 1068267 1069426 1070464 1071650 1072175 1071334 1069194 1065870 1060973 1054278 1046353 1037948 1029238 1020222 1011366
52171 1011366 1003163 995431 987804 980680 974956 970976 968427 967141 967274 968697 970936 973772 977300 981258
52157 981258 984911 987777 989953 991620 992703 993201 993319 993096 992363 991262 990324 989835 989578 989456 989911 991368
52141 991368 993657 996281 998965 1001583 1003853 1005512 1006692 1007802 1009175 1011036 1013771 1017959 1024139 1032532
52127 1032532 1042949 1054939 1068235 1083146 1100360 1120314 1142815 1167222 1192798 1218955 1245463
52116A245463K6980K7496K7534K6715K5172K3118K0508J7475J4699J2850J1878
52105A479888J1180J0267Q956P353N979N514N923O257N742M651L517K133M9k380
52091A555029m365n959p990j0827j3943j6687j8701j9616j9134j7525j5469j3384
52079A391429j1405r809q717p527n525k977q22P31K328M256O041P466Q934J0576
52065A384979J1938J2864J3698J4338J4096J3065J2434J2794J3080J2115J0364
52054A525765R123Q616P983O696M962L001R11r87k546m453p466j1064j3796j5155
$$ plain form
52116 1245463 1272443 1299939 1327473 1354188 1379360 1402478 1422986 1440461 1455160 1468010 1479888
52105 1479888 1491068 1501335 1510291 1517644 1523623 1529137 1535060 1541317 1547059 1551710 1555227 1557360 1557409 1555029
52091 1555029 1550664 1544705 1536715 1525888 1511945 1495258 1476557 1456941 1437807 1420282 1404813 1391429
52079 1391429 1380024 1370215 1361498 1353971 1348446 1345469 1344647 1345378 1347706 1351962 1358003 1365469 1374403 1384979
52065 1384979 1396917 1409781 1423479 1437817 1451913 1464978 1477412 1490206 1503286 1515401 1525765
52054 1525765 1534888 1543504 1551487 1558183 1563145 1566146 1567057 1566070 1563524 1559071 1551605 1540541 1526745 1511590
$$ [...]
##END NTUPLES=NMR SPECTRUM
##END=
