##TITLE=AC1428_PERAH13239_7764532_aaiA193wdL
##JCAMPDX= 6.0         $$ Bruker NMR JCAMP-DX V2.0
##DATA TYPE= NMR SPECTRUM
##DATA CLASS= NTUPLES
##ORIGIN= BRUKER
##OWNER= Administrator
$$ 1.72 TOPSPIN		Version 2.1
$$ 2015-07-09 20:59:02.378 -0700  Administrator@X
$$ Compression mode = diff/dup
##.OBSERVE FREQUENCY= 400.02188249412
##.OBSERVE NUCLEUS= ^1H
##.ACQUISITION MODE= SIMULTANEOUS (DQD)
##.ACQUISITION SCHEME= undefined
##.AVERAGES= 8
##.DIGITISER RES= 22
##SPECTROMETER/DATA SYSTEM= spect
##.PULSE SEQUENCE= zg30
##.SOLVENT NAME= COFFEE_meoh
##.SHIFT REFERENCE= INTERNAL, COFFEE_meoh, 1, 14.98509
##AUDIT TRAIL= $$ (NUMBER, WHEN, WHO, WHERE, PROCESS, VERSION, WHAT)
$$ ##TITLE= Audit trail, TOPSPIN		Version 2.1
$$ ##JCAMPDX= 5.01
$$ ##ORIGIN= Bruker BioSpin GmbH
$$ ##OWNER= Administrator
$$ $$ E:\/data/COFFEE/nmr/AC1428_PERAH13239_7764532_aaiA193wdL/20/pdata/1/auditp.txt
$$ ##AUDIT TRAIL=  $$ (NUMBER, WHEN, WHO, WHERE, PROCESS, VERSION, WHAT)
(   1,<2015-07-09 20:58:54.972 -0700>,<Administrator>,<X>,<go>,<TOPSPIN 2.1>,
      <created by zg
	started at 2015-07-09 20:57:49.128 -0700,
	POWCHK enabled, PULCHK disabled,
       configuration hash MD5:
       21 0F 79 D6 B3 7B B4 F6 88 20 88 DB 03 48 BD 9F
       data hash MD5: 64K
       6C FB 4C BF 18 92 53 23 05 C2 1D 55 59 97 DF B5>)
(   2,<2015-07-09 20:58:58.175 -0700>,<Administrator>,<X>,<proc1d>,<TOPSPIN 2.1>,
      <Start of raw data processing
       efp LB = 0 FT_mod = 6 PKNL = 1 PHC0 = 0 PHC1 = 0 SI = 32K 
       data hash MD5: 32K
       EF 3B 5C 6D 0E 97 DF 5B C3 B6 2F 98 FF 25 2B 65>)
(   3,<2015-07-09 20:58:58.472 -0700>,<Administrator>,<X>,<proc1d>,<TOPSPIN 2.1>,
      <pk PHC0 = 87.65991 PHC1 = 0 
       data hash MD5: 32K
       4C 36 A8 F0 D2 21 37 A2 2F C4 B7 9D 50 18 01 58>)
(   4,<2015-07-09 20:58:58.581 -0700>,<Administrator>,<X>,<proc1d>,<TOPSPIN 2.1>,
      <abs ABSG = 1 
       data hash MD5: 32K
       74 28 26 64 CD BF E2 9C 2D 7A 7F 48 F0 E9 0F 02>)
(   5,<2015-07-09 20:58:58.644 -0700>,<Administrator>,<X>,<proc1d>,<TOPSPIN 2.1>,
      <abs ABSG = 2 
       data hash MD5: 32K
       47 94 A2 58 76 6B 13 1A 89 50 0D 5C 06 B9 F3 A5>)
(   6,<2015-07-09 20:58:58.706 -0700>,<Administrator>,<X>,<proc1d>,<TOPSPIN 2.1>,
      <abs ABSG = 3 
       data hash MD5: 32K
       22 45 F4 C6 EE BD AA 9D CA B0 2B DB 04 26 98 19>)
(   7,<2015-07-09 20:58:58.769 -0700>,<Administrator>,<X>,<proc1d>,<TOPSPIN 2.1>,
      <abs ABSG = 4 
       data hash MD5: 32K
       3E 25 30 9B C3 4D EF A6 50 12 96 EB B8 20 E9 CE>)
(   8,<2015-07-09 20:58:58.831 -0700>,<Administrator>,<X>,<proc1d>,<TOPSPIN 2.1>,
      <abs ABSG = 5 
       data hash MD5: 32K
       C2 B9 D4 BD 11 BF 12 72 AC 31 C2 4A DB 7A 42 33>)
$$ ##END=
$$ 
$$ $$ hash MD5
$$ $$ 86 17 AB AB 90 AF 25 D7 EF 35 5E 3B 18 00 0B DD
##$RELAX= 
##$RELAX= 
##$RELAX= 
##$RELAX= 
##$RELAX= 
##$RELAX= 
##$RELAX= 
$$ Bruker specific parameters
$$ --------------------------
##$DU= <E:\>
##$EXPNO= 20
##$NAME= <AC1428_PERAH13239_7764532_aaiA193wdL>
$$ [...]
150 150 150 150 150 150 150 150
##$TP07= 0
##$TPNAME0= <>
##$TPNAME1= <>
##$TPNAME2= <>
##$TPNAME3= <>
##$TPNAME4= <>
##$TPNAME5= <>
##$TPNAME6= <>
##$TPNAME7= <>
##$TPOAL= (0..7)
0.5 0.5 0.5 0.5 0.5 0.5 0.5 0.5
##$TPOFFS= (0..7)
0 0 0 0 0 0 0 0
##$TUNHIN= 0
##$TUNHOUT= 0
##$TUNXOUT= 0
##$USERA1= <user>
##$USERA2= <user>
##$USERA3= <user>
##$USERA4= <user>
##$USERA5= <user>
##$V9= 5
##$VALIST= <valist>
##$VCLIST= <CCCCCCCCCCCCCCC>
##$VD= 0
##$VDLIST= <DDDDDDDDDDDDDDD>
##$VPLIST= <PPPPPPPPPPPPPPP>
##$VTLIST= <TTTTTTTTTTTTTTT>
##$WBST= 2048
##$WBSW= 25
##$XGAIN= (0..3)
0 0 0 0
##$XL= 0
##$YL= 0
##$YMAX_a= 615324
##$YMIN_a= -538406
##$ZGOPTNS= <>
##$ZL1= 120
##$ZL2= 120
##$ZL3= 120
##$ZL4= 120
##$ABSF1= 14.98509
##$ABSF2= -5.573092
##$ABSG= 5
##$ABSL= 3
##$ALPHA= 0
##$AQORDER= 0
##$ASSFAC= 0
##$ASSFACI= 0
##$ASSFACX= 0
##$ASSWID= 0
##$AUNMP= <proc_prof1d_extract_pilot.lims>
##$AXLEFT= 0
##$AXNAME= <>
##$AXNUC= <1H>
##$AXRIGHT= 0
##$AXTYPE= 0
##$AXUNIT= <>
##$AZFE= 0.1
##$AZFW= 0.1
##$BCFW= 0
##$BC_mod= 0
##$BYTORDP= 0
##$COROFFS= 0
##$CY= 15
##$DATMOD= 1
##$DC= 0
##$DFILT= <>
##$DTYPP= 0
##$F1P= 0
##$F2P= 0
##$FCOR= 0.5
##$FTSIZE= 32768
##$FT_mod= 6
##$GAMMA= 0
##$GB= 0
##$INTBC= 1
##$INTSCL= 1
##$ISEN= 128
##$LB= 0
##$LEV0= 0
##$LPBIN= 0
##$MAXI= 10000
##$MC2= 0
##$MEAN= 0
##$ME_mod= 0
##$MI= 0
##$NCOEF= 0
##$NC_proc= -8
##$NLEV= 6
##$NOISF1= 0
##$NOISF2= 0
##$NSP= 0
##$NTH_PI= 0
##$NZP= 0
##$OFFSET= 14.98509
##$PC= 1
##$PHC0= 87.65991
##$PHC1= 0
##$PH_mod= 1
##$PKNL= yes
##$PPARMOD= 0
##$PPDIAG= 0
##$PPIPTYP= 0
##$PPMPNUM= 2147483647
##$PPRESOL= 1
##$PSCAL= 4
##$PSIGN= 0
##$PYNMP= <proc.py>
##$REVERSE= no
##$SF= 400.02
##$SI= 32768
##$SIGF1= 0
##$SIGF2= 0
##$SINO= 400
##$SIOLD= 32768
##$SPECTYP= <>
##$SREGLST= <1H.CDCl3>
##$SSB= 0
##$STSI= 32768
##$STSR= 0
##$SW_p= 8223.68421052631
##$SYMM= 0
##$S_DEV= 0
##$TDeff= 65536
##$TDoff= 0
##$TI= <>
##$TILT= no
##$TM1= 0
##$TM2= 0
##$TOPLEV= 0
##$USERP1= <user>
##$USERP2= <user>
##$USERP3= <user>
##$USERP4= <user>
##$USERP5= <user>
##$WDW= 1
##$XDIM= 32768
##$YMAX_p= 455562620
##$YMIN_p= -694781
##$CURPLOT= <Network HP LaserJet P1505>
##$CURPRIN= <$Network HP LaserJet P1505>
##$DFORMAT= <normdp>
##$LAYOUT= <+/1D_H.xwp>
##$LFORMAT= <normlp>
##$PFORMAT= <normpl>
##$SURQMSG= 1
$$ End of Bruker specific parameters
$$ ---------------------------------
##NTUPLES= NMR SPECTRUM
##VAR_NAME=  FREQUENCY,     SPECTRUM/REAL,   SPECTRUM/IMAG
##SYMBOL=    X,             R,               I
##VAR_TYPE=  INDEPENDENT,   DEPENDENT,       DEPENDENT
##VAR_FORM=  AFFN,          ASDF,            ASDF
##VAR_DIM=   32768,         32768,           32768
##UNITS=     HZ,            ARBITRARY UNITS, ARBITRARY UNITS
##FACTOR=    0.250966925370066, 1,           1
##FIRST=     8223.43324360094, 15151,        -22844
##LAST=      0,             68673,           232894
##MIN=       0,             -694781,         0
##MAX=       8223.43324360094, 455562620,    0
$$ Real data points
##PAGE= N=1
##DATA TABLE= (X++(R..R)), XYDATA
$$ [...]
$$ plain form
19576 -210871 -209006 -81927 -52997 6538 186539 112661 81278 24559 -33014 -106890 -223335
19565 -223335 -184988 -42557 261876 -193761 -74221 112126 12461 38991 -290070 -51341 5333
19553 -121283 -38976 -97546 135710 -119210 -29834 -309513 -179357 -154426 316229 163669
19543 163669 -149278 -244596 185578 -122966 62254 -75372 -399799 -202697 -38516 -27399
19533 -27399 -393927 -107643 -1352 -93290 -255207 122376 -218079 24482 -158474 -101904 -263274
19522 -263274 183050 -63431 87888 -70627 -147725 -235804 124186 -159091 49532 -58245 -143834
19511 -143834 194368 -73097 -146459 -66324 -130051 -51556 260180 69011 -161408 195549 -63989
19499 97117 199986 42209 37276 -210138 -456967 -80996 -28859 -146648 -47490 178852 144835
$$ packed form
19576b10871J865h1927K8930F538J80001p3878l1383B4559c3014p3876j16445
19565b23335L8347d2557B61876a93761g4221A12126A2461K6530b90070e1341E333
19553a21283c8976n8570A35710a19210b9834k79679J30156K4931C16229j52560
19543A63669a49278r5318A85578a22966F2254g5372l24427J97102c8516J1117
19533b7399l66528a07643a352r1938j61917A22376b18079B4482a58474N6570j61370
19522b63274A83050f3431H7888g0627p7098q8079A24186a59091D9532e8245q5589
19511a43834A94368g3097p3362f6324o3727e1556B60180F9011a61408A95549f3989
19499I7117J02869D2209m933b10138k46829h0996b8859j17789d7490A78852l4017
$$ plain form
19488 144835 -108128 11124 -121634 39372 -113820 -8541 -70266 116097 22097 76911 -205488
19476 -10558 274943 242752 -305045 -299315 -112969 57830 102905 -5585 88654 -93493 -62829
19465 -62829 119877 190811 -49689 -36066 -72027 -26665 -49725 -44523 -108690 -383937 -143728
19453 -31471 295631 -65496 -54369 -2145 -41434 180851 67473 67748 -309323 25337 -57239 231703
19440 273307 -24215 196893 -237780 -114877 -208529 -133599 -216379 134104 -206857 104791
19429 -342634 -57596 317775 -92344 -72250 72288 -109276 74610 -68804 34953 3205 -131351
19417 215018 -27142 18982 -113370 -154854 -31551 58939 -59030 3970 -59851 214722 15919
19405 -216606 -47043 -20816 -241444 -1722 -197133 -192313 71190 -1408 -87476 171840 -7727 -203234
$$ packed form
19488A44835a08128A1124a21634C9372a13820h541o1725A16097B2097N4814b05488
19476a0558B74943l2191c05045N730a12969E7830M5075e585H8654i3493L0664
19465f2829A19877P0934d9689J3623l5961b6665k3060N202o4167k75247a43728
19453c1471B95631f5496J1127b145l9289A80851F7473K75c09323B5337e7239B31703
19440B73307b4215A96893b37780a14877r3652P4930q2780A34104b06857A04791
19429c42634e7596C17775i2344K0094G2288a09276G4610f8804C4953C205a31351
19417B15018b7142A8982a13370m1484c1551E8939e9030C970e9851B14722A5919
19405b16606d7043b0816k20628a722j95411M820G1190a408q6068A71840g727j95507
$$ plain form
19393 -203234 -362087 127328 -98630 -278865 138168 -30772 -158852 -245538 41465 55433
19383 55433 -143899 217765 -125082 149599 -136542 63993 -9241 224352 -73509 246244
19372 -34884 -67671 163979 159387 -112755 -84592 -97504 32707 52955 118540 -104820 -163919
19361 -163919 -67219 -103542 117661 -8700 -50763 -315508 -383107 -40514 163355 69362 -625
19349 -331535 77895 -211427 81769 -72285 2318 206748 -107310 -73887 -142213 -242718 -97922
19337 -338664 -42640 -40025 -351268 -18913 -276145 4530 -109977 33485 -161212 -20876 204570
19325 47606 -87239 -73115 -26510 92519 -82938 -33638 95411 19400 52362 67232 89796 -292628
19312 112341 120837 -255694 -114885 -84168 -174707 -288559 105477 -93590 75368 -233892 -97843
$$ packed form
19393b03234j58853A27328i8630j80235A38168c0772j28080q6686D1465J3968
19383E5433a43899B17765a25082A49599a36542F3993i241B24352g3509B46244
19372c4884l2787A63979m592a12755K8163j2912C2707K0248O5585a04820n9099
19361a63919f7219l6323A17661h700m2063k64745o7599d0514A63355F9362f25
19349c31535G7895b11427H1769g2285B318K04430a07310L3423o8326j00505i7922
19337c38664d2640K615l11243a8913k57232D530a09977C3485a61212b0876B04570
19325D7606h7239J4124b6510I2519h2938c3638I5411A9400L2962J4870K2564b92628
19312A12341Q496b55694a14885L0717r0539j13852A05477i3590G5368b33892i7843
$$ plain form
19300 234414 -110234 12820 132547 -179761 46136 236868 -134650 -105313 -29887 180648
19289 -21321 73887 114465 -7795 89734 -158415 -43146 44477 99613 -210316 -2505 13422 5451
19276 14216 -9830 -186787 -3530 -79001 -212583 33055 -193168 -261303 -512861 -71482 -247575
19265 -247575 -253346 -4323 59199 -7473 -20620 244267 -26406 -188815 103366 -217804 276957
19253 114297 -169128 -298899 116682 -91297 -164787 204817 -9587 166922 92532 -69021 315652
19241 -40576 -209020 -187633 -171686 105469 25451 -203341 190009 -182186 -187005 21515 -141469
19229 217366 -202870 -179973 -149176 -399017 -131299 -74223 -48 -143321 -111749 -131922 228757
19217 -249322 81044 -11922 -102042 -125595 -35359 51818 54959 -66106 4822 41004 -259619 -157777
$$ packed form
19300B34414a10234A2820J19727a79761D6136J90732a34650K9337b9887A80648
19289b1321G3887M0578g795H9734a58415d3146D4477N5136b10316b505A3422E451
19276A4216i830j76957c530p5471j33582C3055a93168o8135k51558g1482j76093
19265b47575n771d323E9199g473j3147B44267b6406j62409A03366b17804B76957
19253A14297a69128j29771A16682i1297p3490B04817i587A66922p4390f9021C15652
19241d0576j68444K1387J5947A05469B5451b03341A90009a82186m819B1515a41469
19229B17366b02870K2897L0797k49841a31299N7076d8j43273L1572k0173B28757
19217b49322H1044a1922r0120k3553c5359E1818L141f6106D822L6182b59619J01842
$$ plain form
19205 -157777 -258550 -222617 -37284 138281 -207793 -154724 197963 18192 -123096 -67589
19195 -67589 -78651 -151362 108364 223340 -1487 -41045 -26772 47686 -194348 -214836 -71804
19183 -124075 -81757 -236157 218460 -256818 -127579 -212889 -23957 -212941 -212851 -217564 -13037
19171 -47456 9581 -482935 102050 40529 235734 -405097 -31156 130409 84001 93949 -100535
19159 -255459 -83373 -338573 -257722 30141 -125369 1817 -83598 467619 -292469 297982 83733
19147 188177 17785 139503 22567 107676 75917 -115284 -60835 75419 -57450 -55544 252831
19135 29204 -95887 297854 29544 -69195 107439 283127 -13536 -4203 -109094 212397 -220055
19123 -19193 -287185 -50071 -92419 -184829 -347584 284974 -14173 319649 -349132 -14341 -263862
$$ packed form
19205a57777j00773L5933c7284A38281b07793N3069A97963A8192a23096N5507
19195f7589j1062p2711A08364J14976a487l9558J4273D7686a94348k0488g1804
19183a24075M2318j54400B18460b56818a27579q5310b3957j88984R0m713a3037
19171d7456I581d82935A02050D0529J95205d05097c1156A30409m6408R948a00535
19159b55459h3373k55200Q0851C0141a25369A817h3598D67619b92469B97982H3733
19147A88177A7785J21718B2567Q5109l1759a15284N4449G5419e7450J906B52831
19135B9204i5887B97854B9544f9195A07439J75688a3536d203j04891B12397b20055
19123a9193k67992e0071m2348r2410j62755B84974a4173C19649c49132a4341k49521
$$ plain form
19112 -263862 -214024 -232897 34654 -330261 -266273 -239324 97484 -164277 -18914 132252 -227280
19100 163455 -172908 -140964 239710 105291 21076 -300251 53752 -421991 -111085 33401
19089 16747 -239482 -93086 -59342 -53526 -57764 184825 -340427 50510 -53535 -194727 -144371
19078 -144371 163781 38855 136105 -381351 -319831 76107 127168 -205874 -243764 -172854 105379
19066 14283 9684 -213107 -155733 -413183 -914 -306193 -2903 -81030 -77987 -253875 -255488 52404
19053 -195627 50398 -122959 -65493 -80396 -379371 129437 -170808 209741 -141097 -89219
19043 -89219 -83039 -292421 -89276 97073 -321895 122220 -72744 -26579 230448 -28784 -111915
19032 -111915 120614 55873 121896 198461 -72708 33232 -13013 86002 355887 -54102 -24500
$$ packed form
19112b63862M9838j8873C4654c30261O3988K6949I7484a64277a8914A32252b27280
19100A63455a72908L1944B39710A05291B1076c00251E3752d21991a11085C3401
19089A6747b39482i3086L3744N816m238A84825c40427E0510e3535j41192N0356
19078a44371A63781C8855R7250c81351O1520G6107N1061b05874l7890P0910A05379
19066A4283m599b13107N7374k57450i14l05279b903p8127L043j75888j613E2404
19053a95627E0398a22959N7466j4903k98975A29437a70808B09741a41097N1878
19043h9219O180k09382h9276I7073c21895A22220g2744b6579B30448b8784q3131
19032a11915A20614E5873O6023P6565g2708C3232a3013H6002K69885e4102b4500
$$ plain form
19020 32325 -34231 -132813 57942 108226 190215 51992 105275 -212177 39386 158930 -309800
19008 -229145 -289206 85335 -165112 -75348 -76841 -113992 -191326 7012 178199 100000 -13054
18996 40179 -72257 -75376 -221833 28618 66908 156346 -271200 -230331 -26099 -212531 -327713
18985 -327713 -326023 -164538 -145020 -109980 110145 -49126 -182834 -189676 -209716 76875 -64757
18973 -29891 -37942 -49062 -68634 49809 -269070 -65122 111260 -71089 -192676 105151 -298980
18961 200032 30191 -103204 -174433 -73639 -243661 276981 -43627 -140164 -158450 142765 -119405
18949 -8052 -103764 90398 75042 174873 -135486 -97781 -72663 184082 -73259 -434661 -66798
18937 -146151 -334499 11080 68528 -213247 15763 -53855 -39562 -24799 -158345 22794 61221
$$ packed form
19020C2325c4231r8582E7942N0284Q1989E1992N3283b12177C9386J19544c09800
19008b29145o0061H5335a65112g5348j493l7151p7334G012J71187p8199a3054
18996D0179g2257l119j46457B8618L8290Q9438b71200M0869b6099j86432j15182
18985c27713J690J61485J9518L5040A10145d9126j33708o842k0040G6875f4757
18973b9891q051j1120j9572D9809b69070f5122A11260g1089j21587A05151b98980
18961B00032C0191a03204p1229g3639j70022B76981d3627r6537j8286A42765a19405
18949h052r5712I0398j5356R9831a35486L7705K5118A84082g3259l61402f6798
18937a46151j88348A1080N7448b13247A5763e3855J4293J4763j33546B2794L8427
$$ plain form
18926 61221 35644 40224 62687 135343 -64938 -158493 174807 -301153 115874 -197785 -159761
18915 -159761 10891 -11615 -193351 36867 -289454 -250448 125226 -131244 77324 14815 -39870
18903 -216764 4008 -22519 -245749 61238 -93219 -201659 71446 49124 111288 136446 -174374
18891 -179582 62415 -415416 -248702 218326 -108040 -128423 -309043 182263 28143 163302
18881 163302 76773 -192325 15087 140467 -320249 70368 -265900 -51055 -112669 105535
18870 -116018 -177562 -321375 -200460 354369 103768 -20269 234407 309138 77001 -91727
18859 178886 -76566 -73956 -200192 -106498 -207394 88077 -313019 -242327 139822 417111 -1778
18847 -104226 146941 -90729 37250 -111202 -51592 14788 -202264 -177123 59880 -34955 107498
$$ packed form
18926F1221k5577M580K2463P2656f4938r3555A74807c01153A15874a97785L8024
18915a59761A0891a1615j81736C6867b89454L9006A25226a31244G7324A4815c9870
18903b16764D008b2519k23230F1238i3219j08440G1446k2322O2164K5158a74374
18891a79582F2415d15416J66714B18326a08040k0383j80620A82263B8143J35159
18881A63302G6773a92325A5087J25380c20249G0368b65900e1055o1614A05535
18870a16018o1544j43813J20915C54369A03768b0269B34407P4731G7001i1727
18859A78886g6566K610j26236R3694j00896H8077c13019P0692A39822K77289a778
18847a04226A46941i0729C7250a11202e1592A4788b02264K5141E9880c4955A07498
$$ plain form
18835 -23398 53667 -292985 125452 -72629 37788 -201502 50545 -49898 53595 -65297 -144748
18824 -144748 121361 281414 -12009 -31944 8961 -195595 -40120 206489 60681 19749 9020
18812 134240 23086 466424 183374 -95193 9108 78753 160978 -77405 28015 27266 -267459
18800 72060 -191500 -234066 241405 93113 -167519 11474 34466 94923 60962 -192799 -283549
18789 -283549 -231918 45583 -62295 100234 -19018 -125860 -131911 -242948 38666 -207201 157731
18777 -97851 49512 135019 -319983 76956 107270 -192603 -345274 -155557 -381797 8053 -75234
18765 -37204 150713 122302 -173423 -285909 7280 -213127 94575 -21330 -50927 -74318 281694
18753 -273478 -128745 20978 -105541 -180141 437262 -272906 -111819 -223649 -114103 -76350
$$ packed form
18835b3398E3667b92985A25452g2629C7788b01502E0545d9898E3595f5297p9451
18824a44748A21361J60053a2009j9935H961a95595d0120B06489F0681A9749I020
18812A34240B3086M43338A83374i5193I108O9645Q2225g7405B8015p49b67459
18800G2060a91500m2566B41405I3113a67519A1474K2992O0457l3961a92799r0750
18789b83549N1631D5583f2295A00234a9018j06842o051j11037C8666b07201A57731
18777i7851D9512Q5507c19983G6956L0314a92603j52671a55557k26240H053g5234
18765c7204A50713k8411a73423j12486G280b13127I4575b1330k9597k3391B81694
18753b73478a28745B0978a05541p4600D37262b72906a11819j11830J09546L7753
$$ plain form
18743 -76350 137301 116803 33591 -224907 -337130 -231956 98011 -85832 25772 268835 -287344
18731 338371 210492 -60539 -217269 -262041 224020 -75984 180884 50468 -282073 21334
18720 -67661 -143322 147988 -2098 131599 -458544 -2533 -532631 -91292 -101673 -525843 199841
18708 -234355 125922 -63454 -67370 -216831 -70646 -280985 75919 -86874 -49200 246840 -58386
18696 69620 -136259 -70997 80573 -195950 -113358 150189 -120635 103806 -83330 44757 -212273
18684 -162302 -93977 326707 134700 392053 28311 119979 -272386 -131619 276063 95683
18673 -196493 172326 281850 96065 -16638 129426 70637 45525 -116834 -32796 82940 -50584
18661 -168937 -12595 189146 266266 256430 -282216 -121554 -236847 -105697 59440 -194599
$$ packed form
18743g6350A37301k0498C3591b24907j12223J05174I8011h5832B5772K43063b87344
18731C38371j27879f0539j56730m4772B24020g5984A80884E0468b82073B1334
18720f7661p5661A47988b098A31599d58544b533n30098i1292j0381m24170A99841
18708b34355A25922f3454l916j49461g0646k10339G5919h6874L7674B46840e8386
18696F9620a36259O5262H0573a95950Q2592A50189a20635A03806h3330D4757b12273
18684a62302O8325C26707A34700K57353B8311R1668b72386a31619B76063I5683
18673a96493A72326J09524I6065a6638A29426n8789k5112a16834c2796H2940e0584
18661a68937a2595A89146P7120r836b82216a21554j15293a05697E9440a94599
$$ plain form
18650 -1345 -87602 -151203 110848 -21108 -47308 128585 20876 -37486 -79894 150772 -205559
18638 31480 -297025 59846 372291 161216 -241082 -49003 83522 60061 -163026 -258013 -157247
18627 -157247 40986 -67895 213676 175806 43153 -11169 -194379 -220167 -25675 -472395 352920
18615 44922 -335016 258018 -79979 -15204 6250 -184195 -495867 101403 -199719 -108138 -159858
18604 -159858 231005 79173 -70424 44884 20450 -37215 128659 -282939 -154717 -172910 -10486
18592 -136630 -50608 -217522 -138994 -67740 45835 -54491 -171372 382478 -180914 68822 -103877
18580 -123197 71686 -250672 86682 -35528 -128413 104054 -153365 172177 -455583 62307
18569 -58106 301402 11124 -396187 3364 166630 -100087 138560 -347487 28329 106512 -199570
$$ packed form
18650a345q6257o3601A10848b1108k6200A28585B0876c7486m2408A50772b05559
18638C1480b97025E9846L12445A61216b41082d9003H3522k3461a63026r4987J00766
18627a57247D0986f7895B13676l7870D3153a1169j83210k5788b5675m46720C52920
18615D4922c35016B58018g9979a5204F250a84195l11672A01403a99719R1581n1720
18604a59858B31005G9173g0424D4884B0450c7215A28659b82939J28222j8193a0486
18592a36630e0608j66914P8528f7740D5835e4491j16881C82478a80914F8822a03877
18580a23197G1686b50672H6682c5528r2885A04054a53365A72177d55583F2307
18569e8106C01402A1124c96187C364J63266a00087A38560c47487B8329P8183a99570
$$ plain form
18557 -198614 -52046 48338 -124408 -16930 -26589 -231971 -307434 -106740 -73448 -355176 -29350
18545 140599 140844 17101 -281739 -472886 -189935 155494 -80812 66297 124915 -188405 23534
18533 102550 -397572 -68613 -13856 244749 37634 -275870 -171606 132369 -246422 -69840
18522 -294957 -41756 103417 6730 276173 -155902 133586 -46069 284096 -369851 -31946
18511 28079 57802 -68827 -161970 -90967 -271712 17659 83055 -166897 -87137 153193 -221696
18499 15621 -92332 -89783 -282487 -74683 -288968 -97896 -150721 61249 31864 -298220 37352
18487 291949 191245 -342109 -86006 -173662 -206750 -67322 -119407 -278265 -126325 -266295
18477 -266295 156388 -386481 138369 186537 -255043 -56919 139625 -39195 127764 -307496
$$ packed form
18557a98614e2046D8338a24408a6930r659k05382p5463a06740L3292k81728b9350
18545A40599K45A7101b81739j91147a89935A55494h0812F6297N8618a88405B3534
18533A02550c97572f8613a3856B44749C7634b75870J04264A32369b46422f9840
18522b94957d1756A03417F730K69443a55902A33586d6069B84096c69851c1946
18511B8079K9723f8827r3143P1003j80745A7659O5396a66897P9760A53193b21696
18499A5621i2332K549j92704g4683k14285i7896n2825F1249k9385b98220C7352
18487B91949j00704c42109h6006q7656l3088f7322n2085j58858a26325j39970
18477b66295A56388c86481A38369M8168b55043e6919A39625c9195A27764c07496
$$ plain form
18466 -89851 48364 351367 -619 12329 -113990 115334 -219408 39427 36561 65014 257973
18455 257973 -42212 50897 -52827 163984 294078 -160293 -102616 131273 -190762 -197208 -193203
18444 -193203 10178 -92190 -72432 -216108 278431 -170563 -237161 -316031 191156 263271 59027
18432 121296 -107924 -223066 -269495 -6309 -38870 -486265 -199949 144199 -66659 74823 257382
18421 257382 2865 -217766 -162842 -18604 35835 79933 199046 127550 86399 154743 -94966
18409 -185002 86028 27720 -225259 110402 1239 -18069 1688 -105556 -132740 -123809 -88998
18398 -88998 -176993 -73635 -129068 -29887 154239 -87360 163643 91558 29068 125992 127018
18387 127018 90348 -123944 -164681 74329 -86965 64988 8131 -23024 -11101 73817 -98447
$$ packed form
18466h9851D8364L03003f19A2329a13990A15334b19408C9427k866K8453J92959
18455B57973d2212E0897e2827A63984J30094a60293N7677A31273a90762o446M005
18444a93203A0178i2190J9758j43676B78431a70563o6598p8870A91156P2115E9027
18432A21296a07924j15142m6429f309l2561m47395a99949A44199f6659G4823J82559
18421B57382B865b17766N4924a8604C5835M4098J19113p1496m1151O8344i4966
18409a85002H6028B7720b25259A10402A239a8069A688a05556k7184Q931L4811
18398h8998q7995g3635n5433b9887A54239h7360A63643p2085B9068R6924J026
18387A27018l6670a23944m0737G4329h6965F4988H131b3024a1101G3817i8447
$$ plain form
18375 61995 161611 18103 4171 -234772 -82198 -391623 -199413 -175476 137397 42695 338575
18364 338575 9005 150682 288166 132071 -215259 188196 -80008 -243324 24483 -339257
18353 91315 -251423 -8695 -407061 86843 9394 -470709 -101928 210483 189337 -53083 -152853
18342 -152853 -196889 115492 -44505 434748 -43452 117034 190051 23091 80956 187423 -130866
18330 -71370 95141 8584 67113 -196871 41462 102726 92674 132016 -220930 142869 -384912
18318 15781 -113860 -253344 45637 128977 -147109 51648 -197771 -231876 190951 -8887 179167
18306 -164872 -88308 -175341 3886 -25767 -197220 -119319 -271398 -216750 67810 132698 203442
18295 203442 135008 -24744 -29704 -134194 -58316 -317792 66854 -147126 -212720 11833 -54099
$$ packed form
18375F1995R9616A8103D171b34772h2198l09425J92210K3937A37397D2695K95880
18364C38575I005J41677J37484A32071b15259A88196h0008j63316B4483c39257
18353I1315b51423h695l98366H6843I394d70709a01928B10483k1146e3083r9770
18342a52853m4036A15492d4505D34748d3452A17034P3017B3091N7865J06467a30866
18330g1370I5141H584N8529a96871D1462O1264j0052L9342b20930A42869c84912
18318A5781a13860j39484D5637Q3340a47109E1648a97771l4105A90951h887A79167
18306a64872P6564q7033C886b5767j71453P7901j52079N4648F7810O4888P0744
18295B03442o8434b4744m960j04490e8316k59476F6854a47126o5594A1833e4099
$$ plain form
18283 -240731 -157153 -246079 -190625 13584 -168358 126490 -196751 -305659 18486 255340
18273 255340 -27661 -139990 -127154 -310632 -97544 238545 -141085 36037 19928 33006 -112840
18261 -90270 12558 -198727 -127662 -252181 44856 -78620 -87861 -178567 15432 61565 -86547
18249 -111553 -200267 -60503 110947 -300633 6575 -38515 165301 -205985 -301806 102747 307067
18238 307067 72457 479184 -278412 -227987 39278 -94521 -11441 -72239 -4709 -259319 54205
18226 -261005 102582 338089 190111 -23074 -67036 -279167 -114524 -52094 -146880 -45665
18215 154366 -23381 -192596 47209 -288286 -116839 -257354 67006 -102783 -142560 353014
18204 -104912 -80844 16716 57890 22373 -403932 -20691 -39431 -221853 -207075 248130 -20046
$$ packed form
18283b40731Q3578q8926N5454A3584a68358A26490a96751j08908A8486K36854
18273B55340b7661j12329J2836j83478i7544B38545a41085C6037j6109J3078a12840
18261i0270A2558a98727P1065j24519D4856g8620r241r0706A5432M6133h6547
18249a11553q8714f0503A10947c00633F575c8515A65301b05985r5821A02747K04320
18238C07067G2457M06727b78412N0425C9278i4521a1441o0798d709k54610E4205
18226b61005A02582K35507j47978b3074m3962k12131a14524e2094r4786d5665
18215A54366b3381j69215D7209b88286a16839j40515F7006a02783l9777C53014
18204a04912K4068A6716M1174B2373d03932b0691j8740j82422J4778B48130b0046
$$ plain form
18192 -135443 -324274 49081 12177 -91754 24473 -232043 -250820 -320547 61139 -22344 -35406
18181 -35406 -119371 -227024 -254583 -183891 -103352 -90749 156906 9906 296641 -241982 -338101
18170 -338101 105353 -102656 -28386 89318 -6999 -83910 62390 -170015 -89612 117594 250717
18159 250717 -536910 -56275 -15863 -100295 -139592 288625 -26345 -117397 140707 -130072 -125791
18148 -125791 -269337 -36345 -188286 173461 -214357 -123060 -26819 -67734 -97126 -118903 28805
18136 -43273 -30373 278474 -286174 9741 -143502 21308 -287094 158292 -217351 76202 79972
18125 79972 -289602 -85888 -271322 30637 -74189 -174750 -172472 -185541 176194 188780 350067
18114 350067 155215 -145003 163326 -59435 -379804 114857 16418 -106516 -160256 -225619
$$ packed form
18192a35443j88831D9081A2177i1754B4473b32043j8777o9727F1139b2344j3062
18181c5406q3965j07653k7559P0692Q0539J2603A56906I906K86735b41982r6119
18170c38101A05353a02656b8386H9318f999p6911F2390a70015Q0403A17594J33123
18159B50717e36910e6275a5863q4432l9297B88625b6345r1052A40707a30072M281
18148a25791j43546c6345j51941A73461b14357R1297b6819m0915k9392k1777B8805
18136d3273J2900B78474b86174I741a43502B1308b87094A58292b17351G6202L770
18125G9972b89602h5888j85434C0637g4189j00561K278j3069A76194J2586J61287
18114C50067A55215a45003A63326e9435l20369A14857A6418a06516n3740o5363
$$ plain form
18104 -225619 129777 -74130 239845 -216727 206461 79920 102733 -88220 5180 -7651 -25847
18093 -25847 -41888 -66518 -88107 -44673 -21759 206651 17495 -310912 -87141 -54931 168979
18081 44928 -291677 126599 26658 -92463 286899 -158805 -286719 85818 -287478 -162230
18071 -162230 232698 -182110 98783 132523 81945 182301 46033 -152256 93723 -199928
18060 249682 -60372 66404 95112 197235 1589 -241155 -280041 197706 -95804 184598 -14847
18048 -360254 -26914 -189008 42105 -245935 -201195 104291 -166539 -4675 -250488 -65979 67714
18036 -56691 -283393 -242632 -162634 230422 16829 26895 67284 471937 -33463 186504 -72355
18024 -14388 -174672 -367223 -155904 -186039 -80178 -34065 -116182 40298 34528 -100390 -110774
$$ packed form
18104b25619A29777g4130B39845b16727B06461G9920K2813h8220E180g651j8196
18093b5847j6041k4630k1589M3434b1759B06651A7495c10912h7141L2210A68979
18081D4928b91677A26599B6658i2463B86899a58805j27914H5818b87478J25248
18071a62230B32698a82110I8783L3740n0578J00356D6033a52256I3723a99928
18060B49682f0372F6404K8708J02123A589b41155l8886A97706i5804A84598a4847
18048c60254b6914j62094D2105b45935M4740A04291a66539d675k45813f5979F7714
18036e6691k26702M0761P9998B30422A6829J0066M0389M04653c3463A86504g2355
18024a4388j60284j92551a55904l0135h0178c4065q2117D0298n770a00390j0384
$$ plain form
18013 -110774 -277191 -272519 116319 -287476 24703 72765 -203586 -54049 -216579 -134203 28182
18001 380604 51039 -268037 31398 60816 -129234 -214852 37863 -223206 -247207 -145942 40839
17989 247002 -96523 240176 -64390 19681 213795 44761 67397 16573 23231 -62670 71573
17977 4092 -87415 -26508 -179401 -141152 -55300 162078 248270 -187552 220677 -55547 223455
17965 255487 -153160 -1666 189999 188016 123984 -54806 -124328 320830 274455 -40851 76712
17953 4880 185780 -84010 7336 158590 -333759 -37962 92882 251195 16723 -116687 -126741
17942 -126741 228710 217798 -254570 -140733 88220 32880 180427 -189924 -219371 44240
17931 104438 -131714 -117938 34746 168226 69614 -246441 -133864 101760 -15793 274976
$$ packed form
18013a10774j66417M672A16319b87476B4703M8062b03586e4049j62530Q2376B8182
18001C80604E1039b68037C1398K9418a29234q5618C7863b23206k4001J01265D0839
17989B47002i6523B40176f4390A9681J94114D4761K2636A6573O658f2670G1573
17977D092h7415b6508j52893L8249e5300A62078Q6192a87552B20677e5547B23455
17965B55487a53160a666A89999j983o4032e4806o9522C20830m6375d0851G6712
17953D880J80900h4010G336J51254c33759c7962I2882J58313A6723a16687j0054
17942a26741B28710j0912b54570J13837H8220C2880J47547a89924k9447D4240
17931A04438a31714J3776C4746J33480F9614b46441J12577A01760a5793B74976
$$ plain form
17920 85079 -101155 -216676 30713 87452 209350 -12195 -138224 -59198 -304962 308854
17909 -140792 50440 -149690 98602 -96905 -288066 -63937 -78883 -22606 152803 -141041 82424
17897 -259827 -194539 171025 -199604 97063 183950 129829 -32325 197161 -96 15881 106119
17886 106119 -222838 -56892 -290663 288252 607 60074 111659 -139428 -360051 -15681 37349
17874 144832 125141 160070 -70077 101784 -8039 -70075 -36025 142496 331371 -245080 -239058
17863 -239058 -183547 176269 -164703 31943 373685 -194209 98870 175676 -126028 78583
17852 200650 47109 -210424 -94643 219834 22236 -208525 -57147 -141998 -54038 22847 -4036
17840 85014 222123 -114446 -209327 27121 269653 -41867 136576 -95929 -72812 170776 -91292
$$ packed form
17920H5079a01155j15521C0713N6739J21898a2195j26029e9198k45764C08854
17909a40792E0440a49690I8602i6905j91161f3937j4946b2606A52803a41041H2424
17897b59827O5288A71025a99604I7063Q6887n4121c2325A97161i6A5881R0238
17886A06119b22838e6892k33771B88252F07N9467N1585a39428k20623a5681C7349
17874A44832j9691L4929g0077A01784h039o2036L4050A42496J88875b45080O022
17863b39058N5511A76269a64703C1943L41742a94209I8870P6806a26028G8583
17852B00650D7109b10424i4643B19834B2236b08525e7147q4851e4038B2847d036
17840H5014J37109a14446r4881B7121K42532d1867A36576i5929K3117A70776i1292
$$ plain form
17828 146374 -208315 -186146 -223205 -69659 154220 107322 78013 1836 -90077 -174115 184881
17816 -84412 256825 -136571 -234203 -227601 172767 217119 -316159 95044 161364 -120885 -234516
17805 -234516 -99538 -12298 154810 279954 155307 -94142 -65773 -196617 -29590 242996
17794 175641 -533707 43020 127920 24222 271941 114857 179582 96336 -16294 -139679 -127557
17783 -127557 243634 -247674 -223304 175978 -155514 -381613 36158 39993 -212093 702 -69749
17771 -107220 -160715 -283712 145659 199394 168539 88262 -32501 -20400 399651 -40402 387874
17759 181841 210479 170235 -187801 356319 -14773 -316970 -6985 -130822 124762 13137 -383063
17747 20904 -313806 341911 324145 -40268 -179717 -240356 331742 202360 96290 63380 -150613
$$ packed form
17828A46374b08315K2169l7059f9659A54220m6898k9309A836i0077q4038A84881
17816h4412B56825a36571r7632O602A72767M4352c16159I5044O6320a20885j13631
17805b34516i9538a2298A54810J25144j24647i4142K8369j30844b9590B42996
17794A75641e33707D3020Q4900B4222K47719A14857O4725q3246a6294j23385J2122
17783a27557B43634b47674K4370A75978a55514k26099C6158L835b12093G02f9749
17771a07220n3495j22997A45659N3735l0855q0277c2501J2101C99651d0402C87874
17759A81841K8638m0244a87801C56319a4773l02197f985j23837A24762A3137c83063
17747B0904c13806C41911j7766d0268j39449o0639C31742j29382I6290l2910a50613
$$ plain form
17735 -9040 -207755 55351 137654 72210 -79243 -8817 70921 -65484 -70328 -6411 -29664 -86668
17723 -86668 -383814 132380 -276942 -197723 66091 231362 -210215 12689 -22464 -115624 249177
17711 82404 8820 46579 32838 -274146 324260 -110198 -39358 187395 137182 107374 56565
17700 56565 28130 -207513 141014 192239 91058 16259 -59125 -169902 -228688 -134539 -47419
17688 -39695 -73496 -112419 -170696 -45529 -244992 42554 -68081 -146671 189845 -42645 69339
17676 192011 182110 169006 -17956 185333 -88549 48710 -128757 -4543 379740 -280731 269899
17664 -344881 39856 60302 353412 264733 -264996 118822 128498 -340580 235808 243487 -215075
17652 63086 9693 35459 -25472 -52353 -196178 175099 -62165 -156178 -62952 27492 15792
$$ packed form
17735i040j98715E5351Q2303o5444g9243h817G0921f5484m844f411k3253n7004
17723h6668k97146A32380b76942P9219F6091J65271b10215A2689b2464r3160B49177
17711H2404H820L7759j3741b74146C24260a10198c9358A87395n0213k9808n0809
17700E6565B8130b07513A41014N1225I1058A6259e9125j10777n8786R4149d7419
17688c9695l3801l8923n8277d5529j99463D2554f8081p8590A89845d2645F9339
17676A92011r901j3104a7956A85333h8549D8710a28757d543C79740b80731B69899
17664c44881C9856K0446K93110q8679b64996A18822R676c40580B35808P679b15075
17652F3086I693K5766b5472k6881j43825A75099f2165r4013f2952B7492j1700
$$ plain form
17641 15792 -73204 55084 -40788 133262 -139333 75430 235358 89087 20160 35051 192877
17630 192877 22940 56694 -14613 160967 71021 390888 34408 85311 -89136 -162866 23380
17618 70681 -371077 -48003 156029 27270 31859 -378093 396626 -269914 181809 -125851
17607 345989 26536 107884 -95339 -141377 -60216 47339 -49214 -47948 14494 -322670 222115
17595 290646 17138 147341 -159950 -32084 133574 391407 -258776 82998 112819 173820
17585 173820 -68907 216463 317958 -189603 -7766 -151088 -28326 10594 -30550 -33111 157310
17573 -413 -105309 -254259 -70329 69346 77070 -34726 167685 217423 98151 -46484 -4616 14628
17560 14231 3877 191576 48801 -82306 -23071 218508 90690 -213942 99737 122555 114581
$$ packed form
17641A5792g3204E5084d0788A33262a39333G5430J59928H9087B0160J4891J57826
17630A92877B2940L3754a4613A60967G1021L19867C4408N0903h9136p3730B3380
17618G0681c71077d8003A56029B7270M589c78093C96626b69914A81809a25851
17607C45989B6536Q1348i5339m6038f0216D7339d9214J266A4494c22670B22115
17595B90646A7138J30203a59950c2084A33574K57833b58776H2998K9821O1001
17585A73820f8907B16463J01495a89603g766j43322b8326A0594c0550k561A57310
17573d13j04896j48950g0329F9346P724c4726A67685M9738I8151d6484d616A4628
17560A4231C877J87699D8801h2306b3071B18508I0690b13942I9737K2818p974
$$ plain form
17549 114581 81058 67 224509 25899 218760 260936 1047 -128379 -50803 80245 350606
17538 350606 -180076 290968 -167380 45354 -121309 193651 121978 362464 -6400 -17519
17528 -17519 121100 63760 49893 313593 183112 281008 138745 103706 241382 119380
17517 -22491 -20087 261880 -52282 190639 87015 281282 211777 -141304 265006 135141 -129053
17505 135709 -228825 -2451 91516 229828 -13057 50677 237066 186782 118708 -188357 388894
17493 -29453 96113 327034 -25156 -28790 66642 -43116 207311 310406 2824 70643 67389 112675
17481 112675 421800 124901 475463 32825 -179470 106272 219648 234500 344203 8940
17470 166823 400953 196515 -42177 269952 272371 31962 -96108 41542 41886 160074 29732
$$ packed form
17549A14581l3523F7K24442B5899J92861M2176A047a28379e0803H0245K70361
17538C50606a80076B90968a67380D5354a21309A93651p1673K40486f400j1119
17528a7519A21100n7340j3867K63700j30481R7896A38745l5039J37676A19380
17517b2491K404B61880e2282A90639H7015J94267o9505a41304B65006j29865a29053
17505A35709b28825b451I1516J38312a3057E0677J86389n0284o8074a88357C88894
17493b9453I6113K30921b5156l634F6642d3116B07311J03095B824O7819l254M5286
17481A12675L09125A24901L50562C2825a79470A06272J13376J4852J09703H940
17470A66823K34130A96515d2177B69952K419C1962i6108D1542L44J18188B9732
$$ plain form
17458 29917 183295 163058 178127 135050 56566 35265 123452 100971 155450 730140 29654
17446 473248 57602 390806 140205 -21453 -29943 383920 264512 -162805 15293 -80198 521828
17434 166719 341205 90960 291448 358423 211169 316304 365003 168383 353208 49663
17423 351419 20383 404531 203152 507336 496106 227733 281006 167868 179051 379060
17413 379060 249075 454446 -100934 249169 228895 393465 13351 164801 149723 320182
17403 320182 -17884 343910 294477 -37320 335247 521220 280030 6915 117712 433796
17393 433796 153270 142588 9519 -247146 -79108 81483 130352 266841 -101708 271261 125032
17381 204269 44582 216598 206384 226808 124043 -210019 171854 212131 344098 17119
$$ packed form
17458B9917J53378k0237J5069m3077E6566k1301Q8187k2481N4479N74690B9654
17446D73248E7602L33204A40205b1453q490C83920j19408a62805A5293h0198E21828
17434A66719J74486I0960K00488O6975j47254J05135M8699A68383J84825D9663
17423C51419B0383L84148k01379L04184j1230B27733N3273j13138J1183K00009
17413C79060j29985K05371a00934B49169k0274J64570A3351J51450j5078J70459
17403C20182a7884C43910m9433c7320C35247J85973k41190F915J10797L16084
17393D33796A53270j0682I519b47146g9108H1483M8869J36489a01708B71261A25032
17381B04269D4582J72016j0214K0424j02765b10019A71854M0277J31967A7119
$$ plain form
17370 -88247 -68923 -106184 395031 -70657 40515 443149 189415 59317 180038 237766 264694
17359 264694 108771 275187 149612 226514 23956 122593 57886 133461 -141172 91372 347958
17348 347958 17419 97893 -117049 56217 164451 70543 60926 24489 203351 214473 73688
17336 206657 309293 57171 401629 -13293 75711 -73224 280071 -104404 138366 17959
17325 93967 233329 233635 102485 -10447 149710 -61660 -24595 273440 196955 20213 69657
17314 69657 33 126727 -198072 186070 80489 367190 456805 256802 401533 14274 347544
17303 347544 18716 79182 113300 187289 416188 384441 332607 258115 -15510 418815 85093
17291 -134660 70696 91419 89582 144236 55672 363335 520053 337027 9644 198562 128159
$$ packed form
17370h8247J9324l7261C95031g0657D0515M02634A89415E9317J20721N7728K6928
17359B64694A08771J66416j25575P6902B3956R8637E7886P5575a41172I1372K56586
17348C47958A7419Q0474a17049E6217J08234G0543r617B4489J78862J1122G3688
17336B06657J02636E7171L44458a3293G5711g3224B80071a04404A38366A7959
17325I3967J39362L06A02485a0447A49710f1660b4595B73440p6485B0213M9444
17314F9657C3J26694a98072A86070H0489K86701Q9615k00003J44731A4274L33270
17303C47544A8716O0466L4118P3989K28899l1747n1834p4492a5510D18815H5093
17291a34660G0696K0723j837N4654E5672L07663J56718j83026I644J88918p0403
$$ plain form
17280 128159 199605 196864 193383 83753 296338 139247 25814 126576 -7750 245964 265272
17269 265272 595339 -493006 117194 334439 527034 183651 462334 2132 86475 73682
17259 73682 410456 154067 361611 -102004 148059 49840 -63235 95013 221853 363644
17249 363644 229305 179487 174432 22521 22253 76387 17143 -3078 -23496 83078 410481 28710
17236 345281 477863 64843 111064 67746 320210 18296 316094 284441 60215 174873 80936
17224 398750 223339 165997 454582 14829 -128506 392377 301775 230224 -134894 -52725
17213 196761 315938 140446 209745 435535 406347 83087 -90532 75321 266303 263963 20268
17201 273364 221817 62187 505900 137026 -68928 -130761 456028 486294 627201 201088
$$ packed form
17280A28159P1446k741l481H3753K12585A39247B5814J00762g750B45964J9308
17269B65272L30067d93006A17194K17245J92595A83651K78683B132Q4343j2793
17259G3682L36774A54067K07544a02004A48059D9840f3235I5013J26840J41791
17249C63644j34339m9818n055B2521k68N4134A7143c078k0418H3078L27403B8710
17236C45281J32582F4843M6221m3318K52464A8296K97798l1653F0215J14658H0936
17224C98750j75411n7342K88585A4829a28506C92377r0602p1551a34894e2725
17213A96761J19177A40446O9299K25790k9188H3087i0532G5321J90982k340B0268
17201B73364n1547F2187M43713A37026f8928o1833D56028L0266J40907B01088
$$ plain form
17190 226261 45669 209352 17514 726846 187135 240183 178763 306556 76649 216862
17180 216862 152620 17175 259470 379921 311400 51364 278051 192812 398414 212893
17170 212893 25166 528935 108541 134146 318767 392977 80732 364918 417773 404439 447910
17159 447910 321267 555894 227139 132183 308790 580981 366420 606288 633601 581765
17149 581765 329734 389016 288118 759388 202775 358255 403080 356364 549006 -160264
17138 390478 381121 497417 287026 272059 562584 244181 516326 361992 573099 154570
17127 257074 224198 301438 507403 -67620 449628 154839 329820 171356 286875 282283
17117 282283 222226 521139 457204 710030 681451 623160 148187 310449 627329 266596
$$ packed form
17190B26261D5669J63683A7514P09332A87135N3048o1420J27793G6649J40213
17180B16862o4242A7175K42295J20451o8521E1364K26687q5239K05602j85521
17170B12893B5166N03769A08541K5605J84621P4210H0732K84186N2855j3334M3471
17159D47910j26643K34627B27139r4956J76607K72191k14561K39868K7313n1836
17149E81765k52031N9282j00898M71270B02775J55480M4825m6716J92642a60264
17138C90478r357J16296k10391j4967K90525B44181K72145j54334K11107A54570
17127B57074l2876P7240K05965f7620D49628A54839J74981j58464J15519m592
17117B82283o0057K98913o3935K52826k8579n8291A48187J62262L16880B66596
$$ plain form
17106 185191 468388 362194 207722 268572 304632 282927 469079 55692 315160 504472
17096 504472 350659 460823 594236 415629 490641 215158 339404 292151 561286 131707
17085 524280 304645 59954 825643 336717 371330 274414 187508 261599 357648 496344 101027
17073 257685 388806 -13308 649943 534813 552531 336657 414549 504211 550985 427396
17063 427396 291513 308951 346251 719631 596453 409791 410540 673062 753647 532092 683118
17052 683118 512155 680583 349248 649783 378143 668115 715050 307985 753937 664111
17042 664111 731533 489867 462671 483159 585000 470729 919389 832759 663157 473609
17032 473609 713467 875853 669211 747853 669718 495004 715904 592728 790117 730634
$$ packed form
17106A85191K83197j06194j54472O0850L6060k1705J86152E5692K59468J89312
17096E04472j53813J10164J33413j78607P5012B15158J24246m7253K69135A31707
17085E24280k19635E9954P65689C36717L4613r6916q6906P4091R6049J38696A01027
17073B57685J31121a3308F49943j15130J7718k15874P7892Q9662M6774j23589
17063D27396j35883J7438L7300L73380j23178j86662P49K62522Q0585k21555J51026
17052F83118j70963J68428l31335L00535k71640K89972M6935C07985M45952q9826
17042F64111O7422k41666k7196K0488J01841j14271M48660q6630j69602j89548
17032D73609K39858J62386k06642P8642p8135j74714K20900j23176J97389n9483
$$ plain form
17022 730634 533962 527176 749892 521887 364024 591852 708398 624077 239495 582690
17012 582690 859197 763340 796609 707980 837336 533715 774438 690379 462329 568433
17002 568433 666414 929841 526031 748899 1441335 883691 743257 651433 716237 941475
16992 941475 541436 891364 748722 481831 759077 1019003 920166 878797 840938 648213
16982 648213 732212 521931 719923 731566 879252 865202 628352 997316 1037321 981948
16972 981948 1072720 892203 790151 1101708 1176283 691286 772278 1033629 1007472 1334068
16962 1334068 1125662 1096909 1157877 876309 928699 1265846 1060795 1347712 1263177 1081742
16952 1081742 1171847 1285621 1136632 1115363 1360124 1454921 1141916 1117875 1180486 1061147
$$ packed form
17022G30634j96672o786K22716k28005j57863K27828J16546q4321B39495L43195
17012E82690K76507r5857L3269q8629J29356l03621K40723q4059k28050J06104
17002E68433R7981K63427m03810K22868O92436n57644j40434r1824O4804K25238
16992I41475m00039L49928j42642k66891K77246K59926r8837m1369l7859j92725
16982F48213Q3999k10281J97992J1643J47686j4050k36850L68964M0005n5373
16972I81948R0772j80517j02052L11557P4575m84997Q0992K61351k6157L26596
16962A334068k08406k8753O0968k81568N2390L37147k05051K86917q4535j81435
16952A081742R0105J13774j48989k1269K44761R4797l13005k4041O2611j19339
$$ plain form
16942 1061147 1358379 1163476 1205671 1202178 1216095 1178717 1275971 1358875 1472055 1556840 1229383
16931 1229383 1468719 1387203 1612431 1244335 1370362 1198633 1548129 1329604 1521760 1586589
16921 1586589 1518103 1726141 1540166 1716906 1714101 1433590 1792751 1743636 1508942 1333716
16911 1333716 1792136 1712140 1561900 1598398 1796133 1877472 1885863 2025735 1967817 2057417 1762339
16900 1762339 1705074 1909605 2075792 2088842 1959734 2007121 2179069 1751126 2361533 2040075
16890 2040075 1929671 2185735 2141517 2014728 2106259 2162568 2444752 2114302 2444430 2241925
16880 2241925 2297412 2403195 2377228 2686378 2489657 2590342 2547088 2620352 2565485 2498468
16870 2498468 3030209 2675433 2840244 2730834 2705568 3082504 3060478 2870790 3131572 2847964
$$ packed form
16942A061147K97232j94903M2195l493J3917l7378R7254Q2904J13180Q4785l27457
16931A229383K39336q1516K25228l68096J26027j71729L49496k18525J92156O4829
16921A586589o8486K08038j85975J76740k805k80511L59161m9115k34694j75226
16911A333716M58420p9996j50240L6498J97735Q1339Q391J39872n7918Q9600k95078
16900A762339n7265K04531J66187J3050j29108M7387J71948m27943O10407l21458
16890B040075j10404K56064m4218j26789R1531N6309K82184l30450L30128k02505
16880B241925N5487J05783k5967L09150j96721J00685m3254P3264n4867o7017
16870B498468N31741l54776J64811j09410k5266L76936k2026j89688K60782k83608
$$ plain form
16860 2847964 3241313 2897470 3120034 3092030 3378688 3161964 3132613 3152439 3217415 3698082
16850 3698082 3825211 3644015 3661785 3682747 3953180 3561512 3685680 3920220 3733778 4123416
16840 4123416 4150695 3902172 4378331 4426458 4364115 4340492 4398919 4651486 5139629 4636303
16830 4636303 4836792 5139369 5271736 4999333 5347639 5323794 5716260 5612008 5922947 5855284
16820 5855284 5674570 5745348 6217069 6359503 6456388 6528644 6741097 6612349 7213993 7217441
16810 7217441 6847677 7441849 7323766 7442265 8083539 7971625 8176255 8125257 8353765 9015212
16800 9015212 8839390 8962956 9528398 9524497 9565607 9667368 10075542 10205672 10544715 11036092
16790 11036092 11170467 11710109 11960124 12030384 12428069 13117167 13191675 13686916 14301277 14635071
$$ packed form
16860B847964L93349l43843K22564k8004K86658k16724k9351J9826O4976M80667
16850C698082J27129j81196J7770K0962K70433l91668J24168K34540j86442L89638
16840D123416K7279k48523M76159M8127o2343k3623N8427K52567M88143n03326
16830D636303K00489L02577J32367k72403L48306k3845L92466j04252L10939o7663
16820E855284j80714P0778M71721J42434R6885P2256K12453j28748O01644L448
16810G217441l69764N94172j18083J18499O41274j11914K04630n0998K28508O61447
16800I015212j75822J23566N65442l901M1110J01761M08174J30130L39043M91377
16790A1036092J34375N39642K50015P0260L97685O89098P4508M95241O14361L33794
$$ plain form
16780 14635071 14722909 15344795 15866748 16263809 16803321 17459550 18103784 18197967 18960406 20019398
16770 20019398 20733767 21596880 21796520 22454334 23662531 24483463 25659157 26494754 27269942
16761 27269942 28637894 29611690 31106709 32339293 33521279 35199194 36142447 38564168
16753 38564168 39654766 41848169 43464459 45466706 47997642 50152044 52708770 55149475
16745 55149475 57913109 60928299 63953040 67414454 70556833 74760373 78512449 82677762
16737 82677762 87127151 91600408 96760649 101653014 107273734 112530633 118591718 124278060
16729 124278060 129959154 135937636 141675676 147427083 152515033 157444883 162300849 165373140
16721 165373140 168680582 171178113 172389423 172927319 172425595 171053062 168650220 165247240
$$ packed form
16780A4635071Q7838O21886N21953L97061N39512O56229O44234R4183P62439J058992
16770B0019398P14369Q63113J99640O57814J208197Q20932J175694Q35597P75188
16761B7269942J367952R73796J495019J232584J181986J677915R43253K421721
16753C8564168J090598K193403J616290K002247K530936K154402K556726K440705
16745E5149475K763634L015190L024741L461414L142379M203540L752076M165313
16737H2677762M449389M473257N160241M892365N620720N256899O061085N686342
16729A24278060N681094N978482N738040N751407N087950M929850M855966L072291
16721A65373140L307442K497531J211310N37896n01724j372533k402842l402980
$$ plain form
16713 165247240 161553572 156985833 152092286 146814393 140816583 134718121 128801969 122655273
16705 122655273 117137337 111061646 105265188 100216033 94725882 90126903 84859101 80422435
16697 80422435 76264327 72352688 68255894 64853827 61334082 58861548 55421631 53138828
16689 53138828 50510405 47812634 45756926 43573669 41370585 39871700 37862613 36278657
16681 36278657 34563988 33068991 31812509 30761431 29282087 28189332 26576469 25906791
16673 25906791 25024501 24036616 22951449 22465243 21734519 20649607 20010564 19468585 18756624
16664 18756624 17766372 17755724 16897089 16359607 16080669 15236063 15042096 14266395 14113050
16655 14113050 13470043 13022042 12836789 12528320 12361459 11977170 11530007 11389024 11137195
$$ packed form
16713A65247240l693668m567739m893547n277893n997810o098462n916152o146696
16705A22655273n517936o075691n796458n049155n490151m598979n267802m436666
16697H0422435m158108l911639m096794l402067l519745k472534l439917k282803
16689E3138828k628423k697771k055708k183257k203084j498885k009087j583956
16681C6278657j714669j494997j256482j051078j479344j092755j612863o69678
16673B5906791q82290r87885j085167m86206p30724j084912o39043n41979p11961
16664A8756624r90252j0648q58635n37482k78938q44606j93967p75701j53345
16655A4113050o43007m48001j85253l08469j66861l84289m47163j40983k51829
$$ plain form
16646 11137195 10658686 10487358 10134080 9822892 9339955 9005112 9231835 8925606 8509460
16637 8509460 8288897 8324194 8222312 7634486 7393614 7168801 6906258 7231938 6895238 7143422
16627 7143422 6751894 6424823 6321521 6357954 6350905 5797403 5751207 5685540 5497403 5388463
16617 5388463 5396018 5109031 5250715 4947465 4798522 4932170 4847875 4989685 4683999 4623648
16607 4623648 4360358 4425066 4109771 4363843 4472963 3915741 3993819 4135395 3992472 3644959
16597 3644959 3771741 3856175 3601080 3274834 3332896 3228515 3306730 3272722 3220035 3278502
16587 3278502 3371823 3116989 2935169 3034523 3070609 3003212 3014493 2750026 2808073 2724804 2832072
16576 2832072 2857111 2426793 2872716 2367142 2572931 2171492 2770139 2628717 2407290 2470659
$$ packed form
16646A1137195m78509j71328l53278l11188m82937l34843K26723l06229m16146
16637H509460k20563L5297j01882n87826k40872k24813k62543L25680l36700K48184
16627G143422l91528l27071j03302L6433p049n53502m6196o5667j88137j08940
16617E388463P555k86987J41684l03250j48943J33648q4295J41810l05686o0351
16607D623648k63290O4708l15295K54072J09120n57222P8078J41576j42923l47513
16597C644959J26782Q4434k55095l26246N8062j04381P8215l4008n2687N8467
16587C278502R3321k54834j81820R9354L6086o7397J1281k64467N8047q3269J07268
16576B832072K5039m30318M45923n05574K05789m01439N98647j41422k21427O3369
$$ plain form
16566 2470659 2521579 2126422 2177342 2442653 2294774 2291263 2116321 2294603 2344026 2213248
16556 2213248 1858308 2122714 1863206 1806891 2018352 2047629 1784263 1839981 2051603 1860341
16546 1860341 1685573 1519409 1492843 1732513 1735356 1801719 1646902 1356178 1521863 1542052
16536 1542052 1892642 1661581 1586333 1722776 1399452 1369552 1372942 1617492 1428571 1256261
16526 1256261 1620741 1845667 1431882 1531384 1448851 1058701 1220772 1456397 1542760 1472787
16516 1472787 1139166 1459766 841798 1253819 1145758 846928 1110682 1379493 1239685
16507 1239685 993410 1150857 1080682 1076747 869414 1093714 1230071 1161087 984128 994093
16497 994093 755881 1028913 915074 840392 1069399 1036128 819003 851694 954520 1038727
$$ packed form
16566B470659N0920l95157N0920K65311j47879l511j74942J78282M9423j30778
16556B213248l54940K64406k59508n6315K11461K9277k63366N5718K11622j91262
16546A860341j74768j66164k6566K39670K843O6363j54817k90724J65685K0189
16536A542052L50590k31061p5248J36443l23324k9900L390K44550j88921j72310
16526A256261L64480K24926m13785R9502q2533l90150J62071K35625Q6363o9973
16516A472787l33621L20600o17968M12021j08061k98830K63754K68811j39808
16507A239685k46275J57447p0175l935k07333K24300J36357o8984j76959R965
16497I94093k38212K73032j13839p4682K29007l3271k17125L2691J02826Q4207
$$ plain form
16487 1038727 910299 968491 1021117 1091276 902957 815915 964014 580918 805817 1249186
16477 1249186 662279 1037313 774603 782696 242111 980502 1017637 516257 922012 734761
16467 734761 927986 712944 840877 920693 499040 647390 669602 933460 875319 675965
16457 675965 546959 646114 850115 775933 833324 718429 856413 350055 204810 658729
16447 658729 680450 933610 551796 530110 572179 924429 527482 554663 601582 257290
16436 540996 581164 347104 434674 838743 714324 641976 481705 714340 506004 597429
16426 597429 365547 765108 802496 721964 674547 432875 482651 559613 388059 704659
16416 704659 908491 200837 346554 360502 552803 565231 746989 136024 622137 633913
$$ packed form
16487A038727j28428N8192N2626P0159j88319q7042J48099l83096K24899M43369
16477A249186n86907L75034k62710Q093B42111P38391L7135n01380M05755j87251
16467G34761J93225k15042J27933P9816m21653J48350K2212K63858n8141j99354
16457F75965j29006R9155K04001p4182N7391j14895J37984C50055j45245M53919
16447F58729K1721K53160l81814k1686M2069L52250l96947K7181M6919B57290
16436E40996M0168k34060Q7570M04069j24419p2348j60271K32635k08336R1425
16426E97429k31882L99561L7388q0532m7417k41672M9776P6962j71554L16600
16416G04659K03832B00837J45717J3948J92301J2428J81758A36024M86113J1776
$$ plain form
16406 633913 925506 564634 211312 499744 484972 676977 661817 534663 726482 438296
16396 438296 433462 676592 417434 411437 851130 837452 82460 91892 502098 402482 392342
16385 392342 468695 434712 234017 451428 383859 368766 229497 344683 545042 286400
16375 286400 273111 363148 328812 264900 354229 -76544 205046 605719 390283 133525 602502
16364 602502 183203 376707 -88936 68339 150274 392627 374999 239346 270608 498830
16354 498830 284196 349596 679851 236735 273091 314949 -212270 250288 553512 289266
16344 289266 201178 350134 350093 378643 195470 474630 312017 244162 160241 268479 446916
16333 446916 79170 378871 376319 132215 289381 247296 264732 281908 245820 198975 311816
$$ packed form
16406F33913K91593l60872B11312K88432j4772J92005j5160j27154J91819k88186
16396D38296m834K43130k59158n997M39693j3678H2460R432M10206r9616j0140
16385C92342P6353l3983k00695K17411o7569j5093j39269J15186K00359k58642
16375B86400j3289R0037l4336o3912Q9329g6544B05046M00673k15436A33525M68977
16364F02502A83203J93504h8936F8339Q1935K42353j7628j35653L1262K28222
16354D98830k14634O5400L30255B36735L6356M1858b12270B50288L03224k64246
16344B89266q8088J48956m1K8550j83173K79160j62613o7855q3921J08238J78437
16333D46916G9170K99701k552A32215J57166m2085J7436J7176l6088m6845J12841
$$ plain form
16322 311816 155283 265809 335572 -114391 288477 569848 204524 131307 278539 163702
16312 163702 634457 169520 176782 76020 176611 424910 610282 299066 323107 173601
16302 173601 174576 176805 279837 51241 115992 336219 570338 131063 151516 385071 327481
16291 327481 159159 229416 -70996 175576 250042 205818 246976 295357 312763 532732 55087
16279 116010 -33625 2386 381850 67325 304288 620188 197872 -53985 -98311 39228 351533
16268 351533 522892 376263 190211 97783 45560 75904 268133 -237196 209395 125701
16258 125701 327420 137453 -7029 221533 301342 304338 254482 128846 69637 424671 280031
16247 280031 592787 46354 121141 112344 316383 67092 202970 328006 380008 224455 -185946
$$ packed form
16322C11816A55283J10526O9763a14391B88477K81371B04524p3217J47232j14837
16312A63702M70755A69520P262G6020J00591K48299J85372B99066K4041j49506
16302A73601R75K229J03032E1241O4751K20227K34119A31063K0453K33555n7590
16291C27481A59159P0257g0996A75576P4466m4224M1158M8381J7406K19969E5087
16279A16010c3625B386L79464F7325K36963L15900A97872e3985m4326C9228L12305
16268C51533J71359j46629j86052r2428D5560L0344J92229b37196B09395q3694
16258A25701K01719A37453g029B21533P9809K996m9856j25636n9209L55034j44640
16247B80031L12756D6354P4787q797K04039F7092J35878J25036N2002j55553a85946
$$ plain form
16235 -89029 157686 103515 33879 324511 356202 -61767 308577 234284 -10061 122408 410580
16224 410580 -289576 4778 120422 -289512 204818 -96554 812898 197869 5516 -179873
16213 134333 356756 215598 142587 -105264 290519 -158312 55200 37734 44544 13716 201381
16202 201381 48442 352127 256938 134967 460436 -64345 13590 143681 144308 65023 138877
16191 138877 -28456 307444 17660 -7553 131767 224824 -86486 -41539 50064 197572 62619
16179 -72728 -145557 70793 -64458 254225 -162838 263341 -123253 -104484 46372 87825 109169
16168 109169 255911 130788 107023 -54103 172607 129894 229611 318940 80404 240427 165601
16157 165601 -149601 -145847 181911 228684 27058 29171 58887 -134999 -167262 -67750 -92038
$$ packed form
16235h9029A57686n4171C3879K90632L1691f1767C08577p4293a0061A22408K88172
16224D10580b89576D778J15644b89512B04818i6554H12898A97869E516a79873
16213A34333K22423j41158p3011a05264B90519a58312E5200j7466O810A3716J87665
16202B01381D8442L03685r5189j21971L25469f4345A3590J30091O27F5023P3854
16191A38877b8456C07444A7660g553A31767R3057h6486d1539E0064J47508F2619
16179g2728p2829G0793f4458B54225a62838B63341a23253J8769D6372M1453K1344
16168A09169J46742j25123k3765e4103A72607m2713R9717Q9329H0404J60023p4826
16157A65601a49601L754A81911M6773B7058K113K9716a34999l2263f7750k4288
$$ plain form
16146 -92038 33177 131579 11576 -49032 -113125 -36006 47571 71279 -125565 170366 13946
16134 146592 -117613 -86726 242778 95528 89739 103931 -123778 63815 -181797 319564 -62865
16122 -48696 554526 -25480 234634 389655 418016 -117179 -93771 24357 -262199 10013 -25958
16110 34127 220753 -309558 -99833 70761 -7217 -162221 -239601 -171261 254174 255455 16817
16098 54636 -225897 244223 27784 267635 -103631 -119507 -201108 129878 8604 7351 83009
16087 83009 -41526 502610 -202030 -207045 9425 -219594 -217723 218116 -167502 475790 -15018
16075 -27031 -242846 -228771 -250670 -221086 97976 -10838 278779 79626 -110072 61458 366854
16064 366854 643177 -234682 110660 13272 -96474 67017 58690 -113203 155098 -337294
$$ packed form
16146i2038C3177R8402A1576d9032o4093c6006D7571K3708a25565A70366A3946
16134A46592a17613L0887B42778I5528n789J4192a23778F3815a81797C19564f2865
16122d8696E54526b5480B34634J55021K8361a17179K3408B4357b62199A0013b5958
16110C4127J86626c09558i9833G0761g217j55004p7380O8340B54174J281A6817
16098E4636b25897B44223B7784K39851a03631j5876q1601A29878H604j253P5658
16087H3009d1526E02610b02030n015I425b19594J871B18116a67502D75790a5018
16075b7031k15815J4075k1899K9584I7976a0838B78779G9626a10072F1458L05396
16064C66854K76323b34682A10660A3272i6474F7017q327a13203A55098c37294
$$ plain form
16053 -375660 234416 -96119 83576 58361 200615 -119056 26388 159403 -214144 26925
16042 172739 75510 -40883 23006 -103389 111548 146665 13917 -172887 23172 -212080 5486
16030 88229 44825 -70714 -40809 -310589 -58406 -60939 75651 -13206 131381 -113905 42129
16018 -378090 118731 111805 -6211 -328263 185160 129310 -79618 54950 210722 -112763 -24523
16006 117830 -133901 -337698 161283 -252146 -35055 136859 -118561 -33022 145715 -197403
15995 59039 44137 -135878 36002 241330 -193881 -139313 80672 21594 -373684 184787 -136417
15983 -163112 341705 309755 -38229 405069 50864 62198 190767 -27095 -98 96324 346561
15972 346561 -16272 45258 -146014 7704 -290148 -59557 192352 -55319 -243567 -208600 -89588
$$ packed form
16053c75660B34416i6119H3576k5215J42254a19056B6388J33015b14144B6925
16042A72739G5510d0883B3006a03389A11548L5117A3917a72887B3172b12080E486
16030H8229m3404g0714K9905k69780e8406k533G5651a3206A31381a13905D2129
16018c78090A18731o926f211l22052A85160n5850g9618E4950J55772a12763b4523
16006A17830a33901k03797A61283b52146c5055A36859a18561c3022A45715a97403
15995E9039j4902a35878C6002K05328a93881N4568H0672B1594c73684A84787a36417
15983a63112C41705l1950c8229D05069E0864J1334J28569b7095i8I6324K50237
15972C46561a6272D5258a46014G704b90148e9557A92352e5319j88248L4967h9588
$$ plain form
15960 262305 -34488 -92038 438516 -99039 55639 49641 -225524 32555 64472 -34809 -72255
15949 -72255 -172169 210210 -9846 187894 -260142 257312 -50499 -2966 78331 -372666 -198433
15938 -198433 309532 -347412 -261325 -89375 97578 -176895 -129842 -73145 -78745 -194803 -11174
15926 3175 -18115 75942 32733 124686 -341553 -47486 91212 85217 344334 305337 -284048
15914 -331171 -163509 104609 -91842 -111312 -479340 180403 74722 -572372 -141177 246271
15903 -235102 105894 13095 -158033 15697 -96426 -108144 -223949 -453851 14002 -485573
15892 -279186 91350 22541 -107592 -7420 -37062 -188 425151 140007 -131199 26333 149083
15881 149083 94336 42676 -281205 -36348 24412 130283 -137477 -233121 13022 -175678 93971
$$ packed form
15960B62305c4488n7550D38516i9039E5639n998b25524C2555L1917c4809l7446
15949g2255r9914B10210i846A87894b60142B57312e0499b966G8331c72666J74233
15938a98433C09532c47412Q6087h9375I7578a76895M7053N6697n600j16058a1174
15926C175a8115G5942C2733R1953c41553d7486I1212n995K59117l8997b84048
15914c31171a63509A04609i1842j9470l68028A80403G4722e72372a41177B46271
15903b35102A05894A3095a58033A5697i6426j1718j15805k29902A4002d85573
15892b79186I1350B2541a07592g420k9642a88D25151A40007a31199B6333J22750
15881A49083n4747D2676b81205c6348B4412J05871a37477r5644A3022a75678I3971
$$ plain form
15869 -84344 -260145 -104779 8520 93060 -24537 -155803 -46121 185918 -4198 292542 -19148
15857 -27193 -15140 -154627 -175900 280750 -85256 228507 -92128 -143859 -62904 6088 23043
15846 23043 91549 -458362 263973 53344 149675 77111 -64727 -67825 6366 18049 -328060
15834 118695 -223259 329820 40662 370443 312797 -229429 94424 -157365 62152 -139038
15823 -164877 -76141 -208404 185109 -5414 181955 -320146 -181239 -95790 -189441 15351 115648
15812 115648 -297342 116383 136142 214812 -15833 144907 -105673 -135107 36619 -284639
15801 -20192 -103719 107580 -319778 95482 9362 67619 33607 -131654 240616 -147605 21830
15789 408560 -176910 -121571 50817 -180934 -67920 143584 -52685 -65833 -86559 257149 -139782
$$ packed form
15869h4344j75801a04779H520Q4540b4537j31266d6121A85918d198B92542a9148
15857b7193J2053j39487k1273B80750h5256B28507i2128n1731f2904F088J6955
15846B3043O8506d58362B63973E3344R6331p2564f4727l098F366J1683c28060
15834A18695b23259C29820D0662L29781n7646b29429I4424a57365F2152a39038
15823a64877g6141j32263A85109e414A81955c20146J38907Q5449r3651A5351J00297
15812A15648b97342A16383J9759P8670a5833A44907a05673k9434C6619b84639
15801b0192q3527A07580c19778I5482I362N8257C3607a31654B40616a47605B1830
15789D08560a76910N5339E0817a80934f7920A43584e2685j3148k0726B57149a39782
$$ plain form
15777 -203105 218992 -93088 -213116 -216006 90431 215092 -105565 -31399 394769 -12528 -216420
15766 -216420 68443 193967 -239790 133806 -30340 256513 95387 50382 -370165 -44747
15755 41164 236555 159333 87286 -109265 61403 -66940 399414 -197825 -37474 -182823 -99300
15744 -99300 192666 -35096 -159356 -120730 105312 -158680 -184632 -27951 357205 234433
15734 234433 -317351 244127 54628 -58796 195073 28211 -294216 -9373 -118195 -47930 120132
15722 -12832 43764 -229092 123090 -99408 323653 -35598 193044 145289 -135845 4402 -191107
15710 -115099 -130201 -66947 -287086 61027 21790 -197918 76690 -227118 -34060 -249857 -111633
15698 -80830 150305 -180130 -49232 240754 103026 -397463 293395 324890 -40163 261390
$$ packed form
15777b03105B18992i3088j20028k890I0431J24661a05565c1399C94769a2528k03892
15766b16420F8443J25524b39790A33806c0340B56513I5387m5005c70165d4747
15755D1164J95391p7222p2047a09265F1403f6940C99414a97825c7474j45349Q3523
15744i9300A92666c5096j24260L8626A05312a58680k5952b7951C57205j22772
15734B34433c17351B44127E4628e8796A95073B8211b94216i373j08822d7930A20132
15722a2832D3764b29092A23090i9408C23653c5598A93044m7755a35845D402a91107
15710a15099j5102O3254k20139F1027B1790a97918G6690b27118c4060k15797a11633
15698h0830A50305a80130d9232B40754A03026c97463B93395L1495d0163B61390
$$ plain form
15687 202035 387049 -192781 272794 -96980 -153870 57528 85324 -311344 28886 -123700
15676 288038 -121011 239134 115811 -110743 -53462 39866 99760 -95781 168304 35465
15665 173913 -86793 -34098 -120184 181042 49381 -230679 38518 206940 -471213 148272
15654 -26756 81316 81052 183108 -410143 -81907 -21590 -39011 76631 -278920 -129492 -38831
15642 208571 -110168 -72653 475195 -163733 19049 -111798 -148855 173877 -4262 -37229 -83943
15631 -83943 141378 137559 -44835 -78703 -299320 -252088 85311 129828 143033 50297 -3648 -298991
15619 -298991 -156146 66334 153662 59017 58235 -214019 -60683 -239468 -104121 51982 189579
15608 189579 -194453 -3993 336618 -111608 162627 155491 289528 50652 292776 -57061 99829
$$ packed form
15687B02035J85014a92781B72794i6980n6890E7528K7796c11344B8886a23700
15676B88038a21011B39134A15811a10743e3462C9866N9894i5781A68304C5465
15665A73913h6793c4098q6086A81042D9381b30679C8518J68422d71213A48272
15654b6756H1316k64J02056d10143h1907b1590j7421G6631b78920a29492c8831
15642B08571a10168L7515D75195a63733A9049a11798l7057A73877d262l2967m6714
15631h3943A41378l819d4835l3868k20617M7232H5311M4517J3205E0297c648k95343
15619b98991J42845F6334Q7328E9017p82b14019f0683j78785a04121E1982J37597
15608A89579a94453c993C36618a11608A62627p136J34037E0652K42124e7061I9829
$$ plain form
15596 130812 171070 68721 -234502 278987 -137243 153178 -184624 -362280 35293 127009
15586 127009 80265 -321665 73025 -68115 -54108 190007 -90661 -76661 24204 -90528 -81306
15575 -81306 -37223 -114542 -49226 63468 58605 224655 -149406 -3331 91884 -224712 -300960
15564 -300960 -7646 115942 268217 154788 -46088 100618 -5973 68705 12300 -48472 128144
15552 -273923 -45177 55981 92552 236304 -79513 -168026 84413 -12604 142843 98145 144252
15541 144252 -273979 -158048 28276 -315556 227092 279377 -43379 -239231 343215 156464
15530 -333860 -48706 114118 73183 -81373 71893 -159829 -81404 -237401 -276911 88994 -365965
15518 127707 2837 107873 -223564 -11816 -30304 -191516 -138240 79375 264853 3199 46839
$$ packed form
15596A30812M0258F8721b34502B78987a37243A53178a84624j77656C5293R1716
15586A27009m6744c21665G3025f8115J4007A90007i0661J4000B4204i0528R222
15575h1306c7223p7319d9226F3468m863J66050a49406c331I1884b24712p6248
15564c00960g646A15942J52275j13429d6088A00618e973F8705A2300d8472A28144
15552b73923d5177E5981L6571J43752g9513q8513H4413a2604A42843m4698M6107
15541A44252b73979J15931B8276c15556B27092N2285d3379j95852C43215A56464
15530c33860d8706A14118m0935h1373G1893a59829P8425j55997l9510H8994c65965
15518A27707B837J05036b23564a1816j8488j61212N3276G9375J85478C199M3640
$$ plain form
15507 46839 62609 -137008 -44328 211356 -178992 -212442 222997 -82605 -256812 -164730 45805
15495 -96254 47758 314315 129787 -67779 -123987 73036 135853 -134796 44273 145761 -449786
15483 -90690 -65599 111864 163996 -96842 -290903 18175 56341 -40408 -237672 158528 -268856
15471 43573 -5554 46702 -12021 38318 -188500 -124890 132086 128560 2729 54280 137495 -117948
15458 -88518 -9772 -90263 -52922 343726 -243854 13230 360525 105655 8596 23424 162479
15447 162479 -12496 139181 5747 81309 -87122 -89294 143384 -98928 -186923 36638 -109425
15435 289485 -98667 -56999 -80173 -118366 -252532 -16340 -341731 -425099 -343508 255974 -175360
15423 -7984 44287 -30595 18719 204627 -209625 -74339 68195 191516 -43652 -48999 -101077
$$ packed form
15507D6839J5770a37008d4328B11356a78992l3450B22997h2605j74207R2082D5805
15495i6254D7758K66557A29787f7779n6208G3036O2817a34796D4273J01488d49786
15483i0690K5091A11864N2132i6842j94061A8175L8166d0408j97264A58528b68856
15471D3573e554D6702a2021C8318a88500O3610A32086l526B729N1551Q3215a17948
15458h8518i772q0491L7341C43726b43854A3230L47295A05655H596J4828J39055
15447A62479a2496A39181E747P5562h7122k172A43384i8928q7995C6638a09425
15435B89485i8667M1668k3174l8193j34166a6340l25391q3368Q1591B55974a75360
15423g984D4287c0595A8719J85908b09625g4339F8195J23321d3652n347n2078
$$ plain form
15412 -101077 25519 44334 -115418 -33119 245374 115688 -196687 -97189 -120467 -190099 148052
15400 79609 -226322 458974 -117012 -11278 36631 321358 -1549 -3677 -189241 171492 144902
15389 144902 -281922 -395939 113029 -174970 154254 -132837 166098 188946 -112702 476559
15378 75043 -68206 -129923 76123 342297 -410237 287333 -233173 122716 -35801 -117897 13966
15366 -51930 -143517 -41247 -53573 -125498 108931 189402 75274 55708 72009 -58466 -192604
15355 -192604 -52257 -16901 1363 248599 107214 -360372 -81304 28221 -47241 219315 -38487
15343 -184900 8840 -82601 26075 -20700 -54637 59622 23418 135861 71888 -275023 71185
15331 -73021 -22217 -19184 -207322 199848 -84679 -160354 -155044 322618 -71880 252827 -262392
$$ packed form
15412a01077B5519J8815a15418c3119B45374A15688a96687i7189k3278o9632A48052
15400G9609b26322D58974a17012a1278C6631K84727a549k128j85564A71492k6590
15389A44902b81922j14017A13029a74970A54254a32837A66098K2848a12702D76559
15378G5043f8206o1717G6123K66174d10237B87333b33173A22716c5801q2096A3966
15366e1930r1587d1247j2326p1925A08931Q0471G5274j9566J6301e8466j34138
15355a92604e2257a6901A363K47236A07214c60372h1304B8221d7241B19315c8487
15343a84900H840h2601B6075b0700l3937E9622B3418J12443o3973b75023G1185
15331g3021b2217L033j88138A99848h4679p5675N310C22618g1880B52827b62392
$$ plain form
15319 19037 -291542 280336 75850 390260 -200741 -96359 91291 101758 245941 -25167 44817
15307 -105702 -3776 188829 -231699 -156090 95928 254433 448244 -21771 -68797 235524 -135311
15295 -60800 -22358 -18721 85655 -168884 -85828 -69661 -61055 -243852 -83607 272748 92446
15283 37828 202660 80232 257816 -68880 6052 -33093 158225 208531 65356 41349 -14511
15271 45525 259556 -228084 250339 50637 -73908 231926 -74107 70218 -4922 -85870 56927
15259 112834 127249 347006 -56559 131174 189466 213735 142431 344720 57380 575281 1203552
15248 1203552 1379927 1177864 1110629 1055803 331301 123495 -66678 -32748 120849 190744
15238 190744 34629 170930 -78096 310252 339814 -62796 132104 105177 -77706 2769 95852
$$ packed form
15319A9037b91542B80336G5850L14410b00741i6359I1291J0467J44183b5167D4817
15307a05702c776A88829b31699P5609I5928J58505J93811b1771m7026B35524a35311
15295f0800b2358L637H5655a68884Q3056J6167Q606j82797h3607B72748I2446
15283C7828J64832H0232J77584f8880F052c3093A58225N0306F5356k4007a4511
15271D5525K14031b28084B50339E0637g3908B31926g4107G0218d922q0948E6927
15259A12834J4415K19757e6559A31174N8292K4269p1304K02289E7380N17901O28271
15248A203552J76375k02063o7235n4826C31301A23495f6678c2748A20849O9895
15238A90744C4629J36301g8096C10252K9562f2796A32104k6927g7706B769R3083
$$ plain form
15227 95852 185711 -149271 342944 -293486 175950 -126631 123764 -201606 161749 -94516
15216 49102 -146909 176235 68472 -234548 -42708 -98019 189927 -99507 -18031 92938 71655
15205 71655 8696 287930 -27735 93925 -146801 -111895 309588 -37552 -75522 -120603 181926
15193 150650 79047 261989 -35565 -237325 -76145 105174 45513 277 260930 727373 8750
15181 174079 250485 -57153 143804 -193421 -213599 162103 -108545 -152692 397690 164190
15170 139710 155305 -13584 76399 209172 -258813 -9459 -10623 175783 -214080 110184 245923
15159 245923 141745 80325 -195145 -147750 312067 153213 -73979 190891 165105 67179
15148 259304 155470 184699 -45420 119486 28473 -99335 -77007 533751 113367 23352 -23570
$$ packed form
15227I5852Q9859a49271C42944b93486A75950a26631A23764b01606A61749i4516
15216D9102a46909A76235F8472b34548d2708n5311A89927i9507a8031I2938k1283
15205G1655H696K79234b7735I3925a46801L4906C09588c7552l7970m5081A81926
15193A50650p1603J82942c5565k01760g6145A05174D5513B77K60653M66443H750
15181A74079P6406e7153A43804a93421k0178A62103a08545m4147C97690A64190
15170A39710J5595a3584G6399J32773b58813i459j164A75783b14080A10184J35739
15159B45923j04178o1420a95145M7395C12067A53213g3979A90891k5786F7179
15148B59304j03834K9229d5420A19486B8473i9335K2328E33751A13367B3352b3570
$$ plain form
15136 -48743 111274 -89542 32213 401232 -24964 -89864 -66010 -127043 210635 244528 -45995
15124 126607 -143871 256152 364639 25273 233544 125946 311113 -41958 371081 60224
15113 -37482 -88564 -124175 134818 219217 -11399 -86009 -74962 -116712 164388 216926 -26904
15101 213561 265446 239123 244471 22308 99993 126917 83649 -214939 159025 -7175 319281
15089 -193538 74395 128741 225636 134198 136560 112785 379534 -62845 122981 -152392 477971
15077 100400 -51477 -217965 474932 165433 36686 -35245 399759 172807 269954 -39409
15066 398728 -46004 376132 99535 312583 180815 -37469 74276 75494 -73824 91430 55403
15055 55403 424717 67988 -32075 107534 181316 -60663 -173141 50638 136521 331928 -91329
$$ packed form
15136d8743A11274h9542C2213L69019b4964o4900K3854o1033B10635L3893d5995
15124A26607a43871B56152J08487B5273K08271j07598J85167d1958C71081F0224
15113c7482n1082l5611A34818Q4399a1399p4610J1047m1750A64388N2538b6904
15101B13561N1885k6323N348B2308P7685K6924m3268b14939A59025g175C19281
15089a93538G4395N4346R6895r1438K362k3775K66749f2845A22981a52392D77971
15077A00400e1477j66488D74932A65433C6686c5245C99759A72807R7147c9409
15066C98728d6004C76132I9535K13048j31768c7469G4276J218g3824I1430l6027
15055E5403L69314F7988c2075A07534P3782f0663j12478E0638Q5883J95407i1329
$$ plain form
15043 278787 -97929 100461 -103420 -34394 240473 339573 219526 264455 217540 79747 77538
15032 77538 219168 -177911 159776 377689 -97231 298547 -19920 245369 539190 275803
15022 275803 94247 7674 248858 -17259 369953 30546 -17497 148936 315577 84146 -142760
15010 6674 219104 25412 400617 36509 39879 315278 -286326 90393 437806 453382 125052
14998 423961 -200830 193224 -24470 148167 409110 557287 101915 660353 397889 548809
14988 548809 126142 76696 -27556 114678 301437 87508 244021 163744 245520 -127287
14977 271642 70626 553598 161650 349706 180525 587391 228975 318322 319438 282456
14967 282456 63117 355702 130843 -76627 78555 289553 325586 330167 17952 440513 26133
$$ packed form
15043B78787i7929A00461a03420c4394B40473R9100j20047M4929m6915G9747k209
15032G7538J41630a77911A59776K17913i7231B98547a9920B45369K93821k63387
15022B75803I4247G674K41184a7259C69953C0546a7497A48936J66641H4146a42760
15010F674K12430B5412L75205C6509L370K75399b86326I0393L47413J5576A25052
14998D23961b00830A93224b4470A48167K60943J48177A01915N58438k62464J50920
14988E48809A26142m9446b7556A14678J86759H7508J56513q0277Q1776a27287
14977B71642G0626M82972A61650J88056j69181M06866B28975Q9347J116l6982
14967B82456F3117K92585A30843g6627G8555K10998L6033M581A7952M22561B6133
$$ plain form
14955 440810 518190 203858 235679 141973 266378 179902 327291 203286 -46238 109135
14944 186326 366022 275636 301072 200638 465817 436477 239817 175119 380280 367145
14934 367145 457514 523320 -10386 227079 -168964 416234 655071 541480 405340 228547
14924 228547 357436 478100 374248 376578 121116 159075 230323 125179 85387 -30099 415668
14912 363771 59902 238144 212140 18049 262583 279188 271954 498153 -1322 427032 228975
14901 228975 194040 76424 44998 291578 171792 55374 231507 306495 230218 121970 411835
14890 411835 320228 377013 328610 141195 205407 122483 327918 337651 420724 393775 451372
14879 451372 410402 311159 520881 548183 529857 395707 148190 259361 326377 628308
$$ packed form
14955D40810P7380B03858L1821r3706J24405q6476J47389j24005d6238A09135
14944A86326J79696r0386K5436j00434K65179k9340j96660o4698K05161j3135
14934C67145R0369O5806a0386B27079a68964D16234K38837j13591j36140j76793
14924B28547J28889J20664j03852K330A21116L7959P1248j05144l9792c0099D15668
14912C63771E9902J78242k6004A8049K44534J6605p234K26199a322D27032j98057
14901B28975l4935G6424l1426K46580j19786E5374J76133P4988p6277j08248K89865
14890D11835r1607N6785m8403A41195O4212q2924K05435R733Q3073k6949N7597
14879D51372m0970r9243K09722K7302j8326j34150A48190J11171O7016L01931
$$ plain form
14869 628308 555135 188332 301750 782037 180542 311262 553506 308076 251467 780341
14859 780341 349067 239972 103045 399659 371607 151052 474432 352511 422855 354301
14849 354301 412083 288102 589339 442751 328245 731361 489072 450739 306735 560537
14839 560537 407220 397645 258869 481526 361727 383590 522284 108526 297169 -40606
14828 270060 571328 431406 640263 601458 522882 766213 225196 745668 344727 672713
14818 672713 297465 454912 634372 382477 550397 192380 477217 467785 653628 537473
14808 537473 670480 327506 410951 761093 660655 502585 679805 553271 331217 694383
14798 694383 568693 484701 266974 272205 277397 255493 91977 639008 604242 362547 465613
$$ packed form
14869F28308p3173A88332J13418M80287A80542J30720K42244k45430n6609N28874
14859G80341C49067j09095A03045K96614k8052A51052L23380j21921P0344o8554
14849C54301N7782j23981L01237j46588j14506M03116k42289l8333j44004K53802
14839E60537j53317r575j38776K22657j19799K1863J38694A08526J88643d0606
14828B70060L01268j39922K08857l8805p8576K43331B25196N20472C44727L27986
14818F72713B97465J57447J79460k51895J67920A92380K84837r432J85843j16155
14808E37473J33007C27506Q3445L50142j00438j58070J77220j26534k22054L63166
14798F94383j25690q3992k17727N231N192k1904I1977N47031l4766k41695J03066
$$ plain form
14787 465613 459893 687893 899425 363437 431325 564520 637847 622087 424594 718235
14777 718235 214661 366177 394037 502573 572933 570620 805836 1089149 1044633 470596
14766 517908 704322 489430 666263 379939 692834 515496 932233 570086 710149 731728
14756 731728 440935 464139 367521 440590 355533 824846 661738 531194 428231 721122
14746 721122 357011 801913 461780 671935 1023755 758430 655205 614528 821928 596531
14736 596531 868050 496828 845877 605828 533206 483838 599010 763173 816903 799994
14726 799994 631409 715875 851234 912692 544174 975837 1030350 986721 1041801 513994
14715 844139 800876 768661 747186 838929 700809 983155 659179 952569 963373 853760
$$ packed form
14787D65613n720K28000K11532C63437O7888J33195P3327j5760j97493K93641
14777G18235B14661J51516K7860J08536P0360k313K35216K83313m4516D70596
14766E17908J86414k14892J76833k86324L12895j77338M16737l62147J40063K1579
14756G31728k90793K3204r6618P3069q5057M69313j63108j30544j02963K92891
14746G21122C57011M44902l40133K10155L51820k65325j03225m0677K07400k25397
14736E96531K71519l71222L49049k40049p2622m9368J15172J64163N3730j6909
14726G99994j68585Q4466J35359O1458l68518M31663N4513m3629N5080E13994
14715H44139m3263l2215k1475R1743j38120K82346l23976K93390J0804j09613
$$ plain form
14705 853760 922682 903861 552803 1085248 924966 745274 989640 773920 854973 964901
14695 964901 909813 987761 966563 633924 745665 711428 449437 745180 767776 1056230
14685 1056230 1130145 1002661 1009958 953670 938682 1149439 1079772 858817 788397 721346 1247924
14674 1247924 1000855 1258162 796505 746927 1190318 617962 1245207 937294 1057886 1061724
14664 1061724 1152231 830922 1184564 1130885 1089870 1163651 763417 997046 777011 904393
14654 904393 1440314 1165889 974557 1191595 1118085 1183167 899789 1210842 1052594 1302300
14644 1302300 1292319 1401246 933764 942540 1151494 1120523 1301682 1356562 968360 767052
14634 767052 1165125 1427807 1446088 1276505 1237817 971407 1616216 1540116 1366359 1586840
$$ packed form
14705H53760O8922j8821l51058N32445j60282j79692K44366k15720Q1053J09928
14695I64901n5088P7948k1198l32639J11741l4237k61991K95743K2596K88454
14685A056230P3915j27484P297n6288j4988K10757o9667k20955p0420o7051N26578
14674A247924k47069K57307m61657m9578M43391n72356O27245l07913J20592L838
14664A061724R0507l21309L53642n3679m1015P3781m00234K33629k20035J27382
14654I04393N35921k74425j91332K17038p3510O5082k83378L11053j58248K49706
14644A302300r981J08927m67482Q776K08954l0971J81159N4880l88202k01308
14634G67052L98073K62682J8281j69583l8688k66410O44809p6100j73757K20481
$$ plain form
14624 1586840 1616394 1338575 1683338 1400951 1420531 1329778 1708099 1337951 1424313 1115864
14614 1115864 1662967 1380192 1561659 1219257 1753687 1253461 1705268 1517643 1658850
14605 1658850 1455069 1544752 1341139 1687048 1582860 1185132 1962319 1499230 1771974 1522414
14595 1522414 1581903 1783435 1573425 1543866 1990948 1764332 1800461 1578410 2120700 1915044
14585 1915044 1913401 1855939 2057468 1972020 1852066 2007738 2156188 1986161 1573915 1962108
14575 1962108 2187635 2336411 2130977 1989134 2075608 2302257 2097160 2171147 2405993 2523128
14565 2523128 2515667 2693348 2306453 2695787 2452015 2748076 2811948 2907028 2850801 3035961
14555 3035961 3438783 3384208 3783149 4283048 4532083 5858415 7852008 12321541 22194715
$$ packed form
14624A586840K9554k77819L44763k82387J9580r0753L78321l70148Q6362l08449
14614A115864N47103k82775J81467l42402N34430n00226M51807j87625J41207
14605A658850k03781Q9683k03613L45909j04188l97728P77187m63089K72744k49560
14595A522414N9489K01532k10010k9559M47082k26616L6129k22051N42290k05656
14585A915044j643n7462K01529q5448j19954J55672J48450j70027m12246L88193
14575A962108K25527J48776k05434j41843Q6474K26649k05097P3987K34846J17135
14565B523128p461J77681l86895L89334k43772K96061O3872R5080n6227J85160
14555C035961M02822n4575L98941M99899K49035J326332J993593M469533R873174
$$ plain form
14546 22194715 45557048 42043055 18297050 7211078 3664153 2955397 2056843 1820427
14538 1820427 1890179 2034321 1819737 1985644 1898748 2084674 2247432 1833148 2258764 2267214
14528 2267214 2188829 2000219 2478255 2446991 2577530 2146004 2320419 2420130 2246125 2481653
14518 2481653 2744449 2193399 2520722 2381089 2516439 2308722 2773641 2809769 2383263 2471231
14508 2471231 2846460 3045835 2622465 2913763 2894457 3027524 3000910 3028244 2882087 2926025
14498 2926025 3190553 3000386 3583286 3000507 3482360 3551020 3381121 3075004 3703650 3421600
14488 3421600 3719727 3311117 3842131 3639647 3618380 3832524 3722163 3669311 3970396 4031509
14478 4031509 3918797 4092439 4177622 4122990 4129440 3960342 4056033 4407265 3946871 4023697
$$ packed form
14546B2194715K3362333l513993A8297050G211078l546925p08756q98554k36416
14538A820427O9752J44142k14584J65907q6896J85926J62758m14284M25616Q450
14528B267214p8385j88610M78036l1264J30539m31526J74415R9711j74005K35528
14518B481653K62796n51050L27323j39633J35350k07717M64919L6128m26506Q7968
14508B471231L75229J99375m23370K91298j9306J33067k6614K7334j46157M3938
14498B926025K64528j90167N82900n82779M81853O8660j69899l06117O28646k82050
14488C421600K98127m08610N31014k02484k1267K14144j10361n2852L01085O1113
14478D031509j12712J73642Q5183n4632O450j69098R5691L51232m60394P6826
$$ plain form
14468 4023697 4415831 4088831 4591267 4298003 4305966 4330240 4531892 4706367 5203308 5082861
14458 5082861 4944202 5155467 5073874 5128460 5011781 5217784 5263003 5350350 4962625 5189536
14448 5189536 5713747 5285553 5297992 5629106 5765007 5490009 6051625 5822816 6086933 6071438
14438 6071438 6463318 6218968 6243090 6556095 6599223 6507104 6447821 7030737 6882689 7322844
14428 7322844 7124943 6867105 7239643 7578626 7326099 7621297 7444457 7357136 7704700 8204026
14418 8204026 8382336 8166607 8207442 8505055 8182245 8928420 8837607 9232276 9061849 9399878
14408 9399878 9265942 9291539 9585528 9860429 9685254 9980037 10092436 10387878 10361775 10779587
14398 10779587 11169453 11194902 11174891 11120692 11446664 11733365 11942898 12587964 12379127 12698121
$$ packed form
14468D023697L92134l27000N02436k93264P963K4274K01652J74475M96941j20447
14458E082861j38659K11265q1593N4586j16679K06003M5219Q7347l87725K26911
14448E189536N24211m28194J2439L31114J35901k74998N61616k28809K64117j5495
14438F071438L91880k44350K4122L13005M3128r2119n9283N82916j48048M40155
14428G322844j97901k57838L72538L38983k52527K95198j76840q7321L47564M99326
14418H204026J78310k15729M0835K97613l22810P46175r0813L94669j70427L38029
14408I399878j33936K5597K93989K74901j75175K94783J12399K95442k6103M17812
14398A0779587L89866K5449k0011n4199L25972K86701K09533O45066k08837L18994
$$ plain form
14388 12698121 12683283 12917158 13470813 13404876 13648157 13684004 14173435 14540001 14647308 15123454
14378 15123454 15225766 15617226 15671610 16269646 16368527 16646859 17188463 17451976 17556766 18268621
14368 18268621 18632168 18751183 19404439 19752022 20142923 20449900 21096140 21269111 22234030
14359 22234030 22550758 22894874 23449361 24075640 24503185 25145818 25555712 26380058 27082080
14350 27082080 27836806 28350317 28776856 30139349 30643540 31494624 31745504 32842686 33654488
14341 33654488 34527206 35691003 36974592 38065408 39001808 40247503 41044532 42265213
14333 42265213 43821680 45189521 46453711 48112419 49379425 51347920 52474467 54634264
14325 54634264 56056628 58199867 60385470 62169011 64764006 66984829 69294905 71744223
$$ packed form
14388A2698121j4838K33875N53655o5937K43281L5847M89431L66566J07307M76146
14378A5123454J02312L91460N4384N98036R8881K78332N41604K63513J04790P11855
14368A8268621L63547J19015O53256L47583L90901L06977O46240J72971R64919
14359B2234030L16728L44116N54487O26279M27545O42633M09894Q24346P02022
14350B7082080P54726N13511M26539J362493N04191Q51084K50880J097182Q11802
14341C3654488Q72718J163797J283589J090816R36400J245695P97029J220681
14333D2265213J556467J367841J264190J658708J267006J968495J126547K159797
14325E4634264J422364K143239K185603J783541K594995K220823K310076K449318
$$ plain form
14317 71744223 74539485 77361664 80395446 83702198 87173794 90658750 94344371 98317711
14309 98317711 102613575 107092336 111323491 116574882 121850384 127380028 133448679 139539232
14301 139539232 146061525 153147029 160507740 168570814 176564286 185701347 194932912 204802337
14293 204802337 214864042 225793610 237301438 248388573 260749049 273483921 287029066
14286 287029066 300776435 314981634 329089068 343569551 358318883 372766916 386938374
14279 386938374 400403916 413432364 424978732 435534359 444402948 451310825 455314782
14272 455314782 455562620 454708728 454188783 450690846 444861614 439434842 431902281 421615392
14264 421615392 409609618 395733522 381736790 366762788 350974901 335760246 320380251
$$ packed form
14317G1744223K795262K822179L033782L306752L471596L484956L685621L973340
14309I8317711M295864M478761M231155N251391N275502N529644O068651O090553
14301A39539232O522293P085504P360711Q063074P993472R137061R231565R869425
14293B04802337J0061705J0929568J1507828J1087135J2360476J2734872J3545145
14286B87029066J3747369J4205199J4107434J4480483J4749332J4448033J4171458
14279C86938374J3465542J3028448J1546368J0555627Q868589O907877M003957
14272D55314782K47838q53892n19945l497937n829232n426772p532561j0286889
14264D21615392j2005774j3876096j3996732j4974002j5787887j5214655j5379995
$$ plain form
14257 320380251 305194609 290183146 277123247 263738411 250248731 238000598 226071717
14250 226071717 214934274 204343144 194088653 184597225 175497854 167478071 159714655
14243 159714655 152014700 144811275 138433072 132004944 126273424 121037571 115853600 110987612
14235 110987612 105822319 101373590 97254596 93361907 90656092 86885962 83400233 80166748
14227 80166748 77037289 74056459 71400794 69243844 66702260 64321222 62071551 60125127
14219 60125127 58164445 56239981 54414404 52637746 51054093 49538684 48214599 46706995
14211 46706995 45221700 43550043 42442790 41458865 41001642 39588806 37898294 36991870
14203 36991870 35954869 34898278 34374379 33485618 32695428 31726166 30718209 30142594 29328963
$$ packed form
14257C20380251j5185642j5011463j3059899j3384836j3489680j2248133j1928881
14250B26071717j1137443j0591130j0254491r491428r099371q019783p763416
14243A59714655p699955p203425o378203o428128n731520n235853n183971m865988
14235A10987612n165293m448729m118994l892689k705815l770130l485729l233485
14227H0166748l129459k980830k655665k156950k541584k381038k249671j946424
14219F0125127j960682j924464j825577j776658j583653j515409j324085j507604
14211D6706995j485295j671657j107253r83925m57223j412836j690512r06424
14203C6991870j037001j056591n23899q88761p90190r69262j007957n75615q13631
$$ plain form
14194 29328963 28587395 28326167 27478234 26636925 25826210 25518286 24855825 23988027 23637940
14185 23637940 23031116 22795452 21980748 21494191 20986475 20715211 20641463 20150117 19542685
14176 19542685 19423427 18650168 18522024 17835616 17384661 17376311 16781532 16686452 16182344 16365652
14166 16365652 15779389 15392201 14923776 14720725 14754415 14273784 13811339 13651078 13779622
14157 13779622 13324687 13382483 13092469 12612224 12607456 12340949 12204573 11938300 11679732 11415562
14147 11415562 11362745 11392146 10922824 10677241 10574609 10342194 10453825 10182362 10260804 9829460
14137 9829460 9618519 9464325 9285077 9370130 9382965 8825443 9213697 8820530 8603061 8396617
14127 8396617 8376162 8335321 8095395 8226014 8121366 7888699 7868484 7558561 7531924 7396954
$$ packed form
14194B9328963p41568k61228q47933q41309q10715l07924o62461q67798l50087
14185B3637940o06824k35664q14704m86557n07716k71264p3748m91346o07432
14176A9542685j19258p73259j28144o86408m50955q350n94779r5080n04108J83308
14166A6365652n86263l87188m68425k03051L3690m80631m62445j60261J28544
14157A3779622m54935N7796k90014m80245m768k66507j36376k66273k58568k64170
14147A1415562n2817K9401m69322k45583j02632k32415J11631k71463P8442m31344
14137I829460k10941j54194j79248Q5053J2835n57522L88254l93167k17469k06444
14127H396617k0455m0841k39926J30619j04648k32667k0215l09923k6637j34970
$$ plain form
14117 7396954 7497439 7137307 7071514 6886543 6970035 7110836 6477547 7046210 6901949 6655142
14107 6655142 6393167 6479559 6348154 6393086 6145819 6065658 5969517 5898889 5743510 5687819
14097 5687819 5495806 5611541 5634676 6029475 5380021 5524419 5204514 5548439 5127328 5130033
14087 5130033 5012564 5123060 5317332 5141225 4794136 5057649 4991131 4632177 4753933 4714816
14077 4714816 4533263 4499627 4684047 4335866 4394559 4310354 4039639 4419488 4269419 4161474
14067 4161474 4160020 4248188 4041608 4179837 4196212 3902955 4019231 3762954 4169378 3869084
14057 3869084 3879276 3685364 3978107 4068197 3629208 3531453 3552983 3469478 3452209 3678600
14047 3678600 3398119 3261103 3371468 3293834 3153118 3381114 3353560 3331027 3100208 3091483
$$ packed form
14117G396954J00485l60132o5793j84971Q3492J40801o33289N68663j44261k46807
14107F655142k61975Q6392j31405M4932k47267q0161r6141p0628j55379n5691
14097E687819j92013J15735K3135L94799o49454J44398l19905L43925m21111K705
14087E130033j17469J10496J94272j76107l47089K63513o6518l58954J21756l9117
14077D714816j81553l3636J84420l48181N8693q4205k70715L79849j50069j07945
14067D161474j454Q8168k06580J38229J6375k93257J16276k56277M06424l00294
14057C869084J0192j93912K92743R0090m38989r7755K1530q3505j7269K26391
14047C678600k80481j37016J10365p7634j40716K27996k7554k2533k30819q725
$$ plain form
14037 3091483 3208658 3199573 3078290 3064429 3223896 3068086 2940162 2925816 2807171 3099040
14027 3099040 3143168 2638556 2719317 2812715 2378516 2929543 2728718 2627711 2731758 2655921
14017 2655921 2234681 2783883 2565548 2386439 2253268 2424340 2459243 2682000 2490201 2284265
14007 2284265 2530294 2275626 2759938 2286344 2084387 2445354 2161933 2254379 2353765 2067295
13997 2067295 2237961 2372290 2185554 2008847 2015333 2068458 2405277 2710571 3757311 6529647
13987 6529647 14265240 36711896 45347638 22791996 11789951 7225379 5325543 4870800
13979 4870800 3813356 3788516 3081725 2943691 2823875 2428772 2474375 2626945 2543421 2516083
13969 2516083 2188175 2411259 2651209 2251461 2272275 2502874 2222659 2031308 1952424 2174241
$$ packed form
14037C091483J17175r085j21283j3861J59467j55810j27924j4346j18645K91869
14027C099040M4128n04612Q0761R3398m34199N51027k00825j01007J04047p5837
14017B655921m21240N49202k18335j79109j33171J71072L4903K22757j91799k05936
14007B284265K46029k54668M84312m73594k01957L60967k83421R2446R9386k86470
13997B067295J70666J34329j86736j76707O486N3125L36819L05294J046740K772336
13987F529647P735593K2446656Q635742k2555642j1002045m564572j899836m54743
13979D870800j057444k4840p06791j38034j19816l95103M5603J52570q3524k7338
13969B516083l27908K23084K39950l99748K0814K30599k80215j91351p8884K21817
$$ plain form
13959 2174241 1883888 2276429 1555597 1942802 2162208 1625095 2029896 1825682 2182770
13950 2182770 2105078 2202219 1876447 1809565 1810345 1919741 2166901 1601994 1800193 1466366
13940 1466366 2055851 1768243 1591161 1657964 1970898 1830351 1496266 1245375 1673816 1747016
13930 1747016 1860033 2003823 1745901 1713976 2062627 1598372 1563052 1385111 1657475 1524507
13920 1524507 1618857 1771563 1729467 1348282 1528891 1202027 1567464 1611376 1417176 1319555
13910 1319555 1440232 1390371 1358426 1446316 1529816 1501782 1348836 1394621 1311389 1167532 1403424
13899 1403424 1316467 1221822 1112546 1443484 1309863 1232996 1356513 1528691 1003841 1199341
13889 1199341 1660380 1365868 1112806 1254725 1423033 1285611 1161037 1372759 1057880
$$ packed form
13959B174241k90353L92541p20832L87205K19406n37113M04801k04214L57088
13950B182770p7692R7141l25772o6882P80J09396K47160n64907J98199l33827
13940A466366N89485k87608j77082O6803L12934j40547l34085k50891M28441P3200
13930A747016J13017J43790k57922l1925L48651m64255l5320j77941K72364j32968
13920A524507R4350J52706m2096l81185J80609l26864L65437M3912j94200r7621
13910A319555J20677m9861l1945Q7890Q3500k8034j52946M5785q3232j43857K35892
13899A403424q6957r4645j09276L30938j33621p6867J23517J72178n24850J95500
13889A199341M61039k94512k53062J41919J68308j37422j24574K11722l14879
$$ plain form
13880 1057880 1279460 1299787 1323033 1269839 1399785 1425140 1260181 1048343 1196982 1012453
13870 1012453 1180880 1032922 1376450 985817 1076314 1116184 1141284 1116061 1239027 1317132
13860 1317132 1095491 1258631 964356 965662 1053327 1023164 969891 1315684 958807 1165347
13850 1165347 1073470 685608 741356 903510 861322 792053 652932 1094884 1137363 668237
13840 668237 917793 622623 897937 1036581 746557 975184 757966 1124723 893580 939953
13830 939953 808103 820159 787228 1035817 1272814 820548 973983 1073007 1005256 1151707
13820 1151707 1293068 898798 886791 1103447 943297 1128830 591585 872892 770668 749270
13810 749270 751585 1104055 999116 804863 936203 1132292 771603 962741 991793 899287
$$ packed form
13880A057880K21580K0327K3246n3194J29946K5355j64959k11838J48639j84529
13870A012453J68427j47958L43528l90633R0497L9870K5100k5223J22966P8105
13860A317132k21641J63140k94275J306Q7665l0163n3273L45793l56877K06540
13850A165347r1877l87862N5748J62154m2188o9269j39121M41952M2479m69126
13840F68237K49556k95170K75314J38644k90024K28627k17218L66757k31143M6373
13830I39953j31850J2056l2931K48589K36997m52266J53435R9024o7751J46451
13820A151707J41361l94270j2007K16656j60150J85533n37245K81307j02224k1398
13810G49270K315L52470j04939j94253J31340J96089l60689J91138K9052r2506
$$ plain form
13800 899287 887221 935701 676844 816472 793234 649687 714786 899096 556019 616555
13790 616555 946099 1084075 964381 730475 773462 492940 870251 612616 540641 727794
13780 727794 760496 620565 628064 525429 711389 879416 1009009 801342 750125 612122
13770 612122 824035 896684 574051 818327 738017 612895 545338 1052702 755666 281003
13759 751498 777532 631554 389315 422162 578195 453922 891010 593272 731045 725203
13749 725203 606255 737567 710486 200539 659047 820963 678427 705985 396022 346611
13739 346611 609186 523991 652836 724310 524102 553199 280610 600269 574179 587787
13729 587787 556824 417733 685061 542652 726266 363375 277984 714305 450368 636939
$$ packed form
13800H99287j2066M8480k58857J39628k3238j43547O5099J84310l43077O0536
13790F16555L29544J37976j19694k33906M2987k80522L77311k57635p1975J87153
13780G27794L2702j39931P499j02635J85960J68027J29593k07667n1217j38003
13770F12122K11913P2649l22633K44276q0310j25122o7557N07364k97036B81003
13759G51498K6034j45978k42239L2847J56033j24273M37088k97738J37773n842
13749G25203j18948J31312k7081B00539M58508J61916j42536K7558l09963m9411
13739C46611K62575q5195J28845P1474k00208K9097k72589L19659k6090J3608
13729E87787l0963j39091K67328j42409J83614l62891q5391M36321k63937J86571
$$ plain form
13719 636939 642641 556266 306629 310556 545690 660494 438025 239853 385101 729774
13709 729774 474030 247050 697346 313086 905230 505252 373614 378256 466905 490341
13699 490341 416017 537370 444761 658375 673636 692771 869496 350783 472392 415362
13689 415362 -144312 852883 334170 539313 327436 354722 417424 658744 588623 781544
13679 781544 795176 436112 726646 408405 483246 523461 224616 617323 437548 437836 239726
13668 239726 368547 486069 574608 229585 423421 395937 389945 339472 341058 285943 651433
13657 651433 507983 243570 568628 270279 581459 512927 710610 216366 208316 425923
13647 425923 587787 327859 286941 472851 340596 505162 245645 292549 725268 477576
$$ packed form
13719F36939N702q6375k49637L927K35134J14804k22469j98172J45248L44673
13709G29774k55744k26980M50296C13086N92144l99978j31638M642Q8649K3436
13699D90341p4324J21353r2609K13614J5261J9135J76725C50783J21609n7030
13689D15362a44312H52883C34170K05143k11877K7286O2702K41320p0121J92921
13679G81544J3632l59064K90534l18241P4841M0215B24616L92707j79775K88j98110
13668B39726J28821J17522Q8539B29585J93836k7484n992n0473J586n5115L65490
13657F51433j43450B43570L25058B70279L11180o8532J97683B16366q050K17607
13647D25923J61864k59928m0918J85910j32255J64566B45645M6904M32719k47692
$$ plain form
13637 477576 520754 653064 360432 201760 328223 733621 594393 97229 526150 484230
13627 484230 379337 261359 665853 548080 359320 429776 444414 549500 281126 405811
13617 405811 336091 540731 443421 376954 87398 411638 82420 693732 32211 727357 68752
13605 470601 473059 273555 596021 709486 142105 431953 258876 271694 507306 98045
13594 475422 619439 108115 336820 272230 116366 287712 424854 185980 271133 -28928
13583 185617 344121 535922 406260 -20817 222055 246443 422874 313643 196429 486459
13573 486459 413908 565984 185013 212851 397948 156668 330216 272842 281003 307522 230020
13562 230020 311134 491258 477387 409223 137698 420972 412613 491728 582841 349323 518426
$$ packed form
13637D77576M3178J32310k92632j58672J26463M05398j39228I7229M28921m1920
13627D84230j04893j17978M04494j17773j88760P0456J4638J05086k68374J24685
13617D05811o9720K04640r7310o6467H7398L24240H2420O11312C2211O95146F8752
13605D70601K458j99504L22466J13465A42105K89848j73077J2818K35612I8045
13594D75422J44017A08115K28705o4590A16366J71346J37142A85980Q5153b8928
13583A85617J58504J91801j29662b0817B22055K4388J76431j09231j17214K90030
13573D86459p2551J52076A85013K7838J85097A56668J73548n7374Q161K6519p7502
13562B30020Q1114J80124j3871o8164A37698K83274q359P9115R1113k33518J69103
$$ plain form
13551 518426 357170 488127 279090 597976 359191 397238 391092 190332 411278 590987
13541 590987 323964 324369 391913 231204 8130 409492 401484 370001 184531 94934 407698
13530 407698 305569 227243 226494 169895 139215 497101 474452 -188930 348554 259761 380520
13519 380520 214109 308627 207316 398694 140583 157222 284036 404970 214452 105068
13508 231652 151190 340371 300691 313229 301278 230896 191155 441010 262485 21809 267094
13497 267094 208925 525176 278282 603481 172610 66764 102844 340692 418533 386535
13487 386535 255740 314209 51472 313196 97939 134766 277192 253550 506347 125844
13476 411386 417983 95512 141588 325349 101155 440777 71315 529119 400251 426272 228207
$$ packed form
13551E18426j61256J30957k09037L18886k38785L8047o146A90332K20946J79709
13541E90987k67023M05O7544j60709H130M01362q008l1483A84531q9597L12764
13530D07698j02129p8326p49n6599l0680L57886k2649a88930C48554q8793J20759
13519C80520j66411R4518j01311J91378A40583J6639J26814J20934j90518A05068
13508B31652q0462J89181l9680J2538j1951p0382l9741K49855j78525B1809K45285
13497B67094n8169L16251k46894L25199A72610F6764L6080K37848P7841l1998
13487C86535j30795N8469E1472K61724I7939L6827J42426k3642K52797A25844
13476D11386O597I5512M6076J83761A01155L39622G1315M57804j28868K6021j98065
$$ plain form
13465 228207 197856 232901 363882 76668 443678 -1634 178569 343928 398814 222456 239940
13454 239940 278817 203086 348389 304398 144702 152910 222697 63159 -15439 390579 244713
13443 244713 21174 245880 615327 271582 -109394 246943 351601 316612 633068 254162
13432 410834 78464 163807 318955 262297 163415 -48406 307827 136358 71333 445383 -158916
13420 -60613 309259 -370699 239853 249728 104960 509369 324317 213542 394300 37282
13409 520100 76606 316665 561386 -41845 211348 211583 -153064 203826 290408 264040 263713
13398 263713 494875 -83736 201453 139236 290989 193692 386015 306377 277538 -244659
13387 126863 -133461 291141 495795 465581 210083 15505 26666 8327 182206 398622
$$ packed form
13465B28207l0351L5045J30981G6668L67010a634A78569J65359N4886j76358J7484
13454B39940L8877p5731J45303m3991A44702Q208O9787F3159a5439C90579j45866
13443B44713B1174K24706L69447B71582a09394B46943J04658l4989L16456B54162
13432D10834G8464Q5343J55148n6658r8882d8406C07827A36358o5025L74050a58916
13420f0613C09259c70699B39853R875A04960M04409j85052j10775J80758C7282
13409E20100G6606K40059K44721d1845B11348K35a53064B03826Q6582k6368l27
13398B63713K31162h3736B01453o2217J51753r7297J92323p9638k8839b44659
13387A26863a33461B91141K04654l0214B10083A5505J1161H327J73879K16416
$$ plain form
13377 398622 424175 374983 286244 132800 144245 209221 214028 75534 50482 229595 -124546
13365 147693 126958 50770 298137 166493 264372 262041 392691 260314 147277 89217 185528
13354 185528 -189600 625565 44026 82040 -44512 -112494 477019 353912 276009 408792
13344 408792 283856 151335 338613 462313 216470 474645 413395 349133 520780 236591
13333 337992 82609 327020 196488 37348 353880 197942 109802 137532 30185 -67245 39120
13321 223117 240840 -9312 -55570 264622 375374 35601 -51858 464045 158341 -44396 270563
13309 -123451 -9030 -136394 179304 86782 113353 427313 171294 326583 201582 21129
13298 -172016 -3985 224643 276712 170043 -26028 326352 129040 487849 -63352 114063
$$ packed form
13377C98622K5553m9192q8739A32800J1445O4976M807G5534k5052J79113a24546
13365A47693k0735E0770K47367j31644R7879k331J30650j32377j13037n8060R6311
13354A85528a89600F25565D4026L8014d4512o7982D77019j23107p7903J32783
13344D08792j24936j32521J87278J23700B16470K58175o1250o4262J71647B36591
13333C37992H2609K44411j30532C7348L16532j55938q8140K7730C0185f7245C9120
13321B23117J7723i312m6258B64622J10752C5601e1858D64045A58341d4396B70563
13309a23451i030j27364A79304H6782K6571L13960A71294J55289j25001B1129
13298a72016c985B24643N2069j06669b6028C26352A29040L58809f3352A14063
$$ plain form
13287 114259 -130382 -38343 -139058 -44215 132382 -167842 42416 -218303 119987 -226118
13276 396759 326884 35017 36040 -257222 -10707 39799 198715 -41283 -15625 -59053 203949
13264 11498 -129693 -49804 375357 300747 48353 -27028 25411 304565 108679 221106 88013
13252 158427 319159 7189 219099 192386 252305 153672 -72834 216895 109166 128712 146545
13241 146545 363852 -74264 301970 338519 -173152 214312 429788 277008 50293 170664
13231 170664 80335 189874 132951 322892 -120356 89356 167185 289533 237043 -159052
13220 281227 -7952 -26751 235839 -140354 29024 -69157 81963 252808 -47350 -182551 -135901
13209 -135901 139832 -257714 133239 30989 -63788 172469 449412 165080 -48338 170192
$$ packed form
13287A14259a30382c8343j00715d4215A32382a67842D2416b18303A19987b26118
13276C96759o9875C5017J023b57222a0707C9799J58916d1283a5625m3428B03949
13264A1498a29693d9804C75357p4610D8353b7028B5411K79154A08679J12427H8013
13252A58427J60732G189K11910k6713N9919r8633g2834B16895j07729J9546J7833
13241A46545K17307g4264C01970L6549a73152B14312K15476j52780E0293J20371
13231A70664H0335J09539n6923J89941a20356H9356P7829J22348n2490a59052
13220B81227g952j8799B35839a40354B9024f9157H1963J70845d7350j35201M6650
13209a35901A39832b57714A33239C0989f3788A72469K76943A65080d8338A70192
$$ plain form
13198 -11583 65287 16015 300290 25550 -166787 -17535 -214911 147143 125507 270994 211266
13187 211266 80264 391849 -129076 112778 126010 43235 260137 235393 132196 54798
13176 426816 10555 124486 168110 -72979 133479 -182558 203765 231557 43002 169892
13166 169892 194119 221724 227457 138588 398526 112898 78563 133328 185126 63587 204170
13155 204170 288580 -77397 36895 260631 215433 -23365 111456 57445 190977 -86874 -21846
13143 45041 178654 131084 18253 21049 182510 127247 -2395 157481 208079 -57106 286348
13131 5946 203309 245109 -219448 -7547 -2874 387308 -10071 65701 183883 -219483 85825
13119 370647 -58960 141782 130685 307225 175601 -554 382382 339321 328505 -282866 110530
$$ packed form
13198a1583F5287A6015K84275B5550a66787a7535j97376A47143k1636J45487n9728
13187B11266H0264L11585a29076A12778J3232D3235K16902k4744j03197E4798
13176D26816A0555J13931M3624g2979A33479a82558B03765K7792D3002J26890
13166A69892K4227K7605N733q8869K59938A12898l4335N4765N1798F3587J40583
13155B04170Q4410g7397C6895K23736m5198b3365A11456n4011J33532h6874b1846
13143D5041J33613m7570A8253K796J61461n5263b395A57481N0598e7106B86348
13131E946J97363M1800b19448g547b874C87308a0071F5701J18182b19483H5825
13119C70647e8960A41782j1097J76540j31624e54C82382m3061j0816b82866A10530
$$ plain form
13107 -126025 8166 124065 -32617 42596 147343 -114901 60243 -132236 47636 194190 464862
13096 464862 -111902 113334 59232 196606 26647 210779 35102 -38284 -15418 115278
13085 273697 321072 111937 176683 -181518 -47204 53520 8018 19911 80043 10671 -251071
13073 -122777 -160719 354733 97045 -42376 -56387 224485 25241 185737 -111772 145390
13062 -260444 37154 53832 301497 -23099 -167228 337473 301672 112548 56580 156374 245965
13051 245965 -187824 108790 225981 141951 297014 64823 438083 75339 147836 294460
13041 294460 -142650 167609 266077 74753 31668 215171 240695 456133 210876 -156875
13030 325380 115993 -31907 224607 187475 186116 262428 11965 241488 -45439 334800 -111472
$$ packed form
13107a26025H166J15899c2617D2596J04747a14901F0243a32236D7636J46554K70672
13096D64862a11902A13334n4102J37374B6647J84132C5102c8284a5418A15278
13085B73697M7375A11937O4746a81518d7204E3520H018J1893O0132A0671b51071
13073a22777l7942C54733I7045d2376j4011B24485B5241J60496a11772A45390
13062b60444C7154J6678K47665b3099j44129C37473l5801A12548n5968R9794Q9591
13051B45965a87824A08790J17191q4030J55063F4823L73260G5339P2497J46624
13041B94460a42650A67609R8468G4753C1668J83503K5524K15438B10876a56875
13030C25380A15993c1907B24607l7132j359P6312A1965K29523d5439C34800a11472
$$ plain form
13018 108660 127049 268854 -179805 349091 114154 102659 340415 -50143 -71937 -180179
13008 -180179 161617 254533 266954 174945 -69679 6106 316948 -193410 241967 160776 53450
12996 79172 232722 102220 -1579 254334 -89596 -24264 126839 -160561 124015 -129551
12985 -130634 -45297 5068 269921 -181708 -39164 147109 257796 -33032 16486 -27498 142430
12973 140440 312729 162798 115258 45577 192887 56128 102155 -107597 -81184 2687 -258706
12961 -11138 28138 -116841 -52134 -157190 150107 418751 131096 455014 -209666 4679
12950 20511 178173 -135837 -133513 74552 -147570 265671 -280740 76941 3781 -18961 112805
12938 433341 -100506 -113282 44781 250128 131104 -92840 -104294 -18969 -81116 1082 -23863
$$ packed form
13018A08660J8389J41805a79805C49091A14154j1495K37756e0143k1794j08242
13008a80179A61617R2916J2421r2009f9679F106L10842a93410B41967q1191E3450
12996G9172J53550A02220a579B54334h9596b4264A26839a60561A24015a29551
12985a30634d5297E068K64853a81708c9164A47109J10687c3032A6486b7498A42430
12973A40440J72289j49931m7540D5577J47310E6128M6027a07597K6413B687b58706
12961a1138B8138a16841e2134j05056A50107K68644A31096L23918b09666D679
12950B0511J57662a35837K324G4552a47570B65671b80740G6941C781a8961A12805
12938D33341a00506j2776D4781K05347j19024i2840j1454a8969o2147A082b3863
$$ plain form
12926 -321696 127992 -400323 233769 166687 280481 -106449 4767 14208 31545 137236 66494
12914 313549 116006 -209880 -181289 -4418 -19168 26629 -46735 309637 -109470 -108746 -268835
12903 -268835 1624 171879 -79319 -27645 -99647 67653 13309 86259 208820 269950 244518
12892 244518 -61783 -84453 28817 11871 -73192 8092 -8816 -233919 48204 199537 202987 -156220
12879 -127617 388786 -217299 120970 -341194 81779 -77364 70829 297192 -80617 35070
12868 323882 -59876 -107405 82801 111485 -380723 58340 -20973 58984 -32992 117779 110106
12857 110106 -144188 318283 -20606 -105470 354582 340622 -27188 169369 70573 113149 -131403
12845 207568 75250 138405 121457 122210 23650 37559 -37882 37631 272360 200649 -376619
$$ packed form
12926c21696A27992d00323B33769o7082J13794a06449D767R441J7337J05691F6494
12914C13549A16006b09880K8591d418j4750B6629d6735C09637a09470P24j60089
12903b68835A624J70255g9319b7645p2002F7653A3309P2950J22561O1130k5432
12892B44518f1783k2670B8817A1871g3192H092h816k25103D8204J51333L450a56220
12879a27617C88786b17299A20970c41194H1779g7364G0829K26363h0617C5070
12868C23882e9876m7529H2801K8684c80723E8340b0973E8984c2992A17779p673
12857A10106a44188C18283b0606q4864C54582j3960b7188A69369G0573M2576a31403
12845B07568G5250O3155j6948P53B3650J3909c7882C7631K34729p1711c76619
$$ plain form
12833 191743 203244 41632 47944 -212150 -220366 -7518 -102893 118867 59733 9747 -96919 -54920
12821 -54920 108498 -57075 65988 294347 253381 -231463 38251 282318 113598 178137 -96326
12809 260489 102804 94682 77172 -172426 107830 -52846 -273466 142977 287599 -156387
12798 -298357 -156022 -67470 372356 -61794 28471 65001 19498 -238265 -40927 248678 65881
12786 195914 105665 -232400 -27433 -58231 85635 -200606 352875 120337 -65459 76838 -4249
12774 66648 -339601 -40933 35313 -92255 -158823 -50971 387985 -50342 -24464 -150556 -224591
12763 -224591 51963 -204410 297819 137761 -42630 20259 -84416 56744 -126957 253451
12752 14076 -140953 188234 -200696 -128560 158776 41002 -195557 -165336 -19101 289459
$$ packed form
12833A91743J1501D1632O312b12150q216g518r5375A18867n9134I747i6919M1999
12821e4920A08498e7075F5988K28359m0966b31463C8251K44067A13598O4539i6326
12809B60489A02804q122j7510a72426A07830e2846k20620A42977J44622a56387
12798b98357J42335f7470C72356f1794B8471L6530A9498b38265d0927B48678F5881
12786A95914r0249b32400b7433l0798H5635b00606C52875A20337f5459G6838d249
12774F6648c39601d0933C5313i2255o6568e0971C87985e0342b4464j26092p4035
12763b24591E1963b04410B97819A37761d2630B0259h4416E6744a26957B53451
12752A4076a40953A88234b00696P2136A58776D1002a95557L0221a9101B89459
$$ plain form
12741 -5145 192286 412167 404809 59334 409312 326296 12614 -222220 221345 205054 -51457
12729 302079 35752 31676 96655 80470 78275 -398228 196306 27940 -65107 115073 -170076
12717 108342 -281551 -52807 172711 -87375 -218884 395121 224977 47778 471517 17406
12706 59878 382728 246129 235538 395706 132293 204716 137246 -69480 -162944 83243 -82016
12694 256944 116394 92096 -40384 210647 -5843 -25901 -151986 -152393 -260966 -296870 215841
12682 46262 522692 -264008 258877 367329 190688 198890 -35967 143303 327739 -41612
12671 386239 -114284 38648 65939 208160 371108 42296 390303 412480 374210 305946 234266
12660 234266 -114151 117614 153394 121059 359468 156708 249198 161266 215096 58423 388999
$$ packed form
12741e145A92286K19881p358E9334L49978q3016A2614b22220B21345j6291e1457
12729C02079C5752m076O4979j6185k195c98228A96306B7940f5107A15073a70076
12717A08342b81551e2807A72711h7375j31509C95121j70144D7778M23739A7406
12706E9878L22850j36599j0591J60168A32293P2423o7470f9480r3464H3243h2016
12694B56944A16394k4298d0384B10647e843k0058j26085m07j08573l5904B15841
12682D6262M76430b64008B58877J08452j76641Q202c5967A43303J84436d1612
12671C86239a14284C8648K7291J42221J62948D2296L48007K2177l8270o8264p1680
12660B34266a14151A17614L5780l2335K38409A56708R2490q7932N3830E8423L30576
$$ plain form
12649 388999 -131287 32499 332804 126752 -154845 368266 114524 53062 -90110 -55974
12639 -55974 394515 208544 138751 322407 203028 159285 -152979 138756 82150 505914
12629 505914 -55345 258115 52360 -107911 124751 -34342 187783 27673 366188 -27684
12618 79131 12317 -33568 375551 -69677 -119905 -104553 37155 -267183 -109482 -196820 -145907
12607 -145907 138506 123817 94886 28552 167835 -68302 216351 -40249 258289 -199631
12596 75284 8753 108107 -265076 265875 75871 232110 -155104 175925 -54069 103015 92487
12585 92487 -285840 -68568 71626 -107634 -118460 49064 -230173 251135 -146789 107629
12574 -253992 216543 -13411 177008 124936 -43011 278313 -82079 -61845 89542 42945 79344
$$ packed form
12649C88999a31287C2499L00305A26752a54845C68266A14524E3062i0110L4136
12639e5974C94515j85971o9793J83656j19379m3743a52979A38756n6606M23764
12629E05914e5345B58115E2360a07911A24751c4342A87783B7673L38515b7684
12618G9131A2317c3568C75551f9677n0228J5352C7155b67183a09482q7338N0913
12607a45907A38506j4689k8931B8552J39283f8302B16351d0249B58289a99631
12596G5284H753R9354b65076B65875G5871J56239a55104A75925e4069A03015j0528
12585I2487b85840f8568G1626a07634j0826D9064b30173B51135a46789A07629
12574b53992B16543a3411A77008n2072d3011B78313h2079K0234H9542D2945L6399
$$ plain form
12563 79344 -22131 52255 -38020 -40490 70143 314671 260340 -152525 -15150 43372 -78062
12551 133328 -13372 12363 -231295 218444 -5286 188705 -34108 -137618 54687 -224947 247027
12539 19397 -72333 415584 37607 136992 247028 50362 -237107 95853 77667 -208864 -42363
12527 122099 390686 13260 -70192 -24047 152366 66417 -194138 -260439 269858 -121183
12516 98401 -13478 245094 107467 12389 198531 -203056 233315 49184 -115523 -1842 250329
12504 -226592 -188205 86425 -266775 121402 156732 -65691 -117730 4846 532684 -86852 -140554
12493 -140554 -43854 162227 -117415 178394 165284 226401 32128 -47012 -149069 -220689 112419
12481 99029 -15015 -23368 -169260 -96279 128470 189847 -88089 -60598 153518 -87106 -126526
$$ packed form
12563G9344b2131E2255c8020k470G0143K44528n4331a52525a5150D3372g8062
12551A33328a3372A2363b31295B18444e286A88705c4108j03510E4687b24947B47027
12539A9397g2333D15584C7607R9385J10036E0362b37107I5853j8186b08864d2363
12527A22099K68587A3260g0192b4047A52366F6417a94138o6301B69858a21183
12516I8401a3478B45094A07467A2389J86142b03056B33315D9184a15523a842B50329
12504b26592L8387H6425b66775A21402L5330f5691n2039D846N27838h6852n3702
12493a40554d3854A62227a17415A78394j3110O1117C2128d7012j02057p1620A12419
12481I9029a5015q353j45892P2981A28470O1377h8089K7491A53518h7106l9420
$$ plain form
12470 -126526 336053 -116431 -121363 -357638 32562 -124602 -190365 -121957 113969 85747 -122631
12458 -265997 326624 54703 -134752 -248799 146626 -244807 23270 248732 -157266 -122837
12448 -122837 140367 -66282 -304757 -154328 60096 -199300 169522 141550 257070 55738
12437 -299442 241054 -170001 -203981 -123450 18491 -237148 130883 -213767 21647 44487
12427 44487 -29530 -256643 -121344 6155 -173000 223226 -77907 121617 186293 -231855 78453
12415 -48099 77106 29036 307652 9854 -136564 92689 -147746 215928 62611 -260409 138108
12403 -108637 -307124 79829 -222178 55434 -198473 46175 69210 82495 7795 8222 -288786
12391 171843 198401 176906 125294 233229 139716 -340315 36329 20130 -91671 61836 80971
$$ packed form
12470a26526C36053a16431m932k36275C2562a24602o5763O8408A13969k8222a22631
12458b65997C26624E4703a34752j14047A46626b44807B3270K25462a57266L4429
12448a22837A40367f6282k38475J50429F0096a99300A69522k7972J15520E5738
12437b99442B41054a70001l3980Q0531A8491b37148A30883b13767B1647K2840
12427D4487b9530k27113a21344F155a73000B23226g7907A21617O4676b31855G8453
12415d8099G7106B9036K78616I854a36564I2689a47746B15928F2611b60409A38108
12403a08637j98487G9829b22178E5434a98473D6175K3035J3285G795M27b88786
12391A71843K6558k1495n1612J07935r3513c40315C6329j6199i1671F1836J9135
$$ plain form
12380 80971 -27653 135812 262860 -95353 -133486 -44091 -161439 191909 372227 148852
12369 240610 -119260 19963 -90400 -258516 -98045 -6200 279089 -43661 -51209 89120 62859
12358 62859 112985 35928 291301 141962 -88381 373649 104068 379097 -198103 104101
12347 -12503 -143254 148132 324159 431852 42962 372348 -198388 -95741 -258529 218880
12336 -250582 209872 -20550 205421 355792 -28363 -151477 -81317 258026 -26472 32001
12325 -47578 -87549 -126750 35525 44106 265979 -200062 -23986 149948 -125251 -367242 63442
12313 95606 286306 -466031 54096 -206062 -109990 -66131 88629 -34675 -81383 152796 -178764
12301 -233336 335519 -143721 -140309 -60496 74618 72668 34902 -205646 -24563 -22035 -18939 -15917
$$ packed form
12380H0971b7653A35812J27048i5353l8133d4091j17348A91909J80318A48852
12369B40610a19260A9963i0400j68116i8045f200B79089d3661p548H9120k6261
12358F2859N0126C5928K55373A41962h8381C73649A04068K75029a98103A04101
12347a2503j30751A48132J76027J07693D2962L29386a98388i5741j62788B18880
12336b50582B09872b0550B05421J50371b8363j23114P0160B58026b6472C2001
12325d7578l9971l9201C5525Q581K21873b00062b3986A49948a25251k41991F3442
12313I5606J90700d66031E4096b06062R6072M3859H8629c4675m6708A52796a78764
12301b33336C35519a43721L412f0496G4618j950C4902b05646b4563K528L096L022
$$ plain form
12289 -15917 -57869 -182017 -278738 56887 52662 37105 71138 37770 137631 -69658 147109
12277 301082 146934 41115 -99230 36720 98140 207051 -321022 103770 243875 148115
12267 148115 -167293 59560 257399 194861 -199811 -66681 93029 122481 -26253 -208159 11343
12255 -67099 13844 59050 152518 -248084 175423 412803 166232 -85878 116172 -4251 204048
12243 -58947 63064 -144633 1993 -106551 -96882 208327 508697 195449 38362 64022 -105457
12231 220254 206799 211352 -16615 18086 363853 -77954 156312 274754 197800 204698 80088
12219 -40929 406182 257084 308034 12490 350261 149328 371102 153045 362556 98088
12208 97691 161656 160551 -63800 130959 57239 103331 178240 101285 119866 28000 119495 446963
$$ packed form
12289a5917m1952j24148r6721E6887m225j5557L4033l3368R9861f9658A47109
12277C01082A46934D1115i9230C6720O1420J08911c21022A03770J40105r5760
12267A48115a67293E9560J97839o2538a99811f6681I3029K9452b6253j81906A1343
12255f7099A3844M5206R3468b48084A75423K37380A66232h5878A16172d251B04048
12243e8947F3064a44633A993a06551R669B08327L00370A95449C8362K5660a05457
12231B20254j3455M553a6615A8086L45767g7954A56312J18442p6954O898H0088
12219d0929D06182j49098N0950A2490L37771A49328K21774A53045K09511I8088
12208I7691O3965j105f3800A30959E7239M6092P4909p6955J8581B8000R1495L27468
$$ plain form
12196 446963 172955 770 189770 275886 148955 -173270 -51361 -222512 103895 36691 238888
12185 238888 51294 -170772 210814 280052 187784 198278 393761 93416 16978 -252674 362071
12173 85514 167069 -106541 -131080 -127348 313761 -143544 70089 27976 86440 234643 207250
12162 207250 384065 -397484 116230 244040 37820 -98920 284669 131100 74277 -110112
12151 153155 -411697 -30404 215105 16878 60209 272209 392639 173668 -51067 61846
12140 107792 -233224 455040 14232 -144030 76742 38914 -38246 162666 53960 306422
12130 306422 -75383 -73712 102728 -79378 -74580 215150 -45720 -124691 -74485 -58126 47268
12118 53366 -71711 23563 10946 -212750 -197741 -45503 -62540 -119026 -40663 -382228 12078
$$ packed form
12196D46963A72955G70J89000Q6116j26931a73270e1361j71151A03895C6691K02197
12185B38888E1294a70772B10814O9238r2268J0494J95483I3416A6978b52674C62071
12173H5514Q1555a06541k4539L732C13761a43544G0089B7976N8464J48203k7393
12162B07250J76815c97484A16230J27810C7820i8920B84669A31100n6823a10112
12151A53155d11697c0404B15105A6878M3331K12000J20430A73668e1067F1846
12140A07792b33224D55040A4232a44030G6742l7828c8246A62666E3960K52462
12130C06422g5383J671A02728g9378M798B15150d5720p8971N0206J6359D7268
12118E3366g1711B3563A0946b12750J5009d5503j7037n6486d0663l41565A2078
$$ plain form
12106 120533 -103935 -202134 -52337 -29543 -77214 306077 180204 -35529 209746 -138343
12095 -286362 -9653 386367 -92010 38911 199477 118722 -116537 -140755 -378634 -170205 129687
12083 -3037 -103580 -288306 52142 262887 -164807 407 -297354 -182217 674423 714427 2306474
12072 2306474 1078789 132896 101388 -184780 190857 162149 94255 -249689 179661 19696
12061 -443539 133287 -374495 -190164 -53142 88383 -82970 -169361 -6669 -178418 351388 274036
12050 274036 -94880 -303465 148328 -75096 -107229 196299 243803 -138765 255774 149307
12040 149307 170527 164730 -150395 -55796 73968 -184569 30192 -163648 -47576 -6811 203033
12028 -80092 216207 149929 -117502 -55924 -851 155542 81328 284019 -101441 2709 -5104
$$ packed form
12106A20533a03935r8199e2337K2794m7671C06077j25873c5529B09746a38343
12095b86362i653C86367i2010C8911J60566q0755a16537k4218k37879a70205A29687
12083c037j00543j84726E2142K10745a64807D07b97354J15137F74423M0004J592047
12072B306474A078789A32896l1508a84780A90857k8708o7894b49689A79661A9696
12061d43539A33287c74495J84331e3142H8383h2970q6391f669j71749C51388p7352
12050B74036i4880k08585A48328g5096l2133A96299M7504a38765B55774j06467
12040A49307K1220n797a50395e5796G3968a84569C0192a63648d7576f811B03033
12028h0092B16207o6278a17502e5924h51A55542p4214K02691a01441B709e104
$$ plain form
12016 82478 301951 -56641 68565 -18371 189465 -201233 -163772 -107196 -483802 13399 -76384
12004 75267 329127 -19795 -165587 44234 236510 -209670 -56265 -1573 504314 -137905 -163294
11993 -163294 -168443 -94029 -3437 3286 -108535 89386 -382515 -64106 295233 -358258 -206769
11982 -206769 -165862 6225 242670 23345 -15916 237622 -232755 33868 -2060 81468 12075
11970 42880 132476 -327203 103570 57378 -196240 -141604 -274165 -28349 9500 144700 98386
11959 98386 53381 96004 147863 -229300 -87047 -37575 -20065 189333 268648 -161400 143715
11947 417 -11065 -221251 -208047 72362 -221828 -194421 97424 71177 208061 -59690 98876
11935 -75094 -373116 -121890 3010 248266 -181665 177534 -250283 -247783 -130546 -84962 16002
$$ packed form
12016H2478K19473e6641F8565a8371A89465b01233L7461N6576l76606A3399g6384
12004G5267K53860a9795j45792D4234J92276b09670e6265a573E04314a37905k5389
11993a63294n149P4414c437C286a08535H9386c82515f4106B95233c58258J51489
11982b06769M0907F225K36445B3345a5916B37622b32755C3868b060H1468A2075
11970D2880Q9596c27203A03570m6192a96240N4636j32561b8349I500J35200m6314
11959I8386m5005M2623N1859b29300h7047c7575J7510A89333P9315a61400A43715
11947D17a1065k10186J3204G2362b21828K7407I7424k6247J36884e9690I8876
11935g5094k98022a21890C010K45256a81665A77534b50283K500J17237M5584A6002
$$ plain form
11923 -198757 155954 66529 -117459 289870 -98178 428863 -226933 69530 23407 18081 -118560
11911 450575 197661 29693 224682 -104938 233691 213731 -269933 -311916 -76141 -125164
11901 -125164 -184167 -66 272606 87293 -221325 -234503 -64021 -27220 -119403 -271497 87478
11889 -136897 -300152 202246 -19324 -20283 -116177 159065 -188940 -41252 -21279 -23052 -78656
11878 -78656 75978 27412 -167819 -62506 506539 137722 275240 46884 -4931 105962 34109
11866 160138 1492 -7549 -339248 -385730 -270094 61782 9937 -54505 20937 99046 80640 -314737
11853 109469 283664 -136100 -58515 279 -190241 -249198 -67202 -44157 -73531 -86505 186473
11841 -146536 -56386 -44374 -447534 -271174 -123495 114917 61071 -192806 21208 -242848
$$ packed form
11923a98757A55954F6529a17459B89870i8178D28863b26933F9530B3407n326a18560
11911D50575A97661B9693J94989a04938B33691j9960b69933m1983g6141m9023
11901a25164n9003f6B72606H7293b21325j3178f4021b7220r2183j52094H7478
11889a36897j63255B02246a9324r59r5894A59065a88940d1252J9973j773n5604
11878g8656G5978B7412a67819f2506E06539A37722J37518D6884d931A05962C4109
11866A60138A492g549l31699m6482J15636F1782I937e4505B0937P8109j8406c14737
11853A09469J74195a36100e8515B79a90241n8957f7202K3045k9374j2974A86473
11841a46536e6386J2012m03160J76360a23495A14917n3846a92806B1208b42848
$$ plain form
11830 -227678 -157570 -29233 -163530 169684 118617 -19003 26690 186063 256459 -195257 -145791
11819 -145791 -250742 -14095 60877 -94311 -16954 -197054 526576 -125635 101141 -27793
11808 -56782 194472 -352838 -107042 -109902 139747 32561 -239461 -429100 119129 -52813
11797 -6730 95605 47014 140296 -246896 132608 -112429 -121220 81914 84548 -51168 -73550 -20696
11784 -21013 243126 16707 61561 292825 89162 32860 306761 -319752 54406 110999 -126133
11772 -120867 34378 -145772 -301510 -111015 23795 -217043 287618 294581 -126384 -75294
11762 -75294 191139 -79849 -49132 75388 -145143 -128281 -141638 -77667 209705 53032 -2010
11750 18102 134296 -190498 -44000 -84330 67143 181694 -244516 -130593 -163273 214557
$$ packed form
11830b27678P0108b9233j34297A69684n1067a9003B6690J59373P0396a95257M9466
11819a45791j04951a4095F0877i4311a6954j80100E26576a25635A01141b7793
11808e6782A94472c52838a07042k860A39747C2561b39461j89639A19129e2813
11797f730I5605D7014R3282b46896A32608a12429q791H1914K634e1168k2382b0696
11784b1013B43126A6707M4854K31264H9162C2860K73901c19752E4406N6593a26133
11772a20867C4378a45772j55738a11015B3795b17043B87618O963a26384N1090
11762g5294A91139g9849L0717G5388a45143J6862j3357O3971B09705E3032b010
11750A8102J16194a90498d4000m0330F7143J14551b44516J13923l2680B14557
$$ plain form
11739 15254 47697 106919 -88993 271912 -328017 -454901 -49969 -25646 -205537 -194812 -13264
11727 -127854 20170 -231992 -167923 102680 85737 246840 230170 168843 184103 284364 -134653
11715 -8825 3210 -86992 170811 25418 45567 97730 175830 92432 -32022 23914 23048 -36355
11702 -58694 41973 277089 -78993 -98332 287636 219813 170641 59303 63131 -178047 323177
11690 -89993 54438 -148050 17128 21979 187066 -95370 221848 107998 -20012 315738 -70240
11678 -31373 -62714 -128351 245793 62867 -228538 3789 122524 -115720 64275 50651 233566
11667 233566 140864 -150650 -371661 278979 -524852 57554 117513 121169 106428 92063 285547
11656 285547 52198 -170864 464322 -206386 76268 68359 -14460 -161975 18878 -212699 186788
$$ packed form
11739A5254L2443N9222h8993B71912c28017j26884d9969K4323j79891J0725a3264
11727a27854B0170b31992O4069A02680j6943J61103j6670o1327J5260J00261a34653
11715h825C210h6992A70811B5418K0149N2163P8100q3398c2022B3914q66c6355
11702e8694D1973K35116g8993j9339B87636o7823m9172E9303L828a78047C23177
11690h9993E4438a48050A7128M851J65087i5370B21848A07998b0012C15738g0240
11678c1373l1341o5637B45793F2867b28538C789J18735a15720F4275j3624J82915
11667B33566r2702a50650k21011B78979e24852E7554N9959L656j4741j4365J93484
11656B85547E2198a70864D64322b06386G6268p909a4460j47515A8878b12699A86788
$$ plain form
11644 189133 -125475 -186726 18345 -190948 180777 51089 -135514 88731 47550 -49905 -12280
11632 -14989 -299551 135917 201300 185532 32723 -5759 -149427 -65892 178983 23520 -25075
11620 -286556 -377249 -79598 238188 -8609 -138895 334413 208582 43748 -300676 130201
11609 98218 12599 -44423 283242 138733 -125417 33365 -16146 152049 197135 -47231 202190
11597 148685 -20806 269564 131197 -69940 -8823 64817 -122344 -110062 -86594 197239 244646
11586 244646 148510 -180895 45576 -144464 119109 61097 -14873 108420 198351 154397 -148590
11574 551389 364959 52438 -32747 -142337 55958 135962 95442 -141914 250155 573982
11564 573982 265982 -111777 165332 120835 260779 -190285 438841 202689 336788 215840
$$ packed form
11644A89133a25475o1251A8345a90948A80777E1089a35514H8731m1181d9905a2280
11632a4989k84562A35917O5383j5768C2723e759j43668f5892A78983B3520b5075
11620b86556r0693g9598B38188h609j30286C34413j25831D3748c00676A30201
11609I8218A2599d4423B83242A38733a25417C3365a6146A52049M5086d7231B02190
11597A48685b0806B69564A31197f9940h823F4817a22344J2282K3468A97239M7407
11586B44646r6136a80895D5576a44464A19109n8012a4873A08420Q9931m3954a48590
11574E51389j86430E2438c2747j09590E5958Q0004m0520a41914B50155L23827
11564E73982B65982a11777A65332m4497J39944a90285D38841B02689J34099j20948
$$ plain form
11554 215840 -87226 91706 149700 230981 -140571 97644 297317 236640 -490 193314 32222
11542 206763 -120098 -117889 180442 32764 191911 302116 240724 145759 -166699 153472
11531 -96467 90045 -2871 33140 374915 -75248 -6651 410736 364430 175692 -47602 63395
11519 85201 433301 516583 275569 115573 9405 114125 246043 97443 160036 -85121 271953
11507 490841 -62488 476316 216296 425191 199275 182185 204855 281356 115969 36132
11496 162161 -65063 381674 284925 227611 433308 39602 161709 208615 99796 275710 13911
11484 -48720 -102775 97944 263146 402457 460839 -148746 43691 5899 156512 174650 339820
11473 339820 134416 60139 372318 294961 178201 330667 58496 227911 50705 -47479
$$ packed form
11554B15840h7226I1706N7994Q1281a40571I7644J99673o0677d90A93314C2222
11542B06763a20098K209A80442C2764J59147J10205o1392r4965a66699A53472
11531i6467I0045b871C3140L41775g5248f651D10736m6306A75692d7602F3395
11519H5201L48100Q3282k41014A15573I405J04720J31918I7443O2593h5121B71953
11507D90841f2488D76316B16296K08895A99275j7090K2670P6501A15969C6132
11496A62161f5063C81674r6749n7314K05697C9602J22107M6906I9796J75914A3911
11484d8720n4055I7944J65202J39311N8382a48746D3691E899J50613J8138J65170
11473C39820A34416F0139L12179p7357j16760J52466E8496J69415E0705d7479
$$ plain form
11462 556447 -298146 -22292 142453 37730 -214995 36401 123215 340343 -23078 -196883
11452 -196883 19164 223799 -188290 66400 -234204 -63362 191904 71157 -89401 32192 5178
11440 62567 -114250 336345 97748 287068 159664 248028 133130 56179 133171 -292974
11429 -393177 17082 -35591 218928 -29801 -89204 143887 -124890 -243256 296878 -73676
11418 79145 -16716 -28794 -156273 -190535 65376 48925 -113897 -147046 56742 256370 66126
11406 140645 -20 -95837 190239 290717 -19337 -50780 533289 -264023 113637 16392 89036
11395 89036 -222838 -68550 73266 248962 14871 127788 119768 204801 -108697 223127 5270
11383 85536 58693 82633 25764 -140151 -9974 -72364 -165025 -120554 -24882 279110 206381
$$ packed form
11462E56447b98146b2292A42453C7730b14995C6401Q6814K17128b3078j73805
11452a96883A9164K04635a88290F6400b34204f3362A91904G1157h9401C2192E178
11440F2567a14250C36345I7748J89320j27404Q8364j14898E6179P6992b92974
11429c93177A7082c5591B18928b9801n9403A43887a24890j18366B96878g3676
11418G9145a6716j2078j27479l4262F5376j6451a13897l3149E6742J99628F6126
11406A40645b0r5817A90239J00478a9337l1443E33289b64023A13637A6392P2644
11395H9036b22838f8550G3266J75696A4871J12917q020Q5033a08697B23127E270
11383H5536k6843K3940B5764a40151i974o2390r2661M4471b4882B79110p2729
$$ plain form
11372 206381 44828 -439461 202123 -17561 4260 -102850 71764 -118630 62182 -43061 -216985
11361 -216985 302643 -34168 159767 -17612 35188 69549 -216658 294199 -65186 -21767 49870
11349 26700 157879 157506 49092 -158857 -82163 87953 237624 -100897 68002 -42034 -161658
11338 -161658 35280 123205 -161541 -170473 6349 -120860 -92872 119833 -154033 -368367 -36318
11326 -288136 69692 -159388 -62754 -370645 -61278 -139411 -43132 -221100 -128076 126600 -115557
11314 -123799 187106 124487 -122034 -169305 63988 -22317 187448 -129871 179599 -152851
11303 17847 -5259 33752 47585 -219682 -367834 -10078 151336 -369887 -222474 -175270 -384931
11292 -384931 -296667 -282891 -215919 77788 -132204 -37661 145906 -109894 -67503 151739 -223188
$$ packed form
11372B06381D4828d39461B02123a7561D260a02850G1764a18630F2182d3061j73924
11361b16985C02643c4168A59767a7612C5188L4361b16658B94199f5186b1767D9870
11349B6700J31179l73D9092a58857P6694H7953J49671a00897F8002d2034j19624
11338a61658C5280Q7925a61541q932F349a20860K7988A19833a54033k14334c6318
11326b88136F9692a59388f2754l07891f1278p8133d3132j77968R3024A26600a15557
11314a23799A87106o2619a22034m7271F3988b2317A87448a29871A79599a52851
11303A7847e259C3752J3833b19682j48152a0078A51336c69887J47413M7204k09661
11292c84931Q8264J3776O6972G7788a32204c7661A45906a09894M2391A51739b23188
$$ plain form
11280 -50119 -111840 27436 216840 -6867 -237115 -91994 166374 -117297 191220 -163055 -309276
11269 -309276 -87980 116019 -281981 25302 25502 125797 251808 -19267 -37929 112138 -1226
11257 67418 53099 -131019 -114631 11918 -147772 183189 -192606 65257 -324562 -295531 390514
11245 -315800 -33324 104085 266230 43202 197950 -35721 101143 -501612 118600 22520
11234 67875 139231 -249983 296754 -39479 -96043 -13269 218274 -152243 -94023 -44141 152398
11222 223136 -181434 -69960 106796 48070 105198 -166091 -176447 16098 103995 -302051 409621
11210 -405255 -353054 -398362 -81905 -189889 -261354 44757 -87475 104675 -48211 -401448 -320967
11199 -320967 -218042 -221499 115688 36355 -22893 -115238 149113 -192036 -11672 -49477 40124
$$ packed form
11280e0119o1721B7436J89404f867k30248i1994A66374a17297A91220a63055j46221
11269c09276h7980A16019b81981B5302K00J00295J26011a9267j8662A12138a226
11257F7418j4319a31019J6388A1918a47772A83189a92606F5257c24562K9031C90514
11245c15800c3324A04085J62145D3202J54748c5721A01143e01612A18600B2520
11234F7875P1356b49983B96754c9479n6564a3269B18274a52243N8220d4141A52398
11222B23136a81434f9960A06796D8070N7128a66091j0356A6098Q7897c02051D09621
11210d05255N2201m5308h1905j07984p1465D4757h7475A04675d8211l53237Q0481
11199c20967J02925l457A15688C6355b2893r2345A49113a92036a1672l7805D0124
$$ plain form
11187 -161518 50613 -145491 -90316 -40627 63375 -333809 70620 -169957 48655 -207448 14745
11175 -121631 173248 -165326 -134479 357969 -71862 103372 -124986 310720 19381 -187594
11164 -20477 57575 -75071 -245613 88542 -161050 -178055 -113485 270779 119501 -48168 78144
11152 61803 -121978 167151 -228458 -241940 76392 -282856 100886 39862 111452 252280
11142 252280 253090 80825 -237024 -46423 -146276 -118116 -98603 -312657 90879 203329 248667
11131 248667 -55250 91468 215016 136296 -185991 97881 147873 240004 23472 68255 29093
11119 18444 -124673 146124 50626 297244 6557 -45218 97348 219135 247620 214891 88336
11107 -116784 354191 25547 64631 -61620 432829 359090 166086 343463 -52609 300998
$$ packed form
11187a61518E0613a45491N5175d0627F3375c33809G0620a69957D8655b07448A4745
11175a21631A73248a65326L0847C57969g1862A03372a24986C10720A9381a87594
11164b0477E7575g5071j70542H8542a61050j7005O4570B70779A19501d8168G8144
11152F1803a21978A67151b28458j3482G6392b82856A00886C9862P1590J40828
11142B52280Q10H0825b37024d6423r9853K8160J9513k14054I0879J12450M5338
11131B48667e5250I1468J23548p8720a85991I7881M9992R2131B3472M4783B9093
11119A8444a24673A46124E0626K46618F557d5218I7348J21787K8485l2729H8336
11107a16784C54191B5547L9084f1620D32829p3739A66086J77377e2609C00998
$$ plain form
11096 355892 102217 137741 306218 196867 85943 124327 143227 28916 399107 -4663 179834
11084 268545 265255 344743 -22247 359095 280815 248350 249874 85054 361857 400934 405392 167623
11071 518193 722202 489885 356590 139259 682910 582080 704122 375313 480860 277273
11061 277273 721864 330763 654348 820241 745544 853023 488515 784345 674672 849430
11051 849430 690064 687910 637134 600416 896878 1000599 910482 616907 957342 720117
11041 720117 712829 1009209 771932 573774 879362 809595 810326 722273 690148 551846 673586
11030 673586 578681 755977 583692 893719 795142 698357 597828 954122 802619 681852
11020 681852 621275 905001 693651 285619 701384 626571 393001 666917 635131 398582
$$ packed form
11096C55892A02217L5524J68477j09351H5943L8384J8900B8916L70191d663A79834
11084B68545l290P9488b2247C59095p8280l2465J524H5054K76803L9077M458A67623
11071E18193K04009k32317j33295A39259N43651j00830J22042l28809J05547k03587
11061B77273M44591C30763L23585J65893p4697J07479l64508K95830j09673J74758
11051H49430j59366k154n0776l6718K96462J03721r0117k93575L40435k37225
11041G20117p288K96380k37277j98158L05588o9767P31q8053l2125j38302J21740
11030F73586r4905J77296j72285L10027r8577r6785j00529L56294j51503j20767
11020F81852o0577K83726k11350B85619M15765p4813k33570K73916l1786k36549
$$ plain form
11010 398582 663740 699773 803799 456686 815856 253439 413123 752660 606770 739145
11000 739145 815971 912606 600363 321641 645969 588661 909881 894168 456530 575476
10990 575476 970154 618548 966505 604053 927610 1010572 826902 1189442 1194243 1153226
10980 1153226 1105217 1175731 1316896 1488539 1780363 2060964 2344649 2450042 2858113 2797309
10970 2797309 2846215 2970172 2913079 2614677 2351722 2262818 2125700 1575369 1727267 1631461
10960 1631461 1743706 1539612 1633513 1873306 1865515 1670324 1682942 1380977 1195904 967387
10950 967387 963676 649656 627808 135843 227703 645423 327622 271283 -115588 272900
10939 164028 80156 228140 -65319 167252 156923 135458 408525 172303 140785 392187
$$ packed form
11010C98582K65158L6033J04026l47113L59170B53439J59684L39537j45890J32375
11000G39145P6826R6635l12243k78722L24328n7308L21220j5713m37638J18946
10990E75476L94678l51606L47957l62452L23557Q2962j83670L62540M801m1017
10980A153226m8009P0514J41165J71643K91824K80601K83685J05393M08071o0804
10970B797309M8906J23957n7093k98402k62955q8904j37118n50331J51898r5806
10960A631461J12245k04094R3901K39793p791j95191J2618l01965j85073k28517
10950I67387l711l14020k1848A35843R1860M17720l17801n6339a15588B72900
10939A64028H0156J47984f5319A67252j0329k1465K73067A72303l1518K51402
$$ plain form
10929 392187 296727 154763 120024 -42383 165480 -214080 -94693 266622 -43939 78318 161110
10918 161110 -3626 274396 -67812 -28707 155304 103194 17719 16596 200432 296170 -281788
10906 326365 202475 -16931 -80140 -355379 287075 38304 72067 -61741 -117272 56909 213140
10895 213140 -250925 412421 59394 7892 61878 81058 229061 288651 92775 329004 7183
10883 106955 -64523 7397 -117954 3372 -28307 97207 59832 -134497 68371 -390223 -461254
10872 -461254 -191159 -340499 247652 101376 71622 42115 159744 27020 124340 12632
10861 -175799 -61474 -28725 13058 177001 111193 -132583 81617 235284 198084 -117294 30635
10849 494761 193134 -248933 -350800 -93840 94799 -58811 119112 -224452 -210960 -148537
$$ packed form
10929C92187r5460j41964l4739d2383A65480b14080i4693B66622d3939G8318Q2792
10918A61110c626B74396f7812b8707A55304n2110A7719j123J83836R5738b81788
10906C26365j23890a6931o3209k75239B87075C8304L3763f1741n5531E6909J56231
10895B13140b50925D12421E9394G892N3986J9180J48003N9590I2775K36229G183
10883A06955f4523G397a17954C372b8307I7207l7375a34497F8371c90223p1031
10872d61254a91159j49340B47652A01376k9754k9507J17629B7020R7320A2632
10861a75799f1474b8725A3058J63943o5808a32583H1617J53667l7200a17294C0635
10849D94761A93134b48933j01867i3840I4799e8811A19112b24452J3492O2423
$$ plain form
10839 -148537 170542 168520 -62236 -33491 60738 -299525 2373 100362 59498 134911 1522 319047
10827 319047 -121782 -116465 -69288 -83580 98039 -83492 -89326 -182317 38691 7263 -141199 -305532
10815 -305532 534871 -155498 -175019 -43749 -245089 388778 41527 -15944 -201291 -143143
10805 -143143 21442 -108803 -228856 303455 165530 104077 232619 -95088 -6507 -270561
10795 -270561 -252436 -263074 106868 -12233 223882 -43069 -173096 -339588 -222354 -249581
10785 -249581 -201102 -220381 100106 211080 6729 -134990 -23615 56993 295098 -79991 -228066
10774 -228066 158144 97029 -150702 238572 -431682 -642 -227920 28307 -240434 81973 32148
10762 -297277 30760 19809 -301807 -118049 128651 210035 -213714 115729 -286431 52015
$$ packed form
10839a48537A70542k022f2236K8745F0738b99525B373R7989m0864P5413A522L17525
10827C19047a21782N317M7177j4292I8039h3492n834r2991C8691G263a41199j64333
10815c05532E34871a55498j9521d3749k01340C88778D1527a5944j85347N8148
10805a43143B1442a08803j20053C03455j37925o1453J28542i5088f507k64054
10795b70561J8125j0638A06868a2233B23882d3069j30027j66492J17234k7227
10785b49581M8479j9279A00106J10974F729a34990b3615E6993K38105g9991j48075
10774b28066A58144o1115a50702B38572d31682f42k27278B8307b40434H1973C2148
10762b97277C0760j0951c01807a18049A28651Q1384b13714A15729b86431E2015
$$ plain form
10751 116641 -170791 -16233 194805 68939 75946 160493 -117752 111885 -91952 206617 -199518
10739 18545 29083 140321 -284982 222161 121257 104152 36671 32871 140834 -25228 -138260
10728 -138260 -31889 202988 2607 -194699 -144586 -143283 66419 -104848 -46744 143012 -433897
10716 260876 -101127 27148 106498 26184 -125112 -333438 52223 -87832 -125501 -122613 -13218
10704 15361 -697 69095 -159162 138651 -159635 -120783 -401828 -134050 65967 62437 -61138
10692 -218071 236282 -232327 -274299 337259 338777 -21516 -54570 -93352 66829 -157471 -185630
10681 -185630 -58785 37503 -80890 22658 -274221 182844 331 113443 -2941 100649 162756
10670 162756 -151709 280017 -209827 -261237 -59736 11950 173309 141221 -64458 -195505
$$ packed form
10751A16641a70791a6233A94805F8939P007Q4547a17752A11885i1952B06617a99518
10739A8545J0538J11238b84982B22161j00904j7105C6671l800J07963b5228j13032
10728a38260c1889B02988B607a94699N0113J303F6419a04848d6744A43012d33897
10716B60876a01127B7148P9350B6184a25112k08326E2223h7832l7669K888a3218
10704A5361f97F9095a59162A38651a59635L8852k81045a34050F5967l530f1138
10692b18071B36282b32327m1972C37259J518b1516l3054l8782F6829a57471k8159
10681a85630e8785C7503h0890B2658b74221A82844C31J13112b941A00649O2107
10670A62756a51709B80017b09827n1410e9736A1950J61359l2088f4458j31047
$$ plain form
10660 -195505 -256108 -264943 -158418 148203 -30055 -154714 -377892 -308477 -71715 356602 -105681
10648 -119352 110634 77417 -238177 80573 -64358 122874 -234982 -232019 270847 25159 -88894
10636 3986 27909 -310990 153474 -27800 -37771 177921 -67176 45189 -252788 -39401 55723
10624 128608 -273702 -67558 -69242 161350 -72465 -244352 -50296 -129611 -218190 23363 -192854
10612 -23715 -142317 205638 -93403 31079 136240 -161175 13332 1259 -558600 -152834 -292963
10601 -292963 -389891 -17002 -6771 -65234 111351 -17583 7472 105456 279350 214038 -74256
10589 -41780 114195 138018 171609 125257 -66981 -149661 -223487 -229788 -186371 -284920 20335 -504506
10576 -418492 -7169 3204 -46143 80958 -184721 71248 414955 198923 337203 -45661 -3992
$$ packed form
10660a95505o0603q835J06525A48203c0055j24659k23178O9415g1715C56602a05681
10648a19352A10634l3217b38177H0573f4358A22874b34982K963B70847B5159h8894
10636C986K3923c10990A53474b7800r971A77921f7176D5189b52788c9401E5723
10624A28608b73702f7558j684A61350g2465j71887e0296p9315q8579B3363a92854
10612b3715j18602B05638i3403C1079J05161a61175A3332A259e58600a52834j40129
10601b92963r6928a7002f771n8463A11351a7583G472R7984J73894o5312g4256
10589d1780A14195K3823L3591m6352f6981q2680p3826o301M3417r8549B0335e04506
10576d18492g169C204d6143H0958a84721G1248L43707A98923J38280d5661c992
$$ plain form
10564 65246 -100281 -377459 -361826 -12894 -2952 -137541 -53274 -123072 -109859 94260 -25491
10552 -30927 -294235 54709 -66037 -251228 -67137 -123561 -38084 -30831 -248410 342567 -237499
10540 -212474 -38889 -42065 9175 30512 63544 -105270 -204665 -149376 95679 170831 -287217
10528 211945 -259557 -229226 -353732 170874 -30640 148689 -52457 -191009 -107586 35759
10517 -101779 -204478 123392 -489201 166486 237804 103966 115701 193135 129182 154773
10507 154773 -366884 70038 -195821 -408483 334354 -303068 322731 133885 103219 105166
10497 105166 193030 -301375 -69556 107488 90732 -254225 147979 295964 320577 126975
10486 -67093 -42118 3362 -103672 132233 321168 268854 526776 548412 360455 -39773 99088
$$ packed form
10564F5246a00281k77178J5633a2894b952j34589e3274o9798J3213I4260b5491
10552c0927k63308E4709f6037j85191f7137n6424c8084P253k17579C42567b37499
10540b12474c8889l176I175K1337L3032a05270r9395N5289I5679P5152b87217
10528B11945b59557L0331j24506A70874c0640A48689e2457j38552Q3423C5759
10517a01779j02699A23392d89201A66486P1318A03966J1735P7434o3953K5591
10507A54773c66884G0038a95821k12662C34354c03068C22731A33885l0666J947
10497A05166Q7864c01375f9556A07488j6756b54225A47979J47985K4613A26975
10486f7093K4975C362a03672A32233J88935n2314K57922K1636j87957c9773I9088
$$ plain form
10474 -70938 -105335 -98626 -245850 147868 -77140 457737 262181 -91528 83855 113425 3673
10462 -4550 231756 -326662 -201386 -237065 -445179 -519868 -40814 -93180 238527 -125687 -86706
10451 -86706 273008 152634 -159748 223594 3271 189560 -91340 220574 262013 244673 125500
10440 125500 239248 -66667 114222 41832 2634 191980 21593 -38523 -137076 108016 219471
10429 219471 -93786 177550 -77796 -40579 35222 -284451 -167918 -86117 9465 -210722 -40412
10417 -181571 382720 166310 8534 148412 -188907 -64943 -119659 -375254 26977 93923 -91660
10405 -83468 -167953 -125035 19440 -117993 166989 -251740 -3196 -6059 193895 68927 260849
10394 260849 -28992 317917 47982 248029 13204 281819 190181 203331 126693 362648 183017
$$ packed form
10474g0938l4397O709j47224A47868g7140D57737j95556i1528H3855K9570C673
10462d550B31756c26662J25276l5679k08114p4689d0814n2366B38527a25687L8981
10451h6706B73008j20374a59748B23594C271J86289i1340B20574M1439j7340j19173
10440A25500J13748f6667A14222D1832B634J89346B1593c8523r8553A08016J11455
10429B19471i3786A77550g7796L7217C5222b84451J16533Q1801I465b10722d0412
10417a81571C82720A66310H534J39878a88907f4943n4716k55595B6977O6946i1660
10405h3468q4485M2918A9440a17993A66989b51740c196k863A93895F8927J91922
10394B60849b8992C17917D7982K00047A3204K68615r1638J3150p6638K35955j79631
$$ plain form
10383 183017 89298 264560 -65353 -160098 38735 -69069 26052 291855 412711 403014 348474
10372 348474 130553 367028 241795 375417 235952 225615 485112 446094 525097 263427
10362 263427 296615 -16849 314708 170047 -33760 282606 263439 382611 95038 252334
10352 252334 444644 597137 651475 549305 229953 378713 250843 430608 193453 569435
10342 569435 414794 243099 357922 170076 331937 109218 2298 101535 -197786 25910
10331 425497 -11257 -111558 308063 -93705 -68273 208624 113372 391902 -110105 217444
10320 157868 160493 234996 -34917 313618 358221 195936 159078 436251 268324 -28921 -288224
10309 -288224 48362 -15491 71537 42287 -67750 145459 -3829 51229 -68162 -146398 173126
$$ packed form
10383A83017H9298J75262f5353r4745C8735f9069B6052K65803J20856r697n4540
10372C48474A30553K36475j25233J33622j39465j0337K59497l9018P9003k61670
10362B63427L3188a6849C14708j44661c3760B82606j9167J19172I5038J57296
10352B52334J92310J52493N4338j02170B29953J48760j27870J79765A93453L75982
10342E69435j54641j71695J14823A70076J61861A09218B298R9237a97786B5910
10331D25497a1257j00301C08063i3705K5432B08624r5252K78530a10105B17444
10320A57868K625P4503c4917C13618M4603j62285l6858K77173j67927b8921k59303
10309b88224D8362a5491G1537k9250f7750A45459c829E1229f8162p8236A73126
$$ plain form
10297 -26275 -162446 -238742 -374316 -347902 -1141 -49155 -54338 -77223 -128886 143231 -117060
10285 207801 -51660 239141 -77994 -44923 -318270 75108 4985 -197320 -111150 -215163 -85651
10273 -34213 -218109 88051 102425 -68763 -88410 -218846 -251981 -179086 178146 79539 -288924
10261 164212 468272 434890 237822 706482 275307 -71359 173945 -9799 57108 212201
10251 212201 59944 101100 36132 171194 167685 290622 -122583 -11245 196658 219476 9829
10239 403359 -9054 82851 83963 -134049 -357635 -326668 127339 -377567 -42920 -266012 -143124
10228 -143124 -104968 -54510 19070 26263 160133 157068 -249478 285483 -180788 53496 15508
10216 110017 -78384 -366894 -192131 18090 -103116 158732 -68395 -99517 -32923 -125627 108641
$$ packed form
10297b6275j36171p6296j35574K6414a141m8014n183k2885n1663A43231a17060
10285B07801e1660B39141g7994L3071k73347G5108D985a97320Q6170j04013h5651
10273c4213j83896H8051J4374f8763j9647j30436l3135P2895A78146G9539b88924
10261A64212L04060l3382j97068M68660B75307g1359A73945i799E7108J55093
10251B12201E9944M1156C6132J35062l509J22937a22583a1245A96658K2818I829
10239D03359i054H2851J112a34049k23586L0967A27339c77567d2920k23092J22888
10228a43124L8156N0458A9070P193J33870l065b49478B85483a80788E3496A5508
10216A10017g8384k88510J74763A8090a03116A58732f8395l1122c2923r2704A08641
$$ plain form
10204 151119 233660 -120067 110938 -79767 -73355 -132845 269751 100518 -341357 -355927 162216
10192 -92524 -251252 -29055 -23894 -38581 -139197 115574 264467 -226169 115575 -85138 -33208
10180 25760 -161282 -105050 -132545 153309 -27016 -22398 -109042 -70907 -168486 -208404 -53413
10168 57686 -135653 -123417 -198161 88781 -135964 -156863 38350 -31040 43631 -228033 53572
10156 201331 -63333 48575 -72397 91585 55660 153066 -47107 -90075 -302574 -106847 185632
10144 171065 -169304 432203 -92976 -215116 -30575 161384 121582 43992 79275 -25450 -360019
10133 -360019 -182035 -95927 153577 184624 39850 46347 -97323 -200324 45899 69600 -104918
10121 -130624 -344036 105748 -59537 -154639 191071 -301511 -189014 -160804 -73885 -14600
$$ packed form
10204A51119Q2541a20067A10938g9767O412n9490B69751A00518c41357j4570A62216
10192i2524j58728b9055N161j4687j00616A15574J48893b26169A15575h5138c3208
10180B5760a61282N6232k7495A53309b7016M618q6644L8135r7579l9918e3413
10168E7686a35653J2236p4744H8781a35964k0899C8350c1040D3631b28033E3572
10156B01331f3333D8575g2397I1585l5925R7406d7107m2968k12499a06847A85632
10144A71065a69304D32203i2976j22140c0575A61384l9802D3992L5283b5450l34569
10133c60019J77984Q6108A53577L1047C9850O497i7323j03001D5899K3701a04918
10121a30624k13412A05748e9537r5102A91071c01511J12497K8210g3885a4600
$$ plain form
10110 220247 -229503 15591 -169217 46212 -17066 -186699 -106191 -319051 151524 22281
10099 -105684 172361 -122307 -140566 -222384 102965 -356676 -245030 -157715 114076 127481
10089 127481 -347471 -107653 -262248 -115756 85410 -273572 -156191 200802 -288940 -211796
10079 -211796 280816 81097 -105134 -168988 -52939 -51197 -57959 -114510 -156131 -105077 -67148
10068 -67148 325411 -44666 -132851 423915 115536 39919 14985 129960 -272060 16101 162764
10057 162764 -147484 288584 373385 -49313 -14464 145682 -126980 -145787 -129152 161155
10046 4463 112480 -130353 192920 107757 -285986 10475 458664 197046 -154566 -18412
10035 -92390 -167306 -7951 86202 136170 -122396 89155 8957 89755 66965 -186203 127521
$$ packed form
10110B20247b29503A5591a69217D6212a7066j69633Q0508k12860A51524B2281
10099a05684A72361a22307j8259q1818A02965c56676J11646Q7315A14076J3405
10089A27481c47471a07653j54595a15756H5410b73572J17381B00802b88940P7144
10079b11796B80816H1097a05134o3854e2939J742o762n6551m1621N1054L7929
10068f7148C25411d4666q8185D23915A15536C9919A4985J14975b72060A6101J46663
10057A62764a47484B88584Q4801d9313a4464A45682a26980j8807J6635A61155
10046D463J08017a30353A92920q5163b85986A0475M48189A97046a54566a8412
10035i2390p4916g951H6202M9968a22396H9155H957Q0798k2790a86203A27521
$$ plain form
10023 72195 -227263 -211564 206402 -76120 116018 -360494 -95755 -129759 -61254 -50188 -182446
10012 -182446 74571 -105680 -467864 -136428 13219 -156678 -220879 131434 -24433 -479573
10002 -479573 39333 -131269 -441995 -267216 116003 -135655 -65883 -94062 -240 -358937 -145179
9990 -252744 161528 -38050 -3916 273973 -64538 187971 261 -15656 -147807 -290088 -87551
9978 8318 31304 -147193 88762 54225 47545 535 -89753 -288282 22629 314516 -194135 -241607
9966 -241607 -319656 -338105 9145 -85346 -170054 -123431 -4019 -65154 47486 -91212 1379 269121
9954 269121 -84278 39664 203270 -36327 378173 -133724 -45005 619 239322 26664 -146603
9942 165042 -269712 -16565 -155103 -13814 -94635 5529 -89591 173482 -11882 -91858 378429
$$ packed form
10023G2195b27263J5699B06402g6120A16018c60494i5755l4004f1254J1066j32258
10012a82446G4571a05680l62184a36428A3219a56678o4201A31434b4433m55140
10002d79573C9333a31269l10726J74779A16003a35655f5883k8179b40l58697a45179
9990b52744A61528c8050c916B73973f4538A87971B61a5656j32151j42281h7551
9978H318K2986a47193H8762l4537o680E35h9753j98529B2629K91887a94135m7472
9966b41607p8049j8449I145h5346q4708M6623d019o1135D7486i1212A379K67742
9954B69121h4278C9664J63606c6327C78173a33724d5005F19K38703B6664a46603
9942A65042b69712a6565j38538a3814q0821E529h9591A73482a1882p9976C78429
$$ plain form
9930 250919 -23309 446236 -317133 40825 -226492 -279030 -100728 -312696 109014 295853
9920 295853 123309 -248231 -15632 19760 -18958 -292573 60530 31286 -180974 -36606 90471
9908 3594 108525 82750 -214072 -397645 -235817 36336 -138893 79781 -302819 118418 50067
9896 -36502 -26414 36770 -32147 -257540 -41239 -61030 -18836 31349 129366 -136351 -162039
9885 -162039 -266433 216140 32869 -177769 -285935 -159317 -3171 -88759 -118478 206765 34308
9873 216831 138193 -43672 53712 -57716 -80912 -226752 -216472 -133770 -148379 -80984 -278613
9862 -278613 -1666 -94353 -278221 238894 -38838 211480 -303900 142923 -16237 -166715 -293537
9851 -293537 -87551 -227296 -138143 -195042 -14125 4576 65478 -276182 34608 156345 148377
$$ packed form
9930B50919b3309D46236c17133D0825b26492n2538a00728k11968A09014J86839
9920B95853A23309b48231a5632A9760a8958k73615F0530k9244a80974c6606I0471
9908C594J04931k5775b14072j83573J61828C6336a38893G9781c02819A18418E0067
9896c6502J0088C6770c2147k25393d1239j9791a8836C1349R8017a36351k5688
9885a62039j04394B16140C2869a77769j08166J26618c171q5588k9719B06765C4308
9873B16831p8638d3672E3712e7716k3196j45840J0280Q2702j4609O7395j97629
9862b78613a666r2687j83868B38894c8838B11480c03900A42923a6237j50478j26822
9851b93537h7551j39745Q9153n6899a4125D576O0902b76182C4608J21737p968
$$ plain form
9840 148377 -117713 -49015 -217067 136967 161800 75751 -129107 158911 -48045 169887
9829 -158295 -207627 29569 -38773 -40669 -397926 -561003 65376 -77589 -47976 -112440 -159373
9818 -159373 20468 -5089 -116590 -74037 -83120 -97118 -396338 -12387 27366 -39148 76625 -7473
9805 43690 289065 36620 -188738 133935 -15809 120024 364 -103349 -372554 -71283 -93630
9794 -93630 21713 36861 73145 -21949 -71301 229706 -279426 29849 138820 -24435 87149
9782 -343624 295758 -176227 120282 -41960 -427515 36759 -280026 -228607 75772 -28953 -213699
9771 -213699 58158 -335004 -168376 -324949 -86961 19069 -48995 -78933 -141744 -355930 49511
9759 -297904 167782 -367806 -231068 -259939 -104883 202587 -107473 -92500 -254356 -196445
$$ packed form
9840A48377a17713d9015j68052A36967K4833G5751a29107A58911d8045A69887
9829a58295m9332B9569c8773j896l57257j63077F5376g7589K9613o4464m6933
9818a59373B0468e089j11501M2553r083j3998k99220a2387B7366c9148G6625g473
9805D3690K45375C6620a88738A33935a5809A20024C64a03349k69205g1283k2347
9794i3630B1713J5148L6284b1949m9352B29706b79426B9849J08971b4435H7149
9782c43624B95758a76227A20282d1960l85555C6759b80026N1419G5772b8953j84746
9771b13699E8158c35004J66628j56573h6961A9069d8995k9938o2811k14186D9511
9759b97904A67782c67806J36738k8871a04883B02587a07473J4973j61856N7911
$$ plain form
9749 -196445 -127408 -221392 -116647 -23465 -382433 -95795 -67307 23117 -96517 40528 52884
9738 52884 -326271 -227665 187068 -311859 -261629 -130154 97090 -87815 -97146 60389 -78702
9726 46522 -73351 -111547 -211543 72110 -148216 56618 -88019 108977 41984 -194963 -139432
9715 -139432 -406896 221468 -62311 41403 255733 -132155 -239209 136916 310795 30661
9704 56158 -235328 -126089 -168990 -45730 307935 24724 160968 51212 24373 -287735 -112178
9692 14538 -289757 19385 -38361 -133719 290511 -251432 -124495 -209156 -17127 -47123 -127411
9681 -127411 40701 -414283 -181636 -16616 -91822 62523 -57014 -168690 249230 -154114 159470
9669 99155 -127046 20103 115115 225136 -13139 -394820 35623 -68665 141789 267160 -76282
$$ packed form
9749a96445O9037r3984J04745b3465l58968i5795K8488B3117i6517D0528J2356
9738E2884c26271R8606A87068c11859N0230a30154I7090h7815r331F0389g8702
9726D6522g3351l8196r9996G2110a48216E6618h8019A08977D1984a94963N5531
9715a39432k67464B21468f2311D1403K14330a32155j07054A36916J73879C0661
9704E6158b35328J09239m2901d5730C07935B4724J36244E1212B4373b87735a12178
9692A4538b89757A9385c8361r5358B90511b51432a24495q4661a7127k9996q0288
9681a27411D0701d14283a81636a6616p5206F2523e7014j11676B49230a54114A59470
9669I9155a27046B0103R5012J10021a3139l81681C5623f8665A41789J25371g6282
$$ plain form
9657 -305542 247137 193711 60506 7202 -117779 312793 -282320 -29000 200547 279172 -95196
9645 -120927 -49058 -301397 -9047 -195573 -111079 -42389 -117306 138396 7552 -66579 297740
9633 209448 -112477 -174097 127766 -189125 -238231 -77787 -271101 95184 -189545 128360
9622 -58016 -2342 94313 207400 -285843 -97562 -108618 29526 -195008 427823 -140891 272924
9610 32662 -59309 -316971 -34137 -143090 -157883 -242372 113354 -40936 139031 -90838 -40511
9598 -11720 -4939 12923 -123100 -92926 -154176 -26195 309212 -274746 -22533 -65845 -74544 -35221
9585 -55772 117435 111314 115011 -35743 -123802 -208404 326524 -477108 -222614 -551770 -511219
9574 -511219 496045 -95291 -368909 -278749 -23691 -167157 -11932 -173064 129590 -228727
$$ packed form
9657c05542B47137n3426F0506G202a17779C12793b82320b9000B00547P8625i5196
9645a20927d9058k52339i047j86526Q4494d2389p4917A38396G552f6579B97740
9633B09448a12477o1620A27766a89125m9106g7787j93314I5184a89545A28360
9622e8016b342I4313J13087b85843i7562j1056B9526a95008D27823a40891B72924
9610C2662e9309k57662c4137j08953j4793q4489A13354d0936A39031i0838d0511
9598a1720d939A2923a23100L0174o1250b6195C09212b74746b2533m3312q699c5221
9585e5772A17435o121L697c5743q8059q4602C26524d77108b22614l29156M0551
9574e11219D96045i5291k73618R0160b3691j43466a1932j61132A29590b28727
$$ plain form
9563 266647 -203560 91906 96779 55514 -158020 310599 -296936 -247615 193578 102985 173942
9552 173942 -25728 -56745 199972 308290 62769 -392636 -48673 48938 -112772 44242 -270063
9540 -234508 -45408 -128611 45128 -269705 -138040 -13021 -98618 -30202 -64728 -289555 71174
9528 -137439 -294532 6448 -168945 -412933 202659 17438 13898 131423 -99112 253084 11146
9516 -42085 -293799 -333898 297239 6000 199239 -85310 -129935 -419625 -73082 -272738 -11458
9504 163760 -160074 -22821 87909 -232439 -157408 -142800 -138369 -193038 -254420 50304 -103289
9492 -112595 -276668 -165184 3129 31452 -24506 -181504 -204168 115189 94659 -93884 181232
9480 -168955 -360265 -116788 -298704 56 -111007 15037 -28668 -388179 193508 59994 -245470
$$ packed form
9563B66647b03560I1906M873m1265a58020C10599b96936M9321A93578r0593P0957
9552A73942b5728l1017A99972J08318F2769c92636d8673D8938a12772D4242b70063
9540b34508d5408q3203D5128b69705J31665a3021q5597c0202l4526k24827G1174
9528a37439j57093F448a68945k43988B02659A7438l540J17525i9112B53084A1146
9516d2085k51714m0099B97239F000J93239h5310m4625k89690g3082j99656a1458
9504A63760a60074b2821H7909b32439P5031J4608M431n4669o1382E0304a03289
9492a12595j64073J11484C129K8323b4506j56998k2664A15189k0530i3884A81232
9480a68955j91310a16788j81916E6a11007A5037b8668l59511A93508E9994b45470
$$ plain form
9468 -216964 -68337 -452087 -82039 -157973 123453 160813 -23782 -304767 244167 -206757 -145524
9457 -145524 263794 100646 -96960 8095 -247925 -142594 -182614 -193277 -224643 22512 1266
9445 -200599 -214186 -124702 139068 -191631 -121209 222824 -355095 -248592 135469 84340
9435 84340 -176998 -179186 125362 246245 101366 -124276 -171927 58616 -195633 66645 85437
9424 85437 -74020 -403739 -149097 175219 -123761 9383 -91300 171716 -79754 -180840 -91729
9413 -91729 -128684 209271 -153473 196335 -244039 -10459 -191410 -105058 -11320 -87589 -305162
9402 -305162 -9827 -132216 -173490 419797 71961 -38820 -15439 96418 37371 -281930 168859
9390 -75084 137511 -225381 68759 -155512 -240064 10940 87851 -198155 -441375 148382 -275050
$$ packed form
9468b16964f8337l83750h2039p5934A23453L7360b3782k80985B44167b06757O1233
9457a45524B63794A00646i6960H095b47925J05331m0020j0663l1366B2512A266
9445b00599j3587Q9484A39068a91631P0422B22824c55095J06503A35469n1129
9435H4340a76998k188A25362J20883A01366a24276m7651E8616a95633F6645J8792
9424H5437g4020l29719a49097A75219a23761I383i1300A71716g9754j01086Q9111
9413i1729l6955B09271a53473A96335b44039a0459j80951Q6352a1320p6269k17573
9402c05162i827j22389m1274D19797G1961c8820a5439I6418C7371b81930A68859
9390g5084A37511b25381F8759a55512q4552A0940P6911a98155k43220A48382b75050
$$ plain form
9378 -365589 -20614 -141754 74739 -179658 -231563 199991 -27612 -320619 91037 -121281 -47456
9366 471239 202895 -51378 -93431 1171 -106605 81098 -219707 -334985 -56035 206701 141530
9355 141530 238724 -233673 -97534 30391 206154 166246 226782 174565 -207793 -240882 11719
9343 -252516 223282 -49631 131725 141026 9249 8851 -291470 -78566 -377484 289261 -94478
9331 -75080 -83607 -152840 33354 -10633 69175 144010 5675 -92766 -48082 185110 97796 61827
9319 61827 215636 -356957 -136914 140923 -159210 -197903 66742 -41510 -78506 -1108 15495
9307 -229223 -34021 -176637 -99673 -520863 242870 -264307 32172 172971 142405 -70272 39994
9295 95149 -218004 -79860 -45466 68482 -137039 3837 -162882 -48087 127424 42393 113356
$$ packed form
9378c65589b0614j21140G4739a79658n1905A99991b7612k93007I1037a21281d7456
9366D71239B02895e1378m2053A171a06605H1098b19707j15278e6035B06701o5171
9355A41530R7194b33673i7534C0391J75763l9908O0536n2217b07793l3089A1719
9343b52516B23282d9631A31725R301I249l98b91470g8566k98918B89261i4478
9331g5080q527o9233C3354a0633F9175P4835E675i2766M4684A85110q7314l5969
9319F1827J53809c56957a36914A40923a59210l8693F6742d1510l6996a108A5495
9307b29223c4021j42616P6964m21190B42870b64307C2172J40799l0566g0272C9994
9295I5149b18004g9860L4394F8482a37039C837a62882d8087A27424D2393P0963
$$ plain form
9284 113356 151104 -476668 -136367 11605 -115959 -29037 -35962 -22079 -21742 -188799 -22442
9272 -209271 -89967 -79014 -362349 84073 -104238 -179252 -23357 -56793 -224024 -78021 -5626
9260 -162376 9294 -225895 -233453 -125036 -157450 391790 296022 6899 -109004 -459752 33058
9248 64962 -124230 -214161 -2420 -66636 -238085 -109919 203564 -352138 124062 148888 235874
9237 235874 -38675 34478 67794 -340675 70492 -71860 -73860 139439 -180916 89148 -235649
9225 -55638 -101839 17506 -603951 -258089 135353 167741 168489 -19024 -201355 -202372 36017 -191850
9212 -288581 10946 4911 -140619 -188377 322693 172424 98003 16747 -111267 -290501 -132039
9200 -4634 41851 35492 112069 85467 -297695 -241954 -265792 366119 -186576 79395 141530 38097
$$ packed form
9284A13356L7748d76668a36367A1605a15959b9037o925J3883L37j67057b2442
9272b09271h9967J0953k83335H4073a04238p5014b3357l3436j67231g8021e626
9260a62376I294b25895p558J08417l2414C91790r5768F899a09004l50748C3058
9248F4962a24230q9931b420o4216j71449a09919B03564c52138A24062K4826Q6986
9237B35874c8675C4478L3316c40675G0492g1860k000A39439a80916H9148b35649
9225e5638m6201A7506f03951b58089A35353L2388P48a9024j82331j017C6017a91850
9212b88581A0946D911a40619m7758C22693j50269p4421A6747a11267j79234a32039
9200d634D1851o359P6577k6602b97695N5741k3838C66119a86576G9395O2135C8097
$$ plain form
9187 -104259 -7739 -48058 -328292 -269686 74477 -63021 -226962 -29918 26584 -209195 -177012
9176 -177012 131667 50415 -427279 -305391 -16963 -168510 -123571 15007 -2840 -221750 110973
9164 -8142 93794 215551 -57526 -54601 -523132 -145893 -132230 75830 193449 -152853 -323509
9153 -323509 -134604 108933 -43505 -307386 -109754 -8157 66203 -90281 79239 -35148 -93220
9142 -93220 -139413 9559 -312568 -34629 -36549 -59262 42457 -156387 -345872 182608 -72139
9130 -45602 -149137 142196 196249 -68391 11123 40271 265851 -118562 288637 -160623 154947
9118 -12978 -381338 -12423 27832 1573 15692 -303971 -92519 -198569 -106208 -16852 -258237
9107 -258237 3754 -57434 -91159 -17457 84033 -150031 -127482 124241 -35276 236 28581 128723
$$ packed form
9187a04259g739m0319k80234N8606G4477f3021j63941b9918B6584b09195L2183
9176a77012A31667E0415d27279J21888a6963j51547M4939A5007b840k18910A10973
9164h142I3794J21757e7526K925m68531a45893J3663G5830J17619a52853j70656
9153c23509a34604A08933d3505k63881a09754h157F6203i0281G9239c5148n8072
9142i3220m6193I559c12568c4629j920k2713D2457a56387j89485A82608g2139
9130d5602j03535A42196N4053f8391A1123K9148K25580a18562B88637a60623A54947
9118a2978l68360a2423B7832A573J4119c03971i2519j06050R2361a6852k41385
9107b58237C754e7434l3725a7457H4033a50031K2549A24241c5276B36K8345J00142
$$ plain form
9095 128723 -27080 29214 19149 -134169 -10902 -273872 -121178 -83760 88682 -134504 28259
9083 -128241 73162 -334189 -382529 -170192 -59201 86528 -241295 -87066 -65296 80075 4078
9071 -208412 154272 -170879 -244622 38448 -151867 80884 185773 -188692 165862 5328 32348
9060 32348 189282 -122511 -344361 -129709 -366545 -287749 -298198 -75798 -214719 111665
9049 205410 160081 -62441 -161868 237333 33444 95070 -43074 -29655 -76909 269879 -392193
9037 44946 -153691 -168206 56117 15556 -279199 26836 -88799 -234572 -178712 -13856 -198270
9026 -198270 23866 -186594 -69035 76951 -30768 49500 -121079 29113 -158185 -264512 -32912
9014 336381 -43150 45080 222653 -34496 -222308 -31333 -31377 124564 99461 -123492 -338724
$$ packed form
9095A28723b7080B9214j0065a34169a0902k62970a21178L7418H8682a34504B8259
9083a28241G3162c34189m8340a70192e9201H6528b41295h7066K1770H0075D078
9071b08412A54272a70879p3743C8448a51867H0884J04889a88692A65862E328K7020
9060C2348J56934a22511k21850a29709k36836P8796j0449g5798j38921A11665
9049B05410m5329f2441r9427B37333C3444O1626d3074J3419m7254B69879c92193
9037D4946a53691j4515E6117A5556b79199B6836h8799j45773N5860a3856j84414
9026a98270B3866a86594f9035G6951c0768D9500a21079B9113a58185j06327c2912
9014C36381d3150D5080J77573c4496j87812c1333m4A24564k5103a23492k15232
$$ plain form
9003 -338724 -131774 -208777 -250876 -199699 -99151 -138417 53820 -228429 167323 -228809 -71665
8991 124873 286788 -55417 -18762 -116920 -41392 -220303 38430 63665 -439768 -100912 -89082
8980 -89082 -197716 360896 109825 284443 -36320 -118153 106034 92857 -377225 -40937 -302634
8969 -302634 -142351 140716 -47012 -181312 -9675 -15946 91618 -96539 125387 88892 107770
8958 107770 -25862 -286350 120219 190955 61276 -39709 -52221 83006 57616 225666 -378052
8946 -139261 26947 126144 33205 -112642 -96949 267527 -99436 -69737 -220070 29860 -422153
8934 -138265 -365207 176123 193477 86106 132931 -97754 -247712 -6039 125007 -180066 -265143
8923 -265143 164357 711775 978408 199709 -57893 -165505 30481 40539 -120582 206051
$$ packed form
9003c38724a31774p7003m2099N1177i9151l9266E3820b28429A67323b28809g1665
8991A24873J61915e5417a8762r8158d1392j78911C8430K5235d39768a00912J1830
8980h9082j08634C60896A09825J74618c6320q1833A06034j3177c77225d0937k61697
8969c02634a42351A40716d7012j34300i675o271I1618i6539A25387l6495J8878
8958A07770b5862k60488A20219P0736F1276c9709j2512H3006k5390J68050c78052
8946a39261B6947R9197C3205a12642J5693B67527i9436K9699j50333B9860d22153
8934a38265k26942A76123J7354H6106M6825i7754j49958f039A25007a80066q5077
8923b65143A64357N47418K66633A99709e7893j07612C0481J0058a20582B06051
$$ plain form
8912 -4146 96524 -161130 41291 -74601 -261240 -149604 117117 368596 -21688 88820 -419907
8900 -45748 -238338 -133396 -93777 17666 -60976 -85299 -171694 -100515 119750 -33254 -199399
8889 -199399 172265 100365 96668 -142565 -296067 52882 -248001 260733 -274208 -158952
8879 -158952 -371419 -231254 141538 -82831 68841 39099 112589 -54385 -441341 157864 -90118
8867 -12823 26759 -312578 -152113 -21151 17597 -15376 -223105 -53075 137333 109570 108568
8856 108568 -55986 -57205 27758 -109964 24886 -133649 -74441 -172548 -19696 -44749 -179051
$$ packed form
8912d146I6524a61130D1291g4601j86639J11636A17117K51479b1688H8820d19907
8900d5748j92590J04942L9619A7666f0976k4323q6395P1179A19750c3254j66145
8889a99399A72265p1900l697a42565j53502E2882b48001B60733b74208J15256
8879a58952k12467J40165A41538h2831F8841k9742P3490e4385l86956A57864i0118
8867a2823B6759c12578a52113b1151A7597a5376k07729e3075A37333k7763j002
8856A08568e5986j219B7758a09964B4886a33649N9208r8107a9696k5053j34302
$$ [...]
##END NTUPLES=NMR SPECTRUM
##END=
