##TITLE=AC1428_PERAH13239_7764532_aaiA193wdL
##JCAMPDX= 6.0         $$ Bruker NMR JCAMP-DX V2.0
##DATA TYPE= NMR SPECTRUM
##DATA CLASS= NTUPLES
##ORIGIN= BRUKER
##OWNER= Administrator
$$ 1.72 TOPSPIN		Version 2.1
$$ 2015-07-09 21:12:06.800 -0700  Administrator@X
$$ Compression mode = diff/dup
##.OBSERVE FREQUENCY= 400.02188249412
##.OBSERVE NUCLEUS= ^1H
##.ACQUISITION MODE= SIMULTANEOUS (DQD)
##.ACQUISITION SCHEME= undefined
##.AVERAGES= 64
##.DIGITISER RES= 22
##SPECTROMETER/DATA SYSTEM= spect
##.PULSE SEQUENCE= noesygpps1d.comp
##.SOLVENT NAME= COFFEE_meoh
##.SHIFT REFERENCE= INTERNAL, COFFEE_meoh, 1, 14.96098
##AUDIT TRAIL= $$ (NUMBER, WHEN, WHO, WHERE, PROCESS, VERSION, WHAT)
$$ ##TITLE= Audit trail, TOPSPIN		Version 2.1
$$ ##JCAMPDX= 5.01
$$ ##ORIGIN= Bruker BioSpin GmbH
$$ ##OWNER= Administrator
$$ $$ E:\/data/COFFEE/nmr/AC1428_PERAH13239_7764532_aaiA193wdL/22/pdata/1/auditp.txt
$$ ##AUDIT TRAIL=  $$ (NUMBER, WHEN, WHO, WHERE, PROCESS, VERSION, WHAT)
(   1,<2015-07-09 21:12:01.206 -0700>,<Administrator>,<X>,<go>,<TOPSPIN 2.1>,
      <created by zg
	started at 2015-07-09 21:00:31.441 -0700,
	POWCHK enabled, PULCHK disabled,
       configuration hash MD5:
       21 0F 79 D6 B3 7B B4 F6 88 20 88 DB 03 48 BD 9F
       data hash MD5: 64K
       24 3D 9C E6 3D 14 02 8B C6 17 BD 9B CE A3 F9 8C>)
(   2,<2015-07-09 21:12:04.644 -0700>,<Administrator>,<X>,<proc1d>,<TOPSPIN 2.1>,
      <Start of raw data processing
       efp LB = 0.3 FT_mod = 6 PKNL = 1 PHC0 = 0 PHC1 = 0 SI = 128K 
       data hash MD5: 128K
       AA FB 98 A2 23 1C A4 08 24 F5 3B F7 21 3D 31 4F>)
(   3,<2015-07-09 21:12:05.550 -0700>,<Administrator>,<X>,<proc1d>,<TOPSPIN 2.1>,
      <pk PHC0 = -89.8407 PHC1 = 0 
       data hash MD5: 128K
       E8 CC FE 22 D3 28 33 CC 4E 40 FC 0C 80 72 A1 7C>)
(   4,<2015-07-09 21:12:05.956 -0700>,<Administrator>,<X>,<proc1d>,<TOPSPIN 2.1>,
      <abs ABSG = 1 
       data hash MD5: 128K
       DE 28 24 60 C6 6A 3F BF B4 D9 82 0C A0 8F 43 29>)
(   5,<2015-07-09 21:12:06.066 -0700>,<Administrator>,<X>,<proc1d>,<TOPSPIN 2.1>,
      <abs ABSG = 2 
       data hash MD5: 128K
       1A A2 88 40 4F D4 1D 44 9B 8B F7 72 58 29 9E E2>)
(   6,<2015-07-09 21:12:06.160 -0700>,<Administrator>,<X>,<proc1d>,<TOPSPIN 2.1>,
      <abs ABSG = 3 
       data hash MD5: 128K
       7B 82 2A 4E 3E B3 A4 AE 61 2A B3 5A 77 89 69 39>)
(   7,<2015-07-09 21:12:06.238 -0700>,<Administrator>,<X>,<proc1d>,<TOPSPIN 2.1>,
      <abs ABSG = 4 
       data hash MD5: 128K
       B1 14 60 F5 D5 FB 48 48 EF 74 26 6A EF 17 9D 3F>)
(   8,<2015-07-09 21:12:06.363 -0700>,<Administrator>,<X>,<proc1d>,<TOPSPIN 2.1>,
      <abs ABSG = 5 
       data hash MD5: 128K
       6D CB C7 99 62 07 EF 62 10 E5 0C B1 8D 02 0B 42>)
$$ ##END=
$$ 
$$ $$ hash MD5
$$ $$ D0 96 CD 15 32 07 C1 C4 4D BD EC CB 0B 8B 96 22
##$RELAX= 
##$RELAX= 
##$RELAX= 
##$RELAX= 
##$RELAX= 
##$RELAX= 
##$RELAX= 
##$RELAX= 
$$ Bruker specific parameters
$$ --------------------------
##$DU= <E:\>
##$EXPNO= 22
$$ [...]
##$TP07= 0
##$TPNAME0= <>
##$TPNAME1= <>
##$TPNAME2= <>
##$TPNAME3= <>
##$TPNAME4= <>
##$TPNAME5= <>
##$TPNAME6= <>
##$TPNAME7= <>
##$TPOAL= (0..7)
0.5 0.5 0.5 0.5 0.5 0.5 0.5 0.5
##$TPOFFS= (0..7)
0 0 0 0 0 0 0 0
##$TUNHIN= 0
##$TUNHOUT= 0
##$TUNXOUT= 0
##$USERA1= <user>
##$USERA2= <user>
##$USERA3= <user>
##$USERA4= <user>
##$USERA5= <user>
##$V9= 5
##$VALIST= <valist>
##$VCLIST= <CCCCCCCCCCCCCCC>
##$VD= 0
##$VDLIST= <DDDDDDDDDDDDDDD>
##$VPLIST= <PPPPPPPPPPPPPPP>
##$VTLIST= <TTTTTTTTTTTTTTT>
##$WBST= 2048
##$WBSW= 25
##$XGAIN= (0..3)
0 0 0 0
##$XL= 0
##$YL= 0
##$YMAX_a= 6530034
##$YMIN_a= -11695715
##$ZGOPTNS= <>
##$ZL1= 120
##$ZL2= 120
##$ZL3= 120
##$ZL4= 120
##$ABSF1= 14.96098
##$ABSF2= -5.597201
##$ABSG= 5
##$ABSL= 3
##$ALPHA= 0
##$AQORDER= 0
##$ASSFAC= 0
##$ASSFACI= 0
##$ASSFACX= 0
##$ASSWID= 0
##$AUNMP= <proc_prof1d_extract.lims>
##$AXLEFT= 0
##$AXNAME= <>
##$AXNUC= <1H>
##$AXRIGHT= 0
##$AXTYPE= 0
##$AXUNIT= <>
##$AZFE= 0.1
##$AZFW= 0.1
##$BCFW= 0
##$BC_mod= 0
##$BYTORDP= 0
##$COROFFS= 0
##$CY= 15
##$DATMOD= 1
##$DC= 0
##$DFILT= <>
##$DTYPP= 0
##$F1P= 0
##$F2P= 0
##$FCOR= 0.5
##$FTSIZE= 131072
##$FT_mod= 6
##$GAMMA= 0
##$GB= 0
##$INTBC= 1
##$INTSCL= 1
##$ISEN= 128
##$LB= 0.3
##$LEV0= 0
##$LPBIN= 0
##$MAXI= 10000
##$MC2= 0
##$MEAN= 0
##$ME_mod= 0
##$MI= 0
##$NCOEF= 0
##$NC_proc= -2
##$NLEV= 6
##$NOISF1= 0
##$NOISF2= 0
##$NSP= 0
##$NTH_PI= 0
##$NZP= 0
##$OFFSET= 14.96098
##$PC= 1
##$PHC0= -89.8407
##$PHC1= 0
##$PH_mod= 1
##$PKNL= yes
##$PPARMOD= 0
##$PPDIAG= 0
##$PPIPTYP= 0
##$PPMPNUM= 2147483647
##$PPRESOL= 1
##$PSCAL= 4
##$PSIGN= 0
##$PYNMP= <proc.py>
##$REVERSE= no
##$SF= 400.020009644577
##$SI= 131072
##$SIGF1= 0
##$SIGF2= 0
##$SINO= 400
##$SIOLD= 131072
##$SPECTYP= <>
##$SREGLST= <1H.CDCl3>
##$SSB= 0
##$STSI= 131072
##$STSR= 0
##$SW_p= 8223.68421052631
##$SYMM= 0
##$S_DEV= 0
##$TDeff= 65536
##$TDoff= 0
##$TI= <>
##$TILT= no
##$TM1= 0
##$TM2= 0
##$TOPLEV= 0
##$USERP1= <user>
##$USERP2= <user>
##$USERP3= <user>
##$USERP4= <user>
##$USERP5= <user>
##$WDW= 1
##$XDIM= 131072
##$YMAX_p= 447993231
##$YMIN_p= -13525
##$CURPLOT= <Network HP LaserJet P1505>
##$CURPRIN= <$Network HP LaserJet P1505>
##$DFORMAT= <normdp>
##$LAYOUT= <+/1D_H.xwp>
##$LFORMAT= <normlp>
##$PFORMAT= <normpl>
##$SURQMSG= 1
$$ End of Bruker specific parameters
$$ ---------------------------------
##NTUPLES= NMR SPECTRUM
##VAR_NAME=  FREQUENCY,     SPECTRUM/REAL,   SPECTRUM/IMAG
##SYMBOL=    X,             R,               I
##VAR_TYPE=  INDEPENDENT,   DEPENDENT,       DEPENDENT
##VAR_FORM=  AFFN,          ASDF,            ASDF
##VAR_DIM=   131072,        131072,          131072
##UNITS=     HZ,            ARBITRARY UNITS, ARBITRARY UNITS
##FACTOR=    0.0627417313425164, 1,          1
##FIRST=     8223.62146879497, 2145,         -57011
##LAST=      0,             4258,            -56550
##MIN=       0,             -13525,          0
##MAX=       8223.62146879497, 447993231,    0
$$ Real data points
##PAGE= N=1
##DATA TABLE= (X++(R..R)), XYDATA
$$ [...]
63921C701106j69485j81556j88277j90919j90414j87372j82546j76577j69440
$$ 3701106 3531621 3350065 3161788 2970869 2780455 2593083 2410537 2233960 2064520
63912B064520j60700j50154j38023j24837j11534r9182q8240p8336o9070o0627
$$ 2064520 1903820 1753666 1615643 1490806 1379272 1280090 1191850 1113514 1044444 983817
63902I83817n3205m6461m0001l4033k9003k4977k1828j9619j8250j7096j5492
$$ 983817 930612 884151 844150 810117 781114 756137 734309 714690 696440 679344 663852
63891F63852j3410j1283r478q224p604p211o284m589k707j052Q25L428O408R145
$$ 663852 650442 639159 629681 621457 613853 606642 600358 595769 593062 592010 592835 596263 602671 611816
63877F11816J1674J4294J6708J8377J9537K1117K3700K7068L0480L3009L3946
$$ 611816 623490 637784 654492 672869 692406 713523 737223 764291 794771 827780 861726
63866H61726L3504L2773L2525L2455L2034L1418L0714K9070K5613K0884J6232
$$ 861726 895230 928003 960528 992983 1025017 1056435 1087149 1116219 1141832 1162716 1178948
63855A178948J1957P263J913l256p708j1948j6489k0958k4692k7586k9928l1942
$$ 1178948 1190905 1198168 1200081 1196825 1189117 1177169 1160680 1139722 1115030 1087444 1057516 1025574
63843A025574l3871l5918l7780l8684l8342l7453l6886l6578l5734l3910l1548
$$ 1025574 991703 955785 918005 879321 840979 803526 766640 730062 694328 660418 628870
63832F28870k9432k7796k6208k4261k2231k0748j9888j9023j7723j6277j4959
$$ 628870 599438 571642 545434 521173 498942 478194 458306 439283 421560 405283 390324
63821C90324j3390j1260r279q516q870r048q213o908o083n842n561m900m135l636
$$ 390324 376934 365674 356395 347879 339009 329961 321748 314840 308757 302915 297354 292454 288319 284683
63807B84683l383l069k557k066j854j828j690j515j774k621l506l764l380k867
$$ 284683 281300 278231 275674 273608 271754 269926 268236 266721 264947 262326 258820 255056 251676 248809
63793B48809k618k649k752k625k152j745k002k707k752j551l5M48j71r15j264
$$ 248809 246191 243542 240790 238165 236013 234268 232266 229559 226807 225256 225221 225669 225498 224583 223319
63778B23319j507j684j298l10M60L35l90r11q29l23J77K89j9l28k75j06k67n84
$$ 223319 221812 220128 218830 218520 218980 219315 218925 218014 217185 216862 217039 217328 217309 216981 216706 216600 216333 215749
63760B15749m84o4j26r33j653j487o90k5L11N77Q04Q74R50J213J300Q28K98O71
$$ 215749 215265 215201 215075 214142 212489 211002 210312 210287 210598 211175 211979 212853 213803 215016 216316 217144 217442 218113
63742B18113J901K788K623K242K722L677L750K595J288P69Q53J129J774K880L757
$$ 218113 220014 222802 225425 227667 230389 234066 237816 240411 241699 242468 243321 244450 246224 249104 252861
63727B52861L852L733M239N060N253M889M964N716O229N929N278M643L605J915
$$ 252861 256713 260446 264685 269745 274998 279887 284851 290567 296796 302725 308003 312646 316251 318166
63713C18166J50j245k630m231n329n266m489l843l416k886k372k090j654o97K47
$$ 318166 318316 317071 314441 310210 304881 299615 295126 291283 287867 284981 282609 280519 278865 278168 278415
63698B78415L92n1j41N51J673K794L639L919L603L136K771K139J174P24J323J991
$$ 278415 278807 278756 278615 279166 280839 283633 287272 291191 294794 297930 300701 302840 304014 304738 306061 308052
63682C08052J421m2j014j200j528k189k202j146J11Q63J484K310K789K515K142
$$ 308052 309473 309431 308417 307217 305689 303500 301298 300152 300263 301126 302610 304920 307709 310224 312366
63667C12366K459L240L802M076M309M162K969P59j611l357m349m864n070m948
$$ 312366 314825 318065 321867 325943 330252 334414 337383 338142 336531 333174 328825 323961 318891 313943
63653C13943m561m261m406m786m672l724k547j942j830j546r46n31m98m24k1M52
$$ 313943 309382 305121 300715 295929 291257 287533 284986 283044 281214 279668 278722 278191 277693 277269 277248 277700
63637B77700P95J283K170L191L886M130M178M332M709N205N692O261P082P954
$$ 277700 278495 279778 281948 285139 289025 293155 297333 301665 306374 311579 317271 323532 330614 338568
63623C38568Q424Q552R018J0140J1435J2617J4266J6637J8674J9368J9547K0943
$$ 338568 346992 355544 364562 374702 386137 398754 413020 429657 448331 467699 487246 508189
63611E08189K3699K6241K7597K8445K9552L0433L0035K7791K3578J7620J0823
$$ 508189 531888 558129 585726 614171 643723 674156 704191 731982 755560 773180 784003
63600G84003M534m60m102o255o719o073n482n335n118m825n458p694j1056j4793
$$ 784003 788537 788077 783975 777720 771001 764928 759446 754111 748993 744168 738710 731016 719960 705167
63586G05167j8517k1590k3102k3082k2718k2602k1795j9394j6056j3045j0630
$$ 705167 686650 665060 641958 618876 596158 573556 551761 532367 516311 503266 492636
63575D92636q332o115m282k728j172K63J429K672M283N830O753P171P516P834
$$ 492636 484304 478189 473907 471179 470007 470270 471699 474371 478654 484484 491237 498408 505924 513758
63561E13758Q056Q428R073R657J0090J1010J2873J5194J7384J9738K2778K6275
$$ 513758 521814 530242 539315 548972 559062 570072 582945 598139 615523 635261 658039 684314
63549F84314K9928L4330L9859M4749M5638M0453L0149J7629N643m204j1301j5558
$$ 684314 714242 748572 788431 833180 878818 919271 949420 967049 972692 968488 957187 941629
63537I41629j7011j5954j3321j0490q201o121l964k530l020n602r375j3497j7637
$$ 941629 924618 908664 895343 884853 876652 870531 866567 864037 861017 855415 846040 832543 814906
63524H14906k1466k4517k6609k7895k8455k8259k7481k6417k5181k3784k2347
$$ 814906 793440 768923 742314 714419 685964 657705 630224 603807 578626 554842 532495
63513E32495k0918j9319j7505j5708j3990j2058r949q331p545o914n705m327l702
$$ 532495 511577 492258 474753 459045 445055 432997 423048 414717 407172 400258 394553 390226 386524
63500C86524l824l857l470l063k817k447j970j847k164k392k162j638j014k85
$$ 386524 382700 378843 375373 372310 369493 367046 365076 363229 361065 358673 356511 354873 353859 353574
63486C53574L89O80P03J043J943K978L774M575N731O946P409O620M884L016J584
$$ 353574 353963 354643 355346 356389 358332 361310 365084 369659 375390 382336 389745 396365 401249 404265 405849
63471D05849M78o88j863k642l111l929n198n933n325m048l549m206n097n377n025
$$ 405849 406327 405639 403776 401134 398023 394094 388896 382963 377638 373590 370041 365835 360738 355361 350336
63456C50336m208k835j079M27J282J820K601L761N083O377P607Q817J0035J1174
$$ 350336 346128 343293 342214 342641 343923 345743 348344 352105 357188 363565 371172 379989 390024 401198
63442D01198J2116J3093J4721J7416K0999K5135K9673L3964L6228L4603K8891
$$ 401198 413314 426407 441128 458544 479543 504678 534351 568315 604543 639146 668037
63431F68037K0706J2010M132j976n669p062o809n086j446M080J0452J6641K2489
$$ 668037 688743 700753 704885 702909 697240 690178 683369 678283 676837 680917 691369 708010 730499
63418G30499K8043L2663L5523L6561L6213L4341L0176K3454J5071O558p80o173
$$ 730499 758542 791205 826728 863289 899502 933843 964019 987473 1002544 1009102 1008322 1002149
63406A002149r329j0472j0252r333q035o601n770o706j0080j5309k0974k5930
$$ 1002149 992820 982348 972096 962763 954728 948127 942357 935651 925571 910262 889288 863358
63394H63358k9714l2108l2929l2397l1173k9676k7751k5267k2631k0301j8200
$$ 863358 833644 801536 768607 736210 705037 675361 647610 622343 599712 579411 561211
63383E61211j6027j3795j1604r309o888m828l457k243m26J881L920N447O890Q451
$$ 561211 545184 531389 519785 510476 503588 498760 495303 493060 492634 494515 498435 503882 510772 519223
63369E19223R874J1127J2557J4204J5672J6845J8087J9593K1220K3140K5896K9451
$$ 519223 529097 540224 552781 566985 582657 599502 617589 637182 658402 681542 707438 736889
63357G36889L2840L5208L6509L6799L5388L1521K5500J8538J1614M990j163o217
$$ 736889 769729 804937 841446 878245 913633 945154 970654 989192 1000806 1005796 1004633 998416
63345I98416r402j0514j0150r252q420p782p550q402j0900j4696j8780k2462k5669
$$ 998416 989014 978500 968350 959098 950678 942896 935346 926944 916044 901348 882568 860106 834437
63332H34437k8273k9771k9808k8546k6254k3119j9585j6260j2956q484k243M060
$$ 834437 806164 776393 746585 718039 691785 668666 649081 632821 619865 611381 609138 613198
63320F13198P064M459k985j1973j8972k2275k2419k1062j9422j7715j5790j3833
$$ 613198 620262 624721 621736 609763 590791 568516 546097 525035 505613 487898 472108 458275
63308D58275j2266j1188j0291r224p821o132m485l438l334l879m377m424m173
$$ 458275 446009 434821 424530 415306 407485 401353 396868 393430 390096 386217 381840 377416 373243
63295C73243l886l523k944k370k313k999l940m318l798k816k036j650j385j067
$$ 373243 369357 365834 362890 360520 358207 355208 351268 346950 343152 340336 338300 336650 335265 334198
63281C34198q96j093j503j700j505j223j343j955k482k164q88N43J145P66J92
$$ 334198 333302 332209 330706 329006 327501 326278 324935 322980 320498 318334 317446 317989 319134 319900 320092
63266C20092K21Q34J344J240P11L25L60N84P01P97J208J990K736L021K868K762
$$ 320092 320313 321147 322491 323731 324442 324767 325127 325711 326412 327209 328417 330407 333143 336164 339032 341794
63250C41794L236M403N747O442O148N413N119N564O402P381Q635J0161J1579J2728
$$ 341794 345030 349433 355180 361622 367770 373183 378302 383866 390268 397649 406284 416445 428024 440752
63236D40752J4027J5856J7912J9612K0769K1568K2113K2518K3079K3900K4454
$$ 440752 454779 470635 488547 508159 528928 550496 572609 595127 618206 642106 666560
63225F66560K4116K3054K2073K1642K1534K1466K1568K2006K2602K3038K3245
$$ 666560 690676 713730 735803 757445 778979 800445 822013 844019 866621 889659 912904
63214I12904K3291K2998K1810J9195J5181J0398N443K82n433j1525j7239k2112
$$ 912904 936195 959193 981003 1000198 1015379 1025777 1031220 1031502 1026069 1014544 997305 975193
63202I75193k6311k9859l2138l2606l1633l0043k8252k6285k4197k1816j8511
$$ 975193 948882 919023 886885 854279 822646 792603 764351 738066 713869 692053 673542
63191F73542j4014r242n484k888m86K378N431Q226J0710J2886J4664J6189J7673
$$ 673542 659528 650286 644802 641914 641428 643806 649237 657463 668173 681059 695723 711912 729585
63178G29585J8818J9087J8669J8450J8815J9193J9142J9114J9604K0133J9701
$$ 729585 748403 767490 786159 804609 823424 842617 861759 880873 900477 920610 940311
63167I40311J7951J5397J2662R905O810K923j882p106j2059j6691k1571k6821
$$ 940311 958262 973659 986321 996226 1003036 1005959 1004077 996971 984912 968221 946650 919829
63155I19829l1470l4249l4852l4037l2728l1309k9726k7869k5831k3874k2155
$$ 919829 888359 854110 819258 785221 752493 721184 691458 663589 637758 613884 591729
63144E91729k0471j8465j6068j3600j1386r485p879o651n864n392m973m366l502
$$ 591729 571258 552793 536725 523125 511739 502254 494375 487724 481860 476468 471495 467129 463627
63131D63627k595k049j976j929j438o81k32k06p4N62J540K532L390L892L641K649
$$ 463627 461032 458983 457007 455078 453640 452959 452727 452521 452447 453009 454549 457081 460471 464363 468004 470653
63115D70653J659J465K032K617K653K251J868J811K031K233K097J522P43K36L29
$$ 470653 472312 473777 475809 478426 481079 483330 485198 487009 489040 491273 493370 494892 495635 495871 496200
63100D96200Q32J097O31l54j166j425j328j124o70J88J158J741J773J538J454
$$ 496200 497032 498129 498760 498406 497240 495815 494487 493363 492693 492881 494039 495780 497553 499091 500545
63085E00545J815K553L100K857K048J648K194L132L785M329N180N970N978N335
$$ 500545 502360 504913 508013 510870 512918 514566 516760 519892 523677 528006 533186 539156 545134 550469
63071E50469M979N515O803Q467J0114J1212J1584J1869J2793J4181J5411J6622
$$ 550469 555448 560963 567766 576233 586347 597559 609143 621012 633805 647986 663397 680019
63059F80019J8461K0805K2844K4522K6746K9946L3518L6968M0503M4075M6906
$$ 680019 698480 719285 742129 766651 793397 823343 856861 893829 934332 978407 1025313
63048A025313M8695N0322N2573N4849N6007N5921N5359N4695N3651N2198N0988
$$ 1025313 1074008 1124330 1176903 1231752 1287759 1343680 1399039 1453734 1507385 1559583 1610571
63037A610571N0725N1404N2318N2705N2445N2045N1677N0381M6751M0425L2332
$$ 1610571 1661296 1712700 1765018 1817723 1870168 1922213 1973890 2024271 2071022 2111447 2143779
63026B143779K3362J3426K091j0476k3534l6281m7975n7893o5539p0728p3481
$$ 2143779 2167141 2180567 2182658 2172182 2148648 2112367 2064392 2006499 1940960 1870232 1796751
63015A796751p4077p3088p0773o6621o0165n2213m4394l7425l0695k3704j6858
$$ 1796751 1722674 1649586 1578813 1512192 1452027 1399814 1355420 1317995 1287300 1263596 1246738
63004A246738j0466m003K975R911J5902K0627K4171K6637K8445L0331L2455L4148
$$ 1246738 1236272 1232269 1235244 1245155 1261057 1281684 1305855 1332492 1360937 1391268 1423723 1457871
62992A457871L5055L5833L7085L8294L8574L7848L6588L4883L2499K9371K5327
$$ 1457871 1492926 1528759 1565844 1604138 1642712 1680560 1717148 1752031 1784530 1813901 1839228
62981A839228J9788J2440L846n264j4769k4655l4247m2760n0161n6737o2185o5835
$$ 1839228 1859016 1871456 1875302 1870038 1855269 1830614 1796367 1753607 1703446 1646709 1584524 1518689
62969A518689o7441o7124o5050o1882n8858n6479n3659m9251m3986l9731l7017
$$ 1518689 1451248 1384124 1319074 1257192 1198334 1141855 1088196 1038945 994959 955228 918211
62958I18211l4657l1771k8892k6719k4961k3007k0954j9373j8497j8066j7656
$$ 918211 883554 851783 822891 796172 771211 748204 727250 707877 689380 671314 653658
62947F53658j6908j5713j4367j3269j2424j1546j0635r977r637r303q817q364
$$ 653658 636750 621037 606670 593401 580977 569431 558796 548819 539182 529879 521062 512698
62935E12698q085p715o833n332l590k304k009k599l450m049m273m073l304k239
$$ 512698 504613 496898 490065 484733 481143 478839 476830 474231 470781 466732 462459 458386 455082 452843
62921D52843j611j749k056j811j156o92o20p71j162j822k403k637k885l492l910
$$ 452843 451232 449483 447427 445616 444460 443768 443148 442377 441215 439393 436990 434353 431468 427976 424066
62906D24066l393k341j934k381k606j853p15p6R5L33O67O78K54k61n94p29o67
$$ 424066 420673 418332 416398 414017 411411 409558 408843 408767 408862 409195 409862 410540 410794 410533 409939 409210 408543
62889D08543l95j47l16r17j328q74K87J218J312J024J152J667J847J440R88Q99
$$ 408543 408148 408001 407685 406768 405440 404566 404853 406071 407383 408407 409559 411226 413073 414513 415501 416400
62873D16400R07P03M00J13l40r24j256j287j439j674j336m17p8j021k155k006
$$ 416400 417307 418010 418410 418523 418183 417259 416003 414716 413277 411603 410267 409850 409772 408751 406596 404590
62857D04590p57J95L33L33O41R34J086J476K170K679K728K515K082J199j2r89
$$ 404590 403833 404028 404361 404694 405335 406269 407355 408831 411001 413680 416408 418923 421005 422204 422192 421203
62841D21203j397j348j033o35m95p21q02k98L13K33m44r51j082j209j238o08O03
$$ 421203 419806 418458 417425 416790 416295 415574 414772 414474 414787 415020 414576 413625 412543 411334 410096 409488 410091
62824D10091J588J975K114K099J588Q40Q41J976L435M311M527M335L829L365L547
$$ 410091 411679 413654 415768 417867 419455 420295 421136 423112 426547 430858 435385 439720 443549 446914 450461
62809D50461M339M913M868M828N439O506P608Q796J0093J1050J1299J1005J0351
$$ 450461 454800 459713 464581 469409 474848 481354 488962 497758 507851 518901 530200 541205 551556
62796E51556R364Q616R208J1357J3914J6009J8278K1550K5231K8231L0834L4219
$$ 551556 560920 569536 578744 590101 604015 620024 638302 659852 685083 713314 744148 778367
62784G78367L8498M2678M6571N1283N7381O3848O9500P4525P9825Q5350Q9930
$$ 778367 816865 859543 906114 957397 1014778 1078626 1148126 1222651 1302476 1387826 1477756
62773A477756R2544R3097R1892Q8800Q3163P4410O2632M8658L3527J7887J880
$$ 1477756 1570300 1663397 1755289 1844089 1927252 2001662 2064294 2112952 2146479 2164366 2166246
62762B166246j4455l0603m5434n7742o7126p4294q0200q4870q7424q7313q5176
$$ 2166246 2151791 2121188 2075754 2018012 1950886 1876592 1796392 1711522 1624098 1536785 1451609
62751A451609q2155p8729p4638o9708o4304n8980n4082m9716m5768m1867l7675
$$ 1451609 1369454 1290725 1216087 1146379 1082075 1023095 969013 919297 873529 831662 793987
62740G93987l3366k9524k6412k3615k0624j7578j5069j3302j1769r909p788o055
$$ 793987 760621 731097 704685 681070 660446 642868 627799 614497 602728 592819 585031 578976
62728E78976n242n247n368m851l564k163j325q04L66K548M815O020O217O424P264
$$ 578976 573734 568487 563119 558268 554704 552541 551216 550412 550778 553326 558141 564161 570378 576802 584066
62713E84066Q568J0161J2178J4426J6279J7609J9213K1901K5576K9555L3303L6579
$$ 584066 592634 602795 614973 629399 645678 663287 682500 704401 729977 759532 792835 829414
62701H29414L9484M2726M7253N3103N9123O4290O8729P2953P6730P9327Q0324
$$ 829414 868898 911624 958877 1011980 1071103 1135393 1204122 1277075 1353805 1433132 1513456
62690A513456P9408P5961O9656O1099N0978L9038K4846R219o190k0584l4221m6960
$$ 1513456 1592864 1668825 1738481 1799580 1850558 1889596 1914442 1923661 1917471 1896887 1862666 1815706
62678A815706n7705o5585p0882p4407p6543p7152p6001p3164o9336o5564o2186
$$ 1815706 1758001 1692416 1621534 1547127 1470584 1393432 1317431 1244267 1174931 1109367 1047181
62667A047181n8403n3506m8191m3776m0365l6841l2584k8160k4243k0971j8536
$$ 1047181 988778 935272 887081 843305 802940 766099 733515 705355 681112 660141 641605
62656F41605j7292j6855j6084j4502j2878j1983j1505j0751r689q715p929p228
$$ 641605 624313 607458 591374 576872 563994 552011 540506 529755 520066 511351 503422 496194
62644D96194o646o124n304m086k977k524k601k642k292j658j136j140j727k358
$$ 496194 489548 483424 478120 474034 471057 468533 465932 463290 460998 459340 458204 457064 455337 452979
62630D52979k435k020j658j496j152n36j33k57n86o31k65L59R76J216R75Q49J545
$$ 452979 450544 448524 446866 445370 444218 443682 443549 443292 442706 442075 441810 442169 443145 444361 445336 446185 447730
62613D47730K832L673L576L102K961L266L980N270P031Q669R806J0820J2349J4623
$$ 447730 450562 454235 457811 460913 463874 467140 471120 476390 483421 492090 501896 512716 525065 539688
62599E39688J7459K0512K3448K6232K9275L2827L6385L9287M1666M3909M5421
$$ 539688 557147 577659 601107 627339 656614 689441 725826 765113 806779 850688 896109
62588H96109M5092M3014M0455L7802L3848K7715K0214J2530M634l987j2886k0954
$$ 896109 941201 984215 1024670 1062472 1096320 1124035 1144249 1156779 1161413 1157426 1144540 1123586
62576A123586k7627l2948l6875l9371m0745m1263m0819l9504l8003l6732l5137
$$ 1123586 1095959 1063011 1026136 986765 946020 904757 863938 824434 786431 749699 714562
62565G14562l2557k9374k6528k4282k2179j9920j7611j5372j3361j1900j1052
$$ 714562 682005 652631 626103 601821 579642 559722 542111 526739 513378 501478 490426
62554D90426j0238q866p118n696m960m704m506l916k664j135k93o19j457j747
$$ 490426 480188 471322 464204 458508 453548 448844 444338 440422 437758 436623 436330 435711 434254 432507
62540D32507j160j14R15J607J760J471J165J058R30P32R47J937L313M449N296
$$ 432507 431347 431233 432148 433755 435515 436986 438151 439209 440139 440871 441818 443755 447068 451517 456813
62525D56813O232P462Q932J0547J2182J3742J5546J8083K1219K4160K6575K9106
$$ 456813 463045 470507 479439 489986 502168 515910 531456 549539 570758 594918 621493 650599
62513F50599L2301L5674L8405M0365M1901M2991M3310M2695M1004L7812L2853
$$ 650599 682900 718574 756979 797344 839245 882236 925546 968241 1009245 1047057 1079910
62502A079910K6448J9121J1130K752n417j2839j9322k4526k7857k9265k9585k9491
$$ 1079910 1106358 1125479 1136609 1139361 1133944 1121105 1101783 1077257 1049400 1020135 990550 961059
62490I61059k8659k6516k3273j9613j5805j1847q012m643j648J226L850N731O215
$$ 961059 932400 905884 882611 862998 847193 835346 827334 822691 821043 822269 826119 831850 838065
62477H38065M594Q16l600o393o967p229r296j3202j7486k1153k4000k5813k6455
$$ 838065 842659 843475 839875 833482 826515 819286 809990 796788 779302 758149 734149 708336 681881
62464F81881k6377k6102k5508k4339k2908k1480j9597j6898j3998j1696r852p969
$$ 681881 655504 629402 603894 579555 556647 535167 515570 498672 484674 472978 463126 455157
62452D55157o294n256m457l334k249j779j464n66N29R98J217K192L656M299L863
$$ 455157 448863 443607 439150 435816 433567 431788 430324 429758 430287 431285 432502 434694 438350 442649 446512
62437D46512L469L692L746K933J576J72j274k675l601m032m485n095n325m936
$$ 446512 449981 453673 457419 460352 461928 462100 460826 458151 454550 450518 446033 440938 435613 430677
62423D30677m415m275m536n091n832o298n948m912l932l476l492l820m161l805
$$ 430677 426262 421987 417451 412360 406528 400230 394282 389370 385438 381962 378470 374650 370489 366684
62409C66684k431r73p09j476j867j198k42J99K85M29O19Q55J382K064K295J873
$$ 366684 364253 363280 362571 361095 359228 358030 357788 357987 358272 358701 359320 360175 361557 363621 365916 367789
62393C67789J329J124J217J533K122K683K812K834L537M912N971O147N902N743
$$ 367789 369118 370242 371459 372992 375114 377797 380609 383443 386980 391892 397863 404010 409912 415655
62379D15655N591N538O149P471Q546Q682Q484Q955J0145J1404J2442J3459J4473
$$ 415655 421246 426784 432933 440404 448950 457632 466116 475071 485216 496620 509062 522521 536994
62366E36994J5310J6133J7458J9587K2377K5540K9021L2971L7474M2341M7247
$$ 536994 552304 568437 585895 605482 627859 653399 682420 715391 752865 795206 842453
62355H42453N1975N6176N8889N8957N6206N1656M6053L8909K9796J9944J1446
$$ 842453 894428 950604 1009493 1068450 1124656 1176312 1222365 1261274 1291070 1311014 1322460
62344A322460N059k60n729j1623j7653k3505k8861l3586l7820m1298m2972m2202
$$ 1322460 1327519 1327259 1321530 1309907 1292254 1268749 1239888 1206302 1168482 1127184 1084212 1042010
62332A042010m0035l8124l6684l4658l1739k8761k6150k3464k0805j9201j9046
$$ 1042010 1001975 963851 927167 892509 860770 832009 805859 782395 761590 742389 723343
62321G23343j9388j9320j9046j8970j8825j8266j7447j6421j4829j2793j1210
$$ 723343 703955 684635 665589 646619 627794 609528 592081 575660 560831 548038 536828
62310E36828j0598j0373r813q980q215p431o451n379m219k833j523r14q80m91
$$ 536828 526230 515857 506044 497064 488849 481418 474967 469588 465369 462536 461013 460099 459219 458728
62296D58728N16J216Q89Q1l30k74m1N18J546K545K912K721K473K429K590K867
$$ 458728 459244 460460 461349 461430 461100 460826 460785 461303 462849 465394 468306 471027 473500 475929 478519 481386
62280D81386L010K855K753L212M043M543M585M655M870M995N446O979R227J0966
$$ 481386 484396 487251 490004 493216 497259 501802 506387 511042 515912 520907 526353 533332 542559 553525
62266E53525J2117J3991J7047K0076K2383K5140K9422L4429L8955M3270M8105
$$ 553525 565642 579633 596680 616756 639139 664279 693701 728130 767085 810355 858460
62255H58460N2907N6709N9735O2471O3865O2132N7045M9938M1807L2822K3397
$$ 858460 911367 968076 1027811 1090282 1154147 1216279 1273324 1323262 1365069 1397891 1421288
62244A421288J4322N841k252r718j6147k1919k7857l4013l9808m5020m9591n2664
$$ 1421288 1435610 1441451 1439199 1429481 1413334 1391415 1363558 1329545 1289737 1244717 1195126 1142462
62232A142462n3164n1291m8436m5515m2437l9151l6196l3941l2119l0295k8178
$$ 1142462 1089298 1038007 989571 944056 901619 862468 826272 792331 760212 729917 701739
62221G01739k5554k2539j9903j8326j7413j6136j4167j2107j0479r265q382p822
$$ 701739 676185 653646 633743 615417 598004 581868 567701 555594 545115 535850 527468 519646
62209E19646p321o584n798n320m994m409l654l059k448j409j78O47J125J869L021
$$ 519646 512325 505741 499943 494623 489629 485220 481566 478507 476059 474650 474472 475119 476244 478113 481134
62194D81134M211N493P261R265J0639J1097J1214J1360J1275J0924J0772J0895
$$ 481134 485345 490838 498099 507364 518003 529100 540314 551674 562949 573873 584645 595540
62182E95540J0694R942R283R143Q881P646N591L639K506K510L925O809J0588J4394
$$ 595540 606234 616176 625459 634602 643483 651129 656720 660359 662865 665375 669300 676109 686697 701091
62168G01091J7911K1558K5751L0242L4361L7769M0661M3049M4096M2642L8478
$$ 701091 719002 740560 766311 796553 830914 868683 909344 952393 996489 1039131 1077609
62157A077609L2524K5650J7960R713K115l657p836j1583j5448j9261k3241k7918
$$ 1077609 1110133 1135783 1153743 1163456 1165571 1161914 1154078 1142495 1127047 1107786 1084545 1056627
62145A056627l2800l6327l7634l7333l6124l3678k9641k4897k0785j7575j4720
$$ 1056627 1023827 987500 949866 912533 876409 842731 813090 788193 767408 749833 735113
62134G35113j2203j0530r494q134o181m574l980l638k397l17J680L369N492Q348
$$ 735113 722910 712380 702886 694752 688571 683997 680017 676379 673982 673665 675345 678714 684206 692554
62120F92554J1169J3243J4828J6242J6757J5281J1942Q057M650J851j61o75N84
$$ 692554 703723 716966 731794 748036 764793 780074 792016 800073 804723 806574 806413 805738 806322
62107H06322K517L335J931j525n955r954j2399j2929j1862r684o860m009j693
$$ 806322 808839 812174 814105 812580 806625 796671 784272 771343 759481 749797 742937 738928 737235
62094G37235J95K219M443O154O866P013P306P823Q161Q100P816P706Q224R505
$$ 737235 737430 739649 744092 750246 757112 764125 771431 779254 787415 795515 803331 811037 819261 828766
62080H28766J0951J1763J2012J2705J4440J6662J8522J9777K0493K0566K0163
$$ 828766 839717 851480 863492 876197 890637 907299 925821 945598 966091 986657 1006820
62069A006820J9975K0412K1028K1284K1382K1773K2433K3187K4132K4955K4403
$$ 1006820 1026795 1047207 1068235 1089519 1110901 1132674 1155107 1178294 1202426 1227381 1251784
62058A251784K1383J6292J0544N052m7m565q026j0299j1875j3618j6495k1026
$$ 1251784 1273167 1289459 1300003 1305055 1305008 1300443 1292417 1282118 1270243 1256625 1240130 1219104
62046A219104k6527l1432l4908l7585m0047m1471m0795l8599l6530l5198l3827
$$ 1219104 1192577 1161145 1126237 1088652 1048605 1007134 966339 927740 891210 856012 822185
62035H22185l1823k9478k7139k4755k2390k0248j8114j5607j2982j0806q933o783
$$ 822185 790362 760884 733745 708990 686600 666352 648238 632631 619649 608843 599910 593127
62023E93127m658l658m102n043n626n956o299o456o414o726p529p887o853m730
$$ 593127 588469 584811 580709 575666 570040 564084 557785 551329 544915 538189 530660 522773 515920 511190
62009E11190k658j204j08Q92J596J924K388L586N341O650O699N739M623L685K572
$$ 511190 508532 507328 507220 508112 509708 511632 514020 517606 522947 529597 536296 542035 546658 550343 552915
61994E52915J191P5m74r65j961l377m937o784q909j0625j1325j1316j1172j0727
$$ 552915 554106 554181 553707 552742 550781 547404 542467 535683 526774 516149 504824 493508 482336 471609
61980D71609r623q280p366o589n200l468k529k708l039k608j532m72R5N5k06P2
$$ 471609 461986 453706 446340 439751 434551 431083 428554 425846 422807 420199 418667 418195 418290 418345 418139 418211
61964D18211J112K015J854J122J029J669K013J727J646K254K995L414L867M568
$$ 418211 419323 421338 423192 424314 425343 427012 429025 430752 432398 434652 437647 441061 444928 449496
61950D49496N060N194N693P091Q877J0314J1454J2793J4568J6905J9953K3337
$$ 449496 454556 459750 465443 472534 481411 491725 503179 515972 530540 547445 567398 590735
61938E90735K6062K7515K8095K8411K8364K7625K6460K5455K4703K3748K2138
$$ 590735 616797 644312 672407 700818 729182 756807 783267 808722 833425 857173 879311
61927H79311J9692J6510J3023R710O495K728j918o845j0984j3627j4649j4266
$$ 879311 899003 915513 928536 938246 944741 947469 945551 938706 927722 914095 899446 885180
61915H85180j2736j0130o392j895K378N746Q774J2569J7124K1208K3868K5185
$$ 885180 872444 862314 855922 854027 856405 862151 870925 883494 900618 921826 945694 970879
61903I70879K5243K3465J9494J4003P980J805m434j0196j4810j8278k1149k3740
$$ 970879 996122 1019587 1039081 1053084 1061064 1062869 1058435 1048239 1033429 1015151 994002 970262
61891I70262k5784k6794k6600k5564k4321k3044k1193j8387j5415j3662j3543
$$ 970262 944478 917684 891084 865520 841199 818155 796962 778575 763160 749498 735955
61880G35955j4178j4694j4989j5001j4266j2684j0990r812q811p418n883m877
$$ 735955 721777 707083 692094 677093 662827 650143 639153 629341 620530 613112 607229 602352
61868F02352m381l658k197j68J989L985N733P212Q428R466J0730J2894J6267K0236
$$ 602352 597971 594313 592116 591948 593937 597922 603655 610867 619295 628761 639491 652385 668652 688888
61854F88888K3883K7161L0847L5247L9632M3238M6041M8201M9371M9188M7899
$$ 688888 712771 739932 770779 806026 845658 888896 934937 983138 1032509 1081697 1129596
61843A129596M5790M2302L6448K8180J8803R919K160m863j1588j7559k1609k2946
$$ 1129596 1175386 1217688 1254136 1282316 1301119 1311038 1313198 1308335 1296747 1279188 1257579 1234633
61831A234633k1833j9008j4824r378l213K811Q321J3498J8189K1524K2528K0779
$$ 1234633 1212800 1193792 1178968 1169590 1166377 1169188 1177509 1191007 1209196 1230720 1253248 1274027
61819A274027J6391R817J808o837j5572k3947l1408l7689m3116m7807n0857n1176
$$ 1274027 1290418 1300235 1302043 1295206 1279634 1255687 1224279 1186590 1143474 1095667 1044810 993634
61807I93634m9066m6097m3347m0638l7565l4241l0799k7127k3515k0711j8870
$$ 993634 944568 898471 855124 814486 776921 742680 711881 684754 661239 640528 621658
61796F21658j7199j5072j2828j1047r742q645p784p204o670n948n027l924k740
$$ 621658 604459 589387 576559 565512 555770 547125 539341 532137 525467 519519 514492 510568 507828
61783E07828j973k054k485k264j286m44k61l79o08j262k019j792m34O17L21l64
$$ 507828 505855 503801 501316 499052 497766 497322 497061 496682 496074 494812 492793 491001 490567 491184 491505 491141
61767D91141K0J262K038K005J998K443K808K617K104J732J748K155K674K793K279
$$ 491141 491161 492423 494461 496466 498464 500907 503715 506332 508436 510168 511916 514071 516745 519538 521817
61752E21817J502Q70K48o67j711k447k706k553k054j411j051j126j254j075p29
$$ 521817 523319 524189 524437 523770 522059 519612 516906 514353 512299 510888 509837 508711 507457 506382 505653
61737E05653n46o20r03j276j312n65O39J390J443J553K136K489J980J214J226
$$ 505653 505107 504487 503584 502308 500996 500431 501070 502460 503903 505456 507592 510081 512061 513275 514501
61722E14501K077L033L647L911L773L285K859K744K587K031J328P41q6j513l044
$$ 514501 516578 519611 523258 527169 530942 534227 537086 539830 542417 544448 545776 546517 546431 544918 541874
61707E41874l888l998l922l944m005m155m396m423m118l955m310m710m406l338
$$ 541874 537986 533988 530066 526122 522117 517962 513566 509143 505025 501070 496760 492050 487644 484306
61693D84306k052j024n97j047k042k536j984j235j379k134k275j436n71o45j557
$$ 484306 482254 481230 480633 479586 477544 475008 473024 471789 470410 468276 466001 464565 463994 463349 461792
61678D61792k401k290j064L82P38l14j660k140j897j752j814j511p36r0j49r68
$$ 461792 459391 457101 456037 456419 457157 456843 455183 453043 451146 449394 447580 446069 445333 445243 445094 444126
61662D44126k122k777k178o24N22M39q6Q2O93O17l42j205j138j90J205K594L519
$$ 444126 442004 439227 437049 436425 436947 437386 437300 437382 438075 438692 438350 437145 436007 435817 437022 439616 443135
61645D43135L911M345N230O074O128N483M728L948K945K003J483Q80n93k639m158
$$ 443135 447046 451391 456621 462695 468823 474306 479034 482982 485927 487930 489413 490293 489700 487061 482903
61630D82903m805n178n562n508m871m190l809l450k956k663k709k700k313j742
$$ 482903 478098 472920 467358 461850 456979 452789 448980 445530 442574 439911 437202 434502 432189 430447
61616D30447j253q68o31p44j263j965k637l193l672m321n394o550o929o329n773
$$ 430447 429194 428326 427695 426951 425688 423723 421086 417893 414221 409900 404506 397956 391027 384698 378925
61601C78925o143o812o601n599m944n009n073m731m391m224l765k882k179j982
$$ 378925 372782 365970 359369 353770 348826 343817 338744 334013 329622 325398 321633 318751 316572 314590
61587C14590j784j113k66J96J61j92p00j196j564j983k613l096k893k137j454
$$ 314590 312806 311693 311427 311623 311784 311592 310892 309696 308132 306149 303536 300440 297547 295410 293956
61572B93956j038o10k47m04r56j142p50m92q31j233j022l29K74N56N73L56P6J41
$$ 293956 292918 292308 292061 291657 290701 289559 288809 288317 287486 286253 285231 284902 285176 285732 286305 286661 286737 286878
61554B86878O62J106R81M95K62N31J013J384J561J599J490J144O20K70M91J123
$$ 286878 287540 288646 289627 290122 290384 290915 291928 293312 294873 296472 297962 299106 299726 299996 300487 301610
61538C01610J414Q46j36n21K70J952L665M447L763K059N48N1K78N30O30O08J01
$$ 301610 303024 303870 303734 303213 303483 305435 309100 313547 317310 319369 319917 319968 320246 320776 321406 322014 322115
61521C22115j087k177k141j142l41k69l58j13J16j50p43j193j328j200q39l42
$$ 322115 321028 318851 316710 315568 315227 314958 314600 314487 314603 314453 313710 312517 311189 309989 309150 308808
61505C08808Nn9n38j171j509j218n03m0k25p64j225j564j743j356k19J028J564
$$ 308808 308813 308754 308216 307045 305536 304318 303815 303775 303550 302786 301561 299997 298254 296898 296679 297707 299271
61488B99271J348Q76M19L6m2K39M45L14L47R86J713J822J612J822K258K084J225
$$ 299271 300619 301495 301914 301950 301908 302147 302592 302906 303253 304239 305952 307774 309386 311208 313466 315550 316775
61471C16775M13j3k95m51l15j93m30m74L74J506J537L95m95l17J81K19K06Q10
$$ 316775 317188 317175 316880 316429 316114 315921 315491 315017 315391 316897 318434 318829 318334 318017 318198 318417 318623 319433
61453C19433J791K422K416J938J254P02M64K62j67l18N95K300L523L576L084K942
$$ 319433 321224 323646 326062 328000 329254 329956 330420 330682 330515 330197 330792 333092 336615 340191 343275 346217
61437C46217L288L776M178M434M609M902N255N092M068K806K129J841J210M29
$$ 346217 349505 353281 357459 361893 366502 371404 376659 381751 385819 388625 390754 392595 393805 394234
61423C94234M12J285K267K955L559L849L224K011J355J479J287R1j439k485l111
$$ 394234 394646 395931 398198 401153 404712 408561 411785 413796 415151 416630 417917 418008 416569 414084 410973
61408D10973l621l910l961m066m165l869l393l467m039m109l193j984j223r55
$$ 410973 407352 403442 399481 395415 391250 387381 383988 380521 376482 372373 369180 367196 365973 365018
61394C65018j131j747k139j381K18J207R40K36k66q64j492j251l2Q47O26L96J282
$$ 365018 363887 362140 360001 358620 358838 360045 360985 361221 360955 360091 358599 357348 357316 358163 358789 359185 360467
61377C60467K615L065K595K076J858J814K064K575K714K143J543J581J904J936
$$ 360467 363082 366147 368742 370818 372676 374490 376554 379129 381843 383986 385529 387110 389014 390950
61363C90950J909K240K690K964L421M288N025N306N811P092Q464R080R277R795
$$ 390950 392859 395099 397789 400753 404174 408462 413487 418793 424604 431696 440160 449240 458517 468312
61349D68312J0392J0384R845R163Q046O278M858M971O132O707O107N299N134N358
$$ 468312 478704 489088 498933 508096 516142 522420 527278 532249 538381 545088 551195 556494 561628 566986
61335E66986N378M962L997K253j87k758m786n893o140n978n838n615m956m104
$$ 566986 572364 577326 581323 583576 583389 580631 575845 569952 563812 557834 551996 546381 541425 537321
61321E37321l799m070m009l075j893j243j072j028j118j166m91J068K626L482
$$ 537321 533522 529452 525443 522368 520475 519232 518160 517132 516014 514848 514357 515425 518051 521533
61307E21533M179N514P244Q594R331R374Q153N428K200k04j515k225k578k741
$$ 521533 525712 531226 538470 547064 556395 565769 573922 579350 581550 581346 579831 577606 575028 572287
61293E72287l338m631n757n761m954m264l762k938j982j635k017k570k928k950
$$ 572287 568949 564318 558561 552800 547846 543582 539820 536882 534900 533265 531248 528678 525750 522800
61279E22800k218n07J521K882L386L517L611L866M508N217N068L953L311M340
$$ 522800 520582 520075 521596 524478 527864 531381 534992 538858 543366 548583 553651 557604 560915 565255
61265E65255O174P155P263P894R586J1497J2942J3972J4479J4047J2852J1556
$$ 565255 571429 578584 585847 593741 603327 614824 627766 641738 656217 670264 683116 694672
61253F94672J0215Q331O017M028K564J035r39l169n541q059j0289j1604j1988
$$ 694672 704887 713218 719235 723263 725827 726862 725923 722754 717213 709154 698865 687261 675273
61240F75273j1773j0869r200p627p227p750p973p553p200p022o089m072k025r35
$$ 675273 663500 652631 643431 635804 628577 620827 612854 605301 598101 591079 584990 580918 578893 577958
61226E77958n00P2Q44J321J265Q27L86M28J191K223K892L227L666L990L413J927
$$ 577958 577458 577530 578374 579695 580960 581787 582173 582601 583792 586015 588907 592134 595800 599790 603203 605130
61210F05130N95J97L90N32O28R15J206J224J250J913L519N837Q336J0421J1764
$$ 605130 605725 605922 606312 606844 607472 608387 609593 610817 612067 613980 617499 623336 631672 642093 653857
61195F53857J2585J3454J4586J5479J5381J3996J1740R335P194N254L502K372
$$ 653857 666442 679896 694482 709961 725342 739338 751078 760413 767607 772861 776363 778735
61183G78735K199K371J743R6j585k502k989l570m021m031m108m892o084o883p109
$$ 778735 780934 783305 785048 785144 783559 781057 778068 774498 770477 766446 762338 757446 751362 744479 737370
61168G37370p116p046p003p528q960j0587j1349j1223j1092j1360j1469j0743
$$ 737370 730254 723208 716205 708677 699717 689130 677781 666558 655466 644106 632637 621894
61156F21894r102o983n070l819k913j553L57J902K419K229J560k54l503o908q934
$$ 621894 612792 605809 600739 596920 594007 592454 592811 594713 597132 599361 600921 600667 597164 590256 581322
61141E81322r663j0099j0293r529p936o429n240l852k260j046k23P74J976K868
$$ 581322 571659 561560 551267 541738 533802 527373 522133 518281 516021 514975 514752 515526 517502 520370
61127E20370L443M208N223O215P438R386J1712J3629J5157J6774J8049J8035J7089
$$ 520370 523813 528021 533244 539459 546897 556283 567995 581624 596781 613555 631604 649639 666728
61114F66728J6798J7833J9133J9566J9245J8763J8204J7337J6122J4623J2986
$$ 666728 683526 701359 720492 740058 759303 778066 796270 813607 829729 844352 857338
61103H57338J1477R935P422L332j395n132p481r280j0975j2282j3395j5054j7216
$$ 857338 868815 878750 886172 889504 888109 882977 875496 866216 855241 842959 829564 814510 797294
61090G97294j8860j9401j9188j8465j7026j5161j3769j3087j2365j1114r762q793
$$ 797294 778434 759033 739845 721380 704354 689193 675424 662337 649972 638858 629096 620303
61078F20303q157p713p379o674n164l470k740k940k728j322N56J951K781L326
$$ 620303 612146 604433 597054 590380 585216 581746 579006 576066 573338 572016 572572 574523 577304 580630
61064E80630L574L632L924M565N148N497O025P055Q362R528J0295J0572J0667
$$ 580630 584204 587836 591760 596325 601473 606970 612995 620050 628412 637940 648235 658807 669474
61051F69474J1317J2864J4646J5919J6926J8308J9905K1185K2392K4114K6066
$$ 669474 680791 693655 708301 724220 741146 759454 779359 800544 822936 847050 873116
61040H73116K7488K8412K9387L0387L1239L2619L5171L8162M0464M2366M4770
$$ 873116 900604 929016 958403 988790 1020029 1052648 1087819 1125981 1166445 1208811 1253581
61029A253581M7262M8813M9758N1059N2134N1821N1112N2490N6688O2589P0053
$$ 1253581 1300843 1349656 1399414 1450473 1502607 1554428 1605540 1658030 1714718 1777307 1847360
61018A847360P9922R1217J01433J10127J19500J31224J45893J65901J95198K35494
$$ 1847360 1927282 2018499 2119932 2230059 2349559 2480783 2626676 2792577 2987775 3223269
61008C223269K86236L48671M25297N14940O14985P30895Q77075J065715J303400
$$ 3223269 3509505 3858176 4283473 4798413 5413398 6144293 7021368 8087083 9390483
60999I390483J599970J956477K314368K521743K397082J873189J086955L08308
$$ 9390483 10990453 12946930 15261298 17783041 20180123 22053312 23140267 23448575
60991B3448575k32383m53173l89137j11591K82196O25137P01717L74967k95874
$$ 23448575 23216192 22763019 22373882 22262291 22544487 23169624 23871341 24246308 23950434
60982B3950434j080147j727927k106968k222093k147635j962867j729528j490556
$$ 23950434 22870287 21142360 19035392 16813299 14665664 12702797 10973269 9482713
60974I482713j269169j071893q98455p48674o21484n13535m22030l46485k86303
$$ 9482713 8213544 7141651 6243196 5494522 4873038 4359503 3937473 3590988 3304685
60965C304685k38919k01420j71877j48246j28013j09919r4365q1405o9776n8465
$$ 3304685 3065766 2864346 2692469 2544223 2416210 2306291 2211926 2130521 2060745 2002280
60955B002280m7669l7733k8597k0784j5552j3483j3978j6333k0108k4242k7281
$$ 2002280 1954611 1916878 1888281 1867497 1851945 1838462 1824484 1808151 1788043 1763801 1736520
60944A736520k8951l0389l2474l4980l7519m0012m2050m3046m3436m4444m6152
$$ 1736520 1707569 1677180 1644706 1609726 1572207 1532195 1490145 1447099 1403663 1359219 1313067
60933A313067m7040m6048m3981m2175m0770l9130l7165l5297l3536l1394k8664
$$ 1313067 1266027 1219979 1175998 1133823 1093053 1053923 1016758 981461 947925 916531 887867
60922H87867k5715k3070k0981j9392j8128j7057j5991j4595j2714j0837r734r353
$$ 887867 862152 839082 818101 798709 780581 763524 747533 732938 720224 709387 699653 690300
60910F90300q671p018n025l701l099k574j873j231o87j14K78R5o57j644k574l192
$$ 690300 681629 674611 669586 665885 662786 660212 658339 657108 656421 656307 656585 656680 656023 654379 651805 648613
60894F48613l236k870k755l236l901m278m403m302l665k643k206k986m398n597
$$ 648613 645377 642507 639752 636516 632615 628337 623934 619632 615967 613324 611118 608132 603734 598137
60880E98137o514p247p301o424n460n319n748o078o420o979p027n956m724m770
$$ 598137 591623 584376 577075 570651 565191 559872 554124 548046 541626 534647 527620 521664 516940 512170
60866E12170n806o143n066l496k421j908j652j444j026m65n06j646l085l566l016
$$ 512170 506364 500221 495155 491659 489238 487330 485678 484234 483208 482743 482237 480591 477506 473940 470924
60851D70924k282j618n84O80J361J140M66l21j134j582j317q98j315k613l866
$$ 470924 468642 467024 466440 467120 468481 469621 470087 469766 468632 467050 465733 464835 463520 460907 457041
60836D57041m468m537m214l490k614j837r28K87J264J473J420J893K673L027L039
$$ 457041 452573 448036 443822 440332 437718 435881 434953 435240 436504 437977 439397 441290 443963 446990 450029
60821D50029L228L331K775J974J673J408K19j365j798r50k77m38n74l15o12j867
$$ 450029 453257 456588 459363 461337 463010 464418 464637 463272 461474 460524 460247 459809 459235 458920 458308 456441
60805D56441k845k448j316p40r74j500k106k828l489l952m414m889m951m403l681
$$ 456441 453596 451148 449832 449092 448118 446618 444512 441684 438195 434243 429829 424940 419989 415586 411905
60790D11905l366l599m188m780m900m343l513k923k513k037j740j939k225k050
$$ 411905 408539 404940 400752 395972 391072 386729 383216 380293 377780 375743 374003 372064 369839 367789
60776C67789j755j917k044j185L55J291J346J479K086K450K295K417L225L939
$$ 367789 366034 364117 362073 360888 361243 362534 363880 365359 367445 369895 372190 374607 377832 381771
60762C81771L865L396L171L202L387L897M591M844M442L855L375K808K241K098
$$ 381771 385636 389032 392203 395405 398792 402689 407280 412124 416566 420421 423796 426604 428845 430943
60748D30943K180J793J066J031J882K348J380n94k625m444o015o978p264p489
$$ 430943 433123 434916 435982 437013 438895 441243 442623 442029 439404 434960 428945 421967 414703 407214
60734D07214q010q289p852p135o739o548o145n512m738l700k512j656j257q71
$$ 407214 399204 390915 383063 375928 369189 362641 356496 350984 346246 342546 340034 338378 337121 336250
60720C36250l84l54r80j621j821j940k223k084j135j00J34j68j40L10M89R6l82
$$ 336250 335866 335512 334532 332911 331090 329150 326927 324843 323708 323608 323742 323574 323434 323744 324233 324329 323947
60703C23947l28L72J308J851J732J390J512K108K495K274J800J539J581J860K287
$$ 323947 323619 323991 325299 327150 328882 330272 331784 333892 336387 338661 340461 342000 343581 345441 347728
60688C47728K577K623L015M355N968O354N236M105M175M877M957M242L436K895
$$ 347728 350305 352928 355943 360298 366266 372620 377856 381961 386136 391013 395970 400212 403648 406543
60674D06543K478K182K060J851J297N64j59j153k704m408n510n761n546n278n024
$$ 406543 409021 411203 413263 415114 416411 416975 416816 415663 412959 408551 403041 397280 391734 386456 381432
60659C81432m618l940l160k690k706k725k059p50M36R25R49J093J620K290K510
$$ 381432 376814 372874 369714 367024 364318 361593 359534 358784 359220 360145 361094 362187 363807 366097 368607
60644C68607J731K3j802k967l440l565l422l080k981l283l274k309j012n54r87
$$ 368607 370338 370361 368559 365592 362152 358587 355165 352085 349104 345821 342547 340238 339226 338672 337685
60629C37685j354j245j107j062o41K16R44J268J416J411J080P04O49N20k20j030
$$ 337685 336331 335086 333979 332917 332276 332492 333436 334704 336120 337531 338611 339315 339964 340484 340264 339234
60613C39234r28j37K84K98P28J356J050l9l47N31J001J7j301j518q82l32M6N31
$$ 339234 338306 338169 338453 338751 339479 340835 341885 341846 341499 342030 343031 343048 341747 340229 339347 339015 339061 339592
60595C39592P96N24J69K25N30Q28J143J185M59o46j007m63KK6L38J023J103M82
$$ 339592 340388 340912 341081 341306 341836 342664 343807 344992 345451 344805 343798 343335 343337 343363 343701 344724 345827 346309
60577C46309M67J496K206J849J634K441L151K810K641L953N769O569O999Q521
$$ 346309 346776 348272 350478 352327 353961 356402 359553 362363 365004 368957 374726 381295 388294 396815
60563C96815J0509J1054R951Q660P698O215L863J341q76k692l637l400k809k737
$$ 396815 407324 418378 428329 436989 444687 450902 454765 456106 455230 452538 448901 445501 442692 439955
60549D39955k503r68J277K575K712L019M149N576P182R450J1930J3441J4043J5163
$$ 439955 437452 436484 437761 440336 443048 446067 450216 455792 462974 472424 484354 497795 511838 527001
60535E27001J7145J8314J7126J3985J0242O462K513j531n213p995r376r181p987
$$ 527001 544146 562460 579586 593571 603813 610275 612788 611257 606044 598049 588673 579492 571505
60522E71505o729n820n120m573m211l705k726j626j027p95k62O31J308J631K143
$$ 571505 564776 558956 553836 549263 545052 541347 538621 536995 535968 535173 534911 535542 536850 538481 540624
60507E40624L193M546N935P320Q694J0231J2520J5905J9839K3613K7408L1741
$$ 540624 543817 548363 554298 561618 570312 580543 593063 608968 628807 652420 679828 711569
60495G11569L6122L9418M1410M2837M3688M2655L8636L1959K3599J3933K785r643
$$ 711569 747691 787109 828519 871356 915044 957699 996335 1028294 1051893 1065826 1068611 1058968
60483A058968k2256l3307m1257m5716m7537m7730m6501m3658l9545l5005l0648
$$ 1058968 1036712 1003405 962148 916432 868895 821165 774664 731006 691461 656456 625808
60472F25808k6738k3402k0494j7638j5019j3576j3618j3847j2711j0403q375p302
$$ 625808 599070 575668 555174 537536 522517 508941 495323 481476 468765 458362 449987 442685
60460D42685o583n744n035m542l872k989k495k726l293l637l512k898k088j743
$$ 442685 436102 430358 425323 420781 416909 413920 411425 408699 405406 401769 398257 395359 393271 391528
60446C91528k208k849k756j992j364j146r36o03l88q7P44J690J606J70j582k562
$$ 391528 389320 386471 383715 381723 380359 379213 378277 377674 377286 377199 377943 379633 381239 381409 379827 377265
60430C77265k695k365j703q29j55K7j72n48r34q75Q9J581K450K062J096O70J046
$$ 377265 374570 372205 370502 369673 369518 369545 369373 368825 367891 367016 367105 368686 371136 373198 374294 374964 376010
60413C76010J599J681J179M24j55l40k18K6L15O59J058J564K231K817K794J948
$$ 376010 377609 379290 380469 380893 380738 380398 380180 380206 380521 381180 382238 383802 386033 388850 391644 393592
60397C93592O95l20p01k41J072K691L693L749L434L213K747J813J160J579K583
$$ 393592 394287 393967 393266 393025 394097 396788 400481 404230 407664 410877 413624 415437 416597 418176 420759
60382D20759K922K257J492J471K103K742K911K593K165J974J892J609J390J839
$$ 420759 423681 425938 427430 428901 431004 433746 436657 439250 441415 443389 445281 446890 448280 450119
60368D50119K719K872J865P61N45Q18Q30R07J604K355K341K072K702M167N383
$$ 450119 452838 455710 457575 458336 458881 459699 460529 461436 463040 465395 467736 469808 472510 476677 482060
60353D82060O036O838Q186R742J1199J2268J2143J0284P600N521M022J842j346
$$ 482060 488096 494934 503120 512862 524061 536329 548472 558756 566356 571877 575899 577741 576395
60340E76395m392o414p709q651q987q643q164p886p531o900o153n278m145l189
$$ 576395 572003 565589 557880 549229 540242 531599 523435 515549 508018 501118 494965 489687 485542 482353
60326D82353l051l450l498l201l444m216m192k731j047n39q01l47J242K887L619
$$ 482353 479302 475852 472354 469153 465709 461493 457301 454570 453523 452984 452183 451836 453078 455965 459584
60311D59584L835M747O854R366J1187J2263J3405J4767J5284J4154J2110J0360
$$ 459584 463419 468166 475020 484386 495573 507836 521241 536008 551292 565446 577556 587916
60299E87916Q800O309K526j687n450q557j1023j2763j3780j4034j3277j1620r956
$$ 587916 596716 603025 605551 603864 598414 589857 578834 566071 552291 538257 524980 513360 503404
60286E03404r065q577p639o279n202m588m029l437l061k826k565k626l313m028
$$ 503404 494339 485762 478123 471844 466642 462054 458025 454588 451527 448701 446136 443510 440197 436169
60272D36169l929l119k259j469o48k58o15q75k06O01K34q74j129l86m6n47p00
$$ 436169 432240 429121 426862 425393 424745 424487 423872 422997 422791 423392 423626 422752 421623 421237 421191 420644 419944
60255D19944J38R97R01J25o21r58n46O74J718J423K43k11M49R82O40L9l80j039
$$ 419944 420082 421079 421980 422105 421484 420526 419980 420654 422372 423795 424038 423827 424276 425258 425898 425937 425557 424518
60237D24518j878k011j283o30l78K27J305J821J462J331K018K612K418K117K286
$$ 424518 422640 420629 419346 418716 418338 418565 419870 421691 423153 424484 426502 429114 431532 433649 435935
60222D35935K340J906J740K264K627K359K464L735N285N951N948N872N386M195
$$ 435935 438275 440181 441921 444185 446812 449171 451635 455370 460655 466606 472554 478426 483812 488007
60208D88007L220L301L769L575L045L125L630L663L151K708K417J866J056L79
$$ 488007 491227 494528 498297 501872 504917 508042 511672 515335 518486 521194 523611 525477 526533 526912
60194E26912J2j4K91M36l41j875k990l103k911k845k181n60Q88J074M75m0p37
$$ 526912 526924 526910 527201 527637 527296 525421 522431 519328 516417 513572 511391 510831 511719 512793 513268 513228 512491
60177E12491k032l095k950k161j909k022j429j10Q31P13k13j408k225k013j032
$$ 512491 510459 507364 504414 502253 500344 498322 496893 496783 497614 498327 498114 496706 494481 492468 491436
60162D91436o32j472k262j543J28J096J043R80J317J562J603J755J725R84P0Q9
$$ 491436 490804 489332 487070 485527 485655 486751 487794 488774 490091 491653 493256 495011 496736 497720 497790 497879
60146D97879R29J366J010P64J180J664J645J464J680K412L650N333O848P252O317
$$ 497879 498808 500174 501184 501948 503128 504792 506437 507901 509581 511993 515643 520976 527824 535076 541393
60131E41393M790L438K385J502Q04K80j48m21m36l42l67m76n58o86p89m71L26
$$ 541393 546183 549621 552006 553508 554312 554592 554444 554023 553587 553245 552878 552402 551844 551158 550369 549898 550224
60114E50224Q98O71O3k94p46j940l331l531k335j172j216j927k026j258m51k20
$$ 550224 551122 551793 551856 551562 550816 548876 545545 542014 539679 538507 537291 535364 533338 532080 531629 531409
60098E31409k53R2R38J901K725L571M516N188N298N300N817O600O755O116N472
$$ 531409 531156 531248 532186 534087 536812 540383 544899 550087 555385 560685 566502 573102 579857 585973 591445
60083E91445N269M914L811K238O81r11k601l941m669n397o835q769j0392j1231
$$ 591445 596714 601628 605439 607677 608358 607447 604846 600905 596236 590839 584004 575235 564843 553612
60069E53612j1226j0412r099p921p148o399n496m944n027n097m487l587l206l422
$$ 553612 542386 531974 522875 514954 507806 501407 495911 490967 485940 480843 476356 472769 469563 466141
60055D66141l772m102m410m259l171j381M31J868K747K788K052J326J423K324
$$ 466141 462369 458267 453857 449598 446427 445046 445477 447345 450092 452880 454932 456258 457681 460005
60041D60005L454M305M440L467J717L18n5k1m90j383k126k750l607m417m513l832
$$ 460005 463459 467764 472204 475671 477388 477706 477651 477630 477140 475757 473631 470881 467274 462857 458344 454512
60025D54512k975k483k602l405m552n308n281m752l985k869j692j352k100k832
$$ 454512 451537 449054 446452 443047 438495 433187 427906 423154 419169 416300 414608 413256 411156 408324
60011D08324k522j623j238j524j868k023k085j845j143m01k8K52O54N65n13j755
$$ 408324 405802 404179 402941 401417 399549 397526 395441 393596 392453 392052 392024 392276 392930 393495 392982 391227
59995C91227j862p87M16J124J603K132K573K780K783K675K712L061L170K145K20
$$ 391227 389365 388578 388994 390118 391721 393853 396426 399206 401989 404664 407376 410437 413607 415752 415972
59980D15972j096j075q61j591k567k553j974k111k816k631j051P94J689J410L78
$$ 415972 414876 413801 412940 411349 408782 406229 404255 402144 399328 396697 395646 396440 398129 399539 399917
59965C99917o73q69k5Q50P94K75L73R71R70J20n88l35O26J468J508O72k08QJ178
$$ 399917 399244 398375 398350 399200 399994 400269 400642 401613 402583 402703 402115 401780 402406 403874 405382 406054 405846 405854 407032
59946D07032J639M00j316j817j359j338j826j661o76q2o05j675k553k936k471
$$ 407032 408671 409071 407755 405938 404579 403241 401415 399754 399078 398996 398391 396716 394163 391227 388756
59931C88756r48Q70J765J618J427J853K622L340L910M240M445N078O313P184O706
$$ 388756 387808 388678 390443 392061 393488 395341 397963 401303 405213 409453 413898 418976 425289 432473 439179
59916D39179N391M514M247L759K883K302K231K156J905J792J804J677J632J958
$$ 439179 444570 449084 453331 457090 459973 462275 464506 466662 468567 470359 472163 473840 475472 477430
59902D77430K194J803J275J274J235K74r49r56J33P06K18j23O04J848K837L509
$$ 477430 479624 481427 482702 483976 485211 485485 484536 483580 483713 484419 484637 484514 485118 486966 489803 493312
59886D93312L828L528K887K585K523J951J001P96J736K821L038K355J184j05r58
$$ 493312 497140 500668 503555 506140 508663 510614 511615 512411 514147 516968 520006 522361 523545 523440 522482
59871E22482r81o42p22j172j460j745k411k803j911k36O96O11P31J596K387K625
$$ 522482 521501 520859 520137 518965 517505 515760 513349 510546 508635 508399 509095 509706 510437 512033 514420 517045
59855E17045K868L372L668L872M871O708Q306R255J0285J1406J1129Q389M067
$$ 517045 519913 523285 526953 530825 535696 542404 550710 559965 570250 581656 592785 601174 605241
59842F05241o2k821l655k524m27J043J220M95j088l952p398r587r751r033q564
$$ 605241 605179 602358 598703 596179 595752 596795 598015 598510 597422 593470 586072 576485 566734 557701 549137
59827E49137q087p219o547o584o747o335n490m535l359k085j329j157q22l5N24
$$ 549137 541050 533831 527284 520700 513953 507618 502128 497593 494234 492149 490820 489663 488841 488806 489330
59812D89330M59K12o3q97k194k847k362j598j197n82O58J654J514O71L9j55n2
$$ 489330 489789 490001 489938 489041 486847 484000 481638 480040 478843 478261 478919 480573 482087 482758 482797 482642 482590
59795D82590L50O19r8j677k726k469j865j961k297j972j296j203j753k275k470
$$ 482590 482940 483559 483461 481784 479058 476589 474724 472763 470466 468494 467198 465995 464242 461967 459497
59780D59497k391j924j094m66m65o80m03N22J686K502K429J494O68R45J999K683
$$ 459497 457106 455182 454088 453622 453157 452477 452074 452596 454282 456784 459213 460707 461375 462320 464319 467002
59764D67002K828L337M382M958M538L802L340K945K694L168M091M274L528L142
$$ 467002 469830 473167 477549 482507 487045 490847 494187 497132 499826 502994 507085 511359 514887 518029
59750E18029L689M048L467K936L358L905L507K668K392K439J970J096M66J38r9
$$ 518029 521718 525766 529233 532169 535527 539432 542939 545607 547999 550438 552408 553504 553970 554108 554009
59735E54009n8K15P0o60j106p99n19q45j034m00L33J94n39j157j737k371k349
$$ 554009 553951 554166 554236 553576 552470 551671 551152 550307 549273 548873 549206 549400 548861 547704 545967 543596 541247
59718E41247j337l94m67r02o86j64q7J0R03K009K175J540J152J303J596K024K660
$$ 541247 539910 539516 539049 538147 537461 537297 537210 537220 538123 540132 542307 543847 544999 546302 547898 549922 552582
59701E52582K869K243J655J975K404J630O3o91k87R1k43o99p51o82q06r43q62
$$ 552582 555451 557694 559349 561324 563728 565358 565421 564730 564443 564534 564291 563592 562841 562159 561353 560410 559548
59684E59548n38J2N37M44m93j669k483l132l943m619m893n172n690n795n064m297
$$ 559548 559010 559022 559559 560003 559510 557841 555358 552226 548283 543664 538771 533599 527909 522114 517050 512753
59668E12753m266m276l255j655q55j096j398j204q45n12L7P44J217J377J446J546
$$ 512753 508487 504211 500956 499301 498446 497350 495952 494748 493903 493391 493428 494172 495389 496766 498212 499758
59652D99758J858K708L825M171L228J763N36q16k613l951l988l563l982m840m675
$$ 499758 501616 504324 508149 512320 515548 517311 517847 517031 514418 510467 506479 502916 498934 494094 489419
59637D89419l320k031j497j208p81m40k65j12k87j172k259k673k503k597l117
$$ 489419 486099 484068 482571 481363 480582 480142 479877 479765 479478 478306 476047 473374 470871 468274 465157
59622D65157l392l175k939k982l086l084k983k671k240k271l009l585k983j409
$$ 465157 461765 458590 455651 452669 449583 446499 443516 440845 438605 436334 433325 429740 426757 425348
59608D25348J20J165J910K310K200J934J970K087J897J627J622J653J643K281
$$ 425348 425468 426633 428543 430853 433053 434987 436957 439044 440941 442568 444190 445843 447486 449767
59594D49767L827N015M579L154K293K171J821J155R03Q78J46j075j488r15p28
$$ 449767 453594 458609 463188 466342 468635 470806 472627 473782 474685 475563 475709 474634 473146 472231 471503
59579D71503j680k789k980k523k250k409k853l523m183m377m009l412k721j812
$$ 471503 469823 467034 464054 461531 459281 456872 454019 450496 446313 441936 437927 434515 431794 429982
59565D29982r22n75p87r87q76o76n90n64n99o63m81N7N34O74R98K008L133L435
$$ 429982 429060 428485 427698 426711 425835 425159 424569 424005 423406 422743 422262 422319 422853 423527 424525 426533 429666 433101
59547D33101L115L248M157N105N636O222P431R332J2016J5934K1045K5757K7109
$$ 433101 436216 439464 443621 448726 454362 460584 468015 477347 489363 505297 526342 552099 579208
59534E79208K2635J2807J587o415r667r985r303p716n168k906j841r91O86K122
$$ 579208 601843 614650 616237 609822 600155 590170 580867 573151 567983 565077 563236 562245 562931 565053
59520E65053J716R5q23r12j773l864n791o629o985p512q013q383q919r379r042
$$ 565053 566769 566864 566041 565129 563356 559492 553701 547072 540087 532575 524562 516179 507260 497881 488839
59505D88839p960o926o053m716l092k317k723l212k919k413k588l262l430k454
$$ 488839 480879 473953 467900 463184 460092 457775 455052 451840 448921 446508 443920 440658 437228 434774
59491D34774o31J049J683J333R77J208J471J128O31P23J133J082P03P58J391K183
$$ 434774 434143 435192 436875 438208 439185 440393 441864 442992 443623 444346 445479 446561 447264 448022 449413 451596
59475D51596L009L745L696K551J379J385K047J986J162P10R50J127R90J038J304
$$ 451596 454605 458350 462046 464597 465976 467361 469408 471394 472556 473266 474216 475343 476333 477371 478675
59460D78675J398J682K869M493N351N407N702O380O492N868N517N815N875N090
$$ 478675 480073 481755 484624 489117 494468 499875 505577 511957 518449 524317 529834 535649 541524 546614
59446E46614L943K882J654Q3j627l588n943p836p996o607n263m779m424l588k776
$$ 546614 550557 553439 555093 555176 553549 549961 544018 536182 528186 521579 516316 511537 507113 503525 500749
59431E00749k460k240j721j123m86O69K475M387O164Q163J0362J2010J2727J3179
$$ 500749 498289 496049 494328 493205 492719 493388 495863 500250 506414 514577 524939 536949 549676 562855
59417E62855J4159J5625J7005J8152J9645K2032K4382K3744J7266N684o380j4517
$$ 562855 577014 592639 609644 627796 647441 669473 693855 717599 734865 740549 734169 719652
59405G19652j8004j8492j6895j3224q090k239M328J0562J2834Q061j925j1711
$$ 719652 701648 683156 666261 653037 644947 642708 647036 657598 670432 678493 676568 664857
59393F64857j7838k0635k1132j9330j5970j2978j1048r036o541m850m456l933
$$ 664857 647019 626384 605252 585922 569952 556974 545926 536890 530349 525499 521043 517110
59381E17110k317o35L9K61Q67J618K173K903L791M046L564L320L595L424K575
$$ 517110 514793 514158 514197 514458 515325 516943 519116 522019 525810 529856 533420 536740 540335 543759 546334
59366E46334K333L405M628M841M490M490M861N479O757Q561R755R733R259Q976
$$ 546334 548667 552072 556700 561541 566031 570521 575382 580861 587618 596179 605934 615667 624926 633902
59352F33902Q413P352O794P581R143J0449J1190J1378J0869R926R164Q407O825
$$ 633902 642315 649667 656461 664042 673185 683634 694824 706202 717071 726997 736161 744568 751393
59339G51393M551K790J840N62j668m006n748p353r151j0585j1446j2316j3133
$$ 751393 755944 758734 760574 761136 759468 755462 749714 742361 733210 722625 711179 698863 685730
59326F85730j2907j1540j0258r491q167n969m405m452m946m596l926l804l588
$$ 685730 672823 661283 651025 641534 633367 627398 622993 618541 613595 608999 605073 601269 597681
59313E97681k409r74m72o25l31N59J403K050K866M029N583P660J0128J2702J5430
$$ 597681 595272 594298 593826 593201 592870 593429 594832 596882 599748 603777 609360 617020 627148 639850 655280
59298F55280J7917J8065J3423M385n541j3326j8537k1507k1716j9297j6162j3969
$$ 655280 673197 691262 704685 709070 703529 690203 671666 650159 628443 609146 592984 579015
59286E79015j2320j0315q411p318o474n053l380k022n97J309L113M295N278O331
$$ 579015 566695 556380 547969 540651 534177 529124 525744 523722 523125 524434 527547 531842 537120 543451
59272E43451O844O725P096Q424R412Q993P998P528P087N759L966K555J281m54
$$ 543451 550295 557020 564116 572540 581952 590945 598943 606471 613558 619317 623283 625838 627119 626665
59258F26665k340l940n549p121p622o707n770n942o361n797m712m219m172l793
$$ 626665 624325 620385 614836 607715 600093 593386 587616 581674 575313 569516 564804 560585 556413 552620
59244E52620l095k272p94J397K985L074K753L408M527M814M384M213M258L782
$$ 552620 549525 547253 546459 547856 550841 553915 556668 560076 564603 569417 573801 578014 582272 586054
59230E86054K817J857Q29m26j369j662j939k643l146l058l175l960m409l720k740
$$ 586054 588871 590728 591557 591131 589762 588100 586161 583518 580372 577314 574139 570179 565770 562050 559310
59215E59310k449k361j800j311j325r31L66J187L79q79r61m12o42j344j354r60
$$ 559310 556861 554500 552700 551389 550064 549133 549499 550686 551065 550186 549225 548813 548171 546827 545473 544513
59199E44513j136j494j193r45j820k946k656j249l14L8R45K255K647K032J634
$$ 544513 543377 541883 540690 539745 537925 534979 532323 531074 530760 530798 531743 533998 536645 538677 540311
59184E40311J762J544R48J020J968K760K886K996L531M005L921L377K751K575
$$ 540311 542073 543617 544565 545585 547553 550313 553199 556195 559726 563731 567652 571029 573780 576355
59170E76355L410N122O675P393P732Q107P977P028O131N947N656M323K457R43
$$ 576355 579765 584887 591562 598955 606687 614794 622771 629799 635930 641877 647533 651856 654313 655256
59156F55256m50k106l309l521l720m920o433p128p225p320o948n850n284o178
$$ 655256 654806 652700 649391 645870 642150 637230 630797 623669 616444 609124 602176 596326 591042 584864
59142E84864p299p204o661p049p663o986n532m874m906m430l612l316k892j188
$$ 584864 577565 570361 563700 556651 548988 542002 536470 531596 526690 522260 518648 515332 512440 511252
59128E11252Q89J462P61N90J232J496J452K402M277N599O043O754Q120R432J0605
$$ 511252 512141 513603 514364 514954 516186 517682 519134 521536 525813 531412 537455 544209 552329 561761 572366
59113E72366J2087J3249J3041J2164J2310J3434J3913J3308J2690J2308J1216
$$ 572366 584453 597702 610743 622907 635217 648651 662564 675872 688562 700870 712086
59102G12086R340P723O653N405L853K429P10j905m326m801l623k644k348j681
$$ 712086 721426 729149 735802 741207 745060 747489 748199 746294 741968 737167 733544 730900 728552 726871
59088G26871o16l72r43r61l22o34k586m916o462p331p787p749p713q355r110q827
$$ 726871 726255 725883 724940 723979 723657 723023 720437 715521 709059 701728 693941 686192 678479 670124 661014 652187
59072F52187p766p144o901n941m465l882m388m721m424m319m651m799m812n262
$$ 652187 644421 637277 630376 624435 619970 616088 611700 606979 602555 598236 593585 588786 583974 578712
59058E78712n584m732l382l282m368m752l663k184j041R6R59O83l11n85l5J34
$$ 578712 573128 568396 565014 561732 557364 552612 548949 546765 545724 545820 546779 547462 547151 546566 546531 546665
59042E46665k29j03M56K63o26q82k78J91N77J830L392L614K798L024M721O165
$$ 546665 546436 546333 546789 547052 546426 545544 545266 545457 546034 547864 551256 554870 557668 560692 565413 571578
59026E71578O793Q034J0280J2027J2795J3947J5639J5949J4223J2401J1628J0258
$$ 571578 578371 586405 596685 608712 621507 635454 651093 667042 681265 693666 705294 715552
59014G15552O832K639m07k268l567l890l026k080j798j270K88K039L024L710M820
$$ 715552 722384 725023 724616 722348 718781 714891 711865 709785 707987 706717 707005 709044 712068 715778 720598
58999G20598N992O650O873O508M821J903r12k723l853m537m462m076m650o395
$$ 720598 726590 733240 740113 746621 751442 753345 752433 749710 745857 741320 736858 732782 728132 721737
58985G21737q096r055r617r547p931n268l428k885k030K6K095L224M188N718P209
$$ 721737 713641 704586 694969 685422 677491 672223 668795 665910 663880 663906 666001 669225 673413 679131 686340
58970F86340Q205R302J0562J0881R887Q742Q273Q001P689P916Q392P763N837M009
$$ 686340 694545 703847 714409 725290 735177 743919 752192 760193 767882 775798 784190 791953 797790 801799
58956H01799K714O16k758n806p398q519j0212j1845j2634j3006j3290j2866j1661
$$ 801799 804513 805129 802371 796565 789167 780648 770436 758591 745957 732951 719661 706795 695134
58943F95134j0678j0063q550n836l565k914l039k975l075l469l104j610l49l74
$$ 695134 684456 674393 665843 660007 656442 653528 650489 647514 644439 640970 637866 636256 635907 635533
58929F35533r46j065q88o98k23K21l31j646k229j770j588k017j606K04J950K675
$$ 635533 634587 633522 632634 631936 631713 631934 631603 629957 627728 625958 624370 622353 620747 620951 622901 625576
58913F25576L295M421N144N106N438O545P174O884P045Q290R313R378R569J0303
$$ 625576 628871 633292 638436 643542 648980 655525 662699 669583 676628 684918 694231 703609 713178 723481
58899G23481J0294R201Q709R404R400P788O656P768R800J1079J2479J5257J8248
$$ 723481 733775 742976 751685 761089 770489 778277 784933 792701 802501 813580 826059 841316 859564
58886H59564J9657J9737J9409J8087J5049J1304P981M530M20l128n018o173p665
$$ 859564 879221 898958 918367 936454 951503 962807 970788 975318 975738 972610 967592 961419 953754
58873I53754q773q772q834j0084j1539j1948j1931j2334j2233j0728r100r057
$$ 953754 944981 936209 927375 917291 905752 893804 881873 869539 857306 846578 837478 828421
58861H28421j0209j1231j2050j3052j3616j3279j2921j3170j3107j2126j1318
$$ 828421 818212 806981 794931 781879 768263 754984 742063 728893 715786 703660 692342
58850F92342j1434j1326j0097q895q819q956q304p644p697p414o036m863m950
$$ 692342 680908 669582 659485 650590 641771 632815 624511 616867 609170 601756 595720 590857 585907
58837E85907n101m190l380l906m636m143l172k870k484j176j17l87p06L66J771
$$ 585907 580806 576616 573236 569330 564694 560551 557379 554509 552025 550849 550732 550345 549639 550005 551776
58822E51776J975J666K079K498J997J732K826L871L181J806J541J733R38j7L79
$$ 551776 553751 555417 557496 559994 561991 563723 566549 570420 573601 575407 576948 578681 579619 579602 579981
58807E79981J236P63n03q63n43p72j105n14N5q74k497l076k921l342l886l453
$$ 579981 581217 581980 581477 580614 580071 579299 578194 577680 577735 576861 574364 571288 568367 565025 561139 557686
58791E57686k914l731m988m696l065j745p78Q59K649L310L404M547O681Q504R807
$$ 557686 554772 551041 546053 541357 538292 536547 535769 536628 539277 542587 545991 550538 557219 565723 575530
58776E75530J1049J1546J0345P992N341J854k738o640q269q805j0027j1232j0959
$$ 575530 586579 598125 608470 616462 621803 623657 620919 614279 606010 597205 587178 575946 564987
58763E64987r994r744r257p007m153k753k187o93R13N97q39p96Q10J753J507J570
$$ 564987 554993 545249 535992 528985 524832 522079 519892 519199 520112 520709 519870 519074 519884 521637 523144 524714
58747E24714K203K131J348J288K198K953L249L683M215M673N888Q079R311Q155
$$ 524714 526917 529048 530396 531684 533882 536835 540084 543767 547982 552655 558543 566622 575933 584088
58733E84088O483O906Q733R521R137R121R188P919N939N022M806L664K049J755
$$ 584088 590571 597477 606210 615731 624868 633989 643177 651096 657035 662057 666863 670527 672576 674331
58719F74331K593L029L288M595O212O550O310P149Q076O760L649J194l40k642
$$ 674331 676924 679953 683241 687836 694048 700598 706908 714057 722133 728893 732542 733736 733396 730754
58705G30754n622p633q916j1149j3906j5255j5473j6610j8570j9260j8347j7302
$$ 730754 725132 717499 708583 697434 683528 668273 652800 636190 617620 598360 580013 562711
58693E62711j6106j3564j0606r484r735q716o099m221l879l494k597k524l305
$$ 562711 546605 533041 522435 512951 503216 494500 488401 484180 480301 476807 474210 471686 468381
58680D68381l328k403j928j876q52Q28J438J192J977L783M808N144O802R979J2809
$$ 468381 465053 462650 460722 458846 457994 458822 460260 461452 463429 467212 472020 477164 483966 493945 506754
58665E06754J4971J7997K1636K3278K1541J7382J1637M568k140o299q295j0197
$$ 506754 521725 539722 561358 584636 606177 623559 635196 639764 637624 631325 623030 612833
58653F12833j1987j1879j0143q992q741p717n933n213n518m835k964j892k132
$$ 612833 600846 588967 578824 569832 561091 553374 547441 542228 536710 531875 528911 527019 524887
58640E24887k099j348j117j492j327q58j181j433J5J970J837R2n21J55n8j052
$$ 524887 522788 521440 520323 518831 517504 516646 515465 514032 514047 516017 517854 517946 517425 517580 517522 516470
58624E16470n32J313J881J092J575L590M404L367L014M317N245M888M771N129
$$ 516470 515938 517251 519132 520224 521799 525389 529793 533160 536174 540491 545736 550624 555395 560524
58610E60524M094J552k11m92r55j904j802r54j420k842k689j131j107k993l959
$$ 560524 564618 566170 565959 565467 564512 562608 560806 559852 558432 555590 552901 551770 550663 547670 543711
58595E43711l220l057l805k954k94J156P03J403M382O766P021P437R283J0298
$$ 543711 540491 537434 533629 530675 530381 531537 532240 533643 538025 544791 551812 559249 568532 578830
58581E78830R152P981Q232Q243O992O141O405N959M419M239O311Q212Q663R644
$$ 578830 587982 595963 604195 612438 619430 625571 631976 637935 642354 646593 652904 661116 669779 679423
58567F79423J2195J4352J5167J6673J9804K2411K3263K4044K5489K5494K2985
$$ 679423 691618 705970 721137 737810 757614 780025 803288 827332 852821 878315 901300
58556I01300J9789J6931J3081Q205M685L163J398j243k611k476l716p055r468
$$ 901300 921089 938020 951101 959306 963991 967154 968552 967309 964698 962222 958506 951451 941983
58543I41983r700j0528j3466j6042j6702j7551j9758k0931j9634j8004j7374j5795
$$ 941983 932283 921755 908289 892247 875545 857994 838236 817305 797671 779667 762293 746498
58531G46498j2429r806r211q319n868m118m166l515r20J029P99O69J955K308O28
$$ 746498 734069 724263 715052 706733 700865 696747 692581 689066 688146 689175 689974 690643 692598 694906 695534
58516F95534k65J198K257R29n56m74q76k961m098k846k145m047n909n358m369
$$ 695534 695269 696467 698724 699653 699097 698623 697747 694786 690688 687842 685697 681650 675741 670383 666014
58501F66014m899n131l677k909m385n442m039k515k912l153j520k75r74r10J824
$$ 666014 661115 655984 652307 649398 645013 639571 635532 633017 630105 626952 625432 625157 624183 623273 625097
58486F25097M315M000L343N191P864Q997J0015J2491J4347J3792J2921J3369J2696
$$ 625097 629412 633412 636755 641946 649810 658807 668822 681313 695660 709452 722373 735742 748438
58473G48438R105N423M221L331L89k446k604j574j180J61L292M986L122P49P13
$$ 748438 757543 762966 767187 770518 770907 768461 765857 764283 763103 763264 766556 771542 774664 775413 776126
58458G76126R02q59k020j62K165K200J942L497M209J510j921k969l498n945q028
$$ 776126 777028 776169 774149 773987 776152 778352 780294 783791 788000 789510 787589 784620 781122 775177 767149
58443G67149p143n495n705n711l221o95n94l90K336M546L156J104K230M617M895
$$ 767149 760006 754511 748806 743095 739874 739179 738585 738195 740531 745077 748233 749337 751567 756184 761079
58428G61079M635O513Q584Q384Q338J1006J3312J1618Q170O485M804L76m257n709
$$ 761079 765714 772227 780811 789195 797533 808539 821851 833469 841639 848124 852928 853304 849047 843338
58414H43338n987p988r337p277n010o333q493p351n154n938p610o072l073k475
$$ 843338 837351 829363 820026 812749 807739 801406 792913 785562 780408 774470 766860 760788 757715 755240
58400G55240k673k88K512J949J33J149L298K661O72P30J035j642m825m555l073
$$ 755240 752567 752279 754791 756740 756873 758022 761320 763981 764653 765383 766418 764776 759951 755396 752323
58385G52323m608p176o209k697r6L001R256J5515J7252J6472J7417J8395J5800
$$ 752323 747715 740539 734330 731633 731537 734538 743794 759309 776561 793033 810450 828845 844645
58372H44645J2125J1661J2248R746O614P388R705Q732O506P797J0603R971P596
$$ 844645 856770 868431 880679 890425 897039 904427 914132 922864 929370 937167 947770 957741 965337
58359I65337Q165R891Q132M834M839O300M400J081J357L453K402kJ235M295M166
$$ 965337 973502 983393 991525 996359 1001198 1007498 1011898 1012979 1014336 1017789 1020191 1020189 1021424 1025719 1029885
58344A029885K693M878Q659Q713P049R274J3723J4823J3891J5930J9105J8269
$$ 1029885 1032578 1037456 1046115 1054828 1061877 1071151 1084874 1099697 1113588 1129518 1148623 1166892
58332A166892J5450J5972J7706J5305J1289J1501J3315J0240M512K972M235K307
$$ 1166892 1182342 1198314 1216020 1231325 1242614 1254115 1267430 1277670 1282182 1285154 1289389 1291696
58320A291696q01J131N728O101M200O833J1878J2084R270J0804J5140J5089J2278
$$ 1291696 1290895 1292026 1297754 1303855 1308055 1314888 1326766 1338850 1348120 1358924 1374064 1389153 1401431
58307A401431J3855J7870J6860J3045J4589J9505J8981J4361J4700J9446J9842
$$ 1401431 1415286 1433156 1450016 1463061 1477650 1497155 1516136 1530497 1545197 1564643 1584485
58296A584485J5952J5938J9771J9971J7199J8856K3518K3219J9687K1588K7296
$$ 1584485 1600437 1616375 1636146 1656117 1673316 1692172 1715690 1738909 1758596 1780184 1807480
58285A807480K7585K3785K5500L1868L3296L0401L2541L8753L9374L5507L7252
$$ 1807480 1835065 1858850 1884350 1916218 1949514 1979915 2012456 2051209 2090583 2126090 2163342
58274B163342M3443M3340L7858L8460M5070M6252M1602M2421M9591N2471N0643
$$ 2163342 2206785 2250125 2287983 2326443 2371513 2417765 2459367 2501788 2551379 2603850 2654493
58263B654493N4742O4473O8099O5056O6691P3340P3579O7443O6961P2477P2407
$$ 2654493 2709235 2773708 2841807 2906863 2973554 3046894 3120473 3187916 3254877 3327354 3399761
58252C399761O7567P0812Q1419Q5412Q2733Q7516J00099J06158J05234J11632
$$ 3399761 3467328 3538140 3619559 3704971 3787704 3875220 3975319 4081477 4186711 4298343
58242D298343J25237J30988J29442J37129J54190J63389J63959J73349J92351
$$ 4298343 4423580 4554568 4684010 4821139 4975329 5138718 5302677 5476026 5668377
58233E668377K03109K05264K18043K42238K57613K62830K79029L08465L30242
$$ 5668377 5871486 6076750 6294793 6537031 6794644 7057474 7336503 7644968 7975210
58224G975210L42909L68795M09580M42020M64732N02667N57828O04976O44135
$$ 7975210 8318119 8686914 9096494 9538514 10003246 10505913 11063741 11668717 12312852
58215A2312852P04661P88373Q64850R33145J028183J155003J281380J408468J578989
$$ 12312852 13017513 13805886 14670736 15603881 16632064 17787067 19068447 20476915 22055904
58206B2055904J800838K037804K292774K619083L032400L503160M058032M789256
$$ 22055904 23856742 25894546 28187320 30806403 33838803 37341963 41399995 46189251
58198D6189251N739744O889205Q274167R987728J2038919J4386947J7164337K0672991
$$ 46189251 51928995 58818200 67092367 77080095 89119014 103505961 120670298 141343289
58190A41343289K5106212L0497921L6881441M3822572M9288950M9550986M1413875
$$ 141343289 166449501 196947422 233828863 277651435 326940385 376491371 417905246
58183D17905246K5149390M938595j3878393k7937410l6596184m0637746m1076509
$$ 417905246 443054636 447993231 434114838 406177428 369581244 328943498 287866989
58176B87866989l8953127l5364834l1199318k6954845k2908582j9283052j6181185
$$ 287866989 248913862 213549028 182349710 155394865 132486283 113203231 97022046
58169I7022046j3544700j1294090r421879p907784o660114n602636m731136m037750
$$ 97022046 83477346 72183256 62761377 54853593 48193479 42590843 37859707 33821957
58161C3821957l461661k957804k540213k217118j948734j704518j500827j348396
$$ 33821957 30360296 27402492 24862279 22645161 20696427 18991909 17491082 16142686
58153A6142686j218206j089730r80780r01165q25511p38623o61661o08199n57875
$$ 16142686 14924480 13834750 12853970 11952805 11127294 10388671 9727010 9118811 8560936
58144H560936m97312m45260m13658l83389l41774l06809k91797k80831k60734
$$ 8560936 8063624 7618364 7204706 6821317 6479543 6172734 5880937 5600106 5339372
58135E339372k43981k39360k31763k11339j92795j86486j79068j61064j45672
$$ 5339372 5095391 4856031 4624268 4412929 4220134 4033648 3854580 3693516 3547844
58126C547844j42205j37840j23399j11295j10403j08259r5508q4020q3648q3926
$$ 3547844 3405639 3267799 3144400 3033105 2922702 2814443 2718935 2634915 2551267 2467341
58116B467341p5575o8102o9603p0171o1673n3928n5501n7596n2137m7209m9847
$$ 2467341 2391766 2323664 2254061 2183890 2122217 2068289 2012788 1955192 1903055 1855846 1805999
58105A805999n1586m5599m0714m4173m7479m3042l8378m0268m1160l4648k8624
$$ 1805999 1754413 1708814 1668100 1623927 1576448 1533406 1495028 1454760 1413600 1378952 1350328
58094A350328k9807l0611k4411j8793k0681k2950j8675j4470j6890j9392j5614
$$ 1350328 1320521 1289910 1265499 1246706 1226025 1203075 1184400 1169930 1153040 1133648 1118034
58083A118034j2247j6046k0771j9445j7339k0641k4156k2112j9668k2128k3999
$$ 1118034 1105787 1089741 1068970 1049525 1032186 1011545 987389 965277 945609 923481 899482
58072H99482k0060j6148j7940j9964j6596j3062j4702j6235j2434q787j0634j2298
$$ 899482 879422 863274 845334 825370 808774 795712 781010 764775 752341 743554 732920 720622
58060G20622p957l126m338p305o178m891q376j1924j0143p535r478j1611q693
$$ 720622 712665 709539 705201 697896 691718 686827 678451 666527 656384 648849 639371 627760 619067
58047F19067n291o975r367o645k810l924o864o263n023p617j0252p960m416m861
$$ 619067 613776 606801 597434 590789 587979 584055 577191 570928 565905 558288 548036 540076 535660 530799
58033E30799o206l933j810m814r186r343q079j0173j2430r968o148o423q221o547
$$ 530799 524593 520660 518850 514036 504850 495507 487428 477255 464825 454857 448709 442286 434065 427518
58019D27518l859m751o478m301r35j350l307k168l8j069k779r40J747P51j489
$$ 427518 423659 418908 412430 408129 407194 405844 402537 400369 400331 399262 396483 395543 397290 398041 396552
58004C96552m67J539K44j888m39K188J532o4J804M524L143m9N32L953N586N914
$$ 396552 396085 397624 397868 395980 395541 397729 399261 399197 401001 405525 408668 408619 409151 413104 418690 424604
57988D24604P937R473O641J790k74p65l694p546q242p109q008r678q712o913p872
$$ 424604 432541 442014 448655 450445 450171 449406 445712 438166 429924 422815 414807 405129 396417 389504 381632
57973C81632r426p440l985l873n914n472k921j917j916p6K012J051j047k77J945
$$ 381632 372206 364766 360781 356908 350994 345522 342601 340684 338768 338692 340704 341755 340708 340431 342376
57958C42376J603k63j2J232J0k264j952n00j641l757k600O10J410K15P77K511
$$ 342376 343979 343716 343704 344936 344946 342682 340730 340230 338589 334832 332232 332842 334252 334467 335244 337755
57942C37755J927oO90L577M988N057O688R058R110P965R050J1237J0660P794O083
$$ 337755 339682 339676 340366 343943 348931 353988 360676 369734 378844 386809 395859 407096 417756 425550 431633
57927D31633N127J984k271m141m291n888p936p179n079n857q787r451p542o499
$$ 431633 436760 438744 436473 432332 428041 422153 414217 407038 401959 396102 387315 377864 370322 363823
57913C63823o483m688j816j283k571k077R8Q11N51K667O442P704O037M921N026
$$ 363823 357340 352652 350836 349553 346982 344905 345003 345814 346365 349032 355474 363178 369215 374136 379162
57898C79162L782J366O47J325L77j799j895j31l8j910k555j539j614k989l149
$$ 379162 382944 384310 384957 386282 386659 384860 382965 382834 382796 380886 378331 376792 375178 372189 369040
57883C69040k312l158n165n096l115k590l859m072l128l785n771n794l703k773
$$ 369040 366728 363570 358405 353309 350194 347604 343745 339673 336545 332760 326989 321195 317492 314719
57869C14719l567l301j530p00q62M56K844L305K213L068N970P278O249O066P571
$$ 314719 311152 307851 306321 305621 304759 305215 308059 311364 313577 316645 322615 329893 336142 342208 349779
57854C49779P954O553O092O996O267L276J193J254Q80j192k933l477m614o607
$$ 349779 357733 364286 370378 377374 383641 386917 388110 389364 390244 389052 386119 382642 378028 371421
57840C71421p281o380o242p178o836m992m172m760m273k253j125j412r88K25j24
$$ 371421 364140 357760 351518 344340 337504 332512 328340 323580 319307 317054 315929 314517 313529 313754 313630
57825C13630j789j651N74J511R1p89K78J076N00M35J529J761N47k75p20l151p321
$$ 313630 311841 310190 310764 312275 312366 311577 311855 312931 313431 313866 315395 317156 317703 317428 316708 313557 306236
57808C06236r729r177q302q372p518n409m632n678n438k562K88J229J748K807
$$ 306236 296507 287330 279028 270656 263138 257729 253097 247419 241981 239419 239707 240936 242684 245491
57794B45491K904J747J527K793L323K563K829M651N478M605M685O662P917P300
$$ 245491 248395 250142 251669 254462 257785 260348 263177 267828 273306 277911 282596 289258 297175 304475
57780C04475P271Q947R727Q132O524O618O587N046L694L500K417o50l387m093
$$ 304475 311746 320693 330420 338552 345076 351694 358281 363327 367021 370521 372938 372288 368901 364808
57766C64808m402n736o762o616o964q559r402q477p647p818p024m485k669l006
$$ 364808 360406 354670 347908 341292 334328 325769 316367 307890 300243 292425 285401 280916 278247 275241
57752B75241l390k273j388j946j987j75J425J055K62O11Q46kk08J301K478J794
$$ 275241 271851 269578 268190 266244 264257 264082 265507 266562 266824 267435 268281 268279 268071 269372 271850 273644
57736B73644J063J948K788J837N89J003K111K167J650J571J297L86R8R48J264
$$ 273644 274707 276655 279443 281280 281869 282872 284983 287150 288800 290371 291668 292054 292152 293100 294364
57721B94364J26r06q12r94k337l473l715m527o188o459m608l263m057m931m141
$$ 294364 294490 293584 292772 291778 289441 285968 282253 277726 271538 265079 260471 257208 253151 248220 244079
57706B44079l330m078m892m373l877m297l718j295J12j599l940l904k657k621
$$ 244079 240749 236671 231779 227406 223529 219232 215514 214219 214331 212732 208792 204888 202231 199610
57692A99610k861j322R00J332K68l72m41p00m14J149K547K433K177L518N503O447
$$ 199610 196749 195427 196327 197659 197927 197555 197114 196414 196000 197149 199696 202129 204306 207824 213327 219774
57676B19774P030Q855J1659J4515J7976K2614K7418L2006L8409M8145N8991O6432
$$ 219774 226804 235659 247318 261833 279809 302423 329841 361847 400256 448401 507392 573824
57664E73824O6432N5823L3515L962k3620m2461n2675n7041n6095n0245m2880l7257
$$ 573824 640256 696079 729594 733556 709936 667475 614800 557759 501664 451419 408539 371282
57652C71282l2651k7138k1762j8509j6490j3710j0636q655p045m727l004l241
$$ 371282 338631 311493 289731 271222 254732 241022 230386 221731 214686 209959 206955 203714
57640B03714l837k771j138r20j310o45J55m91j416p94K88j36j135q13m8o80j621
$$ 203714 199877 197106 195968 195048 193738 193093 193248 192757 191341 190547 190835 190699 189564 188751 188703 188023 186402
57623A86402p05J143J337jq26r76j606k059j073N2p93k611k739j276n29q93q34
$$ 186402 185697 186840 188177 188176 187350 186374 184768 182709 181636 181688 180895 178284 175545 174269 173740 172847 172013
57606A72013k38l03p84n87l31j183k050j173L78K27j199j503n39k55r48j101n65
$$ 172013 171775 171472 170688 170101 169770 168587 166537 165364 165742 165969 164770 163267 162728 162473 161525 160424 159859
57589A59859o12j126r03l22p18j593j459q09j232k211j938p61n58j232j125m34
$$ 159859 159247 158121 157218 156896 156178 154585 153126 152317 151085 148874 146936 146175 145617 144385 143260 142826
57573A42826r21k443l018k205j407j010j97O42L05o46o27J1l09j135n78J114J741
$$ 142826 141905 139462 136444 134239 132832 131822 131625 132267 132572 131926 131299 131310 131001 129866 129288 130402 132143
57556A32143Q05p4k96q12j542j289k65N8l90m43k70q98j551m95J620K392J637
$$ 132143 132948 132874 132578 131766 130224 128935 128670 128728 128338 127895 127625 126727 125176 124681 126301 128693 130330
57539A30330J575K975M177M148L577K753J159n59j044p27j217k225j993o16M9
$$ 130330 131905 134880 139057 143205 146782 149535 150694 150135 149091 148364 147147 144922 142929 142313 142362
57524A42362j87K48J263R47p86j651p67K01L28Q00K087K759K130J459J474J220
$$ 142362 142175 142423 143686 144633 143847 142196 141429 141630 141958 142758 144845 147604 149734 151193 152667 153887
57508A53887K87k38J13L34l2k00n4m77j260j021J94N99m67j550j578j120o06L04
$$ 153887 154174 153936 154049 154383 154351 154151 154097 153620 152360 151339 151533 152132 151665 150115 148537 147417 146811 147115
57490A47115J128O16r39j681j068n12o96n96K15O04K6n54n72o95j102j016m67
$$ 147115 148243 148859 147920 146239 145171 144659 143963 143367 143582 144186 144212 143658 143086 142391 141289 140273 139806
57473A39806m98j116j072j55M40L59N74J198J073P4m75k02k52r04q70L08J364
$$ 139806 139308 138192 137120 136965 137405 137764 138338 139536 140609 140683 140208 140006 139754 138850 137980 138288 139652
57456A39652J504J406J421Q51k42n92J82R03Q58P06Q99R94R02J047J080L41m24
$$ 139652 141156 142562 143983 144834 144592 144000 144182 145085 145943 146649 147548 148542 149444 150491 151571 151912 151488
57439A51488J31J492J918J438J668K658K674J413N53O54L84o34r89k84Q6k78P3
$$ 151488 151619 153111 155029 156467 158135 160793 163467 164880 165433 166087 166471 165837 164848 164564 164650 164372 164445
57422A64445J491K212J376N16Q22J310Q89R4k91l63m2J023J944J283k87m91R10
$$ 164445 165936 168148 169524 170040 170862 172172 173061 173155 172864 172501 172459 173482 175426 176709 176422 175931 176841
57405A76841J732J134P36J264J220L9o00Q1N23kJ14J576K456J502L81O21J124
$$ 176841 178573 179707 180443 181707 182927 182966 182366 182447 182970 182968 183082 184658 187114 188616 188997 189618 190742
57388A90742O87M01J312K123J503N62Q04J623J869J990K573K684J669P56R39J172
$$ 190742 191429 191830 193142 195265 196768 197330 198134 199757 201626 203616 206189 208873 210542 211298 212237 213409
57372B13409N64L76J774L441L649L010L080L763M182M604N491O024N523M949N253
$$ 213409 213973 214349 216123 219564 223213 226223 229303 233066 237248 241852 247343 253367 258890 263839 269092
57357B69092N594M965M042L735L415K390J556J783K185J805J489K164K801K187
$$ 269092 274686 279651 283693 287428 290843 293233 294789 296572 298757 300562 302051 304215 307016 309203
57343C09203J213J384K251K407J894J653J684J588J894L061M162M190L670L453
$$ 309203 310416 311800 314051 316458 318352 320005 321689 323277 325171 328232 332394 336584 340254 343707
57329C43707L172K360J808K257K993L264L674M637N058M210L362L684M153L514
$$ 343707 346879 349239 351047 353304 356297 359561 363235 367872 372930 377140 380502 384186 388339 391853
57315C91853K745L366M710N162M915N186N744N487M704M552N015N300N509O042
$$ 391853 394598 397964 402674 407836 412751 417937 423681 429168 433872 438424 443439 448739 454248 460290
57301D60290O224N385M516M981O306P085P202P450P710P450P215P714Q162P342
$$ 460290 466514 471899 476415 481396 487702 494787 501989 509439 517149 524599 531814 539528 547690 555032
57287E55032N768M952N184N672O307P468Q597Q684P927P533Q076R191J0395J1343
$$ 555032 560800 565752 570936 576608 582915 590383 598980 607664 615591 623124 631200 640391 650786 662129
57273F62129J1777J2020J2769J3852J4359J4386J5006J5979J5556J3596J2454
$$ 662129 673906 685926 698695 712547 726906 741292 756298 772277 787833 801429 813883
57262H13883J3327J4222J3441J2558J3555J5252J5417J4519J4412J4893J4590
$$ 813883 827210 841432 854873 867431 880986 896238 911655 926174 940586 955479 970069
57251I70069J4016J4676J6025J6311J5656J5570J6093J6153J6080J7013J8385
$$ 970069 984085 998761 1014786 1031097 1046753 1062323 1078416 1094569 1110649 1127662 1146047
57240A146047J8749J8574J9458K0997K1224K0021J9334K0035K1095K1973K3313
$$ 1146047 1164796 1183370 1202828 1223825 1245049 1265070 1284404 1304439 1325534 1347507 1370820
57229A370820K5031K5967K5786K5346K5131K5006K5403K6855K8528K9077K8749
$$ 1370820 1395851 1421818 1447604 1472950 1498081 1523087 1548490 1575345 1603873 1632950 1661699
57218A661699K8802K9247K9091K8519K8706K9681L0391L0739L1589L2862L3587
$$ 1661699 1690501 1719748 1748839 1777358 1806064 1835745 1866136 1896875 1928464 1961326 1994913
57207A994913L3677L3958L4610L5307L6416L8268L9805L9892L9422M0019M1333
$$ 1994913 2028590 2062548 2097158 2132465 2168881 2207149 2246954 2286846 2326268 2366287 2407620
57196B407620M1856M1842M2783M4431M4980M4208M3814M4483M5049M4833M4595
$$ 2407620 2449476 2491318 2534101 2578532 2623512 2667720 2711534 2756017 2801066 2845899 2890494
57185B890494M4775M4971M5436M7028M9415N1264N2480N4368N7468O1180O5636
$$ 2890494 2935269 2980240 3025676 3072704 3122119 3173383 3225863 3280231 3337699 3398879 3464515
57174C464515P1878P9957Q8560R6555J02991J05838J02958R4588Q3005O9808N5594
$$ 3464515 3536393 3616350 3704910 3801465 3904456 4010294 4113252 4207840 4290845 4360653 4416247
57163D416247M2000L1464K4557J9821J6533J5393J6159J6978J6720J5939J5046
$$ 4416247 4458247 4489711 4514268 4534089 4550622 4566015 4582174 4599152 4615872 4631811 4646857
57152D646857J3520J1498J0074R464Q729P774P687Q658R494R711J0101J0745J0421
$$ 4646857 4660377 4671875 4681949 4691413 4700142 4707916 4715603 4724261 4733755 4743466 4753567 4764312 4774733
57139D774733Q657O438M254J278k849p141j0889j4478j7956k0392k1327k1373
$$ 4774733 4783390 4789828 4794082 4795360 4792511 4785370 4774481 4760003 4742047 4721655 4700328 4678955
57127D678955k0841j9209j6334j2713q249k383M287J0112J4390J7768K0577K2490
$$ 4678955 4658114 4638905 4622571 4609858 4601609 4599226 4603513 4613625 4628015 4645783 4666360 4688850
57115D688850K4024K6486L0284L5121M2052N3236O9224Q8384J09399J32482J57969
$$ 4688850 4712874 4739360 4769644 4804765 4846817 4900053 4969277 5057661 5167060 5299542 5457511
57104E457511J85901K17527K55229L00476L53988M18757N01149O08523P47276
$$ 5457511 5643412 5860939 6116168 6416644 6770632 7189389 7690538 8299061 9046337
57095I046337R23210J141105J402576J705366K044553K412171K795393L177019
$$ 9046337 9969547 11110652 12513228 14218594 16263147 18675318 21470711 24647730
57087B4647730L537632L854212M096315M227778M216569M045224L715324L246427
$$ 24647730 28185362 32039574 36135889 40363667 44580236 48625460 52340784 55587211
57079E5587211K670629K022017J326280O00731j34975q51291j514714k100236
$$ 55587211 58257840 60279857 61606137 62206868 62071893 61220602 59705888 57605652
57071E7605652k596780l002678l318232l541435l668295l697121l633592l491563
$$ 57605652 55008872 52006194 48687962 45146527 41478232 37781111 34147519 30655956
57063C0655956l288904l043405k771969k490506k212233j946668j700616j478630
$$ 30655956 27367052 24323647 21551678 19061172 16848939 14902271 13201655 11723025
57055A1723025j281881j108662r57304q27375p17638o24960n46390m80489m25540
$$ 11723025 10441144 9332482 8375178 7547803 6830165 6205205 5658815 5178326 4752786
57046D752786l78379l36465k99464k67560k39667k14467j91669j71032j51637
$$ 4752786 4374407 4037942 3738478 3470918 3231251 3016784 2825115 2654083 2502446
57037B502446j33171j16426j01572q7474p3456n9992m6778l2203j5416L365K5026
$$ 2502446 2369275 2252849 2151277 2063803 1990347 1930355 1883577 1851374 1835958 1839323 1864349
57026A864349N0173P3073Q0524O1496J8079l5150q1834j12685j26539j27155j19901
$$ 1864349 1914522 1987595 2068119 2129615 2147694 2112544 2030710 1918025 1791486 1664331 1544430
57015A544430j09085r6844q4284p2760o3239n5365m8350m2146l6959l2510k8630
$$ 1544430 1435345 1338501 1254217 1181457 1118218 1062853 1014503 972357 935398 902888 874258
57004H74258k5620k3282k0758j8058j6348j5887j5226j3520j1949j1558j1246
$$ 874258 848638 825356 804598 786540 770192 754305 739079 725559 713610 702052 690806
56993F90806r493o786m692l538k450q39J436M551Q275J1739J4308J5641J4458
$$ 690806 681313 674527 669835 666297 663847 663008 664444 668995 677270 689009 703317 718958 733416
56980G33416R045j64r994j7561k2325k4594k4203k1889j9750j8661j7070j3880
$$ 733416 742461 742297 732303 714742 692417 667823 643620 621731 601981 583320 566250 552370
56968E52370j0530q498o787l920n34K199M995R012J3561J7665K2333K8474L3499
$$ 552370 541840 533342 526555 522635 522101 524300 529295 538307 551868 569533 591866 620340 653839
56955F53839L2782K4328J0234n620j9504k8538l2021l1921l0488k7891k3548j8579
$$ 653839 686621 710949 721183 715563 696059 667521 635500 603579 573091 545200 521652 503073
56943E03073j4898j2660j0465p510l944J33M418Q006J0792J4440K0403K7979L5381
$$ 503073 488175 475515 465050 457540 453596 453729 458147 466153 476945 491385 511788 539767 575148
56930E75148M1145M2823L6608K1189J019j7007k9465l7074m0901m1018l8353l4744
$$ 575148 616293 659116 695724 716913 717932 700925 671460 634386 593485 552467 514114 479370
56918D79370l0834k6173k1358j7865j5754j3661j1139r115p933o792n272l867
$$ 479370 448536 422363 401005 383140 367386 353725 342586 333471 325538 318746 313474 309607
56906C09607k911k304k096k116j512l1J005M62n86k75J385K994M168N485O828
$$ 309607 306696 304392 302296 300180 298668 298637 299642 300104 299518 299243 300628 303622 307790 313275 320103
56891C20103P836R450J2864J7411K1432K4644K7382K8086K4194J5638N285m168
$$ 320103 327939 337389 350253 367664 389096 413740 441122 469208 493402 509040 514325 510157
56879E10157j1674j6472j7770j6370j4412j2832j0705p500m217j709O27L697P444
$$ 510157 498483 482011 464241 447871 433459 420627 409922 402422 398205 396496 397123 400820 408264
56866D08264J1323J5250J9620K4973L1755L9879M8471N5875N9283N4731L9661
$$ 408264 419587 434837 454457 479430 511185 551064 599535 655410 714693 769424 809085
56855H09085J6733o692k4383l5397m1564m3308m0301l4227k7741k1591j5256r322
$$ 809085 825818 819126 794743 759346 717782 674474 634173 599946 572205 550614 535358 526036
56843E26036m533M78P559J5866K3237L0102L8967N0514O3355P7069R1319J01255
$$ 526036 521503 521981 529540 545406 568643 598745 637712 688226 751581 828650 919969 1021224
56831A021224R7847P5423L7515n491m2907o8104p9777q1119p6820o9723o0642
$$ 1021224 1119071 1194494 1232009 1226518 1183611 1115507 1035730 954611 877791 808068 747426
56820G47426n0606m1259l3060k5105j7110r854l391L414J1297K0079K9883M1246
$$ 747426 696820 655561 622501 597396 580286 570432 567041 570455 581752 601831 631714 672960
56808F72960N3771O5562P3459P2786N8688L0807l633l4167n4855o6202p0617o9369
$$ 672960 726731 792293 865752 938538 997226 1028033 1024400 990233 935378 869176 798559 729190
56796G29190o3937n6756m9276m1396l3388k6291k0115j3970q171l837j87N032
$$ 729190 665253 608497 559221 517825 484437 458146 438031 424061 415890 412053 411866 416898
56784D16898J2105J9098K5400L2264L8778M0416L3558J9422K238j4314k7689l6034
$$ 416898 429003 448101 473501 505765 544543 584959 618517 637939 640177 625863 598174 562140
56772E62140l9214l9003l6942l3224k8318k3832k0712j8246j5795j3834j2402
$$ 562140 522926 483923 446981 413757 385439 361607 340895 322649 306854 293020 280618
56761B80618j0339p176m234k777k579l032m145n535o052n389m596m214l470k053
$$ 280618 270279 263103 258869 256092 253513 250481 246336 240801 234749 229360 224764 220550 217080 215027
56747B15027j073j292j938k125k135k395k540k231j784j381q69o02j139j941j897
$$ 215027 213954 212662 210724 208599 206464 204069 201529 199298 197514 196133 195264 194662 193523 191582 189685
56732A89685j241j184j563r34P03J553R42L47P47J143O40l0r4L4N2N51J537J896
$$ 189685 188444 187260 185697 184763 185466 187019 187961 188308 189055 190198 190838 190808 190714 190748 190800 191351 192888 194784
56714A94784J260P61J104J482J212P95P16P38R21J713K567K293J087L96M23Kq12
$$ 194784 196044 196805 197909 199391 200603 201398 202114 202852 203773 205486 208053 210346 211433 211829 212252 212254 211442
56697B11442m85J086J956J243L90L93K88n83j153p13j79j46J56Q89Q55k25r37
$$ 211442 210957 212043 213999 215242 215632 216025 216313 215730 214577 213864 213685 213539 213695 214584 215439 215214 214277
56680B14277p01p47j514j558k87O99L48j85M0J61k60%J354K178J655J315K093
$$ 214277 213576 212829 211315 209757 209470 210169 210517 210332 210372 210533 210273 210273 211627 213805 215460 216775 218868
56663B18868K428J205l7K40J066J180J335K274K722J670N16P05J331J197J128
$$ 218868 221296 222501 222464 222704 223770 224950 226285 228559 231281 232951 233467 234172 235503 236700 237828
56648B37828J960K472J668J045K083L472L379K517K343K135O45j083j395j032
$$ 237828 239788 242260 243928 244973 247056 250528 253907 256424 258767 260902 261547 260464 259069 258037
56634B58037j638k710k730k157k470l345l401k874k932l302k881j932j462j251
$$ 258037 256399 253689 250959 248802 246332 242987 239586 236712 233780 230478 227597 225665 224203 222952
56620B22952o35j84n92r67l24L80j58j169j180o43q93j567j406o19k83k96l4p3
$$ 222952 222317 222133 221541 220574 220250 220630 220472 219303 218123 217480 216587 215020 213614 212995 212712 212416 212382 212309
56602B12309j065j933j306J95J135J557K096K053O75p65n32Q73J728J800J917
$$ 212309 211244 209311 208005 208200 209335 210892 212988 215041 215716 214951 214419 215292 217020 218820 220737
56587B20737J881J062J61J90O50O18N87J198J489N18n49k25P60R72Q16J282J641
$$ 220737 222618 223680 223841 224031 224681 225299 225886 227084 228573 229091 228542 228317 229077 230049 230865 232147 233788
56570B33788J055R59K900N341N708M505M265N324N939N917O850Q998J0875J1935
$$ 233788 234843 235802 238702 244043 249751 254256 258521 263845 269784 275701 282551 291549 302424 314359
56556C14359J2917J3749J3591J2826J2604J2627J1658R880Q511P537N998M110
$$ 314359 327276 341025 354616 367442 380046 392673 404331 414211 422722 430259 436257 440367
56544D40367K863K048P81o63j563k465m091n535n817o063p687r621r986r377r568
$$ 440367 443230 445278 446059 445396 443833 441368 437277 431742 425925 419862 412175 402554 392568 383191 373623
56529C73623j0125r468q337q741j0083r818p711o148o231o659o538o336n930m531
$$ 373623 363498 354030 345693 336952 326869 317051 309340 303192 296961 290302 283764 277428 271498 266967
56515B66967k740k064k340k010r10l61o89j050j417k245k651j496P9j05j786k668
$$ 266967 264227 262163 259823 257813 256903 256542 255853 254803 253386 251141 248490 246994 247073 246968 245182 242514
56499B42514j921p51Q4P25O55n39j426m36J269J406L39K17J094J162K95RK59l41
$$ 242514 240593 239842 239926 240651 241306 240767 239341 238905 240174 241580 241919 242136 243230 244392 244687 244696 244955 244614
56481B44614j412j281k95k36q15k32J033P63p88j041L99J230O99N12J065O94o84
$$ 244614 243202 241921 241626 241390 240575 240343 241376 242139 241351 240310 240709 241939 242638 243150 244215 244909 244225
56464B44225r70K33P55j86p12N4N58R2P6R61J071j24q14p0O51M08K63P62P68k7
$$ 244225 243255 243488 244243 244057 243345 243399 243957 244049 244125 245086 246157 246033 245219 245149 245800 246208 246471 247233 248001 247974
56444B47974k05O93J247Q54O55R52N25o44q19L84J134N64MK23K35k73k29K97k17
$$ 247974 247769 248462 249709 250563 251218 252170 252695 252051 251232 251616 252750 253314 253318 253541 253776 253503 253274 253571 253354
56425B53354j656j853k11J208J145P68Q80N61l41l49P94J282M34n3P74J540J213
$$ 253354 251698 249845 249634 250842 251987 252755 253635 254196 253855 253506 254300 255582 256016 255963 256737 258277 259490
56408B59490O99O73M24j52K5R32J148M94L23P20L76m35L3J450J492Q6j94J250
$$ 259490 260189 260862 261286 261134 261159 262091 263239 263733 264056 264776 265152 264717 264750 266200 267692 267778 267584 268834
56390B68834J894P04n8R23J831J399J061J694J768O30J65J289K100J368O42J015
$$ 268834 270728 271432 271374 272297 274128 275527 276588 278282 280050 280680 280845 282134 284234 285602 286244 287259
56374B87259J118K03r5R76J490L65n13K18J003N44K50J302K202J574O17O64R27
$$ 287259 288377 288580 288485 289461 290951 291316 290803 291021 292024 292568 292818 294120 296322 297896 298513 299177 300104
56357C00104O66R03K011K347J182K74P36J113L16l89p8O6o15p54J67N23k98m92
$$ 300104 300770 301673 303684 306031 307213 307487 308223 309336 309652 309263 309185 309251 308636 307882 308049 308572 308274 307782
56339C07782P53J732J613J968L243L381J778Q87J883K493J287K74R27J471O23
$$ 307782 308535 310267 311880 313848 317091 320472 322250 323137 325020 327513 328800 329074 330001 331472 332095
56324C32095K20J487K481J930J831L355M063K274M59J002K176J730R69J721K543
$$ 332095 332315 333802 336283 338213 340044 343399 347462 349736 350195 351197 353373 355103 356072 357793 360336
56309C60336J634M66R33J740J060P7N52J476J356J203K227L233L169L438M861
$$ 360336 361970 362436 363369 365109 366169 366246 366798 368274 369630 370833 373060 376293 379462 382900 387761
56294C87761N417L906K658L575M763M204L400M124M917M254L854N336O881O650
$$ 387761 393178 397084 399742 403317 408080 412284 415684 419808 424725 428979 432833 438169 445050 451700
56280D51700O250P278P927O661N743P199Q828Q252P402Q771J0680J0733J0548
$$ 451700 457950 465228 473155 479816 485559 492758 501586 509838 517240 526011 536691 547424 557972
56267E57972J2421J4504J4149J3126J4610J7719J9809K1582K5087K9103L1368
$$ 557972 570393 584897 599046 612172 626782 644501 664310 685892 710979 740082 771450
56256G71450L3075L6628M1132M4707M8814N5682O3769P0352P6309Q3687R0930
$$ 771450 804525 841153 882285 926992 975806 1031488 1095257 1165609 1241918 1325605 1416535
56245A416535R5249R7557J00332J02665J01957R8396R3355Q5653P3837N9876M6179
$$ 1416535 1511784 1609341 1709673 1812338 1914295 2012691 2106046 2191699 2265536 2325412 2371591
56234B371591L1505J4237l152j7692l0967m5478n8821o7004p1091p4927p8631
$$ 2371591 2403096 2417333 2414181 2396489 2365522 2320044 2261223 2194219 2123128 2048201 1969570
56223A969570p9902p9643q0460q1409p9771p6444p4182p2207o7941o2328n8165
$$ 1969570 1889668 1810025 1729565 1648156 1568385 1491941 1417759 1345552 1277611 1215283 1157118
56212A157118n4908n0284m5291m2264l9949l5750l0989k8568k7379k4522k0958
$$ 1157118 1102210 1051926 1006635 964371 924422 888672 857683 829115 801736 777214 756256
56201G56256j9389j8598j5707j2044j0869j1129r430o454n421n875n025l535l889
$$ 756256 736867 718269 702562 690518 679649 668520 659090 652636 647215 641340 636315 632780 628891
56188F28891m748l100m17m50k427k648j260j173j840n08J779J883P94J753L688
$$ 628891 624143 621043 620626 620176 617749 615101 613841 612668 610828 610320 612099 613982 614776 616529 620217
56173F20217L139J202J752M132M472L053L424N312N426M279N230P611P745O000
$$ 620217 623356 624558 626310 630442 634914 637967 641391 646703 652129 656408 661638 669249 676994 682994
56159F82994N977P540P544O573P933J0838J1602J0799J2135J5180J6379J6391
$$ 682994 688971 696511 704055 710628 718561 729399 741001 751800 763935 779115 795494 811885
56147H11885J9081K4092K7749L0685L7224M7932O0011P3963R2104J11247J24620
$$ 811885 830966 855058 882807 913492 950716 998648 1058659 1132622 1224726 1335973 1460593
56136A460593J30412J31004J25256J10073Q8895P0053N6874M7114M0928M0409
$$ 1460593 1591005 1722009 1847265 1957338 2046233 2116286 2173160 2220274 2261202 2301611
56126B301611M1834L7662K6659J4015K043j0568k1163k4550k2352k1964k6240
$$ 2301611 2343445 2381107 2407766 2421781 2423824 2413256 2392093 2367543 2345191 2323227 2296987
56115B296987l2835m2894o0174q1313r7120j04368j07132j06489r9183q6864p6075
$$ 2296987 2264152 2221258 2161084 2079771 1982651 1878283 1771151 1664662 1565479 1478615 1402540
56104A402540o7876n7488m5025l6283l1814k5888j7652j2712j2088j0151n360
$$ 1402540 1334664 1277176 1232151 1195868 1164054 1138166 1120514 1107802 1095714 1085563 1080203
56093A080203k515k566p31L359M320J748J650N179O654M848N271R029J0486Q365
$$ 1080203 1077688 1075122 1074391 1077750 1082070 1083818 1085468 1090647 1097301 1102149 1107420 1116449 1126935 1135300
56079A135300Q172J1120J1771R126Q862J2037J2935J0585J0857J4643J5799J3398
$$ 1135300 1143472 1154592 1166363 1175489 1184351 1196388 1209323 1219908 1230765 1245408 1261207 1274605
56067A274605J3890J8333J9867J6866J5972J8946J9362J5716J4742J8121J9010
$$ 1274605 1288495 1306828 1326695 1343561 1359533 1378479 1397841 1413557 1428299 1446420 1465430
56056A465430J5577J4617J7875J8347J4296J3083J6877J8507J5905J6303K1494
$$ 1465430 1481007 1495624 1513499 1531846 1546142 1559225 1576102 1594609 1610514 1626817 1648311
56045A648311K3650K0684K0809K6593K9786K7468K7801L3844L7416L5296L5526
$$ 1648311 1671961 1692645 1713454 1740047 1769833 1797301 1825102 1858946 1896362 1931658 1967184
56034A967184M1074M3406L9295L7654M2448M5208M1970M0983M5945M8506M5314
$$ 1967184 2008258 2051664 2090959 2128613 2171061 2216269 2258239 2299222 2345167 2393673 2438987
56023B438987M5325N2084N6281N4069N4827O2247O6429O3506O4021P2450P8064
$$ 2438987 2484312 2536396 2592677 2646746 2701573 2763820 2830249 2893755 2957776 3030226 3108290
56012C108290P5845P6432Q5061R1253R0067R2484J03463J11319J10436J12444
$$ 3108290 3184135 3260567 3345628 3436881 3526948 3619432 3722895 3834214 3944650 4057094
56002D057094J22981J30335J29541J33744J48596J60127J61780J67722J84933
$$ 4057094 4180075 4310410 4439951 4573695 4722291 4882418 5044198 5211920 5396853
55993E396853J98974K02842K11882K33559K51566K57606K68768K94506L17900
$$ 5396853 5595827 5798669 6010551 6244110 6495676 6753282 7022050 7316556 7634456
55984G634456L29780L48692L85319M21014M44713M75834N26148N75999O14372
$$ 7634456 7964236 8312928 8698247 9119261 9563974 10039808 10565956 11141955 11756327
55975A1756327O63613P36671Q11057Q74876R54831J066917J186621J302592J448972
$$ 11756327 12419940 13156611 13967668 14842544 15797375 16864292 18050913 19353505 20802477
55966B0802477J646793J868859K104682K400390K788693L246688L775759M450462
$$ 20802477 22449270 24318129 26422811 28823201 31611894 34858582 38634341 43084803
55958D3084803N330556O406779P694975R281377J1200641J3402067J5949543J9116776
$$ 43084803 48415359 54822138 62517113 71798490 82999131 96401198 112350741 131467517
55950A31467517K3159071K8163060L4203483M1119256M7437199M9694774M3969048
$$ 131467517 154626588 182789648 216993131 258112387 305549586 355244360 399213408
55943C99213408K9055671Q188936j2746743k8845721l8308101m1900644m1341136
$$ 399213408 428269079 436458015 423711272 394865551 356557450 314656806 273315670
55936B73315670l8299395l4119026k9695884k5451349k1542078j8083385j5144167
$$ 273315670 235016275 200897249 171201365 145750016 124207938 106124553 90980386
55929I0980386j2674514j0581621q832994p414449o255801n277986m462840l811060
$$ 90980386 78305872 67724251 58891257 51476808 45221007 39943021 35480181 31669121
55921C1669121l279186k817383k425428k116120j862392j630215j426895j269853
$$ 31669121 28389935 25572552 23147124 21031004 19168612 17538397 16111502 14841649
55913A4841649j140900j014585r00420q16026p47280o73318o03921n55732n16773
$$ 14841649 13700749 12686164 11785744 10969718 10222438 9549120 8945199 8389467 7872694
55904G872694m68976m22052l92230l69721l38372l06329k87394k72271k47036
$$ 7872694 7403718 6981666 6589436 6219715 5881343 5575014 5287620 5015349 4768313
55895D768313k20946k08265k00593j83813j65017j56945j52313j38594j22616
$$ 4768313 4547367 4339102 4138509 3954696 3789679 3632734 3480421 3341827 3219211
55886C219211j16270j12703j00064q4796p8944p8049p2952o9873p7327q6200q3906
$$ 3219211 3102941 2990238 2890174 2805378 2726434 2648385 2575433 2505560 2428233 2342033 2258127
55875B258127p6164p4748p5833p0341o3683o5131o8653o3854n5573n3791n4372
$$ 2258127 2181963 2107215 2031382 1961041 1897358 1832227 1763574 1699720 1644147 1590356 1535984
55864A535984m8515m1308m2287m6712m4435l8648l8219l9874l5438k8729k8095
$$ 1535984 1487469 1446161 1403874 1357162 1312727 1274079 1235860 1195986 1160548 1131819 1103724
55853A103724k9797k5528j9069j9101k2570k1285j8105k0561k5124k3666j9332
$$ 1103724 1073927 1048399 1029330 1010229 987659 966374 948269 927708 902584 878918 859586
55842H59586k0317k3795k1583j6136j5611j8171j6308j1957j2430j5706j4324
$$ 859586 839269 815474 793891 777755 762144 743973 727665 715708 703278 687572 673248
55831F73248r952r936j2949j1927p846p278r375q278n378o553j0188j0182p942
$$ 673248 663296 653360 640411 628484 620638 613360 603985 595707 590329 583776 573588 563406 555464
55818E55464r386j2898j2175q328p507r128p827m538m409o130m294j08R44k95
$$ 555464 546078 533180 521005 512677 505170 496042 488215 483677 479268 473138 468844 468736 469680 469385
55804D69385J246M697N408M715P262J1105J0719P325O161O085K186l756n868n082
$$ 469385 470631 475328 480736 485451 492713 503818 514537 521862 528023 534108 536294 532538 526670 521588
55790E21588p077j1272j1962q855o696o023l995k600o220j2429j4835j3716j4460
$$ 521588 514511 503239 491277 482422 475726 469703 465708 463108 456888 444459 429624 415908 401448
55777D01448j6951j6157j2128r861r880q145m659l352m003k817l26l64k122j542
$$ 401448 384497 368340 356212 346351 336471 328326 323667 320315 316312 313495 313169 312805 310683 309141
55763C09141M27n99l710m003j688j368l090k614j3M03j604k071n16L0J1K348N150
$$ 309141 309568 308969 305259 301256 299568 298200 295110 292496 292483 292886 291282 289211 288695 288725 288736 291084 296234
55746B96234L527j727n093n461o523q697q781p230p707r537q559n347m597o384
$$ 296234 299761 298034 292941 287480 280957 272260 263479 256249 248542 239005 230446 225099 220502 214118
55732B14118o017k829j139k043k015k89j27j962k532j515k079m234m461k497j739
$$ 214118 208101 205272 204133 202090 200075 199786 199659 197697 195165 193650 191571 187337 182876 180379 178640
55717A78640k586k017K0M74n27J3J541P31j539j200J225J377n25J14L314L885
$$ 178640 176054 174037 174057 174531 174004 174017 175558 176289 174750 173550 174775 176152 175627 175741 179055 182940
55701A82940O61j630j013j055l276m260k503j104j563j386J95M06j270j670j2
$$ 182940 183601 181971 180958 179903 176627 172367 169864 168760 167197 165811 166006 166412 165142 163472 163460
55686A63460N98o65p39J245K304J537J744L598M100K446J461J780N22k741m673
$$ 163460 164058 163393 162654 163899 166203 167740 169484 173082 177182 179628 181089 182869 183391 180650 175977
55671A75977m298m535o152o241m182l005l178j296L284O705P360Q112R899R511
$$ 175977 171679 167144 160992 154751 150569 147564 144386 143090 146374 153079 160439 168551 178450 187961
55657A87961O170L953M893N652L897K166K434K458O31q20o15j236l940n883n288
$$ 187961 194131 198084 202977 208629 212526 214692 217126 219584 220215 219395 218780 217544 213604 207721 202433
55642B02433m703o077p269o459n533n992n944m174k996l985m892l757k234k111
$$ 202433 197730 191653 184384 177925 172392 166400 160456 156282 153286 149301 144409 140652 138418 136307
55628A36307k181j284p99j567j850p52j47j056j634q18l33j124j498p01n67j750
$$ 136307 134126 132842 132043 130476 128626 127874 127727 126671 125037 124219 123886 122762 121264 120563 119996 118246
55612A18246k160j023n20j560j985r00n64j982k764j558n06j053j445n91l35j558
$$ 118246 116086 115063 114543 112983 110998 110098 109534 107552 104788 103230 102724 101671 100226 99635 99300 97742
55596I7742k075p99J6r79j686o46K61l32o46N75J534Q96K06M67J82j094j117P64
$$ 97742 95667 94868 94884 93905 92219 91573 91834 91502 90856 91431 92965 93861 94067 94534 94716 93622 92505 93269
55578I3269J770M69o28K88J200M06l54L42P02m64j009N04J851J230N42J507K239
$$ 93269 95039 95508 94880 95168 96368 96774 96420 96762 97464 97000 95991 96495 98346 99576 100118 101625 103864
55561A03864Q95p75p37j36l41l5J670K630J364J0M32Q17n52j648l80J366J034
$$ 103864 104759 103984 103247 103111 102770 102735 104405 107035 108399 108409 108841 109658 109106 107458 107078 108444 109478
55544A09478j84O7J102J125Q41J604K318J553M71O30J075N24n4K99K11j261k313
$$ 109478 109294 109361 110463 111588 112429 114033 116351 117904 118375 119005 120080 120604 120550 120849 121060 119799 117486
55527A17486j547p11j446k236j538r55k071l174k352j095j363j924j071k09j119
$$ 117486 115939 115228 113782 111546 110008 109053 106982 103808 101456 100361 98998 97074 96003 95794 94675
55512I4675k300j747q26j619k760j840K13R56O14P49P35o55j931r42J289K218
$$ 94675 92375 90628 89802 88183 85423 83583 83796 84752 85366 86115 86850 86195 84264 83322 84611 86829
55496H6829J815J574J179m08k050j980r59p86j086n92L7l59p82J09J159P00k61
$$ 86829 88644 90218 91397 90989 88939 86959 86000 85214 84128 83536 83573 83214 82432 82541 83700 84400 84139
55479H4139Q9J058J032O15J110J561N29r06j017o20j228j859r55K86j25j262j092
$$ 84139 84228 85286 86318 86933 88043 89604 90133 89227 88210 87590 86362 84503 83548 83834 83709 82447 81355
55462H1355k71o40j497j008P8j51r42k18J407J644O23L08P22L68m05L1J178J114
$$ 81355 81084 80444 78947 77939 78017 77866 76924 76706 78113 79757 80380 80688 81410 81778 81373 81404 82582 83696
55444H3696K6k14M53L87n43q51k30L19O41J142J077k22j375q01M16L07n94n09
$$ 83696 83722 83508 83961 84348 83805 82954 82724 83043 83684 84826 85903 85681 84306 83505 83921 84228 83634 83125
55426H3125J41k09r40l19J022J046K8o3Q05J011O08J063K058J867N29l56o52j457
$$ 83125 83266 83057 82117 81798 82820 83866 83894 83831 84636 85647 86255 87318 89376 91243 91772 91416 90764 89307
55408H9307k323j827m86p3m11O8J062R06J6M19J949K201M90j224j652j582j632
$$ 89307 86984 85157 84671 84598 84187 84255 85317 86223 86239 86658 88607 90808 91298 90074 88422 86840 85208
55391H5208j320o89n00n76j28M12M3o20k00Q75J014K98J20M94L07j89J47Q29M25
$$ 85208 83888 83199 82699 82123 81995 82407 82450 81830 81630 82505 83519 83817 83937 84431 84738 84549 84696 85525 85950
55372H5950n97n03N19O18m42j080r01j147k100k615k397k235k062j102J63N54
$$ 85950 85353 84850 85369 85987 85545 84465 83564 82417 80317 77702 75305 73070 71008 69906 70069 70623
55356G0623M52J093K016J717M68j19N0k03o20J13J564J965J205O95N27l40j351
$$ 70623 71075 72168 74184 75901 76369 76250 76300 76097 75477 75590 77154 79119 80324 81019 81546 81206 79855
55339G9855q80N98R00j89o73J19O98M37M56J056J052J58m74n01p12r97l90P00
$$ 79855 78975 79573 80473 80284 79611 79730 80428 80865 81321 82377 83429 83587 83113 82612 81900 80903 80513 81213
55321H1213Q63K94M56J200R95l5j47Q18J189O00M18P75K71j049j424n95l24j066
$$ 81213 82076 82370 82826 84026 85021 84986 84839 85657 86846 87446 87864 88639 88910 87861 86437 85842 85518 84452
55303H4452j142M1Q72N73M90J367J888J088q4n96o24m00K74Q31M03l07J77J346
$$ 84452 83310 83351 84223 84796 85286 86653 88541 89629 89545 88949 88325 87925 88199 89030 89433 89126 89303 90649
55285I0649J233k08r96n98n39j182r94L43J154R17J144K175K118K45j453j435
$$ 90649 91882 91674 90678 90080 89541 88359 87365 87708 88862 89779 90923 93098 95216 95461 94008 92573
55269I2573p90q58j113p85l65j94L49J193J185K80k9P15J131N89K07M35J84p81
$$ 92573 91783 90925 89812 89027 88662 88468 88817 90010 91195 91475 91446 92161 93292 93881 94088 94523 94707 93926
55251I3926j061l16j41j105j559o27J38l86r29k86N41L12l82o49r36j637j893
$$ 93926 92865 92549 92408 91303 89744 89117 89255 88869 87940 87654 88195 88507 88125 87476 86540 84903 83010
55234H3010j209n05k79L67J609J879M33r73o16P32J387J218J026R05O49O16R36
$$ 83010 81801 81296 81017 81384 82993 84872 85305 84332 83716 84448 85835 87053 88079 88984 89633 90249 91185
55217I1185R86N28J40mm31r44o19L24N78J23M56J801K355J184l76j066j288j443
$$ 91185 92171 92699 92839 92835 92404 91460 90841 91165 91743 91866 92322 94123 96478 97662 97286 96220 94932 93489
55199I3489r45N9K14p02j142m39J18j03O7J061J444O28J57Q40J159J48p54m04
$$ 93489 92544 92603 92817 92115 90973 90534 90652 90549 90616 91677 93121 93749 93906 94746 95905 96053 95299 94895
55181I4895m2o97j083q9Q99M95j24N39J500J193L76O02J379J309P21Q02J263J078
$$ 94895 94853 94156 93073 92984 93883 94378 94254 94793 96293 97486 97862 98464 99843 101152 101873 102675 103938 105016
55163A05016M94K93J17n85j041m34L93K83k81k54O3j04l27P2N13K05l68n00o36
$$ 105016 105510 105803 105920 105335 104294 103860 104253 104536 104255 104001 104064 103960 103633 103705 104218 104423 104055 103555 102919
55144A02919j197j335m29M51K35l24j00M09J73m96q25j086j568j360N3J351J233
$$ 102919 101722 100387 99958 100409 100644 100320 100220 100629 100802 100306 99481 98395 96827 95467 95520 96871 98104
55127I8104M94M29N73j35j160j354r62p25k09J047J860J046l07l25P48J283J074
$$ 98104 98598 99027 99600 99465 98305 96951 95989 95264 95055 96102 97962 99008 98701 98376 99124 100407 101481
55110A01481J205J720J560N16n28j084j248q92p3L66o8m72K9P16N76J16L58R36
$$ 101481 102686 104406 105966 106482 105954 104870 103622 102730 102657 103023 102955 102483 102512 103228 103804 103920 104278 105214
55092A05214R14N73O58O96j29j168j177l97o0l79o04n52n02j78O86J320R01Lk71
$$ 105214 106128 106701 107359 108055 107926 106758 105581 105184 105124 104745 104141 103589 103087 102909 103595 104915 105816 105819 105548
55073A05548O1L34N74J041J238P16K8l40r41j972k227q74Q31J285Q22N97M27l46
$$ 105548 105609 105943 106517 107558 108796 109512 109540 109200 108259 106287 104060 103186 104017 105302 106124 106721 107148 106802
55055A06802r71l23R77J430Q87J70o11j534j685m60Q04N32n75p61k6L41J96K66
$$ 106802 105831 105508 106485 107915 108802 108972 108361 106827 105142 104682 105486 106018 105443 104682 104656 104997 105193 105459
55037A05459J94q07j859j388J89R89N78J76K43O2l63j83N22Q19P20J079J704J510
$$ 105459 105653 104846 102987 101599 101788 102777 103355 103531 103774 103836 103473 103290 103812 104631 105351 106430 108134 109644
55019A09644N38J5L31O02L06j65n20p42m87L40Q14K26n62m40Rl21q36k52R09J159
$$ 109644 110182 110197 110528 111130 111436 111271 110751 110009 109522 109862 110676 110902 110340 109900 109909 109588 108752 108500 109409 110568
54999A10568P61J114J884J384k30q59J65J119Q20J44k7j55o01p61m55m42p98m58
$$ 110568 111329 112443 114327 115711 115481 114622 114787 115906 116726 116870 116843 116688 116087 115326 114871 114429 113631 113173
54981A13173Q56J796J348K59k40m1K51L42K65J08J12M15O71N43L59M75M47r2l88
$$ 113173 114029 115825 117173 117432 117192 117151 117402 117744 118009 118117 118229 118644 119315 119858 120217 120692 121139 121047 120659
54962A20659L31J274J118J84j53K37L19N3M39J373J431J78j035j019j31P10J078
$$ 120659 120990 122264 123382 123566 123413 123650 123969 124022 124461 125834 127265 127443 126408 125389 125258 125968 127046
54945A27046Q53J44m23l22l7l36r10r10m45k60k72J38P39Q21N92P52J109J094
$$ 127046 127899 128043 127620 127298 127261 126925 126015 125105 124660 124400 124128 124266 125005 125826 126418 127170 128279 129373
54927A29373J124J819K517K402K391L849O043P134P138P376P462N728K536J71
$$ 129373 130497 132316 134833 137235 139626 143475 149518 156652 163790 171166 178628 184356 186892 187063
54913A87063q51k363m858o303n582m393m294m407l576k615k726l451l720l509
$$ 187063 186212 183849 178991 172688 167106 162713 158419 154012 150436 147821 145095 141644 137924 134415
54899A34415l122k253r83l54p45r72p2J192J660J388R93N80K39M95J344J906J827
$$ 134415 131293 129040 128057 127703 126958 125986 125914 127106 128766 130154 131147 131727 131966 132461 133805 135711 137538
54882A37538J903K655L470L889M449N464O135N789M833L748K336O56m76p79j183
$$ 137538 139441 142096 145566 149455 153904 159368 165503 171292 176125 179873 182209 182865 182389 181610 180427
54867A80427k353l615m177m382m940n765o297o222n356l720k071j372j409j054
$$ 180427 178074 174459 170282 165900 160960 155195 148898 142676 137320 133600 131529 130157 128748 127694
54853A27694j55J61n48j321j503j641k067k121j547j204j491j527p84j31k61m00
$$ 127694 127539 127700 127152 125831 124328 122687 120620 118499 116952 115748 114257 112730 111946 111815 111554 111154
54837A11154K62J095J146O44L00Q1k59l42O6L41K1l34j06L11L09Q2N5J49K84P52
$$ 111154 111416 112511 113657 114301 114601 114682 114423 114081 114147 114488 114509 114175 114069 114380 114689 114771 114826 114975 115259 116011
54817A16011J350J208J99m79k8P39P66K94M3q5l52j92Q78K047K150J313N94L82
$$ 116011 117361 118569 118768 118289 118261 119000 119766 120060 120103 120018 119666 119474 120352 122399 124549 125862 126456 126838
54799A26838K17j73n68p91q54o74j69N35J278J892K007J343L54r7J05K70O3j40
$$ 126838 127055 126882 126314 125523 124669 123995 123826 124361 125639 127531 129538 130881 131235 131138 131243 131513 131576 131436
54781A31436j78l57n97l54L51R10J344K245L336L480K606K133K877L980M593N137
$$ 131436 131258 130901 130304 129950 130301 131211 132555 134800 138136 141616 144222 146355 149232 153212 157805 162942
54765A62942O024O487N876M807M021L076J334p86k482l674m530m845m699m771
$$ 162942 168966 175453 181329 186136 190157 193233 194567 193781 191299 187625 183095 178250 173551 168780
54751A68780n168n040m076l293l317l174j930l64K67J45J98M11J82l09m27k47
$$ 168780 163612 158572 154496 151203 147886 144712 142782 142418 142685 142830 143028 143439 143621 143312 142885 142638
54735A42638k32k46Q2N02O68R25J649K407K749L133M005M637M160L199L134M080
$$ 142638 142406 142160 142242 142744 143412 144337 145986 148393 151142 154275 158280 162917 167077 170276 173410 177490
54719A77490M748M250K949J491j0j655l296m603n351n654n850n961n386l732j878
$$ 177490 182238 186488 189437 190928 190918 189263 185967 181364 176013 170359 164509 158548 153162 149430 147552
54704A47552j220j801k208j572n89j58j88l09n84r46q91m54l98q97j095n93j57
$$ 147552 146332 144531 142323 140751 140162 140004 139816 139507 138923 137977 137086 136632 136234 135337 134242 133649 133492
54687A33492l31n99n76p25j105q83J3L05n38j124l64O99P53L89P24J187O51l37
$$ 133492 133161 132562 131986 131261 130156 129273 129286 129591 129053 127929 127565 128264 129017 129406 130130 131317 131968 131631
54669A31631n19k31p04j615j526l97L63K43J14L03L4q86j440r51k0N59P77R29
$$ 131631 131112 130881 130177 128562 127036 126639 127002 127245 127359 127662 127696 126810 125370 124419 124399 124958 125735 126664
54651A26664R95Q83O85M73K83K68M72O19N31M39M74L45qj07J84K51j71l17L47
$$ 126664 127659 128542 129227 129700 129983 130251 130723 131342 131873 132312 132786 133131 133123 133016 133200 133451 133280 132963 133310
54632A33310J010P12j44n64n74q14j109p62P6N60M70K75J33k00o11p38o09m51
$$ 133310 134320 135032 134888 134324 133750 132936 131827 131065 131141 131701 132171 132446 132579 132379 131768 131030 130421 129970
54614A29970j45L83O97M67J31J54K14q1l43j47R5q1k03K37P03N57L34P86J340
$$ 129970 129825 130208 130905 131372 131503 131657 131871 131790 131447 131300 131395 131314 131111 131348 132051 132608 132942 133728 135068
54595A35068R37p3m43j8K77J47J60L65J62m17n92j30L81O33R07J221J193Q00M20
$$ 135068 136005 135932 135489 135471 135748 135895 136055 136420 136582 136165 135573 135443 135824 136457 137364 138585 139778 140578 140998
54576A40998J09l29o58m69n0j18o88j046p78j01O48J149R94J07q85j293j122o58
$$ 140998 141107 140778 140120 139651 139601 139483 138795 137749 136971 136870 137518 138667 139661 139768 138883 137590 136468 135810
54558A35810P3Q67J072N78L61J102K034K093J531J226J223J147J271J782J788
$$ 135810 135883 136750 137822 138400 138761 139863 141897 143990 145521 146747 147970 149117 150388 152170 153958
54543A53958O10n87j42J565K650K403J708J005j79j654k330j944j418j211p95
$$ 153958 154568 153981 153839 155404 158054 160457 162165 163170 162991 161337 159007 157063 155645 154434 153639
54528A53639n2K58p3j72M35R86P22k3n22o07m92l85n27r92j282q14J40P25O94
$$ 153639 153587 153845 153772 153600 154035 155021 155743 155720 155198 154591 154099 153714 153187 152195 150913 150099 150239 150964 151658
54509A51658N81O97P51N26J53k67o50o81k63Q3m2j58J75L09m99j501j298p2N82
$$ 151658 152239 152936 153687 154213 154366 154099 153449 152768 152505 152588 152546 152388 152563 152872 152373 150872 149574 149502 150084
54490A50084M0n65k46N29Q45N68R1l16m64j83M42J200K032K713K642J655O33M73
$$ 150084 150124 149559 149313 149842 150687 151255 151346 151030 150566 150383 150825 152025 154057 156770 159412 161067 161700 162173
54472A62173Q35Q86O85P58Q29L60j34K19R62R29L00L30J037J036j04j082r03j51
$$ 162173 163008 163894 164579 165337 166166 166526 166392 166611 167573 168502 168802 169132 170169 171205 171101 170019 169116 168965
54454A68965L45O27P60K67p42j166m31M73L84m79j126j276j455j997k614k770
$$ 168965 169310 169937 170697 170964 170222 169056 168625 169098 169482 169003 167877 166601 165146 163149 160535 157765
54438A57765k130q24N85J535J873J661R30p7q25j076j132j061l93Q01J394P29
$$ 157765 155635 154811 155396 156931 158804 160465 161395 161318 160493 159417 158285 157224 156831 157632 159026 159755
54422A59755k41l22K11N00P26J373J710Q25m92o89Q9M13K5p4K16m3p67p59J19
$$ 159755 159514 159192 159403 159903 160629 162002 163712 164537 164045 163356 163445 163858 163883 163809 164025 163982 163215 162456 162575
54403A62575O23L61L75J135J731J626J482J648J514Q99N41O25L76l61o92l00Q
$$ 162575 163198 163559 163934 165069 166800 168426 169908 171556 173070 173969 174510 175135 175511 175150 174458 174158 174166
54386A74166p9J25O58M46p61j590j018K60J173J590J583Q68j89m02N44J477J488
$$ 174166 174087 174212 174870 175316 174555 172965 171947 172207 173380 174970 176553 177421 177232 176830 177374 178851 180339
54369A80339J073Q44N08j23m30o6M48Q73J628K468K241P59n58o90k61qM30J247
$$ 180339 181412 182256 182764 182641 182211 182145 182593 183466 185094 187562 189803 190562 190004 189314 189053 189045 189475 190722
54351A90722J511O98j73r1L96K60n03j435k526l616l981l459k892k643j953o18
$$ 190722 192233 192931 192758 192667 193063 193323 192820 191385 188859 185243 181262 177803 174911 172268 170315 169697
54335A69697J54l80j172j114p51r50j222p95k19m00r40r06m13j26M0M44P18M14
$$ 169697 169851 169471 168299 167185 166434 165484 164262 163467 163248 162848 161908 161002 160589 160463 160503 160947 161665 162079
54317A62079k4m6jl11m84p2L06Qm16j73M05N68M26L97J94m72j048r88o72m36K19
$$ 162079 162055 162009 162008 161697 161213 161141 161447 161455 161039 160866 161271 161839 162265 162662 162856 162384 161336 160348 159676 159240 159459
54296A59459J335J605K41j352j331j0Q99Q64O27M07k09q85p45J01N92K55m72j167
$$ 159459 160794 162399 162640 161288 159957 159947 160846 161710 162337 162744 162535 161650 160905 161006 161598 161853 161381 160214
54278A60214j677j660r54j20L04O26J232J635J317Q68R99J204O30k61l84J12J68
$$ 160214 158537 156877 155923 155803 156107 156733 157965 159600 160917 161785 162784 163988 164618 164357 163973 164085 164253
54261A64253k40p9R23J791J774J131L85k27n12l57l6J74M50R03J045N30j09k69
$$ 164253 164013 163934 164857 166648 168422 169553 169938 169711 169199 168842 168806 168980 169430 170333 171378 171908 171799 171530
54243A71530k40m95p28n83o44j448k165j618j40R04J057Q79M99m63j592j752o35
$$ 171530 171290 170795 170067 169484 168840 167392 165227 163609 163469 164373 165430 166309 166808 166345 164753 163001 162366
54226A62366Q07J638J705J242N91K44L60M16k4m99m60k63m13m65J87R46P64j30
$$ 162366 163173 164811 166516 167758 168349 168593 168953 169369 169345 168846 168386 168123 167710 167245 167432 168378 169142 169012
54208A69012o24n45p08j318j658j401r87o83l09Qk9j18L17J013J162O92K68J00
$$ 169012 168388 167843 167135 165817 164159 162758 161771 161088 160779 160787 160758 160640 160957 161970 163132 163824 164092 164192
54190A64192j87o00p64q05j168j626j504q57l66j72J55N42M56K5J3N61J006R98
$$ 164192 164005 163405 162641 161836 160668 159042 157538 156681 156315 156143 156298 156840 157296 157321 157334 157895 158901 159899
54172A59899Q01M95j27p38o77o6J91k83q80j038r04p99p45p17p06m68K15J058
$$ 159899 160700 161195 161068 160330 159653 159587 159778 159495 158615 157577 156673 155874 155129 154412 153706 153238 153453 154511
54154A54511J543J564J309P79ln99o02j43N07J338K010J760O35m7N10J277J035
$$ 154511 156054 157618 158927 159706 159703 159104 158502 158359 158866 160204 162214 163974 164609 164562 165072 166349 167384
54137A67384L62M95J130J081N06N37J111J131N47L81O83M76k12k11O22J034N60
$$ 167384 167746 168241 169371 170452 170958 171495 172606 173737 174284 174665 175348 175824 175612 175401 176023 177057 177617
54120A77617K77P96J239R61O52R56J351J221Q29N38J44l67n59n23r62j748j719
$$ 177617 177894 178690 179929 180890 181542 182498 183849 185070 185899 186437 186581 186214 185655 185132 184170 182422 180703
54103A80703n48M26O4r82j426j043m22J70P51J092J028Q59Q81J021J266J810K525
$$ 180703 180155 180581 180645 179663 178237 177194 176772 176942 177693 178785 179813 180672 181553 182574 183840 185650 188175
54086A88175K961L139L637M662N808O922Q276R613R964Q705O016K252k151o012
$$ 188175 191136 194275 197912 202574 208382 215304 223580 233193 243157 251862 257878 260130 257979 251967
54072B51967p890p724o884o259n433m107l017k766k849k623k256k057j807j411
$$ 251967 244077 236353 229469 223210 217777 213670 210653 207887 205038 202415 200159 198102 196295 194884
54058A94884j243j218m78J201K643K677J664Q32Q02J370K080K410K005J281J125
$$ 194884 193641 192423 191945 193146 195789 198466 200130 200962 201764 203134 205214 207624 209629 210910 212035
54043B12035J617J906J716J947L177M603N314N648O373P307P730P605P461P513
$$ 212035 213652 215558 217274 219221 222398 227001 232315 237963 244336 251643 259373 266978 274439 281952
54029B81952P625P672P372O291M545K910J717L79j394k837l292l337l846m612
$$ 281952 289577 297249 304621 310912 315457 318367 320084 320463 319069 316232 312940 309603 305757 301145
54015C01145m859m582m389m462m552m601m672m637m660n356o669p206n840l477
$$ 301145 296286 291704 287315 282853 278301 273700 269028 264391 259731 254375 247706 240500 234660 231183
54001B31183k108k302k856k798k497k523k542k013j280j190j853k369j939q91
$$ 231183 229075 226773 223917 221119 218622 216099 213557 211544 210264 209074 207221 204852 202913 202022
53987B02022l58q94j759j820r18K9K72j2j88QL43L90j06q44j076m69K99M07J17
$$ 202022 201664 200770 199011 197191 196273 196302 196574 196562 196374 196382 196725 197115 197009 196165 195089 194620 194919 195326 195443
53968A95443L05R71J202P17K84L36L41J6O7J002K099K408K039J691J520J253R57
$$ 195443 195748 196719 197921 198638 198922 199258 199599 199615 199682 200684 202783 205191 207230 208921 210441 211694 212651
53951B12651R03J000J088J455K482L946N206N932O336O891P985R556J1028J2056
$$ 212651 213554 214554 215642 217097 219579 223525 228731 234663 240999 247890 255875 265431 276459 288515
53937B88515J3286J5690J9023K1673K2192K0122J5390Q149k99p590j2185j4346
$$ 288515 301801 317491 336514 358187 380379 400501 415891 424040 423741 416151 403966 389620
53925C89620j4790j3500j0679p757o135n523m656l093j392O4J323K290K792L084
$$ 389620 374830 361330 350651 342894 336759 331236 326580 323487 322095 322159 323482 325772 328564 331648
53911C31648L500L898L994L933L849L367K214R47K83R7j91o48j019j472k261l003
$$ 331648 335148 339046 343040 346973 350822 354189 356403 357350 357633 357730 357539 356891 355872 354400 352139 349136
53895C49136l136k868k843l099l196l175l518m274m995n486n916o158n842n026
$$ 349136 346000 343132 340289 337190 333994 330819 327301 323027 318032 312546 306630 300472 294630 289604
53881B89604m284m008m102m319m428m166l515k931k831l030l085k940k795k650
$$ 289604 285320 281312 277210 272891 268463 264297 260782 257851 255020 251990 248905 245965 243170 240520
53867B40520k540k887l838m578m093k617j454j315j553j244m18J73Q3m01o56m20
$$ 240520 237980 235093 231255 226677 222584 219967 218513 217198 215645 214401 213983 214156 214239 213838 213182 212762
53851B12762j08l90j310k063j924j187p60q98r06j97P80J014J86r11j311j015
$$ 212762 212654 212264 210954 208891 206967 205780 205020 204122 203216 203019 203799 204813 204999 204088 202777 201762
53835B01762q44j184j456j097m90k70j49O02J678J861Q34j70M1J143J989K024
$$ 201762 200918 199734 198278 197181 196691 196421 196272 196874 198552 200413 201247 201077 201118 202261 204250 206274
53819B06274J495Q22L98N87J383K286K820K898K585J987J514J589J995K166K194
$$ 206274 207769 208591 208989 209576 210959 213245 216065 218963 221548 223535 225049 226638 228633 230799 232993
53804B32993K733L670L998L393K863L241M032M422M425M317L895L173K825L014
$$ 232993 235726 239396 243394 246787 249650 252891 256923 261345 265770 270087 273982 277155 279980 282994
53790B82994K722J306j32k22O06Q52J46o70j209j799k286k109j578j781k931l919
$$ 282994 285716 287022 286890 286668 287274 288126 288272 287602 286393 284594 282308 280199 278621 276840 273909 269990
53774B69990l833l022k383k359k869l571l949l708l210l048l210l137k562j760
$$ 269990 266157 263135 260752 258393 255524 251953 248004 244296 241086 238038 234828 231691 229129 227369
53760B27369j098q09j077j770k220j833q17J02N32N01L1p82j481j650j417j077
$$ 227369 226271 225462 224385 222615 220395 218562 217745 217847 218379 218880 218911 218129 216648 214998 213581 212504
53744B12504n29L68J219J572J594J627J424O64j33j14O18J105Q46K47j81l21j53
$$ 212504 211975 212343 213562 215134 216728 218355 219779 220443 220310 220196 220814 221919 222765 223012 222831 222510 222357
53727B22357L98J177J897K417K587K093J026K03L54J236K157K931L529L351J912
$$ 222357 222755 223932 225829 228246 230833 232926 233952 234155 234509 235745 237902 240833 244362 247713 249625
53712B49625k4j056q10p5O21J514K689L651L999L753K987J875J089J330K392L450
$$ 249625 249601 248545 247735 247660 248281 249795 252484 256135 260134 263887 266874 268749 269838 271168 273560 277010
53696B77010M199M885N348N052M086L132K321J174j44o28M6Q18O59j25n98n22
$$ 277010 281209 286094 291442 296494 300580 303712 306033 307207 307063 306435 306481 307299 307958 307833 307235 306713
53680C06713l06k21k68m84p70p00n3O95Q01J15p84j259j160p75m21j64J11L95
$$ 306713 306407 306186 305918 305434 304664 303964 303911 304606 305407 305522 304738 303479 302319 301544 301123 300959 301070 301465
53662C01465M73K25j83n16o73o12l54j50k91n64l35M82J087Q03k5o18p61o90m81
$$ 301465 301938 302163 301980 301464 300791 300179 299825 299675 299384 298820 298485 298967 300054 300857 300832 300214 299453 298763 298282
53643B98282j19J50K14M27J020J588J703J581J512J238O39L94J006J739J605R88
$$ 298282 298163 298313 298527 298954 299974 301562 303265 304846 306358 307596 308235 308629 309635 311374 312979 313967
53627C13967R93J578J684J123R72J842K991L553L590L602L768M087M579N083N374
$$ 313967 314960 316538 318222 319345 320317 322159 325150 328703 332293 335895 339663 343750 348329 353412 358786
53612C58786N621O168O890P361P605P925Q126P687O602N289L752J819R1m73l8
$$ 358786 364407 370575 377465 384826 392431 400356 408482 416169 422771 428060 431812 433631 433722 433249 433211
53597D33211J23o09j458j624j398j389j477j173n36j37l45r75j417j195n65m26
$$ 433211 433334 432725 431267 429643 428245 426856 425379 424206 423670 423533 423188 422213 420796 419601 419036 418610
53581D18610j197k109k193j649j407j629j657j293j054j183j327j358j542j747
$$ 418610 417413 415304 413111 411462 410055 408426 406769 405476 404422 403239 401912 400554 399012 397265
53567C97265j465p49k85l06l12n3J32J14K60O18P20M11J33J24J23N3K32O60Q79
$$ 397265 395800 395051 394766 394460 394148 394095 394227 394341 394601 395219 395939 396350 396483 396607 396730 396783 397015 397675 398554
53548C98554P39O27P96J182J813K671L192K866K247K286K776K697K096K196L365
$$ 398554 399293 399920 400716 401898 403711 406382 409574 412440 414687 416973 419749 422446 424542 426738 430103
53533D30103M518M959N372O342P260P588P960R035J0280J0933J1250J1811J2357
$$ 430103 434621 439580 444952 451294 458554 466142 474102 483137 493417 504350 515600 527411 539768
53520E39768J2373J2254J2830J4121J5425J6345J7072J7896J9030K0587K2307
$$ 539768 552141 564395 577225 591346 606771 623116 640188 658084 677114 697701 720008
53509G20008K3644K4411K4975K5551K5901K5917K5875K5849K5565K5095K4899
$$ 720008 743652 768063 793038 818589 844490 870407 896282 922131 947696 972791 997690
53498I97690K4877K4309K3142K2423K2783K3379K3048K1815K0563J9824J9586
$$ 997690 1022567 1046876 1070018 1092441 1115224 1138603 1161651 1183466 1204029 1223853 1243439
53487A243439J9707J9917J9808J9359J8996J8827J8438J7823J7746J8670J9999
$$ 1243439 1263146 1283063 1302871 1322230 1341226 1360053 1378491 1396314 1414060 1432730 1452729
53476A452729K0812K0698J9466J6891J3334R899P355N453L663J834k76l187o781
$$ 1452729 1473541 1494239 1513705 1530596 1543930 1553829 1561184 1566637 1570300 1572134 1571858 1568671 1561890
53463A561890j0048j2350j4073j5579j6446j6449j6262j6414j6540j6516j7274
$$ 1561890 1551842 1539492 1525419 1509840 1493394 1476945 1460683 1444269 1427729 1411213 1393939
53452A393939j9412k1870k3150k3177k2874k2598k2142k1670k1460k1155k0301
$$ 1393939 1374527 1352657 1329507 1306330 1283456 1260858 1238716 1217046 1195586 1174431 1154130
53441A154130j9258j8561j7842j6339j4130j1854r658p345n227l774k808j874
$$ 1154130 1134872 1116311 1098469 1082130 1068000 1056146 1046488 1039143 1033916 1030142 1027334 1025460
53429A025460j054n16K49J813L812N536P073Q795J0289J0960J1347J2604J4788
$$ 1025460 1024406 1023890 1024139 1025952 1029764 1035300 1042373 1051168 1061457 1072417 1083764 1096368 1111156
53416A111156J6885J8405J9764K1191K2378K3298K4350K5601K6818K8219L0265
$$ 1111156 1128041 1146446 1166210 1187401 1209779 1233077 1257427 1283028 1309846 1338065 1368330
53405A368330L2662L4575L5874L7250L9064M1059M3208M5845M8774N1232N2964
$$ 1368330 1400992 1435567 1471441 1508691 1547755 1588814 1632022 1677867 1726641 1777873 1830837
53394A830837N4472N6018N7314N8397N9842O1714O3133O3338O2509O1164N9415
$$ 1830837 1885309 1941327 1998641 2057038 2116880 2178594 2241727 2305065 2367574 2428738 2488153
53383B488153N7282N5035N2795N0297M7501M4950M2976M0946L7904L3741K9254
$$ 2488153 2545435 2600470 2653265 2703562 2751063 2796013 2838989 2879935 2917839 2951580 2980834
53372B980834K5135K1298J7299J2947Q267K967l635j1920k1329l0732l9280m6581
$$ 2980834 3005969 3027267 3044566 3057513 3065780 3068747 3065112 3053192 3031863 3001131 2961851 2915270
53360B915270n2199n5770n7689n8978o0048o0362n9705n8991n9025n9170n8145
$$ 2915270 2863071 2807301 2749612 2690634 2630586 2570224 2510519 2451528 2392503 2333333 2275188
53349B275188n5787n2991n0291m7627m5427m4774m6025m7991m8946m8073m5780
$$ 2275188 2219401 2166410 2116119 2068492 2023065 1978291 1932266 1884275 1835329 1787256 1741476
53338A741476m3045m0608l8576l6550l4228l1677k9007k6133k3139k0408j8019
$$ 1741476 1698431 1657823 1619247 1582697 1548469 1516792 1487785 1461652 1438513 1418105 1400086
53327A400086j5528j2936j1319j1639j3312j4808j5404j5465j5188j4210j2594
$$ 1400086 1384558 1371622 1360303 1348664 1335352 1320544 1305140 1289675 1274487 1260277 1247683
53316A247683j1148j0340r676q582p272o216n250l794j775J53J341J799K126K884
$$ 1247683 1236535 1226195 1216519 1207937 1200665 1194449 1189199 1185405 1183630 1183783 1185124 1186923 1189049 1191933
53302A191933M142N635P226R004J1043J3275J5646J8030K0062K1488K2691K4357
$$ 1191933 1196075 1201710 1208936 1217940 1228983 1242258 1257904 1275934 1295996 1317484 1340175 1364532
53290A364532K6514K8534L0125L1479L2274L1588K9337K6858K5240K4003K2251
$$ 1364532 1391046 1419580 1449705 1481184 1513458 1545046 1574383 1601241 1626481 1650484 1672735
53279A672735K0283J8891J7685J5437J1792P567L515j44l174n448p510j0107j3209
$$ 1672735 1693018 1711909 1729594 1745031 1756823 1764390 1767905 1767761 1764587 1759139 1751629 1741522 1728313
53266A728313j6285j9293k2431k5195k6921k8090k9829l2028l3320l3194l2817
$$ 1728313 1712028 1692735 1670304 1645109 1618188 1590098 1560269 1528241 1494921 1461727 1428910
53255A428910l3235l3919l3825l2936l1974l1217l0383k9349k8282k7384k6873
$$ 1428910 1395675 1361756 1327931 1294995 1263021 1231804 1201421 1172072 1143790 1116406 1089533
53244A089533k6971k7597k8298k8728k8908k8792k8013k6335k4130k2108k0732
$$ 1089533 1062562 1034965 1006667 977939 949031 920239 892226 865891 841761 819653 798921
53233G98921j9980j9469j8710j7438j5750j3815j1665r500p934p415p613p848
$$ 798921 778941 759472 740762 723324 707574 693759 682094 672594 664660 657245 649632 641784
53221F41784q013q583r743j1111j2300j3211j3746j3798j3604j3603j3733j3417
$$ 641784 633771 625188 615445 604334 592034 578823 565077 551279 537675 524072 510339 496922
53209D96922j2348j0940r760q894q088p249o569o260o279o377o472o840p701q562
$$ 496922 484574 473634 463874 454980 446892 439643 433074 426814 420535 414158 407686 400846 393145 384583
53195C84583q527p427o137n558n708o171o749p201o910n558l788k537k051k073
$$ 384583 376056 368629 362492 356934 351226 345055 338306 331105 324195 318637 314849 312312 310261 308188
53181C08188k509l253l720l446k847k627k705k463j774j104p59p71j230k036k602
$$ 308188 305679 302426 298706 295260 292413 289786 287081 284618 282844 281740 280981 280210 278980 276944 274342
53166B74342k489k063j887j808j383p63l23P7O13P42j1j025j401j349j610j974
$$ 274342 271853 269790 267903 266095 264712 263949 263626 263703 264316 265058 265047 264022 262621 261272 259662 257688
53150B57688j669r38p06r58q53l63k15l64m6O11O68K55N78J694K065R90j60j09
$$ 257688 256019 255081 254375 253417 252564 252201 251986 251622 251576 252187 252855 253110 253688 255382 257447 258437 258277 258168
53132B58168N20N33L9j47O4L08O16R79Q28n7p56l51O94J165O81j51p31r05p09
$$ 258168 258688 259221 259260 259113 259177 259485 260101 261080 261908 261851 261095 260744 261438 262603 263284 263133 262402 261497 260788
53113B60788l95m29r73j654k081k266k188j643q00k99l63m48j88j7l07o23m76
$$ 260788 260393 259964 258991 257337 255256 252990 250802 249159 248359 248060 247697 247249 247061 247044 246737 246114 245638
53096B45638j61j81l26n4N37Q41O13K10Q2L62P73P15j75j357j702p53P64J854
$$ 245638 245477 245296 244970 244916 245453 246294 246907 247117 247199 247561 248334 249049 248874 247517 245815 245062 245826 247680
53078B47680K182J904J180K66l70m86k75J4K81K99j94r57j360j236j030r88q40
$$ 247680 249862 251766 252946 253212 252842 252356 252081 252095 252376 252675 252481 251524 250164 248928 247898 246910 246070
53061B46070n17m76r38j433j411q35K4P70R02L17j49M64J758K288J588P22N68
$$ 246070 245553 245077 244139 242706 241295 240460 240484 241254 242156 242473 242324 242788 244546 246834 248422 249144 249712
53044B49712O68L08l48q86j349j669j271j06Q46Q41L84K28K09j07m22k62P8Q0
$$ 249712 250380 250688 250340 249454 248105 246436 245165 245059 245905 246746 247130 247358 247567 247460 247038 246776 246854 246934
53026B46934q8l6jl12n70k13M92Q57P72O00M52L00L95Q39J110P23j2n15p49q74
$$ 246934 246846 246810 246809 246497 245927 245714 246206 247063 247835 248435 248887 249187 249582 250421 251531 252254 252242 251727 250978 250104
53006B50104o01K84J202J376Q48K13l14q19r60k33J182K403K702J963N67p95j496
$$ 250104 249503 249787 250989 252365 253213 253426 253112 252293 251333 251100 252282 254685 257387 259350 259917 259122 257626
52989B57626j498j260r88m82J00J90j35K0R22J561J131K75o6o0k65l26L50J255
$$ 257626 256128 254868 253880 253398 253498 253688 253553 253573 254495 256056 257187 257462 257396 257336 257071 256745 257095 258350
52971B58350J410R27O79Q13P57M84N69J036J330J338J469J699J517Q17J8o88j371
$$ 258350 259760 260687 261366 262179 262936 263420 263989 265025 266355 267693 269162 270861 272378 273195 273213 272525 271154
52954B71154j790j674j474j880k634k748j963j036n07r0M70Q28O59K33l6r6p5
$$ 271154 269364 267690 266216 264336 261702 258954 256991 255955 255448 255358 255828 256656 257315 257548 257512 257416 257341
52937B57341j8M2L7n2l01q72j582j775j098j41K34l6m02o41q87r40m26M03Q08
$$ 257341 257323 257365 257402 257350 257049 256177 254595 252820 251722 251581 251815 251779 251377 250736 249849 248909 248483 248886 249694
52918B49694N68K13J77L13L94M58N47N56M04J03l25p20p79n75p16j488k110j598
$$ 249694 250262 250475 250652 250965 251359 251817 252364 252920 253324 253427 253102 252382 251603 251028 250312 248824 246714 245116
52900B45116j76R22R99N46K63J90Ml08m61k57K37Q13J331J847K371K538J912P17
$$ 245116 244940 245862 246861 247407 247670 247860 247864 247556 247095 246838 247075 247888 249219 251066 253437 255975 257887 258604
52882B58604k27m93n11o77o97k60K26J78l40q72j195j156m47Q38J966K482K838
$$ 258604 258377 257884 257373 256696 255999 255739 255965 256143 255803 254931 253736 252580 252133 252971 254937 257419 260257
52865B60257L420L647K866J569P56N27K66k28p16j290k121k760k620k014j813
$$ 260257 263677 267324 270190 271759 272515 273042 273308 273080 272364 271074 268953 266193 263573 261559 259746
52850B59746k274k961l519l726l221k080j203j197j377r33l98p07j386j222m04
$$ 259746 257472 254511 250992 247266 244045 241965 240762 239565 238188 237255 236857 236150 234764 233542 233138
52835B33138k39q36q52K93J577K083K020J622N70q87j627j254q63j343k023j749
$$ 233138 232899 232063 231211 231504 233081 235164 237184 238806 239376 238489 236862 235608 234745 233402 231379 229630
52819B29630n03Q31J638J791J353P33P32J838L699N439O092M842J656k121m648
$$ 229630 229127 229958 231596 233387 234740 235473 236205 238043 241742 247181 253273 258115 259771 257650 253002
52804B53002n314m948m315l385k282j698j848j931j288l89%j43l94n79o78n55
$$ 253002 247688 242740 238425 235040 232758 231060 229212 227281 225993 225604 225604 225461 225067 224488 223810 223255
52788B23255k99k65l89r5P29J308J048L90J32M60J036J507J492O87n07j067n77
$$ 223255 222956 222691 222302 222207 222936 224244 225292 225682 225814 226274 227310 228817 230309 230996 230489 229422 228845
52771B28845J74K80j19l06j14L9p4l01m96o80q73j033j056p78k69M6m7oP82J842
$$ 228845 229019 229299 229180 228874 228760 228799 228725 228424 227928 227248 226375 225342 224286 223508 223239 223285 223238 223232 224014 225856
52751B25856K002J053J52K54R90J474J458J218J001J054J580K228K290J746J407
$$ 225856 227858 228911 229063 229317 230307 231781 233239 234457 235458 236512 238092 240320 242610 244356 245763
52736B45763J630J672Q90j94o42k49O66J871K902K828J284o99j771j874j943k360
$$ 245763 247393 249065 249955 249761 249119 248870 249536 251407 254309 257137 258421 257722 255951 254077 252134 249774
52720B49774k565k112j273m76J23M14J99n02j307j744j590r49k20J96K96M46Q95
$$ 249774 247209 245097 243824 243348 243471 243885 244084 243582 242275 240531 238941 237992 237772 237968 238264 238710 239605
52703B39605J465J869J997J748R23l55j417j539o34O22J282R00l2m60Q6R19J138
$$ 239605 241070 242939 244936 246684 247607 247252 245835 244296 243662 244284 245566 246466 246434 245974 246060 246979 248117
52686B48117P98N23L25k52r35q42M0O48M63K49N73P52Q3p76p83k06j74r08j475
$$ 248117 248915 249438 249763 249511 248576 247734 247774 248422 248885 249134 249707 250459 250542 249766 248983 248777 248603 247695 246220
52667B46220j240o00j45Q2K97N15O99R76J455J979K253K198K101K388L073L591
$$ 246220 244980 244380 244235 244317 244614 245129 245828 246804 248259 250238 252491 254689 256790 259178 262251 265842
52651B65842L301K152O30p77j758k073j825j655k075k588k238j015M6K71L1j59
$$ 265842 269143 271295 271925 271148 269390 267317 265492 263837 261762 259174 256936 255921 255967 256238 256269 256110
52635B56110l20m80k76L31P14M99K39N30J089J268J018O88K86l63j076j453j415
$$ 256110 255790 255310 255034 255365 256079 256578 256817 257347 258436 259704 260722 261410 261696 261333 260257 258804 257389
52618B57389j153q17n34n23p78r34o83j03N57J135J459J419J204J035O89j01p95
$$ 257389 256236 255419 254885 254362 253584 252650 251967 251864 252421 253556 255015 256434 257638 258673 259362 259261 258466
52601B58466n13N33J039L72n77q00l90J28P47J463J707J198O34O88R00M65m09
$$ 258466 257953 258486 259525 259897 259320 258520 258130 258258 259005 260468 262175 263373 264007 264695 265595 266060 265651
52584B65651q83p54m70k06K34P98J224J478J519R89j79j158j041k2Q73J036O21
$$ 265651 264768 264014 263544 263338 263572 264370 265594 267072 268591 269580 269401 268243 267202 267180 268053 269089 269710
52567B69710p2q75j537j832j819j577j004j79M21N51N45N52M9j197k281k208j369
$$ 269710 269638 268763 267226 265394 263575 261998 260994 260815 261236 261787 262332 262884 262933 261736 259455 257247 255878
52550B55878r92j351j470o53O09J389J306O31p4k75J37P23R29O62K64J33N32J402
$$ 255878 254886 253535 252065 251412 252021 253410 254716 255347 255273 254998 255135 255858 256787 257449 257713 257846 258378 259780
52532B59780K151K010R24l04r64j017o45R4Q28Q61J67l68j98J81L06N54J138J291
$$ 259780 261931 263941 264865 264561 263597 262580 261935 262029 262857 263718 263885 263517 263319 263500 263806 264360 265498 266789
52514B66789N27j50M73J973K857K621J996J604J473J608J902J714O43o02j144
$$ 266789 267316 267166 267639 269612 272469 275090 277086 278690 280163 281771 283673 285387 286030 285428 284284
52499B84284j371k223l340l391k146q94o01q72r32n33K69J236J671J013j33n28
$$ 284284 282913 280690 277350 273959 271813 270919 270318 269446 268514 267981 268250 269486 271157 272170 272037 271509
52483B71509k6K58l11j013r80l19L64P82Q94P08N07O48R60R10M87K41L62M94N50
$$ 271509 271483 271741 271430 270417 269437 269118 269482 270264 271158 271866 272373 273021 273981 274891 275378 275619 275981 276475 277025
52464B77025R55J809K532K592K062J270N07J9k24p22j714k428j975q33m06j086
$$ 277025 277980 279789 282321 284913 286975 288245 288752 288771 288547 287825 286111 283683 281708 280875 280469 279383
52448B79383j873k007j834j712j288m22K06M7n50j094j612k107k078j327m67q8
$$ 279383 277510 275503 273669 271957 270669 270247 270453 270500 269950 268856 267244 265137 263059 261732 261265 261177
52432B61177M0L69P67Q91Q12P19N13J66K6K63M77L40J26J64K66K12K75P29J281
$$ 261177 261217 261586 262353 263244 264056 264775 265288 265454 265480 265743 266220 266560 266686 266850 267116 267328 267603 268332 269613
52413B69613J629K162L437N174O450O923P365Q823J1440J3976J4590J2299P781
$$ 269613 271242 273404 276841 282015 288465 295388 302753 311576 323016 336992 351582 363881 371662
52400C71662K611k153o215r191j0380r715q142o693n617m708l861k969j840o70
$$ 371662 374273 372120 365905 356714 346334 336619 328477 321784 316167 311459 307598 304629 302789 302119
52386C02119q7k97o52n66k62j90k12M2M54P61J208K104K972K958K119J546K046
$$ 302119 302032 301735 301083 300517 300255 300065 299853 299895 300349 301110 302318 304422 307394 310352 312471 314017 316063
52369C16063L203M016M073L743L425L006K206J179M27J05k44r29j418r61K83J319
$$ 316063 319266 323282 327355 331098 334523 337529 339735 340914 341341 341446 341202 340273 338855 337894 338177 339496
52353C39496J548J406J588K153K663K842K832K972L424L878L715K825K017K105
$$ 339496 341044 342450 344038 346191 348854 351696 354528 357500 360924 364802 368517 371342 373359 375464
52339C75464K768L040K877L258M550N765N960N464N153N255N719O996R410J2039
$$ 375464 378232 381272 384149 387407 391957 397722 403682 409146 414299 419554 425273 432269 441679 453718
52325D53718J3437J3467J3494J4538J6001J6612J6056J5138J4687J4825J5235
$$ 453718 467155 480622 494116 508654 524655 541267 557323 572461 587148 601973 617208
52314F17208J5711J6292J7073J8101J9307K0398K0890K0496J9560J8800J8518
$$ 617208 632919 649211 666284 684385 703692 724090 744980 765476 785036 803836 822354
52303H22354J8330J7781J6918J6013J5077J4055J3155J2485J1611R975P642N136
$$ 822354 840684 858465 875383 891396 906473 920528 933683 946168 957779 967754 975396 980532
52291I80532K696K32k048l689m618n237n791o170o329o406o373o081n584m977
$$ 980532 983228 983460 981412 977723 973105 967868 962077 955907 949578 943172 936799 930718 925134 920157
52277I20157l980k340n74M98R52J682L021M348N263O232P593Q768R123Q970R070
$$ 920157 916177 913837 913263 913761 914713 916395 919416 923764 929027 935259 942852 951620 960743 969713 978783
52262I78783R621J0312J1056J2044J3297J4537J5449J5804J5652J5468J5761J6280
$$ 978783 988404 998716 1009772 1021816 1035113 1049650 1065099 1080903 1096555 1112023 1127784 1144064
52250A144064J6058J4472J1869Q941O017L265J034m66j535k657m032n639p362
$$ 1144064 1160122 1174594 1186463 1195404 1201421 1204686 1205720 1205254 1203719 1201062 1197030 1191391 1184029
52237A184029q834r556r461r056q813q847r257j0187j1272j1683j1110j0171r423
$$ 1184029 1175195 1165639 1156178 1147122 1138309 1129462 1120205 1110018 1098746 1087063 1075953 1065782 1056359
52224A056359q611p362o096n553n684n623m655k841q56N39J093J363K147L485
$$ 1056359 1047748 1040386 1034290 1028737 1023053 1017430 1012775 1009934 1009078 1009617 1010710 1012073 1014220 1017705
52210A017705M590M896M650M271L771L149K722K613K490K294K631L852N281O044
$$ 1017705 1022295 1027191 1031841 1036112 1039883 1043032 1045754 1048367 1050857 1053151 1055782 1059634 1064915 1070959
52196A070959O177O200O110N562M760M271M081L591K517J149k49j613k680l134
$$ 1070959 1077136 1083336 1089446 1095008 1099768 1104039 1108120 1111711 1114228 1115377 1115128 1113515 1110835 1107701
52182A107701l285l985n603p462q552q493p701o861o422o417o537o449o040n408
$$ 1107701 1104416 1100431 1094828 1087366 1078814 1070321 1062620 1055759 1049337 1042920 1036383 1029934 1023894 1018486
52168A018486m647l762k696j480l40L96O48P14Q59Q89N10m7k10J01L90L87M16
$$ 1018486 1013839 1010077 1007381 1005901 1005561 1005957 1006605 1007319 1008178 1009067 1009577 1009530 1009320 1009421 1009811 1010198 1010614
52151A010614P29J073J202J355J780K213K213J794J358J140R89N37m83j935l200
$$ 1010614 1011343 1012416 1013618 1014973 1016753 1018966 1021179 1022973 1024331 1025471 1026460 1026997 1026514 1024579 1021379
52136A021379l667l324k547j477mJ668L100M384O133Q522J0967J3001J4879J7005
$$ 1021379 1017712 1014388 1011841 1010364 1010360 1012028 1015128 1019512 1025645 1034167 1045134 1058135 1073014 1090019
52122A090019J9273K1305K2859K3713K3643K2863K2071K1863K2271K2959K3423
$$ 1090019 1109292 1130597 1153456 1177169 1200812 1223675 1245746 1267609 1289880 1312839 1336262
52111A336262K3108K1943K0672J9968J9402J8176J6687J6023J5987J5119J3101
$$ 1336262 1359370 1381313 1401985 1421953 1441355 1459531 1476218 1492241 1508228 1523347 1536448
52100A536448J1450J1086J0732Q852N817K923L12k677n931q798j1330j3919j6144
$$ 1536448 1547898 1558984 1569716 1578568 1584385 1587308 1587620 1584943 1579012 1570214 1558884 1544965 1528821
52087A528821j7163j6937j6056j4765j3188j2009j1752j1768j1043r704q565p633
$$ 1528821 1511658 1494721 1478665 1463900 1450712 1438703 1426951 1415183 1404140 1394436 1385871 1378238
52075A378238o261m496k942j485N82L212N586P386Q964J0323J1119J1674J2749
$$ 1378238 1371977 1367481 1364539 1363054 1363636 1366848 1372434 1379820 1388784 1399107 1410226 1421900 1434649
52062A434649J4244J5269J5639J6016J6465J6142J4795J3337J2376J1298R386
$$ 1434649 1448893 1464162 1479801 1495817 1512282 1528424 1543219 1556556 1568932 1580230 1589616
$$ [...]
##END NTUPLES=NMR SPECTRUM
##END=
