##TITLE=AC1428_PERAH13239_7764532_aaiA193wdL
##JCAMPDX= 6.0         $$ Bruker NMR JCAMP-DX V2.0
##DATA TYPE= NMR SPECTRUM
##DATA CLASS= NTUPLES
##ORIGIN= BRUKER
##OWNER= Administrator
$$ 1.72 TOPSPIN		Version 2.1
$$ 2015-07-10 22:33:21.956 -0700  Administrator@X
$$ Compression mode = diff/dup
##.OBSERVE FREQUENCY= 400.02188249412
##.OBSERVE NUCLEUS= ^1H
##.ACQUISITION MODE= SIMULTANEOUS (DQD)
##.ACQUISITION SCHEME= undefined
##.AVERAGES= 8
##.DIGITISER RES= 22
##SPECTROMETER/DATA SYSTEM= spect
##.PULSE SEQUENCE= zg30
##.SOLVENT NAME= COFFEE_meoh
##.SHIFT REFERENCE= INTERNAL, COFFEE_meoh, 1, 14.98509
##AUDIT TRAIL= $$ (NUMBER, WHEN, WHO, WHERE, PROCESS, VERSION, WHAT)
$$ ##TITLE= Audit trail, TOPSPIN		Version 2.1
$$ ##JCAMPDX= 5.01
$$ ##ORIGIN= Bruker BioSpin GmbH
$$ ##OWNER= Administrator
$$ $$ E:\/data/COFFEE/nmr/AC1428_PERAH13239_7764532_aaiA193wdL/30/pdata/1/auditp.txt
$$ ##AUDIT TRAIL=  $$ (NUMBER, WHEN, WHO, WHERE, PROCESS, VERSION, WHAT)
(   1,<2015-07-10 22:33:14.519 -0700>,<Administrator>,<X>,<go>,<TOPSPIN 2.1>,
      <created by zg
	started at 2015-07-10 22:32:08.269 -0700,
	POWCHK enabled, PULCHK disabled,
       configuration hash MD5:
       21 0F 79 D6 B3 7B B4 F6 88 20 88 DB 03 48 BD 9F
       data hash MD5: 64K
       39 11 0B AD B4 13 A2 FC BB 33 CE 43 A5 23 76 F5>)
(   2,<2015-07-10 22:33:17.769 -0700>,<Administrator>,<X>,<proc1d>,<TOPSPIN 2.1>,
      <Start of raw data processing
       efp LB = 0 FT_mod = 6 PKNL = 1 PHC0 = 0 PHC1 = 0 SI = 32K 
       data hash MD5: 32K
       76 33 E6 DB 04 EB 80 C3 90 E8 5B A4 EA D8 22 F2>)
(   3,<2015-07-10 22:33:18.066 -0700>,<Administrator>,<X>,<proc1d>,<TOPSPIN 2.1>,
      <pk PHC0 = 92.46094 PHC1 = 0 
       data hash MD5: 32K
       DE F3 9D 51 DE 63 8F D1 01 E1 C2 9A 90 72 C9 EA>)
(   4,<2015-07-10 22:33:18.175 -0700>,<Administrator>,<X>,<proc1d>,<TOPSPIN 2.1>,
      <abs ABSG = 1 
       data hash MD5: 32K
       F8 90 20 24 0A 49 0F 54 CC 8D 2D C2 EF 10 3F D5>)
(   5,<2015-07-10 22:33:18.253 -0700>,<Administrator>,<X>,<proc1d>,<TOPSPIN 2.1>,
      <abs ABSG = 2 
       data hash MD5: 32K
       1C 69 F3 90 B6 C9 74 FF B2 EC AB 44 35 5F 8A 7A>)
(   6,<2015-07-10 22:33:18.316 -0700>,<Administrator>,<X>,<proc1d>,<TOPSPIN 2.1>,
      <abs ABSG = 3 
       data hash MD5: 32K
       9D E2 8B 8D 57 31 1B B3 A8 0D 99 B6 B0 FC A2 CD>)
(   7,<2015-07-10 22:33:18.378 -0700>,<Administrator>,<X>,<proc1d>,<TOPSPIN 2.1>,
      <abs ABSG = 4 
       data hash MD5: 32K
       4D 97 11 8D 0C D9 BA 40 E0 0B 99 1A CC 6C 52 20>)
(   8,<2015-07-10 22:33:18.441 -0700>,<Administrator>,<X>,<proc1d>,<TOPSPIN 2.1>,
      <abs ABSG = 5 
       data hash MD5: 32K
       84 00 06 65 29 DA 85 3D 0E 5C 04 9F B0 D2 AD 1B>)
$$ ##END=
$$ 
$$ $$ hash MD5
$$ $$ 8B EA A0 13 89 72 9B F9 EE 58 18 B6 71 EA FC 9E
##$RELAX= 
##$RELAX= 
##$RELAX= 
##$RELAX= 
##$RELAX= 
##$RELAX= 
##$RELAX= 
$$ Bruker specific parameters
$$ --------------------------
##$DU= <E:\>
##$EXPNO= 30
##$NAME= <AC1428_PERAH13239_7764532_aaiA193wdL>
$$ [...]
150 150 150 150 150 150 150 150
##$TP07= 0
##$TPNAME0= <>
##$TPNAME1= <>
##$TPNAME2= <>
##$TPNAME3= <>
##$TPNAME4= <>
##$TPNAME5= <>
##$TPNAME6= <>
##$TPNAME7= <>
##$TPOAL= (0..7)
0.5 0.5 0.5 0.5 0.5 0.5 0.5 0.5
##$TPOFFS= (0..7)
0 0 0 0 0 0 0 0
##$TUNHIN= 0
##$TUNHOUT= 0
##$TUNXOUT= 0
##$USERA1= <user>
##$USERA2= <user>
##$USERA3= <user>
##$USERA4= <user>
##$USERA5= <user>
##$V9= 5
##$VALIST= <valist>
##$VCLIST= <CCCCCCCCCCCCCCC>
##$VD= 0
##$VDLIST= <DDDDDDDDDDDDDDD>
##$VPLIST= <PPPPPPPPPPPPPPP>
##$VTLIST= <TTTTTTTTTTTTTTT>
##$WBST= 2048
##$WBSW= 25
##$XGAIN= (0..3)
0 0 0 0
##$XL= 0
##$YL= 0
##$YMAX_a= 653831
##$YMIN_a= -552772
##$ZGOPTNS= <>
##$ZL1= 120
##$ZL2= 120
##$ZL3= 120
##$ZL4= 120
##$ABSF1= 14.98509
##$ABSF2= -5.573092
##$ABSG= 5
##$ABSL= 3
##$ALPHA= 0
##$AQORDER= 0
##$ASSFAC= 0
##$ASSFACI= 0
##$ASSFACX= 0
##$ASSWID= 0
##$AUNMP= <proc_prof1d_extract_pilot.lims>
##$AXLEFT= 0
##$AXNAME= <>
##$AXNUC= <1H>
##$AXRIGHT= 0
##$AXTYPE= 0
##$AXUNIT= <>
##$AZFE= 0.1
##$AZFW= 0.1
##$BCFW= 0
##$BC_mod= 0
##$BYTORDP= 0
##$COROFFS= 0
##$CY= 15
##$DATMOD= 1
##$DC= 0
##$DFILT= <>
##$DTYPP= 0
##$F1P= 0
##$F2P= 0
##$FCOR= 0.5
##$FTSIZE= 32768
##$FT_mod= 6
##$GAMMA= 0
##$GB= 0
##$INTBC= 1
##$INTSCL= 1
##$ISEN= 128
##$LB= 0
##$LEV0= 0
##$LPBIN= 0
##$MAXI= 10000
##$MC2= 0
##$MEAN= 0
##$ME_mod= 0
##$MI= 0
##$NCOEF= 0
##$NC_proc= -8
##$NLEV= 6
##$NOISF1= 0
##$NOISF2= 0
##$NSP= 0
##$NTH_PI= 0
##$NZP= 0
##$OFFSET= 14.98509
##$PC= 1
##$PHC0= 92.46094
##$PHC1= 0
##$PH_mod= 1
##$PKNL= yes
##$PPARMOD= 0
##$PPDIAG= 0
##$PPIPTYP= 0
##$PPMPNUM= 2147483647
##$PPRESOL= 1
##$PSCAL= 4
##$PSIGN= 0
##$PYNMP= <proc.py>
##$REVERSE= no
##$SF= 400.02
##$SI= 32768
##$SIGF1= 0
##$SIGF2= 0
##$SINO= 400
##$SIOLD= 32768
##$SPECTYP= <>
##$SREGLST= <1H.CDCl3>
##$SSB= 0
##$STSI= 32768
##$STSR= 0
##$SW_p= 8223.68421052631
##$SYMM= 0
##$S_DEV= 0
##$TDeff= 65536
##$TDoff= 0
##$TI= <>
##$TILT= no
##$TM1= 0
##$TM2= 0
##$TOPLEV= 0
##$USERP1= <user>
##$USERP2= <user>
##$USERP3= <user>
##$USERP4= <user>
##$USERP5= <user>
##$WDW= 1
##$XDIM= 32768
##$YMAX_p= 451214685
##$YMIN_p= -752666
##$CURPLOT= <Network HP LaserJet P1505>
##$CURPRIN= <$Network HP LaserJet P1505>
##$DFORMAT= <normdp>
##$LAYOUT= <+/1D_H.xwp>
##$LFORMAT= <normlp>
##$PFORMAT= <normpl>
##$SURQMSG= 1
$$ End of Bruker specific parameters
$$ ---------------------------------
##NTUPLES= NMR SPECTRUM
##VAR_NAME=  FREQUENCY,     SPECTRUM/REAL,   SPECTRUM/IMAG
##SYMBOL=    X,             R,               I
##VAR_TYPE=  INDEPENDENT,   DEPENDENT,       DEPENDENT
##VAR_FORM=  AFFN,          ASDF,            ASDF
##VAR_DIM=   32768,         32768,           32768
##UNITS=     HZ,            ARBITRARY UNITS, ARBITRARY UNITS
##FACTOR=    0.250966925370066, 1,           1
##FIRST=     8223.43324360094, -242088,      -67327
##LAST=      0,             -112090,         -58251
##MIN=       0,             -752666,         0
##MAX=       8223.43324360094, 451214685,    0
$$ Real data points
##PAGE= N=1
##DATA TABLE= (X++(R..R)), XYDATA
$$ [...]
23822 -153803 -55865 227477 173305 -167437 154198 -467819 -49632 -42748 -123261 349249 -282473
23810 275728 -34039 23062 -58324 94250 -282628 -145104 18091 -119114 178683 69170 297175
23799 297175 -180464 117506 97460 59921 517998 77379 -123325 46913 79651 -233355
23788 -217430 11067 -166670 86613 -147314 -234920 -242782 356997 53607 208301 -6265 111417
23776 -121094 -22605 -87104 -71364 -27535 124899 140391 -126302 -43312 -104157 34878 59543
23765 59543 -64422 133465 44451 -178527 -79911 79717 71010 121721 -110832 -183676 179078
23753 -13055 -191103 22837 -248859 21494 -131057 -283879 -76758 159219 128833 -157096
23742 53271 -96535 -107301 45506 130731 -32692 173460 19016 -48314 28114 7072 175218
23731 175218 18204 -72545 -137940 -91652 11371 -97770 -116017 43392 -260828 -99106 96361
23719 -251232 257825 -161836 -61527 636 363616 -108665 -153138 -1690 -124987 -214520 157948
23707 -375491 233550 20346 -180668 81912 -353501 -33819 -61301 70691 -443667 -407879 183515
23695 -14038 352600 -109441 -87948 62664 1103 81889 -70867 -96712 61451 -310315 -231852
23684 -231852 154378 -165732 37215 119408 12527 97364 291537 100476 178847 -230852
23673 367916 -309981 -97513 -48355 -55571 -127596 179972 99502 317352 34720 -302834 -126118
23661 -158310 -341925 -271322 -153956 194885 -69757 134873 71036 156492 121916 169711 -4556
23649 -67558 479141 -140933 162995 110343 -43369 -173022 239 -83848 -101829 -5172 -40590
23638 -40590 12925 -266992 -335748 -119226 -257779 515465 -277606 28884 -99493 208908
23627 198371 190302 -280838 -16478 -10792 -326489 37186 -135284 237565 339343 -83128 3596
23615 -94708 32128 244535 234482 -38405 45179 -217059 -131558 -21521 -249787 -26328 -76642
23604 -76642 109269 128565 -427482 349772 -59626 8624 -272104 -242100 61871 -118225 72491
23592 -42847 -158020 27506 56352 -299138 -198510 -18502 379512 21584 97196 44656 2070
23580 37694 -179217 -74090 91356 -10341 -95996 224889 110108 -109697 101039 -141088
23569 -4788 187273 96132 252353 -256891 128882 27371 325329 238763 64697 -237148 -166118
23558 -166118 94742 119334 80121 245810 166229 -8253 159145 34036 -280359 -206569 -68565
23546 -55738 111020 261564 18826 197209 14799 -77072 -104827 17926 496 21768 -25396
23534 -235984 68697 -183096 -143041 33632 212255 -152673 101784 -35018 162362 -262717
23523 -25736 164814 -54112 233228 -12922 -90044 -95874 -34670 45490 -195002 -295457 -165917
23512 -165917 -245504 -111119 -16622 -389681 -74331 -248505 128670 59057 3348 -37707 -227256
23501 -227256 -136928 156423 39373 -46637 -160548 -179420 -162996 -152016 -220608 -117364 -302511
23490 -302511 39747 -28919 -93933 415755 123786 -270523 -297684 -238755 -195929 388437 -90025
23478 -89221 -244527 90688 10044 -125413 93093 63046 80136 -289741 280576 31241 -71002
23466 74769 -2023 -162208 -212408 -35470 -50196 93846 152251 -26653 -128849 -64780 226268
23454 -101676 266461 80997 120952 -196195 -211530 -235628 -57721 -497468 289450 -27830 -117166
23443 -117166 -41081 153654 -33968 136050 -66215 20077 -43887 128383 -125331 -77519 -15529
23431 -353259 -58552 -115027 -460853 101376 -60045 -155027 -464724 -2188 10050 111424 317114
23420 317114 -139384 -219091 150998 307992 -118701 192962 240556 -172110 263796 -217843
23409 74845 -132922 59573 65027 -351591 174110 101952 66738 36068 186339 -5172 208074
23397 -127074 -117338 271541 4172 -62774 -4994 441355 51739 -57755 85639 -131020 -221528
23386 -221528 120752 -196432 145446 201879 -184757 -193575 251022 -331944 -207988 38013
23375 -144098 -128742 -64347 -79473 288815 -123666 38247 147681 -52978 154290 -46889 -2877
23363 240458 53250 207539 -155627 214131 -80206 55413 -196372 -102782 87485 -116947
23352 7955 124435 219269 97852 111727 37138 -85330 189820 98342 -158764 1558 -12201
23340 102960 -155637 48812 120583 299025 -44690 -4463 -43945 -27247 265098 29992 -259585
23328 -279122 -95996 -22185 -148290 15185 -226 14927 231727 -128825 181045 -1097 13979
23316 315327 12162 194748 -381933 6247 219643 -17969 31121 -1370 98018 -87329 324327
23304 -21761 190305 -213183 38060 11780 -118851 41024 -135777 -72324 -25870 192117 -294834
23292 -19655 -52369 -315236 -217453 48157 -22285 -324587 333158 -182313 -73658 -152680 275407
23280 13287 -395052 20596 80112 91150 -172825 277885 105026 78794 119643 -305474 -311700
23269 -311700 -333905 155442 161004 -309230 119295 -218915 -77089 -7498 -186437 25269 -300364
23257 -29687 -241147 47571 8114 -176821 -114346 -191868 -156409 42435 73957 -142440 -3284
23245 242667 -61571 84954 230199 -384444 -1582 10295 298339 143829 -35566 -218184 96192
23233 135097 184501 -76341 -243061 249286 145859 179958 77271 -26138 43246 -191593 23084
23221 -26553 -169170 -247744 284232 19060 -126461 187277 -329629 -2487 82469 326988 -148253
23209 4185 -91846 47669 495839 -116033 -255025 -112918 1545 -193999 -166664 -253604 -139836
23198 -139836 -45268 -18873 321415 178316 -153834 -145063 176005 -7923 -218670 -152830 83819
23186 15400 -157729 115014 -190203 -136660 -192760 -211730 61867 -103741 177855 -203970
23175 -40309 -93792 135 -7861 -522809 -128626 -247698 -100924 76002 -192670 149658 -86283
23163 92026 22431 -279580 26191 -170423 93292 266951 -154731 -182683 10936 -212750 -135719
23152 -135719 31528 253648 119562 10086 -29875 -119421 50864 90006 -128089 99340 168233
23141 168233 58442 -7871 -154513 -196111 -286942 44884 -101764 37111 -32766 228244 -36952
23129 -77378 164180 -211818 236716 11930 -25952 270999 13679 22514 512598 56040 47246
23118 47246 57272 150469 -210901 -94084 124105 -38701 104581 244345 879 -63929 9712
23106 208867 -57199 53251 217705 53979 -207555 65469 14420 -185643 347565 -388471
23095 28867 -1434 -69842 189643 11377 241262 -110544 55656 113870 -56094 37636 70209
23084 70209 141355 221800 343191 -31623 -180033 -14593 -2979 -208832 24965 -214311 -194062
23073 -194062 107325 333126 -119110 -125771 -187884 -62949 216904 134739 -299277 16481 152743
23062 152743 -184763 208959 155078 238042 41560 -49617 -282892 -122638 -444968 75866
23051 -343416 -118584 148607 -80882 84786 302604 -101581 -83817 -225225 -14074 157649
23040 196338 -188305 5480 -187721 179652 220436 244484 98277 221427 32549 34387 47157
23029 47157 -21919 226682 162154 -68268 -43518 -258111 208449 -90877 -175064 -370132 79208
23017 -23306 -100623 -176252 -76715 -154994 -52091 -56789 -31452 -52750 -442330 9807 -254177 -131490
23005 -131490 37496 -219910 114374 -252888 -41392 187729 -378272 168362 70297 -240194
22994 2536 102300 -213307 74495 -6748 5460 -427639 -104811 212127 -107912 305534 -123038
22982 20100 59736 -265908 -86890 -88878 367617 -200515 -33066 32567 -307960 334718 279760
22971 279760 57174 -147859 -72870 -48092 83182 194767 -314479 -62 -376564 -94067 -140881
22960 -140881 262587 -108009 313692 -8446 -364019 40305 -64123 150448 93431 48698 -106104
22948 -9115 -22823 -39133 53726 -13793 93877 -15073 82054 -136670 -14439 -79369 -12697 -136064
22936 -136064 -223428 -7390 -145759 -441194 -124749 137885 202908 81560 -187052 69977 267208
22925 267208 182537 -64370 -185771 276479 2853 -68054 -132132 -212564 -202730 66555 13981
22913 -128519 -259678 -312685 -201816 -113178 -195090 -505054 -504131 77442 -110210 -179523 -59199
22901 183991 -185160 187763 -11236 -187812 -109868 -154539 47272 192797 120361 -203156
22890 -215403 -76098 -164672 -66519 372755 11700 -215916 185589 -173053 206352 54428
22879 64178 47330 -18767 -424424 48719 88964 92751 1515 -153352 234467 219020 81199
22867 -41166 -234443 -86154 54480 29413 -9907 71783 -143114 -9746 -116148 180695 -22051
22855 151382 -311966 292810 80453 74987 -32656 104365 170967 213364 -266054 107205 -81412
22843 399446 -198177 -122959 -46714 39077 -283236 69879 -178697 -285463 -67660 -3796 -135591
22832 -135591 -118934 59905 -107303 200946 6362 -82294 -54733 229322 194463 -48179 195932
22820 -139804 63453 65850 252090 -13368 11577 -133478 15724 131508 340398 130873 -136164
22808 -252078 107886 296312 -50206 -116152 195525 -171870 -233849 -315581 102505 142287
22798 142287 -226826 218819 -254308 104987 343643 -208298 7450 -218549 42287 -235512
22787 -219863 122731 -201117 -101850 -186052 -190055 228058 105214 26031 -27569 254784 -61199
22775 52188 76894 21096 -128783 -156864 -171377 -176358 102402 -78811 62742 49174 -79140
22763 86377 -280551 -157427 258612 -89879 -71697 -117726 -453842 -191025 -337 -45237 217042
22751 -45594 -57378 -108228 181306 148342 322257 19325 -237995 -222868 45555 109797 -101320
22739 -59527 -111359 -181971 115353 -24312 -88210 -18208 46786 -13710 -62230 25212 39979
22728 39979 260582 76278 -219181 52836 -198528 159943 5399 12994 -42545 108678 195312
22717 195312 -21823 16593 41696 -87651 86821 -106046 -251649 -136638 -108690 -316875 -11367
22705 -24719 37722 -114773 111306 -147172 4631 -91647 -146694 -194918 -56962 -75027 -117042
22694 -117042 -232051 -173139 -4016 56757 -37071 162842 -33488 473828 -189496 119306 38546
22682 113474 75349 -36572 119600 -180244 -56575 579 -120565 -267023 -45672 -89019 -129954
22671 -129954 -272719 22601 157612 182397 241726 -7866 236748 -5803 -170964 -55279 -99921
22660 -99921 153150 135626 -95463 148010 -144410 135969 -222395 -597508 146067 -229863
22649 -12512 153882 32734 -249030 -363555 9393 56488 -145390 -96998 -77229 -87078 92708
22637 -315605 -259400 111614 112422 -115909 -92609 -125244 -98302 -81885 -213153 137993 -52815
22625 234355 -281774 103121 -127491 125200 -363889 155734 115776 72905 150419 -58985
22614 -30639 -86876 -59161 -111625 -71943 -55231 123126 -138415 -36099 -159245 100184 -157704
22602 -46678 210018 -91436 59038 293660 32342 187145 26121 269085 273382 177544 126201
22591 126201 -178156 5571 -81071 74996 -11352 -16010 -343621 -202626 -11518 -30580 -240973
22580 -240973 28710 42943 -208071 -335335 -78880 41423 37494 4152 107288 -263437 -68204
22568 -37987 168192 117981 149102 229615 28356 72331 -102642 57909 -283188 -345126 26256
22556 116484 87268 -317547 257621 -84254 -29108 -77592 -132217 39639 115338 59844 -139784
22544 -139576 -179958 -98408 -169855 100415 118237 93081 -372823 102069 -170632 -352309
22534 -352309 -45913 -163730 -69608 3334 -175159 -67724 10173 -156104 -15838 -278994 -173708
22523 -173708 25724 -107570 176733 -173066 -3105 -89974 -316542 138169 -111396 364957
22512 278855 -84945 -147044 112673 128466 -260822 -255717 -110163 -535 -101647 -136090 -109429
22501 -109429 160783 11208 69405 223632 360162 76631 231248 -83211 -147151 -10335 180254
22489 -67497 108049 -30181 18664 -149381 131198 147548 -89110 -176168 -148376 31316 81303
22478 81303 -246361 -482051 -8596 -114926 -87995 -5999 48037 -179540 -80921 -107229 204025
22466 71341 258996 99554 -59993 -23451 -534488 -354564 -160220 -127605 -94265 -368014 -605574
22455 -605574 -32021 -166138 -84928 -82165 -145395 113836 33289 -94274 -370601 -252803 152345
22443 45694 -88156 82721 49384 27548 -12696 -207934 71451 270099 117103 154571 6354
22431 -3144 83224 182749 -250690 67384 -79595 -431112 -153614 -311588 -316329 -109035 -184426
22420 -184426 95126 -27972 63162 -136940 218521 40333 -36152 114934 27094 89657 -121940
22408 5514 4143 -202108 -260848 117328 124305 40839 -291541 -393073 -474977 338853 -37685
22396 55420 -225569 -205645 -358776 -214206 -55292 70853 -203227 160317 -46140 66312 -210966
22384 52264 -5544 -90193 -29061 224329 -31400 -315484 -186793 -223397 44498 93155 348071
22373 348071 53287 -377565 -87148 230622 -205840 18576 -290557 -156333 -183493 -35357
22362 -21115 117241 -52950 -337546 -139508 26369 -174285 -133260 -74774 129648 -285710
22351 -157565 -133969 -55082 -190113 129436 38365 121697 142793 -39920 21935 68637 52198
22340 52198 -147056 246828 88814 135022 57781 -163750 302885 -201149 281947 -312521
22329 -13701 263670 -214604 -162049 -40862 83931 -97080 64704 136561 362611 117448 333965
22318 333965 141161 983 155731 82861 -41128 99745 419937 -30195 -143662 -173449 242457
22306 -96193 81418 -16660 97195 99251 -168746 -146355 58921 -6040 220953 -242354 -70195
22294 -131562 122787 -246276 267770 125197 155147 -157622 183741 -57361 92439 302590
22284 302590 -60304 -119080 53336 -303704 548045 2400 -228882 -207737 182375 -66389 -12234
22272 -167170 45827 -228843 -199784 -30689 -176114 -344622 -306958 -116195 214725 80452
22261 153694 -100092 66606 303219 47887 121196 -108947 124895 88840 -52888 -234667
22251 -234667 -254988 -409742 32219 10930 14601 115951 -137745 -198241 -224914 -139699 20421
22239 -233331 229113 -195628 -93264 129993 314450 47522 10810 -12431 -74906 -211142
22229 -211142 174282 -250566 140637 97995 -247864 147304 149855 -53186 -23515 -133020
22219 -133020 -210162 -299700 -125896 -185221 -79663 -177124 48075 -21151 -316091 117554 75654
22208 75654 -142473 -371598 -37051 -62584 198928 -171508 -141193 -62979 -73539 -100393 -435859
22197 -435859 149068 261757 -191487 5169 -294788 -117966 -393705 55963 193487 94906
22186 -157729 65467 147510 48069 -270722 -71280 82947 96281 -122472 -303365 -109365 -21509
22174 -95556 -191792 -48551 -90517 485170 25159 -53804 -467409 84172 -35017 32575 116573
22163 116573 -152724 33371 152525 171604 195935 -113010 -146095 -119576 -161870 -359725 -110845
22151 -118842 229008 250797 -35374 -23394 49882 -98388 33601 -104012 206194 -83692 -321272
22140 -321272 -190228 -156841 -152438 -78224 -66857 502064 -152421 220265 -30374 5481 165593
22129 165593 -214290 23484 -252797 -227190 115784 -259233 -79386 -76153 109602 81712 102209
22118 102209 -68813 85316 -227722 39390 73646 1644 -161765 -58723 -264373 36622 11332
22106 40885 -243405 155343 -392481 -108323 -13254 168254 -1766 -369039 39997 -320050
22095 -21173 -238470 23362 -152458 -275007 274475 -67056 -188794 -161633 161789 -136235
22084 -248570 -67226 268938 160543 -444534 -219273 -321264 112158 24548 -172030 377249
22073 124033 -218694 57933 -93550 -51865 -67293 -275924 -50907 -15782 202073 -340255 -133319
22061 -69255 -12529 136159 -290679 498253 -122727 134226 -447001 -226436 133793 37352
22050 275633 -60081 -110164 1186 -240662 64610 130998 236999 -189872 159657 188934 -133846
22038 116704 193086 -235955 55037 -30013 150983 466799 -6143 -149849 -193130 -267074 -75025
22026 45658 -28133 -75451 -41299 177492 64225 51969 -308351 138129 163491 -19732 32400
22014 -284965 -33910 -287789 -80800 -21160 -133836 -104656 9691 -84928 -158088 -500105 -134042
22002 219881 -153312 228035 -314511 20622 -133501 -292344 -179858 -70971 30963 196476
21992 196476 21960 420528 77642 9760 583 -210474 132401 -29583 141311 133909 50741
21980 19875 -276387 -124319 -126089 -346569 161870 -176148 -62025 11879 -124541 -374500
21970 -374500 -151368 -188210 -84616 -69212 423663 -19938 89902 265473 -144138 -87034 -237138
21959 -237138 -109640 -76243 -260191 185235 -143821 216325 79624 137770 201238 7705 -19135
21947 95939 68018 13012 -275237 -260409 2187 -126331 -194231 -7219 -42984 106068 -119555
21935 -18864 -6834 118465 -153806 -348402 129677 128204 61877 -83360 -26580 -315430 -9239
21923 -314168 70268 139268 365010 -63376 -122977 2742 50578 55001 -119170 -91729 447870
21911 -169513 46483 -282439 173749 -468563 4931 -268560 47670 100824 -57268 163583 100959
21900 100959 -34438 56752 -202087 -128045 57279 167636 45417 120749 -193652 221135 -337288
21888 60301 -206355 -27607 -247706 -471 -180241 -136262 -97213 261385 156567 48463 -265306
21876 -81035 210022 -249280 134735 240289 -149494 92740 -29413 -450916 -79229 -39368
21865 223070 -130553 90711 -172952 -160721 -343167 -30522 -231179 -207898 -199601 -350635 138541
21853 -239194 -51891 -186062 -105701 125037 -20649 -72251 20749 150176 -127385 69225 -37184
21841 10775 -64152 104914 17599 -167829 131015 -6585 331691 408104 -11060 38695 -88867
21829 -81498 -540 -67795 54202 177006 282886 -128096 -297531 -255627 189860 61346 -18011
21817 -125670 -150545 -4454 -95781 -60558 222550 -200245 -50854 6966 -218532 15972 -254686
21805 41975 20260 -196714 -170731 -99115 80977 120767 -260530 -56782 222794 257729 28315
21793 -59871 -128819 -248829 148774 -68935 -66553 -74429 -46644 185475 335149 65842 36645
21782 36645 138373 1214 -44588 -113475 211525 -8018 -230180 295713 64401 42306 169111
21771 169111 -152073 -116339 108882 -256439 -322798 48588 87936 57176 -61488 -196602 223882
21759 331608 -54538 -359024 27863 -137248 126946 -17641 284415 91991 30886 -163187
21748 -69933 -412845 -389473 -217347 -41280 315678 -462016 230757 -411065 -42051 -254831
21738 -254831 127459 -253541 -161606 -237318 67457 -78158 27364 15334 -50699 153421 -267446
21726 -118006 -257453 23144 36516 101264 -223342 65200 111023 -386383 41969 71100 78156
21715 78156 -367609 -7602 -270790 30618 347082 89309 -8456 -128984 83273 -236439 -145470
21704 -145470 -218731 -215288 -128660 -43743 -247723 -179873 -61917 -63051 15816 145918 13592
21692 -106045 284546 -141801 -14830 -13349 -8523 135531 116707 182269 -334869 43726 -102936
21680 106478 79157 53905 4660 -209364 -228576 167868 126020 167969 88234 76382 -203184
21668 7515 -131675 -175637 -44800 9791 -177764 -296307 -310828 -322229 -81088 5322 -229772
21656 -97033 192992 58492 -223073 -232345 -24427 -100917 -104011 -108702 189637 -232184 -49457
21644 161951 -282892 -233429 389777 -132710 152457 -20779 -346372 105613 93917 -14553
21633 213448 165124 255510 22819 -260759 -179402 -271626 142613 -149321 -252375 213199
21622 179393 -269986 130139 -180817 -56200 251414 -292147 160408 -259885 114917 139796
21612 139796 109993 -22778 -19951 -42412 10783 -117157 138549 -60300 10164 -285184 -43008
21600 -325666 34419 -17821 23461 -122208 -124413 4361 -18298 -118036 -306201 -67435 2909 441879
21588 441879 -121339 132739 -7678 -1089 320701 62921 250498 35084 99141 51245 -168110
21576 -144180 34385 115218 -84682 -13002 71253 -103885 -348683 5103 110252 74054 383674
21565 383674 99709 -295526 -204476 -214943 171026 -339454 41957 17805 161583 -236746
21554 -267849 -15393 -286666 -8694 -219368 -80795 -13625 -255086 143416 -188052 -24074 101182
21542 -486513 13932 -125646 46508 -151018 -280845 -127862 184370 10499 -112785 -351619
21532 -351619 -118459 -96668 116791 -295 235952 -752666 325207 -105195 98649 -184784
21521 -118443 105987 50766 102151 -39431 44130 33403 -161641 -209397 127598 -58246 -6335
21509 -341782 -157816 -443557 -92569 -24413 -76513 202223 -294010 -155383 -262345 2214
21498 -162186 -63408 -111295 -15794 -279371 -51228 334037 -142806 -317324 216981 56149
21487 -189606 -386632 -406374 -6263 187794 -113950 -1772 294028 201977 164080 -282683 -122855
21475 -259464 191015 244881 47714 -358600 -123033 -162491 -21157 -68345 -284860 -11869 37411
21463 48548 154655 34896 115670 105325 113723 -61008 -42694 -12501 -89014 104022 154495
21452 154495 355305 -78834 -94448 -215178 6670 -197849 -294644 11765 -116382 204672 -447819
21440 -232330 3051 280404 26345 159724 206240 386669 58462 239858 -40709 -16019 422273
21428 50825 -96657 243218 -91458 -331770 -136930 17267 229681 -162438 -119789 224976
21417 -372573 -25908 -343074 -93824 17527 37630 39404 214953 280499 -157696 -31187 -413149
21406 -413149 -43993 -113304 -29088 -171235 65926 -247799 -103398 -22794 -156395 -268944
21396 -268944 272995 74885 58665 -197351 -140901 283629 -135668 -154220 -86331 80222 161791
21385 161791 -39168 140447 30197 74706 5807 -60289 43810 68503 -119920 -430048 -237952
21374 -237952 38126 -76381 141671 25475 278862 -114359 36098 36907 53402 43174 -55572
21362 64618 -103645 -189030 -63279 15991 32152 -187459 144595 15759 -13643 -201671 -75600
21350 -169751 -69994 244769 29005 309791 -193561 -152453 -327456 69515 -123899 526 -189121
21338 -337844 5787 210665 -56493 84016 -247500 -166191 328454 420099 -47107 -387693 91308
21326 -67889 314439 -204068 -34516 -169295 140062 -67350 26159 -72241 -12930 -115631 127585
21314 -137792 -131925 -16616 -266696 -30007 271300 53523 -123294 11239 83702 88105 117166
21303 117166 -14966 213880 151069 2762 -46091 -55432 -7313 -53498 108879 15025 -17368 -19403
21291 -19403 158260 -109226 -254421 -130310 296839 -67340 50586 -23969 -280718 36680
21280 177534 -312756 -153917 70484 -35312 183839 146591 -42 -434913 227565 -425109 195862
21268 33654 50910 -368710 -27678 -144930 -135022 -22852 51720 -21145 268253 -295834 37187
21256 -185831 126534 -56278 -295661 -328739 -45516 -111844 -9331 -52124 164908 -67231 120699
21244 182242 75720 -310105 -107365 37335 96682 -219147 114350 -170999 -112366 -88963
21234 -88963 -64446 -65683 -35329 -273672 -87891 -404489 -81260 -122426 -224375 -282982 -158800
21223 -158800 -149496 -169670 -207839 -60839 -134769 50269 -99997 54850 115417 24955 -80814 212430
21210 200204 -194233 -29310 -78938 11472 4720 -161615 133652 -95141 50740 -304650 -29724
21198 -134425 168679 -279069 103815 -55028 -163079 170594 67316 -94645 -276097 -148598
21188 -148598 178497 -98505 -113312 -120780 -319076 444869 -274690 -25796 -136056 113427
21177 -256303 90862 -3586 -58419 186100 168957 -247562 213195 -41215 -71838 -280880 143915
21165 -122667 -206065 -41094 -50653 -164000 -121908 6165 -11620 -131271 -167195 -12172 -74714
21154 -74714 84408 101442 -5477 75476 305273 -88887 -125908 -61813 -60181 171801 176976 -37657
21141 80894 -99552 108945 -258834 -103917 -144595 -402850 -71850 340181 -64840 43656 -89971
21129 -4204 -79893 -296872 64940 58244 -194062 262770 -134340 -216650 -72591 -307096 28338
21117 -36422 -165494 93671 -259249 -191499 259398 282196 -129862 21285 -133419 -504912
21107 -504912 149983 182331 -103287 178827 -29860 311619 98288 -10783 202008 -224403
21096 -47125 219440 -65278 -38082 -94949 24384 -39541 -50783 15380 -124202 -24065 -197944
21085 -197944 -345529 -199020 -120106 193414 -137789 -147373 -178449 -406156 -80488 129033
21074 -135456 199504 -147409 -113536 -178304 -89576 90833 -222393 -112848 -84700 185184
21063 -129961 -415734 -83224 -143194 238531 -321918 -42520 -105004 -114895 49031 17851 86786
21052 86786 78066 -155397 -153028 334422 -270170 -266168 -99403 -215069 -145888 44910 76148
21041 76148 -247434 -35249 -2852 -284690 63156 -66949 212958 -79252 344943 110216 -144089
21029 -239252 -206444 117506 -126867 121078 66542 -50220 -27762 -9871 -69717 -253242 -229571
21018 -229571 58745 -88868 -76348 92878 255543 200093 257500 -203399 277075 92859 174587
21007 174587 -77665 129868 120817 3192 77436 -152590 -95932 -15685 -137168 -62543 119999
20995 77653 -150607 -248002 -182109 -48540 98621 -48516 -276565 -153422 -37498 -13189 212668
20983 -193169 203407 109322 -198465 146372 -119665 -131673 3729 22780 95591 -159886 -23335
20971 -164346 -169529 -165780 -17032 -101970 -201546 21150 281158 258962 -6254 -30746 119245 77888
20959 77888 5944 191441 14255 144222 176424 -147902 23217 -170136 -4340 -96457 -73802
20948 -73802 -83538 -178302 59851 28408 287743 -142549 -291595 -317930 84774 107942 -172038
20936 55677 -145052 -239333 -25075 -357124 24455 -279312 130415 -53248 159400 -51118 -110588
20925 -110588 -174331 -13903 -132263 -288494 30048 325368 137147 -218249 -52515 125769
20914 -437323 -443369 -422881 -152477 -82674 -45615 90614 52439 71918 -351770 -150959 -139901
20903 -139901 -115993 -212264 -17243 14044 -261904 -13054 -264185 -40020 21996 117376 -73515
20891 96520 189081 -218727 109912 347151 -617430 -175716 22564 143011 22429 171902
20881 171902 350353 17920 6827 -522 106278 -191612 -166927 -296642 -401657 208866 -248666
20869 -34677 -36658 -126703 -261035 -49848 72842 -158223 -244533 -146831 -95560 -258822 -90314
20857 9767 -180964 99231 73257 -330293 232721 -48576 -193719 -45204 -271207 23602 31013
20846 31013 45836 103959 286567 146610 -53250 168019 19770 -2476 180232 -313156 -4266
20834 51853 -79755 -6384 96861 33772 227788 106442 62874 -108563 312086 63548 11002
20822 -260708 -214861 111517 90526 137309 326826 -225361 241844 115814 -69471 -3258 -341636
20811 -341636 -65790 -77669 -48625 136249 -36009 -20322 -310454 82858 -168811 311657 -164416
20799 -11093 -464382 -143554 69612 198377 34959 151479 -125971 -110273 140197 -308579
20788 32580 97232 -45121 -208057 14071 -172777 47944 -241903 22980 -98758 202179 163777
20777 163777 66378 162461 -76614 -1798 -349017 404080 -298527 22298 -195324 -123402 170342
20765 358342 -104586 250610 -293287 -51612 -115445 -42123 13214 -172289 182704 -96713
20754 -325205 -181977 -304366 -197821 -58475 -48262 259148 -106072 200893 -24500 -391841
20744 -391841 101231 -15690 -197327 -99625 107379 165116 392462 -190963 68287 -152092
20733 7444 -131983 -87721 -271684 -225824 -261398 -124763 37694 -255530 -171567 -273740 24764
20721 -290642 -50894 250895 -27371 -66868 -55583 -166971 -45205 174400 -56491 112404 98307
20710 98307 -119592 136763 -58247 123318 -81343 -69068 -269553 -263733 -236343 -318034 -351946
20699 -351946 -144174 -118716 -99026 -350083 -85700 -130970 -15479 -376723 -37276 -414641 -51622
20687 -136774 81189 107043 -385418 -123176 -198877 -161169 90680 261468 26661 -189671 -100198
20676 -100198 -196034 -8363 -235099 -398058 105886 -209001 -233734 30257 -234568 128524
20665 170096 -189163 -103669 245465 -145722 11731 252343 -125815 -305339 266526 -112417
20654 88183 -128992 -87633 -33542 -69346 6912 397485 -117569 122054 37656 181103 -159599
20642 213091 -142819 -195296 230587 36358 -396746 -112385 -251619 -31228 -128786 -1757 5449
20630 -110790 -435523 209592 323004 -360813 200363 116732 -145698 -104080 -55032 -250987
20620 -250987 -14166 76371 -51995 -6569 145501 203084 -181864 -95421 -915 -119831 -13855
20608 44930 -355433 4067 -10564 -302230 27066 -6024 -146269 51413 -59042 186396 -19718
20596 80902 -312507 73361 -121562 77069 70912 -94590 -23734 133162 -28098 395635 110380
20584 -12449 -54384 210135 -126351 148151 192592 -49720 -167119 -144859 99912 -233843 104112
20572 -266328 -196265 94877 128110 -264746 -135908 136048 -237641 -96114 -123577 -12333 -63038
20561 -63038 222136 -72511 -323142 -16269 75296 -275677 -343219 -171099 59282 -114447 -116898
20550 -116898 20712 302396 -71576 67558 36410 -212402 -51337 389031 -239353 66803 -57763
20538 120161 -331503 -31635 -150658 132423 -163379 -109121 42380 -16666 76987 56773 -158943
20526 4126 -180319 40128 -82207 -263819 -4703 7302 57620 29973 64583 -164303 -39305 -30427
20514 -30427 -144566 -103119 -135654 -19700 138616 -125833 119709 24424 67452 -88301 -597050
20503 -597050 -74864 -218266 -190558 121282 -14761 -94389 196843 10127 -98365 -218053 -259368
20492 -259368 -278311 -71364 11907 -45371 -71150 -176725 6328 -347430 76348 4656 -292966
20480 -310207 -315979 -87821 92639 -4853 240872 -325172 -319498 -262415 -3611 -69014 -38261 -20009
20468 -20009 -105256 -13926 -252600 -33904 -146533 145880 -31982 220728 -149130 -3900 138021
20456 446362 219032 1257 280655 -285687 -286645 38663 20676 -135883 1372 -199208 158510
20444 60228 -4307 -261105 -104225 60031 -121651 3790 214019 -197601 134182 139737 -54677
20432 -141881 532065 89392 -259027 22610 7868 -11470 -184300 246293 209558 94383 24173
20420 53560 33421 -48073 -136202 -211423 -176176 -71661 -47594 192203 129151 -189714 156507
20408 276283 168315 25532 264524 110860 -215091 109155 -262838 -27609 -254496 -230340
20398 -230340 -93036 -39901 -128690 70961 -388014 -552857 -112373 127463 84274 -131555
20387 -81734 -142535 -140857 45171 -141410 -24184 -158409 -203486 133832 -291108 -375725 74792
20375 -86082 -12961 63407 -349375 -74451 156831 -23301 108213 -140276 -87411 -202315 -23665
20363 92942 -6196 120517 88581 -257741 60331 233185 -152658 -237918 111735 26873 176304
20352 176304 161100 -267533 -31849 34571 93318 64489 -4194 -413692 -158850 -127293 -292080
20341 -292080 -482866 -17663 -116808 -381609 -267083 69886 -100276 -94995 39306 -8078 -134762
20330 -134762 -30871 22203 89237 127224 -53238 -118944 162971 276929 -148469 -154063 -305133
20319 -305133 -251649 -200120 288015 80147 -201707 70054 -71052 -146392 1262 -222677 209450
20307 -54521 -627870 -130931 -116523 -191083 -164449 29876 -183359 2823 -148812 -191673 -99419
20296 -99419 -128066 -35462 -239649 -250669 170467 -20547 265030 -116055 -42350 191450 -191943
20284 -175669 -81420 -174104 -86062 -190181 223136 36919 86006 66347 -35085 -17137 -709
20272 41690 -61709 -117008 100519 -5116 -35639 -125626 -127743 65775 -81917 -31100 -199539 27790
20259 -149246 6687 46404 1200 9925 194913 -19036 -18864 -130926 75733 -137085 -301470 -195727
20247 -195727 62250 -460879 286077 153865 96024 -63559 -41705 88565 -226787 188481
20236 -96623 -238160 -135 -140887 94395 24051 -177729 -170098 125805 4815 -401069 -73490
20224 -10839 -162557 -182214 291 -73336 -43028 -291579 -174226 -84407 69421 210375 -77119
20212 -20618 -77064 -351244 50539 -329114 62163 -109763 -28673 53455 371628 -346554 -119881
20200 241159 -72948 245097 30403 -82951 -115875 -275366 99596 191670 3100 -236800 -156194
20189 -156194 -71064 -190982 -84158 25579 -20459 100256 -42353 -201352 -270021 63271 -5876
20177 10598 -42439 -54519 -254043 248335 53387 -82913 -41013 -17183 265170 -7530 31684
20165 21877 -298004 4254 44633 -39877 -115993 72487 -23263 -37251 93072 -161719 126883
20153 82928 111177 22344 -43985 -211181 -250334 -184187 66186 309359 13007 -155382 406342
20141 -199153 -73594 30120 -122767 -34544 148479 78518 -296523 13840 9386 -561322 -225607
20129 -186172 -115264 -188730 -326641 -140019 -25711 73938 -41292 -151274 -42785 -445711 -267017
20118 -267017 132064 -308600 211387 -280918 -466270 194461 -223490 -196549 229559 106711
20107 -439206 132753 -163735 -316328 -102242 -199736 54624 -140445 -53530 144597 232269
20097 232269 -324698 173803 98882 3119 -111088 119427 -210073 -272556 -12669 -112975
20087 -112975 -90473 -54768 50565 -202938 -166865 56905 -334455 281656 -37332 -309992 -144678
20075 44064 57981 -26986 -173787 -236751 -190235 150967 114899 -252827 -264818 -64583 -138654
20064 -138654 -143980 137657 -155406 8064 -208888 245921 -75106 16606 -226806 -208761 -393289
20053 -393289 259833 -200068 10101 -6684 119496 20168 44292 64495 80639 -109539 225616
20041 171929 -92730 179285 24248 -99790 -4145 -146593 -140811 2011 100549 56915 -236815
20029 -132477 12657 -112145 -88117 -77200 1871 -200015 -36323 -134162 -108646 -426084 -329331
20018 -329331 -49312 -65384 -142446 -171412 -452344 -120142 -79124 -126785 -111855 -33432 154019
20006 -170509 418551 -100218 -89300 42748 -245128 65236 -48997 -16228 145280 185964 177070
19995 177070 -182262 221280 -146846 -152566 -344632 196824 26901 -77262 -184874 -67983
19984 -314191 -27800 -106914 -35180 -16257 -162343 126520 62093 -74615 -448620 -25658 -195982
19973 -195982 -221995 179469 84494 -67663 253642 -205773 -86466 -248997 84040 -6940 282387
19961 -65690 278150 -91484 263287 24824 -194650 7974 -130112 -232653 500407 12636 41651
19950 41651 82513 260985 -17756 -101242 191664 57609 -267087 29497 -218471 77261 110437
19939 110437 -194688 -361431 -170293 30117 136002 -131526 -122523 -133027 11010 -243004
19928 -50796 308628 34443 -115280 -411183 117633 -214827 125672 -197930 -262934 319074
19917 -141845 -45466 -87098 -162255 -102791 14183 91122 -28897 -317534 53632 -255461 -187267
19906 -187267 -341720 9560 133486 -16617 -156886 -73348 -163949 -204437 101075 127034 -536213
19894 -132200 -187424 -323834 13481 -126104 -277618 -94548 112873 156817 -132452 87478
19883 150158 100006 133275 -11224 -108007 -93550 -44354 -95329 134413 50154 -212682 285562
19871 -139010 22394 -85056 -83244 -158588 74729 -14212 -303633 66127 196031 24375 -86342
19859 -264186 -293235 39174 -226265 -29205 -234568 -106046 -66727 -216458 -36906 -423512
19849 -423512 9454 -81854 -110841 -216684 75807 15284 81139 -215101 -68757 -236588 -382700
19838 -382700 206805 127858 290297 5654 -20032 -187723 -201630 2407 -66511 18717 -71568
19826 -388169 -31851 250249 48164 -343295 246947 -137441 45689 -193496 -116807 -84192
19816 -84192 -180868 -151947 -255122 -77287 140574 -186694 129756 -207555 -26895 -133233
19806 -133233 -313914 85534 285320 -286026 17047 -199584 -140769 76725 1697 129202 -56732
19794 -53203 -224196 -238095 40390 -201011 72543 -280746 -152791 115553 2708 -10467 -104156
19783 -104156 -77518 110969 8702 -114793 -118972 -96802 -90682 -445833 39914 -255728 -341177
19772 -341177 44353 -107376 183058 -53103 -152952 -283291 -275305 -280362 -398804 259972 -187265
19760 125487 -494727 27186 -166722 -118504 37659 33954 -204540 197374 -14756 -109240 108737
19748 169157 -35201 90162 -312559 71376 -111472 -222989 -416545 -21196 -239898 -31852
19737 -197293 -36039 130109 -392166 179476 -121299 -86574 -106828 170412 102711 -383680
19726 3478 -56346 47913 317204 3117 -10149 192653 107993 46154 146236 -276846 -17168
19714 -143837 -93703 -206165 43887 -11035 194013 -134620 -436018 188746 -104759 65714
19703 -3091 -52641 -65434 -357 30539 -283831 55816 -159003 -25308 -24363 -37626 -112634 -108690
19691 -108690 245725 -63731 97790 -206742 -81203 59210 -77599 -78578 10278 -52934 -277222
19680 -277222 -201136 -274534 -15652 -83069 -42643 60757 -156383 60656 71941 -32930 279844
19668 2328 -235820 258120 -294946 59508 -244137 -99203 -108821 -86820 -37911 -241659 150551
19656 -301084 164010 -388931 -49114 -35525 107711 15378 -161084 86736 138459 -355375
19645 161913 -123355 -63865 -114156 265478 -52350 -60313 -273438 49768 -64790 201395 -192534
19633 28523 -356613 -420579 -289558 -62069 16055 74690 22200 255281 -299629 -135885 -288087
19622 -288087 -146312 -53087 -130531 39576 105128 -311168 98293 46421 -247556 103922 -138162
19610 488991 -128541 -153506 -83068 -93265 194385 80907 196201 -100346 264281 73378
19599 -32207 -161267 -264140 -22728 -213221 110542 -37252 -118520 22447 58444 -242099 -226298
19588 -226298 36304 -244043 192268 43618 -297935 -221207 10518 -55066 375389 157275
19577 -173561 17352 -82663 20457 298779 -147036 -239618 235909 -279329 -121073 30504
19566 -208444 -111403 -251875 -53057 174263 -35618 79576 81547 130476 89920 276175 -26265
19554 3160 -22544 340413 139504 -84896 13839 -137691 52051 -145115 -79573 -55422 -81025
19543 -81025 -528728 -124194 -55442 159450 208103 -39559 38936 -38629 -62883 62070 -29949
19531 130526 -183112 -271350 -32032 -48967 20895 -19001 -135486 -78981 19731 -370567 -109710
19519 -292017 -23871 93 -108798 -134304 -107691 -227673 -78263 51507 -127457 -75102 -199574
19508 -199574 -168435 -396847 -60495 -110650 -15611 -261377 -299701 297652 102193 -3444 488488
19496 -56579 122498 -71099 -180285 68429 29837 -447 -242407 -153649 -7506 -2146 -178023 27696
19483 -244606 5906 -137092 -126879 -131564 -111116 54757 51960 132317 45938 -41926 -232682 -108451
19470 -37512 -73075 126263 -180781 283978 -307584 -35555 -27493 -48677 -88264 276973 -175537
19458 75179 -41751 -418542 -324308 -332551 -241245 -10454 -114090 -148371 49157 -321448 -141675
19446 -143385 -45064 -215 -81641 67732 -402521 -153781 -38893 -235806 -143586 -193697 -81620
19434 -310435 -258245 -128255 -144087 -283673 -7858 139334 -132708 131279 -38757 -424718
19424 -424718 -10825 -379256 -35680 -41704 -223575 249439 -1551 115569 74761 97142 -129049
19412 -211979 -167960 -334127 24800 144352 -133542 87444 -377928 -90149 1893 77916 -69731
19400 74917 25116 94207 95512 -125172 -47235 -164055 222005 83912 -122046 -483193 -106412
19388 -25565 -340635 -217923 147509 -324977 66717 -231005 -232216 -146662 -179819 -212835 -5061
19376 -38268 -144857 -266529 -562 168577 -71722 9797 -358226 60494 -72601 79887 -55132
19364 -40914 322673 -129326 -11971 120737 -176024 270368 31977 -274712 -83017 189763
19353 -112416 108283 -107011 -272121 176775 -272963 -19156 -23199 133978 -274380 121063
19342 -39503 -264466 313021 -76834 265236 -10020 -68476 -243590 -62380 100957 -153861
19331 -494536 -221869 48498 243437 -190273 162015 191729 -92314 -173475 -124863 69167 -63309
19319 39911 -115673 7449 -76646 -191716 36291 -45939 -43656 -149162 -108528 -48760 -48183 204254
19306 17405 -455432 -48316 -61167 39478 359237 -137124 14958 -212450 404627 303984
19296 303984 -30416 -315356 -8847 -125637 -287541 74327 250682 -277946 -238047 61591 -213094
19284 213674 -30220 -112599 -11210 163911 -264393 40857 -4576 -373303 -9608 14772 65553
19273 65553 -164909 -21995 56949 50082 56391 -257659 -92913 -216032 121060 -305352 28709
19261 -223235 -705 222883 150214 -92811 -55616 -240238 113076 -278042 -134354 47907 -130455
19249 -124564 -278211 242657 -266935 -212172 -38932 -181173 21080 71882 40563 -202430
19238 -129503 -33509 -366561 63711 -151733 -73371 -112021 191444 -255249 7681 -257917 -154652
19227 -154652 100690 126347 36866 -56083 -382428 455200 155680 -14757 -251021 -84849
19216 -154888 -254099 -116214 -65493 3472 -235211 -400358 -682739 176328 58628 -192408
19205 42859 21068 168726 32709 -132267 -2032 396424 -182984 201135 154901 21641 -205701
19193 -474998 -9216 -110854 -95748 166772 35317 12526 -298397 -8066 -276306 217577 175994
19182 175994 -92521 -118884 -156175 -262134 -391909 -63384 -165366 -79973 -166696 -52950 -61730
19171 -61730 -230127 -362578 -253483 33288 79163 -290940 239504 -306602 -129305 149532
19160 -206774 -86042 -210562 125309 -93347 -169512 -115547 4432 -82067 -115299 -253511 -68113
19148 -217178 20822 -10350 -141000 77660 -39611 250835 104696 153229 52566 -94752 -122351
19137 -122351 -190750 -189237 -28475 -153289 452942 -285320 226085 20958 -28690 243490 -82355
19125 -5648 -158855 238214 -340859 1724 24381 -79359 -69698 -24099 -47047 -149196 123176
19113 93941 -169439 -536319 168270 -319781 -63797 -174654 -303644 127633 97741 3967
19102 18181 75045 259889 -151165 40247 -31672 -171554 -176908 -152265 -329026 -5661 -118623
19091 -118623 46725 -64344 -186177 -360684 -172778 -43223 50489 -211798 -148799 -30095 64931
19079 -264712 -185728 -199200 -49536 -312253 -123746 -108700 -33776 -40527 205122 95391 -135167
19067 -28860 295392 -68854 -68423 -227161 -83912 148206 -13828 -7226 241024 -63616 -27377
19055 10705 109720 284584 358188 -31579 -79224 -128839 -11365 -251899 14856 145674 64643
19043 -153040 25943 337687 34536 -302916 60567 36284 -90805 118135 -235646 106986
19032 -31441 -176213 124217 -310303 342111 180277 333114 157435 -6853 -200846 121308
19021 -7002 -187340 358673 -240925 -347991 -49064 107993 37064 -32381 -48441 -53893 119421
19009 -224275 225227 -148114 -146001 117886 20439 263638 -93793 -263869 87688 62578 103475
18998 103475 75993 -441476 -2591 59435 -4985 44887 14522 -32494 -107451 -122714 -236404
18987 -236404 76372 -16509 135778 -125671 -128570 -68188 -206609 70232 -221321 243041 17110
18975 -139245 -154510 168473 258794 -141649 -235978 -108435 -11620 -238789 -223882 -169544 24256
18963 -394412 -353552 -242942 -274437 -130159 -265123 -130770 125278 -7590 -66045 -334567
18953 -334567 -31693 540983 -177845 9763 191387 358475 71334 89644 -136853 5959 -334792
18941 -213351 102104 -244237 -79881 215427 72252 -90683 297367 -21346 -243529 71521
18930 -17080 -54034 -123838 -254055 412694 -176305 -125777 9645 293626 46330 18516 97546
18919 97546 -86733 43298 61804 -175506 158941 -108950 -277629 -120953 34364 -245123
18908 87606 -158280 -229977 -274101 258734 -134583 -160611 -225383 225873 53582 36269 -90824
18896 -218982 -126248 38479 16804 164964 -71912 -127348 -177597 -293857 -206414 -180554 -54467
18884 67603 59653 -294468 -164518 -53308 10942 -38337 -305001 -157613 -100817 36559 -177977
18872 -405352 -143223 19504 157664 -66015 -178628 219203 -146644 -210994 99025 114032
18862 114032 -693 130189 9707 55781 305686 83610 120759 -236054 -201673 -292500 -144274
18850 -55130 64087 369866 -85964 -36490 -209712 -53272 -29331 -219976 190177 -4318 123778
18838 247387 -160076 172129 -40844 37439 370424 -287522 -13976 55263 -242557 -173137
18828 -173137 317434 -16711 -355897 -27130 -112416 -164205 257354 15516 157251 -281401
18817 374707 63449 -144921 -208405 -92738 60852 -176518 43946 203545 282616 40285 -27266
18805 34485 214885 -48755 -343367 -117256 -611 -124753 -57905 -105198 -26393 246897 263346
18794 263346 -262335 -121062 61122 -15755 -139391 -148169 83757 -12596 148521 -330842 -118466
18782 -159695 -54913 20941 -103304 -136170 275021 -80382 -207879 -157100 27718 -229830 89711
18770 17411 78891 -327905 55554 -33004 121280 110048 -41946 -185361 -315035 -115418 -326401
18759 -326401 63000 17641 -18432 -197378 30406 240895 70955 -111221 2249 -221823 -237277
18748 -237277 21560 -194078 98157 174843 -200423 -392932 -80177 -198486 -324106 136502
18737 -247136 -168899 -196053 11125 143835 -262153 -204668 -126629 86211 -164844 -62457 -10371
18725 11087 -321769 87756 -106173 -33990 -162227 179358 -258096 85862 -113100 -57963
18715 -57963 -93861 7777 -36485 227325 -78693 142604 -67909 159958 -163867 -401627 20051
18703 -184725 -60986 -340009 -64219 80545 46825 26617 -63252 12523 93300 -232226 9264
18691 47632 -153760 -143236 -82741 -155826 -131915 -323687 -61923 -119036 -42355 -142199 -216856
18680 -216856 -18482 -166642 -141765 -143702 -42381 -44057 126983 48886 3768 14964 52121 -391414
18667 -50766 7603 268906 84365 -142849 -129345 -227458 -307916 -188368 -115377 381963 -8880
18655 -37770 82957 -258644 -33519 178565 -97574 804 175559 -83010 212852 -130780 -40270
18643 -252375 7498 193060 -129947 -170408 -211696 -140203 -183133 -2247 -170888 451502 -217260
18631 39838 -52185 83900 66918 85682 -310383 -117267 -101711 -261957 -201659 192697 607
18619 -79415 -59571 -278412 111466 -187191 -255891 78925 46674 -170816 -416150 195145
18608 177082 -82822 -171156 -455221 -222171 -471608 10960 -236674 64061 17997 -167378
18597 -298580 -257521 -329731 -51292 -219361 5624 26404 31810 465283 -164232 -27281 243459
18585 -33895 173306 -266501 65386 83626 -174772 -75401 144687 84063 42032 -116986 -111888
18574 -111888 -184789 -242824 176215 -242505 101522 -8137 -297845 17092 -303475 -161382
18564 -161382 -175225 269737 165248 -114864 -91537 -412714 -123158 -186442 -104058 -324740
18554 -324740 286848 9586 -278594 -128252 12814 29664 3935 31187 -143710 121227 31210
18542 -144720 -26544 -178208 306215 32250 -128568 -208894 152056 31108 129941 -99180 339300
18530 61767 -15940 -18761 92092 24151 -44934 -144355 -374874 165247 121413 -120469 -125476
18519 -125476 126581 -47130 114105 -75600 -73954 170153 -325210 -12316 107509 280506
18509 280506 55631 -169188 76266 113428 89215 -107966 40270 -98511 320097 -241404 -33195
18497 -51911 -108412 -118113 -42331 16266 -164164 130370 92602 50329 5866 198747 186224
18486 186224 12004 -203313 -78220 -418675 -49195 59885 -114180 95309 245248 79652 -251555
18474 -362904 -391219 69956 201052 -230603 68395 199057 -113154 61887 -276156 -10616
18463 -83655 -212801 105666 -356694 143210 267246 -178124 45078 -123106 -100861 153587
18452 -226814 343178 -16851 -268461 -59438 -290276 37236 -152734 100933 -96970 97647
18441 14492 116619 -137067 137632 201089 291159 43138 -249875 -132779 -483562 -111160
18430 44857 -130216 156487 -313149 -38372 132151 -148780 17732 -7280 213591 417481
18420 417481 -150634 138250 -286812 123207 -331606 56738 133414 -211946 -294503 -144624
18409 32958 4596 -39542 128175 -155910 5059 55286 -16600 -223227 44836 269336 26653
18397 39638 -182004 -253566 -19006 -30178 196144 -41931 86642 -167291 113193 -84880 56575
18385 97573 39522 -371805 -142706 -110447 96320 68645 -44739 -401973 -180782 -179972 -203639
18374 -203639 -236209 34846 75419 -278561 105260 116410 -11881 54364 -25080 -30454 -75916
18363 -75916 168474 149181 -161465 25615 192250 92646 114834 114812 90044 -350248 -45971
18351 -385431 -188592 -12616 215214 49325 123061 -100041 159302 48585 82301 -14407 100017
18339 -104442 28802 -18681 123473 -24838 -129517 -171766 -13184 205608 -203580 -140275 -141041
18328 -141041 85960 -222187 -50949 -74573 -30910 -338076 -196810 173802 -14708 -106079 -62256
18317 -62256 7891 83484 137385 -172400 -112746 -26153 -105825 -96209 -150197 -240006 -283513 285421
18304 -201923 -295751 296632 -19996 -215098 -8681 -53384 92985 -259722 -151034 -105718 -66247
18293 -66247 -100285 -214222 -126767 -397312 -120324 -112602 -69360 167325 279469 118007 161022
18282 161022 -51270 170317 3790 -149318 73781 67303 -211115 -24000 46930 -91868 444783
18270 -88757 236480 -408053 151903 -205796 -10722 -167887 -91621 -67367 -230254 -171874
18260 -171874 147220 166909 71644 65852 -116090 28828 -22049 -191631 -77069 -143976 -111576
18249 -111576 -158546 14243 -119024 -52395 -8842 -78653 -79447 -106181 -23702 -473682 132082
18237 -74552 -23308 -164620 100067 -145972 -215798 48053 -284057 -258748 258320 -39972 -101874
18226 -101874 264019 -25384 -130118 20154 196447 205713 202353 -4785 -286403 163524 -7228
18214 135113 -87996 -332376 -108127 16966 -69761 -144424 88616 -279967 -87244 137137 11758
18202 149934 -152160 -93306 -96405 -141652 162441 299497 -266794 -52652 -163628 152244
18191 -31697 137296 -14381 -40462 241301 67155 -69826 -280328 381035 -19641 -201180 -445464
18180 -445464 181908 -14459 -146742 -63022 277948 149345 -164565 11537 259376 51873
18169 -147092 -47440 42824 -300833 13012 67384 -110619 73736 -167280 -501115 39200 -157195
18157 185945 338013 288000 223184 40761 -275872 -370834 -9390 -105880 -36789 -188223 130688
18145 29621 32255 21068 -142765 91389 -31658 194138 165913 145316 48278 -46875 -92448
18134 -92448 -273838 -514080 -92016 -351746 -49848 -90735 -119513 -27835 173333 -202612 58598
18122 -36226 -124763 39111 -229326 -24045 172014 -349874 166879 305907 191227 -61400
18111 102645 111498 107013 -229282 -95733 -80396 -93049 -22933 -110771 36102 24042 -246680
18099 48463 250797 456730 -90897 -277387 -235533 150523 96506 224200 119293 22041
18088 -266445 3757 40119 -291067 122666 -157874 -213950 -98051 636 29466 -216223 -29145
18076 -68499 162439 -165644 34255 -180772 117413 -86057 233380 -119258 -69531 61122
18065 -344350 -96076 -123557 -125535 172926 139392 -240580 205747 -72465 -9843 -92927 151767
18053 -29951 170571 228648 57079 339081 -271041 -206687 143869 172715 73642 -52255 56148
18041 67192 45249 129102 191325 -58705 -240284 8013 -259124 -261932 -103302 805 -96766 -392497
18029 -392497 -207951 149326 68248 -145618 172425 -112320 -60474 -201052 -21990 -145945
18019 -145945 -139681 261174 -84759 201241 -127715 -321304 79423 -259711 -31823 11597 38687
18008 38687 285743 -129004 -90919 9611 160892 119820 -209495 -363199 26590 -334284 14740
17996 -395035 -276963 13481 -99026 137845 -441260 -167032 213834 -25074 -231090 43007
17985 -145548 74771 270554 -109971 73394 -101090 -273353 187379 -150864 -97811 -209203
17975 -209203 -37403 89093 269347 -81605 185405 14681 -22351 61633 -196116 242118 -126578
17963 -21654 266012 70699 -57165 348170 -151688 -254306 52146 -4770 -74120 -17913 -23578
17952 -23578 193847 -161434 34202 -41786 -226575 -84561 449995 -78384 -109085 -313747 -18934
17940 -152823 72483 33805 -220456 255889 -28813 -42273 491891 -20790 46479 -243839 -113938
17928 -65877 206157 187880 121723 -253655 177413 60704 -8943 338368 -127191 20294 223894
17917 223894 -72356 -160618 -138410 -238328 85937 -8891 126465 71321 -150697 -155343 -245443
17906 -245443 -104745 -36063 201984 47505 -245268 116663 -109879 178236 68189 87299
17896 87299 -65643 -223999 107209 -377824 -311771 -47555 -122099 -122349 -29348 79011 -162370
17884 87785 -160137 180665 -66759 32329 93015 306300 -315682 -86465 18633 56740 135415
17873 135415 117300 -13392 -170110 97804 132854 15979 67899 -39760 40576 -111424 77842
17861 186487 -213599 -95354 26094 -83111 -260129 -9365 -174277 -41173 -127954 -80650 -142187
17850 -142187 -266916 211564 -54649 -276999 16826 88620 -122022 -12522 -116596 -21370
17839 53582 116216 -3444 -103851 -56845 -25256 226634 336485 -150731 114770 55761 218859
17828 218859 81670 -126191 3887 97618 119149 -414225 -18125 -99059 -3686 -13543 -168716
17817 -168716 -212353 202598 -89696 71261 21084 -115497 351717 200662 100273 171037
17807 171037 -92889 -202246 -178252 -3864 71391 13120 119446 117251 -302327 -61540 53605
17795 -134181 33265 46646 -269 87051 -88261 9291 9450 58706 188313 -105507 -136387 -148209
17783 -148209 -180230 77297 52291 1351 -134871 71714 165962 -168634 82506 -107381 -72920
17772 -72920 4277 -35427 -242216 -61706 59616 -64973 75732 73627 -21721 161655 -123086
17760 46510 342241 463513 -511299 97814 -173311 114244 414864 228626 79115 307415
17750 307415 -1031 41104 255890 -48768 -201732 -130091 28504 -281730 93564 124992 -22342
17738 92694 156218 -177396 111775 739 32472 243849 337914 -255825 92237 -124496 -7250
17726 -98738 119447 90649 -226 50491 84165 132209 107330 24421 231582 -122884 -56854
17714 -381503 118675 -87653 135595 197095 -115425 -166197 -23613 -180969 108343 185915
17704 185915 89029 -66230 433320 37111 54444 -35326 193176 -35604 -154569 365972 -46975
17692 404485 113957 144850 -52466 40106 288585 -69473 130672 -27086 -41826 -110525 142684
17680 -152629 -200431 -283121 -53539 135093 -166193 -224980 -140594 -71844 -222052 105679 176409
17669 176409 -75988 111577 -66238 -179272 -117925 17970 -112900 53248 7265 151330 -117452
17657 -120347 -161603 12220 434256 314687 -39826 -444097 34060 171623 -251818 277696
17646 289651 97997 72122 111508 -131389 91002 36016 333652 10933 138230 139136 -325349
17634 51015 103128 94162 85292 -418993 -156215 129341 194979 4072 123403 -276196 -178010
17623 -178010 -110405 -34056 162019 -273597 217961 11033 127681 11561 98999 240459
17613 240459 -127471 -318437 -28507 45816 -62779 -79462 76153 91746 -146184 -163033 257208
17601 9190 202590 33060 141057 -207344 58962 136188 -104080 11217 102941 -39105 333501
17589 288745 -97858 266918 -177549 144686 383852 252832 97418 133805 158617 3116 38950
17578 38950 35640 -121485 -27096 124499 -148045 -347116 39894 -105747 459507 88853 -85534
17566 -135401 -362893 292787 123001 38681 -179728 269219 -64099 437867 -7253 -173133
17556 -173133 273316 254618 189991 -110089 -142693 -153170 -55272 6440 110899 127319 361663
17545 361663 -54844 112004 174834 76305 258462 171382 280225 235307 -228091 -58871 -21197
17533 454567 -6671 408237 389877 -97476 54157 3972 48570 117617 34655 219752 222151 21347
17520 404804 49734 -81190 163162 266800 57137 227099 88002 131723 163022 1199 163576
17509 163576 -339768 -402856 399121 83044 131185 160782 155113 80281 209837 112307 285389
17498 285389 447 57918 236645 16802 23103 103007 114646 279630 61452 189004 355231
17487 355231 104593 -11080 107197 269213 224065 54628 277567 141008 97785 236955
17477 236955 127620 40899 223980 308366 403478 151267 257730 -1662 301676 52454 276098
17466 276098 172330 95595 68016 132026 636963 81195 -52985 282462 16171 35432 93955
17455 93955 287001 -16593 321138 246733 249579 308596 38927 469457 592019 168883 197141
17444 197141 258808 -50388 516687 13788 294750 308703 210336 15262 -150497 243323 -74293
17432 314501 113642 139179 350031 91370 128157 -153554 106216 204580 209889 413916 486901
17421 486901 363038 266868 215896 407367 521475 305024 -49226 573153 474150 558376
17411 558376 409767 561567 297215 85023 550061 178951 201700 195402 278720 361574 -54219
17399 -34668 34358 196760 150250 263609 513452 220825 52684 208093 -3201 41085 172091
17388 172091 61768 70769 -3925 152588 252802 -73085 229860 251114 241513 128591 17500
17376 189990 193935 341092 161185 76381 -22466 216897 1123 190564 503999 -41901 96275
17364 337513 129232 123296 135881 -59733 -46465 -21550 222250 -148443 25560 75909 97954
17353 97954 206074 214584 472541 404432 185599 319674 114677 -96163 426227 -160930
17342 105768 336708 105124 136300 -47606 7282 347380 227887 162001 209838 118760 123199
17331 123199 -141355 10642 72747 199143 -31620 226200 -8233 -16097 157753 135461 301731
17320 301731 23321 347455 198544 -28234 179119 346281 63123 234028 306801 24651
17309 233610 249780 463283 -271714 43041 257970 -145223 132612 85755 367835 315820
17299 315820 296871 109047 -183987 168428 301206 335893 264928 347486 305082 342490 67963
17287 208251 164287 32575 274472 188884 -27666 189688 464216 107139 154365 169933 61967
17275 239623 127813 271225 27871 291364 -173936 229595 516319 121323 280302 349173
17265 349173 11397 -106673 7361 -27439 212244 64429 250574 157441 -602 214096 99739
17253 -101363 274189 89906 5521 201452 13330 176047 146222 1409 330016 387977 281570
17242 281570 355927 31569 343640 168674 240407 58859 -141274 356725 447130 214280
17231 55703 709068 265191 210645 346273 109938 10971 -53285 30502 202794 -48809 117979
17219 390273 122094 366525 387779 400111 33417 57001 278388 591488 310364 409805
17209 409805 86509 282804 665818 314400 219465 399684 344626 403965 403966 503819 318367
17198 318367 523405 242590 219456 348254 387182 109006 177638 85481 275076 215325
17188 215325 363474 225803 274794 167774 360932 354771 272598 -53523 138731 416767
17178 416767 197746 269161 797165 -72872 552277 223519 522227 278404 319193 679858
17168 679858 237630 88366 643517 351214 460102 214722 390874 450567 -55048 279252
17157 11681 274955 129326 338375 21403 367894 282568 412192 549237 855098 455430
17147 455430 228778 128725 380306 123951 501689 522536 479350 -59095 326220 700184
17137 700184 433989 171093 252256 478490 588471 308271 273768 472758 494394 190286
17126 635559 445966 429708 239060 515064 266974 604467 259506 479202 384616 384854
17116 384854 471530 370524 514898 484743 470107 647786 401765 496937 355513 645526
17106 645526 603244 559754 626642 329447 432034 319962 572904 193936 246192 382806
17096 382806 339294 593410 620280 343173 317589 386295 562085 470209 721257 621665 395037
17085 395037 573974 556482 931582 731480 669615 194437 477079 662981 685424 711466
17075 711466 431902 394625 524873 749124 725930 693688 648279 599517 835029 861443 683686
17064 683686 735957 505303 681047 489190 492842 685997 417332 619493 565308 386983
17054 386983 534862 491111 429045 485441 691156 650433 504637 924687 403335 730047
17044 730047 660120 816538 275522 804564 498221 603712 560551 819428 743977 1053253
17034 1053253 349076 272351 429867 816300 593305 388304 751285 666884 537519 733496
17024 733496 1096581 853068 907720 959934 849944 574349 608517 769102 585558 827993
17014 827993 1093226 860845 1023554 879429 690584 855929 941479 677096 1002191 696716
17004 696716 1027507 911431 576192 877367 543935 701041 643245 728243 1143397 954405
16994 954405 811181 1081127 857603 727660 654549 580601 1095835 1134223 1156085 1125736
16984 1125736 1052495 1102259 1038187 862937 776932 1053742 718581 1322736 1021843 1218552
16974 1218552 942916 1202004 1193853 1178770 1476242 872763 1057169 945853 821576 1186543
16964 1186543 1218009 1109200 991330 892485 1152951 1142980 1315131 1423145 1382933 1498087
16954 1498087 1361356 1521458 1462090 1360532 1360992 1289005 1374632 1353027 1547344 1412864 1081345
16943 1081345 1598313 1330309 1250884 1560122 1052398 1386506 1360559 1510969 1539451 1494890
16933 1494890 1717158 1571811 1262196 1743753 1676986 1527941 1797620 1536556 1715479 1562293
16923 1562293 1850778 1590015 1535532 1796077 1524138 1880454 1425388 1707350 2062708 1863496
16913 1863496 1659989 1990222 1698237 1927955 1920105 2050569 1841923 1708460 1903962 1868384
16903 1868384 1906717 1740116 2096590 1894009 2479931 2027387 2170748 2352575 2090889 2048541
16893 2048541 1920055 2351824 2207618 2196207 2180215 2375143 2419288 2811141 2217816 2401900
16883 2401900 2458905 2662355 2443869 2384747 2638189 2547870 2679131 3177462 3135484 2811439
16873 2811439 2859628 2886646 3025512 3037320 2795714 3180654 2927555 2987331 3077337 3261632
16863 3261632 3580390 3315584 3359502 3234734 3350694 3665887 3688928 3292733 3826690 3736631
16853 3736631 3889474 3705716 3769068 3841254 4241017 3956080 4119694 4387912 4217594 4367819
16843 4367819 4543192 4292354 4716916 4558967 4811580 4779384 4786305 5094775 4956832 5252489
16833 5252489 5272463 5328226 5222960 5415017 5714813 5607307 5460207 5825126 5897697 6128441
16823 6128441 6087646 6284940 6687048 6618615 6688971 6740406 6926727 7345866 7333533 7397388
16813 7397388 7605757 7830973 7889563 8220078 8208779 8201163 8725269 9042256 9261587 9189143
16803 9189143 9665675 9873936 10154155 10161112 10790513 10704629 10841561 11177600 11484941 11929367
16793 11929367 12202347 12387070 12534043 12773939 13405523 13745651 14163844 14440144 15138188
16784 15138188 15591796 15822690 16200091 16883692 17462938 17566841 18431068 19100598 19463686
16775 19463686 20152730 21066038 21619501 22356420 22801559 23945901 24619920 25605416 26397566
16766 26397566 27463216 28801511 29944894 30842068 32230235 33106512 34356682 36382746
16758 36382746 37540822 39226239 41187536 42699046 44645631 46710247 48568356 51124221
16750 51124221 53326410 56265068 58493164 61238383 64526949 67815765 71282355 74717531
16742 74717531 78743074 83160279 86981149 91731264 96633293 101445488 106690300 112191693
16734 112191693 118038870 123431418 129585874 135453450 141359426 147088154 152720058 157584180
16726 157584180 162741874 167309371 170789077 173764950 175641871 176877940 177029751 176548047
16718 176548047 174984612 172183268 169021080 165166229 160021842 154851704 149613905 143509900
16710 143509900 137631079 131536245 125359625 118978794 113294522 107409819 101920892 96464438
16702 96464438 91231765 86653288 81893466 78045673 73607308 69927808 66471163 62703296
16694 62703296 59633182 56701417 53987724 51205111 48985543 46766327 44082262 42740487
16686 42740487 40443270 38454184 37111067 35678578 33743576 32375224 31365746 30015733
16678 30015733 28554921 27293038 26340453 25296092 24597626 23353638 22898727 22132983 21292589
16669 21292589 20331144 19602570 19258057 18377301 18012578 17257862 16576136 16568242 15746999 15045328
16659 15045328 14604022 14448687 13947994 13331147 12867058 12823240 12218793 11601313 11721760
16650 11721760 11273011 10683861 10961505 10392303 10205483 9877501 9662549 9608170 9275219
16641 9275219 8954049 8645780 8530181 8382255 8058387 8019292 7675873 7689196 7290664 6945166
16631 6945166 7237065 7069102 7040502 6238633 6552411 6318079 6431218 5910229 6460503 5733145
16621 5733145 5728083 5761234 5296039 5202461 4911293 4747373 5065021 5179298 4834183 4683850
16611 4683850 4902616 4764401 4533948 4478966 4567798 4170182 4099787 3870027 3962772 4078776
16601 4078776 3868842 3843731 3595821 3885738 3789713 3593617 3738759 3638273 3511924 3624317
16591 3624317 3367505 2999688 3041722 3015737 2889715 3013264 3110046 3295512 3148909 2956681
16581 2956681 2753666 2931974 2809806 2861289 2726984 2588236 2681421 2380316 2587403 2615370
16571 2615370 2708018 2391640 2404956 2299767 2360882 2482795 2205235 2126629 2191685 1986018
16561 1986018 2156043 1957743 2059894 1751019 1665712 1915270 1876787 1644420 2019011 1938279
16551 1938279 2198142 2004397 1638233 1972914 1513417 1539340 1857666 1902044 1636627 1708693
16541 1708693 1842999 1389041 1452186 1681647 1657386 1462066 1227825 1514646 1374481 1420071
16531 1420071 1534337 1322395 1541878 1387927 1273291 1362620 1031770 1221076 1144028 1479231
16521 1479231 1384189 1376341 1289307 1478643 1172222 1108865 1257125 1340032 942485 1165392
16511 1165392 1111684 1088178 1137229 1120438 1215260 1120454 1213348 990971 1109076 966176 821599
16500 821599 1145767 900171 1051550 950616 1077916 1000825 854499 1057923 865453 547130
16490 547130 1016433 781454 1286473 834930 736011 765205 966446 1031240 941553 917083
16480 917083 968649 1106043 708577 874187 735382 995602 1226059 933631 980788 1097444
16470 1097444 1038604 609931 654460 770177 913751 987399 578502 634181 678112 481148
16460 481148 869737 744765 794830 769792 946988 699257 671557 690306 599102 810667
16450 810667 640480 904884 533190 444424 422745 552004 475910 593590 732482 644277
16440 644277 606723 623006 666793 694921 609908 636736 526876 633872 448994 308320 413875
16429 413875 373781 462755 508257 538885 404946 368679 553643 128339 657736 606262 353875
16418 353875 595617 617014 688817 718860 541580 486424 471660 686649 327212 571516
16408 571516 835782 298640 292477 530129 483894 476052 695343 375972 448331 148094 442143
16397 442143 650745 308213 559823 321312 363068 153489 36064 532105 482627 485198
16387 485198 475443 298335 476357 231540 312041 425533 455635 160733 386636 657229
16377 657229 249757 -34118 320725 197739 449746 370361 231452 131183 196648 486427
16367 486427 338642 242625 176801 437485 272635 459183 249971 447134 63014 319275
16357 319275 475442 309621 209037 292142 284822 333944 700129 290939 -79655 174234
16346 318600 161750 291431 349307 494580 213692 408660 90298 126976 304465 288907
16336 288907 206819 454039 76617 186501 59044 462855 434531 176599 80737 202012
16326 202012 351559 199611 49493 -21994 536853 478368 663372 -128717 469405 143591
16315 50227 240157 679148 199018 245891 214043 -50664 156843 279202 225643 305481 147169
16303 303593 538236 380069 175307 382318 -88709 118657 355104 130715 94879 -1685
16292 125631 119185 182950 88576 -31632 289904 355376 -118876 25497 187316 211681 406613
16281 406613 156929 35283 134537 272422 276134 -8750 217179 -16809 417499 214505 -28194
16269 -33078 150569 198559 125136 359780 190981 -72957 307976 -18272 -79514 30058 149073
16258 149073 -8518 81068 -152960 384800 -153108 225345 118744 -13958 37979 -29006 63482
16246 65859 -19632 294393 -251778 313842 45908 464926 206927 233328 -116427 33692
16235 48186 -37243 135620 404619 270277 307612 -63610 116935 -63435 173605 539126
16225 539126 86736 174345 408196 -96270 -58964 73997 214542 -271911 119410 111615 148090
16214 148090 309508 301283 -113762 48631 25073 400380 44041 237688 337007 63135 119928
16203 119928 9886 73391 22825 148106 -23243 410790 53637 107012 97418 -45064 172949
16191 418865 -188554 -185892 65562 79477 -9252 -95997 -155606 416528 151238 -73646 129697
16179 -176516 -224819 -9236 -100765 -129883 212141 -130290 16777 -249202 64998 -143870 -51836
16167 -97651 48210 11578 190776 -8216 -272160 -3623 335654 -197397 25539 7207 232879
16156 232879 328162 -38537 172537 -106894 -38476 -284390 420938 -35482 16917 -80724 -41964
16145 -41964 15044 29867 194603 258008 -131450 47893 -230272 66307 -200116 81426 -210366
16133 -213023 5819 217114 136807 52262 145772 130999 -58726 228772 -186470 101780 -3110
16121 124130 -126027 67165 -23469 32554 114427 -25466 79931 -93162 -76616 -44214 -13598
16109 232126 23171 -74663 -157950 -78671 -3050 -33047 234705 92597 91927 524156 -27171 -95986
16097 -95986 98057 2507 -124536 -66932 194017 38506 237725 81660 36975 100961 -35036
16085 -165683 99610 149295 -444681 454319 -234753 15593 25094 -171679 -275689 85709 17026
16073 166393 -53246 148982 -46420 29523 114037 31137 130075 -134948 -83812 121869 283310
16062 283310 -14606 393035 151425 -10336 -126026 208919 -130891 -61329 -10819 -28072
16052 -28072 -21772 -172679 114539 -338442 -15365 -450029 133671 168488 171316 -46539 -114371
16041 -114371 -101554 -83092 163906 -117074 -219916 166700 -53648 -133106 194379 261275
16031 261275 -145965 -32213 208009 -12198 145934 -298845 -62245 -131249 148183 -346302
16020 224154 197948 88372 -98729 -16697 -132289 220152 273218 117775 282687 122269
16009 146466 170516 -32013 166612 -136598 -295682 83518 -141590 -36209 62337 -128134
15998 -83085 -397658 25198 393072 413134 -88837 -14694 147344 -106384 282829 86060 171728
15987 171728 164851 87682 134593 193525 331391 105596 211596 211285 284757 317176 432976
15976 432976 74595 -131177 130387 306038 144769 -20282 82683 -187131 -90226 -416108
15966 -416108 -123617 -112214 187772 -149570 198127 -44640 -10781 37438 39670 -199923 263743
15954 -193661 183465 344408 -67939 -118685 59078 -63470 -92834 -85375 176769 -101025 -157367
15943 -157367 -88369 396788 -353016 -28499 28716 229354 -104305 15476 29499 -253518
15932 198793 3446 126383 64747 -139167 -51481 -10344 49998 -87378 229811 -231446 -150961
15921 -150961 -76390 -47148 -217580 -182720 -51408 -217738 -128277 229836 4310 -132341 -365543
15910 -365543 -57849 -8345 39126 86302 -88681 -128857 -20090 -77661 223976 -136685 -84945
15899 -84945 -177755 58738 130663 -241517 11713 -429042 -471751 -35230 97908 -223161 -256196
15888 -256196 -194977 -77968 144575 123540 43619 28994 158264 220106 -35509 -239026 -297458
15877 -297458 -154825 61090 76017 -73224 48081 -160511 -104261 -144280 91826 135174 86651
15866 86651 104713 -124525 -9727 193616 164753 -252457 12007 -104066 170490 83158 -214384
15854 13985 -313294 123946 -161629 -194047 -162650 -30739 -215284 -281683 115884 -88170 339195
15842 -244386 2647 -375656 -110856 -229336 -55026 -189956 310051 -109305 -19800 208994
15831 -287411 533466 70525 46183 197948 -63337 119984 -183412 267505 -114761 290345
15820 -179084 276208 -90730 241915 -143028 79432 -29960 245425 -24110 -79550 -283817
15810 -283817 -180978 -53842 -37016 55629 -157471 -256018 -150348 214641 111273 -34065
15799 85290 -212055 213262 -45437 80077 -108737 -251876 -136463 -306849 12720 175655
15789 175655 27017 -192549 -56293 -36064 240025 -172378 -59981 -78199 -180051 -128099 -77262
15778 -77262 22634 -120630 32485 -94266 107950 -56685 -70853 191907 -331905 10408 -155241
15766 -83585 146974 -244487 -292443 141225 151390 159986 -59238 -44448 -120938 262392 -179048
15754 120197 91996 -8786 -144612 -118987 -137942 -153255 172108 -30348 -194207 -221372 -76548
15742 -33185 -30750 123069 398950 279449 -16864 -282030 511578 215562 249875 -118592
15731 74772 -145750 113385 -145539 -98206 140234 -151502 -309606 104698 220194 -41572
15720 261813 236345 -243559 -147981 85398 8438 -164287 131882 -283613 -40225 26748 205484
15709 205484 71987 -33004 -190591 69527 178829 -122462 -116469 101995 168430 60840 215659
15698 215659 -9998 68750 -73189 113216 148490 153247 278763 40699 -98583 -116321 77645
15686 61570 55941 -97574 -313808 -206623 26168 118130 129037 227642 58059 -7794 -254736
15675 -254736 198722 111319 306268 -19436 -192201 -15895 -26718 -68221 196315 17724 -124084
15663 53457 -59769 -110048 -88551 -452636 216406 -82189 -90112 -146858 163082 -329397 19691
15651 29735 59255 -75120 213556 -111152 -304345 39170 24735 205523 -238180 -102822
15640 86581 76485 -10023 -88917 105741 -72379 110690 42111 205490 -102264 -244817 -57531
15628 -61444 -203449 95524 155308 -223854 -287586 296103 -215818 -208294 121735 413520 -56404
15616 52082 77181 -101443 -180580 -79838 -328287 -155591 92963 -78824 -143955 49988 182551
15605 182551 308748 81700 -36286 37315 -114065 -107936 126202 25820 -201985 -65166 249885
15593 -32292 -307876 -96797 -120371 -131905 -70528 248888 -104844 165275 245614 144899 -90932
15581 -356278 172753 179673 -101299 -50437 -61282 50412 -150484 160826 160940 -219944 61627
15569 -96954 -209482 -13665 -237030 -40456 -129583 76068 -210335 -224125 221625 -223037 86341
15557 134428 95220 254162 188037 138911 -170819 -164576 131177 -95312 -249965 134112 150227
15546 150227 -272729 -62581 209854 -95359 141066 7724 -350 103500 27724 291246 166816
15535 166816 -64912 108812 -122764 -21295 341593 107619 -195685 33706 219188 313714
15525 313714 836 -44 -78358 -455254 -7317 -4846 47160 177459 -187237 -43950 122820 -51578
15512 -96504 10803 99853 186017 210094 -237022 18440 186582 -220104 -291164 -5047 -44464
15501 -44464 -170304 77923 136870 -70081 -243432 -154781 -64134 -44300 102177 -148971 2967
15489 -29563 196142 374929 -197565 -61712 165384 50150 -17897 -153771 12999 189364
15479 189364 137780 -161923 -84633 -88980 99939 -59208 -30478 -20130 139034 37142 54623
15468 54623 -125895 164410 -276083 -78721 351987 -116065 -48188 108037 56731 -196248
15457 132611 -2860 -119024 -124751 53365 399146 -7446 -342952 -38756 -313314 -162378 -434233
15446 -434233 -54314 -20362 -55257 205527 112867 -89957 -38774 35409 106004 196794 -63990
15434 9495 -339718 27978 -213356 -53546 112956 -279742 -250419 -49225 -91738 215917 228163
15423 228163 -108194 -178925 100906 -59440 169949 105207 -114920 17920 -47434 -23099 346943
15411 141609 86739 -47258 69750 -213673 448267 -2285 36206 236151 187979 24782 422074
15400 422074 143344 111588 240136 823 478711 62280 143885 -2187 -88758 251760 102070
15388 122981 90823 -1204 -5190 -140108 33464 14959 115004 118606 -69215 225766 -13351
15376 88567 112336 -102473 -57382 256139 115292 30766 -192613 71768 357105 -83997 383764
15364 -142158 -67657 101360 147742 155500 -139875 190350 299168 -14739 403964 104894
15353 262340 -456019 55297 367065 -63519 -175997 36785 -105217 45437 175631 -208376
15342 -118956 -32609 197282 -21216 -360728 65567 410361 -393618 -27808 37037 305723
15332 305723 -157338 -104107 -273076 -44925 272462 -120591 -101026 181626 141719 94378
15322 94378 14108 -145911 -121106 47178 301530 401291 76612 -72392 -230156 -176013 -72721
15310 -137823 468269 -93703 -36200 -40967 77007 292500 13468 86209 156504 -228203 43170
15298 247550 -136168 -158769 169404 -33712 -133453 51836 -230096 85178 172502 94368 -245354
15286 -97413 78165 129186 32910 -13925 89293 149807 -35492 151646 -118896 298365 -111085
15274 115360 118837 277158 213565 63712 45717 233420 103337 239716 171950 65193 -171729
15262 138034 261809 -6100 368880 256493 5106 -2508 -52082 207475 62884 -87779 306973
15250 -67906 205754 359092 1238008 1466998 1155103 1391622 1010774 781191 241252 -59820
15239 331290 -18307 -139812 339003 175079 -149513 128103 -240458 -18217 -157276 161222
15228 226847 -116370 105265 -9988 -75603 -208244 123282 -243070 -87408 56073 133256 99589
15217 99589 191553 -124642 17935 111265 384270 -8308 221232 182494 127642 51552 -204360
15205 35143 203913 80103 -153865 194394 412788 -71328 169651 -6453 86177 91518 203502
15194 203502 51020 224386 -6161 46817 -61462 40010 109317 365866 221766 -42935 23341
15182 -28121 82204 301612 -72492 36048 222285 168075 256634 -98474 -46862 1853 322510
15171 322510 -193782 70543 178501 216889 129349 208138 -212963 -40891 2924 169294 220599
15160 220599 327009 -89172 303139 -41994 427284 264399 -195225 151706 185345 287896
15150 287896 135467 285970 188710 35372 -114362 92220 278576 225820 136270 -147449
15139 -87355 106647 26463 -52667 553276 -7863 -166078 263299 -123155 -82150 -69157 351346
15127 -150890 69765 202848 -74442 300183 263306 -157473 210831 232329 -24726 -59052 -81176
15116 -81176 61074 190564 303508 -345979 134769 19154 285934 310685 385746 224227
15106 224227 241929 -8756 153976 181249 40889 -105607 -126044 179199 283710 120012 400318
15095 400318 -30046 80338 -17524 271613 -15378 116117 349364 157598 713494 -175960
15084 -167434 -1777 53330 93633 195706 7020 -67940 168472 3338 235986 183381 312498
15073 312498 140845 233829 26816 245727 53976 -35696 71555 172916 175458 75504 296407
15062 296407 278891 136350 279655 200928 -149268 131163 208814 342707 -120667 -14376
15051 62719 351521 274770 232606 -37853 -17012 130240 68911 263896 112839 398964 321696
15040 321696 307362 566930 -58320 62326 61802 284832 396655 -44693 238849 -60709 -15371
15028 878331 335839 61313 86288 -38844 598579 174613 360048 128922 342532 416463
15018 416463 -185679 71010 -173243 126001 -83741 -88868 69203 135385 192721 295516 329093
15007 329093 -3027 56140 -7751 457378 298599 83110 -729 3062 180169 215669 256387 373735
14995 373735 160312 466346 209390 188590 190268 223227 61123 416928 496993 44907 186126
14984 186126 101640 316715 398296 279044 378433 -62135 608524 185478 583213 26584
14973 350226 137219 128428 241429 384108 149157 97220 478436 320450 150805 88902
14963 88902 559892 10852 534752 504361 217323 560906 411590 239498 286953 382341
14953 382341 236730 405881 419286 546918 328821 425146 70573 476344 501903 378219
14943 378219 206529 307524 368739 411515 138687 352484 455364 165869 41361 134097
14933 134097 359714 55627 428911 578203 247051 575393 333727 96240 534511 127908
14922 33046 380799 473740 263831 370160 243062 364108 470966 172441 316367 65605
14911 90221 450149 303691 170030 269393 414732 219919 675604 150049 602940 207002
14900 755218 125463 183908 349156 207881 510023 269247 320678 257759 488108 161765
14889 279830 701294 325794 432327 396998 449389 292289 221979 495383 326534 285667
14879 285667 482966 182977 102923 282972 568224 701268 439212 530806 191183 526462
14869 526462 411225 332799 417038 372001 268884 126649 189717 480634 307958 178619
14859 178619 176208 526283 535403 320595 332999 208838 620688 361849 314265 516978 589447
14848 589447 563998 795712 676071 600368 343092 403355 708475 654362 443031 435027 187719
14836 495681 578701 490597 615164 536646 352465 474225 359432 668286 462433 545073
14826 545073 898889 567671 395164 265496 691391 364174 389427 588004 536716 500548
14816 500548 647334 488099 419617 744080 643534 429460 327454 310238 461651 621435
14806 621435 420825 41792 519548 690801 431185 394259 543697 351492 469031 704054
14796 704054 698333 628701 503197 655410 409810 944328 733610 782339 699000 88285 714519
14785 714519 325520 929877 221606 513984 590696 723690 432612 570359 714909 451114
14775 451114 679099 421597 550763 528561 667335 457560 644654 562413 518332 522785
14765 522785 752302 560836 481162 871603 673190 544341 608865 612639 624708 676664 692802
14754 692802 496872 754429 975166 661845 847175 806361 742253 522435 830815 532814
14744 532814 777713 749052 894703 1016032 673502 696139 842230 726506 979562 1073923
14734 1073923 459875 791285 554537 546310 752458 735701 619632 705665 645035 793460
14724 793460 795899 855264 869151 616304 768128 1131682 820082 746159 713731 934525 884580
14713 884580 769720 1059024 776175 838462 1238936 993399 1315983 938874 1045328 981419
14703 981419 947985 694429 1174027 1354187 672270 1147039 729165 998060 1131258 999180
14693 999180 1063163 706262 804328 842717 1177975 1191082 993903 1174083 1024522 1074599
14683 1074599 1211717 826120 932050 1142512 850386 1363208 1063059 1149649 1429831 1289814
14673 1289814 980990 1157998 1286201 1181027 1166591 1177918 917814 1260774 1049536 1351021
14663 1351021 994002 1604051 1114713 1272266 1363120 747269 724014 1119264 1291397 1232309
14653 1232309 1036507 1275325 1272053 921389 1275296 1492931 1321032 1357922 1383879 979731
14643 979731 1449944 1364641 1236483 1227040 1389812 1353292 1041526 1303287 1403181 1327932 1527787
14632 1527787 1470937 1144625 1594371 1092837 1432493 1393408 1514348 1277916 1457914 1644735
14622 1644735 1539945 1514067 1808806 1785056 1527004 1349949 1550164 1823044 1618406 1464688
14612 1464688 1759185 1634795 1432844 1717914 1409447 1618011 1565409 1864428 1702125 1452366
14602 1452366 1368838 1563286 1791235 1683631 1778176 1857496 1972695 1829243 1863114 1820928
14592 1820928 2069866 2020040 1515503 2009264 1975740 2001785 1703628 1781051 2178270 1860758
14582 1860758 2314671 2120052 2174675 2226179 2453393 2272281 2086183 2093377 2239858 2428235
14572 2428235 1980096 2378308 2826915 2571948 2272535 2820527 2478507 2524074 2497721 3239430
14562 3239430 2782681 2890837 2778890 3112468 3312470 3006756 3263540 3471335 3833071
14553 3833071 4281410 4459994 5474998 6427621 8904920 13187300 22068905 42166084
14545 42166084 40191392 21362659 11257706 5675745 3486649 2580970 2488853 2149758
14537 2149758 1975429 2548364 2108544 2457810 2039925 2163818 2244067 2277724 2520971 2228910
14527 2228910 2647528 2571198 2860470 2555822 2906127 2521669 2730123 2623922 2610821 2557540
14517 2557540 2944958 2952732 2924354 2736917 2869617 2923593 2860541 3054775 2887742 2922160
14507 2922160 3343973 3141636 3387699 3281865 3255599 3429374 3525509 3856387 3831424 3530279
14497 3530279 3491836 3649042 3386225 3898776 3841830 3879396 3851620 3716089 4208920 4100292
14487 4100292 3947345 4001706 3885669 4159977 4404778 4402417 3972795 3909999 4496458 4363190
14477 4363190 4327904 4209267 4541074 4486150 4418870 4306953 4776699 4624377 4794656 4928947
14467 4928947 4954172 5128251 5172034 4921870 5201347 5278124 5217666 5249553 5481381 5403572
14457 5403572 5558674 5204865 5629261 5484520 5554668 5798761 5762611 5971899 5870219 6025501
14447 6025501 5705854 6064572 6237157 6298889 6296041 6592510 6680514 6352732 6435025 6688043
14437 6688043 6807477 7162243 6732336 7016025 7296212 7208625 7122030 7578919 7543695 7994771
14427 7994771 7563176 7821597 8009366 8181466 8201474 8411191 8252087 8646872 8768988 8589117
14417 8589117 8634470 8813212 9194468 9424126 9137635 9585168 9953448 10124304 10048482 10150335
14407 10150335 10224825 10734291 10706503 11075468 11029126 11275932 11519664 11642487 11273745 11891139
14397 11891139 12034344 12045968 12553730 13053909 13140260 12952882 13448039 13487068 13883703 13930854
14387 13930854 14396288 14148769 14190708 15084020 15064161 15425836 15849383 16244499 16350025 16635924
14377 16635924 16812691 17112099 17511547 18192821 18186792 18422121 19253258 19571027 19756522 20091650
14367 20091650 20730480 21286181 21714156 22032729 22245455 23051034 23553259 23887262 24353155
14358 24353155 25144746 25808742 26148691 27229713 27479814 27967424 28812265 29400523 30215290
14349 30215290 30825954 31387028 32476359 33177451 33797066 35185277 35781814 36991143 37912152
14340 37912152 38795388 39981784 41044782 42033044 43329042 44322052 46249152 47467592
14332 47467592 48908714 49798815 51878820 53127277 54531471 56437209 58536812 60296482
14324 60296482 62143518 64390292 66564554 68892099 71225083 73747872 76353725 78801639
14316 78801639 81660021 84724999 87904917 91089887 94481458 98356984 101954897 106355930
14308 106355930 110478935 115152292 119809464 124982604 129868042 135689281 141774031 147863160
14300 147863160 154358358 161347881 168616854 176251880 184658834 193057424 202298034 211683582
14292 211683582 221674123 232364952 243262039 254766697 266650396 278951806 291854653
14285 291854653 305313781 318849664 332312613 346596688 360510931 374353228 388250631
14278 388250631 401349006 413532800 424726637 435019922 442654603 446985224 448613945
14271 448613945 450074307 451214685 448954958 444966884 442735128 438510055 431460434 422205951
14263 422205951 411039293 398915984 385821084 371457181 357108478 342225557 327216379
14256 327216379 312422164 298087295 284479067 271762780 258907199 246268025 234475294
14249 234475294 223095540 212363251 202240545 192446708 183593292 175043405 167321451
14242 167321451 159496457 152061764 145446087 138906978 133274894 127538172 122254159 116993293
14234 116993293 111797261 107209343 103281173 99335943 95845576 91728902 88332756 84886117
14226 84886117 81646608 78906385 75718033 73313929 70921519 68376988 65882463 63683074
14218 63683074 61509367 59814490 57799644 55926812 54071536 52940652 50983495 49197136
14210 49197136 47711973 46766255 45309629 44135326 43201891 41621100 40464446 39655361
14202 39655361 38356542 37470757 36434293 35452181 34812158 33349553 32848644 32016422 31391604
14193 31391604 30652033 30213031 29117949 28433067 27780536 26872354 26276641 25744718 25121148
14184 25121148 24683311 24297839 23947054 23418195 22888753 22420516 21832129 21015486 20955628
14175 20955628 20639266 20063689 19648285 19565948 18918178 18683520 18240408 17808231 17628537
14166 17628537 17378459 16738148 16821962 16193555 16166857 15782867 15371596 15719030 15268118 14656995
14156 14656995 14535902 14108702 13990796 13676199 13311069 13217914 12806168 12987612 12714778
14147 12714778 12316164 12168838 11850832 11663369 11748467 11217700 11096786 11155279 10883128 10949911
14137 10949911 10704469 10401151 10470424 10504379 10175205 10054489 9794176 9712701 9484234 9312542
14127 9312542 9046382 9174277 9191444 8545280 8754795 8485504 8724483 8548047 8277272 8263701
14117 8263701 8123962 7751756 7841336 7673937 7795931 7649635 7705256 6993248 7126676 7495341
14107 7495341 6947103 7220858 7202192 6892464 6713292 6507085 6786047 6609121 6602567 6545008
14097 6545008 6280638 6406440 6144643 6022543 6014722 5830836 6024761 5516607 5612377 5621369
14087 5621369 5699282 5567466 5427558 5358860 5318878 5692491 5032606 5135405 5381258 5262822
14077 5262822 4798192 5223214 5000194 4704857 4957695 4910398 4644039 4744346 4609106 4544993
14067 4544993 4752102 4425928 4479470 4202439 4441549 4084612 4333770 4355131 4381103 4545339
14057 4545339 4372616 4339762 3996650 4269876 4111371 3835355 3969565 4096047 3876924 3479848
14047 3479848 4069060 3559869 3420505 3840718 3436898 3751886 3495859 3645452 3224047
14038 3224047 3730021 3751648 3140817 3148757 3044964 3166428 3214447 3253798 3434230 3386544
14028 3386544 3125371 3266323 3157564 2923240 3239397 2921459 2694778 2956624 3000259 3115743
14018 3115743 2647996 2533995 2797336 2767378 2554966 2882172 2480208 2800346 2401464 2610470
14008 2610470 2580123 2434142 2511388 2278148 2780834 2634143 2541466 2435355 2302148 2089628
13998 2089628 2397562 2257862 2228997 2118826 2330974 2131922 2003179 2984704 3200542 4337360
13988 4337360 7379444 14442683 34528397 42857016 26089662 14562793 9183454 6570341
13980 6570341 4964222 4148109 3964723 3491086 3064685 3166762 3277612 3074534 3007455
13971 3007455 2914760 2595509 2681526 2666859 2345848 2181558 2466253 2289343 2431603 2204587
13961 2204587 2419221 2326219 2302158 2321683 2003502 2429344 2013152 2097426 1827747 2123099
13951 2123099 2164093 2028464 2519706 2280779 2246231 1945010 1901530 1738981 1836612 1959186
13941 1959186 2067180 1760268 1792845 1576396 1867584 2116361 1863851 1783946 1588848 1810697
13931 1810697 2000058 1704405 1786269 1861234 1709615 1547693 1796598 1713274 1789922 1725478
13921 1725478 1898729 1770814 1653389 1758395 1668710 1582417 1402579 1709845 1579232 1572274
13911 1572274 1670159 1318802 1396683 1366947 1604112 1725019 1387553 1541065 1579535 1735447
13901 1735447 1556578 1454667 1400982 1668886 1322353 1344384 1066414 1496450 1653858 1041892
13891 1041892 1615117 1261512 1335385 1488836 1099221 1633838 1315107 1291574 1399682 949640
13881 949640 1246045 1063859 1379711 1082246 1025836 1071560 1257219 1552121 943481 1163899
13871 1163899 1471021 1030975 1013040 1144449 1288298 973737 1324737 1055835 1215569 1016457
13861 1016457 1410751 1107915 1187228 1201626 984558 1071570 1025471 1169626 925310 1157320
13851 1157320 1202738 1082577 1183593 1325102 1140622 923917 1152755 1115459 1582690 940396
13841 940396 958485 956986 1269271 1088341 1143305 1191432 778867 935043 1144904 1101335 1144403
13830 1144403 756515 957179 1131569 868954 674032 1122970 942555 1032585 695685 994928
13820 994928 934891 837362 726496 992732 1103255 640137 883813 764273 1323650 848910
13810 848910 1023464 738372 739914 965061 866295 856314 831774 1096573 756055 945167 1141947
13799 1141947 1246143 885057 1075814 570001 803003 878582 777004 869015 964053 445623
13788 745318 762890 875569 634808 743319 821866 860981 948359 740334 800778 667631
13778 667631 971272 825078 814383 855941 560260 572380 633382 378607 294042 863573
13768 863573 812280 651737 660096 812291 1042569 832849 1090631 785712 777597 714401 753939
13757 753939 530440 638792 734435 473892 1013486 944281 393817 735587 683051 483783
13747 483783 767384 766755 535047 709570 540216 696470 780923 665180 800894 641922
13737 641922 506569 407205 470460 779240 861895 281284 535386 632539 471307 761336
13727 761336 835938 655259 378625 463500 477011 256999 410813 717506 782390 643043
13717 643043 648571 665596 757526 708018 892853 820217 521966 660402 722441 312093 335266
13706 335266 591234 485894 586142 841375 645480 783449 463757 589218 464841 392125
13696 392125 641159 725658 466372 604787 479419 503504 602197 752034 728292 654298
13686 654298 707524 557368 839730 676945 540263 412595 472117 700143 681558 468648
13676 468648 543034 467430 683733 472244 -343 414473 380359 577371 515278 399165 110526
13664 741783 441199 611995 454621 511047 672307 620304 706544 306183 684400 253634
13653 598671 424838 412880 641154 230132 544113 238810 665143 32805 529396 679997
13643 679997 651027 348750 634047 307724 353626 307179 454027 439530 278856 565900
13633 565900 231427 417786 374541 362699 438625 488392 637981 311411 534477 618076
13623 618076 323346 356847 292227 694027 277221 387374 572577 337377 496637 535939
13613 535939 167893 324920 527358 325107 627794 317335 161360 -15677 488314 554345
13603 554345 337827 297392 395367 783433 337596 416107 315634 455046 360449 465385
13593 465385 95956 437073 492204 346317 454610 151899 468635 464002 456624 369928 270351
13582 270351 154809 289302 557469 72779 164576 396753 -36784 258141 712306 391115
13572 391115 281433 260984 491958 255138 222673 554560 398469 432240 542230 690595
13562 690595 527224 720690 285595 280844 -30242 453150 439262 330562 531956 380545
13552 380545 255689 279848 481918 260484 -83366 235639 538562 78458 326367 557330
13542 557330 244690 430341 288990 393790 245024 885693 357500 536589 139659 249243
13532 249243 592587 69012 616875 295443 137153 131530 149065 423081 215671 357932
13522 357932 112199 313465 556290 273241 234493 249791 368404 -59233 115163 365552
13512 365552 213536 510221 88914 190014 134572 385421 331722 597202 382104 534862
13502 534862 541828 283900 389274 192452 63603 272440 457188 119208 494254 321427
13492 321427 158463 257342 302893 335668 360389 203746 287153 284142 472491 73390 373806
13481 373806 115629 464652 210802 143906 265720 -26685 122004 397816 341202 262159
13471 262159 494748 18122 464430 192869 135729 235979 288472 141926 103558 395876
13461 395876 158834 368436 397974 157268 196909 174110 336045 41589 82137 -56678 283391
13449 158461 135698 -2451 491969 211865 508701 -43477 139368 44964 153290 604122
13439 604122 127849 9442 304913 356333 157440 42274 583682 131294 498955 138998
13428 57067 115698 75027 480653 280577 338811 340025 328901 291576 54418 147908 61006
13416 520003 429734 141612 129729 -100968 59906 631577 181460 276153 112925 71195
13406 71195 266963 397089 391002 350160 251718 203838 374397 105572 92249 605109 89547
13394 100413 326259 117180 289435 84513 238762 389048 187448 351277 157240 512176
13384 512176 -52217 200762 -13841 119847 371102 139364 393171 151476 285088 360293
13374 360293 143021 264318 303528 228892 264800 229371 540347 190661 425116 469402
13364 469402 466497 195232 67475 582740 117363 93417 30786 213218 187912 269497 64017
13352 247563 298636 423543 394103 301361 81197 256064 393567 190260 324678 254858
13342 254858 318439 498392 205374 318426 385128 49976 -66373 -115306 240015 138943
13332 138943 254704 359397 217384 56102 635473 -168455 201372 174521 296149 268276
13322 268276 312565 399480 215330 55584 566232 18330 -3048 130568 582521 94807 106383
13311 106383 287144 280801 407379 454760 323668 177661 17525 -14027 143976 281844
13301 281844 391789 -41748 2137 32920 277414 524945 68146 251890 55843 71879 294399
13290 294399 195007 68781 -270337 151061 161740 152832 179242 145071 -79173 204698 -191746
13278 -121626 95335 257689 -118756 208754 164311 104371 66182 268871 146161 259235
13268 259235 60220 477155 161892 16296 136904 467105 47201 210869 127732 101331
13258 101331 100551 -35601 23282 233251 31103 36590 105005 -132203 88993 -13449 21178 159157
13246 159157 166318 -133393 163504 164184 220829 -133403 51179 -154015 510210 55212 -69575
13234 37085 -84286 141687 -237224 120884 103576 84456 80249 174375 54288 32477 446030
13223 446030 37004 83565 -1820 105448 -30574 336 71224 140346 193888 116048 98727 -43083
13210 -38327 114157 271241 98803 94854 34740 32607 181127 232035 103690 -126204 317711
13198 46211 83043 243834 166096 74021 -2538 249943 -156875 403710 507211 265888 196885
13187 196885 234706 220835 171019 256316 207463 119514 81940 -21188 219598 168296 22105
13175 -58842 326831 -19767 171992 277371 -126908 75558 506284 145666 246826 -82860
13164 -111181 389232 -107333 -200220 -51630 132107 253826 -80938 -66178 316028 200791
13154 200791 203952 15752 211437 -22758 170600 -33289 -13826 -39803 -238412 -87134 234045
13142 -253138 22857 91131 84130 206761 44231 88197 263889 163221 -101968 170866 131912
13131 131912 106676 121597 295692 78933 69200 -52294 -57986 209067 73290 340838 84401
13119 239493 49378 260807 142915 193686 -226955 -47725 7492 -181015 131862 86184 168279
13108 168279 37243 41398 190023 -104697 272078 -234120 -162829 -34142 329356 420448 108940
13096 45026 40631 -241933 277722 -4529 -22691 263820 28263 188755 -106136 227582 -52241
13084 -291672 155406 -139443 287168 475246 -69536 163667 126962 62234 263325 292654
13074 292654 299097 -178012 -11742 107820 166161 127334 -20291 -216891 125740 188862 56409
13062 357561 -147874 -136201 -154626 -19791 115346 -14094 47968 -6744 48126 -18182 318408
13050 100931 45537 115134 -330356 114482 -179829 219170 112057 233214 346715 1470
13039 137240 66814 14921 -101802 -122039 -30120 268637 -43183 63880 88949 109913 -267017
13027 304321 81248 251824 325088 43474 269438 87095 46887 346800 -50415 75786 341996
13016 341996 46732 -62392 47393 83097 384937 -54025 285070 196728 330324 -175263 69221
13004 397876 178414 -125799 375505 135782 107765 13279 203040 184769 282957 92593
12993 93257 236 -125031 59529 -31623 330266 281802 97765 62791 -45087 89112 278989
12982 278989 -225174 76510 27118 -12529 205866 22465 -49711 133959 347069 47071 179219
12971 179219 59448 1890 201644 -30011 74257 16019 207576 -184669 211823 -30964 204301
12959 -176189 31263 -47741 -71159 1285 136560 4846 -275338 325340 -46318 -155481 -76535
12947 -30703 62907 -30014 153612 24566 191209 194264 -106348 -201356 -9105 -189227 59553
12935 -149485 30189 123979 252266 -252316 302039 -682 -106107 48212 -244881 -198073 -20378
12923 120862 196040 142446 -159364 -72402 130918 242978 52884 -131114 173675 -101863
12912 -23180 -188543 416294 123108 27556 209077 244751 2181 -188567 180216 60167 -31346
12900 47591 48734 91464 64748 61937 150439 421763 -17689 88194 -182336 168541 -13839
12888 -82104 191550 261567 -37444 147315 46286 237120 143396 103763 -411756 14862 130745
12877 130745 59983 127629 106182 -191457 12638 209137 120241 -171136 -98244 -34170 -167547
12866 -167547 231600 209604 -115022 168569 409327 -82655 140239 312157 -6477 -231120
12856 -231120 -199970 62485 -180842 -54830 254482 11294 30099 -316556 207754 -65886 12385
12844 3720 -59931 -180902 146119 205738 56163 73772 2989 261791 164969 -454431 158515
12832 -61831 -56317 -267666 60356 -63724 -145519 -359325 -109591 -22169 22238 -255572 29927
12820 475667 244356 232465 306188 -22795 -174293 22620 -46961 122788 -331526 -26708 7326
12808 47548 71494 -94805 212738 -201741 -40027 -97212 73395 -84296 241927 55701 134791
12797 134791 -124276 50434 291883 101492 -89219 19281 258887 -104684 222298 -77693
12786 -105075 163717 -8533 -244365 159222 75348 25517 -414285 -301628 -37311 144520
12775 31228 -21798 159363 87385 389660 13976 151192 5283 -46933 122428 -214072 240523
12763 118944 -154275 183903 96761 -2107 -102844 77863 -409025 57428 148958 -113620 143875
12751 -23714 106043 288260 147944 -166563 -156048 -151836 124962 340652 -329834 157569
12740 281733 -54024 -26463 147745 148094 240735 -83890 383423 129823 -24889 -14901 -247492
12729 -247492 383656 177249 311904 -239325 104103 17975 50317 -6061 -134217 208793
12718 122776 -151146 215166 -23485 130226 169485 131351 -124830 22287 67031 305463
12708 305463 256760 306118 215224 -59707 15280 -20410 -41324 293922 181699 -15421 231423
12696 279677 149548 4171 39052 -12096 99828 200188 143722 172634 227465 150604 -60034
12684 -58991 100965 -289570 -155801 -16105 -320959 192755 158677 324917 255950 -82058
12673 9221 199715 213013 36483 523283 38488 49161 -50936 236958 288657 8778 169322
12662 169322 -75809 195737 -33574 453480 -365162 214060 -80536 10988 308469 141990
12651 -43270 -102287 301600 242580 122988 11475 15949 197361 61732 -97784 285046 232197
12640 232197 -205513 23184 154692 256340 115187 110362 -111547 129222 176351 119047
12630 119047 235368 -205158 193236 388007 600436 138883 266914 92685 346456 324106
12620 324106 240646 -225672 -39952 -86188 110881 47520 -115111 87453 132195 108665 -182583
12608 133162 57153 80430 -131076 184339 137313 68693 159461 17195 -37517 -63831 207134
12596 240521 -135727 158260 -128298 180970 12174 83793 112371 -286510 111237 -167873
12585 -155654 104910 122567 15409 -71762 319541 -239004 -19320 -283467 -280589 88966 89659
12574 89659 -105362 -78679 81450 -312 122411 283293 15630 309690 8452 -49992 280094
12562 106821 3376 222417 398517 -76823 209694 196232 351782 -81145 95548 80825 -147585
12550 -279596 128837 -133741 -288041 -107017 -20361 1883 -119274 6121 -2945 -228226 -59840
12538 -318513 56531 244251 59450 41458 -368271 205384 -227159 -188008 15868 33468 13801
12526 180335 24134 -151369 14972 -67087 18070 -4665 149255 82873 -14605 147582 -43731
12514 -211583 41196 44533 -30199 -13292 -278707 -183535 166491 -387050 160719 -102069 -241035
12503 -241035 118573 27437 -163452 277153 149197 -217908 152778 177283 191155 -23136
12492 61966 -163950 107155 -71858 48865 158794 19412 -47573 38974 -213223 170997 241985
12481 241985 47930 126621 -23351 159614 -112844 -140592 20149 382124 -251538 -204751 -461284
12470 -461284 -58477 -61901 113114 91289 245582 173727 -310924 -25804 -20060 113658 -3329
12458 95125 286140 268762 -115714 33226 69721 243571 -42840 366998 326937 -352626 134767
12446 223952 269269 49033 33920 73546 220522 93133 -23903 -12335 123186 235714 -58278
12434 17885 -153747 53614 42622 -4059 184435 13614 -269136 145201 60781 62168 -135459
12422 113566 176171 -72232 276406 -118204 67810 -36468 -5673 -47914 -29436 184451 -196775
12410 326547 7761 -205400 -226563 27695 -48236 58843 57218 119936 -14466 119601 -176282
12398 -123017 -70954 -20406 198375 -218653 57441 -3428 170423 228603 72066 -92952 -2998
12386 -94167 135524 -74222 -359325 57048 -67599 6927 72545 -30846 47628 163736 34339
12374 -82464 -39733 -86309 301107 279025 -205942 16205 -304790 10851 50351 51593 288277
12363 288277 -256046 -221961 129759 154719 -111687 58666 268889 88389 -87931 -153521 -49598
12351 16397 30089 -166723 -65643 189746 -221384 80081 339710 -367514 -210442 -182491
12341 -182491 -208980 -252625 -49365 -57071 253193 -286912 -193298 -207366 288239 273160 254169
12330 254169 129527 -97870 -74573 227701 249406 -54739 436083 250772 -86388 -232118
12320 -232118 -32224 4930 43224 -80816 -8862 -21911 -155117 232223 55653 -182185 -214521
12309 -214521 -215432 216733 -153427 -125219 22723 125987 262869 76454 -61452 70426 276718
12298 276718 -81865 -174498 -211731 -148817 51372 -13298 249135 5759 68081 -176771 -44087
12286 -209368 198264 -114351 175995 -16372 220265 -91022 413495 304661 -222235 186982
12275 67432 353765 60039 56527 -192512 14981 113424 330908 376658 219172 24807 -150548
12263 2052 287322 -258176 -4028 381641 58733 145360 28005 -107841 -118125 18407 184784
12252 184784 24285 314018 277170 194679 -283838 127306 184126 317446 128736 -20380
12241 80418 -215254 14646 -150128 -300722 -103659 35104 103927 66940 -144906 -40597 119279
12229 156106 -45353 381936 95261 269893 -49340 -86819 217693 462072 331922 -38024
12218 152156 348569 310524 72599 565430 212633 337026 9852 419085 179490 52235
12207 -103191 -73597 100804 224377 -134519 145362 39281 350953 213384 -5329 -120763
12197 -120763 131633 310672 219758 102472 198950 262940 319709 106391 89064 -155602
12186 168136 -129263 111282 126969 152050 -115033 4654 201994 172306 68286 275424 -12703
12174 180663 503810 -84974 102666 310559 -50314 299836 -194132 171785 -114550 237091
12163 44592 162996 334374 338251 -74884 -157327 162634 -51837 -140093 280324 -141739 110120
12151 174293 -49665 248341 -291358 669018 270790 -59762 -164890 -106901 68513 -84794
12140 -33816 23574 -77473 169889 311255 -147824 170054 -31096 -220731 -297209 -36882 28246
12128 177133 148217 56104 145992 122198 501571 36514 177055 -146671 -34674 -421143 375700
12116 -11205 -169311 -81979 144428 187622 -26966 463088 -389934 86811 -42915 79366 185572
12105 185572 -232059 24045 128209 290985 -272653 271150 58792 8364 -20026 210520
12094 -279777 -22518 176798 -178509 -84439 12952 -202640 -252911 58349 4161 305627 65969
12082 -50628 37424 -102135 45354 -100230 -53883 65299 246372 -295950 448681 1344638
12072 1344638 1370547 486392 303156 -217915 194193 48810 87701 312401 -289779 -46485
12061 300424 164989 -12148 272289 268806 -75918 70320 -119559 -148785 125410 80678 -257230
12049 -66226 -151982 -147943 133341 -22997 -101932 123693 -143320 -126344 -243156 74399 -68158
12037 110022 -236509 29296 -249839 151954 40616 -392183 -251513 -11296 268968 -253045
12026 -99343 -9611 327025 -54266 146275 -535508 -156747 199727 62937 -152810 31052 -166790
12014 116958 -12546 116854 171671 161551 63374 136581 -194110 -43447 100316 -142377 -67179
12002 -245077 -34595 195004 -70353 -142463 -300239 -208485 52669 -276153 5500 235612 184504
11991 184504 126667 -156736 193109 221071 9415 -63902 50567 -138928 -14043 -250826 -334129
11980 -334129 -19393 60174 30315 -61251 95336 39939 -52964 -356806 12277 -31133 82282
11968 120104 176803 141131 120202 262932 22098 -98834 200515 -206744 202042 87198 26010
11956 -151962 -36691 -405992 296439 -111348 69088 -33156 -219103 73478 -159188 -110670
11946 -110670 -37103 -111470 -299886 108955 133610 -87730 -265441 -51632 237036 -376673
11935 129780 -166196 -66823 -120177 -15533 -48976 32225 72699 -91919 267578 184649 -172248
11923 -88016 -70974 33764 255906 10740 -271124 -75561 169376 -6850 -121605 -40860 258159
11911 66891 -17778 -166986 -290562 -431290 248523 186578 -55734 -12579 406883 -131955
11900 11668 118078 -85850 4786 -15253 152340 -293964 158091 108561 81745 -44997 27711
11888 -434965 60669 95315 120735 198569 -119048 105139 298870 161781 -45800 -194775
11878 -194775 31908 -228064 52229 -100445 -147771 223186 -456639 108246 208946 -65166
11867 -147290 59274 -85096 117020 -13261 14147 -241871 244388 26696 -194079 -360950
11857 -360950 66562 236630 -136185 -80398 -198354 -56486 166279 39082 55457 57460 73108
11846 73108 432873 150481 110152 -111229 27312 157527 59842 -167201 -170280 77665 74765
11835 74765 -202729 182221 138222 -189776 -87625 -344346 -68302 -272976 -198763 155040
11824 -240157 20420 -14816 -374604 84141 -73511 -120167 298413 152957 -144740 135590
11813 58677 -285 165771 25692 -42844 -61018 -37888 -59520 -93876 -216651 -4551 -253370 -216634
11801 -216634 -7827 -46182 -130595 153533 -108635 256980 -124325 -49966 -159173 -18387 145039
11789 46086 -196801 -87332 -104188 -26365 135816 -58387 403731 247195 7762 -68270 -148400
11778 -148400 194088 224415 -125597 -67366 -238560 218207 28217 -58636 -309700 92707
11767 157856 -152315 -12907 -23538 -51277 -193113 -88435 -114669 -440072 112466 131612 -196482
11755 -125382 -159848 -225333 -224794 -85577 38537 -145164 -166774 -272875 49999 186545 -215590
11743 -265979 46754 -242178 67651 -50291 -155270 162517 178171 128775 287286 -47381 264503
11731 -225160 413 -291116 159792 169433 -242337 197024 87369 -22182 -166173 299305 -186790
11719 76505 105877 316220 -110310 -324781 -247443 307451 -37883 -10966 306929 -255348
11708 409556 55472 -110459 172119 -272050 70929 -27927 208518 -185273 -121914 333537
11697 49237 77573 203843 -54750 -14220 -25948 310467 140270 264785 -48653 -233434 -65891
11685 29499 -390908 48690 134587 -215995 -63832 140376 -169107 -30773 -115297 -24380 117012
11673 -17542 -29420 -115564 126344 -161919 -29342 -527015 168922 74326 243546 -214359
11662 260851 72139 -2764 103921 -53626 -83749 -131289 18445 364149 71726 295711 -21453
11650 -61826 -24069 -148814 86219 -118175 -72533 11879 36572 61151 -120278 -159569 -65850
11638 -15400 316339 -172470 -196413 -250431 -73858 11866 140282 42853 -174523 -78595 -130207
11627 -130207 32733 230965 -6821 -273962 3612 98913 224684 3537 48237 -86713 139776
11615 -29753 126041 263228 -37960 -48971 -5833 190360 196683 -41946 173321 -51908 386722
11603 315547 246868 94747 67107 175796 238383 232539 143514 -341715 -80744 -82232 31494
11591 149193 -48891 584654 155963 116165 36098 -119842 18589 70235 18532 -4308 457765
11579 252837 -36624 262472 -29283 -221559 12669 -87985 91542 -62665 -163115 528208 -132037
11567 289895 11420 208094 67185 103170 -137216 123601 208164 91514 197997 18123 -41966
11555 -347011 138114 -92953 -56104 166597 -78805 1614 -56844 -45951 -230856 56721 188688
11544 188688 244091 66704 -271090 -151466 192433 253371 -142233 270177 81658 -33807
11533 -99029 327535 359969 -20769 159992 215572 -15210 -251095 34836 268436 67785 23834
11521 246279 207796 199779 -216900 29799 -130980 130486 -78283 52827 -172615 505409 34565
11509 405195 -8608 279685 72565 278345 337282 -22076 347401 11275 -351637 103554 160251
11498 160251 352814 308331 197667 87437 211847 498241 280921 211010 356300 -40334
11487 139666 309249 4846 100442 365745 -18400 316545 305355 519685 261182 59639 172514
11476 172514 583180 -127898 356531 41491 -30838 -62965 296044 5103 26487 5538 134283
11465 134283 -142171 145416 351547 -20971 -95207 81001 -251478 282862 64367 -67678
11454 -35646 -97083 272416 203202 260285 35164 112896 -120252 -20986 178826 128832 83308
11443 83308 57378 344154 33180 91455 19822 5248 54224 101825 -209239 -30041 80937
11431 -5550 -48919 -78913 -74043 -50368 160494 68721 29465 181103 -8681 182515 -149000
11419 -243509 154399 241706 272378 185500 60697 212273 -129680 -200010 219625 -262400
11408 -115690 -97540 51541 -130901 232633 71007 198128 -36321 -305643 42384 132657 15710
11396 -203032 -247083 -87127 -46259 -87153 81167 145693 -31379 -78255 23505 74424 -214969
11384 -76602 -25453 17635 209896 188894 -10598 -107315 101787 -80254 248272 -113238 -8908
11372 231357 -221474 88016 89794 162581 -34835 -9742 -71411 160140 -59073 -234966 240148
11360 -71892 128726 28840 106041 -119322 2828 216689 130337 -51166 71001 -16298 103961
11348 -349316 -96441 -391952 -204851 -148261 -262162 -98981 90487 277565 270863 380344 -116186
11336 167782 -14374 -149883 -194572 109300 -162282 275541 -89590 -2432 -14410 -200542 143575
11324 134236 -176909 159454 -102537 -104848 111164 -177263 -199560 -182523 -117928 78242 -416789
11312 -241692 100306 31301 72437 -53952 272744 -199532 176608 -75896 -5193 -145917 -48996
11300 -80909 -311290 24465 19601 -382961 -164601 -126637 68967 -52108 31873 83631 -131570
11288 184656 9011 86903 -183286 -200144 10474 -6135 36078 51085 93967 -19411 323560
11276 348503 -186530 219266 -221860 67862 84877 35658 48182 -212973 -233061 28187 157204
11265 157204 -78144 7128 -229949 273969 -138122 -249365 -18236 202591 -205164 -152077
11255 -152077 -339848 82012 161721 290710 -106574 -305688 -8288 62271 -184919 62880 -153813
11243 -193844 -261803 61527 127426 74013 -28436 -120471 -333474 -206447 389985 -68774 102689
11231 10135 -162664 132878 72236 -209793 -207157 2325 101878 -8675 -132286 82664 -47832
11219 110497 153501 -352249 -73008 -7762 107190 -65131 13696 -298741 196982 -157880 48626
11207 69824 -348618 96266 -281360 83871 -242348 -173228 45327 -152252 -35049 -45682 -19619
11195 -37149 -114182 -125437 -222298 -175730 15574 -363444 432067 -280502 -59663 50862 61921
11184 61921 -104740 -177947 -15448 30926 223064 197673 -73368 35330 -281467 21130 -357056
11172 318230 -273582 22387 55319 182669 219137 -11964 217150 211614 -18134 -146380 123655
11160 -149847 -83567 -42553 -12930 -182711 -50239 -244799 -109521 -32881 -251179 -231212 -49515
11148 -30207 -28222 -281188 101500 252421 -292155 252221 52147 106510 92929 -371859 -32473
11136 92416 257712 -1611 34051 442044 101114 -110004 152599 19935 1694 328717 -120368
11124 73064 -127720 -128360 -221101 -81800 -274065 -120704 77034 256893 152780 366869 -124780
11112 -167629 52635 31276 115311 45689 308502 -242815 34593 135734 170529 -69649 156550
11100 -47936 179365 273542 -33497 113375 330165 212575 391140 241854 70040 39155
11090 39155 225648 -33142 303919 224135 406387 -26563 131380 22859 210383 -31957 156432
11078 48272 196097 -63972 263116 453693 155098 139094 410499 333063 210457 644155
11068 644155 271063 68060 375967 292377 531933 259821 673869 329802 645871 433074
11058 433074 449256 761361 461456 587512 487082 470217 667709 872195 1277728 483921
11047 917015 787116 810580 610185 741876 780205 699850 514285 873759 699668 631181
11037 631181 774173 590630 804190 493465 513951 880085 755572 706149 823416 639271
11027 639271 662145 813897 402709 545120 657208 755754 607246 575113 620845 479768
11017 479768 531177 791351 393722 692986 653075 870440 771990 504406 773127 965417
11007 965417 482328 539748 657957 406240 1076450 622024 665707 818681 313073 814915
10997 814915 915225 508304 919766 906482 936269 385418 702993 738885 850272 942642
10987 942642 751922 773070 1002607 718528 1153601 834357 1342628 1688281 1284469 1344235
10977 1344235 1633770 1683714 1855867 2113631 2363027 2553878 3105434 2796698 2800837 2714465
10967 2714465 2675529 2329707 2399368 2036215 1941502 1891678 1375647 1739272 1720783 1640406
10957 1640406 1999373 1780108 1466199 1476217 1407882 1552473 966351 1346119 1156768 1167812
10947 1167812 722056 736466 455841 857306 186451 164517 282152 276694 406830 524207
10937 524207 -24568 -15532 85731 464638 -2503 159976 257156 302601 7752 311575 253193
10926 253193 -96384 84579 -6470 -100628 54865 -51289 308328 264028 386151 -77347 179712
10914 116884 86180 173367 59158 215376 -152013 79912 118838 -87905 389069 166272 66783
10902 80338 -64460 297902 -511373 -158099 123538 119839 23375 -39548 169 162835 -343921
10890 -218530 -457646 94470 42397 189609 88528 18967 -54641 199468 -30582 10363 103067
10879 103067 -231221 94683 -297707 -173411 -23173 -63207 -443462 -77742 121085 -346474
10868 177934 222523 -156650 -58394 -276372 -47610 -214616 2853 109556 -108690 -287851
10858 -287851 -106052 78419 -294922 -182704 -249744 -317759 278104 -141754 57161 -119218
10847 107439 -108874 26696 -210000 -312298 -203915 87164 56493 274026 -208224 186901
10836 171558 -177499 -25613 -98824 -128742 174600 -141046 -51036 -172235 197258 -198709
10825 31145 130791 33368 -138731 -157318 -63570 -32279 -313087 -89452 34427 -39832 119695
10813 319615 -23298 -120029 -21353 330045 -157953 -102112 -356503 -46383 -14189 63766 -179706
10801 28409 381000 -28650 134401 60447 -91545 -17809 122063 13755 103917 -72588 -73599
10790 -73599 -36869 -244323 9103 -122904 -31782 -148135 346500 93084 -453608 257756 -321335
10778 -147982 -42227 -189572 -67802 101318 -123068 -58709 63043 42112 110021 31539 -87497
10766 -263666 -44627 -233174 166160 164780 102965 104723 -193730 -204179 191118 -165316 159736
10754 -264266 5916 -70690 260450 318858 -198608 -142396 -116298 94540 -7755 -274984 -88564
10742 -57673 123359 -29595 -182683 -35685 129187 -207761 -202819 86930 102373 -260067 35482
10730 105500 9668 53760 -135748 -172786 -45099 279244 -223847 -241441 155166 -222910 -27755
10718 -451837 -175398 73089 -220673 -181878 -32809 -29939 -134484 143961 -73535 -21083 -141129
10707 -141129 62774 175423 -29573 -98676 170562 -30564 -63170 27999 8317 -279426 221143
10695 40923 189627 -265292 -171765 -47976 220403 -415229 148391 92162 -38443 -14612 -84440
10684 -84440 127129 -176453 -334885 160773 -36895 -96952 -39093 -25781 -373853 38330 -147080
10672 -230400 -133971 -195794 27190 -75369 -5027 -223011 -114918 143479 -149192 241181 -342520
10660 -74327 109382 -99359 -53229 -167488 -98683 358783 -179123 -56592 -123417 75344 -16464
10648 -83225 82323 355622 9605 -93995 -367724 191606 157011 207648 -227995 -10285 114898
10636 -37426 87374 112768 73223 -233432 17192 84115 -33610 -4669 119147 93692 62014
10625 62014 -79720 -79369 78957 112108 -369987 191645 -92988 -80307 -340737 106524 -226148
10613 -455790 199119 98365 -49330 -81131 -190906 -58658 -212559 -147127 263394 78469 -512747
10601 -127938 118318 203758 -150005 -305307 -222644 -57511 -282016 -57869 57178 -174429
10590 -68507 -136904 -129735 -46578 -36834 84541 -161240 -305315 -180077 -151144 24232 -282750
10578 -10735 -348791 -204634 64425 -180329 -243706 -68050 45141 211812 -96558 -195981 244477
10566 158060 6298 -282694 21130 25646 87007 -160763 -169727 -84217 -134939 -111404 342744
10554 15513 -16886 248678 -11516 -118775 -127445 114015 -257663 -181861 123819 -40290 -385443
10543 -385443 -27635 -34650 118300 50638 191839 66492 -232928 13417 161261 227162 79062
10531 -85329 86270 -483975 201861 -222016 -34086 -98952 -251673 -101416 138122 -51014
10520 86852 -65953 110156 -31942 130833 -38436 241387 -279999 -182592 113112 -326340
10509 305323 17429 -116365 172912 33042 -12101 -148376 87391 3674 134515 -140595 -154678
10498 -154678 -252024 -117904 -42165 -268300 -155564 -310776 -155617 73466 -41436 39122
10487 -222724 68708 -153613 -179547 -184187 252652 217298 195562 208294 337998 286216 364733
10476 364733 155500 240548 12763 161893 -48669 285737 -9867 -279391 210876 -48143 -148335
10465 -148335 -156819 154732 -168788 -9622 -132757 92957 166904 -88483 -89038 -148215 -113263 2883
10452 -293773 -173698 -112659 227828 71421 -215854 45467 106864 54052 219444 193680 26174
10440 95338 126083 171235 8123 112769 64772 148866 240100 -52846 -198560 467165 383782
10429 383782 -299530 -156027 -157899 122441 -172009 -332619 -143976 44004 248535 105346
10418 158903 130977 80807 -28910 -350966 335331 243087 -165499 152545 60269 -181881
10407 -236751 -30293 -99482 -119874 -60048 -27281 62762 255032 65047 -119870 -30761 267079
10395 -138184 -97681 -239862 403803 334706 167394 296982 130770 -205772 208206 -28550
10384 -39657 260255 82977 -70061 321739 207681 341165 196780 207469 175348 -147233
10373 188562 265622 161030 330704 440343 165542 379757 556699 578221 647346 308818
10362 318599 120725 205645 175908 240052 161028 76676 75738 138568 525627 -63748 501740
10350 600561 675983 527577 424146 746984 293849 -34488 214242 336605 433789 368372
10340 368372 355297 257631 275664 36706 384291 486941 137788 224887 212668 184738 127830
10329 127830 -96954 332983 117181 222811 158056 251465 207167 9109 124701 -88640 108768
10317 268261 346224 70998 -110742 319434 423013 441749 -150434 318533 252383 126276
10307 126276 212221 -311793 -28005 27508 56191 -58625 -102618 81670 223121 271943 87216
10295 181910 -20030 63167 -272255 -47973 42703 -287465 -96406 242237 -245555 30997 -76320
10283 172766 53201 196204 -112035 -13642 56598 291767 -182098 41258 -276445 67721
10272 -131712 -188496 245787 -111094 -320279 44193 150863 187878 155075 -28188 -84818 28048
10260 174079 3967 278522 19993 290317 -108629 194559 -36239 -10525 306601 150644
10249 -217070 70378 73224 -48964 77890 270723 -63864 -28525 427482 15677 105340 -332 -268135
10237 -268135 369453 -104164 -15347 13940 158184 -208478 81645 -132811 190958 -310526
10226 5333 158777 -159488 -82804 -277313 87617 -57747 -251675 -201854 14363 15571 -325925
10214 -139774 33025 -340560 -75239 -221315 163633 155843 -131039 -61301 157640 -55361 45595
10202 -32670 192971 -60918 13180 -281624 129304 -149922 -269707 -245873 -77546 385304
10191 -302758 -172710 -100837 91124 -133333 -278982 -98506 -226619 -60731 -244100 -3198 -189263
10180 -189263 -230971 -276685 84944 154436 243993 -32925 139570 -304699 -73767 -43481 115406
10168 -164515 -54709 14445 135332 129458 -53641 -337222 86205 55411 -64014 -52328 21673
10156 204521 -28069 144607 57454 -58808 195335 -234139 -132021 -47408 -50966 -126821 95782
10144 74338 -106286 -154495 23522 32803 -166742 -336361 60519 -195356 -57824 -101551 133248
10132 -112788 -172547 -46591 -161288 -197430 -6325 -169984 204610 107614 98754 148970 -307594
10120 46997 111111 -121119 -122143 -209456 -160684 -48075 -43450 63910 -114926 -66685 335102
10108 192058 288576 81636 229007 -76034 -214873 -113143 100913 87643 -213327 91317
10097 122754 -279481 37451 82281 -315321 -13205 -166997 -226692 101429 -360561 -233677
10087 -233677 -12329 -211552 250749 277753 43291 197688 -139910 102321 -249441 -30473
10076 6426 -194323 26848 -178726 -168420 -154627 218013 171595 -128996 181792 -236844 -409983
10065 -409983 -148154 -416811 -179848 -42928 103814 -29055 18177 126205 -453038 99164
10054 -33961 66330 303838 -191354 -281352 -138016 -70734 37216 -155192 125429 233215
10044 233215 -193562 -74513 -96109 -383047 334522 68457 364947 -334157 10776 238278
10034 238278 54538 101462 -222702 -220596 21400 -267561 36141 -98585 51924 -278344 54708
10022 -42752 -172481 -203103 -156921 -8776 -341600 -219813 44652 -238584 -168123 81631 32166
10010 -178252 -100302 -33533 192054 -330672 100021 -321097 96334 75220 46591 -84550 -199139
9999 -199139 -158425 -323841 -176201 230163 -148524 46914 10036 -330066 430144 155350
9988 57828 -72975 -45056 67834 -60509 -173401 -169891 -32958 -56455 -316609 -98505 -72098 59526
9975 28435 48573 -51866 -72348 198734 -273167 156039 -86530 -179783 -170703 -214403 -415562
9964 -415562 -294922 -289317 -7033 -322073 55287 -275934 -221947 195753 -125631 -190088 -224682
9953 -224682 -418691 -65793 4337 -157215 -281761 -71943 -80275 -114530 85900 -11007 -296751
9942 -296751 -108336 84878 -153566 -48145 -139808 -21081 206106 -266975 -211908 75009 -384883
9930 -91905 -95398 -415563 -40478 -50101 -113942 -10359 -137504 -1342 149344 229808 -31901 -70082
9918 -70082 -183789 28216 228661 -267858 157254 -269885 -209405 103794 -72858 -370291
9908 -370291 -184053 -386013 -271374 -257150 89874 -128361 -148137 31880 96782 102522 -404627
9896 328968 306453 3505 -317085 -410977 123041 126843 -38964 -386554 213927 130772 -141433
9884 6338 -306531 -34272 136717 177643 51909 204486 -361160 -203505 -230860 -16713 13156
9872 204500 -23555 -105795 -68732 -117116 -152175 35749 128871 7270 7330 -87954 -112592 136943
9859 833 70419 -391518 -87853 24288 80630 63379 -86259 -222014 -237074 -124607 93066 -541656
9846 131321 631 -64199 -254416 -123764 -109666 -12069 -65748 -63207 -150246 -262078 -87818 -292546
9834 -292546 243287 -5922 -14310 33778 158950 -135066 3156 51332 -228721 -348450 -102537
9822 -1152 53769 -132857 131713 -49948 179817 275590 -31036 -105570 -127703 -40623 242610
9810 -110987 -33594 -164798 -325778 -36505 -247757 51562 -177570 -460275 65236 119946 63245
9799 63245 -30678 -231054 197227 -10071 207902 160448 -119543 -39821 13319 -333256 -166362
9787 -93562 -49615 -95171 192934 -266154 -59731 -152695 59601 2470 -184448 47330 201321
9776 201321 -66964 -119567 -106902 -173601 -105712 -246087 -142196 -73838 -313253 -46599 -190125
9765 -190125 -334267 216496 18111 -307514 -425081 -169482 91371 121550 -297610 9707 -246295
9753 39986 69435 68378 -33153 48318 -106430 -28577 -349221 -41261 -205099 -176648 -105767
9742 -105767 198177 -93199 -128568 10509 31950 55195 -7333 -107237 73012 59394 223749
9731 223749 74596 -76622 164110 225654 -163378 -83403 147063 -116731 112960 -80719 -78897
9720 -78897 -270559 -70178 -200615 -249395 -27869 217433 41425 -170496 -234236 -139449 102806
9708 95423 -192438 -45479 -2447 -133904 -439473 395556 -73179 -17670 -250324 -48645 -127748
9697 -127748 -292117 344624 -160017 -56155 -22051 184217 -157465 186650 4118 -219212
9686 220790 -167809 70974 -98751 -66233 -71758 285279 -95427 87144 26364 65867 -245359
9674 -48025 -179957 -220678 63608 -93553 -521500 -183007 -369731 423721 -203213 -229725 45957
9662 -280296 -143196 -133360 -287645 176327 -359155 -417490 150653 -482099 -148014 19573
9651 14260 -90312 -351238 -52122 -163707 45559 -65831 -26096 35219 105417 167958 -47817
9639 111750 -32914 230903 -39552 9606 -187885 -179854 -11238 -365926 132209 -186207 226086
9627 -36846 46633 -53503 195053 -249479 -435752 330728 9271 205236 -253791 -277450 -65420
9615 -34607 383739 -105876 -181124 -12328 83028 -232865 -266381 -172409 -506 -40110 73845 -248364
9602 171419 77385 -180277 -42149 -9659 -203321 -167303 74491 116747 -189426 -153038 162973
9590 -311693 212755 -251554 -56464 -404501 -206688 -67466 -45401 120256 188823 -84127 -107111
9579 -107111 152054 88220 191547 203521 -57189 -78920 -164022 290108 -142429 -78144 215708
9567 289517 192107 55551 100800 65722 -240947 189699 78534 -248335 345590 83944 -218886
9555 -30650 -169478 -354582 220733 -259979 -116565 -340270 135335 -161344 -94511 -128046
9545 -128046 5688 -227439 -192061 -296979 -213683 -211260 -205558 -100458 132973 -202285 268694
9533 -178636 -108202 62823 37742 -54805 7534 14890 -128488 -61295 -144722 -126555 13789 -244477
9520 663 -312685 -190901 72676 -316279 -117984 -6438 116706 -192591 -43448 -323715 -51907
9508 -27716 7253 -14362 -47086 -72913 -185887 -127158 -26507 -299134 7687 -110929 -57923 83800
9495 -59881 111972 219743 -211169 -130377 -405161 -172134 102257 -22463 194837 110833
9485 110833 -12601 -184202 -200225 -142679 64214 -378835 1806 212386 303864 -94 -56593 141687
9472 148953 -302365 -34139 -33776 -250896 -39084 -236866 284261 -81214 -80694 -20355 -88213 -13258
9459 -185828 -292055 -189713 117374 -59026 330210 -255831 -284151 272068 -117707 247578
9448 258018 -49968 -188481 -108448 250682 131419 22110 90656 -2546 205087 25694 -40931
9436 14382 -70537 -364453 8948 -129787 -89244 11808 30045 -70080 -118184 39313 -16689 -204049
9424 -204049 -5117 -254239 308541 76925 199628 -142707 100254 -77568 -172303 206015 -151364
9412 -311516 99378 -14260 -303601 19021 -73582 -69499 -77654 64754 -135441 -35085 122161
9400 1270 7697 -129825 125792 -105182 -42806 15943 267420 8300 129186 123877 -36698 -12450
9387 42390 -237530 395785 -40731 -75121 -385859 25813 -24379 -35188 -97533 -181213 -306783
9376 -306783 -257675 13271 -248778 -229049 37905 -71521 -12154 -51013 9845 -31707 120870
9364 17891 -227343 131070 92545 120793 -272331 -70342 -157514 -255076 21479 -139777 -152166
9353 -152166 -237522 -333159 68474 -1033 -72106 119476 137587 218867 -25385 25330 -220425
9341 296756 127868 -439016 -22251 -22573 -5379 -91658 20799 73361 -199115 -185987 77458 -119514
9328 50161 -99115 -140794 171760 -215771 -68586 -227685 199001 -58872 -71997 35861 -166465
9316 -83775 -589548 181362 54495 43768 7269 -180165 80749 -269923 194197 -78968 -381698
9305 -381698 -39572 -81737 -24544 -255568 -296058 91276 95773 -338281 -81535 -110367 -83522
9294 -83522 -16932 -92174 259516 -468195 91127 -233955 7551 392449 -251185 194006 65219
9282 -376873 -63337 -47185 -255331 -147676 127519 -133962 100895 112190 -118205 -255450
9272 -255450 -412050 -76884 -167049 -157824 -444183 -264835 322772 -216646 -193252 259469 -178617
9260 -84069 -400908 355803 -66231 -106169 152786 204965 -63224 -97579 -120863 -62312 -105527
9249 -105527 451974 -122184 -153038 -292616 163880 -25252 -277500 -119748 -396616 10449
9238 -21860 -48052 122363 -183883 -458048 -43299 -338188 62563 10254 -7417 -4337 102118
9226 124141 392751 -34239 93223 109260 -99036 110450 -2653 360820 62163 -152226 -228532
9215 -228532 -214518 -54855 62990 -60077 -383480 -134789 -60515 354467 127608 -135571 -210289
9204 -210289 123186 -256316 -112331 -17827 -164799 -161774 -84520 -57769 -251228 -165426 139472
9192 175794 -126873 -219074 138356 -43763 -217812 -163401 -234620 83036 -47008 120679 -122434
9180 -26679 -16662 -340392 161501 441025 -253582 52069 -602682 -291428 146769 35555
9169 -105185 -249607 -68718 -394619 96384 -41381 -69009 -305291 -340107 -278177 -54679 131218
9157 -59529 -155460 -300741 -237636 -63512 -69001 -95026 -82552 62441 -60443 -27704 -93101 -243366
9145 -243366 -103029 -45066 -187611 9992 15022 -92577 349390 24683 36119 -169758 -157993
9134 -157993 139789 -12361 -292300 -565245 -279309 35031 -225819 7070 51199 201772 -427407
9122 134330 -205842 91486 44024 -250746 193704 -1969 -317276 17163 -80896 37349 -416174
9110 234545 -251757 108760 107731 121914 -50216 -234350 42707 -41603 -426956 -146402 261338
9098 -233508 104141 149962 -34892 11094 302035 -33179 72259 149923 -45451 44213 38556
9087 38556 121832 -465667 -14513 -305416 -237981 -106093 -115855 -25720 178407 -213421 -81856
9075 11922 173515 -38574 -93235 -25725 243410 -157033 127516 -280787 -131708 -97331 -346294
9064 -346294 92550 -212836 -204755 -102914 -230872 -33320 229814 97356 241253 -143361 224994
9052 35933 123869 -133994 199033 126497 234049 -140422 -26686 254098 -247236 116220
9041 43087 -71336 -359321 -38512 141796 -12725 -34066 158748 -355392 -276846 -38555 -339428
9030 -339428 44266 -197502 7644 -312798 -165397 82558 273580 -443009 -94244 67719 82078
9019 82078 -141057 -71265 87578 -45306 -96109 91420 149962 -42557 -297689 -171641 12083
9007 -189421 166712 -228544 -84470 -176548 -169364 102175 -105878 -209778 52802 236999 -20304
8995 -32563 -329838 30493 -21452 345368 -159944 126397 -7854 21626 -132288 -274089 70369
8983 -71893 146470 -148436 46591 14961 199384 -93946 -273860 -193246 79194 -380687 79290
8971 -292599 18372 -105390 -551803 -399639 510677 192223 -200036 -72744 -330656 -373063
8961 -373063 -126288 -43569 -89740 48777 -129967 44384 -106560 -86007 -165833 -197657 -61385
8949 53929 30812 -256824 -254947 -33093 -93978 87743 -8299 -304395 -426012 -34635 40106 176436
8937 176436 22730 -363293 -174003 150645 394668 167133 -225572 -90975 -55981 -265780
8927 -265780 -68525 30396 -53563 -404419 26622 72128 346172 419047 100739 -273754 -288421
8916 -288421 -134611 -255320 7674 -51738 -18765 -111254 -89493 195118 -32156 -129394 -290696
8905 -290696 87165 -294396 -103614 -132254 -148192 -17768 -57509 349449 -165583 -232889 -109655
8893 -23440 -7086 72342 -177694 -295095 -429971 -30240 339137 -11885 -204172 -336262 -70334
8881 71182 -80059 96664 290356 -118989 -200790 55718 -91920 202867 -34999 110454 -156927
8869 193496 -127598 -250407 121333 -136786 150608 -207764 112448 -266990 60581 92456
8859 92456 -61908 -87038 -238743 269415 -157660 6057 -142645 -357527 -22098 12570 -217821
8847 -200737 23603 321608 -182655 -266050 -270759 65162 -109341 -288559 -69363 -319023 -176649
8836 -176649 -266255 301227 -274426 322538 238887 -151359 51460 8969 -131097 234939 -227254
8824 -105115 -304865 89544 -290216 221551 -122588 -135310 -50849 186926 -169649 -370041
8814 -370041 31369 -218112 90493 -293952 -269936 -37906 -114437 153210 98225 107429 -6145
8802 -202306 5686 22183 -1816 100835 -427193 -297790 -244838 23711 -251772 -13115 -30515
8791 -30515 -203801 -155731 81859 40324 -483981 -210629 -494458 337250 80540 -306361 35891
8779 -4023 -386234 379619 -198144 -113849 -437179 -197660 -38598 -150570 332566 11378 37117
8768 37117 95905 73545 -200042 -192153 -215230 275588 192051 -7719 -270318 110646 82993
8757 82993 -112715 21067 113706 152889 7428 212768 -192003 107105 -62373 -150473 -422287
8746 -422287 -229616 277549 -42147 -47434 144040 -174514 -174582 154607 156052 60045 96761 -272821
8733 112668 -113842 -2778 -104126 173638 -309893 -163861 -148954 -2615 -275615 -165045 7162
8721 -123935 -115907 149080 -48881 -35140 -9731 3729 -140898 -75405 -25607 -42370 -125599 -66320
8709 -66320 -118071 25705 -454508 57003 -45162 -264034 87714 38796 67896 256275 -105900
8697 75115 -219838 -151641 -326156 -16408 -23655 -70657 -218233 -100224 -231436 232953 -165979
8685 166264 348919 45485 139733 -3110 98123 -57046 -354757 90365 -89029 -206976 70241
8673 -133904 -81555 -238216 -129053 147157 2139 -35189 -255373 26660 -149436 -224149 -76563
8661 -179946 -176795 -33238 169563 32383 -113895 182952 17649 160788 120567 -113119 -273283
8650 -273283 116847 121887 -269372 -155886 -263847 138254 51582 -166974 -297034 -214742
8640 -214742 56608 -103049 149726 -103472 269166 -95690 -163172 103554 -31205 -99407 -128869
8629 -128869 -121517 116283 52230 -470401 74912 -182528 -107718 -60451 -383992 -263274 254315
8617 -127634 45029 -83122 99568 -22299 -42979 8709 158931 -150043 164504 -54650 37129
8605 118213 103514 -204717 69801 -125523 -84929 -36509 215774 -252855 178332 -192893
8594 23294 68813 -242061 45099 -171731 65198 -282611 -84044 149724 45618 -215144 -196042
8583 -196042 -17997 -301314 187094 -379342 -6521 2994 -102182 -271332 -217244 -74343 -122480
8572 -122480 -260660 -321689 -39386 -344203 134801 -123443 85346 -21427 -152932 -77215 55691
8560 -113483 -196554 -185243 48228 -251856 -299957 53480 161802 -71947 -11675 -82583 81363
8548 221351 -188022 -127682 -22596 315180 54321 -96260 -34451 42469 -239104 43662 -259755
8536 152256 100523 -77148 138272 -155639 -290407 61529 -53418 -162940 160971 -151487
8525 5300 23560 -160921 -324404 185841 95734 37383 -59936 -157651 -9698 -146540 -168173
8514 -168173 162227 226252 21445 -292745 38380 260677 -10627 175442 -149730 -154680 151063
8502 -93709 -127907 -218229 -29836 -17413 -130606 -217956 -305591 -89878 31940 27417 184672 -102197
8489 -107504 114228 1313 -209134 361813 8556 42202 -319997 58652 88947 12764 -136330
8477 -69595 -105464 -417586 -50335 47209 -366955 -148239 -271946 28939 337731 -134896 -216572
8466 -216572 7928 288538 88346 -69520 235835 -186645 20329 -155955 27525 -294738 -450113
8455 -450113 -264433 231928 -310195 -45876 -6028 72545 83590 56275 -87979 -51350 200381
8443 164599 -357271 186115 -146559 65855 236594 -75353 -133975 -30312 326110 118118
8432 -266985 -39975 -159451 9236 6642 -160196 -95674 -80712 97622 197635 247857 -104316
8420 81917 10811 -18715 -105154 -137004 -129596 -134445 -21201 -64791 104363 -442887 -173978 256098
8407 59381 -369261 70339 -38671 -110269 -180628 118541 -97629 -163015 -126359 -265315 -22527
8395 -58655 24379 -10957 100467 -104793 63383 -439397 -203073 -934 163331 25944 -141629
8383 -135772 -7425 46308 493067 51333 -61489 205330 -182695 -75723 43738 304340 -21335
8371 -412795 -364058 -71036 23402 132795 -172737 215353 -68358 95491 -161927 -439453 -224993
8360 -224993 -137601 62796 -64400 309030 -69347 60797 47990 76700 -199334 -146756 1855
8348 -310614 -126183 88796 142136 -34315 183025 -240085 44009 -210568 5703 32874 -71134
8336 -11744 -146201 -398 -67001 -34461 94907 245137 -9099 10531 -20041 -145756 -3369 -405413
8324 -405413 -459629 4427 8788 -121282 185299 -163790 -50051 252279 -417025 54262 147112
8313 147112 35865 -124285 -70708 99133 -62664 41082 -198413 195611 86308 -252235 97659
8301 -76108 35253 148483 433460 -103536 328839 26211 223502 148981 321517 -53254 195405
8289 150948 -180246 73708 -182483 -347252 -296401 131408 70653 68357 -31808 -58407 127633
8277 -120611 -150783 43713 -261956 -81296 -89219 52859 -110781 81085 -22306 -317964 -35574
8265 239790 -287464 128377 -86376 -131688 -92303 -487641 -147753 -304290 139237 -159195
8254 -48277 -85379 209756 28110 -161851 325321 -118779 -32272 27162 -304386 14827 -61102
8242 134559 -240960 -146532 -204697 36057 30635 -140723 -372065 -244962 -389866 -15605 268300
8230 -275383 -44133 26436 160230 -214512 -102276 -83757 58976 10118 242493 -15104 -46471
8219 -46471 46096 -3751 68197 -135848 -185530 289037 124929 34513 -293685 -17060 31452
8207 -29085 31210 -341813 -66469 -86690 20033 -110440 -211584 204667 181241 13003 -196831
8195 -151079 -243116 -258503 48285 -136807 -243301 4162 -101823 181996 -143165 -102758 236198
8183 -80037 -189425 -189268 -116902 -293888 190869 -9267 64210 258018 347398 66453 -157411
8171 -117390 -430006 94886 149085 11824 106494 -199566 91487 210072 -412643 47430 -66153
8159 -212758 -251043 -179124 -84129 -166133 285025 51811 94887 200095 -281479 -227813 200360
8147 284936 136235 -432905 27762 -27145 81146 41162 -130111 -154491 228346 19048 -163524
8135 -38872 49196 -342756 -31551 42199 -56530 -225431 -79059 61092 -24444 36657 -116604
8123 69711 -120022 109280 -257986 160697 9018 -158591 -35196 -35713 81058 -94690 -403280
8112 -403280 -375110 -154015 7784 220974 -252085 144924 -102585 -367375 64837 -286364
8101 142335 -65365 -27784 -273488 -247296 -127141 -172990 33997 99185 -259285 3067 -216853
8089 -64668 -38663 -124088 28151 -148495 -249713 -92731 -142700 -97012 -4061 -16229 -82174 -84772
8077 -84772 155974 -186687 -243510 -82766 -371490 -4300 127022 -197125 216840 -30567 -142947
8066 -142947 -176226 -51258 353451 -262596 -42419 481571 -783 126433 138023 100401 177476
8055 177476 -63181 -190578 -79088 33695 -173520 240801 -119316 -87036 -65592 -243536 194549
8043 -225820 -286110 -29252 -14513 -197782 -77392 -153986 -467878 48613 254861 280635 52474
8031 1693 -128308 72808 -99848 2423 86571 -124989 989 61681 -280419 324450 82008 41118
8019 41118 188234 128279 115223 -281989 3672 -289263 -83393 -148448 -430042 -270236 -329017
8008 -329017 -328234 -243999 -92776 -28328 -123285 29194 168796 61522 -300719 41740 58112 -28849
7995 38306 -129115 -34156 11736 157131 13013 -179524 -114203 -221054 151637 -12523 -170769
7984 -170769 -302799 -74517 34753 290562 -155523 237706 56586 -110084 -394679 -230722
7974 -230722 -316568 162302 -127009 46634 -11808 257142 42467 -188236 -181778 -27278 -138749
7963 -138749 -17484 38008 163507 -169216 81224 9547 176948 23016 -224345 -279567 247966
7951 -253870 -239700 -246713 -85041 -298244 -42560 11479 189154 281397 -46882 -228844 -291854
7940 -291854 167244 109809 85620 34670 -59629 -26482 -9717 -292820 -190304 -158958 127934
7928 298951 83826 157741 -381928 111656 121242 -510076 -136407 97074 -178784 -153072 -209054
7917 -209054 15560 -39078 -66241 85964 -76668 -286171 78846 125430 172923 -24869 3416 -38479
7904 167425 -64085 -28113 156431 -251060 -84026 52988 -47151 56728 285836 211771 109690
7893 109690 83860 84431 -102007 217688 -98136 -93023 463293 -192042 -37751 3180 21894 -132770
7880 -71234 -48582 223669 2296 -123669 79843 1342 -127239 59848 169749 153772 -281191
7868 -171755 -196015 -50037 -61111 -320582 -305613 359741 -175116 -240308 86199 91777 -177413
7856 8632 -48780 -127471 118370 48148 79031 -25741 -253642 -414782 -86803 325963 -382126
7844 128612 41688 159259 106884 -70374 -162982 6985 -55916 191176 -103565 -91406 -35878
7832 -55272 24913 128343 -246758 -50798 -110305 -299323 243539 -66854 -18748 -73014 -74135
7821 -74135 -304337 -2897 95354 -343901 140384 58467 -92558 93514 -289440 43946 -129249
7809 -36842 -277072 -215387 243321 -306571 -162996 81407 -130286 -198551 44503 167388 -86843
7797 -99256 -180382 -107516 -230125 -46635 -7143 145308 180790 -13141 280885 59777 -144312
7785 -258557 -276699 13929 -340990 -203285 190259 -153247 14553 178275 -62045 -81436 -125558
7774 -125558 -182716 -211994 223001 -318757 183557 -129993 212630 -371206 104525 31974
7763 27888 162597 -101619 -114000 -226702 68256 -67404 35773 -100941 -4492 109765 -226864
7751 117039 -263255 100766 -171633 -41808 45639 -179839 70761 -47240 -27853 -298213 -50146
7739 -299321 -117185 -30044 -136249 85008 62836 -83637 173694 -54999 44402 238282 -458406
7727 41610 -65504 -21168 -156859 31760 -153318 -32075 226620 -96888 53809 -250004 -88795
7715 -95152 -224370 -322161 -358751 50601 -234222 326434 -279200 -142814 128233 -171207
7704 -145041 -143827 92698 -155304 -77855 146518 -36946 192324 -139404 58914 -147004 -88224
7693 -88224 -109682 -16800 -162299 32453 256273 -132689 54227 -102350 65630 113677 64302
7682 64302 -164883 -182883 -92325 3735 119476 18366 93159 11695 -330453 -352694 -165544
7670 -178147 157663 390139 -21475 -209894 95210 -170284 180717 -125975 -188287 4551 122207
7659 122207 -1534 39634 243937 -176564 -329282 -100104 -96541 -190946 -79091 -241384 -403359
7648 -403359 3 -60769 205393 77520 -143808 20131 -444591 109174 86791 -758 -43494 121155
7635 -143485 -152040 80177 97594 -411756 88481 -355998 -194791 -36583 100131 11876 127266
7624 127266 -156206 117467 236459 -52805 -44193 -386258 -193357 1510 93046 -150247 -107061
7613 -107061 -51180 -21793 -245792 -483063 20644 60943 -276302 -360745 -97193 -46767 -130796
7602 -130796 -215232 -326402 -136229 -125801 139194 -351847 -101102 -404067 101434 -174123
7591 112056 21702 -140287 118161 55699 -167398 -38343 -165239 67969 47592 32496 -129320
7579 -28085 136579 370825 -102909 -23468 -65779 -90582 -219140 152678 -35306 -149749 -208691
7568 -208691 75563 -390452 189091 92763 6252 -132498 -191102 157829 -66187 -342556 -43592
7556 195381 159336 -351985 -35873 9450 -149468 -51978 123358 111499 -51023 -37503 110552
7544 -322846 -47689 -57477 -70588 343749 -34214 -194809 -150819 -99127 -64232 368784 2345
7532 -5635 -92856 94601 194291 -39631 -8577 129562 -282185 -97058 870 243084 -142362 -141968
7520 -141968 -121663 144120 240994 73058 117273 -118661 -114191 -144070 -117168 113979 53861
7508 128693 -372936 119606 160967 -263997 -154841 87447 31477 160054 95987 28636 -10509
7496 143173 -252844 -291480 -5325 -232265 104556 -86948 89184 -317633 -108786 -217484 -178564
7485 -178564 93789 122265 -78423 -292811 -170280 185572 190221 296601 15709 -187299 6276
7473 275265 -152058 -287036 356749 -59196 -84821 86458 248493 -226116 -564422 -145633
7462 -50773 -71857 -66263 -95041 -115992 -154510 107144 155072 -152147 -53015 21257 17492 -59548
7449 -91727 -59716 -101896 -219641 173996 89273 -165629 -87795 -319160 -252763 188815 -880
7437 -142857 226201 137199 -196531 75293 -95754 51095 52230 55331 18231 83774 58232 -342959
7424 -133675 63433 -231900 149029 6516 83262 69040 248806 81349 -37177 -177384 -285872
7413 -285872 -205163 86917 58054 -24661 -37937 140824 -7600 -428537 201327 -107148 -288540
7402 -288540 37587 -53318 93465 13137 -431992 368337 -189626 32909 -123421 212613 117274
7391 117274 -78973 -283973 68825 315626 -216281 -285287 -74352 -10485 -179412 31942 -264218
7379 -356042 -9969 -195691 -20113 10732 292009 -354074 -95073 -288952 -80447 169387 -739
7367 -174289 75859 -134321 -119043 -7607 -191003 -12952 133873 -108281 -30109 -230518 -189873
7356 -189873 84021 -42572 149862 -128674 387779 127521 173950 40350 -269209 -74010 -45982
7345 -45982 45051 217680 -234677 192230 -98984 -280374 70121 -425607 -114372 -48782 48609
7333 -69507 -92056 144169 -264489 -211317 -129756 53428 -340134 -262767 -5737 122546 293815
7322 293815 -253259 11323 138061 291240 294617 132267 26801 -193365 57088 -156686 276249
7310 -197016 31404 -176017 173496 76364 86919 -228980 30170 -73938 -263425 -82032 -15864
7298 -202309 -205406 -307357 18703 44816 98769 -276305 -120928 73719 -345977 69200 -174212
7286 -162675 43234 185090 -90546 -62019 135743 55894 -184610 101974 -206013 -468288
7276 -468288 -122427 -20752 -175716 321022 -105177 -61920 57307 -293422 -199473 13595 166669
7265 166669 -51468 -403324 35768 -62130 -127005 -12339 -131444 -121424 -37207 -356006 -285115
7254 -285115 -84304 -110574 104181 -31686 35178 -425484 -39015 -34713 140762 210556 251769
7243 251769 172718 37269 94644 133844 -190343 -80957 32664 77577 -260695 -92756 -3989
7231 -352828 -6809 -183141 206645 -78174 68065 107404 134849 182249 -129765 275509 -120710
7219 -136158 -110232 86362 -20061 240345 121784 -7151 -57294 -20452 -53474 226907 -307673
7207 -98114 -192656 57530 -238394 193314 138171 -215100 -3891 -250320 -144446 -29527 82598
7195 -90586 -55490 118798 -48304 150194 324732 -186228 -123406 -191828 -10722 -138729 -141354
7184 -141354 103967 -195946 -54148 -392637 -174646 -10835 92016 31339 -105451 -234627
7174 -234627 -315209 60342 -280469 -79685 20775 -173547 25770 -186755 -52370 -32481 -42151
7163 -42151 12688 189545 -137515 -60540 -345971 341963 43626 26375 -183037 -108912 37342
7151 47907 -93158 -146248 -263127 204356 -19194 -303566 -159210 -150334 153609 -192546 -216108
7140 -216108 167436 -170080 21947 5552 231142 149726 -427480 -62291 -32477 -153233 49321
7128 -73802 -162391 -172294 -224638 185525 -411397 -5374 -116212 134013 418245 -154720 77419
7116 388516 -85999 -21457 113612 -94629 78835 237140 130352 74404 -279161 -21923 38064
7104 -113447 133204 737 -104570 96002 98439 93323 -27542 -15022 -68419 -64711 -235798 -34021
7091 336766 -117608 218133 -263795 58108 -85439 172231 61355 -356416 43097 -306527
7080 163979 132187 -176062 -28863 274746 175276 -154967 50828 201373 -261116 -25519 148342
7068 49159 -206269 -110615 180464 273558 1329 209611 12393 223302 -58948 -119373 -29346
7056 219316 87610 -72960 -151847 -102726 324662 -321111 15896 -86320 91269 -36526 80290
7044 25068 -39812 -237825 -30047 -162255 -244418 -32775 -12357 -112798 -178442 -234316 -168487
7033 -168487 95245 -1556 -215632 -122901 326204 -92098 -132937 -151456 71623 -107944 125334
7021 -272010 -41767 169417 -38574 -68096 160126 -146185 -113215 399393 -81656 -404490 -237558
7010 -237558 -246930 351595 -40495 130845 -23519 -186479 -265497 -37980 109494 -115456 67499
6998 68697 11726 -393272 -152525 172509 -162800 -113533 63321 -206038 -96474 413953 -25494
6986 200473 -56322 -2243 -107124 -241251 -42495 345751 -149310 -224814 147284 -71534 -161512
6975 -161512 136008 319888 50650 339982 148155 22232 -66574 44618 425201 23185 -55527
6963 383544 -111722 120655 -154072 -143238 -147281 -49061 -147804 217247 -355030 68508 -33548
6951 -29171 -108296 -20784 -129699 -200975 -131648 -101375 41996 58346 -302122 -174149 19419
6939 59501 37134 94718 -173110 187242 -227841 -74757 -49247 193286 -104770 -39723 51005
6927 25710 -10689 -18507 -91102 20616 -103369 -2868 -96063 -148535 -313877 145852 53620 38214
6915 38214 -95127 86043 -17182 29711 308633 32144 199332 -40052 -318947 -69337 16208
6903 -39880 -146042 -212742 301052 -61462 -15404 -40962 -336575 -90532 -313521 -44051 192028
6891 -98967 -91753 -134421 -67171 -233639 128987 -270367 -175587 -231493 183753 90981 109088
6880 109088 -105380 193940 158782 -60226 -120435 -108527 -37225 280198 -121044 302591 -94158
6868 -198284 51772 -67341 416025 -337158 134310 167057 -119113 -309861 -106668 -110132 -214739
6857 -214739 -113486 18905 69040 -220089 127261 201757 222573 -293826 68070 -271742 -79223
6845 142192 -172317 146616 -160239 171211 -51314 87863 80147 65445 291620 396567 57032
6833 130413 138594 -47641 -16779 -176075 251670 176078 -146536 110347 135704 -31421 113179
6821 -265370 -387830 51077 -138476 -155111 48103 230251 -49266 -42187 -181374 172574 -123351
6809 22916 44909 -468670 121103 -118808 54039 44352 -55634 71077 -34225 -68290 41299
6797 93986 -291790 85654 278603 107174 -261863 -150586 207581 -160589 -237223 -43438
6786 279349 -29159 133161 60855 -132789 74932 -2444 13917 -183170 -80492 84500 -106037
6774 45479 -123764 -234706 65271 -81274 69927 263082 36343 174581 -111316 -199278 -142082
6763 -142082 80584 -32133 181777 -5958 -24055 -22690 -287388 -171507 -294659 -124954 406677
6751 -86615 -168152 123158 -286565 198721 -73896 288096 -27916 -70197 -219927 426386 -179635
6739 115522 202091 -49420 -233874 161806 173283 14236 148539 -113154 54831 -187930 -173450
6728 -173450 -71962 107312 -138087 -218443 -111688 -181681 -77450 71989 291659 -49140 154351
6716 -69998 45710 171495 -62774 27990 -18883 185429 -41580 -40645 -182821 66910 12144 183826
6704 183826 -121444 41517 -157675 -123448 25329 182017 -211505 -178278 -293836 -96185 70989
6692 70519 6205 75544 -35772 -222738 -1553 -200450 -97874 -369402 160720 -245076 425921
6680 141752 -108939 -69141 -134489 15415 242391 254781 -96288 -34451 97576 -120875 -92348
6669 -92348 295294 179135 -397450 7885 97454 335050 -9497 180387 -158293 72617 -53969
6657 -40693 75705 202460 -74008 263569 85169 -332857 -207367 -86793 155976 -108067 284324
6645 -111169 68449 -393255 -175457 75405 78255 101472 -389986 320693 155441 25692 -140348
6633 16753 63310 -306171 -183097 -33558 81045 43496 108733 250104 -65196 -52241 84607
6621 -20186 160715 -177871 -71598 4851 -194638 31361 102193 -86395 23878 -43688 -195478
6610 -195478 -137665 -190654 91417 -139628 -195010 -2296 18952 280173 256223 104791 -129528
6598 123451 64769 -188625 254552 171679 56648 52441 -124060 -6354 50472 89098 266685
6587 266685 -12360 36491 -214128 166735 107314 -199158 158345 -191430 -46014 98395 132329
6576 132329 150757 181719 -47109 -1703 135112 -301821 -32361 -213786 -137873 -176077 -303386
6565 -303386 52644 227505 -307962 -83077 -54954 -210009 -3698 293212 -168349 -143367 170648
6553 116653 -201741 -233959 -6775 -225366 -145797 310714 -79017 -105250 62035 -205586 -99930
6541 49350 57860 -262966 94033 353360 -268165 -160973 -288756 -150125 -125180 -308973 265146
6529 -12368 153300 26108 216826 -942 75440 254564 126703 -173753 -5608 62991 -14745
6517 114235 17241 -23457 285868 133434 -188360 331976 -260782 -48436 287807 -87930
6506 25993 -160867 335178 -211020 -152556 52529 -167523 56686 -157656 354075 -151336
6495 84405 -11872 -44885 -150001 -360706 279896 423605 -84849 54112 100840 -170901 239423
6483 145770 -180176 1422 44622 -70159 -117739 -110152 162312 -8098 -154746 -199316 -107126 40479
6470 -109543 362548 -42981 230654 -67683 -334470 19697 166082 -231198 -128475 192598
6459 268198 55673 283088 213844 -207584 217756 -163053 -157877 -219286 61974 221691 44713
6447 -307811 88029 55173 -217374 333002 -430236 -252075 -220242 2601 48148 -13998 -218910
6436 -218910 172895 -125906 126333 199318 107330 205471 -256702 125661 67560 188947
6426 188947 41999 -126272 -334304 152735 -8231 -35994 -99863 -33290 -195342 7946 229235
6415 229235 -352968 244812 39967 -3234 -78369 -121327 227198 -48551 -131289 84239 29936
6403 -410262 -22572 -235245 -140887 -176339 -123615 -73813 21154 -44602 -254372 -162226 -206989
6392 -206989 -229432 34757 308090 200696 186417 -87719 -253716 -167839 -25837 -171967 25513
6380 -20114 13504 -248624 -181991 -152730 2004 67036 -7160 432011 110043 86932 -142794
6368 -216467 -278117 -237537 20747 241829 -237688 14793 -38765 -97437 -44792 -131083 60316
6356 -378262 -68416 -128385 144115 203304 -157134 143846 368990 303728 -272649 -244060 -43017
6344 -206207 -241335 -153834 -2745 110343 -42892 -219082 -225281 229628 120562 -149135 -109743
6333 -109743 40230 104705 -51128 -43620 -114653 82728 -275487 65284 -37641 -46143 -77035 -125895
6321 -125895 -100900 69355 -134824 85317 146346 92812 141935 30588 64821 44237 -238726
6309 -408912 -344770 117814 -286128 271793 224063 126018 116909 -159319 -71942 288123 -110467
6297 99354 257870 186661 125537 130445 -26914 -53978 20535 112818 -319935 25184 254532
6286 254532 1358 -320234 -214446 258472 -39603 -53475 -48797 -85496 -185109 -109501 91962
6274 51719 97462 92849 -76783 323073 -274864 215407 -64887 -71553 -199552 -108011 116678
6262 -133311 51729 -6789 -4171 -78841 -187165 -237844 205893 8775 75586 -133134 -174414 -5143
6249 330137 -312492 -166292 -193496 -121377 179477 -43787 38291 268239 -363948 -44225 -347620
6238 -347620 -184121 -732 188163 49103 36790 319206 -29323 -57333 -298974 247377 -308938
6226 317042 -60907 54889 -129946 43182 -105308 -13902 204784 59681 -35521 253554 199690
6215 199690 34632 -118109 -80861 -33610 -108419 70689 76942 12897 58466 110647 131610 -252875
6202 82738 -41103 146281 244492 -61712 219505 -28006 253293 40603 9721 68032 -5999 -8001
6190 -8001 214297 -237454 155808 -38597 83629 -271742 -52085 -34523 -230055 128235 -104450
6178 -136970 -279541 97740 -325022 -12831 -38091 179474 -160084 157960 -230571 -144867
6168 -144867 167603 -151443 165608 -51843 56353 41926 254571 103316 118222 -192305
6157 -233570 76665 37287 -33760 109452 253078 -30458 -36480 -114644 -115643 -15012 24935 31645
6145 31645 -6960 -370235 -62970 25709 -18988 35935 474202 -35679 104762 8892 39858 34735
6133 34735 -192424 20498 -460817 268419 -81234 2981 -80830 -182557 129697 -328872 -125993
6121 -58074 -251093 90875 -149244 -133673 142388 -97221 21354 261347 129709 1055 -23568
6109 66138 354223 100427 -225010 -256737 -86341 -115172 186471 -32208 29618 -131567 -36005
6097 -94877 21150 -188021 107966 81833 256805 -36539 -7917 -116669 76753 -334125 -440327
6086 -440327 -302631 183448 215108 -233359 13951 348169 78388 278751 64151 81875 -100068
6074 -63280 71673 -309348 -81220 -43928 299519 110548 85433 -228072 414742 -52922 52307
6062 -159247 15630 -91516 161009 -87614 -130421 -58322 272309 -112580 -187202 -67514 -134481
6051 -134481 -341135 127818 -16603 -199253 -183584 7525 -170816 120764 -31413 9374 -73527
6039 -472319 -264453 -75121 -51986 34570 -263156 108926 -231603 -170764 152940 -284436
6028 151745 -96798 227604 -74139 -188829 70509 48511 -446530 -26095 -84804 391999 -119233
6016 -85663 75477 -108294 66482 155330 -227122 213870 -49366 -23505 32787 -377517 -142337
6004 176807 -108951 64833 -213093 86823 28216 -149252 -82721 -297863 -65310 201811 -4030
5992 -7599 109120 -249704 44535 11857 -117941 92951 -121384 -310283 145844 -302530 -260099
5981 -260099 136998 254494 -14589 98536 -33398 -90561 -186777 -13264 156962 106684 64308
5970 64308 -84163 -264513 -70874 -66793 68698 131781 -113907 50016 -551 -243943 -30197 339398
5957 5904 -100249 139406 -112427 -9694 -115649 162173 -240964 252251 -37687 273861 -99038
5945 7164 -75214 267486 65792 77378 -135255 364879 -281170 -35676 -13136 251340 154604
5934 154604 270479 146797 -216747 412906 -51113 127862 287256 -128533 -94028 -23902
5923 -156781 179520 78861 -179993 97987 -40799 -80174 -56813 105772 -204298 152316 69516
5911 -106621 31192 109309 24730 -45228 111972 -15324 -257531 47972 165043 -230474 -162494
5900 -162494 128751 10103 188593 16205 13281 -95079 -122786 -77365 132792 70503 202801
5889 202801 -110132 -170420 98983 201956 227133 97252 2390 -200656 20531 -18603 316240
5877 171190 -216007 -194432 -141885 30401 -74041 74215 -115572 70673 -175960 98211 225557
5866 225557 193907 -11290 151741 58004 -30318 -16744 -98380 95890 84589 -131830 -277918
5855 -277918 152283 -85313 280756 12788 -383883 -156991 10507 -36077 -77566 -263034 -177330
5844 -177330 226263 6651 135254 35084 -194023 199576 81962 -35705 255727 502600 -283102
5832 -18575 233818 9920 -106118 -199187 294481 -263833 60182 -167064 59413 193337 -276396
5820 19852 282657 -302445 -145937 -44833 -125306 -52524 176010 175554 -158690 -106735 77401
5808 -209162 119605 -48851 -337228 -6626 -179466 189037 85072 239706 -138908 179137
5797 -622096 108859 -172697 234249 -15455 -77741 110269 18764 -40267 82174 -164315 -134769
5786 -134769 -135805 210647 -49921 127991 -148155 74285 -133686 -42278 -274423 165433 72782
5774 -464755 70262 163198 -58550 138970 -9523 -40070 -218949 -4137 45691 47432 -262974 12209
5761 -27604 -104362 -33107 144936 23068 58305 -52940 16983 186193 -5617 236373 -195096
5749 72077 -74764 60707 263235 -353031 240722 -184594 -21111 -297858 -178785 141045
5738 335752 -80779 -20504 225843 224222 -230771 15506 -119786 -269785 -85755 67383 -231682
5726 -60650 102005 143988 -151524 -87239 124198 126318 -70002 -297203 91185 33765 206794
5715 206794 -184472 -106575 335646 121391 230401 -88645 -61212 140128 217832 -59978 117192
5703 333072 76242 -137068 -172785 77362 78100 -88478 54285 -146130 -93352 -165004 -35519 133871
5690 -60210 87905 -62006 220815 107569 -116741 345718 259340 23199 34418 -37528 69375
5678 106010 -282118 -6056 -81620 200176 394498 339843 -79606 118575 -130732 -146872 126531
5666 -10859 -342276 -70692 -89734 25928 295251 144730 -143440 166860 170766 167901 92180
5655 92180 -56766 56314 -327445 350049 202917 203801 60177 -112939 -207560 -16623 -47445
5644 -47445 28305 101953 -354378 -75409 -90741 37768 6805 121770 -74030 -204730 115591
5632 206479 -198558 6060 -59169 83339 -13973 -92731 -124763 -158924 111198 41918 -219811
5620 -295155 -258632 11740 127531 -34657 -74930 -133413 -249014 156830 -251683 -227858 239
5608 -131429 158468 -120957 502590 49906 -81069 -18965 -14218 53113 30701 2075 -28814
5596 188425 -45824 150114 -58249 294828 -105248 -36184 135609 -179551 -56555 306943
5585 74654 44149 -167847 171651 83254 55525 -213414 -15625 -135544 89184 92722 302819
5574 302819 -109188 48050 -67401 138553 79851 -147628 -112035 -180287 204804 449226 109498
5562 -69270 -97147 279819 -92424 203218 -188434 -92287 277452 -21472 134216 29584 -162916
5550 -40141 -24486 192274 -29677 -369747 221690 -245018 63108 -38092 -65451 -41980 101725
5538 -262631 268930 -75725 4950 186564 170035 95849 -126819 -8530 -52562 -98647 2723 17324
5526 17324 312251 -37963 -208247 164178 29781 -133118 -125937 -285647 -4260 423513 -265530
5514 66499 231871 184106 57152 18796 15077 135584 135943 54341 -205078 292406 -90476 -281378
5502 -281378 145865 -222353 -203364 -24079 -66102 -84970 -134737 67463 68472 -19908 123481
5490 68426 -360483 -102777 86987 -254139 -429995 -313820 255584 70939 30814 154800
5480 154800 -155748 37964 192674 113910 -146366 217265 -163278 -206902 -132425 117991
5469 -20640 61079 394190 281405 -197018 77098 -171266 177190 -132222 87071 92808 381865
5458 381865 15656 -113369 21382 -241864 -29326 36014 -99512 -187267 126213 -116469 7766
5446 -12573 158628 -88321 -285566 -176084 -481891 78796 24615 179650 -538464 199727
5435 -150417 271505 402484 -144226 114515 -87062 -154461 49798 -261697 -190993 -152412 123462
5423 161639 221660 -106179 99419 -131987 -59975 224825 -61915 -47488 282933 117691 321603
5412 321603 -163877 194479 224712 -138907 249521 306927 46582 192278 110693 -151367
5401 -152691 -55566 -165867 1427 33715 -22867 -25466 316641 -283191 -259440 117995 -53502
5389 -260137 -194544 -250736 24022 -56077 50149 112388 -31594 290030 143665 -278807 23447
5377 -91197 287160 199007 -129899 104884 -437386 -6139 81801 -82991 -200267 -96051 -186281
5366 -186281 18993 490840 16576 -175441 -29213 -263464 171153 -231822 -164020 71464 28887
5354 234259 295662 73523 246063 -106235 1396 122001 -311766 -19433 -189620 93626 70137
5343 70137 -54947 70613 7067 75668 -213006 342768 87038 -78478 -267535 30028 -138973
5331 145610 76119 -204136 -191458 111547 -22534 -23332 10438 -149387 79127 105804 -96158
5319 247671 143800 255583 42903 68298 27839 417617 -56402 154190 175328 -101973 -43172
5307 265170 -61474 -75485 -91482 -62098 -241437 38218 -58223 -24983 -78956 -152312 -31263
5295 31019 -190002 -11345 -73453 241791 134961 -261631 35659 108957 8325 -229778 -289910
5284 -289910 85848 178550 14973 -221823 -147609 30145 -13612 -79664 -36417 240202 9642
5272 125564 247105 -55866 -8074 226661 -186874 -331094 -75343 215119 -169709 362439
5261 122953 -28462 79205 -139649 -89521 -231327 47405 110580 205160 -49678 156154 -242016
5249 -144620 116283 -195989 -20430 -38457 110728 -123653 23033 -356127 -170901 -193961
5239 -193961 198998 -120669 6082 154663 205026 -199687 -140014 70477 -80782 173785 46001
5227 -138360 84239 136038 149113 -44235 73426 -110294 96268 160968 188138 -389377 -139770
5215 -210412 106694 -81104 -188623 -196109 90810 -114965 373488 -72686 370042 -44087 -136839
5204 -136839 -72341 132594 -224714 -256387 74169 -177830 136325 -30982 270059 129758
5193 189179 239735 4597 95321 181771 370134 -53499 246696 -91740 -140354 88127 298956
5182 298956 -156675 -416244 318893 -27016 -369957 -7489 46046 -332759 2515 -174665 110466
5170 -48305 -76686 -49631 205847 285866 214494 73630 15412 5454 142791 -83565 94092 224582
5158 224582 104005 -26318 -244963 -87449 92805 52908 47814 166636 287694 58500 46829
5147 46829 34572 -81493 -87997 27649 -115928 128251 155421 -285949 -14167 -11433 -141850
5136 -141850 -12823 58479 -270220 97384 192112 -371095 210179 -283404 145672 205802 327242
5125 327242 -32555 82076 78240 217819 53164 49229 -47151 -157064 310006 80486 29259
5113 -172223 143673 -97958 137647 21084 343786 85104 -205280 -73464 225325 -47556 129188
5101 77714 225608 -152354 -298065 -13932 215472 254725 167567 -8128 -133135 -64092 -109364
5090 -109364 -340785 85421 -65486 67526 -132508 14064 194906 78741 -219319 -579386 116947
5078 483962 -100041 -12192 -487814 -28316 121718 -4325 -67146 147437 4299 121867 72500
5067 72500 55380 -184851 -132311 9742 119286 -137716 93244 -38505 -82832 63613 22347
5055 16788 80738 275281 -142752 -144135 67773 155242 35409 360330 -152807 130749 141275
5044 141275 377490 59184 -18933 153812 227017 8106 -238844 -180950 71053 -193799 183680
5032 240415 217401 -95750 -305227 249098 -190690 355346 -52020 -343081 48025 -76057 172380
5020 3145 330112 -86033 -232982 7298 -45564 -173589 -129544 -215310 -169775 121390 104641
5009 104641 -64019 -136847 201521 -33323 200872 -279835 -87737 -231022 -3558 -142387 453084
4997 -2477 255278 83718 -25914 45836 300735 -25975 20645 -12972 -65248 -218100 67410
4985 158587 -39676 61383 -168730 298317 -1111 138846 -393411 230059 -265369 227416
4974 40937 222939 -96069 135617 183998 108174 127631 94815 3070 -59039 -149618 -116133 -51507
4961 352712 312896 -33580 52132 56095 103683 49536 83778 -184310 72546 295279 -299903
4949 66486 249378 -247662 -121329 -494004 185150 35518 -24970 -168426 115400 -228136
4938 94394 280976 -93080 -107299 -15662 64168 -18927 -61462 -234797 -160007 -136709 36406
4926 48 -80570 -211905 -24377 -334490 128093 253226 -122578 98392 -52443 -97302 -50492
4915 -50492 322821 18715 154546 -167548 -23136 -18667 4440 -141848 4834 123977 -54775
4903 287611 325625 -97425 -84576 -61135 365214 -11731 -175006 -139912 9873 -196719 275669
4891 128936 -72493 165538 156337 56442 100443 110310 9482 -237185 -308006 -131789 162285
4879 172827 -4866 -134829 -198834 -154729 70228 113359 235820 -182200 -158977 -304983 71637
4867 -20571 -45537 -34998 -112735 -156095 -34732 75263 327686 10990 -173722 12110 -107233
4855 -65643 12477 -151120 -89230 238583 -248169 -280982 131844 9658 368361 -342505 -229156
4844 -229156 9445 164890 -31747 568293 310366 -154958 9762 547530 -211386 -164697 -26355
4832 -132129 -15929 118382 210385 280763 106983 128435 -71954 -197852 -4563 -31167 -12606
4820 209880 219512 86794 -145267 317408 28756 -246569 -146868 -65028 -23173 -78172 -225329
4809 -225329 99290 -34795 228699 -140459 352393 74264 -90833 227591 -283656 -73784 -13741
4797 -112785 16771 -30094 -53569 -105063 -191542 158536 120053 82058 -314016 -212571 -113064
4786 -113064 -57646 -15924 147547 60264 90925 -58826 109598 -228626 -164856 292797 -107608
4774 -272832 -116784 -240672 37785 171135 362746 -67002 118353 -93299 82911 -83588 104390
4762 -129751 -5051 171759 -305802 174818 -42270 -178870 -282030 -425632 -66014 168903
4751 -91672 -203703 279639 -67717 249489 219964 193468 188720 135503 105568 -6855 143322
4739 26616 397462 -112245 -35446 -74268 -161792 233920 -274162 -67670 13881 125191 199661
4728 199661 345886 -277606 19425 -22066 -214488 -100097 276085 -217036 6007 -168950
4717 45445 -2247 277709 177293 278469 -24946 114273 -325828 39213 42862 219879 179006
4706 179006 -162253 -145214 -127561 110880 -4930 -421213 -38727 -3137 114308 218307 -39027
4694 146209 -200551 -86948 137473 -19034 -53008 285528 -43220 202999 -102939 29008 -67809
4682 -285775 -29062 -34220 -146731 -62925 -126620 -38996 -63179 -65401 158142 -28523 -92038 280236
4669 266497 -24841 68502 1249 27480 37172 -157592 -218665 -56414 -7281 50709 -108373 -202817
4657 -202817 -238990 -253213 -219184 101420 395635 -116028 -38913 317905 354637 -294115 -390739
4646 -390739 123259 -99809 24892 256600 217270 54319 21540 335734 124553 -285366 -355520
4635 -355520 -355040 -99514 215461 310519 -135255 196850 -2946 -95439 -86319 -96273 198892 -391499
4622 -104504 58535 -873 -225223 -133884 380694 113345 -167538 -75319 78957 -14978 177220
4610 -29045 48541 -35502 159208 91154 321859 99758 -8101 -176116 191006 211546 93798
4598 146367 -18776 169631 69930 -145300 -255661 -190824 -98050 154058 -58610 -63387 -270250
4587 -270250 -228061 -48122 222 -68091 171419 -139101 -53374 152175 157796 -48294 -128125 210950
4574 345700 -74362 -60720 -44593 -191404 73247 232820 -202785 -383722 -121885 223495
4563 -114492 46996 26856 234311 -31732 61639 78357 -70001 336057 -214578 73411 96930
4552 96930 371168 -157290 -146397 -105853 110718 423388 -118613 -366768 288231 83803
4541 35822 -246584 14581 124541 -139468 154591 316558 127183 -215853 -1719 -111345
4531 -111345 222559 -63421 -68278 -71176 221691 -135706 122776 408739 -28286 37814 68448
4520 68448 -33552 -108567 21398 -41115 242386 -207805 304297 224313 -151020 183495 -26006
4508 124119 39919 125541 -106897 -11537 56661 110680 78756 120318 -213110 -6262 198641
4496 -55493 -36915 -189700 36941 202077 247389 -8522 -116383 -200929 40684 138360 -134389
4484 28938 42548 -196332 12254 28182 191200 368841 -95598 107599 -131994 -252760 223344
$$ [...]
##END NTUPLES=NMR SPECTRUM
##END=
