##TITLE=AC1428_PERAH13239_7764532_aaiA193wdL
##JCAMPDX= 6.0         $$ Bruker NMR JCAMP-DX V2.0
##DATA TYPE= NMR SPECTRUM
##DATA CLASS= NTUPLES
##ORIGIN= BRUKER
##OWNER= Administrator
$$ 1.72 TOPSPIN		Version 2.1
$$ 2015-07-10 22:46:25.691 -0700  Administrator@X
$$ Compression mode = diff/dup
##.OBSERVE FREQUENCY= 400.02188249412
##.OBSERVE NUCLEUS= ^1H
##.ACQUISITION MODE= SIMULTANEOUS (DQD)
##.ACQUISITION SCHEME= undefined
##.AVERAGES= 64
##.DIGITISER RES= 22
##SPECTROMETER/DATA SYSTEM= spect
##.PULSE SEQUENCE= noesygpps1d.comp
##.SOLVENT NAME= COFFEE_meoh
##.SHIFT REFERENCE= INTERNAL, COFFEE_meoh, 1, 14.96144
##AUDIT TRAIL= $$ (NUMBER, WHEN, WHO, WHERE, PROCESS, VERSION, WHAT)
$$ ##TITLE= Audit trail, TOPSPIN		Version 2.1
$$ ##JCAMPDX= 5.01
$$ ##ORIGIN= Bruker BioSpin GmbH
$$ ##OWNER= Administrator
$$ $$ E:\/data/COFFEE/nmr/AC1428_PERAH13239_7764532_aaiA193wdL/32/pdata/1/auditp.txt
$$ ##AUDIT TRAIL=  $$ (NUMBER, WHEN, WHO, WHERE, PROCESS, VERSION, WHAT)
(   1,<2015-07-10 22:46:19.988 -0700>,<Administrator>,<X>,<go>,<TOPSPIN 2.1>,
      <created by zg
	started at 2015-07-10 22:34:50.628 -0700,
	POWCHK enabled, PULCHK disabled,
       configuration hash MD5:
       21 0F 79 D6 B3 7B B4 F6 88 20 88 DB 03 48 BD 9F
       data hash MD5: 64K
       BB 8A F7 BC 05 C4 1C E8 78 9F D4 80 59 F3 64 8B>)
(   2,<2015-07-10 22:46:23.566 -0700>,<Administrator>,<X>,<proc1d>,<TOPSPIN 2.1>,
      <Start of raw data processing
       efp LB = 0.3 FT_mod = 6 PKNL = 1 PHC0 = 0 PHC1 = 0 SI = 128K 
       data hash MD5: 128K
       37 D9 E6 25 C4 81 CD DB 06 61 9A FE 3D 1C F4 8B>)
(   3,<2015-07-10 22:46:24.488 -0700>,<Administrator>,<X>,<proc1d>,<TOPSPIN 2.1>,
      <pk PHC0 = -85.15503 PHC1 = 0 
       data hash MD5: 128K
       B6 A8 EB C2 DF 8C 2F 98 8D C9 A2 59 32 78 25 1A>)
(   4,<2015-07-10 22:46:24.863 -0700>,<Administrator>,<X>,<proc1d>,<TOPSPIN 2.1>,
      <abs ABSG = 1 
       data hash MD5: 128K
       A0 52 05 40 03 FE 21 FE 82 BF D3 0E 7C 4E D7 C5>)
(   5,<2015-07-10 22:46:24.972 -0700>,<Administrator>,<X>,<proc1d>,<TOPSPIN 2.1>,
      <abs ABSG = 2 
       data hash MD5: 128K
       D0 76 47 E3 E7 47 8F A9 ED 14 DF 2F B8 88 A5 90>)
(   6,<2015-07-10 22:46:25.050 -0700>,<Administrator>,<X>,<proc1d>,<TOPSPIN 2.1>,
      <abs ABSG = 3 
       data hash MD5: 128K
       E7 96 9A 7A 8A C1 DD 5A 26 70 0D EC 73 BE 73 55>)
(   7,<2015-07-10 22:46:25.144 -0700>,<Administrator>,<X>,<proc1d>,<TOPSPIN 2.1>,
      <abs ABSG = 4 
       data hash MD5: 128K
       EF 54 29 AE 9F 4B 61 90 40 3E EF 35 9F 1E 92 A4>)
(   8,<2015-07-10 22:46:25.222 -0700>,<Administrator>,<X>,<proc1d>,<TOPSPIN 2.1>,
      <abs ABSG = 5 
       data hash MD5: 128K
       CD A4 06 06 ED 07 A7 A7 69 01 5C 27 80 5B 96 2B>)
$$ ##END=
$$ 
$$ $$ hash MD5
$$ $$ 0C 7A E4 68 A5 B1 7E 4F DD BA F0 52 B1 83 48 86
##$RELAX= 
##$RELAX= 
##$RELAX= 
##$RELAX= 
##$RELAX= 
##$RELAX= 
##$RELAX= 
##$RELAX= 
$$ Bruker specific parameters
$$ --------------------------
##$DU= <E:\>
##$EXPNO= 32
$$ [...]
##$TP07= 0
##$TPNAME0= <>
##$TPNAME1= <>
##$TPNAME2= <>
##$TPNAME3= <>
##$TPNAME4= <>
##$TPNAME5= <>
##$TPNAME6= <>
##$TPNAME7= <>
##$TPOAL= (0..7)
0.5 0.5 0.5 0.5 0.5 0.5 0.5 0.5
##$TPOFFS= (0..7)
0 0 0 0 0 0 0 0
##$TUNHIN= 0
##$TUNHOUT= 0
##$TUNXOUT= 0
##$USERA1= <user>
##$USERA2= <user>
##$USERA3= <user>
##$USERA4= <user>
##$USERA5= <user>
##$V9= 5
##$VALIST= <valist>
##$VCLIST= <CCCCCCCCCCCCCCC>
##$VD= 0
##$VDLIST= <DDDDDDDDDDDDDDD>
##$VPLIST= <PPPPPPPPPPPPPPP>
##$VTLIST= <TTTTTTTTTTTTTTT>
##$WBST= 2048
##$WBSW= 25
##$XGAIN= (0..3)
0 0 0 0
##$XL= 0
##$YL= 0
##$YMAX_a= 7087450
##$YMIN_a= -13141812
##$ZGOPTNS= <>
##$ZL1= 120
##$ZL2= 120
##$ZL3= 120
##$ZL4= 120
##$ABSF1= 14.96144
##$ABSF2= -5.596742
##$ABSG= 5
##$ABSL= 3
##$ALPHA= 0
##$AQORDER= 0
##$ASSFAC= 0
##$ASSFACI= 0
##$ASSFACX= 0
##$ASSWID= 0
##$AUNMP= <proc_prof1d_extract.lims>
##$AXLEFT= 0
##$AXNAME= <>
##$AXNUC= <1H>
##$AXRIGHT= 0
##$AXTYPE= 0
##$AXUNIT= <>
##$AZFE= 0.1
##$AZFW= 0.1
##$BCFW= 0
##$BC_mod= 0
##$BYTORDP= 0
##$COROFFS= 0
##$CY= 15
##$DATMOD= 1
##$DC= 0
##$DFILT= <>
##$DTYPP= 0
##$F1P= 0
##$F2P= 0
##$FCOR= 0.5
##$FTSIZE= 131072
##$FT_mod= 6
##$GAMMA= 0
##$GB= 0
##$INTBC= 1
##$INTSCL= 1
##$ISEN= 128
##$LB= 0.3
##$LEV0= 0
##$LPBIN= 0
##$MAXI= 10000
##$MC2= 0
##$MEAN= 0
##$ME_mod= 0
##$MI= 0
##$NCOEF= 0
##$NC_proc= -2
##$NLEV= 6
##$NOISF1= 0
##$NOISF2= 0
##$NSP= 0
##$NTH_PI= 0
##$NZP= 0
##$OFFSET= 14.96144
##$PC= 1
##$PHC0= -85.15503
##$PHC1= 0
##$PH_mod= 1
##$PKNL= yes
##$PPARMOD= 0
##$PPDIAG= 0
##$PPIPTYP= 0
##$PPMPNUM= 2147483647
##$PPRESOL= 1
##$PSCAL= 4
##$PSIGN= 0
##$PYNMP= <proc.py>
##$REVERSE= no
##$SF= 400.020009459783
##$SI= 131072
##$SIGF1= 0
##$SIGF2= 0
##$SINO= 400
##$SIOLD= 131072
##$SPECTYP= <>
##$SREGLST= <1H.CDCl3>
##$SSB= 0
##$STSI= 131072
##$STSR= 0
##$SW_p= 8223.68421052631
##$SYMM= 0
##$S_DEV= 0
##$TDeff= 65536
##$TDoff= 0
##$TI= <>
##$TILT= no
##$TM1= 0
##$TM2= 0
##$TOPLEV= 0
##$USERP1= <user>
##$USERP2= <user>
##$USERP3= <user>
##$USERP4= <user>
##$USERP5= <user>
##$WDW= 1
##$XDIM= 131072
##$YMAX_p= 436296594
##$YMIN_p= -11191
##$CURPLOT= <Network HP LaserJet P1505>
##$CURPRIN= <$Network HP LaserJet P1505>
##$DFORMAT= <normdp>
##$LAYOUT= <+/1D_H.xwp>
##$LFORMAT= <normlp>
##$PFORMAT= <normpl>
##$SURQMSG= 1
$$ End of Bruker specific parameters
$$ ---------------------------------
##NTUPLES= NMR SPECTRUM
##VAR_NAME=  FREQUENCY,     SPECTRUM/REAL,   SPECTRUM/IMAG
##SYMBOL=    X,             R,               I
##VAR_TYPE=  INDEPENDENT,   DEPENDENT,       DEPENDENT
##VAR_FORM=  AFFN,          ASDF,            ASDF
##VAR_DIM=   131072,        131072,          131072
##UNITS=     HZ,            ARBITRARY UNITS, ARBITRARY UNITS
##FACTOR=    0.0627417313425164, 1,          1
##FIRST=     8223.62146879497, 1417,         -63112
##LAST=      0,             4142,            -62923
##MIN=       0,             -11191,          0
##MAX=       8223.62146879497, 436296594,    0
$$ Real data points
##PAGE= N=1
##DATA TABLE= (X++(R..R)), XYDATA
$$ [...]
63916C645456k05277k08144k08047k05679k01257j94789j86128j75068j61890
63907A899177j47751j34129j21626j09596r7209q4754p3509o4372n6947n0195
63897I59089m3604l7467l2221k7946k4497k1676j9253j7059j5136j3568j2190
63886F94472j0723r213p989p106o162m764k878o20J915M532O978R311J1887J4852
63872F94492J7911K0740K3245K5339K6994K8659L0981L3785L6003L7036L7575
63861A012760L8403L9069L8607L7008L4949L2330K8297K2823J7166J2368Q142
63850A321922L596j571p023j2329j7160k1328k4998k8525l1821l4393l6209l8026
63838A072135m0385m2688m3855m3603m2594m1440m0110l8366l6328l4372l2606
$$ plain form
63916 3645456 3440179 3232035 3023988 2818309 2617052 2422263 2236135 2061067 1899177
63907 1899177 1751426 1617297 1495671 1386075 1288866 1204112 1130603 1066231 1009284 959089
63897 959089 915485 878018 845797 817851 793354 771678 752425 735366 720230 706662 694472
63886 694472 683749 674536 666547 659441 653279 648515 645637 645017 646932 651464 658442 667753 679640 694492
63872 694492 712403 733143 756388 781727 808721 837380 868361 902146 938149 975185 1012760
63861 1012760 1051163 1090232 1128839 1165847 1200796 1233126 1261423 1284246 1301412 1313780 1321922
63850 1321922 1325518 1323947 1316924 1304595 1287435 1266107 1241109 1212584 1180763 1146370 1110161 1072135
63838 1072135 1031750 989062 945207 901604 859010 817570 777460 739094 702766 668394 635788
63827F35788l0706k8322k5623k3232k1534k0216j8752j7139j5770j4693j3521
63816D06280j2127j0910j0135r483q572p553o778o181n418m503l847l711l899
63803C13163m007l764l165k503k281k777l694m321m189l499k866k703k880k983
63789B67531k788k469k306k327k344k254k106j901j572j179r70j086j314j256
63775B41659p42j9N16P62R81J359J612J299N00j86m20n04p87j048q67l12J72L67
63757B44342K85j76j020j731j646q44j03Q8K8K09P27J360J836J819J094Po45l61
63739B45269O64J895K880L253K835J947J248J107J402J960K726L429L652L481
63725B77748L564M191M844M980M786M706M743M717M793N126N235M451K884J373
$$ plain form
63827 635788 605082 576760 551137 527905 506371 486155 467403 450264 434494 419801 406280
63816 406280 394153 383243 373108 363625 355053 347500 340722 334541 329123 324620 320773 317062 313163
63803 313163 309156 305392 302227 299724 297443 294666 290972 286651 282462 278963 276097 273394 270514 267531
63789 267531 264743 262274 259968 257641 255297 253043 250937 249036 247464 246285 245315 244229 242915 241659
63775 241659 240917 240898 241414 242176 243157 244516 246128 247427 247927 247741 247321 246817 246030 244982 244115 243803 243975 244342
63757 244342 244627 244451 243431 241700 240054 239210 239107 239195 239223 239432 240159 241519 243355 245174 246268 246275 245630 245269
63739 245269 245933 247828 250708 253961 256796 258743 259991 261098 262500 264460 267186 270615 274267 277748
63725 277748 281312 285503 290347 295327 300113 304819 309562 314279 319072 324198 329433 333884 336768 338141
63711C38141M30k74j240k374l105l043k404j825j779k148k399k159j446m08Q03
63696C14770J820K143J776J378J521K042K448K629K767K817K598K224J957J743
63682C44633J337Q29N05K53l53j219j596j084l68m60j356j958j324K76J762K486
63666C42363K762L192L802M090L728K912K006J203N21j21r04j928k974l672l999
63651C52981m270m620m827m786m713m670m355l646k953k577k158j232r8N17N51
63636C09144P19J446K248K460K175K136K781L791M580N014N447O085O627O824
63622C61477P052P948R438J0710J1259J1542J2261J3493J4859J6215J7783J9743
63610E13780K2007K4183K5635K5953K5658K5960K7345K8672K8204K5258K0464
$$ plain form
63711 338141 338571 338297 337057 334683 331578 328535 326131 324306 322527 320379 317980 315821 314375 313967 314770
63696 314770 316590 318733 320509 321887 323408 325450 327898 330527 333294 336111 338709 340933 342890 344633
63682 344633 345970 346799 347304 347557 347204 345985 344389 343305 342937 342477 341121 339163 337839 338115 339877 342363
63666 342363 345125 348317 352119 356209 359937 362849 364855 366058 366579 366458 365554 363626 360652 356980 352981
63651 352981 348711 344091 339264 334478 329765 325095 320740 317094 314141 311564 309406 308174 308076 308593 309144
63636 309144 309863 311309 313557 316017 318192 320328 323109 326900 331480 336494 341941 348026 354653 361477
63622 361477 368529 376477 385915 396625 407884 419426 431687 445180 460039 476254 494037 513780
63610 513780 535787 559970 585605 611558 637216 663176 690521 719193 747397 772655 793119
63599G93119J4805R070M028K47k354m295n778o565o572o077n434n058n657p824
63585G65655j1261j4894j7877k0016k1287k1547k0935j9944j8760j7038j4597
63574E67499j1917r598p709o005m398k863j186P24K463L519L955M361N148O155
63560E50148O982P509Q003Q808R949J1041J1721J2144J2895J4416J6674J9473
63548F89763K2888K7214L2476L7904M1816M2254L8286L0834K1980J3332N333j953
63536A002127p958j1891j3539j3365j2027j0083q021o189m790m154m854p172j0609
63523H87475j4290j7780k1071k3885k5615k6191k6405k6982k7627k7487k6263
63512F23879k4387k2242j9889j7600j6014j5332j4871j3843j2260j0654r166p568
$$ plain form
63599 793119 807924 816994 821022 821269 818915 814620 808842 802277 795705 789628 784194 779136 773479 765655
63585 765655 754394 739500 721623 701607 680320 658773 637838 617894 599134 582096 567499
63574 567499 555582 545984 538275 532270 527872 525009 523823 524547 527010 530529 534484 538845 543993 550148
63560 550148 557130 564639 572642 581450 591399 602440 614161 626305 639200 653616 670290 689763
63548 689763 712651 739865 772341 810245 852061 894315 932601 963435 985415 998747 1004080 1002127
63536 1002127 994169 982278 968739 955374 943347 933264 925243 919054 914264 910110 905256 898084 887475
63523 887475 873185 855405 834334 810449 784834 758643 732238 705256 677629 650142 623879
63512 623879 599492 577250 557361 539761 523747 508415 493544 479701 467441 456787 447621 440053
63500D40053o020n134n099n298n036m245l272k355j633j319j532k034k400k316
63486C92360j713q29j58L4K11J112K678L968M416M504M815N105M904M496M449
63471D30352M567M157L113J886N94j005k682l830m425n050n779n896m989l637
63457D07376k624k164k150k515k930k794j942q52J95J590L584N597O911P642Q441
63442D23365R601J0964J2433J4053J5825J7915K0761K4538K8666L2185L4257L4021
63430F78584L0601K4043J5917Q315K345j900m308m630l184p70K282O202J0878
63417G64375J5664K0265K4960K9547L2827L3739L2388K9482K5202J9376J2452
63406A040277N586k16m561p370q624q601p929p269p049p624r359j2459j6711k1481
$$ plain form
63500 440053 434033 428899 423800 418502 413466 409221 405949 403594 401961 400642 399110 397076 394676 392360
63486 392360 390647 389818 389660 389694 389905 391017 393695 397663 402079 406583 411398 416503 421407 425903 430352
63471 430352 434919 439076 442189 444075 444669 443664 440982 437152 432727 427677 421898 416002 411013 407376
63457 407376 404752 402588 400438 397923 394993 392199 390257 389405 389600 391190 394774 400371 407282 414924 423365
63442 423365 432966 443930 456363 470416 486241 504156 524917 549455 578121 610306 644563 678584
63430 678584 709185 733228 749145 757460 759805 757905 753597 748967 745783 745013 747295 753497 764375
63417 764375 780039 800304 825264 854811 887638 921377 953765 983247 1008449 1027825 1040277
63406 1040277 1045863 1045647 1041086 1033716 1025092 1016491 1008562 1001293 994244 986620 977261 964802 948091 926610
63392I26610k5873k9009l0442l0398k9551k8529k7578k6578k5182k3030k0079
63381F30361j6805j3911j1752j0071q352o337m124k002k26J081K075L150M625
63368E67712O396Q032R271J0344J1693J3451J5297J6884J8260J9820K1866K4351
63356G43377K6973K9385L1276L2415L2748L2360L1138K8546K4029J7809J1024
63345A041080M920k1l969o989q757r116q575q046q166r032j0502j2554j5331j8815
63331I26127k2488k5440k7026k7402k7216k6675k5231k2286j7965j2972p937l341
63319F80148P5J325k22m344j0047j5843k0158k2015k1680k0425j9321j8422j7150
63306E11921j5246j3083j1171r706q625p769o928n912m739l746l351l659m308
$$ plain form
63392 926610 900737 871728 841286 810888 781337 752808 725230 698652 673470 650440 630361
63381 630361 613556 599645 587893 577822 569470 563133 559009 557007 556781 557862 559937 563087 567712
63368 567712 574108 582140 591411 601755 613448 626899 642196 659080 677340 697160 719026 743377
63356 743377 770350 799735 831011 863426 896174 928534 959672 988218 1012247 1030056 1041080
63345 1041080 1046000 1045979 1042010 1035021 1026264 1017148 1008573 1000527 992361 983329 972827 960273 944942 926127
63331 926127 903639 878199 851173 823771 796555 769880 744649 722363 704398 691426 683489 680148
63319 680148 680223 681548 681326 676982 666935 651092 630934 608919 587239 566814 547493 529071 511921
63306 511921 496675 483592 472421 462715 454090 446321 439393 433481 428742 424996 421645 417986 413678
63293D13678m748m622l956l045k265j947k222k883l475l744l832l959l972l514
63279C65494k591j687j176r18n62o0L41M73L52K9m42q64j015q96o93m44L2P81
63261C56154J471J774J774J831K001J954J552J214J457K194K764K756K475K535
63247C83906L157M056M846N376N729O085O604P250P778Q073Q485R603J1547J3680
63233D86175J5266J6319J7544J9410K1572K3298K4314K4865K5130K4952K4253
63222G23098K3321K2486K1725K0929K0330K0266K0648K1105K1586K2293K2932
63211I60719K2663K1064J8692J6221J3467R777N107R8m820r842j5151k0338k4664
63198I92993k7714k9568l0455l0386k9154k6727k3657k0763j8331j5890j3024
$$ plain form
63293 413678 408930 404308 400352 397307 395042 393095 390873 387990 384515 380771 376939 372980 369008 365494
63279 365494 362903 361216 360040 359122 358560 358500 358841 359314 359666 359695 359253 358389 357374 356478 355785 355341 355373 356154
63261 356154 357625 359399 361173 363004 365005 366959 368511 369725 371182 373376 376140 378896 381371 383906
63247 383906 387063 391119 395965 401341 407070 413155 419759 427009 434787 442860 451345 460948 472495 486175
63233 486175 501441 517760 535304 554714 576286 599584 623898 648763 673893 698845 723098
63222 723098 746419 768905 790630 811559 831889 852155 872803 893908 915494 937787 960719
63211 960719 983382 1004446 1023138 1039359 1052826 1062603 1067710 1067808 1062988 1053146 1037995 1017657 992993
63198 992993 965279 935711 905256 874870 845716 818989 795332 774569 756238 740348 727324
63187G27324j0033p379m827j796J627M764P417J0096J2955J5327J6698J7522J8467
63174H08162J9352J9522J8965J8314J7945J7708J7595J7841J8257J8033J6606
63163A008300J4300J1727Q950N590J535k986p800j2813j7649k1780k5082k7838
63151I34454l0060l1314l1471l1177l1069l0849k9694k7460k4811k2245j9603
63140F24701j6770j4229j2469j1298j0156q853p568o342n054l778k764k068j553
63127E21799j161r92j070j269j358r98N6J536K606K674K050J517J444J748K396
63112E30978L313L903L498K374J607J676J865J420O92N30R32J039L38p30j449
63097E51986j679j773j964k060j686o83O75J719J757O94o25r21K70J976K806K564
$$ plain form
63187 727324 717291 709912 705085 703289 704916 709680 717097 727193 740148 755475 772173 789695 808162
63174 808162 827514 847036 866001 884315 902260 919968 937563 955404 973661 991694 1008300
63163 1008300 1022600 1034327 1043277 1048867 1050402 1047416 1039616 1026803 1009154 987374 962292 934454
63151 934454 904394 873080 841609 810432 779363 748514 718820 691360 666549 644304 624701
63140 624701 607931 593702 581233 569935 559779 550926 543358 537016 531962 528184 525420 523352 521799
63127 521799 520638 519646 518576 517307 515949 514951 515007 516543 519149 521823 523873 525390 526834 528582 530978
63112 530978 534291 538194 541692 544066 545673 547349 549214 550634 551326 551856 552788 553827 554165 553435 551986
63097 551986 550307 548534 546570 544510 542824 542141 542816 544535 546292 546986 546361 545440 545710 547686 550492 553056
63081E53056K373L047M027M344M021L803L927M032M153M783N894O762P122P591
63067F18935Q595R542R753R596R969J1084J2469J3937J5734J7747J9381K0469
63055G77211K1763K4123K7476L0922L3766L6125L8586M1531M4869M8210N1043
63044A175625N2913N3730N3960N4191N4447N4243N3459N2691N2371N2018N0996
63033A760644M9697M9171M9627N0057M9505M7876M5284M1290L5379K7686J8751
63022B224967Q799k209j4042k6001l7205m6840n4472o0340o4987o8330o9501o7957
63010A721882o4429o0195n5711n0501m4256l7385l0446k3597j6847j0416m468
62999A323631J221P030J2896J8269K2630K5947K8504L0545L2256L3892L5509L6637
$$ plain form
63081 553056 555429 558476 562503 566847 570868 574671 578598 582630 586783 591566 597460 604222 611344 618935
63067 618935 627530 637072 646825 656421 666390 677474 689943 703880 719614 737361 756742 777211
63055 777211 798974 823097 850573 881495 915261 951386 989972 1031503 1076372 1124582 1175625
63044 1175625 1228538 1282268 1336228 1390419 1444866 1499109 1552568 1605259 1657630 1709648 1760644
63033 1760644 1810341 1859512 1909139 1959196 2008701 2056577 2101861 2143151 2178530 2206216 2224967
63022 2224967 2233766 2231557 2217515 2191514 2154309 2107469 2052997 1992657 1927670 1859340 1789839 1721882
63010 1721882 1657453 1597258 1541547 1491046 1446790 1409405 1378959 1355362 1338515 1328099 1323631
62999 1323631 1324852 1331882 1344778 1363047 1385677 1411624 1440128 1470673 1502929 1536821 1572330 1608967
62987A608967L6677L5801L4931L4497L3798L2070K9610K7010K3688J8348J0811
62976A926208K344o070j4699k3880l2897m0772m7440n3353n8426o2133o4282o5013
62964A459587o4348o2367n9619n6692n3535m9736m5411m1264l7829l5092l2807
62953I20887l0799k8928k7120k5438k3961k2603k1225j9785j8280j6781j5590
62942F70377j4989j4673j3928j2585j1315j0687j0469j0235r971r552q349o191
62930E37433m247l872m768n301m572l243k225j526q56n00r35j901k462k085j288
62915D97652j086j789k572k498j827j763k737l670l401k276j591j811k235k225
62901D66171j923j646j423j268j371j670j784j516j089p37m45k25k08l15k26J37
$$ plain form
62987 1608967 1645644 1681445 1716376 1750873 1784671 1816741 1846351 1873361 1897049 1915397 1926208
62976 1926208 1928552 1922482 1907783 1883903 1851006 1810234 1762794 1709441 1651015 1588882 1524600 1459587
62964 1459587 1395239 1332872 1273253 1216561 1163026 1113290 1067879 1026615 988786 953694 920887
62953 920887 890088 861160 834040 808602 784641 762038 740813 721028 702748 685967 670377
62942 670377 655388 640715 626787 614202 602887 592200 581731 571496 561525 551973 543624 537433
62930 537433 533186 529314 524546 519245 514673 511430 509205 507679 506823 506323 505388 503487 501025 498940 497652
62915 497652 496566 494777 492205 489707 487880 486117 483380 479710 476309 474033 472442 470631 468396 466171
62901 466171 464248 462602 461179 459911 458540 456870 455086 453570 452481 451744 451299 451074 450866 450551 450325 450462
62885D50462M25L27Pj70j8L91Q89J262J344J153Q73O95P04Q57R96R58P24L13m13
62866D61779j461k284k141j160m20n88j046q82k23J53P6O2L28N99P46R35J121
62849D55594J102J042J326J905K305K293J918J182K64j75K59P76K23j204k021
62834D66789j426k83J87k48j106j945k328j785m18R40J667J998K357K570K258
62819D69227J572J094J211J935K968L723L667K993K537K788L348L713M089M979
62805E09844O304P419P836P542O805O037N812O578Q249J0087J1152J1073J0558
62792F15296J0952J2894J5606J7876J9514K1300K3700K6426K9313L2691L6665
62781H62233M0749M4615M8623N3194N8213O3350O8474P3374P7677Q1316Q4509
$$ plain form
62885 450462 450887 451214 451221 451051 451033 451424 452313 453575 454919 456072 456945 457640 458344 459201 460197 461155 461879 462192 461779
62866 461779 460318 458034 455893 454733 454313 453725 452679 451797 451574 451727 451803 451865 452193 452792 453538 454473 455594
62849 455594 456696 457738 459064 460969 463274 465567 467485 468667 468931 468756 469015 469791 470014 468810 466789
62834 466789 465363 465080 465267 465019 463913 461968 459640 457855 457437 458377 460044 462042 464399 466969 469227
62819 469227 470799 471893 473104 475039 478007 481730 485397 488390 490927 493715 497063 500776 504865 509844
62805 509844 516148 523567 531403 538945 545750 551787 557599 564177 572426 582513 593665 604738 615296
62792 615296 626248 639142 654748 672624 692138 713438 737138 763564 792877 825568 862233
62781 862233 902982 947597 996220 1049414 1107627 1170977 1239451 1312825 1390502 1471818 1556327
62770A556327Q6910Q7463Q5565Q1662P6154O8424N7849M5159L1805J8224L740
62759B199282j1901k7712m2358n5033o5325p2908p7836q0733q2248q2479q1150
62748A519599p8305p4619p0988o7855o4905o1458n7147n2205m7148m2358l7979
62737H64632l3986l0237k6641k3335k0592j8469j6707j5014j3288j1588j0002
62726F44773q594p246n704l952k427j533j082n50K71J264K435L826N159O170P240
62711F40050Q965J1103J2800J3936J5398J7713K0282K2378K4248K6610K9678L3219
62699H76380L7079M1131M5069M8787N2693N7210O2187O7046P1174P4018P5205
62688A507979P4785P2955O9352O3303N4842M4777L3490K0639O445p647k0339l1753
$$ plain form
62770 1556327 1643237 1730700 1816265 1897927 1974081 2042505 2100354 2145513 2177318 2195542 2199282
62759 2199282 2187381 2159669 2117311 2062278 1996953 1924045 1846209 1765476 1683228 1600749 1519599
62748 1519599 1441294 1366675 1295687 1227832 1162927 1101469 1044322 992117 944969 902611 864632
62737 864632 830646 800409 773768 750433 729841 711372 694665 679651 666363 654775 644773
62726 644773 636179 628933 623229 619277 616850 615317 614235 613685 613956 615220 617655 621481 626640 632810 640050
62711 640050 649015 660118 672918 686854 702252 719965 740247 762625 786873 813483 843161 876380
62699 876380 913459 954590 999659 1048446 1101139 1158349 1220536 1287582 1358756 1432774 1507979
62688 1507979 1582764 1655719 1725071 1788374 1843216 1887993 1921483 1942122 1948567 1940920 1920581 1888828
62676A888828m2520n2375o0553o6894p1556p4124p4174p2457p0368o8284o5384
62665A170139o1214n6466n1981m7764m3363l8809l4746l1780k9734k7615k4578
62654G22089k1046j8358j7130j6525j5596j4504j3747j2915j1296r282q000p676
62642E56014p417o625n603m666l650k599k026k139k421k377k144k108k338k669
62628E07232k915k798k141j293r85j536k462l043k955k294j372n51nM54J107J930
62612D86373K710L405M042M404M279L940L979M651N755P030Q334R573J0891J2717
62598E72083J5186J7747J9855K1765K3995K6344K8344L0373L3287L6884L9858
62587H65721M1486M2319M2795M2242L9838L5781L0715K4736J7784J0431L363l615
$$ plain form
62676 1888828 1846308 1793933 1733380 1666486 1594930 1520806 1446632 1374175 1303807 1235523 1170139
62665 1170139 1108925 1052459 1000478 952714 909351 870542 835796 804016 774282 746667 722089
62654 722089 701043 682685 665555 649030 633434 618930 605183 592268 580972 571690 563690 556014
62642 556014 548597 541972 536369 531703 528053 525454 523428 521289 518868 516491 514347 512239 509901 507232
62628 507232 504317 501519 499378 498085 497100 495564 493102 490059 487104 484810 483438 482887 482882 483336 484443 486373
62612 486373 489083 492488 496530 500934 505213 509153 513132 517783 523538 530568 538902 548475 559366 572083
62598 572083 587269 605016 624871 646636 670631 696975 725319 755692 788979 825863 865721
62587 865721 907207 949526 992321 1034563 1074401 1110182 1140897 1165633 1183417 1193848 1197211 1193596
62575A193596j1130j8906k5760l0920l4607l7218l8688l9008l8755l8481l7927
62564H42196l6443l4057l1520k9316k7183k4888k2782k1157j9497j7097j4227
62553E64029j1937j0699r984r220q394p476o145m539l509l435l523k894j831j119
62539D79324p76l55qj42l47J69J143J441P73J50M25J323K332L516M978O247O886
62522E07079P191P770Q819J0204J1928J4127J6822J9894K3107K6065K8495L0633
62510G12134L2963L5497L7810L9758M1524M2887M3102M1798L9347L6051L1594
62499A134465K5755J9056J2166N159k056q854j4146j7422j9133k0025k0476k0439
62487A074050j9790j8585j7002j5021j2326q779n000k194j263k258m509p040q948
$$ plain form
62575 1193596 1182466 1163560 1137800 1106880 1072273 1035055 996367 957359 918604 880123 842196
62564 842196 805753 771696 740176 710860 683677 658789 636007 614850 595353 578256 564029
62553 564029 552092 541393 531409 522189 513795 506319 500174 495635 492126 488691 485168 482274 480443 479324
62539 479324 478548 478193 478185 478043 477696 477865 479008 480449 481222 481372 481797 483120 485452 488968 493946 500193 507079
62522 507079 514270 522040 530859 541063 552991 567118 583940 603834 626941 653006 681501 712134
62510 712134 745097 780594 818404 858162 899686 942573 985675 1027473 1066820 1102871 1134465
62499 1134465 1160220 1179276 1191442 1196601 1194545 1185691 1171545 1154123 1134990 1114965 1094489 1074050
62487 1074050 1054260 1035675 1018673 1003652 991326 982547 977547 975353 974090 971832 967323 960283 951335
62474I51335r987j0858j2592j5541j9219k2881k5866k7572k7862k7571k7754k8300
62462F95332k7968k6114k3612k1652k0341j8976j7096j4711j1988r319p304o101
62450D90150n121l880k769k363k333j778n01Q01J593K067K530K843K802K673K946
62435D89660L686M401M536L960K976J946R86Kj110k403l922n649p372q690r213
62420D73794q712p254n352l860l412l924m701n029m617l756l134l224l604l319
62406D09896k158j133j130j602j380m22K22Q5q4M57J439K130K209J817J363J433
62390D13142K341L536M080L826L464L335L126K901L441M961O424O794O338O011
62376D73720O177O631P252P946Q355Q350Q456R198J0359J1454J2515J3769J5016
$$ plain form
62474 951335 941348 930490 917898 902357 883138 860257 834391 806819 778957 751386 723632 695332
62462 695332 667364 641250 617638 595986 575645 556669 539573 524862 512874 503555 496251 490150
62450 490150 485029 481149 478380 476017 473684 471906 471405 472206 473799 475866 478396 481239 484041 486714 489660
62435 489660 493346 497747 502283 506243 509219 511165 512151 512153 511043 508640 504718 499069 491697 483007 473794
62420 473794 465082 457828 452476 448616 445204 441280 436579 431550 426933 423177 420043 416819 413215 409896
62406 409896 407738 406605 405475 403873 402493 402071 402293 402378 402294 402751 404190 406320 408529 410346 411709 413142
62390 413142 415483 419019 423099 426925 430389 433724 436850 439751 443192 448153 454577 461371 467709 473720
62376 473720 479897 486528 493780 501726 510081 518431 526887 536085 546444 557898 570413 584182 599198
62363E99198J6069J7412J9665K2592K5497K8403L2021L6532M1121M4909M7803
62352I31222N0236N2422N3978N4106N2133M8064M2510L5953K8430K0173J2101
62341A381328N171n61n753j0922j6214k1731k7472l2918l7241l9967m1175m1143
62329A111402m0184l8700l7054l5260l3046l0199k6875k3774k1971k2028k3055
62318G79256k3304k2085k0544j9965j9954j9092j7047j4944j3755j3195j2470
62307E82901j1356j0164r118q144p084n972n030m367l667k464q98J95K16m41r51
62292E13656r77o02J88J357K385K671K258J670J138N61Q0J00O81J449K099K573
62276E31287K806K756K617K671K972L562M725O601Q732J0496J1796J2887J3816
$$ plain form
62363 599198 615267 632679 652344 674936 700433 728836 760857 797389 838510 883419 931222
62352 931222 981458 1033880 1087858 1141964 1194097 1242161 1284671 1320624 1349054 1369227 1381328
62341 1381328 1386499 1385938 1380185 1369263 1353049 1331318 1303846 1270928 1233687 1193720 1152545 1111402
62329 1111402 1071218 1032518 995464 960204 927158 896959 870084 846310 824339 802311 779256
62318 779256 755952 733867 713323 693358 673404 654312 637265 622321 608566 595371 582901
62307 582901 571545 561381 552263 544119 537035 531063 526033 521666 517999 515535 514637 514832 515048 514607 513656
62292 513656 512679 512077 512265 513622 516007 518678 520936 522606 523744 524305 524385 524485 525166 526615 528714 531287
62276 531287 534093 536849 539466 542137 545109 548671 553396 559997 568729 579225 591021 603908 617724
62263F17724J4721J6300J9196K3044K6929L0683L4830L9337M3463M7012N0716
62252I63955N4961N8948O1573O2398O1381N8317N3176M6507L8957L0830K2405
62241A513408J4170O276j718j0111j8461k6262l3703m1062m7719n2495n4894n5441
62229A191988n4846n3466n1538m9308m6752m3619m0005l6498l3489l0695k7621
62218G24151k4321k1301j8817j6593j4377j2424j1163j0554j0080r412q718q162
62206E58229p457o259m742l449k561j770q62o2L78O42J095J832K651L408M120
62191E45193M807N500O379P656R191J0431J0921J0813J0597J0419J0018R399R131
62178F60455R562J0083R673Q173O449N332M904M989N730P290R472J2043J5112
$$ plain form
62263 617724 632445 648745 667941 690985 717914 748597 783427 822764 866227 913239 963955
62252 963955 1018916 1077864 1139437 1201835 1263216 1321533 1374709 1421216 1460173 1491003 1513408
62241 1513408 1527578 1533854 1532136 1522025 1503564 1477302 1443599 1402537 1354818 1302323 1247429 1191988
62229 1191988 1137142 1083676 1032138 982830 936078 892459 852454 815956 782467 751772 724151
62218 724151 699830 678529 659712 643119 628742 616318 605155 594601 584521 575109 566391 558229
62206 558229 550772 544513 539771 536322 533761 531991 531129 531067 531445 532087 533182 535014 537665 541073 545193
62191 545193 550000 555500 561879 569535 578726 589157 600078 610891 621488 631907 641925 651324 660455
62178 660455 670017 680100 689773 697946 704395 709727 714631 719620 725350 732640 742112 754155 769267
62165G69267J8804K2808K6702L0505L4396L7987M0372M0860L9396L6314L2027
62154A129438K6975K1521J5865J0163M675m31n305j0199j5067j9601k3528k6733
62142A107773k9182l0946l2136l2662l2142l0343k7569k4448k1446j8699j6092
62131H12108j3357j0401p648n760m788m040l032k069j432n48J321L883O078P449
62117G77764Q575J0104J1944J3510J4292J3949J2254R228N346J552j009j705j072
62104H74732m62p18j516k244l005m250n766o792o897o159m703k733q64K71Q10
62089H29704J481K613L803M550M781M733M792N362O472P642Q522R477J1017J2918
62075I17867J4502J5599J6522J7347J7875J8255J8790J9199J8821J7578J6128
$$ plain form
62165 769267 788071 810879 837581 868086 902482 940469 980841 1021701 1061097 1097411 1129438
62154 1129438 1156413 1177934 1193799 1203962 1208637 1208206 1202901 1192702 1177635 1158034 1134506 1107773
62142 1107773 1078591 1047645 1015509 982847 950705 920362 892793 868345 846899 828200 812108
62131 812108 798751 788350 780702 774942 770154 766114 763082 761013 759581 759033 760354 764237 770315 777764
62117 777764 786339 796443 808387 821897 836189 850138 862392 871620 876966 878518 877509 875804 874732
62104 874732 874270 873552 872036 869792 866787 862537 856771 849979 843082 836923 832220 829487 828623 828894 829704
62089 829704 831185 833798 837601 842151 846932 851665 856457 861819 868291 875933 884455 893932 904949 917867
62075 917867 932369 947968 964490 981837 999712 1017967 1036757 1055956 1074777 1092355 1108483
62064A108483J5084J4776J5643J7871K0578K2309K2558K2047K1293J9765J6818
62053A317225J2698Q160L757k15l668o963j0669j4811j8911k2823k6882l1033
62041A205865l4634l7365l9482m0925m1062l9824l8174l6898l5608l3636l1080
62030G97177k8291k4995k0854j6422j2671r899p844o520o125o305o326n914n392
62017F39619n090n140n716o785p742p843p105o236n663n083m070k755j670j122
62003E67599q24j86J014K252K843K884L174M001M500L723J946L67l15m66q10j693
61987E90009l156n146p360r155r970r855r417r230r306r242q765p995p087n943
61973D78382m497l118k282j944j648j241j002j041j052q06m38l2O11J505K196
$$ plain form
62064 1108483 1123567 1138343 1153986 1171857 1192435 1214744 1237302 1259349 1280642 1300407 1317225
62053 1317225 1329923 1338083 1341840 1341625 1337957 1330994 1320325 1305514 1286603 1263780 1236898 1205865
62041 1205865 1171231 1133866 1094384 1053459 1012397 972573 934399 897501 861893 828257 797177
62030 797177 768886 743891 723037 706615 693944 684045 676201 669681 663556 657251 650925 645011 639619
62017 639619 634529 629389 623673 616888 609146 601303 594198 587962 582299 577216 573146 570391 568721 567599
62003 567599 566775 566589 567603 569855 572698 575582 578756 582757 587257 590980 592926 593293 592978 592512 591702 590009
61987 590009 586853 581707 574347 565192 555222 545367 535950 526720 517414 508172 499407 491412 484325 478382
61973 478382 473885 470767 468485 466541 464893 463652 462650 461609 460557 459751 459313 459281 459892 461397 463593
61958D63593K305K078K047K371K796L162L602M264M955N198M763M202M586O420
61944E16342R030J1373J3221J5005J6800J8253J9461K1067K3203K5155K6325K6901
61932G42136K7235K7208K6642K5779K4822K3499K1523J9116J6634J4064J1216
61921I79874Q074M679J034k540n413p354q796r987j0303q920n912k250J139M052
61907I37377O919J0281J4138J7771K0391K1865K2345K1466J8630J4109Q948L632
61895A117872k137q092j2965j6042j8171k0358k2257k2981k2747k2599k2857k2826
61883I03840k1896k0194j8307j6917j6493j6782j6881j6296j5500j5017j4565
61872G14992j3688j2583j1489r918p468m872l179k188q51J045K703L790M916O490
$$ plain form
61958 463593 465898 467976 470023 472394 475190 478352 481954 486218 491173 496371 501134 505336 509922 516342
61944 516342 525372 536745 549966 564971 581771 600024 619485 640552 663755 688910 715235 742136
61932 742136 769371 796579 823221 849000 873822 897321 918844 937960 954594 968658 979874
61921 979874 987948 992627 993661 991121 985708 978354 969558 959571 949268 940348 934436 932186 933325 937377
61907 937377 944296 954577 968715 986486 1006877 1028742 1051087 1072553 1091183 1105292 1114240 1117872
61895 1117872 1115735 1107643 1094678 1078636 1060465 1040107 1017850 994869 972122 949523 926666 903840
61883 903840 881944 861750 843443 826526 810033 793251 776370 760074 744574 729557 714992
61872 714992 701304 688721 677232 667314 659846 654974 651795 649607 648756 649801 652504 656294 661210 667700
61858F67700Q150R623J1377J4005J7554K1630K5745K9404L2433L5227L8263M1319
61846I52430M3677M4993M5467M5242M4176M2177L9168L4864K9148K2605J6025
61835A359972R470K451m922j1638j6637j9400j9739j7747j4041r419m201J587
61823A255736P321J1777J4247J5146J5275J4799J3092R247K854n363j3812k1304
61811A319015k7939l4284m0056m4287m6557m7232m6632m4861m2421m0049l7788
61800H66909l5100l2007k9195k6785k4010k0585j7462j5630j4767j3785j2239
61789F25344j0539r093p837o560n314m476m395m818m841l857k442j699j778j768
61775E55927j187o60p69j036p67k31k22q10j215q99q8P17J301J679J856J881J996
$$ plain form
61858 667700 675850 685473 696850 710855 728409 750039 775784 805188 837621 872848 911111 952430
61846 952430 996107 1041100 1086567 1131809 1175985 1218162 1257330 1292194 1321342 1343947 1359972
61835 1359972 1369442 1371893 1366971 1355333 1338696 1319296 1299557 1281810 1267769 1258350 1254149 1255736
61823 1255736 1263057 1274834 1289081 1304227 1319502 1334301 1347393 1356640 1359494 1354131 1340319 1319015
61811 1319015 1291076 1256792 1216736 1172449 1125892 1078660 1032028 987167 944746 904697 866909
61800 866909 831809 799802 770607 743822 719812 699227 681765 666135 651368 637583 625344
61789 625344 614805 605712 597875 591315 586001 581525 577130 572312 567471 563614 561172 559473 557695 555927
61775 555927 554740 554080 553311 552275 551508 551277 551055 550245 549030 548131 548043 548760 550061 551740 553596 555477 557473
61758E57473K506L400M103L915K832J703J272J336J225Q14L88k03j447l146m314
61743E71857m347l571k484j233j92j65j294k408k221q67M44R37Q15N23K41J06
61727E56141L09P98J278J637K004K401K593K477K322K532L229M080M460L907K590
61712E92758J295P48Q75Q98J96j064k217k898l347l923m500m637m255l815l693
61697E62421l669l309k683k310k520l113l639l790l489k882k243j761j434j237
61683E24342j220j332j378j388j734k560l308l262k430j488r24o80o37r48j755
61668D99298k815l551l453k596j739j689k359k855k699k402k432k269j182M39
61654D67696J444J409R36N71L18J94M67J139J922K794L989N291O039N962N471
$$ plain form
61758 557473 559979 563379 567482 571397 574229 575932 577204 578540 579765 580579 580967 580764 579317 576171 571857
61743 571857 567510 563939 561455 560222 560030 559865 558571 556163 553942 553075 553519 554456 555271 555794 556035 556141
61727 556141 556450 557248 558526 560163 562167 564568 567161 569638 571960 574492 577721 581801 586261 590168 592758
61712 592758 594053 594801 595676 596574 596770 595706 593489 590591 587244 583321 578821 574184 569929 566114 562421
61697 562421 558752 555443 552760 550450 547930 544817 541178 537388 533899 531017 528774 527013 525579 524342
61683 524342 523122 521790 520412 519024 517290 514730 511422 508160 505730 504242 503318 502638 502001 501053 499298
61668 499298 496483 492932 489479 486883 485144 483455 481096 478241 475542 473140 470708 468439 467257 467696
61654 467696 469140 470549 471485 472056 472374 472568 473035 474174 476096 478890 482879 488170 494209 500171 505642
61639E05642M955M452L977L615L105K029N24p79j629k337l029l464l704m181m883
61624E04293n171m746m048l484k888k087j364j014j015j329j965k594k785k729
61610D67074k995l435l344k869l154m608o164o849p036p377p559p116o549o547
61596C91472o726o283n381m747m346l608k689k286k330k046j376j236k095l183
61582C43140l515k984k117j326p88o25q42j198j371j109l50N72R63M08o82j481
61566C26695j660j551j467j307r00l74kJ27J21P4j4r4O4P02J621K104J682Q10
61548C26631L94O43R74J063J237J613J635R57J33j14J59M83Q04J327J916K276
61532C42131K445K571K474K030J616J587J603J136M05K2o9n13j421k077j982j535
$$ plain form
61639 505642 510597 515049 519026 522641 525746 527775 528299 527520 525891 523554 520525 517061 513357 509176 504293
61624 504293 499122 494376 490328 486844 483956 481869 480505 479491 478476 477147 475182 472588 469803 467074
61610 467074 464079 460644 457300 454431 451277 446669 440505 433656 426620 419243 411684 404568 398019 391472
61596 391472 384746 378463 373082 368335 363989 360381 357692 355406 353076 351030 349654 348418 346323 343140
61582 343140 339625 336641 334524 333198 332410 331785 330943 329745 328374 327265 326915 327487 328450 328858 328176 326695
61566 326695 325035 323484 322017 320710 319810 319436 319434 319561 319682 319756 319742 319648 319712 320414 322035 324139 325821 326631
61548 326631 327025 327668 328642 329705 330942 332555 334190 335147 335280 335166 335325 335808 336612 337939 339855 342131
61532 342131 344576 347147 349621 351651 353267 354854 356457 357593 357998 358020 357951 357438 356017 353940 351958 350423
61516C50423j393j603j635j112k81K24R6k34j73J81K45J8J91Q38R74L3j022j045
61498C44725m89o27j391j453l85N99M47l33o00o9P27J315J537J357R13N29L32
61481C47134J75k5j69l33p19j112r42r7Q14J266J367J330J016L95n2J10O39J010
61463C51807J146J241J188P46P3l26k28K25Q49J417J472P44k30m88K09J140J671
61446C62656K015K566L031K840K128J668J842K312K780L403M205M711M561M116
61432D04834L963M122M182L966L570K984K268J909K392L387L959L681L018K593
61418D50828K560K743K835K397J236j11r16j289j961k853k948j976j342k419m594
61403D42190n928n469m088l121l029l381l516l008j952r16m32n14p76r13q69p18
$$ plain form
61516 350423 349030 347427 345792 344680 344399 344623 344719 344485 344312 344493 344738 344756 344947 345785 346759 346792 345770 344725
61498 344725 344236 343609 342218 340765 340380 340979 341426 341093 340493 340424 341151 342466 344003 345360 346273 346802 347134
61481 347134 347309 347284 347115 346782 346063 344951 344009 343912 344726 345992 347359 348689 349705 350100 350048 350158 350797 351807
61463 351807 352953 354194 355382 356128 356201 355875 355647 355872 356721 358138 359610 360354 360124 359636 359845 360985 362656
61446 362656 364671 367237 370268 373108 375236 376904 378746 381058 383838 387241 391446 396157 400718 404834
61432 404834 408797 412919 417101 421067 424637 427621 429889 431798 434190 437577 441536 445217 448235 450828
61418 450828 453388 456131 458966 461363 462599 462488 461572 460283 458322 455469 452521 450545 449203 446784 442190
61403 442190 436262 430793 426705 423584 420555 417174 413658 410650 408698 407782 407350 406836 406060 405147 404278 403560
61387D03560o32p21p80m09L82J068J325J472J894K364K381J831J048M47L74Q98
61371D16502J497J471R83J077K234L564M033L849L868M185M278M121M179M499
61357D60340M719M909N473O328P026P660Q757J0181J1035J0833J0048R287Q589
61344E65185P820P104O574O139N695N274M823M264L759L487L209K495J360J87
61330F27375q93k025l116l937m666n643o512o454n442m466m204m164l601k660
61316E69592k014j822j630j127m68J11O47J363K394L708N186O714Q065Q793Q546
61301F08058P535O314M964L016N22j438j976j671j817k707l495l640l512l517
61287F06636l517l371l263l214k904k325j948j963j805q43Q39K610L935M668M967
$$ plain form
61387 403560 402928 402207 401427 401018 401400 402468 403793 405265 407159 409523 411904 413735 414783 415230 415604 416502
61371 416502 417999 419470 420453 421530 423764 427328 431361 435210 439078 443263 447541 451662 455841 460340
61357 460340 465059 469968 475441 481769 488795 496455 505212 515393 526428 537261 547309 556596 565185
61344 565185 573005 580109 586683 592822 598517 603791 608614 612878 616637 620124 623333 625828 627188 627375
61330 627375 626482 624457 621341 617404 612738 607095 600583 594129 588687 584221 580017 575853 572252 569592
61316 569592 567578 565756 564126 562999 562531 562642 563289 564652 567046 570754 575940 582654 590719 599512 608058
61301 608058 615593 621907 626871 629887 630409 628971 626995 625324 623507 620800 617305 613665 610153 606636
61287 606636 603119 599748 596485 593271 590367 588042 586094 584131 582326 581483 582322 584932 588867 593535 598502
61272E98502N073N015M546L708L191L689M978O198O966P593Q294Q970R819J1291
61258F87833J3140J4272J3936J2610J1249J0131Q825O944M545K016k69k272m306
61245G78654o507q456r646j0143j0297j0046r156q024p448p574p827p856p761
61232F67913p426o535n400m765m526l686j956l55K51K91M75O81N57M95R94J681
61216F38689J913J874K219K919L341L310L217L219L018K498J983J822K088K672
61202F74782L360L936M550N692P580R710J1478J2874J4211J5392J5977J5789J4970
61189H10301J3567J1518R000O453M279K769K124K224K445K102J052l21j603k637
61175H63273l468m231n102o167p332q389r042r036q564q378r079j0264j0948j0855
$$ plain form
61272 598502 603575 608590 613136 616844 620035 623724 628702 634900 641866 649459 657753 666723 676542 687833
61258 687833 700973 715245 729181 741791 753040 763171 771996 778940 783485 785501 785232 782960 778654
61245 778654 772147 763691 754045 743902 733605 723559 714403 706379 698931 691357 683530 675674 667913
61232 667913 660487 653952 648552 643787 639261 635575 633619 633264 633515 633806 634281 634962 635519 636014 637008 638689
61216 638689 640602 642476 644695 647614 650955 654265 657482 660701 663719 666217 668200 670022 672110 674782
61202 674782 678142 682078 686628 692320 699900 709610 721088 733962 748173 763565 779542 795331 810301
61189 810301 823868 835386 844386 850839 855118 857887 860011 862235 864680 866782 867834 867513 865910 863273
61175 863273 859805 855574 850472 844305 836973 828584 819542 810506 801942 793564 784485 774221 763273 752418
61161G52418j0637j0675j0508r800r084q898q819q070o631n004l299j362M62J501
61147F61594J648J285M27j363m061o832q808r802j0050r696q818p613o303m944
61133E86664l469j855j59J491K966M185N136N837O381P035Q117R675J1410J2998
61119F56412J4311J5352J6143J6807J7483J8133J8623J8989J9348J9542J9283
61108H50426J8686J8170J7724J6774J5009J2839J0696Q346N300J546k486o298
61096I66732r339j1157j1966j2705j4021j5472j6231j6298j6358j6720j7007j6806
61084G92652j6024j4749j3292j2310j2186j2276j1434r484p526o488n979n044
61072F65860l569k304j685j287n35O05J799K826L573L920M005M411N587P168Q284
$$ plain form
61161 752418 741781 731106 720598 710798 701714 692816 683997 675927 669296 664292 660993 659631 660093 661594
61147 661594 663242 664527 664954 663591 659530 652698 643890 634088 624038 614342 605524 597911 591608 586664
61133 586664 583195 581340 581181 582672 585638 589823 594959 600796 607177 614212 622329 632004 643414 656412
61119 656412 670723 686075 702218 719025 736508 754641 773264 792253 811601 831143 850426
61108 850426 869112 887282 905006 921780 936789 949628 960324 968670 973970 975516 973030 966732
61096 966732 957393 946236 934270 921565 907544 892072 875841 859543 843185 826465 809458 792652
61084 792652 776628 761879 748587 736277 724091 711815 700381 690897 683371 676883 670904 665860
61072 665860 662291 659987 658302 657015 656480 657085 658884 661710 665283 669203 673208 677619 683206 690374 698658
61057F98658Q559Q391Q324Q642R591J1339J3433J4989J5776J6544J7854J9294
61045H51394K0384K1540K3287K5108K6107K6416K6940K7962K9013K9932L0983
61034A139066L2070L2877L3775L5435L7580L9249M0446M2284M5198M8241N0523
61023A576744N2216N3656N4636N5256N6585N9752O5069P2469Q1983R3333J05851
61012B327550J19279J34026J50590J69817J93808K25138K64822L12446L68508
61003D265984M34729N11745N99461P01529Q27521R89089J195959J454373J757326
60994A2737716K061121K271235K272048J997399J487207Q76389L24562n2167k03440
60985B3772070j36258Q6585L41983M72829L57413k2915n75516j153266j627330
$$ plain form
61057 698658 707217 715608 723932 732574 742165 753504 766937 781926 797702 814246 832100 851394
61045 851394 871778 893318 916605 941713 967820 994236 1021176 1049138 1078151 1108083 1139066
61034 1139066 1171136 1204013 1237788 1273223 1310803 1350052 1390498 1432782 1477980 1526221 1576744
61023 1576744 1628960 1682616 1737252 1792508 1849093 1908845 1973914 2046383 2128366 2221699 2327550
61012 2327550 2446829 2580855 2731445 2901262 3095070 3320208 3585030 3897476 4265984
61003 4265984 4700713 5212458 5811919 6513448 7340969 8330058 9526017 10980390 12737716
60994 12737716 14798837 17070072 19342120 21339519 22826726 23703115 24027677 23975510 23772070
60985 23772070 23635812 23722397 24064380 24537209 24894622 24871707 24296191 23142925 21515595
60976B1515595j927726k044655k010220j875981j691963j493153j298277j116341
60968H057279r51789q05855o77800n66834m72343l92876l26650k72681k29954
60959C360497j95961j67721j43912j24494j08611r4673q2286p2199o4351n7630
60949B248659n1706m7514m5684m5813m7397n0119n3165n5604n7560n9665o1418
60938A673014o1562o0147n8609n7603n6258n3980n1410m9168m6938m4387m1707
60927A091245l8885l5622l2340k9982k8425k6419k3570k1007j9506j8309j6498
60916H00682j4337j2496j1035r825q954q054o342l953k199j750j700j124m64m83
60902G17966r13j110j199j546j956k232k821l916m699m484l972m262n183n621
$$ plain form
60976 21515595 19587869 17543214 15532994 13657013 11965050 10471897 9173620 8057279
60968 8057279 7105490 6299635 5621835 5055001 4582658 4189782 3863132 3590451 3360497
60959 3360497 3164536 2996815 2852903 2728409 2619798 2525125 2442839 2370640 2306289 2248659
60949 2248659 2196953 2149439 2103755 2057942 2010545 1960426 1907261 1851657 1794097 1734432 1673014
60938 1673014 1611452 1551305 1492696 1435093 1378835 1324855 1273445 1224277 1177339 1132952 1091245
60927 1091245 1052360 1016738 984398 954416 925991 899572 876002 854995 835489 817180 800682
60916 800682 786345 773849 762814 752989 744035 735981 729639 725686 723487 721737 720037 718913 718449 717966
60902 717966 717053 715943 714744 713198 711242 709010 706189 702273 697574 693090 689118 684856 679673 674052
60888F74052n161m427m021l962m052m105m012l977m440n362o053o092n950o209
60874F06229o777p346p954q517q482p661o752o358o077n358m615m514m683m225
60860E16910l197k448k091j298K25J489J420K04r22r59KJ046J435J335J453K012
60844E16616K403K007R37k90j366k174k582k687k909l430l787l424k401j289n17
60829D95107j85j52o0N01J479K279K397J913J291R32J043J460J547Q12k80p05
60813E09379l44j95q82j763k042j950k166k638k850k749k686k735k767k879l152
60798D77581l312l183l222l928m991n627n578n206m797m345l915l695l618l369
60784D18795k763j970j421j558k461l571m124l881l088j902m51O52P92M63P98
$$ plain form
60888 674052 668891 664464 660443 656481 652429 648324 644312 640335 635895 630533 624480 618388 612438 606229
60874 606229 599452 592106 584152 575635 567153 559492 552740 546382 540305 534947 530332 525818 521135 516910
60860 516910 513713 511265 509174 507876 508101 509590 511010 511214 510292 509333 509335 510381 511816 513151 514604 516616
60844 516616 519019 521026 521963 521673 520307 518133 515551 512864 509955 506525 502738 499314 496913 495624 495107
60829 495107 494922 494770 494710 495211 496690 498969 501366 503279 504570 505502 506545 508005 509552 510364 510084 509379
60813 509379 509035 508840 507958 506195 504153 502203 500037 497399 494549 491800 489114 486379 483612 480733 477581
60798 477581 474269 471086 467864 463936 458945 453318 447740 442534 437737 433392 429477 425782 422164 418795
60784 418795 416032 414062 412641 411083 408622 405051 400927 397046 393958 392056 391605 392257 393049 393512 394310
60769C94310J710J839Q58M75K025M331N338M987M842N466N915N727N626N993O022
60754D55464N053L645K726K421K192J669Q81R1l56m11n77j448k875m157n022n871
60738D53425o931p752p833p314o742o452o357o162n625m780l936l377l134l078
60724C73952l071k880k229j246n74p09j391j948j977j453n04N39J192J280J128
60709C60109R69N88m3l30J78R95J345J243J266J539J713J708J757J884J960K152
60693C79033K583K817K423J907K218L389M457M773M575M203L647L070K973L479
60679D25547M042M177L985L689L219K515J851J454J202Q85N15J11n24j589k990
60664D48089m346n225n416n165m931m809m412l559k766k594k858k959k693k167
$$ plain form
60769 394310 396020 397859 398717 399192 401217 405548 410886 415873 420715 426181 432096 437823 443449 449442 455464
60754 455464 460517 464162 466888 469309 471501 473170 474051 474142 473786 473375 472798 471350 468475 464318 459296 453425
60738 453425 446494 438742 430909 423595 416853 410401 404044 397882 392257 387477 383541 380164 377030 373952
60724 373952 370881 368001 365772 364526 363952 363243 361852 359904 357927 356474 355970 356509 357701 358981 360109
60709 360109 361078 361666 361623 361293 361471 362466 363811 365054 366320 367859 369572 371280 373037 374921 376881 379033
60693 379033 381616 384433 386856 388763 390981 394370 398827 403600 408175 412378 416025 419095 422068 425547
60679 425547 429589 433766 437751 441440 444659 447174 449025 450479 451681 452566 453081 453192 452668 451079 448089
60664 448089 443743 438518 433102 427937 423006 418197 413785 410226 407460 404866 402008 399049 396356 394189
60650C94189j266O1J223J505J101Q57R48O27n18j823k349j916j151q22j234j939
60634C87493k091j541j281k191l594l915k709j062pN19Q51Q93O39N39P64Q90P98
60617C74995J073J912K462K006J096P10P97O27J45p6kj89o45o36R3P24M28n64
60599C84956j411j724j681j427r84n59m03l18J75J047J657J675J611J952K218
60584C86784J651N95L10J139J840J208k53j037n11N73J247J277J062J181J992
60569C99058L269M279M637M846N525O453O999P188P546Q033Q047P522P100O989
60555D87491O568N425L988K647J081r19k598k921j844k95R29J687K114K309K482
60540E08144L005M156N895P907R840J1553J3161J4712J5915J6361J5921J4646
$$ plain form
60650 394189 392923 392984 394207 395712 396813 397670 398618 399245 398727 396904 394555 392639 391488 390666 389432 387493
60634 387493 385402 383861 382580 380389 376795 372880 370171 369109 369102 369621 370472 371365 372004 372543 373307 374197 374995
60617 374995 376068 377980 380442 382448 383544 384254 385051 385678 385823 385747 385745 385556 384911 384275 384368 385092 385520 384956
60599 384956 383545 381821 380140 378713 377729 377170 376767 376449 376624 377671 379328 381003 382614 384566 386784
60584 386784 388435 389030 389340 390479 392319 393527 393274 392237 391726 392299 393546 394823 395885 397066 399058
60569 399058 402327 406606 411243 416089 421614 428067 435066 442254 449800 457833 465880 473402 480502 487491
60555 487491 494059 499484 503472 506119 507200 506281 503683 500762 498918 498623 499552 501239 503353 505662 508144
60540 508144 511149 515305 521200 529107 538947 550500 563661 578373 594288 610649 626570 641216
60528F41216J2323Q650L960o44m075n990o676o597o206n733n063m043l032k668
60514F15422k949l064k405j347o58m15J9J149K768M137M670M562M795O226Q639
60499F41549J1098J3273J5826J9270K3095K6605K9998L3872L7925M0985M2329
60488I35825M2201M0867L7814L2308K4421J5103N376m330j4062k3807l2985m0444
60476A018287m5026m6410m5409m3324m0956l8244l4893l1064k7420k4507k2360
60465F18674k0629j8927j7033j4997j3136j1719j0573r262p804o808o609o620
60453D74557o004m806l812l401l138k659k331k585l097l122k526j941j895k205
60439D31035k368k254k130k145k086j718j148o45k72N2K28M0m31p73p66o32n91
$$ plain form
60528 641216 653539 662189 666149 665505 661430 655440 648764 642167 635961 630228 625165 621122 618090 615422
60514 615422 612473 609409 607004 605657 604999 604584 604603 605752 608520 612657 617327 621889 626684 632910 641549
60499 641549 652647 665920 681746 701016 724111 750716 780714 814586 852511 893496 935825
60488 935825 978026 1018893 1056707 1089015 1113436 1128539 1133915 1129585 1115523 1091716 1058731 1018287
60476 1018287 973261 926851 881442 838118 797162 758918 724025 692961 665541 641034 618674
60465 618674 598045 579118 562085 547088 533952 522233 511660 502398 494594 487786 481177 474557
60453 474557 468553 463747 459935 456534 453396 450737 448406 445821 442724 439602 437076 435135 433240 431035
60439 431035 428667 426413 424283 422138 420052 418334 417186 416541 416269 416321 416549 416589 416158 415385 414619 413987 413396
60422D13396m79o4M98Q74J061J344J810K223K409K500K620K500J642lj569j895
60406D28867q06M35M73n65j242n76J011K532L475L794L564L091K851K859K624
60391D52387K007J556J573J604J345J351K119L084L411L206L065K865K058R06
60377D82537M00R66K082L102L677L537K682J764J503J755J823J503J100P29L97
60362E09557N17J390K364K607K505L098M268M808M386M093M677N579O182O843
60348E62874Q034R436J0577J1463J1930J1259R124O179L158J14k913n300o640
60335F29295p452q411r437j0114j0367j0103q935o959n214m527m443m103l611
60322E35619l620m004l909l040k001j408j273j267j042l30Q26J997K842L542M450
$$ plain form
60422 413396 412917 412853 413351 414225 415286 416630 418440 420663 423072 425572 428192 430692 432334 432331 430762 428867
60406 428867 428061 428496 428969 428404 427162 426586 427597 430129 433604 437398 440962 444053 446904 449763 452387
60391 452387 454394 455950 457523 459127 460472 461823 463942 467026 470437 473643 476708 479573 481631 482537
60377 482537 482937 483903 485985 489087 492764 496301 498983 500747 502250 504005 505828 507331 508431 509160 509557
60362 509557 510074 511464 513828 516435 518940 522038 526306 531114 535500 539593 544270 549849 556031 562874
60348 562874 570908 580344 590921 602384 614314 625573 634697 640876 644034 644148 641235 635935 629295
60335 629295 621843 613432 603995 593881 583514 573411 564476 557517 552303 547776 543333 539230 535619
60322 535619 531999 527995 524086 521046 519045 517637 516364 515097 514055 513725 514551 516548 519390 522932 527382
60307E27382N583O809Q247R972J1591J2609J3080J3474J3919J3920J2766J0052
60295F59404O023J578k246n098p469r903j2270j3950j4392j3418j1404r314q093
60282E59448p873q060q249q381q086o779m789l497l674m409m342l332k153j180
60268D84644k77L25P5r88k078k526k339j917j549j187n27N13J307R90l77j623
60252D72466j792j135l95K48R01J237Q32o6p95j080r84m39N01J194R61K3p30p93
60234D70154l98P9M78P27Q65J136J624J937J658J004O19Q44J552K466L338L958
60218D92041M344M674M817M407L652L469M254N120N102M545M429M812M990M894
60204E55550N166N813N945N108L947L175K612J742O31k08n49o29p59r72j023p48
$$ plain form
60307 527382 532965 539774 548021 557993 569584 582193 595273 608747 622666 636586 649352 659404
60295 659404 665427 667005 664759 659661 652192 642289 630019 616069 601677 588259 576855 567541 559448
60282 559448 551575 543515 535266 526885 518799 512020 507231 503734 500060 495651 491309 487977 485824 484644
60268 484644 484367 484692 484767 483779 481701 479175 476836 474919 473370 472183 471656 472169 473476 474466 474089 472466
60252 472466 470674 469539 469144 469392 470293 471530 472362 472296 471501 470421 469437 468998 469499 470693 471654 471677 470947 470154
60234 470154 469756 469835 470313 471040 471905 473041 474665 476602 478260 479264 479883 480727 482279 484745 488083 492041
60218 492041 496385 501059 505876 510283 513935 517404 521658 526778 531880 536425 540854 545666 550656 555550
60204 555550 560716 566529 572474 577582 581529 584704 587316 589058 589689 589481 588932 588303 587544 586572 585549 584801
60188E84801m24o04j395k229k587k647k794k854k471j880j645j707j505r96p59
60173E58304r84j102o86p9K25K81L91N38M99K44j45p11j423j903j679p95N2J65
60155E51192m26r73q26j59L46M25N23J052J789K259K373K372K339K129J691J242
60139E67348J130J596K481L179L205K902L176M318N576O121N896N192L991K270
60125F18381N25o73j412k082k578k403j485l03O90J303J420R97K73l79p51p99
60109F10724n68l87p79j796k731k895k418j897j593j346j003m94K54J114J733
60094E95918K042K459L256M162M901N579O209O452O343O539P209P419O398M767
60080F69653L575K709J304p06k600m117n653p286q658r705j0645j1284j1242j0740
$$ plain form
60188 584801 584377 583773 582378 580149 577562 574915 572121 569267 566796 564916 563271 561564 560059 559063 558304
60173 558304 557320 556218 555532 555453 555678 555959 556350 556888 557387 557631 557486 556775 555352 553449 551770 550975 551027 551192
60155 551192 550766 549793 548967 548808 549154 549579 550102 551154 552943 555202 557575 559947 562286 564415 566106 567348
60139 567348 568478 570074 572555 575734 578939 581841 585017 589335 594911 601032 606928 612120 616111 618381
60125 618381 618906 618233 616821 614739 612161 609758 608273 607970 608660 609963 611383 612380 612653 612274 611523 610724
60109 610724 610156 609769 608990 607194 604463 601568 599150 597253 595660 594314 593311 592817 593071 594185 595918
60094 595918 597960 600419 603675 607837 612738 618317 624526 630978 637321 643860 651069 658488 664886 669653
60080 669653 673228 675937 677241 676535 673935 669818 664165 656879 648221 638516 627871 616587 605345 594605
60066E94605j0287r771q711p273o104n334m712m491n038n670n170l546k088j539
60052E14871j389j131r92j022p27o1K88J99O15K059L569L931L185K199J380O08
60036E27582n2l32k81k39n16j314k593l797m222l941l842m368m892m724m189m034
60020D84246m276m242l612k791k375k611l263l793l780l353k981k806k464j671
60006D40228o26L19R83J202P95mn10l19J98M15K85K85P01J268J502J223P38M85
59988D49168N61P28R32J477K428L230L246K484J373J27j163k159k547k565k635
59973D54685k676k309j567p62R1J016J512J054J03k80J99Q95J340J655J862J707
59957D58525J329J231J399J290P85L37N6m36j066j223q67p19j038j162p10k93
$$ plain form
60066 594605 584318 574547 565836 558563 552459 547125 542413 537922 532884 527214 522044 518498 516410 514871
60052 514871 513482 512351 511359 510337 509610 509549 509837 510036 510651 512710 516279 520210 523395 525594 526974 527582
60036 527582 527530 527198 526917 526678 526162 524848 522255 518458 514236 510295 506453 502085 497193 492469 488280 484246
60020 484246 479970 475728 472116 469325 466950 464339 461076 457283 453503 450150 447169 444363 441899 440228
60006 440228 439602 439921 440904 442106 442901 442897 442387 442068 442266 442681 442966 443251 443952 445220 446722 447945 448683 449168
59988 449168 449729 450457 451389 452866 455294 458524 461770 464254 465627 465754 464591 462432 459885 457320 454685
59973 454685 452009 449700 448133 447371 447462 448478 449990 451044 451147 450867 451066 451961 453301 454956 456818 458525
59957 458525 459854 461085 462484 463774 464559 464896 464952 464516 463450 462227 461360 460641 459603 458441 457731 457438
59941D57438n13j109j626k070k465k503k181k004k010j457j01J097J342J246J847
59926D44931K998L699L576L130K848K905L522M797O284P318P714P653P130O031
59912E14536M559L110J851Q76N40J138K323L274L432K833J793O61k17n18j03P98
59896E40886J604J734J239Q38J038J457J493J366J715K450K861K793K738K743
59882E66955K298J529J402K288L303L563L185K533J444m6j124j204q40q49j148
59867E83289j213j135j317j560j325o58j84l21r69j717j995j387j64Q96J536K284
59851E74060L393M327M780N417O816Q424R395R820J0164R998Q387N372K102l41
59837F62114j595j698r57m0M74N81M00m61k454n138p369q399q389p980p816q225
$$ plain form
59941 457438 456925 455816 454190 452120 449655 447152 444971 442967 440957 439500 439399 440496 441838 443084 444931
59926 444931 447929 451628 455204 458334 461182 464087 467609 472406 478690 486008 493722 501375 508505 514536
59912 514536 519095 522205 524056 524932 525472 526610 528933 532207 535639 538472 540265 540926 540709 540191 540088 540886
59896 540886 542490 544224 545463 546301 547339 548796 550289 551655 553370 555820 558681 561474 564212 566955
59882 566955 569253 570782 572184 574472 577775 581338 584523 587056 588500 588454 587330 586126 585286 584437 583289
59867 583289 582076 580941 579624 578064 576739 576081 575897 575576 574607 572890 570895 569508 569344 570240 571776 574060
59851 574060 577453 581780 586560 591977 598793 607217 616612 626432 636596 646594 654981 660353 662455 662114
59837 662114 660519 658821 657864 657824 658298 658879 659279 658818 656364 651226 643857 635458 627069 619089 611273 603048
59821F03048q860q872p847o323n008l905k700j578r38p07n96p48j419k222k405
59806E48920j785q96l16l51j014j833j940j059l8K01r8q4K38K6r54j858j867j094
59788E34198k50N7m14j443k335k491k049j690j753j942j847j372o60K2L39J88
59772E16558o5Q1O79J302J579J519J522K050L183M313M646M130L522L372L444
59757E51835L430L586M185M821M949M708M632M786M822M664M553M490M167L417
59743F13045K373J354P81J013J899K694K726J944O92o58j634j820j458j351j772
59728F19828j983j392n80m86r99j122l73O25Q74n1j607k637k400j485j168j707
59712F03337k001j232j0P85J299K039K673K553J954J700J925K050J842J601J517
$$ plain form
59821 603048 594188 585316 577469 571146 566138 562233 559533 557955 557017 556310 555714 554966 553547 551325 548920
59806 548920 547135 546239 545923 545572 544558 542725 540785 539726 539688 539889 539791 539707 539945 539971 539017 537159 535292 534198
59788 534198 533948 534005 533591 532148 529813 527322 525273 523583 521830 519888 518041 516669 516009 516031 516370 516558
59772 516558 516493 516574 517253 518555 520134 521653 523175 525225 528408 532721 537367 541497 545019 548391 551835
59757 551835 555265 558851 563036 567857 572806 577514 582146 586932 591754 596418 600971 605461 609628 613045
59743 613045 615418 616772 617553 618566 620465 623159 625885 627829 628521 627863 626229 624409 622951 621600 619828
59728 619828 617845 616453 615873 615387 614388 613266 612893 613518 614392 614341 612734 610097 607697 606212 605044 603337
59712 603337 601336 600104 600094 600879 602178 604217 606890 609443 611397 613097 615022 617072 618914 620515 622032
59697F22032J551J747J996J862J183M74J63p6n59q20m57r3m76j143j092l81O8
59680F25979j17o14j413k718m084m782m975n380n918n881n406n432o077o180m933
59665E62069k977j549j243j833k627k758j827m38M78Q11J166J761K255K570K974
59650E58832L354L241K613J871J028j90j450k007j945k204l129l905l831l278
59636E49000k962k883k541j752q29k20k05p24j441k126k857l548l738l276k816
59621E17082k946l189k659j491p05p95j293j648j746j573j189r73j147j167l47
59606D94214R68J675J374P60O43J186K037K563K197J211Q16J626K570K333J385
59591E17558J284K260K996K736K104J639J017Q6n79o73o23o55n15m04j108k664
$$ plain form
59697 622032 623583 625330 627326 629188 630371 630845 631008 630932 630373 629553 629096 629003 628527 627384 626292 625911 625979
59680 625979 625862 625248 623835 621117 617033 612251 607276 601896 595978 590097 584691 579259 573182 567002 562069
59665 562069 559092 557543 556300 554467 551840 549082 547255 546817 547295 548106 549272 551033 553288 555858 558832
59650 558832 562186 565427 568040 569911 570939 570749 569299 567292 565347 563143 560014 556109 552278 549000
59636 549000 546038 543155 540614 538862 538033 537813 537608 536884 535443 533317 530460 526912 523174 519898 517082
59621 517082 514136 510947 508288 506797 506092 505297 504004 502356 500610 499037 497848 496875 495728 494561 494214
59606 494214 495182 496857 498231 498991 499634 500820 502857 505420 507617 508828 509644 511270 513840 516173 517558
59591 517558 518842 521102 524098 526834 528938 530577 531594 531680 531101 530428 529805 529150 528635 528231 527123 524459
59575E24459l906l977l437l339l883m482m544l879k806k073k114k435k306j863
59561D79415j656j411m09R77J500Q94K35K31M69O26J115K009K587K551K569L096
59545D94798L673L979M471N418O323O917P837R663J2166J5018J8257K1411K2997
59532F32928K1572J6895R839K035m324p550p847o772n219l040p27K89l63j293
59518F46423j531j902l266m908n891o732q261r903j0549j0308r936r293p824o032
59504E50087m968m629m219l684l668m064l954l106k380k431k849k839k116r23
59490E04257K87J040J080N87K4j74J93R91J768K165K289K323K013J206O93J440
59474E22182L002L887L677L481L881L895K771J403Q84P24j06j246j359o1J745
$$ plain form
59575 524459 520553 516576 513139 509800 505917 501435 496891 493012 490206 488133 486019 483584 481278 479415
59561 479415 477759 476348 475939 476916 478416 479310 479545 479776 480245 480871 481986 483995 486582 489133 491702 494798
59545 494798 498471 502450 506921 512339 518662 525579 533416 543079 555245 570263 588520 609931 632928
59532 632928 654500 671395 681234 683269 678945 671395 663548 656776 651557 648517 647790 648079 647716 646423
59518 646423 644892 642990 639724 634816 628925 622193 613932 604029 593480 583172 573236 563943 556119 550087
59504 550087 545119 540490 536271 532587 528919 524855 520901 517795 515415 512984 510135 507296 505180 504257
59490 504257 504544 505584 506664 507251 507275 507101 507294 508285 510053 512218 514507 516830 518843 520049 520742 522182
59474 522182 525184 529071 532748 536229 540110 544005 546776 548179 549063 549787 549681 548435 547076 547015 548760
59459E48760L185M080M576M903N364O002O522O874P339P668P051N451M079L724
59445F25578L559K525J001n5q37k246m250n919o810p143o896n849m353l065k044
59430E83196j020k69k54n39j07J295K945M331N670P160Q517R453J0068J0635J1343
59415F52424J2234J3165J3967J4810J6084J7538J7965J6135J1806N597j515q147
59403G82063j2693j4278j3351j0859p257k645K477O993R329P879K243n585j2252
59390G32064j5927j7397j7931j7311j4925j1623r062p750o871n677m088k320p83
59377F00399mQ1L34J258K293K847L219L697L747L089K683L404M573N104N261N899
59361F47884O629O412N531N271N884O457O738P497Q952J0236J0702J0600J0272
$$ plain form
59459 548760 551945 556025 560601 565504 570868 576870 583392 590266 597605 605273 612324 617775 621854 625578
59445 625578 629137 631662 632663 632608 631771 629525 625275 619356 612546 605403 598507 592658 588305 585240 583196
59430 583196 582176 581907 581653 581114 581007 582302 585247 589578 595248 602408 610925 620378 630446 641081 652424
59415 652424 664658 677823 691790 706600 722684 740222 758187 774322 786128 791725 790210 782063
59403 782063 769370 755092 741741 730882 723625 720980 723457 730450 739779 747658 749901 744316 732064
59390 732064 716137 698740 680809 663498 648573 636950 627888 620138 613267 607590 603502 601182 600399
59377 600399 600395 600476 600810 602068 604361 607208 610427 614124 617871 620960 623643 627047 631620 636724 641985 647884
59361 647884 654513 660925 666456 671727 677611 684068 690806 698303 707255 717491 728193 738793 749065
59348G49065R810R560R917J0492J0477R861R311Q856P790N901L756J640o63k978
59334H42795m678n807p149q934j0385j0937j1034j1316j1707j1704j1071r926
59322G28147q569p301o157m890l627l103l636m258l804k548j823k155k746k840
59308F70690k556k260k013j813j634j070L49K409M372N980P562R280J0901J2272
59294G12469J3147J2557R259L184m100j0528j4784j6577j6447j5393j4165j2766
59282F45856j0889q627o337m123k039m42N02J352K703M263N331N922O620P583
59268F47675Q449R017R246Q794P354N317L421J931P55l7n35j395l089n061o441
59253F85401p144p508p361o448n319m708m426l889l275l013k597j212Q30K428
$$ plain form
59348 749065 758875 768435 778352 788844 799321 809182 818493 827349 835139 841040 844796 846436 845773 842795
59334 842795 838117 832310 825161 816227 805842 794905 783871 772555 760848 749144 738073 728147
59322 728147 719578 712277 706120 701230 697603 694500 690864 686606 682802 680254 678431 676276 673530 670690
59308 670690 668134 665874 663861 662048 660414 659344 659693 662102 666474 672454 680016 689296 700197 712469
59294 712469 725616 738173 747432 750616 746516 735988 721204 704627 688180 672787 658622 645856
59282 645856 634967 626340 620003 615880 613841 613399 613901 615253 617956 622219 627550 633472 640092 647675
59268 647675 656124 665141 674387 683181 690535 695852 699273 701204 701959 701922 701387 699992 696903 691842 685401
59253 685401 678257 670749 663388 656940 651621 646913 642487 638598 635323 632310 629713 628501 629331 631759
59239F31759L265L827M247M374M595N198N376M293K783K301K475J608m85k053
59225F73563k131j747j969k466k701k947l381l446k960k721l298m142m459m066
59211F31129l023j448q4j1j289k774l527l552l030k019j126j193j987k365k004
59196F01697j761j981j930j316r14j067r33k0Q81J089J240K116L323M047M195
59181F08666M037L533K843K628L069L411L146K835L043L414L571M067N465P180
59167F60908Q217Q469Q522Q579Q440Q075P548O611N051L114J218m58j886l129
59153G29279m548o408q139q726q106p394p439p908q168q118p816p119o264o013
59139F27113o600p258p224o555n596m420l265k700k773k699j890o64M50J374K032
$$ plain form
59239 631759 635024 638851 643098 647472 652067 657265 662641 666934 669717 672018 674493 676101 675616 673563
59225 673563 671432 669685 667716 665250 662549 659602 656221 652775 649815 647094 643796 639654 635195 631129
59211 631129 628106 626658 626574 626563 625274 622500 618973 615421 612391 610372 609246 608053 606066 603701 601697
59196 601697 599936 597955 596025 594709 593795 592728 591795 591775 592656 593745 594985 597101 600424 604471 608666
59181 608666 612703 616236 619079 621707 624776 628187 631333 634168 637211 640625 644196 648263 653728 660908
59167 660908 669125 677594 686116 694695 703135 711210 718758 725369 730420 733534 734752 734294 732408 729279
59153 729279 724731 718323 710184 701458 693352 685958 678519 670611 662443 654325 646509 639390 633126 627113
59139 627113 620513 613255 606031 599476 593880 589460 586195 583495 580722 578023 576133 575469 575919 577293 579325
59124E79325K109J763J844K852M390N980P647R282J0329J0709J1176J2164J3093
59111F72663J3445J3670J4287J4829J4561J3683J2991J2749J2574J2115J1186
59100H18753R536P065M085J129j366l040l746l810l748l656l350k945k629k081
59086H10197r53R2j09j640l381m566n411o160o663p084p792q408q162p372p246
59071G35342p887p971o848n470m712m277l961m401n699o708o673o315o274n913
59057F52233m733l681l713m167l934l233k867k620j855r90r02j287j017J08J145
59042F18487J389J087Q30R68J463J877J772J419J586K361K974L141L623M969O567
59027F54513P663Q387R120R822J0556J1761J3250J3986J3540J2749J2169J1049
$$ plain form
59124 579325 581434 583197 585041 587893 592283 598263 605910 615192 625521 636230 647406 659570 672663
59111 672663 686108 699778 714065 728894 743455 757138 770129 782878 795452 807567 818753
59100 818753 828289 835354 839439 840568 839202 836162 832416 828606 824858 821202 817852 814907 812278 810197
59086 810197 809244 809336 809227 807587 804206 799640 794229 788069 781406 774322 766530 758122 749960 742588 735342
59071 735342 727455 719484 712636 707166 702454 698177 694216 689815 684116 677408 670735 664420 658146 652233
59057 652233 647500 643819 640106 635939 632005 628772 625905 623285 621430 620440 619538 618251 617234 617342 618487
59042 618487 619876 620963 621793 622761 624224 626101 627873 629292 630878 633239 636213 639354 642977 647946 654513
59027 654513 662176 670563 679683 689505 700061 711822 725072 739058 752598 765347 777516 788565
59015G88565Q758O058L875J937k64k150k999l258l615l565k234M6K266M210O115
59000H03745P480P525O530N503M832M159L262K113N31j421l118m214n233o632
58986H25062p996q850r450r884r368p486n301m075l600k832j493J9J591L202M466
58971G64005N348O593Q429R730R634R009R099R643R762R751J0303J0758R869P815
58957H89748N796M009J732r47l218n195p758j0687j2605j2952j2707j2866j3342
58944H09008j3576j3213j2037j0100q093o715n794m723l553k779k299j635r68
58931G23523r40j476j783j530j178j126j204j134r15p40q70j329j551q08O56J640
58915G09235J492Q77O26Q02J428K926N053O540O786O879P889R223R813R867J0195
$$ plain form
59015 788565 797323 803381 807256 809193 808929 806779 803780 800522 796907 793342 791108 791154 793420 797630 803745
59000 803745 811225 818750 825280 830783 835615 839774 843036 845149 845680 844259 841141 836927 831694 825062
58986 825062 817066 808216 798766 788882 779514 772028 766727 762652 759052 756220 754727 754746 756337 759539 764005
58971 764005 769353 775946 784375 794105 803739 812748 821847 831490 841252 851003 861306 872064 881933 889748
58957 889748 895544 899553 901285 900338 897120 891925 884167 873480 860875 847923 835216 822350 809008
58944 809008 795432 782219 770182 760082 751989 745274 739480 734757 731204 728425 726126 724491 723523
58931 723523 722583 721107 719324 717794 716616 715490 714286 713152 712237 711497 710627 709298 707747 706939 707595 709235
58915 709235 710727 711604 712230 713032 714460 717386 722439 728979 735765 742644 750533 759756 769569 779436 789631
58900G89631J0779J1228J1770J2485J2628J1955J1663J2577J3548J3312J2776
58889I24352J3560J5254J6204J6247J6495J6851J5905J3239R912O719L608O53
58877A068999j885m340p089r553j1093j2305j3874j4889j4061j2021j0514r809
58865I47566q982q216q546r586r811r163r187j0399j1645j2298j2946j3621j3384
58852H09782j2187j1245j1013j0550r419q458q146p905p577p920q998r669r368
58839F87327q958r052q981q137p051o292n487m215k901k058j459p58j95j18l36
58824F21329l57J03R81J804K031J861K196L258L968L603L137L628M232L453J718
58809F56945P49Q69Q83M10K37L91q3j132j455o93j49q26k203l363m019m099l679
$$ plain form
58900 789631 800410 811638 823408 835893 848521 860476 872139 884716 898264 911576 924352
58889 924352 937912 953166 969370 985617 1002112 1018963 1034868 1048107 1058019 1064738 1068346 1068999
58877 1068999 1067114 1062774 1055685 1046132 1035039 1022734 1008860 993971 979910 967889 957375 947566
58865 947566 938584 930368 921822 912236 902425 893262 884075 873676 862031 849733 836787 823166 809782
58852 809782 797595 786350 775337 764787 755368 746910 738764 730859 723282 715362 706364 696695 687327
58839 687327 678369 669317 660336 652199 645148 638856 633369 629154 626253 624195 622736 621978 621783 621665 621329
58824 621329 620972 621075 622056 623860 625891 627752 629948 633206 637174 640777 643914 647542 651774 655227 656945
58809 656945 657694 658563 659446 659856 660093 660484 660401 659269 657814 657121 656972 656146 653943 650580 646561 642462 638783
58792F38783l456m062m823m545l400k550k085j035O84K119L097M326N625O018
58778F34696N786O424Q098R137Q510O985N228K730o65l865o079p748r180r691
58764F50366q913p681o886o448n967n317m257k608j064o36j121j295o93L7N10
58749E98027R36J151Q72Q21J972L707M448M093M060M882N629N824N993O274O313
58734F55002O663Q273J0499J1584J1252J0712J0167Q697O712N877O213N880M396
58721G61927L455L831M141L600L426M376N335N525N819O631O750N476L798K347
58707H26437L01k530m848o262q216j1249j3711j4627j5492j7487j9228j9146j8034
58694F75908j7348j6732j5259j3442j2138j0860q937p039n984n354m672m466m873
$$ plain form
58792 638783 635327 631265 626442 621897 618497 615947 613862 612827 613511 615630 618727 623053 628678 634696
58778 634696 640482 646906 655004 664141 672651 679636 684864 687594 686929 683064 676985 669237 660057 650366
58764 650366 641453 633772 626886 620438 614471 609154 604897 602289 601225 600589 599468 598173 597480 597517 598027
58749 598027 598963 600114 600986 601807 603779 607486 611934 616027 620087 624969 630598 636422 642415 648689 655002
58734 655002 661665 669938 680437 692021 703273 713985 724152 732849 739561 745438 751651 757531 761927
58721 761927 765382 769213 773354 776954 780380 784756 790091 795616 801435 808066 814816 820292 824090 826437
58707 826437 826738 824208 819360 813098 804882 793633 779922 765295 749803 732316 713088 693942 675908
58694 675908 658560 641828 626569 613127 600989 590129 581192 574153 568169 562815 558143 553677 548804
58681E48804m712l356j968j512j155n8R37R47P85J553K951M377O185Q504J0469
58666E72751J1914J4079J7212J9368J9111J7459J5562J2501P403J761k508n626
58654G00987q498j0374j0318r506r656j0324j0000q787p850p132n781m038k738
58641E95985j799r03o81j484k045j213L1J23o11q33n68o66q50k38Q59J478J648
58624E88233J986K344K355K421K831K878K263K160L365M648M630M057M372N204
58610F33747N199M307L341K207M79j158j835k076k746l316k882k009j849k304
58596F29105k660l083l826m026k932j421n66K02J917M141N922P525R423J0662
58582F50383J0184Q812Q092Q129Q222Q528R292R585Q730P826P996Q305P514O659
$$ plain form
58681 548804 544092 540736 538768 537256 536101 536043 536980 537927 538712 540265 543216 547593 553778 562282 572751
58666 572751 584665 598744 615956 635324 654435 671894 687456 699957 707360 709121 706613 700987
58654 700987 692489 682115 671797 662291 652635 642311 632311 623524 615674 608542 602761 598723 595985
58641 595985 594186 593283 592602 591118 589073 587860 587891 588014 587403 586570 586002 585336 584486 584248 585107 586585 588233
58624 588233 590219 592563 594918 597339 600170 603048 605311 607471 610836 615484 620114 624171 628543 633747
58610 633747 638946 643253 646594 648801 649280 648122 646287 644211 641465 638149 635267 633258 631409 629105
58596 629105 626445 623362 619536 615510 612578 611157 610591 610793 612710 616851 622773 630298 639721 650383
58582 650383 660567 669379 677471 685600 693822 702350 711642 721227 729957 737783 745779 754084 761598 768257
58568G68257P689J0460J3319J5788J8517K1339K3521K5235K6828K7342K5779K3058
58556A007132K0696J8357J4697R990N881L067R53r14k685m711o788p826p768q483
58542A041598j1174j4265j5816j6501j8014j9882k0300j9189j7994j7222j6254
58531H54987j4920j3314j1014q177o268n900n400l402j287p71q41L13J954K231
58517G88191J606J798K369J559k94j173q24r36k210l644m482m723m265l447l571
58502G65954m977n818m725l259l361m093l472k027j470j408m42P71P80M23J446
58487G34322L131L724M006N968Q905J0465J0837J2219J4676J6163J6257J6309
58475H56982J6187J4339J0925P587M457O18k893m077l693m456o662p937p309o115
$$ plain form
58568 768257 775946 786406 799725 815513 834030 855369 878890 904125 930953 958295 984074 1007132
58556 1007132 1027828 1046185 1060882 1070872 1076753 1079820 1080773 1079859 1077174 1072463 1065675 1057849 1050081 1041598
58542 1041598 1030424 1016159 1000343 983842 965828 945946 925646 906457 888463 871241 854987
58531 854987 840067 826753 815739 807562 801294 795394 789994 786592 785305 784534 783693 784006 785960 788191
58517 788191 789797 791595 793964 795523 795229 794056 793232 792296 790086 786442 781960 777237 772972 769525 765954
58502 765954 760977 755159 750434 747175 743814 739721 736249 734222 732752 731344 730902 731673 732453 732876 734322
58487 734322 737453 741177 745183 751151 760056 770521 781358 793577 808253 824416 840673 856982
58475 856982 873169 887508 898433 906020 910477 911095 908202 904125 900432 895976 889314 881377 874068 867953
58461H67953m908k813j31J577K252L253M646N290N373N920O171M495J495q23k434
58446H97316m674o949p452o588o200o020m460k346j941k786k401p23J76M12K040
58431H47404M649N619M918N304P419Q902Q929R406J0941J1638J0691R456Q245
58418I53521N716K034q63k650m714o762p029o128o556q154q094n959m580n214
58404H94568n870n246m378l655j985K75J282J221K162M074M691L696L061L068
58390H96964K015P9p29o19j613l080k244O53K574L262N468R157J0976J0238J0062
58375I43163J1497J1964J0818J0910J3058J4223J3013J1927J2351J2348J1139
58364A076411J0829J1880J1837J0251R874J1237J1266R088P868Q896R140P031
$$ plain form
58461 867953 863045 860232 860101 861678 863930 867183 871829 877119 882492 888412 894583 899078 900573 899750 897316
58446 897316 892642 885693 878241 871653 865453 859433 854973 852627 850686 847900 845499 844776 844952 845364 847404
58431 847404 852053 857672 862590 867894 875313 884215 893144 902550 913491 925129 935820 945276 953521
58418 953521 959237 961271 960408 957758 953044 946282 939253 933125 926569 918415 910321 904362 899782 894568
58404 894568 888698 883452 879074 875419 873434 873709 874991 876212 878374 882448 887139 890835 893896 896964
58390 896964 898979 899058 898329 897710 896097 893017 890773 891426 894000 897262 902730 911887 922863 933101 943163
58375 943163 954660 966624 977442 988352 1001410 1015633 1028646 1040573 1052924 1065272 1076411
58364 1076411 1087240 1099120 1110957 1121208 1131082 1142319 1153585 1162673 1170541 1179437 1188577 1195608
58352A195608N343N917O578N803N461O439O528N110N103P772J0361J1216J2340
58339A289579J4673J5881J5233J5514J7704J8887J7831J7282J8378J8261J5875
58328A475098J4482J5514J5609J2810J0162R923R741P902O960Q663J0455J0417
58316A607736J0598J2337J3464J3205J4416J7870J9897J8834J8175K0126K1845
58305A788503K1385K1368K3308K4281K2830K2167K3876K4591K2576K1354K3016
58294B039255K4344K3409K3492K6421K8674K8212K8490L1420L3321L2184L1928
58283B351150L4816L6924L5914L5892L9467M2491M2029M2057M5645M8986M8914
58272B804285M9004N2341N5673N6515N8448O3557O7431O7671O9135P4666P9073
$$ plain form
58352 1195608 1200951 1206868 1213446 1219249 1224710 1231149 1237677 1242787 1247890 1255662 1266023 1277239 1289579
58339 1289579 1304252 1320133 1335366 1350880 1368584 1387471 1405302 1422584 1440962 1459223 1475098
58328 1475098 1489580 1505094 1520703 1533513 1543675 1553598 1563339 1571241 1578201 1586864 1597319 1607736
58316 1607736 1618334 1630671 1644135 1657340 1671756 1689626 1709523 1728357 1746532 1766658 1788503
58305 1788503 1809888 1831256 1854564 1878845 1901675 1923842 1947718 1972309 1994885 2016239 2039255
58294 2039255 2063599 2087008 2110500 2136921 2165595 2193807 2222297 2253717 2287038 2319222 2351150
58283 2351150 2385966 2422890 2458804 2494696 2534163 2576654 2618683 2660740 2706385 2755371 2804285
58272 2804285 2853289 2905630 2961303 3017818 3076266 3139823 3207254 3274925 3344060 3418726 3497799
58261C497799P8793P8740Q2672Q5789Q4250Q2987Q6315Q9812Q9459Q9745R4533
58250D440894R9114R9794J01927J09725J17699J21183J25438J35040J44423J48790
58240E644027J53946J65139J76646J83050J90020K03081K16709K25817K36574
58231G395009K54222K72111K84849K99769L22859L46577L64956L86768M19457
58222A0346577M54678M84959N19383N66507O17814O65502P19958P90983Q69395
58213A6035756R47237J037672J153282J284507J423090J586145J791760K033490
58205B7292939K307476K640948L062747L570816M162482M868475N718752O706273
58197F0330908P828990R134529J0677511J2481347J4613286J7259216K0649724
$$ plain form
58261 3497799 3576592 3655332 3738004 3823793 3908043 3991030 4077345 4167157 4256616 4346361 4440894
58250 4440894 4540008 4639802 4741729 4851454 4969153 5090336 5215774 5350814 5495237 5644027
58240 5644027 5797973 5963112 6139758 6322808 6512828 6715909 6932618 7158435 7395009
58231 7395009 7649231 7921342 8206191 8505960 8828819 9175396 9540352 9927120 10346577
58222 10346577 10801255 11286214 11805597 12372104 12989918 13655420 14375378 15166361 16035756
58213 16035756 16982993 18020665 19173947 20458454 21881544 23467689 25259449 27292939
58205 27292939 29600415 32241363 35304110 38874926 43037408 47905883 53624635 60330908
58197 60330908 68159898 77294427 87971938 100453285 115066571 132325787 152975511
58190A52975511K4941376L0178326L6121009M1753750M4966154M3223042L5124591
58183D09283759K1571587N441248r882901k1887812k9490304l2936855l3370623
58176C08728099l2186843l0403596k8430653k6304949k4016460k1610637j9150011
58169A26624950j6717816j4432621j2388795j0599556r035693p687930o554324
58162D9208215n602417m789969m102582l536128l063647k653111k299551k009287
58154B1151523j769061j558585j377582j233367j115274j006268r07349q27197
58146A1356840p59209o90759o24474n69626n22296m73394m26717l90440l59719
58137F540206l25541k92420k70107k55655k40001k24687k16121k10463j99625
$$ plain form
58190 152975511 177916887 208095213 244216222 285969972 330936126 374159168 409283759
58183 409283759 430855346 436296594 426413693 404525881 375035577 342098722 308728099
58176 308728099 276541256 246137660 217707007 191402058 167385598 145774961 126624950
58169 126624950 109907134 95474513 83085718 72486162 63450469 55762539 49208215
58162 49208215 43605798 38815829 34713247 31177119 28113472 25460361 23160810 21151523
58154 21151523 19382462 17823877 16446295 15212928 14097654 13091386 12184037 11356840
58146 11356840 10597631 9906872 9282398 8712772 8190476 7717082 7290365 6899925 6540206
58137 6540206 6214665 5922245 5652138 5396483 5156482 4931795 4715674 4505211 4305586
58128D305586j85913j76244j68197j55666j42073j34194j28945j19486j08642
58119B986226j03169j00398r3409q4302p9700p7954p3066o6719o4361o3755n9103
58108B120290n2633n0558n1292m8865m4431m3462m4675m2546l8010l6344l7065
58097A630409l5692l3025l3088l4420l2592k8993k8198k9037k7019k3155k1801
58086A303389k2205k0585j8127j8624k0564j9885j8152j9701k3013k3234k1119
58075A078180k1232k3172k2775k0331j9603k0231j8830j6202j5838j6683j4885
58064H68398j1297r902j0181q404n203m449n831n780m725o179r466j0493r095
58051G67393q734r599q720o385n751o615o067m657n412p421p019m890n185p887
$$ plain form
58128 4305586 4119673 3943429 3775232 3619566 3477493 3343299 3214354 3094868 2986226
58119 2986226 2883057 2782659 2689250 2604948 2525248 2447294 2374228 2307509 2243148 2179393 2120290
58108 2120290 2067657 2017099 1965807 1916942 1872511 1829049 1784374 1741828 1703818 1667474 1630409
58097 1630409 1594717 1561692 1528604 1494184 1461592 1432599 1404401 1375364 1348345 1325190 1303389
58086 1303389 1281184 1260599 1242472 1223848 1203284 1183399 1165247 1145546 1122533 1099299 1078180
58075 1078180 1056948 1033776 1011001 990670 971067 950836 932006 915804 899966 883283 868398
58064 868398 857101 847199 837018 828614 823411 818962 813131 807351 802626 796447 786981 776488 767393
58051 767393 758659 749060 740340 733955 728204 721589 715522 710865 705453 698032 691013 686123 680938 673051
58037F73051q718o739n447o092o142m955m899o181o276n153n634p930r022p997
58023E81866p080o970o089m673m737n762n137l019k052k388j800n21r49k552k220
58008E25917J76J562J187J392K625K698J518J634L462M564M251M425N418N497
57994E66326M909N952Q501R827R249Q568P664M362r23n042p247r885j3292j4696
57980E74273j3255j1644j1453j1182r955r139r073q022n646l912l520k896j568
57967D73008j052j585j504n65l74r61m96R66J187j90r23j99K62k41m34k47j194
57950D65458k856k782p01P84N28J84N53L53m52L9J984L154K977L581N754P536
57934D86094P991Q662J0029J0186Q523P168P314P328N979M297K881N80k758n338
$$ plain form
58037 673051 664333 657594 652147 646055 639913 634958 630059 623878 617602 612449 606815 598885 589863 581866
58023 581866 574786 567816 561727 557054 552317 546555 541418 538399 536347 533959 532159 531638 530689 528137 525917
58008 525917 526093 527655 528842 530234 532859 535557 537075 538709 542171 546735 550986 555411 560829 566326
57994 566326 571235 577187 585688 595515 604764 613332 620996 625358 624435 619393 612146 602261 588969 574273
57980 574273 561018 549374 537921 526739 516784 507645 498572 490550 484904 480992 477472 474576 473008
57967 473008 471956 470371 468867 468302 467928 466967 466471 467437 468624 468434 467511 467312 467574 467333 466899 466652 465458
57950 465458 462602 459820 459119 459903 460431 460615 461168 461521 461069 461108 463092 466246 469223 472804 478558 486094
57934 486094 494085 502747 512776 522962 531485 538653 545967 553295 559274 563571 566452 567032 564274 558936
57920E58936o512p719r291r584q420p952q777q625o425m257l640l190j709l89
57906D72446r8N15K273L655L606L440M172M581L665K500K023J417K46l02K09L68
57890E04716m15p55j00Lj108j735q47R5j06n18m61j014k527l344k711k280l077
57873D83816l649k983k525l366m083l357k229j807j163N13K083K697L491N212
57859D72650O453O225N925O792P799P951Q164Q946Q755O860N282N561N976M487
57845E67826K110P46j05j785l576m199m498n916p713q289p897p656p252n981m726
57830E01089m486m234k584m08N06L03L66P93P13K04q0k73o33n53J73M03l90p22
57812D90187N98K225K275J033k60j801m172o316o851o327o115o057n287m130l296
$$ plain form
57920 558936 552424 544705 535414 525830 517410 509458 500681 492056 485631 481374 477734 474544 472835 472446
57906 472446 472348 472863 475136 478791 482397 485837 490009 494590 498255 500755 502778 504195 504441 504139 504348 504716
57890 504716 504301 503546 503446 503449 502341 500606 499759 499854 499748 499230 498769 497755 495228 491884 489173 486893 483816
57873 483816 480167 477184 474659 471293 467210 463853 461624 459817 458654 459167 461250 463947 467438 472650
57859 472650 479103 485328 491253 498045 505844 513795 521959 530905 539660 546520 551802 557363 563339 567826
57845 567826 569936 570682 570577 568792 565216 561017 556519 550603 542890 534601 526704 519048 511796 505815 501089
57830 501089 496603 492369 489785 489377 489883 490186 490552 491345 492058 492262 492182 491909 491276 490723 490896 491299 490909 490187
57812 490187 490785 493010 495285 496318 496058 494257 490085 483769 476918 470591 464476 458419 453132 449002 445706
57797D45706k283o15O38N85M56J661L293L843L997N173O460N934M154L494M495
57782D86991N547N920O473P478Q147Q367Q768R035Q185O527N440N151M514L028
57768E79571J345k47k166m247n585n844n569n272n259o032p615q812q375o631
57754E09262m898l748k963k538k482k217j390p10p82q44K3J226J611J413J692
57739D92655K517L182L618M146M354L759K976K863L114L085L253M236N094M404
57725E43256K530J065N32K65J27N70J201J082L62J7P8m55j934l621m827n334m904
57708E30010l597k307j959k358k753k987l158k910k170j791k227k409j331J78
57694D98231P59P23J206J975J929J186P41N79k8o61j43J359K457K600K500K713
$$ plain form
57797 445706 443423 442808 443446 444031 444487 446148 449441 453284 457281 462454 468914 474848 479002 482496 486991
57782 486991 492538 498458 504931 512409 520556 528923 537691 546726 554911 561438 566878 572029 576543 579571
57768 579571 580916 580669 578503 574256 568671 562827 557258 551986 546727 540695 533080 524268 515893 509262
57754 509262 504364 500616 497653 495115 492633 490416 489026 488316 487534 486690 486713 487939 489550 490963 492655
57739 492655 495172 498354 501972 506118 510472 514231 517207 520070 523184 526269 529522 533758 538852 543256
57725 543256 545786 546851 547383 547648 547775 548345 549546 550628 550990 551007 551085 550630 548696 545075 540248 534914 530010
57708 530010 526413 524106 522147 519789 517036 514049 510891 507981 505811 504020 501793 499384 498053 498231
57694 498231 498990 499713 500919 502894 504823 506009 506750 507329 507301 506640 506497 507856 510313 512913 515413 518126
57678E18126L296M612O934R443J1144J2418J4302J6760J9260K2408K7274L3599
57666F99576M0471M8095N6498O2896O2671N3369L6163J3945r709l0183m3496m9313
57654I40983n0392m8752m4371l7858l1643k7359k4080k0331j6276j2765r834p280
57642F10042n530m852m591l998l036j920p24K08M69N04J181K323K820K464K251
57627E97611K549K494J710J189J696K542K783K539K330K043J424Q30P60J167J728
57612F25395K281K649K620K284J859J198J70n76j70J158K269K639K750K959L145
57597F52630L402L944M247L542K298J856K383K549J668P58R12J836K648L113L364
57582F91150L287K844K324J831J262R95J708L166M134L907L137K744K792K883
$$ plain form
57678 518126 521422 526034 532968 542411 553555 565973 580275 597035 616295 638703 665977 699576
57666 699576 740047 788142 844640 907536 970207 1023576 1059739 1073684 1063975 1033792 990296 940983
57654 940983 890591 841839 797468 759610 727967 700608 676528 656197 639921 627156 617322 610042
57642 610042 604512 599660 595069 591071 588035 586115 585391 585599 586068 586572 587753 590076 592896 595360 597611
57627 597611 600160 602654 604364 605553 607249 609791 612574 615113 617443 619486 620910 621740 622500 623667 625395
57612 625395 627676 630325 632945 635229 637088 638286 638456 637880 637710 638868 641137 643776 646526 649485 652630
57597 652630 656032 659976 664223 667765 670063 671919 674302 676851 678519 679277 680189 682025 684673 687786 691150
57582 691150 694437 697281 699605 701436 702698 703693 705401 708567 712701 716608 719745 722489 725281 728164
57568G28164K866K731K455K309K717L588M384M894N258N262M484L239K526K798
57554G77675L589M349M884M998M577M113M269M949N578O098O732P048O523N794
57540H51176O010O989P464P192P223P953Q464Q144P460O762N834N039N301O366
57526I47377O685N763N088N811P025P392P163P335P886Q161Q139Q157Q043P627
57512A047652P473Q064Q773Q647P829P289P431P781P907P933Q185Q727R272R402
57498A162365R014Q514Q240P930P231O542O555P118P477P520P771Q177Q083P551
57484A270088P497Q224Q904Q965Q852R006R094Q781Q369Q254Q447Q938R645R997
57470A393061R526Q943R477J1017J2275J2820J3440J4235J4095J2726J1556J1714
$$ plain form
57568 728164 731030 733761 736216 738525 741242 744830 749214 754108 759366 764628 769112 772351 774877 777675
57554 777675 781264 785613 790497 795495 800072 804185 808454 813403 818981 825079 831811 838859 845382 851176
57540 851176 857186 864175 871639 878831 886054 894007 902471 910615 918075 924837 930671 935710 941011 947377
57526 947377 954062 959825 964913 970724 977749 985141 992304 999639 1007525 1015686 1023825 1031982 1040025 1047652
57512 1047652 1055125 1063189 1071962 1080609 1088438 1095727 1103158 1110939 1118846 1126779 1134964 1143691 1152963 1162365
57498 1162365 1171379 1179893 1188133 1196063 1203294 1209836 1216391 1223509 1230986 1238506 1246277 1254454 1262537 1270088
57484 1270088 1277585 1285809 1294713 1303678 1312530 1321536 1330630 1339411 1347780 1356034 1364481 1373419 1383064 1393061
57470 1393061 1402587 1411530 1421007 1432024 1444299 1457119 1470559 1484794 1498889 1511615 1523171 1534885
57458A534885J2540J3027J3329J3889J4334J4300J4278J4558J4467J3618J2872
57447A686097J3044J3684J4109J4615J5587J6430J6480J6132J5974J5768J5322
57436A853242J5353J6296J7170J6890J5919J5386J5344J5203J5181J5907J7084
57425B028975J7858J8124J8336J8404J7992J7494J7594J8080J8122J7517J6789
57414B225285J6359J6431J7332J9082K0912K1939K2062K1639K0862K0044J9864
57403B441811K0488K1093K1051K0948K1584K2709K3630K4298K4876K4971K4450
57392B691909K4171K4787K5473K5201K4526K4714K5661K6268K6467K7171K8368
57381B974716K8909K8423K7963K8411K9396L0131L0377L0201K9690K9157K9041
$$ plain form
57458 1534885 1547425 1560452 1573781 1587670 1602004 1616304 1630582 1645140 1659607 1673225 1686097
57447 1686097 1699141 1712825 1726934 1741549 1757136 1773566 1790046 1806178 1822152 1837920 1853242
57436 1853242 1868595 1884891 1902061 1918951 1934870 1950256 1965600 1980803 1995984 2011891 2028975
57425 2028975 2046833 2064957 2083293 2101697 2119689 2137183 2154777 2172857 2190979 2208496 2225285
57414 2225285 2241644 2258075 2275407 2294489 2315401 2337340 2359402 2381041 2401903 2421947 2441811
57403 2441811 2462299 2483392 2504443 2525391 2546975 2569684 2593314 2617612 2642488 2667459 2691909
57392 2691909 2716080 2740867 2766340 2791541 2816067 2840781 2866442 2892710 2919177 2946348 2974716
57381 2974716 3003625 3032048 3060011 3088422 3117818 3147949 3178326 3208527 3238217 3267374 3296415
57370C296415K9354K9807L0396L1248L1972L1981L1425L1088L1384L2046L2750
57359C639866L3335L3544L3316L3321L4442L6599L8635L9549L9423L9155L9543
57348D040728M0646M1767M2218M2153M2304M2855M3263M3281M3274M3227M2562
57337D508278M1433M1048M1856M2599M2192M1436M1549M2123M2042M1642M2146
57326D968344M3547M4695M5260M5918M6702M6838M6316M6179M6992M8221M9222
57315E478234M9803M9849M9454M9315M9895N0395M9809M8719M8551M9300M9554
57304F022878M8906M8584M9363N0463N1018N1197N1300N1183N1147N2072N3914
57293F582025N5320N5482N5218N5521N6098N6304N6400N6940N7625N7802N7426
$$ plain form
57370 3296415 3325769 3355576 3385972 3417220 3449192 3481173 3512598 3543686 3575070 3607116 3639866
57359 3639866 3673201 3706745 3740061 3773382 3807824 3844423 3883058 3922607 3962030 4001185 4040728
57348 4040728 4081374 4123141 4165359 4207512 4249816 4292671 4335934 4379215 4422489 4465716 4508278
57337 4508278 4549711 4590759 4632615 4675214 4717406 4758842 4800391 4842514 4884556 4926198 4968344
57326 4968344 5011891 5056586 5101846 5147764 5194466 5241304 5287620 5333799 5380791 5429012 5478234
57315 5478234 5528037 5577886 5627340 5676655 5726550 5776945 5826754 5875473 5924024 5973324 6022878
57304 6022878 6071784 6120368 6169731 6220194 6271212 6322409 6373709 6424892 6476039 6528111 6582025
57293 6582025 6637345 6692827 6748045 6803566 6859664 6915968 6972368 7029308 7086933 7144735 7202161
57282G202161N6755N5729N4465N3780N4287N5330N5678N5065N4337N4207N4578
57271G806372N4937N5015N4953N5083N5510N5892N5810N5412N5323N5850N6573
57260H416730N6813N6196N4815N3241N2215N1867N1317M9716M7571M6235M6049
57249H982765M5768M4164M1457L8937L7715L8055L9341M0446M0646M0436M0903
57238I430633M2298M3821M4862M5635M6445M7098M7378M7368M7026M6053M4601
57227I933218M3377M2711M2006M0467L7859L4396L0464K6695K3573K0803J7654
57216A0293223J4175J1218R023O673L448j34l185n607p725r508j0852j2135j3626
57203A0274988j4819j5109j4851j4999j5873j6927j7659j8164j8737j9364j9790
$$ plain form
57282 7202161 7258916 7314645 7369110 7422890 7477177 7532507 7588185 7643250 7697587 7751794 7806372
57271 7806372 7861309 7916324 7971277 8026360 8081870 8137762 8193572 8248984 8304307 8360157 8416730
57260 8416730 8473543 8529739 8584554 8637795 8690010 8741877 8793194 8842910 8890481 8936716 8982765
57249 8982765 9028533 9072697 9114154 9153091 9190806 9228861 9268202 9308648 9349294 9389730 9430633
57238 9430633 9472931 9516752 9561614 9607249 9653694 9700792 9748170 9795538 9842564 9888617 9933218
57227 9933218 9976595 10019306 10061312 10101779 10139638 10174034 10204498 10231193 10254766 10275569 10293223
57216 10293223 10307398 10318616 10327639 10334312 10337760 10337626 10334441 10328834 10321109 10311601 10300749 10288614 10274988
57203 10274988 10260169 10245060 10230209 10215210 10199337 10182410 10164751 10146587 10127850 10108486 10088696
57192A0088696j9939k0241k1347k3303k5189k6019k5878k5571k5276k4320k2427
57181I829186k0369j9049j8590j8662j8990j9203j8861j8009j7046j5870j3979
57170I630558j1794j0838j1935j4149j6263j8380k1094k3954k6082k7790l0271
57159I418008l3956l8263m2911m8258n4379o0869o7692p5208q3032q9763r4274
57148H729403r6640r7466r6872r4588r0584q5239p9059p2513o5906n9441n3557
57137G837538m9131m6996m7250m9440n3354n9199o6923p5829q4845r2763r8265
57126G113543j00325r8891r4843q9145q2464p5572o9577o5488o3951o5471p0087
57115F237729p6310q0866q0180p2445n8438m0891k3133p507N727J8035L1262M7112
$$ plain form
57192 10088696 10068757 10048516 10027169 10003866 9978677 9952658 9926780 9901209 9875933 9851613 9829186
57181 9829186 9808817 9789768 9771178 9752516 9733526 9714323 9695462 9677453 9660407 9644537 9630558
57170 9630558 9618764 9607926 9595991 9581842 9565579 9547199 9526105 9502151 9476069 9448279 9418008
57159 9418008 9384052 9345789 9302878 9254620 9200241 9139372 9071680 8996472 8913440 8823677 8729403
57148 8729403 8632763 8535297 8438425 8343837 8253253 8168014 8088955 8016442 7950536 7891095 7837538
57137 7837538 7788407 7741411 7694161 7644721 7591367 7532168 7465245 7389416 7304571 7211808 7113543
57126 7113543 7013218 6914327 6819484 6730339 6647875 6572303 6502726 6437238 6373287 6307816 6237729
57115 6237729 6161419 6080553 6000373 5927928 5869490 5828599 5805466 5797959 5803686 5821721 5852983 5900095
57103E900095O7852R6297J34296J81874K38681L05660L84527M76429N81931P01374
57093I069016Q33753R75878J123937J274767J423734J562244J678616J758190
57085A9700135J778801J712812J549287J321519J100735R44642Q47479P47437
57077B9702847N84834L48069O6298k26334n09069p68411r92635j177463j328746
57068B5699390j453613j551795j618045j649620j648391j617837j561277j482450
57060A3116362j385693j275505j156521j032956r06797p77503o45752n18923m12375
57051E004337l42935l17570l26242l46701l58577l54147l36747l11871k82382
57042B027165k50366k18839j89863j63238j38445j16287r7600q1871o8120n6008
$$ plain form
57103 5900095 5967947 6064244 6198540 6380414 6619095 6924755 7309282 7785711 8367642 9069016
57093 9069016 9902769 10878647 12002584 13277351 14701085 16263329 17941945 19700135
57085 19700135 21478936 23191748 24741035 26062554 27163289 28107931 28955410 29702847
57077 29702847 30287681 30635750 30702048 30475714 29966645 29198234 28205599 27028136 25699390
57068 25699390 24245777 22693982 21075937 19426317 17777926 16160089 14598812 13116362
57060 13116362 11730669 10455164 9298643 8265687 7358890 6581387 5935635 5416712 5004337
57051 5004337 4661402 4343832 4017590 3670889 3312312 2958165 2621418 2309547 2027165
57042 2027165 1776799 1557960 1368097 1204859 1066414 950127 852527 770656 702536 646528
57032F46528m5274l5330k6135j8219j1170l357O188J7136K9681M4926O1656P4058
57020G40688P4810O0591L4083J733k9230n2940o6666p1422p0229o5678n9276n2226
57008D44238m5594l9824l4761l0197k6052k2271j8877j5895j3108j0440q495p940
56996A70784q246q030o853n593m756l730k154o85M15K144N224Q840J1846J4058
56982A73264J5274J4213R943L550k874q273j2551j5321j6152j5541j4347j2670
56970A18515j0364q042o399n007k985l82K259N139Q728J2507J5606J8379K1851
56957A69805K5714K8034K6927K1687J2721J721q426j5341j8920k0532k0814j9489
56945A83087j6937j4309j1945r153n778k659j82K304N241Q229J1161J4929K0234
$$ plain form
57032 646528 601254 565924 539789 521570 510400 507043 513231 530367 560048 604974 666630 740688
57020 740688 815498 876089 910172 911905 882675 829735 763069 691647 621418 555740 496464 444238
57008 444238 398644 358820 324059 293862 267810 245539 226662 210767 197659 187219 178724 170784
56996 170784 162538 154508 147655 142062 137306 133576 131422 130737 131152 133296 138520 147360 159206 173264
56982 173264 188538 202751 212694 216244 213370 205097 192546 177225 161073 145532 131185 118515
56970 118515 108151 100109 93710 88703 85718 85336 87595 92734 101462 113969 129575 147954 169805
56957 169805 195519 223553 250480 272167 284888 286609 278183 262842 243922 223390 202576 183087
56945 183087 166150 151841 139896 130743 124965 122306 122124 124428 129669 137898 149059 163988 184222
56932A84222K6396L1813L4914L4297K8859J8679N648p284j7645k4393k7928k9331
56920B58247k9361k8126k5688k2610j9555j6738j4172j2063j0462q973p407o207
56908E6885n653n180m250l292k874k572j639l76L85P34J376K214K548K557L190
56893D4053M622O000O865P652Q715J0010J1833J4559J7367J8336J6277J1696N882
56880A83867j8m918p989r342r744r519q439o666m725k547L24L505N868P132Q290
56865A45079J0264J3167J7007K1917K7378L2253L5740L7192L5048K7673J5840
56854D18558K999p671j5352k0422k2876k2867k1378j9131j5792j1237o623l051
56842B55157oL808Q758J4447K0832K8074L5774M3365N0657N6875N9560N5702M4135
$$ plain form
56932 184222 210618 242431 277345 311642 340501 359180 364828 357544 339899 315506 287578 258247
56920 258247 228886 200760 175072 152462 132907 116169 101997 89934 79472 70499 63092 56885
56908 56885 51232 46052 41802 38510 35636 33064 31425 31049 31434 32168 33544 35758 38306 40863 44053
56893 44053 48675 54675 61540 69192 77907 87917 99750 114309 131676 150012 166289 177985 183867
56880 183867 183849 178931 170942 161600 151856 142337 133898 127232 122507 119960 120284 123789 129657 136789 145079
56865 145079 155343 168510 185517 207434 234812 267065 302805 339997 375045 402718 418558
56854 418558 421557 413886 398534 378112 355236 332369 310991 291860 276068 264831 258208 255157
56842 255157 255151 258959 267717 282164 302996 331070 366844 410209 460866 517741 577301 633003 677138
56829F77138K6405N669j4473l0707m1059m5673m6199m4238m0668l5974l0607k4957
56817C54657j9439j4386r600m323J882Q535J4916K1068K7577L4448M0505M3648
56805D99488M1621L3111J8814J413j5770l0141m0168m5224m5759m3237l9294l4856
56793B99998l0108k4978j9507j4055r234n313j722K350O817J0823J4064J7180
56781B46315K0513K3160K3559K0570J3888M284o142j4843k0534k3710k5267k5398
56769B36395k4141k2011j9464j6479j3247j0558q877p759o742o061n762n012l288
56756H6994j526j001j568k054k063k233k882l488l588l337k988k510j919j452
56742E4385j275j298j327j137n15M12J068R64L22j36N1P23J301J245N15k78m27
$$ plain form
56829 677138 703543 709212 694739 664032 622973 577300 531101 486863 446195 410221 379614 354657
56817 354657 335218 320832 311232 306909 308791 317326 332242 353310 380887 415335 455840 499488
56805 499488 541109 574220 593034 594447 578677 548536 508368 463144 417385 374148 334854 299998
56793 299998 269890 244912 225405 211350 202116 196803 195081 197431 204248 215071 229135 246315
56781 246315 266828 289988 313547 334117 348005 352289 346147 331304 310770 287060 261793 236395
56769 236395 212254 190243 170779 154300 141053 130495 121618 113859 107117 101056 95294 90282 86994
56756 86994 85468 84467 82899 80845 78782 76549 73667 70179 66591 63254 60266 57756 55837 54385
56742 54385 53110 51812 50485 49348 48833 49245 50313 51277 51599 51463 51514 52237 53538 54783 55298 55020 54593
56725E4593J30Q44J249J204O37l40j090r71k43L20P13J550K560K505J085l00l68
56708F4078M81J233J742K259K485K201K027K411K573J606P0p62p69q48j247j332
56692G8208q88m96m92o01o46p61q08m09L03O53K92l86p80n45L10J404K098K029
56674G8485J436P38J40j52J71R69J550J535J334J348J331J119J195J848K457K399
56658I7903J992J751J453Q47M88P84R97M24j11O32K226L148L080K988L131K653
56642A24386J439P23J323K501L129L001K449J617N97l97j379k493l395l455k802
56627A27244k353k563k848k550j805j144q71j092j738k335k283j632j049q84p96
56612A01301n13l29n35q36o97o0N96P13J60o35j053q57l00L70J102J680J676J110
$$ plain form
56725 54593 54723 55567 56816 58020 58657 58317 57227 56256 56013 56333 57046 58596 61156 63661 64746 64446 64078
56708 64078 64559 65792 67534 69793 72278 74479 76506 78917 81490 83096 83166 82404 81635 80787 79540 78208
56692 78208 77320 76824 76332 75731 75085 74324 73516 73107 73410 74063 74355 73969 73189 72644 72954 74358 76456 78485
56674 78485 79921 80659 80799 80647 80818 81787 83337 84872 86206 87554 88885 90004 91199 93047 95504 97903
56658 97903 99895 101646 103099 103946 104434 105218 106215 106639 106528 107160 109386 112534 115614 118602 121733 124386
56642 124386 125825 126548 127871 130372 133501 136502 138951 140568 141165 140768 139389 136896 133501 130046 127244
56627 127244 124891 122328 119480 116930 115125 113981 113110 112018 110280 107945 105662 104030 102981 102097 101301
56612 101301 100788 100459 99924 99088 98391 98331 98927 99640 99800 99165 98112 97255 96955 97325 98427 100107 101783 102893
56594A02893N43K59k3k24L65J805K874K598J581Q72L88l11o03K55J386J267J49
56577A16074k60N76J456J645J812K371K602K091J688K105K796L034L174L954N265
56562A50383O394P023P412Q025R265J1147J2910J3539J2913J1917J1295J0988
56550B73211J0745J0584J0387R727Q466P054N934N097M354L626K856J990J016
56537C55047k73k259m756o701p292p064p091p516p816q065q775r747j0268j0316
56523B57108j0421j0437r719q408p330o595n605m469m066m520m930m796m453l981
56509A67378k994j759j166j260j138n86m84j170j859k093k354k782k643j709q30
56494A42551n40l54j3q0o09n99L87J348J392J011R51R89P46O05Q46R01L51k17
$$ plain form
56594 102893 103436 103695 103672 103448 103813 105618 108492 111090 112671 113543 113931 113620 113017 113272 114658 115925 116074
56577 116074 115814 116390 117846 119491 121303 123674 126276 128367 130055 132160 134956 137990 141164 145118 150383
56562 150383 156777 163800 171212 179237 188502 199649 212559 226098 239011 250928 262223 273211
56550 273211 283956 294540 304927 314654 323120 330174 336108 341205 345559 349185 352041 354031 355047
56537 355047 354774 352515 347759 341058 333766 326702 319611 312095 304279 296214 287439 277692 267424 257108
56523 257108 246687 236250 226531 218123 210793 204198 198593 194124 190058 185538 180608 175812 171359 167378
56509 167378 164384 162625 161459 160199 159061 158475 157991 156821 154962 152869 150515 147733 145090 143381 142551
56494 142551 142011 141657 141644 141564 140955 140356 140743 142091 143483 144494 145445 146434 147180 147785 148631 149532 149883 149666
56476A49666k13J8K3J17O09R97P67J97k88o82q14k02Q73J271P08L31Q50J345Q81
56457A56454J03M2M59N61M38N34N76K39Q8O45J255J002J89k79k86k35j4O15J152
56438A63538J028O83Q77J304J058J52m41j56N65J018R07M53J54L02N34L05j67
56421A72114j94J36J3n62n66L08R97P97M22O11R45R34R67J261J115K52l06J84
56403A79428R27R89Q14J074J287Q78N01Q51J213O99l0J51R18J202J022J055J128
56386A94107O60R7K93J004J355J375J682K129K083J662J422J323J085R61J093
56371B12331Q55J2l49O28J914J919P33l69q06p12R4J590K708K573J852J428P97
56354B27198o11j641r92L46N15r7L97J990K669J695N55M46Q58J055J048P50p1
$$ plain form
56476 149666 149453 149471 149494 149611 150220 151217 151984 152181 151893 151211 150397 150195 151068 152339 153047 153378 154228 155573 156454
56457 156454 156557 156599 157058 157619 158057 158591 159167 159406 159494 160139 161394 162396 162585 162306 162020 161785 161771 162386 163538
56438 163538 164566 165249 166126 167430 168488 168640 168199 168043 168608 169626 170533 170986 171140 171442 171976 172281 172114
56421 172114 171920 172056 172069 171507 170941 171249 172246 173043 173465 174076 175021 175955 176922 178183 179298 179550 179244 179428
56403 179428 180355 181344 182158 183232 184519 185397 185898 186749 187962 188661 188631 188782 189700 190902 191924 192979 194107
56386 194107 194767 194864 195157 196161 197516 198891 200573 202702 204785 206447 207869 209192 210277 211238 212331
56371 212331 213186 213198 212849 213477 215391 217310 218043 217674 216868 216156 216250 217840 220548 223121 224973 226401 227198
56354 227198 226587 224946 223954 224300 224815 224718 225115 227105 229774 231469 232024 232470 233328 234383 235431 236181 236110
56337B36110p32j17J476K516K440K138K082J633N51l30l61J83Q96J665K179K146
56321B54475K015K380K849K615J964J814K118K013J419J088J276J642K116K561
56307B82345K166O87l47N10K190K580J882K177L916N277N250M873M970M913M297
56292C27686L928M321M840M976M987M914M416L931M401N555O040N504N006N083
56278C95588N105M864N075N946O804P518Q650R925J0240R571R185R661J0305J0851
56264E09288J2015J3954J5863J7440J9182K0958K2110K3215K5815L0028L4250
56253G44118L7732M1499M6210N1126N5876O1332O7811P4176P9573Q4531Q9467
56242A433451R3669R6492R8104R8343R6264R1487Q4689P6216O5567N2628L8092
$$ plain form
56337 236110 235378 235261 236737 239253 241693 243831 245913 247546 248097 247767 247406 247589 248485 250150 252329 254475
56321 254475 256490 258870 261719 264334 266298 268112 270230 272243 273662 274750 276026 277668 279784 282345
56307 282345 284511 285198 284851 285361 287551 290131 292013 294190 298106 303383 308633 313506 318476 323389 327686
56292 327686 331614 335935 340775 345751 350738 355652 360068 363999 368400 373955 379995 385499 390505 395588
56278 395588 400693 405557 410632 416578 423382 430900 439550 449475 459715 469286 478471 488132 498437 509288
56264 509288 521303 535257 551120 568560 587742 608700 630810 654025 679840 709868 744118
56253 744118 781850 823349 869559 920685 976561 1037893 1105704 1179880 1259453 1343984 1433451
56242 1433451 1527120 1623612 1721716 1820059 1916323 2007810 2092499 2168715 2234282 2286910 2325002
56231B325002K2413N924r934k3434l4874m6113n7427o6865p3276p7859q1861q4725
56219A796971q5453q4089q1104p6885p2453o8992o6126o2413n7911n4247n1805
56208A035493m9101m5563m2450m0204l7285l2832k8238k4845k2136j9430j7340
56197F76069j6238j5142j3423j1867j0912r640p639o047n569n266m427l802l805
56184E62292l374j898m31K13Q26K053K965K690J803J053L59K0J030L100M277L710
56168E80688K937L295M025M130M150M781N482N779O239O997P126O483O353P284
56154F55749Q231Q806J0148J2550J4467J5095J5790J7691K0159K2733K6315L1224
56142H58958L6435M2037M9981O0946P2923Q4227R5366J06359J14819J18411J16985
$$ plain form
56231 2325002 2347415 2353339 2343405 2319971 2285097 2238984 2181557 2114692 2041416 1963557 1881696 1796971
56219 1796971 1711518 1627429 1546325 1469440 1396987 1327995 1261869 1199456 1141545 1087298 1035493
56208 1035493 986392 940829 898379 858175 820890 788058 759820 734975 712839 693409 676069
56197 676069 659831 644689 631266 619399 608487 598847 591208 585161 579592 574326 569899 566097 562292
56184 562292 558918 557020 556589 556802 557628 559681 562646 565336 567139 568192 568551 568571 569601 572701 576978 580688
56168 580688 583625 586920 590945 595075 599225 604006 609488 615267 621506 628503 635629 642112 648465 655749
56154 655749 663980 672786 682934 695484 709951 725046 740836 758527 778686 801419 827734 858958
56142 858958 895393 937430 987411 1048357 1121280 1205507 1300873 1407232 1522051 1640462 1757447
56131A757447J10912J00030Q5878P2332O2114N4820M9407M5725M2215L5593K4953
56120B441426J3347L416n404j3549j8968k0888k2788k8646l8693n1197o5392p9909
56108B112755r1351r7464r9395r8452r3577q4535p4350o5479n6644m6484l7190
56097A267834l1133k6821k1722j6469j2723r616n805k530j065L01L284O159O759
56084A156453O354P070Q099Q053Q359J0546J2741J2724J1969J2852J4443J4834
56072A284497J5026J6592J8039J7547J6694J7614J9054J9141J9276K1181K3032
56061A487693K2714K1970K2995K4001K2670K0815K0988K1629K0504J9543K1129
56050A726651K2917K1931K0528K2422K5829K6670K5820K6911K9446L0394L0328
$$ plain form
56131 1757447 1868359 1968389 2054267 2126599 2188713 2243533 2292940 2338665 2380880 2416473 2441426
56120 2441426 2454773 2458189 2452785 2439236 2420268 2399380 2376592 2347946 2309253 2258056 2192664 2112755
56108 2112755 2021404 1923940 1824545 1726093 1632516 1547981 1473631 1408152 1351508 1305024 1267834
56097 1267834 1236701 1209880 1188158 1171689 1158966 1149350 1143545 1141015 1139950 1140251 1143535 1149694 1156453
56084 1156453 1162807 1169877 1177976 1186029 1194388 1204934 1217675 1230399 1242368 1255220 1269663 1284497
56072 1284497 1299523 1316115 1334154 1351701 1368395 1386009 1405063 1424204 1443480 1464661 1487693
56061 1487693 1510407 1532377 1555372 1579373 1602043 1622858 1643846 1665475 1685979 1705522 1726651
56050 1726651 1749568 1771499 1792027 1814449 1840278 1866948 1892768 1919679 1949125 1979519 2009847
56039B009847L1876L4193L4905L5241L7431L9595L9208L8769M1836M6363M8468
56028B437732M9629N3368N7908N9450N9683O2502O6214O6775O5960O8230P2300
56017C119751P3984P4724P8719Q4271Q6773Q7750R1973R8108J01363J02904J07317
56006D107637J13261J16399J18914J25926J35080J40279J43302J50762J61926
55997E313486J70822J78082J88900K01587K10364K17472K29881K46182K59612
55988G216388K71874K90235L13144L33058L51522L76665M07729M37551M68158
55979A0466324N07575N53534N97649O43534P02411P73085Q46003R24734J022333
55970A7037182J138642J264241J404979J578361J787923K028126K312968K670707
$$ plain form
56039 2009847 2041723 2075916 2110821 2146062 2183493 2223088 2262296 2301065 2342901 2389264 2437732
56028 2437732 2487361 2540729 2598637 2658087 2717770 2780272 2846486 2913261 2979221 3047451 3119751
56017 3119751 3193735 3268459 3347178 3431449 3518222 3605972 3697945 3796053 3897416 4000320 4107637
56006 4107637 4220898 4337297 4456211 4582137 4717217 4857496 5000798 5151560 5313486
55997 5313486 5484308 5662390 5851290 6052877 6263241 6480713 6710594 6956776 7216388
55988 7216388 7488262 7778497 8091641 8424699 8776221 9152886 9560615 9998166 10466324
55979 10466324 10973899 11527433 12125082 12768616 13471027 14244112 15090115 16014849 17037182
55970 17037182 18175824 19440065 20845044 22423405 24211328 26239454 28552422 31223129
55962C1223129L111731L633269M253460N004709N895284O918625Q099860R488773
55954G7628840J1114882J3015724J5319416J8235595K1951317K6566501L1998738
55947B15831013L7619510M1805109M2138414L6632399K5173388R878629n973467
55940D03104995j9479200k9007331l4241247l5797438l4759895l2230383k9020085
55933A88569416k5607854k2272836j9189429j6435045j4012478j1909454j0117907
55926F9024413q606970p324478o233992n320827m561818l920578l374878k920540
55918B6760332k545530k225537j947270j712607j517162j346376j194694j067842
55910A3203314r63543q69133p80470p04980o43547n86746n31401m84324m46817
$$ plain form
55962 31223129 34334860 37968129 42221589 47226298 53121582 60040207 68140067 77628840
55954 77628840 88743722 101759446 117078862 135314457 157265774 183832275 215831013
55947 215831013 253450523 295255632 337394046 374026445 399199833 409078462 403104995
55940 403104995 383625795 354618464 320377217 284579779 249819884 217589501 188569416
55933 188569416 162961562 140688726 121499297 105064252 91051774 79142320 69024413
55926 69024413 60417443 53092965 46858973 41538146 36976328 33055750 29680872 26760332
55918 26760332 24214802 21989265 20041995 18329388 16812226 15465850 14271156 13203314
55910 13203314 12239771 11370638 10590168 9885188 9241641 8654895 8123494 7639170 7192353
55901G192353m10989l74364l43458l19900k96814k71845k50707k34995k18937
55892D470344k00953j86549j76944j66254j52619j41305j34184j26477j16441
55883C068618j08155j02291r3977q2361p3084o8729o5627o2236o1935o5193o7416
55872B217614o6770o6404o7145o5900o2693o1321o1554n8775n2808m8928m8439
55861A556877m6501m1267l6984l5736l4138l0719k8928k9975k9972k7148k5016
55850A190493k5626k6153k4954k4566k6020k6367k4503k3478k4463k4357k1863
55839I18143k0101k0566k0277j7582j5347j5566j6072j5110j4230j4250j3294
55828G35748j1134j0493j1846j1849r165o938p301q283q285q672r810r472p413
$$ plain form
55901 7192353 6781364 6407000 6063542 5743642 5446828 5174983 4924276 4689281 4470344
55892 4470344 4269391 4082842 3905898 3739644 3587025 3445720 3311536 3185059 3068618
55883 3068618 2960463 2858172 2764195 2681834 2608750 2540021 2474394 2412158 2350223 2285030 2217614
55872 2217614 2150844 2084440 2017295 1951395 1888702 1827381 1765827 1707052 1654244 1605316 1556877
55861 1556877 1510376 1469109 1432125 1396389 1362251 1331532 1302604 1272629 1242657 1215509 1190493
55850 1190493 1164867 1138714 1113760 1089194 1063174 1036807 1012304 988826 964363 940006 918143
55839 918143 898042 877476 857199 839617 824270 808704 792632 777522 763292 749042 735748
55828 735748 724614 714121 702275 690426 681261 674323 667022 658739 650454 641782 631972 622500 615087
55815F15087o664q065q422o319m706n303n463l299j121q91q19P43K365L194N116
55800E75433Q575J0587R601Q065P439N198j76n653q456j0264j3203j5599j5301
55787E56246j3702j2809j1517q363n007l639l641l847n350q879j2153j2920j2261
55774D42158j2054j1624r712p310n801m502k635j408j718k124j449r67j776k483
55760C76595j847j198j825k456j759p80n57J77K411M477M754M183L644J457l580
55745C83696r119j2175j3032j3515j3523j2196j0587j0125r978q621o625n409
55733B58791m733l763l068l254l205j918n56n36j166j321j658k959l976l329k005
55718B21344j669j948j545o90k95q4L79K26j160k451k111o15P45J772K481K037
$$ plain form
55815 615087 608423 600358 591936 585617 580911 575608 570145 566846 565725 564834 564015 564758 567123 570317 575433
55800 575433 584008 594595 604196 612261 619700 624898 624722 619069 610613 600349 587146 571547 556246
55787 556246 542544 529735 518218 509855 504848 501209 497568 493721 488371 479492 467339 454419 442158
55774 442158 430104 418480 408768 401458 395657 391155 388520 387112 385394 383270 381821 380854 379078 376595
55760 376595 374748 373550 371725 369269 367510 366730 366173 366350 368761 373238 377992 382175 385819 387276 383696
55745 383696 374577 362402 349370 335855 322332 310136 299549 289424 279446 270825 264200 258791
55733 258791 254058 250295 247227 243973 240768 238850 238294 237758 236592 235271 233613 230654 226678 223349 221344
55718 221344 219675 217727 216182 215492 215197 215113 215492 215718 214558 212107 209996 209381 210126 211898 214379 216416
55702B16416L17j070j059q22j563k520k741k914l574l626k458j572k126k945k866
55687A84877k817l492l377j363Q39J426J327J867J968N52o51J64J414P24q87r27
55671A81644R6k27j799k312j249j96K52R04J670J756J647K358L281L243K964L877
55655A97909N308N557M891M808M980L879J807M47j98j537l394m147l732l805m849
55640B07924n679n872o252o848o606n351m049l077k118j552j982k601k003m94
55626A53440L18q0q95j744k701l065k193j075j107j787j664r93j124j841j768
55611A31721j058j121j859j720n35J28l54r07q91q73j024q05m44p78j448j225
55595A16807k04K24l36r16j085j265j194j64J152J233J85l97j16j53p50o41M76
$$ plain form
55702 216416 216733 215663 214604 213782 212219 209699 206958 204044 200470 196844 194386 192814 190688 187743 184877
55687 184877 182060 178568 175191 173828 174667 176093 177420 179287 181255 181807 181156 181320 182734 183458 182571 181644
55671 181644 181740 181513 179714 177402 176153 175957 176209 177113 178783 180539 182186 184544 187825 191068 194032 197909
55655 197909 203217 208774 213665 218473 223453 227332 229139 229586 229388 227851 224457 220310 216578 212773 207924
55640 207924 202245 196373 190121 183273 176667 171316 167267 164190 162072 160520 158538 155937 153934 153440
55626 153440 153758 153678 152783 151039 148338 145273 143080 142005 140898 139111 137447 136454 135330 133489 131721
55611 131721 130663 129542 127683 125963 125428 125556 125202 124295 123404 122531 121507 120702 120258 119480 118032 116807
55595 116807 116603 116827 116491 115575 114490 113225 112031 111867 113019 114252 114437 114040 113924 113771 113021 112380 112856
55578A12856J130M38n97r57j005j250j300p38J71J199K307K924K451J583J582
55563A20794K186J912O11j42M12J111R25L91L87Q80J522K116K089Q15j050j894
55547A33065j295n37o32j131j307j197r84n44j07k00o33n38L19J273J927K369
55531A29848K266J035q45k012j995j599j427j297j254j795k714k996k256j269
55517A11690q00q29j064j217q77n3L35l98j424j554j157j421k103j887p98k49
55501I6194o10o91N6O36L60j40k30j82k49k38k93p60j113m58P54J084L42j94L6
55482I4304K21MP6M89K34q62j557j157n08l52l02p8j84o30n27K78P05K76lN91
55462I1018J341J413J071P49K60l51m32J45O15O14N66M56l01j357j490o70k83
$$ plain form
55578 112856 113986 114424 113827 112870 111865 110615 109315 108577 108748 109947 112254 115178 117629 119212 120794
55563 120794 122980 124892 125503 125361 125773 126884 127809 128200 128587 129467 130989 133105 135194 136009 134959 133065
55547 133065 131770 131233 130601 129470 128163 126966 125982 125438 125331 125131 124498 123960 124279 125552 127479 129848
55531 129848 132114 133149 132304 130292 128297 126698 125271 123974 122720 120925 118211 115215 112959 111690
55517 111690 110890 110061 108997 107780 106903 106850 107185 106787 105363 103809 102652 101231 99128 97241 96443 96194
55501 96194 95584 94893 94949 95585 95945 95805 95575 95393 95144 94906 94613 93853 92740 92282 93036 94120 94462 94268 94304
55482 94304 94525 94529 94605 95094 95328 94466 92909 91752 91244 90892 90590 90512 90328 89698 89171 89449 90154 90430 90427 91018
55462 91018 92359 93772 94843 95592 95852 95501 95069 95214 95829 96443 97009 97465 97164 95807 94317 93647 93364
55445I3364o60l68J112K135J486L75L23P14J78r48j297p00j07l2l36r13j455j265
55427I1606k95M34L27J56O07R81M61l72n47l66p16j389j357l08J100K127K343
55410I4792J679P67N49J014J088K81n74q29j060j741k187j859j564k024k414j684
55394H4234m62l7j87L51J651K361J681L30n37n02J00O20O08K80K37N11M73pk18
55375I1487Q0M7p66j340o66N47Q73J97l96l46o5nk19p05j253j287n54K71M55K46
55355H6601L63P87Q73M25r1k05J83Q52J268R14J0n75n00l95p42j055p25nN61J002
55335H9546J494J659J059k9r28j240q16L00J426J528M85n61p12l45j78j37K6j0
55317I2567m38o54k12K93J99j11L2L30J62k08j05L05K39m42j057j034l82M36P19
$$ plain form
55445 93364 92704 92336 93448 95583 97069 97444 97767 98481 98659 97711 96414 95714 95607 95575 95239 94326 92871 91606
55427 91606 91311 91745 92072 92228 92835 93816 94277 93905 93358 92992 92276 90887 89530 89222 90322 92449 94792
55410 94792 96471 97238 97787 98801 99889 100170 99596 98767 97707 95966 93779 91920 90356 88332 85918 84234
55394 84234 83772 83735 83548 83899 85550 87911 89592 89922 89385 88883 88983 89603 90211 90491 90728 91239 91712 91705 91487
55375 91487 91567 91614 90848 89508 88842 89389 90262 90459 90063 89717 89652 89647 89428 88723 87470 86183 85629 85900 86355 86601
55355 86601 86964 87751 88624 89049 88958 88753 88936 89788 91056 91970 91980 91405 90905 90510 89768 88713 87988 87983 88544 89546
55335 89546 91040 92699 93758 93729 92801 91561 90745 91045 92471 93999 94484 93923 93211 92866 92688 92551 92577 92567
55317 92567 92129 91475 91263 91556 91755 91644 91676 92006 92168 91960 91855 92160 92399 91957 90900 89866 89484 89920 90639
55298I0639J04p35o58K69P16J44k72M15J304J176M50K67M97K30m63p93p65r66
55280I1559j149n37O43J346J301J146J128Q44L01M0R8m8m75o80n36m60n78n60
55262I3383l26j93k63l50l79l21M3P26J127P63O2k65k58l39l91p5L06K68J13M38
55242I4069R11O58k77r37q97p01p70p83l50L81R49R43K18q05j243o97K43Q67J209
55223I2988J465J239K97n37l62L93O79N37P82J276R50l33j349j132o8R25J273
55206I9023O47r57k638l005j658K85J469J538J005N29M91P58P20Mq75j055m61
55189I5820J98M60M99N07M02K07J69L18M46M83N10M62K70J22K07L50L41L33M60
55170A02564M23Lm53o05p33j043r93j63P90J010P93R22J132O02l07l55N09R08
$$ plain form
55298 90639 90743 90008 89350 89619 90335 90479 90207 90622 91926 93102 93552 93819 94316 94546 94083 93290 92525 91559
55280 91559 90410 89873 90516 91862 93163 94309 95437 96281 96582 96622 96720 96672 96197 95517 94981 94521 93943 93383
55262 93383 93057 92864 92601 92251 91872 91551 91594 92320 93447 94210 94272 94007 93749 93410 93019 92944 93250 93518 93631 94069
55242 94069 94980 95638 95361 94424 93527 92826 92056 91273 90923 91304 92253 93196 93414 92609 91366 90669 90912 91779 92988
55223 92988 94453 95692 95989 95452 95090 95483 96162 96699 97481 98757 99707 99374 98025 96893 96825 97750 99023
55206 99023 99670 98713 96075 93070 91412 91697 93166 94704 95709 96238 96729 97487 98207 98211 97336 96281 95820
55189 95820 96018 96478 96977 97484 97886 98093 98262 98580 99026 99509 100019 100481 100751 100873 101080 101430 101771 102104 102564
55170 102564 102987 102990 102537 101932 101199 100156 99163 99000 99790 100800 101593 102515 103647 104249 103942 103587 104096 105004
55152A05004K25m07N2R36R10j39j140j251o27K4J47k34n96n39k82k64m39l74M6
55133A01052M98P12O17J57m89o98p2Q46J161Q24N48O96R42R37O47Nr41j678j626
55114A04138r80m50k47o5R4j16n17m19L24R72R09L74j05m40q29j273j506j256
55096I8608m22P98K000K873L266K943J726Q7r91j118r16r47r29n03n3RL3M17P49
55077A07630O02M17O53P67K26j98M26J383J148k47j249j070m16PK59M03L37M39
55059A11517J151J834J410J32o66o53q25j568j977j495p94m55j67K81M59K89L90
55042A08863Q18P73P1k77K87Q52M96k91n16j57J71K13k2o70j547j876j143J96
55024A06241J303J734J315R1j233j575p50K30N60N66P45P82K98j80J33J052J603
$$ plain form
55152 105004 105229 104822 104874 105810 106720 106581 105441 104190 103563 103587 103734 103500 102904 102365 102083 101819 101380 101006 101052
55133 101052 101550 102262 102879 103036 102547 101849 101777 102623 103784 104608 105156 105852 106794 107731 108378 108383 107442 105764 104138
55114 104138 103158 102708 102461 102396 102490 102374 101857 101438 101762 102734 103643 104017 103912 103472 102643 101370 99864 98608
55096 98608 98186 98984 100984 103857 107123 110066 111792 111879 110888 109770 108854 107907 106978 106475 106422 106431 106464 106881 107630
55077 107630 108232 108649 109302 110069 110295 110097 110523 111906 113054 112807 111558 110488 110072 110079 110338 110741 111078 111517
55059 111517 112668 114502 115912 116044 115378 114725 113900 112332 110355 108860 108066 107611 107444 107725 108184 108473 108863
55042 108863 109681 110454 110525 110248 110535 111387 111883 111592 111076 110919 111090 111303 111281 110611 109064 107188 106045 106241
55024 106241 107544 109278 110593 110684 109451 107876 107126 107356 107916 108482 109227 110009 110307 110127 110260 111312 112915
55007A12915J188J28p38p17J96J229J584J316J001P48K22l86m30L3J51l94q98
54990A17148q42n83n17l89NK89J97O9K11M32N29N85M95ro00n63K3L13K14P25K168
54969A19900L272K839J394L17J68N88J158J498J121J1j074j472j313r82n27m7
54953A26851R6l2K18J047J667J387N36j70n17n68l30j49o17j522j784r65RK67
54935A25424K19N96J191J429J399J425J344J030R93J586K266K481K625L298M276
54920A51582N029N588O006N719M459L127K561K045K56k548m580m723l688k934
54906A67899l239m355n410n557m702l566k784k270j740j325j236j265j162r98
54892A28290p60j23Q70J532J453J151J143J137P86O12J292K585L709M383M760
$$ plain form
55007 112915 114103 114231 113493 112776 112972 114201 115785 117101 118102 118850 119072 118686 118256 118289 118440 118046 117148
54990 117148 116306 115723 115206 114817 114822 115111 115308 115377 115588 116020 116549 117134 117629 117620 117020 116457 116480 116793 117007 117732 119900
54969 119900 123172 126011 127405 127722 127890 128478 129636 131134 132255 132266 131192 129720 128407 127425 126898 126851
54953 126851 126947 126915 127133 128180 129847 131234 131770 131600 131083 130515 130185 130036 129419 127897 126113 125148 125157 125424
54935 125424 125643 126239 127430 128859 130258 131683 133027 134057 135050 136636 138902 141383 144008 147306 151582
54920 151582 156611 162199 168205 173924 178383 181510 184071 186116 186372 183824 179244 174521 170833 167899
54906 167899 164660 160305 154895 149338 144636 141070 138286 136016 134276 132951 131715 130450 129288 128290
54892 128290 127530 127407 128277 129809 131262 132413 133556 134693 135479 136091 137383 139968 143677 148060 152820
54877A52820M820M635M765N521O219N828M185J991l3j489k229k562l070l846m361
54862A73194m398m454m817n009m695m190l659k730j559j122j715k247j966j630
54848A29003j969k202j427l57k10p40r24p72q28p04K39J274J185K96j11Ql97j335
54830A20029j633r46k01J16N12J106J208O14k8l55o41q38n25M0O4l62k93M53R51
54811A19271P40M82O46P76M79R4n6j56k67r3K78L33M5J8M67R00J008R73Q56N04
54791A27298J79L13O44O03M42Q26J374R87k07p74j18O80P24N52R18J535J848J904
54773A39728J797J321Q85J649L865O086O954O793O590O305N395M224L625L461
54759A98678K746J104q04k270l188l819m461n281n991n873m620k978k058k105
$$ plain form
54877 152820 157640 162275 167040 172561 178780 184608 188793 190784 190751 189262 187033 184471 181401 177555 173194
54862 173194 168796 164342 159525 154516 149821 145631 141972 139242 137683 136561 134846 132599 130633 129003
54848 129003 127034 124832 123405 123048 122838 122098 121174 120402 119574 118870 119109 120383 121568 121864 121753 121761 121364 120029
54830 120029 118396 117450 117249 117365 117877 118983 120191 120805 120777 120422 119781 118943 118418 118458 118522 118160 117867 118320 119271
54811 119271 120011 120493 121139 121915 122394 122488 122432 122276 122009 121916 122194 122527 122572 122590 123057 123957 124965 125938 126794 127298
54791 127298 127477 127790 128434 129037 129479 130305 131679 132666 132459 131685 131567 132247 132971 133523 134441 135976 137824 139728
54773 139728 141525 142846 143731 145380 149245 155331 162285 169078 175668 181973 187368 191592 195217 198678
54759 198678 201424 202528 201724 199454 196266 192447 187986 182705 176714 170841 166221 163243 161185 159080
54745A59080k369k178j732j727k337k803k186o05O79P23P8k1O41J183J116R51
54729A48493J238J793K233K548K874L241L801M784N991O772O683N717L958J655
54715B01781n14j903k700l506m214m246l838l906m549m837m404m033m164m056
54701A50911l177k313k310k671k357j366m70K9L65N22L06m5q7J23J46j53n72r31
54683A35950j096r37o39p36j340j759j358m69R4J40J83O09J263J689J510O68l66
54666A33406q90o61j23K04K19L9k99o92q73p00k73L34R91J263P66j48o98p13o88
54647A30464p17k63O81J219P93R1P1P21J314J340O94m39j405j412n34J78K6m58
54629A32364m95j35J47K91L80K13k21l85J7M61M52L17N17Q41R58J086J276Q40
$$ plain form
54745 159080 156711 154533 152801 151074 148737 145934 143748 143143 143822 144545 144623 144602 145243 146426 147542 148493
54729 148493 149731 151524 153757 156305 159179 162420 166221 171005 176996 183768 190451 196168 200126 201781
54715 201781 201267 199364 196664 193158 188944 184698 180860 176954 172405 167568 163164 159131 154967 150911
54701 150911 147734 145421 143111 140440 138083 136717 136247 136276 136641 137163 137469 137424 137337 137460 137606 137453 136881 135950
54683 135950 134854 133917 133278 132542 131202 129443 128085 127616 127710 127850 128033 128642 129905 131594 133104 133772 133406
54666 133406 132516 131855 131732 131936 132155 132194 131895 131203 130330 129630 129357 129691 130682 131945 132711 132563 131865 131152 130464
54647 130464 129747 129484 130165 131384 132177 132268 132339 133060 134374 135714 136408 135969 134564 133152 132618 132796 132822 132364
54629 132364 131869 131734 131881 132172 132552 132765 132544 132159 132176 132637 133089 133406 133923 134764 135722 136808 138084 138924
54611A38924n32j688j284K64J296J072L10k17m81n79l94n8R0J02K88M99K48l70
54593A37490o93m42OL17N42O78N84L56K77K92R5k77m75m10l11k47r9Q7K02M25
54573A38397Q71J126P63J38p0Ql54j085j162q0J263J648R00j76p71o45m2O08J080
54554A42417J444J677J392M23n97q71n21l58n85n64JN55P00R03J648K492K608
54537A52764J966J303J106J074O40l04j294j699j301m81J73L92K54j36o59j011
54521A52787r66o97m90j79N41J324J395O83J7j45l92j223j915j440r9O54P8r89
54503A48944j364r01k73J19M58Q78J081P43O6k98J11J071J827J805J137M73K34
54486A56111K22j1n26r40r76p57n02j41M72J189J666J798J811J889J958J809J264
$$ plain form
54611 138924 138392 136704 135420 135684 136980 138052 138362 138145 137664 137085 136691 136633 136723 136825 137113 137612 137860 137490
54593 137490 136797 136355 136361 136678 137220 137898 138482 138838 139115 139407 139502 139225 138750 138340 138029 137782 137683 137770 137972 138397
54573 138397 139268 140394 141157 141295 141225 141233 140879 139794 138632 138552 139815 141463 142363 142187 141416 140771 140729 141337 142417
54554 142417 143861 145538 146930 147353 146756 145885 145364 145006 144421 143857 143858 144413 145113 146016 147664 150156 152764
54537 152764 154730 156033 157139 158213 158853 158549 157255 155556 154255 153774 153947 154339 154593 154457 153798 152787
54521 152787 151821 151124 150634 150455 150996 152320 153715 154398 154415 154270 153878 152655 150740 149300 149201 149855 149933 148944
54503 148944 147580 146679 146406 146525 146983 147861 148942 149685 149751 149453 149564 150635 152462 154267 155404 155877 156111
54486 156111 156333 156322 155796 154856 153880 153123 152621 152480 152952 154141 155807 157605 159416 161305 163263 165072 166336
54469A66336L08p23j143n50N44J081O62l1j46L32Q04R41R52J036J037O94O1m89
54451A71706o26m30l10n21q22q19m95j96r0p6r7k68n57p87r47j091r34j04J046
54432A63582J504Q44k04p92j001j283j370o49O87J619J525Q33L28K65L22J20l33
54415A65997n56q7P99J111K23j203j855j259j87M32N20N89R01J189J111O94K77
54398A68696J35K56N52J079J863K558K573J659J68j244j973j635l80Q92J158L97
54382A76754l86m24l9J21Q9L23P92R69N80r8o27p41m52o6Q2J23N16J222J507R97
54362A81242M11N87J256J543J307J213J556J870J743J318Q57M30K03M08Q71R72
54346A97787L15q70k034k774k959k782k657k788k895k609j979j270m77M39J045
$$ plain form
54469 166336 166644 165921 164778 164228 164772 165853 166515 166484 166338 166670 167474 168415 169367 170403 171440 172134 172195 171706
54451 171706 171080 170650 170340 169819 168997 168178 167683 167487 167397 167321 167224 166956 166399 165612 164665 163574 162640 162536 163582
54432 163582 165086 165930 165726 164934 163933 162650 161280 160631 161318 162937 164462 165295 165623 165888 166210 166330 165997
54415 165997 165441 165354 166153 167264 167487 166284 164429 163170 162983 163415 163935 164524 165425 166614 167725 168419 168696
54398 168696 168831 169087 169639 170718 172581 175139 177712 179371 179539 178295 176322 174687 174307 175199 176357 176754
54382 176754 176368 175944 175905 176026 176115 176438 177230 178199 178779 178681 178054 177313 176861 176795 176877 177000 177516 178738 180245 181242
54362 181242 181653 182240 183496 185039 186346 187559 189115 190985 192728 194046 194903 195333 195536 195944 196815 197787
54346 197787 198102 197232 195198 192424 189465 186683 184026 181238 178343 175734 173755 172485 172008 172447 173492
54331A73492Q00j50j105j611j670j276m99J02m2n30l18P23J478J212O94R55J632
54314A73887J445J12j157j206l10L15J6o84r13m99k9N0l9J30M53M46k0m95n28
54295A70974j66J89J94k21q39j280j345j252j340j592j651j299o60P9Q27J454
54279A62072J766J755J572J251O68j14p46r70r14q39q01p11n93n45m58p7N86J059
54261A63961R28M63L51P45R88O68L97R16J786J866R84J53nK5j13L6N85N39p04
54242A74569k034k020j018m94p68q30k60J92J42K11P56J094O14l38j133j659j912
54225A65112j641r50n03n38l65O27J963K714K560J780P44l1L5Q09J247O80k19
54208A74024m57k38m92j262j615j166n86m82o14o30p41j131j322q89l36m64j017
$$ plain form
54331 173492 174292 174142 173037 171426 169756 168480 167981 168083 168041 167511 167193 167916 169394 170606 171300 172255 173887
54314 173887 175332 175444 174287 173081 172771 173086 173102 172418 171505 171006 170977 171027 170988 171118 171571 172017 171997 171502 170974
54295 170974 170808 170997 171191 170970 170131 168851 167506 166254 164914 163322 161671 160372 159712 159791 160618 162072
54279 162072 163838 165593 167165 168416 169084 168970 168224 167254 166340 165501 164700 163989 163396 162851 162393 162316 162902 163961
54261 163961 164889 165352 165703 166448 167436 168104 168501 169417 171203 173069 174053 174206 174201 174226 174113 174149 174734 175273 174569
54242 174569 172535 170515 169497 169003 168235 167405 167145 167337 167479 167690 168446 169540 170154 169816 168683 167024 165112
54225 165112 163471 162521 162018 161480 161115 161742 163705 166419 168979 170759 171503 171472 171507 172316 173563 174243 174024
54208 174024 173567 173329 172837 171575 169960 168794 168208 167726 167112 166482 165741 164610 163288 162399 162063 161599 160582
54191A60582q19N48J936K026R37j49n77o64o82l93J76L58j66o44k60O05Q94L81
54173A64089j59j96k9l3o3J21L88M90L16j35p33j005n47K95O98M63K66N32P39
54154A65497L06l70l72M45J229J147J84r99j730j724j083p1R98J718J709R75R1
54137A67950l15j60K54P98J483J990J850J155N19K62J35k0L6L51N17L74L51P41
54119A78271J124J071R00J160J677J827J525J245J127P33j91j229j772j640j061
54104A84767l42K68N88N82L58j0m79q74q98m39J92O33R57J577K596L464L525K778
54086A99243J873J458J861L218N416P714R076R253R107R367R444Q059M877Q66
54072B80832k811n664p635q689q858q334p320o079n075m701m759m615l944k949
$$ plain form
54191 160582 159763 160311 162247 164273 165210 165061 164484 163820 163138 162745 162921 163279 163113 162469 162209 162814 163708 164089
54173 164089 163930 163734 163705 163672 163609 163730 164118 164608 164924 164789 164056 163051 162504 162799 163497 163960 164226 164758 165497
54154 165497 165803 165433 165061 165506 166735 167882 168066 167067 165337 163613 162530 162459 163457 165175 166884 167859 167950
54137 167950 167635 167475 167729 168527 170010 172000 173850 175005 175524 175786 175921 175901 175937 176288 176805 177179 177530 178271
54119 178271 179395 180466 181366 182526 184203 186030 187555 188800 189927 190660 190469 189240 187468 185828 184767
54104 184767 184425 184693 185281 185863 186221 186211 185732 184858 183960 183521 183713 184346 185303 186880 189476 192940 196465 199243
54086 199243 201116 202574 204435 207653 213069 220783 229859 239112 248219 257586 267030 275089 279966 280832
54072 280832 278021 272357 264722 256033 247175 238841 231521 225442 220367 215666 210907 206292 202348 199399
54058A99399j948j098n64m33m52k00L73J001J612K295K736K419J471P31P15J088
54042B09145J418J860K676L582M140M495N184O317P360P762P558P316P578Q293
54028B84684Q807Q446P101N148L006R90o22j759k648l485m085m223m043l778l350
54013B90189k753k500k994l642l487k568j854j880k291k786l495m282m628m535
53999B46494m632n010m882l841k624k058j967j778j476j308j148q10n70p08r18
53984B12764p82m59l59m73n09m44m93p76j267j796j911j258k79Q3l32n85l4P35
53966B01825Q86N51L66L90K72K9p6n4N5N58J572K432K376J627J123J358K028K650
53948B19968K997L070L090L381L905M240M303M623N522O609P493Q500J0065J2045
$$ plain form
54058 199399 197451 196353 195789 195356 194904 194704 195077 196078 197690 199985 202721 205140 206611 207342 208057 209145
54042 209145 210563 212423 215099 218681 222821 227316 232500 238817 246177 253939 261497 268813 276391 284684
54028 284684 293491 301937 309038 314186 317192 318182 317560 315801 313153 309668 305583 301360 297317 293539 290189
54013 290189 287436 284936 281942 278300 274813 272245 270391 268511 266220 263434 259939 255657 251029 246494
53999 246494 241862 236852 231970 228129 225505 223447 221480 219702 218226 216918 215770 214960 214390 213682 212764
53984 212764 211982 211523 211164 210691 210182 209738 209245 208469 207202 205406 203495 202237 201958 202041 201709 201124 201090 201825
53966 201825 202711 203262 203628 204018 204290 204319 204243 204189 204244 204802 206374 208806 211182 212809 213932 215290 217318 219968
53948 219968 222965 226035 229125 232506 236411 240651 244954 249577 255099 261708 269201 277701 287766 299811
53934B99811J4220J6846J9850K2015K1866J9104J4371Q182J084n507j0004j2152
53922D09686j2963j3073j2169j0119p656n572m028k838j920j138k76O03J271J894
53908C41702K948M406N475N444M477L345K596K123J375J5j591k624k677k095j440
53893C63479r99j037j886l338m506m862m974n625o588p054o836o379n910n403
53879B98082n158n423n655n035l765k938l060l519l659l570l550l488l117k407
53865B43738j488o54m36j188k426l106k762j914j325j217j345j418j352j321j522
53850B20264j762j547q92n72j070j684j440n01J37J47J29M76R10J180J344J202
53834B16321L67q88j641j461r12o18n11k84O2M27Q58J244J248P83K17n5J05O92
$$ plain form
53934 299811 314031 330877 350727 372742 394608 413712 428083 436265 437349 431842 421838 409686
53922 409686 396723 383650 371481 361362 353706 348134 344106 341268 339348 338210 337934 338537 339808 341702
53908 341702 344650 349056 354531 359975 364452 367797 370393 372516 373891 373906 372315 369691 367014 364919 363479
53893 363479 362480 361443 359557 356219 351713 346851 341877 336252 329664 322610 315774 309395 303485 298082
53879 298082 292924 287501 281846 276811 273046 270108 267048 263529 259870 256300 252750 249262 246145 243738
53865 243738 242250 241596 241160 239972 237546 234440 231678 229764 228439 227222 225877 224459 223107 221786 220264
53850 220264 218502 216955 216063 215491 214421 212737 211297 210796 210933 211080 211209 211685 212595 213775 215119 216321
53834 216321 216688 215800 214159 212698 211786 211168 210657 210373 210435 210862 211720 212964 214212 214995 215212 215157 215262 215954
53816B15954J444J682R60r1k41Q18K138K734K548K000J421J253K035L612M860
53801B43127M751L489K180J697K143L126M170M920N192M920M194L377K916K732
53787B92934K237J269N62O71R42M55m63q01o66j191k549l457l103k292k032k111
53771B80405j950j916k725m026m627l928k463j210q53j497k586l259l148k674
53757B43543k341k117j811j573j602j685j500j147r43q83o92k51L11P64Q63M40
53741B29376k80o99l98L51Q50O12k10r54j031m96M2K56M90J063J515J209L49k73
53723B31772l65k67j07L41R71J356J499J785K152K146J820J643J519R58L74Q81
53707B48478K454L559L268K535K538K918K737K215K270K926L492L873M528N247
$$ plain form
53816 215954 217398 219080 220040 219949 219708 220526 222664 225398 227946 229946 231367 232620 234655 238267 243127
53801 243127 247878 251367 253547 255244 257387 260513 264683 269603 274795 279715 283909 287286 290202 292934
53787 292934 295171 296440 297002 297673 298615 299070 298607 297806 297140 295949 293400 289943 286840 284548 282516 280405
53771 280405 278455 276539 273814 269788 265161 261233 258770 257560 256707 255210 252624 249365 246217 243543
53757 243543 241202 239085 237274 235701 234099 232414 230914 229767 228824 227941 227249 226998 227309 228073 228936 229376
53741 229376 229096 228397 227999 228350 229200 229812 229602 228648 227617 227121 227163 227419 227909 228972 230487 231696 232045 231772
53723 231772 231407 231140 231033 231374 232345 233701 235200 236985 239137 241283 243103 244746 246265 247223 247597 248478
53707 248478 250932 254491 257759 260294 262832 265750 268487 270702 272972 275898 279390 283263 287791 293038
53693B93038N101L804K263J531J728K117J917R76o4m20p5K22M6j58J02M87L84
53676C12999p0j25N92J659K326K072R59k86q28o11l87o68j165j550k008k593k664
53659C07652j685j67Q82J147J046Q70N32O8k34k11KR8k31j006j654j455m75M01
53641C05580O32O10Q02R57P07L02J84L28N81J104J849K208J862J501J886K588
53625C23681K536J592P60R06J942L140L788L607K988K698L045L606L975M248M513
53610C67025M502M265M433N237N981O144O269O859P260O723N833N654N906N370
53596D47461L809K159R58q0r52j107n58j47m21j091j742k226k298j820j405j839
53580D38701k765k938k010j034q94j240j459j630j935j934j201j84K39k20j089
$$ plain form
53693 293038 298139 301943 304206 305737 307465 309582 311499 312475 312411 311991 311916 312138 312184 312026 312128 312615 312999
53676 312999 312929 312804 313396 315055 317381 319453 320412 320126 319298 318687 318300 317632 316467 314917 312909 310316 307652
53659 307652 305967 305800 306682 307829 308875 309745 310277 310345 310111 309900 309902 310000 309769 308763 307109 305654 305179 305580
53641 305580 306212 306822 307624 308581 309288 309590 309774 310102 310683 311787 313636 315844 317706 319207 321093 323681
53625 323681 326217 327809 328569 329475 331417 334557 338345 341952 344940 347638 350683 354289 358264 362512 367025
53610 367025 371527 375792 380225 385462 391443 397587 403856 410715 417975 424698 430531 436185 442091 447461
53596 447461 451270 453429 454387 454307 453355 452248 451690 451543 451122 450031 448289 446063 443765 441945 440540 438701
53580 438701 435936 432998 430988 429954 429060 427820 426361 424731 422796 420862 419661 419477 419716 419496 418407
53565D18407j680j578r39m56o65j174j111l84J66K9k66j21J82mo79j231j256q44
53547D06396k42M40J148J776K132K127K053K468L459M293M165L237K420K300K765
53532D40937L553M516N332N727N950O530P406Q015Q290Q792R746J0602J0954J1233
53518E47583J1982J3047J3938J4564J5127J5611J5937J6390J7391J8776J9823
53507G20169K0161K0409K1565K3673K5495K5855K5116K4745K5400K6238K6319
53496I85145K5864K5517K5143K4248K3061K2301K2123K2177K2323K2517K2357
53485A242776K1627K0941K0881K0914K0258J9321J8991J8909J8057J6870J6926
53474A456471J8342J9311J8682J7309J6149J4744J2527J0094Q006N646K488o34
$$ plain form
53565 418407 416727 415149 414210 413754 413089 411915 410804 410420 410586 410615 410349 410228 410410 410406 409727 408496 407240 406396
53547 406396 406154 406594 407742 409518 411650 413777 415830 418298 421757 426050 430215 433452 435872 438172 440937
53532 440937 444490 449006 454338 460065 466015 472545 479951 487966 496256 505048 514794 525396 536350 547583
53518 547583 559565 572612 586550 601114 616241 631852 647789 664179 681570 700346 720169
53507 720169 740330 760739 782304 805977 831472 857327 882443 907188 932588 958826 985145
53496 985145 1011009 1036526 1061669 1085917 1108978 1131279 1153402 1175579 1197902 1220419 1242776
53485 1242776 1264403 1285344 1306225 1327139 1347397 1366718 1385709 1404618 1422675 1439545 1456471
53474 1456471 1474813 1494124 1512806 1530115 1546264 1561008 1573535 1583629 1591635 1597281 1599769 1599135
53462A599135k772m435o632r166j1255j3020j4976j6617j7022j6528j6431j7185
53450A453096j8168j9051k0145k1287k1713k1305k0936k1237k1769k1776k1144
53439A224565k0372j9919j9762j9256j7625j4907j2151j0216q771p053n191l902
53427A065440l161k201p32P74K095L607N410O951P876Q619R784J1514J3622J5874
53413A145472J7850J9073J9583J9981K0758K1936K3444K5316K7347K9106L0484
53402A400350L1805L3193L4378L5402L6976L9695M3204M6636M9477N1720N3402
53391A856238N4595N5675N7097N8808O0202O0819O0847O0828O0965O0860N9916
53380B506850N7946N5356N2808N0710M9001M7240M4928M1912L8496L5040L1418
$$ plain form
53462 1599135 1596363 1591928 1585296 1576130 1564875 1551855 1536879 1520262 1503240 1486712 1470281 1453096
53450 1453096 1434928 1415877 1395732 1374445 1352732 1331427 1310491 1289254 1267485 1245709 1224565
53439 1224565 1204193 1184274 1164512 1145256 1127631 1112724 1100573 1090357 1081586 1074533 1069342 1065440
53427 1065440 1062279 1060078 1059346 1060120 1062215 1065822 1071232 1078183 1086059 1094678 1104462 1115976 1129598 1145472
53413 1145472 1163322 1182395 1201978 1221959 1242717 1264653 1288097 1313413 1340760 1369866 1400350
53402 1400350 1432155 1465348 1499726 1535128 1572104 1611799 1655003 1701639 1751116 1802836 1856238
53391 1856238 1910833 1966508 2023605 2082413 2142615 2203434 2264281 2325109 2386074 2446934 2506850
53380 2506850 2564796 2620152 2672960 2723670 2772671 2819911 2864839 2906751 2945247 2980287 3011705
53369C011705K7178K2296J7420J3065Q901M143j638q422j6124k4485l2683l9742
53357B981614m5301m9628n2908n5118n6580n7922n9283o0091n9944n9168n8160
53346B367511n6742n4634n2220n0256m9005m8223m7822m7949m8385m8422m7471
53335A816382m5530m2947m0147l7600l5606l3834l1465k8193k4832k2418k0830
53324A452980j8888j5964j3044j1765j2610j4419j5676j5877j5539j5169j4629
53313A289400j3513j1852j0162q846p774o513m956l454k368j612p49N56K283M187
53299A224627N988P478Q617R636J0968J2851J4971J6654J7544J8121J9337K1679
53287A388471K4698K7454K9198K9563K8546K6799K5507K5291K5263K3982K1436
$$ plain form
53369 3011705 3038883 3061179 3078599 3091664 3100565 3104708 3103070 3094648 3078524 3054039 3021356 2981614
53357 2981614 2936313 2886685 2833777 2778659 2722079 2664157 2604874 2544783 2484839 2425671 2367511
53346 2367511 2310769 2256135 2203915 2153659 2104654 2056431 2008609 1960660 1912275 1863853 1816382
53335 1816382 1770852 1727905 1687758 1650158 1614552 1580718 1549253 1521060 1496228 1473810 1452980
53324 1452980 1434092 1418128 1405084 1393319 1380709 1366290 1350614 1334737 1319198 1304029 1289400
53313 1289400 1275887 1264035 1253873 1245027 1237253 1230740 1225784 1222330 1219962 1218350 1217601 1218157 1220440 1224627
53299 1224627 1230615 1238093 1246710 1256346 1267314 1280165 1295136 1311790 1329334 1347455 1366792 1388471
53287 1388471 1413169 1440623 1469821 1499384 1527930 1554729 1580236 1605527 1630790 1654772 1676208
53276A676208J9250J8547J8369J6930J3738R755N941K601r1k033l781o302r843
53263A759289j3647j6985j9910k2770k5521k7851k9600l0836l1742l2579l3440
53252A474408l4030l4029l3646l3301l2917l2137l1152l0554l0264k9499k8118
53241A124761k7084k7105k7606k7677k7343k7134k6984k6400k5399k4438k3598
53230H33993k2599k1424k0250j8816j6624j3900j1646j0482r967r306q406p890
53218F62683q244r246j0276j1012j1646j2399j3075j3379j3506j3892j4384j4179
53206E17445j2932j1339j0315j0004r964r879r616q949p828o714o143o111o305
53193D01346o711p410q002p852o928n900n348n284n405n446n215m680m077l657
$$ plain form
53276 1676208 1695458 1714005 1732374 1749304 1763042 1772797 1778738 1781339 1781248 1779215 1775434 1769132 1759289
53263 1759289 1745642 1728657 1708747 1685977 1660456 1632605 1603005 1572169 1540427 1507848 1474408
53252 1474408 1440378 1406349 1372703 1339402 1306485 1274348 1243196 1212642 1182378 1152879 1124761
53241 1124761 1097677 1070572 1042966 1015289 987946 960812 933828 907428 882029 857591 833993
53230 833993 811394 789970 769720 750904 734280 720380 708734 698252 688285 678979 670573 662683
53218 662683 654439 645193 634917 623905 612259 599860 586785 573406 559900 546008 531624 517445
53206 517445 504513 493174 482859 472855 462891 453012 443396 434447 426619 419905 413762 407651 401346
53193 401346 394635 387225 379223 371371 364443 358543 353195 347911 342506 337060 331845 327165 323088 319431
53179C19431l423l327l500l938m138l588k545j806j717j845j742j515j475j598
53165B83274j581j211o07j88l99j185j866j779j015k79p5l63q67j291j300p36
53149B68532K7L51K6n90j127j539j804j709j141l12M41R39J153J130R92Q10N09
53132B66688J3m93p19n86k00L90J041J301Q10j31q02r16p40m01K11Q04O52l08
53114B66614j019n63N28R22K23o61q57m84j72k37o95j518k367k445j293L45J103
53097B57424O23k7J93R51J203P46L39L95M14m0n52n32j84j76o64j158j235r28
53079B56792m09K84J087J813K250K167J391J32q12o55M69J493J486N37n61j283
53063B66181j759k240k551k307j639j251j529j890j529n90K3j7rO09J388J646
$$ plain form
53179 319431 316008 312681 309181 305243 301105 297517 294972 293166 291449 289604 287862 286347 284872 283274
53165 283274 281693 280482 279875 279687 279288 278103 276237 274458 273443 273164 273089 272726 271859 270568 269268 268532
53149 268532 268559 268910 268936 268346 267219 265680 263876 262167 261026 260714 261155 262094 263247 264377 265369 266179 266688
53132 266688 266701 266208 265489 264903 264703 265093 266134 267435 268245 268114 267312 266396 265656 265255 265466 266270 266922 266614
53114 266614 265595 265032 265560 266482 266705 266044 265187 264703 264531 264294 263599 262081 259714 257269 255976 256321 257424
53097 257424 258047 258020 258213 259164 260367 261113 261452 261847 262261 262221 261669 261137 260953 260777 260113 258955 257720 256792
53079 256792 256383 256667 257754 259567 261817 263984 265375 265507 264695 264040 264509 266002 267488 268025 267464 266181
53063 266181 264422 262182 259631 257324 255685 254434 252905 251015 249486 248896 248919 248902 248893 249502 250890 252536
53047B52536J525J592J799J614J011N64N82P57Q02Q13Q63O85R3o44j093j191j211
53030B61097j330j347r59k90L8l80j013q71J91J176J257Q26P52J050R97L65k52
53013B61307l14J21P00J187J388J133N05j92o87q18n65k40l41q46j026m32K95
52996B61175K75k77m15J10O95J057J510J931J593M55l86j76L36J3r63j366o51
52979B64916L33M79l23j179j191k78R00J658J862J746J511J303J341J601J615
52964B76294R90J10k81n4K57L38L45K42l54j430k314k474k018j229k28O36P32
52947B69562m4q80r55l82J11P9l82r05j084p42k54k23o82j030r44p30n56q5P41
52928B60615J237R10K37n7pl3q3J12L51L03K20N08Q43O04Nq0N13R11M23n72j232
$$ plain form
53047 252536 254061 255653 257452 259066 260077 260641 261223 261980 262782 263595 264458 265143 265236 264592 263499 262308 261097
53030 261097 259767 258420 257461 257171 257209 256829 255816 254945 255136 256312 257569 258395 259147 260197 261194 261559 261307
53013 261307 260993 261114 261814 263001 264389 265522 266027 265835 265148 264330 263765 263525 263184 262338 261312 260880 261175
52996 261175 261450 261173 260758 260868 261563 262620 264130 266061 267654 268109 267723 267547 267883 267896 266933 265567 264916
52979 264916 265249 265728 265405 264226 263035 262757 263657 265315 267177 268923 270434 271737 273078 274679 276294
52964 276294 277284 277394 277113 277059 277316 277654 277999 278241 277887 276457 274143 271669 269651 268422 268194 268830 269562
52947 269562 269518 268638 267683 267301 267412 267491 267109 266204 265120 264378 264124 263901 263219 262189 261245 260515 259959 259874 260615
52928 260615 261852 262762 262999 262942 262935 262902 262819 262931 263282 263585 263805 264313 265156 265760 265765 265685 266198 267109 267532 266960 265728
52907B65728j184o80k32l30j081j986k374k118j624j115m18M99J255J536J446
52892B57322J219R11O06N64Q78J222J216Q66M56J01k71n95o25k49K51M01jo66
52874B63606j092j061p88o10o05n46j64O17J555K260K579K801L227L560L107J727
52858B80173K17o08q22j063j514j788j699j612j918k529l090l404l495l416l156
52843B50276k659j857q16J17M85J69l85n92l89l30q79j710j979j334l35L67Q86
52826B39035J657K403K326J369N65O96J275J338P39K6n19r34r58j83J081J949
52810B51865K142K346L025L502K778R03j061k300k837k970k747k279k101k628
52796B47638l422l557k791j901j598j572j135m37k95q20j045k52R08J200L70o42
$$ plain form
52907 265728 264544 263864 263632 263302 262221 260235 257861 255743 254119 253004 252586 253085 254340 255876 257322
52892 257322 258541 259452 260058 260622 261500 262722 263938 264804 265260 265361 265090 264495 263870 263621 263872 264273 264272 263606
52874 263606 262514 261453 260665 260055 259450 258904 258740 259357 260912 263172 265751 268552 271779 275339 278446 280173
52858 280173 280390 279782 278960 277897 276383 274595 272896 271284 269366 266837 263747 260343 256848 253432 250276
52843 250276 247617 245760 244944 245061 245546 245715 245330 244738 244349 244019 243140 241430 239451 238117 237782 238149 239035
52826 239035 240692 243095 245421 246790 247355 248051 249326 250664 251403 251429 250910 249976 249018 248835 249916 251865
52810 251865 254007 256353 259378 262880 265658 266561 265500 263200 260363 257393 254646 252367 250266 247638
52796 247638 244216 240659 237868 235967 234369 232797 231662 231225 230930 230110 229065 228813 229721 230921 231291 230649
52780B30649r17m90%J32Q5K82Q95J669K220K405K244J621N08n36o38K50J029P11
52762B42119l17q60n11l7k21r33j517j609j313r07n55k17K57Q35J191J081P29
52745B37215N74O78P40O23N29O39R00J224J540J637J322P95N37O87R24J095J472
52728B53131K175K747K681K063J324N69l11j063j134n16J7k07r04j243r62o67
52712B57700r11j371j309o53j30k32m66l4R89J662J383O14J28j9l46r29j147n63
52694B54366L40P31N02L13O11J036J004N69L14N43R51J139J118J131J147Q80K67
52677B66962k75k81J10J95m99j567k101j686q00j86j37m60p82o97L0J016J373
52660B60215O68m24q32l27M33R01J124J354J788K647L825M440L476J220p52j334
$$ plain form
52780 230649 229732 229242 229242 229374 229459 229741 230636 232305 234525 236930 239174 240795 241303 240767 240129 240379 241408 242119
52762 242119 241802 240942 240431 240394 240173 239240 237723 236114 234801 233894 233339 233122 233379 234214 235405 236486 237215
52745 237215 237789 238467 239207 239830 240359 240998 241898 243122 244662 246299 247621 248416 248953 249640 250564 251659 253131
52728 253131 255306 258053 260734 262797 264121 264690 264379 263316 262182 261666 261683 261476 260572 259329 258367 257700
52712 257700 256789 255418 254109 253456 253326 253094 252628 252594 253583 255245 256628 257242 257370 257351 257005 256076 254929 254366
52694 254366 254706 255437 255939 256252 256863 257899 258903 259472 259786 260329 261280 262419 263537 264668 265815 266695 266962
52677 266962 266687 266406 266516 266711 266212 264645 262544 260858 260058 259872 259735 259275 258493 257796 257826 258842 260215
52660 260215 260883 260459 259627 259300 259733 260634 261758 263112 264900 267547 271372 275812 279288 280508 279756 278422
52644B78422j063j087j604j960j846j592j430j218q72n79l59O8P94J376J286O48
52628B68984K84Q60K027K622J906L71r09j512j817k121k212j885j332q08l65n5
52612B64038O4J55M00N19J15m73m08L73R65Q62O26P36P97N01M32R18J054Qj346
52593B70336j445k73P51R06Q63J162J377J121P82P39O70K63q6J30O95R72P64M61
52575B80188M19M70J37o66j233p66M95J342J135N71M15K32o81j719j653n34L61
52558B78513M40K98K70j29q74j000j24O98M62m25j020j242j445j451r28k18Q5
52541B71910kk19p94j869k656k156o12P00J051Q35O00L71J48K49P93J299J232
52524B70880O99K65K37L38J50k77l77K17J085J474J353J464K178K852K753K144
$$ plain form
52644 278422 277359 276272 274668 272708 270862 269270 267840 266622 265750 265171 264812 264880 265674 267050 268336 268984
52628 268984 269268 270128 272155 274777 276683 277054 276145 274633 272816 270695 268483 266598 265266 264458 264093 264038
52612 264038 264102 264257 264657 265176 265291 264818 264410 264783 265748 266610 267236 267972 268769 269270 269702 270620 271674 271682 270336
52593 270336 268891 268618 269369 270275 271138 272300 273677 274798 275580 276319 276989 277252 277166 277296 277991 278963 279727 280188
52575 280188 280607 281077 281214 280548 279315 278549 279044 280386 281521 282092 282507 282739 282058 280339 278686 278152 278513
52558 278513 278953 279251 279521 279392 278518 277518 277394 278092 278554 278129 277109 275867 274422 272971 272043 271825 271910
52541 271910 271908 271689 270895 269026 266370 264214 263602 264302 265353 266188 266788 267159 267307 267556 268349 269648 270880
52524 270880 271579 271844 272081 272419 272569 272292 271915 272132 273217 274691 276044 277508 279686 282538 285291 287435
52508B87435J845K070K316K247K032J829J474P92k65j714l322m360m182l163k392
52493B82642k269k019r80L47J072J240J550J973J649L01j067j330o15J30M25M80
52477B83529L37k67j094j263l41R54J651J655J495J333R20L26L6K87Q50J530K374
52460B94312L253L687L304K239R42j99j044j735k444k896k484j253l41p79j977
52445B92585k334j322n3L65R0k27m84q07r14n91k98n46j036j108p36m46m66o34
52427B81038r01j265j350p37K64Q32O93M49O82J290J854K190K293K117J728J491
52411B92668J762K467L231L872M544N387O246O985P866R226J0650J0885R018N549
52397C80356J840j300l976o283p816q339q199p733o819n418m015l029k236j358
$$ plain form
52508 287435 289280 291350 293666 295913 297945 299774 301248 302040 301775 300061 296739 292379 288197 285034 282642
52493 282642 280373 278354 277374 277721 278793 280033 281583 283556 285205 285506 284439 283109 282494 282624 283049 283529
52477 283529 283866 283599 282505 281242 280901 281855 283506 285161 286656 287989 288909 289235 289271 289558 290408 291938 294312
52460 294312 297565 301252 304556 306795 307737 307538 306494 304759 302315 299419 296935 295682 295341 294562 292585
52445 292585 290251 288929 288876 289241 289331 289104 288620 287813 286899 286308 286010 285464 284428 283320 282584 282138 281672 281038
52427 281038 280137 278872 277522 276785 277049 277881 278574 279023 279705 280995 282849 285039 287332 289449 291177 292668
52411 292668 294430 296897 300128 304000 308544 313931 320177 327162 335028 344254 354904 365789 374807 380356
52397 380356 382196 380896 376920 370637 362821 354482 346283 338550 331731 326313 322298 319269 317033 315675
52383C15675p18p34j075j085p52n02k28N50J671K332K352K535L440M480M780M386
52367C37107L973L715L138K008P23k26o71n27L22J562K317J964R74M09O06Q94
52351C58288P39N42R34J710K104J858J403J077Q36P34J013J591K021K152K353
52336C79355K859L428L871M420N200N891O212O362O609O917P296Q091R413J0733
52322D66657J1521J1935J2399J2916J3261J3494J3744J3872J3850J4143J5080
52311F12872J6250J7058J7494J7732J7475J6610J6063J6852J8465J9385J9258
52300H05514J9292K0197K0951K0291J8439J6546J5063J3540J1674R665P721N799
52288I84692L969K470J352L49p95j988k882l247l297l597m431n325n472m693l676
$$ plain form
52383 315675 314957 314223 313148 312063 311311 310809 310581 311131 312802 315134 317486 320021 323461 327941 332721 337107
52367 337107 341080 344795 347933 349941 350664 350438 349767 349240 349562 351124 353441 355405 356379 356788 357394 358288
52351 358288 359027 359569 360503 362213 364317 366175 367578 368655 369491 370225 371238 372829 374850 377002 379355
52336 379355 382214 385642 389513 393933 399133 405024 411236 417598 424207 431124 438420 446511 455924 466657
52322 466657 478178 490113 502512 515428 528689 542183 555927 569799 583649 597792 612872
52311 612872 629122 646180 663674 681406 698881 715491 731554 748406 766871 786256 805514
52300 805514 824806 845003 865954 886245 904684 921230 936293 949833 961507 971172 978893 984692
52288 984692 988661 991131 992483 992832 992037 990049 987167 983920 980623 977026 972595 967270 961798 957105 953429
52273I53429l117k917k458j387M5J351K293L046L901M817N427N659O162P623R760
52258I93634J1473J2159J2342J2881J3980J5324J6642J7688J7967J7063J5240
52247A156393J3296J1787J0599R307P691N898M252K962J945R26k33j468k718m040
52233A216597n377o428o976p224p613q357r355j0406j1252j1430j0509q700p014
52220A105956o449o997p680p663o983o101n087l766k421j647j349n77J169K999
52206A053404L665L177K643K727L065L256L542M118M562M522M410M838N632O094
52192A109655N962N522M915M030L089K626K604K212Q90r20k490l785n120o208
52178A122982o387n766n324n570n864n499m880m872n412n634n185m584m170l526
$$ plain form
52273 953429 950312 947395 944937 943550 943595 944946 947239 950285 954186 959003 964430 970089 976251 983874 993634
52258 993634 1005107 1017266 1029608 1042489 1056469 1071793 1088435 1106123 1124090 1141153 1156393
52247 1156393 1169689 1181476 1192075 1201382 1209073 1214971 1219223 1222185 1224130 1225056 1224823 1223355 1220637 1216597
52233 1216597 1211220 1204792 1197816 1190592 1182979 1174622 1165267 1154861 1143609 1132179 1121670 1112970 1105956
52220 1105956 1099507 1092510 1084830 1077167 1070184 1064083 1058996 1055230 1052809 1051162 1049813 1049236 1050405 1053404
52206 1053404 1057069 1060246 1062889 1065616 1068681 1071937 1075479 1079597 1084159 1088681 1093091 1097929 1103561 1109655
52192 1109655 1115617 1121139 1126054 1130084 1133173 1135799 1138403 1140615 1141505 1140585 1138095 1134310 1129190 1122982
52178 1122982 1116595 1110829 1105505 1099935 1094071 1088572 1083692 1078820 1073408 1067774 1062589 1058005 1053835 1050309
52164A050309k312r99k74j31n7J38J90q9n58q92p88j45O53R09L38m44n72J16R98
52145A046390J441J315R19O85R40J572J954J406j16j907l036l061k360j760j592
52130A042790j195K92K695M955O510P822R342J0782J1926J3250J5018J6497J7078
52117A157762J7509J8821K0476K0941K0028J9261J9642K0352K0180J9300J8850
$$ plain form
52164 1050309 1047997 1046998 1046724 1046593 1046536 1046674 1046864 1046775 1046217 1045325 1044537 1044392 1045045 1045954 1046292 1045848 1045276 1045392 1046390
52145 1046390 1047831 1049146 1050065 1050750 1051690 1053262 1055216 1056622 1056506 1054599 1051563 1048502 1046142 1044382 1042790
52130 1042790 1041595 1041887 1044582 1049537 1056047 1063869 1073211 1083993 1095919 1109169 1124187 1140684 1157762
52117 1157762 1175271 1194092 1214568 1235509 1255537 1274798 1294440 1314792 1334972 1354272 1373122
$$ [...]
##END NTUPLES=NMR SPECTRUM
##END=
