##TITLE=AC1429_MEXAH13240_7764576_H80rwTeiM3
##JCAMPDX= 6.0         $$ Bruker NMR JCAMP-DX V2.0
##DATA TYPE= NMR SPECTRUM
##DATA CLASS= NTUPLES
##ORIGIN= BRUKER
##OWNER= Administrator
$$ 1.72 TOPSPIN		Version 2.1
$$ 2013-04-11 23:13:11.603 -0700  Administrator@X
$$ Compression mode = diff/dup
##.OBSERVE FREQUENCY= 400.02188249412
##.OBSERVE NUCLEUS= ^1H
##.ACQUISITION MODE= SIMULTANEOUS (DQD)
##.ACQUISITION SCHEME= undefined
##.AVERAGES= 8
##.DIGITISER RES= 22
##SPECTROMETER/DATA SYSTEM= spect
##.PULSE SEQUENCE= zg30
##.SOLVENT NAME= COFFEE_meoh
##.SHIFT REFERENCE= INTERNAL, COFFEE_meoh, 1, 14.98509
##AUDIT TRAIL= $$ (NUMBER, WHEN, WHO, WHERE, PROCESS, VERSION, WHAT)
$$ ##TITLE= Audit trail, TOPSPIN		Version 2.1
$$ ##JCAMPDX= 5.01
$$ ##ORIGIN= Bruker BioSpin GmbH
$$ ##OWNER= Administrator
$$ $$ E:\/data/COFFEE/nmr/AC1429_MEXAH13240_7764576_H80rwTeiM3/10/pdata/1/auditp.txt
$$ ##AUDIT TRAIL=  $$ (NUMBER, WHEN, WHO, WHERE, PROCESS, VERSION, WHAT)
(   1,<2013-04-11 23:13:01.088 -0700>,<Administrator>,<X>,<go>,<TOPSPIN 2.1>,
      <created by zg
	started at 2013-04-11 23:11:55.306 -0700,
	POWCHK enabled, PULCHK disabled,
       configuration hash MD5:
       33 CF 6A 21 5C D3 B9 40 6C 15 AA 8D 27 A2 4F 13
       data hash MD5: 64K
       6E 53 7E 29 03 2B 89 D5 BA BD 4E DA A0 3B D4 8F>)
(   2,<2013-04-11 23:13:04.791 -0700>,<Administrator>,<X>,<proc1d>,<TOPSPIN 2.1>,
      <Start of raw data processing
       efp LB = 0 FT_mod = 6 PKNL = 1 PHC0 = 0 PHC1 = 0 SI = 32K 
       data hash MD5: 32K
       67 93 A5 63 51 D6 BD 63 6C C0 F8 55 2D F2 88 CD>)
(   3,<2013-04-11 23:13:05.588 -0700>,<Administrator>,<X>,<proc1d>,<TOPSPIN 2.1>,
      <pk PHC0 = 98.16284 PHC1 = 0 
       data hash MD5: 32K
       D3 DE 49 F9 98 E3 A9 8E 47 8B DA D9 3E 1A 4E 6B>)
(   4,<2013-04-11 23:13:05.822 -0700>,<Administrator>,<X>,<proc1d>,<TOPSPIN 2.1>,
      <abs ABSG = 1 
       data hash MD5: 32K
       6A 68 52 D4 DA 8B 09 00 A8 66 04 45 DA 52 2D 73>)
(   5,<2013-04-11 23:13:06.119 -0700>,<Administrator>,<X>,<proc1d>,<TOPSPIN 2.1>,
      <abs ABSG = 2 
       data hash MD5: 32K
       70 B7 AF 0C 40 FE 55 B6 4A E1 E6 3B 47 D3 73 D2>)
(   6,<2013-04-11 23:13:06.275 -0700>,<Administrator>,<X>,<proc1d>,<TOPSPIN 2.1>,
      <abs ABSG = 3 
       data hash MD5: 32K
       FF 55 16 26 55 33 8C FD 4C 60 06 9F 3F AE C7 80>)
(   7,<2013-04-11 23:13:06.400 -0700>,<Administrator>,<X>,<proc1d>,<TOPSPIN 2.1>,
      <abs ABSG = 4 
       data hash MD5: 32K
       CA C7 DB 0F A5 34 68 8E 5D 3D 19 12 84 73 67 05>)
(   8,<2013-04-11 23:13:06.541 -0700>,<Administrator>,<X>,<proc1d>,<TOPSPIN 2.1>,
      <abs ABSG = 5 
       data hash MD5: 32K
       02 9F 25 DC B0 E1 CE 0B 70 6F ED D9 06 A1 8D 96>)
$$ ##END=
$$ 
$$ $$ hash MD5
$$ $$ 0C A5 FE 56 EC 7C 41 80 1B 96 31 86 4A 4D 7C EB
##$RELAX= 
##$RELAX= 
##$RELAX= 
##$RELAX= 
##$RELAX= 
##$RELAX= 
##$RELAX= 
$$ Bruker specific parameters
$$ --------------------------
##$DU= <E:\>
##$EXPNO= 10
##$NAME= <AC1429_MEXAH13240_7764576_H80rwTeiM3>
$$ [...]
##$TP= (0..7)
150 150 150 150 150 150 150 150
##$TP07= 0
##$TPNAME0= <>
##$TPNAME1= <>
##$TPNAME2= <>
##$TPNAME3= <>
##$TPNAME4= <>
##$TPNAME5= <>
##$TPNAME6= <>
##$TPNAME7= <>
##$TPOAL= (0..7)
0.5 0.5 0.5 0.5 0.5 0.5 0.5 0.5
##$TPOFFS= (0..7)
0 0 0 0 0 0 0 0
##$TUNHIN= 0
##$TUNHOUT= 0
##$TUNXOUT= 0
##$USERA1= <user>
##$USERA2= <user>
##$USERA3= <user>
##$USERA4= <user>
##$USERA5= <user>
##$V9= 5
##$VALIST= <valist>
##$VCLIST= <CCCCCCCCCCCCCCC>
##$VD= 0
##$VDLIST= <DDDDDDDDDDDDDDD>
##$VPLIST= <PPPPPPPPPPPPPPP>
##$VTLIST= <TTTTTTTTTTTTTTT>
##$WBST= 2048
##$WBSW= 25
##$XGAIN= (0..3)
0 0 0 0
##$XL= 0
##$YL= 0
##$YMAX_a= 669053
##$YMIN_a= -569547
##$ZGOPTNS= <>
##$ZL1= 120
##$ZL2= 120
##$ZL3= 120
##$ZL4= 120
##$ABSF1= 14.98509
##$ABSF2= -5.573092
##$ABSG= 5
##$ABSL= 3
##$ALPHA= 0
##$AQORDER= 0
##$ASSFAC= 0
##$ASSFACI= 0
##$ASSFACX= 0
##$ASSWID= 0
##$AUNMP= <proc_prof1d_extract_pilot.lims>
##$AXLEFT= 0
##$AXNAME= <>
##$AXNUC= <1H>
##$AXRIGHT= 0
##$AXTYPE= 0
##$AXUNIT= <>
##$AZFE= 0.1
##$AZFW= 0.1
##$BCFW= 0
##$BC_mod= 0
##$BYTORDP= 0
##$COROFFS= 0
##$CY= 15
##$DATMOD= 1
##$DC= 0
##$DFILT= <>
##$DTYPP= 0
##$F1P= 0
##$F2P= 0
##$FCOR= 0.5
##$FTSIZE= 32768
##$FT_mod= 6
##$GAMMA= 0
##$GB= 0
##$INTBC= 1
##$INTSCL= 1
##$ISEN= 128
##$LB= 0
##$LEV0= 0
##$LPBIN= 0
##$MAXI= 10000
##$MC2= 0
##$MEAN= 0
##$ME_mod= 0
##$MI= 0
##$NCOEF= 0
##$NC_proc= -8
##$NLEV= 6
##$NOISF1= 0
##$NOISF2= 0
##$NSP= 0
##$NTH_PI= 0
##$NZP= 0
##$OFFSET= 14.98509
##$PC= 1
##$PHC0= 98.16284
##$PHC1= 0
##$PH_mod= 1
##$PKNL= yes
##$PPARMOD= 0
##$PPDIAG= 0
##$PPIPTYP= 0
##$PPMPNUM= 2147483647
##$PPRESOL= 1
##$PSCAL= 4
##$PSIGN= 0
##$PYNMP= <proc.py>
##$REVERSE= no
##$SF= 400.02
##$SI= 32768
##$SIGF1= 0
##$SIGF2= 0
##$SINO= 400
##$SIOLD= 32768
##$SPECTYP= <>
##$SREGLST= <1H.CDCl3>
##$SSB= 0
##$STSI= 32768
##$STSR= 0
##$SW_p= 8223.68421052631
##$SYMM= 0
##$S_DEV= 0
##$TDeff= 65536
##$TDoff= 0
##$TI= <>
##$TILT= no
##$TM1= 0
##$TM2= 0
##$TOPLEV= 0
##$USERP1= <user>
##$USERP2= <user>
##$USERP3= <user>
##$USERP4= <user>
##$USERP5= <user>
##$WDW= 1
##$XDIM= 32768
##$YMAX_p= 463652490
##$YMIN_p= -780062
##$CURPLOT= <Network HP LaserJet P1505>
##$CURPRIN= <$Network HP LaserJet P1505>
##$DFORMAT= <normdp>
##$LAYOUT= <+/1D_H.xwp>
##$LFORMAT= <normlp>
##$PFORMAT= <normpl>
##$SURQMSG= 1
$$ End of Bruker specific parameters
$$ ---------------------------------
##NTUPLES= NMR SPECTRUM
##VAR_NAME=  FREQUENCY,     SPECTRUM/REAL,   SPECTRUM/IMAG
##SYMBOL=    X,             R,               I
##VAR_TYPE=  INDEPENDENT,   DEPENDENT,       DEPENDENT
##VAR_FORM=  AFFN,          ASDF,            ASDF
##VAR_DIM=   32768,         32768,           32768
##UNITS=     HZ,            ARBITRARY UNITS, ARBITRARY UNITS
##FACTOR=    0.250966925370066, 1,           1
##FIRST=     8223.43324360094, -45331,       -85009
##LAST=      0,             -33840,          62093
##MIN=       0,             -780062,         0
##MAX=       8223.43324360094, 463652490,    0
$$ Real data points
##PAGE= N=1
##DATA TABLE= (X++(R..R)), XYDATA
$$ [...]
19560B8418N8513c2373l10775I6134b52467H5074a50552j08236F9851M6709c28126
19548i0671B13052c5568B47015a03721A72916e136k6955B7165b82631q4515d0458
19536C719M6555c27562J36994B00285n6563b3028B3776J40568a35843L9456l76082
19525d72469C89200F455J65027B8300i4230j93055Q0526A89184b23747m8667B9543
19513B85770A04454b74544J24205L4783o0383F4983J26888D4676a84714F833g3329
19501b48814e0528l98120C392J18352a48391k5851J7675O5328C75541A54612a04043
19489F4948J21253D5376h2935l42174B4876L61105a91766a3027l18853f4278A2793
19477c7047C0038c84992L7443a43102F5836q803a91508q2295e9872B47081f3358
$$ plain form
19560 28418 86931 -32373 -343148 96134 -252467 85074 -150552 -258788 69851 116560 -328126
19548 -90671 213052 -35568 247015 -103721 172916 -5136 -32091 27165 -282631 -367146 -40458
19536 3719 50274 -327562 -190568 200285 143722 -23028 23776 164344 -135843 -96387 -472469
19525 -472469 389200 6455 171482 28300 -94230 -287285 -206759 189184 -223747 -272414 29543
19513 285770 104454 -274544 -150339 -115556 -175939 64983 191871 44676 -184714 6833 -73329
19501 -248814 -50528 -448648 3392 121744 -148391 -174242 -156567 -91239 375541 154612 -104043
19489 64948 186201 45376 -82935 -425109 24876 385981 -191766 -13027 -331880 -64278 12793
19477 -37047 30038 -384992 -347549 -143102 65836 57033 -191508 -273803 -59872 247081 -63358
19465A20730b70627b5979j16425J015A30676n7402c47273J65822I0266a25728
19454d1886k33629J13584m14855a49469j93707j6456C4022g4360K067A36094g8755
19442A13135g112B60013c8626j04061A84135H0960b69227N3549e0525C06605A11595
19430e9930m2285A02007l4571c62202J23941r9331b5041E9646J6146h1921A54708
19418f2741f231A43480P1317j05969a42746A05303e0009l8241j55081B17984b3159
19406A9693e0533H9788B1607g967A3281a90166c1616j70526f5766C4670J97861
19395B32531a26945N6343P491b2696B5590f9763G6115O9952d89972E8026K050
19384F0076b3999j7302A99394i1080j09585e5839k2857L333A29456B543J85330
$$ plain form
19465 120730 -270627 -25979 -142404 -141389 130676 73274 -347273 -181451 90266 -125728
19454 -41886 -275515 -161931 -576786 -149469 -343176 -359632 34022 -74360 -72293 136094 -78755
19442 113135 -7112 260013 -38626 -142687 184135 80960 -269227 -215678 -50525 306605 111595
19430 -59930 -102215 102007 67436 -362202 -238261 -337592 -25041 59646 75792 -81921 154708
19418 -62741 -6231 143480 214797 108828 -142746 105303 -50009 -88250 -243331 217984 -23159
19406 19693 -50533 89788 21607 -7967 13281 -190166 -31616 -202142 -65766 34670 232531
19395 232531 -126945 -70602 -63111 -22696 25590 -69763 76115 146067 -489972 58026 60076
19384 60076 -23999 -41301 199394 -91080 -200665 -55839 -78696 -75363 129456 2543 187873
19373A87873A4342b32269H8293N141c9701k05584c3580D6179M8463f400j49428
19362a55828q8076A6887M2542c33464J42153i3721k6770B27550e0299E3048K36817
19351B89865B4062H982a97802O9304b281j66037k22260g6354k9995D424M532c4965
19338e9529F7514l1434a02451c7660F5244a16973e4256Q876j51136C2291h6908
19326D9292c00523I4220a11336G986c80447D677b69193a3396A39556b96798N0247
19315b46551R6436A7694a19181L3298J8176A55453j7696c87783B47301A6296b25192
19303d8976m9677k41906a56738L7802L344d3585j02047A89190H6464B2070n477
19292A6593a68387f6405C72384i5835j29178M4806H7759a84235n7461q1115k51545
$$ plain form
19373 187873 14342 -232269 88293 93434 -39701 -245285 -33580 46179 94642 -6400 -155828
19362 -155828 -243904 16887 59429 -333464 -191311 -93721 -120491 227550 -50299 53048 289865
19351 289865 24062 8982 -197802 -128498 -2281 -168318 -390578 -76354 -106349 4424 8956 -34965
19338 -59529 67514 36080 -102451 -37660 65244 -116973 -54256 -45380 -196516 32291 -86908
19326 49292 -300523 94220 -111336 7986 -380447 4677 -269193 -13396 139556 -296798 -246551
19315 -246551 -150115 17694 -119181 -85883 -67707 155453 137757 -387783 247301 16296 -225192
19303 -48976 -98653 -340559 -156738 -118936 -115592 -43585 -145632 189190 86464 22070 16593
19292 16593 -168387 -66405 372384 -95835 -225013 -180207 87759 -184235 -241696 -322811 -574356
19281e74356K71981a16015k41356E8059O9153a81725I3435b16826h3235B85389
19270b17138m0016a24244E7933J49652o1379O4855p8974a25958b7024j41255j05185
19259b73464K227a08029o8176A7484J79986a45165A26088h5004l09309a42876
19248b91599D4948k1881b42389E7814g3567B89992b84085g4533n7473m1581k25915
19237c99502f8110A61894b33895p1557A88558h6615c5076G1579J68107a3198I3893
19225A00528o973f0557l8431n2088j0124A18540f0163E9922c01037a9325B21745
19213A14189j9824A5724a74364a0483I0761c9110k23490d8957k28447n2913J58404
19202a71913j74854e706l5446j37865f4957h062j26037o0672B829P2935J13750
$$ plain form
19281 -574356 -302375 -116015 -357371 58059 127212 -181725 93435 -216826 -83235 285389
19270 -217138 -257154 -124244 57933 207585 146206 211061 132087 -125958 -27024 -168279 -273464
19259 -273464 -271237 -108029 -176205 17484 197470 -145165 126088 -85004 -394313 -142876
19248 -291599 44948 23067 -242389 57814 -73567 289992 -284085 -74533 -132006 -173587 -399502
19237 -399502 -68110 161894 -233895 -305452 188558 -86615 -35076 71579 239686 -13198 93893
19225 100528 93555 -60557 -98988 -151076 -161200 118540 -60163 59922 -301037 -19325 221745
19213 114189 94365 15724 -174364 -10483 90761 -39110 -262600 -48957 -277404 -330317 -171913
19202 -171913 -346767 -5706 -41152 -179017 -64957 -8062 -134099 -194771 2829 75764 189514
19191A89514G2343J4002a32651A93655r6432a46014d7467m0617k3803j65997J00220
19180a77664o3354h6697A06881e0271H109b17073O1627d2218j79729m6237P4021
19169a94163A76303b13211a02990D1004c08180I6342b575k24652J09281e3964
19158B68184f755q281A32971L36206E8784j8849b4272k67510J39235f9932A15030
19146A59758f927j84491e4658A61633a73249A500c76563D4803d18591A13457a08441
19134C8120A8011f4003j57602R3822K7292L4165k8210A23634c63841B20876f0058
19122A51492G3921J75177L1546E0499c80939e6656K4291B3431a80997A19611A6011
19110a48492N6894a3404F002h4851B04845e1591j38233I9727i1211N316A40904
$$ plain form
19191 189514 72343 86345 -132651 193655 97223 -146014 -47467 -88084 -111887 -277884 -177664
19180 -177664 -241018 -86697 106881 -50271 8109 -217073 -155446 -42218 -221947 -268184 -194163
19169 -194163 176303 -213211 -102990 41004 -308180 96342 -2575 -227227 -117946 -53964
19158 268184 -6755 -15036 132971 469177 58784 39935 -24272 -291782 -152547 -69932 115030
19146 159758 -6927 -191418 -54658 161633 -173249 1500 -376563 44803 -418591 113457 -108441
19134 38120 18011 -64003 -221605 -127783 -100491 -66326 -94536 123634 -363841 220876 -60058
19122 151492 73921 249098 280644 50499 -380939 -56656 -32365 23431 -180997 119611 16011
19110 -148492 -91598 -13404 6002 -84851 204845 -51591 -189824 99727 -91211 -85895 140904
19098b89494J4353b0056l05146g1253f685l127l8461k46553h4438A84226a69214
19086h1177L0605l3010j9669D4663L0665b87184a0651n0051A58437I899J51579
19075A61478i9880B73974A13417f997C7414M134b32955C0210b2700k8133n8891
19064a09724M7155j8611J3845A68439f423A22536d9473q5992o6458e169n3764
19053e8933j38566c3867j41744I1620i0165E3192a06872I055a2713A08415P4461
19042A82876q014g1092A22158J18973a02106A43456a22041j87155a33407A34900
19031a4995k22996I7323c6339q7846c7089B74388D6033K39637n3576h0191A4911
19019a03376B742M700J21783a54790j6678B37072c83223a23805k14512B2417L98356
$$ plain form
19098 -289494 -275141 -20056 -325202 -71253 -6685 -9812 -48273 -294826 -84438 184226 -169214
19086 -81177 -50572 -83582 -103251 44663 75328 -287184 -10651 -60702 158437 9899 161478
19075 161478 -99880 273974 113417 -6997 37414 41548 -232955 30210 -22700 -50833 -109724
19064 -109724 -62569 -81180 -67335 168439 -6423 122536 -49473 -135465 -201923 -5169 -58933
19053 -58933 -197499 -33867 -175611 91620 -90165 53192 -106872 9055 -12713 108415 182876
19042 182876 174862 -71092 122158 241131 -102106 143456 -122041 -309196 -133407 134900
19031 -14995 -237991 97323 -36339 -124185 -37089 274388 46033 285670 232094 -80191 14911
19019 -103376 2742 7442 129225 -154790 -171468 237072 -383223 -123805 -338317 22417 420773
19008D20773A51416h2090j4789j1302j9728B0342d20509A00568J949a72028Q5068
18997h6960K8793E5187P0520a56270j32261O3247a0384j52397P0758L0087k13574
18986b75510a21763r3987R8891A09404P075g3605K3247j51065G8246j1215a34901
18974G9746a55141K7884k22618a19764d2429b068C42007A7577H274b05666d5334
18962A21146c13963c9759j31560b9774a2937j52769j09090A30130l9058f7094
18951C93820e8666K1098m3942C83246h8069A94651c25713A29807l191j7814a24603
18939A74452l7577a71929j95732a8738n7023a0064o2792b5976j75239A61275b5050
18927E538Q7058e1877J705k1655J7231G0889f5599j69042f6206J9689a1943j70850
$$ plain form
19008 420773 151416 -82090 -96879 -108181 -127909 20342 -420509 100568 102517 -172028 -86960
18997 -86960 -58167 55187 125707 -156270 -288531 -225284 -10384 -162781 -92023 -61936 -275510
18986 -275510 -121763 -215750 -116859 109404 116479 -73605 -50358 -201423 78246 67031 -134901
18974 79746 -155141 -127257 -349875 -119764 -42429 -2068 342007 17577 8274 -205666 -45334
18962 121146 -313963 -39759 -171319 -29774 -12937 -165706 -274796 130130 91072 -67094
18951 393820 -58666 -37568 -81510 383246 -88069 194651 -325713 129807 126616 108802 -124603
18939 174452 136875 -171929 -367661 -18738 -75761 -10064 -72856 -25976 -201215 161275 -25050
18927 5538 92596 -51877 -50172 -71827 -54596 70889 -65599 -234641 -66206 -46517 -11943 -182793
18915a82793h3955l99988b7874j69727c3631k49061A3716c14956f0853k53541
18905c14394K2787B55550a46396d6027g027I1830O0161h4334b0493D87218d9289
18893h3883A18431a18658c4B76833a49096L8244j73187O2590J01672j83595f6822
18881e7950k01381A17201b42439a16738c5416p5603A46228o9132j4752K45888
18871C08232C5354d7504C31588A17324a19639r918j01097R1599A08736b07962
18860A86128a58845a410q4770I8090C6395e5380B72675G7766c85768e2616C77682
18848b4447A40555K29561c0604j23391k8538F8346c5090C07234A6881b81440a4507
18836b99983J14282B14713C2248i6555J2758B29044e9097E0079e997p683E4283
$$ plain form
18915 -182793 -83955 -483943 -27874 -197601 -33631 -282692 13716 -314956 -60853 -314394
18905 -314394 -291607 255550 -146396 -46027 -7027 91830 151991 -84334 -20493 487218 -49289
18893 -83883 118431 -118658 -34 276833 -149096 -110852 -284039 -221449 -119777 -303372 -66822
18881 -57950 -259331 117201 -242439 -116738 -35416 -111019 146228 77096 62344 308232
18871 308232 35354 -47504 331588 117324 -119639 -129557 -230654 -139055 108736 -207962
18860 186128 -158845 -1410 -86180 98090 36395 -55380 272675 77766 -385768 -52616 377682
18848 -24447 140555 370116 -30604 -153995 -182533 68346 -35090 307234 16881 -281440 -14507
18836 -299983 -185701 214713 32248 -96555 -83797 229044 -59097 50079 -5997 -13680 54283
18824B3320b79307A80586n2810b21106c4668r2472d7178A08323C8068J28347j993
18813A64422b11593d2513A66403D6110L7785K14338A0337J57627i3129L9761A79951
18801B7842K0345j3697b17597A51588q505e6629j56616E736f7423A78707E1463
18789b19773b9196k34724A28136a85621D8510a1745m037j54954A17304J19418
18779B36722i1929c1945j52868A56217a94039B97836A18409m1657l6036K09735
18769B50451E3a31858p1400b2969k621B596c17413A05190J16873b31778L1316
18758b00462M7794j10688J15637A00960c27387F8451L5276L3067b72471A18198
18747e7400A29324A2089b64529m4812i9254j37827p8370B22132a36241j1153j94932
$$ plain form
18824 23320 -279307 180586 127776 -221106 -34668 -127140 -47178 108323 38068 166415 164422
18813 164422 -211593 -42513 166403 46110 83895 298233 10337 167964 -93129 -53368 179951
18801 27842 48187 34490 -217597 151588 143083 -56629 -213245 5736 -67423 178707 51463
18789 -219773 -29196 -263920 128136 -185621 48510 -11745 -15782 -170736 117304 236722
18779 236722 -91929 -31945 -184813 156217 -194039 297836 118409 76752 40716 250451
18769 250451 53 -131858 -203258 -22969 -25590 2596 -317413 105190 222063 -231778 -200462
18758 -200462 -152668 -263356 -147719 100960 -327387 68451 103727 136794 -272471 118198
18747 -57400 129324 12089 -264529 -309341 -99254 -237081 -315451 222132 -136241 -147394 -342326
18736c42326J58190A38432C4720N1440k5948R421J98397D5188b30684G5827a71428
18724d19008d9260B64564a54796r704B28360E9510j4880j4221J2617i8754k08729
18713c07483E1732b103k15201c3745C908P9837J99707b00370M9864E2002H549
18701G1884N5720g7238j03974A49653C8864c79190A1243M0138K5037i6825F5611
18689F8693B1149a95011B71787b99155J26503B41737d4161n4177b7691m4400n2908
18678a24999A63353a92936e3918A10196c1943j01424C00269a5709E3129e4493
18667C31726d6954k49969B9150a0880j67603B08924a54614L221E9337M7097f9968
18655e9357j08909q7298H5154c4134A01525a82998k6413C59832a58641A1091J6748
$$ plain form
18736 -342326 -184136 138432 34720 86160 60212 69633 268030 45188 -230684 75827 -171428
18724 -419008 -49260 264564 -154796 -164500 228360 59510 44630 30409 43026 -98754 -307483
18713 -307483 51732 -2103 -217304 -33745 3908 83745 283452 -200370 -150506 52002 8549
18701 71884 127604 -77238 -181212 149653 38864 -379190 11243 51381 76418 -96825 65611
18689 68693 21149 -195011 271787 -299155 -172652 241737 -44161 -98338 -27691 -72091 -124999
18678 -124999 163353 -192936 -53918 110196 -31943 -133367 300269 -15709 53129 -54493
18667 331726 -46954 -296923 29150 -10880 -178483 208924 -154614 -151393 59337 106434 -69968
18655 -59357 -168266 -255564 85154 -34134 101525 -182998 -209411 359832 -158641 11091 27839
18644B7839R8255d2793J6952m9945J1939A15301K5472a76238K7894o9227D2902
18632b76806L9821b2678l23798E1780c57968A59056c1565r9512B58676a62980
18621d7958C24193h0847l99213A84229c7524q4440B84093e12000A31173b53209
18610E4395N2449i0071B40548d0649r2287e6180e167l25280e2765r1022f0147
18598h7302b1198k67680f0361n5102j67517g4395g224j63698b7005A40102a11447
18586d5659l12352J75462B1270L5856N1736b04010g7212j34710A35181a51223
18575A86524a48553g604j733k19461c4282j91897a2410L77j79106M78A4699i6782
18562b23784J02071B64820c8478C1096d0311B61575c5378j15421A50216A9485
$$ plain form
18644 27839 126094 -42793 -25841 -75786 -63847 115301 140773 -176238 -148344 -217571 42902
18632 -276806 -236985 -22678 -346476 51780 -357968 159056 -31565 -131077 258676 -162980
18621 -47958 324193 -80847 -480060 184229 -37524 -121964 284093 -512000 131173 -253209
18610 54395 106844 -90071 240548 -40649 -132936 -56180 -5167 -330447 -52765 -143787 -60147
18598 -87302 -21198 -288878 -60361 -115463 -282980 -74395 -7224 -170922 -27005 140102 -111447
18586 -45659 -358011 -182549 21270 57126 108862 -204010 -77212 -211922 135181 -151223
18575 186524 -148553 -7604 -9337 -228798 -34282 -226179 -12410 -12033 -191139 -190661 14699 -96782
18562 -223784 -121713 264820 -38478 31096 -40311 261575 -35378 -150799 150216 19485
18551E1780P6394c54008g1402r9210f1134j93895A22339a1892A03698A6272J33667
18540A49939a09949k2518e4226j9045H0111A6296d86567a47292A842J04108a06893
18528c7523m0536K3292j9569j04749e841l55318B1720M1847J07775h1946A51908
18516C61808a13950p9348C2529C198O2404J69108b55435O6331O2942k6231E6809
18504a52615F3015b18958M2845k94574D9155b11239A0188c73940I8656J31774
18494B30430B9826a6848k08966a8384j90465k18969a02466A10548J7621J6726
18484A44895h9804a9704j73898m2380f4073l4464k14374B41240a88154A01861
18473e16946G0869a8689A39006a3297k507O205F3074b00896R5774I6841b91601
$$ plain form
18551 51780 128174 -354008 -71402 -170612 -61134 -255029 122339 -11892 103698 16272 149939
18540 149939 -109949 -132467 -54226 -73271 80111 16296 -486567 -147292 1842 105950 -106893
18528 -37523 -78059 -54767 -74336 -179085 -5841 -361159 21720 63567 171342 -81946 151908
18516 361808 -113950 -193298 32529 3198 65602 234710 -255435 -189104 -126162 -152393 56809
18504 -152615 63015 -218958 -176113 -470687 49155 -211239 10188 -373940 98656 230430
18494 230430 29826 -16848 -225814 -18384 -208849 -427818 -102466 110548 128169 144895
18484 144895 -89804 -19704 -193602 -235982 -64073 -98537 -312911 241240 -188154 101861
18473 -516946 70869 -18689 139006 -13297 -15804 -9599 63074 -200896 -105122 96841 -291601
18461e1795n8701G246b0556j75657d2520m14494a16244A16901b74175b1309r1293
18450a12602d3540j27826A72873J2774c5090A46417J46974a61498A93926b97745
18439a50764A35561a79698A10007d7392I0740h1437k57113E3311f0815C1974a29791
18427a67811M9811l02102A60887g0502j31572E7748a85081A26660h95A83459C3691
18415b67740C9637a74302A3194K09326a78474B26075P2325b09752B70860A0046
18404I3666a38986e3547m2258B42143m2302d33109D8006m24a08484A79020f8357
18392A36295J7884a96211I0647b20399A98924o4525J6428A2788J66583b63720
18381f0008B0567a0009A58787N3827c20108g4886J5049j01025k36428A18312a98372
$$ plain form
18461 -51795 -110496 7246 -20556 -196213 -42520 -457014 -116244 116901 -274175 -21309 -112602
18450 -112602 -43540 -171366 172873 185647 -35090 146417 293391 -161498 193926 -297745
18439 -150764 135561 -179698 110007 -47392 90740 -81437 -338550 53311 -60815 31974 -129791
18427 -167811 -118000 -420102 160887 -70502 -202074 57748 -185081 126660 -895 183459 33691
18415 -267740 39637 -174302 13194 222520 -178474 226075 298400 -209752 270860 10046
18404 93666 -138986 -53547 -95805 242143 199841 -433109 48006 47582 -108484 179020 -68357
18392 136295 154179 -196211 90647 -220399 198924 134399 150827 12788 179371 -263720
18381 -60008 20567 -10009 158787 212614 -320108 -74886 -59837 -160862 -397290 118312 -198372
18369B75960b50437P2158C24J17069J77494a90257E5992k4908K8118J11381a52246
18357i7956j13987F8876J92957C0154K10710b06110K2934m9959A5539a24887j5544
18346a40431f6631E1266J3482b29045g9804K8514l8206L9936r0341L5403B51354
18334b39468h328k40954f4580D5254d05649J34499A34208A3757i5828j57080d7232
18322b09706A38891J16262E4880K5854m0244J20011g2997g287B98298O2229B369
18310a61419r5670I8791K22056a97498L0754j58912e3738B2700f6153k38907B25691
18298a58752D5558b35949b5116A22474k4052J01652a26654j40500r2803a62948
18287F2173b41197M274i1820b7348I2049j0154a38622m7700b8255B69386c14407
$$ plain form
18369 275960 -250437 -178279 324 117393 294887 -190257 55992 31084 59202 170583 -152246
18357 -97956 -211943 68876 261833 30154 240864 -206110 -183176 -233135 15539 -124887 -140431
18346 -140431 -66631 51266 64748 -229045 -79804 -51290 -89496 -49560 -139901 -104498 251354
18334 -239468 -8328 -249282 -64580 45254 -405649 -271150 134208 13757 -95828 -252908 -47232
18322 -209706 138891 255153 54880 80734 40490 160501 -72997 -7287 298298 360527 2369
18310 -161419 -257089 98791 320847 -197498 -166744 -325656 -53738 22700 -66153 -305060 225691
18298 -158752 45558 -235949 -25116 122474 98422 200074 -126654 -267154 -359957 -162948
18287 62173 -241197 -236923 -91820 -27348 92049 81895 -138622 -186322 -28255 269386 -314407
18275A4378K15431m8280J0102F1571b68026D4161d70420A98874e5309a7967C9049
18263d10445A0461h1014A29375m5010O98M1675A3301b10775H8440K0840M1150
18252A50430a24342d8053A62093G3996a06154a9396C6004c3325D4227a12668j9482
18241a32150p5799H8243J24197b72435N8074B76121b26541A04320a12303A98501
18230C39928b56653a3886j15572j33548E3260N9729c25117f2611E5374b0456l0383
18219e0839j41851B02094p1023a05704G4185a52634B43532c09015e6040j74574
18209b30614N9238A95739c0242j07236E535b8142P367A20913b68846J27089B5854
18197c3297B03789G3951a98511J9744A04620M5920h6110A2638Q3271a33135A13605
$$ plain form
18275 14378 229809 181529 191631 61571 -268026 44161 -470420 198874 -55309 -17967 39049
18263 -410445 10461 -81014 129375 84365 85063 126738 13301 -210775 88440 109280 150430
18252 150430 -124342 -48053 162093 73996 -106154 -19396 36004 -33325 44227 -112668 -132150
18241 -132150 -207949 88243 212440 -272435 -214361 276121 -226541 104320 -112303 198501
18230 339928 -256653 -13886 -129458 -263006 53260 112989 -325117 -62611 55374 -20456 -50839
18219 -50839 -192690 202094 131071 -105704 74185 -152634 243532 -309015 -56040 -230614
18209 -230614 -171376 195739 -30242 -137478 5535 -28142 -20775 120913 -268846 -141757 25854
18197 -33297 203789 73951 -198511 -178767 104620 150540 -86110 12638 95909 -133135 113605
18185A57313a43071b1764F5403j0648c0473G0281b200k32208A23280G476c49497
18173A2002M4723A9986b16659C1622i7754m7492A25145J34356b35116c2928j25054
18162a57982D9742a27452a2117E7a2899j4995e7A3794J08327O2420P3758H0352
18149C10159r1700b24334N0495j21893E3410c309k37573K5895K4925A36994c14808
18137c07473J32438a4444j89645i8371j95647A6108a01002l3940N5553j78539
18127b57928j61137J30287A5461K9463a25200k8413L0034A64975a10365F0806
18116e1176J6404m804o2822A4825c7028o5007b2242G056a02027A42284c95741
18104a19751F9497b7741B882R5685b00804L4302M7374B0054a75015d5048j16104
$$ plain form
18185 157313 -143071 -21764 65403 54755 -30473 70281 -2200 -234408 123280 7476 -349497
18173 12002 56725 19986 -216659 31622 -97754 -145246 125145 259501 -235116 -32928 -157982
18162 -157982 49742 -127452 -12117 57 -12899 -27894 -57 13794 122121 184541 258299 80352
18149 310159 218459 -224334 -173839 -295732 53410 -3309 -240882 -214987 -190062 136994 -314808
18137 -307473 -175035 -14444 -204089 -98371 -294018 16108 -101002 -134942 -79389 -257928
18127 -257928 -419065 -288778 15461 44924 -125200 -153613 -123579 164975 -110365 60806
18116 -51176 -34772 -39576 -102398 14825 -37028 -102035 -22242 7056 -102027 142284 -395741
18104 -119751 69497 -27741 2882 98567 -200804 -166502 -119128 20054 -175015 -45048 -161152
18093a61152r2166m6214B8352K6130k5385c59960d2631C7509a13757l8766j23469
18082b75992a10765N2663l8454B54850a70954I9031b08303a5179E5313f6410B12
18070C517K5851c7439j96246a5971k23682B0018a73762o5961H9433a58704A66255
18058a15017L5070l2489A01131q701D1424a4464d851C14505b84070A27265e0505
18046i9718E7294a57919c4858j69830a8017j8186E1754b81802A5112a99142A44776
18034D1089a7395k90488f2507B73962a18532A79762m7993d9077A5267M2726P7824
18023A35817f9171P746r098m0233A05697M9426g8657l4030a0099n83A8416o95
18011A7721a9252m3134q401b9651r4062D6767a62564B53481C66J48732M4586b35966
$$ plain form
18093 -161152 -253318 -299532 28352 54482 29097 -359960 -42631 37509 -113757 -152523 -275992
18082 -275992 -110765 -58102 -96556 254850 -170954 99031 -208303 -15179 55313 -66410 212
18070 3517 29368 -37439 -233685 -15971 -239653 20018 -173762 -239723 89433 -158704 166255
18058 -115017 -79947 -112436 101131 92430 41424 -14464 -4851 314505 -284070 127265 -50505
18046 -99718 57294 -157919 -34858 -204688 -18017 -36203 51754 -281802 15112 -199142 144776
18034 41089 -17395 -307883 -62507 273962 -118532 179762 131769 -49077 15267 57993 135817
18023 135817 -69171 -61425 -70523 -110756 105697 155123 -78657 -112687 -10099 -10682 18416 17721
18011 17721 -19252 -62386 -70787 -29651 -123713 46767 -162564 253481 366 149098 193684 -235966
17998A30055a80921h744E8295j1213J00103a89031b0929j98784p1120B95912b36689
17986I7102J56496a05698A95484N6968a84691e3399a8201j35940A16868a34976
17975H7464a00405c4642j11027c4644n2524L3328A13626J19219f6941E5075J20110
17964A75185B6634c62880h1590B0331M35518j77439q4714p0086d8160B77189F5502
17952a46594D4069K3418i1345k09285i8145A12104e6894B03480c1478A90007f8681
17940b53577i8792c597A42677a01358H3757a05638H6679c54321a69187K2952A70678
17928A54386a34742J9462p4k26826O5322f0289J4387D4021h6608j86694J01656
17917a71646A75597a00829d9022k28705d777D9968K49146D1971a03769p6772j03070
$$ plain form
17998 130055 -180921 -8744 58295 47082 147185 -189031 -20929 -219713 -290833 295912 -236689
17986 97102 253598 -105698 195484 252452 -184691 -53399 -18201 -154141 116868 -134976
17975 87464 -100405 -34642 -145669 -34644 -87168 -53840 113626 232845 -66941 55075 175185
17964 175185 26634 -362880 -81590 20331 455849 278410 193696 123610 -48160 277189 65502
17952 -146594 44069 67487 -91345 -300630 -98145 112104 -56894 203480 -31478 190007 -68681
17940 -253577 -98792 -3597 142677 -101358 83757 -105638 86679 -354321 -169187 -146235 170678
17928 154386 -134742 -115280 -115354 -342180 -276858 -60289 -45902 44021 -86608 -273302 -171646
17917 -171646 175597 -100829 -49022 -277727 -4777 49968 299114 41971 -103769 -180541 -283611
17906b83611a28439a5026o340B07249a8142I4544M4339a23697A00397g8962D4824
17894a55804c8408A58433a29784B97900b49445C2683K28225A4742c886j9263n5305
17883g8454C66689a53039B92363b33468h2977B22294a28596o619C1095a92135
17872h4447j97417K5795C25688a46426p1994B5082Q7710O0735d4036j27993A5631
17860g2525A0797J78303g6251A65502i4304A07857b41903Q6140k4232a3525m19980
17849d33505a35963E5787f7839k23979B28a97075c3857n0103I7485f0624I4388
17837a4048A13910Q8032a02546G744R4998a14962B53617h6408p2714M1009e3137
17825F3715p300a6278l1305l3818P457j96126h6070A16840J63228A12628a92643
$$ plain form
17906 -283611 -128439 -15026 -21366 207249 -18142 94544 138883 -123697 100397 -78962 44824
17894 -155804 -38408 158433 -129784 297900 -249445 32683 260908 14742 -3886 -23149 -78454
17883 -78454 366689 -153039 292363 -233468 -82977 222294 -128596 -135215 31095 -192135
17872 -84447 -281864 -256069 325688 -146426 -218420 25082 112792 173527 -44036 -172029 15631
17860 -72525 10797 189100 -76251 165502 -94304 107857 -241903 -155763 -179995 -13525 -433505
17849 -433505 -135963 55787 -67839 -291818 228 -197075 -33857 -83960 97485 -60624 94388
17837 -14048 113910 201942 -102546 7744 102742 -114962 253617 -86408 -159122 -118113 -53137
17825 63715 56415 -16278 -47583 -81401 -73944 -270070 -86070 116840 280068 112628 -192643
17813e3584A75253C7303Q6677a96591A89287B7617K74058c78997b2783A04210
17802i8756I0265l9390d2107A90504B4147J61952q2278N7283a70482A59333c16052
17790B32319j14896e37173B4846K70164d0924k64239a19813o589g195D3790b32614
17778h4909k54223A5255K24534d4848j13010B84982c1623n4062a7127j8314B20295
17766C16058a700A37692h0948D4190d2614p92A09105l2012J8221K4918D8572K18201
17754B66773A9184d005o3837A99252r639g1072k689A6392K18286a86457k02945
17743c89402B5027d9849k4401q9925A1039L11536J55506h461o9745A5352N8256
17732G3608b06260N1274L6104k9723I3899O6329F6068a88612K5909j23941B86853
$$ plain form
17813 -53584 175253 37303 123980 -196591 189287 27617 301675 -378997 -22783 104210
17802 -98756 90265 50875 -42107 190504 24147 186099 103821 161104 -170482 159333 -316052
17790 232319 117423 -537173 24846 295010 -40924 -305163 -119813 -126402 -7195 43790 -232614
17778 -84909 -339132 15255 239789 -44848 -157858 284982 -31623 -85685 -17127 -35441 220295
17766 316058 -1700 137692 -80948 44190 -42614 -43406 109105 77093 95314 120232 48572 266773
17754 266773 19184 -4005 -67842 199252 189613 -71072 -73761 16392 234678 -186457 -389402
17743 -389402 25027 -49849 -74250 -164175 11039 322575 478081 -8461 -78206 15352 73608
17732 73608 -206260 -154986 -118882 -148605 93899 160228 66068 -188612 -162703 -286644 286853
17720c6907J3080G5106L3510F386M7737h2187D87230A9259f0867E2108J91368
17709B43476i1359H8984B246N2001a62103j16358A12695f4064j75381C7605L41215
17698C78820D4396c9622e99A64390o6182K8882a23843j07438D8239g4126A07949
17686f5598k7252B56524B7514K5098R4845a05636K2110a722B89163A10406J14673
17675B25079g2762C04049d5687r9840F7041a40427p653B47597A00556D4081M35765
17664D79846B15565d4113A11462D1784Q5344R2943F4311e9716C8555K6955i5013
17652a45716A24874a41118H2238b58743E9286h8452L0903a6335j05969C6269R2936
17641A29205B3569d2024H4490a87495C17273b13576F8370a6403g870G9259L8793
$$ plain form
17720 -36907 -23827 75106 108616 6386 54123 -82187 487230 19259 -60867 52108 243476
17709 243476 -91359 88984 2246 54247 -162103 -278461 112695 -64064 -239445 37605 378820
17698 378820 44396 -39622 -599 164390 98208 127090 -123843 -231281 48239 -74126 107949
17686 -65598 -92850 256524 27514 52612 147457 -105636 -83526 -1722 289163 110406 225079
17675 225079 -72762 304049 -45687 -145527 67041 -140427 -148080 247597 100556 44081 479846
17664 479846 215565 -44113 111462 41784 127128 220071 64311 -59716 38555 65510 -95013
17652 -145716 124874 -141118 82238 -258743 59286 -88452 -57549 -16335 -122304 36269 129205
17641 129205 23569 -42024 84490 -187495 317273 -213576 68370 -16403 -7870 79259 118052
17630A18052K9689k0046a337E0233b61606R3576B69513b6802K610A15108b10254
17618h8955B1646b31276P2495b2799B06977f254A73637R3387d1268B89100a92847
17606e1483B70408F9727b74853h9251A23730g9116A04585a52845A34370a87227
17595B56520a29382A56954J44224I63a70002b6317H8705a43943m344c8062q1892
17584a19954G0502a41455H3340l1240j9253N0634k0515L82358b1538k3269r7305
17573a42112k3937B06120j2366C1286D093R1455J07191I5160K6276J34973j6332
17562B40077H7552i7985j08002c0271j0934B92982g0917B1938J25480J47679a47360
17550a7794A86352L9270m7910Q659n6496Q5169c18991A90609a1102l8128r4901
$$ plain form
17630 118052 147741 127695 -1337 50233 -261606 -168030 269513 -26802 -24192 115108 -210254
17618 -88955 21646 -231276 -158781 -22799 206977 -6254 173637 267024 -41268 289100 -192847
17606 -51483 270408 69727 -274853 -89251 123730 -79116 104585 -152845 134370 -187227
17595 256520 -129382 156954 301178 963 -170002 -26317 88705 -143943 -148287 -38062 -119954
17584 -119954 70502 -141455 83340 52100 32847 83481 62966 445324 -21538 -44807 -142112
17573 -142112 -166049 206120 193754 31286 4093 95548 202739 95160 121436 256409 240077
17562 240077 87552 -97985 -205987 -30271 -41205 292982 -70917 21938 147418 295097 -147360
17550 -17794 186352 225622 177712 186371 129875 215044 -318991 190609 -11102 -49230 -144131
17539a44131E4301a1298r075A48619o5020d8937l24094B96962r1751C7011L30848
17528C67859o2066r2624H9534b73033a15322G9037J32754A8055J9524L20934C5872
17516A25466m24C6690j1098L29952a16241K8079A94052J78419I3615a11793r0760
17505b02553A47897d7927q80A70804o7555J64038a5048A81979l917P6129f6965
17493D33476h0352B33430n9094f8482B57761a49550B5061a05051h170r541e640
17481D3074L1761R5420d194E65309j4455A82140K0233j3805n9212J69082b86260
17469C57585b3866A0836B540K21208A05064J7201b5635F2168c3312I9522A9534
17457a06976A64136p775k1696O9870a79737B15808N0526j25513L33964j55161
$$ plain form
17539 -144131 54301 -11298 -20373 148619 83599 -48937 -373031 296962 205211 37011 367859
17528 367859 305793 213169 89534 -273033 -115322 79037 211791 18055 37579 358513 35872
17516 125466 125042 36690 25592 355544 -116241 -88162 194052 372471 93615 -111793 -202553
17505 -202553 147897 -47927 -48807 170804 103249 267287 -15048 181979 178062 254191 -66965
17493 433476 -80352 233430 174336 -68482 257761 -149550 25061 -105051 -8170 -17711 -5640
17481 43074 74835 170255 -4194 565309 550854 182140 202373 188568 129356 298438 -286260
17469 357585 -23866 10836 2540 223748 105064 122265 -25635 62168 -33312 99522 19534
17457 -106976 164136 156361 134665 204535 -179737 215808 266334 140821 474785 319624
17447C19624r4006J16823j15599b13673A85757p1701D2411N1898K14695A02692
17436D23475k0536a59485C60290c425B07276R7437A07612K7885C9565L4469K34406
17425C08440K14808A41567K39397A7804K9498J05172p6170Q6313K46569J39247
17415E48433r6508r2136A24136K76976j43930P7952j13966p5342K41382k6201
17405C61007A50312C2739f9792I0615M06171A23361K82365A29866M5206K06880
17395C81952A41187R6965J43706F1994M79152D3755J69762K01094j23118c3525
17384H789O902J16826J10225M3397F7846Q1986k6123R2157k6019H6416b0432D21388
17371f4524I4826f8558A34706n500C1848J44721b6232B7084K56987a00549l8210
$$ plain form
17447 319624 225618 342441 226842 -213673 185757 114056 42411 94309 309004 102692
17436 423475 402939 -159485 360290 -3425 207276 304713 107612 135497 39565 74034 308440
17425 308440 523248 141567 380964 17804 47302 152474 76304 162617 409186 548433
17415 548433 451925 359789 124136 401112 257182 335134 221168 145826 387208 361007
17405 361007 150312 32739 -69792 90615 496786 123361 405726 129866 175072 381952
17395 381952 141187 238152 381858 61994 541146 43755 213517 414611 291493 -33525
17384 8789 15691 132517 242742 286139 67846 149832 123709 215866 189847 86416 -20432 421388
17371 -64524 94826 -68558 134706 129206 31848 176569 -26232 27084 284071 -100549 -138759
17360a38759C60307J93748b4746B46239o0318J83513a80729C06149A23488C4425
17349E64273B12104I1795l7693K35523b924E20327e3527C17062d2841F0411J87174
17338B47585g4792I6063b7803J1367A12265K17297C3317R7078a86796m2524B33999
17326B0432d8610B46116L96715B68566j16015L34089B19888h0631C86572a97908
17315D59306A69353A2766Q9380M6021R7856a0754C55723A13485O6000a61C6356
17303c7111A08233a44976A10128K0178L1326n7638m2944d7333B13526n0249o539
17292A56738J35836A13214b2525F926N65996B23657r4208K23317A25546J44804
17282B70350J08942P755C4188Q0439N5263J08122H5232J416K88387j75360q9787
$$ plain form
17360 -138759 360307 554055 -24746 246239 185921 369434 -180729 306149 123488 34425
17349 564273 212104 91795 54102 289625 -2924 520327 -53527 317062 -42841 60411 247585
17338 247585 -74792 96063 -27803 -16436 112265 329562 33317 130395 -186796 -229320 233999
17326 20432 -48610 246116 642831 268566 152551 486640 219888 -80631 386572 -197908
17315 459306 169353 12766 102146 148167 246023 -10754 355723 113485 179485 -161 36356
17303 -37111 108233 -144976 110128 130306 161632 103994 61050 -47333 213526 163277 156738
17292 156738 292574 113214 -22525 6926 572922 223657 129449 352766 125546 270350
17282 270350 379292 387047 34188 114627 169890 278012 85232 86648 375035 199675 109888
17271A09888J83560g5775C37840Q0955a0404H0624J84322J1123j16480J30799
17261B90388H5584J5023K1535D5665R270L51924A57896L0325E5634N4521m1176
17250F8979L08990A61615k1129Q4202g9238c662A25941F1335J28450J90236A55309
17238D41485G7554K46321m2579q244K26380j88617i7910B24212l4406K24476A47105
17226I7900b0889A51928M07299k37661r3827J51313r7917K0879K22949J33368
17216F58331k89469A51577n5383l9315J6154K7617k3547K16244q358A42365b9678
17204D71885k08028b1959A50915J60225F2910J96465E231b4144C41838H1742L628
17193H5370J37479D1557J29563K09890P6596j66156D0435K92587o8320E8135g0454
$$ plain form
17271 109888 293448 -75775 337840 418795 -10404 80624 264946 276069 159589 290388
17261 290388 85584 100607 122142 45665 54935 406859 157896 188221 55634 110155 68979
17250 68979 377969 161615 140486 224688 -79238 -3662 125941 61335 189785 380021 155309
17238 441485 77554 323875 281296 273052 499432 310815 -97910 224212 189806 414282 147105
17226 97900 -20889 151928 559227 321566 227739 379052 281135 302014 524963 658331
17216 658331 368862 151577 96194 56879 73033 100650 77103 293347 284989 142365 -29678
17204 471885 263857 -21959 150915 311140 62910 259375 5231 -24144 341838 81742 85370
17193 85370 222849 41557 171120 381010 457606 291450 40435 333022 264702 58135 -70454
17181E27250B7942K99589B0682K14869a78922B56021k3185o7378Q1745H712K39869
17170B48581J73174j16277P029G5078M6687O1481J79072n851P4666n7383J1337
17159C85087J34110o8431o6796j46978b2663A51332P9313K52278j79509k6172
17149B77242e511B39601D3570M71947j67371q7528K98714A81492J38124J90121
17139E09737o4753j49680A00763L36676j25149J15391a07751D50453j13869A16819
17128a57B56525K32237k34112L16232j05201n3591A23981N09134q3339r2882K33735
17117F90629A10404L66758M0605A81330L5833L23186A73274K17112A08728K75546
17107C84274A39244J38523N7376N9304A69223J68896K30026Q7161C00557K91472
$$ plain form
17181 527250 27942 327531 20682 235551 -178922 256021 232836 165458 247203 8712 248581
17170 248581 421755 305478 312507 75078 121765 183246 362318 356467 431133 373750 385087
17159 385087 519197 450766 383970 236992 -22663 151332 230645 482923 303414 277242
17149 277242 -5511 239601 43570 515517 348146 260618 559332 181492 319616 509737
17139 509737 444984 295304 100763 437439 312290 427681 -107751 450453 336584 116819
17128 -157 256525 488762 254650 570882 465681 412090 123981 633115 549776 456894 690629
17117 690629 110404 477162 517767 181330 217163 540349 173274 390386 108728 384274
17107 384274 139244 277767 335143 394447 169223 338119 568145 655306 300557 592029
17097E92029k9041A86656q4304K55904j22882M24008A62817N38667k46051k25771
17087B29662l8102L68217k73112Q6253m724J89560L1030j17878j94582P4837L70381
17076G21542j86715n1735r108j47886K68282j28972K41540q9783N5507B55778
17065D11861K41858B61371L02574l4421k53716K99314J79924C07129M73749k9336
17055G51542k68489L09342k25698B37250K74664L08487B94473J10925K20786j33072
17045D93112A83763J254L83096j8961J69942l08467K45898j63762L50667k15646
17035F27784J02702l22072M3932K33791B70235K69720L00099m06396M0144K18185
17025F91987K90872j76596j00750k27412q2526M10961k4160k64444M3871O2184
$$ plain form
17097 592029 562988 186656 102352 358256 235374 659382 162817 701484 455433 229662
17087 229662 191560 559777 286665 372918 368194 557754 588784 470906 276324 351161 721542
17076 721542 534827 483092 473984 326098 594380 465408 706948 617165 672672 255778
17065 411861 653719 261371 563945 529524 275808 575122 755046 307129 780878 751542
17055 751542 483053 792395 566697 237250 511914 820401 294473 405398 626184 493112
17045 493112 183763 185017 568113 549152 719094 410627 656525 492763 843430 627784
17035 627784 730486 408414 452346 686137 270235 539955 840054 433658 473802 691987
17025 691987 982859 806263 705513 478101 395575 806536 782376 517932 561803 623987
17015F23987K2929q8046J4543K30869k99683N0784N0026L62519m28953M3457K64392
17004H46824j29448q6307k40179M77300m19013L71226J03594k76197J00402j59512
16994E88690l2749L49142n0111j15188J52040l72563L42117k20517K15654k37603
16984F18912M31520l75265J78862l39932J61566J35654J47813L6066l53198J33815
16974G75813k24185K48558K90659l38632L11965j72331k3246j6536N42969k92480
16964A102554l9268j66012J79626l01049K82835j49731K58389l95236K12886L613
16954I88607L6072O6205j91841M44148l93109J93459q9523J89702j40644K87001
16944A390077n48693L80224k50658N00042k80496J03189n7322L18973j80945K24761
$$ plain form
17015 623987 646916 558870 573413 804282 504599 555383 605409 967928 538975 582432 846824
17004 846824 717376 631069 390890 868190 449177 820403 923997 647800 748202 588690
16994 588690 555941 905083 854972 739784 891824 519261 861378 640861 856515 618912
16984 618912 1050432 675167 854029 514097 675663 811317 959130 995196 641998 775813
16974 775813 551628 800186 1090845 752213 1064178 891847 868601 852065 1395034 1102554
16964 1102554 1063286 897274 1076900 775851 1058686 908955 1167344 772108 984994 988607
16954 988607 1024679 1090884 899043 1343191 950082 1143541 1054018 1243720 1103076 1390077
16944 1390077 841384 1221608 970950 1470992 1190496 1293685 1236363 1555336 1374391 1599152
16934A599152l01781l29933L12246P87K9915l83349K59496K30595K6760j82696
16924A261192K0905R0978j29459Q3106p6426M43642o894l68109J96123Q9996o9036
16913A536018j79149J30832N1621l35055N04386k69435K40217k29481O8401J5111
16903A533466L09758q7945l5058O9773J47261l50537N03542K23173m45264J46401
16893B014570K26780q2381n86382Q15504k84279N4316j4593k54190J8436L57232
16883B265013K5934j25100o829R9185J22396P8220k33526k77212N83665l03712
16873B228034N1675m2332M58075l41039J69539O1283Q54L2901K6470q4391J92805
16862B753874n8486K46505k75914K07911j52165L45834j0449J18798j13337L06032
$$ plain form
16934 1599152 1297371 967438 1279684 1280471 1310386 927037 1186533 1417128 1443888 1261192
16924 1261192 1282097 1373075 1243616 1326722 1250296 1693938 1687044 1318935 1515058 1605054 1536018
16913 1536018 1356869 1487701 1539322 1204267 1708653 1439218 1679435 1449954 1518355 1533466
16903 1533466 1843224 1755279 1720221 1789994 1937255 1586718 2090260 2313433 1868169 2014570
16893 2014570 2241350 2158969 1572587 2388091 2103812 2158128 2143535 1889345 1907781 2265013
16883 2265013 2290947 2165847 2159018 2258203 2380599 2458819 2225293 1948081 2531746 2228034
16873 2228034 2279709 2237377 2695452 2354413 2523952 2585235 2586089 2618990 2645460 2561069 2753874
16862 2753874 2695388 2941893 2665979 2873890 2721725 3067559 3057110 3175908 3062571 3368603
16852C368603K7582l57826n7128M95247M2208o9961J09932r9987J95737k3370
16842C631037M5865J46354k32629K08509M85935m24344M41705k90675J06952O8348
16832D187057K80422N5223j67553N43793m21756N49658k34239K78398j70749o8781
16822D831473L40639o0544K35365n1014J23635L79551J26161J15412j74823K13674
16812F079529L26988K20753j15410N1178L61975J5445K51967r5274K74022M58573
16802G829746k10095P6871K31664N15113l51497R52004j40722k48130L88272M53752
16792I496978O7566O29172K47416m2515J74133P15356J49652K54248K78067L09297
16782A2279370M89922O86810J19688L10485M06378N67912O85881J69693O73805
$$ plain form
16852 3368603 3396185 3038359 2981231 3476478 3518686 3448725 3558657 3458670 3654407 3631037
16842 3631037 3676902 3823256 3590627 3799136 4285071 3860727 4302432 4011757 4118709 4187057
16832 4187057 4467479 4522702 4355149 4898942 4477186 5026844 4792605 5071003 4900254 4831473
16822 4831473 5172112 5111568 5346933 5295919 5419554 5799105 5925266 6040678 5865855 6079529
16812 6079529 6406517 6627270 6511860 6563038 6925013 6940458 7192425 7097151 7371173 7829746
16802 7829746 7619651 7696522 7928186 8443299 8091802 9043806 8903084 8654954 9043226 9496978
16792 9496978 9564544 10193716 10441132 10398617 10572750 11288106 11437758 11692006 11970073 12279370
16782 12279370 12769292 13456102 13575790 13886275 14292653 14860565 15546446 15716139 16389944
16773A6389944M68899P34976K04156R07148M85539Q33578J021433M66964R81174
16764B2493811O66891O90663J445884N83123J355960O15706J988557R50011J557845
16755C2348451J225739J518901J442900J942317J490047K506303K414285K168429
16747D7057372K284896K642722K801524L271128K991092L542552L830773M236826
16739G2658885M314020M907941N122444M991828N952546O059905O998822P021160
16731A18027551P623174P808968Q015853Q066288Q752864Q280027Q103200Q022056
16723A82699981P134695O397450N413841L976600K524565J186389m21320k043054
16715B06869147l041168n007805o132935o602502p616120p756649q456565q268627
$$ plain form
16773 16389944 16858843 17593819 17797975 18705123 19190662 20024240 21045673 21512637 22493811
16764 22493811 23160702 23851365 25297249 25880372 27236332 27852038 29840595 30790606 32348451
16755 32348451 33574190 35093091 36535991 38478308 39968355 42474658 44888943 47057372
16747 47057372 49342268 51984990 54786514 58057642 61048734 64591286 68422059 72658885
16739 72658885 76972905 81880846 87003290 91995118 97947664 104007569 111006391 118027551
16731 118027551 125650725 133459693 141475546 149541834 158294698 166574725 174677925 182699981
16723 182699981 189834676 196232126 201645967 205622567 208147132 209333521 208912201 206869147
16715 206869147 203827979 198820174 192687239 186084737 178468617 170711968 162255403 153986776
16707A53986776q683822q367732p965464p775883p239657o995403o641131o253533
16699I4064151n955135n092317n218756m513744m300927m291953l737947l181956
16691E7771416l548419k771719k852871k536136k246763k286543k179174k036153
16683C7313638j429688j812979j624564j866577j170061j404050p46871j508495
16675B5750353j040512j008947p82973j118657r49572r04074p98219p34644l18741
16666A8094014q25230m21576j033431q208p15746o16762n61673j64960p89629
16657A2956799k65884q12107k09912l23803j73331j38103j85646m39662n39347
16648I869004J19383m83991l50940l50382j98030l13576J83414o28556P6170k64891
$$ plain form
16707 153986776 145302954 136935222 128969758 121193875 113954218 106958815 100317684 94064151
16699 94064151 88109016 83016699 77797943 73284199 68983272 64691319 60953372 57771416
16691 57771416 54222997 51451278 48598407 46062271 43815508 41528965 39349791 37313638
16683 37313638 35883950 34070971 32446407 30579830 29409769 28005719 27258848 25750353
16675 25750353 24709841 23700894 22917921 21799264 20849692 19945618 19147399 18412755 18094014
16666 18094014 17268784 16847208 15813777 15805569 15089823 14473061 13911388 13746428 12956799
16657 12956799 12690915 11878808 11668896 11345093 11171762 11033659 10848013 10408351 9869004
16648 9869004 9988387 9504396 9153456 8803074 8605044 8291468 8474882 7846326 7922496 7657605
16638G657605l69732j20536k37400l14029l65008M0293j56247K03714l13622j45287
16628E879751j06658k89915J58319k44882P7233m35229k46350q816j75525K2218
16618D630146k5745J66316k23841l02376L1224p9981j53246J61240l28511j41679
16608C733547J35105k16045k78052N8437J35565j50727k85138K75974k07337k54357
16598B946972J07475L801O383J67806k78226k1598j28714K182j95584O1885q0475
16587B591907j93961K80464k20992M09702m29175J22072j55988q3183m19069N4119
16577A955896J47799l8154K62420j37407L72261q32642K19898K93968m9588J84863
16567B379314l21407j95055J49387l78916K07402k03716R2991K20350j39616k53643
$$ plain form
16638 7657605 7287873 7167337 6929937 6615908 6250900 6291193 6134946 6338660 6025038 5879751
16628 5879751 5773093 5483178 5641497 5396615 5473848 5038619 4792269 4783453 4607928 4630146
16618 4630146 4604401 4770717 4546876 4244500 4275724 4195743 4042497 4203737 3875226 3733547
16608 3733547 3868652 3652607 3374555 3432992 3568557 3417830 3132692 3408666 3201329 2946972
16598 2946972 3054447 3058248 3064631 3232437 2954211 2932613 2803899 2806081 2610497 2672382 2591907
16587 2591907 2397946 2678410 2457418 2867120 2437945 2560017 2404029 2320846 1901777 1955896
16577 1955896 2103695 2065541 2327961 2190554 2562815 1730173 1950071 2244039 2194451 2379314
16567 2379314 2057907 1862852 2012239 1633323 1840725 1637009 1730000 1950350 1810734 1557091
16557A557091L10471m1085R7288n98517j89255O11528l72438k22547L02815j5845
16547A439506j44354j1890K14105k82135J14709k7196p7940n556m4155K2382R5943
16536A293419j65648j20541L2412J2303M24110j64524l30592L38129l30095L6602
16526A025575K61862k08246j088J28683k00053l7974K85370j79164m7840j07598
16516I19527j78963o210L22162m79972L48351R158r7732l7583M24874l48992q8296
16505G86324j50715J88019L029q1993O0564k5747j67545J6421Q3739J05506M4258
16494H61860p2600l4241J69238k09556P6318k04358J50089K20294k78230J42642
16484H21456J3787j11908o2072m2383L19484m41588J04507N93895n35932L4775
$$ plain form
16557 1557091 1867562 1826477 1923765 1325248 1135993 1747521 1375083 1152536 1455351 1439506
16547 1439506 1295152 1283262 1497367 1215232 1329941 1302745 1224805 1219249 1175094 1197476 1293419
16536 1293419 1127771 1007230 1039642 1051945 1476055 1311531 980939 1319068 988973 1025575
16526 1025575 1287437 1079191 1078103 1206786 1006733 968759 1254129 1074965 1027125 919527
16516 919527 740564 734354 1056516 576544 924895 934053 836321 798738 1223612 874620 786324
16505 786324 635609 823628 826657 744664 805228 779481 611936 628357 712096 817602 861860
16494 861860 789260 755019 924257 714701 791019 586661 736750 957044 678814 821456
16484 821456 835243 723335 661263 618880 938364 496776 601283 1195178 659246 694021
16474F94021j64698K55560B67736K98574p9706j58131K77158j48692J47965j95751
16464D09153N7371K86595o8839n9734A62066N20896J19794C36082l6165O07650
16454I07567l72179E4064L73537L07126M6425k5145M9201k46477Q1659k48881
16444C91509N9507n7181j03976K34516l9171F1616M99618j05881j60144Q062R791
16433C13062J74306k1518n3824O245J72151k63785I9260R7227J06191J7711J24077
16422D44466A77524K98007k37144L33144A70155J04644o4961N555R7126k4484
16412B88035L10484B32263j03759K49282r0866A41567K72403A95512P1541G8962
16401A65344m6559K68890o9393O4A15970M34044J2607B41994p4708H455M42419
$$ plain form
16474 694021 529323 784883 267736 566310 486604 328473 605631 456939 604904 409153
16464 409153 466524 753119 684280 624546 162066 682962 802756 336082 299917 907567
16454 907567 535388 54064 427601 734727 781152 756007 805208 558731 640390 391509
16444 391509 451016 393835 289859 524375 485204 61616 561234 455353 295209 303271 313062
16433 313062 487368 465850 412026 418271 590422 326637 99260 196487 302678 320389 444466
16422 444466 177524 475531 238387 571531 170155 274799 209838 215393 312519 288035
16412 288035 598519 232263 128504 377786 286920 141567 413970 195512 267053 78962
16401 165344 118785 387675 318282 318346 115970 550014 562621 241994 167286 8455 450874
16390D50874p9974j33250M4989j22938m2604K97230Q2730B43575O7166H6003K83346
16379C69349n4343j15710J05617b9262E51130A5676L50208I7413J72374a51276
16368D36354G7251J68077L01717H4360M83258f1847C84291A48819J18780J7400
16358B84999c4779C65046k4573J03172A1349a1145C03179j37350J94175K94037
16348F54041A91687F6810N4532J1941L32982a39186A40070D6585J48845K44292
16338D39722A70543J89821j52013L02678A62854L1349R3428e8328F3669P0237
16328A33906J84726J10373j19525A26745a07598q3171C4770K16826j02572b15104
16317C02729o1090o5687P8332p3110m7579P1434P7393r9197P9014o1122K62190
$$ plain form
16390 450874 370900 237650 282639 159701 117097 414327 497057 243575 310741 86003 369349
16379 369349 315006 199296 304913 -29262 551130 15676 365884 97413 269787 -151276
16368 436354 77251 245328 547045 84360 567618 -61847 384291 148819 267599 284999
16358 284999 -34779 365046 340473 443645 11349 -11145 303179 165829 360004 654041
16348 654041 191687 66810 121342 133283 466265 -139186 140070 46585 195430 439722
16338 439722 170543 360364 208351 511029 162854 194203 287631 -58328 63669 133906
16328 133906 318632 429005 309480 126745 -107598 -190769 34770 251596 149024 -215104
16317 302729 241639 175952 254284 181174 133595 205029 282422 183225 262239 201117 463307
16306D63307G5081L33J61082a61440A07106J5007c46458A32563J33087H281M5857
16295E4138M0803J2559l0681J04319b7327G9524J88884L1621j27075G0899P4113
16284A45012k5693K48152G054J41118F1782f2402C19857b36240B29547D3069M642
16273D7711J3399J8131k6940L5919a65888A89786l350Q6802F7723d316F2183J98323
16261B60506f0180A2435K28422G8349K31518C2057O2434a8104r021A14936C1739
16249H7757L59568a6084D741K05170G0224J28010k4021a01071j01564A66561J72765
16238C39326e4786F0395K04901j10459m8366J08684l809H8824j7819J11497h588
16226D6544P6078a19209C38375a07781M9059k6384R149A6194c01089a01458D4391
$$ plain form
16306 463307 75081 75414 236496 -161440 107106 122113 -346458 132563 265650 8281 54138
16295 54138 94941 107500 76819 181138 -27327 79524 268408 300029 172954 70899 145012
16284 145012 119319 367471 7054 148172 61782 -62402 319857 -236240 229547 43069 47711
16273 47711 61110 79241 52301 88220 -165888 189786 186436 273238 67723 -4316 62183 260506
16261 260506 -60180 12435 240857 78349 309867 32057 94491 -18104 -27125 114936 31739
16249 87757 447325 -16084 4741 209911 70224 198234 174213 -101071 -202635 166561 339326
16238 339326 -54786 60395 265296 154837 106471 215155 211346 88824 71005 182502 -8588
16226 46544 122622 -119209 338375 -107781 -58722 -85106 -75957 16194 -301089 -101458 44391
16214B3950J32544o8408a32659G8329a63067n0510B68493B1508R3192K12994n4442
16203B73252j21772h7643H8990d1395j637H3358b7236D95164A36359a54294J4627
16192a39667l0622L2735A3495R6598R478K55831H0136a08761A49119e2132j12950
16181a65082e3554j00372A42644D0764b74704B00377n3071B852e6588k94485a04086
16169B29878H913J51932b7338j37310C32194D7988P1408b94206j515H9919a35199
16157A47656b9148q5488j01076A81026H3986b26816J6918C22260F5968O6221a6464
16145c8055j25937B88915j21784C2848J14856M9277b90070e7701E5287a58997
16134D8843g1244G5195a4222p303E1868O5687K11211c4541F7288L88252I4980
$$ plain form
16214 23950 156494 88086 -132659 78329 -163067 -213577 268493 21508 114700 327694 273252
16203 273252 151480 -87643 88990 -41395 -43032 83358 -27236 495164 136359 -154294 -139667
16192 -139667 -170289 -137554 13495 110093 119571 375402 80136 -108761 149119 -52132 -165082
16181 -165082 -53554 -153926 142644 40764 -274704 200377 147306 2852 -56588 -351073 -104086
16169 229878 8913 160845 -27338 -164648 332194 47988 119396 -294206 -295721 89919 -135199
16157 147656 -29148 -114636 -215712 181026 83986 -226816 -209898 322260 65968 132189 -16464
16145 -38055 -163992 288915 167131 32848 147704 196981 -290070 -57701 55287 -158997
16134 48843 -71244 75195 -14222 -21525 51868 117555 328766 -34541 67288 455540 94980
16122B96799l7782I9908J455J42132D3537K04503a63686N7230E1223O4688l3388
16111H2523f4519B93852c8803k0603I4081a13974C5027J29252J24636O224A32973
16099B22527a99773B34214l0265i8869C80241F5630B0565R101M9314K6841J28733
16088B34554a66856B0173N1474o187c90633a17312j07314B56891b85257A27976
16077I766a46091r148A16442i1073k19139M8032E4756K0855d3111A75839J69613
16066C45452A35124C8335g9392C0633J06321I025a41932q5310n8730B32396F9902
16054A39103B7110c08999D8683a6778a903j46386P1618C10346n679A12854P3341
16043A86195b5357j24838C7888b2756j36698F3862b55224N9977a5855j72247A02021
$$ plain form
16122 296799 259017 99908 101363 243495 43537 248040 -163686 -106456 51223 115911 82523
16111 82523 -64519 293852 -38803 -59406 94081 -113974 35027 164279 288915 295139 132973
16099 222527 -199773 234214 203949 -98869 380241 65630 20565 29666 78980 105821 234554
16088 234554 -166856 20173 71647 65460 -390633 -117312 -224626 256891 -285257 127976
16077 9766 -146091 -155239 116442 -91073 -310212 -262180 54756 75611 -43111 175839 345452
16066 345452 135124 38335 -79392 30633 136954 9025 -141932 -227242 -285972 232396 69902
16054 139103 27110 -308999 48683 -16778 -1903 -148289 -76671 310346 304667 112854 186195
16043 186195 -25357 -150195 37888 -22756 -159454 63862 -255224 -195247 -15855 -188102 102021
16031A8821R2963I316c25183e72q7551C31492a98564B2387J07957n7269f8550
16019d5731n1529j70672A06723C9315R004J57085c86180h7483B81037G1275b76101
16007I6551J74431h6641b3270p56792a54330A1485C63d52503A78386d93141H7584
15995g6277n1182b6272F3497a07600C98634c3214r4870l734N8676n1875A73984
15983A76614J15171j1840a33928A71919M79744A25566a71235C50758d4720A45989
15972g30n7873A76166A530b69841I3670a05417A42898a27699M5240A40828D3936
15960b49777C7701b43888a18267B41858H3775a67942l2989c1952k210A5965J6540
15949C2505K09507B3807R2523d3188k1599A16104E5536g5336F8414c7898E7798
$$ plain form
16031 18821 111784 9316 -325183 -572 -88123 331492 -198564 22387 130344 73075 -68550
16019 -45731 -97260 -267932 106723 39315 48319 205404 -386180 -87483 281037 71275 -276101
16007 96551 270982 -86641 -23270 -780062 -154330 11485 363 -452503 178386 -493141 87584
15995 -76277 -127459 -26272 63497 -107600 398634 -33214 -128084 -131818 -73142 -125017 173984
15983 176614 291785 279945 -133928 171919 651663 125566 -171235 350758 -44720 145989
15972 -730 -58603 176166 1530 -269841 93670 -105417 142898 -127699 -82459 140828 43936
15960 -249777 37701 -243888 -118267 241858 83775 -167942 -200931 -31952 -34162 15965 32505
15949 32505 242012 23807 116330 -43188 -64787 116104 55536 -75336 68414 -37898 57798
15937A76329a48883a2539k39105G0620f7669C45510b40949J9084A0410b64374
15926a06439B7201Q3193o508J34409m3175a06662B22072e4147J4402o2379j84505
15915b86629N8507F1841A1542L861P5928d5968D2254a5524k57888a01599n3678
15904a55277j91766c2255j33267A6312K20967i5181j12513A65431a63902A37271
15893A2152c07586I6679K24448a38097A17767E2620a03873A08875b22815q3968
15883c06783b2188J0137j44119C4791e9087k1580j59646L1383R0049j6538e3709
15871b69495c2186l06036i3144j47881P8265e2262j24099h91j65994A04500a66220
15859D2567b54930j33330H753K86882a36354n9566o2489c7075A66375J10610j34652
$$ plain form
15937 176329 -148883 -12539 -251644 70620 -67669 345510 -240949 -221865 10410 -264374
15926 -106439 27201 110394 103886 238295 195120 -106662 222072 -54147 -39745 -102124 -286629
15915 -286629 -228122 61841 11542 15403 91331 -45968 42254 -15524 -273412 -101599 -155277
15904 -155277 -347043 -32255 -165522 16312 237279 -95181 -207694 165431 -163902 137271
15893 12152 -307586 96679 321127 -138097 117767 52620 -103873 108875 -222815 -306783
15883 -306783 -22188 -12051 -156170 34791 -59087 -80667 -240313 -208930 -118881 -135419 -53709
15871 -269495 -32186 -338222 -93144 -241025 -162760 -52262 -176361 -891 -166885 104500 -166220
15859 42567 -254930 -388260 8753 295635 -136354 -195920 -258409 -37075 166375 276985 142333
15848A42333n6663b0027G8360L6302e4192D204a82502A85084m4795f2194A11918
15836a75440m2149A87455a65762b2359A72297n2562O2931b39662B50273a55939
15825B51273A17678L69405d05182g4806b1258j8935G9251a22570e900k8445j0939
15814d5284C757J28298R2922r2318H471a52670O2843b1269p3176A26278K2522
15803A48800C5651L41368A55933O4290f63j09135B96089m4548i2230D67327a41604
15791c73964A03803b33512a07087m1755j53722C6422a81479B35329f8777A30495
15780b11486C90932c23102a10194D9999b43375b3238A58492f032j3333h095B1175
15768A72464d1198q2816j13633B14083e9865b742B69631a29031A9174K3945J88282
$$ plain form
15848 142333 85670 -20027 78360 114662 -54192 4204 -182502 185084 140289 -62194 111918
15836 -175440 -217589 187455 -165762 -22359 172297 119735 182666 -239662 250273 -155939
15825 251273 117678 487083 -405182 -74806 -21258 -40193 79251 -122570 -5900 -34345 -45284
15814 -45284 3757 132055 224977 132659 8471 -152670 -89827 -21269 -94445 126278 148800
15803 148800 35651 377019 155933 220223 -663 -109798 296089 251541 -92230 467327 -141604
15791 -373964 103803 -233512 -107087 -148842 -302564 36422 -181479 235329 -68777 130495
15780 -211486 390932 -323102 -110194 49999 -243375 -23238 158492 -6032 -19365 -8095 21175
15768 172464 -41198 -124014 -237647 214083 -59865 -2742 269631 -129031 19174 43119 231401
15757B31401f472C96708A33610a73644O8089G8654L5792a12268d5068j12758G9070
15745I8644f9297A71673a5693C55928A0009K0351a38500a4570D8782c9861l14684
15734c54545B29206G4132f8867j44095j09454e0901k3325o5320I5941f0606G8319
15722A65464C3059a80329H1061a627l77710a7831j2643j87617j20276h5162C35251
15710A38927i6736l40432A5324M3472K6813B6015a73360A63109i5241A29988b87388
15698i7497A21622b48112B8490J63652m7590l1802k9042R0711J51017j23944B2108
15686a91385A10540C7357c0816k1793l4331o473j11159g1l71098a9926B0014N0790
15674G0804l3096J41604f8671p4575A15580L8846K015B6189b8064d457j0907j78873
$$ plain form
15757 231401 -6472 396708 133610 -173644 -105555 78654 114446 -112268 -45068 -157826 79070
15745 98644 -69297 171673 -15693 355928 10009 30360 -138500 -14570 48782 -39861 -354545
15734 -354545 229206 74132 -68867 -212962 -322416 -50901 -74226 -139546 95941 -60606 78319
15722 165464 33059 -180329 81061 -1627 -379337 -17831 -30474 -218091 -338367 -85162 335251
15710 138927 -96736 -437168 15324 58796 85609 26015 -173360 163109 -95241 129988 -287388
15698 -97497 121622 -248112 28490 192142 144552 112750 83708 174419 325436 201492 22108
15686 -191385 110540 37357 -30816 -52609 -86940 -93413 -204572 -71 -371169 -19926 20014 70804
15674 70804 37708 179312 -68671 -143246 115580 154426 156441 26189 -28064 -4457 -15364 -194237
15662a94237q7463J11949l5507B7954M380J0696a11149L6437L0875P941j13835
15651a49731H387b70699A32936c55471B12351F2170A5291m338J24216b0762m30782
15640d51544a5572j44860O6017L3816j7687B05696a26417I1441a27281k57273
15630c84554a04850C49836a78585A15392f5240L0735l91398b0302C0578g5051
15619A56125K59133j97537b6686B49227A8563c97591d7073l4186L720I6830g1481
15607h554A80886b19350M2674E5192d40854b06887k05170a65791A46757a7880
15596D2972b36722C24679C7077P7314C600J86724l1725k6232k983b58697g3442
15584b21373j4770e1700p4116c7742B42818i2270A22248a59228M4213j97003F8443
$$ plain form
15662 -194237 -281700 -169751 -205258 27954 32334 43030 -111149 -74712 -43837 -35896 -149731
15651 -149731 8387 -270699 132936 -355471 212351 62170 15291 10953 135169 -20762 -451544
15640 -451544 -15572 -160432 -94415 -60599 -78286 205696 -126417 91441 -127281 -384554
15630 -384554 -104850 349836 -178585 115392 -65240 -34505 -425903 -20302 30578 -75051
15619 156125 415258 217721 -26686 249227 18563 -397591 -47073 -81259 -77539 96830 -71481
15607 -8554 180886 -219350 -176676 55192 -440854 -206887 -412057 -165791 146757 -17880
15596 42972 -236722 324679 37077 114391 3600 190324 158599 132367 129384 -258697 -73442
15584 -221373 -236143 -51700 -125816 -37742 242818 -92270 122248 -159228 -115015 -312018 68443
15572a90046E3893a99013I1921b7341k31830f9634A95251a78659o7943a08600
15561a02466c7752C02685r86A28378J37241H6371a23804I6681c0401J4501D9083
15549b67976a0583A1663K06595F8951J0171b63161A3343J96157a07329A0165J61362
15538A71527i2164F1092L62660A43189J93677A23633M972a70358G3930e1702j90525
15527b42227J21019A51733G2352J62515o5322a66637O1433C6278K3167O8844d8318
15515b43271a04676B0442K47383J18565A65245g9255L2623j39928N4297G1702
15504B627J5028e30841f2615q7402j50083g298j8277k9286l5935F5136e2391j84524
15492b36915N4949d060j94723j23101I3015J19603h5322r3903L8926k24257f6425
$$ plain form
15572 -190046 53893 -199013 91921 -27341 -259171 -69634 195251 -178659 -246602 -108600
15561 -102466 -37752 302685 301699 128378 265619 86371 -123804 96681 -30401 -15900 49083
15549 -267976 -10583 11663 218258 68951 79122 -263161 13343 209500 -107329 10165 171527
15538 171527 -92164 61092 423752 143189 336866 123633 128605 -170358 73930 -51702 -242227
15527 -242227 -121208 151733 72352 234867 169545 -166637 -105204 36278 59445 128289 -48318
15515 -243271 -104676 20442 267825 386390 165245 -79255 -46632 -186560 -132263 71702
15504 2627 17655 -530841 -62615 -150017 -300100 -7298 -25575 -54861 -90796 65136 -52391 -236915
15492 -236915 -181966 -4060 -198783 -321884 93015 212618 -85322 -179225 -140299 -364556 -66425
15480F274a68216D7506j6003A0565R5272J47210a49212A56539i967A71837o3343
15469A08494h4462A29769a09645A69082K06567A85460E0888d7702F1718a71572
15458a28351A99006b7223E1872J16867e2243r3780I1698Q5263g0875k77559C7769
15446a15235q021A79419o358H4846h0159B82724B6257L7532a059n1792j30159
15435a83010A08826l8910a39095M9848l68702a05138n3936D11287A72005C7572
15424E252J65576i674E737J05732a18020C58731r8727A22073k5130B5476J80874
15413B06350e2600k23527Q4901B6287Q0688a01246N0383A59680J296g0098O303
15402f3795k2561j27629c7373D1248J65180p2393O8382r9215A2077M874L53165
$$ plain form
15480 6274 -168216 47506 31503 10565 105837 253047 -149212 156539 -9967 171837 108494
15469 108494 -84462 129769 -109645 169082 375649 185460 50888 -47702 61718 -171572
15458 -128351 199006 -27223 51872 168739 -52243 -146023 91698 176961 -70875 -348434 37769
15446 -115235 -123256 179419 173061 84846 -80159 282724 26257 63789 -1059 -52851 -183010
15435 -183010 108826 69916 -139095 -89247 -457949 -105138 -159074 411287 172005 37572
15424 5252 170828 -9674 5737 111469 -118020 358731 260004 122073 96943 25476 206350
15413 206350 -52600 -276127 -191226 26287 106975 -101246 -50863 159680 160976 -70098 -63795
15402 -63795 -86356 -213985 -37373 41248 206428 134035 202417 103202 12077 16951 370116
15391C70116j30323h8953D13783B6136d8286o774j26077I0456j2831R8786q5957
15380I0454e5332A1866M1487b2273l86970F6376l2348a3372k28621h4778a8427
15368I9157J76102b68442B3580c05416i4604B1947P445J31433o4548L31873h7541
15356c82416B12023B9388A0805a00292j20109C842g6021p3013f1138A80025e21558
15344i9950F4317b57640A5548a43480C7160J2616O6369j4811J42329a7001k04912
15333b21913G4683h4210B17756b39528A3633P89a9083B85626J84788e5715k54052
15322c09767A408f5692K190a404A66247J76567I6390O5078a74063A72431H1188
15310A03533J6942g1016j91098a13183D26745b7962D0533h5512m1011B42506C6569
$$ plain form
15391 370116 239793 -88953 413783 26136 -48286 -55060 -181137 90456 77625 176411 90454
15380 90454 -55332 11866 53353 -22273 -409243 66376 34028 -13372 -241993 -84778 -18427
15368 99157 275259 -268442 23580 -305416 -94604 21947 29392 160825 96277 428150 -87541
15356 -382416 212023 29388 10805 -100292 -220401 3842 -76021 -149034 -61138 180025 -521558
15344 -99950 64317 -257640 15548 -143480 37160 49776 116145 101334 243663 -17001 -221913
15333 -221913 74683 -84210 217756 -239528 13633 14422 -19083 285626 470414 -55715 -309767
15322 -309767 1408 -65692 -63502 -1404 166247 342814 96390 161468 -174063 172431 81188
15310 103533 120475 -71016 -262114 -113183 426745 -27962 40533 -85512 -126523 242506 36569
15298g9673C8071R9204a23539A1358J86684h6704G0401q171O5021b555k64885
15287b67440B73027b69169A73310R2364C5830L62641a0034m7309G5214d3088A59938
15275B44825A22055m9189b28839E7639O4138a16662H1823J69835e5219p0015G121
15263C48041j30274c37080G0226k4571K8717Q2733a46767G7232j7544b35660a1789
15251B52090A5834c77215C94050K48093J146098n23232m9453J94220F55028A50466
15240A22941B3585b7116B36627f4723A19972P1558C4872a11338B22870r6047m6923
15229G9900l1732L39978a20691E9435L432F677K86295j42041K15772A985J37343
15218A39328j2353a23324B08596B8313K20179a4792k98616o0798a50533A51142
$$ plain form
15298 -79673 38071 137275 -123539 11358 198042 -86704 70401 62230 127251 -2555 -267440
15287 -267440 273027 -269169 173310 265674 35830 398471 -10034 -57343 75214 -43088 159938
15275 244825 122055 72866 -228839 57639 121777 -116662 81823 251658 -55219 -125234 7121
15263 348041 217767 -337080 70226 45655 74372 157105 -146767 77232 59688 -235660 -11789
15251 252090 15834 -377215 394050 642143 1788241 1265009 1215556 1409776 655028 150466
15240 122941 23585 -27116 236627 -64723 119972 191530 34872 -111338 222870 126823 79900
15229 79900 48168 388146 -120691 59435 62867 6677 292972 150931 366703 1985 139328
15218 139328 126975 -123324 208596 28313 248492 -14792 -313408 -374206 -150533 151142
15207H2736a98504e2643j11790g2542C4483Q7662J1893L67071E7857K49236j49448
15196A57645o0546a09032b5043B53214a84374b2472B4686a5365A95599A8588b88611
15184A95381a06845j69109N4362a06563g365j58677C84628j36246I6891B224b91330
15172a47556I7696b05150C21265B8661c47013h3834E3052J89481O1084A8321c650
15160e7448I8152b5091k1189D17137A66041a11318B00129a38375j23152g1481
15149I3684M13134a93791R2378J5605B32403G6745M28082H463L34955p3550F0976
15137C38653E6763d6862A74262J66183A18505K09451k6686m5412M0714G7732L1964
15126A09696A840Q1722A4723a9376M608A74186R0004e2581o5081D38915L15311
$$ plain form
15207 82736 -198504 -52643 -164433 -72542 34483 122145 134038 501109 57857 307093 157645
15196 157645 97099 -109032 -25043 253214 -184374 -22472 24686 -15365 195599 18588 -288611
15184 195381 -106845 -275954 -221592 -106563 -7365 -166042 384628 248382 96891 2224 -291330
15172 -147556 97696 -205150 321265 28661 -347013 -83834 53052 242533 303617 18321 -3650
15160 -57448 98152 -25091 -46280 417137 166041 -111318 200129 -138375 -261527 -71481
15149 93684 506818 -193791 -101413 -85808 232403 76745 504827 8463 343418 269868 60976
15137 338653 56763 -46862 174262 340445 118505 327956 301270 255858 296572 77732 109696
15126 109696 1840 83562 14723 -19376 -14768 174186 264190 -52581 -117662 438915 754226
15115G54226h4012b5228B52203C153a62356B0410j583J78760I7900J35424Q6376
15104C19700a2060l8320C35430E8341J37401J02870F0421J26838P1999B6878K00782
15093B27660A01009Q1400l0044K80220a30230M1174D01346A38271a26786B08856
15082d8278B20030m6465m8678J59116C3801H771L54346b97680A4942L92797K9416
15071D37155H5079K21078P6611a9329N172A22691c9812B46361J19707E8892R3985
15060A52877J95541q4636L1269J19155n0177C6361J21353A7488J82156h5483B84122
15048E53141A90146j4201a32661D18715A29965B8449K41533J8584k8853q406G5526
15036G3777b9743B4653K07636K2768j04723J15324d3838j38978A05417D823K01658
$$ plain form
15115 754226 -84012 -25228 252203 3153 -162356 20410 18827 197587 97900 233324 319700
15104 319700 -12060 -50380 335430 58341 195742 298612 60421 187259 259258 26878 227660
15093 227660 101009 182409 152365 432585 -130230 -89056 401346 138271 -126786 208856
15082 -48278 220030 173565 124887 284003 33801 8771 363117 -297680 14942 407739 437155
15071 437155 85079 306157 382768 -19329 -14157 122691 -39812 246361 366068 58892 152877
15060 152877 348418 263782 295051 414206 364029 36361 157714 17488 199644 -85483 284122
15048 553141 190146 175945 -132661 418715 129965 28449 269982 288566 259713 251307 75526
15036 73777 -29743 24653 232289 255057 150334 265658 -43838 -182816 105417 4823 206481
15025B06481J316B6545b4074D52923B1981N0617J39892q6602J95946A15472J2963
15014A28435m1594L33617j32438d58B00336P1966q3620a90717A86559o4112O4785
15003A87232L3717q7525B4492K83079a81889E47032A46763A425L52675Q4388j25423
14992C13065H7463J03918I3569M45963j19764a12916A96958J53392H2902a2657
14981G7150J87451L4919o6823L01942j63083j43297f5987A81163q986C9995f0070
14969D18529q0663A49596J51425N4376E049J69576K28164o6816N0546J44174j84200
14958C46493r3079Q7907j07335l8084m8864Q0629n7629N3303o6430K12419J03487
14947D72817A21526K39080A21942J93824A4688M26217j50570L451J55197p5456
$$ plain form
15025 206481 207797 26545 -24074 452923 21981 72598 212490 125888 321834 115472 128435
15014 128435 86841 420458 288020 -458 200336 272302 188682 -190717 186559 122447 187232
15003 187232 220949 133424 24492 307571 -181889 547032 146763 1425 354100 438488 313065
14992 313065 87463 191381 93569 539532 419768 -112916 196958 350350 82902 -12657
14981 77150 264601 299520 232697 534639 371556 228259 -65987 181163 172177 39995 -60070
14969 418529 337866 149596 301021 355397 5049 174625 402789 335973 386519 530693 346493
14958 346493 253414 341321 233986 195902 147038 227667 170038 223341 156911 369330 472817
14947 472817 121526 360606 121942 315766 14688 440905 290335 293786 448983 373527
14937C73527k7690A25659M18268A50379K33609j17552q4294K24063r1130o8713
14927B46362K63522j19377j05747N0010A53246K25466I9567J59556r6163K1002
14917A83962L21862B52045K74643j03443k01374Q9450K1320M0786o1290P1208
14907C83345A31116K06336A41927M15083j83061J40615A57457K10506C5035K68592
14897C03627q6416j9959J43673n20J18173R9304B69527N8857J93623B46307J95744
14886D42051j21867L5234M6200A72237H4023K43962L25178k62276A50685Q6336
14876B37021L6958A24678L06296K44584k75215a05067F84791k06043p87A66367
14865F58386Q9447l69436j78608A2116N16912B30200K66970j614N6248B49047
$$ plain form
14937 373527 345837 125659 543927 150379 383988 266436 182142 406205 315075 246362
14927 246362 509884 390507 284760 334770 153246 378712 99567 259123 162960 183962
14917 183962 505824 252045 526688 423245 221871 311321 332641 373427 312137 383345
14907 383345 131116 337452 141927 557010 373949 514564 157457 367963 35035 303627
14897 303627 217211 197252 340925 340405 458578 557882 269527 328384 522007 246307 442051
14886 442051 320184 355418 401618 172237 84023 327985 653163 390887 150685 237021
14876 237021 273979 124678 430974 675558 400343 -105067 684791 478748 477961 166367
14865 658386 747833 378397 199789 12116 529028 230200 497170 495556 551804 249047
14854A05264M50774k43688J79338r0942J97850j92267p7366R0068N3645O2394
14844E35070J1053k00198M7412Q7027B19223J9969J06313L31752k18912K05583
14834F63928j64046j6725B26079K72050L1154P0354l8284j34474j3340K19169
14824F32708j72492Q0201r2226J35139B65263J03582J36883B34261M18730Q241
14814F61232j55001J14993B55920L6760L28479k20766K56570j72673j64954J85441
14804E04777Q8299j82947M9249K31321K45403B67043J49733A91460L73899o1204
14794E04155o8576J01721J21904O9108C39282K17970L14515l53262L17067p175
14784H28397l03955L6662j69393K06612j40994L11021C28343L3859L81054P1794
$$ plain form
14854 105264 556038 312350 491688 400746 598596 406329 328963 419031 472676 535070
14844 535070 546123 345925 393337 480364 219223 239192 345505 677257 458345 663928
14834 663928 499882 483157 226079 498129 529283 599637 561353 426879 413539 632708
14824 632708 460216 540417 448191 583330 265263 368845 505728 234261 652991 661232
14814 661232 506231 621224 255920 292680 621159 400393 656963 484290 319336 504777
14804 504777 593076 410129 459378 690699 936102 267043 416776 191460 565359 504155
14794 504155 435579 537300 659204 728312 339282 557252 871767 518505 835572 828397
14784 828397 524442 561104 391711 598323 457329 768350 328343 362202 743256 815050
14774H15050k72041L11954j90058J42811N635n0372J71810l41364K14840j54030
14764F54235q9803j12922K64326r5112j55285o2785P0996J56871j31802Q4813
14754E83532r7098J35227R4767n3285j35012K96406l88578J50640J42604J31474
14744H60677l08385K69517L9549K21063k74198K16328j82435j91112o4195M24795
14734A011604J21936k09107n8475n5892j02254J10298j12999J05921j59803K75815
14724I27044j50521J83986M1590r3914k36742o888N33147m27278j11379K04232
14714H63277O3049r3178N2461l26532K10053K17083k4730l64010K35800j07491
14704G25782J18935N7327q2256J68801K2075k17311P9678J17961l8755J6785P0019
$$ plain form
14774 815050 543009 854963 664905 807716 813351 762979 934789 593425 808265 654235
14764 654235 564432 451510 715836 620724 465439 402654 473650 630521 498719 583532
14754 583532 486434 621661 716428 663143 528131 824537 435959 586599 729203 860677
14744 860677 552292 821809 861358 1082421 808223 1024551 842116 651004 586809 1011604
14734 1011604 1133540 924433 865958 810066 707812 818110 705111 811032 651229 927044
14724 927044 776523 960509 1002099 908185 671443 664555 1197702 770424 659045 863277
14714 863277 926326 833148 885609 559077 769130 986213 961483 597473 833273 725782
14704 725782 844717 902044 819788 988589 1010664 793353 873031 990992 952237 969022 1039041
14693A039041m48073L38212J49403j58133J0464j72857J81713Q6402J9420J38954
14683A184546l1596j46097j06141L05030k23267P7396K984K08367k36914l57804
14673F76504M84175l02801J75548K90533p7111k85356j20395K26996K42131j89324
14663A120900l4471j4092J52859l10012N564M41323k98836j3731J60203N1686
14653A261393K4754o8419q4685j7963N10678n07834J1570P3576J97293K638l7603
14642A365398k09002J72513j42219J30137R3280j07137J45417k56402J57734j94352
14632A155367N1714n9699L13695M88407p08297M31800l60417L49335m62011M83626
14622A683520j76745J78907l80121L53046J58450k61019L5826o4898k26410J47253
$$ plain form
14693 1039041 590968 929180 1078583 920450 930914 758057 939770 1026172 1045592 1184546
14683 1184546 1152950 1006853 900712 1205742 982475 1059871 1062855 1271222 1034308 676504
14673 676504 1160679 857878 1033426 1323959 1246848 961492 841097 1068093 1310224 1120900
14663 1120900 1086429 1072337 1225196 915184 920748 1362071 1063235 1049504 1209707 1261393
14653 1261393 1286147 1217728 1133043 1115080 1625758 1117924 1129494 1203070 1400363 1403001 1365398
14642 1365398 1156396 1328909 1186690 1316827 1410107 1302970 1448387 1191985 1349719 1155367
14632 1155367 1207081 1147382 1461077 1949484 1241187 1672987 1312570 1661905 1199894 1683520
14622 1683520 1506775 1685682 1305561 1658607 1817057 1556038 1591864 1526966 1300556 1447809
14612A447809j51666K58831J54564k99315K64740j14168p797J74835k98241M34650
14602A864242M5575j03697k14291r3792K20012J15073k46684J42678K9931K31180
14592A990227j71848l19944M17659M006k13266L69068m47681K82639J61414j49512
14582A922762j45258M5591M03306j73865j27987K21734j2921j61330L83085l2809
14572B322308k15132j79430O08102l04387J68021K17686j13310K3883J36610l02601
14562B361750J11293L37296M0370J46382m8734j91783N66245r4403n684O16392
14552C839124O24026L36406Q73308J826308L841546R616050K3366678L031966
14544D7355412B0848550r193016E787923k322201q24899j96856l04536N9418j68029
$$ plain form
14612 1447809 1296143 1554974 1709538 1410223 1674963 1560795 1552998 1727833 1429592 1864242
14602 1864242 1909817 1806120 1591829 1498037 1718049 1833122 1586438 1729116 1759047 1990227
14592 1990227 1818379 1498435 1916094 1920100 1706834 2075902 1628221 1910860 2072274 1922762
14582 1922762 1777504 1823095 2226401 2052536 1924549 2146283 2133362 1972032 2355117 2322308
14572 2322308 2107176 1927746 2535848 2231461 2399482 2617168 2503858 2527741 2664351 2361750
14562 2361750 2473043 2810339 2850709 2997091 2948357 2756574 3322819 3228416 3222732 3839124
14552 3839124 4463150 4799556 5672864 7499172 11340718 20956768 44323446 47355412
14544 47355412 20848550 11655534 5787923 3465722 2640823 2443967 2139431 2198849 2030820
14535B030820K29124m9822l455O7223j76895J54368N2132p1393N4769P2371J96366
14524B555608l4503O6330j26525j01688K52163J71043q4484Q2896K3724R5889
14514B900453K30953n21849J35232Q8732K27842J2458j43746J45395j2516j58077
14504B904877L06727J38345J72119r2267l75960M41584J7814J09812j53724O9970
14494C539297J05777k40980J10631J7501m1814J82100N504m5437L52358q7837
14484C897100L81722n20003M93021r0522k5541q3119J60910K69725k02885J57185
14474D437593p8116J1266Q5119k24423M79026K468l08476M54420J4163J3499K68772
14463E155311k52755J60181K24370j11463m79318M62735N9801J25029J73090p3711
$$ plain form
14535 2030820 2259944 2210122 2206667 2273890 2096995 2251363 2303495 2232102 2286871 2359242 2555608
14524 2555608 2521105 2587435 2460910 2359222 2611385 2782428 2697944 2780840 2804564 2900453
14514 2900453 3131406 2609557 2744789 2833521 3061363 3073821 2930075 3075470 3062954 2904877
14504 2904877 3211604 3349949 3522068 3429801 3053841 3495425 3513239 3623051 3469327 3539297
14494 3539297 3645074 3404094 3514725 3532226 3490412 3672512 3678016 3632579 3984937 3897100
14484 3897100 4278822 3758819 4251840 4161318 4135777 4052658 4213568 4483293 4280408 4437593
14474 4437593 4359477 4370743 4455862 4231439 4710465 4712933 4404457 4858877 4873040 4886539 5155311
14463 5155311 4902556 5062737 5287107 5175644 4696326 5159061 5218862 5343891 5516981 5443270
14453E443270j95965L72628J68853L0695k0861k63164K94686L85255k35857L038
14443E982578K67991J23149m6501j26378K73000l01222P47021m10952N46074k40379
14433F814381J67755K30306J18658j87094r8750Q28354k23909K83109j66147J59944
14423G926607J22300O7126m2667M4558l9006R48731n58907O00618m05534M43758
14413I107584M8518J03606M11058l7472j30594O26384l86389K08998O59048o9498
14403A0541243J50780J50249j9070O09912Q576K98176p7999k6834O18584q094
14393A2245523M08135j05273M85346K06245k27150Q93507Q0773R3854K94025L09398
14383A4684383o7767K52217N06353j03748P72568k4583M58165L61517K24284O75750
$$ plain form
14453 5443270 5247305 5619933 5788786 5819481 5798620 5535456 5830142 6215397 5979540 5982578
14443 5982578 6250569 6373718 6327217 6200839 6473839 6172617 6919638 6508686 7054760 6814381
14433 6814381 6982136 7212442 7331100 7144006 7045256 7873610 7649701 7932810 7766663 7926607
14423 7926607 8048907 8116033 8073366 8117924 8078918 9027649 8468742 9069360 8663826 9107584
14413 9107584 9156102 9259708 9670766 9633294 9502700 10129084 9742695 9951693 10610741 10541243
14403 10541243 10692023 10842272 10823202 11433114 11441690 11739866 11661867 11635033 12253617 12245523
14393 12245523 12653658 12548385 13033731 13239976 13012826 13906333 13987106 14080960 14374985 14684383
14383 14684383 14616616 14868833 15375186 15271438 16044006 16019423 16477588 16839105 17063389 17739139
14373A7739139K35790K31536M70330N3102O13942N38876J40368L08603L93444
14364B0725130M15406N84182M94726J70590O64770N73303K66052R51542L20116
14355B5165817L03082J097110K73075Q48824O31485L85274R32059P48147O18247
14346C1003120Q80672P41915N43165R32596J100009R77662P62228J364933J052821
14337C9359121R60843R13115J281433R67459J362390J544237J423358J349194
14329D9161150J736578J620324J368373K080417J342923K231638J688426K081025
14321F3310854K544654K042626K400086K908661K426333K641633K745388L377484
14313H4397719L446518L063816L847131L518619M173094M144765M736212M640008
$$ plain form
14373 17739139 17974929 18206465 18676795 18729897 19343839 19882715 20023083 20331686 20725130
14364 20725130 21140536 21724718 22219444 22390034 23054804 23628107 23894159 24845701 25165817
14355 25165817 25468899 26566009 26839084 27687908 28319393 28704667 29636726 30384873 31003120
14346 31003120 31883792 32625707 33168872 34101468 35201477 36179139 36941367 38306300 39359121
14337 39359121 40319964 41233079 42514512 43481971 44844361 46388598 47811956 49161150
14329 49161150 50897728 52518052 53886425 55966842 57309765 59541403 61229829 63310854
14321 63310854 65855508 67898134 70298220 73206881 75633214 78274847 81020235 84397719
14313 84397719 87844237 90908053 94755184 98273803 102446897 106591662 111327874 115967882
14305A15967882N245115N076459N659371N673254O747938O419420P165011P775943
14297A65730393P686211Q491816Q391903R666419R853163J0262253J1074686J1674796
14289B42831640J2049061J2586392J3421413J3513511J4107025J4539942J4557156
14282C37606140J4935018J4915951J4797226J4563158J3536447J3180851J2079828
14275D35614619J0658360Q610824O257567K234475K76645n41217j411517l118674
14267D58581082m464130o277123p467526q870482j0390901j2188543j2168824
14260C96753553j4095517j4773577j4724956j5058015j4990127j4850174j3691421
14253B94569766j3187883j3567119j2909831j2232158j1781995j0806236j0794712
$$ plain form
14305 115967882 121212997 126289456 131948827 137622081 144370019 150789439 157954450 165730393
14297 165730393 173416604 181908420 190300323 199966742 209819905 220082158 231156844 242831640
14289 242831640 254880701 267467093 280888506 294402017 308509042 323048984 337606140
14282 337606140 352541158 367457109 382254335 396817493 410353940 423534791 435614619
14275 435614619 446272979 454883803 461141370 463375845 463652490 463111273 461699756 458581082
14267 458581082 454116952 447839829 440372303 431501821 421110920 408922377 396753553
14260 396753553 382658036 367884459 353159503 338101488 323111361 308261187 294569766
14253 294569766 281381883 267814764 254904933 242672775 230890780 220084544 209289832
14246B09289832r876551r511592q728469q501359p796440p808260p210486o604203
14238A43252472n856312n957945n731625n495222m882645n022943m237571l968962
14230A02099247l920807l958578m071172l282844l183969k889921k891769k956723
14222G4943464k679995k486719k334598k432836j890795k354408k183857j686171
14214E6894085j322823j466126k244999j561126j347422j339511j489650r86139
14206D5136289j090852j159737j760009j014003p65035j180853q02511j330069
14198C6033220p52829j103099o58951j025049k14120j154667r15154q61144q28055
14189B8520152n22831o60293n30755q06154l31864o61775m46862q09516n12576
$$ plain form
14246 209289832 199413281 189901689 181173220 172671861 164875421 157067161 149856675 143252472
14238 143252472 137396160 131438215 125706590 120211368 115328723 110305780 106068209 102099247
14230 102099247 98178440 94219862 90148690 86865846 83681877 80791956 77900187 74943464
14222 74943464 72263469 69776750 67442152 65009316 63118521 60764113 58580256 56894085
14214 56894085 55571262 54105136 51860137 50299011 48951589 47612078 46122428 45136289
14206 45136289 44045437 42885700 41125691 40111688 39346653 38165800 37363289 36033220
14198 36033220 35280391 34177292 33518341 32493292 32279172 31124505 30209351 29348207 28520152
14189 28520152 27997321 27337028 26806273 26000119 25668255 25006480 24559618 23750102 23237526
14180B3237526m90668k59094o99196k38406m92041l76581l99365n69328m64939
14171A9247908l65842j05861m25938n78667l83683L2090n51681j29066m33920
14162A6305340k44515l90639r1932l51009J46202r99806K77717l67641m62743
14153A3820974m00713J01831j93558m56877r4720l12252r5714n0802k39080R4428
14143A2173517l48995l59017o2820k40839J37426k45016n98733N6465k22354l31143
14133I958491k97616O1850L93985l41942k67437k36195N08830m93720m17542j63893
14123H704811L96685l90600o2484k79175N261j96280o18965L47719L03156k05028
14113H005100j47587k56401j28395j25085o0885k620P652k44512j73863k01977
$$ plain form
14180 23237526 22746858 22487764 21788568 21550162 21058121 20681540 20282175 19712847 19247908
14171 19247908 18882066 18776205 18350267 17771600 17387917 17420007 16868326 16739260 16305340
14162 16305340 16060825 15670186 15578254 15227245 15373447 14373641 14651358 14283717 13820974
14153 13820974 13420261 13522092 13328534 12871657 12776937 12464685 12368971 12318169 12079089 12173517
14143 12173517 11824522 11465505 11402685 11161846 11299272 11054256 10455523 10511988 10289634 9958491
14133 9958491 9660875 9722725 10116710 9774768 9507331 9271136 9779966 9286246 8868704 8704811
14123 8704811 9101496 8710896 8648412 8369237 8374498 8178218 7559253 7906972 8210128 8005100
14113 8005100 7857513 7601112 7472717 7347632 7286747 7284127 7291779 7047267 6873404 6671427
14103F671427q5415J58894k08845l9814j34070j15968P3149m98761L27699Q4632
14093F232928J44715n33684q5914j3851k235k61937N10658k42439j77275j4174
14083E556792q3204o9188k95280J03836o0795l1469J85775n31846J69002o9981
14073D873642J4336j53542p5725l9541k01464L1249K97895m68047M02517j42612
14063D538708k13233R6099j20104J55610l89772O9498K36011K65962k86376m17523
14053C934880K08323l94870M59387q4513r9162k79817L67479l80644j05950k12386
14043C412727M05575l10940J32749q3819j1378p8259j86989J12283M3147Q9960
14033C525056k93077K57556k79905K25497j13347k20065J22003l0548J02381k41984
$$ plain form
14103 6671427 6586012 6744906 6536061 6496247 6362177 6246209 6319358 5820597 6148296 6232928
14093 6232928 6377643 5843959 5758045 5744194 5741959 5480022 5990680 5748241 5570966 5556792
14083 5556792 5473588 5404400 5109120 5212956 5152161 5120692 5306467 4774621 4943623 4873642
14073 4873642 4887978 4734436 4658711 4619170 4417706 4448955 4746850 4278803 4681320 4538708
14063 4538708 4325475 4421574 4301470 4457080 4067308 4136806 4372817 4638779 4352403 3934880
14053 3934880 4143203 3748333 4207720 4123207 4024045 3744228 4111707 3731063 3625113 3412727
14043 3412727 3818302 3507362 3640111 3556292 3544914 3466655 3279666 3391949 3435096 3525056
14033 3525056 3231979 3489535 3209630 3435127 3321780 3101715 3223718 3193170 3295551 3053567
14023C053567k12095K03345K1993r8935p3770k28386J6070k80503L77915j1930
14013B767271M6041j7973Q6026j75839l57034L24099k45063L83314k56083l44473
14003B210286j32779K95050k63305R5124K88755l46146K4579J14682J9433k88385
13993B017294L54179j19381j08054L05745N09765K797016P415263K2622507J5242043
13984E1036377k4882403j2071358n077040k553926j241674m62975o49146n14107
13976C583748m92404P5439m6899J15663m41923j44641j10568L6364J19214j53601
13966B540392q1222o7452J90009k25111N1598l08844R6884O0369J29834l96947
13956A989510M53686o0515p5090K42528m73962l3924J48343k75994K59901p729
$$ plain form
14023 3053567 2841472 3044817 3066810 2967875 2894105 2665719 2681789 2401286 2779201 2767271
14013 2767271 2813312 2795339 2881365 2705526 2348492 2672591 2427528 2810842 2554759 2210286
14003 2210286 2077507 2372557 2109252 2204376 2493131 2146985 2171564 2286246 2305679 2017294
13993 2017294 2371473 2252092 2144038 2449783 2959548 5756564 13171827 35794334 51036377
13984 51036377 26153974 14082616 9005576 6451650 5209976 4747001 4097855 3583748
13976 3583748 3091344 3166783 3119884 3235547 2793624 2648983 2538415 2574779 2693993 2540392
13966 2540392 2459170 2391718 2581727 2356616 2408214 2099370 2196254 2256623 2386457 1989510
13956 1989510 2443196 2382681 2307591 2550119 2076157 2042233 2190576 1914582 2174483 2166754
13946B166754j37030m9414M8470k5607N2289k49714L79579l46689J86237j16359
13936A908516J26647k13863L26289r31153L60890J33749K3948K60683j18416m0229
13926A837061j8515l6015j36300L78536l35238k8781j52173L22614k56088j8030
13916A557071k96866M60417o8746J97974j10524j83334j59967K1950K3245K13360
13906A654580k60745K08035J2076k43406Q144K14870M556m905q5360l7482K62478
13895A732841m54192j24101j3893K47283J2774l54255N15050J87J79195m21807
13885A319082J04736j32695K96471k67641l01420M15236j18866K08164K8261j43666
13875A407662j64205J96469j04571k3506L71890j85797l36033m28846M21979L29952
$$ plain form
13946 2166754 2029724 1980310 2028780 2003173 2055462 1805748 2185327 1838638 2024875 1908516
13936 1908516 2035163 1821300 2147589 1216436 1577326 1711075 1735023 1995706 1877290 1837061
13926 1837061 1818546 1782531 1646231 2024767 1689529 1660748 1508575 1831189 1575101 1557071
13916 1557071 1260205 1720622 1651876 1849850 1739326 1555992 1396025 1417975 1441220 1654580
13906 1654580 1393835 1601870 1613946 1370540 1378684 1593554 1598110 1593205 1507845 1470363 1732841
13895 1732841 1278649 1154548 1140655 1387938 1400712 1046457 1561507 1561694 1740889 1319082
13885 1319082 1423818 1291123 1587594 1319953 1018533 1433769 1314903 1523067 1551328 1407662
13875 1407662 1243457 1439926 1335355 1311849 1683739 1497942 1161909 733063 1155042 1484994
13865A484994j78508p8702J19517l55779m3660O5940k7698K43486n8407j86144
13855I85039K22430j43935J11285Q6343l91556K11948l09720L10083j24743J54501
13845A111675J9916k80587K35840K29417m18912K95599J18066m0854l33489K13811
13835A150482l04404L35449Q952r7842k93933L41527k94011J44968J7936J97365
13825A206489R6129m58094j0102q0396L44139j66550J85914k41647K75968k3351
13815A128499J99989k39433j98608M0789J93212l47739P3500p4414L19184P1531
13805A166510k59949R4985k34297L04366j07242q7280Q2972k89598K61899M82655
13795A415021n39102K5461M3190j28211K30020k4038k76257J06433k26136J00147
$$ plain form
13865 1484994 1306486 1227784 1347301 991522 947862 1013802 986104 1229590 1171183 985039
13855 985039 1207469 1063534 1174819 1261162 869606 1081554 771834 1081917 957174 1111675
13845 1111675 1131591 851004 1086844 1316261 897349 1192948 1311014 1270160 936671 1150482
13835 1150482 846078 1181527 1190479 1092637 798704 1140231 846220 991188 1009124 1206489
13825 1206489 1302618 844524 834422 754026 1098165 931615 1117529 875882 1151850 1128499
13815 1128499 1328488 1089055 890447 931236 1124448 776709 850209 775795 1094979 1166510
13805 1166510 906561 1001546 767249 1071615 964373 877093 960065 670467 932366 1415021
13795 1415021 875919 901380 944570 816359 1046379 1022341 746084 852517 626381 726528
13785G26528q5062K31923Q4102k63789j56780M75826l34523j11888A60593P5898
13775B36491O30598q8414r9782j30674K01584j62557M09320k01480n6210J95674
13765I34550R690q9100o361j33249N9729K46979j18693j52580o7744J72921O8485
13754I24627p8366r681k14266N9884j71743L51491q3934k0787k660K7293k51048
13743E30810K24932j0586m1639J0627p3424K25378C79541L00978K7893N6598l23121
13732D41889N20354k65389J9432j78255M4336k188L50009j99554K15111j10372
13722H35373j40949l42803L14350j83695q4549r7247J25658P8283M2306L00400
13712H47127C56927J80371J02978J71564C96729A63022M93053j04925M6128K86201
$$ plain form
13785 726528 641466 873389 957491 693702 536922 1012748 678225 566337 160593 236491
13775 236491 867089 778675 678893 548219 749803 587246 996566 795086 738876 934550
13765 934550 944240 855140 848779 715530 775259 1022238 903545 750965 683221 856142 924627
13754 924627 846261 836580 622314 682198 510455 861946 778012 757225 754565 781858 530810
13743 530810 755742 745156 703517 714144 640720 866098 379541 680519 708412 765010 441889
13732 441889 962243 696854 716286 538031 582367 580179 930188 730634 945745 835373
13722 835373 694424 351621 665971 482276 397727 300480 426138 504421 546727 847127
13712 847127 356927 537298 640276 811840 396729 163022 656075 551150 597278 883479
13702H83479m4335o9707l65862L84491j09306k1867j12827j62191J54828p4018
13692D62685M89784l01813l08566L36559J70548o017l12585J61458r2939m4743
13682E54371P8929l2329J11680C25329M74201j07901N8119k04554K66324o3637
13672G47881k78757L60189m00766j51086M82157C43174R7015N545L0884B24216
13661C67741r5831e9679F08605k17929M18232l44602k6373l877P1041O8134k53509
13650C19722K51487B69952K09460l2676K80666k11282K04680B46215N76098j86374
13640F35939K6729k96276J45606j82267o0030J26676J50586k30379K54154I7551
13629E15718j85037J99404r7377l524B07963L31139Q0707B15074N38357B98948
$$ plain form
13702 883479 839144 769437 403575 788066 678760 656893 544066 381875 536703 462685
13692 462685 952469 650656 342090 678649 849197 843180 530595 692053 599114 554371
13682 554371 633300 600971 712651 325329 799530 691629 749748 545194 811518 747881
13672 747881 469124 829313 428547 277461 759618 343174 440189 445734 476618 224216
13661 367741 271910 -59679 608605 390676 808908 464306 437933 434056 505097 573231 319722
13650 319722 571209 269952 479412 446736 727402 516120 720800 246215 822313 635939
13640 635939 662668 366392 511998 329731 269701 396377 546963 316584 570738 97551
13629 515718 330681 530085 432708 429184 207963 539102 619809 215074 753431 298948
13618G45714k53704K3792j25429N2301r3828r8393k6320J21131K57922B73996
13607C53237J12638j09277K9704A84544J86976j13763J89806I7831J94231L49968
13597F42030A42632K79265j55931N6502K3321K23742m8197j74187k97J49833A99278
13585A74677R1282J39905p132q2745o8217M37642A71188J68456R6693A81142L50352
13574E31494j20590j64817I4979P5390J40327Q2895p0766K30354j63581l7525
13564C52073J5768q6616n0356P2497j03877K84956j67540A39185M8681K80392
13554D68258k24468o593J17532P6475q1752J06008P0973o8916j35141K15689m4031
13543D94034j72433j14391K55489c993C54566K16756B18063K87872j36960K16828
$$ plain form
13618 745714 492010 515802 390373 442674 348846 250453 224133 345264 603186 273996
13607 353237 465875 356598 386302 184544 371520 257757 447563 97831 292062 642030
13597 642030 142632 421897 265966 322468 345789 569531 521334 347147 346850 496683 199278
13585 174677 265959 405864 398732 315987 247770 685412 171188 339644 436337 181142 531494
13574 531494 410904 246087 94979 170369 310696 393591 322825 553179 389598 352073
13564 352073 367841 281225 230869 303366 199489 484445 316905 139185 187866 468258
13554 468258 243790 237197 354729 431204 349452 455460 526433 457517 322376 538065 494034
13543 494034 321601 207210 462699 -3993 354566 571322 218063 505935 368975 585803
13533E85803k54797j49765L32998j11035j26020J42503E2546L34727Q8253j3610
13523D61916H3446L53767A42189P3856P2573J54401L7297B23704k3133m9471J84246
13512C35346A63266M1436J0849L05123q3661a24449H39617l02940d7951C73660
13501A78034M6476J42415o7518P8755o8752J52642j85042K50923A61253L17606
13491D78859j13687j39217K01149j05601J1187F8651M93149B13151L87467A54477
13480C43082J60487m1567B14366M7289K01411a18372H7481b46238A83982n0707
13470A33275n8426J99762R538o6112k986O7696K45169k60315L08088j12226A65691
13458B93888K41399B36852k8310Q8205K22699B2348K97973m4711a38917C78790
$$ plain form
13533 585803 331006 181241 514239 403204 277184 419687 52546 387273 475526 461916
13523 461916 83446 437213 142189 216045 288618 443019 480316 223704 200571 151100 335346
13512 335346 163266 204702 215551 520674 437013 -124449 839617 536677 -47951 373660
13501 178034 224510 366925 299407 378162 309410 462052 277010 527933 161253 478859
13491 478859 365172 225955 427104 321503 332690 68651 561800 213151 600618 154477
13480 343082 503569 462002 214366 261655 463066 -118372 87481 -246238 183982 133275
13470 133275 74849 274611 284149 218037 215051 282747 527916 267601 575689 463463 165691
13458 293888 535287 236852 208542 296747 519446 22348 320321 275610 -138917 378790
13447B4733J67715J64261j1099R999m971j66202q4055l1720L9451L77966A92515
13435C61508A16354k5937O1004E9521J07111K5357G7095K67963E780K00780K92180
13424D98740J62432k51862E2322M15276A50645E6617N2560M67672j38194J8957
13414D57612B05113k2538J91645k4054O489c1063D83L68122K24508H8570K66718
13403C55288a38337A60130C7085J0818J91797D5858J22691J42221l6402r0504
13393A83864m1509M55552B29240K3389j22175J50235C3104L91914A15655J35962
13383B51617J40354j71260R6131P2957j45914G8289J59269L56983A85435J29736
13373C15171j55522L29184k20445C3607M10974C1329K25384I2910J08468J7210
$$ plain form
13447 24733 192448 356709 345610 355609 350638 184436 100381 68661 108112 486078 192515
13435 361508 116354 90417 151421 59521 166632 191989 77095 345058 5780 206560 498740
13424 498740 661172 409310 52322 467598 150645 56617 109177 576849 438655 457612
13414 457612 205113 182575 374220 350166 356655 -31063 483 368605 593113 88570 355288
13403 355288 -138337 160130 37085 47903 239700 45858 168549 310770 274368 183864
13393 183864 142355 597907 229240 252629 130454 280689 33104 425018 115655 251617
13383 251617 391971 220711 316842 389799 243885 78289 237558 594541 185435 315171
13373 315171 159649 488833 268388 33607 444581 31329 256713 92910 201378 218588
13363B18588N3775J97303k09124L1672J8802r6064E6160J51500F3867L15671K431
13352C81969n4644E2212K52222Q289J40196A43536C5604L08331M69227C88874
13341E06169r1725l2178p624A70197O6514i9503D21796A64388a31922B05805n9592
13330A46213C972L00754O7802j70060J43230A56852L51975H9378N0318E5185R2770
13319A47955M11372A23406J7414K48502N8706k17917k4194J82288A28149L33229
13309D61378B29434F4408J22940a35367D71794A33847f4033B10206f1309m9220
13299a10529A47592K04791c840C35835f758D76204c6250E75391A47107J08900
13289B56007A3253a02376B34689l0050e6127C44200A38808b6150A71610K50525
$$ plain form
13363 218588 272363 469666 260542 292214 311016 214952 56160 207660 63867 379538 381969
13352 381969 327325 52212 304434 312723 452919 143536 35604 343935 813162 388874
13341 506169 414444 382266 374642 170197 236711 -99503 421796 164388 -131922 205805 146213
13330 146213 3972 304726 372528 202468 345698 156852 508827 89378 139696 55185 147955
13319 147955 559327 123406 140820 389322 448028 230111 205917 388205 128149 461378
13309 461378 229434 64408 187348 -135367 471794 133847 -64033 210206 -61309 -110529
13299 -110529 147592 352383 -3840 335835 -6758 476204 -36250 575391 147107 256007
13289 256007 13253 -102376 234689 204639 -56127 344200 138808 -26150 171610 422135
13279D22135a735H0486a8698A04783E2106J6981b40854c1848A6903Q6074L800
13268A06777B3021Q2870L27461j27407K2413j59786N6677q4039M7379a73315A87755
13256H4668b3417A59188J11770b5985G383M87815A40339G818J20613J61563r6989
13245A93005o1686K7045e3525i609B17066B2177a6932k71068B15303K39071C1420
13233B41203I0890J00594q9836K76044g569C86651F2667J95616J45722j59340
13223B44665m7854A5798O3254e6659l7530r7786E0308B1934K87401j23490O1717
13212B47562a5909A48503j9698J63287C2214L71027P0513a26003F7485b18912
13201B17575A08280C3479f8164A91561Q7185I8842e6054o6408B06089a11750C53095
$$ plain form
13279 422135 -1735 80486 -18698 104783 52106 69087 -240854 -31848 16903 102977 106777
13268 106777 23021 105891 433352 305945 328358 168572 225249 141210 188589 -173315 187755
13256 84668 -23417 159188 270958 -25985 7383 495198 140339 7818 128431 289994 193005
13245 193005 131319 158364 -53525 -9609 217066 22177 -16932 -288000 215303 454374 31420
13233 241203 90890 191484 101648 377692 -7569 386651 62667 258283 404005 244665
13223 244665 196811 15798 79052 -56659 -94189 -191975 50308 21934 309335 185845 247562
13212 247562 -15909 148503 128805 292092 32214 403241 473754 -126003 67485 -218912
13201 217575 108280 33479 -68164 191561 278746 98842 -56054 -122462 206089 -111750 353095
13189D7302J42548e2987B19367o5280b10838M285B59134J7744F1249J41906f5707
13177A48468K311L5729L4132a95575A16873b73376A34643j6981E5256J8785J61548
13166B35589c92624A65599C0286J46545p8208J12157O9677r2337n3476e0932C07559
13154C07719H928L35804e3888H4230j7788N1000J67194I8892K03424H6564r602
13143G6962k1098B2694K68782h8816C69654a19063b9794B47261i832D32098A08948
13131B8112e4617j19477l0253E8037K7813b10790H8193Q5647K26612r6890A38470
13119A15655D5400K62562F6146j2412a31931B62131C3415K5095L49018j12020
13109B95508j40548F0803f2451A80848J67652F7250k3340g5489D6415K61943j01736
$$ plain form
13189 47302 189850 -52987 219367 154087 -210838 -206553 259134 276878 61249 203155 -65707
13177 148468 150779 186508 220640 -195575 116873 -273376 134643 117662 55256 74041 235589
13166 235589 -392624 165599 30286 176831 98623 210780 280457 188120 134644 -50932 307559
13154 307719 8928 344732 -53888 84230 66442 117442 284636 98892 302316 86564 76962
13143 76962 55864 22694 291476 -88816 369654 -119063 -29794 247261 -9832 432098 108948
13131 28112 -54617 -174094 -204347 58037 85850 -210790 88193 173840 400452 303562 138470
13119 115655 45400 307962 66146 53734 -131931 262131 33415 58510 407528 295508
13109 295508 154960 60803 -62451 180848 348500 67250 43910 -75489 46415 308358 206622
13098B06622d1189A59459l3727a5472C28378H4587k7152J45898a5549B19327k4860
13087A94467F39L01582D8051f1491B04311C860J0109a299E80198d03822J87982
13076b15840A85223b95467A86776D6174i9996D53824A03689g5259q1064C15009
13065E9204R4720G4234A8649h8639H5981J94562L21735I5638J17938D2146n125
13054C7021b49420D72922d462B10324P7937F1189d8262j30124g9069O997B50512
13042b56226C81959j27106a34268A27724J02201I0769j7456J88158R666c8838
13031B68402o1499B3128L09484d974E252J83576H7326J74120e3349j95464A55306
13019C05505j37982a709j3949l7576I6586L82989k10977a04883I033J38708P555
$$ plain form
13098 206622 -41189 159459 125732 -15472 328378 84587 57435 203333 -15549 219327 194467
13087 194467 639 302221 48051 -61491 204311 3860 13969 -1299 580198 -403822 -215840
13076 -215840 185223 -295467 186776 46174 -99996 453824 103689 -75259 -156323 315009
13065 59204 153924 74234 18649 -88639 85981 280543 602278 95638 213576 42146 37021
13054 37021 -249420 472922 -4462 210324 288261 61189 -48262 -178386 -79069 -72072 250512
13042 -256226 381959 254853 -134268 127724 229925 90769 73313 261471 271137 -38838
13031 268402 206903 23128 332612 -4974 5252 188828 87326 261446 -53349 -248813 155306
13019 305505 167523 -1709 -15658 -53234 96586 479575 268598 -104883 9033 147741 155296
13008A55296G4826K38559k7550N7773F5J60595e6889j13922A85346l4858a18891
12996A65514f0342A48845C0868c78976a26275B56328n9230q2144b0565n4744a8240
12984A35657F636R5601a32727A41626j35J40012E1175A6429J44964G8584M6672
12973A25256e1874A41568k9104d388E29263A42900a8565E3019J23413M0785G8753
12961B8832K41209J20796A94398g7733C7956a73532D9931L73008d82995H8271
12950a30693c0330B89568a8154j74938e4236D39255A61812G3144N1910a75087
12939h9326B57341a72887B7109K42356A31398I964a73273g9480p5749A39720j5701
12928A24019M347J42597A26807E9206a83952I1094d0966I2222L009P6515a36621
$$ plain form
13008 155296 74826 313385 285835 343608 65 160660 -56889 -170811 185346 150488 -118891
12996 165514 -60342 148845 30868 -378976 -126275 256328 197098 114954 -20565 -75309 -18240
12984 135657 6636 102237 -132727 141626 141491 281503 51175 16429 161393 78584 125256
12973 125256 -51874 141568 112464 -4388 529263 142900 -18565 53019 176432 217217 78753
12961 28832 270041 390837 194398 -77733 37956 -173532 49931 422939 -482995 88271
12950 -130693 -30330 289568 -18154 -193092 -54236 439255 161812 73144 125054 -175087
12939 -89326 257341 -172887 27109 269465 131398 9964 -173273 -79480 -155229 139720 124019
12928 124019 128366 270963 126807 59206 -183952 91094 -40966 92222 95231 171746 -136621
12916H6159N3940l9146c02760A4358L04314A31267J80990a48298G5604K7195a64871
12904a53494M5834F552a5415p5173a8125A06732L2670a25820d4242C05415D2571
12892a88419C80246b843r9083A75110p5208C8280g3505m8678A95068m2069G1539
12880i8610l0171A17780b95878D112a67032j09569B66321A19845O9937K17155
12870D06937R7164A37177a39265l6560A49733c27976B6414a00201l5174k3514
12860a58889b2825p3709j10800M9985C94853a33375f6564D4034a48502A53187
12849c2754C74473A9737a38335A0598h938A27855P5822b698B9861J91782E9925
12837A1438P3873R5033J00920M257c06633A72437b42635i0121j51490B9041J15175
$$ plain form
12916 86159 140099 100953 -302760 14358 318672 131267 312257 -148298 75604 102799 -164871
12904 -153494 -107660 6552 -15415 -90588 -18125 106732 139402 -125820 -44242 305415 42571
12892 -188419 380246 -2843 -101926 175110 99902 38280 -73505 -122183 195068 152999 71539
12880 -98610 -128781 117780 -295878 4112 -167032 -276601 266321 119845 189782 406937
12870 406937 504101 137177 -139265 -175825 149733 -327976 26414 -100201 -135375 -158889
12860 -158889 -22825 -96534 -207334 -157349 394853 -133375 -66564 44034 -148502 153187
12849 -32754 374473 19737 -138335 10598 -8938 127855 203677 -2698 29861 221643 59925
12837 11438 85311 180344 281264 285521 -306633 172437 -242635 -90121 -241611 29041 144216
12826A44216J4295J58241d23782E0030a5993B47902A6032O2655a32317e6908A32580
12814a408H2550b88293d8121n9228H8724O9463J68899D1571J6953b65347D9222
12802i7292l6347B22275p4461a69752q423A54984N9810d61699a40668L6120j11098
12791b15646b1276A48617a23074l9829a4987g328A02954n0872K43782a73020m54
12780a73474l462J2570B62930a34854B18405F8373J5518C492d2666k6922C2386
12768A63199k3344F9031f8470B96265j42831k2593i2654K054o5268j29543A60470
12756b0825C31K55797o3124c41105a41973e3171F8417q705M48072C952d9123E7538
12743A5791O2156l8289M14392b02906g7697p2244B947a69954g2748k9883A78611
$$ plain form
12826 144216 158511 316752 -423782 50030 -15993 247902 16032 78687 -132317 -56908 132580
12814 -1408 82550 -288293 -48121 -107349 88724 158187 327086 41571 58524 -265347 49222
12802 -97292 -133639 222275 147814 -169752 -178175 154984 214794 -461699 -140668 -104548 -215646
12791 -215646 -21276 148617 -123074 -162903 -14987 -7328 102954 52082 295864 -173020 -173474
12780 -173474 -176936 -164366 262930 -134854 218405 68373 83891 3492 -42666 -69588 32386
12768 163199 139855 69031 -68470 296265 153434 130841 -92654 -90600 -155868 -285411 160470
12756 -20825 331 256128 193004 -341105 -141973 -53171 68417 59712 507784 3952 -49123 57538
12743 15791 77947 39658 454050 -202906 -77697 -149941 2947 -169954 -72748 -102631 178611
12731B73393b47079D99259n3478d202k23747J03644B01029B0284a1728C11137
12720a44413A93840p0957k5643E212J00276m126N3726h2866B3995N5567R1277
12709A70839K05948b89682I9358K23514n3585j22961Q2346p9092J15842r8546
12699A66876k9810Q4378j7070o8188e0566C03772j51451L04759H7614g6334q8837
12688a65171E07564C7191K05555h3929j43320H9616r597d8689B43714m3640J69774
12677C69848b7995n5612E7412J40142D5609M45886B31L08353G690d23736a86300
12665e1023A70665a03354N0225A81673f3043C31386I9833J55022n8625J53159
12655C49389A07308l6311J29623n2559a34554G3205a39328A43711e6226C1747
$$ plain form
12731 273393 -247079 499259 445781 -4202 -227949 -124305 201029 20284 -11728 311137
12720 -144413 193840 122883 97240 5212 105488 101362 155088 -82866 23995 79562 170839
12709 170839 376787 -289682 99358 322872 269287 146326 228672 149580 265422 166876
12699 166876 137066 221444 204374 136186 -50566 303772 152321 457080 87614 -76334 -165171
12688 -165171 507564 37191 242746 -83929 -227249 89616 80019 -48689 243714 200074 369848
12677 369848 -27995 -83607 57412 197554 45609 491495 231 308584 7690 -423736 -186300
12665 -51023 170665 -103354 -53129 181673 -63043 331386 99833 254855 196230 349389
12655 349389 107308 70997 200620 148061 -134554 73205 -139328 143711 -56226 31747
12644A43365K51362a55448C37056a06530H2586l4936d30520A26920a5842D27980
12633I6668a12457C35853I5635B161J30477d2661C18496m3631B705g203A56636
12621a7790B74692a83930B32632A06786j702J11400j1540f1047d734D0781Q275
12610D9056J79718J01689a72107G8303a62295B29995a81537A35430P2986K44238
12600D52654I3916j1542R0024L7693K51293l7530F8804K17033Q8214C4764j991
12589C2773J81567p880J57009i7889B10359E3544k6321j1744h1694Q548A38062
12577D1642a07112A13971B067J08558C8596d4395j0754m2473j8207B6935I40c8446
12564d0589o8773G6454J87475o7923a06585d4435A16156d3541q7327C96213B5960
$$ plain form
12644 143365 394727 -155448 337056 -106530 82586 47650 -430520 126920 -15842 427980
12633 96668 -112457 335853 95635 2161 132638 -42661 318496 274865 2705 -7203 156636
12621 -17790 274692 -183930 232632 106786 105084 216484 204944 -61047 -4734 40781 49056
12610 49056 228774 330463 -172107 78303 -162295 229995 -181537 135430 208416 452654
12600 452654 93916 82374 172398 210091 461384 423854 68804 285837 374051 34764 32773
12589 32773 214340 206460 363469 -97889 210359 53544 27223 15479 -81694 -73146 138062
12577 41642 -107112 113971 2067 110625 38596 -44395 -55149 -97622 -115829 26935 940 -38446
12564 -40589 -109362 76454 263929 196006 -106585 -44435 116156 -43541 -130868 396213 25960
12552c1775k44379B19815d4929a9555j14824M3730d832j18730B48661a8598A60223
12540B14749f8140p2551E1435M4021i6527a7054r5896j1043N2991p146J7065F8113
12527a22653B73654J7547q4458j02967g5315G1712a7958A51700e8386A38247n2150
12516H6097l0308a53981C7428J64603E0068a23742E636a47317A25741C4434b19804
12504G0780N0070h3956j45645A90527O8611D3501J50107o4385J86511A23913J78204
12493C02117a08516j51041B2501N3434c06998E8943d6417b0945l03333k7702A38100
12481d0244F4890O3747a89698h9755j8637c6123A16388A9347c9038k33929J20018
12470a52949J0422G5526f8100n661l8955j3849N1837A28708b03278K9550A25387
$$ plain form
12552 -31775 -276154 219815 -44929 -19555 -134379 -90649 -4832 -123562 248661 -18598 160223
12540 214749 -68140 -140691 51435 95456 -96527 -17054 -112950 -123993 -71002 -78148 -61083 68113
12527 -122653 273654 291201 206743 103776 -75315 71712 -17958 151700 -58386 138247 86097
12516 86097 55789 -153981 37428 202031 50068 -123742 5636 -147317 125741 34434 -219804
12504 70780 120850 -83956 -229601 190527 259138 43501 193608 129223 315734 123913 302117
12493 302117 -108516 -259557 22501 75935 -306998 58943 -46417 -20945 -324278 -351980 138100
12481 -40244 64890 128637 -189698 -89755 -108392 -36123 116388 19347 -39038 -272967 -152949
12470 -152949 -142527 75526 -68100 -73761 -112716 -126565 -74728 128708 -203278 -173728 125387
12458A46075A9856a1760A02412e6024k27122A7599J21981C8918a27321C29794
12447h3164H8927R0586a9224B23759d0030A22293i2818q9198I8682a36543a7126
12435H3060J55516I8091a8814B17481i7296B83044c51491b7626j27582B63677
12424a5290C69052a25129C50317k5834c0188A46600l9039a95110D0980K10449
12414B51429g9261B07973c3467k27819K6224B511K12620H8318a87266B38485c4189
12402A82645G1990f7911o3921F1413b53480a07368L3474b4730K172B97810b31780
12390B131K45466a27120j76002F3945a02340j07096A00261e2781B26965c0083
12379A1394a8328A36154b05950N6396E0579A4993b00948B66112H6170b96457f1049
$$ plain form
12458 146075 19856 -11760 102412 -56024 -283146 17599 139580 38918 -127321 329794
12447 -83164 88927 179513 -19224 223759 -40030 122293 -92818 -182016 98682 -136543 -17126
12435 83060 238576 98091 -18814 217481 -97296 283044 -351491 -27626 -155208 263677
12424 -15290 369052 -125129 350317 324483 -30188 146600 107561 -195110 40980 251429
12414 251429 -79261 207973 -33467 -261286 -235062 2511 215131 88318 -187266 238485 -34189
12402 182645 71990 -67911 -131832 61413 -253480 -107368 -73894 -24730 -22558 297810 -231780
12390 2131 247597 -127120 -303122 63945 -102340 -209436 100261 -52781 226965 -30083
12379 11394 -18328 136154 -205950 -149554 50579 14993 -200948 266112 86170 -296457 -61049
12367B12277b99534e9699D88604a41609o446A1971a90931d8579j95382a1576C1488
12355D5946h2013n3743B6614b24311E554Q2335b122D40625A37895a47648A26212
12343D3392b8101k28007i6726d488r0923B15444C3286M0894l1688A080K4710b62760
12330F3395j5321f5853H7043a13797b7645A62657k5886O1155e9828E9848O1465
12319A21313f8350a9747C55d524A89360d1450j6251J6614B5270i1355i069k15920
12307b24989a6721o9973A55786a95511j03964B30345q4288a85081K6248B46832
12296C74049j73153b91958J45739j03893D54455C0843n517Q3203K3635E4314g000
12284b33569h9803B48549l8706o5024K76991F2159L63824m1220j56349F8210O0604
$$ plain form
12367 212277 -299534 -59699 488604 -141609 -148055 11971 -190931 -48579 -243961 -11576 31488
12355 45946 -82013 -135756 26614 -224311 5554 87889 -2122 440625 137895 -147648 126212
12343 43392 -28101 -256108 -96726 -4488 -95411 215444 33286 74180 42492 1080 25790 -262760
12330 63395 48074 -65853 87043 -113797 -27645 162657 136771 197926 -59828 59848 121313
12319 121313 -68350 -19747 355 -4524 189360 -41450 -57701 -41087 25270 -91355 -9069 -224989
12307 -224989 -16721 -86694 155786 -195511 -299475 230345 146057 -185081 -158833 246832
12296 374049 200896 -291958 -146219 -250112 454455 30843 25326 108529 132164 54314 -7000
12284 -233569 -89803 248549 209843 144819 421810 62159 425983 384763 228414 68210 128814
12273A28814J73687m1607G9578i1323A47999n016J7181J41628b70010F5033f2717
12261A73766J38553q7472j07941Q3240D6357J34697n7254C160a50306D29736i3671
12249A33858J37989a93389B82899E5452M7580L1117N6637o4121K19905n0765p2610
12238B23195a70318l774B17888B7615G468c29372B21606K48170A83099f6743D3039
12226B49613A19473c00131A00818J19594G8328P3079L46592I7433L32225I5912
12215A10973k40C2144N8597C1631M65983A94735k0998Q3047o4171i6267F4697
12203A04828N6225K5297e6581J318B00723Q5672F6877J90805C81a964C50301Q725
12191C59026n0652A14821a3040B40200a15324A46289P5336H0843g0755B66253
$$ plain form
12273 128814 302501 260894 79578 -91323 147999 142983 160164 301792 -270010 65033 -62717
12261 173766 312319 224847 116906 200146 46357 181054 123800 3160 -150306 429736 -93671
12249 133858 271847 -193389 282899 55452 103032 134149 190786 126665 346570 295805 223195
12238 223195 -170318 -174092 217888 27615 7468 -329372 221606 469776 183099 -66743 43039
12226 249613 119473 -300131 100818 220412 78328 151407 497999 97433 429658 95912
12215 110973 110733 32144 90741 31631 497614 194735 173737 256784 192613 -96267 64697
12203 104828 161053 186350 -56581 -55263 200723 286395 66877 257682 381 -1964 350301 359026
12191 359026 308374 114821 -13040 240200 -115324 146289 221625 80843 -70755 266253
12180B55771r0816K90378c80883D79899B3459L715P0364h9588j7017q7805g2637
12168d9555F1608g8518D21122A99893G4570J59385R0000j30317b1897k38672I2502
12156f0227A54469J81225j25405c0155F8101B1560J18740c71008a54851A37207
12145C08569b55453F2318R1353J02735g729j11287I1878M1486d9999j59127G8950
12133b54398d1466D64633a12653A64167P5574q3517g0801k34854B8975q813i3731
12121D2501J51803C5488R7404D1335e9694A07801e3243B55134r0875a41606B57111
12109A31279a16355A27199a12975a6767k35542O312J17856k03233F4805J5285
12099H0090a79794d1160j11973A15352J92983b14593A9432d05869B22664a57859
$$ plain form
12180 255771 164955 455333 -380883 479899 23459 27174 97538 -89588 -106605 -194410 -72637
12168 -49555 61608 -78518 421122 199893 74570 233955 323955 193638 -21897 -260569 92502
12156 -60227 154469 335694 210289 -30155 68101 21560 140300 -371008 -154851 137207
12145 308569 -255453 62318 153671 256406 -7729 -119016 91878 133364 -49999 -209126 78950
12133 -254398 -41466 464633 -112653 164167 239741 156224 -70801 -305655 28975 20162 -93731
12121 42501 194304 35488 132892 41335 -59694 107801 -53243 255134 164259 -141606 257111
12109 131279 -116355 127199 -112975 -16767 -252309 -245997 -128141 -331374 64805 80090
12099 80090 -179794 -41160 -153133 115352 308335 -214593 19432 -405869 222664 -157859
12088e4414A75881P0474H8798Q9480a55691j51119e8452b6329F2635a30605C5874
12076F5000a54462A79489a38095A5739J38369J34169M94248J019316M23830G37732
12065A99825K2035b2498r058A75295a16927A32260a31364C22892A50932M6359
12055A97291M2025a33111n1971A18135m0594R5131e7984D9553j8568J48884P6317
12044B56186a5186k30D70394a03717r2731H8974d2472o8618F4199J29537b59798
12032i3839A62366g6884j05663B6567b89611C2518f4695A6700e9215k8760m1560
12021a29535d7114B84490I2463a07776D917J28145l4103N5194a9477o9697O670
12010h2504A24908a60047P7164H6500b7625A69978Q5571A1885M8895k6633J35054
$$ plain form
12088 -54414 175881 246355 88798 178278 -155691 -306810 -58452 -26329 62635 -130605 35874
12076 65000 -154462 179489 -138095 15739 154108 288277 782525 1801841 2225671 737732
12065 199825 221860 -22498 -31556 175295 -116927 132260 -131364 322892 150932 197291
12055 197291 239316 -133111 -185082 118135 77541 172672 -57984 49553 30985 179869 256186
12044 256186 -15186 -15416 470394 -103717 -196448 88974 -42472 -111090 64199 193736 -259798
12032 -93839 162366 -76884 -182547 26567 -289611 32518 -64695 16700 -59215 -87975 -129535
12021 -129535 -47114 284490 92463 -107776 4917 133062 98959 154153 -19477 -89174 -82504
12010 -82504 124908 -160047 -82883 86500 -27625 169978 255549 11885 60780 34147 169201
11999A69201E5680J21854K31347A58840a24152A28771J02162h4075l6083e9118
11988A18799a86706j7331e9114A63987a89924l6717A6106M1188J61409a11719
11977B65921a38881p8543i4439A25945B6105J06842m1818J86027C8579J59042
11967A97621H5625a6124j04327C0522J05108n9979b55510B09107a68756q4163
11957b52919J4532R3971C47163j52843K4064a53955H9045j1985a45055o2390O6310
11946a41135c3952H0527b49746A31083a38443A0590N1326J19437a02037D42463
11935c13642Q5696R3528N235A81795I641f6317G3063R7859o7938R8223b7570j369
11923b8939A6601J11032a02828j60407A9416J1370h0493k9102j07740A86271h8984
$$ plain form
11999 169201 55680 177534 408881 158840 -124152 128771 230933 -84075 -120158 -59118
11988 118799 -186706 -204037 -59114 163987 -189924 -226641 16106 57294 218703 -111719
11977 265921 -138881 -217424 -94439 125945 26105 132947 91129 277156 38579 197621
11967 197621 85625 -16124 -120451 30522 135630 75651 -255510 209107 -168756 -252919
11957 -252919 -238387 -144416 347163 194320 218384 -153955 89045 77060 -145055 -207445 -141135
11946 -141135 -33952 80527 -249746 131083 -138443 10590 61916 181353 -102037 442463
11935 -313642 -227946 -134418 -129183 181795 9641 -66317 73063 170922 102984 201207 -27570 -28939
11923 -28939 16601 127633 -102828 -263235 19416 30786 -80493 -109595 -217335 186271 -88984
11911c23207a07779A16886l5207a43773O9689q2514C4007M0703d2441l1669j22949
11900a97059F3547b18329D349R1613c58561a75808I8194a84085l6802B02516b61639
11888c8171k0995j2888m477a2463H1534a05515C0745d5785A6815J0288P00b12221
11875a13761C0895j1861q285a37548A51594b08817f2362B89632A07563J55530
11865B63093c68320a31161c5203A56296a12481B5459e500E0550J2530k7730d9118
11853A73711b84882I072b31485P8119p3183a07347M9827j09675A23643o1697P2708
11842A34654d2870k07944q1074B24537j5257g6686l88016a45286L1938k33523
11832c46871A12202k7044A9791J233K1778K09878a07024A69440b18745j4711f0996
$$ plain form
11911 -323207 -107779 116886 81679 -143773 -74084 -156598 34007 74710 -42441 -74110 -197059
11900 -197059 63547 -218329 4349 95962 -358561 -175808 98194 -184085 -220887 202516 -261639
11888 -38171 -59166 -72054 -76531 -12463 81534 -105515 30745 -45785 16815 27103 27803 -212221
11875 -113761 30895 19034 10749 -137548 151594 -208817 -62362 289632 107563 263093
11865 263093 -368320 -131161 -35203 156296 -112481 25459 -5500 50550 63080 35350 -49118
11853 173711 -284882 9072 -231485 -153366 -226549 -107347 -57520 -167195 123643 61946 134654
11842 134654 -42870 -250814 -331888 224537 209280 -76686 -464702 -145286 -113348 -346871
11832 -346871 112202 85158 19791 21024 42802 252680 -107024 169440 -218745 -233456 -60996
11820A15983a5267p2097k25644J48944F8243B3479c0453n7513j54518B4829Q6530
11809A11359a97419H31a28776A34475b2699B08020E5681J12819d3846B33779I3822
11797G47b75518A13154M7920l9709N8960d5958C90159D7452a09782j76805B96896
11785B82895a07186j34780j32539B2544L01427A49558Q0660J01202h2489B53025
11774H3604b31324c7286D1761A5038b7632n0136A10497b85194c4830k55021P6697
11763b13154r361B09068I1701b82028b1391R921j14032e9909A11967a95790A2570
11751I5232a42763a7929j04362A77647G640O2527d5874r9808B81031a5686B33557
11739C45310A2065J58868i5996b0286m5108A15677d67527B5180b23624J1520f5448
$$ plain form
11820 115983 -15267 -87364 -313008 -164064 68243 23479 -30453 -87966 -242484 24829 111359
11809 111359 -197419 831 -128776 134475 -22699 208020 55681 168500 -43846 233779 93822
11797 747 -275518 113154 161074 121365 180325 -45958 390159 47452 -109782 -286587 296896
11785 282895 -107186 -241966 -374505 22544 323971 149558 230218 331420 -82489 253025
11774 83604 -231324 -37286 41761 15038 -27632 -77768 110497 -285194 -34830 -289851 -213154
11763 -213154 -222515 209068 91701 -282028 -21391 -11470 -125502 -59909 111967 -195790 12570
11751 95232 -142763 -17929 -122291 177647 7640 70167 -45874 -145682 281031 -15686 233557
11739 345310 12065 170933 -95996 -20286 -65394 115677 -467527 25180 -223624 -212104 -65448
11727i5127a218B02959J7801c5709J3107k8234a8173B19181B8929a49889A34697
11715C73538a33549B28654I2846K8796C4451Q4939K36199Q1036A33341Q9626a75930
11703A52951M5575n5535E4446a41251k14528i1901K8285j5229F3351A6606A056
11691F5843K1739k3335k9469O9964a79566A0340J085L35637A63510d287B5477
11679G1247j2770J25504B5806M7094L526a3693B23197f1020B21943k1505J66766
11668C67204a55995r911A6120J0422a87999A57903F7245a50776C19367I800K01572
11657B11372o3240J39675a3705j51285A09383e8176F6921J31895q0878B1112c2391
11645B02025e9905D87136a49679P0551F5263i9866A66790e605j76634A27877R4320
$$ plain form
11727 -95127 -1218 202959 220760 -35709 -22602 -50836 -18173 219181 28929 -149889 134697
11715 373538 -133549 228654 92846 121642 34451 119390 355589 436625 133341 222967 -175930
11703 152951 198526 142991 54446 -141251 -355779 -91901 -63616 -78845 63351 16606 1056
11691 65843 87582 64247 34778 104742 -179566 10340 11425 347062 163510 -4287 25477
11679 71247 58477 183981 25806 72900 76426 -13693 223197 -61020 221943 200438 367204
11668 367204 -155995 -165906 16120 26542 -187999 157903 67245 -150776 319367 9800 211372
11657 211372 148132 287807 -13705 -164990 109383 -58176 66921 198816 117938 21112 -32391
11645 202025 -59905 487136 -149679 -79128 65263 -99866 166790 -5605 -182239 127877 222197
11634B22197G9718P3579A9172a79214A57209L14536j73871D1493c09933A19207
11623B14128n9655R18F0608a3641q5736K3776k56313f3438n2249D7040a23319
11611D0856a49335C9608a18323n1196D9854O3608K43347k6447a74915B8161O305
11600C4466M6894O4571K45192F1702g1864D80082A53690c9730l4244q7325A27532
11588g1307A05645a08374M539D78644A16783i6003A86802a5419r1551a2834A11410
11576B45154l3335b05823A47882L5251n1873K4330n4905m6057J63036D233M5178
11565D9411R4520n9533c1776j83031C03171j2822a34443C53329F6284O7755J8884
11554A52923a40729B7693J64784b26062d2582B34292a35100A95951a38156C08373
$$ plain form
11634 222197 79718 153297 19172 -179214 157209 471745 297874 41493 -309933 119207
11623 214128 154473 155391 60608 -13641 -99377 -75601 -331914 -63438 -115687 47040 -123319
11611 40856 -149335 39608 -118323 -169519 49854 113462 356809 330362 -174915 28161 34466
11600 34466 81360 145931 391123 61702 -71864 480082 153690 -39730 -73974 -161299 127532
11588 -71307 105645 -108374 -103835 478644 116783 -96003 186802 -15419 -106970 -12834 111410
11576 245154 211819 -205823 147882 183133 131260 155590 100685 54628 217664 4233 49411
11565 49411 143931 84398 -31776 -214807 303171 290349 -134443 353329 66284 134039 152923
11554 152923 -140729 27693 192477 -226062 -42582 234292 -135100 195951 -138156 308373
11543b72696R1159F2112h5616H7769b12975I8938R1133q5830L77591C3347O8817
11532A02164h7346A28773b1082E5701a42917B4480c6828D578c4636A3669J42129
11521A55798a16520A19385b07469C02860G3495M2409a2867k0261E6719J60576
11511B17295g879j26856B60495H5301R5081m3620K63637j85582k8353k2096G8012
11499D7884M84762A83851H7228J79778a42919B72155a87247C5792J69534H0192
11488a86897B39182q5583I931P8764b73I1705P9179a48421B0203K90427i2165
11476B78251K31339j20092m6978j65624k5727L57362j93483a03560A33381Q9653
11466B23034o3375a38023C67455I7956J08951M2241n2508L4066g9490m913C21576
$$ plain form
11543 -272696 -181537 62112 -85616 87769 -212975 98938 190071 104241 481832 33347 102164
11532 102164 -87346 128773 -21082 55701 -142917 24480 -36828 4578 -34636 13669 155798
11521 155798 -116520 119385 -207469 302860 73495 115904 -12867 -33128 56719 217295
11511 217295 -7879 -134735 260495 85301 180382 136762 400399 214817 186464 164368 78012
11499 47884 532646 183851 87228 267006 -142919 272155 -187247 35792 205326 80192
11488 -186897 239182 153599 9931 88695 -273 91705 170884 -148421 20203 310630 -92165
11476 278251 509590 389498 342520 176896 151169 508531 315048 -103560 133381 223034
11466 223034 159659 -138023 367455 97956 206907 249148 196640 230706 -79490 -84403 321576
11454C66437n5903k7700A17688n8285J20065a61122B20675q0386a92881C03374
11443c1294D2552O3395a96548r3584A43200K30072B8609j102g0602A42086a64029
11431A45522B31b78494F654a2448j03610A70289J74861A55439j3303K66129G3526
11419a20647j439B55246h7916B22760j00027k8859f6946k5036A47327c9306j13617
11408a52923f3961A47560E4648J45848A9186P248a03459E25169E0127P1240q244
11397A13123J12497b1061l9632J9418A43577b70520a4241B35015K7406l3716D2550
11385h278A51917h5530J5271d90C67384j81778I1405b21495i7670B16843j3875
11374B02968g7190g139j18791H6108O6681a65230N8244A41973a59723g4224j31339
$$ plain form
11454 366437 310534 282834 117688 59403 179468 -161122 220675 140289 -192881 303374
11443 -31294 42552 105947 -196548 -290132 143200 373272 28609 27507 -70602 142086 -164029
11431 145522 231 -278494 6654 -12448 -116058 170289 345150 155439 142136 408265 73526
11419 -120647 -122086 255246 -87916 222760 122733 93874 -66946 -91982 147327 -39306 -152923
11408 -152923 -63961 147560 54648 200496 19186 26434 -103459 525169 50127 121367 113123
11397 113123 225620 -21061 -60693 -41275 143577 -270520 -14241 235015 262421 228705 42550
11385 -8278 151917 -85530 -70259 -490 367384 185606 91405 -221495 -97670 216843 202968
11374 202968 -77190 -7139 -125930 86108 152789 -165230 -106986 141973 -159723 -74224 -205563
11363b05563G2615e7715B79525b6363A72056m9490J55788j19568c9222q8238D22325
11351A40436a03373P769j52706A13871K09964a72416A78207b40476A05661K6435
11341A32096b35833a14322E3001Q6041a2696I0100J84179A27502r959B5296K46522
11330B71818f360k44309E9874b6384B47040c468k03638b8235C0638L80591C9401
11318C01268h4839m58899A26259k0298a67705B5313c07542g077m5159A00406J27436
11307B27842C3229K2881c13367J44066N7264l4482B0111a75349I7700a59544c6683
11295b91349K8541B03203b42325O510j0891h5793C5070c39953I1218j1448J09233
11284A89003c24053J4785L2482A55685a63965D1723K10069b59267a12183G9249
$$ plain form
11363 -205563 72615 -57715 279525 -26363 172056 122566 278354 158786 -39222 -127460 422325
11351 140436 -103373 -95604 -248310 113871 323835 -172416 178207 -240476 105661 132096
11341 132096 -235833 -114322 53001 139042 -12696 90100 274279 127502 117543 25296 271818
11330 271818 -6360 -250669 59874 -26384 247040 -3468 -207106 -28235 30638 411229 39401
11318 301268 -84839 -543738 126259 105961 -167705 25313 -307542 -7077 -52236 100406 227842
11307 227842 33229 56110 -313367 -169301 -112037 -146519 20111 -175349 97700 -159544 -36683
11295 -291349 -262808 203203 -242325 -235815 -246706 -85793 35070 -339953 91218 79770 189003
11284 189003 -324053 -309268 -276786 155685 -163965 41723 251792 -259267 -112183 79249
11273B61325p5346k005a70757B79737B2964L2676K17256O2360n6928a64659j9100
11262a83759N5144A99295a76648d1092l5469a5539m13316J66695c4816B9971K05492
11251B35463A14421a46523I7850l2587a24285B2999N2227f2274D7036g7620l41025
11240d18645A48340c28787C53055I2476Q9718a03222M9786j20323Q4694F9498
11229c07084A29112a86873F167f5694k55411J39506A69200f2190j7549l42692
11219d22431J99196A22986a24415B36469f07588A29354a27108C8083h9852d1142
11208a5978G1156b59695A24352a9766j10030k91283e5847G630b43836i3825k46379
11197c40204B02524l8184a53360k7250Q4649l74239D9337b57483C14962f1717
$$ plain form
11273 261325 185979 183974 -170757 279737 22964 55640 272896 335256 278328 -164659 -183759
11262 -183759 -128615 199295 -176648 -41092 -76561 -15539 -428855 -262160 -34816 29971 235463
11251 235463 114421 -146523 97850 65263 -124285 22999 75226 -62274 47036 -77620 -418645
11240 -418645 148340 -328787 353055 92476 182194 -103222 -53436 -173759 -89065 69498
11229 -307084 129112 -186873 6167 -65694 -321105 -181599 169200 -62190 -79739 -422431
11219 -422431 -223235 122986 -124415 236469 -607588 129354 -127108 38083 -89852 -41142
11208 -15978 71156 -259695 124352 -19766 -129796 -421079 -55847 7630 -243836 -93825 -340204
11197 -340204 202524 164340 -153360 -180610 -95961 -470200 49337 -257483 314962 -61717
11186b791j37556q2663K7250N8045j41973A05045J43522a76013I1088b19514n1117
11175b70631I1314f8179K6113b378B2558P8783a69235A90398a5211D5193i0890
11163D4733J51199a50518L6367J2235n9310A65496o8783D7479K4547k7387a05762
11151A6200c2789B98995d2101j49476a085j08404A34903d3748l6450L2590A31184
11139a38417A81330a76560E999d41A27246J7661b39957A12626b7022B13754H7721
11127D14728I7675g0924k9327L1443b0910p8674C37306G9183a32668C8398A0293
11115F7621b12483B14807a01544C6891L50226f526C88257A7595L44508A55566
11104D27723a4273E204J73110J23923r8864F4861N37696F2548L13686j85928N6908
$$ plain form
11186 -2791 -140347 -223010 -195760 -137715 -279688 105045 248567 -176013 91088 -219514 -270631
11175 -270631 91314 -68179 -42066 -2378 22558 101341 -169235 190398 -15211 45193 -90890
11163 44733 195932 -150518 -114151 -101916 -161226 165496 96713 47479 72026 44639 -105762
11151 16200 -32789 298995 -42101 -191577 -1085 -109489 134903 -43748 -80198 -47608 131184
11139 -138417 181330 -176560 5999 -441 127246 144907 -239957 112626 -27022 213754 87721
11127 414728 97675 -70924 -100251 -68808 -20910 -99584 337306 79183 -132668 38398 10293
11115 67621 -212483 214807 -101544 36891 387117 -6526 388257 17595 362103 155566
11104 427723 -14273 5204 178314 302237 203373 64861 602557 62548 376234 190306 247214
11093B47214j06407L28495j11301J7092j57409G4898l3491J36222P8574J48034
11083D04237G0147K10938d4437B53833o5268F915L08208h6922C73023j70703C352
11071B38655K3788R0019J67696k28012J21764p4004J68796n9291j1067L03847
11061G42191j79844J56451j35490j1333j52615K88087k93448J50156J01492K43664
11051I09311m02913K40575j25112J88650J56220l99959K13975j0545K3210R5419
11041H88831o9473j66582Q3280k0124J24239j48914J37598j44248R8507l1777
11031G51337j51194J73559l08005K53286j24692k3235K31402J26253k06927q9657
11021F32127k4247J22634C37760P4163J68367K09658Q6236q2350j59732j98434
$$ plain form
11093 247214 140807 469302 358001 375093 217684 74898 41407 177629 256203 404237
11083 404237 70147 281085 -44437 253833 188565 6915 315123 -86922 373023 202320 3352
11071 238655 262443 352462 520158 292146 413910 339906 508702 449411 438344 742191
11061 742191 562347 718798 583308 571975 419360 707447 413999 564155 665647 909311
11051 909311 506398 746973 621861 810511 966731 566772 780747 770202 793412 888831
11041 888831 819358 652776 736056 715932 840171 691257 828855 684607 783114 751337
11031 751337 600143 773702 465697 718983 594291 571056 802458 928711 721784 632127
11021 632127 607880 730514 337760 411923 580290 789948 876184 793834 634102 435668
11011D35668M03203k46577n7788P6195R7128B74572M60538r8369k587j05512L39629
11000H68271k04677M5895k3071m9427M9601l7513J76786J35096k93120p6355J14252
10989G05738J35462l1350j5314J2927L41382k88473N2671J32171J35494J69740
10979A350448K12481J28789J32358K23348M59O04374K00325L71479k52734j49882
10969B821445J90752J6541l02480j5326q17067L0608j65983L52689J65235m63065
10959A813349L02736j26352l13900K23702k26537J76371r8238o77770J77668k41959
10949A009070l20104K59707l29613L4810B4699K45693A22103J52167J37854A47121
10938B48696J8886m264C6704K33945r5056G6204N9237J37241i8030C34104j00975
$$ plain form
11011 435668 838871 592294 534506 610701 707829 274572 735110 636741 634154 528642 868271
11000 868271 663594 709489 686418 636991 686592 649079 825865 960961 667841 591486 705738
10989 705738 841200 809850 794536 807463 1148845 860372 913043 1045214 1180708 1350448
10979 1350448 1562929 1691718 1824076 2047424 2047883 2652257 2852582 3224061 2971327 2821445
10969 2821445 3012197 3028738 2726258 2710932 1893865 1924473 1758490 2111179 2276414 1813349
10959 1813349 2116085 1989733 1675833 1899535 1672998 1849369 1751131 1073361 1251029 1009070
10949 1009070 688966 948673 619060 653870 24699 270392 122103 274270 412124 147121
10938 248696 267582 263318 36704 270649 175593 76204 135441 272682 -98030 334104 233129
10927B33129A7002K1621K2756h1988A39911J89987B1754K12163I7683b13086b0913
10915B6555d4099J7477j6311B29558g710G8868L3403R9346i5256I9486l0290j5183
10903E4013c43219J71375b4361j71044B2175Q9116b69490B80520r402g7145D3319
10891A01257e4409A04147b10608j4489A09812M714n3501i0698c4512k54862A2428
10879a91077q519g5555c2237C8064Q8641a38856I6498a75866B19356b31809E6034
10867A24294a73638g1160D4813K42714C9347c8253B57946c6329B07509a17937
10856a32515D6402J28346a49940B00964q1481a94064A27008a03357A42130o2990
10846G9140O9605a19935G6812b01149I682a39071f7277A07622N4523a9758C46664
$$ plain form
10927 233129 17002 38623 61379 -81988 139911 329898 21754 233917 97683 -213086 -20913
10915 26555 -44099 -26622 -42933 229558 -7710 78868 112271 211617 -95256 99486 69196 54013
10903 54013 -343219 -171844 -24361 -195405 22175 111291 -269490 280520 271118 -77145 43319
10891 101257 -54409 104147 -210608 -225097 109812 114526 61025 -90698 -34512 -289374 12428
10879 -191077 -199596 -75555 -32237 38064 126705 -138856 96498 -175866 219356 -231809 56034
10867 124294 -173638 -71160 44813 287527 39347 -38253 257946 -36329 207509 -117937
10856 -132515 46402 174748 -149940 200964 119483 -194064 127008 -103357 142130 79140
10846 79140 148745 -119935 76812 -201149 9682 -139071 -67277 107622 162145 -19758 346664
10834B00668a51529A19991g0948A28058E7770a0653B32109J31197i0105j51016
10824b41121R3849M2712L4817j1573q6596A69136f4744A1641a33804l3018b332
10812c1207I384a70354M2589j01138E8401b7326M668B46809F323M0681b18783
10800a09200k345B676K5910k000b88824a6542q874j56080P3624j52913a11536
10788a98503i8140A18015K74758b28683A09191k8839f9604J5717r1666G0432f8272
10776a00223l6745l94233b05422b900l6968B4223Q7243a99418A30868a52388o562
10765a58950k90279b1390j88145A8612a21917K7863q4153A80085a29401I0812
10754A33155a61031G5345a66603b8666G5750J0718a22095k3279B93791F4707K5409
$$ plain form
10834 200668 -151529 119991 -70948 128058 57770 -10653 232109 363306 -90105 -241121
10824 -241121 -147272 -104560 -69743 -81316 -167912 169136 -64744 11641 -133804 -166822 -2332
10812 -31207 9384 -170354 -127765 -228903 58401 -27326 -22658 246809 6323 47004 -218783
10800 -109200 -111545 2676 28586 26586 -288824 -16542 -25416 -181496 -107872 -260785 -111536
10788 -198503 -98140 118015 392773 -228683 109191 80352 -69604 -53887 -145553 70432 -68272
10776 -100223 -136968 -531201 -205422 -2900 -39868 24223 111466 -199418 130868 -152388 -158950
10765 -158950 -449229 -21390 -209535 18612 -121917 -94054 -178207 180085 -129401 90812
10754 133155 -161031 75345 -166603 -28666 75750 86468 -122095 -145374 293791 64707 90116
10743I0116A3059i7956L3555A20571Q0950B6592c58275J04414F9856e8481j21182
10732a79663e7778C8856K40979h9495j21466N6698A21390i6076l1427k2796E5085
10720I8672F336M7857J10870J3404q1315a780I3626f7031k60947B69779c24420
10708A21965a81881A84011J95947I54g6570k18248C8717j1200e7511k1468A5935
10696b39378j1006D5330B596K1648M3951i7338o570b8244n5640K5039j12559k648
10684a74052l0991B82967H2001c15910a10643N380k87622A86301g8080F3898h7086
10672E3890b58613G6961b72211m7177A65632a67039J4402g1078n4365r1990A88456
10660b02098P2568o493O5655j59738Q8921b9822G2728b16422L4327K7138K5605
$$ plain form
10743 90116 13059 -97956 -64401 120571 201521 26592 -358275 -253861 69856 -58481 -179663
10732 -179663 -57778 38856 279835 -89495 -210961 -154263 121390 -96076 -127503 -150299 55085
10720 98672 6336 54193 165063 178467 97152 -1780 93626 -67031 -327978 269779 -324420
10708 121965 -181881 184011 379958 954 -76570 -294818 38717 27517 -57511 -78979 15935
10696 -239378 -250384 45330 2596 24244 68195 -97338 -103908 -28244 -83884 -58845 -171404 -174052
10684 -174052 -205043 282967 82001 -315910 -110643 -105263 -392885 186301 -78080 63898 -87086
10672 53890 -258613 76961 -272211 -319388 165632 -167039 -152637 -71078 -125443 -217433 188456
10660 -202098 -129530 -136023 -70368 -230106 -141185 -29822 72728 -216422 -182095 -154957 -129352
10649a29352k6907A05957a46975A08303a66886A29717D6278J1764K95157a57311
10638d4869A44782J43706C2872a35586B22470c5939A0089g6512D6455a32939A94401
10626G8180O5786d17836B17214b95344E8401a25318c5907p3401a568A35491h4499
10614b70938D9809a35746j05701I0660D2368f9522B75563P3674a5760k503m8842
10603f7105G6501J2050Q5514b84109c8540E3844a05368k31496c0198n5659K7479
10592e8378A50848i7181L3995J3590n4809D417b32256J15782j94781B71928K8560
10581C00488g099C56861a26245j41774a32962n4503D3492K0000c26990c1999k76206
10570c08205k7309K6565J26837n6919i9469I7765a04145D8653c7770A4066a97514
$$ plain form
10649 -129352 -156259 105957 -146975 108303 -166886 129717 46278 58042 353199 -157311
10638 -44869 144782 288488 32872 -135586 222470 -35939 10089 -76512 46455 -132939 194401
10626 78180 143966 -417836 217214 -295344 58401 -125318 -35907 -109308 -1568 135491 -84499
10614 -270938 49809 -135746 -241447 90660 42368 -69522 275563 349237 -15760 -18263 -67105
10603 -67105 76501 88551 174065 -284109 -38540 53844 -105368 -336864 -30198 -85857 -58378
10592 -58378 150848 -97181 -63186 -49596 -104405 4417 -232256 -116474 -311255 271928 300488
10581 300488 -7099 356861 -126245 -268019 -132962 -187465 43492 63492 -326990 -31999 -308205
10570 -308205 -335514 -308949 -182112 -239031 -99469 97765 -104145 48653 -37770 14066 -197514
10558a6674l09990B67240F7223a0299A01570a7386l86757a75632F7718C1103g1859
10546i325B01556b19471B6833i2471D8598i0048b8617k07186H636a72391C5813
10534b63349b1399q7423B28921c37829I8035D7826a80221A21013c36283C5827
10523E3848a75306h5234B72434D2456a36430j2896c7828E7524f2970m305j4269
10512h1544A77935a77563F3124B466L94889a98056e534n3006j31580f4807B53948
10500C01984F6043Q2446a0613l64893A38555a65045B29308A2672f8153H7373b17799
10488a46185A34545a04091M3609H9780k0029a12427E44330r1133J94784j16435
10478E31546P6745r5109I890J41196h100H9085a04842p3533A28835j108J0109
$$ plain form
10558 -16674 -326664 267240 67223 -10299 101570 -17386 -404143 -175632 67718 31103 -71859
10546 -9325 201556 -219471 26833 -92471 48598 -90048 -28617 -235803 8636 -172391 35813
10534 -263349 -21399 -108822 228921 -337829 98035 47826 -180221 121013 -336283 35827
10523 53848 -175306 -85234 272434 42456 -136430 -149326 -37828 57524 -62970 -67275 -81544
10512 -81544 177935 -177563 63124 2466 397355 -198056 -5534 -58540 -190120 -64807 253948
10500 301984 66043 148489 -10613 -375506 138555 -165045 229308 12672 -68153 87373 -217799
10488 -146185 134545 -104091 -60482 89780 69751 -112427 544330 453197 647981 531546
10478 531546 608291 513182 9890 151086 -8100 89085 -104842 -178375 128835 127727 137836
10467A37836a01982F8748a54963j8666g7772k85153J19847R9764k28853a464j10127
10456a11591c761A3016L2311d0407k69112B56762d5148l694m4293J0030r4697
10445a77802B6804R3951c0199C1774c3629A94085q1735D0183J53057f5673o5765
10434a31438k53348g972k68736d8156r6468B7867d7660q8603f0383F1226J8498
10423G9724b99703d5432A1259M4881J9624Q1580m6565n0326J09321a32176F8036
10411b56894a16108M3159B23257A167d7256H8395a92662k44066J49283F2292d20137
10399A22554R3057l4008a65557A57269g1134B54902A05301K67479A80926p7313
10389A03613L27376j57004a35734A84174i5742E3402L42191A59421J21575E9960
$$ plain form
10467 137836 -101982 68748 -154963 -173629 -77772 -362925 -243078 -143314 -372167 -1464 -111591
10456 -111591 -3761 13016 45327 -40407 -309519 256762 -45148 -48842 -93135 -83105 -177802
10445 -177802 26804 120755 -30199 31774 -33629 194085 112350 40183 193240 -65673 -131438
10434 -131438 -384786 -7972 -276708 -48156 -144624 27867 -47660 -136263 -60383 61226 79724
10423 79724 -299703 -45432 11259 56140 75764 157344 110779 60453 169774 -132176 68036
10411 -256894 -116108 -72949 223257 1167 -47256 88395 -192662 -436728 -287445 62292 -420137
10399 122554 215611 181603 -165557 157269 -71134 254902 105301 372780 180926 103613
10389 103613 430989 273985 -135734 184174 -95742 53402 395593 159421 280996 59960
10378a56621E2751J38045m9794Q9313m5722J68554K0543j1652p4355J76990q3148
10367C81525A61519K57503l1367m8476J68964A14290K3066i740A98141F4006R7548
10356A61554O9899n630o5057L18645B35836L18789O5038q8813L1717j96562H3127
10344D72538A91632L40215B54892c0622C32516p2967r170J26603A03927a8929
10333A36436a1927j84932A37446R4139L9716C7950Q6262J37456P9917c05107C54426
10321A79555R5266l0269D3957P5284a07527J0864A27845e1446b1268I7253a94379
10309A07293C883L261a36173A35651o5056A1440a82320c4166B7829J38723d81493
10297B46821h9607D1316K68758A13993b41906c7r7272M6911j17733G6718a65538
$$ plain form
10378 -156621 52751 190796 141002 230315 184593 353147 373690 362038 287683 464673 381525
10367 381525 161519 419022 387655 339179 508143 114290 137356 -9740 198141 64006 161554
10356 161554 231453 225823 160766 479411 235836 554625 619663 530850 562567 366005 83127
10344 472538 191632 531847 254892 -30622 332516 259549 250379 376982 103927 -18929
10333 136436 -11927 -196859 137446 231585 271301 37950 124212 261668 341585 -305107 354426
10321 179555 274821 244552 43957 119241 -107527 -96663 127845 -51446 -21268 97253 -194379
10309 107293 3883 7144 -136173 135651 70595 11440 -182320 -34166 27829 166552 -481493
10297 246821 -89607 41316 310074 113993 -241906 -37 -97309 -50398 -168131 76718 -165538
10285H6221e8890B26740E0640Q0663e0074o2222l32785i0755d2935K73k94698
10274c37360C84661F7385D817i1635b8207n3848A39171b5516A21493h2037A14744
10262G5416R7113q4195L83280A70481P216G1760J89833B4360K10460f4870A3249
10250G030a50049G1014L1814a0904B56171k5689b23422L5103H0072a88063A92739
10238h9291a1691I8244g7441B81447b97905I4504b29455C74236h9903j99643A31438
10226b56674J22026B94523a28745j4545A09318A1694Q1267a30409j2016q2905
10216b25330J3052h3878n0550C2660f470A3679c71j11603j13856H9377a86724
10204A02866b61141A03972b86699E7860b28769k4618O1481J6738j8168C4326a40191
$$ plain form
10285 86221 -58890 226740 50640 131303 -50074 -112296 -445081 -90755 -42935 -42662 -337360
10274 -337360 384661 67385 4817 -91635 -28207 -82055 139171 -25516 121493 -82037 114744
10262 75416 172529 88334 471614 170481 177697 71760 261593 24360 234820 -64870 13249
10250 7030 -150049 71014 102828 -10904 256171 230482 -223422 -188319 80072 -188063 192739
10238 -89291 -11691 98244 -77441 281447 -297905 94504 -229455 374236 -89903 -289546 131438
10226 -256674 -134648 294523 -128745 -143290 109318 11694 92961 -130409 -142425 -225330
10216 -225330 -212278 -83878 -134428 32660 -6470 13679 -371 -111974 -225830 89377 -186724
10204 102866 -261141 103972 -286699 57860 -228769 -253387 -191906 -175168 -193336 34326 -140191
10192b69643B08628d6317J4316l97915a02777r2853D7726b42637i1891j01223
10182a93114F2762b20113A88930c52185i8497A26314F2145b87257G3467J1134
10172H4601b42099A31968a96563J5781Q5957k15166A30616C0752J1624J0288a59017
10160a49642k08063a52011b4464j99576p3388h0623p4346a3128o7323j18914h6463
10148G3873c7519j62760B03470c57099b0436A8900i1913j32493C38403b44302
10137A99816p8762C066a09929j8023d9896r4133M2406A63033B8747h5195B88629
10125b78649J36672l320B9586c56726b8285k64179A69324C4085J8164J37185F7809
10113A56154b21915e5864E6319f2629n4386l105k3004A83247b53034E9436e2380
$$ plain form
10192 -269643 208628 -46317 -32001 -429916 -102777 -195630 47726 -242637 -91891 -193114
10182 -193114 62762 -220113 188930 -352185 -98497 126314 62145 -287257 73467 84601
10172 84601 -242099 131968 -196563 -180782 -94825 -309991 130616 30752 42376 52664 -159017
10160 -149642 -357705 -152011 -24464 -224040 -297428 -80623 -154969 -13128 -80451 -199365 -86463
10148 73873 -37519 -200279 203470 -357099 -20436 18900 -91913 -224406 338403 -244302
10137 199816 121054 3066 -109929 -127952 -49896 -144029 -101623 163033 28747 -85195 288629
10125 -278649 -141977 -145297 29586 -356726 -28285 -292464 169324 34085 52249 189434 67809
10113 156154 -221915 -55864 56319 -62629 -117015 -120120 -143124 183247 -253034 59436 -52380
10101A59738a70437B0406J57015P1798a13277A49649c44523a28569B25215j10870
10091A14345C4229b501A7569b69504a17211l1860j20255D7667c62079a7673G0058
10079b11j0100l04853B6204a58487A58779j5677c38499k6075A15768g639B05280
10067a77071P2079F7619a66195C6230b7720C5904K66244a4468k48652g1674r1332
10056a63006F3028c6786m5090e065D8545A8967J28876e4456a1189D7959h7512
10044a34115B66081E4819d76615F0263H570a04006j77653A51851a85265q691H1319
10032F8825J55145F9870R8337J53025a968F293a83183k79523a59168j0545j26509
10021b96222A8603a15623H207Q6561a16827K980k78952h8101J1388A13629a36445
$$ plain form
10101 159738 -170437 20406 177421 249219 -113277 149649 -344523 -128569 225215 114345
10091 114345 34229 -2501 17569 -269504 -117211 -149071 -269326 47667 -362079 -17673 70058
10079 -211 -10311 -315164 26204 -158487 158779 143102 -338499 -364574 115768 -7639 205280
10067 -177071 -104992 67619 -166195 36230 -27720 35904 302148 -14468 -263120 -71674 -163006
10056 -163006 63028 -36786 -81876 -5065 48545 18967 147843 -54456 -11189 47959 -87512
10044 -134115 266081 54819 -476615 60263 8570 -104006 -281659 151851 -185265 -193956 81319
10032 68825 223970 69870 168207 321232 -1968 6293 -183183 -462706 -159168 -169713 -296222
10021 -296222 18603 -115623 8207 94768 -116827 -113847 -392799 -88101 -76713 113629 -136445
10009a99120A54801K4207E0063E664b79068D8829G875c11393a42225F2159a96438
9997b74116J15311P201k3044e7156j20537N2829n5357c2034l3895K5285B41122
9985b6305o8345j47492j62813a81912L249h7454m7060p8708B86415h9986L0004
9974e9982D111c3851j96757H7576N9540J12586c1409j12814L4549A26339K35072
9963C61411b14607F4250J20636F5104L2622a46535c1705A27441a53841L1079E59
9951h9076k58740a280j21278k80346a94651k8537J8599j7079i673o2627K217j64337
9939b34420B7748h2986n8983d3351k60351n1545B38872a25353J0008l38287B47720
9927B2440a57503f6216O80B9821P4204k7640K3948c6828D1080F347i5782A06697
$$ plain form
10009 -199120 154801 179008 50063 5664 -279068 48829 7875 -311393 -142225 62159 -196438
9997 -274116 -158805 -151604 -174648 -57156 -177693 -124864 -180221 -32034 -65929 -40644 241122
9985 -26305 -94650 -242142 -404955 -181912 -178663 -87454 -134514 -213222 286415 -89986 -59982
9974 -59982 4111 -33851 -230608 87576 147116 259702 -31409 -144223 -109674 126339 361411
9963 361411 -214607 64250 184886 65104 97726 -146535 -31705 127441 -153841 -122762 559
9951 -89076 -347816 -1280 -122558 -402904 -194651 -223188 -204589 -221668 -9673 -72300 -70083 -234420
9939 -234420 27748 -82986 -141969 -43351 -303702 -355247 238872 -125353 -115345 -453632 247720
9927 22440 -157503 -66216 -65536 29821 104025 76385 100333 -36828 41080 6347 -95782 106697
9914a46989A25288c6090l412r128o0164k1436r5011b0280l04204j6406d6353k21136
9902b67489m5725B03003c22820b581l71033a39746A2181d45315A90257p5462J58310
9891B73105f9140n7612B890b20458E709J72453a12602j25442J17364C2484i2460
9879b41712P365Q3985B58828c75535g1819o8107r6608Q7473C41065a69283J919
9868a67364h1682j17690a6783k2884k05520B57033g5694B25955B4989g7821i829
9856i7747m3046p208C7299h3371l2512D3118R041a9536l2144k24567f1664m46996
9844e08660C23500f4879l3097B59653b2546F4758b98084a0064l88530A7168a83705
9832c18997a4985p0344A85871c58951K635J74404k5304j40466f8791L4238G9005
$$ plain form
9914 -146989 125288 -36090 -39502 -48630 -108794 -130230 -225241 -20280 -324484 -340890 -46353 -267489
9902 -267489 -313214 203003 -322820 -2581 -373614 -139746 12181 -445315 190257 114795 273105
9891 273105 -69140 -126752 2890 -220458 5709 178162 -112602 -238044 -120680 32484 -92460
9879 -241712 -234347 -150362 258828 -375535 -71819 -139926 -236534 -149061 341065 -169283 -167364
9868 -167364 -81682 -199372 -16783 -39667 -245187 257033 -75694 225955 24989 -77821 -9829
9856 -97747 -140793 -148001 37299 -83371 -115883 43118 52159 -19536 -51680 -276247 -61664 -508660
9844 -508660 323500 -64879 -97976 259653 -22546 64758 -298084 -10064 -398594 17168 -183705
9832 -318997 -14985 -85329 185871 -358951 -356316 -181912 -207216 -347682 -68791 -34553 79005
9820C22488c6353H9382C2433b8877H276b62017B31957C2209a08705o6138j95027
9809c69870a51726c912A3566d70104C7917R8025a82869j1734o9530m212B38397
9797i5407A81455e63567a89593D212J09155a48335D56044j99612a71253P6327
9787i4926d5565Q783p951A02875F900b30349n2780B72449j21151E4775a61103
9775A42340L0521d0188j6194a4249q1858r0565J3856j23666B50491C442b97793
9763b1440C732J37127Q2886c26673A2542r44c8783J006F0651i8501m8265n3315
9751b00081C1903a74602O3489F4720a50867C3828f075K17m3394A61133J73536
9740C34669e2216C1283Q773P9986b53151b1405j41698j69845J9072A3881b18478
$$ plain form
9820 322488 -36353 89382 32433 -28877 8276 -262017 231957 32209 -108705 -174843 -369870
9809 -369870 -151726 -3912 13566 -470104 37917 135942 -182869 -194603 -264133 -268345 238397
9797 -95407 181455 -563567 -189593 4212 113367 -148335 456044 256432 -171253 -94926
9787 -94926 -45565 -36782 -44733 102875 6900 -230349 -283129 272449 151298 54775 -161103
9775 142340 172861 -40188 -56382 -14249 -96107 -186672 -172816 -296482 250491 3442 -297793
9763 -21440 3732 140859 223745 -326673 12542 11598 -38783 -37777 60651 -98501 -146766 -200081
9751 -200081 31903 -174602 -111113 64720 -150867 33828 -6075 -5858 -49252 161133 334669
9740 334669 -52216 31283 40056 120042 -253151 -21405 -163103 -332948 -313876 13881 -218478
9728d97430A13886J22573e507A74232O0731e3562B53104A25104f8784B78286b9878
9716b83829i3690l9027A2181c007A40217G007K89286F0411d16734d0140m7503
9705h7643A11665a19552r9281D2411L42696d0065C6134d00395C2897c66063A34948
9693H4497c10146k18398K21914P6067h9898L1268j82700C8285g6492k93652I0516
9681a47600b0729A5486a77929A6396J69972b8220A7137d84557A86288f1878j38813
9670b00691C9741j9833R359a15353j09057D6532b86931H474Q1100l1931a08422
9658a8577A08115c7929p84A36862b03746A93318b05179J3452G895a54139g1827
9646a9324A72434a78986Q1729r7256j66357n2505C5653d898F4960P5103a68076
$$ plain form
9728 -497430 113886 236459 -5507 174232 234963 -53562 253104 125104 -68784 278286 -29878
9716 -283829 -93690 -132717 12181 -3007 140217 7007 296293 60411 -416734 -40140 -87643
9705 -87643 111665 -119552 -218833 42411 385107 -40065 36134 -400395 32897 -366063 134948
9693 84497 -310146 -528544 -306630 -230563 -89898 -58630 -241330 38285 -76492 -370144 90516
9681 -147600 -20729 15486 -177929 16396 186368 -28220 17137 -484557 186288 -61878 -200691
9670 -200691 39741 19908 29267 -115353 -224410 46532 -286931 8474 89574 57643 -108422
9658 -18577 108115 -37929 -38713 136862 -203746 193318 -205179 -191727 7895 -154139 -71827
9646 -19324 172434 -178986 -97257 -194513 -360870 -413375 35653 -4898 64960 140063 -168076
9634c30929B5951a34679B07546a59624d2826A85579R0406a56409n9799O9008f6044
9622a43898D6098J16160a89232K4525j19428J11520e5134F2641b16102m9604C4780
9610a9299j56308C3707h2081A8712e1423j55723I1353C8012b48541b0497m31291
9599d51788b18507E7683g8052q9975A12325d50763a90222g7014k113b900j24264
9588a27164K014f1522l62615J80072a15084M8845j76219h0884A3576j701a71642
9576a53217A36716c97625H7288c17145o894j14133A6053g0677j51230B16003a79845
9564e8864l9583k46805a51742j68665A43031h6688M3229A628K80842b33477B30569
9552a2232C2602N0283e9110A66614g4626E5240n493a60607e7943j59871G0221
$$ plain form
9634 -330929 25951 -134679 207546 -159624 -42826 185579 275985 -156409 -216208 -147200 -66044
9622 -143898 46098 162258 -189232 -164707 -284135 -172615 -55134 62641 -216102 -265706 34780
9610 -19299 -175607 33707 -82081 18712 -51423 -207146 91353 38012 -248541 -20497 -451788
9599 -451788 -218507 57683 -78052 -168027 112325 -450763 -190222 -77014 -79127 -2900 -127164
9588 -127164 -125150 -61522 -424137 -244065 -115084 -66239 -242458 -80884 13576 11875 -171642
9576 -153217 136716 -397625 87288 -317145 -324039 -438172 16053 -70677 -221907 216003 -179845
9564 -58864 -98447 -345252 -151742 -320407 143031 -86688 -43459 1628 282470 -233477 230569
9552 -12232 32602 82885 -59110 166614 -74626 55240 49747 -160607 -57943 -217814 70221
9540g5568A16926k2866g8567q1525d3778A6125P0560i7609c2881j21883B9201
9528A09278b74346B68927A2119O600K15718p7375L8120c1915k64247r1190J84107
9517b03245L4373A83180a70175A02554a76939k08210f8017J4395j12832K1382
9507a45072C47108A00070c94391F9940e8838l8417A04490a58387C0355J91951
9497B22306d5377p1962J8500r2727A0216R9311c06446c6257F9457b35022k4298
9486b59320d2366h275k26045i7568B54755b0466A56014g2747B09808B2949a12109
9474a24453p8272A82722H6745b89485G2227e8205A36940j3438E5021c3912j11447
9463a45359o3294B3389L3818a72166P0676H2974b57416P3114A79207a33423H0246
$$ plain form
9540 -75568 116926 94060 -78567 -160092 -43778 16125 86685 -97609 -32881 -154764 29201
9528 109278 -274346 268927 12119 18719 234437 157062 195182 -31915 -296162 -387352 -203245
9517 -203245 -168872 183180 -170175 102554 -176939 -385149 -68017 -53622 -166454 -145072
9507 -145072 347108 100070 -394391 69940 -58838 -97255 104490 -158387 30355 222306
9497 222306 -45377 -117339 -98839 -191566 10216 109527 -306446 -36257 69457 -235022 -259320
9486 -259320 -42366 -8275 -234320 -97568 254755 -20466 156014 -72747 209808 22949 -112109
9474 -124453 -202725 182722 86745 -289485 72227 -58205 136940 123502 55021 -33912 -145359
9463 -145359 -208653 23389 57207 -172166 -101490 82974 -257416 -184302 179207 -133423 80246
9451a12741G6340P2989a28284D7104J44958a94474B6948J28468c41028J15674
9441b25354d5444j23900B34933c39062c902k32099Q7841j03935A21480C810c02389
9429a55217A94329O5010b08687A97147i6995A5026N8277a12989B56969a46853
9418H8462a3275D009J0791N7224J86444E5163K8249c0203B39568d3020p3917F8700
9405d07422A4752a43298b6874k5204k3862j95760A15442b13730A60075f427j0429
9394a6856B80277A34343b2499r2129p7223q4820d997l2324B8983J16426p0729
9383G4680a32143N4623n3028q5921D6510g7062b5539o032j04361A23850b9121
9371c7996a3549B75448c5169j17967k4631f1190I6551i9264j91080J39028r3676
$$ plain form
9451 -112741 76340 149329 -128284 47104 192062 -194474 26948 155416 -341028 -225354
9441 -225354 -45444 -169344 234933 -339062 -3902 -236001 -148160 -252095 121480 3810 -302389
9429 -155217 194329 259339 -208687 197147 -96995 15026 73303 -112989 256969 -146853
9418 88462 -13275 4009 14800 72024 258468 55163 83412 -30203 239568 -43020 -116937 68700
9405 -407422 14752 -143298 -26874 -52078 -75940 -271700 115442 -213730 160075 -6427 -16856
9394 -16856 280277 134343 -22499 -114628 -191851 -276671 -4997 -37321 28983 145409 74680
9383 74680 -132143 -77520 -130548 -216469 46510 -77062 -25539 -31571 -135932 123850 -29121
9371 -37996 -13549 275448 -35169 -153136 -177767 -61190 96551 -99264 -290344 -151316 -244992
9360b44992J15043A70061g8784c2221j06521d2115k36385A09286c4330A87353
9349e31009d9842A86965E9830J8394l4252J26099b15708R8887q3284l6131O6930
9338a69306j2776O7072A11212B8938L5431K40812j19674M6813g8028j01972P7914
9327a02086B55814b66112M2556F039h1404A42245a20310d7098k69593B983J52775
9316A55758a08647k35855A21437C3163J47098d18626a78256B26305c36725R3940
9306b42785B72026A33264a24187c4056m4396F2448b88537G3349a42748J8254b6403
9294d37679E2479M2052J6059a25194c1274H4376N1082B6826a93616Q0231A32782
9282I2191M0677a75255N245Q2488j29573M0838b5339r5689j47808b6922A35011
$$ plain form
9360 -244992 -129949 170061 -78784 -32221 -138742 -42115 -278500 109286 -34330 187353
9349 -531009 -49842 186965 59830 78224 43972 170071 -215708 -116821 -200105 -236236 -169306
9338 -169306 -182082 -115010 111212 28938 64369 305181 185507 232320 -78028 -180000 -102086
9327 -102086 255814 -266112 -223556 6039 -81404 142245 -120310 -47098 -316691 2983 155758
9316 155758 -108647 -344502 121437 33163 180261 -418626 -178256 226305 -336725 -242785
9306 -242785 272026 133264 -124187 -34056 -78452 62448 -288537 73349 -142748 -124494 -26403
9294 -437679 52479 94531 110590 -125194 -31274 84376 135458 26826 -193616 -113385 132782
9282 92191 132868 -175255 -170010 -87522 -217095 -176257 -25339 -121028 -268836 -26922 135011
9270h6036B1709f2820j09443k19420O1322j12279b7175B28831a40893D42929A00878
9258A62278c72518e5677k88324R3184n2226J32629m2289q2606D3956i622j08327
9247a17949k0777C32338j29802A6797e7908k18363a4660H8478c0187q5564g980
9235A69214h9604K9464b9242A77341q6955L8933j9207a15411L925k10277F6099
9223A69712C84e41152B6951e9317m6807G4808f8386j43788e1888k1786j68066
9212b41740f5771J9998A02340R7303h0442C7063J92819o7358a70012F627f0601
9200b97750h3030m19333a77127C2159J58942b40437P8290l3920B05262M8492h021
9188A37119b06840f2518A65283a61119B7389b95252d2061j03095N4206m8238C7939
$$ plain form
9270 -86036 21709 -62820 -172263 -391683 -330361 -442640 -27175 228831 -140893 442929 100878
9258 162278 -372518 -55677 -344001 -250817 -303043 -170414 -212703 -295309 43956 -9622 -117949
9247 -117949 -138726 332338 202536 16797 -57908 -276271 -14660 88478 -30187 -115751 -7980
9235 169214 -89604 -60140 -29242 177341 90386 129319 110112 -115411 -111486 -321763 66099
9223 169712 384 -541152 26951 -59317 -106124 74808 -68386 -212174 -51888 -73674 -241740
9212 -241740 -65771 -45773 102340 199643 -80442 37063 229882 162524 -170012 6627 -60601
9200 -297750 -83030 -502363 -177127 32159 191101 -240437 -162147 -196067 205262 253754 -8021
9188 137119 -206840 -62518 165283 -161119 27389 -295252 -42061 -145156 -90950 -139188 37939
9176A88149K53932i7756g089I1451b9249B72648a13297C532i1622A6566g5423
9164c0668J3145j38816a4326B00031h6452L5484E3075R1621d8427C6896b5464
9152A27647Q1109c13471J0546J27955Q5209A25343B6735K10616a36536O4591G7561
9140A13072b9002G922a07302A9009a74697A36271a86624Q7973B86176a34838M7793
9129h7045c2433C7339d8166G4908c2587k29355c5245k47858P8562k6156c3465
9117a67149J1074N7032A878h9660j11192A4728N5077i7652k17392R1853A73663
9105a27152J7018B1720L1804O7021A5026b94081p5426l0638c6155A04344b49715
9093b4479o8725j03841D8100O1003e4206n2132A27283a06078k09704j62956K23467
$$ plain form
9176 188149 442081 -97756 -7089 91451 -29249 272648 -113297 3532 -91622 16566 -75423
9164 -30668 -17523 -156339 -14326 200031 -86452 -50968 53075 144696 -48427 36896 -25464
9152 127647 208756 -313471 -302925 -174970 -89761 125343 26735 237351 -136536 -71945 77561
9140 113072 -29002 7922 -107302 19009 -174697 136271 -186624 -98651 286176 -134838 -87045
9129 -87045 -32433 37339 -48166 74908 -32587 -261942 -35245 -283103 -204541 -230697 -33465
9117 -167149 -156075 -99043 1878 -89660 -200852 14728 69805 -97652 -315044 -223191 173663
9105 -127152 -110134 21720 53524 120545 15026 -294081 -369507 -400145 -36155 104344 -249715
9093 -24479 -93204 -197045 48100 109103 -54206 -106338 127283 -106078 -315782 -478738 -255271
9082b55271l7397c9657j93568N2049l6102N4787n0499A08225R3792a38442f3749
9070b9731A8609f9666G3350a20251I766N721d6974D5608b03013B81436f145A59038
9057g4293C54414a13222A12198i410j05112A51360F7407b1764q0867p4278b0155
9045A869a58495L4684g378k69003f7533l7085A00883a23590K7114j87662g6524
9033a01657G0671b73951A34501c9386o3765M6716n56441H9042J09351a33535j52823
9022b86358i2160A12703J6544Q3921A03576J08999I2871a43942c68G0013h3345
9010b79413D1820a98286P1355B06412R9134F5073a36408G0229d30457R4242B01529
8998A89636a64700b9768D6483b2961a525B3190b73021J00391L016A1664J34342
$$ plain form
9082 -255271 -292668 -39657 -233225 -181176 -217278 -162491 -212990 108225 202017 -138442 -63749
9070 -29731 18609 -69666 73350 -120251 9766 15487 -46974 45608 -203013 281436 -6145 159038
9057 -74293 354414 -113222 112198 -9410 -114522 151360 67407 -21764 -102631 -176909 -20155
9045 1869 -158495 -123811 -7378 -276381 -67533 -104618 100883 -123590 -96476 -284138 -76524
9033 -101657 70671 -273951 134501 -39386 -103151 -56435 -612876 89042 198393 -133535 -286358
9022 -286358 -92160 112703 129247 213168 103576 212575 92871 -143942 -368 70013 -83345
9010 -279413 41820 -198286 -126931 206412 305546 65073 -136408 70229 -430457 -336215 201529
8998 189636 -164700 -29768 46483 -22961 -1525 23190 -273021 -172630 -169614 11664 146006
8987A46006c36914C6808c04265O7272p3712B67443e6203E5410J23311c9150j86694
8976b25844p3624j06442a46137f7286l52079B99577G9518h9651A57458p107g1955
8964c42322E6783J49883b17374A32904O0432m3838A4623b32932E9959a94108A56063
8952b22241f9163r4654K8634J9105P141j29280A01920b47951a23050A40105g2454
8940B01338q3688c20140b7764C3454a90173F1260a50935B29398A06234a80078
8929E7242b2278r5380k1373I1004M16993A18413J269735M467579K976812B137936
8918G70543K8137A57911n0114M36274a49528B65217j17007D6485a6406A35842
8907B2544N9585a64801A43886l0185l9617O7199b49955B30878e2229J0671B34397
$$ plain form
8987 146006 -336914 36808 -304265 -236993 -310705 267443 -56203 55410 178721 -39150 -225844
8976 -225844 -299468 -405910 -146137 -67286 -419365 299577 79518 -89651 157458 150351 -71955
8964 -342322 56783 206666 -217374 132904 193336 149498 14623 -232932 59959 -194108 156063
8952 -222241 -69163 -163817 -135183 -116078 -108937 -238217 101920 -247951 -123050 140105 -72454
8940 201338 117650 -320140 -27764 33454 -190173 61260 -150935 229398 106234 -180078
8929 57242 -22278 -117658 -139031 91004 507997 118413 1388148 5855727 8832539 2137936
8918 770543 798680 157911 107797 544071 -149528 265217 148210 46485 -16406 135842
8907 22544 82129 -164801 143886 113701 74084 141283 -249955 230878 -52229 -41558 234397
8895a69788g7365j94205A11934a22279A5459a26548A61484p5052a49459A06263
8884b866l68475F8121g395r9560j40444A1820J72989a44413A18071e2721B85509
8872a14260F7193M5907b55271A91071J03433a31409j15325i8165a2246F9159J13189
$$ plain form
8895 -169788 -77365 -271570 111934 -122279 15459 -126548 161484 86432 -149459 106263
8884 -2866 -371341 68121 -7395 -106955 -247399 11820 184809 -144413 118071 -52721 285509
8872 -114260 67193 113100 -255271 191071 294504 -131409 -246734 -98165 -12246 69159 182348
$$ [...]
##END NTUPLES=NMR SPECTRUM
##END=
