##TITLE=AC1429_MEXAH13240_7764576_H80rwTeiM3
##JCAMPDX= 6.0         $$ Bruker NMR JCAMP-DX V2.0
##DATA TYPE= NMR SPECTRUM
##DATA CLASS= NTUPLES
##ORIGIN= BRUKER
##OWNER= Administrator
$$ 1.72 TOPSPIN		Version 2.1
$$ 2013-04-11 23:26:16.074 -0700  Administrator@X
$$ Compression mode = diff/dup
##.OBSERVE FREQUENCY= 400.02188249412
##.OBSERVE NUCLEUS= ^1H
##.ACQUISITION MODE= SIMULTANEOUS (DQD)
##.ACQUISITION SCHEME= undefined
##.AVERAGES= 64
##.DIGITISER RES= 22
##SPECTROMETER/DATA SYSTEM= spect
##.PULSE SEQUENCE= noesygpps1d.comp
##.SOLVENT NAME= COFFEE_meoh
##.SHIFT REFERENCE= INTERNAL, COFFEE_meoh, 1, 14.96096
##AUDIT TRAIL= $$ (NUMBER, WHEN, WHO, WHERE, PROCESS, VERSION, WHAT)
$$ ##TITLE= Audit trail, TOPSPIN		Version 2.1
$$ ##JCAMPDX= 5.01
$$ ##ORIGIN= Bruker BioSpin GmbH
$$ ##OWNER= Administrator
$$ $$ E:\/data/COFFEE/nmr/AC1429_MEXAH13240_7764576_H80rwTeiM3/12/pdata/1/auditp.txt
$$ ##AUDIT TRAIL=  $$ (NUMBER, WHEN, WHO, WHERE, PROCESS, VERSION, WHAT)
(   1,<2013-04-11 23:26:08.667 -0700>,<Administrator>,<X>,<go>,<TOPSPIN 2.1>,
      <created by zg
	started at 2013-04-11 23:14:38.963 -0700,
	POWCHK enabled, PULCHK disabled,
       configuration hash MD5:
       33 CF 6A 21 5C D3 B9 40 6C 15 AA 8D 27 A2 4F 13
       data hash MD5: 64K
       86 C8 DA 36 01 13 56 1A 5B CE 16 77 9A 50 2A 44>)
(   2,<2013-04-11 23:26:11.746 -0700>,<Administrator>,<X>,<proc1d>,<TOPSPIN 2.1>,
      <Start of raw data processing
       efp LB = 0.3 FT_mod = 6 PKNL = 1 PHC0 = 0 PHC1 = 0 SI = 128K 
       data hash MD5: 128K
       50 EF 88 93 8D D3 E0 B7 99 AB 21 67 76 BF 5F B5>)
(   3,<2013-04-11 23:26:12.777 -0700>,<Administrator>,<X>,<proc1d>,<TOPSPIN 2.1>,
      <pk PHC0 = -79.38721 PHC1 = 0 
       data hash MD5: 128K
       63 3C 9D 3C 6A 1F 94 2E 30 4A 02 62 91 F4 A0 18>)
(   4,<2013-04-11 23:26:13.527 -0700>,<Administrator>,<X>,<proc1d>,<TOPSPIN 2.1>,
      <abs ABSG = 1 
       data hash MD5: 128K
       5A 56 C0 52 6C 0C 85 CC D0 CC 83 FE DC 0F 91 28>)
(   5,<2013-04-11 23:26:13.730 -0700>,<Administrator>,<X>,<proc1d>,<TOPSPIN 2.1>,
      <abs ABSG = 2 
       data hash MD5: 128K
       D1 42 C5 66 F4 AE 01 A2 21 B1 80 1F 5D FF DC C9>)
(   6,<2013-04-11 23:26:13.902 -0700>,<Administrator>,<X>,<proc1d>,<TOPSPIN 2.1>,
      <abs ABSG = 3 
       data hash MD5: 128K
       94 73 BE 8C 07 C3 4B DF 0F D8 10 DF D2 A0 95 D2>)
(   7,<2013-04-11 23:26:14.105 -0700>,<Administrator>,<X>,<proc1d>,<TOPSPIN 2.1>,
      <abs ABSG = 4 
       data hash MD5: 128K
       E0 F2 4C D4 B0 2E 61 FE 3B 0E 30 D2 BF 11 86 43>)
(   8,<2013-04-11 23:26:14.449 -0700>,<Administrator>,<X>,<proc1d>,<TOPSPIN 2.1>,
      <abs ABSG = 5 
       data hash MD5: 128K
       09 B3 EE CE 7A 3E 24 EB 22 C5 B5 2F 5E AE 09 CA>)
$$ ##END=
$$ 
$$ $$ hash MD5
$$ $$ 32 57 F4 A9 B7 1E 4A A7 4A 97 1E 17 EA CC E4 0B
##$RELAX= 
##$RELAX= 
##$RELAX= 
##$RELAX= 
##$RELAX= 
##$RELAX= 
##$RELAX= 
##$RELAX= 
$$ Bruker specific parameters
$$ --------------------------
##$DU= <E:\>
##$EXPNO= 12
$$ [...]
##$TP07= 0
##$TPNAME0= <>
##$TPNAME1= <>
##$TPNAME2= <>
##$TPNAME3= <>
##$TPNAME4= <>
##$TPNAME5= <>
##$TPNAME6= <>
##$TPNAME7= <>
##$TPOAL= (0..7)
0.5 0.5 0.5 0.5 0.5 0.5 0.5 0.5
##$TPOFFS= (0..7)
0 0 0 0 0 0 0 0
##$TUNHIN= 0
##$TUNHOUT= 0
##$TUNXOUT= 0
##$USERA1= <user>
##$USERA2= <user>
##$USERA3= <user>
##$USERA4= <user>
##$USERA5= <user>
##$V9= 5
##$VALIST= <valist>
##$VCLIST= <CCCCCCCCCCCCCCC>
##$VD= 0
##$VDLIST= <DDDDDDDDDDDDDDD>
##$VPLIST= <PPPPPPPPPPPPPPP>
##$VTLIST= <TTTTTTTTTTTTTTT>
##$WBST= 2048
##$WBSW= 25
##$XGAIN= (0..3)
0 0 0 0
##$XL= 0
##$YL= 0
##$YMAX_a= 6296618
##$YMIN_a= -13793518
##$ZGOPTNS= <>
##$ZL1= 120
##$ZL2= 120
##$ZL3= 120
##$ZL4= 120
##$ABSF1= 14.96096
##$ABSF2= -5.597221
##$ABSG= 5
##$ABSL= 3
##$ALPHA= 0
##$AQORDER= 0
##$ASSFAC= 0
##$ASSFACI= 0
##$ASSFACX= 0
##$ASSWID= 0
##$AUNMP= <proc_prof1d_extract.lims>
##$AXLEFT= 0
##$AXNAME= <>
##$AXNUC= <1H>
##$AXRIGHT= 0
##$AXTYPE= 0
##$AXUNIT= <>
##$AZFE= 0.1
##$AZFW= 0.1
##$BCFW= 0
##$BC_mod= 0
##$BYTORDP= 0
##$COROFFS= 0
##$CY= 15
##$DATMOD= 1
##$DC= 0
##$DFILT= <>
##$DTYPP= 0
##$F1P= 0
##$F2P= 0
##$FCOR= 0.5
##$FTSIZE= 131072
##$FT_mod= 6
##$GAMMA= 0
##$GB= 0
##$INTBC= 1
##$INTSCL= 1
##$ISEN= 128
##$LB= 0.3
##$LEV0= 0
##$LPBIN= 0
##$MAXI= 10000
##$MC2= 0
##$MEAN= 0
##$ME_mod= 0
##$MI= 0
##$NCOEF= 0
##$NC_proc= -2
##$NLEV= 6
##$NOISF1= 0
##$NOISF2= 0
##$NSP= 0
##$NTH_PI= 0
##$NZP= 0
##$OFFSET= 14.96096
##$PC= 1
##$PHC0= -79.38721
##$PHC1= 0
##$PH_mod= 1
##$PKNL= yes
##$PPARMOD= 0
##$PPDIAG= 0
##$PPIPTYP= 0
##$PPMPNUM= 2147483647
##$PPRESOL= 1
##$PSCAL= 4
##$PSIGN= 0
##$PYNMP= <proc.py>
##$REVERSE= no
##$SF= 400.020009651439
##$SI= 131072
##$SIGF1= 0
##$SIGF2= 0
##$SINO= 400
##$SIOLD= 131072
##$SPECTYP= <>
##$SREGLST= <1H.CDCl3>
##$SSB= 0
##$STSI= 131072
##$STSR= 0
##$SW_p= 8223.68421052631
##$SYMM= 0
##$S_DEV= 0
##$TDeff= 65536
##$TDoff= 0
##$TI= <>
##$TILT= no
##$TM1= 0
##$TM2= 0
##$TOPLEV= 0
##$USERP1= <user>
##$USERP2= <user>
##$USERP3= <user>
##$USERP4= <user>
##$USERP5= <user>
##$WDW= 1
##$XDIM= 131072
##$YMAX_p= 444859332
##$YMIN_p= -12865
##$CURPLOT= <Network HP LaserJet P1505>
##$CURPRIN= <$Network HP LaserJet P1505>
##$DFORMAT= <normdp>
##$LAYOUT= <+/1D_H.xwp>
##$LFORMAT= <normlp>
##$PFORMAT= <normpl>
##$SURQMSG= 1
$$ End of Bruker specific parameters
$$ ---------------------------------
##NTUPLES= NMR SPECTRUM
##VAR_NAME=  FREQUENCY,     SPECTRUM/REAL,   SPECTRUM/IMAG
##SYMBOL=    X,             R,               I
##VAR_TYPE=  INDEPENDENT,   DEPENDENT,       DEPENDENT
##VAR_FORM=  AFFN,          ASDF,            ASDF
##VAR_DIM=   131072,        131072,          131072
##UNITS=     HZ,            ARBITRARY UNITS, ARBITRARY UNITS
##FACTOR=    0.0627417313425164, 1,          1
##FIRST=     8223.62146879497, 1925,         -63337
##LAST=      0,             4303,            -62808
##MIN=       0,             -12865,          0
##MAX=       8223.62146879497, 444859332,    0
$$ Real data points
##PAGE= N=1
##DATA TABLE= (X++(R..R)), XYDATA
$$ [...]
63885H09380j2010j1602j1657j2400j3404j3882j3444j2281j0746q955o759l931
63873F78309l97L479O981R721J2194J5267J9080K2827K5787K8044K9997L1568
63861H82857L2373L2455L2315L2184L1669L0236K7819K4781K1432J7800J3862
63850A179783R807N833J803k566p172j1483j5281j9018k3108k7157l0377l2626
63838A028438l4408l5952l6936l7229l7235l7239l6937l5957l4475l2953l1551
63827F37566l0063k8171k5737k3077k0995j9977j9319j7732j5087j2798j1997
63816D12613j2036j1498j0102q706p843p243o673o234n763m745l196j936j613
63803C25025j934k222k281k364k525k540k266j795j275q88r45j665k750l465l387
$$ plain form
63885 809380 797370 785768 774111 761711 748307 734425 720981 708700 697954 688999 682240 678309
63873 678309 677912 681391 688372 698093 710287 725554 744634 767461 793248 821292 851289 882857
63861 882857 915230 947685 980000 1012184 1043853 1074089 1101908 1126689 1148121 1165921 1179783
63850 1179783 1189590 1195423 1197226 1194660 1187488 1176005 1160724 1141706 1118598 1091441 1061064 1028438
63838 1028438 994030 958078 921142 883913 846678 809439 772502 736545 702070 669117 637566
63827 637566 607503 579332 553595 530518 509523 489546 470227 452495 437408 424610 412613
63816 412613 400577 389079 378977 370271 362428 355185 348512 342278 336515 331770 328574 326638 325025
63803 325025 323091 320869 318588 316224 313699 311159 308893 307098 305823 304935 303990 302325 299575 296110 292723
63788B92723k948k919l394l659l192k416k045k047j801j187p97r55j147q23k56
63773B63137j46o84j454j990k041j542p56l38p33j586k041j666p78L7M29L69M7
63756B48264k58l66l02j51J7Q1r0l17k31J18J47l92q06k84R18J725J644J299J494
63737B52510K242K993L390L510L552L555L454L250L074L016K939K651K314K407
63723B94857L088L910M383M600M896N229N298N134M994M795M112K838J379J27
63709C49640q75j664k169k456k758l116l157k505j238J19R65J041O97O42J165
63694C34331J746J794J632K170L502M554M409L500K895K853K723K111J370Q26
63680C70416J46j076k442l024k441j353o71o14o57k72N32J357J887K079K006J657
$$ plain form
63788 292723 289775 286856 283462 279803 276611 274195 272150 270103 268302 267115 266318 265363 264216 263393 263137
63773 263137 262991 262307 260853 258863 256822 255280 254524 254186 253453 251867 249826 248160 247382 247419 247848 248217 248264
63756 248264 248006 247640 247338 247187 247204 247285 247195 246878 246647 246765 246912 246520 245714 245430 246348 248073 249717 251016 252510
63737 252510 254752 257745 261135 264645 268197 271752 275206 278456 281530 284546 287485 290136 292450 294857
63723 294857 297945 301855 306238 310838 315734 320963 326261 331395 336389 341184 345296 348134 349513 349640
63709 349640 348765 347101 344932 342476 339718 336602 333445 330940 329702 329821 330786 331827 332524 333166 334331
63694 334331 336077 337871 339503 341673 345175 349729 354138 357638 360533 363386 366109 368220 369590 370416
63680 370416 370562 369486 367044 364020 361579 360226 359555 358941 358284 358012 358544 359901 361788 363867 365873 367530
63664C67530R82J54l57j65M90P98J59j195k514l295l571l570l524l723m343n083
63648C38773n263m474k970j407m12l11q27j117m95P02J456J380J185J655K625
63633C30500L423L826M164M700N382O016O375O307O032O062O583P217P674Q238
63619D12499R196J0219J0878J1456J2586J4248J5788J6942J8217K0198K2869K5751
63607F00847K8333L0279L1623L2821L4335L6030L7147L6821L4561L0290K4280
63596I57367J7081R355J850m503q836j0990j1642j1579j1103j0430j0204j1091
63584H95275j3172j6177j9925k3992k7317k8988k9255k9039k8567k7215k4666
63573F26962k1400j7940j4442j1233q900p493o217m353j958N61L008N136O362
$$ plain form
63664 367530 368512 368666 368309 368144 368634 369432 369591 368396 365882 362587 359016 355446 351922 348199 343856 338773
63648 338773 333510 329036 326066 324659 324247 323936 323109 321992 321497 322199 323655 325035 326220 327875 330500
63633 330500 333923 337749 341913 346613 351995 358011 364386 370693 376725 382787 389370 396587 404261 412499
63619 412499 421695 431914 442792 454248 466834 481082 496870 513812 532029 552227 575096 600847
63607 600847 629180 659459 691082 723903 758238 794268 831415 868236 902797 933087 957367
63596 957367 974448 983803 985653 981150 972314 961324 949682 938103 927000 916570 906366 895275
63584 895275 882103 865926 846001 822009 794692 765704 736449 707410 678843 651628 626962
63573 626962 605562 587622 573180 561947 553047 545554 539337 534984 533026 533587 536595 541731 548093
63560E48093O405N904N913O827Q110Q991R187R065R364J0682J3089J6199J9645
63547F77474K3314K7198L1330L5868M1068M6876N2625N6952N7909N3519M3003
63536A147136K7788J1130l589j4259k0267k2061k0789j7910j4673j1855r946r380
63524A041325j0490j3356j7664k2664k7476l1729l5687l9359m1741m1611l9097
63513G20451l5850l3371l1596k9402k6160k2442j9394j7594j6520j5091j2871
63502D60160j0495q812p797o856n937n602n940o139n475m201l094k530k319k152
63488C82811j837j284n70R6N75Q34P73L05k54k23Q31K643M486N629N744N099M453
63471D10111M310M275L523J873N0j236k004k657l408m209m866n067m539l370j897
$$ plain form
63560 548093 554498 560402 566315 573142 581252 590243 599430 608495 617859 628541 641630 657829 677474
63547 677474 700788 727986 759316 795184 836252 883128 935753 992705 1050614 1104133 1147136
63536 1147136 1174924 1186054 1182465 1168206 1147939 1125878 1105089 1087179 1072506 1060651 1050705 1041325
63524 1041325 1030835 1017479 999815 977151 949675 917946 882259 842900 801159 759548 720451
63513 720451 684601 651230 619634 590232 564072 541630 522236 504642 488122 473031 460160
63502 460160 449665 440853 433056 426200 420263 414661 408721 402582 397107 392906 389812 387282 384963 382811
63488 382811 380974 379690 379120 379216 379791 380625 381398 381703 381449 381226 382057 384700 389186 394815 400559 405658 410111
63471 410111 414421 418696 422219 424092 424142 422906 420902 418245 414837 410628 405762 400695 396156 392786 390889
63456C90889l78Q81J267M64p36r71P3J314J815J926K425L365M369N468O883Q361
63440D27415R449J0180J0916J1733J2646J4130J6786K0587K5042L0047L5827M1873
63428F66631M6456M7460M3628L5254K4190J3174M591o10k760k482j30L958R220
63415H88580J5220K1781K8555L4658L9131M1619M2270M0942L6964K9952K0651
63404A240323J0719J683n673j1083j4430j5846j5797j4908j3849j3549j5019j8547
63392A114024k3368k8454l3353l7782m0942m1993m1084l9146l6763l3984l1146
63381G26009k8842k6875k4245k0626j7007j4330j2224r774o928m317k148j33J743
63368E60303L214M488O225Q626J1111J3107J4711J6406J8429K0735K3318K6266
$$ plain form
63456 390889 390511 391392 392659 393123 392387 391416 391489 392803 394618 396544 398969 402334 406703 412171 419054 427415
63440 427415 436864 447044 457960 469693 482339 496469 513255 533842 558884 588931 624758 666631
63428 666631 713087 760547 804175 839429 863619 876793 881384 880774 878014 875532 875402 879360 888580
63415 888580 903800 925581 954136 988794 1027925 1069544 1111814 1152756 1189720 1219672 1240323
63404 1240323 1251042 1252725 1247052 1235969 1221539 1205693 1189896 1174988 1161139 1147590 1132571 1114024
63392 1114024 1090656 1062202 1028849 991067 950125 908132 867048 827902 791139 757155 726009
63381 726009 697167 670292 646047 625421 608414 594084 581860 572086 565158 560841 558693 558560 560303
63368 560303 563517 568005 574230 582856 593967 607074 621785 638191 656620 677355 700673 726939
63356G26939K9484L2642L5551L8427M1530M4571M6731M7350M6193M2920L6956
63345A169294K8397J8626R303J066o098j1566j4336j4607j3983j3762j3949j4317
63333A124068j5406j7834k1429k5697l0474l5348l9078m0455l9474l7090l4089
63322G87694l0696k6883k2482j7276j1489n782n49M085P046O104O0r252j8279
63309F62301k4794k8729l0445k9695k6630k2556j8912j6115j3826j1783r904q045
63297D20867o211m794m174m171m157l699k951k501k885m088n453o159n899n076
63283C58649m292l735l042j832l18P09P22J06l29l44l60o39r36j046j080r81m01
63266C40851O25J420J534J375J529J907K120K268K756L593M358M755M731M336
$$ plain form
63356 726939 756423 789065 824616 863043 904573 949144 995875 1043225 1089418 1132338 1169294
63345 1169294 1197691 1216317 1225620 1226686 1220588 1209022 1194686 1180079 1166096 1152334 1138385 1124068
63333 1124068 1108662 1090828 1069399 1043702 1013228 977880 938802 898347 858873 821783 787694
63322 787694 756998 730115 707633 690357 678868 673086 672537 676622 683668 689772 689832 680580 662301
63309 662301 637507 608778 578333 548638 522008 499452 480540 464425 450599 438816 428912 420867
63297 420867 414656 409862 405688 401517 397360 393661 390710 388209 385324 381236 375783 369624 363725 358649
63283 358649 354357 350622 347580 345748 345430 346139 346861 346967 346638 346294 345934 345295 344359 343313 342233 341252 340851
63266 340851 341476 342896 344430 345805 347334 349241 351361 353629 356385 359978 364336 369091 373822 378158
63252C78158L806L495L415L207K894L205M564O273P312P583P753Q259R157J0593
63238D59674J2581J4514J5716J6412J7465J9222K1211K2895K4136K4975K5607
63227F74408K6435K7571K8368K8082K6914K5797K5252K5098K5131K5352K5606
63216I64014K5683K5880K6645K7635K7781K6524K4214K1136J6806J0765L486l978
63204A196591j1021j7738k4210k9868l3810l5803l6716l7497l7807l6383l2961
63193H62777k8961k5663k2557j8480j3724r737p055m760k026J014M092P327J0608
63180G52855J3363J5337J6883J8209J9111J9630K0136K0503K0077J8851J7826
63169I52781J7648J7677J7012J5776J4590J3288J0923P016K140k736p172j1517
$$ plain form
63252 378158 381964 385459 388874 392081 394975 398180 402744 409017 416329 423912 431665 439924 449081 459674
63238 459674 472255 486769 502485 518897 536362 555584 576795 599690 623826 648801 674408
63227 674408 700843 728414 756782 784864 811778 837575 862827 887925 913056 938408 964014
63216 964014 989697 1015577 1042222 1069857 1097638 1124162 1148376 1169512 1186318 1197083 1200569 1196591
63204 1196591 1185570 1167832 1143622 1113754 1079944 1044141 1007425 969928 932121 895738 862777
63193 862777 833816 808153 785596 767116 753392 743655 736600 731840 729814 730828 734920 742247 752855
63180 752855 766218 781555 798438 816647 835758 855388 875524 896027 916104 934955 952781
63169 952781 970429 988106 1005118 1020894 1035484 1048772 1059695 1066711 1068851 1066115 1058943 1047426
63157A047426j6325k1514k6194k9507l1470l2680l3353l3257l2356l0922k9017
63146G30831k6557k3969k1950k0477j8754j6368j3826j1668r876q367p336o723
63134E44960o034n121m376l776k549m47J420J859J237R85J805L117M100M515M486
63119E46181M229M059M259M719N051N112N149N356N506N191M374L569L326L481
63105F09562L247K245J152Q97J427J825J503P07l7m19k98J50K80l51j130r94J07
63088F19873J190J784K387L180L377K464J065m9r16j574j354M8J614K297K661
63073F38047L966O026P295P115O599P034Q427R957J1123J2018J3006J4460J6472
63060G61545J8649K0486K2039K3857K6255K9071L2155L5611L9427M3290M7003
$$ plain form
63157 1047426 1031101 1009587 983393 953886 922416 889736 856383 823126 790770 759848 730831
63146 730831 704274 680305 658355 637878 619124 602756 588930 577262 567386 559019 551683 544960
63134 544960 538926 533805 529429 525653 523104 522657 524077 525936 527173 528158 529963 533080 537180 541695 546181
63119 546181 550410 554469 558728 563447 568498 573610 578759 584115 589621 594812 599186 602755 606081 609562
63105 609562 612809 615054 616206 617103 618530 620355 621858 622565 622528 622109 621811 621961 622241 621890 620760 619766 619873
63088 619873 621063 622847 625234 628414 631791 634255 635320 635271 634355 632781 631427 631475 633089 635386 638047
63073 638047 642013 648039 655334 662449 669048 676082 684509 694466 705589 717607 730613 745073 761545
63060 761545 780194 800680 822719 846576 872831 901902 934057 969668 1009095 1052385 1099388
63049A099388N0662N4265N7450N9904O1762O3346O4596O5110O4795O4241O4219
63038A769738O4800O5231O4871O4042O3652O4039O4542O4300O2968O0490N6550
63027B465223N0622M2384L1869J9332N199j0009k5788m1476n5980o8074p7228
63016B336074q3770q8013q9724q8733q5690q1565p6548p0006o1589n2027m2596
63005A515813l4032k6103j8242j0428l268K839Q266J3552J8522K2512K5330K7436
62993A542197K9077L0005L0167L0090L0241L0523L0716L0911L1127L0930K9734
62982A875718K7147K2833J6621R016J039o850j5108k4076l3194m1670m9172n5285
62970A727019n9166o0621o0894o1287o1381n9724n6037n1577m7414m3478l9567
$$ plain form
63049 1099388 1150050 1204315 1261765 1321669 1383431 1446777 1511373 1576483 1641278 1705519 1769738
63038 1769738 1834538 1899769 1964640 2028682 2092334 2156373 2220915 2285215 2348183 2408673 2465223
63027 2465223 2515845 2558229 2590098 2609430 2614629 2604620 2578832 2537356 2481376 2413302 2336074
63016 2336074 2252304 2164291 2074567 1985834 1900144 1818579 1742031 1672025 1610436 1558409 1515813
63005 1515813 1481781 1455678 1437436 1427008 1423740 1426579 1434845 1448397 1466919 1489431 1514761 1542197
62993 1542197 1571274 1601279 1631446 1661536 1691777 1722300 1753016 1783927 1815054 1845984 1875718
62982 1875718 1902865 1925698 1942319 1951335 1952374 1945524 1930416 1906340 1873146 1831476 1782304 1727019
62970 1727019 1667853 1607232 1546338 1485051 1423670 1363946 1307909 1256332 1208918 1165440 1125873
62959A125873l6134l3582l1535k9440k7382k5748k4539k3467k2526k1911k1467
62948H28142k0684j9321j7827j6908j6706j6569j5755j4261j2747j1731j1136
62937F54497j0659j0225r870r488q924q094o882n252l627k728k784l208l343l084
62923E66329k548j710p82l80o66q44k37N14K09j155k316k461k078j918j852j314
62907E46791l62K33j55j340k554l126k937k257j312k77M45M26j61n80m56j44N6
62890E32290M26J042J134Q4j397k047j674j109o66J69J437K200J888J189J034
62875E36000J312J306R28P64J049J246P87k50j272j767j616j044m81l70q63j532
62859E34197j591o37Q64K089K725K998K935K308J388J059J670K398K294J573J180
$$ plain form
62959 1125873 1089739 1056157 1024622 995182 967800 942052 917513 894046 871520 849609 828142
62948 828142 807458 788137 770310 753402 736696 720127 704372 690111 677364 665633 654497
62937 654497 643838 633613 623743 614255 605331 597237 590355 585103 581476 578748 575964 572756 569413 566329
62923 566329 563781 562071 561289 560909 560243 559399 559162 559676 559885 558730 556414 553953 551875 549957 548105 546791
62907 546791 546429 546662 546507 545167 542613 539487 536550 534293 532981 532704 533149 533575 533414 532834 532378 532234 532290
62890 532290 532716 533758 534892 534976 533579 531532 529858 528749 528083 528252 529689 531889 533777 534966 536000
62875 536000 537312 538618 539546 540310 541359 542605 543392 543142 541870 540103 538487 537443 536962 536592 535729 534197
62859 534197 532606 531969 532833 534922 537647 540645 543580 545888 547276 548335 550005 552403 554697 556270 557450
62844E57450J402J700J708J657J722J609J011M3q57j308j222r22q22q06k26J102
62828E63241K330K549J973J485J309J016O57Q78J770K508K564K450K821L405L448
62813E94404K820K135J927K109K243K106J927K099K667L221L420L451L761M530
62799F32820N658P024Q390R313R638R896J0664J1698J2306J2488J3096J4865J7819
62786G75675K1648K6033L0530L4834L9318M4757N1248N8049O4632P1370P8746
62775A296840Q6445R3615R9657J04441J07961J10060J10271J07731J01624R1909
62765B310554P9331O4554M7668K8783Q717j1276l0201m7478o2664p5414q5632
62754B226942r3406r8822j01949j02910j01895r9190r5258r0657q5779q0723p5406
$$ plain form
62844 557450 558852 560552 562260 563917 565639 567248 568259 568302 567445 566137 564915 563993 563171 562365 562139 563241
62828 563241 565571 568120 570093 571578 572887 573903 574560 575438 577208 579716 582280 584730 587551 590956 594404
62813 594404 597224 599359 601286 603395 605638 607744 609671 611770 614437 617658 621078 624529 628290 632820
62799 632820 638478 645502 653892 663205 672843 682739 693403 705101 717407 729895 742991 757856 775675
62786 775675 797323 823356 853886 888720 928038 972795 1024043 1082092 1146724 1218094 1296840
62775 1296840 1383285 1476900 1576557 1680998 1788959 1899019 2009290 2117021 2218645 2310554
62765 2310554 2389885 2454439 2502107 2530890 2539607 2528331 2498130 2450652 2387988 2312574 2226942
62754 2226942 2133536 2034714 1932765 1829855 1727960 1628770 1533512 1442855 1357076 1276353 1200947
62743A200947o9689o3517n7136n1078m5696m0827l6207l2054k8788k6218k3563
62732G26174k0366j7041j4311j2440j1161j0113r083q027o970n826m379k590q88
62719F02979J54M15M12Q19J945L568N101O089O714P645R233J1185J3201J5476
62705F84936J8206K1098K3917K7106L1079L5306L8983M2357M6456N1458N6316
62694A077218O0200O3409O6515O9406P1667P3227P3998P3218O9760O3050N3495
62683A815163M2086K9625J6260J871j3041k7122l9279m9607n8688o6310p1713
62672A579245p4802p6203p6109p4135p0438o5998o1517n6937n2291m8036m4153
62661H78626l9900l5136l0980k8374k6680k4556k1707j8986j7029j5585j4047
$$ plain form
62743 1200947 1131258 1067741 1010605 959527 913831 873004 836797 804743 775955 749737 726174
62732 726174 705808 688767 674456 662016 650855 640742 631659 623632 616662 610836 606457 603867 602979
62719 602979 603133 603548 603960 604779 606724 610292 615393 621482 628196 635841 645074 656259 669460 684936
62705 684936 703142 724240 748157 775263 806342 841648 880631 922988 969444 1020902 1077218
62694 1077218 1137418 1200827 1267342 1336748 1408415 1481642 1555640 1628858 1698618 1761668 1815163
62683 1815163 1857249 1886874 1903134 1905005 1891964 1864842 1825563 1775956 1717268 1650958 1579245
62672 1579245 1504443 1428240 1352131 1277996 1207558 1141560 1080043 1023106 970815 922779 878626
62661 878626 838726 803590 772610 744236 717556 693000 671293 652307 635278 619693 605646
62650F05646j2112j0008q395p884q320q813q651p848o675n240l790k825k395j874
62636E10816q83J11O70J234K383L662M016L183J904Q46M8n93r84j106j152j191
62620E22964j107r03p73o93k68Q24K380L756M458M661N028N924O932P431P530
62605E68144P936Q943J0062J0823J1449J2434J3950J5950J8469K1474K4749K8189
62593G52572L1937L5967L9905M3519M6998N0349N2959N4100N3616N1700M8305
62582A261927M3185L6320K7966J8414Q028k650j3034k2606l0800l7126m1697m5237
62570A202690m8270n0524n1379n0593m8457m5505m2344l9384l6548l3501l0279
62559G25906k7315k4765k2311j9824j7601j5683j3605j1189r029p698o973o326
$$ plain form
62650 605646 593534 583526 575131 567247 558927 550114 541463 533615 526940 521700 517910 515085 512690 510816
62636 510816 509933 510044 510714 511948 514331 517993 522009 525192 527096 527942 527990 527397 526413 525307 524155 522964
62620 522964 521857 520954 520181 519488 519220 520044 522424 526180 530638 535299 540327 546251 553183 560614 568144
62605 568144 576080 585023 595085 605908 617357 629791 643741 659691 678160 699634 724383 752572
62593 752572 784509 820476 860381 903900 950898 1001247 1054206 1108306 1161922 1213622 1261927
62582 1261927 1305112 1341432 1369398 1387812 1395840 1393190 1380156 1357550 1326750 1289624 1247927 1202690
62570 1202690 1154420 1103896 1052517 1001924 953467 907962 865618 826234 789686 756185 725906
62559 725906 698591 673826 651515 631691 614090 598407 584802 573613 564584 556886 549913 543587
62547E43587n698n309n094m866m608m236l447k291j373j029p66q1P26J102J134
62532E07751J128Q03k23j463j859r89O89K561M225N402O213P392R500J2062J4206
62517E67398J6006J8349K1425K4303K6291K8000L0603L4367L8376M1526M3546
62506H90190M4994M6317M7082M6365M3871M0148L5617K9967K2999J5429Q269J707
62494A272955m578j0330j4514j6259j5398j2278p587k228L210Q897J5295K2354
62482A239539K9578L6545M2937M8395N2981N7332O1362O2902N8926M8645L4820
62471A773962K1507J0836J985p390j9065l3037m7632o0694p0842p7722q1454q2354
62459A328100q1149p8888p6210p2911o8406o2528n5720m8625m1602l4684k8012
$$ plain form
62547 543587 537889 532580 527486 522620 518012 513776 510329 508038 506665 505636 504870 504789 505515 506617 507751
62532 507751 508879 509682 509459 507996 506137 505148 505837 508398 512623 518025 524238 531630 541130 553192 567398
62517 567398 583404 601753 623178 647481 673772 701772 732375 766742 805118 846644 890190
62506 890190 935184 981501 1028583 1074948 1118819 1158967 1194584 1224551 1247550 1262979 1271248 1272955
62494 1272955 1268377 1258047 1243533 1227274 1211876 1199598 1192011 1189783 1192993 1201890 1217185 1239539
62482 1239539 1269117 1305662 1348599 1396994 1449975 1507307 1568669 1631571 1690497 1739142 1773962
62471 1773962 1795469 1806305 1808290 1800900 1781835 1748798 1701166 1640472 1569630 1491908 1410454 1328100
62459 1328100 1246951 1168063 1091853 1018942 950536 888008 832288 783663 742061 707377 679365
62448F79365k2114j7562j4350j1908r732p701n727l685j858q07m32K87K068M251
62434E90095N631N906N735N568N232M503L374J734n78l289n691p330q308q950
62420E93632r392r615r531r095q387p522o516n446m775m933n480n318m120k920
62406E00582k765l392l881l991m069m067l542k488j421p32m70n00l94L99J739
62391D71008K650K614K456L055L821L547K295J246R52R76J121J693K538L090L465
62376E06527M387N848P039P757Q627R602R657Q529P583Q050R450J0650J1677J3452
62362F28835J6203J9203K1876K4441K7500L1532L6695M2699M8863N4592N9715
62351A012154O4302O8177P0718P0930O7886O1453N2534M2323L1397K0033R070
$$ plain form
62448 679365 657251 639689 625339 613431 603699 595998 590271 586586 584728 583921 583489 583776 585844 590095
62434 590095 595726 601632 607367 612935 618167 622670 626044 627778 627200 623911 618220 610890 602582 593632
62420 593632 584240 574625 565094 555999 547612 540090 533574 528128 523353 518420 512940 507622 503502 500582
62406 500582 497817 494425 490544 486553 482484 478417 474875 472387 470966 470234 469764 469264 468870 469269 471008
62391 471008 473658 476272 478728 481783 485604 489151 491446 492692 493644 494620 495741 497434 499972 503062 506527
62376 506527 510914 516762 523801 531558 540185 549787 559444 567973 575556 583606 593056 603706 615383 628835
62362 628835 645038 664241 686117 710558 738058 769590 806285 848984 897847 952439 1012154
62351 1012154 1076456 1144633 1215351 1286281 1354167 1415620 1468154 1510477 1541874 1561907 1570977
62340A570977l53p972j4605k0993k7105l2730l7959m2706m6325m8202m8417m7464
62328A196146m5643m3016l9683l5937l2287k9317k7228k5574k3879k2392k1798
62317H49392k2235k3127k3895k4259k3921k2663k0840j9138j7737j6258j4551
62306F20768j2868j1267r585q029p069o604n937m731l346k146j178o33q14j404
62292E45157j572r96j63N02J039J420J421J290J653K502L077K996K753K755K812
62277E66646K809L050L498L590L218L086L597M260M605M838N154N382N802P336
62263F26871J0195J3257J5554J7583K0427K4371K9161L4750M0918M6879N2249
62252I32215N7754O3974O9958P4049P5547P4589P0947O4068N4191M2411K9834
$$ plain form
62340 1570977 1570624 1562652 1548047 1527054 1499949 1467219 1429260 1386554 1340229 1292027 1243610 1196146
62328 1196146 1150503 1107487 1067804 1031867 999580 970263 943035 917461 893582 871190 849392
62317 849392 827157 804030 780135 755876 731955 709292 688452 669314 651577 635319 620768
62306 620768 607900 596633 587048 579019 571950 565346 559409 554678 551332 549186 548008 547375 546561 545157
62292 545157 543585 542589 542426 542928 543967 545387 546808 548098 549751 552253 555330 558326 561079 563834 566646
62277 566646 569455 572505 576003 579593 582811 585897 589494 593754 598359 603197 608351 613733 619535 626871
62263 626871 637066 650323 665877 683460 703887 728258 757419 792169 833087 879966 932215
62252 932215 989969 1053943 1123901 1197950 1273497 1348086 1419033 1483101 1537292 1579703 1609537
62241A609537J7367O031l579j2030k0388k8967l7301m5145n2578n9224o4192o6902
62229A242629o7302o5400o1317n5814n0122m4952m0147l5291l0329k5532k1228
62218G45195j7596j4522j1797r516p953o901n625l836k184j251n88O49K466M096
62204F70637N063N478N552N367N023M554L841K973K392K298K225J665P09l20j412
62189G16045k483k881j995j01J918L482M508N075N458O081O952P519P496P296
62175G64370P131O442M974L663L541M399N571P456J0905J5525J9991K3948K8308
62162I06224L3621L9317M4704M9461N2930N4047N2439M8708M3247L5748K6266
62151A386712J5960O280k005q691j3893j8341k3191k8884l4595l9252m2606m4873
$$ plain form
62241 1609537 1626904 1632935 1629356 1617326 1596938 1567971 1530670 1485525 1432947 1373723 1309531 1242629
62229 1242629 1175327 1109927 1048610 992796 942674 897722 857575 822284 791955 766423 745195
62218 745195 727599 713077 701280 691764 683811 676910 671285 667449 665265 664014 663426 664075 666541 670637
62204 670637 675700 681178 686730 692097 697120 701674 705515 708488 710880 713178 715403 717068 717777 717457 716045
62189 716045 713562 710681 708686 708585 710503 713985 718493 723568 729026 735107 742059 749578 757074 764370
62175 764370 771501 777943 782917 786580 790121 794520 800091 807547 818452 833977 853968 877916 906224
62162 906224 939845 979162 1023866 1073327 1126257 1180304 1232743 1281451 1324698 1360446 1386712
62151 1386712 1402672 1408952 1406947 1398256 1384363 1366022 1342831 1313947 1279352 1240100 1197494 1152621
62139A152621m5813m4852m1921l7718l3113k8603k4358k0492j7128j4157j1132
62128H33334p809m823l235l127l168k140l52J102K012K981M082M740M996N708
62114H34301P197Q633R163Q754P515N026J045l543p190q857q454o485l762j337
62100H42006k49j042l372n917p136o572n215m136k999q01K182M274M508L821L627
62085H22979M089M450M420M394M665N179N938P080Q550J0176J1941J3880J5803
62072I23544J7444J8823K0085K1093K1424K0889J9936J9504K0402K2623K5328
62061A151095K7728K9958L2703L5923L8393L8838L7061L3643K8858K2542J4982
62050A491724P334P68m671r899j5548k1249k6445l1516l7357m3772m9071n1800
$$ plain form
62139 1152621 1106808 1061956 1020035 982317 949204 920601 896243 875751 858623 844466 833334
62128 833334 825525 820702 817467 814340 811172 809032 808680 809782 811794 814775 818857 823597 828593 834301
62114 834301 841498 850131 859294 868048 875563 880589 881634 878091 870901 862044 853590 847105 843343 842006
62100 842006 841757 840715 837343 831426 824290 817718 812503 808367 805368 804567 806749 811023 815531 819352 822979
62085 822979 827068 831518 835938 840332 844997 850176 856114 863194 871744 881920 893861 907741 923544
62072 923544 940988 959811 979896 1000989 1022413 1043302 1063238 1082742 1103144 1125767 1151095
62061 1151095 1178823 1208781 1241484 1277407 1315800 1354638 1391699 1425342 1454200 1476742 1491724
62050 1491724 1499058 1499826 1495155 1485256 1469708 1448459 1422014 1390498 1353141 1309369 1260298 1208498
62038A208498n2336n2126n1773n0767m8818m6445m3962m0858l6658l1865k7482
62027G25408k3946k1004j8380j6139j4438j3273j2455j1729j0927j0083r324q680
62015E55030q185q029q289q569q263p308o287n662n209m463l342k100q78L99J768
62000D80613L130M323N171N557N550N366N108M623L842L056K681K695K581J865
61986E36161O20p69k193l899n909p649q430q145p257o276n527n203n182m876l786
61971D61680k158o54N53J699K561K577J956J713K183K426J683N41k3M0L07Q68
61955D77952J853K581K322J517J177J355J356J127J297J873K168K147K691M235
61941E05651O131P719R061J0273J0977J1049J1205J2184J3732J4853J4899J4079
$$ plain form
62038 1208498 1156162 1104036 1052263 1001496 952678 906233 862271 821413 784755 752890 725408
62027 725408 701462 680458 662078 645939 631501 618228 605773 594044 583117 573034 563710 555030
62015 555030 546845 538816 530527 521958 513695 506387 500100 494438 489229 484766 481424 479324 478446 478845 480613
62000 480613 483743 488066 493237 498794 504344 509710 514818 519441 523283 526339 529020 531715 534296 536161
61986 536161 536781 536012 533819 529920 524011 516362 507932 499787 492530 486254 480727 475524 470342 465466 461680
61971 461680 459522 458868 459421 461120 463681 466258 468214 469927 472110 474536 476219 476760 476737 476777 477084 477952
61955 477952 479805 482386 484708 486225 487402 488757 490113 491240 492537 494410 496578 498725 501416 505651
61941 505651 511782 519501 528562 538835 549812 560861 572066 584250 597982 612835 627734 641813
61929F41813J3081J2327J1563J0255Q505P194O875O875O091M282J956o48l530
61916G26639o163p680p889p302o233m657k798r19J303M218P133Q956R879J1117
61902G25604J2869J3894J3414J2062J0398P860M032j80l529n870p754r416j0860
61889G62524j2191j3191j3210j2218j1241j0998j0807r689p930o682o505p101
61877F40761q096r227j0094j0462j0649j0932j0876r810p804n625l949k927k294
61864E38016j500j30J540K789L490M310N665P118Q264R344J0589J1777J3098J5451
61850F29821J9030K2437K4294K5031K6015K7437K8278K7961K6843K5309K3466
61839I05922K1525J9465J6465J1831O312J472k222n509q562j0413j0451r292p691
$$ plain form
61929 641813 654894 667221 678784 689039 697544 704738 711613 718488 724579 728861 730817 730169 726639
61916 726639 720476 712796 704907 697605 691372 686715 683917 682998 684301 688519 695652 704608 714487 725604
61902 725604 738473 752367 765781 777843 788241 796101 800133 799953 796424 790554 782800 773384 762524
61889 762524 750333 737142 723932 711714 700473 689475 678668 668979 661049 654367 647862 640761
61877 640761 632665 623438 613344 602882 592233 581301 570425 560615 552811 547186 543237 540310 538016
61864 538016 536516 536386 537926 540715 544205 548515 554180 561298 569562 578906 589495 601272 614370 629821
61850 629821 648851 671288 695582 720613 746628 774065 802343 830304 857147 882456 905922
61839 905922 927447 946912 963377 975208 981520 982992 980770 975261 966699 956286 945835 936543 928852
61826I28852n551k644N37L354N885Q522J1073J2767J2972J1561Q784N074P86m023
61812I97949r305j4517j8811k1849k4060k5848k6995k7151k6518k5566k4246k2011
61800G31072j8747j5325j2933j1933j1585j0981r998r128q553p855o720n494m798
61787E97022m855n358n743n495m540l549l324l726l717k838k000k194l051l483
61773E43149l246k861k343j216J87O62j50j009o76M43J009N92l4j57J01L86P83
61756E35620J594K691L517L647L230K768K517K223J541N85j30l86o30j453k765
61741E54569l775l914l498l277l473l632l384k908k468j917j078k29J99K88M73
61726E21976Q91J316J636J856J781J256P14P68J311J674J728K049K777L217K917
$$ plain form
61826 928852 923301 920657 921194 924548 930433 938955 950028 962795 975767 987328 996112 1001186 1001972 997949
61812 997949 988644 974127 955316 933467 909407 883559 856564 829413 802895 777329 753083 731072
61800 731072 712325 697000 684067 672134 660549 649568 639570 630442 621889 614034 607314 601820 597022
61787 597022 592167 586809 581066 575571 571031 567482 564158 560432 556715 553877 551877 549683 546632 543149
61773 543149 539903 537042 534699 533483 533670 534332 534182 533173 532497 532940 533949 534541 534507 534350 534451 534837 535620
61756 535620 537214 539905 543422 547069 550299 553067 555584 557807 559348 559933 559803 559417 558787 557334 554569
61741 554569 550794 546880 543382 540105 536632 533000 529616 526708 524240 522323 521245 521016 521215 521503 521976
61726 521976 522867 524183 525819 527675 529456 530712 531426 532194 533505 535179 536907 538956 541733 544950 547867
61711E47867K403K287K357K045J225J0j574l167l966l748l424l791m296l920k916
61696E27392k538l233m120m344m098m013m274m626m829m733m287l630l075k865
61682D72727l019l377l646l607l378l317l493l531l178k650k215j842j504j400
61668D32570j532j550j352j357j708j818j243n20l69n88n27k36k14l15J27J097
61652D20465J768J662J233J153J632K459L161L156K343J463J307J657J661J153
61638D46273Q06R88J257J152Q23N61L26p0p09j597k543l010k567j561q80j008
61622D38241j751k694l446l567l005k461k616l082k908k065j500j605j725j426
61608D04390j200j475j867k031k464l626m957n515n221m703m251l710l164k950
$$ plain form
61711 547867 550270 552557 554914 556959 558184 558194 556620 553453 549487 545739 542315 538524 534228 530308 527392
61696 527392 524854 521621 517501 513157 509059 505046 500772 496146 491317 486584 482297 478667 475592 472727
61682 472727 469708 466331 462685 459078 455700 452383 448890 445359 442181 439531 437316 435474 433970 432570
61668 432570 431038 429488 428136 426779 425071 423253 422010 421490 421121 420533 420006 419770 419556 419241 419368 420465
61652 420465 422233 423895 425128 426281 427913 430372 433533 436689 439032 440495 441802 443459 445120 446273
61638 446273 447079 448067 449324 450476 451299 451860 452186 452116 451407 449810 447267 444257 441690 440129 439249 438241
61622 438241 436490 433796 430350 426783 423778 421317 418701 415619 412711 410646 409146 407541 405816 404390
61608 404390 403190 401715 399848 397817 395353 391727 386770 381255 376034 371331 367080 363370 360206 357256
61594C57256l011k872k368j912j887k161k384k427k379k246j960j586j354j376
61580C27333j483j470j388j415j431j089m16J0k60r52j401j276o79J20P19O34
61564C15556j68j020j231q83m81j29M04J006J286J227J235J477J767K004K209
61549C24259K188J736J139Q51P86N44K89N72J210J315O74K12O46J455J746J586
61533C41208J790K712L856M500M354L554K360Q55r72k801l917l965l590l696m187
61518C42061m139l250k245j668j103p7J076J814K180K404K214J273n0j060j613
61503C37817j972k077j614p60k07l28q06j170j215q70k7J166K135K311J664O83
61487C34730j29o21q76r26p02k40K51O16R61J411J847K019J929J833J885J992
$$ plain form
61594 357256 354245 351373 349005 347093 345206 343045 340661 338234 335855 333609 331649 330063 328709 327333
61580 327333 325850 324380 322992 321577 320146 319057 318641 318651 318391 317439 316038 314762 314083 314203 314922 315556
61564 315556 315388 314368 313137 312254 311773 311644 312048 313054 314340 315567 316802 318279 320046 322050 324259
61549 324259 326447 328183 329322 330173 330959 331503 331792 332364 333574 334889 335563 335775 336421 337876 339622 341208
61533 341208 342998 345710 349566 354066 358420 361974 364334 365189 364217 361416 357499 353534 349944 346248 342061
61518 342061 337922 334672 332427 330759 329656 329579 330655 332469 334649 337053 339267 340540 340490 339430 337817
61503 337817 335845 333768 332154 331394 331187 330859 330053 328883 327668 326798 326771 327937 330072 332383 334047 334730
61487 334730 334601 333980 333104 332178 331476 331236 331487 332103 333064 334475 336322 338341 340270 342103 343988 345980
61471C45980K039K122K345K546K296J329k5r64r76l91M7O7k6q8k76m33p2O61P91
61452C56972r3r71o77M75J285J405J414J481J147M44M4J06Pm07l66N26J403J329
61434C65524P35Q99K219L673L990K975J674J290J918K408J712K17o94l11P19J400
61418C90348J518J542J896K548L103L092K394J357L93l89r28r72n94n36j285k129
61402D01358k007j124p21j235j754j492q13l65j38J09K22P1m9N6P7j94l06K86
61384C91981J404K306K471K007J468J355J550J278M4j445j887q79P26J979K634
61369D06992K773K425J842J459J289Q96J29o04q78n89J91J081J349P57L08J134
61353D20554K782L813M020M680O367Q101R075R808J0691J0877R633P706O183M956
$$ plain form
61471 345980 348019 350141 352486 355032 357328 358657 358632 357668 356692 356301 356348 356415 356389 356301 356025 355592 355520 356181 356972
61452 356972 356879 355908 355231 355706 356991 358396 359810 361291 362438 362882 362926 363032 363039 362632 362266 362792 364195 365524
61434 365524 366259 367158 369377 373050 377040 380015 381689 382979 384897 387305 389017 389234 388540 388229 388948 390348
61418 390348 391866 393408 395304 397852 400955 404047 406441 407798 408191 407802 406874 405902 405308 404772 403487 401358
61402 401358 399351 398227 397506 396271 394517 393025 392212 391847 391709 391818 392040 392111 392062 392118 392195 392001 391695 391981
61384 391981 393385 395691 398162 400169 401637 402992 404542 405820 405864 404419 402532 401653 402379 404358 406992
61369 406992 409765 412190 414032 415491 416780 417676 417805 417201 416323 415734 415925 417006 418355 419112 419420 420554
61353 420554 423336 427149 431169 435849 442216 450317 459392 469200 479891 490768 500401 508107 514290 519246
61339E19246L462K136J910K759L770M313M254L491K121P21k06p79j241j495j631
61324E42831k143k969l128k119r43p57j248j317o92K24J493L334N066N719N578
61309E48929N887P098Q408R209R941J1321J3359J5424J6804J7079J6291J4732
61297F94482J2455R264N354J481j852m728p003q009p722p406q163r487j0212j0301
61283F48153j0516j0867j0586r543q444p629o708n479m309l445k631j599l45J037
61269E67089K331L114L194K996K990K980K509J765J484K127L644N776Q061R814
61255F19874J0678J0890J0592R372P065M481K626J592Q29N6q13j969l277l980
61241F68016l703l170l127l222k784k062j585j014J42J253J330O50L26O35J112
$$ plain form
61339 519246 522708 524844 526754 529513 533283 537596 541850 545341 547462 548183 547977 547198 545957 544462 542831
61324 542831 540688 537719 534591 532472 531529 530772 529524 528207 527515 527739 529232 532566 537632 543351 548929
61309 548929 554816 561914 570322 579531 589472 600793 614152 629576 646380 663459 679750 694482
61297 694482 706937 716201 721555 723036 721184 716456 709453 701444 693722 686316 678153 668666 658454 648153
61283 648153 637637 626770 616184 606641 598197 590568 583860 578381 574072 570627 567996 566397 566052 567089
61269 567089 569420 572534 575728 578724 581714 584694 587203 588968 590452 592579 596223 601999 610060 619874
61255 619874 630552 641442 652034 661406 668471 672952 675578 677170 677999 678055 677242 675273 671996 668016
61241 668016 664313 661143 658016 654794 652010 649948 648363 647349 647491 648744 650074 650724 651050 651685 652797
61226F52797J923L655N858P386Q066Q716R452R466Q601P728P345P052O647O430
61212G51122O259N587M647M376M785M742L685K346J384N46k83n07J26R62J672
61197G91449L010N613Q846J1592J3527J5040J6483J7992J9433K0176J9446J7215
61185I59822J4150J0637O711K975M55p35j555k437k716k145j876l087n455p788
61171I66956r430j0383j0708j0621j0718j1377j2307j3099j3827j4636j5279j5510
61159H19061j5521j5605j5773j5944j5991j5431j3755j1265q947p155n216k649
61147F75809k8J871K977L428K861R55j776m379o364p770q619q798q281p240o028
61132F28618n031m196k816l65K588M936O407P571Q625R255R781J1172J3604J6082
$$ plain form
61226 652797 654720 658375 664233 671619 679685 688401 697853 707319 715920 723648 730993 738045 744692 751122
61212 751122 757381 762968 767615 771991 776776 781518 785203 787549 788933 789479 789196 788689 788815 789777 791449
61197 791449 794459 800072 808918 820510 834037 849077 865560 883552 902985 923161 942607 959822
61185 959822 973972 984609 991320 994295 994750 994015 992460 990023 987307 985162 983286 980199 974744 966956
61171 966956 957526 947143 936435 925814 915096 903719 891412 878313 864486 849850 834571 819061
61159 819061 803540 787935 772162 756218 740227 724796 711041 699776 690829 683674 678458 675809
61147 675809 675781 677652 680629 684057 686918 687873 686097 681718 675354 667584 658965 650167 641886 634646 628618
61132 628618 623587 619391 616575 616210 618798 623734 630141 637712 646337 655592 665373 676545 690149 706231
61118G06231J7958J9734K1879K3975K5663K7370K9261L0444L0165K9127K8648
61107I90455K9024K9509K9377K8292K6150K3341K0744J8737J6541J3125Q403L053
61095A236751k353p481j2023j5938j9628k3259k6305k8233k9246k9927l0460l0701
61083I81197l0555k9950k8749k7112k5571k4413k3306k1795j9815j7559j5330
61072G17042j3572j2448j1388r714p726o385n865n376m505l592k598r53J067K186
61058F36173K023J850K673L800M251M439N304O712P973R165J0789J2646J4140
61045G21938J5326J6702J8355K0044K1694K3208K4293K5058K6163K7831K9394
61034I70006L0346L1038L1807L2353L2601L3170L4374L5725L7100L9126M1751
$$ plain form
61118 706231 724189 743923 765802 789777 815440 842810 872071 902515 932680 961807 990455
61107 990455 1019479 1048988 1078365 1106657 1132807 1156148 1176892 1195629 1212170 1225295 1233698 1236751
61095 1236751 1234398 1226917 1214894 1198956 1179328 1156069 1129764 1101531 1072285 1042358 1011898 981197
61083 981197 950642 920692 891943 864831 839260 814847 791541 769746 749931 732372 717042
61072 717042 703470 691022 679634 669920 662194 655809 649944 644568 640063 636471 633873 632920 633987 636173
61058 636173 638196 640046 642719 646519 650770 655209 660513 667225 675198 684363 695152 707798 721938
61045 721938 737264 753966 772321 792365 814059 837267 861560 886618 912781 940612 970006
61034 970006 1000352 1031390 1063197 1095550 1128151 1161321 1195695 1231420 1268520 1307646 1349397
61023A349397M3765M4543M4830M4952M4078M2490M2687M6528N2933O0172O8591
61012A884966P8916Q9668R8924J07499J17907J31590J49917J76400K14600K64800
61002C315187L26028M00332M91638O02515P37364R07202J123675J387092J685583
60993A0976616K000571K292047K467669K391709J971529J262512M77174j34503
60985B3705324m29529m13751j76423J74938N10512O60765M73126p7040q38712
60976B3589210j568397k074229k296645k283183k117895j875414j610545j358678
60968H404224j136019r45033p83682o49672n39241m47486l71201l09325k60518
60959B962047k22266j92288j68928j50211j34123j19796j07114r5392q3700p2183
$$ plain form
61023 1349397 1393162 1437705 1482535 1527487 1571565 1614055 1656742 1703270 1756203 1816375 1884966
61012 1884966 1963882 2053550 2152474 2259973 2377880 2509470 2659387 2835787 3050387 3315187
61002 3315187 3641215 4041547 4533185 5135700 5873064 6780266 7903941 9291033 10976616
60993 10976616 12977187 15269234 17736903 20128612 22100141 23362653 23839827 23705324
60985 23705324 23275795 22862044 22685621 22860559 23371071 24031836 24504962 24427922 23589210
60976 23589210 22020813 19946584 17649939 15366756 13248861 11373447 9762902 8404224
60968 8404224 7268205 6323172 5539490 4889818 4350577 3903091 3531890 3222565 2962047
60959 2962047 2739781 2547493 2378565 2228354 2094231 1974435 1867321 1771929 1688229 1616046
60949A616046o1769n2779m5002l8777l4696l2506l1468l1429l2379l3273l2736
60938A189232l0784k8631k6875k5164k3448k2210k1302j9926j7991j6311j5198
60927I41392j3993j2284j0462q735o675m244k176q31M37K127L728M679N419O665
60913I05047Q362J0108J2120J4763J7482J9275K0144K1229K3238K5517K6948K7228
60901A131461K6863K6289K5512K4437K3120K1558J9498J6639J2956Q741M307j76
60889A341205m579q630j2039j4807j7296j9875k2519k4881k6642k7708k8081k7797
60877A106351k7102k6471k6231k6194k5890k5084k3847k2237k0355j8599j7468
60866H46873j6917j6368j5535j4762j4285j3702j2590j1242j0243r676r290r116
$$ plain form
60949 1616046 1554277 1501498 1456496 1417719 1383023 1350517 1319049 1287620 1255241 1221968 1189232
60938 1189232 1158448 1129817 1102942 1077778 1054330 1032120 1010818 990892 972901 956590 941392
60927 941392 927399 915115 904653 895918 889243 884999 882823 881992 882429 884556 888284 892963 898382 905047
60913 905047 913409 923517 935637 950400 967882 987157 1007301 1028530 1051768 1077285 1104233 1131461
60901 1131461 1158324 1184613 1210125 1234562 1257682 1279240 1298738 1315377 1328333 1337074 1341381 1341205
60889 1341205 1336626 1327996 1315957 1301150 1283854 1263979 1241460 1216579 1189937 1162229 1134148 1106351
60877 1106351 1079249 1052778 1026547 1000353 974463 949379 925532 903295 882940 864341 846873
60866 846873 829956 813588 798053 783291 769006 755304 742714 731472 721229 711553 702263 693147
60854F93147r261r438r363r350r723r864q808o790n177m710m741m529m315m619
60840E92459n295n939o628p597q636r331r580r393q641p469o484o012n574m598
60826D91282l257k055r75K50J409K023K139K188K218J942J495J489K105K756K814
60811E07823K275J588J153J074J153R90L66m38r19r17o70m29l32n14r56j279j109
60794E08859o87o76j285j972k197k061k031k295k710l118l448l678l896m314m972
60779D69519n516n539n098m666m460m121l302k377k213l058m049m066k945j522
60765D16587n54m3L96R47J564K168K558K468K004J826K410L328L663L137K358
60750D44817J974J997K117K280K639L249M018M752N049M364K584M13j188j930
$$ plain form
60854 693147 683886 674448 665085 655735 646012 636148 627340 620550 615373 610663 605922 601393 597078 592459
60840 592459 587164 581225 574597 567000 558364 549033 539453 530060 521419 513950 507466 501454 495880 491282
60826 491282 488025 485970 484995 485245 486654 488677 490816 493004 495222 497164 498659 500148 502253 505009 507823
60811 507823 510098 511686 512839 513913 515066 516056 516422 515984 515065 514148 513478 513049 512717 512203 511247 509968 508859
60794 508859 508172 507496 506211 504239 502042 499981 497950 495655 492945 489827 486379 482701 478805 474491 469519
60779 469519 464003 458464 453366 448700 444240 440119 436817 434440 432227 429169 425120 421054 418109 416587
60765 416587 416033 415990 416386 417333 418897 421065 423623 426091 428095 429921 432331 435659 439322 442459 444817
60750 444817 446791 448788 450905 453185 455824 459073 463091 467843 472892 477256 479840 480253 479065 477135
60736D77135k323k914l827m948o127o914o729n670m794m983n769n942n233m598
60722D06364m704m950m478l477k819k757k754k426j961j628j463j517j856k210
60708C67364k091j484r57q25o57P3J124J722J462O85m5m55n40l47O4N43Q99J055
60690C67590J046R01O52N13Q54J789K855L421L378L221L392L867M448N039N519
60675D08485N666N541N572N963O296O104N583N368N745O404O760O200M358J563
60661D85608j161k963l825m126l889l026k007j562j814k243k458k471k310j934
60647D49819j470j072o42k01k18r72j879k180k138k618l649m370m404m236m069
60632D15701l515k679k417k931l128k103m20P77J216J292J126P11M72P34J014
$$ plain form
60736 477135 474812 471898 468071 463123 456996 450082 443353 437683 432889 427906 422137 416195 410962 406364
60722 406364 401660 396710 392232 388755 385936 383179 380425 377999 376038 374410 372947 371430 369574 367364
60708 367364 365273 363789 362832 362007 361350 361423 362547 364269 365731 366416 366371 365916 365376 365029 365093 365636 366535 367590
60690 367590 368636 369537 370189 370702 371556 373345 376200 379621 382999 386220 389612 393479 397927 402966 408485
60675 408485 414151 419692 425264 431227 437523 443627 449210 454578 460323 466727 473487 479687 484045 485608
60661 485608 484447 481484 477659 473533 469644 466618 464611 463049 461235 458992 456534 454063 451753 449819
60647 449819 448349 447277 446635 446434 446216 445244 443365 441185 439047 436429 432780 428410 424006 419770 415701
60632 415701 412186 409507 407090 404159 401031 398928 398508 399285 400501 401793 402919 403630 404102 404836 405850
60617D05850O16k59p53m98Q3M31K69m46j338j631j002j69o9n68o96n2P25R10N08
60598D01911k8k94l9P70J763K408K606K708K867K756K130J365J066J273J333P12
60582D25307k75p98n98m01r04j615j266N03K528L442L144K573K456K819L464M343
60566D44722N418O602P894R336J0833J2113J2820J2624J1412R501P387N136K367
60553E58165r56m048n990o624o454n905n054l869k310l69J674L200L850M018M462
60538E33790N518P022Q795J0799J2950J5109J7204J9039K0020J9490J7370J4205
60526G01311J0578O729K689j389n025p516q464q295p996q130q357q110p370o468
60512F44187n431m076k560j403r61j170j674j916j305L52K609M881P062R457J2318
$$ plain form
60617 405850 406466 406207 405454 404956 405039 405470 405739 405293 403955 402324 401322 401153 401084 400516 399820 399768 400493 401403 401911
60598 401911 401883 401589 401550 402320 404083 406491 409097 411805 414672 417428 419558 420923 421989 423262 424595 425307
60582 425307 425032 424234 423636 423235 422331 420716 419450 419953 422481 425923 429067 431640 434096 436915 440379 444722
60566 444722 450140 456742 464636 473972 484805 496918 509738 522362 533774 543275 550662 555798 558165
60553 558165 557209 553161 547171 540547 534093 528188 523134 519265 516955 516586 518260 521460 525310 529328 533790
60538 533790 539308 546330 555125 565924 578874 593983 611187 630226 650246 669736 687106 701311
60526 701311 711889 718618 721307 719918 714893 707377 698913 690618 682622 674492 666135 658025 650655 644187
60512 644187 638756 634680 632120 630717 629756 628586 626912 624996 623691 624043 626652 631533 638595 648052 660370
60497F60370J5717J9632K3850K7986L1946L6088M0442M4039M5621M4988M3040
60486A033719M0480L6964L1772K4898J7223R692K545m652j2237j9872k6921l3270
60474A100341l9178m4290m7476m8059m6699m4411m1386l7424l3079k9357k6436
60463F62546k3596k0465j7486j5061j3090j1543j0679j0372r931q983p964p315
60451E06061o758n844m772m064l755l400k800k237j993j953j752j173l78K11L13
60436D65706M6l81j066k159l201l268k055m41L75J08n52r08q38n32j00L69O37
60419D51740N01J26rL97J106J528J353P94K07l01p53r28m86N07J484J926J872
60402D61064J733J724J638J261Q07P89J395K153K461K306K210K452K753K854K920
$$ plain form
60497 660370 676087 695719 719569 747555 779501 815589 856031 900070 945691 990679 1033719
60486 1033719 1074199 1111163 1142935 1167833 1185056 1194748 1197293 1192641 1180404 1160532 1133611 1100341
60474 1100341 1061163 1016873 969397 921338 874639 830228 788842 751418 718339 688982 662546
60463 662546 638950 618485 600999 585938 572848 561305 550626 540254 530323 521340 513376 506061
60451 506061 499303 493459 488687 484623 480868 477468 474668 472431 470438 468485 466733 465560 465182 465393 465706
60436 465706 465752 465371 464305 462146 458945 455677 453622 453181 453556 453664 453112 452204 451366 450834 450734 451103 451740
60419 451740 452241 452367 452358 452755 453861 455389 456742 457536 457743 457442 456689 455761 455275 455782 457266 459192 461064
60402 461064 462797 464521 466159 467420 468227 469016 470411 472564 475025 477331 479541 481993 484746 487600 490520
60387D90520L109L146K779K372K482L012L385L448L531L605L137K083J306J441
60373E29356J856J531O04K31Q67J604J578J264J640K567K873K015Q01K14K34L32
60357E49567M75J016J843K434K638K810L141L399L514L873M889O575Q634J0522
60343F05330J1457J0879R117P107N295L283O89k135m552o264p246p528p372p186
60329F10874o987o373n354m548m234l859l013k246k236k704k941k945l105l212
60315E57117k689j709j051q81n46L25J321K094K928M218N937P926J0208J2892
60301E98090J6148K0216K4865K8777L0231K8689K5095K0301J3946N386m720j4453
60289G92571k2005k6516k7838k6282k2754j8674j5289j2936j1081r071o850m946
$$ plain form
60387 490520 493629 496775 499554 501926 504408 507420 510805 514253 517784 521389 524526 526609 527915 529356
60373 529356 531212 532743 533347 533578 534445 536049 537627 538891 540531 543098 545971 547986 548787 549001 549235 549567
60357 549567 550042 551058 552901 555335 557973 560783 563924 567323 570837 574710 579599 586174 594808 605330
60343 605330 616787 627666 636783 643890 649185 652468 653157 651022 646470 640206 632960 625432 618060 610874
60329 610874 603887 597514 592160 587612 583378 579519 576506 574260 572024 569320 566379 563434 560329 557117
60315 557117 554428 552719 551668 550787 550241 550566 551887 553981 556909 561127 567064 574990 585198 598090
60301 598090 614238 634454 659319 688096 718327 747016 772111 792412 806358 811744 807024 792571
60289 792571 770566 744050 716212 689930 667176 648502 633213 620277 609196 600125 593275 588329
60277E88329l861l592l810m250m733n016m946m744m838n291n603n219m113k804
60263E25509j818j250r00p63j089j805k214j723q03n49j201j738j252j49N10L33
60247E09098k29o26n38J83J271J936J621P84L80O33Q22K34j061k331k699j754
60231E07724k0J339J749J826K368L141L355L019K905L294L645L601L441L363L091
60216E47841K619K629L688N397O804P398P424P410P655Q104Q563Q993R430R651
60202F43606R193Q039O907O484O618O728O651O554O222N248L791K431J284j5j463
60187G18278k602l329m070m922n419n372n330n748o314o492o334o277o414o359
60173F43296n776m841m145m090m273l742k135l23O04O09M44L59j20j150k132k472
$$ plain form
60277 588329 584468 580876 577066 572816 568083 563067 558121 553377 548539 543248 537645 532426 528313 525509
60263 525509 523691 522441 521541 520778 519689 517884 515670 513947 513144 512595 511394 509656 508404 508255 508765 509098
60247 509098 508869 508243 507705 507888 509159 511095 512716 513500 513880 514513 515335 515569 514508 512177 509478 507724
60231 507724 507704 509043 510792 512618 514986 518127 521482 524501 527406 530700 534345 537946 541387 544750 547841
60216 547841 550460 553089 556777 562174 568978 576376 583800 591210 598865 606969 615532 624525 633955 643606
60202 643606 652799 660838 667745 674229 680847 687575 694226 700780 707002 712250 716041 718472 719756 719741 718278
60187 718278 715676 712347 708277 703355 697936 692564 687234 681486 675172 668680 662346 656069 649655 643296
60173 643296 637520 632679 628534 624444 620171 616429 614294 613971 614575 615184 615628 615987 615867 614717 612585 610113
60157F10113k151j470q09o50j178j696j213K81J671K054J590R15M21L09O91J380
60141F10258K087K962M280N578N975N576N610O781Q320R163R254R113Q846Q253
60127G02056P412O389M873K679L05j565k773l392l149j796J74J802K593K831L033
60112G21472L454L956M108L555K419J203K31n66j281j888k540l499m588n200n092
60097G15744m716m571m631m609m320l602k402j128m34m78p97j019j054n65Q27
60082F82245K598L470K937J906J396J371J377J324J006k81k752n426p259q383
60068F75529r404j0098r864q960q274q067p919p693p614p507o844n618m452l823
60054E69392l763m128m553m322l087j624j035j254j140m8J527K988M403N908P098
$$ plain form
60157 610113 607962 606492 605683 605033 603855 602159 600946 601227 602898 604952 606542 607457 607878 608187 608878 610258
60141 610258 612345 615307 619587 625165 631140 636716 642326 649107 657427 666590 675844 684957 693803 702056
60127 702056 709468 715857 720730 723409 723714 722149 719376 715984 712835 711039 711213 713015 715608 718439 721472
60112 721472 724926 728882 732990 736545 738964 740167 740398 739832 738551 736663 734123 730624 726036 720836 715744
60097 715744 711028 706457 701826 697217 692897 689295 686893 685765 685331 684853 684056 683037 681983 681418 682245
60082 682245 684843 688313 691250 693156 694552 695923 697300 698624 699630 699349 696597 691171 683912 675529
60068 675529 666125 656027 646163 637203 628929 620862 612943 605250 597636 590129 583285 577667 573215 569392
60054 569392 565629 561501 556948 552626 549539 547915 546880 545626 544486 544438 545965 548953 553356 559264 566362
60039E66362P554P507P447P465P340P016O525N673M208K325O57l63r63j733k940
60024F24080m294n438o440p536q556q953q578q003p864q108q079p275n790m215
60010E24951l171k833k810k627k323k264k462k413j746o93K11N69K39n78j257
59995E00793j171l31O57J362J848K208K381K476K783L267L627L909M468N176N378
59980E38831M831L962K984J624K7j037j377j896l140m233m136l279k883l208l442
59965E23628k996j932l91J424K858L281K987K875L276L770M035M186M216L857
59951E55074L095K345J912J676J379R52N86O12J232K085K379J725O16k17o58j119
59935E73674j906k933l807l984l235k100j453j350r64R4J113J345J010P41P64
$$ plain form
60039 566362 573916 581423 588870 596335 603675 610691 617216 622889 627097 629422 630079 629716 628753 627020 624080
60024 624080 619786 614348 607908 600372 591816 582863 574285 566282 558418 550310 542231 534956 529166 524951
60010 524951 521780 518947 516137 513510 511187 508923 506461 504048 502302 501609 501820 502389 502628 502050 500793
59995 500793 499622 499291 499948 501310 503158 505366 507747 510223 513006 516273 519900 523809 528277 533453 538831
59980 538831 543662 547624 550608 552232 552259 551222 549845 547949 544809 540576 536440 533161 530278 527070 523628
59965 523628 520632 518700 518309 519733 522591 525872 528859 531734 535010 538780 542815 547001 551217 555074
59951 555074 558169 560514 562426 564102 565481 566433 567019 567631 568863 570948 573327 575052 575668 575451 574793 573674
59935 573674 571768 568835 565028 561044 557809 555709 554256 552906 551942 552036 553149 554494 555504 556245 557009
59920E57009J174K194L452L887L251K841L826N584O856P643Q627R342Q613O553
59906F30852M523L132J754J20j104j596j943k421k383j434k79J87r0o48j072r52
59890F26646Q0J738L135L749L931M181M526M794M964M947M652M394M731N585O115
59875F88168N714M605L291J916M48r39k053k907l639m417n441o602p278o972o146
59860F57748n800o106o145n235l821k782k315j959j299k80R71K311L593M739N828
59845F39448P095Q861J1136J3169J3682J1954Q530M658J354q31j643j309m73N57
59831G16188K057L789M328K400j344m870o869p523p514p352p551q317q915q398
59817F60109p135o490o832o901n646l597j795k98J373K863L071J587o45k227k593
$$ plain form
59920 557009 558183 560377 563829 567716 570967 573808 577634 583218 590074 597717 606344 615686 624299 630852
59906 630852 635375 638507 640261 640381 639277 637681 635738 633317 630934 629500 629221 629408 629318 628670 627598 626646
59890 626646 626726 628464 631599 635348 639279 643460 647986 652780 657744 662691 667343 671737 676468 682053 688168
59875 688168 693882 698487 701778 703694 704142 703203 701150 698243 694604 690187 684746 678144 670866 663894 657748
59860 657748 651948 645842 639697 634462 630641 627859 625544 623585 622286 622006 622977 625288 628881 633620 639448
59845 639448 646543 655404 666540 679709 693391 705345 713875 718533 719887 719056 717413 716104 715631 716188
59831 716188 718245 722034 726362 728762 727418 722548 715679 708156 700642 693290 685739 677422 668507 660109
59817 660109 652974 646484 639652 632751 627105 623508 621713 621415 622788 625651 628722 630309 629664 627437 624844
59802F24844k264k063k277k713l300m056m490l874k468j638k068k648k062p10
59788E88213O9J27L37O58M3j604k890k819k000j491j503j734k013k137j930j832
59772E67494k493l536l649k387q11J24P56J611K180J815J074J144K247L493M092
59757E73154M107M100M490N173N547N124M279L953M592N756O856P723Q309Q485
59743F51648Q290P929P410O680O055N806N424M164K361J161Q70O78K20J22O18
59728G09436Q56L06k89k49j40o20j099o52L98R83Q81O55L71l73j269j298j47J199
59710G08949J588R04j07p79r99r89q68n76j94RjK63J181K397L377M351N954Q007
59692G32467R652J0705J1800J2839J2461R609M916k9m012o279o327m478k227j134
$$ plain form
59802 624844 622580 620517 618240 615527 612227 608171 603681 599807 597339 595701 593633 590985 588923 588213
59788 588213 588282 588409 588746 589404 589447 587843 584953 582134 580134 578643 577140 575406 573393 571256 569326 567494
59772 567494 565001 561465 557816 555429 554618 554742 555498 557109 559289 561104 562178 563322 565569 569062 573154
59757 573154 577261 581361 585851 591024 596571 601695 605974 609927 614519 620275 627131 634854 643163 651648
59743 651648 659938 667867 675277 681957 688012 693818 699242 703406 705767 706928 707798 708476 708696 708818 709436
59728 709436 710292 710598 710309 710060 709920 709300 708201 707549 707947 708930 709811 710466 710837 710464 709195 707897 707750 708949
59710 708949 710537 711441 711334 710555 709556 708567 707699 707123 706929 706938 706937 707200 708381 710778 714155 718506 724460 732467
59692 732467 742119 752824 764624 777463 789924 799533 804449 804420 800408 794129 787802 783324 781097 779963
59678G79963j628l163m979o279o403n579n042n705p150q372r032r359r370q878
59664F89024p971o867n659m552l960l836l389k012j44J322K048K301K411K724
59650F61440L608M937N899N821M865L600K207N92j196l013m791o290p108p215
59636F63356p035o794o239n219l926k427p31N69O47k12o74k51o6j010k274k639
59620F25075k315k351k953l456l551l467l310l124l237l735l992l487k660k174
59606E81263j766p01J018K653L596L547K343M54q44p04J69M73k6o26r43j093q88
59589E87925L2J323K097J986J428R10N71L66J30l72j083j676k250l337m768n384
59573E77898m640l638l652m381m760m736m830m612l173q98O99R99P55N62J76m47
$$ plain form
59678 779963 778335 775172 770193 763914 757511 751932 746890 741185 734035 725663 716631 707272 697902 689024
59664 689024 681053 674186 668527 663975 660015 656179 652790 650778 650634 651956 654004 656305 658716 661440
59650 661440 665048 669985 675884 681705 686570 690170 692377 692969 691773 688760 683969 677679 670571 663356
59636 663356 656321 649527 643288 638069 634143 631716 630985 631554 632201 631989 631315 631064 630998 629988 627714 625075
59620 625075 622760 620409 617456 614000 610449 606982 603672 600548 597311 593576 589584 586097 583437 581263
59606 581263 579497 578796 579814 582467 586063 589610 591953 592407 591563 590859 591028 591501 591475 590849 589906 588813 587925
59589 587925 587957 589280 591377 593363 594791 595701 596272 596638 596768 596396 595313 593637 591387 588050 583282 577898
59573 577898 573258 569620 565968 561587 556827 552091 547261 542649 539476 538578 539277 540276 541031 541593 541769 541322
59557E41322o74k23L45N29N40P62J242J912K612K846K255J410J411K541L982M872
59541E67684N114N086N314O370Q477J1161J3968J7280K1394K4867K4870J9734
59529G31319J0658P97o825j0588j0594q271n255k281O44L277M933N249M515L136
59515G20714J290q38l009n124p050q415r046r456j0175j0840j0637r599q578p946
59501F21291p140n688l938k515j611j057o03M0J047K228L199L797M068L953L376
59486F20447K545J804J380J583K801M876O935Q400R733J1586J3706J5506J7229
59473G18531J9550K2239K4168K4447K2662J8408J1714L953k792p478j0440j2078
59461H32884j2174j0595p713m000J59M171P591J0688J3903J6830J8618J9334J9949
$$ plain form
59557 541322 540648 540425 540770 541299 541839 542601 543843 545755 548367 551213 553468 554878 556289 558830 562812 567684
59541 567684 572798 577884 583198 589568 598045 609206 623174 640454 661848 686715 711585 731319
59529 731319 741977 742774 735949 725361 714767 706496 701241 698960 699604 702881 707814 713063 717578 720714
59515 720714 722004 721166 718157 713033 705983 697568 688522 679066 668891 658051 647414 637815 629237 621291
59501 621291 614151 608463 604525 602010 600399 599342 598739 598779 599826 602054 605253 609050 613118 617071 620447
59486 620447 622992 624796 626176 627759 630560 635436 642371 650771 660504 672090 685796 701302 718531
59473 718531 738081 760320 784488 808935 831597 850005 861719 865672 862880 855402 844962 832884
59461 832884 820710 810115 802402 798402 798561 802732 810323 821011 834914 851744 870362 889696 909645
59448I09645K1040K2446K4112K6132K7827K7827K5392K0586J3210K942r026j9674
59436A092459k6378k8751k7988k5387k2088j9307j7834j7657j8521k0199k1855
59425H46494k2002j9906j6440j2816r038m434P40N268Q476J0931J3559J6673K0080
59412H37585K3491K6647K9547L2900L7451M1835M1486L1542J1961j0878k8721
59401A074846l7294l7293l1118k0753q308M019J5209K4453K8342K1827M273j7313
59389A020890l3658m0975m1716l9246l4825k9236k3935j9596j5591j1652q450
59378G22010o063l616r57Q58J354J408J726J942J840K048K834L514L669L794M092
59363G40453L917L117K679L258M123M412M414M813N503O005O332O693P063P621
$$ plain form
59448 909645 930685 953131 977243 1003375 1031202 1059029 1084421 1105007 1118217 1121159 1112133 1092459
59436 1092459 1066081 1037330 1009342 983955 961867 942560 924726 907069 888548 868349 846494
59425 846494 824492 804586 788146 775330 766292 761858 762598 767866 776342 787273 800832 817505 837585
59412 837585 861076 887723 917270 950170 987621 1029456 1070942 1102484 1114445 1103567 1074846
59401 1074846 1037552 1000259 969141 948388 940080 944099 959308 983761 1012103 1033930 1038203 1020890
59389 1020890 987232 946257 904541 865295 830470 801234 777299 757703 742112 730460 722010
59378 722010 715947 712331 711374 712232 713586 714994 716720 718662 720502 722550 725384 728898 732567 736361 740453
59363 740453 744370 747487 750166 753424 757547 761959 766373 771186 776689 782694 789026 795719 802782 810403
59349H10403Q925J1138J3705J6208J8758K1163K2590K2643K2009K1494K1099K0417
59337A030552J9070J6407J1747N472r02o248j0569j4037j6382j7766j9051k0427
59325I77866k0848j9660j7874j6826j6373j5431j3700j1890j0612r901r519r103
59313H06129q220o832n388m291l635l638m565n952o638o064m865l768k670j183
59299G38420O08K498M686P373J0300J2985J4840J4850J1890N847j975r737j5852
59286G96733j9120j9238j7420j5452j3800j1556q398n363l204j319J063L687N969
59273F92582P920R711J1227J2637J4487J6632J8025J8145J7594J6753J4989J1910
59261H62612Q271M831J343k431n739p894r426j1180j3061j4442j5069j4797j3305
$$ plain form
59349 810403 819328 830466 844171 860379 879137 900300 922890 945533 967542 989036 1010135 1030552
59337 1030552 1049622 1066029 1077776 1083248 1082346 1076098 1065529 1051492 1035110 1017344 998293 977866
59325 977866 957018 937358 919484 902658 886285 870854 857154 845264 834652 824751 815232 806129
59313 806129 797909 791077 785689 781398 777763 774125 769560 763608 756970 750906 746041 742273 739603 738420
59299 738420 739028 741526 746212 753585 763885 776870 791710 806560 818450 824297 822322 812585 796733
59286 796733 777613 758375 740955 725503 711703 700147 691749 686386 683182 681863 682926 686613 692582
59273 692582 700502 710213 721440 734077 748564 765196 783221 801366 818960 835713 850702 862612
59261 862612 870883 875714 877057 874626 868887 860993 851567 840387 827326 812884 797815 783018 769713
59248G69713j0914q817p665o727n187l340j767l03J298K715L888N431P306Q223
59234G53854P464O190N778N904N550M796M219L461J932J80r65j880l323m799n308
59219G83053n143n324n718n360m354l741l617k984j588l80K4J04L15K93m41j786
59203G43353l318m677n590o058o351o432n775m289k883k370k368k112j747j858
59189F87525k188j987j254n68rP66J629K240K847L883M955N274M808M140L493
59174G15554K890K837L763N006N584N734O535Q133R545J0250J0802J1681J2515
59161H10829J2733J2108J0576Q152N260K539K27j850l841n852q064j0338j2050
59148H20429j2868j3301j3845j4135j3653j2757j2108j1590j0703r637q988q704
$$ plain form
59248 769713 758799 749982 742317 735590 730403 727063 725296 724993 726291 729006 732894 738325 745631 753854
59234 753854 761318 767508 773286 779190 784740 789536 793755 797216 799148 799328 798363 796483 793160 788361 783053
59219 783053 777910 772586 766868 761508 757154 753413 749796 746812 745224 744844 744868 744972 745287 745580 745139 743353
59203 743353 740035 735358 729768 723710 717359 710927 705152 700863 697980 695610 693242 691130 689383 687525
59189 687525 685337 683350 682096 681528 681519 682285 683914 686154 689001 692884 697839 703113 707921 712061 715554
59174 715554 718444 721281 725044 730050 735634 741368 747903 756036 765581 775831 786633 798314 810829
59161 810829 823562 835670 846246 854398 859658 862197 862424 860574 856733 850881 842817 832479 820429
59148 820429 807561 794260 780415 766280 752627 739870 727762 716172 705469 695832 686844 678140
59136F78140q289p738p377p002o132m871l700k673j624p73l09K50J293K249K442
59121F33886K435L351N166O816P824Q665R651J0530J1181J1767J2151J1995J1406
59108G46824J0798J0222R494Q701P941O975N805N006M718L945J925m53j784k167
59094H17950k752l692m026l406k526j874j316r82j325k180k752k742k711l232
59080G82434m373n874p179p621p281p242q175r219r190q310p610p218o535n610
59066F80997m956m376l357k354k262k862l151k938k768k538j753r74j384k770
59052F42554l485k631r05Q18K415L745M300L989L294K387J025o62k127l209m062
59037F47446m555m575m589m821m387k523j90J048J384K399M514O567P795Q659
$$ plain form
59136 678140 669851 662113 654736 647734 641602 636731 633031 630358 628734 627961 627652 627902 629195 631444 633886
59121 633886 636321 639672 644838 651654 659478 668143 677794 688324 699505 711272 723423 735418 746824
59108 746824 757622 767844 777338 786039 793980 800955 806760 811766 816484 820429 822354 821901 820117 817950
59094 817950 815198 811506 807480 804074 801548 799674 798358 797376 796051 793871 791119 788377 785666 782434
59080 782434 778061 772187 765008 757387 750106 742864 734689 725470 716280 707970 700360 693142 686607 680997
59066 680997 676041 671665 668308 665954 663692 660830 657679 654741 651973 649435 647682 646708 645324 642554
59052 642554 639069 636438 635533 636351 638766 642511 646811 650800 654094 656481 657506 656844 654717 651508 647446
59037 647446 642891 638316 633727 628906 624519 621996 621806 622854 624238 626637 631151 637718 645513 654172
59023F54172R645J0763J2299J4500J6441J6833J5916J5020J4275J2531R563O531
59011H08489M022J551p41j837j866k456m342o185o564n663m234k377j09K141M263
58996G84092O532Q479Q984P978O692N776M601K852J309L55p11k182l243l524l862
58981H24128m683n088m488l722l421k570k8L527O399P978Q973J0137J1628J3254
58967H62024J4635J5460J5910J6362J6623J6165J5166J4285J3387J1594Q773N774
58955A026158K953k73m110p918j1393j4921j8310k0556k1300k1289k0998k0097
58943H67946j8673j7492j6552j4794j1903q985o846n019l164j930j641j536j163
58930G58248j158j810k219j800j345j604k086k210k421l173l890l991l868l960
$$ plain form
59023 654172 663817 674580 686879 701379 717820 734653 750569 765589 779864 792395 801958 808489
59011 808489 812511 814062 813321 811484 809618 807162 802820 796635 790071 784408 780174 777797 777688 779829 784092
58996 784092 790624 799103 808087 816065 822757 828533 833134 835986 837295 837650 836939 834757 831514 827990 824128
58981 824128 819445 814357 809869 806147 802726 800156 800128 803655 810054 818032 827005 837142 848770 862024
58967 862024 876659 892119 908029 924391 941014 957179 972345 986630 1000017 1011611 1020384 1026158
58955 1026158 1029111 1028838 1024728 1016810 1005417 990496 972186 951630 930330 909041 888043 867946
58943 867946 849273 831781 815229 800435 788532 779547 772701 767682 764518 762588 760947 759411 758248
58930 758248 757090 755280 753061 751261 749916 748312 746226 744016 741595 738422 734532 730541 726673 722713
58916G22713l821k962j693l63J154K570K999K479K408L569M955N501N758O795
58902G52062Q576J0590J3044J6195J9291K1308K2085K1932K0868J9036J7122J5576
58890I57685J4244J3275J3457J4997J7014J8873K0916K3129K4274K3238K0302
58879A161404J6348J1850P259L208l97m428r002j3100j6299j9437k2757k4846
58867A089803k4534k2573k0407j8420j6395j4529j2948j1251r454q329q131q138
58855I14694q185r079j0767j1683j0944r722r287r309r122r053r223q750p530
58842G92040p177q636j0384j0693j0078r854r725q841p933q169q915q626p311
58829F75698o148n370m324l071k203j555o09L44P87J132J947K776L044L346M472
$$ plain form
58916 722713 718892 715930 714237 713874 715028 717598 720597 723076 725484 729053 734008 739509 745267 752062
58902 752062 760638 771228 784272 800467 819758 841066 863151 885083 905951 924987 942109 957685
58890 957685 971929 985204 998661 1013658 1030672 1049545 1070461 1093590 1117864 1141102 1161404
58879 1161404 1177752 1189602 1196861 1200069 1199672 1195244 1186242 1173142 1156843 1137406 1114649 1089803
58867 1089803 1065269 1042696 1022289 1003869 987474 972945 959997 948746 939292 930963 922832 914694
58855 914694 906509 897430 886663 874980 864036 854314 845027 835718 826596 817543 808320 799570 792040
58842 792040 784863 776227 765843 755150 745072 735218 725493 716652 708719 700550 691635 683009 675698
58829 675698 669550 664180 659856 656785 654582 653027 652418 652762 653549 654681 656628 659404 662448 665794 670266
58814F70266N935O803P126P239O640N025L482L039K948J958L84p05j456k629l879
58799G12176m400m573n212n897n819n545o105o922o603n324m526m521m213l083
58785F39433j710m49R36K374L507M525N775O867P209P059O945O630N671M337K841
58770G01950N39k807n842p171p310p591p977p609o696o155n863n069l987l425
58756F24987l235k659j795j225p12K92J356J704J563J577J602J406J719L078M478
58741F34136M843M916N963P502Q172Q058Q155Q314P755O991P065P411O664N193
58727G31138M633N163N397M772M049L526K739J955K001K566K519J957K167L492
58713G78074M876N644O138O550O576O192N513M060J498j249l045m320o322r066
$$ plain form
58814 670266 676201 683004 690130 697369 704009 709034 712516 715555 718503 720461 720845 720140 718684 716055 712176
58799 712176 707776 703203 697991 692094 686275 680730 674625 667703 661100 655776 651250 646729 642516 639433
58785 639433 637723 637274 638210 640584 644091 648616 654391 661258 668467 675526 682471 689101 694772 699109 701950
58770 701950 702489 699682 693840 686669 679359 671768 663791 656182 649486 643331 637468 632399 628412 624987
58756 624987 621752 619093 617298 616073 615361 615653 617009 618713 620276 621853 623455 624861 626580 629658 634136
58741 634136 638979 643895 649858 657360 665532 673590 681745 690059 697814 704805 711870 719281 725945 731138
58727 731138 735771 740934 746331 751103 755152 758678 761417 763372 765373 767939 770458 772415 774582 778074
58713 778074 782950 788594 794732 801282 807858 814050 819563 823623 825121 823872 820827 816507 810185 801119
58699H01119j1557j3598j5731j7745j8848j9090j9054j8594j7279j5619j4291
58688F19713j2792j0409p885o441n842n135m558m845n379n075m395m471m809m097
58674E33580k697k133k420k071n27J452L448N588P440Q649J0121J2708J5368J6521
58660F05027J6384J5865J4193J0229N228J590o04l057n893p643q190q791r414
58647F24924q841p360o585o659o261n330m998n046m123k419j282m52J404L630
58633E70602M233L613M212O222O996N301K925J311k14k046l090k978k833k949
58619E91305k231o23M56P72J741L665N139N788O838Q339Q643P357O085N523M532
58604F53329K784J527J041R7j370j990j930k944m826n117l413k414l415m199l045
$$ plain form
58699 801119 789562 775964 760233 742488 723640 704550 685496 666902 649623 634004 619713
58688 619713 606921 596512 588627 582186 576344 571209 566651 561806 556427 551352 546957 542486 537677 533580
58674 533580 530883 528750 526330 524259 523732 525184 528632 534220 541660 550309 560430 573138 588506 605027
58660 605027 621411 637276 651469 661698 666926 668516 667912 664855 658962 651319 643129 634338 624924
58647 624924 616083 608723 602138 595479 589218 583888 578890 573844 569721 567302 566020 565568 566972 570602
58633 570602 574835 578448 582660 588882 595878 601179 604104 605415 605201 603155 600065 597087 594254 591305
58619 591305 589074 588451 588907 589679 591420 595085 600224 606012 612850 621189 629832 637189 643274 648797 653329
58604 653329 656113 657640 658681 658778 657408 655418 653488 650544 645718 640601 637188 634774 631359 627160 624115
58589F24115j448q81l1K525N566P419Q624J0298J1931J2747J3339J4135J4115
58576G22454J2621J0745R447Q179O572N638O041P025Q077R724J1822J3315J4520
58563H46180J7212K1464K4979K6681K8209L0576L2072L1098K8461K5180K0440
58552A132552J3651O363L67m180p409q649q163p813q528r014q265p304p334q365
58538A067909j0662j5090k0832k5245k7228k8274k9171k8463k5483k1973j9206
58527H16282j6241j2573r652q124o419l747j748j389j133k1M29p30j817j577j411
58512G50129k438l167k388j590k239l178l013k514k436j677J95J258M15m24K88
58497G27221J039L58k86O07J496N26j104j367p00l34L44K076L617M026M837P403
$$ plain form
58589 624115 622667 621786 621755 624280 629846 637265 645889 656187 668118 680865 694204 708339 722454
58576 722454 735075 745820 755267 763446 770018 775656 781697 788722 796799 806523 818345 831660 846180
58563 846180 863392 884856 909835 936516 964725 995301 1027373 1058471 1086932 1112112 1132552
58552 1132552 1146203 1152566 1152933 1148753 1141344 1132695 1124532 1116719 1108191 1099177 1090912 1083608 1076274 1067909
58538 1067909 1057247 1042157 1021325 996080 968852 940578 911407 882944 857461 835488 816282
58527 816282 800041 787468 777816 769692 763273 759526 757778 756389 755256 755235 755664 754934 753117 751540 750129
58512 750129 747691 744524 742136 740546 738307 735129 732116 729602 727166 725489 725684 726942 727357 726933 727221
58497 727221 728260 728618 728332 728939 730435 730961 729857 728490 727790 727456 727800 729876 733493 737519 742356 749759
58481G49759J0318J2046J3688J6557J9343K0530K1177K2489K2895K0455J5998
58470I45255J1162N599j046o807r995j1946j4315j5927j5189j3240j1692r615
58458H52244n951k480j067q5L018P561J1235J3846J6198J7161J5253J1487P610
58445I46030L212k567q307j2117j4299j5660j5382j3267j1480j1246j0408p266
58433H27243l962k742j894Q93L998M839M678O231Q785J0094J0877J3034J5276
58420H97350J4948J2597J0514Q350M375m95m009o461r358j1760j1927j0938j0852
58407H82334j0879r312p468p616q629p919o104n524n644m213j610L7P92K041L098
58392H13384K626J955L102M967N241M435M240L844J907Q9M95J613J116N03K383
$$ plain form
58481 749759 760077 772123 785811 802368 821711 842241 863418 885907 908802 929257 945255
58470 945255 956417 962016 960970 954163 944168 932222 917907 901980 886791 873551 861859 852244
58458 852244 846293 843813 842746 842661 845679 853240 864475 878321 894519 911680 926933 938420 946030
58445 946030 949242 946675 938368 926251 911952 896292 880910 867643 856163 844917 834509 827243
58433 827243 823281 820539 818645 819538 823536 828375 833053 839284 848069 858163 869040 882074 897350
58420 897350 912298 924895 935409 943759 948134 947639 943630 937169 927811 916051 904124 893186 882334
58407 882334 871455 862143 854675 847059 838430 830511 824407 818883 813239 809026 807416 807453 808245 810286 813384
58392 813384 816010 817965 821067 826034 831275 835710 839950 843794 845701 845790 846285 847898 849014 849517 851900
58377H51900N304O053N147N189N735M760L444M340O366O628N721O313P993Q494
58363I33387Q469J0066J2328J2955J2916J4414J6053J5205J3238J3007J3148J0413
58351A085599N866K987J469j213l857l336q05O0l16J309M414N703N482O810R389
58336A119561J0406J0380J2073J4668J5264J4865J6601J9261J9107J6849J6245
58325A285280J6868J5045J0964Q072O414L318k34q37P23Q31r1J147L582L619K210
58310A356911L236N982O657O137Q404J2446J3724J2636J3457J5877J5859J4010
58298A485336J4619J7147J7147J5035J5296J7653J7685J5674J6074J8774J9683
58287A670123J9201K1150K4230K3881K1605K2844K6649K7403K5699K6958L0411
$$ plain form
58377 851900 857204 863257 868404 873593 879328 884088 887532 891872 898238 904866 910587 916900 924893 933387
58363 933387 941856 951922 964250 977205 990121 1004535 1020588 1035793 1049031 1062038 1075186 1085599
58351 1085599 1091465 1094452 1095921 1094708 1090851 1087515 1086710 1086770 1086454 1087763 1092177 1097880 1103362 1110172 1119561
58336 1119561 1129967 1140347 1152420 1167088 1182352 1197217 1213818 1233079 1252186 1269035 1285280
58325 1285280 1302148 1317193 1328157 1336229 1342643 1345961 1345727 1344890 1345613 1346444 1346353 1347500 1351082 1354701 1356911
58310 1356911 1360147 1366129 1372786 1378923 1387327 1399773 1413497 1426133 1439590 1455467 1471326 1485336
58298 1485336 1499955 1517102 1534249 1549284 1564580 1582233 1599918 1615592 1631666 1650440 1670123
58287 1670123 1689324 1710474 1734704 1758585 1780190 1803034 1829683 1857086 1882785 1909743 1940154
58276A940154L0422K7984K9449L4402L6474L5778L8415M3866M5501M3732M5754
58265B351931N1727N4322N2905N4728O0763O3903O2860O4197O8682O9333O5137
58254C020488O3138O4779O3899O0168O0524O5297O7293O6414P0422P9448Q5156
58243C767026Q7016R3351J04384J11098J13008J19547J31512J39314J42326J50925
58233D959507J66372J78213J84949J96969K15460K29646K38889K55383K80574
58224F905962L01880L17394L39957L71875M00883M26311M62640N11321N57233
58215A0595456N99310O55123P28470Q04012Q81129R79370J102577J234050J375916
58206A8955413J554584J778315K032344K326289K700133L172933L738113M421880
$$ plain form
58276 1940154 1970576 1998560 2028009 2062411 2098885 2134663 2173078 2216944 2262445 2306177 2351931
58265 2351931 2403658 2457980 2510885 2565613 2626376 2690279 2753139 2817336 2886018 2955351 3020488
58254 3020488 3083626 3148405 3212304 3272472 3332996 3398293 3465586 3532000 3602422 3681870 3767026
58243 3767026 3854042 3947393 4051777 4162875 4275883 4395430 4526942 4666256 4808582 4959507
58233 4959507 5125879 5304092 5489041 5686010 5901470 6131116 6370005 6625388 6905962
58224 6905962 7207842 7525236 7865193 8237068 8637951 9064262 9526902 10038223 10595456
58215 10595456 11194766 11849889 12578359 13382371 14263500 15242870 16345447 17579497 18955413
58206 18955413 20509997 22288312 24320656 26646945 29347078 32520011 36258124 40680004
58198D0680004N288010O371722P676309R252788J1210594J3639781J6617982K0299636
58190A31036826K4845723L0190676L5970240M1609943M6094636M7456334M3041826
58183D00246204L1235855J3377273o289056k2953418l3764135l8484477l8478196
58176C04890050l5570605l1521278k7706361k4758535k2533408k0564828j8550510
58169A23684525j6451699j4343346j2320558j0482023q885897p520246o351730
58162D7329026n373030m575612l918726l361731k896073k517938k200741j920792
58154B0564383j681793j489947j330246j187618j066678r71418q88687q08884
58146A1139112p40325o87165o35268n75364n18757m75019m34878l89858l48798
$$ plain form
58198 40680004 45968014 52339736 60016045 69268833 80479427 94119208 110737190 131036826
58190 131036826 155882549 186073225 222043465 263653408 309748044 357204378 400246204
58183 400246204 431482059 444859332 438570276 415616858 381852723 343368246 304890050
58176 304890050 269319445 237798167 210091806 185333271 162799863 142235035 123684525
58169 123684525 107232826 92889480 80568922 70086899 61201002 53680756 47329026
58162 47329026 41955996 37380384 33461658 30099927 27203854 24685916 22485175 20564383
58154 20564383 18882590 17392643 16062397 14874779 13808101 12836683 11947996 11139112
58146 11139112 10398787 9711622 9076354 8500990 7982233 7507214 7072336 6682478 6333680
58137F333680l19721k94109k64095k38048k24566k16858k06516j97663j94529
58128D177575j89554j76696j63015j55199j47499j34293j21785j15986j11359
58119B862189j02310r4194r2203r0567q3359p5431p2589p0916o5478n9919n8223
58108A997000n6334n0782m6373m6950m7552m3834m0186m0612m0771l6962l3855
58097A512789l5312l6404l2761k9095l0207l1912k9189k5364k4866k4502k0283
58086A192894j5826j5716j7146j5892j4363j6110j8482j8010j7261j9345k1372
58075A003371k0091j8285j9187k0191j8400j6634j7732j8538j5843j2582j2226
58064H13662j2518j0717r304j0509j1031q252n972p788j0396r738q249r562j1435
$$ plain form
58137 6333680 6013959 5719850 5455755 5217707 4993141 4776283 4569767 4372104 4177575
58128 4177575 3988021 3811325 3648310 3493111 3345612 3211319 3089534 2973548 2862189
58119 2862189 2759879 2665685 2573482 2482915 2399556 2324125 2251536 2180620 2115142 2055223 1997000
58108 1997000 1940666 1889884 1843511 1796561 1749009 1705175 1664989 1624377 1583606 1546644 1512789
58097 1512789 1477477 1441073 1408312 1379217 1349010 1317098 1287909 1262545 1237679 1213177 1192894
58086 1192894 1177068 1161352 1144206 1128314 1113951 1097841 1079359 1061349 1044088 1024743 1003371
58075 1003371 983280 964995 945808 925617 907217 890583 872851 854313 838470 825888 813662
58064 813662 801144 790427 781123 770614 759583 751331 745359 737571 727175 717437 709188 699626 688191
58051F88191j0485q880r723j0669q585n982o330p401n643k882k544l279k445j835
58037F01508l818n799m629k714l683n680n109l451m292o728p654p656q957j0333
58023E21005r530q004q125q582p279n837o377p052n571l822m209m828l237j521
58009D37031k461m078l275j629k203l681l087j428j317j792o28Q79N66J2J499
57994D14408L261K756J681K600L591J795p15k65J746J402r07j878j544k328l678
57979D21925l195j667j730k933l031k583l448m362k975n81Ln07K98J485O55r98
57963C96356o44P63K80j326r47J046J575M30k1K63o78k376k638j910k304l192
57947C84677k322m06L0n72K59K280L308L780N774Q385Q953Q130Q943J1295J2305
$$ plain form
58051 688191 677706 668826 659103 648434 639849 633867 627537 620136 614493 611611 609067 605788 603343 601508
58037 601508 597690 591891 587262 584548 580865 575185 570076 566625 562333 555605 547951 540295 531338 521005
58023 521005 511475 503471 495346 486764 479485 473648 467271 460219 454648 450826 446617 441789 438552 437031
58009 437031 434570 430492 427217 425588 423385 419704 416617 415189 413872 412080 411452 412331 412897 412909 414408
57994 414408 417669 420425 422106 424706 428297 430092 429377 429112 430858 432260 431353 429475 427931 425603 421925
57979 421925 418730 417063 415333 412400 409369 406786 403338 398976 396001 395420 395423 394916 395214 396699 397354 396356
57963 396356 395712 396475 396755 395429 394482 395528 397103 397533 397512 397775 397097 394721 392083 390173 387869 384677
57947 384677 382355 381949 381979 381407 381666 383946 387254 391034 396808 405193 414146 422276 431219 442514 454819
57932D54819J1644J1790J3102J3293J1794J0259Q883O382L503K276K021K14k917
57919E47063m881n581p224r778j0898j0327j0132j0581r914q293p787q353p820
57906D35494o040n022m948m042k518k618m476n829o046o603p407o653m516l081
57892C65695k436p48J606K145R07Q40K919M812N166N297N828N378L677K558K753
57877D06397K865K175J504P78j025l108l345k038j794l199m015l266k619l007
57863C86303l196k557k085j972j212j68l12j016J9K572L721K530J411J873K490
57848C88401K150J924K352K073N54p96j412k669m870o078n194l687l095l247l804
57833C62602n001o048n399l408k098j731n49J594K547J756J418K637L580K895
$$ plain form
57932 454819 466463 478253 491355 504648 516442 526701 535584 541966 545469 547745 549766 549980 547063
57919 547063 542182 536601 529377 519599 508701 498374 488242 477661 467747 459454 451667 443314 435494
57906 435494 429454 424432 419484 415442 412924 410306 405830 400001 393955 387352 379945 373292 368776 365695
57892 365695 363259 362511 364117 366262 367169 368009 370928 375740 380906 386203 392031 397409 401086 403644 406397
57877 406397 409262 411437 412941 413719 412694 409586 406241 404203 402409 399210 395195 391929 389310 386303
57863 386303 383107 380550 378465 376493 375281 375113 374801 373785 373804 376376 380097 382627 384038 385911 388401
57848 388401 390551 392475 394827 396900 397454 396658 395246 392577 387707 381629 376435 372748 369653 366406 362602
57833 362602 357601 351553 346154 342746 340648 338917 338368 339962 342509 344265 345683 348320 351900 354795
57819C54795J898J787J668R32Q17J911K599J771P27P14Q61J03r54j687k835m701
57803C60406n904n451m234l257k127m83Q25J199J211J208O88r3J41J498K375J903
57787C49905J085P07J73q00j240o31K53Q55J477J967J776J572K634M354M716L605
57771C72408L006L478L223J421l50j008j555k703l545l668m129n156n422m633
57757C51367m324m938m816l251j889j781j646n67K45j6J5J415K981L336K900K239
57741C41270P29j596k992k566j788j961k197j477o09n04m59J72N42K4m03k9K32
57724C26388l67j078j404k117l311l597k595j975k519k551r00R34J404J478K587
57709C10377M034M477M147L642K405L20r89m03P76R99R16J833L405M713O011P624
$$ plain form
57819 354795 356693 358480 360148 361080 361897 363808 366407 368178 368905 369619 370480 370583 369629 367942 365107 360406
57803 360406 354502 349051 344817 341560 339433 338950 339775 340974 342185 343393 344081 343988 344129 345627 348002 349905
57787 349905 350990 351697 351870 351070 349830 349199 349452 350307 351784 353751 355527 357099 359733 364087 368803 372408
57771 372408 375414 378892 382115 383536 383186 382178 380623 377920 374375 370707 366578 361422 356000 351367
57757 351367 347043 342105 337289 334038 332149 330368 328722 328155 328400 328384 328399 329814 332795 336131 339031 341270
57741 341270 341999 340403 337411 334845 333057 331096 328899 327422 326813 326309 325850 326022 326564 326588 326185 326156 326388
57724 326388 326021 324943 323539 321422 318111 314514 311919 309944 307425 304874 303974 304908 306312 307790 310377
57709 310377 314411 318888 323035 326677 329082 329402 328413 328010 328786 329785 330701 332534 335939 340652 346663 354287
57693C54287Q567Q039O710N042K105k313o284q198q955r880j0328r280p544o297
57679C15671m999k785m00J269L170O568J0932J5193J9845K6070L3903M2848N2982
57666E20267O3960P4068Q1239Q3145P5662N4568K1211j5613m5919o5278p4267
57655G73043p4544o8441n9918n2097m4758l6756k9346k4445k1228j7514j3392
57644C30604j0521q923p264n542m717m447l661k705k521k543j721p12o66q46O2
57629B73877J209P96p34j411r96r35j614k092k158k361k419j800j317j935k669
57614B53441j957m58p0q04j032m09j8o3J78L99l20j441j510o11j13k77k40o0n94
57595B44041j522j694j203j180j788k246k474k836k844k038j507k344l433l020
$$ plain form
57693 354287 362854 370893 377603 382645 384750 382437 376153 367955 359000 349120 338792 329512 321968 315671
57679 315671 310672 307887 307487 308756 311926 318494 329426 344619 364464 390534 424437 467285 520267
57666 520267 584227 658295 739534 822679 898341 952909 974120 958507 912588 847310 773043
57655 773043 698499 630058 570140 518043 473285 436529 407183 382738 361510 343996 330604
57644 330604 320083 311160 303896 298354 293637 289190 285529 282824 280303 277760 276039 275327 274661 273815 273877
57629 273877 275086 275882 275148 273737 272741 271806 270192 268100 265942 263581 261162 259362 258045 256110 253441
57614 253441 251484 251026 250956 250152 249120 248711 248693 248630 248808 249207 248887 247446 245936 245325 245212 244935 244695 244635 244041
57595 244041 242519 240825 239622 238442 236654 234408 231934 229098 226254 224216 222709 220365 216932 213912
57581B13912j737j527k250k163j250j214k276k846k444k219k424j994r64o99j395
57566A86510j757j469j616k292k240j268o64p43l22P81J126K00n72k14M33O05
57550A76498R49K014L113L483L232K548J400L82L48Q80O75k61m69O34J999K806
57534B00231L364L728L153J516k32j454k342k786k273j149m95m85l24J10K06J48
57518B00916P44J575J268j06p95N4J348J972K010J643O62m23n18K50N26n7l40
57501B10729J88N66K58J37P02R82J24j288k281k698k709k356k037k284k659k188
57485A93186j142r47j962k839k554j666j071q40p51p59n48J30N65j42j376j566
57469A75718n50K23K1l62l20j95m2O54J612J815J232Q73R03M77l82o88n08r71
$$ plain form
57581 213912 212175 210648 208398 206235 204985 203771 201495 198649 196205 193986 191562 189568 188604 187905 186510
57566 186510 184753 183284 181668 179376 177136 175868 175204 174461 174139 174920 176046 176246 175674 175460 175893 176498
57550 176498 177447 179461 182574 186057 189289 191837 193237 193619 193967 194847 195522 195261 194792 195426 197425 200231
57534 200231 203595 207323 210476 211992 211760 210306 207964 205178 202905 201756 201261 200776 200452 200562 200768 200916
57518 200916 201660 203235 204503 204397 203602 203656 205004 206976 208986 210629 211291 210868 210350 210600 211126 211069 210729
57501 210729 210917 211483 211741 211878 212580 213562 213686 212398 210117 207419 204710 202354 200317 198033 195374 193186
57485 193186 192044 191097 189135 186296 183742 182076 181005 180165 179414 178655 178107 178237 178802 178660 177284 175718
57469 175718 175168 175391 175412 175050 174730 174535 174493 175147 176759 178574 179806 180679 181582 182059 181677 180989 180481 179510
57451A79510j907j734k89N63q5q03m11K81M02N67J207J305K58p79p45l15l19j24
57433A76582R77K181K414J959J544J071M00K16Q75J574J645J567J708J415M03
57418A96531l38j65M9m37p29J56J427J654Q15p1n13n27P1J209K049J960J328O78
57400B05147p4q78j104o45l70o47o19J93Q47N36oK12Q71J192J289J566J798J753
57382B11061J838K140J916R91M80J034J535Q29l71o25J42R97J585K033K044J324
57366B28953L55l17r30j761k312k145j741j560j205m56j32p51j278m87J221K498
57350B17952K893K869K671K297K049K107K083J791J798K374K788K482K000J899
57336B50053J703J033P22J497K464K311J283O46P37R30J001J185J222N95m20r82
$$ plain form
57451 179510 177603 175869 175580 176143 176058 175255 174844 175125 175527 176094 177301 178606 178864 178085 177340 177025 176706 176582
57433 176582 177559 179740 182154 184113 185657 186728 187128 187344 188219 189793 191438 193005 194713 196128 196531
57418 196531 196193 196028 196077 195640 194911 195067 196494 198148 198963 198892 198379 197852 197923 199132 201181 203141 204469 205147
57400 205147 205073 204195 203091 202446 202076 201429 200810 201003 201850 202386 202380 202592 203463 204655 205944 207510 209308 211061
57382 211061 212899 215039 216955 217946 218426 219460 220995 221824 221453 220828 220970 221967 223552 225585 227629 228953
57366 228953 229308 228991 228061 226300 223988 221843 220102 218542 217337 216881 216749 215998 214720 214233 215454 217952
57350 217952 220845 223714 226385 228682 230731 232838 234921 236712 238510 240884 243672 246154 248154 250053
57336 250053 251756 252789 253511 255008 257472 259783 261066 261712 262449 263379 264380 265565 266787 267382 266962 265980
57320B65980q47m91k68j71j30OM14Q19O08j47n45j91K35K91N81J414J842J069
57302B70469q8l00M45J240J804K481L166L332K878K211J771J906K688L450L280
57287C00733K371J982K595L235L206L260M205N503O302O788P496Q203Q528Q779
57273C73186R191R155Q193O876N954N327M661M104L639K710J270K21K2Ok55j74
57257D34086M34O36O7j14Q65K009K264K209K644K969K560K351L342M711N186N260
57241D71479O284Q212R871J0726J0864J0169Q914Q247Q531Q240O147L562K658
57228E73904L573M942O322Q078R712J0379J0560J1376J2655J3408J3686J4235
57216F92830J4862J4873J4623J4967J5581J5522J4895J4420J3927J2973J2369
$$ plain form
57320 265980 265133 264642 264374 264203 264073 264079 264493 265312 265920 265773 265228 265037 265272 265563 266144 267558 269400 270469
57302 270469 270381 270081 270526 271766 273570 276051 279217 282549 285427 287638 289409 291315 294003 297453 300733
57287 300733 303104 305086 307681 310916 314122 317382 321587 327090 333392 340180 347676 355879 364407 373186
57273 373186 382377 391532 399725 406601 412555 417882 422543 426647 430286 432996 434266 434487 434509 434515 434260 434086
57257 434086 434520 435156 435223 435109 435974 437983 440247 442456 445100 448069 450629 452980 456322 461033 466219 471479
57241 471479 477763 485975 495846 506572 517436 527605 536519 544766 553297 561537 567684 571246 573904
57228 573904 577477 582419 588741 596819 606531 616910 627470 638846 651501 664909 678595 692830
57216 692830 707692 722565 737188 752155 767736 783258 798153 812573 826500 839473 851842
57205H51842J3235J4985J6015J6022J6088J6797J7871J9125K0283K0455J9329
57194A042047J8212J8275J8594J7725J6322J6162J7247J8069J8255J8736J9603
57183A239247J9998J9882J9893J9675J8437J6919J6716J7739J8386J8199J8244
57172A443335J8888J9233J8927J8696J8861J9090J9654K1156K3012K3903K3757
57161A668512K3630K3720K3313K2629K2797K3867K4672K4795K5029K5797K6739
57150A935500K7817K9234L0263K9838K8359K7337K7364K7897K8748L0084L1289
57139B253730L1617L1737L2882L4710L5906L6565L7993M0449M3045M5702M9124
57128B673460N3000N6349N9473O3524O8276P2407P5788P9450Q3480Q7185R1096
$$ plain form
57205 851842 865077 880062 896077 912099 928187 944984 962855 981980 1002263 1022718 1042047
57194 1042047 1060259 1078534 1097128 1114853 1131175 1147337 1164584 1182653 1200908 1219644 1239247
57183 1239247 1259245 1279127 1299020 1318695 1337132 1354051 1370767 1388506 1406892 1425091 1443335
57172 1443335 1462223 1481456 1500383 1519079 1537940 1557030 1576684 1597840 1620852 1644755 1668512
57161 1668512 1692142 1715862 1739175 1761804 1784601 1808468 1833140 1857935 1882964 1908761 1935500
57150 1935500 1963317 1992551 2022814 2052652 2081011 2108348 2135712 2163609 2192357 2222441 2253730
57139 2253730 2285347 2317084 2349966 2384676 2420582 2457147 2495140 2535589 2578634 2624336 2673460
57128 2673460 2726460 2782809 2842282 2905806 2974082 3046489 3122277 3201727 3285207 3372392 3463488
57117C463488R6553J03527J11066J19730J31306J46416J64689J86977K14834K48162
57107D986748K85933L28983L79543M38514N06215N85641O82123Q00209R43785
57098I937694J118656J331345J585210J880723K218911K601235L027031L494791
57090B7195596M003968M549311N112494N663333O168474O595601O914898P106725
57082G3310400P162663P058070O715034O012928M864803L296867J455027m61113
57074A09414679k271271l848214n120254o064801o696111p046118p149335p040273
57066F4178302o756523o338654n828314n267647m696530m145853l633229l165915
57058B4345637k746710k376578k054409j776916j539021j334405j157222j004041
$$ plain form
57117 3463488 3560041 3663568 3774634 3894364 4025670 4172086 4336775 4523752 4738586 4986748
57107 4986748 5272681 5601664 5981207 6419721 6925936 7511577 8193700 8993909 9937694
57098 9937694 11056350 12387695 13972905 15853628 18072539 20673774 23700805 27195596
57090 27195596 31199564 35748875 40861369 46524702 52693176 59288777 66203675 73310400
57082 73310400 80473063 87531133 94246167 100259095 105123898 108420765 109875792 109414679
57074 109414679 107143408 103295194 98174940 92110139 85414028 78367910 71218575 64178302
57066 64178302 57421779 51083125 45254811 39987164 35290634 31144781 27511552 24345637
57058 24345637 21598927 19222349 17167940 15391024 13852003 12517598 11360376 10356335
57050A0356335q73115p61533o64772n79865n07727m51155m10878l83858l64769
57041E358663l48581l32187l14227k94071k71641k48065k25286k04269j84518
57032B935818j65792j48996j34422j20327j04488q6294o6262m4663k1734J831
57022B044671K5561M8476O5722O7772M6545L336n0398r9989j34909j51616j52686
57011A712485j44047j31197j16962j02541q9346p8528o9716o1977n5459n0634
57001H12078m6603m1947l6803l2431k9152k6356k4113k2963k2289k0674j7805
56990D90942j4575j1431q105m766j847J263N752J1358J5974J7371J4532P665j785
56977E22348j1361j8907k3738k5978k5619k3243k0553j8670j6651j3297r513p019
$$ plain form
57050 10356335 9483220 8721687 8056915 7477050 6969323 6518168 6107290 5723432 5358663
57041 5358663 5010082 4677895 4363668 4069597 3797956 3549891 3324605 3120336 2935818
57032 2935818 2770026 2621030 2486608 2366281 2261793 2175499 2109237 2064574 2042840 2044671
57022 2044671 2070232 2118708 2184430 2252202 2298747 2302083 2251685 2151696 2016787 1865171 1712485
57011 1712485 1568438 1437241 1320279 1217738 1128392 1049864 980148 918171 862712 812078
57001 812078 765475 723528 686725 654294 625142 598786 574673 551710 529421 508747 490942
56990 490942 476367 464936 456831 452065 450218 451481 457233 468591 484565 501936 516468 524133 522348
56977 522348 510987 492080 468342 442364 416745 393502 372949 354279 337628 324331 314818 307799
56965C07799n499l192K35L645P038J1723J7705K3167K6946K9404L0113K6815J7952
56952D93851M994q660k0110k7755l1054l0580k7759k3892j9693j5733j2427r464
56940B71718o068k067J939N562R123J3167J8086K4109L0950L7536M2439M4100
56928D90594M0391K9307J1582q171k4465l4872m0063m1082l8572l4058k9702k6344
56916B94545k3362k0493j8259j6551j4512j2124j0323r229p890o122n039n126
56904A45515n250m392l115k487k442k104j033M91J992L157M014N012O574Q653
56890A54585J1157J4450J8794K3590K7848L1000L2384L0584K4572J5298N111m226
56878C85147j1898j7038j8956j8303j6581j4389j1318p497l779l05L750Q688J3856
$$ plain form
56965 307799 302300 299108 299343 302988 310026 321749 339454 362621 389567 418971 449084 475899 493851
56952 493851 498845 490185 470075 442320 411266 380686 352927 329035 309342 293609 281182 271718
56940 271718 265650 263583 265522 271084 280207 293374 311460 335569 366519 404055 446494 490594
56928 490594 530985 560292 571874 563703 539238 504366 464303 423221 384649 350591 320889 294545
56916 294545 271183 250690 232431 215880 201368 189244 178921 169692 161802 155680 150641 145515
56904 145515 140265 135873 132758 130271 127829 125725 124692 125183 127175 130332 134346 139358 145932 154585
56890 154585 165742 180192 198986 222576 250424 281424 313808 344392 368964 384262 389373 385147
56878 385147 373249 356211 337255 318952 302371 287982 276664 269167 265388 265083 268833 277521 291377
56865B91377J8895K4398L0913L8318M6362N4742O2237O6337O4129N3452L4199
56854G85359R534j4653l3074m3996m8528m7994m3448l6720k9709k2599j4538o005
56842D53629J412P561J4213K2676L2706M4019N7022P1478Q5945R8657J07165J06829
56830A103312R2283O2171K1678k0378n6112q0638r2316r2888q6450p6823o5988
56819G07851n4912m4488l4967k5726j6410p463J023R899J9876L0787M2429N4850
56807F82749O7019P5979P7941O9769M9876J9748j4676m4916o4978p4318p5834
56796G68359p2363o5745n7565m8964m0279l1821k4441j8492j3027o922k62O268
56784C94746J2646J9301K6118L2447L7544M0116L7938K9137J4170l850k0810l3566
$$ plain form
56865 291377 310272 334670 365583 403901 450263 505005 567242 633579 697708 751160 785359
56854 785359 794893 780240 747166 703170 654642 606648 563200 526480 496771 474172 459634 453629
56842 453629 455041 462602 476815 499491 532197 576216 633238 704716 790661 889318 996483 1103312
56830 1103312 1195595 1257766 1279444 1259066 1202954 1122316 1030000 937112 850662 773839 707851
56819 707851 652939 608451 573484 547758 531348 523885 524908 534807 554683 585470 627899 682749
56807 682749 749768 825747 903688 973457 1023333 1043081 1028405 983489 918511 844193 768359
56796 768359 695996 630251 572686 523722 483443 451622 427181 408689 395662 388740 388478 394746
56784 394746 407392 426693 452811 485258 522802 562918 600856 629993 644163 640313 619503 585937
56772E85937m0867m3160m1773l8179l3812k9906k6940k4494k2143k0170j8791
56761B45702j7256j4739j1822r845q989q235p169o475o413o203n318m269l617
56748A35352l209k845k703k759k608k182j787j301l04Q31J019M1j029j227o75
56733A14614J09Q90J386J275P96N43M95J61l75n66n08p19q69j02J267J942J756
56716A22095J925K855L318K601J786J976K633K677K182J820J620J275R66J011
56702A50740J228J341J466J694J767J589J444J334Q16k35j292j815j621o91O92
56687A58457J686J704J277J152Q67m23k104k609j715p15l14o7J8p74k177k807
56671A51456k219j437j058n84m8l42j323j505l89O39O29M48R05J328J016N84P12
$$ plain form
56772 585937 545070 501910 460137 421958 388146 358240 331300 306806 284663 264493 245702
56761 245702 228446 213707 201885 192040 183051 174816 167647 161172 154759 148556 143238 138969 135352
56748 135352 132143 129298 126595 123836 121228 119046 117259 115958 115654 116485 117504 117545 116516 115289 114614
56733 114614 114723 115613 116999 118274 119070 119613 120108 120269 119894 119328 118820 118101 117232 117130 118397 120339 122095
56716 122095 124020 126875 130193 132794 134580 136556 139189 141866 144048 145868 147488 148763 149729 150740
56702 150740 151968 153309 154775 156469 158236 159825 161269 162603 163419 163184 161892 160077 158456 157765 158457
56687 158457 160143 161847 163124 164276 165143 164720 162616 160007 158292 157577 157263 157196 157214 156440 154263 151456
56671 151456 149237 147800 146742 146158 146110 145768 144445 142940 142551 143190 143819 144267 145172 146500 147516 148100 148812
56654A48812J019J178J673K531K775K038J346J406J580J351J195J208O05m85n40
56639A67692R52K390K497K104K246K319J625J027J501K359K488K046J558O96o71
56624A92829j600j553j478k054k334j447k00L21L78M71J61o39q70k19j02j193
56608A80471j833p36N77J59j239j706j305j242j215j85J162J217J81l66l5K80
56592A74185L58O95J089R63O29O05L77m96r75n2J189J083L5l61j6J7p9P46K061
56573A82053K332J481R50J258J494J269J294J903K597L189L999M970N833O887
56559B21509Q491J0198J1529J2827J4052J3737J0805O615L406J554J28p30k34
56546C13887R06J112L95Q9L71R2j034k147k971l960m789m672m062m177m868m840
$$ plain form
56654 148812 149831 151009 152682 155213 157988 160026 161372 162778 164358 165709 166904 168112 168717 168232 167692
56639 167692 168644 171034 173531 175635 177881 180200 181825 182852 184353 186712 189200 191246 192804 193500 192829
56624 192829 191229 189676 188198 186144 183810 182363 182163 182484 182862 183333 183494 182855 181985 181766 181664 180471
56608 180471 178638 177902 178479 178638 177399 175693 174388 173146 171931 171746 172908 174125 174306 173940 173905 174185
56592 174185 174543 175238 176327 177290 177919 178524 178901 178405 177430 177378 178567 179650 179685 179324 179308 179325 179246 179992 182053
56573 182053 184385 185866 186816 188074 189568 190837 192131 194034 196631 199820 203819 208789 214622 221509
56559 221509 230000 240198 251727 264554 278606 292343 303148 309763 313169 314723 314851 314121 313887
56546 313887 314793 315905 316300 316389 316760 316852 315818 313671 310700 306740 301951 297279 293217 289040 284172 279332
56530B79332l993l611m170m751m774m654m526m003l309l149l300k826j740j120
56516B29406j506k380l162l523l041j804r17j161j670j360q67j366k283k166j253
56501B00947j011j511j446o01j46m79p99q48j131j397q53J18K89k76l93L1r4q34
56483A89566r76j80N20P04J107J913K234J727J051M87l43j169j112l16J21rK22
56466A95547J069J634J427R52N86J50l15n86q98j312r68N76J919J547L26K15J057
56449B02926J061J04m4J094J931J552Q84O66M19jJ35P93Q83J23m81m02j67P5P48
56430B12299J472J266L05k77l66p61j161m06J227K140K016K056K560K567K175
56415B27112K714M141M678L633K275J337Oj928l253l482l616l965l391j639k07
$$ plain form
56530 279332 275339 271728 267558 262807 258033 253379 248853 244850 241541 238392 235092 232266 230526 229406
56516 229406 227900 225520 222358 218835 215794 213990 213073 211912 210242 208882 208015 206649 204366 202200 200947
56501 200947 199936 198425 196979 196378 196232 195753 194954 194106 192975 191578 190725 190843 191132 190856 190463 190494 190400 189566
56483 189566 188590 188410 188930 189634 190741 192654 194888 196615 197666 198153 197810 196641 195529 195213 195334 195325 195547
56466 195547 196616 198250 199677 200629 201215 201365 201050 200464 199566 198254 197286 197862 199781 201328 201654 201869 202926
56449 202926 203987 204091 204047 205141 207072 208624 209508 210174 210593 210592 210727 211520 212403 212526 212045 211643 211476 211551 212299
56430 212299 213771 215037 215342 215065 214699 213938 212777 212371 213598 215738 217754 219810 222370 224937 227112
56415 227112 229826 233967 238645 242278 244553 245890 245896 243968 240715 237233 233617 229652 226261 224622 224415
56400B24415K6P7Q30J695K230L076M346M880M138L167K831K658K173J706J307
56385B59555M63n56q38n89r09j542j060L97R02j41j070q32l74l47P7J142J567
56368B55845Q58L18P00R68N22L88J093J453P65J54M44P39L35L9L59L48l55l84
56350B64589J050K532K535J569Q68N27J74OO9j28m03J47J274J496N93J72R56J600
56332B79626J239J059K064L268L472L096L024L167L172L107K707J619Q20J785
56318C13225L850M664L748L070L487L454K244J437J861J959P84o0P66K069K505
56303C49063K842M132N719O852Q187J0117J1620J2087J2122J1341P990K309k353
56290D42028l649k997k574k093o01J103K068L064M776O079O073N842O382O883
$$ plain form
56400 224415 224441 224518 225348 227043 229273 232349 236695 241575 245713 248880 251711 254369 256542 258248 259555
56385 259555 260018 259462 258624 258035 257126 255584 254524 254921 255823 255682 254612 253780 253406 253059 253136 254278 255845
56368 255845 256703 257021 257721 258689 259211 259599 260692 262145 262910 263064 263508 264247 264582 264621 264980 265328 264973 264589
56350 264589 265639 268171 270706 272275 273143 273670 273844 273850 273919 273791 273388 273535 274809 276305 276898 277070 278026 279626
56332 279626 280865 281924 283988 287256 290728 293824 296848 300015 303187 306294 309001 310620 311440 313225
56318 313225 317075 321739 325487 328557 332044 335498 337742 339179 341040 342999 343783 343723 344489 346558 349063
56303 349063 351905 356037 361756 368608 376795 386912 398532 410619 422741 434082 442072 444381 442028
56290 442028 438379 435382 432808 430715 430114 431217 433285 436349 441125 447204 453277 459119 465501 472384
56276D72384O739P091Q568R756R678R599J0561J1542J1783J2492J4355J5911J6386
56263F16845J7450K0098K2556K3557K4893K8217L2066L4793L7896M3463N0600
56252I52434N7317O3944P1845Q0667Q9600R9417J10756J22140J32106J41264J50033
56241B071523J56566J59360J59518J57976J52887J42464J27889J10706Q9910O4611
56231C393410L7139J0399j5578m1360o4945q4191j00080j14222j25277j31373
56221B763922j33879j35226j34986j31691j26579j21837j16895j10073j02247
56212A650509r5291q8603q0777p3066o7517o3205n7934n2253m8154m5192m1488
56201I37029l7279l4062l1417k8055k4662k2502k0627j7680j4854j3846j3551
$$ plain form
56276 472384 479123 486214 494782 504538 514216 523815 534376 545918 557701 570193 584548 600459 616845
56263 616845 634295 654393 676949 700506 725399 753616 785682 820475 858371 901834 952434
56252 952434 1009751 1073695 1145540 1226207 1315807 1415224 1525980 1648120 1780226 1921490 2071523
56241 2071523 2228089 2387449 2546967 2704943 2857830 3000294 3128183 3238889 3328799 3393410
56231 3393410 3430549 3440948 3425370 3384010 3319065 3234874 3134794 3020572 2895295 2763922
56221 2763922 2630043 2494817 2359831 2228140 2101561 1979724 1862829 1752756 1650509
56212 1650509 1555218 1466615 1385838 1312772 1245255 1182050 1124116 1071863 1023709 978517 937029
56201 937029 899750 865688 834271 806216 781554 759052 738425 720745 705891 692045 678494
56190F78494j2132j0467j0093r722p520m964m513n227m619l198l102l809l296
56177E95832k033j804j996j020P8m77j328j11K052K488J876K751M622N026M318
56162F10274M770O089O273N925P152R192R605Q894R515J1277J2168J2698J4877
56149G28709J7800J8937J9036K1162K5543K9896L4149M0375M8648N7355O6978
56138A108588P9186R2853J05227J16024J26065J32964J32873J25679J14269J00005
56128B233733Q3628O9113O1192N9472N9592N9009N7065N1142L8551K1566N351
56117B799414q396k0993l1836l9681m7571o0275p7385r4414j09586j23583j33903
56106B051791j36172j30772j21976j10996r6153p9388o5726n6148m7226l7958
$$ plain form
56190 678494 666362 655895 645802 636080 628560 623596 619083 613856 609237 606039 602937 599128 595832
56177 595832 593799 591995 589999 588979 589057 588580 587252 587141 589193 591681 593557 596308 600930 605956 610274
56162 610274 615044 621133 627406 633331 640483 649675 659280 668174 677689 688966 701134 713832 728709
56149 728709 746509 765446 784482 805644 831187 861083 895232 935607 984255 1041610 1108588
56138 1108588 1187774 1280627 1385854 1501878 1627943 1760907 1893780 2019459 2133728 2233733
56128 2233733 2317361 2386474 2447666 2507138 2566730 2625739 2682804 2733946 2772497 2794063 2799414
56117 2799414 2791018 2770025 2738189 2698508 2650937 2590662 2513277 2418863 2309277 2185694 2051791
56106 2051791 1915619 1784847 1662871 1551875 1455722 1376334 1310608 1254460 1207234 1169276
56096A169276l0804k5953k0841j5523j2499j1196q603n118l673l572j555J560
56084A031499K086P08J586M597N694M704N387P744P933N984O006Q324R106Q138
56070A109496R205J2223J2915J1053J1085J3745J4976J4114J5018J8110J9313
56059A261253J8050J8169J9948J9337J6281J5374J7083J6809J3877J2801J4323
56048A443305J4107J1674J1682J4800J6369J5670J7201K1277K2852K1454K2494
56037A632885K6843K8986K7540K7627L0722L2373L2045L4734M0472M3043M1550
56026A998820M2305M6746M8792M6938M7262N1381N3231N1141N1139N4902N6587
56015B549244N5074N6823O2926O6239O5180O7128P4159P9104P9891Q3584R1646
$$ plain form
56096 1169276 1138472 1112519 1091678 1076155 1063656 1052460 1043857 1038739 1035066 1031494 1029939 1031499
56084 1031499 1033585 1034293 1035879 1040476 1046170 1050874 1056261 1064005 1071938 1077922 1083928 1092252 1101358 1109496
56070 1109496 1118701 1130924 1143839 1154892 1165977 1179722 1194698 1208812 1223830 1241940 1261253
56059 1261253 1279303 1297472 1317420 1336757 1353038 1368412 1385495 1402304 1416181 1428982 1443305
56048 1443305 1457412 1469086 1480768 1495568 1511937 1527607 1544808 1566085 1588937 1610391 1632885
56037 1632885 1659728 1688714 1716254 1743881 1774603 1806976 1839021 1873755 1914227 1957270 1998820
56026 1998820 2041125 2087871 2136663 2183601 2230863 2282244 2335475 2386616 2437755 2492657 2549244
56015 2549244 2604318 2661141 2724067 2790306 2855486 2922614 2996773 3075877 3155768 3239352 3330998
56004C330998R5953R4477R5948J03689J10086J12554J19014J31619J41441J45641
55994D481420J53098J66570J76762J80975J89417K05727K20080K29385K44453
55985F247887K68734K90630L06013L26987L58613L89268M14493M47052M92201
55976I541878N37379N78310O29730O97876P69462Q41137R30802J045665J170496
55967A6742735J303023J467379J676062J915972K190858K537548K980209L514434
55959C4328220M160187M980027O018131P278583Q796271J0668364J2988751J5836097
55951A05054631J9360050K3747935K8999743L4801258M0602236M5485969M7685930
55944C45737752M4608075L4232371J7110456l108505k1516668l4594222m1431741
$$ plain form
56004 3330998 3426951 3521428 3617376 3721065 3831151 3943705 4062719 4194338 4335779 4481420
55994 4481420 4634518 4801088 4977850 5158825 5348242 5553969 5774049 6003434 6247887
55985 6247887 6516621 6807251 7113264 7440251 7798864 8188132 8602625 9049677 9541878
55976 9541878 10079257 10657567 11287297 11985173 12754635 13595772 14526574 15572239 16742735
55967 16742735 18045758 19513137 21189199 23105171 25296029 27833577 30813786 34328220
55959 34328220 38488407 43468434 49486565 56765148 65561419 76229783 89218534 105054631
55951 105054631 124414681 148162616 177162359 211963617 252565853 298051822 345737752
55944 345737752 390345827 424578198 441688654 438580149 417063481 382469259 341037518
55937C41037518m3054250m1129546l7203820l2480936k7748944k3392555j9553756
55930A16473711j6290668j3597301j1387609r558891q052996o827276n815402
55923D4943568m959158m242257l657262l170720k750093k393242k102443j856971
55915A9811422j636890j447570j296143j167620j046558r39631q55263p82105
55907A0639642p07941o40137n87854n42457m93967m49431m17118l88836l55061
55898F056840l22411k99597k80387k56320k32911k17939k06086j89803j73752
55889C877634j64614j57540j45881j33856j27120j20992j09888r8554r2458q6781
55879B639950p6050o5374o1294o0595n8519n8765o4928p0918p0343o7142o7046
$$ plain form
55937 341037518 297983268 256853722 219649902 187168966 159420022 136027467 116473711
55930 116473711 100183043 86585742 75198133 65639242 57586246 50758970 44943568
55923 44943568 39984410 35742153 32084891 28914171 26164078 23770836 21668393 19811422
55915 19811422 18174532 16726962 15430819 14263199 13216641 12277010 11421747 10639642
55907 10639642 9931701 9291564 8703710 8161253 7667286 7217855 6800737 6411901 6056840
55898 6056840 5734429 5434832 5154445 4898125 4665214 4447275 4241189 4051386 3877634
55889 3877634 3713020 3555480 3409599 3275743 3148623 3027631 2917743 2819189 2726731 2639950
55879 2639950 2563900 2498526 2437232 2376637 2318118 2259353 2194425 2123507 2053164 1986022 1918976
55868A918976o6921o2423n7818n8031n8659n3887m6979m3282m0061l3066k6289
55857A371560k5393k7597k7427k6489k8501l0564k8526k5511k6325k8604k7934
55846A068689k6485k8108l0019k7740k3642k2364k2340j9811j6710j6744j7855
55835H16871j6343j4238j5063j6392j4220j0745j0327j1386r794o838o501p960
55823F77064p839o941p979r584r087q309j0269j3006j2865j0927j0256r882p515
55810E52605n115n547o778n386k867k463k785p77K009K439K154M591Q181Q908
55796E49169P331O778O748M334L47k103l396n994q930r415q359q677r632q358
55782E09843n452l735k963j191J57j845n818p464n780k985N88O505J4095K1176
$$ plain form
55868 1918976 1852055 1789632 1731814 1673783 1615124 1561237 1514258 1470976 1430915 1397849 1371560
55857 1371560 1346167 1318570 1291143 1264654 1236153 1205589 1177063 1151552 1125227 1096623 1068689
55846 1068689 1042204 1014096 984077 956337 932695 910331 887991 868180 851470 834726 816871
55835 816871 800528 786290 771227 754835 740615 729870 719543 708157 698363 691525 685024 677064
55823 677064 669225 662284 654305 644721 635634 627325 617056 604050 591185 580258 570002 560120 552605
55810 552605 547490 541943 535165 529779 526912 524449 521664 520887 522896 525335 527489 532080 540261 549169
55796 549169 556500 563278 570026 574360 574707 572604 569208 563214 554284 544869 536510 527833 518201 509843
55782 509843 504391 500656 497693 496502 496659 494814 488996 481532 475752 472767 473355 479860 493955 515131
55768E15131K7945L5304M0187L7358K5671Q797r166k5068l5426l8511l7011l4769
55756E10442l2051k7520k2751k0264j8846j5623j1408r296r167q311o502n762
55744C22941n935n013l240k563k716j863l43K48O43K409L958K428j285l723m258
55729C01688n008o239o322n674o315p805p816o417n720n637m178j680n73j010
55715B31294o68J103K735L951O164R262J1442J2233J2566J2090R668O033K837
55702C20710l52m805r320j1572j1942j2400j2525j0576p620o475o989o495m599
55689B15040l363l073k015l55m7p88j97J796K739K150K284L954N408N774N986
55674B35293N825L820O16j130q70p59j711k260j841j723k111j699o23n67j369
$$ plain form
55768 515131 543076 578380 618567 655925 681596 690393 681227 656159 620733 582222 545211 510442
55756 510442 478391 450871 428120 407856 389010 373387 361979 352683 343516 335205 328703 322941
55744 322941 317006 311993 308753 306190 303474 301611 301268 301516 302159 304568 308526 310954 309669 305946 301688
55729 301688 296680 290441 284119 278445 272130 264325 256509 250092 244372 238735 234557 232877 232304 231294
55715 231294 230626 231729 234464 238415 244579 253841 265283 277516 290082 302172 311840 317873 320710
55702 320710 320358 315553 306233 294661 282719 270319 257794 247218 239598 233123 226134 219639 215040
55689 215040 211677 208604 206589 206234 206187 205399 205202 206998 209737 211887 214171 218125 223533 229307 235293
55674 235293 241118 244938 245554 244424 243554 242795 241084 238824 236983 235260 233149 231450 230827 230260 228891
55659B28891r87P05J505Q84Q62K173L038K709K726L580L523J891N34N43M85p83
55643B52279k204k720k878l136k869k118k061k999l951m754o234p908q121o927
55629A93399o190o361n877m277l051k667j677L62J778J639J110J079Q72K28R3
55614A70460O04N82j93n81n24j380l208m239l828l321l326k783j511r90j658k039
55598A42065j494j232j685j526k95N61L61L16R91J199N42M18J329J733Q61K00
55582A44344Q30J727K063K713M073M801M315M213N629P340Q099Q743J0289J2001
55568B21180J3070J4346J6626J8729J8972J7165J3852R119L425j841n856r067
55556C29720j1609j2733j2674j3073j4467j5231j4240j2598j1491j0352q556p054
$$ plain form
55659 228891 227904 228609 230114 230998 231860 234033 237071 239780 242506 246086 249609 251500 252034 252577 253062 252279
55643 252279 250075 247355 244477 241341 238472 236354 234293 231294 227343 222589 216355 208447 200326 193399
55629 193399 187209 180848 174971 170694 167643 164976 163299 163661 165439 167078 168188 169267 170139 170367 170460
55614 170460 171064 171646 171453 170872 170348 168968 165760 161521 157693 154372 151046 148263 146752 145762 144104 142065
55598 142065 140571 139339 137654 136128 135833 136394 136755 137071 138062 139261 139803 140221 141550 143283 144144 144344
55582 144344 145174 146901 148964 151677 155750 160551 164866 169079 174708 182048 190147 198890 209179 221180
55568 221180 234250 248596 265222 283951 302923 320088 333940 343059 346484 344643 338787 329720
55556 329720 318111 305378 292704 279631 265164 249933 235693 223095 211604 201252 192696 185642
55544A85642o630o214m622k580j484j376j513j693j857j507o74k40m94o08k32
55529A53918j25n06m98pk20j435k305k228k428l512m100l296k424k689l072k324
55513A22749j278j310j967k031j676j772k169k274k374k918l416l400l393l761
55499H9010l714k648j385q59p16l04J17L08R70K443L692L708K964K373J857J007
55483I8823P1o91j527k314k378j912k125l196l624k520r35Q0J008K403L574L950
55467H8687M129M366L700J899M95N38R83P44N68J325K122J896J294J213J014J8
55451A14991p22j35P74N11m10n28N8K06k00n03p53j169j126k46L93j60j015r04
55433A09062k96k53l15M63J403J169J43j84L79P77O75N98N77K91R0M28Q00O68
$$ plain form
55544 185642 179012 172798 168176 165596 164112 162736 161223 159530 157673 156166 155492 155252 154758 154150 153918
55529 153918 153793 153287 152789 152782 152562 151127 148822 146594 144166 140654 136554 133258 130834 128145 125073 122749
55513 122749 121471 120161 118194 116163 114487 112715 110546 108272 105898 102980 99564 96164 92771 89010
55499 89010 85296 82648 81263 80404 79688 79384 79501 79809 80779 83222 86914 90622 93586 95959 97816 98823
55483 98823 98894 98203 96676 94362 91984 90072 87947 84751 81127 78607 77672 77752 78760 81163 84737 88687
55467 88687 92816 97182 100882 102781 103276 103814 104797 105541 106109 107434 109556 111452 112746 113959 114973 114991
55451 114991 114269 114134 114908 115419 115009 114481 114539 114745 114545 114042 113289 112120 110994 110748 111141 110981 109966 109062
55433 109062 108766 108513 108198 108661 110064 111233 111376 111192 111571 112348 113023 113621 114198 114489 114579 115007 115807 116475
55415A16475O88J559K500K493K160K656L460L175J904R51N69j05j207j979k235
55400A33064k522k910l068l124l229k728j130O65J425J320J188Q74j27j107r91
55385A17600k16qk84J1Q47J187Q47N98O02K99k80n94q00j384j892j467m13J94
55367A14847J90K18K78j44q31j104j107j405j727j505j212j588j989j259K06Q95
55351A02763N17J18J15M5K8O81J559J510O68L40P98R20K51l58m34n69r71r50l13
55332A06718J54R1J08N06O73K63k70o68j255j908j850r22j1K24J00ll15r36j311
55313I9388r23L6R95J472J200L59l89o39p80j156j189k76R21J240P45M59O65P57
55295A02885O30Q22J314J508J444J721K162J897Q93Q7j52l92p53n41L60J005Q03
$$ plain form
55415 116475 117163 118722 121222 123715 125875 128531 131991 135166 137070 138021 138590 138485 137278 135299 133064
55400 133064 130542 127632 124564 121440 118211 115483 114353 115018 116443 117763 118951 119825 119698 118591 117600
55385 117600 117384 117376 117092 117103 117950 119137 119984 120582 121184 121483 121203 120609 119809 118425 116533 115066 114653 114847
55367 114847 115037 115255 115533 115389 114558 113454 112347 110942 109215 107710 106498 104910 102921 101662 101868 102763
55351 102763 103280 103398 103513 103558 103586 104267 105826 107336 108004 108344 109142 110062 110313 109955 109521 108952 107981 107031 106718
55332 106718 106872 106963 107071 107577 108250 108513 108243 107575 106320 104412 102562 101640 101629 101853 101953 101950 101635 100699 99388
55313 99388 98465 98501 99496 100968 102168 102527 102138 101499 100719 99563 98374 98098 99019 100259 101004 101463 102128 102885
55295 102885 103515 104337 105651 107159 108603 110324 112486 114383 115276 115363 115211 114819 114066 113525 113885 114890 115693
55278A15693L01P0j44o87j268j489j351r13j86M38L54l13p29n33k80n19j040j333
55260A06071j212q04l27O3N22J286J910J372m04j846j602m02N9m04n76J2N98P56
55242A05072Q28P87J06r50j304o84oQ9m7p5k75p35j018r08o60l22K75P42M37l75
55222A00977o81j44O21J233J829K118J459R5q11p24k44R1M16O98N03m5j99J70
55204A07362L18o6l73k30p9j99j50L38Q61J099J281J521J510J117N98O6m29m21
55186A14124L48R74K34j482k432j879q68m14k90m7J29J65M79R68P70l62j489j820
55168A07108j611j239n34L95P52K73j74J41P83J064J074J106R48M88K28N31R50
55151A12283R73P37N30K27k46n47m97m15m72l74j5K48K50K57L23J73r7p0L9m48
$$ plain form
55278 115693 115994 116064 115920 115233 113965 112476 111125 110212 110026 110464 110818 110505 109776 109243 108963 108444 107404 106071
55260 106071 104859 104055 103728 103791 104313 105599 107509 108881 108477 106631 105029 104627 104686 104282 103706 103718 104316 105072
55242 105072 105900 106687 106793 105843 104539 103855 103849 103938 103891 103816 103541 102806 101788 100880 100220 99898 100173 100915 101352 100977
55222 100977 100296 100152 100773 102006 103835 105953 107412 107507 106696 105972 105728 105819 106235 106933 107436 107391 107192 107362
55204 107362 107680 107614 107241 107011 106932 106733 106583 106921 107782 108881 110162 111683 113193 114310 114908 114974 114545 114124
55186 114124 114472 115446 115680 114198 111766 109887 109019 108605 108315 108268 108397 108562 109041 110009 110779 110417 108928 107108
55168 107108 105497 104258 103724 104119 104871 105144 104970 105111 105894 106958 108032 109138 110086 110574 110802 111333 112283
55151 112283 113256 113993 114523 114750 114504 113957 113460 113045 112573 112199 112184 112432 112682 112939 113262 113435 113338 113268 113307 112859
55131A12859j344j555p47M4m8o39r97j009o85J72J240J638J141N37L08P6k22R7
55113A10866J046J475Q20J33L94R41O98p9m35k07K27Q93J786K201J651Q34O31
55096A23875P28L17m00n60o5M08N51O06O70O75P93J100J100L43p39j328j261r45
55078A25868o14k97j89l77m99k63j7k04o17p78o58m97k87M9L47O14J195K049K341
55059A27166J444n5j024j092p60n45n96p86p48j63O28P62K5p20p70n50p75j306
55041A20135j565j487j313r46k45L90N24L93N01P63P56M57J54o0j64N7N77Q25
55023A19752L89l31o75n85m00j85N8J2m90r75q98m62k58m05n48n06l86k42j8L37
55003A13184Q68J498J813J500J041J279K106K437J826J136J156J477J425J108
$$ plain form
55131 112859 111515 109960 109213 109257 109209 108570 107573 106564 105879 106051 107291 108929 110070 110607 110915 110991 110769 110866
55113 110866 111912 113387 114207 114340 114734 115675 116373 116294 115859 115652 115879 116772 118558 120759 122410 123244 123875
55096 123875 124603 124920 124520 123960 123895 124303 124854 125460 126130 126805 127598 128698 129798 130141 129402 128074 126813 125868
55078 125868 125254 124957 124768 124391 123892 123629 123612 123408 122791 122013 121355 120858 120571 120620 120967 121581 122776 124825 127166
55059 127166 128610 128555 127531 126439 125679 125134 124538 123752 123004 122841 123469 124231 124256 123536 122766 122216 121441 120135
55041 120135 118570 117083 115770 114824 114579 114969 115493 115886 116387 117150 117906 118363 118517 118457 118293 118350 118927 119752
55023 119752 120141 119810 119135 118550 118150 117965 118023 118035 117545 116570 115672 115210 114952 114547 113999 113493 113107 112865 112847 113184
55003 113184 114052 115550 117363 118863 119904 121183 123289 125726 127552 128688 129844 131321 132746 133854
54989A33854P72J6j324k314k043j093p75j285j626j136j61O60J024R90Q74R50
54973A27383R65M13m23m75N51J517J432Q19O38P14M23J19N64J363J382M86k99
54956A37572l03J58N91P95N91k5m98l28P0o7o91j095j099j126j226j015n11j93
54938A31600j44M3M89Q10P74N80M68N54R46J537J910J918K001K435K756K609K601
54921A53887L402M542N114N326O157P666Q787Q792P881O289M003J539j50r21j793
54906B20521l615n977p760q225p370n839m602m258m395m157l360k622k330k152
54892A53859j663r35l43j87n35j089j227o35K76R35J333J757K091K138K317L267
54876A61359M820O129O822P297P856Q243Q126P400N955L719J054j397l327m795
$$ plain form
54989 133854 134626 134642 133318 131004 128961 127868 127093 125808 124182 123046 122885 123545 124569 125559 126433 127383
54973 127383 128348 128761 128338 127863 128414 129931 131363 132182 132820 133534 133957 134076 134640 136003 137385 137871 137572
54956 137572 137269 137427 138018 138813 139404 139379 138881 138553 138623 138556 137865 136770 135671 134545 133319 132304 131793 131600
54938 131600 131456 131499 131988 132798 133572 134152 134620 135174 136120 137657 139567 141485 143486 145921 148677 151286 153887
54921 153887 157289 161831 166945 172271 178428 186094 194881 203673 211554 217843 221846 223385 223235 222314 220521
54906 220521 216906 210929 203169 194944 187574 181735 177133 172875 168480 164323 160963 158341 156011 153859
54892 153859 152196 151261 150918 150731 150196 149107 147880 147245 147521 148456 149789 151546 153637 155775 158092 161359
54876 161359 166179 172308 179130 186427 194283 202526 210652 218052 224007 227726 228780 227383 224056 219261
54862B19261n754o115o160o268o248n566m237k919k079j712j817k463l270l546
54848A61107l175k828k984l275l077k374j663j214p74o9N95N05n37j663j759p78
54832A36037K32N16L27J42q2m30n28j54K12M3n10j004j293j259o09M77J226J389
54814A34732J636K158J889K23j434j309K03J129P11J21M28J334K036K206J861
54799A47924J182O02L52k5r34j764j602o12K64P17J060J114L55q75j517j219n63
54782A44459O6P57J269J187Q07Q29J195J355J496K166K875K563J495J133J997
54767A65649L183M249N811P904R440R977J0430J1275J1559J0601R190Q082O597
54754B73947L845K77l094o078q808j0824j1670j1691j1268j0070q012o113n272
$$ plain form
54862 219261 213507 207392 201232 194964 188716 183150 178913 175994 173915 172203 170386 167923 164653 161107
54848 161107 157932 155104 152120 148845 145768 143394 141731 140517 139743 139674 140269 140774 140237 138574 136815 136037
54832 136037 136269 136785 137112 137254 137172 136742 136214 136060 136272 136315 135805 134801 133508 132249 131640 132117 133343 134732
54814 134732 136368 138526 140415 140638 139204 137895 138098 139227 139938 140059 140487 141821 143857 146063 147924
54799 147924 149106 149708 150060 150035 149101 147337 145735 145123 145387 146104 147164 148278 148633 147758 146241 145022 144459
54782 144459 144525 145282 146551 147738 148545 149374 150569 151924 153420 155586 158461 161024 162519 163652 165649
54767 165649 168832 173081 178892 186796 196236 206213 216643 227918 239477 250078 259268 267350 273947
54754 273947 277792 278069 274975 268897 260089 249265 237595 225904 214636 204566 196554 190441 185169
54741A85169m872l796k233j380j676k433k943k954k298j006K87Q27O14K78K78
54726A61862O76J422K255K704K700K930M023N673P110P992Q315P839O361M298
54712B26160K283L81j717l892n631o748p485p908p737o779n225l528k226j728
54698A68220j944k270k195j830j599j658j822j890j765j396p92n1O37R12L52r56
54682A49953k088k086j093j64J02N1R2Q1j16j99NJ69k3m48r54j576k052j700l38
54663A37616J191J855J446N49j52k35K31O18K88n65j109r90n70j22M23P32J73
54646A41379r98j542q78J16M91N02P41R86Q51O67Q46R41L83m16o54l55r3K6K34
54627A43227L96L46M74J049J373O73m97q82l47M3l10p90o76p8M30M98J77p7L06
$$ plain form
54741 185169 180297 176501 174268 172888 171212 168779 165836 162882 160584 159578 159865 160692 161306 161584 161862
54726 161862 162538 163960 166215 168919 171619 174549 178572 184245 191355 199347 207662 215501 221862 226160
54712 226160 228443 228824 227107 223215 217584 210836 203351 195443 187706 180927 175702 172174 169948 168220
54698 168220 166276 164006 161811 159981 158382 156724 154902 153012 151247 149851 149059 149008 149645 150557 150909 149953
54682 149953 147865 145779 144686 144522 144624 144675 144767 144848 144732 144533 144538 144707 144684 144236 143282 141706 139654 137954 137616
54663 137616 138807 140662 142108 142657 142505 142270 142501 143119 143407 142842 141733 140743 140173 140051 140474 141206 141379
54646 141379 140381 138839 137961 138077 138568 139070 139811 140797 141648 142315 143161 144102 144485 144069 143415 143060 142967 142993 143227
54627 143227 143623 143969 144443 145492 146865 147538 147041 146159 145812 145855 145545 144755 144079 144001 144431 144929 145106 145029 145335
54608A45335J181J434K92j335j832j055m88j064j877j569j18J307J791J374O58
54593A44034K13K18L82K93j4p1L86R99J171P28L6m37n78o37q46j116j214j110
54575A42437q98m59L65J215J413Q99M14M41N50K91R0N82J377J416L81q89j466
54558A48159j193n09Q4K33o8m77o44o33o62o41k78L75R15J093J020R33R73J143
54540A49823J240R64L76N5M46J244J743J665J303J001Q26P17N86L61J42J04O1
54523A62657m99j582k290j830o07K73M76O43J183J599J290M40k81n24m36k66j34
54506A60112j14k59m77n30l20j35m20j217j927j891j105j82L50M09Q0n43j151
54489A50680j243n99M72J437J889J654R74M70N08N98Nj045j487q87k6L05K76M38
$$ plain form
54608 145335 146516 147950 148242 146907 145075 144020 143532 142468 140591 139022 138904 140211 142002 143376 144034
54593 144034 144247 144465 144847 145140 145126 145055 145441 146440 147611 148339 148375 147938 147360 146723 145877 144761 143547 142437
54575 142437 141539 141080 141445 142660 144073 144972 145386 145827 146377 146668 146758 147340 148717 150133 150514 149625 148159
54558 148159 146966 146457 146541 146774 146706 146229 145585 144952 144290 143649 143371 143746 144661 145754 146774 147707 148680 149823
54540 149823 151063 152027 152403 152458 152904 154148 155891 157556 158859 159860 160686 161403 161989 162350 162492 162596 162657
54523 162657 162158 160576 158286 156456 155849 156122 156598 157241 158424 160023 161313 161753 161472 160948 160512 160246 160112
54506 160112 159998 159739 159262 158732 158412 158277 157857 156640 154713 152822 151717 151535 151885 152294 152374 151831 150680
54489 150680 149437 148838 149310 150747 152636 154290 155264 155734 156242 156840 156845 155800 154313 153426 153400 153705 153981 154419
54471A54419Q14J117J296J338J107P41P38J113J181O31J33L07P30P07L77K77L54
54454A67380K42Q4J78K36j81p90r78p91p03p63p39q08j209j531j261p23n22m02
54436A56719K73J080R04k38j003o28R5J30n05j211j694j777j110K78J600K054
54420A54967J663J061P72R37J387J680J433Q76O61R92J261Q92J33k93r8L14L82
54403A69020m4n91p39l07M35J101J454J349P82K36N42J859L173L352K514J745
54387A85881J529J242K75j004j729j596j136j012j294j440j078o20p25j165r08
54372A75220L46J429J137j26r84q94m47o3N06J341J930J891J509J273J290J324
54356A86682J093N04j19j16P90K045K900L235L234K729J618O64Q33J921K680K400
$$ plain form
54471 154419 155233 156350 157646 158984 160091 160832 161570 162683 163864 164495 164628 164935 165665 166372 166749 167026 167380
54454 167380 167622 167706 167884 168120 167939 167149 166171 165380 164677 163914 163175 162367 161158 159627 158366 157643 157121 156719
54436 156719 156992 158072 158976 158738 157735 157107 157202 157332 156827 155616 153922 152145 151035 151313 152913 154967
54420 154967 156630 157691 158463 159400 160787 162467 163900 164776 165437 166429 167690 168582 168715 168422 168324 168638 169020
54403 169020 168976 168385 167646 167339 167774 168875 170329 171678 172460 172696 173238 175097 178270 181622 184136 185881
54387 185881 187410 188652 188927 187923 186194 184598 183462 182450 181156 179716 178638 178018 177293 176128 175220
54372 175220 175566 176995 178132 178006 177022 176128 175681 175618 176124 177465 179395 181286 182795 184068 185358 186682
54356 186682 187775 188279 188160 188044 188834 190879 193779 197014 200248 202977 204595 205259 206092 208013 210693 213093
54340B13093J544O99k07j354k505l376l962m193l770k715j633j187j514k218k611
54325A84091k097p97K68J93o47j073o60r9L6L7L72Q47R34M52k60o86n62j94k19
54306A79936p35j063q01o03j161j903j790r84n14m90o1Q07J106N91L19Q31J170
54289A74655N50k96m32k29m46o92j19R91J551J296R42R19R14O89M44K74l0m58
54271A80523o04j74N73J032P90O3l79N0J008J612J565J365J301R68J69m54k97
54254A89111K25L17l8k38o7J85L93O33O83J61p45j324j240r26q95j093j118q45
54236A83179n33m08l79k15P8K54J90O6k1l20r62j447j126j42O40P01L01j63o31
54217A79062r46o66K64J120J171N22j20l19k23k06m70q45r05m93j15l30p85m93
$$ plain form
54340 213093 214637 215336 215129 213775 211270 207894 203932 199739 195969 193254 191621 190434 188920 186702 184091
54325 184091 181994 181197 181465 181658 181011 179938 179278 179179 179215 179252 179624 180471 181405 181857 181597 180911 180349 180155 179936
54306 179936 179201 178138 177337 176734 175573 173670 171880 170896 170382 169892 169831 170638 171744 172335 172654 173485 174655
54289 174655 175205 174909 174477 174248 173802 173110 172991 173982 175533 176829 177771 178690 179604 180293 180737 181011 180981 180523
54271 180523 179919 179745 180318 181350 182140 182203 181824 181874 182882 184494 186059 187424 188725 189693 189862 189408 189111
54254 189111 189336 189653 189615 189377 189310 189495 189888 190521 191204 191365 190620 189296 188056 187130 186235 185142 184024 183179
54236 183179 182646 182238 181859 181644 181722 181976 182166 182232 182211 181891 180929 179482 178356 178214 178854 179555 179856 179693 179062
54217 179062 178116 177450 177714 178834 180005 180527 180407 180088 179865 179659 179189 178344 177439 176946 176831 176501 175716 175223
54199A75223O97J657J389L80j37K81R56J095N29l74j049j058n07m9k35q43j060
54182A76895l39J015J983J657K36r11n63R16J953J594M08n41r18r33p19m03l72
54165A80958p78j109p48J12O51M09k48o69o04l80m89r97j404j186m15M33J079
54148A74615J495J498Q69o3o14n72l56k26J8M36O78N53L50L38M87O97Q10M18o09
54129A80822j409r40M42J228Q88M81P26Q25Jr28p52L06J089J206J081Q39L66J12
54111A86383O26J434J461N67k74l43J13N46P76Q60Q81R69J083R26M17M7K37O49
54093A97358O28J49k90m19l34q7K66M35K51M1J19K81K79L66P34Q89M01j12K59
54074B01214J272J841J606J237J157J042P50P97J524K470L065L371L856M728N779
$$ plain form
54199 175223 175920 177577 178966 179346 179209 179490 180446 181541 182070 181696 180647 179589 179082 179033 178798 177955 176895
54182 176895 176556 177571 179554 181211 181447 180536 179973 180889 182842 184436 184844 184303 183385 182452 181733 181330 180958
54165 180958 180180 179071 178323 178435 179086 179495 179247 178578 177974 177594 177105 176108 174704 173518 173103 173536 174615
54148 174615 176110 177608 178477 178414 177800 177228 176872 176646 176664 177100 177778 178331 178681 179019 179506 180203 181013 181431 180822
54129 180822 179413 178473 178915 180143 181031 181512 182238 183063 183064 182136 181384 181690 182779 183985 185066 185905 186271 186383
54111 186383 187009 188443 189904 190471 190197 189854 189967 190513 191289 192149 193030 193999 195082 196008 196425 196472 196709 197358
54093 197358 197986 198135 197845 197426 197092 197005 197271 197706 197957 197998 198117 198398 198677 199043 199777 200666 201067 200955 201214
54074 201214 202486 204327 205933 207170 208327 209369 210119 210916 212440 214910 217975 221346 225202 229930 235709
54059B35709O683P357Q084R103R871R137O239K017k044n193p387q382p879o424
54045B56891n151m445l616k081k01J252J877J747J289J195J954L249M299M822
54031B63081N199N669N915N616M939M303M002M111M427M454L790K574J323M62
54017C19865J95N50J132J189M23n29j013j389k428l971n011n106m798m667m699
54002B89743m749m819m735m144l059j913j025m50l12p07j336j812k235k830l248
53987B52369k969k269j847j602q05M51J110P58K62M10Q16Q39O35O51P66O64N64
53970B50803R04J704K807M232N734O414N555L599J686L91n56j446k117k428k629
53955B74653k982l266k966k014j037o27n23J06J437K597K769K234J845J930K351
$$ plain form
54059 235709 242392 249749 257833 266936 276807 285944 292183 294200 292156 286963 279576 271194 263315 256891
54045 256891 251740 247295 243679 241598 241397 242649 244526 246273 247562 248757 250711 253960 258259 263081
54031 263081 268280 273949 279864 285480 290419 294722 298724 302835 307262 311716 315506 318080 319403 319865
54017 319865 320060 320610 321742 322931 323354 322825 321812 320423 317995 314024 309013 303907 299109 294442 289743
54002 289743 284994 280175 275440 271296 268237 266324 265299 264849 264537 263830 262494 260682 258447 255617 252369
53987 252369 249400 247131 245284 243682 242877 243328 244438 245196 245458 245868 246684 247523 248158 248809 249575 250239 250803
53970 250803 251707 253411 256218 260450 266184 272598 278153 281752 283438 283829 283273 281827 279710 277282 274653
53955 274653 271671 268405 265439 263425 262388 261761 261238 261344 262781 265378 268147 270381 272226 274156 276507
53940B76507L183M519N833O372O215O080O175O067N690N518N547N038L568J632
53926C47944n4j111j248k86J228K249K427K414K757L330M030N143O616P911Q950
53911C92300J0328J2130J3573J4476J5974J8912K2398K4854K5651K4659K1023
53900E96278J3884M121n797j3720j8903k1519k2071k1282j9759j7696j5331j3356
53888D44849j2280j1740j1148j0651j0645j0763j0287r357q719q377p532o004
53876C27346m658m165m142l914l404k896k539k430k717l302l824m147m448m742
53862B76018m761m415l896l214k194j091n67q15j276j525j847k518l111l098k634
53847B39056k188j703q08L12R83R44O35M94M38J74m01j141j698j607p20L40O90
$$ plain form
53940 276507 279690 284209 290042 296414 302629 308709 314884 320951 326641 332159 337706 342744 346312 347944
53926 347944 347890 346779 345531 345245 346473 348722 351149 353563 356320 359650 363680 368823 375439 383350 392300
53911 392300 402628 414758 428331 442807 458781 477693 500091 524945 550596 575255 596278
53900 596278 610162 614283 608486 594766 575863 554344 532273 510991 491232 473536 458205 444849
53888 444849 432569 420829 409681 399030 388385 377622 367335 357978 349259 340882 333350 327346
53876 327346 322688 318523 314381 310467 307063 304167 301628 299198 296481 293179 289355 285208 280760 276018
53862 276018 271257 266842 262946 259732 257538 256447 255880 255065 253789 252264 250417 247899 244788 241690 239056
53847 239056 236868 235165 234357 234669 235652 236596 237231 237725 238163 238337 237936 236795 235097 233490 232770 233110 233800
53830B33800K40j65K2K99m6p05p17J52J122J467J261Q79M48J28L40J161J900J822
53812B43408J096N64O42R46R98P95O76R19J569K407L156L792M584N511O019N742
53796B82824N257N479O346O819O206M954L894L329L112L103L159L054K761K536
53782C42833K410J949P96p38k020k747l101l431l990m755n292n098m300l708l839
53767C04969m249m254l924l796l861l542k769k345k857l761m015l422k767k679
53753B56728k865k722k224j817j670j618j696k090k466k069q34K41L69Q2L79J209
53737B36937J669J430J022P62L87j39k86K17R56J534J986K183J611K73q03o44
53721B49095N27J793K763L601M189M007K941J630P97N15K63l90j178j274j84J591
$$ plain form
53830 233800 234040 233875 233897 234196 234150 233445 232728 232880 234002 235469 236730 237609 238057 238185 238525 239686 241586 243408
53812 243408 244504 245068 245710 246656 247654 248449 249125 250044 251613 254020 257176 260968 265552 271063 277082 282824
53796 282824 288081 293560 299906 306725 312931 317885 321779 325108 328220 331323 334482 337536 340297 342833
53782 342833 345243 347192 347988 347250 345230 342483 339382 335951 331961 327206 321914 316816 312516 308808 304969
53767 304969 300720 296466 292542 288746 284885 281343 278574 276229 273372 269611 265596 262174 259407 256728
53753 256728 253863 251141 248917 247100 245430 243812 242116 240026 237560 235491 234657 234898 235267 235349 235728 236937
53737 236937 238606 240036 241058 241820 242207 242068 241782 241999 242955 244489 246475 248658 250269 250542 249739 249095
53721 249095 249622 251415 254178 257779 261968 265975 268916 270546 271343 271858 272121 271731 270553 269279 269095 270686
53705B70686K948L260K780K136J827K116K856L362L132K727L258M741N832N498
53691C17159M262L191K451J592O74K02K16K42N0k43o32j219j736j740j245p51
53675C22473n70n69n06l38j51p9k76o87j028j149j202j268j139p70n69q68j356
53658C09948j500j261j010r30r55j012r74n78J25N47L10p0J39P63R93O11L01N50
53640C05997R85J035P16M82N88Q97J184J336J371J349J337J428J696K070K369
53625C24840K605L000L478L422K558J717J941K861L111K428K124K978M037M259
53611C65359M163M625N126M696L863L975M989N570N249M887M912M664L780K805
53597D28663K105J404Q94J355K613L205K416J500J872L069L590L025K175J533
$$ plain form
53705 270686 273634 276894 279674 281810 283637 285753 288609 291971 295103 297830 301088 305829 311661 317159
53691 317159 321421 324612 327063 328655 329329 329531 329747 329989 330039 329796 329164 327945 326209 324469 323224 322473
53675 322473 321903 321334 320828 320490 320339 320260 319984 319297 318269 317120 315918 314650 313511 312741 312172 311304 309948
53658 309948 308448 307187 306177 305247 304292 303280 302306 301728 301853 302400 302710 302640 302779 303542 304535 305146 305447 305997
53640 305997 306982 308017 308733 309215 309803 310700 311884 313220 314591 315940 317277 318705 320401 322471 324840
53625 324840 327445 330445 333923 337345 339903 341620 343561 346422 349533 351961 354085 357063 361100 365359
53611 365359 369522 374147 379273 383969 387832 391807 396796 402366 407615 412502 417414 422078 425858 428663
53597 428663 430768 432172 433066 434421 437034 440239 442655 444155 446027 449096 452686 455711 457886 459419
53583D59419P96l04j588k782l684m090m139m479n440o270n958m613l352k842k642
53568D08032k078j147l16M2j66q05j472j660j214m83N1K64L93P10J228J733K033
53551D05145K140K191K285K480K785L045K946K508K312K821L531L504K792K603
53537D43088L676N154N742N433N320N979O914P628Q365R498J0743J1489J1612
53524E40641J1606J1962J2719J3565J4171J4465J4589J4698J4827J5069J5713
53513F94025J7023J8883K0880K2719K4390K5868K6932K7444K7578K7587K7510
53502I60839K7278K6977K6682K6134K4984K3385K2058K1490K1351K0948K0086
53491A222212J9133J8369J7762J7425J7757J8826J9929K0236J9765J9274J9254
$$ plain form
53583 459419 460215 459911 458323 455541 451857 447767 443628 439149 433709 427439 421481 416868 413516 410674 408032
53568 408032 405954 404807 404491 404533 404367 403562 402090 400430 399216 398733 398784 399048 399441 400151 401379 403112 405145
53551 405145 407285 409476 411761 414241 417026 420071 423017 425525 427837 430658 434189 437693 440485 443088
53537 443088 446764 451918 457660 463093 468413 474392 481306 488934 497299 506797 517540 529029 540641
53524 540641 552247 564209 576928 590493 604664 619129 633718 648416 663243 678312 694025
53513 694025 711048 729931 750811 773530 797920 823788 850720 878164 905742 933329 960839
53502 960839 988117 1015094 1041776 1067910 1092894 1116279 1138337 1159827 1181178 1202126 1222212
53491 1222212 1241345 1259714 1277476 1294901 1312658 1331484 1351413 1371649 1391414 1410688 1429942
53480A429942J9407J9279J8946J8746J8494J7432J5092J1915Q783O118L731J450
53468A589335n44k206m025o523r506j2186j4051j5195j5898j6286j6536j6929
53456A459450j7526j8118j8693j9568k0880k2283k3390k4197k4738k4726k3945
53445A221386k2719k1526k0376j9006j7489j6124j4805j3035j0681q214o109m343
53433A046959k711j284l69o6k6M00J695L778O048P946R344J0328J0933J1331J2106
53418A116412J3851J6469J9135K1026K1928K2211K2573K3710K5892K8643L1028
53407A362878L2485L3356L4530L6543L9004M1043M2370M3746M6074M9163N1854
53396A813046N3469N4557N5915N7464N8569N9064N9348N9674N9901N9887N9610
$$ plain form
53480 1429942 1449349 1468628 1487574 1506320 1524814 1542246 1557338 1569253 1578036 1584154 1587885 1589335
53468 1589335 1588791 1586585 1582560 1576037 1566531 1554345 1540294 1525099 1509201 1492915 1476379 1459450
53456 1459450 1441924 1423806 1405113 1385545 1364665 1342382 1318992 1294795 1270057 1245331 1221386
53445 1221386 1198667 1177141 1156765 1137759 1120270 1104146 1089341 1076306 1065625 1057411 1051302 1046959
53433 1046959 1044248 1042964 1042595 1042529 1042503 1042903 1044598 1048376 1054424 1062370 1071714 1082042 1092975 1104306 1116412
53418 1116412 1130263 1146732 1165867 1186893 1208821 1231032 1253605 1277315 1303207 1331850 1362878
53407 1362878 1395363 1428719 1463249 1499792 1538796 1579839 1622209 1665955 1712029 1761192 1813046
53396 1813046 1866515 1921072 1976987 2034451 2093020 2152084 2211432 2271106 2331007 2390894 2450504
53385B450504N8927N7619N5633N3077N0108M7099M4541M2348L9563L5347L0022
53374B964788K4590J9448J4256Q916L848p90n472j0721j6738k3644l1417l9326
53362B907738m6116n1118n4718n7447n9110n9307n8462n7741n7871n8378n8065
53351B289405n6191n3167n0102m7718m5848m4109m2679m2113m2554m3496m4184
53340A777244m3873m1990l8641l4914l2094l0429k9049k7095k4513k1745j9177
53329A433724j6994j5156j3395j1665j0557j0819j2346j4119j5250j5620j5402
53318A282401j4550j3070j1377j0002r075q288p153n320k923o67P44J401K119
53305A204240L442N084O421P306Q209R748J2052J4545J6464J7718J9041K1043
$$ plain form
53385 2450504 2509431 2567050 2622683 2675760 2725868 2772967 2817508 2859856 2899419 2934766 2964788
53374 2964788 2989378 3008826 3023082 3031998 3035846 3035056 3029584 3018863 3002125 2978481 2947064 2907738
53362 2907738 2861622 2810504 2755786 2698339 2639229 2579922 2521460 2463719 2405848 2347470 2289405
53351 2289405 2233214 2180047 2129945 2082227 2036379 1992270 1949591 1907478 1864924 1821428 1777244
53340 1777244 1733371 1691381 1652740 1617826 1585732 1555303 1526254 1499159 1474646 1452901 1433724
53329 1433724 1416730 1401574 1388179 1376514 1365957 1355138 1342792 1328673 1313423 1297803 1282401
53318 1282401 1267851 1254781 1243404 1233402 1224327 1216039 1208886 1203566 1200643 1199976 1200720 1202121 1204240
53305 1204240 1207682 1212766 1219187 1226493 1234702 1244450 1256502 1271047 1287511 1305229 1324270 1345313
53293A345313K3424K5457K6952K8225K9437L0478L1266L1568L0853K9016K6883
53282A658872K5246K3675K1232J8062J5175J2731R805N987K015j524m945q461
53270A777870j1520j3780j5838j8279k0791k2806k4323k5554k6429k7047k7983
53259A543520k9457l0828l1486l1669l1857l1973l1750l1342l0952l0467k9915
53248A201824k9677k9639k9011k7603k6508k6590k7033k6498k5056k3851k3196
53237I07162k2317k0835j9297j8127j7058j5825j4592j3416j2015j0328q807p920
53225G26625p717q020q714r735j0986j2244j3084j3175j2879j3081j4054j4948
53213E87988j4896j4155j3469j2802j1579r983q936q738q589p770o630o053o433
$$ plain form
53293 1345313 1368737 1394194 1421146 1449371 1478808 1509286 1540552 1572120 1602973 1631989 1658872
53282 1658872 1684118 1707793 1729025 1747087 1762262 1774993 1784798 1790785 1792800 1791276 1786331 1777870
53270 1777870 1766350 1752570 1736732 1718453 1697662 1674856 1650533 1624979 1598550 1571503 1543520
53259 1543520 1514063 1483235 1451749 1420080 1388223 1356250 1324500 1293158 1262206 1231739 1201824
53248 1201824 1172147 1142508 1113497 1085894 1059386 1032796 1005763 979265 954209 930358 907162
53237 907162 884845 864010 844713 826586 809528 793703 779111 765695 753680 743352 734545 726625
53225 726625 718908 710888 702174 692439 681453 669209 656125 642950 630071 616990 602936 587988
53213 587988 573092 558937 545468 532666 521087 511104 502168 493430 484841 477071 470441 464388 457955
53200D57955p466q581r342r589r353q653p540o395n866o101o371n898m846m043
53186C57911l905m104m171l924l418k904k744k874k647j725q36r48j861k366j811
53171C17673p57j5J85p4p63j576j862j266k39M44M22j41q49j359j608j913k537
53154C03765l139l050k173j219q44r44j062j120j347j697j757j247l25O06J191
53139B85638J185N23m54j025o93J38N02L9m90k37M98P09J31m80n81m93n33l23
53121B84054M59J264J359R50Q98J512K214K380K009J564J475J679J592O75p65
53106C03319j729j680j093o74n62o79j163j886k178j739j296j591k161k083j517
53091B81288j448k066k451j947r46j21L62O04N89L35J5k07k27R2O71J029Q07L12
$$ plain form
53200 457955 450489 441908 432566 422977 413624 404971 397431 391036 385170 379069 372698 366800 361954 357911
53186 357911 354006 349902 345731 341807 338389 335485 332741 329867 327220 325495 324659 323711 321850 319484 317673
53171 317673 316916 316901 317086 317012 316249 314673 312811 311545 311306 311750 312172 312031 311182 309823 308215 306302 303765
53154 303765 300626 297576 295403 294184 293340 292396 291334 290214 288867 287170 285413 284166 283841 284447 285638
53139 285638 286823 287346 286892 285867 285174 285312 285814 285853 285363 285126 285624 286333 286464 285984 285403 284910 284377 284054
53121 284054 284513 285777 287136 288086 288984 290496 292710 295090 297099 298663 300138 301817 303409 304084 303319
53106 303319 301590 299910 298817 298143 297581 296902 295739 293853 291675 289936 288640 287049 284888 282805 281288
53091 281288 279840 277774 275323 273376 272430 272309 272671 273275 273864 274199 274214 274007 273780 273872 274543 275572 276379 276691
53073B76691R5J56J44N9J88M47M61K41J18Q8k23q97j543j766j393m95M26O02q4
53054B73315p37o46l04m55o86j35R01J393J308J496J864J365l3r52o97l07p26
53037B75964j316j148o31p12j250j379q89k95J43N15O70L58j52k57J77O90P78
53020B71266L06m21q00m19L31N90J52l00k37J5O7J96P62J415J537J072L80l19
53002B75593q04o17L15J214J234O14L18P08J218J257Q94N64N53Q53J241J403J206
52985B87764Q37N15K99K29M63R62J319J220R39J021J493J750J291M13j6M85J379
52968C02363J651J083N13O45J040Q79L08K14Q25J494J853K244K738K765K052J137
52952C23804M56k74j311k218k612k849l301l608l334k802k521k248j458m50r3
$$ plain form
53073 276691 276786 276942 277086 277145 277333 277780 278241 278482 278600 278688 278465 277568 276025 274259 272866 272371 272797 273399 273315
53054 273315 272578 271932 271628 271173 270487 270352 271253 272646 273954 275450 277314 278679 278646 277694 276997 276690 275964
53037 275964 274648 273500 272869 272157 270907 269528 268639 268344 268487 269002 269672 270030 269878 269621 269798 270488 271266
53020 271266 271572 271151 270351 269932 270263 270853 271005 270705 270468 270483 270550 270746 271508 272923 274460 275532 275912 275593
53002 275593 274789 274172 274487 275701 276935 277549 277867 278575 279793 281050 281944 282508 283061 283914 285155 286558 287764
52985 287764 288601 289116 289415 289644 290107 291069 292388 293608 294547 295568 297061 298811 300102 300515 300499 300984 302363
52968 302363 304014 305097 305610 306255 307295 308174 308482 308696 309521 311015 312868 315112 317850 320615 322667 323804
52952 323804 324260 323986 322675 320457 317845 314996 311695 308087 304753 301951 299430 297182 295724 295274 295181
52937B95181n69j125j045l69L79P07M78k4l22l10l59p13j135j373j499j574j416
52920B84912j082r85j144r02P5J062J224P78N09O13P87R75J202J006J7j078j200
52903B86769m14O6m05j137j169m82K41M66J50l57n54j40O76J415J779J692J144
52886B89740L50j50j14n5o22j623k253k132j523p11J40N88J60p89j224p18M0K77
52868B79381J73M01J127J953K519K734K596K150J654J382J268J016O09M29O58
52853C00050P74N8j391k569k792k559k743l250l273k647k146k231k410k134j555
52838B69182j034n66k16l61r47j196p83n31j171k010j831n99O99J512J990K090
52822B64228J561P31K50P4l47r82j235j022q04n55J60J011J011J08m33K29J438
$$ plain form
52937 295181 294612 293487 292442 292073 292452 293159 293637 293613 293291 292981 292622 291909 290774 289401 287902 286328 284912
52920 284912 283830 282845 281701 280799 280874 281936 283160 283938 284447 285060 285847 286822 288024 289030 289047 287969 286769
52903 286769 286355 286421 286016 284879 283710 283228 283469 283935 284085 283728 283174 283034 283710 285125 286904 288596 289740
52886 289740 290090 289940 289826 289771 289149 287526 285273 283141 281618 280907 281047 281635 281795 281006 279782 279064 279104 279381
52868 279381 279554 279955 281082 283035 285554 288288 290884 293034 294688 296070 297338 298354 298963 299392 300050
52853 300050 300824 300882 299491 296922 294130 291571 288828 285578 282305 279658 277512 275281 272871 270737 269182
52838 269182 268148 267582 267366 267005 266058 264862 264079 263548 262377 260367 258536 257937 258636 260148 262138 264228
52822 264228 265789 266520 266770 266844 266497 265515 264280 263258 262454 261899 262059 263070 264081 264189 263756 263985 265423
52805B65423K194K494K789K956K554J616N13o18j715k511k870l021l085k708j710
52790B62301o98m99j182k026k306j819q59O9O82J163J744K077J614O42K70J022
52774B62195K113K484J996J164L57j76o0O37J061M51p91j606j629j368j191r03
52758B64734l62J01J47r0j81J55P94J212Q71k00j283j685j402q77l61J68O98J281
52740B63720K123L099L450K599J198N78J116J830J791J250R99J261J682J980K029
52725B90705J680J033O87J045J561J272J25r51j360j501j780j775j013p5J7o66
52709B89004r80l95K35l8q65j174o81j73m21j288j964j726n64O71R98M30J08Q85
52691B82062K116K485J795J077J007J075O65J34K35R56J587J647J243P24M35O46
$$ plain form
52805 265423 267617 270111 272900 275856 278410 280026 280539 279921 278206 275695 272825 269804 266719 264011 262301
52790 262301 261603 261104 259922 257896 255590 253771 252912 252981 253663 254826 256570 258647 260261 260903 261173 262195
52774 262195 264308 266792 268788 269952 270309 270133 270073 270710 271771 272222 271431 269825 268196 266828 265637 264734
52758 264734 264372 264473 264620 264530 264349 264504 265298 266510 267381 267181 265898 264213 262811 261934 261573 261741 262439 263720
52740 263720 265843 268942 272392 274991 276189 276767 277883 279713 281504 282754 283753 285014 286696 288676 290705
52725 290705 292385 293418 294105 295150 296711 297983 298108 297157 295797 294296 292516 290741 289728 289653 289670 289004
52709 289004 288024 287629 287864 287826 286961 285787 285106 284933 284512 283224 281260 279534 278970 279641 280639 281069 281177 282062
52691 282062 284178 286663 288458 289535 290542 291617 292282 292416 292651 293607 295194 296841 298084 298808 299243 299889
52675B99889J241J528Q00p83k223k645k030r84q4M06M48J36l06o10o56n52m98
52658B93077n07l34K66J186J955K163J897J719K115K917L362K887J760O82j91
52643C14954j368l033m352m329l045j593q04n36k20L88J111J606J561J011N59
52628C01910Q53J717K225J882J250J107J371J318N94m90j502k201k343j764p92
52613C05135j58j70l91k93j5o8n13q28o62k81j30k32k94k11j21r8o1O2L14Q32
52593C01817J599K202K138J449O32m4o70j123r94l31J48M0j13L25J072J395J212
52576C10754J025J038J040J006J060R05J19r67j435r61j99K01K44Q2m30j254j831
52559C10397j674r23m0O55Q51K13r95j760j368l49J54k21q40j119j161j246j207
$$ plain form
52675 299889 301130 302658 303458 302675 300452 297807 295777 294793 294709 295115 295563 295699 295393 294783 294127 293575 293077
52658 293077 292570 292236 292502 293688 295643 297806 299703 301422 303537 306454 309816 312703 314463 315145 314954
52643 314954 313586 310553 306201 301872 298827 297234 296430 295894 295674 296062 297173 298779 300340 301351 301910
52628 301910 302763 304480 306705 308587 309837 310944 312315 313633 314227 313737 312235 310034 307691 305927 305135
52613 305135 304977 304807 304416 304123 304108 304040 303527 302699 302037 301756 301626 301394 301100 300889 300768 300670 300609 300671 300985 301817
52593 301817 303416 305618 307756 309205 309837 309793 309123 308000 307006 306675 306823 306863 306750 307075 308147 309542 310754
52576 310754 311779 312817 313857 314863 315923 316828 316947 315980 314545 313584 313385 313586 313830 313912 313482 312228 310397
52559 310397 308723 307800 307760 308415 309266 309479 308484 306724 305356 305007 305161 304940 304100 302981 301820 300574 299367
52542B99367p05J17O54O06L65M51O78L38p12j636j664j096p72p57l27P49J683
52525B97339J719J099O37O75R27J007P82L81J98O92J903L139L503K747J605J131
52509C19484J699K606K897K476K170K492K866K431J143m18j959l381m209l994
52495C26303l241k902l001k688j778j089r93q05j17L41n5o71o04m7K77L90P45
52478C10065J186J224J058J291J818J928J452Q77M29m2k49M60J967L156L257K785
52462C32662K745L331L904L899L342K519J546L01j208k621l445l550l277l006
52448C37142k884k998l424l862l690k756j752j372j458j449j304j332j435j264
52434C06162r41q86r74o32J66O70M19j10k32P2L63M37M43N07O07P29Q96J076J163
$$ plain form
52542 299367 298662 298779 299433 300039 300404 300855 301533 301871 301159 299523 297859 296763 295991 295234 294907 295656 297339
52525 297339 299058 300157 300794 301469 302396 303403 304185 304566 304764 305456 307359 310498 314001 316748 318353 319484
52509 319484 321183 323789 326686 329162 331332 333824 336690 339121 340264 339846 337887 334506 330297 326303
52495 326303 323062 320160 317159 314471 312693 311604 310611 309806 309689 310030 309975 309304 308700 308653 308930 309320 310065
52478 310065 311251 312475 313533 314824 316642 318570 320022 320899 321328 321286 321037 321497 323464 326620 329877 332662
52462 332662 335407 338738 342642 346541 349883 352402 353948 354249 353041 350420 346975 343425 340148 337142
52448 337142 334258 331260 327836 323974 320284 317528 315776 314404 312946 311497 310193 308861 307426 306162
52434 306162 305221 304335 303361 302729 302895 303565 303984 303874 303642 303714 304077 304514 304957 305464 306071 306800 307696 308772 309935
52415C09935J070Q89R51J509K297K754K824L182M211N261N598N718O874R256J1583
52400C73912J2671J2521J1480R152M996m23n479q816j0176j0162r608r086q546
52387C62436p401n326k921j282q86j231j558j555j263o69K42J268K132K735L067
52372C47788L051K798K898L987N809P222P289O135M519K898J280l52j924l307
52358C90091m095l704k190o56q4l1O71K037K837K478J823J779K090K140J986J874
52342C99046J611J241J569L012M578N057M730M781N369N595N251N350O676Q806
52328D62672J0805J2146J2750J2910J3346J4667J6579J8183J9087J9559J9681
52317F32385J9211J8399J7969J8044J7978J7560J7523J8425J9813K0984K1814
$$ plain form
52415 309935 311005 311894 312845 314354 316651 319405 322229 325411 329622 334883 340481 346199 353073 362329 373912
52400 373912 386583 399104 410584 419736 424732 424309 418830 410014 399838 389676 380068 370982 362436
52387 362436 355035 349709 346788 345506 344620 343389 341831 340276 339013 338344 338586 339854 341986 344721 347788
52372 347788 350839 353637 356535 360522 366331 373553 380842 386977 391496 394394 395674 395322 393398 390091
52358 390091 385996 382292 380102 379446 379362 379331 380002 382039 384876 387354 389177 390956 393046 395186 397172 399046
52342 399046 400657 401898 403467 406479 411057 416114 420844 425625 430994 436589 441840 447190 453866 462672
52328 462672 473477 485623 498373 511283 524629 539296 555875 574058 593145 612704 632385
52317 632385 651596 669995 687964 706008 723986 741546 759069 777494 797307 818291 840105
52306H40105K2343K2294K1642K0980K0647K0106J8917J7781J7662J8182J7871
52295A058530J5875J2739R432O429L748J241j421m502p603r770j0469j0242j0092
52282A053895j0375j0645j0347r430q229p055o034n112m040k471l98J655L139
52269I84553M201N492P301R304J1278J3290J4946J5270J4105J2995J3585J5484
52257A121804J6799J6647J6026J6078J6643J6934J6626J5689J3995J1718R517
52246A288476P679N613K736o25l763o446q683j0212j0944j1446j2275j3181j3678
52233A213251j4019j4758j5626j5757j5011j4137j3556j2830j1579j0223r384
52222A066371r067q855q522q072p406o387n126l903k809j676l70R90K227L331
$$ plain form
52306 840105 862448 884742 906384 927364 948011 968117 987034 1004815 1022477 1040659 1058530
52295 1058530 1074405 1087144 1096576 1103005 1106753 1107994 1106573 1102071 1094468 1084698 1074229 1063987 1053895
52282 1053895 1043520 1032875 1022528 1013098 1004869 997814 991780 986668 982628 980157 979759 981414 984553
52269 984553 988754 994246 1001547 1010851 1022129 1035419 1050365 1065635 1079740 1092735 1106320 1121804
52257 1121804 1138603 1155250 1171276 1187354 1203997 1220931 1237557 1253246 1267241 1278959 1288476
52246 1288476 1296155 1301768 1304504 1303879 1300116 1293670 1284987 1274775 1263831 1252385 1240110 1226929 1213251
52233 1213251 1199232 1184474 1168848 1153091 1138080 1123943 1110387 1097557 1085978 1075755 1066371
52222 1066371 1057304 1048449 1039927 1031855 1024449 1018062 1012936 1009033 1006224 1004548 1004178 1005168 1007395 1010726
52208A010726M384N249N594N389N169N417N802N437M057K489J813K271L246L966
52194A071009M066L739L597M191N378O431O830O699O364N864N107M161L059J686
52180A138181M0j754l878o649r617j1514j1654j0875j0379j0196r541q227o803
52167A037134n527m187k846j826r39M11K180L538M028M110M350M745M994M834
52153A054999L859J798o56k037j622k59P56J129J435K023K648K974K929K638K257
$$ plain form
52208 1010726 1015110 1020359 1025953 1031342 1036511 1041928 1047730 1053167 1057224 1059713 1061526 1063797 1067043 1071009
52194 1071009 1075075 1078814 1082411 1086602 1091980 1098411 1105241 1111940 1118304 1124168 1129275 1133436 1136495 1138181
52180 1138181 1138221 1136467 1132589 1125940 1116323 1104809 1093155 1082280 1071901 1061705 1052164 1043937 1037134
52167 1037134 1031607 1027420 1024574 1022748 1021809 1022220 1024400 1027938 1031966 1036076 1040426 1045171 1050165 1054999
52153 1054999 1058858 1060656 1060000 1057963 1056341 1056082 1056838 1057967 1059402 1061425 1064073 1067047 1069976 1072614 1074871
$$ [...]
##END NTUPLES=NMR SPECTRUM
##END=
